##TITLE=Analysis number 316987
Compound Code cc 25110
Book Reference 442/160
Project Code adrs
Chemist Name miguelg
##JCAMPDX= 6.0         $$ Bruker NMR JCAMP-DX V2.0
##DATA TYPE= NMR SPECTRUM
##DATA CLASS= NTUPLES
##ORIGIN= Bruker BioSpin GmbH
##OWNER= nmr
$$ XWIN-NMR		Version 3.5
$$ Thu Feb  2 13:30:03 2006 GMT Standard Time (UT+0h)  MAYBRIDGE\nmr@NMR_250MHZ
##.OBSERVE FREQUENCY= 250.131544655141
##.OBSERVE NUCLEUS= ^1H
##.ACQUISITION MODE= SIMULTANEOUS (DQD)
##.ACQUISITION SCHEME= undefined
##.AVERAGES= 16
##.DIGITISER RES= 18
##SPECTROMETER/DATA SYSTEM= dpx250
##.PULSE SEQUENCE= zg30
##.SOLVENT NAME= CDCl3
##.SHIFT REFERENCE= (INTERNAL, CDCl3, 0, 16.522)
##AUDIT TRAIL= $$ (NUMBER, WHEN, WHO, WHERE, WHAT)
$$ ##TITLE= Audit trail, XWIN-NMR		Version 3.5
$$ ##JCAMPDX= 5.01
$$ ##ORIGIN= Bruker BioSpin GmbH
$$ ##OWNER= nmr
$$ C:\u/data/dgb/nmr/ADRS/15540/pdata/1/auditp.txt
$$ ##AUDIT TRAIL=  $$ (NUMBER, WHEN, WHO, WHERE, WHAT)
(   1,<2006-02-02 13:29:32.84 +000>,<MAYBRIDGE\nmr>,<NMR_250MHZ>,
      <created by zg, POWCHK disabled, PULCHK disabled
       configuration hash MD5:
       84 BC 41 DB A1 6E 1D 46 DA 25 12 A5 C1 ED C5 3A
       data hash MD5: 64K
       8C 82 5D 94 88 7C B4 65 6E 94 15 20 A5 67 BD BD>)
(   2,<2006-02-02 13:29:50.06 +000>,<MAYBRIDGE\nmr>,<NMR_250MHZ>,
      <Start of raw data processing
       ef LB = 0.3 FT_mod = 6 PKNL = 1 SI = 32K 
       data hash MD5: 32K
       2E EA E5 6C E3 E1 31 97 1A 18 11 3C 8A 1C EC 01>)
(   3,<2006-02-02 13:29:52.14 +000>,<MAYBRIDGE\nmr>,<NMR_250MHZ>,
      <apk 
       data hash MD5: 32K
       F2 35 C5 EB B8 E9 5D 90 EB 4A 54 77 16 4C 60 19>)
(   4,<2006-02-02 13:29:53.00 +000>,<MAYBRIDGE\nmr>,<NMR_250MHZ>,
      <abs ABSG = 5 
       data hash MD5: 32K
       6D 47 38 1A A7 C1 9D 5D DA 13 08 AE 26 37 DD 57>)
$$ ##END=
$$ 
$$ hash MD5
$$ 5D B6 08 28 D4 B1 63 34 13 A7 11 48 74 7C 57 35
##$RELAX= 
##$RELAX= 
##$RELAX= 
##$RELAX= 
##$RELAX= 
##$RELAX= 
##$RELAX= 
$$ Bruker specific parameters
$$ --------------------------
##$DU= <C:\u>
##$EXPNO= 15540
##$NAME= <ADRS>
##$PROCNO= 1
##$TYPE= <nmr>
##$USER= <dgb>
##$AMP= (0..31)
100 100 100 100 100 100 100 100 100 100 100 100 100 100 100 100 100 100 
100 100 100 100 100 100 100 100 100 100 100 100 100 100 
##$AQSEQ= 0
##$AQ_mod= 3
##$AUNM= <au_zg>
##$AUTOPOS= <22 >
##$BF1= 250.13
##$BF2= 250.13
##$BF3= 250.13
##$BF4= 250.13
##$BF5= 500.13
##$BF6= 500.13
##$BF7= 500.13
##$BF8= 500.13
##$BYTORDA= 1
##$CFDGTYP= 0
##$CFRGTYP= 5
##$CHEMSTR= <none>
##$CNST= (0..31)
1 1 145 1 1 1 1 1 1 1 1 1 1 1 1 1 1 1 1 1 1 1 1 1 1 1 1 1 1 1 1 1 
##$CPDPRG= <>
##$CPDPRG1= <>
##$CPDPRG2= <>
##$CPDPRG3= <>
##$CPDPRG4= <mlev>
##$CPDPRG5= <mlev>
##$CPDPRG6= <mlev>
##$CPDPRG7= <mlev>
##$CPDPRG8= <mlev>
##$CPDPRGB= <>
##$CPDPRGT= <>
##$D= (0..31)
0 1 0 0 0 0 0 0 0 0.06 0 0 0 0 0 0 0.0002 0 0 0 0 0 0 0 0 0 0 0 0 0 0 
0 
##$DATE= 1138886968
##$DBL= (0..7)
120 120 120 120 120 120 120 120 
##$DBP= (0..7)
150 150 150 150 150 150 150 150 
##$DBP07= 0
##$DBPNAM0= <>
##$DBPNAM1= <>
$$ [...]
##$SUBNAM7= <"">
##$SUBNAM8= <"">
##$SUBNAM9= <"">
##$SW= 20.6930455092707
##$SWIBOX= (0..15)
0 0 3 0 0 0 0 0 0 0 0 0 0 0 0 0 
##$SW_h= 5175.983436853
##$TD= 65536
##$TD0= 1
##$TE= 293.16
##$TE2= 300
##$TE3= 300
##$TEG= 300
##$TL= (0..7)
0 120 120 120 120 120 120 120 
##$TP= (0..7)
150 150 150 150 150 150 150 150 
##$TP07= 0
##$TPNAME0= <>
##$TPNAME1= <>
##$TPNAME2= <>
##$TPNAME3= <>
##$TPNAME4= <>
##$TPNAME5= <>
##$TPNAME6= <>
##$TPNAME7= <>
##$TPOAL= (0..7)
0.5 0.5 0.5 0.5 0.5 0.5 0.5 0.5 
##$TPOFFS= (0..7)
0 0 0 0 0 0 0 0 
##$TUNHIN= 0
##$TUNHOUT= 0
##$TUNXOUT= 0
##$USERA1= <user>
##$USERA2= <user>
##$USERA3= <user>
##$USERA4= <user>
##$USERA5= <user>
##$V9= 5
##$VALIST= <valist>
##$VCLIST= <CCCCCCCCCCCCCCC>
##$VD= 0
##$VDLIST= <DDDDDDDDDDDDDDD>
##$VPLIST= <PPPPPPPPPPPPPPP>
##$VTLIST= <TTTTTTTTTTTTTTT>
##$WBST= 1024
##$WBSW= 4
##$XGAIN= (0..3)
0 0 0 0 
##$XL= 0
##$YL= 0
##$YMAX_a= 554779
##$YMIN_a= -484147
##$ZGOPTNS= <>
##$ZL1= 120
##$ZL2= 120
##$ZL3= 120
##$ZL4= 120
##$ABSF1= 16.522
##$ABSF2= -4.171173
##$ABSG= 5
##$ABSL= 3
##$ALPHA= 0
##$AQORDER= 0
##$ASSFAC= 0
##$ASSFACI= 0
##$ASSFACX= 0
##$ASSWID= 0
##$AUNMP= <proc_1d>
##$AZFE= 0.1
##$AZFW= 0.1
##$BCFW= 0
##$BC_mod= 0
##$BYTORDP= 0
##$COROFFS= 0
##$CY= 12.5
##$DATMOD= 1
##$DC= 0
##$DFILT= <>
##$DTYPP= 0
##$F1P= 14.0000005364418
##$F2P= -0.99999901652339
##$FCOR= 0.5
##$FTSIZE= 32768
##$FT_mod= 6
##$GAMMA= 0
##$GB= 0
##$INTBC= 1
##$INTSCL= 1
##$ISEN= 128
##$LB= 0.3
##$LEV0= 0
##$LPBIN= 0
##$MAXI= 10000
##$MC2= 0
##$MEAN= 0
##$ME_mod= 0
##$MI= 0
##$NCOEF= 0
##$NC_proc= -2
##$NLEV= 6
##$NOISF1= 0
##$NOISF2= 0
##$NSP= 0
##$NTH_PI= 0
##$NZP= 0
##$OFFSET= 16.522
##$PC= 1
##$PHC0= 99.96781
##$PHC1= 2.922857
##$PH_mod= 1
##$PKNL= yes
##$PPARMOD= 0
##$PSCAL= 4
##$PSIGN= 0
##$REVERSE= no
##$SF= 250.13
##$SI= 32768
##$SIGF1= 0
##$SIGF2= 0
##$SINO= 400
##$SIOLD= 32768
##$SREGLST= <1H.CDCl3>
##$SSB= 0
##$STSI= 32768
##$STSR= 0
##$SW_p= 5175.98343685301
##$SYMM= 0
##$S_DEV= 0
##$TDeff= 65536
##$TDoff= 0
##$TI= <Analysis number 999999
Compound Code 99
Book Reference 9
Project Code 9>
##$TILT= no
##$TM1= 0
##$TM2= 0
##$TOPLEV= 0
##$USERP1= <user>
##$USERP2= <user>
##$USERP3= <user>
##$USERP4= <user>
##$USERP5= <user>
##$WDW= 1
##$XDIM= 32768
##$YMAX_p= 472432148
##$YMIN_p= -635613
$$ End of Bruker specific parameters
$$ ---------------------------------
##NTUPLES= NMR SPECTRUM
##VAR_NAME=  FREQUENCY,     SPECTRUM/REAL,   SPECTRUM/IMAG
##SYMBOL=    X,             R,               I
##VAR_TYPE=  INDEPENDENT,   DEPENDENT,       DEPENDENT
##VAR_FORM=  AFFN,          ASDF,            ASDF
##VAR_DIM=   32768,         32768,           32768
##UNITS=     HZ,            ARBITRARY UNITS, ARBITRARY UNITS
##FACTOR=    0.157963299565203, 1,           1
##FIRST=     4132.6476996994, 0,             0
##LAST=      -1043.33573715361, 0,           0
##MIN=       -1043.33573715361, -635613,     0
##MAX=       4132.6476996994, 472432148,     0
$$ Real data points
##PAGE= N=1
##DATA TABLE= (X++(R..R)), XYDATA
$$ [...]
##PAGE= N=2
##DATA TABLE= (X++(I..I)), XYDATA
20840 393900 386106 389407 390751 398371 411098 401514 402175 392883 394059 398659 406707 410575 409633 410320 408659
20825 408659 402636 396524 391978 397372 394086 396968 400844 394393 390137 399979 407381 413692 427870 432932
20811 432932 432209 417300 415374 424377 425902 418473 415016 415398 413013 406390 416319 424461 425730 414676
20797 414676 403898 403180 409443 411923 419194 400123 391575 404449 401597 389555 395892 387546 381863
20784 381863 391378 399206 407773 420810 409777 404645 414135 413600 402980 399446 397268 388727 388309 388204
20770 388204 399622 415971 412484 406266 409740 406893 426303 428251 428385 421588 406939 398809 389894
20757 389894 391716 402030 409924 415722 423923 433846 428880 415608 405024 393015 394298 387488 389431
20744 389431 398497 396875 404079 406342 407641 413679 407714 406666 411760 416546 426401 427199 442935 446597
20730 446597 435747 429865 428092 431996 429450 421895 411929 410302 419412 424081 425883 416986 426387 426217
20716 426217 425159 410185 399634 407242 409127 427004 435636 439738 433885 419238 408466 402848 409187
20703 409187 414071 419946 415906 417779 421728 427344 426473 423235 419245 420491 426089 430913 418514 410115
20689 410115 408933 407929 422486 436991 426772 430973 429289 434394 430627 432255 435190 434012 435619
20676 435619 425486 425952 424597 425941 424870 419872 410035 409291 407784 421563 424460 423732 425688 435222
20662 435222 441309 435490 421917 409243 404121 404348 407487 404510 401323 406396 406266 407254 411272 420175
20648 420175 431242 431688 426176 422833 426570 428057 438248 440975 438108 424089 436285 438124 437406 441081
20634 441081 438339 431182 431284 422306 423302 416528 406481 419017 435077 421394 426475 434591 443617 440785
20620 440785 446872 445827 442903 434836 442909 445223 440985 447730 439393 432210 424002 421949 421005 429999
20606 429999 439669 442729 435286 429184 422345 428762 433863 442438 435921 427644 410985 410110 413993 419410
20592 419410 422995 434290 444491 446031 446540 444971 435500 426344 423617 429928 431331 437494 437266 431475
20578 431475 419975 410256 420632 433335 440871 445361 433218 414764 422829 438012 453050 451819
20566 451819 430801 432953 439342 443164 441129 433363 411851 413803 423099 424819 420462 431244 439627
20553 439627 460288 460080 443216 439960 437467 427620 420126 414772 420436 425895 430030 438577 435823 437620
20539 437620 423860 421658 411935 405331 412279 431523 437074 438720 433822 434985 436030 434565 428024 415909
20525 415909 410149 426091 431014 423833 425527 445026 446152 435741 426206 427929 441280 436461 434593
20512 434593 439322 441058 436830 422901 415421 424585 429870 432405 449581 449426 438681 441117 440604 436979
20498 436979 443447 463409 459677 436230 423129 414643 410980 425471 423638 439071 446394 447315 451495
20485 451495 454954 466916 458216 460522 452575 447855 460997 465340 468933 468178 464473 455626 457145 450635
20471 450635 443607 437713 436401 431604 442005 440981 436516 441900 433445 431301 433571 432923 444613 433540
20457 433540 431842 446800 461122 472484 469334 452679 441910 440257 441159 441649 442888 440431 440832 439831
20443 439831 435047 433918 437434 445483 457732 467791 454720 444324 444532 449207 450672 438321 439513
20430 439513 433809 427350 420721 424625 435767 430243 429529 439451 445492 449858 451357 446391 441468 451229
20416 451229 435122 423205 426937 430067 429908 441641 441143 440304 441792 438482 443547 445001 442526 435719
20402 435719 443415 447870 447789 441748 439225 440209 436663 447893 446872 455429 446215 453618 460772 456838 462383
20387 462383 458510 454345 457845 452653 450676 440688 435379 447573 454528 456574 450931 447957 446022 433359
20373 433359 434837 438007 435426 426960 431598 439699 441105 432105 421715 418280 414543 422010 424859 421895
20359 421895 438965 450034 456199 462192 462453 462612 452484 456610 462357 456187 459444 463854 452663 449829
20345 449829 456458 444944 429549 439361 439957 435945 445338 448504 458741 461727 466252 476801 472671
20332 472671 451189 445813 449200 454224 449401 447666 451545 450046 448204 462363 465547 459819 456226 446253
20318 446253 433008 438978 447016 444614 443417 439148 445969 440090 447412 447906 439460 443301 455090 456973
20304 456973 451278 450763 453172 457494 461141 459108 461018 457305 446315 445897 441214 448665 451089 432417
20290 432417 422592 427505 432001 447764 452115 448139 452507 448480 446170 436945 432397 446290 456997
20277 456997 452934 443916 442278 442809 449784 468494 471623 464415 459002 456483 459891 460371 467705 478184
20263 478184 464041 455732 463057 456890 447699 455599 467697 464083 460163 451490 447368 454893 454862 456861
20249 456861 452696 442782 444630 458519 468796 480379 479409 458010 450647 458064 455965 449380 455827
20236 455827 464768 472819 465067 459614 454424 449312 453763 469349 469140 455874 447617 464671 453839
20223 453839 450091 453012 451242 445799 441566 440197 443638 444066 452407 453910 454676 449771 447549 444801 450914
20208 450914 459727 464272 464096 462012 452805 455949 467134 472226 468852 474873 486800 484139 480883 473350
20194 473350 465924 467377 457768 444799 442742 447390 463529 470155 465112 463029 471398 474159 471850 463122
20180 463122 467067 477120 474944 481210 485590 480538 475642 470865 469181 472268 471465 462181 461014 453684
20166 453684 472987 476705 459634 469718 472937 471910 470613 464611 463165 470803 475540 467983 467976 473892
20152 473892 474631 472996 462421 452265 460839 465540 457404 453911 451682 454446 454778 455115 464011 472525
20138 472525 480665 486506 491630 490683 501327 497346 486870 476086 459012 452716 453960 458579 459207 470927
20124 470927 473244 474111 478629 476826 474546 467463 455660 457934 459547 460276 473643 488324 491562 496838
20110 496838 492689 485216 483226 481461 477890 467955 463416 468140 475370 478270 483817 473195 460380 464397
20096 464397 475084 489359 499577 499997 505118 494544 482866 476176 462531 457085 466192 464781 471540
20083 471540 481328 474868 476069 474655 473577 473515 473062 472592 475354 472449 469586 466728 475542 477822 467525
20068 467525 476516 493890 490148 489669 487691 490661 495059 492501 496105 495234 486883 483333 484594 469574
20054 469574 473624 479084 480806 481918 474005 474391 472739 466519 470243 466388 470930 482113 484613 468040
20040 468040 473627 475405 474286 469558 476720 486199 481561 468755 470030 468623 478021 484584 484873 487450
20026 487450 480256 476666 484523 483040 483728 484054 487563 485649 483668 475172 470807 485385 487759 471214
20012 471214 473209 485672 479844 477560 471400 469596 475099 483411 480833 484246 482556 478583 478865 474990
19998 474990 478887 483438 483831 492927 489499 482106 491478 495419 486383 471941 474118 479966 486741 490847
19984 490847 488434 492924 500574 497708 486795 493028 496081 484801 475396 487017 483821 471019 471718
19971 471718 481477 484777 484213 478493 483061 487941 490302 482432 474792 479401 477903 492151 496007 491622
19957 491622 479741 481395 490688 485370 490355 485253 464322 468734 467844 456929 465883 478149 489334
19944 489334 488701 483935 484306 490435 491672 491476 483832 480973 480268 493863 495582 494618 494175 489738 496039
19929 496039 495349 494310 504629 511349 514389 507370 501352 490290 494712 502407 502483 491816 480608 469609
19915 469609 464282 463621 458932 456809 466815 480140 476126 464866 473771 484667 494013 490772 484222
19902 484222 486329 492515 490814 491281 489514 474844 467724 475051 485837 492416 511064 502686 490999
19889 490999 480126 481187 478597 488444 488718 484329 487536 483830 477440 478983 488144 499604 505077 500715
19875 500715 496623 497991 497918 492797 496761 490875 482709 481337 485197 487478 487898 487734 469476 463172 466302
19860 466302 487009 494950 494698 487687 471460 471714 482643 493991 496552 486939 499016 509262 510819
19847 510819 493850 488184 494638 493251 489916 488524 479801 487008 500783 490176 485097 494048 496291
19834 496291 503691 513177 504866 493888 494866 501219 510686 508757 497941 493802 506040 509707 508663 512634
19820 512634 518597 501961 490380 486116 484138 479136 490825 499425 504573 502338 502448 498012 499089 497665
19806 497665 488072 485927 484945 491859 513360 520311 510983 501287 510013 522653 525054 513730 501508
19793 501508 512027 517737 518433 514398 507812 496705 502038 513273 514157 501762 493500 502650 515816
19780 515816 519504 519303 527064 519113 501463 514855 512736 507694 510083 511499 511934 521441 521542 521301 517606
19765 517606 527189 535190 528335 524642 505071 515007 524051 505454 506189 503592 505410 515163 516223 518861
19751 518861 519948 517740 521020 519440 530101 526267 523923 524173 523498 520207 512651 508018 512044 525200
19737 525200 517008 506754 515441 520210 524286 533242 534705 519895 519815 524052 522479 523382 512077 499236
19723 499236 508325 517615 509294 511755 516133 525721 531182 526970 522191 521640 510640 510364 509418 516147 525608
19708 525608 522108 510372 512580 516063 515210 512173 510848 515288 526407 527342 515160 507292 508080 507548
19694 507548 504366 515653 520141 530812 530785 528396 517728 521157 525005 514530 503018 505510 513954
19681 513954 524801 522390 522143 527438 529231 529961 514003 508392 515823 511217 507600 514374 515854 528774
19667 528774 532880 527259 520058 514014 503343 513501 523785 530624 532293 519778 526710 538090 540952
19654 540952 537929 537179 531750 518594 507208 499168 505319 520198 523879 528228 535216 543916 544778 543282
19640 543282 541127 537177 532868 536661 543430 550075 541743 535714 538068 534083 523455 518541 521567 524907
19626 524907 531563 529849 542650 544718 542527 531844 512940 516851 526439 536889 528994 517092 520871
19613 520871 526412 532286 538612 535395 531664 536255 538046 537758 535768 538345 534422 528501 522511 528809
19599 528809 535187 526938 520994 527902 540606 542124 530646 524749 524346 520823 519647 525258 539438 537064
19585 537064 528649 525524 529219 539448 531932 530785 539940 538204 542903 557330 561152 549840 536543
19572 536543 536042 546375 562554 565798 551733 543232 539317 527842 525783 531714 544204 554663 554121
19559 554121 549008 544175 533741 528283 541002 534724 523556 522868 538134 555100 551545 539885 537151
19546 537151 534947 540356 548732 548908 546463 548585 538573 530131 533736 533914 531861 548205 543403 527131
19532 527131 524976 534918 542187 535986 536626 526934 521386 527562 541169 542479 527871 529787 541295 547795
19518 547795 539877 535090 546867 557666 554858 545861 531114 525787 517513 536920 554632 541727 544109
19505 544109 550314 565122 553377 549686 548467 538332 542170 538821 528490 535559 540708 546122 552562
19492 552562 547779 557103 565596 562558 558153 554445 560502 557991 555110 564740 567850 568647 571101 570430 562442
19477 562442 559068 548842 538973 538760 539055 530518 545415 554571 557871 559550 551952 548401 546066 544926
19463 544926 540924 533977 526549 525020 527142 533118 543401 545633 552746 563001 562532 569334 574844 569168
19449 569168 563668 561842 565288 553598 545929 550193 549107 556081 557670 548455 538913 535178 527582 518156
19435 518156 524646 541507 544875 548040 559351 568910 568876 561566 557450 560089 562156 563369 553487 549030
19421 549030 547873 546656 556505 556704 563808 580328 573723 563563 554589 552976 550268 549514 553754 552631
19407 552631 561270 570187 565606 563651 557027 555049 564187 561341 557924 566804 572953 573622 577348 586898
19393 586898 589310 585047 575524 573256 566669 571034 579548 564888 558637 551906 558017 555032 563209 582071
19379 582071 583016 573276 578004 568482 574425 580845 583062 586031 578776 580037 568612 564225 564386 570647
19365 570647 580335 581903 578502 576206 579486 579160 583776 586579 588537 601025 605658 597406 590427 587530
19351 587530 589476 570409 554657 553552 562691 562740 574306 582221 579423 590576 588234 581118 587018 584044
19337 584044 576610 576944 572994 579768 575384 562182 566199 576157 589546 577881 574647 579991 583464 582230
19323 582230 593328 606111 610364 610948 594133 587742 591971 583778 578661 584420 586219 592347 591983 587383
19309 587383 583707 579782 583347 581477 565972 573225 579400 583242 576818 574975 590395 593421 582809
19296 582809 568820 576639 583023 583131 579545 569093 560174 560239 578687 591960 587396 578072 577562 580440
19282 580440 592567 600672 595889 589287 581263 580862 592459 591044 577466 587526 592389 581197 574420
19269 574420 587440 590172 594462 605173 589771 584774 596124 600767 602996 589599 596631 598066 590101
19256 590101 575336 576068 574915 594286 589940 581555 580218 576228 578363 575967 575219 580651 587265 595263
19242 595263 605915 609286 603706 605565 599671 594231 598985 607466 603346 597248 595351 601844 600906 579388
19228 579388 567365 569884 579084 584678 582982 584342 583747 585746 583768 590030 590590 599651 602018 597050
19214 597050 587709 576728 580602 592828 598828 602333 604895 608814 608280 605185 591925 588846 585041 589790
19200 589790 595050 602379 607182 602945 609765 623161 622116 615754 611216 609298 605680 607690 611566 624495
19186 624495 613491 611584 609491 603858 607032 603371 593160 599287 609520 615338 622676 608796 609169
19173 609169 610632 611180 616058 602900 600572 600281 592254 593726 584246 596198 613256 615445 621888 624501
19159 624501 631524 628377 624557 633668 636519 629975 627714 615063 603142 602918 614659 605335 594751
19146 594751 602637 609479 608731 590353 579472 577073 587235 595451 598344 608669 617205 611285 614227
19133 614227 630572 633306 622078 614594 612662 612825 618928 622332 628572 615351 619730 625476 611997
19120 611997 598792 600969 607175 625104 627753 620434 619762 619579 619928 628108 630967 632336 629991 611267
19106 611267 607138 610720 605967 613357 615778 618182 627985 633553 630720 628109 628462 627848 629453 633308 637268
19091 637268 624325 615655 616717 617141 622604 627521 628885 625297 628692 621363 610501 609523 618605 629259
19077 629259 636377 624601 612174 605448 620944 625807 626346 640992 632016 630975 619186 614318 616430
19064 616430 630417 646074 648674 641312 629157 631059 635805 635410 631423 643851 651559 642260 634611
19051 634611 623254 620563 625702 636219 633746 624293 625389 634908 635391 636896 646253 651752 651647 645562
19037 645562 644817 634704 632233 637603 639907 646288 640094 627299 632331 638371 640537 647516 651206 652166
19023 652166 649569 651220 643238 635941 627834 629022 626365 627912 637483 644821 644906 666659 680941 661489
19009 661489 641355 638933 647132 647599 646829 637412 640698 647178 659842 675346 675401 676052 676142 662553 658709
18994 658709 654323 644866 635959 639158 650825 652377 650533 656614 655112 652079 656768 655986 660845 661349
18980 661349 656009 664871 661566 661766 657415 659665 668676 673125 673232 666292 665745 670553 663641 651275 653903
18965 653903 661870 660372 656680 658626 656979 655064 651628 643737 642188 642048 649391 655494 658210 653463
18951 653463 652953 649093 651212 650537 641842 639083 652473 664801 666942 674412 665639 663379 662891 654711
18937 654711 656768 669036 674150 663182 660881 667301 669431 664374 665574 666011 665804 676259 687355 683595
18923 683595 673105 670748 682740 689384 684804 690014 688742 680973 666581 660831 667742 677849 677316
18910 677316 675096 682068 680449 674144 675069 665500 668366 676479 690090 696256 695892 698507 685715 682021
18896 682021 686751 698272 706790 702266 688600 680708 681404 690749 690448 678175 667139 676254 680048 683196
18882 683196 689042 691742 700602 695449 704425 700839 706255 706780 702096 694727 682021 687241 701130 699242
18868 699242 690174 689190 696572 688147 684913 691285 702828 706561 705995 709567 711750 696629 686872 698758
18854 698758 704028 703686 701254 696494 697039 686270 682905 692017 695197 694414 698590 701277 704590 688301
18840 688301 695638 705990 704360 692544 689835 691230 694003 695730 700422 718586 713542 707335 706148
18827 706148 702798 707547 711334 705086 708541 701006 705405 715136 708038 705278 714358 717794 714057 713924
18813 713924 716179 710703 703289 707975 718042 726967 728613 732282 732631 732035 727498 731288 738164 732636
18799 732636 730991 719297 727294 737168 744906 751076 727017 723207 732142 737226 741240 737863 730019 713731
18785 713731 711174 719634 728365 727091 732267 733786 748541 752414 754325 751454 753976 763409 760285 764490
18771 764490 788108 806196 803024 760709 713156 688488 676792 679637 682525 694452 717112 711588
18759 711588 701881 704666 706412 710206 704765 719333 732728 727311 718246 712890 712898 717581 725836 734697
18745 734697 737719 730890 725572 728411 728300 721567 719944 726561 740947 756920 759402 748203 731093
18732 731093 718724 718268 726295 732888 728703 726317 734404 741573 736839 721847 721939 739491 758314 764829
18718 764829 769091 762283 753410 742829 737174 748239 753661 743302 737120 740359 737371 739568 741192
18705 741192 736727 742667 745801 751705 761976 756636 749623 740274 751139 762097 770750 769780 767781 770396
18691 770396 753852 752809 765916 770568 774322 782621 775452 765728 762280 761756 770388 771784 777357 776989
18677 776989 775403 764987 767362 771451 776302 767430 761177 750236 752833 758706 763889 760514 773356
18664 773356 783368 774200 771622 768556 770306 781233 788768 786120 793304 801171 798849 796830 787852 773967
18650 773967 772776 775010 773683 768910 772273 779093 779848 781698 786306 779188 779110 775603 782120 778165 784549
18635 784549 787388 786153 780745 781416 783972 778678 768920 758759 778484 797089 798006 786968 791440 785481
18621 785481 786114 789712 783967 780290 777556 773194 782182 783225 769577 772708 794154 805662 799204 791756
18607 791756 776041 762659 770810 774856 778919 786339 791282 789253 785550 782018 789154 795057 799364 793837
18593 793837 792952 795816 798136 805527 814272 809157 810164 814309 823092 816027 809930 818535 823832 819612
18579 819612 824082 817868 796071 804124 811568 805014 806346 813150 815450 827546 818171 820175 826472 818291
18565 818291 810473 808016 809200 820256 825802 827937 827446 833038 837871 837495 845008 846636 851795 855549
18551 855549 851533 856586 860881 863751 864021 857326 860666 863227 850600 842964 847200 849244 849155 846833 846446
18536 846446 849987 857694 852771 842600 841114 841473 848915 837444 838526 847158 845733 846576 862285 856388
18522 856388 848668 842629 844030 851134 862094 865366 870748 879877 873330 860632 860252 867693 876991 877260
18508 877260 867393 874112 880987 883586 877247 875819 870808 870966 893770 898274 892292 887100 882472 877673
18494 877673 879188 896575 898877 899901 893115 882039 871235 876042 879569 882114 873547 877991 889388
18481 889388 886648 883700 900667 910155 902028 891356 895683 880967 875141 888878 892577 895139 897977
18468 897977 894291 890629 895838 896366 897621 895060 895014 893954 899277 893402 903130 921365 923753 926187 913963
18453 913963 910498 904961 915596 919661 912407 913724 923353 922457 924218 919843 917955 924910 920827 932132
18439 932132 937923 944896 937681 941074 936055 937165 941753 943225 934662 932797 930787 933073 932584 940342
18425 940342 935145 927226 920686 914217 914043 925008 935412 940986 958767 961430 965948 971066 961283 956586
18411 956586 966958 966167 959436 953512 954948 954801 943341 948708 947650 957392 964712 962400 964774 963143
18397 963143 948240 953700 963838 971596 972615 971829 974140 973298 980446 989076 989428 993234 990088 981577
18383 981577 983452 979083 972086 979376 988938 979085 974843 991662 1001148 1005582 1001776 1000674 1007399 1005033
18369 1005033 999634 1007825 999759 998260 1009480 1010592 1007013 1011241 1008333 1004828 1003628 1005846 1014763 1016147
18355 1016147 1017054 1017816 1013756 1003798 1007116 1016553 1034317 1041323 1032398 1033273 1025883 1019099 1024962 1030722
18341 1030722 1038536 1048701 1048665 1051776 1054935 1060275 1060766 1050130 1040654 1044189 1049166 1059091 1075747 1070763
18327 1070763 1064907 1057387 1067050 1074280 1083337 1093216 1087606 1087168 1085708 1080596 1062753 1058475 1061964 1064149
18313 1064149 1072012 1090451 1080161 1075868 1076396 1081450 1089884 1088747 1080504 1087283 1095640 1095246 1096179 1107177
18299 1107177 1126812 1141330 1137850 1137643 1138902 1131486 1127459 1129919 1128258 1126208 1138047 1155318 1164706
18286 1164706 1159439 1159727 1156316 1154820 1153387 1172268 1175295 1161023 1160802 1173305 1171502 1182070 1197675
18273 1197675 1189844 1188955 1201354 1209577 1215721 1207853 1194627 1186262 1179414 1176022 1178321 1202338 1213049
18260 1213049 1206118 1205098 1216892 1224150 1226706 1234787 1232579 1232841 1231424 1236718 1256409 1269770 1278170
18247 1278170 1290318 1286239 1263990 1265299 1273435 1281714 1278772 1265396 1271902 1282097 1279117 1282032 1293592
18234 1293592 1292511 1295134 1297515 1302803 1307019 1323775 1327964 1333252 1345973 1342415 1340319 1338898 1337079
18221 1337079 1350114 1367264 1372326 1369350 1367036 1362861 1371143 1378470 1392364 1409908 1416915 1419852 1428100
18208 1428100 1431051 1431451 1439472 1441353 1451593 1456733 1466809 1475135 1488518 1510206 1514234 1523482 1522838
18195 1522838 1528997 1538224 1543684 1540598 1556603 1569238 1580257 1583528 1598639 1610705 1619539 1621501 1627531
18182 1627531 1646620 1653995 1665221 1675312 1681624 1689205 1695052 1706858 1726019 1747232 1761680 1778720
18170 1778720 1794843 1810128 1834312 1837920 1848048 1870078 1887324 1905171 1925113 1964809 1977240
18159 1977240 1999622 2020784 2047354 2071206 2094977 2113101 2134403 2156056 2185324 2218582 2254600
18148 2254600 2301216 2340081 2379079 2420882 2463181 2504661 2555842 2610249 2662545 2712890 2750598
18137 2750598 2818987 2888360 2957573 3025285 3105448 3190723 3290336 3399555 3521262 3645643 3791389
18126 3791389 3954963 4139440 4345249 4579302 4853720 5169539 5546242 6001055 6519844
18117 6519844 7144071 7945756 8979237 10303954 12021861 14064597 15363295 12237927
18109 12237927 2594640 -6858734 -12320856 -11856033 -9735486 -7979160 -6660414 -5626779
18101 -5626779 -4797485 -4135970 -3637349 -3293568 -3081843 -2958888 -2859420 -2722534 -2534806 -2334309
18091 -2334309 -2144704 -1966479 -1815463 -1687145 -1560495 -1442934 -1327537 -1223850 -1135051 -1049688
18081 -1049688 -965018 -892118 -837159 -773529 -712125 -662457 -605542 -569300 -526516 -468489 -421249
18070 -421249 -378936 -344815 -317591 -282987 -244255 -220694 -194383 -163750 -124506 -82989 -69973
18059 -69973 -51642 -24708 1371 36074 49654 56401 69071 95500 119311 131939 149754 171739
18047 171739 188881 195331 210352 228905 246032 267028 266439 276740 307571 330725 338430 349051
18035 349051 361358 369265 369183 371381 374144 387627 397551 423452 437623 448247 442244 452469 459121
18022 459121 451808 456507 475003 493007 497482 500469 504333 507958 517225 533311 548152 561291 571682
18009 571682 576723 583594 582982 582617 586624 595147 595252 601007 621706 630718 638070 641166 639589 652801
17995 652801 658444 676483 692819 692883 687512 677428 672702 681140 701900 717157 721044 719499 717197
17982 717197 726263 731342 727619 729346 743837 757479 766753 775117 784974 788091 781315 786260 787312 799923
17968 799923 820576 820700 807537 802634 805336 801380 800399 802203 809254 809172 795775 789343 798037 814911
17954 814911 819881 827277 845390 859381 857327 873669 882158 885821 886331 887306 886355 886564 888780 897389
17940 897389 899919 908339 908423 912920 922649 926117 929793 929077 942438 958528 966835 973643 969301 956348
17926 956348 966023 970535 974588 985306 994913 990995 990169 983077 982808 982701 992138 1000065 1008987 1007776 1007686
17911 1007686 1011533 1019486 1015250 1013205 1010516 1025373 1035096 1036226 1032468 1030480 1036602 1040528 1050611
17898 1050611 1033594 1034937 1055611 1074195 1084626 1086426 1078164 1075382 1075929 1085768 1082793 1071416 1078145
17885 1078145 1098353 1117915 1125965 1121732 1125704 1122539 1115834 1120825 1133945 1134130 1132758 1137424 1140586
17872 1140586 1154168 1160331 1158205 1163587 1169884 1161773 1150932 1158268 1175534 1179540 1176866 1181075 1201470
17859 1201470 1203274 1204294 1212297 1221115 1222756 1219398 1209338 1208978 1207310 1204994 1209993 1209392 1219008 1218175
17845 1218175 1227917 1241807 1239187 1253947 1257397 1263921 1270275 1266497 1264612 1274982 1276201 1265607 1271208
17832 1271208 1286267 1294249 1288787 1287380 1304301 1307995 1313536 1315052 1317266 1309349 1316994 1325463 1331797
17819 1331797 1340730 1349430 1351052 1358478 1362311 1355924 1364365 1364488 1368295 1372559 1381610 1377152 1365053 1371342
17805 1371342 1384875 1398049 1399887 1395484 1406477 1420718 1417283 1403939 1377514 1381165 1387241 1389148
17793 1389148 1394520 1411705 1434861 1454797 1466007 1473859 1485022 1493458 1488787 1478482 1477888 1482468 1491969
17780 1491969 1502183 1510459 1513195 1522995 1525229 1537139 1550826 1570254 1591853 1585348 1588369 1589102 1585191
17767 1585191 1585052 1597919 1591310 1597733 1616725 1633039 1633927 1627091 1621916 1617811 1627895 1636439 1629544
17754 1629544 1623549 1626368 1641346 1651067 1664878 1681015 1687908 1705275 1717633 1723770 1742613 1754276
17742 1754276 1749155 1757138 1769343 1779745 1778767 1773719 1758576 1743805 1731162 1732270 1740760 1741120 1752961
17729 1752961 1765134 1778461 1798836 1813380 1817631 1826789 1820162 1820536 1833775 1847794 1857880 1864850
17717 1864850 1869548 1871990 1876550 1878046 1897783 1910841 1915471 1923162 1924734 1934633 1935110 1929879 1941413
17704 1941413 1960509 1981496 1987468 1996591 2007054 2014986 2023625 2028103 2035955 2044619 2043642 2049491 2066646
17691 2066646 2083616 2073942 2087579 2098860 2107754 2113951 2134205 2139318 2139959 2160097 2184122 2194240
17679 2194240 2198184 2209218 2229402 2238941 2239698 2252801 2270468 2292001 2317639 2328850 2349146 2353120
17667 2353120 2369310 2371492 2373057 2385965 2404551 2414792 2420645 2434523 2445033 2462974 2486120 2495376
17655 2495376 2506211 2515147 2527245 2535029 2547760 2558749 2575163 2590757 2616704 2623885 2635065 2650021
17643 2650021 2671852 2691721 2699296 2674063 2644218 2604822 2584711 2598945 2622308 2646858 2678824
17632 2678824 2715316 2738841 2770556 2803828 2837979 2873863 2897269 2903772 2906050 2931862 2964556 2984419
17620 2984419 3015913 3045605 3083305 3121351 3126539 3129570 3152203 3177503 3200108 3216523 3225040 3245990
17608 3245990 3266137 3279273 3292623 3313713 3334710 3351441 3384510 3416178 3452210 3485167 3505078
17597 3505078 3539072 3584744 3620586 3651150 3681825 3710394 3740457 3785242 3814095 3846218 3882962
17586 3882962 3916480 3952107 4001402 4053155 4086210 4112046 4148418 4171756 4198279 4248935 4302094
17575 4302094 4353056 4401297 4437228 4482076 4526142 4568106 4624274 4688754 4747845 4792991 4842625
17564 4842625 4904150 4967019 5029852 5088774 5150947 5219429 5290618 5344773 5411610 5483395 5554769
17553 5554769 5624198 5710409 5792455 5884861 5963790 6036354 6124734 6226620 6334677 6424351 6527364
17542 6527364 6646322 6773093 6907045 7030374 7169528 7301379 7436054 7580004 7742612
17533 7742612 7904848 8082541 8261858 8441060 8614616 8821939 9049051 9298568 9533194
17524 9533194 9725253 9849317 9920381 10003139 10177807 10418227 10651580 10831974 10994045 11214846
17514 11214846 11508106 11810769 12142764 12512709 12956340 13483900 14033260 14612573 15238955
17505 15238955 15926380 16674932 17498738 18389911 19376335 20472532 21682094 23035910 24543965
17496 24543965 26258450 28219619 30486698 33100746 36126726 39678415 43952310 49086925
17488 49086925 55104878 61600563 66927801 66773048 53990017 24813375 -12927470 -44779357
17480 -44779357 -61343660 -63889544 -59594282 -53647795 -48002281 -43127014 -39015531 -35574864
17472 -35574864 -32675265 -30201101 -28043266 -26133834 -24453807 -22952534 -21606881 -20411825
17464 -20411825 -19344477 -18382026 -17506235 -16703477 -15935112 -15218522 -14541745 -13894010 -13314489
17455 -13314489 -12780865 -12266821 -11788805 -11369318 -11030427 -10767523 -10583900 -10444910 -10297793
17446 -10297793 -10115220 -9868572 -9571064 -9277920 -9063315 -8918635 -8857702 -8819228 -8748126 -8600785
17436 -8600785 -8379114 -8129085 -7909470 -7707998 -7511607 -7325898 -7150413 -6993163 -6842254
17427 -6842254 -6701966 -6564320 -6432448 -6319602 -6213438 -6107667 -5998390 -5891725 -5774572
17418 -5774572 -5657721 -5559701 -5469730 -5378125 -5297109 -5220911 -5133821 -5052820 -4979687 -4906962 -4833711
17407 -4833711 -4764402 -4698232 -4638230 -4552026 -4475133 -4424050 -4371938 -4325492 -4271063 -4214166 -4147530
17396 -4147530 -4092414 -4040981 -3972910 -3913975 -3871370 -3824821 -3796055 -3753280 -3702788 -3645918 -3609028
17385 -3609028 -3575806 -3543410 -3508676 -3467051 -3410088 -3359588 -3310545 -3289453 -3260188 -3233093 -3189932
17374 -3189932 -3155563 -3135388 -3113024 -3090746 -3053823 -3021959 -2981385 -2950731 -2934850 -2908918 -2883734
17363 -2883734 -2849748 -2812543 -2797610 -2776854 -2746159 -2727116 -2700219 -2668190 -2642412 -2628583 -2607967
17352 -2607967 -2585873 -2562966 -2560949 -2542084 -2505395 -2466424 -2439290 -2429585 -2416246 -2403770 -2380585 -2364321
17340 -2364321 -2353185 -2337101 -2322949 -2316721 -2321287 -2323527 -2311208 -2299197 -2289969 -2282745 -2282251 -2281409 -2247278
17327 -2247278 -2198648 -2130746 -2060334 -2013008 -1986266 -1966828 -1946652 -1937952 -1926225 -1916146 -1904782
17316 -1904782 -1878865 -1878212 -1862983 -1845512 -1832108 -1833033 -1822051 -1810247 -1792917 -1767788 -1752058 -1741397
17304 -1741397 -1743134 -1732646 -1715463 -1697022 -1690740 -1676596 -1660814 -1658031 -1644980 -1627653 -1618525 -1620349
17292 -1620349 -1631879 -1625380 -1602847 -1589320 -1576499 -1578009 -1568846 -1567723 -1562338 -1541931 -1528861 -1521744
17280 -1521744 -1510424 -1498559 -1485150 -1472464 -1467022 -1463797 -1461615 -1445878 -1420158 -1401879 -1390215 -1388579
17268 -1388579 -1389283 -1387230 -1375565 -1377608 -1370541 -1355533 -1352137 -1340718 -1332701 -1321254 -1307933 -1296340 -1280595
17255 -1280595 -1280200 -1261371 -1260021 -1254346 -1255718 -1260866 -1260143 -1245316 -1236929 -1218087 -1217478 -1199790 -1190502 -1189780
17241 -1189780 -1183791 -1176640 -1169066 -1163302 -1150658 -1146647 -1140504 -1129830 -1116306 -1128386 -1124370 -1118709 -1110888
17228 -1110888 -1099551 -1095857 -1079661 -1071000 -1079453 -1082203 -1075648 -1070577 -1068165 -1061753 -1052397 -1045576 -1034170
17215 -1034170 -1029843 -1031079 -1030073 -1026849 -1029050 -1004593 -984329 -977774 -962960 -953407 -960133 -969222 -961395
17202 -961395 -949487 -947796 -938099 -933566 -933443 -940783 -937623 -925810 -913061 -914383 -914237 -905633 -906986 -908105
17188 -908105 -905205 -888064 -878477 -883354 -880528 -880250 -871473 -859661 -851833 -850168 -855523 -842773 -830224
17175 -830224 -843691 -846410 -850400 -849187 -856655 -866121 -858443 -824047 -805700 -797349 -797728 -790410 -793112 -802269
17161 -802269 -805965 -795820 -782917 -771939 -759606 -752871 -751971 -755062 -742925 -747329 -743368 -739345 -744857
17148 -744857 -738906 -746119 -737234 -727943 -728018 -727883 -717901 -713297 -701633 -694790 -694194 -699380 -706075 -700885 -701323
17133 -701323 -689561 -678048 -677417 -671237 -663077 -668656 -668230 -677032 -679157 -675321 -666688 -658098 -646935 -644491
17119 -644491 -643677 -650619 -655312 -657894 -668330 -661379 -651536 -646380 -636840 -634571 -625201 -620501 -617133 -607830
17105 -607830 -592211 -580886 -577997 -578243 -570923 -568909 -569679 -575761 -579460 -586932 -587326 -575167 -563721 -562113
17091 -562113 -569791 -580692 -591229 -583110 -568764 -551513 -549669 -554459 -553333 -548509 -541508 -536782 -540268
17078 -540268 -533104 -523374 -527069 -522454 -526755 -525668 -522748 -529879 -528262 -519968 -522914 -522753 -509618 -499542
17064 -499542 -498393 -505066 -502602 -492636 -483468 -481082 -488311 -492826 -496359 -494261 -479328 -475579 -481431 -485760
17050 -485760 -477504 -469002 -444860 -429742 -425757 -431659 -432380 -430885 -436267 -443640 -440712 -433464 -436902 -437041
17036 -437041 -432444 -431332 -431270 -428145 -430945 -425417 -416008 -417855 -409739 -404683 -402987 -394873 -387793 -397900
17022 -397900 -387619 -379122 -376880 -381672 -383409 -380618 -362893 -365589 -376550 -378805 -381113 -386672 -395015
17009 -395015 -386677 -370779 -357916 -361405 -364582 -360586 -367805 -358474 -344161 -345357 -344169 -336750 -344776
16996 -344776 -345166 -355548 -366498 -374056 -361402 -346950 -352283 -356307 -354530 -340416 -337898 -336328 -338679
16983 -338679 -321864 -305933 -311194 -323237 -328241 -318353 -319129 -323715 -319284 -314494 -303664 -309836 -312269
16970 -312269 -312318 -299205 -289447 -283359 -279719 -287840 -292432 -279330 -263413 -272711 -280111 -288220 -278339 -275794
16956 -275794 -276323 -281105 -278444 -266529 -259713 -268190 -283299 -272077 -278269 -291594 -288488 -277687 -269382
16943 -269382 -259847 -240049 -235640 -242605 -248069 -255693 -256077 -254632 -266223 -271580 -256017 -236740 -241389
16930 -241389 -246080 -255047 -266717 -255120 -236173 -223106 -216171 -215959 -222055 -219303 -213694 -209830 -202390
16917 -202390 -216841 -226866 -210483 -208273 -211025 -217946 -212341 -199368 -179468 -173740 -178330 -189146 -194448
16904 -194448 -188879 -177363 -172638 -174383 -171338 -170379 -173764 -179908 -179115 -175989 -170244 -164730 -155826 -152812
16890 -152812 -156753 -157623 -154484 -143863 -138020 -134245 -119066 -112485 -113328 -103464 -87489 -74404 -72613 -72644
16876 -72644 -63194 -73931 -60798 -49295 -26460 -14991 -4884 11172 38136 68134 110229 146893
16864 146893 160282 143627 69569 -89566 -283227 -437304 -519980 -531297 -499886 -464781 -434693
16853 -434693 -409330 -388889 -363913 -348094 -346947 -340184 -321866 -304717 -274618 -261140 -258719 -243530
16841 -243530 -235625 -236623 -231634 -234668 -240871 -246363 -239718 -231249 -230364 -229062 -220824 -212335 -206003 -207034 -204954
16826 -204954 -202569 -206488 -207819 -208189 -193630 -187554 -185261 -193846 -199098 -193517 -191808 -191244 -185756 -175556
16812 -175556 -176098 -184074 -184791 -177839 -168789 -163701 -153964 -160512 -176880 -191859 -191375 -179686 -173700 -164292
16798 -164292 -153297 -146413 -129069 -130095 -132589 -145907 -155407 -156063 -152759 -155846 -158487 -147178 -133210
16785 -133210 -126611 -134523 -142566 -146665 -147072 -140414 -134713 -134567 -125687 -127515 -135099 -128464 -130663 -137046 -134377
16770 -134377 -126641 -131720 -134060 -134882 -135111 -138338 -128417 -113741 -101109 -88672 -84309 -92113 -91979 -79537
16756 -79537 -87846 -93328 -89855 -90907 -81807 -74237 -74781 -78875 -88133 -89222 -92203 -83010 -80645 -91127
16742 -91127 -106311 -101739 -97727 -81184 -81893 -91137 -100634 -102044 -97057 -101970 -99066 -92262 -85257 -79256
16728 -79256 -69250 -73979 -76676 -77716 -75752 -76163 -74871 -75573 -73749 -76786 -87272 -86675 -82890 -81014 -80508
16713 -80508 -64336 -61701 -68694 -70635 -74176 -62724 -66825 -66035 -62574 -64763 -73958 -66698 -69776 -63687
16699 -63687 -44287 -41226 -37230 -29639 -35010 -38795 -43015 -47018 -43854 -43069 -49274 -53312 -61500 -52675
16685 -52675 -34933 -16674 -14079 -11984 -19515 -18964 -28245 -43612 -36982 -39911 -31522 -21532 -30917 -37459
16671 -37459 -29889 -26887 -25438 -25513 -21523 -23850 -20209 -5555 -7801 -26639 -33152 -27609 -25196 -34695
16657 -34695 -30778 -18817 -26056 -33054 -36347 -36402 -25318 -14359 -1952 -2368 -25923 -38786 -32076 -18465
16643 -18465 -3179 -394 -1650 4633 890 -6867 -17675 -17517 -15061 -1665 -4259 -18129 -25582 -17121
16629 -17121 -12990 -14439 -22208 -25792 -5706 5912 5091 2113 9728 23486 26308 26256 21219 7238
16615 7238 -10561 -17540 -11950 -5197 1145 -2742 8982 8499 -590 1206 -2175 -2865 -91 10977
16601 10977 19740 24854 29384 28871 21144 20775 22822 24728 24504 23455 14643 23581 28172 28136 24379 22507
16585 22507 15948 10323 15622 23410 30156 33421 34982 24784 32144 41259 45543 41945 38146 36742
16571 36742 44035 44266 50410 47415 44724 47830 52873 69568 75985 69394 62522 60622 53394 52659 41999
16556 41999 40742 46412 41611 30966 32310 38744 33999 36497 40276 39327 48932 60220 61108 61303 56208
16541 56208 49327 56093 60661 63570 67738 71415 70881 68366 79011 77551 76236 70195 67260 66109
16527 66109 55399 57614 65010 62337 54282 47351 48468 58073 61519 61281 53544 49254 61248 79038
16513 79038 83419 70318 61953 68675 79079 77539 85495 77585 79556 77400 80020 82579 80461 61809
16499 61809 57908 58094 65902 83278 81083 79430 75439 72248 64023 73944 93753 82238 67168 74380
16485 74380 83996 99857 110244 96304 81896 81730 86902 87414 95417 107292 115231 102531 95750
16472 95750 92014 88980 109059 120996 117427 101752 93527 95359 94334 94864 96754 98060 98385 94037
16458 94037 91079 84341 79030 73290 75120 86508 94311 106201 100134 92120 100627 100725 97126 97103 102899
16443 102899 109684 121275 117738 105293 96993 98746 87329 81339 83425 103262 118728 117203 109985
16430 109985 115065 119807 118145 117483 120670 118358 119036 113849 100454 114322 125386 120799 125941 127586
16416 127586 123513 111496 108172 110055 120424 118827 115827 105421 114082 119453 120307 119441 123814 138095
16402 138095 137378 128271 126825 126970 136358 147041 141776 134317 137840 135586 131078 138943 148172 144267
16388 144267 145158 143935 131166 137305 132508 122377 107904 114048 124069 133558 134984 129776 134136
16375 134136 137138 137268 138042 132812 127318 124546 133819 147766 151516 147060 145529 145762 137201 125911
16361 125911 123502 122641 128625 133490 142885 149592 151689 146420 149146 145407 140550 142110 147174 156477
16347 156477 164506 166503 168424 170401 171187 155253 136681 129579 144366 145127 131513 122836 128444 135782
16333 135782 144975 145735 141299 153936 165618 171287 174855 158764 141883 145578 145360 147105 150815 156127
16319 156127 160947 157265 157320 161994 158730 163639 170648 162973 157052 160938 166977 161448 161547 159928 154057
16304 154057 138936 138910 147774 148013 149154 157149 167221 176174 177566 165223 166618 185422 192460 189892
16290 189892 193235 186062 171204 167833 174030 175775 179312 176050 177151 186011 187014 174694 174195 168595
16276 168595 173847 168385 165661 156410 149432 155134 163153 177370 179713 181936 186575 192451 189172 193633
16262 193633 200662 204663 199132 187197 182576 189503 186534 186823 180489 191346 189096 178972 167908
16249 167908 172461 180509 178843 186970 182997 182344 177099 181421 190363 189925 180562 190016 196306 194676 190386
16234 190386 189188 188071 177763 185691 193097 201163 188976 181755 191026 201027 201676 214482 224191
16221 224191 216593 198369 191211 190539 191711 190414 200240 203566 190394 191489 193862 187544 195096 193471
16207 193471 194230 192585 190129 197463 205214 199220 203439 204531 203890 208655 209111 204311 201026 206319 202257
16192 202257 194516 199449 200727 205231 201145 200293 213925 225072 224013 215559 219064 220153 223765 225046
16178 225046 220415 227002 221479 218022 223999 237495 229471 223173 223755 226815 223063 230018 235389 218868
16164 218868 207737 207021 215436 212816 206837 204796 200393 198370 208975 219791 218561 216610 214925 214299
16150 214299 213699 202159 206001 211506 215405 210701 212600 223342 223910 234479 248553 233566 216508
16137 216508 211673 215789 212676 221674 230517 223158 218799 231293 241238 232086 229269 234995 231781 225417
16123 225417 229725 231843 230536 220814 220968 213062 212094 214391 224222 223819 221335 213758 210513 216730 220506
16108 220506 230374 235556 245248 240101 246386 235867 232916 224063 224067 234913 232893 237571 234655 249032
16094 249032 247945 244075 253336 257683 262195 263365 255787 231711 217797 231970 231790 237320 236503 242506
16080 242506 245504 243103 241594 247451 241017 242464 264334 276707 266722 270717 270309 254238 241647
16067 241647 241002 247511 263150 257862 252875 247492 240185 242921 240721 254161 262242 260137 258124 254709
16053 254709 247681 251741 255491 249172 248060 246139 251959 261209 262930 246832 244674 254467 262625 262861
16039 262861 266144 270604 284387 284810 281405 263215 259346 256373 252951 252374 258207 262827 247883 235516
16025 235516 247170 255911 268304 265703 261261 258666 261992 251352 256409 261737 256300 259497 270033
16012 270033 271237 271202 271468 275451 270652 273153 258329 256775 263376 276647 274672 269332 275047 276885
15998 276885 284549 294719 299749 302544 288450 282171 282350 284905 285956 274376 275307 278044 280447 284401
15984 284401 279469 277901 279669 284303 283282 274798 263974 266842 273713 289266 296588 306655 295276
15971 295276 280871 284757 284426 279133 276279 275903 279047 286404 293067 297943 287041 278849 285722 293288
15957 293288 287245 288090 298271 293788 289336 293351 277570 267128 281258 283939 293429 296113 286487
15944 286487 275085 276916 276321 273918 277560 288198 285829 279802 270839 258463 272362 275219 275020 271425
15930 271425 271754 294243 309443 300565 293184 286029 274374 270867 281736 299455 301121 294000 295136
15917 295136 306688 312113 317042 309659 299911 307062 309748 310933 300951 290449 308140 312147 304790
15904 304790 297410 301115 307558 308756 311277 310116 320626 321803 327101 322071 316397 309206 299442 280692
15890 280692 271663 272470 280424 284144 277832 284035 289958 288472 295059 296009 310588 302280 298971 307623
15876 307623 311243 303378 294288 297058 305528 302072 297755 307356 309416 290199 285351 287931 297148 301866
15862 301866 300872 302631 308048 314790 309035 303580 312993 309189 305177 311559 319253 323753 327946 325786
15848 325786 310767 323404 336190 323799 314296 322813 318717 316845 318373 319666 306314 312838 323268
15835 323268 334280 332006 334347 335761 334010 334457 337944 347817 342188 323775 324941 328840 317136 317876
15821 317876 325136 325242 324539 325554 331446 329684 328189 327344 334747 329461 324385 330740 323484 325148 336218
15806 336218 330034 320159 308757 302814 312945 326532 334128 340396 343514 339241 337850 341445 350521
15793 350521 363161 349367 349302 349959 350963 343233 338096 339869 340711 328570 310246 315177 321177 319395
15779 319395 318451 318765 332641 344061 351880 359068 352647 359368 353245 339644 332627 328219 322659 325818
15765 325818 319826 332713 336841 343967 355470 343898 331277 330284 332512 339295 346975 348010 342246
15752 342246 335290 338138 338145 341561 342212 353215 349349 342755 338109 332741 336543 340061 355462 360540 348902
15737 348902 341286 343019 339049 335607 332406 332577 323881 321145 329578 335356 348269 352053 354750 360549
15723 360549 352810 347474 341963 337173 334286 337780 351915 351885 346737 351893 354624 363132 366288 364504
15709 364504 362717 353485 354509 360360 366730 369969 362176 360200 349410 343771 342799 351002 350846 339290
15695 339290 335531 338616 340317 345703 352638 357486 356375 344220 351727 364454 364828 359196 350265 339918
15681 339918 332464 331111 339627 360506 372505 373107 354912 348471 351040 371532 385480 379849 377479
15668 377479 368586 370085 368492 357990 357300 361744 364257 370108 367716 365077 369278 366936 378018 389846
15654 389846 385438 384284 396617 393708 392790 390243 382483 388821 387061 390674 394842 395245 395059 399918 395849
15639 395849 396728 398437 383104 375381 364709 360992 360031 367828 378895 385997 392133 387818 382921 387258
15625 387258 381493 385403 386888 383182 385461 380557 388689 392780 393154 383883 379459 383630 388916 389304 386837
15610 386837 385224 374132 367617 377889 377275 363051 360526 372358 383205 393961 394584 387336 380076
15597 380076 393002 389137 391573 396871 404127 397557 402662 416035 415433 409864 399958 386008 379337 376331
15583 376331 383539 390985 410189 412307 403826 391931 382575 396492 400936 408991 406761 394845 381473
15570 381473 373904 383825 398448 405157 398857 403109 406128 398283 411418 411762 409169 408700 401414 409440
15556 409440 429670 418414 406736 394774 393108 393236 398217 407709 415342 413641 408368 414811 409185
15543 409185 394705 389757 376933 380123 389472 392881 389207 394455 392742 381295 382485 396670 401302
15530 401302 411378 403042 394055 396893 404142 411592 396872 391098 397320 392829 387546 382610 386849 394766
15516 394766 403483 405191 400363 402586 409483 416155 413790 405387 406578 405023 388591 386932 406283 417755
15502 417755 424107 413471 407704 403622 411191 416504 402690 397124 394005 401198 411387 412557 409718
15489 409718 414104 416512 423543 421352 423853 421339 415755 415067 415307 420799 421412 422838 419147 404767 392263
15474 392263 401710 396979 388291 383578 386519 394836 399879 399322 399114 393160 392842 402988 422453 425787
15460 425787 424800 421664 419045 419608 434383 434893 437795 427727 422964 434759 437156 432381 425067 420674
15446 420674 424997 425126 428783 429124 424965 437382 441929 441652 440174 432507 429949 422622 414812 419898 430534
15431 430534 445940 438333 433643 437602 434708 434646 432625 418534 426816 436444 440351 448638 452103 452017 446349
15416 446349 432876 430482 440679 438496 426044 424430 432399 433199 437275 442342 431255 424260 429686
15403 429686 431775 425197 419732 426887 425464 421901 434124 447342 446445 449672 455814 445895 442606 431372
15389 431372 425051 424444 420905 429785 443381 458169 464544 456825 449659 444430 434283 421218 426109
15376 426109 432652 429119 429428 428966 435097 447210 447010 442975 429402 432550 429927 427845 429202 418849
15362 418849 427318 428582 425474 424493 441415 451895 449020 452859 450629 444158 442803 448203 446812 448532
15348 448532 452559 438757 441603 446026 444808 439872 435940 446623 459312 463421 472613 469806 468674
15335 468674 462376 451183 449795 458892 469812 472405 464584 463177 463477 450800 457981 463405 452789
15322 452789 442016 445186 452421 444728 438529 433653 439848 448183 446022 432832 430428 436592 448393
15309 448393 454476 456590 454962 452663 447120 439106 444413 447466 441999 443773 446582 446372 459128 460626
15295 460626 461186 465986 460657 463045 478384 471627 471305 484165 485632 474568 448977 439291 444453 456886
15281 456886 460555 447106 438748 446303 456560 469360 466122 468506 468888 472496 473823 464223 466611 459358
15267 459358 461343 467592 464766 457475 454362 451270 461168 467188 469474 475831 465841 455048 456634 465197
15253 465197 467548 476561 465490 456932 456101 459364 449527 448045 457419 462849 469756 482601 490254 481455
15239 481455 467959 468033 467870 484556 483934 485020 496019 498078 488152 478111 483950 470799 457932 456694
15225 456694 455935 464334 480156 486272 482193 470413 468986 462640 464530 460110 460878 471482 475004 476414
15211 476414 477686 480083 470205 477957 483704 480885 463785 466990 475872 477740 480224 500088 506491 501652
15197 501652 500882 491323 482928 480845 480899 484188 480663 482556 493470 505073 507194 499452 506440 502255
15183 502255 490162 489625 506581 508961 502509 493274 496761 493883 497040 494454 490232 508566 520851
15170 520851 502818 500174 502699 499263 496517 499883 499067 500911 502419 498584 497763 504017 516255 512763
15156 512763 502790 498988 496981 497956 503073 504550 512527 498943 496550 493215 500992 506396 511798 512152
15142 512152 501619 503220 502784 495565 498335 491947 496446 503180 502164 496957 487506 477634 483983 503972
15128 503972 516864 511534 498113 507316 514717 511084 516346 521586 524441 520238 520420 522774 526906 514668
15114 514668 509027 504023 500602 512628 515494 503101 494967 490733 498909 506888 506116 506985 514347 515871
15100 515871 507100 511470 516651 518897 525906 534287 533452 524931 517024 511124 517813 523994 521843 528548
15086 528548 528790 523090 515914 520506 528345 533229 528979 522502 518450 514886 517396 523907 526090 513892
15072 513892 519432 526576 525662 532737 533458 529862 529239 537137 536040 522968 516515 514102 514505 521865 524368
15057 524368 522019 518975 514147 511814 509467 518087 529956 529023 520814 516311 515459 514133 521486 518682
15043 518682 532091 532474 533884 539379 544120 556458 545126 530910 536135 534247 533336 521351 520478 514139
15029 514139 512559 523147 527089 526877 542622 543993 530667 529952 533609 525556 519912 519370 525789 532194
15015 532194 538004 528527 524239 527838 518159 503395 508698 525167 546504 550529 551621 548138 544752
15002 544752 532383 516921 522201 540442 539795 531884 523353 528505 536270 539323 536466 537921 539167 533125
14988 533125 534295 535879 540924 554151 556080 555678 563180 567988 565071 549820 540481 537242 539732 543996
14974 543996 547086 534420 526268 542137 548110 542326 541000 549546 557678 567912 554933 549307 554274
14961 554274 559323 563003 566555 560378 563114 571847 572912 567069 554091 543020 536040 529622 521988 531443
14947 531443 537096 549109 566314 572040 567492 558424 555690 556784 555658 559587 561347 554024 539371
14934 539371 541229 542314 549313 561476 545809 546650 553883 562145 567852 566833 571403 578815 577674 581038
14920 581038 580679 571751 568514 569079 566577 559561 553862 554636 555039 567529 575760 578558 585610 581798 582229
14905 582229 581280 576791 576119 580705 584954 573782 569011 567993 560287 557068 555881 552035 557120 554547
14891 554547 552727 553310 562061 565308 559821 542470 541781 552220 552277 542027 544327 554454 575136 578422
14877 578422 578778 582512 577815 575121 583544 590861 597778 586464 585202 589902 598928 596200 595253 599070
14863 599070 604003 594116 591117 586738 572918 578494 579236 566309 561858 569263 572036 574578 584780 580339
14849 580339 586877 599019 593046 574923 576747 572443 564507 553720 565174 586085 594569 594547 586456
14836 586456 578018 574373 568816 560965 553523 573999 592223 602370 598513 583533 583837 584588 583260 568853
14822 568853 571154 575897 580537 567986 566763 581788 603057 608466 601787 605281 599887 587512 590886
14809 590886 590266 593379 602240 613721 612282 595937 587142 585477 592059 587795 586107 597180 598497 601348
14795 601348 596956 589885 593252 604337 609096 602809 597251 601287 601834 602476 598766 595238 607452 608080
14781 608080 588990 585335 594279 599562 596285 595434 603017 606086 612192 612800 623328 621782 609858 600682
14767 600682 611278 615787 602772 605741 616726 616887 620139 603528 597302 601956 599601 599961 602634 605993
14753 605993 611003 614460 617332 605338 603877 609326 611213 611730 611451 607069 622402 630197 631889 629496
14739 629496 615852 605748 604201 597477 600066 599388 602427 605178 601056 604392 602781 605125 603505 610987
14725 610987 620392 618472 625741 632173 634972 639040 644187 625927 630281 630182 624361 628442 617941 635913
14711 635913 647577 636512 623030 619806 617727 613350 625778 628081 623618 632334 634856 629812 641213
14698 641213 642301 642356 644989 647491 644314 631535 623444 625399 624690 626830 636352 646319 646080 630419 632867
14683 632867 637070 632393 637081 630677 636791 635113 620235 630230 637133 631901 626330 639577 649126 641266
14669 641266 640707 635532 638624 638743 643900 642352 653074 667309 654340 651275 648146 629125 614675
14656 614675 617714 615861 621424 631459 636952 640145 641091 639333 639565 645444 639659 642745 643552 643074 648082
14641 648082 655519 649630 636089 638438 624614 620487 629958 634778 644343 646862 649604 649700 650546 649569 641368
14626 641368 643627 646900 645277 650170 654814 645699 645286 647941 640745 636624 637534 648666 658339 649311
14612 649311 642737 646474 652795 657544 641320 635319 632741 648160 659111 659878 657350 658408 657836 658598
14598 658598 658435 660286 660635 657751 659756 662403 661554 659363 651831 657161 663958 667207 677705 678973 676668
14583 676668 681194 674890 665063 661842 656331 667250 664363 657111 658426 661035 664176 663311 665631 663369
14569 663369 662986 674414 677474 669715 663284 668439 676375 674538 682945 695435 684706 665629 660968
14556 660968 661452 664059 668852 678194 671561 663680 655811 658793 667852 679608 683981 691933 689170 673400
14542 673400 670613 674044 682557 680788 677954 682186 686262 680643 680920 675690 671599 665166 657252 660405
14528 660405 667363 678798 684302 672558 668384 674499 678570 674228 672301 662016 655782 668787 681666
14515 681666 669095 668006 674410 677897 670382 668476 678069 684533 685981 688051 690629 689713 684078 675825
14501 675825 672759 683617 682919 688701 693288 674575 673168 687083 687692 690562 698393 698282 689255 694475
14487 694475 689831 676524 684846 679751 671242 679206 691007 699968 705484 706166 699429 695673 699184 701455
14473 701455 697314 701711 706873 700034 701637 702017 709256 703854 706313 709536 704393 705008 709486 712271 709260
14458 709260 703918 693592 693627 700938 692284 691802 698438 703593 707631 710638 701427 696565 703089 710596 707935
14443 707935 712521 722735 719884 731478 730912 718817 709675 704920 696627 696309 710780 717813 723180 720614
14429 720614 716591 695483 698740 720182 732367 726661 710878 706608 706193 714567 726516 733272 736710
14416 736710 736314 734053 725579 721305 722521 729419 729306 724912 711831 707417 722439 744201 744880 746627
14402 746627 741781 725442 726320 733872 734328 733118 745947 747050 743203 734849 726617 727054 726974 741233 749670
14387 749670 745965 749574 746509 729813 729597 729817 746438 743309 744473 742433 732599 726806 732538 733786
14373 733786 726699 733594 733189 722935 720242 720187 727229 741941 753673 754783 750934 730931 730444 737561
14359 737561 737238 746612 735612 739727 756366 747631 739679 750185 740638 734691 742595 749372 741572 739584
14345 739584 733681 733011 731070 738572 753329 750904 752843 757016 741333 724505 729655 735900 743937 750493
14331 750493 760631 767820 773371 768180 758954 757975 762435 769310 767337 769083 765655 757695 750609 756837
14317 756837 758895 756573 750986 756503 761314 757555 761582 759692 752796 753575 752379 751275 761691 761858
14303 761858 749557 742862 750091 769890 774009 767392 747260 734070 742126 765543 761944 748885 752949
14290 752949 757707 766671 762585 764608 759041 758929 760685 759648 759515 773118 773610 764217 764280 772994 769584
14275 769584 753459 750844 763737 766477 769760 766922 767669 772392 780715 787691 785152 778864 783231 791271
14261 791271 786799 779553 782796 785424 770777 778640 774506 763741 760964 759826 761185 766770 777838
14248 777838 775335 779549 788585 799115 793984 798734 811063 818773 817053 813206 806686 801275 792052 788721
14234 788721 780742 779245 784353 788248 777788 788550 788936 778050 777206 777035 784473 792406 789743 776582
14220 776582 763913 767409 773819 776333 774847 784061 785011 779998 778281 797782 804162 811453 810443 809159
14206 809159 816630 808687 809008 809780 800851 789111 791225 799409 793140 783432 781557 791980 803894 802815
14192 802815 803657 809125 796147 811253 814485 808746 816728 832582 832219 825564 819737 826534 831086 821221
14178 821221 811319 807360 803688 808006 809433 818259 816413 809145 805718 809508 817591 810253 806676 809432
14164 809432 804902 807720 807392 813078 814913 818006 814469 827140 832766 827674 818773 811908 815460 810442
14150 810442 808351 812083 818672 827667 822387 812344 806146 808955 812944 833357 835196 839743 841744 835891
14136 835891 826522 819938 821113 829660 836203 825862 818736 816105 818007 822226 819945 827119 831465 830729
14122 830729 843147 843191 841761 844408 842433 837759 838619 845266 855009 851893 857859 863089 862938 865830 854113
14107 854113 840685 846663 842332 833314 837897 844714 847351 846773 846897 851194 845991 831191 835413 853119
14093 853119 847749 841271 843740 851803 850311 838277 844515 858124 860276 855007 855206 864318 879795 874911
14079 874911 870807 868674 865303 864581 864625 856264 859721 863606 850817 847094 844500 842232 836970 838350 849107
14064 849107 856867 864583 867104 871135 879283 867348 849519 852708 862817 875259 878499 864552 862512
14051 862512 868675 865549 868947 890312 891601 876448 870916 859423 852251 857214 865895 872068 873003 884687
14037 884687 887467 888099 882246 885679 882915 896851 902145 885126 867400 864750 854767 856975 877573
14024 877573 889615 897838 890445 887766 900861 900912 894183 892467 888951 877524 868771 871245 875030 888861
14010 888861 901351 897320 892134 896695 889617 896205 897020 888065 879122 871375 858433 872308 894092
13997 894092 891669 887991 894454 884975 880301 878835 880559 886587 915190 927809 924462 911785 903484
13984 903484 912532 914423 923927 926673 919654 900996 887243 878509 882496 884773 884685 891510 890217 877760
13970 877760 882697 888044 895929 895698 902429 914461 912981 905230 904443 904867 899680 897477 899490 904250 903666
13955 903666 914014 910880 907101 920381 923559 920816 920179 915588 922700 916694 913822 918353 920850 931020
13941 931020 932678 920823 908160 910308 923688 931966 926499 914588 919905 916340 909777 916267 926920
13928 926920 911336 909554 916354 920208 928264 934310 929983 922024 922797 930865 937682 946923 949407 951051
13914 951051 949061 944219 944130 941973 938473 926142 931575 932083 938834 951307 956846 957452 958030 963346 961356
13899 961356 957513 941552 937835 941268 946186 958342 956541 950001 953468 949897 954486 948932 959691
13886 959691 960049 927069 901592 894074 921918 946769 949932 944269 944949 944961 947933 946127 943565 964608
13872 964608 973683 955304 954040 950107 943445 937477 942969 958641 962712 974282 964395 945692 947980
13859 947980 960024 972067 968018 965551 958684 960770 961909 962836 962870 966295 959958 958466 961379 968617
13845 968617 982820 985879 978585 985303 980235 970141 970587 970781 953970 946386 951531 958108 962596 973683
13831 973683 976118 977400 983591 984596 983179 981843 980702 983823 985179 983316 980678 986982 984507 978364
13817 978364 975558 998391 998994 985087 983083 978466 979387 992014 999491 997826 1000882 1010922 1021247
13804 1021247 1017735 1009726 1007088 1007760 995896 999410 1007204 995838 997462 1011098 1004005 997418 997670 994115
13790 994115 995414 1003131 1012628 1015708 1015161 1002225 1000314 1008665 1022425 1026564 1024719 1026693 1029139 1027143
13776 1027143 1021105 1017356 1020794 1016188 1026223 1024631 1006083 996312 1002535 1007057 1003158 1009928 1009405 1016262
13762 1016262 1017779 1024157 1026503 1017928 1007804 1008619 1019512 1025926 1019496 1016473 1021221 1014858 1017903 1024659
13748 1024659 1019010 1026626 1034598 1024981 1024609 1024760 1022979 1028924 1021676 1013772 1016389 1036580 1050021 1044912
13734 1044912 1044246 1052829 1048667 1048375 1044717 1041254 1032757 1025407 1027169 1020524 1021084 1026514 1034018 1037519 1040825
13719 1040825 1045936 1045921 1047956 1045672 1052772 1060433 1056310 1052455 1046420 1040794 1040218 1027241 1027428 1041153
13705 1041153 1038698 1025221 1033322 1042957 1051592 1060465 1062443 1062430 1068977 1067870 1073117 1072347 1070529 1064540
13691 1064540 1066767 1073813 1072569 1064776 1064701 1073436 1079002 1079754 1089109 1085104 1062889 1066446 1083423 1076449
13677 1076449 1074149 1068728 1072619 1087065 1088580 1092626 1082959 1074341 1078871 1081325 1080362 1076199 1077839 1079488
13663 1079488 1076607 1078039 1078525 1085912 1085288 1078118 1073306 1082851 1076852 1070527 1078723 1077877 1092155 1097348
13649 1097348 1101994 1105734 1120603 1116137 1102343 1102255 1088822 1097755 1110996 1110767 1115441 1114491 1118751 1118263
13635 1118263 1119123 1112982 1110342 1113497 1104193 1115622 1127871 1112799 1092475 1081189 1083437 1094883 1106599
13622 1106599 1115758 1122697 1125654 1116199 1106598 1108506 1120823 1111938 1107753 1105991 1110287 1111929 1120369 1117995
13608 1117995 1117048 1116049 1131518 1120741 1114011 1118155 1118592 1118547 1127622 1128135 1138143 1135592 1146115 1143729
13594 1143729 1150904 1151668 1149108 1157107 1161071 1151897 1131543 1132312 1140948 1140697 1138599 1131485 1120919 1120784
13580 1120784 1137279 1142410 1129363 1137067 1144994 1139172 1145194 1153253 1145148 1144655 1141304 1148014 1149061 1143960
13566 1143960 1131854 1138105 1152174 1146577 1148024 1149285 1153981 1151486 1150974 1147759 1146200 1145588 1144438 1141800
13552 1141800 1150771 1162261 1158067 1157347 1160604 1159897 1154653 1163520 1164115 1167816 1171016 1160660 1161229 1173435
13538 1173435 1178717 1175317 1183903 1193532 1209691 1201683 1191457 1181287 1188882 1183189 1182722 1174263 1158194
13525 1158194 1153526 1172771 1189051 1191797 1181508 1180627 1184061 1184052 1181761 1186660 1186259 1190591 1207252 1205079
13511 1205079 1195434 1193647 1191304 1191938 1199355 1193122 1192100 1207094 1210685 1207606 1211692 1215444 1210228 1211224
13497 1211224 1214562 1217225 1216346 1217607 1207905 1190989 1184696 1182636 1186272 1190994 1196317 1198224 1197982 1204462
13483 1204462 1204368 1206998 1208965 1208410 1218051 1221185 1214692 1212141 1217143 1220357 1227097 1241591 1236631 1219394
13469 1219394 1209992 1210867 1220766 1230290 1234706 1238266 1245738 1235859 1225460 1224115 1234823 1244098 1253013 1250879
13455 1250879 1233737 1224557 1218512 1223989 1230805 1233667 1224877 1222718 1238804 1236099 1237535 1238923 1232042
13442 1232042 1230652 1241927 1250367 1259022 1261877 1269299 1271648 1259457 1261095 1255530 1258775 1272239 1273121
13429 1273121 1268833 1271812 1275492 1275682 1274658 1278779 1269035 1263755 1263487 1271784 1274632 1287699 1302014 1304800
13415 1304800 1288790 1280477 1279076 1274188 1269934 1271457 1273940 1288743 1292259 1285048 1285913 1280543 1283436 1296987
13401 1296987 1307010 1299527 1287240 1283101 1281507 1280651 1290366 1293545 1293031 1306439 1307608 1307854 1305608 1298576
13387 1298576 1305722 1306092 1296146 1300379 1303656 1299138 1305441 1298447 1296014 1299874 1306671 1314069 1317183 1317867
13373 1317867 1327816 1335394 1333046 1336377 1336312 1333523 1327915 1315498 1326075 1337514 1332796 1325770 1326950 1325954
13359 1325954 1322475 1329324 1324705 1322407 1323506 1331967 1340553 1342355 1332432 1332166 1333553 1337187 1340376 1341965
13345 1341965 1337859 1341557 1340174 1344027 1346532 1345126 1335059 1340304 1351640 1348181 1338936 1340995 1346045
13332 1346045 1359148 1362582 1363248 1362176 1356496 1364734 1371678 1374854 1370340 1356965 1364818 1375846 1366738
13319 1366738 1363640 1350490 1351387 1360468 1358737 1355491 1363780 1362450 1361819 1366687 1374416 1383892 1375176 1358284
13305 1358284 1361450 1356879 1354798 1371088 1374556 1375377 1383811 1371329 1358496 1365329 1386370 1399339 1407759
13292 1407759 1410406 1400625 1397717 1399917 1396339 1396686 1394542 1394710 1408785 1401737 1405565 1406753 1397490 1405011
13278 1405011 1415618 1410963 1423667 1420559 1418205 1411546 1395482 1396865 1400609 1404004 1417307 1431037 1428314
13265 1428314 1434379 1448435 1448882 1450329 1447656 1436499 1435418 1441315 1440120 1439454 1451050 1456557 1453393 1447993
13251 1447993 1442889 1449737 1452095 1463875 1467752 1455121 1451359 1457262 1462896 1459722 1454015 1456739 1470411
13238 1470411 1466050 1456019 1445400 1450104 1461007 1461051 1458052 1453899 1454605 1453892 1453866 1448689 1446735 1450053 1454333
13223 1454333 1466534 1474703 1476572 1478330 1469464 1467680 1476428 1480052 1478231 1489934 1502237 1494029 1485943
13210 1485943 1487740 1492042 1495177 1488913 1483892 1488272 1497565 1485821 1485962 1488027 1493360 1501062 1503471 1508098
13196 1508098 1512594 1528148 1526647 1518407 1523449 1522022 1515679 1515338 1517569 1510747 1505029 1500500 1500831 1501653
13182 1501653 1508612 1523371 1526243 1521914 1530086 1542191 1548408 1538425 1528354 1534164 1543464 1555234 1564006
13169 1564006 1558891 1545335 1534430 1545165 1558309 1549803 1548927 1551937 1549807 1552131 1549588 1552239 1560204
13156 1560204 1558450 1556633 1550532 1551528 1559467 1570645 1582762 1590689 1593940 1582334 1569762 1572555 1577502
13143 1577502 1582495 1588018 1586747 1592769 1598750 1606086 1599063 1586859 1589686 1593173 1610603 1614567 1603364
13130 1603364 1595094 1586867 1586754 1593689 1591087 1592057 1603028 1606086 1614873 1614240 1609100 1613406 1613802 1608883 1601852
13115 1601852 1603222 1611401 1617475 1613701 1616959 1619575 1620797 1627878 1630696 1633696 1628722 1622909 1641437 1657564
13101 1657564 1663921 1660881 1655440 1659526 1655971 1648181 1646957 1648520 1653942 1660124 1657547 1645918 1651617 1653989
13087 1653989 1640014 1645254 1655157 1657043 1659267 1658162 1660013 1676387 1687357 1684154 1680210 1680582 1692651
13074 1692651 1698834 1696151 1697592 1719873 1710470 1710572 1711630 1704482 1694818 1690370 1699721 1703006 1708720 1708461
13060 1708461 1715719 1727666 1737570 1729495 1712402 1704101 1714533 1728919 1724794 1720071 1720992 1719132 1723605
13047 1723605 1728967 1728722 1734776 1739979 1753245 1747923 1730682 1726607 1737483 1749051 1756800 1746425 1745619
13034 1745619 1745264 1749185 1758430 1770528 1771524 1769715 1776234 1774154 1765179 1770419 1777865 1786164 1791987 1780906
13020 1780906 1772222 1771846 1781977 1787699 1788797 1800293 1797096 1799262 1800577 1782075 1777890 1778073 1778570 1795921
13006 1795921 1800584 1797622 1799110 1804343 1811025 1806955 1794628 1800359 1802318 1811247 1819321 1809770 1811154 1823128
12992 1823128 1828304 1827862 1832005 1835389 1834310 1840949 1831441 1834179 1850812 1851033 1840966 1844044 1854358 1865615
12978 1865615 1870013 1871370 1892048 1898202 1885383 1870952 1858968 1858682 1855271 1860868 1867445 1870580 1887581
12965 1887581 1884394 1879423 1885999 1890647 1886481 1886247 1891243 1903204 1911758 1894573 1890882 1912655 1921405
12952 1921405 1920299 1907669 1897423 1896912 1901680 1909980 1923091 1939460 1942508 1943017 1935741 1932220 1935065
12939 1935065 1928106 1926200 1935189 1946779 1956265 1951951 1962967 1964488 1957045 1954530 1956438 1948613 1944465
12926 1944465 1952208 1964728 1977455 1972174 1974156 1979312 1981910 1980356 1983674 1985169 1975249 1971393 1964239
12913 1964239 1968491 1989942 1994128 2001298 2001912 1987754 2004593 2015610 2017522 2002555 2001470 2010400 2011843
12900 2011843 2015750 2022423 2016723 2017531 2005169 2010438 2023311 2016090 2019258 2033524 2047084 2068373 2064425
12887 2064425 2051324 2041226 2039133 2041814 2056644 2076120 2089868 2092428 2082576 2072342 2076943 2068551
12875 2068551 2060720 2062800 2066986 2082146 2093830 2097259 2089412 2094846 2105773 2096107 2098528 2103172 2101118
12862 2101118 2091007 2096925 2102207 2109226 2113932 2119122 2125427 2126213 2126658 2125224 2134870 2141526 2141516 2144930 2154454
12847 2154454 2158539 2162588 2164884 2164663 2154085 2158803 2174200 2183243 2183666 2191023 2197253 2196902 2200434 2206711
12833 2206711 2204010 2201557 2211445 2222170 2214256 2206760 2208218 2217902 2226846 2237630 2239545 2236888 2228823
12820 2228823 2232202 2238086 2247899 2254958 2243428 2231441 2245878 2255000 2258186 2261565 2274381 2274638 2270558
12807 2270558 2276279 2292660 2295372 2282696 2275396 2262768 2247380 2248452 2270006 2281760 2287878 2289272
12795 2289272 2282548 2284781 2289737 2302158 2320845 2329024 2336253 2328709 2330389 2330911 2345224 2346304 2339248
12782 2339248 2333272 2346393 2364003 2374094 2371506 2359390 2365278 2375183 2388415 2392715 2391111 2391818 2398720
12769 2398720 2395792 2398962 2409933 2409842 2407796 2417755 2425573 2419705 2414272 2423335 2430235 2431429 2430086 2437200
12755 2437200 2441211 2442075 2454315 2456659 2462871 2458873 2469313 2467838 2460255 2460543 2468913 2474556 2485264 2490540
12741 2490540 2489515 2486159 2494593 2511353 2522758 2532230 2523446 2510842 2512551 2528577 2532974 2526199 2532500
12728 2532500 2541142 2545006 2544205 2536777 2542566 2557524 2556966 2565155 2578189 2582562 2593245 2602134 2603141 2609656
12714 2609656 2612488 2611452 2611219 2607594 2605909 2609562 2625811 2632965 2625748 2630878 2639282 2640210 2645977 2650894
12700 2650894 2659981 2669140 2666301 2685701 2692940 2688686 2683723 2686327 2690989 2696483 2708404 2718178 2725068
12687 2725068 2729193 2739217 2737789 2748546 2748085 2743451 2748739 2758605 2777782 2774745 2768584 2755303 2758340
12674 2758340 2761016 2776713 2778014 2778182 2795137 2795973 2798673 2806093 2817150 2833319 2854262 2856505 2849329
12661 2849329 2846631 2858042 2870051 2880306 2898282 2902663 2912538 2904892 2889596 2899447 2922021 2942903
12649 2942903 2943466 2934074 2945962 2961913 2960706 2954490 2956252 2962337 2960958 2965950 2976560 2994635 3007871
12636 3007871 3015477 3015422 3025265 3036013 3044037 3055880 3080525 3092424 3102700 3116765 3127886 3132698 3126484
12623 3126484 3126483 3122162 3127851 3153793 3173183 3174652 3168866 3169126 3181496 3190343 3193574 3202252 3217256 3232519
12609 3232519 3251428 3283753 3310060 3339023 3342981 3345390 3344125 3348772 3358588 3377676 3407895 3430792
12597 3430792 3446008 3463138 3491642 3533999 3580221 3616777 3653660 3691121 3747166 3809520 3883868
12586 3883868 3984705 4122418 4284285 4471891 4629183 4559423 4038625 3161998 2328462 1896164
12576 1896164 1885112 2052780 2228981 2377770 2502397 2598910 2658597 2713536 2766488 2815184
12566 2815184 2858853 2891460 2922917 2953599 2981020 3003166 3025498 3037344 3066443 3095061 3106547
12555 3106547 3108403 3127239 3155677 3184591 3195302 3208021 3219202 3238159 3243004 3251243 3267887 3270946
12543 3270946 3279792 3293348 3312863 3324719 3338846 3352647 3351962 3363347 3385773 3406495 3420581 3426328
12531 3426328 3424679 3440902 3462195 3479730 3501240 3501882 3508155 3523756 3536938 3542597 3549138 3545756 3538042
12518 3538042 3541327 3555470 3575520 3591243 3602086 3616507 3630143 3633595 3646251 3672254 3679062 3677115
12506 3677115 3690968 3692326 3694992 3702339 3715602 3725021 3732750 3747191 3775898 3804168 3806838 3810251 3819678
12493 3819678 3828738 3819113 3832873 3849601 3861282 3869456 3885255 3900313 3921169 3924947 3922773 3927721
12481 3927721 3954592 3978629 3984149 3982178 3998921 4013857 4018306 4040638 4054561 4071346 4069031 4062037
12469 4062037 4076214 4092035 4105390 4125152 4136910 4142366 4153385 4151434 4153838 4159620 4176796 4191585
12457 4191585 4205274 4210189 4209158 4195204 4170934 4149662 4135490 4152250 4202493 4271405 4326068 4372345
12445 4372345 4408528 4442060 4479881 4507340 4519807 4539996 4537788 4534737 4540569 4561970 4588139 4607305
12433 4607305 4631204 4649857 4656648 4662371 4658219 4656745 4661775 4685219 4705160 4725849 4746785 4773575
12421 4773575 4793325 4803497 4812383 4816818 4843323 4867979 4881348 4899219 4911127 4927335 4951003 4962081
12409 4962081 4977502 4991230 5009343 5028892 5053066 5081954 5113081 5148902 5188904 5225721 5254368
12398 5254368 5265250 5297384 5334836 5366250 5377483 5322028 5239250 5169546 5127814 5118040 5157527
12387 5157527 5216132 5267114 5304760 5334676 5357061 5394520 5422243 5440414 5458636 5478851 5489191
12376 5489191 5521941 5552114 5569073 5583532 5592822 5618866 5653562 5689435 5719003 5749466 5769590
12365 5769590 5790934 5822408 5854421 5874024 5893686 5912862 5946228 5971043 5992645 6019067 6043915
12354 6043915 6076948 6095210 6116482 6144253 6164880 6193320 6223051 6241810 6266265 6281991 6298946
12343 6298946 6335664 6380212 6427400 6456973 6482729 6506225 6538377 6567274 6598974 6643943 6687595
12332 6687595 6727843 6743191 6756663 6779955 6840444 6926523 6997103 7032237 7070780 7105665 7130820
12321 7130820 7150793 7180706 7215623 7268789 7319493 7355753 7395072 7434446 7469241 7516878 7566013
12310 7566013 7599094 7630117 7669314 7729136 7789595 7833587 7876495 7929018 7988762 8048786 8110173
12299 8110173 8165219 8221345 8257916 8205402 8051819 7863568 7764549 7787205 7884298 7994008 8098502
12288 8098502 8207365 8311552 8404314 8510444 8602851 8696751 8791155 8869498 8927859 8975233 9015437
12277 9015437 9054220 9104999 9171161 9246108 9336169 9434185 9522897 9621222 9736929 9836185 9864947
12266 9864947 9838033 9848898 9891138 9937564 10006954 10097177 10195245 10284929 10376129 10471520 10568105
12255 10568105 10660763 10756195 10853160 10954735 11056774 11156952 11273294 11386184 11502451 11628308
12245 11628308 11737625 11834851 11933140 12058647 12177418 12308379 12435716 12568094 12697041 12825112
12235 12825112 12915635 13030859 13154626 13287107 13441911 13595658 13740804 13869291 14015494
12226 14015494 14168889 14342363 14525949 14715113 14891919 15069855 15250205 15442811 15644877
12217 15644877 15850923 16055227 16280930 16510800 16738377 16956173 17203096 17477348 17758514
12208 17758514 18018939 18277085 18544884 18826499 19130049 19429634 19753750 20096575 20460278
12199 20460278 20834258 21227738 21670122 22150139 22645844 23138282 23656476 24211279 24792946
12190 24792946 25412878 26097941 26870675 27765972 28790049 29921626 31069273 31801378 31297472
12181 31297472 29206842 26419392 24535067 24306042 25328061 26782010 28232878 29632176
12173 29632176 30983807 32290186 33586197 34892531 36236289 37642330 39125767 40709605
12165 40709605 42348297 44053692 45841162 47780416 49931202 52338517 55013860 57967755
12157 57967755 61230845 64847060 68845588 73338505 78406171 84205326 90844023 98202287
12149 98202287 106180975 115103416 126070567 140589724 159892963 184729703 215346058
12142 215346058 248476622 266680875 229201154 107346262 -59472893 -196713380 -256558403
12135 -256558403 -248498107 -216569372 -186181316 -161801327 -142463824 -127336129 -115930440
12128 -115930440 -107320744 -100193703 -93563692 -87213677 -81345631 -76103607 -71498083 -67446395
12120 -67446395 -63842748 -60633768 -57750827 -55129878 -52710185 -50443200 -48311445 -46338133
12112 -46338133 -44546511 -42925833 -41480393 -40154928 -38901483 -37697713 -36547080 -35449138
12104 -35449138 -34428406 -33474948 -32569023 -31691183 -30831042 -30014492 -29244802 -28525971 -27855079
12095 -27855079 -27207871 -26553757 -25890109 -25228249 -24606192 -24040485 -23522294 -23030370 -22542101
12086 -22542101 -22068131 -21622819 -21209678 -20807200 -20412817 -20039917 -19709377 -19403310 -19099926
12077 -19099926 -18811689 -18536580 -18260335 -17962962 -17669180 -17383075 -17098983 -16805468 -16523364
12068 -16523364 -16273035 -16048550 -15835955 -15623736 -15405901 -15191851 -14988894 -14781833 -14567210
12059 -14567210 -14371038 -14193728 -14009914 -13843977 -13679167 -13515459 -13351411 -13198353 -13037410
12050 -13037410 -12873449 -12709038 -12549056 -12407890 -12264092 -12122353 -11974260 -11826111 -11670742
12041 -11670742 -11521464 -11382149 -11254008 -11149045 -11042324 -10928997 -10821130 -10708809 -10622231
12032 -10622231 -10528377 -10436571 -10341862 -10239842 -10146977 -10051910 -9953814 -9854516 -9766640 -9678402 -9576770
12021 -9576770 -9488991 -9413041 -9335124 -9254766 -9173026 -9098969 -9042307 -8976992 -8871692 -8744265 -8647042
12010 -8647042 -8580409 -8524660 -8471142 -8414548 -8357908 -8303617 -8241072 -8176082 -8092159 -8015379 -7956555
11999 -7956555 -7899853 -7853698 -7804895 -7760693 -7730344 -7701494 -7676030 -7652465 -7614839 -7595239 -7589232
11988 -7589232 -7578641 -7571850 -7573711 -7589559 -7539241 -7364171 -7112530 -6841621 -6649894 -6561366 -6511757
11977 -6511757 -6478908 -6450469 -6415715 -6377311 -6340561 -6291932 -6260961 -6224804 -6191747 -6151458 -6097993
11966 -6097993 -6057837 -6020368 -5994965 -5962839 -5923782 -5885134 -5855945 -5810344 -5761714 -5725249 -5671646
11955 -5671646 -5619355 -5569540 -5530495 -5512579 -5481954 -5482814 -5498232 -5498169 -5469907 -5404760 -5350553 -5315386
11943 -5315386 -5290182 -5273434 -5250230 -5225335 -5202758 -5172815 -5144032 -5113321 -5095762 -5075675 -5064314
11932 -5064314 -5020759 -4980544 -4946565 -4916522 -4876487 -4828051 -4798854 -4783619 -4757595 -4736305 -4693130
11921 -4693130 -4659173 -4638737 -4629452 -4607889 -4579018 -4557051 -4530299 -4504335 -4485921 -4457922 -4448571 -4435462
11909 -4435462 -4410400 -4390749 -4363683 -4338347 -4309952 -4265664 -4236202 -4209870 -4189013 -4181292 -4186636 -4170645
11897 -4170645 -4129773 -4093230 -4061480 -4033778 -4015681 -3988363 -3974563 -3964384 -3951975 -3924671 -3889173
11886 -3889173 -3867132 -3850655 -3845864 -3837607 -3811335 -3799486 -3780776 -3753037 -3728041 -3705421 -3686557 -3688274
11874 -3688274 -3674228 -3654558 -3650185 -3651670 -3637602 -3615307 -3584412 -3558171 -3541580 -3521783 -3505905 -3497075
11862 -3497075 -3495934 -3487380 -3462855 -3433917 -3414169 -3388942 -3375444 -3362219 -3355456 -3354912 -3338075 -3315566
11850 -3315566 -3291338 -3265254 -3237106 -3217363 -3203605 -3195025 -3189360 -3181838 -3168554 -3154491 -3133364 -3105747
11838 -3105747 -3081253 -3065959 -3044363 -3015102 -2998811 -3007811 -3006466 -3004300 -3027298 -3064463 -3095868 -3110650
11826 -3110650 -3108798 -3085366 -3040741 -2988314 -2949544 -2923987 -2908709 -2894112 -2882493 -2875880 -2873118 -2861946
11814 -2861946 -2841613 -2822585 -2804466 -2787907 -2775041 -2750951 -2719626 -2712082 -2723563 -2721364 -2703141 -2685665
11802 -2685665 -2682089 -2671806 -2660207 -2644300 -2624886 -2585835 -2570393 -2562194 -2559859 -2560118 -2557757 -2536262
11790 -2536262 -2528852 -2519834 -2498328 -2479101 -2482108 -2470188 -2457526 -2453057 -2454361 -2459009 -2450576 -2430224 -2421755
11777 -2421755 -2415197 -2397926 -2381023 -2368166 -2355703 -2345100 -2343390 -2326121 -2319102 -2316458 -2293794 -2271825
11765 -2271825 -2261197 -2262758 -2259529 -2227828 -2219172 -2218474 -2213474 -2196109 -2186139 -2181075 -2173051 -2158167 -2142052
11752 -2142052 -2133594 -2123487 -2122362 -2114330 -2108716 -2103340 -2081712 -2060492 -2047457 -2033068 -2024791 -2007455
11740 -2007455 -1988375 -1963993 -1951047 -1946878 -1927671 -1917863 -1912840 -1903471 -1911815 -1910824 -1910975 -1912406 -1897130
11727 -1897130 -1883582 -1861870 -1848746 -1839909 -1825362 -1816690 -1798450 -1779486 -1769302 -1751301 -1736753 -1718338
11715 -1718338 -1687257 -1661982 -1647788 -1628896 -1605724 -1584418 -1556865 -1524874 -1490363 -1456186 -1427527
11704 -1427527 -1389618 -1354479 -1316698 -1275685 -1214540 -1140273 -1043377 -923410 -780389 -602622 -419326
11693 -419326 -349931 -644122 -1399087 -2310044 -2960614 -3155929 -3044701 -2866636 -2706793 -2564340
11683 -2564340 -2449785 -2370644 -2314580 -2268718 -2228716 -2174022 -2129782 -2099117 -2050021 -2010222 -1964736
11672 -1964736 -1924266 -1897078 -1881989 -1883883 -1870912 -1848916 -1836972 -1832211 -1822776 -1813436 -1803592 -1782570
11660 -1782570 -1754912 -1735325 -1721179 -1717820 -1721039 -1712274 -1699850 -1672221 -1659961 -1660756 -1653384 -1658906 -1641637
11647 -1641637 -1620661 -1611153 -1604571 -1594913 -1582452 -1583856 -1578125 -1572606 -1548632 -1537010 -1533298 -1522751 -1507982
11634 -1507982 -1507086 -1499207 -1494168 -1484844 -1480486 -1486415 -1486916 -1475319 -1470472 -1457834 -1446321 -1444124 -1447374 -1444179
11620 -1444179 -1434824 -1427108 -1420673 -1411373 -1387766 -1392934 -1380192 -1379145 -1380100 -1362800 -1353659 -1357455 -1363417
11607 -1363417 -1353910 -1340921 -1332559 -1324054 -1314986 -1315276 -1312706 -1301588 -1298781 -1301328 -1292081 -1288063 -1282821 -1285494
11593 -1285494 -1279315 -1272543 -1268053 -1270699 -1274399 -1263362 -1247585 -1234203 -1229337 -1225701 -1214035 -1209621 -1204047
11580 -1204047 -1191691 -1181441 -1185518 -1197409 -1189112 -1177291 -1172420 -1169726 -1165371 -1174475 -1168179 -1157898 -1162311
11567 -1162311 -1152745 -1132195 -1107484 -1122479 -1135154 -1119048 -1096418 -1101902 -1108756 -1100051 -1099527 -1077357
11555 -1077357 -1066196 -1063028 -1054845 -1055569 -1049460 -1043734 -1048825 -1046529 -1033489 -1030661 -1026197 -1022939 -1013857 -1004485
11541 -1004485 -1018715 -1017537 -996500 -987821 -983448 -985864 -984947 -982894 -974839 -965581 -966477 -965021 -943520 -936271
11527 -936271 -942700 -945249 -935459 -925487 -937671 -939234 -933244 -935367 -931923 -926487 -916231 -887511 -881713
11514 -881713 -875533 -861157 -859627 -851350 -847776 -846558 -851932 -853312 -841508 -833273 -841110 -841067 -838352 -812313
11500 -812313 -791765 -799262 -796697 -795415 -795841 -789674 -789428 -796624 -790104 -789540 -799933 -803853 -798318 -789226
11486 -789226 -777567 -776542 -773638 -762255 -755324 -761134 -745171 -729836 -722696 -725009 -731240 -734449 -728216
11473 -728216 -722417 -707573 -699541 -704839 -706258 -691410 -692604 -699217 -699501 -685003 -671802 -663561 -658935
11460 -658935 -661034 -673989 -671185 -658831 -652634 -650095 -649845 -652328 -656842 -651036 -642187 -644460 -631421 -632616
11446 -632616 -618558 -608550 -596860 -597640 -602142 -604971 -604239 -614754 -603061 -604328 -594133 -571513 -568144
11433 -568144 -568039 -558573 -557845 -559813 -554593 -547217 -537164 -534962 -528423 -523234 -519444 -507630 -503734 -508977
11419 -508977 -504026 -500006 -505152 -506251 -497421 -489809 -497013 -500819 -504755 -489844 -467994 -467748 -467195 -464716
11405 -464716 -459543 -456480 -453503 -449833 -439849 -442291 -452107 -445734 -437986 -429451 -416840 -403839 -408232 -419487
11391 -419487 -408606 -397689 -398899 -399243 -404033 -409826 -394928 -402245 -400296 -386386 -377720 -378581 -379500 -368296
11377 -368296 -356981 -352385 -336548 -343423 -355240 -360443 -356675 -352068 -355522 -351398 -344938 -333776 -329965
11364 -329965 -319791 -314531 -316252 -315629 -335210 -341746 -322743 -305376 -295755 -280604 -278022 -282882 -276351
11351 -276351 -273523 -287505 -291413 -281689 -271294 -259949 -252733 -248531 -253054 -253838 -254672 -248107 -248041 -250767
11337 -250767 -257579 -245215 -220109 -209385 -216973 -217794 -214413 -210377 -217257 -219604 -215755 -195262 -183886
11324 -183886 -195937 -201475 -201816 -192495 -180195 -167204 -173922 -180000 -177786 -178823 -171074 -143624 -133677
11311 -133677 -146427 -157899 -152180 -136413 -140542 -142537 -143379 -137038 -122934 -105143 -111683 -116308 -105957
11298 -105957 -111541 -117503 -109303 -94056 -76082 -57882 -66801 -72461 -61402 -65402 -67416 -67464 -65164 -60238
11284 -60238 -48678 -50308 -63652 -53619 -42956 -43861 -36570 -28290 -16532 -14908 -14709 -13491 -6204 -11112
11270 -11112 -9900 -9192 -12844 4308 20654 28193 23575 12054 12240 25413 35151 28900 25612 22643
11256 22643 31289 29670 34787 46124 53421 50588 38481 29219 35976 54660 67258 73394 75339
11243 75339 79872 78083 78471 88987 106756 102893 101237 107555 111138 109743 109229 106500 114851 134919
11229 134919 138082 125113 108284 104199 105162 113212 118161 139864 149110 133721 126064 134325 152479
11216 152479 146727 158070 163880 166582 172073 169841 173662 184388 191259 192474 196655 213955 219083
11203 219083 225906 225184 228109 223563 223140 211026 205019 215570 222737 232535 239809 258214 265987 268841
11189 268841 284745 287554 286247 285039 273125 268321 271065 290116 303398 302349 290045 298722 302204
11176 302204 300516 298027 306917 312184 315020 315879 317614 312660 311049 322815 333868 317164 313138 315451
11162 315451 320768 327816 338827 346086 357748 357917 358224 364460 361697 365043 358155 355913 363913 370643
11148 370643 367934 379015 394490 400674 405112 404758 401777 403087 405909 417834 424683 430422 436292 439224
11134 439224 440834 439197 449935 448191 454334 462037 472541 481836 478944 481390 483869 483565 495389 495104
11120 495104 485369 479858 489715 489918 490051 506307 515692 515503 519882 514783 515951 525155 537795 549802
11106 549802 553666 557963 565924 567819 565365 567472 567996 561316 554380 562081 562776 570602 581598 584303
11092 584303 595600 609141 610373 610764 615398 633167 624327 616655 624311 632638 633293 641307 650791 649241
11078 649241 653385 659114 658690 654097 661434 671732 676368 674867 690173 696486 700439 688111 697434 715384
11064 715384 711820 692523 698867 710464 712458 720762 731042 742107 748512 751024 752577 743534 736030
11051 736030 753917 767040 768525 766699 761377 772569 781030 773311 774352 784901 789019 796070 803834
11038 803834 819576 830137 820344 815876 832296 847570 867375 883159 872035 855769 853003 861547
11026 861547 868601 867384 867295 870297 883795 899000 895006 902301 926711 929072 917462 913511 912587 912666
11012 912666 907740 918429 935005 946624 950740 956088 952787 966717 967375 965151 975154 983491 987217
10999 987217 983158 987585 994461 990681 1000451 1002542 1004004 1005168 1006737 1012304 1004895 1023887 1049176 1050292
10985 1050292 1050835 1059244 1065387 1070478 1083314 1089128 1087274 1088565 1089305 1097541 1105240 1111407 1124433 1129565
10971 1129565 1130911 1132640 1141778 1153017 1160938 1167814 1176783 1183599 1206673 1208558 1211816 1216638 1214229
10958 1214229 1218435 1218033 1216877 1223178 1230515 1234115 1245853 1258264 1266909 1280415 1289071 1300092 1310267
10945 1310267 1307796 1316689 1321407 1329201 1335081 1343538 1353031 1368508 1378191 1376807 1378672 1383947 1411830
10932 1411830 1432913 1450385 1451828 1461865 1472843 1494983 1491389 1505353 1524754 1541075 1572735 1591265
10920 1591265 1620701 1651334 1693939 1735731 1793853 1867127 1948017 2052147 2144228 2132801 1812980
10909 1812980 1284246 843968 680899 746915 855874 953009 1027271 1085178 1124441 1149479
10899 1149479 1177167 1196352 1225075 1247386 1267218 1285575 1290256 1309097 1316212 1338173 1362734 1389460
10887 1389460 1409175 1422129 1435244 1447813 1457534 1469504 1486466 1501425 1509968 1511256 1518638 1534330
10875 1534330 1545995 1568671 1584987 1589169 1599543 1594829 1588856 1600527 1604210 1620465 1629959 1640298
10863 1640298 1666612 1687513 1698852 1710303 1717631 1744512 1750077 1741604 1742171 1738624 1731325 1732789 1742288
10850 1742288 1739252 1745210 1763752 1791988 1792622 1796411 1799427 1815523 1842098 1846693 1849923 1862566 1868591
10837 1868591 1883950 1900418 1910368 1918294 1934509 1954608 1967132 1975510 1990843 2007391 2016837 2037634
10825 2037634 2061824 2082721 2093738 2113827 2128632 2160491 2180685 2187597 2200305 2225522 2245066
10814 2245066 2259970 2285537 2313436 2348976 2389137 2427333 2476633 2540362 2607761 2672164 2759765
10803 2759765 2869889 3000896 3157187 3331250 3450396 3339633 2822003 1991415 1221349
10794 1221349 794968 740356 864846 1027637 1167890 1270121 1357153 1441950 1519571 1584401
10784 1584401 1632453 1681593 1741053 1777833 1803121 1834863 1867016 1903095 1930774 1951200 1973848
10773 1973848 1987838 1999471 2013804 2035522 2055280 2081385 2097724 2118279 2129214 2135104 2150842
10762 2150842 2169350 2186274 2190330 2199657 2209105 2223961 2247762 2264888 2275501 2295774 2305115 2318979
10750 2318979 2346981 2363303 2374158 2386831 2400122 2409753 2417596 2424854 2435831 2461188 2478692 2478854
10738 2478854 2490375 2515894 2532361 2552417 2557697 2560827 2566692 2577293 2589013 2592050 2602545 2611707
10726 2611707 2629909 2646639 2665103 2673822 2686898 2704886 2705475 2719763 2731453 2738827 2741097 2750552
10714 2750552 2769393 2787823 2804994 2812349 2808906 2826749 2834460 2821951 2806563 2785724 2784743 2831536
10702 2831536 2895226 2946485 2988198 3032475 3065530 3091063 3107718 3116309 3115777 3136807 3141960 3150695
10690 3150695 3165802 3168461 3188621 3214226 3239088 3249803 3273130 3283010 3292310 3309721 3323391 3331937
10678 3331937 3352245 3384046 3407411 3410348 3408499 3416802 3453934 3480832 3488809 3494803 3515166 3541692
10666 3541692 3547661 3555204 3582185 3590952 3608769 3638275 3675658 3695313 3719868 3750753 3780508 3816181
10654 3816181 3837448 3865517 3895801 3925228 3959987 3991627 4006869 3989110 3927972 3860313 3801819
10643 3801819 3771309 3784236 3817702 3874892 3922393 3958627 3986255 4000209 4013791 4040178 4072684
10632 4072684 4104771 4127321 4154117 4190886 4224768 4245789 4262583 4274193 4307243 4328259 4329118 4347445
10620 4347445 4371794 4411037 4434985 4467882 4499973 4530546 4554538 4596303 4624534 4643244 4652914
10609 4652914 4664405 4689399 4719759 4757553 4790997 4821365 4847151 4871259 4889258 4899931 4922670
10598 4922670 4943895 4981103 5025585 5068841 5110526 5126163 5159202 5195039 5234307 5280505 5324165
10587 5324165 5360934 5397069 5422904 5426635 5447945 5498953 5568290 5653733 5721867 5759492 5779666
10576 5779666 5808330 5835667 5849791 5879198 5926419 5964822 6002261 6036900 6083030 6121141 6163689
10565 6163689 6219409 6255722 6283901 6319085 6376356 6438009 6494608 6544158 6590213 6654864 6717905
10554 6717905 6761764 6815971 6866054 6899600 6891900 6800730 6645893 6512803 6452070 6475038 6572195
10543 6572195 6682593 6792012 6897004 6986083 7074974 7164817 7253081 7332915 7422088 7521169 7595538
10532 7595538 7663952 7738202 7822638 7882389 7938850 8012216 8096611 8180624 8275792 8372029 8468130
10521 8468130 8536285 8534432 8522704 8537957 8582561 8636829 8696910 8783630 8880437 8972964 9065679
10510 9065679 9168868 9254851 9341879 9450542 9552859 9648853 9747127 9836986 9945580 10057254
10500 10057254 10172479 10282232 10405120 10524703 10660994 10781752 10904993 11032241 11148453
10491 11148453 11259819 11382771 11493543 11598589 11680902 11757643 11866264 12009480 12152506 12298843
10481 12298843 12447044 12580113 12724369 12882063 13053322 13229446 13399391 13576802 13765686
10472 13765686 13949645 14141487 14358640 14564301 14763827 14961481 15162930 15390557 15637577
10463 15637577 15889255 16138518 16380982 16619062 16868584 17132806 17405735 17672709 17955925
10454 17955925 18257455 18554883 18882861 19235841 19608330 20003715 20394705 20786808 21190044
10445 21190044 21597077 22024009 22469245 22926847 23401421 23875286 24354826 24854416 25387341
10436 25387341 25961194 26597613 27294009 28024702 28765737 29527620 30320411 31143457 32017427
10427 32017427 32955385 33969969 35048281 36191312 37403949 38713309 40120740 41620492
10419 41620492 43244482 44971803 46784835 48579264 50186112 51610919 53171508 55270809
10411 55270809 58064496 61442657 65230563 69394495 74013050 79227701 85254870 92297332
10403 92297332 100562755 110248509 121588668 135106716 151683361 172419764 198195670
10396 198195670 228060857 253444338 248476328 177801575 41234233 -108701910 -211631728
10389 -211631728 -244213291 -230272140 -204366925 -181026432 -161481397 -144689727 -130298963
10382 -130298963 -118196065 -108096353 -99572767 -92238984 -85839551 -80191061 -75190555 -70742899
10374 -70742899 -66750898 -63147503 -59884860 -56995493 -54600349 -52808186 -51443057 -50105552
10366 -50105552 -48550095 -46826492 -45134863 -43571895 -42140948 -40804008 -39545141 -38364317
10358 -38364317 -37254447 -36203118 -35191823 -34230389 -33294069 -32418375 -31596937 -30821005 -30100457
10349 -30100457 -29401225 -28719331 -28034197 -27370018 -26720481 -26108256 -25528994 -24982256 -24462982
10340 -24462982 -23987080 -23541512 -23091450 -22658500 -22272883 -21904180 -21542604 -21196618 -20865369
10331 -20865369 -20517137 -20180174 -19851650 -19538078 -19226145 -18930122 -18648422 -18355209 -18072052
10322 -18072052 -17807327 -17554142 -17323037 -17105105 -16879382 -16654617 -16452906 -16257800 -16059432
10313 -16059432 -15851853 -15671475 -15492337 -15298594 -15116153 -14939801 -14790385 -14638958 -14476732
10304 -14476732 -14306592 -14120114 -13954751 -13803175 -13657375 -13512066 -13360078 -13210489 -13072843
10295 -13072843 -12929275 -12785883 -12637565 -12502040 -12369003 -12251784 -12134659 -12026988 -11914236
10286 -11914236 -11812560 -11703048 -11604189 -11509087 -11416116 -11331724 -11230056 -11118550 -11023957 -10938281
10276 -10938281 -10846229 -10749469 -10663544 -10577766 -10485296 -10404163 -10332720 -10261190 -10180480 -10094401 -9995038
10265 -9995038 -9877357 -9768812 -9704598 -9662321 -9612907 -9543899 -9473441 -9403251 -9332618 -9260647 -9193099
10254 -9193099 -9140558 -9069295 -8994612 -8947480 -8902348 -8858394 -8810325 -8756479 -8722951 -8702669 -8693510
10243 -8693510 -8667339 -8651320 -8634796 -8646758 -8649310 -8615703 -8510836 -8312231 -8051405 -7823436 -7671344
10232 -7671344 -7591066 -7530808 -7490956 -7456700 -7405396 -7343365 -7293507 -7249712 -7205145 -7149024 -7105127
10221 -7105127 -7065444 -7022393 -6972306 -6919016 -6872785 -6825838 -6774574 -6719250 -6655985 -6609603 -6576716
10210 -6576716 -6531141 -6465091 -6404950 -6346847 -6299016 -6257602 -6225376 -6206955 -6202644 -6181993 -6134069
10199 -6134069 -6078210 -6013461 -5960591 -5919358 -5878004 -5833770 -5777901 -5718820 -5658304 -5602850 -5559186
10188 -5559186 -5507658 -5447999 -5388857 -5331382 -5263698 -5190144 -5117252 -5031233 -4952949 -4867419 -4783020
10177 -4783020 -4703106 -4630446 -4543869 -4436518 -4321980 -4205818 -4083886 -3971866 -3847596 -3714211
10167 -3714211 -3569734 -3413227 -3265312 -3132751 -3007744 -2916929 -2883350 -2979911 -3244323 -3732209
10157 -3732209 -4463593 -5358160 -6300117 -7139295 -7764686 -8137115 -8324322 -8359255 -8301453 -8194139
10147 -8194139 -8064122 -7926677 -7792221 -7665782 -7544088 -7418401 -7283455 -7156911 -7042743
10138 -7042743 -6951411 -6876736 -6803310 -6724042 -6656325 -6591173 -6520196 -6442140 -6370125 -6306858 -6249756
10127 -6249756 -6202920 -6156550 -6105431 -6071763 -6037277 -5984966 -5920155 -5858912 -5829842 -5800174 -5759742
10116 -5759742 -5711754 -5677304 -5649710 -5621419 -5580917 -5548373 -5515671 -5474273 -5435312 -5406530 -5385585
10105 -5385585 -5357941 -5325303 -5297741 -5271337 -5231826 -5202630 -5172417 -5143787 -5115775 -5088306 -5060086
10094 -5060086 -5020131 -4997415 -4987198 -4975646 -4948433 -4915274 -4884534 -4869532 -4856442 -4848950 -4851296 -4869175
10082 -4869175 -4893219 -4919581 -4918034 -4900012 -4849414 -4794334 -4749782 -4702791 -4670574 -4656615 -4646577
10071 -4646577 -4621929 -4592927 -4572102 -4552772 -4524195 -4494611 -4467653 -4438973 -4408932 -4383625 -4363433
10060 -4363433 -4340647 -4320131 -4305072 -4282857 -4260361 -4241135 -4213465 -4188025 -4175730 -4154040 -4126684
10049 -4126684 -4102067 -4082052 -4056664 -4045897 -4030011 -4000202 -3960314 -3930462 -3895563 -3858024 -3829778
10038 -3829778 -3790664 -3737141 -3687303 -3616704 -3535843 -3460654 -3391853 -3293552 -3178816 -3009024 -2801112
10027 -2801112 -2548184 -2329261 -2516141 -3557516 -4741876 -5546405 -5577580 -5299771 -5045476
10018 -5045476 -4859304 -4718952 -4604206 -4517864 -4440326 -4378619 -4315147 -4251916 -4196454 -4144270 -4099592
10007 -4099592 -4067861 -4033840 -3994875 -3965205 -3941347 -3903922 -3850733 -3811108 -3770713 -3721225 -3678215
9996 -3678215 -3640725 -3595681 -3532001 -3475056 -3413457 -3324593 -3227490 -3129658 -3005979 -2858226 -2691141
9985 -2691141 -2542101 -2547990 -2900237 -3628779 -4465043 -5030654 -5200952 -5094224 -4927233 -4773957
9975 -4773957 -4658328 -4552475 -4472244 -4402940 -4343756 -4281791 -4231410 -4191755 -4151169 -4113992 -4075904
9964 -4075904 -4041745 -4010250 -3977785 -3945464 -3936638 -3917025 -3900062 -3885805 -3873038 -3862843 -3844713 -3826877
9952 -3826877 -3811633 -3793667 -3777356 -3749691 -3727279 -3723904 -3719406 -3703667 -3707648 -3703802 -3687938 -3659680
9940 -3659680 -3637370 -3610623 -3591729 -3579815 -3575867 -3574243 -3567302 -3576109 -3563469 -3523502 -3503082 -3492701
9928 -3492701 -3486731 -3460785 -3423888 -3415060 -3410034 -3406671 -3408598 -3405964 -3399128 -3394153 -3408569 -3408004 -3390503
9915 -3390503 -3372782 -3369889 -3360647 -3359167 -3336419 -3323901 -3309773 -3301028 -3302291 -3313946 -3308338 -3304360 -3309052
9902 -3309052 -3299496 -3283737 -3272089 -3261749 -3263452 -3253792 -3252365 -3242285 -3229742 -3225561 -3220264 -3210905 -3205750
9889 -3205750 -3195964 -3185161 -3178103 -3169422 -3163151 -3161788 -3148244 -3144468 -3147145 -3145190 -3146702 -3132159 -3112536
9876 -3112536 -3109592 -3109210 -3098737 -3081323 -3074083 -3073714 -3075917 -3072241 -3056297 -3053720 -3062692 -3054255 -3043717 -3028845
9862 -3028845 -3031386 -3039114 -3034675 -3026661 -3011438 -2990006 -2987087 -2982815 -2975403 -2963810 -2968176 -2967051 -2961242
9849 -2961242 -2970474 -2972450 -2961299 -2954912 -2935732 -2922085 -2936315 -2940208 -2943442 -2945702 -2932293 -2935027 -2932392
9836 -2932392 -2911662 -2902969 -2888284 -2874129 -2872523 -2882593 -2891977 -2891431 -2881225 -2869707 -2863549 -2860095 -2846961
9823 -2846961 -2838518 -2834330 -2834010 -2833401 -2836971 -2828793 -2809863 -2796439 -2796849 -2794310 -2791618 -2789510 -2791288 -2775642
9809 -2775642 -2774724 -2788370 -2783794 -2770810 -2757925 -2743256 -2742222 -2743713 -2739923 -2729834 -2721448 -2725472 -2722233
9796 -2722233 -2716452 -2704695 -2704025 -2703753 -2694982 -2684091 -2685171 -2687451 -2683638 -2684423 -2685180 -2682014 -2670845 -2672723
9782 -2672723 -2682424 -2670955 -2662318 -2663973 -2656173 -2652928 -2655911 -2663060 -2647810 -2638844 -2636623 -2629713 -2621630 -2609588
9768 -2609588 -2594203 -2586331 -2590272 -2587966 -2589428 -2581189 -2578350 -2564512 -2560620 -2560261 -2554083 -2555606 -2563006 -2552607
9754 -2552607 -2552933 -2547977 -2539639 -2541498 -2553165 -2538212 -2525916 -2523698 -2519274 -2524436 -2524064 -2521303 -2519696 -2514569
9740 -2514569 -2514483 -2508356 -2494769 -2503556 -2501442 -2499433 -2492714 -2492199 -2480835 -2467987 -2453080 -2456645 -2462251 -2458754
9726 -2458754 -2467657 -2464890 -2459258 -2452844 -2447393 -2455989 -2450082 -2433403 -2433840 -2441589 -2434280 -2432928 -2420143 -2410532
9712 -2410532 -2405612 -2404607 -2400297 -2392310 -2388205 -2397234 -2396317 -2389482 -2392755 -2393885 -2382208 -2375418 -2378590 -2380141
9698 -2380141 -2377784 -2373885 -2364061 -2359858 -2365078 -2364679 -2369049 -2365490 -2352192 -2349881 -2341685 -2343744 -2353141 -2348830
9684 -2348830 -2332028 -2329601 -2331318 -2330970 -2325124 -2316925 -2318716 -2316573 -2308810 -2292406 -2293495 -2299885 -2295010 -2295501
9670 -2295501 -2289275 -2279750 -2279718 -2268499 -2269022 -2265287 -2257184 -2250051 -2251231 -2248800 -2259297 -2260389 -2247588 -2237363
9656 -2237363 -2243617 -2244797 -2233235 -2222379 -2227714 -2243005 -2238505 -2225069 -2218128 -2210046 -2203823 -2207446 -2219722
9643 -2219722 -2218552 -2215626 -2211995 -2219132 -2202304 -2196394 -2200409 -2198328 -2189947 -2185542 -2184793 -2187102 -2185324 -2167263
9629 -2167263 -2159369 -2163581 -2170402 -2168527 -2165792 -2168063 -2171567 -2167852 -2161376 -2153040 -2142490 -2147559 -2157345 -2147456
9615 -2147456 -2144400 -2152659 -2155168 -2154726 -2148749 -2143518 -2135194 -2130923 -2135331 -2144064 -2145057 -2135450 -2123615 -2112415
9601 -2112415 -2107520 -2112760 -2114242 -2114033 -2113505 -2102315 -2091224 -2084084 -2086729 -2089936 -2094967 -2097821 -2096393 -2089264
9587 -2089264 -2101691 -2095190 -2082270 -2074424 -2074670 -2074661 -2078971 -2082770 -2069949 -2051870 -2038043 -2026024 -2023056 -2042896
9573 -2042896 -2054694 -2055591 -2057814 -2031498 -2029362 -2041716 -2040892 -2040190 -2036152 -2034708 -2033168 -2033216 -2029481 -2023870 -2019195
9558 -2019195 -2014108 -2015338 -2007287 -1995043 -1986592 -1979962 -1989487 -2008946 -2011392 -1997435 -1982599 -1989502 -1995942
9545 -1995942 -1994611 -1996968 -1991240 -1989482 -1992194 -1981251 -1975952 -1978569 -1982136 -1973705 -1962404 -1946429 -1950330
9532 -1950330 -1958963 -1967472 -1958526 -1946110 -1942533 -1954320 -1955621 -1960650 -1942767 -1937511 -1947297 -1951645 -1946309
9519 -1946309 -1942923 -1934143 -1933051 -1923769 -1912076 -1923591 -1939245 -1942537 -1941075 -1946619 -1941306 -1926868 -1922179
9506 -1922179 -1923157 -1923078 -1921713 -1918146 -1904042 -1892795 -1888542 -1887655 -1900245 -1904739 -1909403 -1906774 -1897764 -1906719
9492 -1906719 -1893970 -1885437 -1887888 -1887595 -1883833 -1889122 -1888669 -1876858 -1872496 -1867216 -1871425 -1874164 -1869554 -1856078
9478 -1856078 -1844610 -1859552 -1860884 -1868605 -1852215 -1858623 -1869345 -1872159 -1876381 -1868320 -1854676 -1844840 -1840992
9465 -1840992 -1843835 -1846647 -1838104 -1832092 -1830717 -1829041 -1832554 -1830318 -1822981 -1820900 -1816630 -1800929 -1794042 -1807247
9451 -1807247 -1821198 -1818440 -1816706 -1814009 -1819264 -1813359 -1802452 -1798768 -1797624 -1807406 -1813184 -1807563 -1798506 -1776476
9437 -1776476 -1771319 -1776742 -1780633 -1779169 -1785982 -1802476 -1801062 -1794322 -1783646 -1781694 -1779143 -1772213 -1759970
9424 -1759970 -1756382 -1765613 -1783643 -1790094 -1783677 -1770714 -1768458 -1755393 -1747464 -1750668 -1753702 -1752984 -1750469 -1751871
9410 -1751871 -1755002 -1756057 -1746872 -1745072 -1746711 -1738973 -1748432 -1737101 -1726070 -1717974 -1713295 -1719275 -1733924
9397 -1733924 -1727022 -1719664 -1728412 -1730191 -1722944 -1714056 -1714625 -1720522 -1714248 -1716258 -1726959 -1729898 -1724012 -1706522
9383 -1706522 -1693627 -1695628 -1708104 -1707203 -1695634 -1694159 -1694722 -1698544 -1701770 -1705097 -1694383 -1696915 -1700872 -1697428
9369 -1697428 -1707345 -1704123 -1695433 -1672823 -1655621 -1660178 -1666111 -1663567 -1667480 -1668640 -1667035 -1664121 -1675501
9356 -1675501 -1673302 -1669787 -1662434 -1659824 -1664916 -1666590 -1672318 -1655473 -1643500 -1649280 -1645666 -1643003 -1653840
9343 -1653840 -1658334 -1663593 -1651693 -1646518 -1656571 -1655300 -1651374 -1646232 -1634677 -1631840 -1633360 -1628869 -1629244 -1633329
9329 -1633329 -1639235 -1629949 -1634402 -1636960 -1630305 -1636919 -1640414 -1637703 -1636847 -1629805 -1616824 -1616663 -1626708 -1633305
9315 -1633305 -1642835 -1636678 -1621347 -1613913 -1608467 -1600922 -1577983 -1576439 -1586659 -1587720 -1585561 -1591917 -1605326
9302 -1605326 -1606415 -1600822 -1606654 -1605088 -1588240 -1583092 -1583828 -1583616 -1587360 -1574413 -1566572 -1568681 -1565372 -1570637
9288 -1570637 -1578289 -1577078 -1579934 -1572824 -1565377 -1566834 -1565781 -1560382 -1568979 -1576461 -1573691 -1562041 -1562810 -1574347
9274 -1574347 -1583261 -1583387 -1580844 -1577032 -1568493 -1573534 -1564217 -1550350 -1550222 -1559346 -1562316 -1566329 -1557940 -1542934
9260 -1542934 -1542334 -1551325 -1547466 -1535974 -1519977 -1522076 -1510776 -1513819 -1528455 -1532446 -1535355 -1541420 -1540961 -1526946
9246 -1526946 -1523348 -1520373 -1521810 -1522028 -1517514 -1524658 -1523890 -1517335 -1515222 -1522462 -1533051 -1519364 -1493702 -1500425
9232 -1500425 -1509345 -1502729 -1503017 -1504385 -1503619 -1511452 -1514539 -1512076 -1519597 -1504690 -1487083 -1484068 -1488647 -1494308
9218 -1494308 -1503302 -1502847 -1498103 -1490936 -1498048 -1504768 -1494330 -1488401 -1491138 -1494257 -1496401 -1490917 -1484842 -1482421
9204 -1482421 -1473536 -1470548 -1465054 -1476584 -1485007 -1481805 -1467277 -1466513 -1467367 -1472112 -1475540 -1478273 -1464189 -1454527
9190 -1454527 -1452388 -1457777 -1472929 -1475584 -1467482 -1470266 -1477129 -1465366 -1462945 -1453345 -1440021 -1431777 -1442740
9177 -1442740 -1450145 -1455954 -1444684 -1439951 -1436776 -1429704 -1433121 -1434727 -1430646 -1445209 -1449157 -1441148 -1438207 -1421893
9163 -1421893 -1422061 -1416603 -1422460 -1426426 -1424444 -1433122 -1426814 -1414778 -1417245 -1424205 -1431755 -1420052 -1414684 -1400694
9149 -1400694 -1398238 -1405127 -1408269 -1409102 -1401135 -1408781 -1415083 -1405999 -1392977 -1396670 -1405266 -1412392 -1416045 -1412343
9135 -1412343 -1400178 -1397099 -1392742 -1390965 -1399684 -1394474 -1385379 -1390136 -1395761 -1392099 -1389567 -1388914 -1392767 -1383908
9121 -1383908 -1380698 -1383990 -1382488 -1378234 -1370141 -1362040 -1373095 -1375569 -1366769 -1364444 -1366319 -1386177 -1382427 -1375917
9107 -1375917 -1375194 -1374596 -1378546 -1386578 -1400286 -1392385 -1380050 -1379513 -1376121 -1371441 -1363991 -1373422 -1371304 -1370780 -1364501
9092 -1364501 -1360425 -1373481 -1383679 -1380400 -1373076 -1376975 -1375529 -1369869 -1362976 -1365413 -1363810 -1355795 -1348463 -1350517
9078 -1350517 -1363423 -1370754 -1373009 -1363150 -1354134 -1337323 -1330486 -1338972 -1336407 -1338360 -1337130 -1343561 -1349547 -1350868
9064 -1350868 -1340266 -1338620 -1344818 -1348699 -1358325 -1359531 -1357256 -1353751 -1358655 -1354159 -1355689 -1362329 -1358899 -1349116
9050 -1349116 -1356992 -1357424 -1350480 -1332878 -1333059 -1348310 -1348492 -1341767 -1336498 -1325839 -1312852 -1316621 -1319618 -1314570
9036 -1314570 -1317602 -1312609 -1301244 -1302444 -1295659 -1293422 -1296642 -1299510 -1303453 -1317058 -1314898 -1300298 -1296603
9023 -1296603 -1294827 -1297095 -1304615 -1307065 -1318378 -1322248 -1322109 -1316022 -1304727 -1298803 -1293956 -1300065 -1309044 -1308959
9009 -1308959 -1317458 -1314382 -1304607 -1302745 -1296692 -1310614 -1312525 -1321969 -1326024 -1326445 -1321431 -1310272 -1300825 -1290576
8995 -1290576 -1286368 -1294985 -1294448 -1294706 -1285001 -1279741 -1271893 -1267223 -1254785 -1258501 -1267965 -1272512 -1268967 -1267317
8981 -1267317 -1272824 -1274809 -1278730 -1282767 -1292146 -1296660 -1283320 -1288174 -1289693 -1279468 -1277329 -1276832 -1278100 -1281645
8967 -1281645 -1277800 -1279229 -1278890 -1273551 -1261541 -1247661 -1246359 -1248108 -1239195 -1239067 -1250226 -1254356 -1259912 -1253162
8953 -1253162 -1247591 -1243702 -1243909 -1239889 -1246477 -1245770 -1251389 -1252979 -1247449 -1237488 -1237768 -1236283 -1224573 -1219618 -1222756
8938 -1222756 -1230372 -1231231 -1233073 -1231112 -1229519 -1236905 -1236050 -1234441 -1234359 -1230706 -1228097 -1229468 -1225353 -1213303 -1215121
8923 -1215121 -1217281 -1215204 -1219515 -1236644 -1232318 -1237432 -1242494 -1238300 -1237456 -1228090 -1227981 -1226726 -1230234 -1224917
8909 -1224917 -1210099 -1207091 -1193726 -1200841 -1193444 -1187564 -1193188 -1203774 -1201295 -1212418 -1215083 -1199191 -1190067
8896 -1190067 -1191005 -1183140 -1188453 -1192222 -1184249 -1184530 -1196037 -1196351 -1190298 -1188248 -1182981 -1173814 -1172648 -1174098 -1178766
8881 -1178766 -1181850 -1186616 -1189756 -1176202 -1167647 -1165047 -1169904 -1172726 -1178841 -1174839 -1154561 -1152243 -1153476 -1157567
8867 -1157567 -1162758 -1166369 -1167453 -1166656 -1162607 -1161978 -1147330 -1145984 -1145295 -1137044 -1127180 -1125364 -1116154 -1102471
8853 -1102471 -1104125 -1103392 -1114843 -1110728 -1089704 -1073335 -1071775 -1056988 -1040365 -1014916 -985159 -985118 -1005113
8840 -1005113 -1084302 -1192240 -1274024 -1305280 -1302650 -1292020 -1271196 -1253126 -1246276 -1222910 -1194148 -1187812
8828 -1187812 -1198383 -1208479 -1216387 -1205754 -1190021 -1193364 -1183110 -1172749 -1185879 -1191551 -1175393 -1172308
8816 -1172308 -1166331 -1168636 -1170600 -1161062 -1152620 -1150752 -1154286 -1154564 -1149417 -1154516 -1140269 -1140282 -1156081 -1156895 -1146007
8801 -1146007 -1145701 -1140979 -1132319 -1122405 -1126719 -1135320 -1134400 -1134394 -1135957 -1124908 -1110057 -1109457 -1108157 -1109285 -1119912
8786 -1119912 -1118804 -1108664 -1099686 -1101969 -1098759 -1100058 -1103836 -1114228 -1122255 -1111647 -1098369 -1088983 -1081873
8773 -1081873 -1087007 -1086747 -1084136 -1072826 -1068079 -1056655 -1064675 -1087525 -1090112 -1092743 -1084218 -1080445 -1067957
8760 -1067957 -1060130 -1063541 -1066897 -1062943 -1060100 -1069051 -1068596 -1063944 -1056670 -1063995 -1073142 -1083058 -1088512 -1093891
8746 -1093891 -1088746 -1084859 -1079752 -1080680 -1080860 -1068128 -1055096 -1043318 -1050930 -1056281 -1053618 -1058283 -1061111 -1062142
8732 -1062142 -1058132 -1049753 -1040983 -1038308 -1040023 -1038588 -1034501 -1022325 -1023687 -1032860 -1026506 -1032586 -1031611 -1031000
8718 -1031000 -1036192 -1032656 -1027272 -1025303 -1026626 -1016526 -994037 -987615 -996075 -1001852 -998643 -990106 -982436 -1002994
8704 -1002994 -1012777 -1001797 -991469 -1010638 -1013789 -1002197 -998536 -1006915 -1001885 -1007752 -1014132 -1024180 -1036145
8691 -1036145 -1033326 -1023295 -1012597 -1005842 -992111 -981111 -975995 -987779 -981379 -971225 -967160 -961847 -959197
8678 -959197 -962055 -961820 -956128 -947858 -955976 -966150 -975914 -971671 -955088 -938243 -921585 -924556 -932993 -942553
8664 -942553 -930934 -926082 -943015 -958355 -954641 -946684 -941503 -942846 -952824 -960046 -944246 -940930 -937779
8651 -937779 -932561 -923884 -919821 -916688 -920439 -930143 -939739 -972612 -976084 -950824 -933931 -922979 -903798
8638 -903798 -894445 -894085 -888927 -892910 -898354 -892235 -891111 -889588 -882230 -874138 -875868 -880131 -882178 -881282 -885211
8623 -885211 -890559 -888216 -890246 -877902 -874781 -882501 -895598 -904699 -907017 -901173 -879529 -865460 -852287
8610 -852287 -833065 -820588 -816862 -812775 -795708 -782835 -777650 -779794 -788085 -801010 -800471 -802510 -812399
8597 -812399 -821230 -824350 -862314 -900003 -942949 -976227 -1004629 -1044543 -1086217 -1129743 -1171061 -1189961
8585 -1189961 -1201855 -1224662 -1240848 -1247308 -1264131 -1274606 -1278469 -1278214 -1277599 -1280709 -1284273 -1292616 -1301148
8572 -1301148 -1333233 -1348547 -1363292 -1380142 -1400953 -1426566 -1428155 -1425638 -1417558 -1405258 -1399795 -1389331
8560 -1389331 -1376638 -1366391 -1352720 -1346098 -1348950 -1343299 -1331881 -1324926 -1326215 -1323502 -1313140 -1306789 -1304095
8547 -1304095 -1295159 -1285236 -1278344 -1278257 -1278459 -1279987 -1279121 -1268155 -1268305 -1262265 -1255151 -1249037 -1255216 -1253734 -1244330
8532 -1244330 -1229634 -1227850 -1231318 -1228969 -1222668 -1217618 -1224422 -1223038 -1220882 -1210864 -1201583 -1193436 -1181045
8519 -1181045 -1173016 -1163174 -1154230 -1158446 -1171788 -1170461 -1161235 -1163706 -1175946 -1168618 -1150018 -1143391 -1156855
8506 -1156855 -1153513 -1159511 -1151924 -1138346 -1131175 -1128896 -1120358 -1121101 -1134144 -1129109 -1129032 -1133765 -1123781 -1130144
8492 -1130144 -1126815 -1114631 -1101550 -1095845 -1093346 -1091998 -1091783 -1089709 -1086326 -1087410 -1092499 -1083929 -1083712 -1089362
8478 -1089362 -1095537 -1096747 -1093154 -1093938 -1090219 -1081917 -1069710 -1070253 -1089205 -1095594 -1089629 -1091421 -1093314 -1083118
8464 -1083118 -1066011 -1058144 -1058090 -1063098 -1065076 -1079154 -1086307 -1075332 -1061106 -1044164 -1040624 -1052585 -1061527
8451 -1061527 -1070575 -1080501 -1088175 -1078861 -1064464 -1056571 -1046032 -1033805 -1030408 -1025722 -1030687 -1041842 -1044861
8438 -1044861 -1055967 -1061580 -1064546 -1062235 -1062345 -1065761 -1054374 -1048258 -1043800 -1040786 -1035737 -1037527 -1047634 -1039043
8424 -1039043 -1033663 -1035847 -1030275 -1022658 -1018720 -1023023 -1015151 -994364 -995185 -999741 -1001313 -1013625 -1016760 -1025721
8410 -1025721 -1023398 -1014609 -1029191 -1034472 -1034339 -1031629 -1034199 -1033808 -1019657 -1015740 -1006895 -998596 -1005243 -1019335
8396 -1019335 -1032663 -1041607 -1032844 -1020732 -1017543 -1013972 -1016108 -1018109 -1023876 -1021208 -1025265 -1029296 -1031391 -1026387
8382 -1026387 -1030324 -1026142 -1025547 -1021733 -1022755 -1012100 -1003143 -1010088 -1017851 -1001771 -988763 -991925 -988324 -982368
8368 -982368 -976316 -987278 -989033 -977960 -989122 -994907 -993593 -988413 -985561 -977187 -977196 -976993 -987938 -997447
8354 -997447 -1001750 -1022349 -1032971 -1035162 -1029511 -1007185 -1007289 -1011482 -1002516 -1006115 -1008095 -1007426 -1002380 -994485
8340 -994485 -992390 -995693 -989006 -984744 -994780 -998657 -1003850 -1007697 -1009282 -1010740 -998901 -988677 -984939 -979352
8326 -979352 -972797 -972171 -964944 -967840 -970874 -963047 -963932 -971994 -976678 -971313 -970155 -971670 -985145 -996148
8312 -996148 -986732 -985770 -987126 -991378 -1004641 -1004213 -994625 -990927 -999026 -1002557 -1001459 -993191 -975987 -965698
8298 -965698 -969326 -971995 -987039 -987235 -979794 -969934 -966565 -965148 -970141 -957886 -962394 -957232 -954840 -956430
8284 -956430 -951979 -960860 -953804 -953866 -960763 -963911 -973084 -957452 -950840 -957501 -958235 -947293 -931507 -925691
8270 -925691 -928177 -931750 -941022 -944326 -939750 -928864 -937757 -946140 -963417 -970305 -973487 -972262 -971924 -958703
8256 -958703 -949536 -953476 -947923 -935888 -939205 -943417 -940663 -942369 -937490 -932375 -929527 -913292 -910180 -924847
8242 -924847 -931272 -926746 -921189 -922777 -925854 -916712 -902202 -905183 -907147 -912204 -918288 -926158 -928269 -919120
8228 -919120 -924333 -934089 -933918 -932756 -923124 -915928 -912630 -916208 -907486 -908467 -912589 -910859 -911089 -916846 -927130
8213 -927130 -926081 -924051 -909700 -910976 -917564 -925182 -941328 -929847 -914479 -915118 -899784 -886902 -886046
8200 -886046 -885762 -889548 -902509 -912935 -907733 -902477 -907203 -910978 -905102 -886219 -877446 -887459 -884882 -888824
8186 -888824 -890827 -884258 -885712 -888913 -886198 -896497 -896377 -898628 -905744 -889814 -878915 -880256 -878118 -883030
8172 -883030 -891005 -896849 -899375 -882107 -869278 -870062 -882786 -887668 -875567 -867041 -870270 -871515 -869032 -871671
8158 -871671 -875435 -868509 -858720 -851822 -846455 -837076 -840617 -854236 -869074 -869232 -856224 -841316 -841246 -833765
8144 -833765 -826242 -818519 -817844 -810702 -796204 -775785 -759667 -753329 -750899 -749597 -762549 -797883 -846444
8131 -846444 -901054 -937589 -927160 -911834 -904011 -880648 -868993 -849276 -848846 -849306 -852619 -848779 -843652
8118 -843652 -846645 -846997 -845610 -850188 -844732 -830684 -826857 -830391 -840104 -837183 -838675 -831762 -818589 -800147
8104 -800147 -787622 -791153 -800648 -807234 -801509 -775901 -759995 -743900 -740296 -748522 -748596 -741720 -755120 -797918
8090 -797918 -850706 -862134 -858786 -860072 -841903 -840295 -828384 -819452 -808924 -799974 -796997 -788601 -776224
8077 -776224 -780317 -778774 -771479 -755699 -750382 -754707 -764873 -759253 -741331 -740910 -752944 -752885 -758057 -759558
8063 -759558 -749998 -735786 -735428 -732667 -725157 -715279 -709002 -709978 -714714 -717397 -713240 -703971 -699934 -700791 -704516
8048 -704516 -708059 -700709 -693297 -681189 -657995 -648970 -647524 -641797 -640258 -629030 -622198 -612217 -606276 -601979
8034 -601979 -615568 -623166 -611755 -592538 -582843 -575346 -569844 -568137 -572394 -574444 -565057 -582432 -610606
8021 -610606 -637408 -646498 -634331 -634858 -639741 -642453 -647002 -656658 -683721 -703329 -716031 -714826 -722875
8008 -722875 -716635 -710175 -702993 -688892 -675495 -655149 -638162 -630698 -631573 -628412 -612017 -585305 -577356
7995 -577356 -555883 -520195 -503719 -501240 -519205 -538765 -532245 -498788 -448175 -388595 -333797 -324151
7983 -324151 -367603 -480960 -684784 -915605 -1067205 -1122994 -1109153 -1061741 -998900 -924367 -851243
7972 -851243 -793683 -768911 -790249 -925177 -1129448 -1311794 -1408169 -1398667 -1347561 -1290892 -1238945
7961 -1238945 -1194954 -1147263 -1114125 -1095189 -1076708 -1038210 -1006801 -982081 -955042 -928931 -910017
7950 -910017 -895102 -881287 -877058 -850861 -828952 -798679 -765693 -737366 -699712 -686022 -673131 -683039
7938 -683039 -745994 -844742 -945109 -1039398 -1106102 -1133526 -1106797 -1079873 -1044495 -994139 -1007591
7927 -1007591 -1121260 -1275046 -1404812 -1463704 -1459429 -1435071 -1413531 -1381255 -1346252 -1315048 -1292146
7916 -1292146 -1271280 -1245828 -1220976 -1200445 -1175453 -1155325 -1144628 -1128469 -1104499 -1092520 -1084946 -1073757
7904 -1073757 -1069542 -1074960 -1068766 -1048872 -1026395 -1006916 -1000538 -1007351 -1022685 -1065179 -1113741 -1151787
7892 -1151787 -1172330 -1159635 -1166054 -1153169 -1141373 -1144206 -1165508 -1170925 -1178369 -1189158 -1173299 -1154178
7880 -1154178 -1146546 -1143224 -1114249 -1112676 -1112442 -1105783 -1090658 -1088005 -1085552 -1078525 -1070826 -1061552 -1051402 -1055653
7866 -1055653 -1062576 -1056223 -1067117 -1060355 -1070659 -1067692 -1049626 -1029104 -1020382 -1026893 -1028947 -1015099 -1010561
7853 -1010561 -1017344 -1030104 -1030386 -1017719 -1002896 -1012838 -1012872 -1008684 -1001134 -1005849 -999294 -995987 -987148 -992444
7839 -992444 -996951 -1001036 -1000235 -997409 -984938 -977993 -983456 -980544 -977290 -980004 -980466 -979160 -972351 -975722 -976150
7824 -976150 -972097 -961867 -953419 -966491 -970004 -962541 -956303 -955470 -955770 -952684 -942018 -937923 -944212 -952544
7810 -952544 -958549 -954560 -949842 -956298 -962341 -964456 -959915 -953478 -947579 -944436 -944400 -955525 -961342 -953632 -942497
7795 -942497 -945536 -945519 -948724 -942396 -928880 -934448 -940193 -940215 -940721 -940391 -943237 -938428 -923002 -922374 -924846 -918262
7779 -918262 -913231 -919188 -928679 -914301 -915311 -928877 -921598 -897466 -897882 -907168 -912854 -905394 -899441 -905192
7765 -905192 -918926 -917075 -906650 -911355 -914883 -913108 -904402 -902983 -904995 -897178 -889859 -886359 -885519 -887858
7751 -887858 -877925 -884973 -899902 -897061 -889391 -891380 -892259 -892927 -887709 -886477 -880814 -885697 -901102 -908335
7737 -908335 -901247 -886170 -875556 -883983 -886074 -891666 -889391 -878091 -867650 -863807 -873243 -869080 -871715
7724 -871715 -874421 -866055 -862889 -865076 -868872 -874624 -875421 -876911 -877566 -873361 -870516 -858073 -846050 -852737
7710 -852737 -856412 -860132 -847919 -836642 -852406 -871612 -881954 -877236 -873249 -876287 -872866 -887053 -887779
7697 -887779 -870237 -865819 -866972 -874308 -866039 -859987 -869729 -870899 -869022 -862970 -862298 -863895 -861683 -863200
7683 -863200 -871924 -876525 -877144 -869179 -870972 -870713 -860164 -843581 -841824 -843402 -840688 -840137 -835335 -838032 -854955
7668 -854955 -861424 -864742 -866435 -862447 -866943 -856517 -849931 -850536 -856162 -860312 -860308 -862740 -856997 -848717 -846402
7653 -846402 -837842 -829220 -826577 -840570 -838382 -848397 -854647 -843190 -834099 -835222 -835487 -841422 -848292 -847547
7639 -847547 -842528 -839243 -832677 -830448 -839603 -841413 -838867 -831680 -835441 -832072 -835401 -840593 -850537 -850974 -852541
7624 -852541 -844184 -829915 -810350 -818128 -826530 -820159 -819569 -831693 -838417 -833503 -836943 -840925 -852982 -844116
7610 -844116 -824186 -820498 -826972 -827215 -826733 -836587 -837258 -832501 -826635 -819878 -809206 -801290 -804824 -793696
7596 -793696 -807576 -817205 -813942 -814643 -816366 -808938 -804266 -794491 -802124 -824990 -829848 -820230 -818191 -823580
7582 -823580 -823333 -823305 -814600 -807064 -805978 -812256 -819223 -823233 -830482 -844998 -841264 -846445 -841930 -833511 -826903
7567 -826903 -843613 -856961 -834158 -816926 -808123 -808161 -810370 -819970 -821071 -821662 -830970 -822209 -836981 -835895
7553 -835895 -819581 -807782 -798213 -798201 -815322 -819748 -822844 -811001 -806375 -796556 -784784 -792037 -794017 -787676
7539 -787676 -793102 -799482 -794434 -797363 -797542 -793051 -789955 -790532 -789517 -792393 -790634 -794471 -804700 -800815 -799938
7524 -799938 -805852 -804216 -803498 -808441 -810178 -803054 -812135 -810898 -801024 -788536 -779541 -784996 -787464 -787194 -799218
7509 -799218 -815197 -822186 -815321 -807519 -791270 -780199 -776412 -775548 -778818 -794632 -799865 -797278 -782607
7496 -782607 -795048 -810986 -813498 -807282 -808489 -811926 -799865 -788319 -786447 -784101 -771852 -774909 -789110
7483 -789110 -806564 -806664 -803297 -804733 -792592 -786633 -790751 -798236 -798589 -798082 -797690 -805634 -807471 -788219 -773293
7468 -773293 -762748 -767177 -768078 -772589 -778330 -775548 -772250 -765418 -773116 -777290 -771434 -759156 -767693 -771944
7454 -771944 -773328 -768945 -755996 -756702 -756828 -767833 -773430 -771323 -768134 -772763 -766083 -769018 -779273 -785960
7440 -785960 -788377 -778292 -778387 -783251 -793131 -795617 -791082 -786896 -788698 -783588 -782432 -790835 -792093 -778727
7426 -778727 -771154 -765348 -756915 -761240 -767379 -764147 -763845 -771446 -773386 -770652 -763936 -772085 -776558 -778675 -776660
7411 -776660 -771916 -771348 -771156 -766930 -766899 -767005 -791939 -797755 -772940 -763053 -769806 -776018 -774702 -754887 -749440
7396 -749440 -764074 -775849 -775574 -773973 -771302 -762851 -755110 -760094 -764601 -764466 -770794 -785520 -783095 -777753
7382 -777753 -776422 -758538 -752621 -752078 -743203 -737986 -743945 -750219 -758960 -769246 -777548 -781872 -778704 -769956
7368 -769956 -762721 -758174 -751614 -753282 -774645 -781152 -767596 -747238 -743229 -758783 -753832 -744910 -737885
7355 -737885 -743390 -744280 -748680 -741190 -747783 -746619 -737483 -742680 -753734 -748693 -734804 -736125 -736554 -740996
7341 -740996 -744828 -752796 -756140 -752252 -755321 -756495 -760246 -761218 -765221 -762731 -753591 -752542 -751940 -741938 -730938
7326 -730938 -726837 -726149 -726334 -735937 -739808 -742991 -749615 -736959 -719983 -729816 -749169 -758032 -751759 -740061
7312 -740061 -724527 -712288 -710572 -707720 -709998 -716865 -738188 -757472 -759715 -744059 -733060 -733663 -725876
7299 -725876 -723766 -721733 -729706 -729137 -724325 -749408 -761233 -749484 -738491 -721647 -714137 -714599 -709909 -710219
7285 -710219 -703026 -701310 -704170 -709586 -715245 -719835 -735960 -743623 -743036 -732170 -740509 -750979 -749635 -743041
7271 -743041 -741197 -745850 -736985 -731129 -734707 -744586 -746170 -735050 -714188 -712650 -717875 -722078 -731859 -735434
7257 -735434 -736020 -733488 -731075 -727333 -731341 -729744 -719784 -729900 -727173 -726489 -728286 -722989 -710816 -705863
7243 -705863 -701242 -703680 -712704 -732913 -745671 -738198 -727296 -724536 -739377 -746255 -738621 -736114 -725968
7230 -725968 -728530 -717576 -714435 -740659 -741835 -731942 -726966 -723946 -722613 -721009 -724491 -729845 -735230 -732157
7216 -732157 -723240 -730189 -743459 -747048 -738224 -748188 -736606 -734800 -720412 -727446 -731655 -733352 -736845 -734351
7202 -734351 -735323 -735357 -733392 -730504 -730102 -728744 -723909 -721653 -719420 -714041 -717242 -719303 -714203 -723394 -737770
7187 -737770 -733623 -728227 -718328 -714163 -719670 -710329 -709263 -716563 -716599 -721271 -710311 -696009 -686841 -688784
7173 -688784 -700861 -708469 -702859 -712913 -726441 -721643 -717609 -723876 -718889 -713341 -713266 -716137 -722410 -727574
7159 -727574 -725139 -712838 -708543 -710740 -706770 -710263 -707461 -697728 -700644 -700146 -714486 -720577 -722783 -709799
7145 -709799 -707310 -708266 -703599 -708641 -710896 -711318 -709777 -706443 -707780 -698940 -690922 -698440 -704488 -700140 -697382
7130 -697382 -707603 -710178 -705466 -703142 -711273 -714750 -711987 -700470 -692069 -705745 -707668 -718889 -710624
7117 -710624 -698971 -703341 -713642 -717785 -712141 -698287 -692979 -701990 -702067 -705852 -712799 -705004 -701195 -697169
7103 -697169 -701560 -695797 -689248 -688497 -685686 -677990 -697301 -706409 -697461 -690264 -682521 -695443 -697983 -685432
7089 -685432 -689754 -696667 -682980 -685466 -687401 -685451 -692425 -686535 -683392 -683162 -695179 -690162 -687817 -690100
7075 -690100 -686774 -692729 -708110 -713368 -710758 -705420 -692969 -697534 -687944 -684359 -682418 -692479 -698651 -690302
7061 -690302 -669483 -666822 -676030 -686423 -704538 -704316 -698534 -690238 -685990 -689445 -677293 -677527 -685794 -692278
7047 -692278 -692470 -682407 -690704 -694195 -688886 -686566 -691992 -697128 -700663 -700528 -695831 -687454 -681162 -679351 -683650
7032 -683650 -680469 -684696 -671326 -660860 -665762 -680459 -680447 -670834 -662703 -662523 -660366 -659549 -669434 -671613 -663689
7017 -663689 -670636 -674828 -666529 -677000 -675592 -657769 -653031 -649464 -668857 -675556 -667652 -673142 -669386 -660825
7003 -660825 -659314 -650949 -654894 -663234 -662341 -668013 -663829 -672000 -665310 -657988 -649398 -658268 -667899 -673199 -670507
6988 -670507 -667451 -676111 -671182 -664888 -662397 -658350 -653085 -660754 -669526 -662862 -669171 -681157 -693207 -698305
6974 -698305 -696179 -684552 -680229 -666077 -665003 -659756 -652200 -648098 -651068 -656658 -660501 -665675 -672390 -660902
6960 -660902 -656293 -659447 -663432 -659839 -657809 -651023 -664186 -671244 -670157 -666146 -668632 -668983 -672834 -657260
6946 -657260 -661051 -664305 -666219 -666928 -679182 -682230 -677382 -669933 -661689 -667710 -658151 -660205 -666485 -668191
6932 -668191 -664250 -658439 -655711 -655765 -649156 -646484 -648514 -648749 -650003 -645101 -655057 -667515 -671453 -675783 -661483
6917 -661483 -661596 -659045 -655716 -651190 -657245 -664689 -669315 -671004 -674486 -674715 -666671 -675132 -689172 -685282 -686688
6902 -686688 -688715 -686449 -678912 -665349 -642327 -637024 -645995 -644646 -649640 -648976 -645946 -642747 -637125 -637971
6888 -637971 -638153 -632945 -645191 -642581 -652564 -654351 -644008 -644566 -651300 -652482 -653604 -649867 -650595 -654627 -668071
6873 -668071 -665771 -655615 -656479 -648988 -639075 -654575 -667475 -675630 -675142 -661831 -655148 -658913 -668316 -672625
6859 -672625 -671655 -655515 -655130 -659513 -653216 -653895 -655424 -646124 -644913 -649780 -637363 -641176 -653465 -644743
6845 -644743 -630837 -635032 -652285 -646172 -639101 -644200 -651027 -649173 -656757 -653634 -641557 -643063 -641444 -643694
6831 -643694 -657293 -656147 -649665 -637876 -641782 -648212 -649808 -650581 -642199 -623597 -629480 -635113 -640209 -644963
6817 -644963 -643384 -646575 -653322 -654638 -649703 -637560 -636450 -651398 -662959 -654263 -647044 -641728 -638768 -641766
6803 -641766 -642184 -638837 -642195 -633027 -628235 -625726 -617851 -627670 -644350 -638947 -633007 -632985 -627777 -622392 -627951
6788 -627951 -638000 -634818 -625723 -635971 -638168 -639086 -634496 -626094 -623584 -627236 -625928 -630234 -623888 -622634
6774 -622634 -618274 -613105 -624515 -627545 -624235 -618517 -616125 -624518 -633276 -640679 -637150 -632637 -635479 -630260
6760 -630260 -623525 -625763 -630463 -637128 -631053 -629639 -636389 -634193 -627325 -623047 -619536 -625052 -621260 -622815
6746 -622815 -622263 -632723 -650110 -659030 -656384 -643365 -641278 -633929 -631339 -630280 -624391 -626837 -626802 -624609
6732 -624609 -638915 -653436 -648285 -640726 -642869 -633853 -626967 -633030 -631261 -631952 -641469 -639490 -627119 -630430
6718 -630430 -630037 -620113 -607478 -607813 -621794 -608790 -611245 -624326 -629256 -622193 -613028 -602814 -597135 -606942
6704 -606942 -632346 -637933 -633247 -636218 -629492 -631918 -639096 -645169 -643143 -646008 -635054 -628636 -628263 -628415
6690 -628415 -626334 -619406 -613340 -618708 -624353 -619319 -622005 -614811 -613852 -610277 -600729 -600257 -609807 -610702 -621360
6675 -621360 -626824 -622105 -608512 -601693 -603260 -612233 -620495 -615628 -606799 -600863 -602344 -610054 -601832 -605336
6661 -605336 -606611 -604036 -612598 -604113 -594412 -593408 -597935 -603546 -604953 -600281 -608223 -623696 -624460 -615770
6647 -615770 -621995 -621990 -614299 -617982 -611275 -611654 -621944 -621406 -622002 -622438 -617071 -631832 -630090 -637367 -649567
6632 -649567 -642649 -632750 -623538 -618993 -616534 -622167 -620027 -621499 -615450 -612896 -623863 -622009 -619933 -627201
6618 -627201 -636863 -648829 -651726 -639434 -627931 -621812 -629046 -623530 -622987 -626509 -629099 -626348 -624329 -618469
6604 -618469 -613613 -602355 -608088 -610759 -612072 -622692 -624362 -630930 -629268 -620414 -626874 -626002 -623925 -621999
6590 -621999 -620283 -610048 -599223 -588836 -602438 -606744 -596310 -588576 -592238 -606066 -615345 -612088 -613876
6577 -613876 -607155 -597748 -604583 -608826 -617028 -620364 -624996 -617704 -618122 -612196 -610738 -614822 -624960 -629619
6563 -629619 -625147 -621986 -620450 -606541 -595703 -596913 -596339 -597992 -608668 -623123 -625645 -624960 -625864 -616124
6549 -616124 -618736 -608179 -594534 -590479 -588617 -595265 -597272 -591544 -585649 -586685 -591573 -592133 -594812 -602005
6535 -602005 -599575 -592224 -592981 -601265 -604568 -605515 -604356 -603140 -594853 -590270 -595781 -605926 -611901 -613298 -613814
6520 -613814 -615379 -608063 -613135 -613630 -600521 -599157 -606146 -606433 -618109 -606368 -603645 -610656 -612506 -611760
6506 -611760 -608228 -616403 -621666 -607285 -597933 -596019 -591232 -589021 -588130 -593582 -594788 -599072 -600816 -590497
6492 -590497 -591432 -602134 -609380 -594737 -584734 -578467 -579816 -585716 -592790 -595993 -598252 -605553 -595281 -581693
6478 -581693 -582297 -591600 -595615 -596197 -596523 -591543 -588452 -591755 -594082 -588607 -593824 -606340 -607358 -603605 -586966
6463 -586966 -585420 -595727 -600535 -581355 -575899 -585370 -594098 -597556 -593156 -598296 -593671 -584290 -582520 -585980
6449 -585980 -591830 -593005 -593022 -583995 -583908 -597598 -603561 -609137 -615515 -607283 -593685 -584737 -592141 -595850 -594508
6434 -594508 -586152 -581117 -590134 -597863 -596450 -592298 -584004 -586590 -591861 -588793 -579432 -577431 -589344 -595369
6420 -595369 -596710 -593461 -584592 -591771 -594919 -581817 -570698 -578969 -585116 -587937 -582235 -571209 -576577 -584173
6406 -584173 -577973 -566560 -570755 -571962 -573044 -567097 -571291 -585235 -599455 -602920 -599456 -591763 -577374
6393 -577374 -565702 -568275 -578847 -576016 -579704 -588827 -581623 -576767 -582549 -574043 -564163 -577407 -582999 -591757
6379 -591757 -599574 -601591 -600200 -604032 -602225 -593385 -599194 -608155 -601432 -602138 -589981 -583983 -590405 -585769
6365 -585769 -583612 -589034 -595277 -589256 -587625 -582354 -579171 -581608 -578930 -583656 -588074 -586653 -583922 -591656
6351 -591656 -597695 -598340 -589734 -575245 -561801 -559963 -558195 -561680 -568625 -572478 -578431 -580913 -579269 -582894
6337 -582894 -582536 -567694 -568687 -567585 -558517 -570654 -572063 -579207 -580581 -572589 -557472 -558675 -559765 -563620
6323 -563620 -564177 -574989 -579786 -580218 -579232 -586755 -599948 -606725 -597171 -578647 -588084 -608574 -607262 -598830
6309 -598830 -579826 -581509 -593896 -596903 -598057 -595365 -593607 -589220 -574924 -562673 -567997 -569677 -566913
6296 -566913 -555246 -556587 -556766 -566748 -569034 -585209 -588318 -577700 -581022 -588633 -585547 -586926 -586778 -577145
6282 -577145 -569146 -566504 -578133 -569812 -569394 -561637 -568282 -581448 -582969 -579762 -573231 -575942 -572064 -561725
6268 -561725 -567312 -571819 -576568 -573452 -559446 -563345 -561641 -563064 -574468 -580987 -590017 -589436 -578038 -577500
6254 -577500 -573495 -564917 -563967 -570343 -570686 -576847 -584140 -577316 -574688 -568382 -562443 -568693 -583743 -585471 -578078
6239 -578078 -569505 -577429 -585269 -589290 -587466 -576914 -565630 -562440 -567721 -566365 -568671 -562727 -563057 -572173
6225 -572173 -571819 -573886 -566338 -563694 -565480 -580040 -584441 -571242 -562480 -567951 -574799 -569745 -568796 -571729
6211 -571729 -560570 -563663 -565610 -565394 -561939 -556244 -552284 -551309 -562706 -580316 -575006 -567202 -563783 -562028
6197 -562028 -565517 -568861 -568860 -562523 -561748 -551141 -542059 -549503 -562564 -564562 -564206 -571431 -564304 -572367 -577207
6182 -577207 -571703 -559673 -554203 -561240 -562000 -573272 -573569 -562257 -553755 -544606 -553255 -564316 -557648 -550768
6168 -550768 -548368 -548938 -555774 -547351 -541978 -541415 -532614 -534615 -540344 -538161 -548621 -551790 -547292 -541256 -547823
6153 -547823 -559616 -567933 -567444 -565186 -558772 -558125 -565620 -575601 -569894 -567740 -569921 -572945 -572604 -572563 -568526
6138 -568526 -554699 -547167 -543876 -545506 -554115 -563325 -556549 -553090 -548216 -548335 -544179 -551183 -554063 -545367
6124 -545367 -548490 -558363 -561287 -564109 -569561 -564727 -573861 -568504 -552601 -546734 -540733 -527183 -515546 -523493
6110 -523493 -531373 -540994 -544852 -552640 -558923 -559384 -554053 -530345 -529224 -540575 -544302 -539587 -538930 -543987
6096 -543987 -544655 -534102 -533548 -543360 -551292 -541620 -545602 -551751 -553515 -547993 -553959 -561435 -558427 -547811
6082 -547811 -541254 -547945 -547983 -549667 -554609 -552762 -554020 -546031 -552223 -548599 -545623 -541064 -539008 -534265 -534510
6067 -534510 -536390 -540891 -548845 -551525 -545030 -554820 -559370 -549149 -546510 -543361 -547851 -551787 -551556 -549834
6053 -549834 -540783 -534632 -531279 -549603 -559739 -555530 -545298 -534320 -537658 -541395 -547514 -537473 -534955
6040 -534955 -535105 -539949 -544327 -536499 -537326 -529930 -545469 -559455 -550341 -552350 -548705 -553147 -552514 -566096
6026 -566096 -569357 -557851 -562446 -544535 -542773 -550144 -543171 -540098 -545657 -534911 -515573 -524657 -549949
6013 -549949 -565993 -569024 -567146 -560966 -549888 -535139 -524539 -530358 -539940 -534328 -535682 -538617 -537531
6000 -537531 -534747 -525148 -523150 -539241 -561433 -563661 -550702 -545562 -542246 -533748 -528988 -535617 -520528
5987 -520528 -517902 -523313 -544444 -554695 -550312 -551677 -560256 -555677 -543741 -548531 -538898 -533131 -533457 -530870
5973 -530870 -539642 -535539 -536030 -537001 -531836 -544056 -546677 -542120 -531226 -527248 -529038 -518643 -527053 -528757
5959 -528757 -527192 -518344 -515055 -507714 -508796 -513062 -523566 -522845 -524739 -537791 -543493 -543416 -539676 -534068 -531930
5944 -531930 -535421 -534024 -538343 -536686 -538020 -534832 -517983 -517056 -530970 -538011 -540328 -534983 -533242 -533615
5930 -533615 -538744 -552594 -546339 -542910 -548541 -549218 -544899 -542010 -537585 -535732 -545676 -543081 -534050 -512958
5916 -512958 -500647 -516931 -530780 -538659 -536123 -528195 -533967 -541235 -533842 -529373 -527610 -528796 -531234 -526144
5902 -526144 -521747 -522602 -518115 -513769 -512284 -516482 -524875 -521259 -526200 -533988 -531193 -529419 -538385 -540384 -539603
5887 -539603 -533795 -534090 -521578 -514435 -508495 -507653 -506834 -501499 -493428 -485085 -493770 -504564 -516763 -526005
5873 -526005 -521422 -512390 -510116 -516488 -515467 -519870 -523101 -526084 -529205 -534436 -536327 -547079 -542340 -531838
5859 -531838 -531948 -529346 -518560 -500417 -489814 -490678 -502404 -511997 -517520 -530576 -530706 -525825 -520560 -520111
5845 -520111 -527182 -532534 -530246 -510172 -509118 -521260 -515782 -507582 -509026 -522030 -523506 -507388 -506426 -523145
5831 -523145 -521451 -516571 -515171 -510060 -497975 -503983 -516004 -509739 -511435 -516063 -516379 -523972 -520012 -529040
5817 -529040 -538356 -532330 -535366 -536245 -536363 -535523 -516247 -506511 -498869 -516226 -526251 -517816 -517493 -530923
5803 -530923 -526381 -525246 -530002 -521795 -524530 -525435 -515852 -511813 -500480 -498759 -502572 -504293 -507319 -515616
5789 -515616 -528827 -535349 -537038 -530436 -530560 -523032 -520682 -510495 -501218 -492729 -505706 -519961 -521892 -509202
5775 -509202 -509279 -516803 -511594 -510944 -517469 -509941 -505358 -506925 -511676 -528107 -526023 -523277 -524203 -532309 -530219
5760 -530219 -529178 -519488 -512621 -513465 -509280 -507514 -515504 -524152 -528663 -527766 -520598 -514782 -527713 -519774 -507288
5745 -507288 -503708 -511908 -514809 -510331 -507842 -503697 -511884 -529078 -520315 -517364 -514115 -505722 -501238 -506849
5731 -506849 -516323 -522962 -517753 -510780 -495716 -503206 -506716 -504238 -497730 -497543 -491790 -496155 -490274 -493410
5717 -493410 -512279 -494242 -481458 -505000 -507505 -501034 -502190 -509371 -518175 -519238 -505876 -503311 -500586
5704 -500586 -501129 -502904 -519038 -522874 -532952 -531452 -524483 -525763 -522610 -524499 -525687 -519310 -523786 -538513
5690 -538513 -526185 -503738 -489326 -497076 -511400 -510068 -502558 -508500 -500510 -499164 -494500 -498635 -494417
5677 -494417 -484419 -480065 -483276 -484761 -485916 -497034 -506747 -506445 -514551 -510797 -507157 -506436 -498625 -495359 -497936
5662 -497936 -495213 -491332 -491877 -504641 -504312 -509340 -516629 -514147 -502872 -500938 -496945 -502523 -498279 -493837
5648 -493837 -507640 -507936 -494883 -485381 -486351 -490394 -489710 -490040 -493151 -500415 -505844 -505709 -498521 -486785 -490691
5633 -490691 -498209 -497808 -504794 -513216 -515358 -506236 -490362 -487409 -503978 -513976 -514946 -501331 -502503 -500538
5619 -500538 -506957 -524388 -521483 -513618 -506306 -512458 -514717 -519229 -519488 -515062 -511590 -509772 -507622 -508817
5605 -508817 -506696 -498621 -486902 -500485 -503386 -499180 -499457 -502094 -490235 -498436 -500042 -499169 -496387 -503520
5591 -503520 -508666 -509799 -510776 -505579 -498469 -492713 -495818 -507549 -508752 -495534 -481934 -480973 -479372 -474705
5577 -474705 -481002 -498927 -499033 -482921 -488176 -495768 -492719 -495390 -499271 -499142 -499031 -500347 -492457 -501328 -519025
5562 -519025 -510287 -490142 -491500 -503745 -510844 -509519 -499635 -498552 -502617 -494792 -499284 -497545 -496308 -500936
5548 -500936 -511874 -490728 -473352 -483068 -499509 -496996 -492061 -486083 -486953 -489766 -473383 -469350 -471055
5535 -471055 -488723 -488901 -477731 -471387 -468343 -474810 -486303 -483870 -489956 -502687 -519677 -521577 -517447
5522 -517447 -513947 -497187 -474959 -473991 -475399 -497111 -497093 -490899 -494686 -506465 -512001 -499333 -498697 -500780
5508 -500780 -491697 -488344 -483664 -474759 -464865 -474452 -480501 -478902 -489387 -490877 -499470 -497798 -500309 -493448
5494 -493448 -498429 -513108 -512107 -497762 -496608 -501299 -504344 -508111 -508879 -496728 -497005 -502566 -498749 -503898
5480 -503898 -495763 -480260 -483694 -484578 -487751 -477642 -479947 -483756 -477974 -490323 -487815 -488528 -494223 -495459
5466 -495459 -481697 -477983 -472588 -465352 -468780 -478784 -490246 -494360 -493418 -487273 -473164 -474980 -483404 -484483
5452 -484483 -477907 -498171 -501927 -492724 -492542 -494436 -492979 -480854 -467704 -469238 -477814 -475081 -477512 -490671
5438 -490671 -497487 -484069 -470666 -463039 -465660 -470031 -485980 -487793 -485234 -492691 -494145 -494597 -489912 -493889
5424 -493889 -481020 -466555 -463431 -462097 -463622 -463019 -478668 -491846 -492268 -489739 -489181 -480779 -490954 -486146
5410 -486146 -465761 -456967 -459891 -468740 -474203 -473938 -468734 -476102 -471954 -465003 -476105 -481822 -486757 -483384
5396 -483384 -481037 -487300 -494608 -498814 -496890 -484790 -476257 -475240 -468456 -479978 -480683 -480795 -496514 -500522
5382 -500522 -502932 -486431 -474337 -473211 -468266 -458450 -462101 -460883 -466564 -472346 -479037 -480568 -474036 -474984
5368 -474984 -476303 -480648 -475612 -468155 -457193 -457541 -466842 -465760 -466355 -467086 -456845 -456719 -469971 -481383
5354 -481383 -483445 -486591 -490720 -494675 -490328 -477832 -483424 -482805 -473165 -471295 -477502 -475161 -468604 -467800 -462062
5339 -462062 -454774 -460007 -476342 -482974 -486053 -479511 -477183 -482420 -477100 -463444 -456752 -466854 -473514 -477873
5325 -477873 -484144 -495367 -495183 -483092 -479711 -488112 -490834 -487203 -484245 -482100 -483540 -493042 -493023 -477694
5311 -477694 -464906 -471399 -478421 -478458 -483230 -483503 -479717 -476502 -470475 -469829 -477902 -480935 -493523 -500673 -499892
5296 -499892 -483951 -473722 -472052 -468118 -478891 -479043 -480113 -476751 -479738 -480069 -469943 -462194 -463389 -456230
5282 -456230 -448019 -448341 -465633 -475455 -480712 -487234 -480315 -480837 -485320 -485135 -475590 -465660 -457312 -451320 -449421
5267 -449421 -448360 -451742 -451835 -463457 -466724 -464738 -464830 -466956 -467458 -463220 -464599 -471534 -474223 -464895 -465175 -467877
5251 -467877 -477063 -478412 -477872 -477716 -466635 -463964 -472494 -473263 -473401 -479857 -485312 -481415 -479579 -475060 -474980 -466568
5235 -466568 -465140 -466649 -477137 -481001 -476288 -473189 -470961 -473410 -467935 -464256 -465764 -463601 -460102 -451296
5221 -451296 -450329 -460764 -469608 -471199 -473894 -486346 -467844 -463458 -467706 -471787 -468102 -465183 -457862 -459120
5207 -459120 -465754 -472846 -472348 -471687 -475758 -476614 -478130 -473830 -463087 -454450 -444835 -452897 -460396 -462425 -474800
5192 -474800 -475301 -461445 -458623 -462447 -457072 -442643 -437557 -445875 -458324 -459249 -468315 -480970 -467863 -456832
5178 -456832 -463986 -467934 -459309 -467284 -479272 -480889 -486926 -492845 -486009 -474338 -471286 -463087 -466174 -465311
5164 -465311 -456411 -460667 -470973 -474140 -479769 -484386 -475505 -463355 -465246 -458644 -453188 -449177 -455557 -453218
5150 -453218 -463054 -471447 -477408 -484647 -485306 -465483 -456892 -457906 -453347 -457681 -467843 -462800 -447999 -448602
5136 -448602 -445995 -445765 -458228 -455875 -446969 -437955 -438762 -443203 -441401 -451893 -459305 -468518 -454034 -444139
5122 -444139 -446392 -454036 -450231 -453675 -451979 -460168 -462553 -456592 -453428 -464799 -451730 -463450 -462638 -454023
5108 -454023 -462441 -467189 -460974 -464157 -467375 -453639 -446894 -463494 -464190 -469486 -468074 -452086 -448225 -443379
5094 -443379 -450261 -455806 -464973 -464001 -467188 -458730 -452339 -450400 -454533 -444714 -432478 -443328 -457665 -463828
5080 -463828 -452886 -445083 -455613 -454966 -449365 -450173 -447570 -445644 -438815 -434217 -450432 -453503 -449425 -452485
5066 -452485 -453995 -457408 -461788 -458680 -453983 -452983 -449189 -447098 -457163 -458275 -460019 -465309 -460643 -456188
5052 -456188 -453958 -441117 -430486 -436789 -448046 -457021 -459099 -460143 -451708 -443779 -445629 -442898 -444314 -443589
5038 -443589 -448668 -456557 -458801 -452480 -454172 -452964 -451835 -440291 -436832 -438115 -435897 -442616 -451428 -447442
5024 -447442 -454561 -447106 -445360 -450838 -451750 -443977 -430026 -424189 -431226 -435471 -434358 -435459 -438532 -436627
5010 -436627 -439170 -444170 -452892 -451957 -452743 -444141 -437874 -427580 -439518 -444611 -436678 -432636 -435683 -423496
4996 -423496 -425947 -432604 -436116 -447255 -452333 -453826 -444115 -451954 -454722 -459434 -461561 -462120 -453147 -444096
4982 -444096 -447340 -443953 -437725 -437908 -443085 -449628 -452572 -441463 -449970 -460349 -464276 -451494 -450468 -456647
4968 -456647 -453435 -445940 -442724 -447001 -442131 -455319 -467114 -475613 -461573 -458749 -443078 -440578 -445035
4955 -445035 -445356 -438130 -430495 -441190 -452318 -450580 -452820 -443756 -441116 -435292 -423490 -419183 -438856 -450143
4941 -450143 -450281 -452825 -443837 -429122 -430132 -444958 -461348 -472934 -462586 -452289 -447299 -434896 -432161
4928 -432161 -437169 -448129 -453001 -455151 -449025 -441897 -448050 -449208 -432438 -428693 -439115 -446149 -441150 -434135
4914 -434135 -433637 -431951 -438284 -453470 -458104 -453995 -441688 -440871 -453200 -462901 -462663 -450381 -455719 -464782
4900 -464782 -458420 -450344 -448515 -450574 -459242 -449981 -445979 -432178 -425887 -431292 -435502 -447683 -450870 -457454
4886 -457454 -463577 -462580 -456392 -455062 -446690 -452559 -462494 -463546 -463274 -452709 -433275 -433788 -437356 -445072 -440963
4871 -440963 -441450 -445190 -446051 -448018 -443214 -434813 -438073 -448823 -459609 -456940 -440506 -442159 -442367 -427060
4857 -427060 -430009 -438187 -434308 -435278 -440688 -448676 -433608 -419440 -427101 -432579 -433411 -432323 -426430 -435967
4843 -435967 -435374 -433723 -442092 -455449 -455684 -450792 -446325 -436049 -426851 -431510 -442336 -441143 -431041 -421643
4829 -421643 -422810 -422466 -413421 -420436 -429215 -423030 -420292 -429541 -443965 -446307 -447649 -450368 -445779 -446881
4815 -446881 -441299 -435274 -441372 -439720 -441624 -437429 -443733 -445377 -434383 -436244 -433816 -430587 -439632 -442612
4801 -442612 -428198 -436134 -445396 -442182 -440984 -432538 -430236 -431351 -424587 -426791 -425147 -420723 -430213 -430716
4787 -430716 -433386 -436055 -447505 -447599 -425966 -417477 -429567 -436501 -442177 -438225 -427839 -434997 -447279 -450389
4773 -450389 -446296 -441261 -447815 -451731 -450380 -458744 -462257 -459676 -456243 -448195 -432053 -430197 -421645 -418342
4759 -418342 -429372 -439959 -435979 -434885 -443581 -460391 -463720 -451397 -442151 -421194 -409654 -417864 -426501
4746 -426501 -435267 -430948 -425143 -432103 -427780 -425849 -429384 -429859 -433814 -429336 -433988 -458160 -455470 -449281
4732 -449281 -438867 -436859 -439801 -436672 -428595 -415995 -417341 -426129 -438966 -451262 -457005 -453152 -434751
4719 -434751 -428209 -431217 -435466 -445195 -449532 -438763 -438795 -439682 -427210 -420310 -427861 -428488 -436175 -436576 -419514
4704 -419514 -399385 -409621 -434800 -426326 -418654 -428584 -432638 -439213 -443125 -433004 -425300 -428988 -437977
4691 -437977 -430453 -426884 -421282 -426757 -433558 -432134 -438775 -436023 -425576 -419572 -417859 -415700 -417838 -426203
4677 -426203 -426437 -408913 -413316 -424187 -425763 -437083 -446491 -446555 -450099 -445828 -439217 -435584 -426272 -423617
4663 -423617 -415648 -418652 -432134 -441494 -439770 -429749 -430516 -426455 -424137 -424185 -424461 -415216 -416163 -409452 -401737
4648 -401737 -403986 -413700 -415533 -411976 -408835 -403895 -411780 -419140 -409678 -416345 -424355 -426073 -417693 -422753
4634 -422753 -428338 -428782 -428097 -436800 -442522 -440653 -438343 -436422 -435913 -435037 -429106 -415983 -411090 -411455 -413324
4619 -413324 -415079 -415741 -400116 -396133 -400545 -410269 -416260 -408488 -403325 -408730 -418929 -427116 -433291 -433476
4605 -433476 -439391 -434599 -431472 -435715 -437060 -413842 -400352 -409683 -415945 -402463 -389321 -400635 -413911
4592 -413911 -423735 -431240 -439004 -436056 -419770 -419429 -430898 -426499 -423187 -430042 -433744 -425899 -402774 -388531
4578 -388531 -384998 -400234 -413751 -422273 -438339 -433189 -424665 -430074 -428800 -416768 -418176 -432326 -443642
4565 -443642 -436006 -428074 -438086 -430540 -421194 -418665 -416545 -417547 -414158 -419832 -420601 -418995 -408409 -409652
4551 -409652 -427513 -426827 -426432 -420760 -419168 -415977 -411565 -421150 -433733 -438665 -427270 -426342 -427440 -434204
4537 -434204 -432011 -427071 -424495 -422678 -424262 -424457 -424437 -423579 -430561 -440149 -438194 -430861 -425102 -412912 -416769
4522 -416769 -419331 -419951 -409401 -406735 -416129 -422432 -422512 -416956 -415901 -425311 -423261 -419723 -429334 -425326 -437901
4507 -437901 -443484 -425647 -417002 -416428 -419380 -412703 -417344 -419258 -411586 -421823 -422987 -414877 -410981 -412393
4493 -412393 -413428 -411833 -409846 -411013 -419650 -420699 -433572 -422778 -403866 -403194 -412530 -419750 -417870 -418931
4479 -418931 -413641 -403956 -398632 -412468 -424541 -421266 -424986 -422594 -422390 -418785 -415080 -402098 -398336 -414276
4465 -414276 -427350 -435648 -420003 -409758 -412557 -407915 -414612 -414895 -409384 -389831 -399403 -409809 -416537
4452 -416537 -420706 -421017 -417331 -413981 -415825 -405365 -402348 -409911 -422221 -429177 -407875 -395977 -406893
4439 -406893 -413122 -413181 -414358 -412857 -401571 -397871 -392790 -402336 -409944 -407491 -413843 -414457 -435382 -443641 -436473
4424 -436473 -415728 -401053 -404862 -405582 -406432 -389749 -383981 -398796 -410141 -412785 -421862 -415425 -414517 -428639
4410 -428639 -434737 -434359 -424167 -414675 -417570 -414492 -416282 -423729 -426026 -427432 -420659 -407911 -403216 -403911
4396 -403911 -401899 -400648 -397001 -407531 -416423 -416108 -420494 -412538 -401834 -405486 -418920 -415902 -417340 -412964
4382 -412964 -412375 -423339 -400820 -397697 -396112 -404334 -411166 -402444 -387288 -386250 -382110 -382600 -397038 -400292
4368 -400292 -397936 -412693 -415612 -405785 -413702 -429725 -429911 -419279 -414697 -408063 -420479 -424072 -413161
4355 -413161 -406218 -396272 -395173 -398764 -406282 -402045 -397905 -411192 -424931 -420764 -421786 -418243 -418407 -423274
4341 -423274 -418450 -402341 -403715 -401744 -393896 -388954 -398682 -411995 -423086 -421430 -424714 -430855 -424533 -411070
4327 -411070 -415046 -410012 -404274 -408912 -414635 -419233 -420982 -413646 -411115 -418097 -411810 -411777 -414320 -420103 -420516
4312 -420516 -416955 -416873 -410438 -407053 -403256 -405068 -409470 -406694 -400501 -402634 -414122 -401254 -390923 -403073
4298 -403073 -405831 -408102 -415403 -426133 -422252 -409068 -416171 -421241 -413840 -403710 -392819 -394759 -397169
4285 -397169 -386210 -390117 -397188 -403367 -401716 -398604 -406928 -415445 -408883 -398358 -398147 -394244 -397537 -402089
4271 -402089 -398622 -395974 -391503 -399283 -404549 -397228 -384392 -384626 -386162 -390006 -400623 -401278 -408020 -405547
4257 -405547 -403817 -406458 -404294 -400818 -395780 -393957 -392877 -391047 -399293 -403524 -404129 -410879 -422087 -423074 -411110
4242 -411110 -396639 -393052 -395888 -386857 -387508 -403951 -399485 -386714 -385368 -399299 -394076 -387520 -393260 -404265
4228 -404265 -405256 -402121 -407001 -418523 -414960 -416120 -411367 -410456 -416853 -418965 -412228 -417089 -408563 -411903 -412497
4213 -412497 -404067 -388970 -397332 -405987 -401471 -400855 -400590 -409687 -401160 -392446 -393720 -376714 -376288 -377355 -382262
4198 -382262 -390086 -397055 -401962 -415945 -419603 -406421 -390463 -387771 -387456 -401386 -418252 -417680 -417448 -415305
4184 -415305 -407544 -411993 -411504 -417168 -414288 -414901 -412889 -421785 -420964 -404172 -391765 -398890 -409963 -418366
4170 -418366 -404861 -398867 -406630 -405671 -406646 -405551 -408736 -404436 -394662 -391696 -397567 -406962 -402945 -394385 -390562
4155 -390562 -401356 -400102 -407804 -404050 -401775 -411367 -404501 -396582 -412260 -410872 -398758 -396066 -398684 -399890
4141 -399890 -401267 -404592 -407820 -404099 -392366 -388295 -392929 -398681 -412066 -412558 -395345 -379064 -390206
4128 -390206 -401661 -418906 -429578 -430444 -428586 -416124 -419117 -428713 -424986 -418842 -412143 -412188 -415575 -413219
4114 -413219 -394890 -380118 -381841 -377966 -373052 -388771 -393621 -392398 -395435 -401438 -401720 -406519 -401063 -406396
4100 -406396 -412641 -410560 -392269 -398280 -407578 -399939 -397514 -400935 -409518 -413799 -403179 -398882 -405527 -398215
4086 -398215 -392145 -398135 -390604 -382222 -390531 -399234 -396521 -400081 -403143 -383002 -376247 -382464 -376122 -381338
4072 -381338 -382503 -393065 -398189 -397758 -391066 -384992 -393252 -393542 -381629 -362194 -359780 -379307 -388184 -382553
4058 -382553 -373461 -378724 -389916 -388035 -387459 -402636 -401284 -385800 -374368 -378245 -378703 -383521 -394648 -395520
4044 -395520 -387350 -391686 -395192 -396465 -391618 -385429 -379999 -364686 -366731 -386446 -402929 -408234 -396721
4031 -396721 -393116 -387364 -396874 -392759 -377614 -376658 -395514 -400815 -392973 -397804 -395932 -393419 -397877 -386071
4017 -386071 -378085 -392445 -404475 -404629 -396223 -382515 -387314 -388709 -388831 -392007 -396419 -388468 -378959 -371464
4003 -371464 -375235 -386127 -393296 -399803 -402411 -395683 -384955 -384492 -392277 -404888 -404669 -396693 -392085 -389420
3989 -389420 -373966 -367944 -380011 -389197 -390161 -384229 -387202 -390464 -388938 -385647 -385484 -383152 -384709 -386019
3975 -386019 -392389 -399620 -403471 -394265 -379493 -391640 -396628 -403824 -406576 -396392 -383400 -385610 -389172
3962 -389172 -392963 -394325 -389409 -383214 -377917 -386471 -387881 -385709 -395979 -393142 -388678 -393971 -399785 -412693
3948 -412693 -412470 -408730 -422038 -415173 -408950 -405881 -399587 -393807 -393231 -400456 -402395 -381110 -383986 -389266
3934 -389266 -378237 -372443 -389347 -402852 -411972 -406389 -400300 -394886 -389117 -399421 -404561 -398852 -384614
3921 -384614 -380849 -383777 -383114 -397314 -402125 -395442 -398653 -390489 -378180 -378039 -388336 -400703 -397617 -399117
3907 -399117 -406475 -401608 -398638 -394610 -390837 -389126 -395330 -391598 -407955 -407351 -411767 -406141 -393487 -382293
3893 -382293 -380366 -383382 -377969 -386368 -387556 -371727 -377474 -391062 -396565 -387504 -378711 -382649 -385029 -385182
3879 -385182 -392880 -405985 -398113 -375900 -362502 -367990 -369983 -369298 -371013 -376407 -375645 -374081 -382149 -384524
3865 -384524 -381591 -383174 -393298 -385893 -374823 -376028 -369598 -370110 -363246 -360706 -356555 -360908 -372541 -375808
3851 -375808 -376974 -382661 -380295 -390343 -392888 -373671 -364793 -364143 -377189 -374343 -355718 -362923 -377026
3838 -377026 -383314 -379443 -378000 -385833 -393334 -394325 -382552 -384619 -397096 -400850 -398010 -400050 -392620 -375664
3824 -375664 -373080 -381273 -376898 -386168 -382138 -380334 -373411 -370667 -380126 -381525 -371763 -369263 -372988 -371582
3810 -371582 -372791 -378604 -374827 -382114 -389938 -381878 -378704 -376802 -382389 -380850 -374503 -371785 -378113 -395738
3796 -395738 -396640 -390891 -377341 -376810 -375095 -381319 -376622 -373457 -393055 -407430 -401487 -398059 -396812 -399461
3782 -399461 -401127 -404761 -399665 -384574 -379866 -388216 -395111 -391056 -379920 -370143 -375858 -383272 -374955 -377822
3768 -377822 -389874 -390778 -386417 -387392 -388171 -381005 -380489 -379249 -381685 -381271 -370123 -370673 -377858 -378195 -387327 -377590
3752 -377590 -377586 -387421 -395837 -389929 -384148 -390172 -396265 -385255 -375060 -372595 -372493 -367031 -354889 -353915 -364130
3737 -364130 -372721 -380212 -375576 -375052 -382204 -383488 -384801 -380006 -373620 -362588 -369364 -377104 -383058 -376902
3723 -376902 -382624 -385459 -383134 -381212 -375320 -372633 -364554 -366584 -373209 -368189 -366890 -367120 -389532 -398282
3709 -398282 -401564 -395619 -378207 -365720 -367597 -373421 -366580 -362218 -370450 -381629 -386722 -388853 -386095 -375709
3695 -375709 -371824 -377642 -368401 -376949 -379182 -385119 -380054 -380193 -377159 -359883 -360576 -366650 -364694 -368825 -369056
3680 -369056 -356347 -350631 -353368 -362194 -362754 -367181 -365478 -370924 -368238 -375322 -362979 -359093 -365668 -364706
3666 -364706 -354190 -355011 -366986 -365405 -367612 -362472 -351599 -351512 -378260 -395394 -387098 -397516 -397666 -385502
3652 -385502 -369036 -361453 -357602 -365463 -376583 -383206 -382261 -372278 -369282 -360408 -349935 -342570 -349560 -368902
3638 -368902 -371688 -376953 -383501 -383113 -380355 -375763 -383089 -390662 -395582 -399043 -395794 -392105 -381486 -371471
3624 -371471 -374738 -389062 -388768 -390599 -382928 -377842 -371536 -378724 -383406 -379045 -367005 -365639 -363938 -370191
3610 -370191 -377116 -368117 -361490 -369805 -396450 -401346 -382109 -380116 -383593 -378554 -368026 -362276 -368326 -374883
3596 -374883 -375071 -378286 -374031 -369743 -361079 -363652 -363910 -362610 -364056 -367856 -380494 -372660 -357504 -355288
3582 -355288 -364071 -369886 -380771 -383110 -377035 -373062 -374923 -382407 -372820 -380528 -381875 -373781 -370151 -355224
3568 -355224 -348909 -343207 -348528 -366379 -374590 -361933 -361089 -359178 -356237 -351327 -348488 -364081 -385449 -388822
3554 -388822 -387557 -383983 -366733 -361126 -352972 -361409 -370820 -378081 -385458 -379732 -372888 -366479 -361829 -366430
3540 -366430 -374662 -380908 -378976 -372837 -370507 -365162 -361824 -374574 -383223 -383087 -380806 -364407 -364216 -355265
3526 -355265 -349503 -355483 -369665 -382768 -385072 -385343 -384994 -383885 -388775 -375529 -373286 -370578 -360452 -354151
3512 -354151 -357794 -364809 -366420 -363268 -360795 -367743 -373407 -373779 -375310 -378922 -381871 -377229 -365868 -360535
3498 -360535 -354400 -342585 -340761 -351232 -354577 -363128 -375289 -376236 -369091 -362125 -352916 -362204 -378217 -375603
$$ [...]
##END NTUPLES=NMR SPECTRUM
##END=
