##TITLE=Analysis number 316185
Compound Code cc 25410
Project Code adrs
Chemist Name af chempharm
##JCAMPDX= 6.0         $$ Bruker NMR JCAMP-DX V2.0
##DATA TYPE= NMR SPECTRUM
##DATA CLASS= NTUPLES
##ORIGIN= Bruker BioSpin GmbH
##OWNER= nmr
$$ XWIN-NMR		Version 3.5
$$ Tue Jan  3 12:27:34 2006 GMT Standard Time (UT+0h)  MAYBRIDGE\nmr@NMR_250MHZ
##.OBSERVE FREQUENCY= 250.131544655141
##.OBSERVE NUCLEUS= ^1H
##.ACQUISITION MODE= SIMULTANEOUS (DQD)
##.ACQUISITION SCHEME= undefined
##.AVERAGES= 16
##.DIGITISER RES= 18
##SPECTROMETER/DATA SYSTEM= dpx250
##.PULSE SEQUENCE= zg30
##.SOLVENT NAME= CDCl3
##.SHIFT REFERENCE= (INTERNAL, CDCl3, 0, 16.522)
##AUDIT TRAIL= $$ (NUMBER, WHEN, WHO, WHERE, WHAT)
$$ ##TITLE= Audit trail, XWIN-NMR		Version 3.5
$$ ##JCAMPDX= 5.01
$$ ##ORIGIN= Bruker BioSpin GmbH
$$ ##OWNER= nmr
$$ C:\u/data/dgb/nmr/ADRS/14120/pdata/1/auditp.txt
$$ ##AUDIT TRAIL=  $$ (NUMBER, WHEN, WHO, WHERE, WHAT)
(   1,<2006-01-03 12:27:05.24 +000>,<MAYBRIDGE\nmr>,<NMR_250MHZ>,
      <created by zg, POWCHK disabled, PULCHK disabled
       configuration hash MD5:
       62 19 C7 07 E1 42 D1 B7 37 6C 3D D0 77 39 F9 E6
       data hash MD5: 64K
       60 AC 61 3B 74 69 D0 AE CB E0 2A 28 08 35 AC 06>)
(   2,<2006-01-03 12:27:21.46 +000>,<MAYBRIDGE\nmr>,<NMR_250MHZ>,
      <Start of raw data processing
       ef LB = 0.3 FT_mod = 6 PKNL = 1 SI = 32K 
       data hash MD5: 32K
       3E 63 4B F3 EF FA 0E 52 B9 EB 33 38 59 CE 0E 3F>)
(   3,<2006-01-03 12:27:23.38 +000>,<MAYBRIDGE\nmr>,<NMR_250MHZ>,
      <apk 
       data hash MD5: 32K
       E4 AC 0F D4 AB E5 3D A9 E6 45 81 39 4A 12 0B BA>)
(   4,<2006-01-03 12:27:24.14 +000>,<MAYBRIDGE\nmr>,<NMR_250MHZ>,
      <abs ABSG = 5 
       data hash MD5: 32K
       57 0A 3B 2E 07 DE 0C FA 0D D9 30 54 66 3C 6F F0>)
$$ ##END=
$$ 
$$ hash MD5
$$ 51 F2 07 ED 94 70 39 5A 73 45 90 A2 43 7C 77 B8
##$RELAX= 
##$RELAX= 
##$RELAX= 
##$RELAX= 
##$RELAX= 
##$RELAX= 
##$RELAX= 
$$ Bruker specific parameters
$$ --------------------------
##$DU= <C:\u>
##$EXPNO= 14120
##$NAME= <ADRS>
##$PROCNO= 1
##$TYPE= <nmr>
##$USER= <dgb>
##$AMP= (0..31)
100 100 100 100 100 100 100 100 100 100 100 100 100 100 100 100 100 100 
100 100 100 100 100 100 100 100 100 100 100 100 100 100 
##$AQSEQ= 0
##$AQ_mod= 3
##$AUNM= <au_zg>
##$AUTOPOS= <8 >
##$BF1= 250.13
##$BF2= 250.13
##$BF3= 250.13
##$BF4= 250.13
##$BF5= 500.13
##$BF6= 500.13
##$BF7= 500.13
##$BF8= 500.13
##$BYTORDA= 1
##$CFDGTYP= 0
##$CFRGTYP= 5
##$CHEMSTR= <none>
##$CNST= (0..31)
1 1 145 1 1 1 1 1 1 1 1 1 1 1 1 1 1 1 1 1 1 1 1 1 1 1 1 1 1 1 1 1 
##$CPDPRG= <>
##$CPDPRG1= <>
##$CPDPRG2= <>
##$CPDPRG3= <>
##$CPDPRG4= <mlev>
##$CPDPRG5= <mlev>
##$CPDPRG6= <mlev>
##$CPDPRG7= <mlev>
##$CPDPRG8= <mlev>
##$CPDPRGB= <>
##$CPDPRGT= <>
##$D= (0..31)
0 1 0 0 0 0 0 0 0 0.06 0 0 0 0 0 0 0.0002 0 0 0 0 0 0 0 0 0 0 0 0 0 0 
0 
##$DATE= 1136291223
##$DBL= (0..7)
120 120 120 120 120 120 120 120 
##$DBP= (0..7)
150 150 150 150 150 150 150 150 
##$DBP07= 0
##$DBPNAM0= <>
##$DBPNAM1= <>
##$DBPNAM2= <>
$$ [...]
##$SUBNAM7= <"">
##$SUBNAM8= <"">
##$SUBNAM9= <"">
##$SW= 20.6930455092707
##$SWIBOX= (0..15)
0 0 3 0 0 0 0 0 0 0 0 0 0 0 0 0 
##$SW_h= 5175.983436853
##$TD= 65536
##$TD0= 1
##$TE= 294.16
##$TE2= 300
##$TE3= 300
##$TEG= 300
##$TL= (0..7)
0 120 120 120 120 120 120 120 
##$TP= (0..7)
150 150 150 150 150 150 150 150 
##$TP07= 0
##$TPNAME0= <>
##$TPNAME1= <>
##$TPNAME2= <>
##$TPNAME3= <>
##$TPNAME4= <>
##$TPNAME5= <>
##$TPNAME6= <>
##$TPNAME7= <>
##$TPOAL= (0..7)
0.5 0.5 0.5 0.5 0.5 0.5 0.5 0.5 
##$TPOFFS= (0..7)
0 0 0 0 0 0 0 0 
##$TUNHIN= 0
##$TUNHOUT= 0
##$TUNXOUT= 0
##$USERA1= <user>
##$USERA2= <user>
##$USERA3= <user>
##$USERA4= <user>
##$USERA5= <user>
##$V9= 5
##$VALIST= <valist>
##$VCLIST= <CCCCCCCCCCCCCCC>
##$VD= 0
##$VDLIST= <DDDDDDDDDDDDDDD>
##$VPLIST= <PPPPPPPPPPPPPPP>
##$VTLIST= <TTTTTTTTTTTTTTT>
##$WBST= 1024
##$WBSW= 4
##$XGAIN= (0..3)
0 0 0 0 
##$XL= 0
##$YL= 0
##$YMAX_a= 494209
##$YMIN_a= -551757
##$ZGOPTNS= <>
##$ZL1= 120
##$ZL2= 120
##$ZL3= 120
##$ZL4= 120
##$ABSF1= 16.522
##$ABSF2= -4.171173
##$ABSG= 5
##$ABSL= 3
##$ALPHA= 0
##$AQORDER= 0
##$ASSFAC= 0
##$ASSFACI= 0
##$ASSFACX= 0
##$ASSWID= 0
##$AUNMP= <proc_1d>
##$AZFE= 0.1
##$AZFW= 0.1
##$BCFW= 0
##$BC_mod= 0
##$BYTORDP= 0
##$COROFFS= 0
##$CY= 12.5
##$DATMOD= 1
##$DC= 0
##$DFILT= <>
##$DTYPP= 0
##$F1P= 14.0000005364418
##$F2P= -0.99999901652339
##$FCOR= 0.5
##$FTSIZE= 32768
##$FT_mod= 6
##$GAMMA= 0
##$GB= 0
##$INTBC= 1
##$INTSCL= 1
##$ISEN= 128
##$LB= 0.3
##$LEV0= 0
##$LPBIN= 0
##$MAXI= 10000
##$MC2= 0
##$MEAN= 0
##$ME_mod= 0
##$MI= 0
##$NCOEF= 0
##$NC_proc= -3
##$NLEV= 6
##$NOISF1= 0
##$NOISF2= 0
##$NSP= 0
##$NTH_PI= 0
##$NZP= 0
##$OFFSET= 16.522
##$PC= 1
##$PHC0= 84.71066
##$PHC1= 0.9815229
##$PH_mod= 1
##$PKNL= yes
##$PPARMOD= 0
##$PSCAL= 4
##$PSIGN= 0
##$REVERSE= no
##$SF= 250.13
##$SI= 32768
##$SIGF1= 0
##$SIGF2= 0
##$SINO= 400
##$SIOLD= 32768
##$SREGLST= <1H.CDCl3>
##$SSB= 0
##$STSI= 32768
##$STSR= 0
##$SW_p= 5175.98343685301
##$SYMM= 0
##$S_DEV= 0
##$TDeff= 65536
##$TDoff= 0
##$TI= <Analysis number 999999
Compound Code 99
Book Reference 9
Project Code 9>
##$TILT= no
##$TM1= 0
##$TM2= 0
##$TOPLEV= 0
##$USERP1= <user>
##$USERP2= <user>
##$USERP3= <user>
##$USERP4= <user>
##$USERP5= <user>
##$WDW= 1
##$XDIM= 32768
##$YMAX_p= 341495496
##$YMIN_p= -125186
$$ End of Bruker specific parameters
$$ ---------------------------------
##NTUPLES= NMR SPECTRUM
##VAR_NAME=  FREQUENCY,     SPECTRUM/REAL,   SPECTRUM/IMAG
##SYMBOL=    X,             R,               I
##VAR_TYPE=  INDEPENDENT,   DEPENDENT,       DEPENDENT
##VAR_FORM=  AFFN,          ASDF,            ASDF
##VAR_DIM=   32768,         32768,           32768
##UNITS=     HZ,            ARBITRARY UNITS, ARBITRARY UNITS
##FACTOR=    0.157963299565203, 1,           1
##FIRST=     4132.6476996994, 0,             0
##LAST=      -1043.33573715361, 0,           0
##MIN=       -1043.33573715361, -125186,     0
##MAX=       4132.6476996994, 341495496,     0
$$ Real data points
##PAGE= N=1
##DATA TABLE= (X++(R..R)), XYDATA
$$ [...]
24588E5736l557l1824k0437l500K9954n634k8562j5943L744M327l273K4441J2827
$$ 55736 52179 20355 -82 -3582 26372 20738 -7824 -23767 -20023 -15696 -18969 5472 18299
24575A8299R079K172j3563k2624j678K2115N032l955j0681r765r37Q287l0931
$$ 18299 27378 29550 15987 -6637 -8315 13800 18832 14877 4196 -5569 -6506 1781 -29150
24562b9150J9061L1465j1735k9047p831L4783L3565J1400m2548J7525J1957j9722
$$ -29150 -10089 21376 9641 -19406 -27237 7546 41111 52511 9963 27488 39445 19723
24550A9723L1851O151k7876k9989k4102l0862J2024j751J1371J0642K2264P813
$$ 19723 51574 57725 29849 -140 -24242 -55104 -43080 -44831 -33460 -22818 -554 7259
24538G259k70j453L2971O273n1331j1534J3287J7653l0104O007J6671j8512J6783
$$ 7259 6989 5536 38507 44780 -6551 -18085 -4798 12855 -17249 -11242 5429 -13083 3700
24525C700j3973j7404K0078L4788J3004k462k6845n089k9201k3050k870N1174
$$ 3700 -10273 -27677 -7599 27189 40193 37731 10886 5797 -23404 -46454 -49324 1850
24513A850K1512j29l8853k2477J7641L9710q857j9428K4602M7337J5146p184k7841
$$ 1850 23362 23233 -15620 -38097 -20456 19254 10397 -9031 15571 62908 78054 70870 43029
24500D3029j2860j4052j278K1670j8267m5774J0926m324j439j1826K6354R252
$$ 43029 30169 16117 14839 36509 18242 -27532 -16606 -20930 -22369 -34195 -7841 1411
24488A411N963l123J5442K4744Q826k6373Q262n28J6389J062J6278N004j9054
$$ 1411 7374 4251 19693 44437 53263 26890 35152 34624 51013 52075 68353 73357 54303
24475E4303m512k7864K0327J2105J3121o757k0433o1274k1910K8067K5835k7495
$$ 54303 49791 21927 42254 54359 67480 60723 40290 -20984 -42894 -14827 11008 -16487
24463a6487J4940J8856l4139L615K8666J3843j0285k9400J614K5499O642q017
$$ -16487 -1547 17309 -16830 -13215 15451 29294 19009 -10391 -8777 16722 23364 15347
24451A5347l1406K017K0084J3543p845k0684j1952m165N479J8104M8023K1003
$$ 15347 -16059 -14042 6042 19585 11740 -8944 -20896 -25061 -19582 -1478 46545 67548
24439F7548k9212q304m806k889k765N013q264j4695j9538K3573o953m0407l5596
$$ 67548 38336 30032 25226 22337 19572 24585 16321 1626 -17912 5661 -1292 -41699 -77295
24426g7295J6863M3434K1183j831O093p83j4644K063L0572j3095j1494K324O642
$$ -77295 -60432 -16998 4185 2354 8447 7664 -6980 -4917 25655 12560 1066 3390 10032
24413A0032j570j1371q289p452n083k1555L7323R488n324K3652r761r276R388
$$ 10032 8462 -2909 -11198 -18650 -23733 -45288 -7965 1523 -3801 19851 10090 814 10202
24400A0202J8445N147m502J0730M77J6742k4695l7014j9912L6548p53k0599j5834
$$ 10202 28647 33794 29292 40022 40499 57241 32546 -4468 -24380 12168 11415 -9184 -25018
24387b5018j701M852r206M447j9066J7282M3741N178r148J1243k3643l5872j6625
$$ -25018 -26719 -21867 -31073 -26626 -45692 -28410 15331 20509 11361 22604 -1039 -36911 -53536
24374e3536J5938M651M152n225K7513J6709j0280j1916j8642M06j2314Q436k584
$$ -53536 -37598 -32947 -28795 -34020 -6507 10202 -78 -11994 -30636 -30230 -42544 -34108 -36692
24361c6692J5367K5686J7957O235m0032L080J5182l3678k4762K658J2887J6864
$$ -36692 -21325 4361 22318 28553 -11479 -8399 6783 -26895 -51657 -48999 -36112 -19248
24349a9248j1033m119R446P45m771M136M602M6838K8973l3398m9582O247k842
$$ -19248 -30281 -34400 -24954 -24209 -28980 -24844 -20242 26596 55569 22171 -27411 -21164 -24006
24336b4006J5787J2102j9657j5305q998q52m045N047K1602J3246K6638J8098l8402
$$ -24006 -8219 3883 -15774 -31079 -40077 -40929 -44974 -39927 -18325 -5079 21559 39657 1255
24323A255l1463Q646R577j699l387J4051j2246l9013M6147M4680j905l774l5695
$$ 1255 -30208 -21562 -11985 -13684 -17071 -3020 -15266 -54279 -8132 36548 34643 30869 -4826
24310d826j6258j6400j306Q074J7444j9612p724P196N387K6039j1262k5467j252
$$ -4826 -21084 -37484 -38790 -30716 -13272 -32884 -40608 -33412 -28025 -1986 -13248 -38715 -39967
24297c9967J7293j948J2953J2494O96k7920k7363K24O119J8650J4047J6036R980
$$ -39967 -22674 -24622 -11669 825 1521 -26399 -53762 -53538 -47419 -28769 -14722 1314 11294
24284A1294q800k4571m318k4483j0272q748M3963k1994j9270K3992J3319m296
$$ 11294 2494 -22077 -26395 -50878 -61150 -69898 -25935 -47929 -67199 -43207 -29888 -34184
24272c4184j943Q931j1281J33n594J7221J1694j1194j9273j73j0178L2653n082
$$ -34184 -36127 -27196 -38477 -38344 -43938 -26717 -15023 -26217 -45490 -45663 -55841 -23188 -28270
24259b8270k2921L0283K6473r512l145J263O378L650l0954r080j5278J1573Q735
$$ -28270 -51191 -20908 5565 -3947 -7092 -5829 549 4199 -26755 -35835 -51113 -39540 -30805
24246c0805L0026L571k5469K2440L3029k0393P678j6464n0560L4938K0741k0794
$$ -30805 -779 2792 -22677 -237 32792 12399 20077 3613 -46947 -12009 8732 -12062
24234a2062j0624J5375K1416J848N176k5609j6230K6120J429q659J2682M8764
$$ -12062 -22686 -7311 14105 15953 21129 -4480 -20710 5410 6839 -1820 10862 59626
24222E9626J7149o989j1759k2374j4108j3226J2418q362n914L543k197n833J2064
$$ 59626 76775 69786 58027 35653 21545 8319 20737 12375 6461 10004 7807 1974 14038
24209A4038m955j717q731K6986K7382j476j4215q286j4475k5921l028J8935L3086
$$ 14038 9083 7366 -1365 25621 53003 51527 37312 29026 14551 -11370 -14398 4537 37623
24196C7623J47l9196J0649P089j7227j6708J5978O532q076j2460q975M466J5080
$$ 37623 37770 -1426 9223 16312 -915 -17623 -1645 4887 -3189 -15649 -24624 -20158 -5078
24183e078k812N926M265j822o013J1051K5829J0226j8621l1082k5832j0976J5754
$$ -5078 -7890 -1964 2301 479 -5534 5517 31346 41572 22951 -8131 -33963 -44939 -29185
24170b9185N6320J9005K2403k3212l0055J6688j6676j7110k064K7338k6453p21
$$ -29185 27135 46140 68543 45331 15276 31964 15288 -1822 -3886 23452 -3001 -3722
24158c722K3623L6216M307l4762j9632k9698k402l390K8644k77o029l728k3740
$$ -3722 19901 56117 60424 25662 6030 -23668 -26070 -29460 -816 -1093 -7122 -10850 -34590
24145c4590l329K6630J0099l0866n066K3204M620j6980q880j0493O125P580J4673
$$ -34590 -37919 -11289 -1190 -32056 -37122 -13918 -9298 -26278 -35158 -45651 -39526 -31946 -17273
24132a7273j6379J7840K6834j3643l0232K799M1044J1872j169N098k3544P555
$$ -17273 -33652 -15812 11022 -2621 -32853 -30054 10990 22862 21693 26791 3247 10802
24120A0802J1276J3914M180l8902l6137p816Q877l4213p860J3205M0850J8039
$$ 10802 22078 35992 40172 1270 -34867 -42683 -33806 -68019 -75879 -62674 -21824 -3785
24108c785J7648L8423l1722l171l3686L974l235K1370K3830J2204j2332k451p148
$$ -3785 13863 52286 20564 17393 -16293 -12319 -15554 5816 29646 41850 29518 27067 19919
24095A9919k5278n959J617j7330J3110J7359J599P871J849k224j1824j4655Q206
$$ 19919 -5359 -11318 -9701 -27031 -13921 3438 5037 12908 14757 12533 709 -13946 -5740
24082e740J7238J1384k6973l3659r163l089J6316k0018J6459O3183L0109K805
$$ -5740 11498 22882 -4091 -37750 -46913 -50002 -33686 -53704 -37245 25938 56047 58852
24070E8852k3572j2670j8905P320m533k9376k1221J6379J6231j873k5547L485
$$ 58852 35280 22610 3705 11025 6492 -22884 -44105 -27726 -11495 -13368 -38915 -35430
24058c5430J7244J962L2138K6750j1219k0350j7534l087k3940Q458P11k2255K2694
$$ -35430 -18186 -16224 15914 42664 31445 11095 -6439 -9526 -33466 -25008 -24297 -46552 -23858
24045b3858N119j9258P172L0567O9741K9639m9556m2649l8076r119K5564l5559
$$ -23858 -18739 -37997 -30825 -258 69483 99122 49566 6917 -31159 -40278 -14714 -50273
24033e0273p234O579R648p222O173j962l415K5410L9503J8764j8340J5109J040
$$ -50273 -57507 -50928 -41280 -48502 -42329 -44291 -47706 -22296 17207 35971 17631 32740 33780
24020C3780p797O348R648j886r039r32p734j6117l486J6965j8201m4524j5652
$$ 33780 25983 32331 41979 40093 31054 30122 22388 6271 2785 19750 1549 -42975 -58627
24007e8627K1566R814j8990r549Q152Q206m541m409L1919J7516k6265m8241j4525
$$ -58627 -37061 -27247 -46237 -55786 -47634 -39428 -43969 -48378 -16459 1057 -25208 -73449 -87974
23994h7974L4594k3753j1184K8933L532J4901L950J979N256K1102J3835q137l9486
$$ -87974 -53380 -77133 -88317 -59384 -55852 -40951 -37001 -35022 -29766 -8664 5171 -2966 -42452
23981d2452Q908N4320J7932n978r807R910M953k9487k9707J4087J4528j4607l7067
$$ -42452 -33544 20776 38708 32730 22923 32833 37786 8299 -21408 -7321 7207 -7400 -44467
23968d4467m892J4318J0416Q757Q3L2123q960j4121j8878k6909j2022o544o21
$$ -44467 -49359 -35041 -24625 -15868 -15785 16338 7378 -6743 -25621 -52530 -64552 -71096 -71717
23955g1717p843K538J2238J2315l463J2549J8424K4010L0025K1125k7737l7192
$$ -71717 -79560 -77022 -64784 -52469 -55932 -43383 -24959 -949 29076 50201 22464 -14728
23943a4728K2435N368M320j5536j1583O90k1604J8272R017K981J2400p8M936J9690
$$ -14728 7707 13075 17395 1859 -9724 -9034 -30638 -12366 -3349 -368 12032 11954 16890 36580
23929C6580L943M877j111j4216j8292j1827p585k6217n671J89R778J4199L192
$$ 36580 40523 45400 44289 30073 11781 -46 -7631 -33848 -39519 -39330 -29552 -15353 -12161
23916a2161k3506J3713j139j1535J7590Q654k7982J8471Q145j336O119j433p528
$$ -12161 -35667 -21954 -23093 -34628 -17038 -8384 -36366 -17895 -9750 -11086 -4967 -6400 -13928
23903a3928N779l3201j5956K1318J2420J2470L728k0648J5587L531N455m314j8656
$$ -13928 -8149 -41350 -57306 -35988 -23568 -11098 -7370 -28018 -12431 -8900 -3445 -7759 -26415
23890b6415j5958N664J4743J9497n174K5880L8748j0421k9841K559j5165j7499
$$ -26415 -42373 -36709 -21966 -2469 -7643 18237 56985 46564 16723 19282 4117 -13382
23878a3382J3656k5394l603K2310J4034P107K5026k9356l2895J7944k8107l7662
$$ -13382 274 -25120 -28723 -6413 7621 14728 39754 10398 -22497 -4553 -32660 -70322
23866g0322k5062N0846K9693o525m374j6760l2223P302N1351K2724k511j6372
$$ -70322 -95384 -44538 -14845 -21370 -25744 -42504 -74727 -67425 -16074 6650 4139 -12233
23854a2233n565q94r671J4091K5328K7508j2939k8825k0819q74K553K4032J8587
$$ -12233 -17798 -18692 -28363 -14272 11056 38564 25625 -3200 -24019 -24893 -22340 1692 20279
23841B0279Q102k3475k0684j0136j795r739J5346L5514j2501R856J9213K2358
$$ 20279 28381 4906 -15778 -25914 -27709 -37448 -22102 13412 911 10767 29980 52338
23829E2338r453o203l370j1479j3064r970P348J8479l025k6757k0298J0571O009
$$ 52338 42885 36682 33312 21833 8769 -1201 6147 24626 21601 -5156 -25454 -14883 -8874
23816h874R801K1296K1497J6985k5050l8834k8967j099K2189L3485q309m1608
$$ -8874 927 22223 43720 60705 35655 -3179 -32146 -33245 -11056 22429 14120 -27488
23804b7488K3148J8821j2210k3300J4282K117j5423J585J042K9031Q756J7682
$$ -27488 -4340 14481 2271 -21029 -6747 -4630 -20053 -18468 -17426 11605 20361 38043
23792C8043P858k0021K5415Q39m3447k6971o261J7030N122k0362K9680J3861j1180
$$ 38043 45901 25880 51295 52134 8687 -18284 -24545 -7515 -2393 -22755 6925 20786 9606
23779I606l732k913P488L4386J1775k5253m396j609p507j9603R118K1301k1486
$$ 9606 5874 2961 10449 44835 56610 31357 26961 25352 17845 -1758 7360 28661 7175
23766G175l6585Q613K2698j7605j7479K5902J4735L528J0048j2358k0078k1111
$$ 7175 -29410 -20797 1901 -15704 -33183 -7281 7454 10982 21030 8672 -11406 -32517
23754c2517J6338J9794L6277P40R841n136k9117n0487k3866M3912J2260r215k831
$$ -32517 -16179 3615 39892 40632 50473 45337 16220 -34267 -58133 -14221 -1961 -11176 -14007
23741a4007j4353j4737R339J3600P349J1684K9353p86p158K5446j7589m768P505
$$ -14007 -28360 -43097 -33758 -20158 -12809 -1125 28228 27442 20284 45730 28141 23373 30878
23728C0878k7429j2447n774J0622J4897j978K1406J4783L044j6593k5941q526
$$ 30878 3449 -8998 -14772 -4150 10747 8769 30175 44958 48002 31409 5468 -3058
23716c058L071k4161R559J7339Q612l054m962k8662r275J3741L507m457j6311
$$ -3058 13 -24148 -14589 2750 11362 8308 3346 -25316 -34591 -20850 -17343 -21800 -38111
23703c8111K2228M6068Q086J1258j5339J7834J7442k5444k5636l068k0804r990
$$ -38111 -15883 30185 38271 49529 34190 52024 69466 44022 18386 15318 -5486 -15476
23691a5476K760n08P742J2931J2182j4361j8970p557j6214K4035m3j1038M8677
$$ -15476 -12716 -13224 -5482 7449 19631 5270 -13700 -21257 -37471 -13436 -13479 -24517 24160
23678B4160o382l1716l026j6672l1784M030k99p341L4887J9097j6486j191L5192
$$ 24160 17778 -13938 -16964 -33636 -65420 -61390 -61689 -69030 -34143 -15046 -31532 -32723 2469
23665B469j2939n1770o936N8065J0116k702K8536M347K632k831N906l3092k2338
$$ 2469 -10470 -62240 -69176 -11111 -995 -3697 24839 29186 31818 28987 34893 1801 -20537
23652b0537O167R921r03j1853p927L1374l692k3932m683j2471L631K5570J8180
$$ -20537 -14370 -4449 -5352 -17205 -25132 6242 2550 -21382 -26065 -38536 -34905 -9335 8845
23639H845N982l267p265M455J131j0762k0639J2543l1684k4902K2036K1344K1168
$$ 8845 14827 11560 4295 8750 9881 -881 -21520 -8977 -40661 -65563 -43527 -22183 -1015
23626a015k398r86M007j0673L8288J4380k8750l3798K806K1344K7489L7904R340
$$ -1015 -3413 -4399 -392 -11065 27223 41603 12853 -20945 -18139 3205 30694 68598 77938
23613G7938o519k1925k2097k2989k9091n366j0579K7068J4624k21K123M200l998
$$ 77938 71419 49494 27397 4408 -24683 -30049 -40628 -13560 1064 843 2966 7166 3168
23600C168j9422j4036k2995J0203N967j5465J3915K4721q998j3429J4562K6332
$$ 3168 -16254 -30290 -53285 -43082 -37115 -52580 -38665 -13944 -22942 -36371 -21809 4523
23588D523J8777k076J7344j7620n2456m90K3811m228k55l1289k9004R885L0638
$$ 4523 23300 21224 38568 20948 -31508 -31998 -8187 -12415 -12670 -43959 -72963 -63078 -32440
23575c2440o415o294J1759j461M2788M0138J6257j9039j0799j0802N536J1554
$$ -32440 -38855 -45149 -33390 -34851 7937 48075 64332 45293 34494 23692 29228 40782
23563D0782J9961l7400l1388j6871J7059M555K4840q05j803n419L167r219l378
$$ 40782 60743 23343 -8045 -24916 -7857 -3302 21538 20733 18930 13511 16678 7459 4081
23550D081P960N1696n117k9927l5671k6528R217K8124L9632Ok4547j1005O711
$$ 4081 12041 63737 58620 28693 -6978 -33506 -24289 3835 43467 43473 18926 7921 14632
23537A4632J9590J8804k6191k9451j1439l669L6405K851k6051j5746j6479k0740
$$ 14632 34222 53026 26835 -2616 -14055 -17724 18681 21532 -4519 -20265 -36744 -57484
23525e7484R073L8641P414q520j3438O47M1536L168J7543l6022k1199J1042j5907
$$ -57484 -48411 -9770 -2356 -10876 -24314 -23667 17869 21037 38580 2558 -18641 -7599 -23506
23512b3506j2267O716N331K317N868R089J4136J2616Q876r83j9672n875j17K8027
$$ -23506 -35773 -29057 -23726 -21409 -15541 -6452 7684 20300 29176 28193 8521 2646 2529 30556
23498C0556J469l5945J6503q476l464J4147m6851k6495J7081J6334K2719J6080
$$ 30556 32025 -3920 12583 4107 643 14790 -32061 -58556 -41475 -25141 -2422 13658
23486A3658J8435J1782M4092K41j7101j1345l9069p748J451J2725K963j1886K1678
$$ 13658 32093 43875 87967 88208 71107 59762 20693 12945 14396 27121 30084 18198 39876
23473C9876j4995k2475K2711R040J3377q833l51j0m843k1367R673J4241J3621
$$ 39876 24881 2406 25117 34157 47534 38701 38350 38340 33497 12130 21803 36044 49665
23460D9665l5261j475j0452K5477M252k8409j397M180r549j2012k6098j4182K6913
$$ 49665 14404 12929 2477 27954 32206 3797 2400 6580 -2969 -14981 -41079 -55261 -28348
23447b8348L3553J3731K763J5940k7604l946j598n546o246j2028R692K6133K6788
$$ -28348 5205 18936 21699 37639 10035 6089 4491 -1055 -7301 -19329 -9637 16496 43284
23434D3284L0979m2311m3062p99k3279j393k633J9175K3032K8482J5641j8213
$$ 43284 74263 31952 -11110 -11909 -35188 -36581 -39214 -20039 2993 31475 47116 28903
23422B8903j5553J1442P002J9988J332j0132j3676p186k1912k5743P022J4315
$$ 28903 13350 24792 31794 51782 53114 42982 29306 22120 208 -25535 -18513 -4198
23410d198L5408J6560j4067l9415k1250Q239J7724m751q831q08k8116N108K6468
$$ -4198 31210 47770 33703 -5712 -26962 -18723 -999 -5750 -14581 -15389 -43505 -38397 -11929
23397a1929j138J6360j2503j4473R075N095j4231J0598N08R783o248r433N874
$$ -11929 -13067 3293 -9210 -23683 -14608 -9513 -23744 -13146 -12638 -2855 -9103 -18536 -12662
23384a2662J8379j2759k5360K4097j207j030j2016j8884k4888N20J0625P333K0982
$$ -12662 5717 -7042 -32402 -8305 -9512 -10542 -22558 -41442 -66330 -65810 -55185 -47852 -26870
23371b6870J5341K2377j4884l6741P43j4287L077K0936J3557j5039k7586j719
$$ -26870 -11529 10848 -4036 -40777 -40034 -54321 -51244 -30308 -16751 -31790 -59376 -61095
23359f1095K4226r760L3901K1445K0129J423m3573j417L153l359M553Q808J974
$$ -61095 -36869 -46629 -12728 8717 28846 30269 -13304 -14721 -11568 -14927 -10374 -1566 408
23346D08p220O277j2385j2809j5630j561K509j0506J166j06k280L718k6045J5266
$$ 408 -6812 -535 -12920 -25729 -41359 -42920 -40411 -50917 -49751 -49857 -52137 -48419 -74464 -59198
23332e9198J2251Q596J4927k1183m490J4258P408O956M139J1764Q768m7457k8881
$$ -59198 -46947 -38351 -23424 -44607 -49097 -34839 -27431 -20475 -16336 -4572 4196 -43261 -72142
23319g2142K1469N779K9451J1441q138j0533k172L505M0863R826p507r244k1820
$$ -72142 -50673 -44894 -15443 -4002 -12140 -22673 -24845 -21340 19523 29349 21842 12598 -9222
23306i222m352L4521O170L252k4987J070K585P854L2840J6282l4051k0458O700
$$ -9222 -13574 20947 27117 30369 5382 6452 9037 16891 49731 66013 31962 11504 18204
23293A8204k6916J989J2614K0431l1703k3184N304O073m304j9553m0572O039J2902
$$ 18204 -8712 -6723 5891 26322 -5381 -28565 -23261 -17188 -21492 -41045 -81617 -75578 -62676
23280f2676K0764M3996J2763n918O464M800r753p551J2590m81l3899j1757k6124
$$ -62676 -41912 2084 14847 8929 15393 20193 10440 2889 15479 14998 -18901 -30658 -56782
23267e6782J3463K8743J1828J527J5711J3923J0050l1511l0684J5983K0964k1706
$$ -56782 -43319 -14576 -2748 -1221 14490 28413 38463 6952 -23732 -7749 13215 -8491
23255h491o302K4137K563j1864j5295j9457K2391j5303L1680J6792m531J3441
$$ -8491 -14793 9344 11907 43 -15252 -34709 -12318 -27621 4059 20851 16320 29761
23243B9761k32J2743Q176k9531m52k980k7267R96K6867J8958q581k2138j1276
$$ 29761 29529 42272 50448 20917 20465 17485 -9782 -8786 18081 37039 28458 6320 -4956
23230d956J1342L893j186j0045m2544l021K8709M6475L2205k610j6341O383j6884
$$ -4956 6386 10279 9093 -952 -43496 -46517 -17808 28667 60872 58262 41921 48304 31420
23217C1420n194P94j5685M12P674J0390N444m1758N725K3453k4872l2851J4094
$$ 31420 26226 27020 11335 11747 19421 29811 35255 -6503 -778 22675 -2197 -35048 -20954
23204b0954K2497R219p126r340k5424k6632Q423J011J6137J9861M2279J0052k3170
$$ -20954 1543 10762 3636 -5704 -31128 -57760 -49337 -48326 -32189 -12328 29951 40003 16833
23191A6833m1476k0805M592J0168q410k3504J3495J7122R802J3970J6136J4628
$$ 16833 -24643 -45448 -40856 -30688 -39098 -62602 -49107 -31985 -22183 -8213 7923 22551
23179B2551l9860j4244K6604n226J1412N88L3790o44k1745k463k7756p945L2153
$$ 22551 -17309 -31553 -4949 -10175 1237 1825 35615 34971 13226 10763 -16993 -24938 7215
23166G215P661L451K578R173p791J1967J7271j2125j8904j9267l6836q664J9208
$$ 7215 14876 18327 20905 30078 22287 34254 51525 39400 20496 1229 -35607 -44271 -25063
23153b5063J6705J8006k914j6774j1079j9399r006J2285J818J9641O571J0741
$$ -25063 -8358 9648 6734 -10040 -21119 -40518 -49524 -37239 -35421 -15780 -9209 1532
23141A532P474l3176J7256J7699K4861k1471J350K1348O587k3677m1508o472K5049
$$ 1532 9006 -24170 -6914 10785 35646 14175 15525 36873 43460 19783 -21725 -28197 -3148
23128c148P466j9454q494J0504K2098J7835k3633j0139J8209K028l1520j1788
$$ -3148 4318 -15136 -23630 -13126 8972 26807 3174 -6965 11244 13272 -18248 -30036
23116c0036j1937P218L6775q49P308K4635j0595k7378K9265J3630J2096j2461
$$ -30036 -41973 -34755 2020 1171 8479 33114 22519 -4859 24406 38036 50132 37671
23104C7671j1589j0529k535q464j9033k9194P040L3044k508k1573J1367J7064
$$ 37671 26082 15553 13018 4554 -14479 -43673 -36633 -3589 -6097 -27670 -16303 761
23092G61K8985j492l8637k4098K5570J1094p717K0677L34k893k4335J5729o897
$$ 761 29746 28254 -10383 -34481 -8911 2183 -5534 15143 15477 12584 -11751 3978 -2919
23079b919q912J296R236n620n869Q887N996j5438r075k6202o798M0867J4310j9413
$$ -2919 -11831 -10535 -1299 -6919 -12788 -3901 2095 -13343 -22418 -48620 -55418 -14551 -241 -19654
23065a9654k0279m6K9956Q870K0272N634k6494l9231J2275j2324K7561J3999O822
$$ -19654 -39933 -39979 -10023 -1153 19119 24753 -1741 -40972 -28697 -41021 -13460 539 7361
23052G361J2845J2818m0501j2867M947n077J0565J7442j9435j6358p125m947M0919
$$ 7361 20206 33024 -7477 -20344 -15397 -20474 -9909 7533 -11902 -28260 -35385 -40332 587
23039E87P161J2294J9506J0410oj3888k4984J8274J7095l8182J4560J1329N829
$$ 587 7748 20042 39548 49958 49952 36064 11080 29354 46449 8267 22827 34156 39985
23026C9985j3923j5289k6430j3058L5581m318o783J0998K4902k961j9491j8931
$$ 39985 26062 10773 -15657 -28715 6866 2548 -4235 6763 31665 28704 9213 -9718
23014i718J0810J4086K1314K5335k594J818Q872n802j2364k963j1619l8454p224
$$ -9718 1092 15178 36492 61827 59233 61051 69923 64121 51757 48794 37175 -1279 -8503
23001h503j8833Q37m17O731J5504J9488K921k7867k1876j3657k1378P488L9376
$$ -8503 -27336 -26499 -26916 -20185 -4681 14807 17728 -10139 -32015 -45672 -67050 -59562 -20186
22988b0186O067L278q097k2849J1046L3025j496O763j5404m2580j2878K1959n733
$$ -20186 -14119 -10841 -18938 -41787 -30741 2284 788 7551 -7853 -50433 -63311 -41352 -47085
22975d7085J0240M6970L0037j779j2874j7799l0963N93J1726J822J3904K7427
$$ -47085 -36845 10125 40162 38383 25509 7710 -23253 -22660 -10934 -9112 4792 32219
22963C2219L176j4774J1763O569k805n37l7702j0982j8339j4563R751K8392J5605
$$ 32219 35395 20621 32384 38953 36148 35611 -2091 -13073 -31412 -45975 -36224 -7832 7773
22950G773l2094j0891j4804L9990L3556k4177k7025J0254K0239Q630l393q698
$$ 7773 -24321 -35212 -50016 -10026 23530 -647 -27672 -17418 2821 11451 8058 -640
22938f40J2199J3021N186j0526j8830m3843q882L7709J7211m327k1666o465L6414
$$ -640 11559 24580 29766 19240 410 -43433 -52315 -14606 2605 -1722 -23388 -29853 6561
22925F561j5349k6097J7072L4015K5134Q30j4210l4039j1252k9743J9941J8134
$$ 6561 -8788 -34885 -17813 16202 41336 42166 27956 -6083 -17335 -47078 -27137 -9003
22913i003j188k6417l14J6171P844j1141l854P385L9156O505j6701j7700K879
$$ -9003 -10191 -36608 -36922 -20751 -12907 -24048 -27902 -20517 18639 25144 8443 -9257 -6378
22900f378J2564k2959n228K027J4975J1613O53k7446j5218j1383R267O209o555
$$ -6378 6186 -16773 -22001 -19974 -4999 6614 7267 -20179 -35397 -46780 -37513 -31304 -37859
22887c7859K6072K1103J0856j1937J5229j4576j2023N4594L6179l8267l1928l5341
$$ -37859 -11787 9316 20172 8235 23464 8888 -3135 51459 87638 49371 17443 -17898
22875a7898j9938N029j1973K7390K7037L436O543j0486k0448j475L5606K7064
$$ -17898 -37836 -32807 -44780 -17390 9647 13083 19626 9140 -11308 -12783 22823 49887
22863D9887j5086j9002j4051r754P463J6351o09m0152k9777K736R631J5794J0372
$$ 49887 34801 15799 1748 -8006 -543 15808 15199 -24953 -54730 -51994 -42363 -26569 -16197
22850a6197m894j450n825R808J4157J3007K9150j8221k5863L989J5007j7821k4793
$$ -16197 -21091 -22541 -28366 -18558 -4401 8606 37756 19535 -6328 -2339 12668 -5153 -29946
22837b9946P236m749J3265K2198k1143r147j1570j3828L749K0986l96J0040K0213
$$ -29946 -22710 -27459 -14194 8004 -13139 -22286 -33856 -47684 -43935 -22949 -23345 -13305 6908
22824F908N296K1273N058j6548J3300n54j8403k2459j8222k0537K0386J7571K3576
$$ 6908 12204 33477 38535 21987 35287 34733 16330 -6129 -24351 -44888 -24502 -6931 16645
22811A6645l172K0117Q744J6230k079l6129l8172k6549K1382Q141J0488q468n120
$$ 16645 13473 33590 42334 58564 56485 20356 -17816 -44365 -22983 -14842 -4354 -12822 -17942
22798a7942J6251p248m120J951N162j1725K6086L1844O09K231k2844k944P741
$$ -17942 -1691 -8939 -13059 -11108 -5946 -17671 8415 40259 40868 43099 20255 17311 25052
22785B5052j1679j0599o242K298J7179j2689m0915r145K0484q809R275K4797P283
$$ 25052 13373 2774 -3468 -1170 16009 3320 -37595 -46740 -26256 -35065 -25790 -993 6290
22772F290K1580p800O527k0408l631J7215j664m4005k44J0779j6549j3840j9443
$$ 6290 27870 20070 26597 6189 2558 19773 18109 -25896 -26140 -15361 -31910 -45750 -65193
22759f5193N59K3763L1133J3769L18q220r219J7721R096r22K74k2466k4140q131
$$ -65193 -64634 -40871 -9738 4031 4349 -3871 -13090 4631 13727 12805 13079 -9387 -33527 -41658
22745d1658J5304J0718j0939R070K2222J5908n502l7861j2641O580j5208K4932
$$ -41658 -26354 -15636 -26575 -17505 4717 20625 15123 -22738 -35379 -28799 -44007 -19075
22733a9075L0272q05O480O156J8837j9207p075j9786J3564J7342q923L717j4364
$$ -19075 11197 10392 16872 23028 41865 22658 15583 -4203 9361 26703 17780 21497 7133
22720G133K229j7826k6226j5010K1870J3276R809J3900j8068j1492J5416Q242
$$ 7133 9362 -8464 -34690 -49700 -27830 -14554 -4745 9155 -8913 -20405 -4989 3253
22708C253k6327j9552K787J3321J4151j7356K4319K657k1540m035o658K0466K862
$$ 3253 -23074 -42626 -39839 -26518 -12367 -29723 -5404 -2747 -24287 -28322 -34980 -14514 -11652
22695a1652j5594n580O175j3667l267K9688J1392O616J7270N755R378K2331k597
$$ -11652 -27246 -32826 -26651 -40318 -43585 -13897 -2505 4111 21381 27136 36514 58845 56248
22682E6248j9956j0388m052k0844k1263j4303K3578P917n623m9933K1682K9135
$$ 56248 36292 25904 21852 1008 -20255 -34558 -10980 -3063 -8686 -58619 -36937 -7802
22670g802k685L7667K1742k1832l2772j6533j897l244K4129K4514M604o149J398
$$ -7802 -10487 27180 48922 27090 -5682 -22215 -24112 -27356 -3227 21287 25891 19742 21140
22657B1140K3447p351j5997p752j4881m125m37j7231p95O381R187K2241k049M5434
$$ 21140 44587 37236 21239 13487 -1394 -5519 -5956 -23187 -23982 -17601 -8414 13827 11778 57212
22643E7212M019j6163k5845k3805O846J9416R862j137N207L507k6882l8884J2774
$$ 57212 61231 45068 19223 -4582 2264 21680 31542 30405 35612 39119 12237 -26647 -13873
22630a3873L5716j1364m556J5213N363J6671j8640K3196j6766j2019j1948k4694
$$ -13873 21843 10479 5923 21136 26499 43170 24530 47726 30960 18941 6993 -17701
22618a7701j8277k638P469K0358j0399P016K3155k6503P280K4612M2642k0726
$$ -17701 -35978 -38616 -31147 -10789 -21188 -14172 8983 -17520 -10240 14372 57014 36288
22606C6288m7474J1902k190j3436j118M5665J3717P478p085k1918j9325L489P633
$$ 36288 -11186 716 -1474 -14910 -16028 29637 43354 50832 43747 21829 2504 5993 13626
22593A3626R276m560J188k4506l7487l712L385K1221j8860k2641J8584K5504N4802
$$ 13626 22902 18342 19530 -4976 -42463 -46175 -42790 -21569 -40429 -63070 -44486 -18982 35820
22580C5820Q721j7800k4972N128J2317n73l824j8962k2726n43J2785Q236J5545
$$ 35820 44541 26741 1769 6897 19214 18641 14817 -4145 -26871 -27414 -14629 -6393 9152
22567I152l470q708P8k5739Q338k6603J1302L1176N829k8824K287j1481l194Q18
$$ 9152 5682 -3026 -2948 -28687 -20349 -46952 -35650 -4474 1355 -27469 -25182 -36663 -39857 -39039
22553c9039K0569J7632J7722j0727j2378j3517M067J925K1914L1677j8444q964
$$ -39039 -18470 -838 16884 6157 -6221 -19738 -15671 -13746 8168 39845 21401 12437
22541A2437j021Q296k1027p704J5911J8305j2344q203j843L033q256q024J4424
$$ 12437 11416 19712 -1315 -9019 6892 25197 12853 4650 2807 5840 -2416 -10440 3984
22528C984j4810j4480L131n042q752L991J632J1633k4063m000m590J7069L2923
$$ 3984 -10826 -25306 -22175 -27217 -35969 -31978 -30346 -18713 -42776 -46776 -51366 -34297 -1374
22515a374p595J8100J9856K113j5778n240K9560o679j7317j2187k6355j8729k586
$$ -1374 -8969 9131 28987 31100 15322 10082 39642 32963 15646 3459 -22896 -41625 -44211
22502d4211r472K2587J4304k70k848J4498K1356K2122R431j4280k2672o710J0697
$$ -44211 -53683 -31096 -16792 -17062 -19910 -5412 15944 38066 47497 33217 10545 3835 14532
22489A4532m449j9178m3991K437K8101R796j3305J766M3787j2642J4386K3574
$$ 14532 10083 -9095 -53086 -50649 -22548 -12752 -26057 -24291 19496 6854 21240 44814
22477D4814j6271k5807J614K2551l1654r845Q943J1802J5536j4453K377K1944
$$ 44814 28543 2736 4350 26901 -4753 -14598 -5655 6147 21683 7230 9607 31551
22465C1551K6239J4690j5959n2123j4125J3268L304L319j6080K5086N958n973
$$ 31551 57790 72480 56521 4398 -9727 3541 6845 10164 -5916 19170 25128 19155
22453A9155k977k7290K8317j149j8077j8597j1623J3428j8160O334r00j7830K0945
$$ 19155 16178 -11112 17205 16056 -2021 -20618 -32241 -18813 -36973 -30639 -31539 -49369 -28424
22440b8424J4902k4152Q462J868Q97K691J5965n891l1318R263L7862n799j6509
$$ -28424 -13522 -37674 -29212 -27344 -26447 -23756 -7791 -13682 -45000 -35737 2125 -3674 -20183
22427b0183K6069K191r440m407j0202K582J7538K2100k155j3894O311j1579j8603
$$ -20183 5886 8077 -1363 -5770 -15972 -13390 4148 26248 24093 10199 16510 4931 -13672
22414a3672J2852M539N18r819J5028L0124q646p940j2211l0110n96l963o805K5389
$$ -13672 -820 3719 4237 -5582 9446 39570 30924 22984 10773 -19337 -19933 -23896 -30701 -5312
22400e312L5884L14l4008k6597k3571J448K7605O286K1125K5807j4832J7834J1722
$$ -5312 30572 30886 -3122 -29719 -53290 -51842 -24237 -17951 3174 28981 14149 31983 43705
22387D3705M40j4877o480r621r377l2653r971N267J0461J8861J4941K0220k3608
$$ 43705 44145 29268 22788 13167 3790 -28863 -38834 -33567 -23106 -4245 10696 30916 7308
22374G308k0361L0971J812n629k3570J549N300L907p672m863k809r481J9932r627
$$ 7308 -13053 17918 19730 14101 -9469 -7920 -2620 1287 -6385 -11248 -14057 -23538 -3606 -13233
22360a3233P318j984Q396J3141k825j9334j1740L3532N533l4086K989K2073K9792
$$ -13233 -5915 -7899 497 13638 10813 -8521 -20261 13271 18804 -15282 -12293 9780 39572
22347C9572N588q549m6789k8201o35K0182r23O227k139j1962p933m41J2248Q513
$$ 39572 45160 36611 -10178 -38379 -39014 -18832 -19755 -13528 -15667 -27629 -35562 -36003 -23755 -15242
22333a5242m247j6013r754J7812J2637L347J0737o04k634n396J242L99P119k2467
$$ -15242 -19489 -35502 -45256 -27444 -14807 -11460 -723 -1327 -3961 -9357 -8115 -7716 -597 -23064
22319b3064l730L3383k943J9285K314P780K0714j4089j2237L1482N317k5356r939
$$ -23064 -26794 6589 3646 22931 25245 33025 53739 39650 27413 58895 64212 38856 28917
22306B8917l2693M797O344o250J0391N592j222J5478K112k3183r404r191m744
$$ 28917 -3776 1021 7365 1115 11506 17098 15876 31354 33466 10283 879 -8312 -13056
22293a3056k533j8001j1244J0315M1957P10j7354P839k0407L564J4684O588M464
$$ -13056 -15589 -33590 -44834 -34519 7438 8148 -9206 -1367 -21774 -18210 -3526 3062 7526
22280G526N513Q247k2259O986L1945J5605k9065j6029j801k2353k4970k476R958
$$ 7526 13039 21286 -973 6013 37958 53563 24498 8469 6668 -15685 -40655 -43131 -33173
22267c3173J7509J8822l0100l429J6557K7597J1895p620Q34J059k1592Q186j5183
$$ -33173 -15664 3158 -26942 -30371 -13814 13783 25678 18058 18892 19951 -1641 6545 -8638
22254h638j4767N318M117O617R083J6303J235k0194k2862l3231j3808o528J0102
$$ -8638 -23405 -18087 -13970 -7353 1730 18033 19268 -926 -23788 -57019 -70827 -77355 -67253
22241f7253L1953K2973k229k4902m288p324j0310J3633Q627K2617J6308J187O908
$$ -67253 -35300 -12327 -14556 -39458 -43746 -51070 -61380 -47747 -39120 -16503 -195 992 7900
22228G900k5523k1741R226K7261m438k6976k4963K7404Q286L868Q604J5687J2539
$$ 7900 -17623 -39364 -30138 -2877 -7315 -34291 -59254 -31850 -23564 -19696 -11092 4595 17134
22215A7134J2070R263P347j9499J2673J9971k3104p513j4930K0927L4249j5510
$$ 17134 29204 38467 45814 26315 38988 58959 35855 28342 13412 34339 68588 53078
22203E3078j4405J2149j1784q778R627r121m62j2664j4500l285n217J3587J6373
$$ 53078 38673 50822 39038 30260 39887 30766 30304 17640 3140 -145 -5362 8225 24598
22190B4598o68l879Q887k8402r953q740M013J5366q275K0003J104R226k276k4577
$$ 24598 23930 20051 28938 536 -9417 -18157 -14144 1222 -7053 12950 14054 23280 21004 -3573
22176c573J2795K5929k7623l9866l477J1670K2568K2556Q726P246R098p278j9221
$$ -3573 9222 35151 7528 -32338 -35815 -24145 -1577 20979 29705 36951 46049 38771 19550
22163A9550q187l5210j0323K8170j4624j4929K9106J9860L3488k7388k9003j6205
$$ 19550 11363 -23847 -34170 -6000 -20624 -35553 -6447 13413 46901 19513 -9490 -25695
22151b5695K0182M7159k6318k7419q438j1824P843L6319m47j5120N345K160l216
$$ -25695 -5513 41646 15328 -12091 -20529 -32353 -24510 11809 11362 -3758 1587 3747 531
22138E31n4j0841j4148J4087M256k0182K0295K6790k7772j8382K7471L8460k273
$$ 531 477 -10364 -24512 -10425 -6169 -26351 -6056 20734 -7038 -25420 2051 40511 38238
22125C8238k6498L716J6090K8454R387k5187l3825j6302p060J1260j874j4136
$$ 38238 11740 15456 31546 60000 69387 44200 10375 -5927 -12987 -1727 -3601 -17737
22113a7737J3847m15K4033N954j2700J8942M824k9138j3741l5211K3767J4654
$$ -17737 -3890 -4305 19728 25682 12982 31924 36748 7610 -6131 -41342 -17575 -2921
22101b921o505L853o870q566m7171j8598p606l017K2416K7832L5321r696j9530
$$ -2921 -9426 -5573 -12443 -21009 -68180 -86778 -94384 -97401 -74985 -47153 -11832 -21528 -41058
22088d1058j8035o387L1352P444J0689J0067o026K6001L463j8982K7012r261l0044
$$ -41058 -59093 -65480 -34128 -26684 -15995 -5928 -11954 14047 17510 -1472 25540 16279 -13765
22075a3765j1437o169k045J3873L1794k7524j4484J8634K206q265o64K080J2442
$$ -13765 -25202 -31371 -33416 -19543 12251 -15273 -29757 -11123 -8917 -17182 -17846 -15766 -3324
22062c324J3818J4063J7416j2388j8515j613J1689j0755k75J7026J0087J2303
$$ -3324 10494 24557 41973 29585 11070 9457 21146 10391 10116 27142 37229 49532
22050D9532j3521l4203l1526o320J323j0615J4865p408j1223R673R686L1846K987
$$ 49532 36011 1808 -29718 -36038 -34715 -45330 -30465 -37873 -49096 -39423 -29737 2109 5096
22037E096k5506j3111l129J2833O546N105O174k280k4373J6848L5840J588l7400
$$ 5096 -20410 -33521 -36650 -23817 -17271 -12166 -5992 -8272 -32645 -15797 20043 21631 -15769
22024a5769q952q176R616r192k096M185J435j607K457p446K9152J5214Q853p362
$$ -15769 -24721 -32897 -23281 -32473 -34569 -30384 -28949 -30556 -28099 -35545 -6393 8821 17674 10312
22010A0312l1460J4840K6118J3176m800L5k1246j2177R040J3214r333n547r74
$$ 10312 -21148 -6308 19810 32986 28186 28221 6975 -5202 3838 17052 7719 2172 1198
21997A198p899l0496k3260j348J1216K2386L3084K83L4702j0100m1128M431j8932
$$ 1198 -6701 -37197 -60457 -61805 -50589 -28203 4881 5164 39866 29766 -11362 -6931 -25863
21984b5863J2674j7173N655J4836J1966K603K5409J0801P962k1684k0037O534
$$ -25863 -13189 -30362 -24707 -9871 2095 4698 30107 40908 48870 27186 7149 13683
21972A3683R913M232J1108k715Q983k2590k2005j4613j2464J1901J3440m208l4139
$$ 13683 23596 27828 38936 36221 45204 22614 609 -14004 -26468 -14567 -1127 -5335 -39474
21959c9474j4947K6777N39P276J1015j7992j0557j5108L3210M711O289k528K2013
$$ -39474 -54421 -27644 -27105 -19829 -8814 -26806 -37363 -52471 -19261 -14550 -8261 -10789 11224
21946A1224L468J3267K1733k0375j9614J6684K6263O363m2534k499R383j8526
$$ 11224 14692 27959 49692 29317 9703 26387 52650 59013 16479 13980 23363 4837
21934D837p599J6594K2499j356m9196l2509R7M553K1880K0060L0227j3593q106
$$ 4837 -2762 13832 36331 34975 -14221 -46730 -46633 -42080 -20200 -140 30087 16494 8388
21921H388L3546M561k1378k1064J1233L7578J3564j9979q556k2626m3615o870
$$ 8388 41934 46495 25117 4053 15286 52864 66428 46449 37893 15267 -28348 -35218
21909c5218K2477M717J1109Q231m135r195q480j5637J7186j392J4757j786k8672
$$ -35218 -12741 -8024 3085 11316 7181 -2014 -10494 -26131 -8945 -10337 4420 2634 -26038
21896b6038k4782j0074J4318M8796O383j5633j7029k6874k18J4068M5377J1995
$$ -26038 -50820 -60894 -46576 2220 8603 -7030 -24059 -50933 -51151 -37083 8294 20289
21884B0289J0259l072j9529k403J3225j9569l7599K857L2858l049j5017j2269
$$ 20289 30548 27476 7947 5544 18769 -800 -38399 -35542 -2684 -5733 -20750 -33019
21872c3019M0302K2265n799N479K0294n166j5032l2727L737j818J1891K247J0870
$$ -33019 7283 29548 23749 29228 49522 44356 29324 -3403 334 -1484 10407 12654 23524
21859B3524j0938o543J0108K2196j2914j6910j7388K0085K091J530r565k7190
$$ 23524 12586 6043 16151 38347 25433 8523 -8865 11220 13311 14841 5276 -21914
21847b1914J2437M0421L3778r151k7377k023K9861j3522J570J6897j5417J0121
$$ -21914 -9477 30944 64722 55571 28194 26171 56032 42510 44080 60977 45560 55681
21835E5681J1806j942m3164j7181M860n538J4892J1022N502O954k4662p770l9783
$$ 55681 67487 65545 22381 5200 10060 4522 19414 30436 35938 42892 18230 10460 -29323
21822b9323j5406J9014O648j7161l07K5646J3604K4536M959j228j5634r498o686
$$ -29323 -44729 -25715 -19067 -36228 -36535 -10889 2715 27251 32210 30982 15348 5850 -836
21809h36R120j2592k0890M951K3331J2494k1733P188J5410m298Q130j1606N078
$$ -836 8284 -4308 -25198 -20247 3084 15578 -6155 1033 16443 12145 20275 8669 13747
21796A3747N901k1318l9589J8791K1902J1562R080j324j0737l193j2040k6825
$$ 13747 19648 -1670 -41259 -22468 -566 10996 20076 18752 8015 4822 -7218 -34043
21784c4043J358J6038J6373O459n509j6648j2974j0207q506K9936K4717k5293
$$ -34043 -32685 -16647 -274 6185 676 -15972 -28946 -39153 -47659 -17723 6994 -18299
21772a8299k6959J0951L0343O495q30o142L4631J1719k1640J2320K6130o173l5819
$$ -18299 -45258 -34307 -3964 2531 1701 -4441 30190 41909 20269 32589 58719 52546 16727
21759A6727j3970Q727K4025n678m3421J3956J7203j0766J5746Q767j9768j1681
$$ 16727 2757 11484 35509 29831 -13590 366 17569 6803 22549 31316 11548 -133
21747a33p176J1530J1664K229p69l4207j2508M45O150J410K5831J5723j8825j4623
$$ -133 -7309 4221 15885 18114 17345 -16862 -29370 -28925 -22775 -21365 4466 20189 1364 -13259
21733a3259r827j46L867K927k8164j2389M7437M4098L4231l4788j5047j2074r966
$$ -13259 -23086 -23232 -19365 -16438 -44602 -56991 -9554 34544 68775 33987 18940 6866 -3100
21720c100p601R048L2443O138k0292j0740k189l882k8697m835P533J0804J6607
$$ -3100 -10701 -1653 30790 36928 16636 5896 3707 -175 -28872 -33707 -26174 -15370 1237
21707A237K2934p056P709m642K445j6852k2448k2755m33K936l826L4025Q581L348
$$ 1237 24171 17115 24824 20182 22627 5775 -16673 -39428 -39861 -36925 -40751 -6726 1855 5203
21693E203M1057Q836j3813j5108j3112k9871L269k311N323K3418Q027J1986K1144
$$ 5203 46260 55096 41283 26175 13063 -16808 -13539 -15850 -10527 12891 20918 32904 54048
21680E4048k9778l2458K4583K3493j5721K1058N333J0831K830l4900k4951p593
$$ 54048 24270 -8188 16395 39888 24167 45225 50558 61389 64219 29319 4368 -3225
21668c225p61N182j9597l4171J2531J9075J1609j8284K7216J2468j207J7657L499
$$ -3225 -3986 1196 -18401 -52572 -40041 -20966 -9357 -27641 -425 12043 10836 28493 31992
21655C1992J0246k5031m8414m267J4153k7713r548P932J7874J8578K3843J6899
$$ 31992 42238 17207 -31207 -35474 -21321 -49034 -58582 -50650 -32776 -14198 9645 26544
21643B6544K1124k9452l6767n530J1695K657K2520n870l335J795j3274j0407r424
$$ 26544 47668 18216 -18551 -24081 -12386 -9729 12791 6921 3586 5381 -7893 -18300 -27724
21630b7724N531j9368j4254k977J5896L7136L3399J732j3618k2879l8307k5896
$$ -27724 -22193 -41561 -55815 -58792 -42896 -5760 27639 29371 15753 -7126 -45433 -71329
21618g1329K6282J4794m352K1611K3603K2051k52p091j1079q680J4669j9067Q2
$$ -71329 -45047 -30253 -34605 -12994 10609 32660 32408 25317 14238 5558 20227 1160 1242
21605A242j2024L73K3162L534k750l7558L0982L356m8001J714R092N3082j0454
$$ 1242 -10782 -10409 12753 16287 13537 -24021 6961 10317 -37684 -35970 -26878 26204 15750
21592A5750q708J2788M286K3688k758k580k0009k1725P68j8408p490Q875k1623
$$ 15750 7042 19830 24116 47804 45046 42466 22457 732 1500 -16908 -24398 -15523 -37146
21579c7146n217Q935P674P322K6631L1684j0245k2767l585Q457m13k29k5362J9153
$$ -37146 -42363 -33428 -25754 -18432 8199 39883 29638 6871 3286 11743 11330 11101 -14261 4892
21565D892J2631N394O030J5089O195k5246l2650j8746K6299j2105r564K5410K9356
$$ 4892 17523 22917 28947 44036 50231 24985 -7665 -26411 -112 -12217 -21781 3629 32985
21552C2985K7365j2102k6816j3274j1005M485J0543q558j0016K0814M8021K656
$$ 32985 60350 48248 21432 8158 -2847 1638 12181 3623 -6393 14421 62442 65098
21540F5098l8298N869n250k5767j5759J1753M52M464J7758r501M499k265L696
$$ 65098 26800 32669 27419 1652 -14107 -2354 -1902 2562 20320 10819 15318 13053 16749
21527A6749J2375j8660M349O927j8216q305L5098p51j3105O905m561k2877J1722
$$ 16749 29124 10464 14813 21740 3524 -4781 30317 29566 16461 23366 18805 -4072 7650
21514G650j3651K735l200J9665L6424Q228m858o844l857K296q731j720p519p405
$$ 7650 -6001 -3266 -6466 13199 49623 57851 52993 46149 42292 44588 35857 34137 26618 19213
21500A9213O731j2070j6855m161j6516k6225P307M3746J8749o642j6401k0846
$$ 19213 25944 13874 -2981 -7142 -23658 -49883 -42576 1170 19919 13277 -3124 -23970
21488b3970o9j6730K6531P718q131n24j0107l871K1317J5357o302J0103j4004
$$ -23970 -24039 -40769 -14238 -6520 -14651 -15175 -25282 -29153 -7836 7521 1219 11322 -2682
21475b682k6800J2255K1761J1140l149k922m601K466Q849o11P539k5175j1724
$$ -2682 -29482 -17227 4534 15674 12525 9603 5002 7468 16317 15706 23245 -1930 -13654
21462a3654j7038K6703K9789J6283q095k5797J446j3956M1346j0244l1405L791
$$ -13654 -30692 -3989 25800 42083 33988 8191 9637 -4319 37027 26783 -4622 -831
21450h31j0404l808J2390p494P447Q845K6174m511N10R691R345j3990k2610j4945
$$ -831 -11235 -15043 -2653 -10147 -2700 6145 32319 27808 28318 38009 47354 33364 10754 -4191
21436d191j3564J1406K3521l454O21K2800K2963j5782O023J1845j135j4365k6554
$$ -4191 -17755 -6349 17172 13718 14339 37139 60102 44320 50343 62188 61053 46688 20134
21423B0134j8535Q897Q375N4l2126j0414n740K0093J9449l017j2155L598j085
$$ 20134 1599 10496 18871 18925 -13201 -23615 -29355 -9262 10187 7170 -4985 -1387 -2472
21410b472K4381K648j4973P451P946J7283k5566j4312J7441j9979m6544j2111
$$ -2472 21909 24557 9584 17035 24981 42264 16698 2386 19827 -152 -46696 -58807
21398e8807J6198L0131L8611k5434j1176J1331k098j7395J4188J3028K0289J2529
$$ -58807 -42609 -12478 26133 699 -10477 854 -1244 -18639 -4451 8577 28866 41395
21386D1395k3571l6018L074K1877k2363j4661J6751K4254j5969J1406j1289l030
$$ 41395 17824 -18194 -15120 6757 -15606 -30267 -13516 10738 -5231 6175 -5114 -8144
21374h144r837K1446j926K5766J9242n830p302j1832k9674K7192r483n1095r137
$$ -8144 -17981 3465 1539 27305 46547 40717 33415 21583 -8091 19101 9618 -41477 -50614
21361e0614N6047J6096J0645r768l2583J830k6609n175Q863K9645J1165J8171
$$ -50614 5433 21529 32174 22406 -10177 -8347 -34956 -40131 -31268 -1623 9542 27713
21349B7713j7858k049L7634J6241J936n8584m3000J7138O353k5015k0034k941
$$ 27713 9855 7806 45440 61681 63617 5033 -37967 -20829 -14476 -39491 -59525 -62466
21337f2466J5739K889m611L5112M203Q64K4311n875k8077o459l482P490N526O068
$$ -62466 -46727 -43838 -48449 -13337 -9134 -8270 16041 10166 -17911 -24370 -27852 -20362 -14836 -8768
21323h768R533R90k2523K7626P586J9583j4572n418j7701M254j892J09j1501R613
$$ -8768 765 1755 -20768 6858 14444 34027 19455 14037 -3664 590 -1302 -1193 -12694 -3081
21309c081n776R293K29l064l1679K4085K3079k0768o918J2313L795K972J7684
$$ -3081 -8857 436 665 -2399 -34078 -9993 13086 -7682 -14600 -2287 1508 4480 22164
21296B2164j271n209q680n74Q109J4063O600q332l0765k6748J0419l360M523k7148
$$ 22164 20893 15684 7004 6430 14539 28602 35202 26870 -3895 -30643 -20224 -23584 -19061 -46209
21282d6209k7875K8879L2179N5122O327l1270m6530j2979J5858L455J2651J9531
$$ -46209 -74084 -45205 -13026 42096 48423 17153 -29377 -42356 -26498 -23043 -10392 9139
21270I139p879j2083j5691l310j1303l3353p55O2887K1839k7559l9144l120K6369
$$ 9139 1260 -10823 -26514 -29824 -41127 -74480 -75235 -12348 9491 -18068 -57212 -60332 -33963
21257c3963M3672R874j1008j20J5420m95J2947k1341n288M132J132k3195l194
$$ -33963 9709 19583 8575 8455 23875 23380 36327 14986 9698 13830 14962 -8233 -11427
21244a1427P621J1516Q938j8645m910J4563k7670p754M75l0K376j1403R783J54
$$ -11427 -3806 7710 16648 -1997 -6907 7656 -20014 -27768 -27293 -27323 -24947 -36350 -26567 -26413
21230b6413j1357p085M7416N1483k980j4539j2972l4275k5493o663L7265Q585
$$ -26413 -37770 -44855 2561 54044 51064 36525 23553 -10722 -36215 -42878 -5613 2972
21218B972J9391k6910j2785J0791o208l3702M813L6078J3659r977k4250L245r561
$$ 2972 22363 -4547 -17332 -6541 -12749 -46451 -41638 -5560 8099 -1878 -26128 -22883 -32444
21205c2444J3209J7245l1469r782O339l690J342K5070L4170K4272J6799l192K6360
$$ -32444 -19235 -1990 -33459 -43241 -36902 -40592 -39250 -14180 19990 44262 61061 57869 84229
21192H4229J4602l7543j7615O156k697l0391j5231k943J3445R948j655j1134j6231
$$ 84229 98831 61288 43673 49829 47132 16741 1510 -1433 12012 21960 20305 9171 -7060
21179g060N660n919Q381Q878j4436j4364k5514n062K0452J3395M999J5726J1019
$$ -7060 -1400 -7319 1062 9940 -4496 -18860 -44374 -49436 -28984 -15589 -10590 5136 16155
21166A6155j7570j2806l342J5770r788K9238M078k4710N323M4374P331l8098j9380
$$ 16155 -1415 -14221 -17563 -1793 -11581 17657 21735 -2975 2348 46722 54053 15955 -3425
21153c425l0893j8624j8925K579K7461L8254j214k7477l4777J3962K507N706L6006
$$ -3425 -34318 -52942 -71867 -69288 -41827 -3573 -4787 -32264 -67041 -53079 -50572 -44866 -8860
21140h860L9661q975j0777m896m723k0253j2940R708r32M94M656J6970J857j6022
$$ -8860 30801 21826 11049 6153 1430 -18823 -31763 -22055 -22987 -22493 -17837 -867 990 -15032
21126a5032J9710J5126l587J598n764j3241R082J087j1239l6639R739n492r597
$$ -15032 4678 19804 16217 17815 12051 -1190 7892 8979 -2260 -38899 -29160 -34652 -44249
21113d4249J6389M6167R272p596L522l3539k2353M1917K8088j6533N445Q266k780
$$ -44249 -27860 18307 27579 19983 23505 -10034 -32387 9530 37618 21085 26530 34796 32016
21100C2016o283j0393J1544n176J4976P603j253P537O833k7083k7011J1711N875
$$ 32016 25733 15340 26884 21708 36684 44287 43034 50571 57404 30321 3310 15021 20896
21087B0896m1915J4305L8344l552l2372m2820j7292L0770K4266j616K43J5376
$$ 20896 -21019 -6714 31630 28078 -4294 -47114 -64406 -33636 -9370 -10986 -10743 4633
21075D633L264j8458K6100j57j6810l0004P175P363J7012r65k4579j7853K3291
$$ 4633 7897 -10561 15539 15382 -1428 -31432 -24257 -16894 118 -847 -25426 -43279 -19988
21062a9988N7646J3160j7685k5894j7881P496m755P100K3151o079M64J3825J5980
$$ -19988 37658 50818 33133 7239 -10642 -3146 -7901 -801 22350 16271 16735 30560 46540
21049D6540q814J228k4929k1426O484K0234K0646l5380k6391J7941N0858P862
$$ 46540 37726 38954 14025 -7401 -917 19317 39963 4583 -21808 -3867 46991 54853
21037E4853k8268o526M072r113k5912j607J8026K0792j1555N551L2660O822k1631
$$ 54853 26585 20059 24131 15018 -10894 -12501 5525 26317 14762 20313 52973 59795 38164
21024C8164M357o896j7901j0329j6112j5105L0296J9931O557Q561J0222J6875
$$ 38164 42521 35625 17724 7395 -8717 -23822 6474 26405 32962 41523 51745 68620
21012F8620J2189j3386k5706r862M09J3682K0863J708m4155l0586Q805N956P946
$$ 68620 80809 67423 41717 31855 32264 45946 66809 68517 24362 -6224 2581 8537 16483
20999A6483M02P070j507j6848J2110j5957J3718J8788J3356J0709j0110k1953
$$ 16483 16885 23955 22448 5600 17710 1753 15471 34259 47615 58324 48214 26261
20987B6261r042r230m269M0J641j0017o01o999K0964n264l781Q613J9756L1841
$$ 26261 17219 7989 3720 3760 5401 -4616 -5217 -12216 8748 3484 -297 8316 28072 59913
20973E9913N624j9593l4846l3644j0099l0757J2204L4597M59M839L223o7J0383
$$ 59913 65537 45944 11098 -22546 -32645 -63402 -51198 -16601 -16142 -11303 -8080 -8147 2236
20960B236J357K5934K083j2946j8321k553k552m357R186j0730r57o119j1547J0426
$$ 2236 3593 29527 31610 18664 343 -2210 -4762 -9119 67 -10663 -11620 -17739 -29286 -18860
20946a8860K1575K643K5351p259q697o152j8542N63K1776K3415m091k978k0474
$$ -18860 2715 5358 30709 23450 14753 8601 -9941 -9378 12398 35813 31722 28744 8270
20933H270J3617J4269R93J586L8272J058p397k5263j9487p673j8846J8436n030
$$ 8270 21887 36156 37149 38735 77007 78065 70668 45405 25918 18245 -601 17835 12805
20920A2805j8638K2343J114L998K901K952J4198p208l0464j0963K4620P650o192
$$ 12805 -5833 16510 17624 21622 24523 27475 41673 34465 4001 -6962 17658 25308 19116
20907A9116q913n272k3340l8187M2602N0979k8046k5377k874J8035L7915j217
$$ 19116 10203 4931 -18409 -56596 -13994 36985 8939 -16438 -19312 -1277 36638 35421
20895C5421j5630k093Q358Q162J0523L0035l655j4916m118L2787j7960j3728k652
$$ 35421 19791 17698 26056 34218 44741 74776 71121 56205 52087 84874 66914 53186 50534
20882E0534j9771j2439o663J078J797j7030l011l1048p836K1084m971p472J3719
$$ 50534 30763 18324 11661 12739 14536 -2494 -5505 -36553 -44389 -23305 -28276 -35748 -22029
20869b2029J5221L2864L462k5646j6109J2307J6972q96r873K6907j6242j688j7412
$$ -22029 -6808 26056 29518 3872 -12237 70 17042 16146 6273 33180 16938 15250 -2162
20856b162K663R048j4205L6782K2967J7300k0553m3898n651J5567M4203J1945
$$ -2162 501 9549 -4656 32126 55093 72393 51840 7942 2291 17858 62061 74006
20844G4006l0129l7272J2324R035R292r399q788p99j0197j4568p713j6828O80
$$ 74006 43877 6605 18929 27964 37256 27857 19069 18270 8073 -6495 -14208 -31036 -30356
20831c0356O736J4782j6693R337M5435k3229l2720k126K5259P208n270l2117p857
$$ -30356 -23620 -8838 -25531 -16194 29241 6012 -26708 -28834 -3575 3633 -1637 -33754 -41611
20818d1611n377J7004K2619L274J2024j1520r244R543k4280K9384K6011l6165
$$ -41611 -46988 -29984 -7365 -4091 7933 -3587 -12831 -3288 -27568 1816 27827 -8338
20806h338q086O330j451J6882J8454r698o52j1484J2683J26j0575J9409k6558
$$ -8338 -16424 -10094 -11545 5337 23791 14093 13441 1957 14640 14766 4191 23600 -2958
20793b958q695j3159j3312K0037K1905Q381K9805J6353j5318R399j4270q850k0094
$$ -2958 -11653 -24812 -38124 -18087 3818 12199 42004 58357 43039 52438 38168 29318 9224
20780I224J4934J304l8093l5408K0504K5025M027j4332k2600J8491K5969j2422
$$ 9224 24158 25462 -12631 -48039 -27535 -2510 1517 -12815 -35415 -16924 9045 -3377
20768c377j4978Q807K282k7695j7727J1886M0900O571m522l077J8524J0530j5176
$$ -3377 -18355 -9548 -7266 -34961 -52688 -40802 98 6669 2147 -930 17594 28124 12948
20755A2948K280o478j9737n3619L1664K8231k1642J5248M4926k1629l9673L58
$$ 12948 15228 8750 -10987 -64606 -32942 -4711 -26353 -11105 33821 12192 -27481 -27123
20743b7123O521k7600o263j1972L2558J8778J1897j0572N584J7978o423j556Q28
$$ -27123 -20602 -48202 -54465 -66437 -33879 -15101 -3204 -13776 -8192 9786 3363 1807 2635
20730B635K8219K4792J8424j4209k2875j4843K8064L831n992P094K4492m36j2308
$$ 2635 30854 55646 74070 59861 36986 22143 50207 54038 48046 55140 79632 79196 66888
20717F6888r691j4275m841j4032j6910k1681J9745j341m788j9817j3199J2922
$$ 66888 57197 42922 38081 24049 7139 -14542 5203 3862 -926 -20743 -33942 -21020
20705b1020K5821M400M645J0882K5180r547l0843j1477J4558n230k4454j883J9578
$$ -21020 4801 9201 13846 24728 49908 40361 9518 -1959 12599 7369 -17085 -18968 610
20692F10K6702j454m3327J8683K326L0967l369j6142k549j1471N159R04n197k382
$$ 610 27312 25858 -17469 1214 3540 34507 31138 14996 12447 976 6135 7039 1842 -540
20678e40J7432R898J053j2239N895j9780j1404L1174q749m3073K7667L028o549
$$ -540 16892 26790 27843 15604 21499 1719 -9685 21489 12740 -30333 -2666 362 -6187
20665f187L5030L312j695q894k1309N651K2234J7802j624j5676l398j1833k1845
$$ -6187 28843 32155 30460 21566 257 5908 28142 45944 44320 28644 25246 13413 -8432
20652h432J1576k525k0892j070K5846K068k1398l5050j2677m687Q510N4602M6306
$$ -8432 3144 619 -20273 -21343 4503 6571 -14827 -49877 -62554 -67241 -58731 -4129 42177
20639D2177K785k7216R184R313k7530m963j0483j9216J4054K6143j536P514j554
$$ 42177 44962 17746 26930 36243 8713 3750 -6733 -25949 -11895 14248 12712 20226 18672
20626A8672M244k4034j7119o370K7645R796j2333j1924k5486K3176J5063J4419
$$ 18672 22916 -1118 -18237 -24607 3038 12834 501 -11423 -36909 -13733 1330 15749
20614A5749j523l6247o488M6945J9144k7451l7647L101L9123n113k3856K882K6106
$$ 15749 14226 -22021 -28509 18436 37580 10129 -27518 -24417 14706 9593 -14263 -11381 14725
20601A4725R704j1722j2316j015p254n1723J8386L1224L117K1787K6425J686J3143
$$ 14725 24429 12707 391 -624 -7878 -59601 -41215 -9991 -6874 14913 41338 43024 56167
20588E6167L722P703P264j4708l2229n915m362o3J370j565o775K1409K8194j6584
$$ 56167 59889 67592 74856 60148 27919 22004 17642 17579 18949 17384 10609 32018 60212 43628
20574D3628L508o785o992M27n4283p598K4054o17p203K1316K4257J7278L4j3090
$$ 43628 47136 40351 33359 33786 -20497 -28095 -4041 -4658 -11861 9455 33712 50990 51024 37934
20560C7934j6171k2419K484n711j8251J5444P854k006n197J2868M069j2310J2864
$$ 37934 21763 -656 1828 -3883 -22134 -6690 1164 -842 -6039 6829 10898 -1412 11452
20547A1452R87n61m493K3950o529k2365M955J235q073p358K1891J3042m099K7517
$$ 11452 12439 11878 7385 31335 24806 2441 7396 8631 558 -6800 15091 28133 24034 51551
20533E1551K0451j2962o3722l2472N959K9609j5208J692K7070R576k6780Q402
$$ 51551 72002 59040 -4682 -37154 -31195 -1586 -16794 -15102 11968 21544 -5236 3166
20521C166K4382J8350J4357l5428m7932R917K0434L123j801K236J9507k5347j9981
$$ 3166 27548 45898 60255 24827 -23105 -13188 7246 10369 8568 10804 30311 4964 -15017
20508a5017j5412L1840p22P399L077K1716K924m2693l9073J1217J5152M295K1185
$$ -15017 -30429 1411 689 8088 11165 32881 35805 -6888 -45961 -34744 -19592 -15297 5888
20495E888L1654J5951q178k2674l794m666N43Q529m482K2894m534P446l210k5018
$$ 5888 37542 53493 45315 22641 18847 14181 14724 23253 18771 41665 37131 44577 41367 16349
20481A6349q868J6111p192o188k198K8433L2142R961j0311j9277l6424j6390j1482
$$ 16349 7481 23592 16400 10212 8014 36447 68589 78550 68239 48962 12538 -3852 -15334
20468a5334M700J8610M116j9476J6525L1842N991M825J920l07j3321p559o51r681
$$ -15334 -10634 7976 12092 -7384 9141 40983 46974 51799 53719 53412 40091 32532 31881 22200
20454B2200J5407M561k2395r954j4709l57K2105j5058M639M1354J0614j0701k0287
$$ 22200 37607 42168 19773 9819 -4890 -5247 16858 1800 6439 47793 58407 47706 27419
20441B7419R524k539J8289k2243l1227J649M2282j0826j3629J278j4499J4250
$$ 27419 36943 34404 52693 30450 -777 872 43154 32328 18699 19977 5478 19728
20429A9728l059J9590r963j8315K6677j3838j7235p881N538q973J0466p57l657
$$ 19728 16669 36259 26296 7981 34658 20820 3585 -4296 1242 -7731 2735 1978 -1679
20416a679m945J2569Q402L9784N280j4144k5968K278j6647N498k116J2430J2128
$$ -1679 -6624 5945 14347 54131 59411 45267 19299 21577 4930 10428 8312 20742 32870
20403C2870j5757R398N269m134k4926J5021J8187q790k3353q504L7341K2394r712
$$ 32870 17113 26511 31780 27646 2720 17741 35928 27138 3785 -4719 32622 55016 45304
20390D5304l881n2323J322K8018q541k1854J8195k68n782K4695P3r151M321R440
$$ 45304 41423 -10900 -9578 18440 9899 -11955 6240 5972 190 24885 24958 15807 20128 29568
20376B9568k2789R00L9431K2338l2550k5664J13J3699R939J6654R009J0205p217
$$ 29568 6779 7679 47110 69448 36898 11234 11347 25046 34985 51639 60648 70853 63636
20363F3636o740k9465L613M013j7457NQ520j592R287L0438L85k8447k8941l3545
$$ 63636 56896 27431 31044 35057 17600 17605 26125 24533 33820 64258 64643 36196 7255 -26290
20349b6290K0264R340q381L8068J7532K9321N6204K4014j6657j6432N773K409
$$ -26290 -6026 3314 -5067 33001 50533 79854 136058 160072 143415 126983 132756 135165
20337A35165J4993j8041n0105n388m0526j2543N779L19J4907l1760O50J7076j7316
$$ 135165 150158 132117 82012 76624 36098 23555 29334 29653 44560 12800 13450 30526 13210
20324A3210j3859K4737M1919j1030l1799l5083o288K6291J7916k5120j6735k829
$$ 13210 -649 24088 66007 54977 23178 -11905 -18193 8098 26014 894 -15841 -18670
20312a8670q540L1103L2939L6440k3556j1875K62l895p034K6620l506j1371j9593
$$ -18670 -27210 3893 36832 73272 49716 37841 38103 34208 27174 53794 50288 38917 19324
20299A9324j2871J171O776M099m859K1573j168K442j6200N644k692N302j1901
$$ 19324 6453 7624 14400 18499 13640 35213 34045 36487 20287 25931 23239 28541 16640
20286A6640k0457k387j3787m0075R656K7668J7291J5052j6748N046M0446k2679
$$ 16640 -3817 -6204 -19991 -60066 -50410 -22742 -5451 9601 -7147 -2101 38345 15666
20274A5666j1427J6685J0165J5820J8252j8599J470K060Q887R602r550j764J2243
$$ 15666 4239 20924 31089 46909 65161 46562 48032 50092 58979 68581 59031 57267 69510
20261F9510K790O482n597o595j3294j5406l0733K0065L0836j5073o536j2921M22
$$ 69510 72300 78782 73185 66590 53296 37890 7157 27222 58058 42985 36449 23528 23950
20248B3950J3403J2080m663l2211j3000k8150k0605M5347M5438K582K8365m050
$$ 23950 37353 49433 44770 12559 -441 -28591 -49196 -3849 41589 44171 72536 68486
20236F8486J480p566K6333K216k6186l1892k2069k7365j4495k4882J8455N4275
$$ 68486 69966 62400 88733 90949 64763 32871 10802 -16563 -31058 -55940 -37485 16790
20224A6790k251J1993J1306k7580J480j0165j4042K7380l118L39m919J5994l352
$$ 16790 14539 26532 37838 10258 11738 1573 -12469 14911 11793 12132 7213 23207 19855
20211A9855P031K2308M151m101j7581k0683L591L0788J1904j852o345n045Q841
$$ 19855 26886 49194 53345 49244 31663 10980 14571 45359 57263 55411 49066 44021 52862
20198E2862j6548L49j0330O171N243L7763k5605k3725j5361m2727j7923M6594
$$ 52862 36314 36663 26333 32504 37747 75510 49905 26180 10819 -31908 -49831 -3237
20186c237N6146l560J5679k292P390k1525J6265L1205j763l8830k6093M5296K7204
$$ -3237 52909 49349 65028 62736 70126 48601 64866 96071 94308 55478 29385 74681 101885
20173A01885k4324j9400j9040p921J6396J5413j7543r480R377j7193k3789k1118
$$ 101885 77561 58161 39121 31200 47596 63009 45466 35986 45363 28170 4381 -16737
20161a6737N577l171R678O897l498M28K3112J5597j501J8926n227j8961J2933
$$ -16737 -11160 -14331 -4653 2244 -1254 -826 22286 37883 36382 55308 50081 31120 44053
20148D4053J8172k4840L029j1119l6243J2771r692M178K5711j0109j0938Q138
$$ 44053 62225 37385 40414 29295 -6948 5823 -3869 309 26020 15911 4973 13111
20136A3111k2138R278L1922L6216k601m3496K032K0793J1417O909J2565l1415
$$ 13111 -9027 251 32173 68389 65788 22292 24324 45117 56534 63443 76008 44593
20124D4593l4507K5173K0734O301K6865j0548r721J9899K828k4245J2122j3643
$$ 44593 10086 35259 55993 62294 89159 78611 68890 88789 91617 67372 79494 65851
20112F5851k1397J6036K832r532l5118k7532K7153L2351j619J1095K235j4548
$$ 65851 44454 60490 63322 53790 18672 -8860 18293 50644 49025 60120 62355 47807
20100D7807j7618K1480J5694N790q752q592k2767N155P528J7855L1769J2470K2045
$$ 47807 30189 51669 67363 73153 64401 55809 33042 38197 45725 63580 95349 107819 129864
20087A29864l4285k4983Q996k3289R554j3988p038j054M5180J5546k0233j0045
$$ 129864 95579 70596 79592 56303 65857 51869 44831 43777 88957 104503 84270 74225
20075G4225l2724j8543q136P199K8862J773j0993k2931J8313J3823j8981L3817
$$ 74225 41501 22958 14822 22021 50883 52656 41663 18732 37045 50868 31887 65704
20063F5704N5219J4485k3512k9597J7461K0260M6143J02607J20375J02420J7332
$$ 65704 120923 135408 111896 82299 99760 120020 166163 268770 389145 491565 508897
20052E08897j8007o8576j3098J5718Q9229J26726O4516o7800j33355o3876m0022
$$ 508897 490890 422314 409216 424934 514163 640889 705405 637605 504250 440374 400352
20041D00352p81M6675m957l6720p3507p8567m5810l1337m4161k5769m427l5546
$$ 400352 399571 446246 441289 404569 331062 252495 206685 175348 131187 105418 100991 65445
20029F5445J6227P834j5165L104r803R126o625N603J0755j6028Q056J7476J1981
$$ 65445 81672 89506 74341 77445 67642 76768 70143 75746 86501 70473 78529 96005 107986
20016A07986M3633Q162k256M0712L9465Q0778P3503r262J231j5201J7293P8185
$$ 107986 151619 159781 157525 198237 237702 318480 391983 382721 383952 368751 386044 464229
20004D64229J40920Q8975J3952p9707q0544q8708q4314k5052K3970L1026l6349
$$ 464229 605149 694124 708076 628369 547825 459117 374803 349751 373721 404747 368398
19993C68398q5992q1333m1240k7950l3397N17o414j1310K0251o634L928l3352
$$ 368398 282406 201073 159833 131883 98486 99003 92589 81279 101530 94896 98824 65472
19981F5472q580l750j2889P047K8031K6935m6153r704L7031M7027j0766j9670
$$ 65472 56892 53142 40253 47300 75331 102266 56113 46409 83440 130467 119701 100031
19969A00031l585k669j7652k4457K9703K3366m887o799m3833j3404k2928q514
$$ 100031 96446 93777 76125 51668 81371 104737 99850 93051 49218 35814 12886 4372
19957D372Q671Q330J4164N8595K6590m7924j6212K1655l203j2816o749k113N104
$$ 4372 13043 21373 35537 94132 120722 72798 56586 78241 75038 62222 55473 53360 58464
19944E8464p063P304N742K5673j8325j6542k5306k3782J752L6142J1164K1048
$$ 58464 51401 58705 64447 90120 71795 55253 29947 6165 7917 44059 55223 76271
19932G6271K7002R530N527m273m6214j4178J8431J2989j1270K4095j0459l8512
$$ 76271 103273 112803 118330 114057 67843 53665 72096 85085 73815 97910 87451 48939
19920D8939L077Q931O668J9153Q407Q591K014k2146J2867k5635m1024M476N64
$$ 48939 52016 60947 67615 86768 95175 103766 105780 83634 96501 70866 29842 34318 34882
19907C4882K7416K2767l4170j1861N740J1290j2512K4640m169j047j5724k0230
$$ 34882 62298 85065 50895 39034 44774 56064 43552 68192 64023 62976 47252 27022
19895B7022k1313r320J4841L0542P721O347j1264m092l7343Q996J6368o999j955
$$ 27022 5709 -3611 11230 41772 49493 55840 44576 40484 3141 12137 28505 21506 19551
19882A9551J0053J3372o783K2361m441j3198J474K037R146r054j2262J2279K1392
$$ 19551 29604 42976 36193 58554 54113 40915 42389 44426 53572 44518 32256 44535 65927
19869F5927j0333l457J9092l767J251K0973J6262J965p334l572j4400J3487n263
$$ 65927 55594 52137 71229 67462 68713 89686 105948 107913 100579 97007 82607 96094 90831
19856I0831j3584L2630r056q787J2927p087k4066q543J1886j1487k6060K2848
$$ 90831 77247 109877 100821 92034 104961 97874 73808 65265 77151 65664 39604 62452
19844F2452K5957m909j0523m2433R678L6317J9026J8671k6669j7836K2347K0975
$$ 62452 88409 83500 72977 30544 40222 76539 95565 114236 87567 69731 92078 113053
19832A13053m801O434o986J2355j3082k3348j7837K498R278J5331J9177O218j9808
$$ 113053 108252 114686 107700 120055 106973 83625 65788 68286 77564 92895 112072 118290 98482
19819I8482m450K498K304r778m2735K2487L4731J5731j3118R500j13k8475l4602
$$ 98482 94032 96530 98834 89056 46321 68808 103539 119270 106152 115652 115539 87064 52462
19806E2462Q499L4005j1754j9578P311o368n884k6740o442K9199J6083j631j2948
$$ 52462 60961 94966 83212 63634 70945 64577 58693 31953 25511 54710 70793 69162 56214
19793E6214r260K859K1492J6091j8541k504J1846J0763K4302M612o652n765j0438
$$ 56214 46954 49813 71305 87396 68855 66351 78197 88960 113262 117874 111222 105457 95019
19780I5019k5585K767l1611j1924K0673L0213j3841l0558j183P908P399j1683
$$ 95019 69434 72201 40590 28666 49339 79552 65711 35153 33970 41878 49277 37594
19768C7594O209K4370Q905n75N972J6437o326m3241N166K5881J2678J5402K2124
$$ 37594 43803 68173 77078 76503 82475 98912 92586 49345 54511 80392 93070 108472 130596
19755A30596N139j1428j3307l0111j2175L4039J6495j1976q530Q911J8677K7439
$$ 130596 135735 124307 111000 80889 68714 102753 119248 107272 98742 107653 126330 153769
19743A53769K2613J3929O147l257l5553P46k4402k9103j6981r019j4009J0505
$$ 153769 176382 190311 196458 193201 157648 158394 133992 104889 87908 78889 64880 75385
19731G5385o57q911l4490J1737J2678Q363L4071K660R964L921J5585R97m726k10
$$ 75385 74728 65817 31327 43064 55742 64105 98176 100836 110800 114721 130306 131303 126577 126367
19717A26367q176J8713K1264j8665k727K6073J9701J9105q75k1452l089j5027
$$ 126367 118191 136904 158168 139503 136776 162849 182550 201655 200780 179328 176239 161212
19705A61212j9807P226j8306j1735M732K0295l795j2429l967J3267J8820m4323
$$ 161212 141405 148631 130325 118590 123322 143617 139822 127393 123426 136693 155513 111190
19693A11190m742J5314L1979m2148k8802J5254r534J3301O3N2744L1655Q470j1060
$$ 111190 106448 121762 153741 111593 82791 98045 88511 101812 101875 154619 186274 194744 183684
19680A83684J6350j0317j2782k3389R966J6718j0470J7774j1556l2717n790L062
$$ 183684 200034 189717 176935 153546 163512 180230 169760 187534 175978 143261 137471 140533
19668A40533M125O539l1486p50K6112K8163j6305k2250q906j3697k1462j6973
$$ 140533 144658 151197 119711 118961 145073 173236 156931 134681 125775 112078 90616 73643
19656G3643K2372j7957j311L6477L207J1583j0219Q027k5420l364Q870K3165K7425
$$ 73643 96015 78058 76747 113224 116431 128014 117795 125822 100402 97038 105908 129073 156498
19643A56498L6625M919k571j5263j5614k0387l111k4660K0156L1989J7772l1595
$$ 156498 193123 198042 195471 180208 164594 144207 141096 116436 136592 168581 186353 154758
19631A54758k6292Q94j2385J4383J7071n160J2168P256J4808J3674m1516l2774
$$ 154758 128466 129360 116975 131358 148429 143269 155437 162693 177501 191175 149659 116885
19619A16885L298J1750j5037p040Q980O174j1616N738l903L3951J5265K849j8838
$$ 116885 120183 131933 116896 109856 118836 125010 113394 119132 115229 149180 164445 167294 148456
19606A48456j6846P022J3430N604m68L1362L2598M0004L2441j566l0655j6917
$$ 148456 131610 138632 152062 157666 157198 188560 221158 261162 293603 292037 261382 244465
19594B44465J9292o314L7532O6702M8345k1307l0999k6202j0202K0333L306q738
$$ 244465 263757 257443 294975 361677 410022 388715 357716 331514 321312 341645 344951 336213
19582C36213J6334k1944m1808P441j8738j2548j880r477j349Q464k0737j9449
$$ 336213 352547 330603 288795 296236 277498 264950 263070 253593 252244 260708 239971 220522
19570B20522J3048j760j6637l4211M975K8100O27J5890L0986P600k7265K8105
$$ 220522 233570 231810 215173 180962 185937 214037 214664 230554 261540 269140 241875 269980
19558B69980M8058r93M2430K9183R751O029o265J4889J0877K8258M6778O466J0141
$$ 269980 318038 317045 359475 388658 398409 404438 398173 413062 423939 452197 498975 505441 515582
19545E15582K1509l3519k2975j2789K1559J8987N845p517n6134l2071J2436r73
$$ 515582 537091 503572 480597 467808 489367 508354 514199 506682 450548 418477 430913 429940
19533D29940R324P471R891M3048J7572j3346K551j286K950L0831P4887J5651n
$$ 429940 439264 446735 456626 499674 517246 503900 506451 505165 508115 538946 613833 629484 629479
19520F29479p717l8783k5609P616K2396K5979M622N2041M6807j7886O412K1837
$$ 629479 621762 582979 557370 564986 587382 613361 617983 670024 716831 698945 705357 727194
19508G27194M5004L7783N4596L6673N2999N3152O4872R2887M4159L8479J25744
$$ 727194 772198 809981 864577 901250 954249 1007401 1072273 1165160 1209319 1247798 1373542
19497A373542J15667J18029J36365J68837J45859J31407J02655J71189K94357
$$ 1373542 1489209 1607238 1743603 1912440 2058299 2189706 2292361 2463550 2757907
19488B757907L85637L69234L50938K95493K79194M05038N82825Q33524J102398
$$ 2757907 3143544 3512778 3863716 4159209 4438403 4843441 5426266 6259790 7362188
19479G362188J295902J566797J872487K441964L663983O102333J0873827J7661570
$$ 7362188 8658090 10224887 12097374 14539338 18203321 24305654 35179481 52841051
19471E2841051J5581455J506428n547370o319869j105961R984424K2325772K2408109
$$ 52841051 68422506 69928934 64381564 58061695 56955734 66940158 89265930 111674039
19463A11674039R163740j0308749k0565324j9511814j2271691j164712R484984
$$ 111674039 120837779 110529030 89963706 70451892 58180201 57015489 66500473
19456F6500473P194142p093648j3311720j4439003j1699908p318166m297937k658395
$$ 66500473 73694615 66600967 53289247 38850244 27150336 19832170 15534233 12875838
19448A2875838j785453j296516r24723n79040l89487k34391o5938j9680m1816
$$ 12875838 11090385 9793869 8869146 8290106 7900619 7666228 7600290 7580610 7538794
19439G538794N3719K59123N90350R78081J379731J735292K191640K931889M403131
$$ 7538794 7592513 7851636 8441986 9420067 10799798 12535090 14726730 17658619 22061750
19430B2061750P580281J3543166J9591870J2065999j846408o678188n774019J879743
$$ 22061750 29642031 43185197 62777067 74843066 72996658 66318470 60544451 62424194
19422F2424194J4876826K5300212J9366560K827997j5861985k1910967j8310894
$$ 62424194 77301020 102601232 121967792 124795789 108933804 87022837 68711943
19415F8711943r248440K738576J1085495K509853j0645821j4825355j4840624
$$ 68711943 59463503 62202079 73287574 75797427 65151606 50326251 35485627
19408C5485627j1019156o755850m145402k723859j940359j392606r78672o23353
$$ 35485627 24466471 17710621 13565219 10841360 8901001 7508395 6529723 5906370
19400E906370l80682k87901l15940m19566l84439l67546l94343l56390l34229
$$ 5906370 5525688 5237787 4921847 4502281 4117842 3750296 3355953 2999563 2665334
19391B665334l02614k18999j41803j45568j43019j25767j37351j37287j07527
$$ 2665334 2362720 2143721 2001918 1856350 1713331 1587564 1450213 1312926 1205399
19382A205399p7765m0223l3126m9156l3826n6311k0859j515k9646n4187m1570
$$ 1205399 1127634 1087411 1054285 1005129 971303 914992 894133 892618 862972 808785 767215
19371G67215j1475o250m6466j7934l0126n4768k2504k2083j6934k8122j9506k3187
$$ 767215 755740 749490 703024 685090 654964 600196 577692 555609 538675 510553 491047 467860
19359D67860l1977N88Q163K1929l482K1957K1207k0925l0178l5383J056l127j9610
$$ 467860 435883 436471 444634 466563 463081 485038 506245 485320 455142 419759 420815 417688 398078
19346C98078q048k1944r407j8866l7006p609J0371m991l3874m697k9506j1925
$$ 398078 390030 368086 358679 339813 302807 295198 305569 300578 266704 262007 232501 220576
19334B20576K8268j8194M553J8632k6927o37j3194j0602r337J3971J4131k7176
$$ 220576 248844 230650 235203 253835 226908 226271 213077 202475 193138 207109 221240 194064
19322A94064Q720K3125K2982P187J131k8152k1230l0459j671J7112K1342K0044
$$ 194064 202784 225909 248891 256078 257209 229057 207827 177368 175697 192809 214151 234195
19310B34195j1425k6577q598m721J0693j0822j8742j7784l8006m1020l1831N599
$$ 234195 222770 196193 187595 182874 193567 182745 164003 146219 108213 67193 35362 40961
19298D0961N0646M553p172j7949P444j3715k2527j089J3050J2814K7287N652N727
$$ 40961 91607 96160 88988 71039 78483 64768 42241 41152 54202 67016 94303 99955 105682
19285A05682K4324J4445L2419Q0518N6320M6363P4385Q5752R8955J60600K33179
$$ 105682 130006 144451 176870 257388 313708 360071 434456 520208 619163 779763 1012942
19274A012942K63420L37964K23557M2189j35834k77362l19270k90774k07997j35728
$$ 1012942 1276362 1614326 1837883 1880072 1744238 1466876 1147606 856832 648835 513107
19264E13107p0759o8121k3365n2003m4040k4205m0621n7376r658j0581m207J8360
$$ 513107 442348 374227 350862 298859 254819 230614 189993 132617 122959 112378 108171 126531
19252A26531K1065j2556j1199j1285k501n774k5844j9768j6535J1458q969K5408
$$ 126531 147596 135040 123841 112556 110055 104281 78437 58669 42134 53592 44623 70031
19240G0031K6414J859J4321K9243R840j0398J2493j5057J5996j1096k3061Q326
$$ 70031 96445 98304 112625 141868 151708 141310 153803 138746 154742 143646 120585 128911
19228A28911K9149J1189j860k9494j0840M454P861k733m167J2670M877N5905J04817
$$ 128911 158060 169249 167389 137895 127055 131509 139370 136637 132470 145140 150017 205922 310739
19215C10739R1556L6239o170J3837K2295O9138J29934O8374l4219q5557r4687
$$ 310739 402295 438534 432364 446201 468496 537634 667568 735942 701723 616166 521479
19204E21479o5507j1159K351N029k5223q1061p0148n5693m2392q560k6592l3291
$$ 521479 455972 444813 447164 452193 426970 345909 275761 220068 177676 169116 142524 109233
19192A09233J5368L7794L3520N5l3515k8498m966j2667J0714K1867j2668l2809
$$ 109233 124601 162395 195915 195970 162455 133957 128991 116324 127038 148905 136237 103428
19180A03428j4846p40j8977m363K1752J8457K4552L088l0688L795K7047n982k872
$$ 103428 88582 87842 68865 64502 86254 104711 129263 132351 101663 105458 132505 126523 123651
19167A23651J5008J1135J862J5696L3477N3064M0775K9001P9720P7396K7261j4580
$$ 123651 138659 149794 151656 167352 200829 253893 294668 323669 403389 480785 508046 493466
19155D93466j3401j7326N6354R4107J18008O0630n8852q5780p9055r0851L523
$$ 493466 480065 462739 519093 613200 731208 791838 732986 647206 568151 477300 480823
19144D80823O849k7224m8203o2491o0378n2270k8783l8398j1201n5557j6255J0114
$$ 480823 487672 460448 412245 349754 289376 237106 208323 169925 158724 103167 86912 97026
19132I7026k8311r154P841j918k3356M4453L7137m2615j0042K3234P09K6698L8884
$$ 97026 68715 59561 67402 65484 42128 86581 123718 81103 71061 94295 95004 121702 160586
19119A60586M1283J379J6394m701r958k8498k9842n570J3301K9969j3532n4245
$$ 160586 201869 203248 219642 214941 204983 176485 146643 141073 154374 184343 170811 116566
19107A16566l4163O733k2002L0522N5898j9072j4819J3461J4383k844n139j9149
$$ 116566 82403 89136 67134 97656 153554 134482 119663 133124 147507 144663 139524 120375
19095A20375l9512j0494K8538O395P38N793J3531j8305j1269J8719l0592k0294
$$ 120375 80863 70369 98907 105302 106040 111833 125364 107059 95790 114509 83917 63623
19083F3623K9270K2582J0442J6318o184J0138j3631j3886m019M105j6465r469
$$ 63623 92893 115475 125917 142235 136051 146189 132558 118672 114653 118758 102293 92824
19071I2824j2849J7235N0734L068k8301j6328K3886J4039j3311j9832Q002J1458
$$ 92824 79975 97210 147944 151012 122711 106383 130269 144308 130997 111165 119167 130625
19059A30625o256j7068O989O827j5687J4473q969j5640p808K1621O723q54J35
$$ 130625 124369 107301 114290 121117 105430 119903 110934 95294 87486 109107 115830 114976 115111
19046A15111J1053J3529m4077l055j0344j1960n333J867R741M0875K4242L7485
$$ 115111 126164 139693 95616 92561 82217 70257 64924 66791 76532 117407 141649 179134
19034A79134k2257l8811p01M865J0589k7526J7204J307N128K0043K7599K224N716
$$ 179134 156877 118066 117365 122230 132819 105293 122497 123804 128932 148975 176574 178798 184514
19021A84514k3516k7615J7765M152p037j3012o000p665J6044J6714q975j6142
$$ 184514 160998 133383 151148 155300 148263 135251 129251 121586 137630 154344 145369 129227
19009A29227j7330P394L332P856q378j48J6817l610R222M5721J3895K187l8204
$$ 129227 111897 119291 122623 130479 122101 121953 138770 135160 144382 190103 203998 206185 167981
18996A67981l8821j218O339j825O275L2864m931k5969j8755L1319J2124N557j4440
$$ 167981 129160 127942 134281 132456 138731 171595 166664 140695 121940 153259 165383 170940 156500
18983A56500k6030P081o186Q875j3630K4891l388J3000R878j3521m4925l9428
$$ 156500 130470 137551 131365 140240 126610 151501 148113 161113 170991 157470 112545 73117
18971G3117k1769j4339l9541j1454K3100K7242M7754L5972K769j9312r323L0641
$$ 73117 51348 37009 -2532 -13986 9114 36356 84110 120082 122851 103539 94216 124857
18959A24857J4575L0313J3538K3073O591J0094j833k1121k1761P889J204j9604
$$ 124857 139432 169745 183283 206356 212947 223041 221208 200087 178326 186215 187419 167815
18947A67815m7007k1144J5699p274M3492J8822K5454K5231J705O911j0169J4399
$$ 167815 120808 99664 115363 108089 151581 170403 195857 221088 222793 229704 219535 233934
18935B33934K786o964j2212j3727l5889j4075k8720r744K2898L2240k2496n193
$$ 233934 236720 229756 217544 203817 167928 153853 125133 115389 138287 170527 148031 142838
18923A42838R094J154r088j1398M4491K8044N1199O4107M5892L2388Q629j3238
$$ 142838 151932 153086 143998 132600 177091 205135 256334 320441 366333 398721 407350 394112
18911C94112k0723m4245k1244l4486k0391L076J1803O152m493j6379j1938k2870
$$ 394112 373389 329144 307900 273414 253023 256099 267902 274054 269561 253182 241244 218374
18899B18374J108R992J5677K372J091R267J5802l584j9141J1299J6686j4444J8918
$$ 218374 219482 229474 245151 247523 248614 257881 273683 270099 250958 262257 278943 264499 283417
18886B83417L3571J6060L1126Q2375J15808O7314K3332J3939k5292M8958R5864
$$ 283417 316988 333048 364174 446549 562357 629671 653003 666942 641650 690608 786472
18875G86472J26745R7366j2257r4805j22016j17432m8452J5607N4598J1836m6503
$$ 786472 913217 1010583 998326 903521 781505 664073 615621 631228 685826 697662 651159
18864F51159r7565q9311o0384l3237k3182l6557p327L4084R870j1812O551j0671
$$ 651159 553594 464283 403899 370662 347480 310923 303596 337680 347550 335738 342289 331618
18852C31618k3850M543k413l0352k442Q623K4207J7046K2567N1086L2447L9599
$$ 331618 307768 312311 309898 279546 277104 285727 309934 326980 349547 400633 433080 472679
18840D72679O3336R6386J14028N1293j8446j5852K197P5822J22787J00877K362
$$ 472679 536015 632401 746429 797722 779276 763424 765621 841443 964230 1065107 1067469
18829A067469m6837r3462j03020p2617o3962J7924L1676j6909k7460o9789r8305
$$ 1067469 1020632 927170 824150 751533 687571 705495 737171 720262 692802 623013 524708
18818E24708m1669o0617p2L6810L3263J4241q430O010p191J0769K3317L3955N684
$$ 524708 483039 422422 422350 459160 492423 506664 498234 504244 497053 507822 531139 565094 570778
18805E70778l588n249k7565j7727K9718J858K7352L0131j4379J6865J6677M056
$$ 570778 567190 561941 534376 516649 546367 548225 575577 605708 591329 608194 624871 628927
18793F28927L6231O0382R1112J26983J30786R8152O984l6387r9295q7499p1383
$$ 628927 665158 725540 816652 943635 1074421 1172573 1179557 1143170 1043875 956376 884993
18782H84993q0368l6001k4704R536j2920k587L4347J9870k4193j3723J3388O439
$$ 884993 804625 768624 743920 753456 740536 737949 772296 792166 767973 754250 767638 774077
18770G74077N8168R8513Q5366L7262p1152j01870q1711k4733k4005N8J3145J183
$$ 774077 832245 930758 1016124 1053386 982234 880364 798653 773920 749915 749973 763118 764301
18758G64301L07M3707Q9886N7544J8445J2042K4144J8195O4471L6118K9471J6994
$$ 764301 764608 808315 898201 955745 974190 986232 1010376 1028571 1093042 1129160 1158631 1175625
18746A175625k0252m448Q469L7497K2539L2776L375J0611J8670p584j0455L7405
$$ 1175625 1155373 1150925 1159394 1196891 1219430 1252206 1255581 1266192 1284862 1277278 1266823 1304228
18734A304228L7551J814M0951N8979L8609M4907N5898N9185N7178N5379O6805
$$ 1304228 1341779 1343593 1384544 1443523 1482132 1527039 1582937 1642122 1699300 1754679 1821484
18723A821484O0106P1119N1326R6323J27721J09931P7418R8035J76770K31133
$$ 1821484 1881590 1952709 2004035 2100358 2228079 2338010 2415428 2513463 2690233 2921366
18713B921366J96093J57413J51963J82535K62551L47291M55874N62372O08708
$$ 2921366 3117459 3274872 3426835 3609370 3871921 4219212 4675086 5237458 5846166
18704E846166O54745O59221O30689N37523M92830N49296N41508M81765M97002
$$ 5846166 6500911 7160132 7790821 8328344 8821174 9370470 9911978 10393743 10890745
18695A0890745P11112J178715J770262K443736L283101M478289O750520J0879969
$$ 10890745 11601857 12780572 14550834 16994570 20277671 24755960 31506480 42386449
18687D2386449J4915948J0914298J468521k789513k107241L642689J3789874K2179710
$$ 42386449 57302397 68216695 69685216 66895703 64788462 68431151 82221025 104400735
18679A04400735J5424916k892587j3875472j5809035j0734244j342604P117441
$$ 104400735 119825651 116933064 103057592 87248557 76514313 75171709 82289150
18672H2289150O664763j356897n076624m252814K76420P415070J5860082K6790918
$$ 82289150 88953913 87597016 82520392 78267578 78543998 85959068 101819150 128610068
18664A28610068M1444283N6712242O1049084M4149278R530541k9065623n4355331
$$ 128610068 170054351 226766593 287815677 331964955 341495496 312429873 258074542
18657B58074542o0270932n2760747l9771583k7454587j8344409j2316420q549141
$$ 258074542 197803610 145042863 105271280 77816693 59472284 47155864 38606723
18650C8606723o203814m677654l669065k924313k319992j833949j377716r44300
$$ 38606723 32402909 27725255 24056190 21131877 18811885 16977936 15600220 14655920
18642A4655920n78302k86524j9920J30759L55151P38175J216495J859517K701115
$$ 14655920 14077618 13791094 13771174 13901933 14257084 14995259 16211754 18071271 20772386
18633B0772386L799253N524182Q862493J4547724J7926737R794640q38390m362138
$$ 20772386 24571639 30095821 38958314 53506038 71432775 81227415 80389025 76026887
18625G6026887k029655O591463J9377679K6023039J1635969j0008617k0212449
$$ 76026887 73997232 80588695 99966374 125989413 137625382 127616765 107404316
18618A07404316k0449947j2815039j712298N790101P49739r731151j4240605j4531090
$$ 107404316 86954369 74139330 72427032 78217133 78966872 69235721 54995116 40464026
18610D0464026j1525942p672334m983914l305720k223339j545656j138028r08906
$$ 40464026 28938084 21265750 16281836 12976116 10752777 9207121 8069093 7160187
18602G160187o90673o44464o15705m91631l42198k37004k10905j76494k27256
$$ 7160187 6469514 5825050 5209345 4717714 4375516 4138512 3927607 3751113 3523857
18593C523857k75180l16024k70609k03819j57020q5176p9090j29982j54588j26784
$$ 3523857 3248677 2932653 2662044 2458225 2301205 2216029 2136939 2006957 1852369 1725585
18583A725585j29600o1879m6624p0272r4178m6458m853n3754q0573q4464m3485
$$ 1725585 1595985 1534106 1487482 1417210 1323032 1276574 1271721 1217967 1137394 1052930 1009445
18572A009445k0539j1760j1205r91J2828Q7079J29923P1182j2586o1651j18479
$$ 1009445 988906 977146 965941 964950 977778 1064857 1194780 1265962 1253376 1191725 1073246
18561A073246j04325m8682M2112P7796Q729n7677j18154j49498j16051r3427n9430
$$ 1073246 968921 920239 962351 1040147 1048876 991199 873045 723547 607496 514069 454639
18550D54639j8463J3307M2344Q533j7254j0378m6642l9222j3215K6602J1463O373
$$ 454639 436176 449483 491827 500360 483106 472728 426086 386864 373649 400251 411714 418087
18538D18087n0220o3362o7666j38375j11813r673N34J3920K9680L0393O2108N7423
$$ 418087 367867 304505 236839 98464 -13349 -23022 -22488 -8568 21112 51505 113613 171036
18526A71036K0649q837R186L4998K2826l399j0931r347p93O925j4470K0928M6271
$$ 171036 191685 182848 192034 227032 249858 246459 235528 226181 225388 232313 217843 238771 285042
18513B85042J4071P586j5308M880J2039L5859j9171k2802n4758l6350l0670m737
$$ 285042 299113 306699 291391 296271 308310 344169 324998 302196 247438 211088 180418 175681
18501A75681p438j0851L9343R188j9868l522m5888n0350l1434l5569P942J6924
$$ 175681 168243 157392 196735 205923 186055 182533 136645 86295 54861 19292 27234 44158
18489D4158m03L547J6518j2215J6928M0856K6762O038j7532n856L8934J2017j8459
$$ 44158 43755 47302 63820 51605 68533 109389 136151 142189 124657 118801 157735 169752 151293
18476A51293n8745J1041M5476K4157J6086M360j1394K645J9894J8968k858k7154
$$ 151293 92548 103589 149065 173222 189308 193668 182274 184919 204813 223781 220923 193769
18464A93769N1845J27825J47537J74102J69194Q0757m3674j46701j80685j12206
$$ 193769 245614 373439 520976 695078 864272 945029 901355 754654 573969 461763
18454D61763p6972o2396m4912m796J0604K7138L7846Q8511J37617J44365J26473
$$ 461763 384791 322395 277483 272687 283291 310429 348275 436786 574403 718768 845241
18443H45241L5044n5817j42018j65476j13788p8259k5927j4578k2404l8109k3339
$$ 845241 880285 824468 682450 516974 403186 324927 299000 284422 262018 223909 200570
18432B00570k215l5341j1673P623l2057K3689J5883P915Q333k3710j2424r423
$$ 200570 198355 163014 151341 158964 126907 150596 166479 174394 182727 159017 146593 137170
18420A37170l268J1079o138j6085P958K1483L6053M7075K3101J5170O6120L5391
$$ 137170 133902 144981 138843 122758 130716 152199 188252 235327 258428 273598 339718 375109
18408C75109M9673J37757J70502J45641P7582k9656j05964j55960j75506j17883
$$ 375109 424782 562539 733041 878682 956264 926608 820644 664684 489178 371295
18398C71295n8002l1500J2766j46L901L2888J12323J16304J41278J62661L2583
$$ 371295 313293 281793 294559 294413 298314 331202 443525 559829 701107 863768 896351
18387H96351l5079j50834j70627j48451j05480l4160K0861J3583N444l4022m8954
$$ 896351 861272 710438 539811 391360 285880 251720 272581 286164 291608 257586 208632
18376B08632k2899J2148j8249m6898J0495L9350M4144O573J8588R691N073j3868
$$ 208632 185733 197881 179632 132734 143229 182579 226723 233296 251884 261575 266648 252780
18364B52780r443k155K9952j9112l9073j1762K0652l2176o03K6758K908P653O137
$$ 252780 243337 241182 271134 252022 212949 201187 221839 189663 189060 215818 218726 226379 232516
18351B32516J4439j4336m0930l0721k6300k2395m7900j6421N278J0994K1476M0517
$$ 232516 246955 232619 191689 160968 134668 112273 64373 47952 53230 64224 85700 126217
18339A26217L0427j5618K2862K5564J7148k712k7987k8736k7632J1903M8356K6015
$$ 126217 156644 141026 163888 189452 206600 203888 175901 147165 119533 131436 179792 205807
18327B05807K0395K6720j8103M133M424Q488J513O552l970j8113J260L485J1641
$$ 205807 226202 252922 234819 238952 243376 251864 253377 259929 255959 237846 239106 242591 254232
18314B54232k9953j2744k0700j9286K590o746j3140k2118j3313l447J8957m125
$$ 254232 224279 211535 190835 171549 174139 167393 154253 132135 118822 115375 134332 130207
18302A30207k6878R199R882r335r285R695K3061J2855j432k1131q417P283K1398
$$ 130207 103329 112528 122410 113075 103790 113485 136546 149401 147969 126838 118421 125704 147102
18289A47102J0232j103R329J7980m909K9997M3832L7570Q853n7140m0716j8678
$$ 147102 157334 156231 165560 183540 178631 208628 252460 290030 298883 241743 201027 182349
18277A82349r572r87l854O365K3229K8683J9366k0442j1784M574j8645m5156l3537
$$ 182349 172777 171790 167936 174301 197530 226213 245579 225137 213353 217927 199282 154126 120589
18264A20589k615m624j5725K5012r869N080L7866k8880l2702p725J9756M3809
$$ 120589 117974 113350 97625 122637 112768 117848 155714 126834 94132 86407 106163 149972
18252A49972M233j5327J6738Q843p545k9563J4742K0700J4079M274j0225o580
$$ 149972 154205 138878 155616 164459 156914 127351 142093 162793 176872 181146 170921 164341
18240A64341J6910J582J0199l597j453K0236m315L8m515j2680k6482p374J409
$$ 164341 181251 182833 193032 189435 187982 208218 203903 203941 199426 186746 160264 152890 154299
18227A54299l232L9867M5462N937K2346K3441m316l6613p524k7664J3744L5500
$$ 154299 151067 190934 236396 242333 264679 288120 283804 247191 239667 212003 225747 261247
18215B61247K8677Q603K8164q839l0344l2976l232R099J6920k5257l0890j7386
$$ 261247 289924 298527 326691 317852 287508 254532 251300 260399 277319 252062 221172 203786
18203B03786k9738m926L0244K0739L6441J6054o400o670R854o006k3874p127r209
$$ 203786 174048 169122 199366 220105 256546 272600 266200 259530 269384 263378 239504 232377 223168
18190B23168m7011K108K8700K3422L4535L0347j7232O728M1690L6890J1640K8877
$$ 223168 176157 178265 206965 230387 264922 295269 278037 284765 326455 363345 374985 403862
18178D03862K2868j3222k8736K837k518p239L4622L3017K2070j141k0228M450
$$ 403862 426730 413508 384772 387609 385091 377852 412474 445491 467561 466420 446192 450642
18166D50642L2360L7089K6285q704J835J6154J5583L4863K7053L8869p12K0244
$$ 450642 483002 520091 546376 537672 539507 555661 571244 606107 633160 672029 671317 691561
18154F91561J1610k6220K6648N1975M5376O691m505J428K6419J7162M4120O466
$$ 691561 703171 676951 703599 755574 800950 807641 803136 804564 830983 848145 892265 898731
18142H98731J297R245l3388j0261L0378L2043L1984O3528Q5800M8546M1192M7533
$$ 898731 900028 909273 875885 865624 896002 928045 960029 1023557 1109357 1157903 1199095 1246628
18130A246628R0707J59078K08734K11014J02397J02905J69445K13807L02480M06799
$$ 1246628 1337335 1496413 1705147 1916161 2018558 2121463 2290908 2504715 2807195 3213994
18120C213994M73817M93368M96325O37506Q79115J270208J962842L101769N334397
$$ 3213994 3687811 4181179 4677504 5315010 6194125 7464333 9427175 12528944 17863341
18111A7863341J0699714K0780879J6779823n842615j2617210j4506659j1320303
$$ 17863341 28563055 49343934 66123757 60281142 47663932 33157273 21836970
18104B1836970n799055k535779p25605O25241J973086L882272P403417J3539880
$$ 21836970 16037915 13502136 12776531 13401772 15374858 19257130 26660547 40200427
18096D0200427J8125519R849623m160761j0556941j1097244o900068o4133Q069128
$$ 40200427 58325946 68175569 64014808 53457867 42360623 35460555 35396422 43465550
18088D3465550J5036845R885783m626056j2725781j4480859j1987079p654897
$$ 43465550 58502395 68388178 63762122 51036341 36555482 24568403 16913506
18081A6913506m448018k659305j668233j010753o33295m29022k97906j54813r42
$$ 16913506 12465488 9806183 8137950 7127197 6493902 6064880 5766974 5612161 5611219
18072E611219J37776K61131J65952j08230k29740k33607r4389K23275M89712O70197
$$ 5611219 5748995 6010126 6176078 6067848 5838108 5604501 5510112 5733387 6223099 6893296
18062F893296P49234R02752J131791J551649K291649L641952N954135J0413749
$$ 6893296 7642530 8545282 9677073 11228722 13520371 17162323 23116458 33530207
18054C3530207J7903224K1122578Q359583p116579j2951476j2263372o371834
$$ 33530207 51433431 72556009 80915592 73799013 60847537 48584165 42212331
18047D2212331K089149J1877327J8337481R526748n888998j2637114j2274414
$$ 42212331 44301480 56178807 74516288 84043036 78154038 65516924 53242510
18040E3242510n786198M224848R245303J844307p317485j0332069r326612n015391
$$ 53242510 47456312 51681160 60926463 62770770 55453285 45121216 35794604 30779213
18032C0779213Q88641P836820J2224986N139841o240170j1081327j1616808r000399
$$ 30779213 31667854 39504674 51729660 56869501 50629331 39548004 27931196 18930797
18024A8930797n569407l255371j881510j071551p11346o08637n59398n13456m15487
$$ 18930797 13361390 10106019 8224509 7152958 6441612 5832975 5273577 4760121 4344634
18015D344634j95349k2137N6684L210r9903j29342j4453J06402K64960L86572
$$ 4344634 4149285 4127148 4183832 4187042 4087139 3957797 3943344 4049746 4314706 4701278
18005D701278M72295N87603P51576J035126J445523K159567L390180N646847J0121889
$$ 4701278 5173573 5761176 6512752 7547878 8993401 11152968 14543148 20189995 30311884
17996C0311884J6792680J6352353K792315q512008j1712887r962235m156036L254672
$$ 30311884 47104564 63456917 66249232 57737224 46024337 36062102 31906066 35160738
17988C5160738J1505562J4387785L296925r280927j3828617j3550101r875104
$$ 35160738 46666300 61054085 64351010 55070083 41241466 27691365 17816261
17981A7816261n949277l433020k086801j339160q90313o28080n15820m08809l13066
$$ 17816261 11866984 8433964 6347163 5008003 4117690 3489610 2973790 2564981 2251915
17972B251915k26983j73946j28509j52314j79471j42880r7702q950R7388Q1495
$$ 2251915 2024932 1850986 1722477 1570163 1390692 1247812 1150110 1141160 1238548 1320043
17962A320043k0469j05493j81084j58175p2576j9097M0879M4316m4861j19133
$$ 1320043 1299574 1194081 1012997 854822 782246 763149 804028 848344 803483 684350
17952F84350j07100q8331l9291j0515j6295m3667l0134m2566l3001n205Q789m304
$$ 684350 577250 488919 449628 439113 422818 379151 349017 306451 273450 268245 277034 272730
17940B72730j9674j7000L244k854k2543k3924j3299j0096n524j1713m259J7780
$$ 272730 253056 236056 239300 236446 213903 189979 176680 166584 161060 149347 145088 162868
17928A62868l0443o5909l0381j8234m49L5111Q344q937J4637k6462k0813J9203
$$ 162868 132425 66516 36135 17901 17452 52563 60907 51970 66607 40145 19332 38535
17916C8535m1582k2355Q562j582K6791O416j4898r261J2490J6030J2211L064m
$$ 38535 -3047 -25402 -16840 -18422 8369 14785 -113 -9374 3116 19146 31357 34421 34417
17903C4417l162L6622J0463k1379j8918J8561K3184L8296K7958j0900j6632k4281
$$ 34417 31255 67877 78340 56961 38043 56604 79788 118084 146042 135142 118510 94229
17891I4229j6517j2747q635K5149L3140k7877m19K4512j567n387K443k0007k7874
$$ 94229 77712 64965 56330 81479 114619 86742 86323 110835 109268 103881 106324 86317 58443
17878E8443m0335J5714N867l6085k4629j0165m487O204k0591J6800K5878L544
$$ 58443 18108 33822 39689 3604 -21025 -31190 -35677 -29473 -50064 -33264 -7386 -3842
17866c842o50j5105L5474j5356r18J7587M1269J9404R028J0513J3299l913l0520
$$ -3842 -4492 -19597 15877 521 -397 17190 58459 77863 86891 97404 110703 106790 76270
17853G6270K4334n303R641o134l88k44m334M1422M305j9457r339l3938q475r654
$$ 76270 100604 95301 104942 98808 98420 98176 93842 135264 139569 120112 110773 76835 68360 58706
17839E8706J6156O909J4229L5747Q513k6841l0479k8133j3835N168m922P852n380
$$ 58706 74862 81771 96000 131747 140260 113419 82940 54807 40972 46140 41218 49070 43690
17826D3690j103J3305l994M881K0509J6230L4957J0839P296N916k7965k8641K5158
$$ 43690 42587 55892 51898 56779 77288 93518 128475 139314 146610 152526 124561 95920 121078
17813A21078p643Q288J3845k3914k845J7089Q242j8497j6267l672J1L2394J8557
$$ 121078 113435 121723 135568 111654 108809 125898 134140 115643 99376 95704 95715 128109 146666
17800A46666j1878l018k6137m0469j896J6250J1662J3576L3161J489Q369j3581
$$ 146666 134788 131770 105633 65164 63268 79518 91180 104756 137917 139406 147775 134194
17788A34194o187K6049R775J6253j1876k6568n177M257J1243m68K0620J8490J360
$$ 134194 128007 154056 163831 180084 168208 141640 136463 140720 151963 151495 172115 190605 191965
17775A91965k4823j5792r500L176Q422M35j2570n116P626j8757K0717j629j8363
$$ 191965 167142 151350 141850 145026 153448 153883 141313 136197 143823 125066 145783 144154 125791
17762A25791J2124o855K0232o425q933N921M561J5063k0046J0247j131J0280j2930
$$ 125791 137915 131060 151292 144867 135934 141855 146416 161479 141433 151680 150549 160829 147899
17749A47899r210J6662O33J2535K5330J9625K1533L453j831R20J096K1875K746
$$ 147899 138689 155351 155984 168519 193849 213474 235007 238460 236629 237549 238645 260520 263266
17736B63266K563J2718K4302k793J0418r815L0959N214l396J861j445l8520k1399
$$ 263266 265829 278547 302849 300056 310474 300659 331618 336832 333436 335297 333852 295332 273933
17723B73933O923j2015J4294K6183j7679l5261m7676q767J5084M426j4549q867
$$ 273933 280856 268841 283135 309318 291639 256378 208702 199935 215019 219445 204896 196029
17711A96029M275J9964n588j0240r44r687j8828J0997J6705L2487K2563J7988
$$ 196029 200304 220268 214680 204440 203496 193809 174981 185978 202683 235170 257733 275721
17699B75721K4907K6372q896N327L2279M9091K9858K3261k160J1781M0530K8189
$$ 275721 300628 327000 318104 323431 355710 404801 434659 457920 455760 467541 508071 536260
17687E36260j0601l826L4393j8010o6188l5439k2562M44J1960L807m163R594R09
$$ 536260 525659 521833 556226 538216 472028 436589 414027 414471 426431 430238 426075 435669 436578
17674D36578j4631J7395K166j3286j0616J3518L4063K3323R819k577J5690J0882
$$ 436578 421947 439342 441508 428222 417606 431124 465187 488510 498329 495752 511442 522324
17662E22324k0783J985K7369L8240L1536r604Q061L8841L5202M2213O3193O3664
$$ 522324 501541 503526 530895 569135 600671 591067 599128 637969 673171 715384 778577 842241
17650H42241K7008L5743L9591L4489K9714M2275Q6665P0180L4115N7729O9362
$$ 842241 869249 904992 944583 979072 1008786 1051061 1137726 1207906 1242021 1299750 1369112
17639A369112N4028Q5626Q7469J23208J36001J54633J49312J56079J49441J72755
$$ 1369112 1423140 1508766 1596235 1719443 1855444 2010077 2159389 2315468 2464909 2637664
17629B637664K03046K55460K95782L40797L50554L61076M19753N09606O30107
$$ 2637664 2840710 3096170 3391952 3732749 4083303 4444379 4864132 5373738 6003845
17620F003845Q08485J070584J356530J764959K383366L282356M664091O727094
$$ 6003845 6812330 7882914 9239444 11004403 13387769 16670125 21334216 28061310
17612B8061310R044498R809429P592880L146632j667053l968338k986020K34854
$$ 28061310 37105808 46915237 54508117 57654749 55987696 52019358 49033338 49268192
17604D9268192L454297L756564Q07529l974673q033316r294973q471802o565766
$$ 49268192 52722489 56479053 57286582 53311909 45278593 35983620 27511818 20946052
17596B0946052m600595l112551k042163j340007q46451o12648m42020l29789j95079
$$ 20946052 16345457 13232906 11190743 9850736 9004285 8391637 7949617 7619828 7424749
17587G424749O097J11910K20619K65511K95805L37854M13109N46877P06793R82984
$$ 7424749 7430846 7542756 7763375 8028886 8324691 8662545 9075654 9622531 10329324 11312308
17577A1312308J339032J752708K281932K932819L875127N288208P457862J0791236
$$ 11312308 12651340 14404048 16685980 19618799 23493926 28782134 36239996 47031232
17569D7031232J4738824J6908881J4509559P722157n88376n986453n925756j447559
$$ 47031232 61770056 78678937 93188496 100910653 100322277 94335824 88410068 86962509
17561H6962509M192114O323616K689664m922953j2486481j6170847j5650880j2830915
$$ 86962509 91154623 97478239 100167903 95244950 82758469 66587622 50936742 38105827
17553C8105827r378017o471333m322206k944656k036514j478987j164157q74867
$$ 38105827 28727810 22256477 17934271 14989615 12953101 11474114 10309957 9435090
17545I435090o77484m76016k02189l2620k9616r6587k77779l19156k29102r5462
$$ 9435090 8757606 8281590 8079401 8046781 8017165 7920578 7642799 7323643 7094541 6999079
17535F999079J16631L00430N35557Q22893J070793J446091K102007L010670M381058
$$ 6999079 7115710 7416140 7951697 8774590 9845383 11291474 13393481 16404151 20785209
17526B0785209O201468P754579P218556M412420M37117k766031l266781j469398
$$ 20785209 26986677 34741256 41959812 46372232 46809349 44043318 40776537 39307139
17518C9307139J384127K959803J771772j480935n288595p334976p327276o103833
$$ 39307139 40691266 43651069 45422841 43941906 38653311 31318335 23991059 17887226
17510A7887226m482469l064024k039966j347407r84307p77426o16196n77281n01226
$$ 17887226 13404757 10340733 8300767 6953360 5969053 5191627 4575431 3998150 3496924
17501C496924l93604k68105j89859j49302j08057j16622j21987j82978k31567
$$ 3496924 3103320 2835215 2645356 2496054 2387997 2271375 2149388 1966410 1734843
17492A734843k16840j65869j51460j43781o8699q9705p9925p0344n8731n2372
$$ 1734843 1518003 1352134 1200674 1056893 988194 898489 818564 748220 689489 637117
17482F37117m2389l5507k1334P362r564k0325j4611j9582l1118j5170k2938l9011
$$ 637117 594728 559221 537887 545249 535685 515360 500749 481167 450049 434879 411941 372930
17470C72930k3289k0085j1274J7591L0717O5758K2656j260l9700o2917n4758M522
$$ 372930 349641 329556 318282 335873 366590 432348 455004 453744 414044 351127 296369 300891
17458C00891J5211K1051l0796l2493L1349J8731k4447m6180k3997l361K618l063
$$ 300891 316102 337153 306357 273864 305213 323944 299497 253317 229320 225959 228577 225514
17446B25514J0920J9596J6006R4647M022j10676r6498r4048k0420j3863m338q910
$$ 225514 236434 256030 272036 366683 370705 260029 163531 69483 49063 35200 30862 21952
17434B1952j5783m7413j2175J0774k0542l821J1827o217K3123L8850N4295K3030
$$ 21952 6169 -41244 -53419 -42645 -63187 -67008 -55181 -61398 -38275 575 54870 77900
17422G7900k769J5310j5002K6204j6769m4610j6755K3363k4228J8771J5962m701
$$ 77900 75131 90441 75439 101643 84874 40264 23509 46872 22644 41415 57377 52676
17410E2676L830j2286k9574l794K3081k9111j2332J6537j5502m5263o480K9613
$$ 52676 56506 44220 14646 10852 33933 4822 -7510 9027 -6475 -51738 -58218 -28605
17398b8605K3152J2449j8661p422k4057j0795J5257p42J5655k4317N768J6516
$$ -28605 -5453 6996 -11665 -19087 -43144 -53939 -38682 -39424 -23769 -48086 -42318 -25802
17386b5802p175m937J3165L3254K3441m150K82J723k984o563k2652k3236L1593
$$ -25802 -32977 -37914 -24749 8505 31946 27796 28078 29801 26817 20254 -2398 -25634 5959
17373E959K2124n779k7713q311k849J1046J0975J1436j0830l642q489K953l7368
$$ 5959 28083 22304 -5409 -13720 -16569 -5523 5452 16888 6058 2416 -6073 -3120 -40488
17360d0488J7004k091J7354j1150j9974J861j4263k464K5507m2686j8452J0532
$$ -40488 -23484 -25575 -8221 -19371 -39345 -37484 -51747 -54211 -28704 -71390 -89842 -79310
17348g9310J3349M442J9257J3107l422J0306k7054K455K9875J9941J0202O110
$$ -79310 -65961 -61519 -42262 -29155 -32577 -22271 -49325 -46870 -16995 2946 13148 19258
17336A9258N230m972l4932J0938L920J2924m996J1786J0534o090j0695m481k0689
$$ 19258 24488 19516 -15416 -4478 -558 12366 7370 19156 29690 23600 12905 8424 -12265
17323a2265q811q953k2955K8516P24k0283j110J2887n1J85K7271k6005k2053j4902
$$ -12265 -21076 -30029 -52984 -24468 -23744 -44027 -45137 -32250 -32301 -32116 -4845 -30850 -52903 -67805
17309f7805k547L2481J3980L1669J5540k162K25l09j5269j7790r424M622J1150
$$ -67805 -70352 -37871 -23891 7778 23318 21156 21381 21072 5803 -11987 -21411 -16789 -5639
17296e639k6311k4810K0581L0413J8606l6306j3995K6174l233j6244j3901K1132
$$ -5639 -31950 -56760 -36179 -5766 12840 -23466 -37461 -11287 -14520 -30764 -44665 -23533
17284b3533l77r724K658J572j8854j3885P470K1135J5425j9985J7999m046r927
$$ -23533 -23910 -33634 -30976 -29404 -48258 -62143 -54673 -33538 -18113 -38098 -20099 -24145 -34072
17271c4072K8933m595k1923o798Q577n783r234J5900K0956J7843K8289J5575l1416
$$ -34072 -5139 -9734 -31657 -38455 -29878 -35661 -44895 -28995 -8039 9804 38093 53668 22252
17258B2252k8846j8087L2323L780Q166J6409r873m8235j1694k49Q114J1835K820
$$ 22252 -6594 -24681 7642 11422 19588 35997 26124 -22111 -33805 -34054 -25940 -14105 -11285
17245a1285M821K6380M645j8514n8205k9916N68o466L5221M876j9815J6796K6821
$$ -11285 -6464 19916 24561 6047 -52158 -82074 -81506 -87972 -52751 -47875 -67690 -50894 -24073
17232b4073J3344J4633m5202k3210j899j009M0752K2573j4703j9120r954m93K8821
$$ -24073 -10729 3904 -41298 -64508 -66407 -67416 -26664 -4091 -18794 -37914 -47868 -48361 -19540
17219a9540K091J6967j2332j9889j2931n227L5350n01m565j000j8457l807k0381
$$ -19540 -17449 -482 -12814 -32703 -45634 -50861 -15511 -16012 -20577 -21577 -40034 -43841 -64222
17206f4222j4742Q167K5550n428j985R576k5814j1110M356J6108k413j5315O094
$$ -64222 -78964 -70797 -45247 -50675 -52660 -43084 -68898 -80008 -75652 -59544 -61957 -77272 -71178
17193g1178K9461J2940k2161r504K8668L0712K0890J9439j0033j6283l2952L41
$$ -71178 -41717 -28777 -50938 -60442 -31774 -1062 19828 39267 29234 12951 -20001 -19660
17181a9660r724k1577j3938K7574o889P4P839J129J7440K4079j274j8858k1728
$$ -19660 -29384 -50961 -64899 -37325 -44214 -44140 -36301 -35172 -17732 6347 5073 -13785 -35513
17168c5513p148j885K6249K520m1418p818r961k7542j8927J6263J4651K3838K5377
$$ -35513 -42661 -44546 -18297 -15777 -57195 -65013 -74974 -102516 -121443 -105180 -90529 -66691 -41314
17155d1314m481J3353O513P43j2585K7551J1381j432K9402j4790j6045j5745K847
$$ -41314 -45795 -32442 -25929 -25186 -37771 -10220 1161 -271 29131 14341 -1704 -17449 -14602
17142a4602o444M483J1321J5658J6781k9909k6132N809j7246O126M2442M3058
$$ -14602 -21046 -16563 -5242 10416 27197 -2712 -28844 -23035 -40281 -34155 8287 51345
17130E1345J7636P192K7051k0844j8582k940K3669q628n911j4240k1961k2371
$$ 51345 68981 76173 103224 82380 63798 60858 84527 75899 69988 55748 33787 11416
17118A1416l668L071l110j7665J2191K4876K635m5520j1926J9660r27J6004K2060
$$ 11416 7748 10819 7709 -9956 2235 27111 29746 -15774 -27700 -8040 -8967 7037 29097
17105B9097j3875L415l1996k619L8415N5944L5152L5395j3542l1335m6127J2663
$$ 29097 15222 18637 -13359 -15978 22437 78381 113533 148928 135386 104051 57924 70587
17093G0587M1411n275J8163L801k0910j1279J9664P2380O1500O067k3022K5524
$$ 70587 111998 106723 124886 128687 107777 96498 116162 188542 250042 256109 233087 258611
17081B58611J3848K5010L0698L2801N632m0352k5015l162p406o702o974k8011
$$ 258611 272459 297469 328167 360968 366600 326248 301233 298071 290665 283963 276989 248978
17069B48978o1283m0528m5181k0475o421n909J5195j4634k3551k7724j8582K6898
$$ 248978 187695 147167 101986 81511 75090 69181 84376 69742 46191 18467 -115 26783
17057B6783O994J6603k1633L4243O5828M5157j1992j7307j6020r462M2325J6639
$$ 26783 33777 50380 28747 62990 128818 173975 161983 144676 128656 119194 161519 178158
17045A78158J466J6760q304j557L3852K4005O3426N8238M0170P1725M7864p032
$$ 178158 179624 196384 188080 186523 220375 244380 307806 366044 406214 477939 525803 518771
17033E18771P620j6632j0743L6245K1459J6949k7758q1040q0971q9506o4185n6668
$$ 518771 526391 509759 499016 535261 556720 573669 545911 464871 383900 294394 230209 173541
17021A73541o2570m9486m0469j2145k440J4429k979j4134R646J7873r505K0535
$$ 173541 110971 61485 21016 8871 6431 20860 17881 3747 13393 31266 21761 42296
17009D2296L7172L820j3770k178o335m774j6805k3285m6586J0501L1998L8450
$$ 42296 79468 83288 69518 67340 61005 56231 39426 16141 -30445 -19944 12054 50504
16997E0504K1370R476M6870L0882L5092K9332j6328j0150J4490O785J9859L8727
$$ 50504 71874 81350 128220 159102 194194 223526 207198 197048 211538 218323 238182 276909
16985B76909q079m1320j5171l7982o7549l9310J7076j5994k300q116k7091l0291
$$ 276909 268830 227510 212339 174357 106808 67498 84574 68580 66280 58164 31073 782
16973G82q320J0237K0312l632o194R282n4396P120J6751j6378J3845l4822o955
$$ 782 -7538 2699 23011 19379 13185 22467 -31929 -24809 -8058 -24436 -10591 -45413 -52368
16960e2368K1633k674k7877J7223J3008O983J0394J7502N997J540R242j9708k5711
$$ -52368 -30735 -33409 -61286 -44063 -31055 -24072 -13678 3824 9821 11361 20603 895 -24816
16947b4816M163M896J4737n513k1352j2025m469q711Q807J6009j1342j5744j9336
$$ -24816 -20653 -15757 -1020 -6533 -27885 -39910 -44379 -53090 -44283 -28274 -39616 -55360 -74696
16934g4696J8153K6184K0398n007J8520J8263k0210j9823K215j7848M987J4065
$$ -74696 -56543 -30359 -9961 -14968 3552 21815 1605 -18218 -16003 -33851 -28864 -14799
16922a4799r71M875p426N50k153L953j9389k6747J806k7219j8829L9683J2258
$$ -14799 -15770 -10895 -18321 -17771 -19924 -15971 -35360 -62107 -60301 -87520 -106349 -66666 -54408
16909e4408L3482N220j2929q767o91J8669N575l765N4448N2905L2088K1764j2914
$$ -54408 -20926 -15706 -28635 -37402 -38093 -19424 -13849 -17614 36834 89739 121827 143591 130677
16896A30677o755j0737J0675O1333M1355l6891n3084l5620k1390N273L1923j1313
$$ 130677 123922 113185 123860 185193 226548 189657 136573 100953 79563 84836 116759 105446
16884A05446n4539l8508j1515K192k6950J1614k6446o898q869K357o091m418N058
$$ 105446 50907 12399 884 3076 -23874 -12260 -38706 -45604 -54473 -52116 -58207 -62625 -57567
16871e7567L4256L0098o441k043m176l734j3080j311O595k1035k1636K4626M7005
$$ -57567 -23311 6787 346 -1697 -5873 -9607 -22687 -23998 -17403 -38438 -60074 -35448 11557
16858A1557L038k01O834l435K107J42k839k007j5686l653J3693L9639K6488j1933
$$ 11557 14595 14394 21228 17793 19900 20042 17203 15196 -490 -4143 9550 49189 75677 63744
16844F3744J5675J2608O760N5004Q9686O781n9703k4209l5487k6041j0920l9045
$$ 63744 79419 92027 98787 153791 243477 250258 190555 166346 130859 104818 93898 54853
16832E4853n574j8498J2707j1154j2920r674j1786k5889J0367L6650J315k9555
$$ 54853 49279 30781 43488 32334 19414 9740 -2046 -27935 -17568 19082 20397 -9158
16820i158r948J4576j3149N795j2119j5083P27m235L7620K4157Q629P905j3733
$$ -9158 -19106 -4530 -17679 -11884 -24003 -39086 -38359 -42594 -4974 19183 27812 35717 21984
16807B1984L632K8944q467O151n050m2296k2481K5012k9105M806K4224p073l838
$$ 21984 25616 54560 46093 52244 47194 4898 -17583 7429 -21676 -16870 7354 281 -3557
16794c557J9874M0628q734k7118k200M668N560J4815j1950m7774J0593J3293J5812
$$ -3557 16317 56945 48211 21093 18893 23561 29121 43936 31986 -15788 -5195 8098 23910
16781B3910L5969P963k0798Q572k502K1930l4936j158K0354N6151L9453M0843
$$ 23910 59879 67842 47044 55616 53114 75044 40108 38950 59304 115455 154908 195751
16769A95751Q3983R8946K03345L45705K18649l102m7166J7783J59792q4276l10258
$$ 195751 279734 378680 582025 927730 1146379 1143277 1096111 1113894 1273686 1189410 879152
16758H79152k69197k10677j54208j25376p5205j5699j3178j3338j1544K749J0083
$$ 879152 609955 399278 245070 119694 44489 28790 15612 2274 -9270 -6521 3562
16747C562n908j3307k3448K610Q301k5464p53K0432J4186J1753L163l3876r182
$$ 3562 -2346 -15653 -39101 -36491 -28190 -53654 -54407 -33975 -19789 -8036 -4873 -38749 -47931
16734d7931L5236O257J1265k9362R004L5814L4614Q807l0359j0297q281R817p371
$$ -47931 -12695 -6438 4827 -24535 -15531 20283 54897 63704 33345 23048 14767 24584 17213
16721A7213j6640L1979j1695J8879K9497L1086M3994M8025P9859K08481L43136
$$ 17213 573 32552 20857 39736 69233 100319 144313 192338 272197 480678 823814
16710H23814K47659j3450o2732o109J39160l7232k12126k47841k65610j64579
$$ 823814 1071473 1058023 995291 989182 1128342 1091110 878984 631143 365533 200954
16700B00954r2437m3453k2473L0217j3013p011j7455l3035q69m597j5261k2321
$$ 200954 108517 65064 42591 72808 59795 52784 35329 2294 1425 -3172 -18433 -40754
16688d0754k663J4493J4533M725j5717l560J3216K1068j1252l9599k881K5512
$$ -40754 -43417 -28924 -14391 -9666 -25383 -28943 -15727 5341 -5911 -45510 -48391 -22879
16676b2879J5461J7441p855J2727J154R045J377q076n1686M349J1687k0896l1080
$$ -22879 -7418 10023 2168 14895 16049 25094 26471 18395 -33291 -28942 -17255 -38151 -69231
16663f9231P310K1779Q050P960r989k919j0644p390o905q831M1945K2435N248
$$ -69231 -61921 -40142 -32092 -24132 -34121 -37040 -47684 -55074 -61979 -70810 -28865 -6430 -1182
16650a182j7242j0700j4466R751L898Q650q00j6534j0594K305L31L1145j320J0104
$$ -1182 -18424 -29124 -43590 -33839 -29941 -21291 -22091 -38625 -49219 -46914 -46583 -15438 -16758 -6654
16636f654J085j7247j8621j5126R090l990K081J1894L286N632L5095M381k7744
$$ -6654 -5569 -22816 -41437 -56563 -47473 -51463 -49382 -37488 -34202 -28570 6525 10906 -16838
16623a6838k521K2438q91j3675N324n055j133k9971L3510j4128k4540p200j2552
$$ -16838 -19359 3079 2188 -11487 -6163 -11218 -12351 -42322 -8812 -22940 -47480 -54680 -67232
16610f7232o804r357N64K4846J2550K9462J2700j3804j5691K832k2321J9890J7086
$$ -67232 -74036 -83393 -82829 -57983 -45433 -15971 -3271 -17075 -32766 -29934 -52255 -32365 -15279
16597a5279J7759j1580l4986l9654L0237J7575J0383K9183K9591j653p102k1715
$$ -15279 2480 -9100 -44086 -83740 -53503 -35928 -25545 3638 33229 31576 24474 2759
16585B759l3083n012j6089k2342K2980L4186Q619J8390K237l1896n581K342j353
$$ 2759 -30324 -35336 -51425 -73767 -50787 -16601 -7982 10408 12645 -19251 -24832 -22490 -23843
16572b3843j937L5084L0420J192o079j0771N543k3975m5531k9572j6787K298L1302
$$ -23843 -25780 9304 39724 40916 34837 24066 29609 5634 -39897 -69469 -86256 -83958 -52656
16559e2656M2053J2044l720J8652j7387k6143m8371k1844L524L5516L8414K233
$$ -52656 -10603 1441 -2279 16373 -1014 -27157 -75528 -97372 -93848 -58332 -19918 -17685
16547a7685M517R697K4405J4971l8870j0968J346j9076p472j3331K9278K2560
$$ -17685 -13168 -3471 20934 35905 -2965 -13933 -12587 -31663 -39135 -52466 -23188 -628
16535f28m1080j0632J4231K4056J1689j4539o828o546l563K0378k645J4666J1190
$$ -628 -41708 -52340 -38109 -14053 -2364 -16903 -23731 -30277 -33840 -13462 -16107 -1441 9749
16522I749q046k0420l3239N748J5066j0665j040K5854j572j9796j7596K4987M2193
$$ 9749 1703 -18717 -51956 -46208 -31142 -41807 -42847 -16993 -18565 -38361 -55957 -30970 11223
16509A1223j2973K4638K390k0526l0229p460J1674Q787R240k8844j958M334k1295
$$ 11223 -1750 22888 25278 4752 -25477 -32937 -21263 -12476 -3236 -32080 -34038 -29704 -50999
16496e0999j5384P184j239j0268J4589j2667J8405J1238j6850j4386k9927k4882
$$ -50999 -66383 -59199 -60438 -70706 -56117 -68784 -50379 -39141 -55991 -70377 -100304 -125186
16484a25186J6517M2704K2884o041M465J4642k9426K7645K3600l490J8233K0699
$$ -125186 -108669 -65965 -43081 -49122 -44657 -30015 -59441 -31796 -8196 -11686 6547 27246
16472B7246O745l7706j2997L4547L533j7513j218L922J0668m9863l56M5501O797
$$ 27246 33991 -3715 -16712 17835 21368 3855 2637 6559 17227 -32636 -32992 12509 19306
16459A9306j2814L238j4350P246j2427m4830k2263o09K7157P0362j0156m5391
$$ 19306 6492 9730 -4620 2626 -9801 -54631 -76894 -77503 -50346 20016 9860 -35531
16447c5531K443J9669O604j4780K1048m609n001Q467L364l5450j6630j011K8305
$$ -35531 -33088 -13419 -6815 -21595 -547 -5156 -10157 -1690 1674 -33776 -50406 -51417 -23112
16434b3112j2343K0K7106N616q842j2943k0818n171J2696j5620l9918L4445L2015
$$ -23112 -35455 -35435 -8329 -2713 -11555 -24498 -45316 -50487 -37791 -53411 -93329 -58884 -26869
16421b6869M0461L500j2312J8592J4104o466j1852k7176l324K2993K9983m319
$$ -26869 13592 17092 4780 23372 37476 31010 19158 -8018 -11342 11651 41634 37315
16409C7315l4728j5207J5200J509k3054j8174k795j2844l09Q060N263K6K7572
$$ 37315 2587 -12620 2580 4089 -18965 -37139 -39934 -52778 -53087 -45027 -39764 -39738 -12166
16396a2166q284k0819L705L63J3871J5170K263J7750P330m6104k4638O612R686
$$ -12166 -20450 -41269 -37564 -37201 -23330 -8160 -5897 11853 19183 -26921 -51559 -44947 -35261
16383c5261J2425k4436K1945L5853O923K232l2684l1230J1931j6679n146J6361
$$ -35261 -22836 -47272 -25327 10526 17449 19681 -13003 -44233 -32302 -48981 -54127 -37766
16371c7766j7165n716J6181K7661J9889l3814q384o603Q162R535M686j4584J0285
$$ -37766 -54931 -60647 -44466 -16805 3084 -30730 -39114 -45717 -37555 -28020 -23334 -37918 -27633
16358b7633K5750l0028l1993k1342j7011M1084L1295J5748l752j3577J4642j0122
$$ -27633 -1883 -31911 -63904 -85246 -102257 -61173 -29878 -14130 -17882 -31459 -16817 -26939
16346b6939j0414K1793J293l3497n762J4839J8372j7275K4226K5927p962k8365
$$ -26939 -37353 -15560 -14267 -47764 -53526 -38687 -20315 -37590 -13364 12563 4601 -23764
16334b3764K948n966k6309j3856j9261J4007K7208K9426L0570J4216j9611j7616
$$ -23764 -20816 -26782 -53091 -66947 -86208 -72201 -44993 -15567 15003 29219 9608 -8008
16322h008k6689L09J8477K4403M293j5038J3013j3135j6290p743L3379p851k6266
$$ -8008 -34697 -34388 -15911 8492 12785 -2253 10760 -2375 -18665 -26408 6971 -880 -27146
16309b7146q745K080J3526M4939l631j5039N106k1663J212l270R024Q809k9569
$$ -27146 -35891 -33811 -20285 24654 21023 5984 11090 -10573 -9361 -12631 -3607 5202 -24367
16296b4367J430Q439k1266M999K2343K7461J6070m6041j408n767n3981j6322J8734
$$ -24367 -22937 -14498 -35764 -30765 -8422 19039 35109 -10932 -12340 -18107 -72088 -88410 -69676
16283f9676K4919L091k7023j9634J9298L0125J0958j416M327Q945N744L2585O117
$$ -69676 -44757 -41666 -68689 -88323 -69025 -38900 -27942 -29358 -25031 -16086 -10342 22243 28360
16270B8360r717O537Q27j3251l8515l932o503J8276Q653k7264o465K0760j6238
$$ 28360 18643 25180 26007 12756 -25759 -29691 -36194 -17918 -9265 -36529 -42994 -22234 -38472
16257c8472k220L8868o840l3102j8577j1770K9959J9188K9103J9138k8650n474
$$ -38472 -40692 -1824 -8664 -41766 -60343 -72113 -42154 -22966 6137 25275 -3375 -8849
16245h849J5433O422m179l3389l244n997N596j1006K2536P598j6506j7686J6618
$$ -8849 6584 13006 8827 -24562 -27806 -33803 -28207 -39213 -16677 -9079 -25585 -43271 -26653
16232b6653j5827k193L424j7720J2162L6886J5186J5363k220Q059r374k7341j496
$$ -26653 -42480 -44673 -41249 -58969 -46807 -9921 5265 20628 18408 26467 17093 -10248 -11744
16219a1744j0462J0870k2172N92l718M025J1632J3873K0247q191k8279k6016j3769
$$ -11744 -22206 -11336 -33508 -32916 -36634 -32609 -20977 -7104 13143 4952 -23327 -49343 -63112
16206f3112N784j33L669J8907O73J1362m928l043j4696J6971j4986l10p408J4056
$$ -63112 -57328 -57461 -53792 -34885 -34212 -22850 -27778 -30821 -45517 -28546 -43532 -43842 -51250 -37194
16192c7194J2673j799J3408j0339l3589J6166J594K7646j6223j2436q358J2189
$$ -37194 -24521 -26320 -12912 -23251 -56840 -40674 -39080 -11434 -27657 -40093 -48451 -36262
16180c6262K4050J0741P261K0001K5722J020k3083j1132j5366k2355m661o673
$$ -36262 -12212 -1471 5790 25791 51513 52533 29450 18318 2952 -19403 -24064 -30737
16168c0737R71N578Q65P43M718r2K4111j2094M016l852L223k3242m803L6955K6325
$$ -30737 -29766 -24188 -23323 -22580 -17862 -17954 6157 -5937 -1921 -5773 -2550 -25792 -30595 6360 32685
16153C2685j1533p074N51j7438k508o18j2440P925Q925l763O173m931O446k0140
$$ 32685 21152 14078 14629 -2809 -5317 -5935 -18375 -10450 -1525 -5288 885 -4046 2400 -17740
16139a7740K8736J6120j4929k474l1201j675O035J1475K2319k7665j1008j0116
$$ -17740 10996 27116 12187 9713 -21488 -23163 -17128 -5653 16666 -10999 -22007 -32123
16127c2123j0883K3607J9470J227M762j1116q910j6208q46Q19J3456K571j2428
$$ -32123 -43006 -19399 71 1298 6060 -5056 -13966 -30174 -31020 -30201 -16745 -14174 -26602
16114b6602M4484P880l1470J5078j0894m621J8264K2008p454m1755j0465P012
$$ -26602 17882 25762 -5708 9370 -1524 -6145 12119 34127 26673 -15082 -25547 -18535
16102a8535j2744J4924K7053j3347K0120k3573j367K7769j2791j801K3177n192
$$ -18535 -31279 -16355 10698 -2649 17471 -6102 -7469 20300 7509 5708 28885 23693
16090B3693j7641j0789l8630K315K9256J1197J1110J9711j1726k7311p870L861
$$ 23693 6052 -4737 -43367 -41052 -11796 -599 10511 30222 18496 -8815 -16685 -12824
16078a2824J9584j1151l989L2191L2989n2778k5137J636N113l0759Q591q909K0198
$$ -12824 6760 -4391 -8380 23811 56800 4022 -21115 -19479 -14366 -45125 -36534 -45443 -25245
16065b5245L8734r969k3806K978P237J7578j1737m036l67r267o399J6240k98j8108
$$ -25245 13489 3520 -20286 -17308 -10071 7507 -4230 -8266 -8633 -17900 -24299 -8059 -8357 -26465
16051b6465j7474j0820L2254L8186O457J0441j6562m5254N512K8720K5656j2109
$$ -26465 -43939 -54759 -22505 15681 22138 32579 16017 -29237 -23725 4995 30651 18542
16039A8542J0159k318k6463l1673m144l538j2850J1409L1186J9595k0180P71j003
$$ 18542 28701 26383 -80 -31753 -35897 -39435 -52285 -40876 -9690 9905 -10275 -9504 -10507
16026a0507k5297m653M2120j4344j2912K3474n944l114j1793J808J2486M217l8597
$$ -10507 -35804 -40457 1663 -12681 -25593 -2119 -8063 -11177 -22970 -21162 -8676 -4459 -43056
16013d3056l5144J0070J0712K9p796o891k521K7685L111L9414k919L13l4518J2785
$$ -43056 -78200 -68130 -57418 -57389 -65185 -72076 -74597 -46912 -43801 -4387 -7306 -6993 -41511 -28726
15999b8726L1836J8612r949k905m33P994K8760j5750k6182j5354L0584N29j0799
$$ -28726 3110 21722 11773 8868 8435 16429 45189 29439 3257 -12097 18487 19016 8217
15986H217j4653J0310m477N671P565k344k6953j45J9327j97o014J9342J262K74
$$ 8217 -6436 3874 -603 5068 12633 10289 -16664 -16809 2518 2321 -3693 15649 16911 17185
15972A7185j8416j8002l6492p155K3416l0449K0949K2118R89K293n164o867L001
$$ 17185 -1231 -19233 -55725 -62880 -39464 -69913 -48964 -26846 -25857 -23564 -28728 -35595 -32594
15959c2594n161m706p79M2218J2634j0464l1865l39K9375o874K4585j6470k1483
$$ -32594 -37755 -42461 -43240 -1022 11612 1148 -30717 -31056 -1681 -8555 16030 -440 -21923
15946b1923j3041L5571J3871o187l8177j7843K0832n742O718P326K869p755k8310
$$ -21923 -34964 607 14478 8291 -29886 -47729 -26897 -32639 -25921 -18595 -15726 -23481 -51791
15933e1791r464J2938J3282J2585R179O202j0003j8631J5161P120o138L153j6342
$$ -51791 -61255 -48317 -35035 -22450 -13271 -7069 -17072 -35703 -20542 -13422 -19560 -16407 -32749
15920c2749M122J1965j1775K7074L491j2827M319J9899m5352k8494p905J0123
$$ -32749 -28627 -16662 -28437 -1363 2128 -10699 -6380 13519 -31833 -60327 -68232 -58109
15908e8109K5125M38J5670M455l8977k0994J2252J3771J7926J5733K9759J8644
$$ -58109 -32984 -32546 -16876 -12421 -51398 -72392 -60140 -46369 -28443 -12710 17049 35693
15896C5693K4339q245m0354j3629J3322O770k7111n143J2209O194j683j445m824
$$ 35693 60032 51787 11433 -2196 11126 17896 -9215 -14358 -2149 4045 2362 917 -3907
15883c907o647N3k6013p062J5068Q951j9871N568K6903J9269J007k2632K023O381
$$ -3907 -10554 -10501 -36514 -43576 -28508 -19557 -39428 -33860 -6957 12312 13319 -9313 -7290 -909
15869i09J1342O664j5248o584q772j6777n431N563p52L2967M56k7996J5955L0016
$$ -909 10433 17097 1849 -4735 -13507 -30284 -35715 -30152 -30904 2063 2519 -25477 -9522 20494
15855B0494K5607K913j5405K511l6241o0941p647L4897O636j8836m379j302J7869
$$ 20494 46101 49014 33609 36120 -121 -61062 -68709 -33812 -27176 -46012 -50391 -51693 -33824
15842c3824J0023j0716j4029L0255R347r461l2431l3091M825J7559M6692K9345
$$ -33824 -23801 -34517 -48546 -18291 -8944 -18405 -50836 -83927 -79102 -61543 -14851 14494
15830A4494p819J1971J9843J0070J6230p579n213k1590k3300K2640Q617j7858
$$ 14494 6675 18646 38489 48559 64789 57210 51997 30407 7107 29747 38364 20506
15818B0506j6359k4831k3330j0457J7820j0456l510K1512j2927j3167J5448p262
$$ 20506 4147 -20684 -44014 -54471 -36651 -47107 -50617 -29105 -42032 -55199 -39751 -47013
15806d7013q953K0845Q44k50j6244o717j9425j1458R508L8642J8147O098K4111
$$ -47013 -55966 -35121 -34277 -34527 -50771 -57488 -76913 -88371 -78863 -40221 -22074 -15976 8135
15793H135o174L119N297N362Q563j3150j9772k9260j8082K0825M3573l5477k8475
$$ 8135 1961 5080 10377 15739 24302 11152 -8620 -37880 -55962 -35137 8436 -27041 -55516
15780e5516J7209J6550n206n599J1074K645J6339j3192k0571K6140K6117j8209
$$ -55516 -38307 -21757 -26963 -32562 -21488 -18843 -2504 -15696 -36267 -10127 15990 -2219
15768b219j8372K5176P361k7100k0720r635M427K3656k6610j0469K4528m131j1540
$$ -2219 -20591 4585 11946 -15154 -35874 -45509 -41082 -17426 -44036 -54505 -29977 -34108 -45648
15755d5648J794J7749K6893J917O644J0226l0459j6446k8276k2444K0285J9231
$$ -45648 -43854 -26105 788 2705 9349 19575 -10884 -27330 -55606 -78050 -57765 -38534
15743c8534R070P818j1340L004L4312j3403J3987Q652k6836m602j1813j1901j0561
$$ -38534 -29464 -21646 -32986 -29982 4330 -9073 4914 13566 -13270 -17872 -29685 -41586 -52147
15730e2147J6822l7501l4367J4673M7076J592K071K2648K8358r431j5220K1526
$$ -52147 -35325 -72826 -107193 -92520 -45444 -43852 -41781 -19133 9225 -206 -15426 6100
15718F100k8925k3628O401K506j201J3406J3122p462j4352L236J4944J7090O876
$$ 6100 -22825 -46453 -40052 -37546 -38747 -25341 -12219 -19681 -34033 -30797 -15853 1237 8113
15705H113j1906K5026p203r859r57j2045J491j9316K86k715J7878M5404J4341
$$ 8113 -3793 21233 14030 4171 3214 -8831 -7340 -26656 -26370 -29085 -11207 34197 48538
15692D8538j6849l7711K7674J7578k1480k416K7636K096k9558j428k6569k5606
$$ 48538 31689 -6022 21652 39230 17750 15334 42970 45066 15508 14080 -12489 -38095
15680c8095O279Q23J3908L0980K3735j0664n1378J3141j1005j6855j4821k5730
$$ -38095 -31816 -30993 -17085 13895 37630 26966 -24412 -11271 -22276 -39131 -53952 -79682
15668g9682M7599L7695q064J6506o219n723K887L832L832r177l4763L378J0571
$$ -79682 -32083 5612 -2452 14054 7835 2112 4999 8831 12663 3486 -31277 -27899 -17328
15655a7328J5101L2177j4470j5616j7208J7655K2512J2013l83j7647k2912n326
$$ -17328 -2227 29950 15480 -136 -17344 311 22823 34836 34453 16806 -6106 -11432
15643a1432O533j0181j958l165K3036R510j5876J054J904q408K0296J8457p43
$$ -11432 -4899 -15080 -17038 -20203 2833 12343 -3533 -2479 -575 -8983 11313 29770 29027
15630B9027k2426j1238K345j3852J0297L6122J4700O179N509L83r723k048q081
$$ 29027 6601 -4637 -2292 -16144 -5847 30275 44975 51154 56663 57046 47323 45275 37194
15617C7194M368n480j9775l6141j0194K3906K471j7574q872o51n750L657J8106
$$ 37194 41562 36082 16307 -19834 -30028 -6122 -3651 -21225 -30097 -30748 -36498 -32841 -14735
15604a4735K027J6273N77j892K119j3022J1804M036k3668k8142k7709J5764K6428
$$ -14735 -12708 3565 4142 2250 4369 -8653 3151 7187 -16481 -44623 -72332 -56568 -30140
15591c0140J9246L3307J0556L530R946j8577k4026k598p186J68k0291J3325O818
$$ -30140 -10894 22413 32969 36499 46445 27868 3842 1244 -5942 -5774 -26065 -12740 -5922
15578e922L585M207K9587K2010l9483n2751J8123K3850J0971Q940K4217q283k2177
$$ -5922 -2337 1870 31457 53467 13984 -38767 -20644 3206 14177 23117 47334 39051 16874
15565A6874O871j2982K950l9934r067J5609J9723J3752k2560k2053k1262N426
$$ 16874 23745 10763 13713 -26221 -35288 -19679 44 13796 -8764 -30817 -52079 -46653
15553d6653K9570j780r63O075j6844l717M163j3856k1523p253m233n27J897L2309
$$ -46653 -17083 -18863 -19826 -13751 -30595 -34312 -30149 -44005 -65528 -72781 -77014 -77541 -75644 -43335
15539d3335L6709J9551O61k6200k0257K7077L7934J0014l76p058j5068l107j2490
$$ -43335 -6626 12925 13586 -12614 -32871 -5794 32140 42154 41778 34720 19652 16545 4055
15526D055k720P050j4358j2349o170J6800J9720m161q536m063K093k1591K7873
$$ 4055 1335 8385 -5973 -18322 -24492 -7692 12028 7867 -669 -4732 -2639 -24230 3643
15513C643N470j3932k7485j4307K6449J0155O195J985j604J094p872P94N187k4840
$$ 3643 9113 -4819 -32304 -46611 -20162 -10007 -3812 -1827 -3431 -2337 -10209 -9415 -4228 -29068
15499b9068j4176R981p600J1516K7941J8859O351l4239k948P025K127N64J5794
$$ -29068 -43244 -33263 -40863 -29347 -1406 17453 23804 -10435 -13383 -6358 -4231 -3667 12127
15486A2127K293L387j9303j328j9815k1272J7049j3770R834J7872K0426k8252
$$ 12127 14420 17807 -1496 -2824 -22639 -43911 -26862 -40632 -30798 -12926 7500 -20752
15474b0752r396K3863N827R918n556k0578q563K3614m449k1167j4452K5264K1882
$$ -20752 -30148 -6285 -458 9460 3904 -16674 -25237 -1623 -6072 -27239 -41691 -16427 5455
15461E455j1825J4300L0481M627K7480n698l5176l0211k5352l694N0701P423j5627
$$ 5455 -6370 7930 38411 43038 70518 64820 29644 -567 -25919 -29613 21088 28511 12884
15448A2884o303k1856R053K413m646k466j304L3859j825k2380m782k5097k319
$$ 12884 6581 -15275 -6222 -3809 -8455 -10921 -12225 21634 19809 -2571 -7353 -32450 -34769
15435c4769J2738k04k76M2670J0844l8461K189L4635k9520k1915M975n598K2321
$$ -34769 -22031 -22235 -22511 20159 31003 -7458 -5269 29366 -154 -22069 -17094 -22692 -371
15422c71K2657J4044j3129J0814J0400m462l0020k7741j2860Q739J8559K6751
$$ -371 22286 36330 23201 34015 44415 39953 9933 -17808 -30668 -21929 -3370 23381
15410B3381m884p928l321K1050L05k1177j7570m235J3555J2306j2772J5868J0716
$$ 23381 18497 10569 7248 28298 28603 7426 -10144 -14379 -824 11482 -1290 14578 25294
15397B5294m784r653M163m899k4231j3892j8075o595J8458n24k7386j3419L9375
$$ 25294 20510 10857 15020 10121 -14110 -28002 -46077 -52672 -34214 -34738 -62124 -75543 -36168
15384c6168J6036m191P363j2333J1282k914n326K2953l068l149O910L024L0679
$$ -36168 -20132 -24323 -16960 -29293 -18011 -20925 -26251 -3298 -6366 -9515 -2605 419 31098
15371C1098k7463l6726J5188J5893K592j5793j3638K7809o979j8110l072J5995
$$ 31098 3635 -33091 -17903 -2010 582 -15211 -28849 -1040 -8019 -26129 -29201 -13206
15359a3206J445m740J4420L0454P006k236j2716k1295l0745j6743j7829Q130M2055
$$ -13206 -11761 -16501 -2081 28373 35379 33143 20427 -868 -31613 -48356 -66185 -58055 -16000
15346a6000M3182K0622j3041j9455j4939M87J9208R025j7055K358r793o777J7378
$$ -16000 27182 47804 34763 15308 369 856 20064 29089 12034 14392 4599 -2178 15200
15333A5200r311k8002k1526K9774J5656L549J493J8152j1978l7899k6526R865
$$ 15200 5889 -22113 -43639 -13865 1791 5340 6833 24985 13007 -24892 -51418 -41553
15321d1553L7396k115k6075N527R642J6831J8105j3195j4222j9144k6121o416
$$ -41553 -4157 -6272 -32347 -26820 -17178 -347 17758 4563 -9659 -28803 -54924 -61340
15309f1340J5504N63p20j9656r460K3541K7338J5970k2360j6827K5951j4987l937
$$ -61340 -45836 -45273 -45993 -65649 -75109 -51568 -24230 -8260 -30620 -47447 -21496 -36483 -40420
15296d0420J6702O103r959m032J0554k0062M241M818j4899J9218r076r111M5014
$$ -40420 -23718 -17615 -27574 -31606 -21052 -41114 -36873 -32055 -46954 -27736 -36812 -45923 -909
15283i09j1721l2882k8956M5157Q319L440J8593K077K8025k312p482l4379K8847
$$ -909 -12630 -45512 -74468 -29311 -20992 -17552 1041 3118 31143 28831 21349 -13030 15817
15270A5817K0529K486k5117j2121l235J1294k1052k3482K232K041Q48J4544q5
$$ 15817 36346 38832 13715 1594 -1641 9653 -11399 -34881 -32649 -30608 -29760 -15216 -15301
15257a5301j9003K2474N391o110j3020J4625J3645J4788J3927j7085q953j1107
$$ -15301 -34304 -11830 -6439 -12549 -25569 -10944 2701 17489 31416 14331 5378 -5729
15245e729K1001j1394o518j4010j7429K2620N657m967q856R827l900O718K4666
$$ -5729 15272 3878 -2640 -16650 -34079 -11459 -5802 -10769 -19625 -9798 -13698 -6980 17686
15232A7686k3257l92Q316j4608k2940r852J4936J8182m275j1597j5831J1280M4426
$$ 17686 -5571 -5963 2353 -12255 -35195 -45047 -30111 -11929 -16204 -27801 -43632 -32352 12074
15219A2074J0240j5434k2332k089l576m606K362J032j043R276Q505J0092Q733
$$ 12074 22314 6880 -15452 -17541 -21117 -25723 -23361 -22329 -23372 -14096 -5591 4501 13234
15206A3234L759L1019K005j4880k694j882j7466j6419m491K2645Q562k4525j4907
$$ 13234 16993 48012 50017 35137 32443 30561 13095 -3324 -7815 14830 23392 -1133 -16040
15193a6040J068Q208N3998L3674l4186k2500M03l2819j5894K5324N736l8696p014
$$ -16040 -14972 -6764 47234 80908 46722 24222 24625 -8194 -24088 1236 6972 -31724 -38738
15180c8738L6722K4020r680l4371j3224J866m9m501K1801K6746l0749j0310N406
$$ -38738 -2016 22004 12324 -22047 -35271 -33405 -33454 -37955 -16154 10592 -20157 -30467 -25061
15167b5061L3658J6496J199j9394m43r753Q002K8051j9610l0864j4296j2500j0609
$$ -25061 8597 25093 26292 6898 6455 -3298 4704 32755 13145 -17719 -32015 -44515 -55124
15154e5124l170k1092J4003M6305L722J24j1051O107J9377j5473j7584J6859K7623
$$ -55124 -58294 -79386 -65383 -19078 -15356 -15232 -26283 -20176 -799 -16272 -33856 -16997 10626
15141A0626J5422k8124k0475j1005j6745k3288j126P981N814L0501K3688j1489
$$ 10626 26048 -2076 -22551 -33556 -50301 -73589 -74715 -66734 -60920 -30419 -6731 -18220
15129a8220j6516J597L2066o979j2080k084r801R084k1731K2006K5259n927j5200
$$ -18220 -34736 -33139 -1073 -8052 -20132 -22216 -32017 -22933 -44664 -22658 2601 -3326 -18526
15116a8526n344j780K2844k055l825k1034J2756p694r284k240j9228L4726M311
$$ -18526 -23870 -25650 -2806 -4861 -8686 -29720 -16964 -24658 -33942 -36182 -55410 -20684 -16373
15103a6373p311L0574j1472l8624j0558O028J2732p251K4825j5090p256J6177
$$ -16373 -23684 6890 -4582 -43206 -53764 -47736 -35004 -42255 -17430 -32520 -39776 -23599
15091b3599q284J6956K5941O617j0823k1845J0894l643j830K0376K9377J065l0811
$$ -23599 -31883 -14927 11014 17631 6808 -15037 -4143 -7786 -9616 10760 40137 41202 10391
15078A0391k2604K8336n879M8933L783l9679j7078n283k2198K37L9068K668l2226
$$ 10391 -12213 16123 10244 59177 62960 23281 6203 920 -21278 -21041 18027 20695 -11531
15065a1531k0378j0025r880J8719M3636J6343j3500j1075n688J3397j720l615
$$ -11531 -31909 -41934 -51814 -33095 10541 26884 13384 2309 -3379 10018 8298 4683
15053D683q300q487k364J5236l641n7554K53M2979O531r852K947o052J2082N1783
$$ 4683 -3617 -12104 -14468 768 -2873 -60427 -60174 -17195 -10664 -20516 -17569 -23621 -11539 40244
15039D0244J882r372J5948m6284j3993p955j7094K7024K956k3108N483L4192J0550
$$ 40244 42126 32754 48702 2418 -11575 -19530 -36624 -9600 -6644 -29752 -24269 9923 20473
15026B0473n834j4027j4784J554j7382l2230q150J6991K1502k923K4100M706L2936
$$ 20473 14639 612 -14172 -12618 -30000 -62230 -70380 -53389 -31887 -34810 -10710 -6004 26932
15013B6932P726k7755M252Q865p164J3335J1672J3783j1040j4224k3375j909M0627
$$ 26932 34658 6903 11155 20020 12856 26191 37863 51646 40606 26382 3007 1098 41725
15000D1725n349l2701k527k4645K3486L5069k0848L524l590J792j5105P93J6322
$$ 41725 36376 3675 1148 -23497 -11 35058 14210 17734 14144 15936 831 1624 17946
14987A7946O461J4051R223K91K3529K7839k10j3840L7695P6784P8094J38380K35742
$$ 17946 24407 38458 47681 47972 71501 99340 99130 85290 122985 199769 277863 416243 651985
14974F51985M81976O57150M7368l51212m48225m50459k59084j24937q9744l4004
$$ 651985 1133961 1791111 1838479 1487267 1039042 588583 329499 204562 114818 80814
14964H0814j0320J82j0121j6058J5023K5352j094j8320l4252j1116o303M521R429
$$ 80814 70494 70676 60555 44497 59520 84872 83778 65458 31206 20090 13787 18308 27737
14951B7737Q252k0473M730j9456k4875j7302K7679O733l695J5628L669j8026j5403
$$ 27737 35989 15516 20246 790 -24085 -41387 -13708 -6975 -10670 4958 8627 -9399 -24802
14938b4802J5853K1355L1916r728m6066N616K61l0562o421L0575L2394J0897j8526
$$ -24802 -8949 12406 44322 34594 -11472 -5856 -5595 -36157 -42578 -12003 20391 31288 12762
14925A2762k9017l7036m597J9295Q086K8988K9292L6289j1142k1509j8953J953
$$ 12762 -16255 -53291 -57888 -38593 -30507 -1519 27773 64062 52920 31411 12458 14411
14913A4411o363m518J5135r750k0887j3236q56N46O536M2763L5921M326k7699
$$ 14411 8048 3530 18665 8915 -11972 -25208 -26064 -25518 -18982 23781 59702 64028 36329
14900C6329l3039j0790L3129j2170j3603L1264K7866k5550k6708K772K4981j181
$$ 36329 3290 -7500 25629 13459 -144 31120 58986 33436 6728 9500 34481 33300
14888C3300l238j3133j3971J9791l075m4160l1714P878K4483J038J0133j6695
$$ 33300 30062 16929 2958 22749 19674 -24486 -56200 -48322 -23839 -22801 -12668 -29363
14876b9363p124J6303k186J9881O942j961J5856M295K85N86M664k25J0201J9915
$$ -29363 -36487 -20184 -22370 -2489 4453 2492 18348 22643 22928 23514 28178 27953 38154 58069
14862E8069k3985r060J3231j7021k6825J4953K0962O425J0287n0167k1319J8499
$$ 58069 34084 25024 38255 21234 -5591 9362 30324 36749 47036 -3131 -24450 -5951
14850e951p641Q519J469k7041Q114K8909K182L6544K009m2566k2096P467o70k389
$$ -5951 -13592 -5073 -3604 -30645 -22531 6378 8560 45104 47113 4547 -17549 -10082 -10752 -13141
14836a3141J6162N818m6208m432j8518P457J6791L6062j2552k2616R819j1290
$$ -13141 3021 8839 -37369 -41801 -60319 -52862 -36071 -9 -12561 -35177 -25358 -36648
14824c6648O732Q717j8052N787L6067K4731J1854M34k5232n428k3274R74k8821
$$ -36648 -29916 -21199 -39251 -33464 2603 27334 39188 39622 14390 8962 -14312 -13338 -42159
14811d2159k5175L3360K3452J368j881j9875J1392q473j2359P721L7672L7029
$$ -42159 -67334 -33974 -10522 -9154 -11035 -30910 -19518 -27991 -40350 -32629 5043 42072
14799D2072l86N342j6648P443q638O52j1570P804P80K082j9607K8178l4042j4324
$$ 42072 41686 47028 30380 37823 29185 29837 18267 26071 26851 28933 9326 37504 3462 -10862
14785a0862L4508k935l1723j9420n062n161L927j1092q435K5395L2332k04M6146
$$ -10862 23646 20711 -11012 -30432 -35494 -40655 -36728 -47820 -56255 -30860 1472 1268 47414
14772D7414o911k350j5160k2006n156K2418o263k6698l8750L2978L7049j6547
$$ 47414 40503 38153 22993 987 -4169 18249 11986 -14712 -53462 -20484 16565 18
14760A8J3574L1114l7233j9471r705L6443P043o856n707k2400J7941O6129n307
$$ 18 13592 44706 7473 -11998 -21703 14740 21783 14927 9220 -13180 4761 70890 65583
14747F5583m5621M329k877k2079j623k5591j98J4661Q224K8886p268j6846j4637
$$ 65583 19962 24291 21414 -665 -2288 -27879 -28077 -13416 -5192 23694 16426 -420 -15057
14734a5057j9146L0697K236k0751k730J4157J0211K1054j4690j7981P866n936
$$ -15057 -34203 -3506 -1270 -22021 -24751 -10594 -383 20671 5981 -12000 -4134 -10070
14722a0070K440L4683k3k7674j3674j46q298j0170o545J7259q444j2952K4253
$$ -10070 -7630 27053 27030 -644 -14318 -14464 -22762 -32932 -39477 -22218 -30662 -43614 -19361
14709a9361L0085L4089j5783k5165J6884J8333l4076l6049N420m92J4407J4349
$$ -19361 10724 44813 29030 3865 20749 39082 5006 -31043 -25623 -26115 -11708 2641
14697B641k531r070K1640J9184l708Q813K2269M073l6123k7343J8755K57Q878
$$ 2641 110 -8960 12680 31864 28156 36969 59238 63311 27188 -155 18600 18857 27735
14684B7735l333k0671K250o363K985J4383L9837p048P629N8413L6972r563j5189
$$ 27735 24402 3731 5981 -382 2603 16986 56823 49775 57404 115817 152789 143226 128037
14671A28037j9684m4415l2441l0197j1989L938p603r175j986J1159M882o25k0636
$$ 128037 108353 63938 31497 1300 -10689 -6751 -14354 -23529 -25515 -14356 -9474 -10099 -30735
14658c0735n008K6304N52J024q932K4093J9126M991J4511k4293k3031N5254L8990
$$ -30735 -35743 -9439 -8887 -7863 -16795 7298 26424 31415 45926 21633 -1398 53856 92846
14645I2846l768k1079J2452j4348j7020k154N009k7086m521k1981k5727L886M0712
$$ 92846 89078 67999 80451 66103 49083 46929 51938 24852 20331 -1650 -27377 -23491 17221
14632A7221n71m1486R530P280j989p403J7588J5640j7592m351J9326K2309j4715
$$ 17221 16650 -24836 -15306 -8026 -10015 -17418 170 15810 -1782 -6133 13193 35502 20787
14619B0787P657J3317k3928j6398J7185l148p369K959m959r663N362P118q44n543
$$ 20787 28444 41761 17833 1435 18620 15472 8103 11062 6103 -3560 1802 8920 8076 2533
14605B533q057L270K7719J4432Q724j6323p906j8729l74R256K354k4435l1147
$$ 2533 -5524 -2254 25465 39897 48621 32298 24392 5663 5289 14545 16899 -7536 -38683
14592c8683J2342K4450J1865L9069j8686p568J0908j855j2520k4159J0210R91
$$ -38683 -26341 -1891 9974 49043 30357 22789 33697 31842 19322 -4837 5373 6364
14580F364L688J0504j7726j0934J8012o985o709j9066j4128r182K8927n460J2442
$$ 6364 10052 20556 2830 -8104 9908 2923 -3786 -22852 -36980 -46162 -17235 -22695 -10253
14567a0253L0583k175p724Q093Q59l0238K417q111Q961K2811P893o642J1635Q843
$$ -10253 20330 18155 10431 18524 19383 -10855 -8438 -16549 -7588 15223 23116 16474 28109 36952
14553C6952P204p723j6047O479J1075k2216j6200M51M224R942J5273j687m5776
$$ 36952 44156 36433 20386 26865 37940 15724 -476 -25 4199 14141 29414 27727 -18049
14540a8049k8516J5044J5423K1842p180M760M593j2480k2650j2331L6300n887
$$ -18049 -46565 -31521 -16098 5744 -1436 3324 7917 -4563 -27213 -39544 -3244 -9131
14528i131m80p849R536O881j4890M70J4560P03n566J0601J6839l093m347p467
$$ -9131 -9611 -17460 -7924 -1043 -15933 -15463 -903 -200 -5766 4835 21674 18581 14234 6767
14514F767l5201j1249O174l833N1269m701O617N857j1477J7795J9936K010j2642
$$ 6767 -28434 -39683 -33509 -37342 13927 9226 15843 21700 10223 28018 47954 49964 37322
14501C7322j2299j2988M651p689K5086N310k9305j0924j1472K0688O061J6478
$$ 37322 25023 12035 16686 8997 34083 39393 10088 -836 -12308 8380 14441 30919
14489C0919r21j5268j0280M843r096j4441J6333j173k8878j7932L7671r305j5855
$$ 30919 29998 14730 4450 9293 197 -14244 2089 916 -27962 -45894 -8223 -17528 -33383
14476c3383J2666K0837K8012R630k3645l2474O061j0380Q041K1195L815K2892
$$ -33383 -20717 120 28132 37762 14117 -18357 -12296 -22676 -14635 6560 10375 33267
14464C3267Q46j0214J7286m786j2162k1110p44K1053K1437J0192l4584m9539J425
$$ 33267 34113 23899 41185 36399 24237 3127 2383 23436 44873 55065 20481 -29058 -27633
14451b7633M0868K8972m819k4140J0142N512j8373P785j0494k1580j3528Q511
$$ -27633 13235 42207 37388 13248 23390 28902 10529 18314 7820 -13760 -27288 -18777
14439a8777L674K1264K3640L8383j4516j7128l9937J1381J7230q536K7556k3775
$$ -18777 -15103 6161 29801 68184 53668 36540 -3397 7984 25214 16678 44234 20459
14427B0459K809j5119q217k7323L985j936J554L4677N756o437j2722j490J019
$$ 20459 23268 8149 -68 -27391 -23406 -25342 -23788 10889 16645 10208 -2514 -4004 -2985
14414b985J2536J931l0176k2803N8047K3538j7193J5219Q557k1310r695k9013
$$ -2985 9551 11482 -18694 -41497 16550 40088 22895 38114 46671 25361 15666 -13347
14402a3347j2844J3406K8676J1277k0670j8164j9036M3640R348J1924K7689l9996
$$ -13347 -26191 -12785 15891 27168 6498 -11666 -30702 12938 22286 34210 61899 21903
14390B1903l8028l969l2328J2373L8656K1973J6987M721J398k1657N098j6094
$$ 21903 -16125 -20094 -52422 -40049 -1393 20580 37567 42288 43686 22029 27127 11033
14378A1033J5786J213K612j191k6270j9932j1553R715J5144J0786j5661J0293
$$ 11033 26819 28032 30644 29453 3183 -16749 -28302 -18587 -3443 7343 -8318 1975
14366A975J7683o11Q86Q729n215k4101M782K4765j3208j671l0445p211m784J4706
$$ 1975 19658 19047 19933 28662 23447 -654 4128 28893 15685 14014 -16431 -23642 -28426 -13720
14352a3720J2250J1376N510n112k7323L712K3020K0549m565J6696M358j5218j048
$$ -13720 -1470 9906 15416 10304 -17019 -13307 9713 30262 25697 42393 46751 31533 30485
14339C0485p508Q645r705L224j6378k5071m873L9025K131l1176j2695k0842J7947
$$ 30485 22977 31622 21917 25141 8763 -16308 -21181 17844 19975 -11201 -23896 -44738 -26791
14326b6791M4897J6834P601j0412j4205m4073L463K4118o148M656R566q720R334
$$ -26791 18106 34940 42541 32129 17924 -26149 -22686 1432 -4716 -60 9506 786 10120
14313A0120j1177R973J0215k844J781p498r729j0531J0216J3790K287j2721l0687
$$ 10120 -1057 8916 19131 16287 18068 10570 841 -9690 526 14316 16603 3882 -26805
14300b6805K8986m285j245K3066j6774l934R231Q692m065P892K2507q02l153j9783
$$ -26805 2181 -2104 -3349 19717 2943 -991 8240 16932 12867 20759 43266 42464 39311 19528
14286A9528k0951j4271O206J7906J7586m648J262N26m2788K2665J7717M860j9851
$$ 19528 -1423 -15694 -9488 8418 26004 21356 22618 23144 -19644 3021 20738 25598 5747
14273E747j8709P838J9871N637K2716j3261K1307j8926n106o925R516j1932q635
$$ 5747 -12962 -5124 14747 20384 43100 29839 51146 32220 27114 20189 29705 17773 9138
14260I138o482L876p656q493m261J562R180K9266N775k3147k0738N237J3555J7928
$$ 9138 2656 6532 -1124 -9617 -13878 -12316 -3136 26130 31905 8758 -11980 -6743 6812 24740
14246B4740j4m465P176p654k4243l088K6252l115m3720n264Q294j3638K9953K2760
$$ 24740 24726 20261 27437 19783 -4460 -7548 18704 15589 -28131 -33395 -25101 -38739 -8786 13974
14232A3974L341l45k2154k2726p900J1163K109P435L0932r761J1407J9427J0321
$$ 13974 17315 16970 -5184 -27910 -35810 -24647 -22538 -15103 15829 6068 17475 36902 47223
14219D7223j1969j3448j3703j8006l0702P735K7627L65O815n34r726j9759K0294
$$ 47223 35254 21806 8103 -9903 -40605 -32870 -5243 -4878 1937 1403 -8323 -28082 -7788
14206g788j590j5826j5329J0724K6688M304m467j6081m2198l834J7471J0629Q991
$$ -7788 -9378 -25204 -40533 -29809 -3121 1183 -3284 -19365 -61563 -65397 -47926 -37297 -28306
14193b8306J0441L3841M43l2945n810P405K2229J0988n629j4848k411Q225k220
$$ -28306 -17865 15976 16419 -16526 -22336 -14931 7298 18286 12657 -2191 -4602 3623 1403
14180A403q610k537J2347j3962q676O916J5792L0853K4686l570J2164k894l7947
$$ 1403 -7207 -9744 2603 -11359 -20035 -13119 2673 33526 58212 54642 66806 63912 25965
14167B5965L8868K224m0296j9807j1588j1102n642J1414J1701r611j0423J0341
$$ 25965 64833 67057 26761 6954 -4634 -15736 -21378 -9964 1737 -7874 -18297 -7956
14155g956O460J1852L334r654l462L572l3494j3943L1820K1376J0817M997l973
$$ -7956 -1496 10356 13690 4036 574 4146 -29348 -43291 -11471 9905 20722 25719 21746
14142B1746j6510o761Q430j6192j8513Q124m2j4226p693m190J7198J1714K2155
$$ 21746 5236 -1525 6905 -9287 -27800 -19676 -19718 -33944 -41637 -45827 -28629 -16915 5240
14129E240m778m459N781J0814n178k6137j662J4261j1439l4511J9406m449Q434
$$ 5240 462 -3997 1784 12598 7420 -18717 -20379 -6118 -17557 -52068 -32662 -37111 -28677
14116b8677o088j5659J7111n009J6052J2593j9089K5242K3352j206k7711M170
$$ -28677 -34765 -50424 -33313 -38322 -22270 -9677 -28766 -3524 19828 18622 -9089 -4919
14104d919j202J3388J5674J791l635j533P886K8120m600k936j9375j0158q407
$$ -4919 -6121 7267 22941 24732 21097 19564 27450 55570 50970 48034 28659 18501 10094
14091A0094o688K435N266N738k1664j8932j172q363J1249K4614M5386J3671l8094
$$ 10094 3406 5841 11107 16845 -4819 -23751 -24923 -33286 -22037 2577 47963 61634 23540
14078B3540j4186J5139j4179m970K2723R831k7408j0741j4096K2804J468J4097
$$ 23540 9354 24493 10314 5344 28067 37898 10490 -251 -14347 8457 9925 24022
14066B4022J2991j4905k5032j30K2895K3783k895j084K6774j1068k0650j7461
$$ 24022 37013 22108 -2924 -3054 19841 43624 40729 39645 66419 55351 34701 17240
14054A7240j0226J6362j909j9142l486j3239j232L2424Q477j5920m000J3602N467
$$ 17240 7014 23376 21467 2325 -1161 -14400 -15632 16792 25269 9349 5349 18951 24418
14041B4418O400o423j7499Q176j6676q004l013J5135L296j9058P398L0671J1566
$$ 24418 30818 24395 6896 15072 -1604 -9608 -12621 2514 5810 -13248 -5850 24821 36387
14028C6387J3809k2774j8770o429J5047j1267p743k8305J9405q684j5107L339
$$ 36387 50196 27422 8652 2223 17270 6003 -1740 -30045 -10640 -19324 -34431 -31092
14016c1092J2579K8897L5715j3951j2489j0189k575J5792j5156p779R538J2957
$$ -31092 -18513 10384 46099 32148 19659 9470 6895 22687 7531 -248 9290 22247
14004B2247j717N18R336r412k0490q798N920O328r392k0122J8082Q896K8075L5458
$$ 22247 20530 21048 30384 20972 482 -8316 -2396 3932 -5460 -25582 -7500 1396 29471 64929
13990F4929K4289k3031l7800l6679r364r294K8253l207L4153R394l4211k2859
$$ 64929 89218 66187 28387 -8292 -17656 -26950 1303 -1904 32249 41643 7432 -15427
13978a5427O564K7653K531R222K026j0324K4925L8009j7781k1305r285r715l6869
$$ -15427 -8863 18790 21321 30543 32569 22245 47170 85179 67398 46093 36808 27093 -9776
13965i776k5369L625L7369L760N197j5525P539J522l0574j240L2788J9630j1823
$$ -9776 -35145 -31520 5849 9609 14806 -719 6820 8342 -22232 -23472 9316 28946 17123
13952A7123J6305O718j3142J6479l269j9906K3062K1494m515l3289l8966J6301
$$ 17123 33428 40146 27004 43483 40214 20308 43370 64864 60349 27060 -11906 4395
13940D395O721K3293J9037J1782j4322j0022J833O787J1971P346j6632o580l3651
$$ 4395 11116 34409 53446 65228 50906 40884 42717 49504 61475 68821 52189 45609 11958
13927A1958n579L1741J3771k3535M304j2060j9835R611M626P339j401L4324P192
$$ 11958 6379 38120 51891 28356 32660 20600 765 10376 15002 22341 20940 55264 62456
13914F2456k088j5331j7626R309R808L6210j8824J2172J7189P750o354j539J826
$$ 62456 60368 45037 27411 36720 46528 82738 63914 76086 93275 101025 94671 93132 94958
13901I4958l2991j9256J819J1316k6771l895K1509J756J3708L292L1993L5159
$$ 94958 61967 42711 44530 55846 29075 25180 46689 48445 62153 65445 97438 132597
13889A32597J7578J8797K648J1377j5743j7806J768k7130k3638p824k2134p567
$$ 132597 150175 168972 171620 182997 167254 149448 151216 124086 100448 92624 70490 62923
13877F2923j0308k558J7620M7430L4125O618k4556p051k4991Q976k984m735m063
$$ 62923 52615 50057 67677 115107 149232 155850 131294 124243 99252 108228 105244 100509 96446
13864I6446N626m636N805J9217K8779n716k4661k6427n7170j1143M7942L1236
$$ 96446 102072 97436 103241 122458 151237 145521 120860 94433 37263 26120 74062 105298
13852A05298O489N29N715j6367k2518Q614K8443K3323p497k3072k8054K1992K5643
$$ 105298 111787 112316 118031 101664 79146 87760 116203 139526 132029 108957 80903 102895 128538
13839A28538K6201M137R48j1614l3786K8846K0841O287j3808k1273k3329m461
$$ 128538 154739 158876 159824 148210 114424 143270 164111 170398 156590 135317 111988 107527
13827A07527L823J2344J1764L5119m240l1323L5972K3315J7489j6941m2220j7888
$$ 107527 111350 123694 135458 170577 166337 135014 170986 194301 211790 194849 152629 134741
13815A34741Q045M2857L5955j1960j8895J1753M316J9200K370k5022J6606L6159
$$ 134741 142786 185643 221598 209638 190743 202496 206812 226012 228382 203360 219966 256125
13803B56125J0687j2747j1543J733L971j6342Q540K7211j281J0882r095j7756
$$ 256125 266812 254065 242522 244255 248226 231884 240424 267635 266354 277236 268141 250385
13791B50385L4023J7514J465j9553k3478l5412n7K2080J6065K3879K1216o732
$$ 250385 284408 301922 303387 283834 260356 224944 224887 246967 263032 286911 308127 301395
13779C01395Q152M975j0319j1965J5235J9002l597J548L439Q176n416n756P589
$$ 301395 309547 314522 304203 292238 307473 326475 322878 324426 327865 336041 330625 324869 332458
13766C32458l7924l8471j2896J0157m740J0619J3425P385j8112J8781K1531J9463
$$ 332458 294534 256063 243167 253324 248584 259203 272628 280013 261901 280682 302213 321676
13754C21676Q48j6591J6458M5P190q160o834L229j6326j2124L871k4042r422o756
$$ 321676 322524 305933 322391 322436 329626 321466 314632 317861 301535 289411 293282 269240 259818 253062
13740B53062q968J885k5029J0814L4542J7136L7170o141k6972l0166j6338P603
$$ 253062 244094 245979 220950 231764 266306 283442 320612 314471 287499 257333 240995 248598
13728B48598j5769k578j4994L930M340j4389L692N426P372J3966J5139j4555q945
$$ 248598 232829 230251 215257 219187 223527 209138 212830 218256 225628 239594 254733 240178 231233
13715B31233j5199M379k743Q556k0497r950J9270j9954l1462J8016K6948j5546
$$ 231233 216034 220413 217670 226226 205729 195779 215049 195095 163633 181649 208597 193051
13703A93051l5909j4915k6548K4413Q076k759j9332K4604L2065L73P327k1149
$$ 193051 157142 142227 115679 140092 148168 145409 126077 150681 182746 183119 190446 169297
13691A69297j2694n371J7733J3086j3322k605K0009M079L0461j2532l5032R155
$$ 169297 156603 151232 168965 182051 168729 166124 186133 190212 220673 208141 173109 182264
13679A82264J0400k5816k4879K2251n521K0611J3033J1460k9900j5437O857K2331
$$ 182264 192664 166848 141969 164220 158699 179310 192343 203803 173903 158466 165323 187654
13667A87654q355j5574j5590k3334N363m933p534M386K8805j20O264j584k9876
$$ 187654 179299 163725 148135 124801 130164 125231 117697 122083 150888 150768 157032 155448 125572
13654A25572k4641L2361K6779j4612l7510l2653j1953L790R713n718l116k579
$$ 125572 100931 133292 160071 145459 107949 75296 63343 67133 76846 71128 68012 65433
13642F5433K0949L8152J7669Q179k3741l5715j1250l93P29Q052O267K1254k8668
$$ 65433 86382 124534 142203 150382 126641 90926 79676 79283 80012 88064 94331 115585 86917
13629H6917j4732K3135k1664k0139K5365M6690K5678k6136m1576m771K1340K7865
$$ 86917 72185 95320 73656 53517 78882 125572 151250 125114 83538 78767 100107 127972
13617A27972j0615O934j1570l4822j4511J2862k4826j11j2702j8168l277J1185
$$ 127972 117357 124291 112721 77899 63388 76250 51424 51313 38611 20443 17166 28351
13605B8351M4139K135n382P340J8769K5911j9937l2430L66K3802L453k3320l4480
$$ 28351 72490 74625 69243 76583 95352 121263 101326 68896 69262 93064 96517 73197 38717
13592C8717J0268K2959L6719L41k6238j8964k6146K1776K5022k3808Q877m1503
$$ 38717 48985 71944 108663 109004 82766 63802 37656 59432 84454 60646 69523 28020
13580B8020k8984M611N215M2858J6038q45K067q174J5831L3025j1586P786j5109
$$ 28020 -964 3647 8862 51720 67758 66913 68980 60806 76637 109662 98076 105862 90753
13567I0753k9447j7305M6817J5909j8918j3463n52J3564M459L85j7747j4097K5302
$$ 90753 61306 44001 90818 106727 87809 74346 73794 87358 91817 92202 74455 60358 85660
13554H5660O378r970j787j390j3783k3053L241J1283j1803q074R418K1381K2866
$$ 85660 92038 82068 80281 78891 65108 42055 45296 56579 44776 36702 46120 67501 90367
13541I0367k0544l4385K1708K5626k970L6026j3491l7950l3626o459K6441k0936
$$ 90367 69823 35438 57146 82772 79802 115828 102337 64387 30761 24302 50743 29807
13529B9807n250L175K0756J0485j6763j3241J856q097P321J4614J2926k5770k5992
$$ 29807 24557 27732 48488 58973 42210 28969 30825 22728 30049 44663 57589 31819 5827
13516E827l9721L11L7414J0567R773J3299K925j956P495j7611K0955J3164Q233
$$ 5827 -33894 -33583 3831 14398 24171 37470 40395 38439 45934 28323 49278 62442 70675
13503G0675J0498k6885n0761J3501M0235r678j8174m826q418J6121K0274j4543
$$ 70675 81173 54288 3527 17028 57263 47585 29411 24585 16167 32288 52562 38019
13491C8019k477j1466L657R735j0711M528K848p370j1908j4382j1368K2469K6143
$$ 38019 35542 24076 27733 37468 26757 31285 34133 26763 14855 473 -10895 11574 37717
13478C7717q511l4461j1928J7790M2228k1407j2107M688K1125K576j8267l0145
$$ 37717 29206 -5255 -17183 607 42835 21428 9321 14009 35134 37710 19443 -10702
13466a0702K58J1676J745L1228L9968j387m1819j8539J7272K2871K990k0227k3749
$$ -10702 -10444 1232 2977 34205 74173 72786 30967 12428 29700 52571 55561 35334 11585
13453A1585L429K2742l3859j9008l685P212J1915J428J535n072R639L611L483
$$ 11585 15014 37756 3897 -15111 -18796 -11584 331 1759 3294 -1778 7861 11472 14955
13440A4955k16n292J2351J8016P833l7197m9201n120L1982k399K068n982j2888
$$ 14955 14739 9447 21798 39814 47647 10450 -38751 -43871 -11889 -14288 -12220 -18202 -31090
13427c1090L8926m428o075J3590k0900k6017k3178K2285M8904M1802P281j9919
$$ -31090 7836 3408 -2667 10923 -9977 -35994 -59172 -36887 12017 53819 61100 41181
13415D1181n0014k6819K1670L2789N420j366j3989K7265r13m3907L180L3241k5225
$$ 41181 -8833 -35652 -13982 18807 24227 22861 8872 36137 35224 -8683 -5503 27738 2513
13402B513N715j647r990J6449K9613j8085j5612O767Q318Q423o399j7861k6467
$$ 2513 8228 6581 -3409 13040 42653 24568 8956 15723 24041 32464 26065 8204 -18263
13389a8263k5427R614M1540J7978K432k7016j0735j1850M307J335j5426o336J7575
$$ -18263 -43690 -34076 7464 25442 27874 858 -9877 -21727 -17420 -16085 -31511 -37847 -20272
13376b0272r222k2182O557K7977k0915l9959K7853J8674K0586L4080o31K484k3354
$$ -20272 -29494 -51676 -45119 -17142 -38057 -78016 -50163 -31489 -10903 23177 22546 25030 1676
13363A676J8046j9874k7801J4656J6782j2481J926K8822j994p283J998j5025L552
$$ 1676 19722 -152 -27953 -13297 3485 -8996 -7070 21752 19758 12475 14473 -552 3000
13350C000J509L4267j6693k8170k2898q90K6326K0516J2165j8518r974L864o130
$$ 3000 4509 38776 22083 -6087 -28985 -29875 -3549 16967 29132 10614 640 4504 -1626
13337a626q344K8195K0823P442l8634k7955J0169K605k6836P873K2612P826J05
$$ -1626 -9970 18225 39048 46490 7856 -20099 -9930 -7325 -34161 -26288 -3676 4150 4255
13324D255M335J2715L800j8527M746L6798P273l2752p859k6293j5277p867k6J2196
$$ 4255 8590 21305 25105 6578 11324 48122 55395 22643 14784 -11509 -26786 -34653 -34679 -22483
13310b2483L6338R20k0986J1647J0824J7716J9376j9605l7343J7194L1161l4013
$$ -22483 13855 14775 -6211 5436 16260 33976 53352 33747 -3596 13598 44759 10746
13298A0746j1974K3439n431q40J5992k7534k0696J655J0749j3907O223L6941J450
$$ 10746 -1228 22211 16780 15940 31932 4398 -16298 -14643 -3894 -17801 -11578 25363 26813
13285B6813l1147O031j6841k6384J4055J2764K6797K5637j8940l7534o881J3145
$$ 26813 -4334 1697 -15144 -41528 -27473 -14709 12088 37725 18785 -18749 -25630 -12485
13273a2485J2651J1339j5103o381K4808K9242P34k9328k7290k551j2689j5984
$$ -12485 166 11505 -3598 -9979 14829 44071 44805 15477 -11813 -14364 -27053 -43037
13261d3037N787J9394M3791j9937N248p025k1318j9181r8L7314J9461j368k3129
$$ -43037 -37250 -17856 25935 5998 11246 4221 -17097 -36278 -36376 938 20399 19031 -4098
13248d098l650j0654L6374K4655J4905k0228l4844j3659k2301K59J0766L6075
$$ -4098 -7748 -18402 17972 42627 57532 37304 2460 -11199 -33500 -33241 -22475 13600
13236A3600K1210l9685j2285j3638M078N3580j5690m259j731k7591M376J752j256
$$ 13600 34810 -4875 -17160 -30798 -26720 26860 11170 6911 5180 -22411 -18035 -16283 -17539
13223a7539L4876j2660m2159j1985K5806K2993J2229m355k9593j0312k545q360
$$ -17539 17337 4677 -37482 -49467 -23661 -668 11561 7206 -22387 -32699 -35244 -43604
13211d3604j448J0730J0862M0709m420j4912l4058L3845M733j2233J3088N998
$$ -43604 -45052 -34322 -23460 17249 12829 -2083 -36141 -2296 2437 -9796 3292 9290
13199I290K6463L8701m1794j2495J3040o553l97j5686P805K452J7675k1678l3623
$$ 9290 35753 74454 32660 20165 33205 26652 26255 10569 18374 20826 38501 16823 -16800
13186a6800K1997K1265R143R221N108j5695j0098J723j6521P333j2575m755N80
$$ -16800 5197 26462 35605 44826 49934 34239 24141 25864 9343 16676 4101 -654 -74
13173g4Q031j0194M788K1174q093j7776j867J4896L8210j2540m3849J2124J9949
$$ -74 7957 -2237 2551 23725 15632 -2144 -4011 10885 49095 36555 -7294 4830 24779
13160B4779p532o750M304J1094r06o418j2742r257K8588Q628j2882l5719J6893
$$ 24779 17247 10497 14801 25895 24989 18571 5829 -3428 25160 33788 20906 -14813 2080
13147B080L6513q20M175K2256k8669l2735o579j6818l95J8974K0830K2792J9220
$$ 2080 38593 37773 41948 64204 35535 2800 -3779 -20597 -20992 -2018 18812 41604 60824
13134F0824j068k1687M619R713j6088l7321m5991P058Q849J6475K7425k035j5614
$$ 60824 59756 38069 42688 52401 36313 -1008 -46999 -39941 -31092 -14617 12808 10773 -4841
13121d841k2967j1525j084j2646j3945K0413J9843m853o89J6443r634r232L8764
$$ -4841 -27808 -39333 -40417 -53063 -67008 -46595 -26752 -31605 -32294 -15851 -25485 -34717 4047
13108D047L1899q878n901J1587k2536j9179K0605M323k4009R558Q849r204j3696
$$ 4047 35946 27068 21167 32754 10218 -8961 11644 15967 -8042 1516 10365 1161 -12535
13095a2535l113n985L3681J443l637l776P788n589j6137J7309n235K1004m802
$$ -12535 -15648 -21633 12048 13491 9854 6078 13866 8277 -7860 9449 4214 25218 20416
13082B0416Q733J9026k0725j0260J2965K6505R845j029l6475k1695j5566j56o475
$$ 20416 29149 48175 27450 17190 30155 56660 66505 65476 29001 7306 -8260 -8416 -14891
13069a4891l497K5634J7869M07O212j1138j8818k3751L617Q195K2971M502j2721
$$ -14891 -18388 7246 25115 25522 31734 20596 1778 -21973 -18356 -10161 12810 17312 4591
13056D591O832j9923j0028m901j0735J5813K5171q382k4753m917k1665P128J9480
$$ 4591 11423 -8500 -18528 -23429 -34164 -18351 6820 -1562 -26315 -31232 -52897 -45769 -26289
13043b6289J8453K5264j6104n646L117j1976K896L1495N271k4149k1905P455J7623
$$ -26289 -7836 17428 1324 -4322 -1205 -13181 -10285 21210 26481 2332 -19573 -12118 5505
13030E505J7386J6739l3543R412J664p173L522J2668m083J4469L690m4403K2047
$$ 5505 22891 39630 6087 15499 17163 9990 13512 26180 22097 36566 40256 -4147 17900
13017A7900J2679k3153m140L0635K3966K3809j7312j2480j9344j0381M825J960
$$ 17900 30579 7426 3286 33921 57887 81696 64384 51904 32560 22179 27004 28964
13005B8964k3059k5887j014R891J1827l719j2800j9297J7390O133K2081K464r667
$$ 28964 5905 -19982 -20996 -11105 722 -2997 -15797 -35094 -17704 -11571 10510 12974 3307
12992C307J2981n3j6724Q754O65R711j4963j9106J5920q572l1942J1058M4557
$$ 3307 16288 16235 -489 8265 8930 18641 3678 -15428 492 -8080 -40022 -28964 15593
12979A5593j2693m346p205M715K1472k590l550j984J880J022L7863M785j5398
$$ 15593 2900 -1446 -8651 -3936 17536 14946 11396 9412 11292 12314 50177 54962 39564
12966C9564j4162o403j4645j9347N983N9495J7908l8543N673l356j3510p1J7360
$$ 39564 25402 18999 4354 -14993 -9010 50485 68393 29850 35523 32167 18657 18586 35946
12953C5946J2760O121l4212q752j5877j3188j523l302L42N816k084K4652R104
$$ 35946 48706 54827 20615 11863 -4014 -17202 -18725 -22027 -21685 -15869 -17953 6699 15803
12940A5803L748J1306P572N083J9880o956k0919l2857k0007R564J6692q699J1816
$$ 15803 19551 30857 38429 43512 63392 56436 35517 2660 -17347 -7783 8909 210 12026
12927A2026j8601J1889K4061r091k7830M805Q708j6101k05J655j6069M496j6647
$$ 12026 -6575 5314 29375 20284 -7546 -2741 5967 -10134 -10339 -8684 -24753 -20257 -36904
12914c6904k0635J1425J6365J9012N179j966K5523l888N662K4665J9732j4454
$$ -36904 -57539 -46114 -29749 -10737 -5558 -7524 17999 14111 19773 44438 64170 49716
12902D9716j7574q394p040r076j4327J539J8858p454q408K067j2011j3706l600
$$ 49716 32142 23748 16708 7632 -6695 -5156 13702 6248 -2160 -93 -12104 -25810 -29410
12889b9410L1756K7054k1781k0241J0266K3535J4200J0539N422J5501q363k4760
$$ -29410 2346 29400 7619 -12622 -2356 21179 35379 45918 51340 66841 58478 33718
12877C3718k7942k6829m415K0118k0215N001M3990J9021j2677j4097n886j2873
$$ 33718 5776 -21053 -25468 -5350 -25565 -20564 23426 42447 29770 15673 9787 -3086
12865c086j3039J4065O463l749J9820J7999N215J580o266j1933n809M094j1701
$$ -3086 -16125 -2060 4403 654 20474 38473 43688 45268 39002 27069 21260 25354 13653
12852A3653n370J4787k8696j0590J0956M0441J500j6731O781n795q559K7120M665
$$ 13653 8283 23070 -5626 -16216 -5260 35181 36681 19950 26731 20936 12377 39497 44162
12839D4162L323K661j6287k2346J3384L139M415r380m5935j4218K392J3793J4739
$$ 44162 47485 50146 33859 11513 24897 28036 32451 23071 -22864 -37082 -34690 -20897 -6158
12826f158l1j534K9334p509k7881l3263J0779J3289N62K5713O618j7945J6991
$$ -6158 -6189 -7723 21611 14102 -13779 -47042 -36263 -22974 -22412 3301 9919 -8026 8965
$$ [...]
##END NTUPLES=NMR SPECTRUM
##END=
