##TITLE=Analysis number 319641
Compound Code cc 26501
Project Code adrs
Chemist Name prosynth
##JCAMPDX= 6.0         $$ Bruker NMR JCAMP-DX V2.0
##DATA TYPE= NMR SPECTRUM
##DATA CLASS= NTUPLES
##ORIGIN= Bruker BioSpin GmbH
##OWNER= nmr
$$ XWIN-NMR		Version 3.5
$$ Tue May 23 08:17:47 2006 GMT Daylight Time (UT+1h)  MAYBRIDGE\nmr@NMR_250MHZ
##.OBSERVE FREQUENCY= 250.131544655141
##.OBSERVE NUCLEUS= ^1H
##.ACQUISITION MODE= SIMULTANEOUS (DQD)
##.ACQUISITION SCHEME= undefined
##.AVERAGES= 16
##.DIGITISER RES= 18
##SPECTROMETER/DATA SYSTEM= dpx250
##.PULSE SEQUENCE= zg30
##.SOLVENT NAME= DMSO
##.SHIFT REFERENCE= (INTERNAL, DMSO, 0, 16.522)
##AUDIT TRAIL= $$ (NUMBER, WHEN, WHO, WHERE, WHAT)
$$ ##TITLE= Audit trail, XWIN-NMR		Version 3.5
$$ ##JCAMPDX= 5.01
$$ ##ORIGIN= Bruker BioSpin GmbH
$$ ##OWNER= nmr
$$ C:\u/data/dgb/nmr/ADRS/4910/pdata/1/auditp.txt
$$ ##AUDIT TRAIL=  $$ (NUMBER, WHEN, WHO, WHERE, WHAT)
(   1,<2006-05-23 08:17:25.38 +100>,<MAYBRIDGE\nmr>,<NMR_250MHZ>,
      <created by zg, POWCHK disabled, PULCHK disabled
       configuration hash MD5:
       84 BC 41 DB A1 6E 1D 46 DA 25 12 A5 C1 ED C5 3A
       data hash MD5: 64K
       3D 9A 5E B5 41 34 B5 F9 3C 18 31 03 F1 89 DE C0>)
(   2,<2006-05-23 08:17:39.57 +100>,<MAYBRIDGE\nmr>,<NMR_250MHZ>,
      <Start of raw data processing
       ef LB = 0.3 FT_mod = 6 PKNL = 1 SI = 32K 
       data hash MD5: 32K
       02 C5 B8 98 4E 42 89 CF 80 7A 5C 44 62 7B 72 C2>)
(   3,<2006-05-23 08:17:41.15 +100>,<MAYBRIDGE\nmr>,<NMR_250MHZ>,
      <apk 
       data hash MD5: 32K
       D2 97 02 D5 07 E4 CD 4C D4 8A 9A FD C9 82 48 D0>)
(   4,<2006-05-23 08:17:41.93 +100>,<MAYBRIDGE\nmr>,<NMR_250MHZ>,
      <abs ABSG = 5 
       data hash MD5: 32K
       36 94 4D E7 39 54 E1 9B 81 A0 25 5A 9F FD 42 86>)
$$ ##END=
$$ 
$$ hash MD5
$$ DB C3 27 49 2D 5B FD 5E 8D E3 CE 9F 1D 8D 5E BE
##$RELAX= 
##$RELAX= 
##$RELAX= 
##$RELAX= 
##$RELAX= 
##$RELAX= 
##$RELAX= 
$$ Bruker specific parameters
$$ --------------------------
##$DU= <C:\u>
##$EXPNO= 4910
##$NAME= <ADRS>
##$PROCNO= 1
##$TYPE= <nmr>
##$USER= <dgb>
##$AMP= (0..31)
100 100 100 100 100 100 100 100 100 100 100 100 100 100 100 100 100 100 
100 100 100 100 100 100 100 100 100 100 100 100 100 100 
##$AQSEQ= 0
##$AQ_mod= 3
##$AUNM= <au_zg>
##$AUTOPOS= <3 >
##$BF1= 250.13
##$BF2= 250.13
##$BF3= 250.13
##$BF4= 250.13
##$BF5= 500.13
##$BF6= 500.13
##$BF7= 500.13
##$BF8= 500.13
##$BYTORDA= 1
##$CFDGTYP= 0
##$CFRGTYP= 5
##$CHEMSTR= <none>
##$CNST= (0..31)
1 1 145 1 1 1 1 1 1 1 1 1 1 1 1 1 1 1 1 1 1 1 1 1 1 1 1 1 1 1 1 1 
##$CPDPRG= <>
##$CPDPRG1= <>
##$CPDPRG2= <>
##$CPDPRG3= <>
##$CPDPRG4= <mlev>
##$CPDPRG5= <mlev>
##$CPDPRG6= <mlev>
##$CPDPRG7= <mlev>
##$CPDPRG8= <mlev>
##$CPDPRGB= <>
##$CPDPRGT= <>
##$D= (0..31)
0 1 0 0 0 0 0 0 0 0.06 0 0 0 0 0 0 0.0002 0 0 0 0 0 0 0 0 0 0 0 0 0 0 
0 
##$DATE= 1148368644
##$DBL= (0..7)
120 120 120 120 120 120 120 120 
##$DBP= (0..7)
150 150 150 150 150 150 150 150 
##$DBP07= 0
##$DBPNAM0= <>
##$DBPNAM1= <>
##$DBPNAM2= <>
$$ [...]
##$SUBNAM6= <"">
##$SUBNAM7= <"">
##$SUBNAM8= <"">
##$SUBNAM9= <"">
##$SW= 20.6930455092707
##$SWIBOX= (0..15)
0 0 3 0 0 0 0 0 0 0 0 0 0 0 0 0 
##$SW_h= 5175.983436853
##$TD= 65536
##$TD0= 1
##$TE= 294.16
##$TE2= 300
##$TE3= 300
##$TEG= 300
##$TL= (0..7)
0 120 120 120 120 120 120 120 
##$TP= (0..7)
150 150 150 150 150 150 150 150 
##$TP07= 0
##$TPNAME0= <>
##$TPNAME1= <>
##$TPNAME2= <>
##$TPNAME3= <>
##$TPNAME4= <>
##$TPNAME5= <>
##$TPNAME6= <>
##$TPNAME7= <>
##$TPOAL= (0..7)
0.5 0.5 0.5 0.5 0.5 0.5 0.5 0.5 
##$TPOFFS= (0..7)
0 0 0 0 0 0 0 0 
##$TUNHIN= 0
##$TUNHOUT= 0
##$TUNXOUT= 0
##$USERA1= <user>
##$USERA2= <user>
##$USERA3= <user>
##$USERA4= <user>
##$USERA5= <user>
##$V9= 5
##$VALIST= <valist>
##$VCLIST= <CCCCCCCCCCCCCCC>
##$VD= 0
##$VDLIST= <DDDDDDDDDDDDDDD>
##$VPLIST= <PPPPPPPPPPPPPPP>
##$VTLIST= <TTTTTTTTTTTTTTT>
##$WBST= 1024
##$WBSW= 4
##$XGAIN= (0..3)
0 0 0 0 
##$XL= 0
##$YL= 0
##$YMAX_a= 307207
##$YMIN_a= -398908
##$ZGOPTNS= <>
##$ZL1= 120
##$ZL2= 120
##$ZL3= 120
##$ZL4= 120
##$ABSF1= 16.522
##$ABSF2= -4.171173
##$ABSG= 5
##$ABSL= 3
##$ALPHA= 0
##$AQORDER= 0
##$ASSFAC= 0
##$ASSFACI= 0
##$ASSFACX= 0
##$ASSWID= 0
##$AUNMP= <proc_1d>
##$AZFE= 0.1
##$AZFW= 0.1
##$BCFW= 0
##$BC_mod= 0
##$BYTORDP= 0
##$COROFFS= 0
##$CY= 12.5
##$DATMOD= 1
##$DC= 0
##$DFILT= <>
##$DTYPP= 0
##$F1P= 14.0000005364418
##$F2P= -0.99999901652339
##$FCOR= 0.5
##$FTSIZE= 32768
##$FT_mod= 6
##$GAMMA= 0
##$GB= 0
##$INTBC= 1
##$INTSCL= 1
##$ISEN= 128
##$LB= 0.3
##$LEV0= 0
##$LPBIN= 0
##$MAXI= 10000
##$MC2= 0
##$MEAN= 0
##$ME_mod= 0
##$MI= 0
##$NCOEF= 0
##$NC_proc= -5
##$NLEV= 6
##$NOISF1= 0
##$NOISF2= 0
##$NSP= 0
##$NTH_PI= 0
##$NZP= 0
##$OFFSET= 16.522
##$PC= 1
##$PHC0= 167.2067
##$PHC1= 4.28188
##$PH_mod= 1
##$PKNL= yes
##$PPARMOD= 0
##$PSCAL= 4
##$PSIGN= 0
##$REVERSE= no
##$SF= 250.13
##$SI= 32768
##$SIGF1= 0
##$SIGF2= 0
##$SINO= 400
##$SIOLD= 32768
##$SREGLST= <1H.DMSO>
##$SSB= 0
##$STSI= 32768
##$STSR= 0
##$SW_p= 5175.98343685301
##$SYMM= 0
##$S_DEV= 0
##$TDeff= 65536
##$TDoff= 0
##$TI= <Analysis number 999999
Compound Code 99
Book Reference 9
Project Code 9>
##$TILT= no
##$TM1= 0
##$TM2= 0
##$TOPLEV= 0
##$USERP1= <user>
##$USERP2= <user>
##$USERP3= <user>
##$USERP4= <user>
##$USERP5= <user>
##$WDW= 1
##$XDIM= 32768
##$YMAX_p= 533590979
##$YMIN_p= -806430
$$ End of Bruker specific parameters
$$ ---------------------------------
##NTUPLES= NMR SPECTRUM
##VAR_NAME=  FREQUENCY,     SPECTRUM/REAL,   SPECTRUM/IMAG
##SYMBOL=    X,             R,               I
##VAR_TYPE=  INDEPENDENT,   DEPENDENT,       DEPENDENT
##VAR_FORM=  AFFN,          ASDF,            ASDF
##VAR_DIM=   32768,         32768,           32768
##UNITS=     HZ,            ARBITRARY UNITS, ARBITRARY UNITS
##FACTOR=    0.157963299565203, 1,           1
##FIRST=     4132.6476996994, 0,             0
##LAST=      -1043.33573715361, 0,           0
##MIN=       -1043.33573715361, -806430,     0
##MAX=       4132.6476996994, 533590979,     0
$$ Real data points
##PAGE= N=1
##DATA TABLE= (X++(R..R)), XYDATA
$$ [...]
25048B8224P7264O3756r8377M0963K9947N860o2441j36786K2637L7755R3631q3344
$$ 28224 105488 169244 70867 111830 141777 147637 85196 -51590 -28953 8802 102433 19089
25036A9089L2910k0899N8870J05778k53899K2183K85604J36548j13505k11190
$$ 19089 51999 31100 89970 195748 -58151 -35968 249636 386184 272679 61489
25026F1489n9298m0677L5903j4592q5670k6921J1363K36837J38705P0148j11942
$$ 61489 2191 -38486 -2583 -17175 -102845 -129766 -118403 118434 257139 327287 215345
25015B15345j56598L843J02759R1876K806l4771j65904j04249r833o6131O4403
$$ 215345 58747 62590 165349 257225 260031 225260 59356 -44893 -54726 -120857 -56454
25004e6454K26740O9183m3553j75465p8906K9779R4242J17878J60170q1453k01606
$$ -56454 170286 239469 195916 20451 -58455 -28676 65566 183444 343614 262161 60555
24993F0555P320N6598J64194q6150n5473k5159N9906m5333k01054m6921k27413
$$ 60555 67875 124473 288667 202517 147044 121885 181791 136458 -64596 -111517 -338930
24982c38930k2593O299K85709R8916q7238m0470M2490M2768Q6006q2293P9820
$$ -338930 -361523 -355224 -69515 29401 -57837 -98307 -55817 -13049 72957 -9336 70484
24971G0484J77686K8319n8063k35035p4220J98568M5614J8235K15605J26374j56146
$$ 70484 248170 276489 218426 -16609 -90829 107739 153353 171588 387193 513567 357421
24960C57421j45148J9867j14722j68188j09866j46836K23619K96701K68052j35615
$$ 357421 212273 232140 117418 -50770 -160636 -307472 -83853 212848 480900 345285
24950C45285k52147J41055O6645j87436j71656k9621j21185J7824K68630L234
$$ 345285 93138 234193 300838 113402 -58254 -87875 -209060 -191236 77394 80628
24940H0628j52506M0437J16148J44496O1872j48547k66040J15304J1409j01408
$$ 80628 -71878 -31441 84707 229203 291075 142528 -123512 -8208 3201 -98207
24930i8207l1610o9184n3567M1730N960l7712P3816p2835L9954j18245j91561
$$ -98207 -129817 -199001 -252568 -210838 -204878 -242590 -168774 -241609 -201655 -319900 -511461
24919e11461j99738K2172J86444J05163J07634L1112J15356J2385L5786j3239
$$ -511461 -711199 -689027 -502583 -397420 -289786 -258674 -143318 -130933 -95147 -108386
24909a08386J01332q4364j55406J13712j3041K65531O308k28393l6299j3765j08213
$$ -108386 -7054 -91418 -246824 -133112 -146153 119378 125686 -102707 -139006 -152771 -260984
24898b60984J74313k01275j22118J7898K8972O5648P5857J44988J08150R541l0071
$$ -260984 -86671 -287946 -410064 -392166 -363194 -297546 -221689 -76701 31449 40990 10919
24887A0919R8052o4956j20991j9217Q9942J24771j15331j77607J21561J79278
$$ 10919 108971 44015 -76976 -96193 -6251 118520 3189 -174418 -52857 126421
24877A26421j41221r4974Q0373j81696N0504J99066Q0429j85770j7897j96784
$$ 126421 -14800 -109774 -29401 -211097 -160593 38473 118902 -66868 -84765 -281549
24867b81549j28923M7848L4414N0161J20279J15708j2574J27553R4860j21357
$$ -281549 -410472 -362624 -328210 -278049 -157770 -42062 -54636 72917 167777 46420
24857D6420j49165N6892j00511k6830O1421Q0326J11834Q9433R2371J06637j11456
$$ 46420 -102745 -45853 -146364 -173194 -111773 -31447 80387 169820 262191 368828 257372
24846B57372j52546k74745J63177J58978j35946J02944r652n5613p8051p9328
$$ 257372 104826 -169919 -6742 152236 16290 119234 109582 53969 -24082 -103410
24836a03410J78554r551R094r980P6466J72615J6282J3059k97066o400J71039
$$ -103410 75144 65593 74687 64707 141173 313788 330070 343129 46063 39663 210702
24825B10702Q7810o6080k54076j42397L8611l514R8561K47754Q8230M5909m0825
$$ 210702 298512 232432 -21644 -164041 -125430 -128944 -30383 217371 305601 351510 310685
24814C10685K5708j81041j5472k9663q2983m766N3940J18718J48292J02114k29435
$$ 310685 336393 155352 139880 110217 27234 22468 76408 195126 343418 445532 216097
24803B16097j07079j22014J10416K5045j87088J09596J15598n7521j16881j80566
$$ 216097 109018 -12996 97420 122465 -64623 44973 160571 103050 -13831 -194397
24793a94397j97033l6886K64360N5597Q2594J28014k48997q5312J02467J90000
$$ -194397 -391430 -428316 -163956 -108359 -25765 102249 -146748 -232060 -129593 60407
24783F0407q7250o3838l6429J0222q3573M6826Q732Q6242J81157k57201K6751
$$ 60407 -26843 -90681 -127110 -116888 -200461 -153635 -144903 -58661 122496 -134705 -107954
24772a07954K7301n9725L38033J84935j2620j37596r2940j16435j76868j2195
$$ -107954 -80653 -140378 197655 382590 369970 232374 139434 22999 -153869 -166064
24762a66064J07507O7599q5869r5537l4183J617J15222r0376j5035J92225O3676
$$ -166064 -58557 9042 -76827 -172364 -206547 -204930 -89708 -180084 -195119 -2894 60782
24751F0782j22649Q9869J02997j71421n5319q0180j04758o1315k05713O6519J30079
$$ 60782 -61867 28002 130999 -40422 -95741 -175921 -280679 -341994 -547707 -481188 -351109
24740c51109J59673J3236K63220O6162r1144P6562P447j81872j97871P9696j23358
$$ -351109 -191436 -178200 85020 151182 60038 136600 144047 -37825 -235696 -156000 -279358
24729b79358j19794K38480m2382j53697K7312j19921j13842O3133Q9603M4627
$$ -279358 -399152 -160672 -203054 -356751 -329439 -449360 -563202 -500069 -410466 -365839
24719c65839j14984K7940J15270K0391J62888J20138l9541J66664J05551l9358
$$ -365839 -480823 -452883 -337613 -317222 -154334 -34196 -73737 92927 198478 159120
24709A59120k08229o9770o0150l1571l4883q563q831K00811J31547O2961n4543
$$ 159120 -49109 -118879 -179029 -210600 -245483 -254046 -262877 -62066 69481 132442 77899
24698G7899O2140l4679j76119J12952J16311j8345J57898j57492j48560P285J40483
$$ 77899 140039 105360 -70759 42193 158504 140159 298057 140565 -7995 -710 139773
24687A39773l5922M8473J00452l4703k7341l7748k07595q2241p4649q242j09766
$$ 139773 103851 152324 252776 218073 190732 152984 -54611 -136852 -211501 -219743 -329509
24676c29509l0893K21923j00732j7821O2877k4917J11522R8360J80324J46128
$$ -329509 -360402 -138479 -239211 -257032 -194155 -219072 -107550 -9190 171134 317262
24666C17262k29964r0245k45835o0955L57342J21498P8335l2709o3615l2628m387
$$ 317262 87298 -2947 -248782 -309737 47605 169103 247438 214729 151114 118486 114099
24655A14099J63259J226j28396m524N6301j8298o7736J57830J49407j09257j17807
$$ 114099 277358 278584 150188 145664 201965 183667 115931 273761 423168 313911 196104
24644A96104p2665l1435k2608m3098p0756m9376o4927o5728p3134J32293P9710
$$ 196104 123439 92004 69396 26298 -44458 -93834 -158761 -224489 -297623 -165330 -85620
24633h5620m5060J84168k0514J93708J97385r1k01889p139j3640n6012Q5568n8823
$$ -85620 -130680 53488 32974 226682 424067 423976 222087 214948 201308 145296 230864 172041
24621A72041m44239k62767J03541J37684J33699j75331m9918N6234r622O9838
$$ 172041 -272198 -534965 -431424 -293740 -160041 -335372 -385290 -329056 -338678 -268840
24611b68840K20034k64863k3980J46191P0712r975l4555Q4736Q1336J08709J67020
$$ -268840 -48806 -313669 -337649 -191458 -120746 -130721 -165276 -80540 796 109505 276525
24600B76525J05354k13758j81009o5921n4110L8996P7430r7172J68457j44231
$$ 276525 381879 168121 -12888 -78809 -132919 -93923 -16493 -113665 54792 -89439
24590h9439m1196J94159m7014p2648j25237j869M179o6380p3788M03264L08706
$$ -89439 -130635 63524 16510 -56138 -181375 -183244 -179065 -245445 -319233 84031 392737
24579C92737j35638m6554n8269q5338j07209Q2144l9831o0020J19299j20439r4354
$$ 392737 257099 210545 152276 66938 -40271 41873 2042 -57978 61321 -59118 -153472
24568a53472j27527J13453J56282N3688l0355m8664N7281O3395j74150J8412r3751
$$ -153472 -280999 -167546 -11264 42424 12069 -36595 20686 84081 -90069 -71657 -165408
24557a65408l0412p0013j4700k2958J60163l1390j04215p58K7096Q4309p0j6613
$$ -165408 -195820 -265833 -280533 -303491 -143328 -174718 -278933 -279691 -252595 -168286 -168356 -184969
24545a84969K506p8334J68010J2645R3730j43457L27M7267q9914o6719n9360k3395
$$ -184969 -182463 -260797 -92787 -80142 13588 -129869 -129542 -82275 -172189 -238908 -298268 -321663
24533c21663K72847M0147p5392R7882l5469K47847J57468o85j95926k05641p483
$$ -321663 -48816 -8669 -84061 13821 -21648 226199 383667 382982 187056 -18585 -26068
24522b6068J99952j68301j73004P001M9797l949J21305m3246j85455K18980J77624
$$ -26068 173884 5583 -167421 -160420 -110623 -114572 6733 -36513 -221968 -2988 174636
24511A74636J07534k43265l0250j44823j23567J22698O1808j15630j2052K02718
$$ 174636 282170 38905 8655 -136168 -259735 -137037 -75229 -190859 -202911 -193
24501a93N9826p2633K68136p1620l27010l7163L7894O1913j65990k51220J18939
$$ -193 59633 -13000 255136 183516 -143494 -180657 -142763 -80850 -246840 -498060 -379121
24490c79121R4397m4266R2438l0745L778m8745M8621M0258Q008j34356J12554
$$ -379121 -284724 -328990 -236552 -267297 -263519 -312264 -263643 -223385 -215377 -349733 -237179
24479b37179K25034J46406K66035o9261k50312j38066Q0160J4302j3076j0661
$$ -237179 -12145 134261 400296 331035 80723 -57343 22817 37119 24043 13382
24469A3382n1977J44128J3341k291j36967j82846j5684J51652l6795l5820M3285
$$ 13382 -38595 105533 118874 116583 -20384 -203230 -218914 -67262 -104057 -139877 -96592
24458i6592M8175K54296p061J8085K5310o3057L1748M5215k8080n2004m1112J9117
$$ -96592 -48417 205879 198818 216903 242213 179156 210904 256119 228039 176035 134923 154040
24446A54040l4777l7942k14267k4883l3043q7380J23582K30798q4364j88116K2140
$$ 154040 119263 81321 -132946 -157829 -190872 -278252 -154670 76128 -8236 -196352 -174212
24435a74212K48139J5579j48721k87363m7738K17632K58560p0085K4233o0456
$$ -174212 73927 89506 -59215 -346578 -394316 -176684 81876 11791 36024 -24432
24425b4432r9430N7909J09951p636k24413K575l0455o013l4064j60956R9150K00286
$$ -24432 -123862 -65953 43998 36362 -188051 -185476 -215931 -221944 -256008 -416964 -317814 -117528
24413a17528O9438K6230k11835J49924K00754k27514j82945M9230J17123K4971
$$ -117528 -48090 -21860 -233695 -83771 116983 -110531 -293476 -244246 -127123 -102152
24403a02152Q6160J26739J55029O8447o9599l2188j00865l61997q174J27531Q2437
$$ -102152 -15992 110747 265776 334223 264624 232436 131571 -230426 -238600 -111069 -28632
24392b8632Q9789R4302j51783j94539J20834n1010k39792L7236r4967R7197J57854
$$ -28632 61157 155459 3676 -190863 -70029 -121039 -360831 -323595 -418562 -321365 -163511
24381a63511J12730J16391N9571L4043p1997j09261j23126p5167k4711J69938
$$ -163511 -50781 65610 125181 159224 87227 -22034 -145160 -220327 -245038 -75100
24371g5100J7708j20753M9377M7080k8039j06692J1005J81700N5484J016j6728
$$ -75100 -57392 -178145 -128768 -81688 -109727 -216419 -205414 -23714 31770 32786 16058
24360A6058l9945J01678Q3366l46780j88038J47293J99541J75580j75528j8458
$$ 16058 -23887 77791 161157 -185623 -373661 -226368 -26827 148753 -26775 -45233
24350d5233p8653K7782J15096J32690J07616p5384k2878j91288j32242N3213J87819
$$ -45233 -123886 -96104 18992 151682 259298 183914 161036 -30252 -162494 -109281 78538
24339G8538N9709j16468j70595j21456l9350K15738K07469l8092L3456n8445Q0798
$$ 78538 138247 21779 -148816 -270272 -309622 -93884 113585 75493 108949 50504 131302
24328A31302P9232j63411K6769o537N2569P891j17238k9254l6187J11769o4086
$$ 131302 210534 47123 73892 67355 119924 127815 10577 -18677 -54864 56905 -7181
24317g181q8994k06574k1361j62533K05552R6286l4951p4353r689K25454J16J24171
$$ -7181 -96175 -302749 -324110 -486643 -281091 -184805 -219756 -294109 -303798 -78344 -78228 45943
24305D5943M0901q3202k36616p9382j00158K31894j05376N1612P2587J26972l1108
$$ 45943 86844 3642 -232974 -312356 -412514 -180620 -285996 -234384 -161797 -34825 -65933
24294f5933k5824j14323l1540L7776J72506N8971j31479R8403J33870k13467Q4746
$$ -65933 -91757 -206080 -237620 -199844 -27338 31633 -99846 -1443 132427 -81040 3706
24283C706J57927o7774j03949k00241k46836J23017J1356j16981Q1251K34198
$$ 3706 161633 93859 -10090 -210331 -457167 -334150 -322794 -439775 -358524 -124326
24273a24326J47507K2316l5334L471J11848K00008J80138p1546o6624M5259j44854
$$ -124326 23181 45497 10163 13634 125482 325490 505628 434082 367458 412717 267863
24262B67863j33746j52603m2116j7304l2616J60308O1019k18037k03847L6540
$$ 267863 134117 -18486 -60602 -77906 -110522 49786 110805 -107232 -311079 -274539
24252b74539J80541J28135J52256r9081l7527J06942r0188o6400J43881j973j25313
$$ -274539 -93998 34137 186393 87312 49785 156727 66539 139 144020 142047 16734
24241A6734o6206R989J57213j11808j7380O7415o0974J06894P0761o3212q2639
$$ 16734 -49472 -39483 117730 5922 -11458 55957 -5017 101877 172638 109426 26787
24230B6787L7811K02180O7920J3737j03702k8176K7985j72261k01327J1759M00616
$$ 26787 64598 266778 334698 348435 244733 216557 244542 72281 -129046 -117287 283329
24219B83329k3133j29303j92672j05536j71030L3630K1376J36480J72367o0014
$$ 283329 260196 130893 -61779 -167315 -338345 -304715 -283339 -146859 25508 -34506
24209c4506N9448l271j78615j17150q1801J06266J33819J55702l7523L2299l1710
$$ -34506 24942 21671 -156944 -274094 -355895 -249629 -115810 39892 2369 34668 2958
24198B958r8299O7249Q8212J77842k92021j98708O2908L6613K3783J82014J38431
$$ 2958 -95341 -28092 60120 237962 -54059 -252767 -189859 -153246 -129463 52551 190982
24187A90982r3639j22052M2632j87209P5020n9230Q5595L3873j64377r1828J45716
$$ 190982 97343 -24709 17923 -169286 -94266 -153496 -67901 -34028 -198405 -290233 -144517
24176a44517k690O5890J03207o1229o1138P264l8277J14081P9882K73373K9992
$$ -144517 -147207 -81317 21890 -39339 -100477 -93213 -131490 -17409 62473 335846 365838
24165C65838j86206j70965r4607M0129O2867r226J85586N6076Q6197Q8358l82862
$$ 365838 179632 8667 -85940 -45811 17056 7830 193416 249492 335689 424047 41185
24154D1185j81043L02333M6462J2178r0726k90419N7467R2906k1879j21397K8082
$$ 41185 -139858 162475 208937 221115 130389 -160030 -102563 -9657 -31536 -152933 -124851
24143a24851J74544m420K7721j0899p1320K8O5799Q1577P5814k12251j40645J08658
$$ -124851 49693 45273 72994 62095 -9225 -9197 56602 138179 213993 1742 -138903 -30245
24131c0245M3541j82501j1084K4608j8432Q7092P1191R0169O472j26512Q1631
$$ -30245 13296 -169205 -180289 -155681 -174113 -87021 -15830 74339 80811 -45701 35930
24120C5930J21607j61310j59754k26062P8751P9783q580P3247K21041Q4317k21322
$$ 35930 157537 -3773 -163527 -389589 -310838 -231055 -239635 -166388 54653 138970 -82352
24109h2352j11340K58618j0020M2772j85095k15412m7778J13291J98690J80421
$$ -82352 -193692 64926 54906 97678 -87417 -302829 -350607 -237316 -38626 141795
24099A41795J13119k67393k2703R5609j01702p5064m1503n6673P587K6241K0059
$$ 141795 254914 -12479 -35182 60427 -41275 -116339 -157842 -214515 -206928 -180687 -160628
24088a60628M1115J03321p0183o5635n5356P4138L667K69741K62084L1960r772
$$ -160628 -119513 -16192 -86375 -152010 -207366 -133228 -129561 140180 402264 434224 424452
24077D24452r3270k20766k49529n8872j28966k13724M635K33976J25678Q0285
$$ 424452 331182 110416 -139113 -197985 -326951 -540675 -536040 -302064 -176386 -96101
24067i6101O3962o7405r7533L6681j0385J35151K17820R0428r1275p2141o1213
$$ -96101 -32139 -99544 -197077 -160396 -170781 -35630 182190 272618 181343 109202 47989
24056D7989m301K37725q0716l5384J31663m6609l35764k00401R6835K12317L1505
$$ 47989 43688 281413 200697 165313 296976 250367 -85397 -285798 -188963 23354 54859
24045E4859j7451L8592j26605J53818J41841J35775n7509k78120K7430l6997n2787
$$ 54859 37408 76000 -50605 103213 245054 380829 323320 45200 72630 35633 -17154
24034a7154q8329j4037l6639J83941M2152O3807n5348l3349l854O4916K57173
$$ -17154 -105483 -119520 -156159 27782 69934 133741 78393 45044 41190 106106 363279
24023C63279p5094j18458j08198p1168M0853k2877K35640N6904k9229N7480j78161
$$ 363279 288185 169727 61529 -9639 31214 8337 243977 300881 271652 329132 150971
24012A50971j11202J24238P4531j05344R721l11194j8671J08807J01937p38k6418
$$ 150971 39769 164007 238538 133194 142915 -168279 -186950 -78143 23794 23056 -3362
24001c362l9166J76417L56001j3511j63560k41548P8284k7635j95911j29409J47048
$$ -3362 -42528 133889 489890 476379 312819 71271 149555 121920 -73991 -203400 -56352
23990e6352J63814O3483j44061k3390L0513J68290J2497m2745q9882j31856O903
$$ -56352 107462 170945 26884 3494 34007 202297 214794 172049 82167 -49689 -42786
23979d2786j7287J2469P1191k13166m090J46044q8063j16202J97029J60992j88854
$$ -42786 -60073 -47604 23587 -189579 -193669 -47625 -135688 -251890 -54861 106131 -82723
23968h2723m3698R2724Q0760j5248L7946Q2291r4987j49141R4852K59849k0192
$$ -82723 -126421 -33697 47063 31815 69761 152052 57065 -92076 2776 262625 242433
23957B42433j48437p5893j73588J13426P4137j62607P7581J68949l2095j55326
$$ 242433 93996 18103 -155485 -42059 32078 -130529 -52948 116001 83906 -71420
23947g1420J4645J84904P3031M9217O538j30699k9148n3431N2603q6794j29151
$$ -71420 -56775 128129 201160 250377 256915 126216 97068 43637 96240 9446 -119705
23936a19705j00832p5387Q3892J04981J9732J77109J45154J51733j9963o0429
$$ -119705 -220537 -295924 -212032 -107051 -87319 89790 234944 386677 366714 306285
23926C06285m4533j98983k13425J39721L92285r1999m8719j24438k64599m9038
$$ 306285 261752 62769 -150656 -10935 381350 289351 240632 116194 -148405 -197443
23916a97443L03008J16947p1730O0085j2857j49303r1903j31212J37280N18n9068
$$ -197443 105565 222512 150782 210867 198010 48707 -43196 -174408 -37128 -36610 -95678
23905i5678n7585j31082o244K13814R0082k5619l1138m6019J36476N2851j40803
$$ -95678 -153263 -284345 -290589 -76775 13307 -12312 -43450 -89469 47007 99858 -40945
23894d0945j07331k23354k38390K80828K433p6386N8440K15509m4413j17466p0300
$$ -40945 -148276 -371630 -610020 -329192 -326759 -403145 -344705 -129196 -173609 -291075 -361375
23883c61375j66384J63853J3557M2205J32668N4593J38328J07568o433k67361
$$ -361375 -527759 -363906 -350349 -308144 -175476 -120883 17445 125013 118580 -148781
23873a48781j98267J33181K78521N32p6328p9001q67q185n6302J53686p0545q1578
$$ -148781 -347048 -213867 64654 65186 -11142 -90143 -91010 -99195 -155497 -1811 -72356 -153934
23861a53934j09830J1292M52510L13854p9007K811n6587l77968j29055K37311
$$ -153934 -263764 -252472 200038 513892 434885 437696 381109 3141 -125914 111397
23851A11397J26717R295N8378R0781K0823j97718k17402j45248J2285l7426j85715
$$ 111397 238114 247409 305787 396568 417391 219673 2271 -142977 -130692 -168118 -353833
23840c53833K17912J91561J9938j03945J0450j10175j12546k5629R2630Q0241
$$ -353833 -135921 55640 75578 -28367 -17917 -128092 -240638 -266267 -173637 -93396
23830i3396k2076Q416l5571j00784K29748M0103K6593R7450k1318k8754k4928
$$ -93396 -115472 -107056 -142627 -243411 -13663 26440 53033 150483 129165 100411 75483
23819G5483j8351K08031q8306j68265R1189M9821q6104p4650k57856J87697J21429
$$ 75483 57132 265163 176857 8592 99781 149602 63498 -11152 -269008 -81311 40118
23808D0118j54139l3268J61111m6479j40434k06143N768K56013J35363o4671k4915
$$ 40118 -114021 -147289 13822 -32657 -173091 -379234 -373466 -117453 17910 -46761 -71676
23797g1676K54242j00281k53706j73599J83754K02815o6051k66088j6369J92818
$$ -71676 182566 82285 -171421 -345020 -161266 41549 -24502 -290590 -306959 -114141
23787a14141J47873p7841j11845n4243j75638J02038J1518j5469J39832J85567
$$ -114141 33732 -44109 -155954 -210197 -385835 -283797 -272279 -287748 -147916 37651
23777C7651J82397Q6553r2765j70917Q5036l0585N5512k02556q7220J1717Q7525
$$ 37651 220048 306601 213836 42919 127955 97370 152882 -49674 -136894 -125177 -37652
23766c7652M8475r5839j75960K9993J1522J70073r0620N2293K36300j40893k47596
$$ -37652 10823 -85016 -260976 -230983 -219461 -49388 -140008 -87715 148585 7692 -239904
23755b39904j57671J72841j5392R3231J01984J9406p3073m6083L8492m6984R8839
$$ -239904 -397575 -224734 -240126 -146895 -44911 -25505 -98578 -144661 -106169 -153153 -54314
23744e4314l6347O0325q4781J00882J18010J52947o3801k02901l9021J52011m8013
$$ -54314 -90661 -30336 -115117 -14235 103775 256722 192921 -9980 -49001 103010 54997
23733E4997J7018k58743m6020J12822J89335J90673k85608k02691l2425J6041
$$ 54997 72015 -186728 -232748 -119926 69409 260082 -25526 -228217 -260642 -244601
23723b44601L8513K886J13017r3657J70227K3290K54283K33934k53882k98117
$$ -244601 -206088 -203202 -90185 -183842 -13615 9675 263958 497892 244010 -54107
23713e4107K6064J86631K65664K7932j02019j26851N3406k5776j9808j0748j911
$$ -54107 -28043 158588 424252 452184 350165 223314 276720 250944 231136 220388 218477
23702B18477k78401q7675M7813p1891O9468q4518J04272K16347l4662q2915J4862
$$ 218477 -59924 -147599 -99786 -171677 -102209 -186727 -82455 133892 99230 16315 31177
23691C1177n7196K8543K17577j08329J36j1467M1679q3410l27743O6755J92556
$$ 31177 -26019 2524 220101 111772 111908 100441 142120 58710 -269033 -202278 -9722
23680i722K6190M9845l3530k5853J14476o2824J24913J58725j66031m0383K559
$$ -9722 16468 66313 32783 6930 121406 58582 183495 342220 176189 135806 138365
23669A38365N9326K650j4307o0782l20286j05185o7615K18946J82264K5007k0683
$$ 138365 197691 200341 186034 125252 -195034 -300219 -367834 -148888 33376 58383 37700
23658C7700l755J23359R722O708L6017j77994n3210j37891K8864k2572O6983j6016
$$ 37700 33945 157304 167026 173734 209751 31757 -21453 -159344 -130480 -153052 -86069 -102085
23646a02085K60592Q9932k02353p3992p4522j10393J61929q6104k05661j88941
$$ -102085 158507 248439 46086 -27906 -102428 -212821 -50892 -136996 -342657 -531598
23636e31598J24598R7562m760Q181m5585J5709J55575J86923m9177q9020O5799
$$ -531598 -407000 -309438 -314198 -306017 -351602 -335893 -180318 6605 -42572 -131592 -65793
23625f5793P8895N0741j8615j91116m5260J03414J62946R4265j17155j64311j80396
$$ -65793 13102 63843 45228 -145888 -191148 -87734 75212 169477 52322 -111989 -292385
23614b92385O4853O7567J99364Q8505k37776K313j05703k41918M6301J67295j61857
$$ -292385 -227532 -159965 39399 127904 -109872 -107559 -213262 -455180 -408879 -241584 -403441
23603d03441q39L30894J14510L4348L6247j6276j4459O9421j81946k5892N684
$$ -403441 -404280 -73386 41124 75472 111719 95443 80984 150405 -31541 -57433 -51749
23592e1749J93043n975k38506j46449J23132J3696J2155J45958l6030r5682p6731
$$ -51749 141294 135319 -103187 -249636 -126504 -112808 -100653 45305 9275 -86407 -163138
23581a63138j10196m594K14700m1233j98486J05273m401O455P2936K11404q507
$$ -163138 -273334 -277928 -63228 -104461 -302947 -197674 -202075 -195620 -122684 88720 80213
23570H0213j30387m9143n7021L22586P2503K0612j27275j76242j58014p7769j0575
$$ 80213 -50174 -99317 -156338 166248 238751 259363 132088 -44154 -202168 -279937 -290512
23559b90512K3538n6219P1132q6500J27235K06903k22988p9332J73171L9169m4205
$$ -290512 -266974 -323193 -252061 -338561 -211326 -4423 -227411 -306743 -133572 -94403 -138608
23548a38608k0296j9984J73666j6395r9967J63578L874k02487j39894J47794J45284
$$ -138608 -158904 -178888 -5222 -21617 -121584 41994 45868 -156619 -296513 -148719 -3435
23537c435J05528j4544Q6840P0562l5242j55340N0394K698J4562j14610j1439
$$ -3435 102093 87549 174389 244951 209709 54369 104763 107461 122023 7413 -4026
23526d026p8859k7624J02722J937r4317p5945R1255L6879m1611q1974l6778K02930
$$ -4026 -82885 -110509 -7787 -5850 -100167 -176112 -84857 -47978 -89589 -171563 -208341 -5411
23514e411K15566q3733q7834N2946l5333m168l6042k93798j22893R1171K10574
$$ -5411 210155 126422 38588 91534 56201 52033 15991 -277807 -400700 -309529 -98955
23503i8955R5790L7466J69640q87j18148j13595K17895O7108j93746M4145j24853
$$ -98955 -3165 34301 203941 203054 84906 -28689 189206 256314 62568 106713 -18140
23492a8140k13241L0370m8912q5790Q2877j70040q6873l4749P0259j9533O3923
$$ -18140 -231381 -201011 -249923 -335713 -252836 -422876 -509749 -544498 -474239 -493772 -429849
23481d29849K89219q193l6978R173l2956p3214Q6758J92875N832r4932k6911r6496
$$ -429849 -140630 -148823 -185801 -176628 -209584 -282798 -196040 -3165 2667 -92265 -119176 -215672
23469b15672M0703R4910j5679M3183J06811j02080N8606P4509l0516j65939K331
$$ -215672 -174969 -80059 -95738 -52555 54256 -47824 10782 85291 54775 -111164 -108833
23458a08833K01117J31193M9426M9966j38971k59504k351n6462j2438J19026K9585
$$ -108833 92284 223477 272903 322869 183898 -75606 -77957 -134419 -146857 -27831 1754
23447A754k8539J7565P8000k09792j32577M1550L9853J47923N8700L0397K48350
$$ 1754 -26785 -9220 68780 -141012 -273589 -232039 -192186 -44263 14437 44834 293184
23436B93184O1184n2945j27366o4867n4728O5929j58784k13410M3297L4671r4646
$$ 293184 354368 301423 174057 109190 54462 120391 -38393 -251803 -208506 -173835 -268481
23425b68481n5655J98733q0447k49294N15J14149n5937k5417p180O5149j0584
$$ -268481 -324136 -125403 -205850 -455144 -454629 -340480 -396417 -421834 -429014 -363865 -374449
23414c74449J19948K40057P8750q6638n2277p4896J3768M7891Q5553j36431k3113
$$ -374449 -254501 -14444 64306 -22332 -74609 -149505 -135737 -87846 -2293 -138724 -161837
23403a61837q8060Q3779K4861J26357P5214l99303N914K44871m0337m3996J0128
$$ -161837 -249897 -166118 -141257 -14900 60314 -338989 -333075 -88204 -128541 -172537 -162409
23392a62409J6313r8739m1004m3914N6294L8701r3634k181O2863L8631J80904
$$ -162409 -146096 -244835 -285839 -329753 -273459 -234758 -328392 -330573 -267710 -229079 -48175
23381d8175k3211j2601l8077o6177J59836J88376m9779k05703m2239R8588J4176
$$ -48175 -71386 -83987 -122064 -188241 -28405 159971 110192 -95511 -137750 -39162 -24986
23370b4986o9217j82614N6181O4304q8397R642J75323N3484P038K7963k0134R9729
$$ -24986 -94203 -276817 -220636 -156332 -244729 -235087 -59764 -6280 758 28721 8587 108316
23358A08316o1261j71769k25207n5927j52337l2952K42921K66430J58219k8427
$$ 108316 47055 -124714 -349921 -405848 -558185 -591137 -348216 -81786 76433 48006
23348D8006r7575l6441K831J831k5947j08708j34721o5449p9777J75745j70670
$$ 48006 -49569 -86010 -83179 -81348 -107295 -216003 -350724 -416173 -495950 -320205 -490875
23337d90875q0795J06370J66615L08351p1830j93437o4899J4865J84728K28722
$$ -490875 -571670 -465300 -298685 9666 -62164 -255601 -320500 -305635 -120907 107815
23327A07815M3922j11013j15073j03914R3357J13337j16830k29734J9465Q3179
$$ 107815 151737 40724 -74349 -178263 -84906 28431 -88399 -318133 -298668 -215489
23317b15489p0821J6889j79851J71535K20867J78763j42097r3573Q9022K4164
$$ -215489 -286310 -269421 -449272 -277737 -56870 121893 -20204 -113777 -24755 -591
23307e91j1955J68750q9389k48556M1620J76493j20076O7255J44717J38808J31220
$$ -591 -12546 156204 66815 -181741 -140121 36372 -83704 -16449 128268 267076 398296
23296C98296R3692o7098k03249j49340n1319k8396J05239j09930p4859N6717J31817
$$ 398296 491988 424890 221641 72301 20982 -7414 97825 -12105 -86964 -30247 101570
23285A01570K03507k89802k16068q7072J04620J48865J61109J30152j83482k04217
$$ 101570 305077 15275 -200793 -287865 -183245 -34380 126729 256881 73399 -130818
23275a30818r8244K49475o8695o9637N8860K41364p3952k19338J73486j2257j81458
$$ -130818 -229062 20413 -48282 -117919 -59059 182305 108353 -110985 62501 50244 -131214
23264a31214r115K744R7292j26648j01389J623l961q3618J00286J59825r7187
$$ -131214 -140329 -137585 -40293 -166941 -268330 -266707 -270668 -354286 -254000 -94175 -191362
23253a91362J88411Q979r159r4802l6737j05332p2651J44269J49514k6934k7999
$$ -191362 -2951 6028 -3131 -97933 -134670 -240002 -312653 -168384 -18870 -45804 -73803
23242g3803k2129P5832J32387M7800k00702n2221o497m8735J56065q6876q7408
$$ -73803 -95932 -20100 112287 160087 -40615 -92836 -99333 -148068 7997 -78879 -166287
23231a66287k07126p876j44434m7325J44747L58116K43361K0j37368j79765j76562
$$ -166287 -373413 -381289 -525723 -573048 -428301 -70185 173176 173196 35828 -143937 -320499
23220c20499j3589J09942r4650r7240J25138Q2439K2426J29657J15590P8167j03617
$$ -320499 -334088 -224146 -318796 -416036 -290898 -208459 -186033 -56376 59214 137381 33764
23209C3764R6285r1434j3914J09655J907j28842J38719k182J25029J24274P5811
$$ 33764 130049 38615 24701 134356 136263 7421 146140 143958 268987 393261 469072
23198D69072L8400l1540p4644l35265j69769Q5034j37044R823J25220j20079m4994
$$ 469072 507472 475932 401288 66023 -103746 -18712 -155756 -145933 -20713 -140792 -185786
23187a85786j4631Q9476K79427j8463l25894j56375O1740J87263J87485J5731
$$ -185786 -200417 -110941 168486 150023 -175871 -332246 -270506 -83243 104242 119973
23177A19973K936p567q025p2507j27422j6071J18452j0720k4353m0584J61252
$$ 119973 122909 115342 107317 34810 -92612 -108683 9769 -951 -25304 -65888 95364
23166I5364J91054l9972k01503k28601J26810J38814M5048Q634L7965J31711J74152
$$ 95364 286418 246446 44943 -183658 -56848 81966 127014 135648 173613 305324 479476
23155D79476j02459m05753j0586N5633j889j618J28547p2366j98765j7630p1177
$$ 479476 377017 -28736 -39322 16311 14422 12804 141351 68985 -129780 -147410 -218587
23144b18587O2907J99496O6418n6049J5177k03973j20099n7831N9922Q2007P6280
$$ -218587 -155680 43816 110234 54185 69362 -134611 -254710 -312541 -252619 -170612 -94332
23133i4332j00369q4088p5079K32946J5931R9619J22330P8822j42422R5698j88050
$$ -94332 -194701 -278789 -353868 -120922 -104991 -5372 116958 195780 53358 149056 -38994
23122c8994j02761l8040K54929J68365N548p2314R1621k71250M2096m1635j81438
$$ -38994 -141755 -179795 75134 243499 249047 176733 268354 -2896 39200 -2435 -183873
23111a83873l9335J3510m8153J20804O3668K14980N7052j00602L8080K8754L1940
$$ -183873 -223208 -209698 -257851 -137047 -73379 141601 198653 98051 136131 164885 196825
23100A96825k79118k16497J85859K94376J77842J64596k5855k12087j32464n7591
$$ 196825 -82293 -298790 -112931 181445 359287 523883 498028 285941 153477 95886
23090I5886j72392k3553J40156J58746N576r8628r208j39716p93k29622M6710
$$ 95886 -76506 -100059 40097 198843 204419 105791 96583 -43133 -43926 -273548 -226838
23079b26838K27517K53702J70889j1085j96858k87518J06349o2909n9811M1495
$$ -226838 679 254381 425270 414185 217327 -70191 36158 -26751 -86562 -45067
23069d5067K2957O3481R7949n8202j29073j13698o6202J85586K13405j19141j52329
$$ -45067 -22110 41371 139320 81118 -47955 -161653 -227855 -42269 171136 51995 -100334
23058a00334k93992o8134M8692K99645K07461N8067j15866p2201k970l1052R3320
$$ -100334 -394326 -462460 -413768 -114123 93338 151405 35539 -36662 -39632 -70684 22636
23047B2636R7898K1690o0592r6602K97099L4607M072M9990k16620j09821n3239
$$ 22636 120534 142224 81632 -14970 282129 316736 320808 370798 154178 44357 -8882
23036h882j07263j15795m6515K88367K54133j22933k23619l01368N7704M55281
$$ -8882 -116145 -231940 -278455 9912 264045 141112 -82507 -383875 -326171 129110
23026A29110J32101l7323m8491q7100j80104O3734Q9873J19732k3897j98955P3581
$$ 129110 261211 223888 175397 88297 -91807 -28073 61800 181532 157635 -41320 32261
23015C2261R49q2291J66458J96460m2417p7679q4306N1059o6010R6093M8216p8733
$$ 32261 33210 -49081 117377 313837 271420 193741 109435 160494 94484 190577 238793 160060
23003A60060n1939m4305j6788j130j13550R0201l253K000J1784K8956Q553l0403
$$ 160060 108121 63816 47028 45898 -67652 22549 19296 21296 33080 62036 70589 40186
22991D0186R3605o2485J2828o4710j05221o9505k43819k7858K40438K09976j77101
$$ 40186 133791 71306 84134 19424 -85797 -155302 -399121 -426979 -186541 23435 -153666
22980a53666j97374J02292m482J12762m4352M0938J5785L2592J24369k36052l11203
$$ -153666 -351040 -248748 -253230 -140468 -184820 -143882 -128097 -95505 28864 -207188 -518391
22969e18391j8739J00009J06971j63807J48688K11116J42556j5825P0032j4693
$$ -518391 -537130 -437121 -330150 -493957 -345269 -134153 8403 -7422 62610 47917
22959D7917K5825m5786K0962j70458l9136J49886J05461p0838j39400n9510j6129
$$ 47917 73742 27956 48918 -121540 -160676 -10790 94671 23833 -115567 -175077 -191206
22948a91206r5712K6525j18028n3280O0785J9156N5019J81317j24515N2490O1751
$$ -191206 -286918 -260393 -378421 -431701 -370916 -351760 -296741 -115424 -239939 -187449 -125698
22937a25698l368J9475j5102n1202j43377j05639L6661R9898O6871K0503j57397
$$ -125698 -129066 -109591 -124693 -175895 -319272 -424911 -388250 -288352 -221481 -200978 -358375
22926c58375j07947L02963J92502p2756j99780o483J5211L32757N1949Q5815L7139
$$ -358375 -466322 -163359 29143 -43613 -243393 -249876 -234665 98092 150041 235856 272995
22915B72995N8099n4457j44251j6184N211K062p553j71558m7026P9582j3832o468
$$ 272995 331094 276637 132386 116202 121413 123475 115922 -55636 -102662 -23080 -36912 -43380
22903d3380j18927k2791k9778J09955K56847M6307j62623j57478k7229K0133k2631
$$ -43380 -162307 -185098 -214876 -104921 151926 198233 35610 -121868 -149097 -128964 -151595
22892a51595j01397j91192J57716K3917j12888Q4464m6203N8757P3575m7895K21512
$$ -151595 -252992 -444184 -286468 -262551 -375439 -290975 -337178 -278421 -204846 -252741 -31229
22881c1229J57074j21480k04696J6083J53827K99936L7447j52045j87889j17883
$$ -31229 125845 4365 -200331 -184248 -30421 269515 306962 154917 -32972 -150855
22871a50855k17112L2448J51367J77622n0301P1024m5416k58008R8006J83378
$$ -150855 -367967 -335519 -184152 -6530 -56831 14193 -31223 -289231 -191225 -7847
22861g847o719j61093j36542j3415J41225J54389j95524J52103J77721K12032
$$ -7847 -14566 -175659 -312201 -325616 -184391 -30002 -225526 -73423 104298 316330
22851C16330j708k07254n4804j36117j789L0431N7373j44489Q9355N5609N4583
$$ 316330 314622 107368 52564 -83553 -85342 -54911 2462 -142027 -52672 2937 57520
22840E7520P5221K8524j50636j64040j59749l6256J36774Q580O9044J13674O7409
$$ 57520 132741 161265 10629 -153411 -313160 -349416 -212642 -204062 -135018 -21344 46065
22829D6065M7305K59362j30064j05679l7718j6243r2273q4286o3370p140n1452
$$ 46065 93370 352732 222668 116989 79271 63028 -29245 -113531 -176901 -184041 -235493
22818b35493M4962J59849j22268R5520K85380l4447q6015r0143M4056K7838J18051
$$ -235493 -190531 -30682 -152950 -57430 227950 193503 107488 17345 61401 89239 207290
22807B07290J13624M1375k77667k34672J5715M6734m360P5808J1678q4466q593
$$ 207290 320914 362289 84622 -150050 -134335 -87601 -91961 -16153 -4475 -88941 -97534
22796i7534n6456J04089p4755l6090q8972N2835L23751o2049r5245R4708j06860
$$ -97534 -153990 -49901 -124656 -160746 -249718 -196883 126868 64819 -30426 64282 -42578
22785d2578j85377j87809j6706L0914k5956P5117p3722j05357J00976J70695R4961
$$ -42578 -227955 -415764 -432470 -401556 -427512 -352395 -426117 -531474 -430498 -259803 -164842
22774a64842K3721p6089k5182O2001J93638k09343j20842Q6510J31570j87171
$$ -164842 -141121 -217210 -242392 -180391 13247 -196096 -316938 -230428 -98858 -286029
22764b86029J02007Q1797m659p220p1555m6653l5968O9430J24859j5815P9033
$$ -286029 -184022 -102225 -106884 -114104 -185659 -232312 -268280 -198850 -73991 -89806 -10773
22753a0773R8654n1241j02875l6867P5799O2442R8584Q6657j28822j94059k75188
$$ -10773 87881 36640 -66235 -103102 -27303 35139 133723 220380 91558 -102501 -377689
22742c77689j61926J42796L7642j01749J78238K98564o1249r7941O6828K29284
$$ -377689 -539615 -396819 -359177 -460926 -282688 15876 -45373 -143314 -76486 152798
22732A52798N0586k91143j48426j5007N6550N3325J11489Q8808K1430q5699j07668
$$ 152798 203384 -87759 -236185 -251192 -194642 -141317 -29828 58980 80410 -5289 -112957
22721a12957M4492J26000r742P4413J45912j18603k04556j04064q9008J236j50937
$$ -112957 -68465 57535 47793 122206 268118 149515 -55041 -159105 -248113 -246877 -397814
22710c97814J26380j20566p4973j29060j05622J3303K87234K33617K1423O7732
$$ -397814 -271434 -392000 -466973 -596033 -701655 -688352 -401118 -167501 -146078 -78346
22700g8346j01043n0183L7241J35387m188k29032J84813N8594K497l1578j06321
$$ -78346 -179389 -229572 -192331 -56944 -61132 -290164 -105351 -46757 -44260 -75838 -182159
22689a82159j39378j70327Q5987J5273k5410J61467m3734k3905K28238J24501
$$ -182159 -321537 -491864 -405877 -390604 -416014 -254547 -298281 -322186 -93948 30553
22679C0553p1275j45254k43884J48356J60426K26080K75974K8207k39181k01971
$$ 30553 -40722 -185976 -429860 -281504 -121078 105002 380976 409183 170002 -31969
22669c1969M940L9702J04824J40881l1182n7056M71J58259j07995j21990j45265
$$ -31969 -27029 12673 117497 258378 227196 170140 170611 328870 220875 98885 -46380
22658d6380j00650r9428j49397k34753R6912J99346J48126K513K02509K16015
$$ -46380 -147030 -246458 -395855 -630608 -533696 -334350 -186224 -183711 18798 234813
22648B34813K2163j71228r1644n6461R565l8581k14631k19701k9199K03407L4513
$$ 234813 256976 85748 -5896 -62357 -52792 -91373 -306004 -525705 -554904 -351497 -316984
22637c16984K62464K9027j3523R0258j16082j57969Q6857q1742L5802o7416J28234
$$ -316984 -54520 -25493 -39016 51242 -64840 -222809 -135952 -217694 -181892 -249308 -121074
22626a21074J40547K15719N1622q3889k12161j59482k27219k64230M1982R1044
$$ -121074 19473 235192 286814 202925 -9236 -168718 -395937 -660167 -618185 -527141
22616e27141K1648J08375R3073K35662r0068p4313n7682J51938N2733K6741o5096
$$ -527141 -505493 -397118 -304045 -68383 -158451 -232764 -290446 -138508 -85775 -59034 -124130
22605a24130q2001K16127j29803l6113r380j00856j31699K49129K6756Q3896j10665
$$ -124130 -206131 9996 -119807 -155920 -165300 -266156 -397855 -148726 -121970 -38074 -148739
22594a48739l4802J22354J5913J7533K60764Q3866r8858j66201j56213k4117L27326
$$ -148739 -183541 -61187 -45274 -27741 233023 316889 218031 51830 -104383 -128500 198826
22583A98826K59947o5427k69356j70142j83771p5925Q562j729L2743L3975J27832
$$ 198826 458773 393346 123990 -46152 -229923 -305848 -297286 -299015 -266272 -232297 -104465
22572a04465K47088N4024m4967M1400P8360j466j04632J33866j10450k57967P7702
$$ -104465 142623 196647 151680 193080 271440 269974 165342 299208 188758 -69209 8493
22561H493J48881O1924o0519j35859k67048L1229P2524J37660J99696O6107j58038
$$ 8493 157374 219298 158779 22920 -244128 -212899 -140375 -2715 196981 263088 105050
22550A05050k51616p9403J19018k64078M8514K90529J54268m6267k5349J31033
$$ 105050 -146566 -225969 -106951 -371029 -322515 -31986 122282 76015 50666 181699
22540A81699o7532k20655l2030J04907q3621p3522M1082K49618L9943M9356N1952
$$ 181699 114167 -106488 -138518 -33611 -117232 -190754 -149672 99946 139889 189245 241197
22529B41197l2529k9059l0075L8636j5185j33645J21851j75255l58059J80638
$$ 241197 208668 179609 149534 188170 172985 39340 161191 -14064 -372123 -191485
22519a91485M5981M5303q94L7938p5134j3973P0431j871Q8838k1563L086O4928
$$ -191485 -145504 -100201 -101095 -63157 -138291 -152264 -81833 -83704 5134 -16429 -13343 51585
22507E1585j6046j60668j74886O2865Q5256J14028K49040J0462n1693m9846j38073
$$ 51585 35539 -125129 -300015 -237150 -151894 -37866 211174 221636 169943 120097 -17976
22496a7976j12308q3974j44756R3072Q0227o7203L4472J78852R7209J08480p6949
$$ -17976 -130284 -214258 -359014 -265942 -185715 -252918 -218446 -39594 57615 166095 89146
22485H9146k46150j93853j68054j1584J74654K96545K1355q6375r0065N512n8759
$$ 89146 -157004 -350857 -518911 -530495 -355841 -59296 -37941 -124316 -214381 -208869 -267628
22474b67628N2923l1807O1673J48231L52070K7604k04368k29364j91415k33171
$$ -267628 -214705 -246512 -184839 -36608 315462 343066 138698 -90666 -282081 -515252
22464e15252J36864J68703J40234k30069k5346R6804K5702J03338J31192j2688
$$ -515252 -378388 -209685 -69451 -299520 -324866 -228062 -202360 -99022 32170 19482
22454A9482J9351N0528j38971j08937j75442q1524r0783J16168R2035j2729J88439
$$ 19482 38833 89361 -49610 -158547 -333989 -415513 -506296 -390128 -298093 -310822 -122383
22443a22383M6179J07518k00225k90541J5486N8152K9889R1655J72812J54404
$$ -122383 -76204 31314 -168911 -459452 -443966 -385814 -355925 -264270 -91458 62946
22433F2946j3925j25349q798k03501j1031M7214L812K13367K9551k34633K35294
$$ 62946 49021 -76328 -85126 -288627 -299658 -252444 -248632 -35265 -5714 -240347 -5053
22422e053M862j67387j3874l5163K39629J96681j0866j50769j37210m8285J01898
$$ -5053 -191 -167578 -181452 -216615 23014 219695 208829 58060 -79150 -127435 -25537
22411b5537j19378O8081Q5839j39285q6210R8377J89723n8220J8024j84056r015
$$ -25537 -144915 -76834 9005 -130280 -216490 -118113 71610 13390 31414 -152642 -161657
22400a61657J08452J85361j74344p9348J51544o7217l42464l6360k2154n3079
$$ -161657 -53205 132156 -42188 -121536 30008 -37209 -379673 -416033 -438187 -491266
22390d91266P7724R4677r0743N388o4M3126L41188J08489J44243k71685j54354
$$ -491266 -413542 -318865 -409608 -404220 -404284 -361158 -19970 88519 232762 -38923 -193277
22379a93277j03118j45051J42725J29328r8791R1322J2774Q6921j21097J4233
$$ -193277 -296395 -441446 -298721 -169393 -268184 -176862 -164088 -77167 -198264 -184031
22369a84031J68401j11982l4114K10359J30985J32425O7233l6091o7889k90466
$$ -184031 -15630 -127612 -161726 48633 179618 312043 379276 343185 275296 -15170
22359a5170j40021N3269k8203N8507J82964P9065J11021j67052j52310p6768l146
$$ -15170 -155191 -101922 -130125 -71618 111346 190411 301432 134380 -17930 -94698 -97844
22348i7844j34267K4695j20285K84098l608j07067L811p5561j45750R5338J58455
$$ -97844 -232111 -207416 -327701 -43603 -47211 -154278 -150467 -226028 -371778 -276440 -117985
22337a17985o8524K3993M4745K3165N7038M5353k2955P1116o0938j95491L1373
$$ -117985 -186509 -162516 -117771 -94606 -37568 7785 -15170 55946 -4992 -200483 -169110
22326a69110J27529J09515J10241K59471K8914j65232k48846k43213O1448j18134
$$ -169110 -41581 67934 178175 437646 466560 301328 52482 -190731 -129283 -247417
22316b47417M7131L07699K04573k14099l2920k4049M7979J51497k44436k08391
$$ -247417 -200286 107413 311986 97887 64967 40918 88897 240394 -4042 -212433
22306b12433J2224L56288L5903K0766m3283k86216k97421j56445m0354J90203
$$ -212433 -200209 156079 191982 212748 169465 -116751 -414172 -570617 -610971 -420768
22296d20768J27235l7184L1642j05648k6988K8448J06712j7504O5564K7451j0072
$$ -420768 -293533 -330717 -299075 -404723 -431711 -403263 -296551 -314055 -248491 -221040 -231112
22285b31112K8035m6989J50318r1990j98410P0664J24320q681J78079M9414n997
$$ -231112 -203077 -250066 -99748 -191738 -390148 -319484 -195164 -203845 -25766 23648 17651
22274A7651O0019j71047j49499J15229Q2983P9553j54211J0832J5306K53175J43489
$$ 17651 77670 -93377 -242876 -127647 -44664 34889 -119322 -108490 -93184 159991 303480
22263C03480K4089J274j93584l1258j07167l8874j4807j08204o1363Q1049O7367
$$ 303480 327569 328843 135259 104001 -3166 -42040 -56847 -165051 -226414 -145365 -77998
22252g7998O1506M9774l1137k0426o4604K39785K06100k62094q6044K0115Q3786
$$ -77998 -16492 33282 2145 -18281 -82885 156900 363000 100906 14862 34977 118763
22241A18763M3252n0894R5166R309k86496l1377m8941N926l9138l8558K4104J41781
$$ 118763 162015 111121 206287 215596 -70900 -102277 -151218 -145292 -184430 -222988 -198884 -57103
22229e7103K29786J89357j85081k45556j6414J10764r3814n9341J43188J46795
$$ -57103 172683 362040 176959 -68597 -85011 25753 -68061 -127402 15786 162581
22219A62581K45485l01333l63224Q2435K07997m6539J30106P3151j73822j40029
$$ 162581 408066 106733 -256491 -174056 33941 -12598 117508 190659 16837 -123192
22209a23192M7150l9647L674M3690J99165j9890J2535j1868k07483k9244L9514
$$ -123192 -76042 -115689 -112015 -68325 130840 110950 123485 111617 -95866 -125110 -85596
22198h5596j04239K02373n0743l01729J31661L2768j53415J4337J79826J06581
$$ -85596 -189835 12538 -38205 -339934 -208273 -175505 -328920 -314583 -134757 -28176
22188b8176J08461J29710o9383j61931P5154L1962P6228m2332P9522j00446r9394
$$ -28176 80285 209995 140612 -21319 53835 85797 162025 119693 199215 98769 -625
22177f25n7844Q1920N0797k46326J2498j31504j05811R8191J97679J56024j37782
$$ -625 -58469 23451 74248 -172078 -159580 -291084 -396895 -298704 -101025 54999 -82783
22166h2783j48387L4090K24749j6252q7125N0056r0410k55373j5346J39638J03998
$$ -82783 -231170 -197080 27669 11417 -75708 -25652 -116062 -371435 -386781 -247143 -143145
22155a43145R5752N5381Q2569j91741k8160j59866o3207M4835P2532O0110J39982
$$ -143145 -47393 7988 90557 -101184 -129344 -289210 -352417 -307582 -235050 -174940 -34958
22144c4958l8494j00631N0702J45531j07194p5518m3251J74489L3497K3098N0080
$$ -34958 -73452 -174083 -123381 22150 -85044 -160562 -203813 -29324 4173 27271 77351
22133G7351j14806r0742L051j8088J20134Q0670k9916L5609O4505K1124j65679
$$ 77351 -37455 -128197 -125146 -143234 -23100 57570 27654 63263 127768 148892 -16787
22122a6787j37860J03112m5489N2180Q2161j19529N0546Q6476l304j9691J72331
$$ -16787 -154647 -51535 -97024 -44844 37317 -82212 -31666 54810 51506 31815 204146
22111B04146K5038j95213m1379K10886L3605j11267k81936J2096J86641j27099
$$ 204146 229184 33971 -7408 203478 237083 125816 -156120 -144024 42617 -84482
22101h4482k8644r3355j80416R9870J73643L55453L8267K4425j8548q031j7869
$$ -84482 -113126 -206481 -386897 -287027 -113384 242069 280336 304761 286213 278182 260313
22090B60313j58165j2824L1995K3576m4109j58619J45062L86616j71547j85624
$$ 260313 102148 89324 121319 144895 100786 -57833 87229 473845 302298 116674
22080A16674j23929o8948O9757N9548m8356j13933o4940k6353j8339o766J02629
$$ 116674 -7255 -76203 -6446 53102 4746 -109187 -174127 -200480 -218819 -225585 -122956
22069a22956N9231m3582o8961j3868j24472J47208O6727j6940p0426K0250J38021
$$ -122956 -63725 -107307 -176268 -190136 -314608 -167400 -100673 -117613 -188039 -167789 -29768
22058b9768J70577j49865n971O8535j7898j34073j14980M4188o2930Q7583J72273
$$ -29768 140809 -9056 -15027 53508 35610 -98463 -213443 -169255 -232185 -144602 27671
22047B7671q9951r7077l5573n9438K71017J01988l50087P4603J84672R2305N6489
$$ 27671 -62280 -159357 -194930 -254368 16649 118637 -231450 -156847 27825 120130 176619
22036A76619Q9598k2937j07029k59084L5657L459j06270J22715J62075p0011J20917
$$ 176619 266217 243280 136251 -122833 -87176 -83717 -189987 -67272 94803 24792 145709
22025A45709O7714j46397q8584N0705K5512J53439j3893j33286j18014j44627
$$ 145709 213423 67026 -21558 29147 54659 208098 194205 60919 -57095 -201722
22015b01722j74900J75430K10016J86313K9819j34411m7768J11797j515j48121
$$ -201722 -376622 -201192 8824 195137 224956 90545 42777 154574 153059 4938
22005D938j5995J1092O413n5885R7724M910J10846J00618j45735p9732K3528j76342
$$ 4938 -11057 35 6448 -49437 48287 53197 164043 264661 118926 39194 62722 -113620
21993a13620j72754j7054l6623J89885J60547R0291P7694O8578j74767k08513
$$ -113620 -286374 -303428 -340051 -150166 10381 100672 178366 246944 72177 -136336
21983a36336P9182k4390j28200J14535o2841k254L4641Q2753L63242J07391j13981
$$ -136336 -57154 -81544 -209744 -95209 -158050 -160304 -125663 -42910 320332 427723 313742
21972C13742o9429o3481j9640q5220k30530n3582J50506L7663j85907k51248L9228
$$ 313742 244313 180832 161192 75972 -154558 -208140 -57634 -19971 -205878 -457126 -417898
21961d17898j13634J07350J60477K41173k8914j87325m3881j09531J73685J63416
$$ -417898 -531532 -424182 -263705 -22532 -51446 -238771 -282652 -392183 -218498 -55082
21951e5082M4563J15230j67519Q9867K21139k8516l6804j75731m2017J15126P2527
$$ -55082 -10519 104711 -62808 27059 248198 219682 182878 7147 -34870 80256 152783
21940A52783J03261p8698j22449m9131o6371P9536K8075j05230J38363l6219N0751
$$ 152783 256044 177346 54897 5766 -60605 18931 47006 -58224 80139 43920 94671
21929I4671j22221j2090r0548l9397Q7891J2485K5091J66413Q6996j85793k98805
$$ 94671 -27550 -39640 -130188 -169585 -81694 -69209 -44118 122295 209291 23498 -275307
21918b75307R8080m1645j96841J64084J91204J8650k3571M5946j98696j03356
$$ -275307 -177227 -218872 -415713 -251629 -60425 -41775 -65346 -19400 -218096 -321452
21908c21452J43894K17781M2771l31364k69712j08687K41087K17662j6310j3968
$$ -321452 -177558 40223 82994 -248370 -518082 -626769 -385682 -168020 -184330 -198298
21898a98298K28200J52185Q6310L5914m07239j05578R0791l9449j33256n8312
$$ -198298 29902 182087 268397 304311 -102928 -208506 -117715 -157164 -290420 -348732
21888c48732p453J28673P1432J24154m2705j65983l9233j41105J87692K59265
$$ -348732 -356185 -227512 -156080 -31926 -74631 -240614 -279847 -420952 -233260 26005
21878B6005Q663q1961M0770L2976O4211k30458j43149k0414k2017j9748N3498
$$ 26005 34668 -47293 -6523 26453 90664 -139794 -282943 -303357 -325374 -345122 -291624
21867b91624J42030k02320j27351J64465K24857j35722k0036j2725q8331M734
$$ -291624 -149594 -351914 -479265 -314800 -89943 -225665 -245701 -258426 -346757 -342023
21857c42023J90691l0362J0751l8514J3993K67752k2726l9977j083K41180j30088
$$ -342023 -151332 -181694 -170943 -209457 -195464 72288 49562 9585 8502 249682 119594
21846A19594k12250q8006M9453J63941R0516n6610L4484j34812k09142j20862
$$ 119594 -92656 -180662 -131209 32732 123248 66638 101122 -33690 -242832 -363694
21836c63694j17840K35778K53406n551j53011j7931J9849O0717J71039K41094
$$ -363694 -481534 -245756 7650 2099 -150912 -168843 -148994 -88277 82762 323856
21826C23856j0808k13894p9047k819j9083n1524j2644K07670J23152j51466j3898
$$ 323856 313048 99154 20107 17288 -1795 -53319 -65963 141707 264859 113393 99495
21815I9495q3442j35421L8976n5673m6316R6712j19185J2269K04248O1632J62429
$$ 99495 16053 -119368 -80392 -136065 -182381 -85669 -204854 -192585 11663 73295 235724
21804B35724o3276k73803m2687j34952J14136O8036q3078O0099J70015o6336j28852
$$ 235724 172448 -101355 -144042 -278994 -164858 -96822 -179900 -119801 50214 -16122 -144974
21793a44974K08439K08387k02198m21553K4984K09072K92464j45069k19588m4965
$$ -144974 63465 271852 69654 -351899 -326915 -117843 174621 29552 -190036 -235001
21783b35001J20536J33473n2980j12194l00885r52J04150M9906K14877K6122O6989
$$ -235001 -114465 19008 -33972 -146166 -447051 -448003 -343853 -293947 -79070 -52948 14041
21772A4041N3100n5426j06758j17191p4087J33857J50282J08267j3083O0362j18810
$$ 14041 67141 11715 -95043 -212234 -286321 -152464 -2182 106085 93002 153364 34554
21761C4554l63247l8130J54483J31010J79001j75199j32929M8275J01144l0943
$$ 34554 -328693 -366823 -212340 -81330 97671 -77528 -210457 -162182 -61038 -91981
21751i1981N6198n0069n9327l0296j07261K268J57059J5647J1778j57220j04863
$$ -91981 -35783 -85852 -145179 -175475 -282736 -280468 -123409 -107762 -95984 -253204 -358067
21740c58067M0084j59053O6037K44676M4591q2532p28j5358P8139j63591p933
$$ -358067 -317983 -477036 -410999 -166323 -121732 -204264 -204992 -220350 -142211 -305802 -313735
21729c13735J24218J18414N5320N5002J27953j14892R6738J61669k57125k08375
$$ -313735 -189517 -71103 -15783 39219 167172 52280 149018 310687 53562 -154813
21719a54813K7739p6287m9993O2785R230J55676j1034p9673M7905j53514J2601
$$ -154813 -127074 -203361 -253354 -190569 -181339 -25663 -36697 -116370 -68465 -221979 -209378
21708b09378J74911N0081p5858o9516O6876j9754o9618k47477k00657l758K44402
$$ -209378 -34467 15614 -60244 -129760 -62884 -82638 -152256 -399733 -600390 -604148 -359746
21697c59746L06176L6007r9912j06700p3021J09179m837L515k4491Q1149K19994
$$ -359746 -53570 -17563 -117475 -224175 -297196 -188017 -192854 -189339 -213830 -132681 87313
21686H7313P4101M1692l6386k36306j89209l7691J38385J84038j3324n7530r1988
$$ 87313 161414 203106 166720 -69586 -258795 -296486 -158101 25937 12613 -44917 -136905
21675a36905k25174M1772P6690J48954J48027j44738M7190L3366Q864j06973O806
$$ -136905 -362079 -320307 -243617 -94663 53364 -91374 -44184 -10818 -1954 -108927 -102121
21664a02121P7238K0427j32647l4096k14870J5816J22678j2262j27860K07930
$$ -102121 -24883 -4456 -137103 -171199 -386069 -370253 -247575 -259837 -387697 -179767
21654a79767M70384J31852k10497k99281k4141m7035r6045J3726J4821J23387
$$ -179767 290617 422469 211972 -87309 -111450 -158485 -254530 -240804 -225983 -102596
21644a02596P8080j87310r9882K79614J97138P2377j20522j96937N9941J05545
$$ -102596 -24516 -211826 -311708 -32094 165044 237421 116899 -80038 -20097 85448
21634H5448P8526J40934K8046k71928j32073N916Q5966L7737p8176j2916L0038
$$ 85448 163974 304908 332954 61026 -71047 -65131 20835 58572 -19604 -32520 -2482
21623b482L1630o7959j60944P1348L56503O9674m0945j70427k81300j416K38534
$$ -2482 29148 -38811 -199755 -128407 228096 297770 256825 86398 -194902 -196318 42216
21612D2216J65422J08823p4503l06636j48853l940J08535l5000l5612k8979J1427
$$ 42216 207638 316461 241958 -64678 -213531 -217471 -108936 -143936 -179548 -208527 -197100
21601a97100J0942o0461J95965N0654k32489k1886k5942K680P3473o5783K70699
$$ -197100 -186158 -246619 -50654 0 -232489 -254375 -280317 -277637 -204164 -269947 752
21590G52P2145N9982q1803k34042k9883J17686K5382q3233j02205L3051j60791
$$ 752 72897 132879 51076 -182966 -212849 -95163 -69781 -153014 -255219 -222168 -382959
21579c82959P8863O661l4821J15400J23171N3690j05211J0046j45047q7294K15083
$$ -382959 -304096 -297435 -332256 -216856 -93685 -39995 -145206 -135160 -280207 -367501 -152418
21568a52418K29371k24737k23259n4362K81554J67545j75938J93650J41257O9153
$$ -152418 76953 -147784 -371043 -425405 -143851 23694 -152244 41406 182663 251816
21558B51816n6874j55968j34273M6980n6542O3141J1p0523m2819l2947L82958
$$ 251816 194942 38974 -95299 -48319 -104861 -41720 -41709 -112232 -155051 -187998 194960
21547A94960J88877J55449k34101j10144m3997j297j05697K5981K5797R48o0556
$$ 194960 383837 539286 305185 195041 151044 149747 44050 70031 95828 96776 36220
21536C6220p4176j41489j90049J61431J75417j88226m6807j92706J16265J08608
$$ 36220 -37956 -179445 -369494 -208063 -32646 -220872 -267679 -460385 -344120 -235512
21526b35512O9171j02832J5903J07189p796k05053p1659K9350J0521J29287O7241
$$ -235512 -166341 -269173 -253270 -146081 -153877 -358930 -430589 -401239 -390718 -261431 -194190
21515a94190P8977J48792l9124m2807r2658M5889j51120P0528J59526m9457K920
$$ -194190 -115213 33579 -5545 -48352 -141010 -95121 -246241 -175713 -16187 -65644 -62724
21504f2724J88502J16451O6510p7909j71280K1923j64504j2033K0574P66r263
$$ -62724 125778 242229 308739 230830 59550 81473 -83031 -95064 -74490 -73724 -82987
21493h2987j43134k32823J77104J94606J62732J07380j29327k39636j27194n0878
$$ -82987 -226121 -458944 -281840 -87234 75498 182878 53551 -186085 -313279 -364157
21483c64157J62017N9637L2802J6389Q1939j47119P4330N6951O9923n3992j30502
$$ -364157 -202140 -142503 -109701 -93312 -11373 -158492 -84162 -27211 42712 -11280 -141782
21472a41782M4147j35080j13129m3893M2660O333J78858K29201J2801n807M2544
$$ -141782 -97635 -232715 -345844 -389737 -347077 -340744 -161886 67315 80116 74309 116853
21461A16853R2566k5164j34823q3636j46159o0256n3600J76463J98758L6710R8327
$$ 116853 209419 184255 49432 -34204 -180363 -240619 -294219 -117756 81002 117712 216039
21450B16039K18915k01167j01858j37577l6015Q5124J2191M4538n8511l0399j43610
$$ 216039 434954 233787 131929 -5648 -41663 43461 55652 100190 41679 11280 -132330
21439a32330o2116R1391J89831M9945O9324J62613J02438j36788o9740j47527
$$ -132330 -194446 -103055 86776 136721 206045 368658 471096 334308 264568 117041
21429A17041j24852J63024l1814N0853P9937j4598K0120k328L7621r8270j8323
$$ 117041 -7811 155213 123399 174252 254189 239591 259711 257383 295004 196734 178411
21418A78411J00282P6378k1233p3932J27105j39102j91363J02986j08048J18040
$$ 178411 278693 355071 333838 259906 387011 247909 56546 159532 51484 169524
21408A69524J14351k71275n6857K50971n4722j55872K1902O1432Q2900r9545j17957
$$ 169524 283875 12600 -44257 206714 151992 -3880 18022 79454 162354 62809 -55148
21397e5148j06596J01759j14039k2099R9832k2635j32200j40255l1774J08593
$$ -55148 -161744 -59985 -174024 -196123 -96291 -118926 -251126 -391381 -423155 -314562
21387c14562N0401J73931p2721j14184p3369J25426O2956r9568J04198l058r1496
$$ -314562 -264161 -90230 -162951 -277135 -350504 -225078 -162122 -261690 -157492 -160550 -252046
21376b52046m0189J43284J19027n2934J31141L9673J81810J94737k38863M1950
$$ -252046 -292235 -148951 -29924 -82858 48283 87956 269766 464503 225640 267590
21366B67590J11978O8971J5492j25129j4134q5654j29553n5940J61615k42301
$$ 267590 379568 448539 464031 338902 324768 239114 109561 53621 215236 -27065
21356b7065l34101m5551p1802j10517j12307K37433K48736J20029J63889j57459
$$ -27065 -361166 -406717 -478519 -589036 -701343 -463910 -215174 -95145 68744 -88715
21346h8715P7902J12842N012j20488r3493J14075K16013r377k00784M412n6804
$$ -88715 -10813 102029 107041 -13447 -106940 7135 223148 213771 12987 17399 -39405
21335c9405m8283O9716n214r9363K05978Q6180q5943n2039r5378M3045P6852p7351
$$ -39405 -87688 -17972 -23186 -122549 83429 169609 83666 31627 -63751 -20706 56146 -21205
21323b1205j42468o7467J7575R0882J29452J0567j6234j11897j22813p1276q4794
$$ -21205 -163673 -231140 -213565 -122683 6769 17336 1102 -110795 -233608 -304884 -389678
21312c89678K2203J78296L1156N9577J88806K46520P1885p4869k47230r4694L8964
$$ -389678 -367475 -189179 -158023 -98446 90360 336880 408765 333896 86666 -8028 30936
21301C0936r1395J1095r106O528n3993Q377Q7793k59415N1874Q1254o5812N054
$$ 30936 -60459 -49364 -58470 -51942 -105935 -97558 -9765 -269180 -217306 -136052 -201864 -196810
21289a96810M4871K3209Q6277k4592l6741p5960O4511P9813J41700K7618j13136
$$ -196810 -151939 -128730 -42453 -67045 -103786 -179746 -115235 -35422 106278 133896 20760
21278B0760r5821k47646l979J98824J53964R6239K12805J88161J12000P1906J37915
$$ 20760 -75061 -322707 -326686 -127862 26102 122341 335146 523307 635307 707213 845128
21267H45128M326j6579k9797l5863P9452P929L2645q6771j02978K19766q6951
$$ 845128 849454 832875 803078 767215 846667 854596 887241 800470 697492 917258 830307
21256H30307q3774j41850l10961J1153o9300m7791J6214L0495m2995K15456n2509
$$ 830307 746533 604683 293722 304875 235575 187784 203998 234493 191498 406954 354445
21245C54445j2329r4118J15314Q0124m0919j07736j99565J53969K9087p5436l0198
$$ 354445 342116 247998 363312 443436 402517 294781 95216 249185 278272 202836 172638
21234A72638r5626j1075J65323O8261m1183o2687N2895o2366K5732K64306J81948
$$ 172638 77012 65937 231260 299521 258338 195651 248546 186180 211912 476218 658166
21223F58166J72076k2843o2561N5992J75210N8274O0480J3204j70174k93311l18241
$$ 658166 830242 807399 744838 800830 976040 1034314 1094794 1107998 937824 644513 326272
21212C26272J09272k9218j5980J16458L0610j37007r9679l17732j22241m9659
$$ 326272 435544 406326 390346 506804 537414 400407 300728 -17004 -139245 -188904
21202a88904M5666J52779K31764l4759j76152j36999n2929J7355J05922Q5551
$$ -188904 -143238 9541 241305 206546 30394 -106605 -159534 -142179 -36257 49294
21192D9294N2240m7291m5218M9730p8881r6172r2133R003m0356j4034J65234n2318
$$ 49294 101534 54243 9025 58755 -20126 -116298 -208431 -199428 -239784 -253818 -88584 -140902
21180a40902j9383K352R6258L7310j12333j03718Q942M8374L9628L39099j8395
$$ -140902 -160285 -157933 -61675 -24365 -136698 -240416 -231474 -183100 -143472 195627 177232
21169A77232j70551J47422J5051J2872j65867j08986Q9684j40606j32131L59665
$$ 177232 6681 154103 169154 182026 16159 -92827 -3143 -143749 -275880 83785
21159H3785J80045j66168j47224l02959j23255K41492K22449K44295j07232r3785
$$ 83785 263830 97662 -49562 -352521 -475776 -234284 -11835 232460 125228 31443
21149C1443j00471K3838N8520R6880O5221j97036j00448M5784N3233J58100j87642
$$ 31443 -69028 -45190 13330 110210 175431 -21605 -122053 -76269 -23036 135064 -52578
21138e2578J23594N9463K8987l2945J03507N0652j19991k7613J05655k40800r0929
$$ -52578 71016 130479 159466 126521 230028 280680 160689 133076 238731 -2069 -92998
21127i2998J00496R0793K01410j11825j75536p1213j50021j26568J76098P6984
$$ -92998 7498 98291 299701 187876 12340 -58873 -208894 -335462 -159364 -82380
21117h2380J01618M4080o7428k0867L0127l42072M5001J82847K25598m725j0702
$$ -82380 19238 63318 -4110 -24977 5150 -336922 -291921 -109074 116524 111799 101097
21106A01097K38961K13811j68143j1046n9362j56519l73316o0290J37104Q4379
$$ 101097 340058 553869 385726 374680 315318 158799 -214517 -274807 -137703 -53324
21096e3324R1286l1939k14078r0152M8132K8442K1950J39089o6752p1774J50033
$$ -53324 37962 6023 -208055 -298207 -250075 -221633 -199683 -60594 -127346 -199120 -49087
21085d9087J3387J32759j22690k10977K23242k6192q9811o502n3896L8578k11912
$$ -49087 -35700 97059 -25631 -236608 -13366 -39558 -129369 -135871 -189767 -151189 -363101
21074c63101M4687L8713O3726Q6663k4517O2831J35030m742J1600J23393J07540
$$ -363101 -318414 -279701 -215975 -129312 -153829 -90998 44032 39290 50890 174283 281823
21063B81823j94474j90829n0083q8423j89534o1462J51941J59885r8481J21856
$$ 281823 87349 -103480 -153563 -241986 -431520 -492982 -341041 -181156 -279637 -157781
21053a57781K53743M0009P1523r2519j74260K7110K6906r8694O0190O1336o3924
$$ -157781 95962 135971 207494 114975 -59285 -32175 -5269 -103963 -43773 17563 -46361
21042d6361O3588O1628r0972j01870o8373j12745K18248J00370l2304L9949O2808
$$ -46361 17227 78855 -12117 -113987 -182360 -295105 -76857 23513 -8791 31158 93966
21031I3966j45893p0909q3008k65951K4635L37692R0909P5197j12786m1665j73573
$$ 93966 -51927 -122836 -205844 -471795 -447160 -109468 -18559 56638 -56148 -97813 -271386
21020b71386J81847K13155l4959J56479k17842j42901j46168k70866m0863K77297
$$ -271386 -89539 123616 88657 245136 27294 -115607 -261775 -532641 -573504 -296207
21010b96207J06506q110L276L9053J38899N381q7810K75731O6426j29144m1080
$$ -296207 -189701 -197811 -194535 -155482 -16583 -11202 -99012 176719 243145 114001 72921
20999G2921O0894r7105k2109J52302K14326o8892j88653k6284J68730J07775L1058
$$ 72921 133815 36710 14601 166903 381229 312337 123684 97400 266130 373905 404963
20988D04963j38136r5280q4860j26388J19594J07336p6983q6425p679K5261q6837
$$ 404963 266827 171547 86687 -39701 79893 187229 110246 23821 16142 41403 -45434
20977d5434j59181o6496J69614P4078l6246O3880N0189R1822q3248r5557L8949
$$ -45434 -204615 -271111 -101497 -27419 -63665 215 50404 142226 58978 -36579 2370
20966B370o576K5974K81234L8932k55276m9630k12169o2290J06265j6792N1550
$$ 2370 -4206 21768 303002 341934 86658 37028 -175141 -237431 -131166 -147958 -96408
20955i6408n2762m5878k7564J14772J51675q9640n1886p1288j47460n7275J30197
$$ -96408 -149170 -195048 -222612 -107840 43835 -45805 -97691 -168979 -316439 -373714 -243517
20944b43517J39059P4505Q3954q0342J39856J78558k11200j63962O7814n7892
$$ -243517 -104458 -29953 54001 -26341 113515 292073 80873 -83089 -15275 -73167
20934g3167o468p3798j46540k7694O8316K56765k0851m6734J63553J79776K56
$$ -73167 -79635 -153433 -299973 -327667 -259351 -2586 -23437 -70171 93382 273158 273414
20923B73414O730l53854q4598J77861J12525o9075k5901k2407Q0304K4981j52185
$$ 273414 280144 -73710 -158308 19553 132078 63003 37102 14695 94999 119980 -32205
20912c2205l16996j14967Q5471L11604Q2450k1811N1718J53416j0780J8439p8940
$$ -32205 -349201 -464168 -378697 -67093 15357 -6454 45264 198680 187900 206339 127399
20901A27399J4103j58279j5564N227j49022k58366n0941K61053K12735J43614
$$ 127399 141502 -16777 -32341 -27114 -176136 -434502 -485443 -224390 -11655 131959
20891A31959l3968l6501j31182k8256J47030r9718j29310m432K51567L49984o0281
$$ 131959 97991 61490 -69692 -97948 49082 -50636 -179946 -184378 67189 417173 356892
20880C56892p5526K8975j90607L449j38492q2662j27374J8234J04421J39664k6783
$$ 356892 281366 310341 119734 123183 -15309 -97971 -225345 -207111 -102690 36974 10191
20869A0191j35456j91897j51020l5295M746n6851Q6247K80910J27422j31697J29873
$$ 10191 -125265 -317162 -468182 -503477 -498731 -555582 -469335 -188425 -61003 -192700 -62827
20858f2827L06083J07007J38898n0154k48837m4752r6806k31076j21471O4889
$$ -62827 243256 350263 489161 439007 190170 145418 48612 -182464 -303935 -239046
20848b39046O8891l0696r027m4900q1340j18907K27463M3440K7620m9969l6106
$$ -239046 -170155 -200851 -209878 -254778 -336118 -455025 -227562 -184122 -156502 -206471 -242577
20837b42577L5928O3779K40153m798q3670P8844j06250j57928j37612k38422o2770
$$ -242577 -206649 -142870 97283 92485 8815 87659 -18591 -176519 -314131 -552553 -615323
20826f15323J50451K64727N1247l8422Q342O3535M2982K0625n3959n0271k12327
$$ -615323 -464872 -200145 -148898 -187320 -178978 -115443 -72461 -51836 -105795 -156066 -368393
20815c68393k8953K01309J84484l5617r3946N7019p6078j95308J40133K17702
$$ -368393 -397346 -196037 -11553 -47170 -141116 -84097 -160175 -355483 -215350 2352
20805B352q461j17725l9030L35061K75709K11181K24861K1087k2215r0404j58621
$$ 2352 -6109 -123834 -162864 172197 447906 659087 883948 905035 882820 792416 633795
20794F33795n9502Q4593J92560Q9161j62826k97521j21316o2016j31418j5039
$$ 633795 574293 658886 851446 940607 777781 480260 358944 296928 165510 150471
20784A50471P7264J9754j8565K6999l3326k7781p5927j10534K25129M33054Q254
$$ 150471 227735 247489 228924 255923 222597 194816 118889 8355 233484 666538 674792
20773F74792k67538j45051j29876r9135N8807N4386K53312K59487J83417l5273
$$ 674792 407254 262203 132327 33192 91999 146385 399697 659184 842601 807328
20763H07328j88635j3756j70479q9677L6775r7330k300q1490J00823J33612r5699
$$ 807328 618693 604937 434458 344781 381556 284226 281926 200436 301259 434871 339172
20752C39172K9537O2501K0556M8719N6023J29938K59754N9901j63757j58485O1605
$$ 339172 368709 431210 451766 500485 556508 686446 946200 1006101 842344 683859 745464
20741G45464p7184o4988K26066l2121j03062K32033n7968j09969q828m8025l1777
$$ 745464 668280 603292 829358 797237 694175 926208 868240 758271 749443 701418 669641
20730F69641J4141k2454n7627R0761m5734L1974K37540l6178K7100L3541l1995
$$ 669641 683782 661328 603701 694462 648728 680702 918242 882064 909164 942705 910710
20719I10710j15733K271K59725K40988k4454n1834j65713l024P9700K54363R2918
$$ 910710 794977 797248 1056973 1297961 1273507 1221673 1055960 1052936 1132636 1386999 1479917
20708A479917q5732Q4042J16517Q6128O5279J15466L47498J01898J06708K43636
$$ 1479917 1394185 1478227 1594744 1680872 1746151 1861617 2209115 2311013 2417721 2661357
20698B661357L05303K82254L25145M12007L93611M61504N88961P55901M90851
$$ 2661357 2966660 3248914 3574059 3986066 4379677 4841181 5430142 6186043 6676894
20689F676894N05560O30905J029907J414787J801375K279789L301603N061555
$$ 6676894 7182454 7813359 8843266 10258053 12059428 14339217 17640820 22702375
20681B2702375Q256642J2263643J5322128J3747371J0760691J1840069J5303586
$$ 22702375 30959017 43222660 58544788 72292159 83052850 94892919 110196505
20674A10196505J9058434K0601135J7462581Q033022K653158O743238J0761259
$$ 110196505 129254939 149856074 167318655 175351677 178004835 184748073 195509332
20667A95509332P735488o222290k1206095k3611094j6453666q156024m098594
$$ 195509332 203244820 197022530 175816435 152205341 135751675 127595651 123497057
20660A23497057o388687j4693953j9822989j6621206j0972551o966561m604386
$$ 123497057 117108370 102414417 82591428 65970222 54997671 48031110 43426724
20653D3426724l071499k456172k007400j792620j748583j553585r23905m91328
$$ 43426724 40355225 37899053 35891653 34099033 32350450 30796865 29872960 29381632
20645B9381632m82859k76729p8833M56916J160944J753056K715806M338479P582761
$$ 29381632 28898773 28622044 28543211 29000127 30161071 31914127 34629933 38968412 46551173
20636D6551173J2560519J6077890J4230971J0466302J1504164J5378071J9339618
$$ 46551173 59111692 75189582 89420553 99886855 111391019 126769090 146108708
20629A46108708K0953234J6362260O777574K354427O678940J0916689P771420
$$ 146108708 167061942 183424202 190201776 192556203 199235143 210151832 217923252
20622B17923252p837136k3066495k4479767j7298766r003263n240578p382560
$$ 217923252 210086116 187019621 162539854 145241088 136237825 130997247 123614687
20615A23614687j5084329k0027288j6986922j1714356p609632n140676l711656
$$ 123614687 108530358 88503070 71516148 59801792 52192160 47051484 43339828
20608D3339828l250895k679514k289950k248653j746537j793398j460721j447760
$$ 43339828 40088933 37409419 35119469 32870816 31124279 29330881 27870160 26422400
20600B6422400j643229j390536j140421r63245o52976r83955r13416p54277o06437
$$ 26422400 24779171 23388635 22248214 21284969 20631993 19648038 18734622 17980345 17373908
20591A7373908p20161p54556n70880l03595m22909n28065l66435n46533k93133
$$ 17373908 16653747 15899191 15328311 15024716 14601807 14073742 13707307 13160774 12867641
20582A2867641n32430n72654k29044k17281k19154m17205l16199m66858n56753
$$ 12867641 12335211 11762557 11533513 11316232 11097078 10679873 10363674 9896816 9340063
20573I340063m50711j49376k14647k40638k25163k99000k46494o9889j38501l50666
$$ 9340063 8889352 8739976 8525329 8284691 8059528 7760528 7514034 7444145 7305644 6954978
20563F954978l68231k15677k63316j09416M9413O9666j16286l16174p0603Q0513
$$ 6954978 6586747 6371070 6107754 5998338 6047751 6117417 6001131 5684957 5614354 5694867
20553E694867j61572l82515j36170P2888o5319J7026l27869l26397j25478q036
$$ 5694867 5533295 5150780 5014610 5087498 5022179 5039205 4711336 4384939 4259461 4251425
20543D251425l90571j74987J6701j59633n4019Q9753j24197j7274l7115o876o9118
$$ 4251425 3860854 3685867 3702568 3542935 3488916 3578669 3454472 3437198 3400083 3393207 3324089
20532C324089p0089O9327n1813l4295J52890P0990j39942K23952J20385L52480
$$ 3324089 3254000 3323327 3271514 3237219 3390109 3461099 3321157 3545109 3665494 4017974
20522D017974N05494K22958K36650J25036k35381l78360l78179m08156k38473
$$ 4017974 4523468 4746426 4983076 5108112 4872731 4494371 4116192 3708036 3469563
20513C469563l2141p8559m90011l94885n8194m9416k86362P442j15567j8391K1186
$$ 3469563 3437422 3358863 2868852 2473967 2415773 2366357 2079995 2087437 1971870 1953479 1974665
20502A974665M1711j13626j74125j31253k32899k2018o2458j03650j51116K58213
$$ 1974665 2016376 1902750 1728625 1597372 1364473 1342455 1279997 1176347 1025231 1283444
20492A283444Q4143Q5336q5301p7188k04794O6440J50814q5919L7179m6218J239
$$ 1283444 1367587 1452923 1367622 1290434 1085640 1152080 1302894 1216975 1254154 1207936 1209175
20481A209175J19154o4863R509n2466K983J25942O4087j04616j19151k27055M8287
$$ 1209175 1328329 1263466 1272975 1220509 1223492 1349434 1413521 1308905 1189754 962699 1010986
20470A010986J19992r7331p4728k72374m9516J84484J4419k77790j09213Q0881
$$ 1010986 1130978 1033647 958919 686545 637029 821513 835932 558142 448929 529810
20460E29810K28468k0740M832M865J6378L2565L7465R4730Q2248K98185r2037
$$ 529810 758278 737538 742370 747235 763613 796178 833643 928373 1010621 1308806 1216769
20449A216769j31876l73751j14266q959N8977J5715j12928L5391j5431J53522
$$ 1216769 1084893 711142 596876 587917 646894 662609 549681 585072 569641 723163
20439G23163m9693j1182R3891r3029q6945m2362J54569j28909l5472Q4374j37471
$$ 723163 673470 662288 756179 663150 576205 533843 688412 559503 524031 608405 470934
20428D70934n3997Q0231K819j30759N716j2738m9254J28274L936k02156L5134
$$ 470934 416937 497168 499987 369228 374944 362206 312952 441226 445162 243006 278140
20417B78140K42821J9812m257P094j00548j09087m0834N0059K08576p0672m2782
$$ 278140 520961 540773 536516 543610 443062 333975 293141 343200 551776 481104 438322
20406D38322j40148j24839K0312O5991N8377n5622o6644l8218L0787j18940o9223
$$ 438322 298174 173335 193647 259638 318015 262393 195749 157531 188318 69378 155
20395A55J73477j07355q040K4736L4724J0527q3332Q925p6511J11394J53898J08748
$$ 155 173632 66277 58237 82973 117697 128224 44892 53817 -22694 88700 242598 351346
20383C51346r0529J0123K5136q1160o7409j05744j0460Q5154R5795J5872J69333
$$ 351346 260817 270940 296076 214916 147507 41763 31303 116457 212252 228124 397457
20372C97457j50211r3922l3225k2071p384l0016k9815j5433M0980K50236J08473
$$ 397457 247246 153324 120099 98028 90644 60628 30813 15380 56360 306596 415069
20361D15069j25631n6877j25678J24058N5336k53187M6961J37384j6954q9855
$$ 415069 289438 232561 106883 230941 286277 33090 80051 217435 200481 110626
20351A10626j74123n1141J72639J00669j9545r3605J3591J08163q8407K0872J95770
$$ 110626 -63497 -114638 58001 158670 139125 45520 59111 167274 78867 99739 295509
20340B95509N6901j94019p7281J8306k78340k0963K35917Q5209J75377l5108r1038
$$ 295509 352410 158391 81110 99416 -178924 -199887 36030 121239 296616 261508 170470
20329A70470M5798R6355O5694j12681k07752n9118J19123p7225L0692J19543J50456
$$ 170470 216268 312623 378317 265636 57884 -1234 117889 40664 71356 190899 341355
20318C41355J46443J38425Q8773J18182J45872J85370k8820m8047l77424j53824
$$ 341355 487798 626223 714996 833178 979050 1164420 1135600 1087553 710129 556305
20308E56305k3417j70006j36070K13177p6433j1820o8464K03261j20289j88586
$$ 556305 532888 362882 226812 439989 363556 351736 283272 486533 366244 177658
20298A77658j50620K183L1784p7116l9315P8059J52037O0275K3143o6860j31114
$$ 177658 27038 29221 61005 -16111 -55426 22633 174670 234945 258088 191228 60114
20287F0114j2043J09518M785j73970r9201N8223R3216j09016J9894K10377J57795
$$ 60114 48071 157589 162374 -11596 -110797 -52574 40642 -68374 -48480 161897 319692
20276C19692r2535O7675Q5873q949k05930j09485o8626J07885J15139p4740J5826
$$ 319692 227157 294832 380705 371756 165826 56341 -12285 95600 210739 135999 151825
20265A51825K0680m8384j36348k38578J09937J42328q0903l6977M520j9747O1274
$$ 151825 172505 124121 -12227 -250805 -140868 1460 -79443 -116420 -111900 -131647 -70373
20254g0373M5091L3864O2241R3133P84j88636J18112J72826J77511j35118j54750
$$ -70373 -25282 8582 70823 163956 164740 -23896 94216 267042 444553 309435 154685
20243A54685j96481L3773N5928J02030j72669n3024q6006q4055m2969J12272J4388
$$ 154685 -41796 -8023 47905 149935 -22734 -75758 -161764 -245819 -288788 -176516 -162128
20232a62128k1969J09407o7681j28787K26560J67474k29591j14806N9189l5479
$$ -162128 -184097 -74690 -142371 -271158 -44598 122876 -106715 -221521 -162332 -197811
20222a97811R6149J70930q4353P4557j35952L5567K057J26871J31536L28987J75818
$$ -197811 -101662 69268 -15085 59472 -76480 -40913 -38856 88015 219551 548538 724356
20211G24356j94579k13813l87794k26186R3334K21617K56267L2209j40107n5858
$$ 724356 529777 315964 -71830 -298016 -204682 16935 273202 305411 165304 109446
20201A09446O0941q6886n5631m2881J17199J15425j29150o2702J3022k0616J36679
$$ 109446 170387 83501 27870 -15011 102188 217613 88463 25761 38783 18167 154846
20190A54846M5843K1101l8980M708K5945R4487p1686p9530k8971J49970L1451
$$ 154846 200689 221790 182810 187518 213463 307950 236264 156734 127763 277733 309184
20179C09184j19222o4814o0697j1269K7546j7760j68037q4P7174J1656p5544j73767
$$ 309184 189962 125148 64451 53182 80728 62968 -105069 -105153 -27979 -16323 -91867 -265634
20167b65634P725j851J54953k9710J3748K8582N71M7506r5761j01238K02240J72248
$$ -265634 -257909 -259760 -104807 -134517 -120769 -92187 -91616 -44110 -139871 -241109 -38869 133379
20155A33379p4794M0104J50847J12057J01962l01519k39541p688J5091J1570K38704
$$ 133379 58585 98689 249536 361593 463555 162036 -77505 -85193 -70102 -58532 180172
20144A80172J42107j35549j31084R2053J67314k5966J42850J15887k07462R8038
$$ 180172 322279 186730 55646 147699 315013 289047 431897 547784 340322 438360
20134D38360r2498j38740P931L8292M4108K66711j56294j92778j61900j81239
$$ 438360 345862 207122 215053 253345 297453 564164 407870 215092 53192 -128047
20124a28047m4411M0182Q9680N5143o8782o5747k2884J24437K83442L5776j75848
$$ -128047 -172458 -132276 -42596 12547 -56235 -121982 -144866 -20429 263013 298789 122941
20113A22941N8512o357j57186o2412j9302J84842J86655R4269q3308k66506k11227
$$ 122941 181453 175096 17910 -44502 -63804 121038 307693 401962 318654 52148 -159079
20102a59079L4843J22194k3181L00725k0853j7910L0297o552n1344q2266J5306
$$ -159079 -124236 -2042 -25223 275502 254649 236739 267036 260484 209140 126874 142180
20091A42180J40947J37426j16600j25680j0747j67838K05185J83013J98380j13120
$$ 142180 283127 420553 303953 178273 167526 -312 204873 387886 586266 473146
20081D73146j73066R1590J82403K07386O7821p1633O0416J61663L02567J80474
$$ 473146 300080 391670 574073 781459 849280 777647 838063 999726 1302293 1482767
20071A482767M6425K3696J4724q6616L2520k18220j47879j46357p1245k6624P696
$$ 1482767 1529192 1552888 1567612 1480996 1513516 1295296 1147417 1001060 929815 903191 910887
20060I10887J54276J17708l5068O3556J51224K4715p1638o404J33721n6702o2935
$$ 910887 1065163 1182871 1147803 1211359 1362583 1387298 1315660 1309256 1442977 1386275 1323340
20049A323340k11397j02449r1775J3653J56401J11127J22818j03750L0268m2900
$$ 1323340 1111943 1009494 917719 931372 1087773 1198900 1321718 1217968 1248236 1205336
20039A205336j50089m9484j33710N3220M3708J08496K95791O1828j21160K82301
$$ 1205336 1055247 1005763 872053 925273 968981 1077477 1373268 1435096 1313936 1596237
20029A596237K61737Q1609k7050p5338r7400j11054M8070P694J17741J57983J19955
$$ 1596237 1857974 1939583 1912533 1837195 1739795 1628741 1676811 1684505 1802246 1960229 2080184
20018B080184r8604k42620j18420j5323J17379j68483q5068k32639r6852j94038
$$ 2080184 1981580 1738960 1620540 1605217 1722596 1554113 1469045 1236406 1139554 945516
20008I45516K17037O2800k2805m4706J6048k8487J57567J73466K22300K044L7193
$$ 945516 1162553 1225353 1202548 1157842 1173890 1145403 1302970 1476436 1698736 1700780 1737973
19997A737973m2170j75310J8690J49007K79503K87386K57206o2483k9211n2784
$$ 1737973 1695803 1520493 1539183 1688190 1967693 2255079 2512285 2449802 2420591 2367807
19987B367807p3100n0830J31040R6859k1121P5600J57671K04536k26435j02449
$$ 2367807 2294707 2243877 2374917 2471776 2450655 2526255 2683926 2888462 2662027 2559578
19977B559578N3536R6967L39415K43097R2532Q6556K04665L09303R6673M1054
$$ 2559578 2613114 2710081 3049496 3292593 3385125 3471681 3676346 3985649 4082322 4123376
19967D123376O0498J37514J7172J64818O46691P88232P70399Q86822P06405P65336
$$ 4123376 4183874 4321388 4338560 4503378 5150069 5938301 6708700 7595522 8301927 9067263
19957I067263O44270O00220M12661K05488J91344J89661L73292P83700Q38633
$$ 9067263 9711533 10311753 10724414 10929902 11121246 11310907 11684199 12467899 13306532
19948A3306532J018735J354513J783445K461103K906241L291767L927233N054944
$$ 13306532 14325267 15679780 17463225 19924328 22830569 26122336 30049569 35104513
19940C5104513O666322R146835J2694839J8828059K8602974M3216471N9692730
$$ 35104513 41770835 50917670 63612509 82440568 111043542 154260013 213952743
19933B13952743P1616858P4660525O8641974N5723014L6603138J2392727j7918878
$$ 213952743 285569601 360230126 428872100 484595114 521198252 533590979 515672101
19926E15672101m8915616p1865752q0363538p1930788n3763063l5979300k3263441
$$ 515672101 466756485 394890733 314527195 242596407 188833344 152854044 129590603
19919A29590603j5650596j1623256r418647q203593p229142o437742n731833n083717
$$ 129590603 113940007 102316751 92898104 84694511 77465369 71027627 65295794 60212077
19911F0212077m185372l738107l221767k755504k429258j976819j575274j452604
$$ 60212077 56026705 52288598 49066831 46311327 43882069 41905250 40329976 38877372
19903C8877372j110843q63430j033985j063258j190728j184685j521978j446701
$$ 38877372 37766529 36903099 35869114 34805856 33615128 32430443 30908465 29461764
19895B9461764j568702j624244j329029j178034o71967p90437n99605m17615n19456
$$ 29461764 27893062 26268818 24939789 23761755 23089788 22299351 21699746 21282131 20762675
19886B0762675o98249o03137m26409p16018p46693o23079q73356p71048o51734
$$ 20762675 20064426 19461289 19034880 18318862 17572169 16949090 16075734 15304686 14652952
19877A4652952l27294n06465n19468m35415n01702j65195q3694l69042n35849
$$ 14652952 14325658 13819193 13299725 12864310 12362608 12197413 12113719 11744677 11208828
19868A1208828k99810j07071j49018k98734j72735l82791k35206k93021k56122
$$ 11208828 10909018 10801947 10652929 10354195 10181460 9798669 9563463 9270442 9014320
19859I014320j60272k42578l36412l04360q5900j74975l11327l65199j37289k59496
$$ 9014320 8854048 8611470 8275058 7970698 7884798 7709823 7398496 7033297 6896008 6636512
19849F636512k63848q3598P19m88131k36947l59452m8448q775O5748r4658j17259
$$ 6636512 6372664 6289066 6289785 5801654 5564707 5205255 5156807 5148032 5213780 5119122 5001863
19838E001863M7683k35288j60490o9714k27349n2427j92242l27936p7514l661
$$ 5001863 5049546 4814258 4653768 4584054 4356705 4304278 4112036 3784100 3706586 3702925
19828C702925j24059r9806k38378j02458M6013O5464O4262N854q7134k56253m0242
$$ 3702925 3578866 3479060 3240682 3138224 3184237 3249701 3313963 3319817 3232683 2976430 2936188
19817B936188o6974l3840j02728j69992O742j34019l9551N7505R0203j00163j66035
$$ 2936188 2869214 2835374 2732646 2562654 2569396 2435377 2395826 2453331 2543534 2443371 2277336
19806B277336k77162j55878N836K8594l8068R3281n931l11394p5210o1747L0151
$$ 2277336 2000174 1844296 1850132 1878726 1840658 1933939 1928008 1616614 1541404 1479657 1509808
19795A509808O3450K6443K01220L2400l6973N76j63870k76064j13258k7973q4163
$$ 1509808 1573258 1599701 1800921 1833321 1796348 1796924 1633054 1356990 1243732 1215759 1131596
19784A131596n8190K64239N3406j96936k7819J86466J83416p4134P5914k2924
$$ 1131596 1073406 1337645 1391051 1194115 1166296 1352762 1536178 1462044 1537958 1515034
19774A515034j24429o8078J773r9887k3583n7483R5606k31480j07791j6220J551
$$ 1515034 1390605 1322527 1324300 1224413 1200830 1143347 1238953 1007473 899682 883462 885013
19763H85013j76658r528l7617J4065j5817q53P678j66208j44523O9099n7912J1109
$$ 885013 708355 698827 661210 675275 659458 658605 666283 500075 355552 424651 366739 377848
19751C77848J09970J03373j2005n877j14817J82079K92651Q0409j32656l38944
$$ 377848 487818 591191 579186 573309 458492 640571 933222 1013631 880975 542031
19741E42031j6433K02740J8671j57649j2654J36675m589r6710j39596j70727k3526
$$ 542031 525598 728338 747009 589360 576706 713381 708792 612082 472486 301759 278233
19730B78233R510n2346r6882P6536p0126K45289L02108l51033j89983j6875J31069
$$ 278233 287743 235397 138515 215051 144925 390214 692322 341289 151306 134431 265500
19719B65500L39919Q9410p8246o6418R466k24270k54729Q9584R8883l2366j25850
$$ 265500 605419 694829 616583 550165 559631 335361 80632 170216 269099 236733 110883
19708A10883m1319J97626l5185N8714Q6113r4115N7036J26330o7583j8544M8866
$$ 110883 69564 267190 232005 290719 376832 282717 339753 466083 398500 379956 428822
19697D28822j24505K00972j6170j71142q6863L9436n1397k89804j7314J92762
$$ 428822 304317 505289 489119 317977 231114 270550 219153 -70651 -87965 104797
19687A04797p7175K9066N5266k11970k0988J16777J00786J84257O5221j4728j17835
$$ 104797 27622 56688 111954 -100016 -121004 -4227 96559 280816 346037 331309 213474
19676B13474k6877K3796k9874m0533j63178J32058N3000O3704M5350l9639k14105
$$ 213474 186597 210393 180519 139986 -23192 108866 161866 225570 270920 231281 17176
19665A7176k4940K98555K22325m7892n6401J52922R6870j70417J61876j6862j24246
$$ 17176 -7764 290791 513116 465224 408823 561745 658615 488198 650074 633212 508966
19654E08966K5511l5305q7305j4552j32072o1900j42389J73582J47304M430N6829
$$ 508966 534477 499172 411867 397315 265243 203343 60954 234536 381840 386270 443099
19643D43099j43411j10145j46019J59521M7401o7078O1301J19695L00960j90593
$$ 443099 299688 189543 43524 203045 250446 183368 244669 364364 665324 474731
19633D74731k85591N9683j9029r045J25939j4928n7098j1298K83869N3067k401
$$ 474731 189140 248823 229794 220749 346688 331760 274662 263364 547233 600300 597899
19622E97899J20879j16011j26269L7066O1105j35847k33104j19823k06646m3698
$$ 597899 718778 602767 476498 513564 574669 438822 205718 85895 -120751 -164449
19612a64449M4018J14110j06554O2288P4502J04741r4895p1034O9370N0873j9972
$$ -164449 -120431 -6321 -112875 -50587 23915 128656 33761 -37273 32097 82970 62998
19601F2998j01082o5214J13320J0254K06363J30350j04638n0039J9157J57558
$$ 62998 -38084 -103298 10022 20276 226639 356989 252351 202312 221469 379027
19591C79027K4650j25994k506k445O0583l5829J92002q8589j91901j8343k8696
$$ 379027 403677 277683 275177 272732 333315 297486 489488 400899 208998 190655 161959
19580A61959p9750r9733L8142j49769o2092Q7848K1688K5125K1013o4798L37159
$$ 161959 82209 -17524 20618 -129151 -191243 -103395 -81707 -56582 -35569 -100367 236792
19569B36792K32952J0160j59478N2640J82807K4636l1176p6911q8146k62807R4843
$$ 236792 469744 479904 320426 373066 555873 580509 549333 472422 384276 121469 216312
19558B16312K47044J27038l4217j78445p3662J70737P8900n3270J47404m9201
$$ 216312 463356 590394 556177 377732 304070 474807 553707 500437 647841 598640
19548E98640k37678j2607K01936m8319j62103o212o5528n3280K99098K2968J35418
$$ 598640 360962 348355 550291 501972 339869 333657 268129 214849 513947 536915 672333
19537F72333L2971j87906N5353j44569j79330r8060J52941J52561J81805Q5057
$$ 672333 705304 517398 572751 428182 248852 150792 303733 456294 638099 723156
19527G23156N6783n9284j55818n0587j80889J13682O3308J10020L87731K25238
$$ 723156 779939 720655 564837 514250 333361 447043 510351 620371 1008102 1233340
19517A233340p5936j68024J76139P7727l154n930M6447N6541j18026p1132K33963
$$ 1233340 1157404 989380 1165519 1243246 1240092 1234162 1280609 1337150 1219124 1147992 1381955
19506A381955R7644j84751j25440j694K93370j5732J1792K1765j97611o2678O5163
$$ 1381955 1479599 1294848 1169408 1167714 1461084 1445352 1457144 1478909 1281298 1218620 1283783
19495A283783L0462Q5724N3700M788q126L8496P4984J86497J87779l6883q9082
$$ 1283783 1314245 1399969 1453669 1458457 1450331 1488827 1563811 1750308 1938087 1901204 1812122
19484A812122J17083J33235J99620K38061q1n1769K06788Q6932K02662L06203
$$ 1812122 1929205 2062440 2262060 2500121 2500040 2448271 2655059 2741991 2944653 3250856
19474C250856M7910K05630M76731O11777K85243K91208L62749Q32987P66737O64055
$$ 3250856 3298766 3504396 3981127 4592904 4878147 5169355 5532104 6365091 7131828 7795883
19464G795883Q59548J114532J523640J796576K466550L817949N976680Q902445
$$ 7795883 8655431 9769963 11293603 13090179 15556729 19374678 25351358 34253803
19456C4253803J1623543J2892203J1725665J0274334J0273052J1323153J0956731
$$ 34253803 45877346 58769549 70495214 80769548 91042600 102365753 113322484
19449A13322484Q624412O827137Q023463J0222492R992467O986042K274409k430202
$$ 113322484 121946896 128774033 136797496 147019988 157012455 163998497 166272906 163842704
19441A63842704n956526q448463j0589066j1116511q572625m772877l932033p802493
$$ 163842704 157886178 149437715 138848649 127732138 119159513 114386636 110454603 102652110
19433A02652110j3459876j6202783j4041198r716177o269115m211326l162086
$$ 102652110 89192234 72989451 58948253 49232076 42962961 38751635 35589549
19426C5589549k419850k044817j759361j425902j317763j300225j136817j208082
$$ 35589549 33169699 31124882 29365521 27939619 26621856 25321631 24184814 22976732
19418B2976732q34079k92081n00328l92331k84990k48022n3362K5370J22745K92671
$$ 22976732 22142653 21850572 21350244 20957913 20672923 20424901 20371539 20396909 20519654 20812325
19408B0812325L15109M16804Q41461J553458K127861L775031N732406Q760865
$$ 20812325 21127434 21544238 22385699 23939157 26067018 29842049 35574455 44335320
19400D4335320J2694724J5233061J4231368J1850026J1226112J2812339J3674829
$$ 44335320 57030044 72263105 86494473 98344499 109570611 122382950 136057779
19393A36057779J1738006Q413713P412295R566650J1332162R168942L859224k967698
$$ 136057779 147795785 156209498 163621793 173188443 184520605 193689547 197548771 194581073
19385A94581073q460361j0733029j1874896j2397510j0460138o705755m745902
$$ 194581073 186120712 175387683 163512787 151115277 140655139 133949384 129203482
19378A29203482p151847j3067388j7691254j7026553j2760690q525788n845449
$$ 129203482 122051635 108984247 91292993 74266440 61505750 52979962 47134513
19371D7134513m150502l321704k828052k577832k256249j870308j619266j583189
$$ 47134513 42984011 39662307 36834255 34256423 32000174 30129866 28510600 26927411
19363B6927411j540095j102697r15482j024607r54301q68716r25928q52681p06036
$$ 26927411 25387316 24284619 23369137 22344530 21390229 20521513 19595585 18742904 18036868
19354A8036868o00790o29887o14691n78299o84972n43383n01073l20371n12973
$$ 18036868 17436078 16806191 16191500 15613201 14928229 14384846 13883773 13563402 13050429
19345A3050429l48529j79606l55244m71168m24116n33332k94694n7153k56486
$$ 13050429 12701900 12522294 12167050 11695882 11271766 10738434 10443740 10386587 10130101
19336A0130101j40427k61339J1667Q4362J31745K52155J46705r4988j46454m56236
$$ 10130101 9989674 9728335 9740002 9824364 9956109 10208264 10354969 10259981 10113527 9657291
19326I657291l70549o23764o86094l06046m67196j84203j57432l25336l32787
$$ 9657291 9286742 8662978 7976884 7670838 7203642 7019439 6862007 6536671 6203884
19317F203884l61745j65956l5800m60623k70254k1987Q9360n9129j80434m2237
$$ 6203884 5842139 5676183 5640383 5179760 4909506 4887519 4976879 4917750 4737316 4695079
19307D695079j66316N0615o149j84602j10519r8770k23946k16945l9195j1818
$$ 4695079 4528763 4579378 4573229 4388627 4278108 4179338 3955392 3738447 3699252 3687434
19297C687434j81565j16128n5102j06320k36130k11842q8935j31173j34298R9558
$$ 3687434 3505869 3389741 3334639 3228319 2992189 2780347 2691412 2560239 2425941 2525499
19287B525499j0398K28549N1916k05676r9251O7781n1677j7143l8526q8829p8221
$$ 2525499 2515101 2743650 2795566 2589890 2490639 2558420 2506743 2489600 2451074 2362245 2284024
19276B284024r8702L6339j30258k20378j1686M9046j36486M292j8882o9244j03330
$$ 2284024 2185322 2221661 2091403 1871025 1859339 1908385 1771899 1776191 1757309 1688065 1584735
19265A584735j72941j59768j9533j632L1060R3529l3553l0154J26620O480J68628
$$ 1584735 1411794 1252026 1232493 1230861 1261921 1355450 1321897 1291743 1418363 1424843 1593471
19254A593471J35585m4510j83866j28830j68108j48124j33329j50729N493K17849
$$ 1593471 1729056 1684546 1500680 1371850 1203742 1055618 922289 771560 777053 994902
19244I94902K4837j14848P6368K48314J23532Q0505k53532k84368m024J34239
$$ 994902 1019739 904891 981259 1229573 1353105 1433610 1180078 895710 891686 1025925
19234A025925k1879l9617L6626n7747j07403l451m922q4484J6925O1574K05050
$$ 1025925 1004046 964429 1001055 943308 835905 832454 827532 743048 759973 821547 1026597
19223A026597L9191o1765q7695o7111n7745j79200r1363l2880j34940n4306J50278
$$ 1026597 1065788 1004023 916328 849217 791472 612272 520909 488029 353089 298783 449061
19212D49061l624j124J72792J54659R929l2728r838K2108k02653r3104p9255q1266
$$ 449061 445437 444313 617105 771764 781693 748965 739127 761235 558582 465478 386223 304957
19200C04957J44930j71542p6678J53486J04644J00875j89334k17943J38143J29454
$$ 304957 449887 278345 201667 355153 459797 560672 371338 153395 291538 420992
19190D20992J28600j11352l2773o8239p6404J50720L5129O8348n2295M3905K29890
$$ 420992 549592 438240 405467 337228 260824 411544 446673 515021 462726 506631 736521
19179G36521l9533k19618J36956K11500N3203o8489J51196J92122K5403j62620
$$ 736521 696988 477370 614326 825826 879029 810540 961736 1153858 1179261 1016641
19169A016641l2143M3713K4633J785j69735l538q7722q1349O4927J04864j10336
$$ 1016641 984498 1028211 1052844 1054629 884894 881356 793634 712285 777212 882076 771740
19158G71740q0505k3448j32059j8417Q6778j0634J5836J22553l963J2514J39833
$$ 771740 691235 667787 535728 517311 604089 593455 609291 731844 727881 740395 880228
19147H80228Q4954N236k09703k45816k9603J67972M358j42169j10642M0744p7051
$$ 880228 965182 970418 760715 514899 485296 653268 657626 515457 404815 445559 368508
19136C68508J0092M16865L9775l5626J61031m2723J69506J10973Q5678k195k25643
$$ 368508 378600 795465 835240 799614 960645 917922 1087428 1198401 1284079 1281884 1056241
19125A056241o0596L3119J5067m3802j14009o3136o7439M2702Q9258J71622N8010
$$ 1056241 995645 1028764 1043831 1000029 886020 822884 755445 798147 887405 1059027 1117037
19114A117037j71817j74793k31335J9903L176k2465j06310k4532K40374K04092
$$ 1117037 945220 770427 539092 558995 562171 539706 433396 408864 649238 853330
19104H53330m4518l51879l31763n5233q905K219K2791K03331R0439j0934Q3813
$$ 853330 808812 456933 125170 69937 61032 63251 86042 289373 379812 368878 452691
19093D52691j31162q4246n1154j14406o908J32997Q5233K96922o0370k65498j44221
$$ 452691 321529 237283 186129 71723 64815 197812 283045 579967 519597 254099 109878
19082A09878N3654J34687J02710K42888n5385m5912J03173m2973k34942L7870
$$ 109878 163532 298219 400929 643817 588432 542520 645693 602720 367778 405648
19072D05648K23940j11869l17327k7945J00246L57043J84710j13245k31886j89593
$$ 405648 629588 517719 200392 172447 272693 629736 814446 701201 469315 279722
19062B79722Q5596m98o2900J17187J77701J37507J24195K22643K92720N12713
$$ 279722 365318 364820 301920 419107 596808 734315 858510 1081153 1373873 1886586
19052A886586K10094Q245M7583j07929k13845l48029l59630m29505n8918r2109
$$ 1886586 2096680 2104925 2152508 2044579 1830734 1482705 1123075 693570 634652 542543
19042E42543j44545k6398J81584L9095j63731j81111j00040J0064J77413Q2089
$$ 542543 397998 371600 553184 592279 428548 247437 147397 157461 334874 416963
19032D16963p1160q4363j07095j45094K8445L21275J0123j54873j25581o1058
$$ 416963 345803 261440 154345 9251 37696 358971 369094 214221 88640 27582
19022B7582Q2213r478K58096j98143k73740J84432J17160L1527Q9562L07j47673
$$ 27582 109795 100317 358413 160270 -113470 70962 188122 219649 309211 309518 161845
19011A61845R1685o8898j89240r0630N172J28647J24705j0797J70945K2305m7065
$$ 161845 253530 184632 -4608 -95238 -90066 38581 163286 152489 323434 345739 298674
19000B98674J16484K26985j46300R6256J26309Q872j66137r3210L8245R7085l09346
$$ 298674 415158 642143 495843 592099 718408 727280 561143 467933 506178 603263 293917
18989B93917J15813k499k54201j32373K3478J44601Q4891J90036j25969j56105
$$ 293917 409730 407231 153030 20657 44135 188736 273627 463663 337694 181589
18979A81589l934K31856j80723k59996P4408l3324j11485j42546j4535r0801o2512
$$ 181589 177655 409511 228788 -31208 43200 9876 -101609 -244155 -258690 -349491 -412003
18968d12003J76466l11J21483K13676Q3462K9209l13634j87603N271K02978N3453
$$ -412003 -235537 -235848 -114365 99311 182773 211982 -101652 -289255 -283984 -81006 -27553
18957b7553R7374O1017O8012o4502L5728L9531J94868J85575j48183m30410m1170
$$ -27553 69821 130838 198850 134348 170076 209607 404475 590050 441867 11457 -29713
18946b9713M3553m9557J36582L3390m833L816J20618m438r0060N1919K8307n1450
$$ -29713 13840 -35717 100865 134255 129422 133238 253856 249418 159358 211277 239584 188134
18934A88134k01994J29962J77802j27774j31406J59083J77437p8284q7630j73639
$$ 188134 -13860 116102 293904 166130 34724 193807 371244 292960 205330 31691
18924C1691k5989O0270R8407O5173m0573n9181j5042Q3726J05780r6816J33072
$$ 31691 5702 65972 164379 229552 188979 129798 114756 198482 304262 207446 340518
18913C40518K10967K51488J89788N6312K57240P66439O80512R80539R91777Q63566
$$ 340518 551485 802973 992761 1049073 1306313 2072752 2753264 3733803 4725580 5589146
18903E589146Q01346K38077j69117m00007o91404p08676q22443q91123m05957
$$ 5589146 6390492 6628569 6459452 6059445 5368041 4659365 3836922 2945799 2539842
18894B539842k59517j80406k02555l81743j98759j80640k07343k13931j38976
$$ 2539842 2280325 2099919 1897364 1515621 1316862 1136222 928879 714948 575972
18885E75972p7272n4450M676J67924N8293o5308j63417P4520K61921Q3424p856
$$ 575972 498700 444250 448926 616850 675143 609835 446418 520938 782859 866283 858427
18874H58427k45660k25278q4463J16685J84619j04488q0221p4667l5570P0145
$$ 858427 612767 387489 303026 419711 604330 499842 419621 344954 309384 379529
18864C79529J25395j2608O6570J80669N8619j99910k29363J52861m0192r879J8290
$$ 379529 504924 492316 558886 739555 798174 598264 368901 521762 481570 471691 489981
18853D89981K68988J73246M6146J70477K25474j36332k83663Q3897q443q8590
$$ 489981 758969 932215 978361 1148838 1374312 1237980 954317 1038214 1029771 941181
18843I41181L6554Q7913J2303r2213J1640N8376j28311p2131P4157L0312j12438
$$ 941181 977735 1065648 1077951 985738 997378 1055754 927443 855312 929469 959781 847343
18832H47343N215K5868o6022k60746p3728J47885p7805p9964k16044l5645r0819
$$ 847343 852558 878426 812404 551658 477930 625815 548010 468046 252002 216357 125538
18821A25538j62706M8875K66054J50666k9138j27697o7854j92407m921K78111
$$ 125538 -37168 11707 277761 428427 399289 271592 203738 11331 6410 284521
18811B84521J91481Q0628m9362O7950J98708k28512k55645k3287O6985q3847j77718
$$ 284521 476002 556630 507268 575218 773926 545414 289769 266482 333467 249620 71902
18800G1902R6473K23722k8458j1639j0556o2016J94536J38389Q9890K30336j01446
$$ 71902 168375 392097 363639 352000 341444 279428 473964 612353 702243 932579 831133
18789H31133j95406j8933p6089j04565J88291J6913j90174K1072J71816n1002
$$ 831133 635727 616794 540705 436140 624431 641344 451170 472242 644058 593056
18779E93056k30852r0683J87593J1850n0837J35048Q4433l2145j12173J61220
$$ 593056 362204 271521 459114 470964 420127 555175 639608 607463 495290 656510
18769F56510q1894j40109O3158m5484j67121n1036K21204J10053o8685J3297q4104
$$ 656510 574616 434507 497665 452181 285060 234024 455228 565281 496596 509893 425789
18758D25789j87222k12354J3567M1936L04620K30905J9737J07895L7843M3009
$$ 425789 238567 26213 39780 81716 386336 617241 636978 744873 782716 825725
18748H25725o8254l2703N4075k55468j17483K2020k1804K31342Q2852j50892j32405
$$ 825725 757471 724768 778843 523375 405892 427912 406108 637450 720302 569410 437005
18737D37005J0138j57275K50419J86984m4025Q0850j51562n9306J17249L2543
$$ 437005 447143 289868 540287 727271 683246 764096 612534 553228 670477 703020
18727G03020J75812J18210j16231l5729J07912p4787n6474n4498p4628J72014
$$ 703020 878832 997042 880811 845082 952994 878207 821733 767235 692607 864621
18717H64621k3791j34968J5326L38598J72379r3037r0493j53279j05133O0862
$$ 864621 840830 705862 721188 1059786 1232165 1139128 1048635 895356 790223 851085
18707H51085k2842K6075O2639j54157J13726K70718k0769j01934O2923J75383
$$ 851085 828243 854318 916957 762800 876526 1147244 1126475 1024541 1087464 1262847
18697A262847j8256k01586j08808m9716n4008P6198J62431M6908J39749K02509
$$ 1262847 1244591 1043005 934197 884481 830473 906671 1069102 1116010 1255759 1458268
18687A458268M1832J73779J68947J23460R1070K64306M21148L17505O2887j2447
$$ 1458268 1500100 1673879 1842826 1966286 2057356 2321662 2742810 3060315 3123202 3110755
18677C110755J18025M1440L02073J07202K78819J95034R4724J04648P8162M40608
$$ 3110755 3228780 3270220 3572293 3679495 3958314 4153348 4248072 4352720 4430882 4871490
18667D871490M18802N44555R63468R95743J405588J887116L190986M624282P066010
$$ 4871490 5290292 5834847 6798315 7794058 9199646 11086762 14277748 18902030 25968040
18658B5968040J1150354J4582493J3986099R994880Q277300R186137R107082N669685
$$ 25968040 37118394 51700887 65686986 75681866 83959166 93145303 102252385 107922070
18650A07922070N46347l136371m241937k131045J36795p39886o609151j4952106
$$ 107922070 108468417 105332046 101090109 98959064 99095859 98355973 91746822 76794716
18642G6794716j7317999j3527526q438603n371773l378282k295557j789288j580534
$$ 76794716 59476717 45949191 37510588 32138815 28760533 26464976 24675688 23095154
18634B3095154j328608j214936j131001q82831n18151m18235k38496l4851j18300
$$ 23095154 21766546 20551610 19420609 18537778 18019627 17601392 17362896 17328045 17209745
18625A7209745j01136J20945N02474O12303Q44945J019203J647968K446865L900755
$$ 17209745 17108609 17229554 17732028 18344331 19189276 20208479 21856447 24303312 28204067
18616B8204067O427126J0451597J5387576J7432564J3507554R710173J0117136
$$ 28204067 34631193 45082790 60470366 77902930 91410484 101120657 111237793
18609A11237793J1338053R313650L162698k338541l630304j240732L925557Q317788
$$ 111237793 122575846 131889496 135052194 132713653 129083349 127842617 131768174 140085962
18601A40085962P852219n7568r460512j0348433m575225L51523J338029j427605
$$ 140085962 147938181 147880613 138420101 128071668 123496443 123847966 125185995 123758390
18593A23758390m140692n462394m466916j994696j058084n186724j3104125j6903696
$$ 123758390 119617698 114155304 109688388 107693692 106635608 101448884 88344759 71441063
18585G1441063j3901690r090009n682073l952484k658341k260573j868690j500637
$$ 71441063 57539373 48449364 42767291 38814807 36156466 33895893 32027203 30526566
18577C0526566j400003j489217j414010r57331q25457o96149n83241p55671o12789
$$ 30526566 29126563 27637346 26223336 25266005 24440548 23744399 23161158 22405487 21792698
18568B1792698l56591j45499r2538L58868P58662J154898J669204K517268M343805
$$ 21792698 21436107 21290608 21198070 21556938 22315600 23470498 25139702 27656970 32000775
18559C2000775P638503J2187468J4774770J2546458Q573067Q094220Q943124Q173945
$$ 32000775 39639278 51826746 66601516 79147974 87721041 95815261 104758385 112932330
18551A12932330L641005k067432m550696m399304j750914Q882k062329r357540
$$ 112932330 116573335 114505903 109955207 105555903 103804989 103813871 101751542 92394002
18543I2394002j6915201j6933272j2372718p924682m749707l426239k557539k103173
$$ 92394002 75478801 58545529 46172811 38248129 33498422 30072183 27514644 25411471
18535B5411471j659968j475679j603502j272426r65135q70495o75900n71493o93668
$$ 25411471 23751503 22275824 20672322 19399896 18434761 17564266 16888366 16316873 15623205
18526A5623205n34154n53354n99046l84921o46972m72391l53852k27873l59236
$$ 15623205 15089051 14535697 13936651 13551730 12904758 12432367 12078515 11850642 11491406
18517A1491406m56549n74948n29586l16889m80246l35978l43582l44282k03795
$$ 11491406 11034857 10459909 9930323 9613434 9133188 8797210 8453628 8109346 7905551
18508G905551O865k9464k38162j97000k22660j67697k89196k93308k63855j9337
$$ 7905551 7912416 7882952 7644790 7447790 7225130 7057433 6768237 6474929 6211074 6191737
18498F191737r5279J10100r0115k99044l19256J07133M4994j33796j70874k57627
$$ 6191737 6096458 6206558 6116443 5817399 5498143 5605276 5650270 5516474 5345600 5087973
18488E087973j41016k27393j27882j02050k35400K1011j79896k65062j43166j83619
$$ 5087973 4946957 4719564 4591682 4489632 4254232 4275243 4095347 3830285 3687119 3503500
18478C503500m0923K1593L8408k9051k59107k06662q810O4537Q3446N1685l29365
$$ 3503500 3462577 3484170 3522578 3493527 3234420 3027758 3018948 3083485 3166931 3218616 2889251
18467B889251j58177J63138k4117J293n0141r8186k07239Q437J77513j9977k22723
$$ 2889251 2731074 2894212 2870095 2871388 2821247 2723061 2515822 2524259 2701772 2681795 2459072
18456B459072n8983Q3054k9235J14883J77552m548j99947l3634j03658n1835o2192
$$ 2459072 2400089 2483143 2453908 2568791 2746343 2741795 2541848 2508214 2404556 2352721 2290529
18445B290529o1519L2998k12823m031j66525k7056j20580l69292j77007r2652
$$ 2290529 2229010 2262008 2049185 2045154 1878629 1851573 1730993 1361701 1184694 1092042
18435A092042J07289J09349J11398k09011k6407j44808q0334k6298J7689J31065
$$ 1092042 1199331 1308680 1420078 1211067 1184660 1039852 959518 933220 950909 1081974
18425A081974o374j31082J75471J66555j01890K38885R3235k27365k28218o0604
$$ 1081974 1075600 944518 1119989 1286544 1184654 1423539 1516774 1289409 1061191 1000587
18415A000587Q6851J04478P4224K02751P0806j83570q9303j20938j8154q9963
$$ 1000587 1087438 1191916 1266140 1468891 1539697 1356127 1266824 1145886 1127732 1037769
18405A037769L0076k09020n6876n0772K03979J85108l871m0447Q4607j02550q0536
$$ 1037769 1067845 858825 801949 751177 955156 1140264 1136393 1095946 1180553 1078003 997467
18394I97467j59673l9322N0171n3370n1413R0670r834k4516j99913n1693J93682
$$ 997467 837794 798472 848643 795273 743860 834530 824696 800180 600267 548574 742256
18383G42256p3604m8528R0697l1699j09671j509J08634J49837l5563J5120q2326
$$ 742256 668652 620124 710821 679122 569451 567942 676576 826413 790850 805970 723644
18372G23644k3670o7464m9891P8548L829j15760o0336j00133m2314O5779q637
$$ 723644 699974 632510 582619 661167 664996 549236 488900 388767 346453 412232 403595
18361D03595O2374K1190J4427n9514j70288j8437Q1934r053j60882j66038k36774
$$ 403595 465969 487159 501586 442072 271784 253347 335281 326228 165346 -692 -237466
18350b37466l9121J61105R3177R2756m3890J80566n9306l386J99319J18019k3331
$$ -237466 -276587 -115482 -22305 70451 26561 207127 147821 144435 343754 461773 438442
18339D38442k08495K912K37808M0890j35310l40399o0882K3766M3957P7339m8624
$$ 438442 229947 232859 470667 511557 376247 35848 -25034 -1268 42689 120028 71404
18328G1404o5496m6209J48739r2907N3544N1850j01681n5566P3945J01748r27
$$ 71404 5908 -40301 108438 15531 69075 120925 19244 -36322 37623 139371 138444
18317A38444K2796K43146M6347r0737r5601j24286l4213n7156m2320L34543J35144
$$ 138444 161240 404386 450733 359996 264395 140109 105896 48740 6420 340963 476107
18306D76107J6470N263j17506j00156K862j03236j24905J61936J65752M0959j02606
$$ 476107 492577 497840 380334 280178 283040 179804 54899 216835 382587 423546 320940
18295C20940k83941l03187K76591L34858P3774j77218j36127K10450J16036q0490
$$ 320940 36999 -266188 10403 345261 419035 241817 105690 316140 432176 351686
18285C51686j31272j18657l8286N2408J69172J48638m759j86160j88965P8261
$$ 351686 220414 101757 63471 115879 285051 433689 428930 242770 53805 132066
18275A32066R050j86239J43403Q7981r8534j97251j90979m2428j54186M5252K10714
$$ 132066 141116 -45123 98280 186261 87727 -109524 -300503 -342931 -497117 -451865 -241151
18264b41151J45306J00987P8742r9397k41820j21230k1080o5271N7692K25429
$$ -241151 -95845 5142 83884 -15513 -257333 -378563 -399643 -464914 -407222 -181793
18254a81793J04231J12950j37921Q4493L32128J03099j43941j42006k3711J01744
$$ -181793 -77562 35388 -102533 -18040 314088 417187 273246 131240 107529 209273
18244B09273j26402r5908o274k300J10846M6141J1927j33358M7567j05754q5698
$$ 209273 82871 -13037 -19311 -21611 89235 135376 147303 13945 61512 -44242 -129940
18233a29940j11227M368K01619J24054J08606j59693P387J49817K5419J70256
$$ -129940 -241167 -236799 -35180 88874 197480 37787 45174 194991 220410 390666
18223C90666J16183Q1794p0921j09553j83454j84390L2993l086J84490k1210l8259
$$ 390666 506849 588643 517722 408169 224715 40325 73318 70232 254722 233512 195253
18212A95253P4074k69903O6634l9581m119l1376J4191j02298J83102J07553J33322
$$ 195253 269327 -576 66058 26477 22358 -9018 5173 -97125 85977 193530 326852
18201C26852j28667k5028j6908J58018k2412J5370K5000o6882k64287N8861J79612
$$ 326852 198185 173157 156249 314267 291855 307225 332225 265343 1056 59917 239529
18190B39529j6152p2534p9807J24532l90J09756k22533j65667j06919o9665J75837
$$ 239529 223377 150843 71036 195568 195178 304934 82401 -83266 -190185 -259850 -84013
18179h4013J51294Q9750J73275k79633J06622n5599R0832O6138j80661l0446p3470
$$ -84013 67281 157031 330306 50673 157295 101696 192528 258666 78005 47559 -25911
18168b5911q0307L9931K7876J12122J02434K08146j21231M0223J00856j43031
$$ -25911 -106218 -66287 -38411 73711 176145 384291 263060 303283 404139 261108
18158B61108k0570J01182j13450j07901k9925k3493Q803j37446j17875R690n9057
$$ 261108 240538 341720 228270 120369 90444 66951 75754 -61692 -179567 -169877 -228934
18147b28934n3617J07657l1493M8968o9467L3911L53543P0370k06237J7431O4242
$$ -228934 -282551 -174894 -206387 -157419 -226886 -192975 160568 230938 24701 42132 106374
18136A06374K07333L7659k81508l1902J03077K45904M02210Q5984j03331j67752
$$ 106374 313707 351366 69858 37956 141033 386937 789147 875131 771800 604048
18126F04048k17229j72565q220J36924J36833j18179K22250R8012j7777j01938
$$ 604048 386819 214254 206034 342958 479791 361612 583862 681874 664097 562159
18116E62159j40589o4562M9390J48383L8256k03702l0389j35903k20076k35689
$$ 562159 421570 357008 406398 554781 593037 389335 358946 223043 2967 -232722
18106b32722J8952K38253K69520J06070L4179q6484j68718j3694J12831J33084
$$ -232722 -213770 24483 294003 400073 434252 347768 179050 165356 278187 411271
18096D11271K56745r4059j73049p0112J56939L75357K2943M9074p0903Q7458j7987
$$ 411271 668016 573957 400908 330796 487735 863092 886035 935109 864206 951664 933677
18085I33677r2513R4259O4773J31961J87147m2867p6220j62583k25765m395K07342
$$ 933677 841164 935423 1000196 1132157 1319304 1276437 1200217 1037634 811869 807474 1014816
18074A014816M4256p034O2684k6504m4787J38964K6605j75100l00079k98375o3459
$$ 1014816 1059072 1052038 1114722 1088218 1043431 1182395 1209000 1033900 733821 435446 371987
18063C71987J60558M0674N9270J10436N5022O5007k09209j74143K11019Q6453
$$ 371987 532545 573219 632489 742925 797947 862954 653745 479602 690621 777074
18053G77074J21050J89083j90686k04828J99249O7307J36447J38076J04200m2643
$$ 777074 898124 1087207 896521 691693 890942 958249 1094696 1232772 1336972 1294329
18043A294329J2398m2234k21550k30288r3079Q2421N9562q2939j9591K93127K88144
$$ 1294329 1306727 1264493 1042943 812655 719576 801997 861559 778620 759029 1052156 1340300
18032A340300J01123k46169n199J61292J71262K61073j21887J03769n888k00941
$$ 1340300 1441423 1195254 1190055 1351347 1522609 1783682 1661795 1765564 1759676 1558735
18022A558735j02826m6996J56772J66953k5922r7849k3552o8364j31346k4068
$$ 1558735 1455909 1408913 1565685 1732638 1706716 1608867 1585315 1516951 1385605 1361537
18012A361537J93763J07841K22570J16743l00599l61004k5538J43876J04211K9410
$$ 1361537 1555300 1663141 1885711 2002454 1701855 1340851 1315313 1459189 1563400 1592810
18002A592810p2880o126K1655R5522Q2183J46755K27833J14163J47185N8588J92447
$$ 1592810 1519930 1513804 1535459 1630981 1713164 1859919 2087752 2201915 2349100 2407688 2600135
17991B600135K82194K33457R9117N5241K85107L46224L37664M22311N45854O15449
$$ 2600135 2882329 3115786 3214903 3270144 3555251 3901475 4239139 4661450 5207304 5822753
17981E822753O03436P09906O95937J104488J562728K338562L290768M831866P615748
$$ 5822753 6426189 7136095 7832032 8936520 10499248 12837810 16128578 20960444 28576192
17972B8576192J0340514J1573063J1434078J0976951Q990951O376384L387199
$$ 28576192 38916706 50489769 61923847 72900798 81891749 88268133 91655332
17965I1655332j17751j743837j450746o67500J396999L750870L903857J791278
$$ 91655332 91537581 89793744 88342998 87675498 89072497 92823367 96727224 98518502
17957I8518502j305104o064323r933473j2513291j3731696j0945649o943445m427338
$$ 98518502 97213398 91149075 81215602 68702311 54970615 44024966 37081521 32654183
17949C2654183l097009k133502j461068j012977r70002r97628o87858n98290j54851
$$ 32654183 29557174 27423672 25962604 24949627 23979625 22981997 22294139 21695849 21540998
17940B1540998L0710O4604M51734M79829R45251J206662J644001K724384M166965
$$ 21540998 21571708 21636312 22088046 22567875 23513126 24719788 26363789 29088173 33255138
17931C3255138O611839J0127749J4718888J9476298K1152824K0793070J8980963
$$ 33255138 39866977 49994726 64713614 84189912 105342736 126135806 145116769
17924A45116769J4718115R964401M204425j668528l590153l250291j197899K771367
$$ 145116769 159834884 169799285 174003710 172335182 168745029 165494738 164296839 167068206
17916A67068206O173266N342355J524511m747091j3295726j9491329k3318438
$$ 167068206 173241472 178583827 180108338 175361247 162065521 142574192 119255754
17909A19255754k3361957j8346310j2491642q222418n597621m183543l367017
$$ 119255754 95893797 77547487 65055845 56833427 51235806 47052263 43685246
17902D3685246k526332k113232k339569k267507j696172j250428q60898q26201
$$ 43685246 41158914 39045682 36706113 34438606 32742434 31492006 30631108 29804907
17894B9804907r24256r35111m67847j43556K71301Q35153J509956K777249M725200
$$ 29804907 28880651 27945540 27477693 27334137 27605438 28440591 29950547 32727796 37452996
17885C7452996P219609R280903R753940R504881Q613034O141303L566278M67646
$$ 37452996 44672605 53953508 63707448 73212329 81825363 87966666 91532944 92000590
17877I2000590k290541k566668k286369r39894J490372K832638J805839j66683
$$ 92000590 89710049 87143381 84857012 83917118 85407490 88240128 90045967 89879284
17869H9879284l490352p187468r990916j1732561j0842396q157053n262268l280234
$$ 89879284 86388932 79201464 69210548 57477987 46635591 38478538 33216270 29936036
17861B9936036k374440j877640j543227j543475j511685j320318j138488q76946
$$ 29936036 27561596 25683956 24140729 22597254 21085569 19765251 18626763 17749817
17853A7749817q02888p61013p03054q24074p90928o87467l96589j42552l28283
$$ 17749817 16946929 16185916 15482862 14658788 13867860 13180393 12783804 12641252 12312969
17844A2312969o97794n82747l95938l37322l22764m14610k72435l80767l23914
$$ 12312969 11615175 11032428 10636490 10299168 9976404 9561794 9289359 8908592 8584678
17835H584678l2976K2055k32554m86606o22325k45562j55576l44155k96549j05191
$$ 8584678 8551702 8573757 8341203 7854597 7232272 6986710 6831134 6486979 6190430 6085239
17825F085239j39035k75506j24326m6008q8722j22654q7874o3906j31575p1749
$$ 6085239 5946204 5670698 5546372 5500364 5411642 5288988 5201114 5137208 5005633 4933884
17815D933884q7653k81869j98734j20854M4848o2994j70095j00719J7077k51859
$$ 4933884 4846231 4564362 4365628 4244774 4289622 4226628 4056533 3955814 3972891 3721032
17805C721032k85767n6592O4913J88509m5992j12323k76289l14841M1514J50150
$$ 3721032 3435265 3378673 3443586 3632095 3586103 3473780 3197491 2882650 2924164 3074314
17795C074314j46437j87118L2880j15335l2543R3157O7497j4426l05721k50639
$$ 3074314 2927877 2740759 2773639 2658304 2625761 2718918 2786415 2771989 2466268 2215629
17785B215629j13574j63310p1958O9106l3332k41303p1880N3325J77342R271n0795
$$ 2215629 2102055 1938745 1866787 1935893 1902561 1661258 1589378 1642703 1820045 1829316 1778521
17774A778521K3475p6602r4437k12185J60083J70348l8904j25955L678K4658j64394
$$ 1778521 1801996 1725394 1630957 1418772 1578855 1749203 1710299 1584344 1588022 1612680 1448286
17763A448286j8845R6244l70651k89049J01166j2681J48277o1977P4833J49752
$$ 1448286 1429441 1525685 1155034 865985 967151 954470 1102747 1040770 1115603 1265355
17753A265355j8098k46008n8431q409Q3138J50559k14127k60376L8324O7063p5962
$$ 1265355 1247257 1001249 942818 934409 1017547 1168106 953979 693603 731927 798990 723028
17742G23028N6423P4915J26047Q1142j8762J862k7387j33103j9888L8360j7940
$$ 723028 779451 854366 980413 1061555 1042793 1044655 1017268 884165 864277 902637 884697
17731H84697J29301K2257n1220R753r9184j10140k60122J03771K23986l9568k34798
$$ 884697 1013998 1036255 985035 994788 895604 785464 525342 629113 853099 813531 578733
17720E78733J16139J06248K360r1863q0169j44303K7214l6244k4968J13775N3564
$$ 578733 694872 801120 803480 711617 631448 487145 514359 478115 453147 566922 620486
17709F20486M2998L8353o8484K3746n0477j22355Q7829o5581k24571K02746j28569
$$ 620486 663484 701837 633353 657099 606622 484267 572096 506515 281944 484690 356121
17698C56121k50996N1379n1903K79222P8301J27102Q2288k29664j27013j18012
$$ 356121 105125 156504 104601 383823 462124 589226 671514 441850 314837 196825
17688A96825j05646L7899P2587j24168k7913J90807R4300o3440n8532r7511J21218
$$ 196825 91179 129078 201665 77497 49584 240391 334691 271251 212719 115208 236426
17677B36426L9044q2573K08845j05896k09424O9366k3111j78468n6410L3868J37938
$$ 236426 275470 192897 401742 295846 86422 155788 132677 -45791 -102201 -68333 69605
17666F9605J97621K0636q378l2089K9765N3736j44616q7214J50982R5118j67513
$$ 69605 267226 287862 279484 247395 277160 330896 186280 99066 250048 345166 177653
17655A77653J17276K5070J5495p7950J8723L5636O8650Q7636j99782k7518J98522
$$ 177653 294929 319999 335494 257544 276267 311903 380553 468189 268407 240889 439411
17644D39411Q7015q9587l7496j55371O866o6886P0331R5453k65347r1782L18738
$$ 439411 526426 436839 399343 243972 250838 183952 254283 349736 84389 -7393 311345
17633C11345j50711k16180O2683O8456R83k80672j747q4311r9066J629K18885
$$ 311345 160634 -55546 7137 75593 76576 -204096 -205843 -290154 -389220 -387591 -168706
17622a68706K76170O3869j2198J46042o5418j28616m12357n5415K1994J29643
$$ -168706 107464 171333 159135 305177 239759 111143 -301214 -356629 -334635 -204992
17612b04992l0218L1143K95562K18768o1444q1189m9188l3165j21381J42983m5775
$$ -204992 -235210 -204067 91495 310263 248819 167630 118442 85277 -36104 106879 61104
17601F1104r9783J2532Q4704Q7238K5600J2684j51384O4168p7912m9550p992l0025
$$ 61104 -38679 -26147 58557 145795 171395 184079 32695 96863 18951 -30599 -38591 -68616
17589f8616K2520N6228J67794K48216J0773j15397j41404l0115K08722j6129j71472
$$ -68616 -46096 10132 177926 426142 436915 321518 180114 149999 358721 342592 171120
17578A71120j66978k60089k01749J59534j21390J32852K57276K45580J65990n1750
$$ 171120 4142 -255947 -457696 -298162 -419552 -286700 -29424 216156 382146 330396
17568C30396o1713p0365L8156q7339K10499J45403K49501j46112k86753j35677
$$ 330396 268683 198318 236474 149135 359634 505037 754538 608426 321673 185996
17558A85996j23684q6531k6224J2895J37917J65579L02082k20924k97509k81622
$$ 185996 62312 -24219 -50443 -37548 100369 265948 568030 347106 49597 -232025
17548b32025j18827L1274q461J17588R7079J65381l29988k03480K32693J16102
$$ -232025 -350852 -319578 -328039 -210451 -113372 52009 -277979 -481459 -248766 -132664
17538a32664J70905J95117j2000o5325j05278l7258j8926j6613n4953k6784Q9394
$$ -132664 38241 233358 221358 156033 50755 13497 -5429 -22042 -76995 -103779 -14385
17527a4385J03823j02053p5166j91276k893O7645R3148J29906J28956J35815l2768
$$ -14385 89438 -12615 -87781 -279057 -281950 -214305 -121157 8749 137705 273520 240752
17516B40752J54139J82983L09813J21232n5772k77039j84157L0091R437J17398
$$ 240752 394891 577874 887687 1008919 953147 676108 491951 522042 531479 648877
17506F48877K76613J69304J71564J94682J35859K13185m7431r8202l61937j89835
$$ 648877 925490 1094794 1266358 1461040 1596899 1810084 1762653 1664451 1302514 1112679
17496A112679n6909l69546K1672P3236J53610J99836j01687l8408K317J5603j06768
$$ 1112679 1055770 686224 707896 781132 934742 1134578 1032891 994483 996800 1012403 905635
17485I05635k66879k68735l63402q1271L20714O298o4030L5215r6119O5104J28905
$$ 905635 638756 370021 6619 -74652 246062 252360 188330 223545 127426 192530 321435
17474C21435q5449J92563J80151j41665j0093j32085j21890J6622N0303K6310
$$ 321435 235986 428549 608700 467035 456942 324857 202967 219589 269892 296202
17464B96202j24458N9610K28314L0791j95030k85883j3983J48252K10765J65055
$$ 296202 171744 231354 459668 490459 295429 9546 -4437 143815 354580 519635
17454E19635J45935K55050P7765N5448J08464q2199j24440k31867J07919K30299
$$ 519635 665570 920620 998385 1053833 1162297 1080098 955658 723791 831710 1062009
17444A062009K80545J54060L04970J31514J07586K4426k98858j18714j06041n8692
$$ 1062009 1342554 1496614 1801584 1933098 2040684 2065110 1766252 1647538 1541497 1482805
17434A482805J7104j68024j36848J40679m4524p33j44343k2599K59949J9437m1557
$$ 1482805 1499909 1331885 1195037 1335716 1291192 1290459 1146116 1123517 1383466 1402903 1361346
17423A361346j39200j27115L1088j34439m0552l07146j98994J24520o296p1767
$$ 1361346 1222146 1095031 1126119 991680 951128 643982 444988 569508 563212 491445
17413D91445j67884o669r8473o9008j39774Q6680K30121K1131j19466j58818R3740
$$ 491445 323561 316892 218419 149411 9637 96317 326438 347569 228103 69285 163025
17402A63025o031n9246L1410K60187R2044J29949n9164k6195r8524k20795j37045
$$ 163025 156994 97748 129158 389345 481389 611338 552174 525979 427455 206660 69615
17391F9615J93377K13362p2728K3576K5273K80308N5787P5086K5805r8547M5408
$$ 69615 262992 476354 403626 427202 452475 732783 788570 863656 889461 790914 836322
17380H36322R5064q9934j31013J14862R2984j37839j34101n1808l2319N7580o4057
$$ 836322 931386 841452 710439 825301 918285 780446 646345 594537 562218 619798 555741
17369E55741j56669M0484J57441O1165k68763k33028p3922R0441K3894N5060l8759
$$ 555741 399072 439556 596997 658162 389399 156371 82449 172890 196784 251844 213085
17358B13085k392J02589p7797o0874n6311P160K04816o6792k73934j64959R3075
$$ 213085 210693 313282 235485 174611 118300 125460 330276 263484 -10450 -175409 -82334
17347h2334J96771J36494M8067J74689K9501O6138J84678J26873m0633q3942L8775
$$ -82334 114437 250931 298998 473687 503188 569326 754004 880877 840244 756302 795077
17336G95077j14925j62890j90053M8201K91588K76006K0477k29148k02313k77055
$$ 795077 680152 517262 327209 375410 666998 943004 963481 734333 532020 254965
17326B54965j38495N7101j7882o4683j70863j16025k11668K184L13915K68438
$$ 254965 116470 173571 155689 91006 -79857 -195882 -407550 -405366 -91451 176987
17316A76987J0180L9882J06501k17328q263j11540j86702R9512K02998J0470o5011
$$ 176987 187167 227049 333550 116222 107959 -3581 -190283 -90771 112227 122697 57686
17305E7686m8612J11508L3524j85023J19686j60727j12991J49739N5619R1970
$$ 57686 9074 120582 154106 -30917 88769 -71958 -184949 -35210 20409 112379
17295A12379Q4767n1964J34895k6363k3087j44989j68181j38901J74661Q8312
$$ 112379 197146 145182 280077 253714 230627 85638 -82543 -221444 -46783 41529
17285D1529k7898Q9320n9764j96199k0450k5694J65933J09073k37073l1429Q3064
$$ 41529 13631 102951 43187 -153012 -173462 -199156 -33223 75850 -161223 -192652 -109588
17274a09588p5770R3636P8791J21927m2464k41561K37160N4225j29628r6954j81965
$$ -109588 -185358 -91722 -12931 108996 66532 -175029 62131 116356 -13272 -110226 -292191
17263b92191R539J36295M9494P3594o7898l0170j2632q3380R4021J92088l3836
$$ -292191 -282652 -146357 -96863 -23269 -91167 -121337 -133969 -217349 -123328 68760 34924
17252C4924J62840m4377j25701q6489R9081L7426R560j2999J58782k4750m4583
$$ 34924 197764 153387 27686 -58803 40278 77704 87264 74265 233047 208297 163714
17241A63714q3202j32492q1198J05677n2469L4339Q9703R4309m601j07975n4832
$$ 163714 80512 -51980 -133178 -27501 -79970 -45631 44072 138381 133780 25805 -29027
17230b9027J18217k3546J0957L0583k2621k31883O0128j67096L2210K54478Q8099
$$ -29027 89190 65644 76601 107184 84563 -147320 -87192 -254288 -222078 32400 120499
17219A20499Q7064L5723k44779j89235J18317J07599k35505j15895j08525K08885
$$ 120499 207563 243286 -1493 -190728 -72411 35188 -200317 -316212 -424737 -215852
17209b15852J82627K3295M2319P7528l55O1527m3397J79298j68585p9763K4590
$$ -215852 -33225 -9930 32389 109917 109562 171089 127692 306990 138405 58642 83232
17198H3232j84315N0040K64891M5591p008j6976J49931j49974k20777k44146M6705
$$ 83232 -101083 -51043 213848 259439 252431 235455 385386 235412 14635 -229511 -182806
17187a82806K74304J5436k42209J10020J39231J0808r1305j37097j7269j13161
$$ -182806 91498 106934 -135275 -25255 113976 124784 33479 -103618 -120887 -234048
17177b34048J37752P0844j93436O3367J62033o8778M9012k18665j27051J0363
$$ -234048 -96296 -25452 -218888 -155521 6512 -62266 -13254 -231919 -358970 -348607
17167c48607K59029J35507J53499j24163k84718m1136K67317R5928j13630o1797
$$ -348607 -89578 45929 199428 75265 -209453 -250589 16728 112656 -974 -62771
17157f2771L7105j17865J40335m0081q6033Q1357r5740R0720K02129P65J9249
$$ -62771 -25666 -143531 -3196 -43277 -129310 -47953 -143693 -52973 149156 149921 169170
17146A69170N872o8703q3815j97387O6407J20567Q9301n4191n0608j56901k0613
$$ 169170 175042 106339 22524 -174863 -108456 12111 101412 47221 -3387 -160288 -180901
17135a80901j46602n4309J69174J24598K8303J43018K2660R8456p8738r0509O503
$$ -180901 -327503 -381812 -212638 -88040 -59737 83281 105941 204397 125659 35150 41653
17124D1653N3985k38293j59312M7529J79936O0124k16894M1630L20673q5986j21532
$$ 41653 95638 -142655 -301967 -254438 -74502 -14378 -231272 -189642 131031 45045 -76487
17113g6487J60339j0761n7642p407j63611n0822J01391J48622J29046L2899j74495
$$ -76487 83852 73091 15449 8042 -155569 -206391 -105000 43622 172668 205567 31072
17102C1072o2350K66400o517k03722k0175k4673j31706j82939J64821j11901p0617
$$ 31072 -31278 235122 228605 24883 4708 -19965 -151671 -334610 -169789 -281690 -352307
17091c52307N9286Q2345J81916Q331J00086j18531j96959J4496J5797p87j18944
$$ -352307 -293021 -210676 -28760 -20429 79657 -38874 -235833 -221337 -205540 -206327 -325271
17080c25271r6452P5848K12091N2924M3478J43349j0560l7929J19768j13350J2660
$$ -325271 -421723 -345875 -133784 -80860 -37382 105967 95407 57478 177246 63896 76556
17069G6556N605o3349K7165l5574J92952O5643m967m2268p9596R5080M5470q8947
$$ 76556 82161 18812 45977 10403 203355 268998 264031 221763 142167 237247 282717 193770
17057A93770j31887o0318l8251M1535N836r8535n7769m0791n3174J22609J02202
$$ 193770 61883 1565 -36686 4849 10685 -87850 -145619 -186410 -239584 -116975 -14773
17046a4773p9484j10165k86595k41459P931J52129K08409J09503p3634L4552K27716
$$ -14773 -94257 -204422 -491017 -732476 -724545 -572416 -364007 -254504 -328138 -293586 -65870
17035f5870M6440M2191m7080j93237p7815j20984K2472K18272N271j82365j59425
$$ -65870 -19430 22761 -24319 -217556 -295371 -416355 -393883 -175611 -170340 -352705 -512130
17024e12130J37550K69725m9757J90702Q2545j44503q3358p2275N9500j8011q0836
$$ -512130 -374580 -104855 -154612 36090 118635 -25868 -109226 -181501 -122001 -140012 -220848
17013b20848J3961P2911R6572K17714j21390j06364n3154J00509k6554j20606
$$ -220848 -206887 -133976 -37404 180310 58920 -47444 -100598 -89 -26643 -147249
17003a47249k54553m8664K76277J09901J9046p2926m044q039o8221R0526K4827
$$ -147249 -401802 -450466 -174189 -64288 -45242 -118168 -122212 -130251 -198472 -107946 -83119
16992h3119m2318p0800K07345J02275k84674P8645K9714k05118o4452n2208K129
$$ -83119 -125437 -196237 11108 113383 -171291 -92646 -62932 -268050 -332502 -384710 -382581
16981c82581m0204J34269O5331P6127N846K49647N1927O140j9765j90141j23571
$$ -382581 -422785 -288516 -223185 -147058 -141212 108435 160362 166502 146737 -43404 -166975
16970a66975j57330J91608M11424j01273l62307j58969K4065j7023J82701O1931
$$ -166975 -324305 -132697 278727 177454 -184853 -343822 -319757 -336780 -154079 -92148
16960i2148k22811J0284K28851O1564L7306k0934r9457L5034l0514N5894l5759
$$ -92148 -314959 -304675 -75824 -14260 23046 2112 -97345 -62311 -92825 -36931 -72690
16949g2690j21394r1778K2439P0968K87361l2968r0446j54216J3758J81130J48973
$$ -72690 -194084 -285862 -263423 -192455 94906 61938 -28508 -182724 -168966 12164 161137
16938A61137J81605p738p1660j93184j38051J5045Q2126j24214M531m0089J0116
$$ 161137 342742 335004 263344 70160 -67891 -52846 29280 -94934 -90403 -130492 -120376
16927a20376R4499k5681m5425j5719K027k16423K9232l4868k2584O3455P5751
$$ -120376 -25877 -51558 -96983 -112702 -110675 -327098 -297866 -332734 -355318 -291863 -216112
16916b16112P5540J83988o4357k9503K16118q2316k78473L7519L1556Q1757J52032
$$ -216112 -140572 43416 -20941 -50444 165674 83358 -195115 -157596 -126040 -44283 107749
16905A07749p7351J51605L7237j62131j26400j1405K04620j5634l09104p7898
$$ 107749 30398 182003 219240 57109 -69291 -80696 123924 108290 -200814 -278712
16895b78712m4481R3703J77065j38408k11039J32881K17303N7573j13758k45279
$$ -278712 -323193 -229490 -52425 -190833 -401872 -268991 -51688 5885 -107873 -353152
16885c53152p16m0897R4094J66774Q1537J57726j21348l13365j1642p9067R4382
$$ -353152 -353868 -394765 -300671 -133897 -52360 105366 -15982 -329347 -340989 -420056 -325674
16874c25674L41018L74031J9449j16963k3383J38548k23128l66109n5803L2953
$$ -325674 15344 389375 408824 291861 268478 407026 183898 -182211 -238014 -205061
16864b05061m8634k16126J24695K04042Q6770j9735j84518K3921L52138K8467
$$ -205061 -253695 -469821 -345126 -141084 -54314 -74049 -258567 -234646 117492 145959
16854A45959j7017M7725k7893j79486j6039n1633j0898j81421J15066K64184l2070
$$ 145959 128942 176667 148774 -30712 -46751 -98384 -109282 -290703 -175637 88547 56477
16843E6477p921p4905j23105l6864O286j33619r3962K21439K34432R3341O139
$$ 56477 48556 -26349 -149454 -186318 -180032 -313651 -407613 -186174 48258 141599 147738
16832A47738j39492k11660j37703j7907K71901J66040N3276K7717p8592j05703
$$ 147738 8246 -203414 -341117 -359024 -87123 78917 132193 159910 81318 -24385
16822b4385l7895l21411j83349K34425R8118p3474j09512M8432J20812o5759J94574
$$ -24385 -62280 -383691 -567040 -332615 -234497 -307971 -417483 -369051 -248239 -313998 -119424
16811a19424K13041J260n5994j27247p8912M0789M8313Q1252j30775k00339j9060
$$ -119424 93617 94877 38883 -88364 -167276 -126487 -78174 3078 -127697 -328036 -347096
16800c47096J60587J90789J8773j7006M2555o0237r3100J17916J55233r816K3526
$$ -347096 -186509 4280 23053 6047 48602 -11635 -104735 13181 168414 158598 182124
16789A82124j96619n8014j483j40054j08889j62062j81220k1252L31285K15571
$$ 182124 -14495 -72509 -73992 -214046 -322935 -484997 -666217 -687469 -356184 -140613
16779a40613j61093J55449J23709J05987j98912p2005L8303q0962M7990P3420
$$ -140613 -301706 -146257 -22548 83439 -115473 -187478 -149175 -230137 -182147 -108727
16769a08727k7552L3072O1371O6336J71823j58917j90281q2759J05672R1358J34206
$$ -108727 -136279 -103207 -41836 24500 196323 37406 -152875 -235634 -129962 -38604 95602
16758I5602J24461j43384j73553p137L9511J43320J6390p1659M4677J45984j18477
$$ 95602 220063 76679 -96874 -104011 -64500 78820 95210 23551 68228 214212 95735
16747I5735r0530j60973j15169k85559n9194l7769P4073K91528j012k6470J41184
$$ 95735 5205 -155768 -270937 -556496 -615690 -653459 -579386 -287858 -288870 -315340 -174156
16736a74156J0331n7914J32334J22974o866n1038j83802j44937L5092J41043Q5789
$$ -174156 -163825 -221739 -89405 33569 26703 -24335 -208137 -353074 -317982 -176939 -91150
16725i1150J22163J96114m3323j10485j33248m8018k14934R4588j75131k72963
$$ -91150 31013 227127 183804 73319 -59929 -107947 -322881 -228293 -403424 -676387
16715f76387N3100J26130J20272J31796M0874J14018j12004q9773j36017m5599
$$ -676387 -623287 -497157 -376885 -245089 -204215 -90197 -202201 -291974 -427991 -473590
16705d73590J95477K7553j13222o1704j06112J58015P3802k9326J19777p4840
$$ -473590 -278113 -250560 -363782 -425486 -531598 -373583 -299781 -329107 -209330 -284170
16695b84170j52049p7851J74699K14785j26382k25458j71854J23001L70988K22479
$$ -284170 -436219 -514070 -339371 -124586 -250968 -476426 -648280 -525279 -154291 68188
16685F8188K53600J1739p3937M2306n798L5327j72171n1011K26752L44266O5812
$$ 68188 321788 333527 259590 301896 296098 331425 159254 108243 334995 679261 745073
16674G45073j83920L804l623O2107r1113j03210j15680j87783J07030j5823o78
$$ 745073 561153 564957 561334 623441 532328 429118 313438 125655 232685 216862 216184
16663B16184K58898j11833k27311j83324j45057o747K08778K94110l1755J11542
$$ 216184 475082 363249 135938 -47386 -192443 -199190 9588 303698 271943 383485
16653C83485J4512l21690K3619J13592L10757N33451K86390L76860J52395k9403
$$ 383485 397997 76307 99926 213518 524275 1057726 1344116 1720976 1873371 1843968
16643A843968Q7658m14776l89119k41586j14811o2947M8027o2411j35005r9069
$$ 1843968 1931626 1516850 1127731 886145 771334 708387 756414 694003 558998 459929
16633D59929p4185L5409N791k20004j14899k359N8532J43698K43031L8307L512
$$ 459929 385744 421153 426944 206940 92041 89682 148214 291912 534943 573250 576762
16622E76762j61463l5322J23311J55472P1360J19900L0529O1556n4189K3796K3222
$$ 576762 415299 379977 503288 658760 730120 850020 880549 942105 887916 911712 934934
16611I34934j13210K19381L60997j36435k53836m13456k59415J43474m9900M4119
$$ 934934 821724 1041105 1402102 1265667 1011831 598375 338960 482434 432534 476653
16601D76653J6575Q9542o2852l44388J6288k6275L567r9061j4260N0655J73779
$$ 476653 493228 582770 519918 175530 191818 165543 169110 70049 55789 106444 280223
16590B80223K27251J08762P0502j60138j211M19550K02236Q8993L04042K27037
$$ 280223 507474 616236 686738 526600 525389 944939 1147175 1236168 1540210 1767247
16580A767247K07078j70850k54975m95794m84536l28517k8351j578L7111j16833
$$ 1767247 1974325 1803475 1548500 1052706 568170 239653 211302 209724 246835 130002
16570A30002J4581K14087L0262q473j03955j41725R3464k1968p2376K4083K32469
$$ 130002 144583 358670 388932 380459 276504 134779 228243 206275 133899 157982 390451
16559C90451P5404o085J82767N4504r5411O1321l0861o7915j17211q5809j24758
$$ 390451 465855 459770 642537 697041 601630 662951 632090 564175 446964 361155 236397
16548B36397P8893Q6071L028k40140m1805k00433k31977J01781Q2855K03617r7787
$$ 236397 315290 401361 404389 164249 122444 -77989 -309966 -208185 -125330 78287 -19500
16537a9500j82630N4303M19463J21825j81208j45665k25869L4639P6547j9041
$$ -19500 -202130 -147827 271636 393461 212253 66588 -159281 -124642 -48095 -67136
16527f7136Q3661l8028n2931K83230J24162J08161l5547k40492k09429K7309q2111
$$ -67136 16525 -21503 -74434 208796 332958 441119 405572 165080 -44349 -17040 -99151
16516i9151L720K71504k24043j03287J1453p6094J3956j00210K17101L5619K3281
$$ -99151 -95431 176073 -47970 -151257 -139804 -215898 -201942 -302152 -85051 -49432 -26151
16505b6151l7343j25623m3705Q1566J61905l1216k38153n4727m8634K21923K31446
$$ -26151 -63494 -189117 -232822 -151256 10649 -20567 -258720 -313447 -362081 -140158 91288
16494I1288j58147q0688l8150k7112J9200M4598m970j04959J00261K68929j65793
$$ 91288 -66859 -147547 -185697 -212809 -193609 -149011 -153981 -258940 -158679 110250 -55543
16483e5543O9989j26968l6788P6873k02576j7722n2349R6927j33674P8246J53607
$$ -55543 14446 -112522 -149310 -72437 -275013 -292735 -345084 -248157 -381831 -303585 -149978
16472a49978P3951L0557K3992M7111K10069k2180k94436m5056R1020j89179j18877
$$ -149978 -76027 -45470 -21478 25633 235702 213522 -80914 -125970 -34950 -224129 -343006
16461c43006J64293O5559O2351j70327m1449P0231K54365O7706j07697j41401
$$ -343006 -178713 -113154 -50803 -221130 -262579 -192348 62017 129723 22026 -119375
16451a19375r0687L0260K3014j4420M1316J81943J33998K05218Q7739j36170j86137
$$ -119375 -210062 -179802 -156788 -171208 -129892 52051 186049 391267 479006 342836 156699
16440A56699R8151J73362K4947j23691l03950r0604q1206k4175o6271j07039L33264
$$ 156699 254850 428212 453159 329468 25518 -65086 -146292 -170467 -236738 -343777 -10513
16429a0513J57367k58409j32905J60281k6552n7977o3437j312M8314L5481p7640
$$ -10513 146854 -111555 -244460 -84179 -110731 -168708 -232145 -233457 -185143 -149662 -227302
16418b27302j37479J8757j8137J61120J26715K13617k5576j76433q8711J09301
$$ -227302 -364781 -346024 -364161 -203041 -76326 137291 111715 -64718 -153429 -44128
16408d4128j04861k91408J68448N0757l7597N6508j2991j5561R1462j09202k17998
$$ -44128 -148989 -440397 -271949 -221192 -258789 -202281 -215272 -230833 -139371 -248573 -466571
16397d66571j37235K84250J96322J79317o4351k14293l1870P1973J8201J8572
$$ -466571 -603806 -319556 -123234 56083 -8268 -222561 -254431 -182458 -164257 -145685
16387a45685j4349N6965K09751J24575N4131m4736J72134J25919r1780k52742
$$ -145685 -160034 -103069 106682 231257 285388 240652 412786 538705 446925 194183
16377A94183j78321p4465j9292l5256j49419p9615q2443L47365J50705j48072
$$ 194183 15862 -58603 -77895 -113151 -262570 -342185 -424628 -77263 73442 -74630
16367g4630p5279J53152K1257r1365M8336M5978r6591j43326j84366J0489O0928
$$ -74630 -149909 3243 24500 -66865 -18529 27449 -69142 -212468 -396834 -386345 -325417
16356c25417M1362J94612J57857j22500L0776q2490K9246m2656Q6522K63308j57126
$$ -325417 -284055 -89443 68414 -54086 -23310 -105800 -76554 -119210 -32688 230620 73494
16345G3494k33913l92763K9974K64469O687K8026J64361J41905j60307J2669J52860
$$ 73494 -160419 -553182 -523208 -258739 -252052 -224026 -59665 82240 -78067 -65398 87462
16334H7462O5936o909p0038k14588L3832J31633j8062j2331J7586J19568K70367
$$ 87462 153398 146489 76451 -138137 -104305 27328 9266 -3065 14521 134089 404456
16323D04456j2308j57040p8137K0217K2732m9218m8558J87135o0936k92311j7728
$$ 404456 392148 235108 156971 177188 199920 150702 102144 289279 228343 -63968 -81696
16312h1696R2275j38791r8266k2590J01509k69926J89719P0765n2391J70740k2353
$$ -81696 10579 -128212 -226478 -249068 -147559 -417485 -227766 -157001 -209392 -38652 -61005
16301f1005j02977J00723N8023J03365L8213K8472j50718j65593n9248r3306j13384
$$ -61005 -163982 -63259 -5236 98129 136342 164814 14096 -151497 -210745 -304051 -417435
16290d17435L8550p2684J12175L57664J41932J7103m3321J07895J15179o9766
$$ -417435 -378885 -451569 -339394 18270 160202 177305 133984 241879 357058 287292
16280B87292k67971o8234p6318J03102K82821J24990j2119j09484p6705N2079
$$ 287292 19321 -48913 -125231 -22129 260692 385682 373563 264079 187374 239453
16270B39453O6178j66771k55223K266K37233K85412n4340l64346k16959M4470
$$ 239453 305631 138860 -116363 -114097 123136 408548 354208 -10138 -227097 -182627
16260a82627R0852J51868m3182O8426j37493k10769J1335J53823k71982j32637
$$ -182627 -91775 60093 16911 85337 -52156 -262925 -251590 -97767 -369749 -502386
16250e02386P1002j1355j67793q0578J30302J83726j2048j24516p8508M0860J09684
$$ -502386 -431384 -442739 -610532 -691110 -560808 -377082 -389130 -513646 -592154 -551294 -441610
16239d41610J59632N8716K1366n8674j57039J88900K78688J07916j0409j83910
$$ -441610 -281978 -223262 -201896 -260570 -417609 -228709 49979 157895 147486 -36424
16229c6424m3283R0526J35510j60816j75950l2219j52120J39600P5916p1392k8823
$$ -36424 -79707 10819 146329 -14487 -190437 -222656 -374776 -235176 -159260 -230652 -259475
16218b59475K17082K76842j52036k23437q7556M3101J08271L5918r0622m0998
$$ -259475 -42393 234449 82413 -141024 -228580 -185479 -77208 -41290 -131912 -172910
16208a72910M3591J72104K31482j2021k51249j20854n1385o9291o5384l4080N8139
$$ -172910 -129319 42785 274267 262246 10997 -109857 -161242 -230533 -295917 -329997 -271858
16197b71858J2929K42028l4365r6410l9419M228J469K27254O6665j68051r1646
$$ -271858 -258929 -16901 -51266 -147676 -187095 -182867 -181398 45856 112521 -55530 -147176
16186a47176J56676j03543K0790l6151Q9260k2397K26478J12136o8819J65966
$$ -147176 9500 -94043 -73253 -109404 -20144 -42541 183937 296073 227254 393220
16176C93220Q2006q3991l18440l9921j13131l1810K65683J20910O4922n0950j39672
$$ 393220 475226 391235 72795 32874 -80257 -112067 153616 274526 339448 288498 148826
16165A48826k24323J975R0882j9305j74463k092m6006j85496j62542N3248L40204
$$ 148826 -75497 -73522 17360 -1945 -176408 -178500 -224506 -410002 -572544 -519296 -179092
16154a79092J77815p5603K4919j07976k06096j74559Q9599m9859l05578J82327
$$ -179092 -1277 -76880 -51961 -159937 -366033 -540592 -450993 -500852 -806430 -624103
16144f24103K13636j2958l671J83117L37768J61479j10178n792j9382r8617J3364
$$ -624103 -410467 -423425 -427096 -243979 93789 255268 145090 139298 119916 21299 34663
16133C4663j74016q686p7845J55219L7122N6365M325l9555m5368o9285K95296
$$ 34663 -139353 -148039 -225884 -70665 -33543 22822 27147 -12408 -57776 -127061 168235
16122A68235J36846j35307n2280J96297m7655l15948P7960K04792J2602R9678
$$ 168235 305081 169774 117494 313791 266136 -49812 28148 232940 245542 345220
16112C45220J32911M0791K49656K12788n0170J78347K63192L18415J98811J19207
$$ 345220 478131 518922 768578 981366 931196 1109543 1372735 1691150 1889961 2009168
16102B009168j51663j93805j66033O1666M2336O9557J42703J37257q1391j76480
$$ 2009168 1857505 1663700 1497667 1559333 1601669 1671226 1813929 1951186 1869795 1693315
16092A693315j31539l52259l88277j63146m1472j56958O1094L9027R6813J05138
$$ 1693315 1561776 1209517 821240 658094 616622 459664 520758 559785 656598 761736
16082G61736J06816j1047p8803k50787O2953j23358k68318j50647o0475K9353
$$ 761736 868552 857505 778702 527915 590868 467510 199192 48545 -11930 17423
16072A7423O7541K07532N6843q2228M8446k6400m7946r1225k35378L9069J11465
$$ 17423 84964 292496 349339 267111 315557 289157 241211 149986 -85392 -46323 65142
16061F5142J71170q5804j4642l3188J22702l9443q3053O7811P2394K0261k6860
$$ 65142 236312 150508 135866 102678 225380 185937 102884 170695 243089 263350 236490
16050B36490N2713m2614J48235l1598Q557j38988k44007q2738j99471o7133J3654
$$ 236490 289203 246589 394824 363226 371783 232795 -11212 -93950 -293421 -360554 -346900
16039c46900K3780J51723n6318l3173O5215K99268L3206K7980J60723k04579k29096
$$ -346900 -323120 -171397 -227715 -260888 -195673 103595 136801 164781 325504 120925 -108171
16028a08171p3877L1993J69243o5986n3265J96242M513j25160J11969J4165K341
$$ -108171 -182048 -150055 19188 -46798 -100063 96179 100692 -24468 87501 101666 104007
16017A04007l8109O2887J43297P3323j14813j78101n1741l09J03451R825J47560
$$ 104007 65898 128785 272082 345405 230592 52491 750 441 103892 113717 261277
16006B61277o5821j16576K5924M3906o8091L5175m4252k45784O289J40386r6462
$$ 261277 195456 78880 104804 148710 80619 115794 71542 -174242 -167953 -27567 -124029
15995a24029O8380O3052k6441k49090j67843K8793K61682J76810j03114k4676
$$ -124029 -55649 7403 -19038 -268128 -435971 -407178 -145496 31314 -71800 -96476
15985i6476k765O2237J07451J70678o3113R1075M3623j89421j47573k00234j3009
$$ -96476 -99241 -37004 70447 241125 178012 269087 312710 123289 -24284 -224518 -237527
15974b37527L65870Q4454j50064k27493j13286J19603j45017o0076J05648J07522
$$ -237527 128343 212797 62733 -164760 -278046 -158443 -303460 -363536 -257888 -150366
15964a50366J21279p2124M1905J01498m7414J41129K2528j28102l5578K21355
$$ -150366 -29087 -101211 -59306 42192 -5222 135907 158435 30333 -5245 216110
15954B16110O4065j63565n6662K4068p9459J93936J79948k26636k92051L2058
$$ 216110 280175 116610 59948 84016 4557 198493 378441 151805 -140246 -108188
15944a08188o5118N26J32311k17824j17245M8790J64055j1976m8873M8131j1057
$$ -108188 -173306 -172780 -40469 -258293 -375538 -326748 -162693 -174669 -223542 -175411 -186468
15933a86468Q4397N7868J02430J17166r7021j33363j64572j2135K0592J27611
$$ -186468 -102071 -44203 58227 175393 78372 -54991 -219563 -231698 -211106 -83495
15923h3495Q4121o218l8901p2885p7436q8704k9655R6042Q742P9721K4445r5721
$$ -83495 626 -5592 -44493 -117378 -194814 -283518 -313173 -217131 -208389 -128668 -104223 -199944
15911a99944j19062L4956J90509O3042j65526J36963O5711l5906j79646j29930
$$ -199944 -319006 -284050 -93541 -30499 -196025 -59062 6649 -29257 -208903 -338833
15901c38833K4757K92309K35670J01287K53439n6739j68867o6233l8084j68308
$$ -338833 -314076 -21767 213903 315190 568629 511890 343023 276790 238706 70398
15891G0398j32893q0005m980j2659j21158r9466j79131J43594J60633l842j9945
$$ 70398 -62495 -142500 -147480 -160139 -281297 -380763 -559894 -416300 -255667 -259509 -279454
15880b79454q5760O8812L70386R3712l6670j44340j25203j22177K2774R1686O6528
$$ -279454 -365214 -296402 73984 167696 131026 -13314 -138517 -260694 -237920 -146234 -79706
15869g9706K6062m349J39393r0768N2358j564j06472j95210n8317R6991M7623
$$ -79706 -53644 -57993 81400 -9368 42990 41426 -65046 -260256 -318573 -221582 -173959
15858a73959o1659L6365P0951K65735j07863J7950K19333M155j19459k28415q8052
$$ -173959 -235618 -199253 -128302 137433 29570 47520 266853 271008 151549 -76866 -164918
15847a64918J56643O610Q075n7063J8739L7586j9718J4772j37487k19831j23565
$$ -164918 -8275 -1665 6410 -50653 -31914 5672 -14046 726 -136761 -356592 -480157
15836d80157J82765J64823j0163k089j1904J7844M9246j26286k5929J2212J07287
$$ -480157 -297392 -132569 -142732 -144821 -156725 -138881 -89635 -215921 -241850 -229638 -122351
15825a22351O9632N1607j49111K439K51J20982J18014n5093p0939M6979K52345
$$ -122351 -52719 -1112 -150223 -147784 -147533 -26551 91463 36370 -34569 12410 264755
15814B64755J841p8415l09440J8868L6261j37030J1001J05332q4016r0234r6908
$$ 264755 266596 188181 -121259 -102391 -66130 -203160 -192159 -86827 -170843 -261077 -357985
15803c57985K24850P5009j21032Q7837k7813N6580k09780j86731O6989K08426
$$ -357985 -133135 -58126 -179158 -91321 -119134 -62554 -272334 -459065 -392076 -183650
15793a83650R2763m8621P9991m0107K8323J5976N785L7351k3247M929m8367o1127
$$ -183650 -90887 -139508 -59517 -99624 -71301 -55325 -49540 -12189 -35436 -30507 -78874 -140001
15781a40001N2547K09033N5795j45852o8734J94225K13695M6622q1346k11325
$$ -140001 -87454 121579 177374 31522 -37212 157013 370708 417330 335984 124659
15771A24659J2813j57125r1319J22465J60132k68863r0844J48658K25351R58q7902
$$ 124659 137472 -19653 -110972 11493 171625 -97238 -188082 -39424 185927 186885 98983
15760I8983J40856j5768M6876n2580r9158k301k4490j28151P4874J06993j25762
$$ 98983 239839 224071 270947 218367 119209 116908 92418 -35733 39141 146134 20372
15749B0372l0278P1842J86381j01143k12926k25706J76146K56670J23948J07221
$$ 20372 -9906 61936 248317 147174 -65752 -291458 -115312 141358 265306 372527
15739C72527m007j01563j49438J07544J40009m3674k24108j71527j80390l5230
$$ 372527 368520 266957 117519 225063 365072 321398 97290 -74237 -254627 -289857
15729b89857J63818Q0711m6433j32740K06779R4165p9157r1313m4460K34819j08473
$$ -289857 -126039 -45328 -91761 -224501 -17722 76443 -2714 -94027 -138487 96332 -12141
15718a2141O2566N3321q7028j24745Q3116k16095J10932O4845M0361j93550P7811
$$ -12141 50425 103746 16718 -108027 -24911 -241006 -130074 -65229 -24868 -218418 -140607
15707a40607J30444L4228j04053j42947R4042n447P111k6621J04297J62622r5233
$$ -140607 -10163 24065 -79988 -222935 -128893 -134340 -127229 -153850 -49553 113069 17836
15696A7836k48476k1394J12063J5275m1017J6184p4257M7005L427k4601k8504
$$ 17836 -230640 -252034 -139971 -124696 -165713 -149529 -223786 -176781 -173354 -197955 -226459
15685b26459J88600K41800j47911k65722k420J64553J57250k876N4820M3269R975
$$ -226459 -37859 203941 56030 -209692 -212112 -47559 109691 106815 161635 204904 214879
15674B14879m9182m0985j05465O8941l6165p3212m1360p5669r2983J70543P2440
$$ 214879 165697 124712 19247 88188 52023 -21189 -62549 -138218 -231201 -60658 11782
15663A1782j17398K14555q0796j18293j22455l18965L3913K28089K66872L6222
$$ 11782 -105616 108939 28143 -90150 -212605 -531570 -497657 -269568 -2696 33526
15653C3526r59j45054J03764m4884L9582q0843q4688K04956l122N2174M1789K0394
$$ 33526 32567 -112487 -8723 -53607 -14025 -94868 -179556 25400 22278 74452 116241 136635
15641A36635m9572n1372p064j5688J81302m5464K0080K5461j20939j9830Q8247
$$ 136635 87063 35691 28627 12939 194241 148777 168857 194318 73379 53549 141796
15630A41796j04942J42891R8021J84717j57894N4800j05731O0840P538m1570r1533
$$ 141796 36854 179745 277766 462483 304589 359389 253658 314498 322036 280466 188933
15619A88933K15888m6320j33849j80339J11725K4214k8180r5758J33701K6410
$$ 188933 404821 358501 224652 44313 156038 180252 152072 56314 190015 216425
15609B16425j42243j63928j14423p394N8740R04Q0911J74753j42207r4107L2759
$$ 216425 74182 -89746 -204169 -211563 -152823 -151919 -71008 103745 -38462 -132569 -99810
15598i9810J41711N2209J1004o7648K413J98066M2415j47928J6727j17354R808
$$ -99810 41901 94110 105114 37466 39879 237945 280360 132432 149159 31805 41613
15587D1613L0698j0668n9541j21875r7333Q9592n7348j8397J56171J19268J23637
$$ 41613 72311 61643 2102 -119773 -217106 -127514 -184862 -203259 -47088 72180 195817
15576A95817j04929j71683J21264K9663p4599l0842J58575j46569j74077L8282
$$ 195817 90888 -80795 40469 70132 -4467 -35309 123266 -23303 -197380 -159098
15566a59098J1751j14572p7379M2040K84569m1907J23856o7651q1054K8006j6177
$$ -159098 -147347 -261919 -339298 -297258 -12689 -54596 69260 1609 -79445 -51439 -67616
15555f7616J90929K7942q984p6985k0152K2138m6795J1396J35319O642J36204
$$ -67616 123313 151255 142271 65286 45134 67272 20477 31873 167192 173834 310038
15544C10038m4336M9387q7190j71476K3532M0880p1949m7924J07902J69564o8043
$$ 310038 265702 315089 227899 56423 79955 120835 48886 962 108864 278428 210385
15533B10385J3973N240j34002n71651o5269K26421J90096M6749n472o0309J8713
$$ 210385 224358 229598 95596 -476055 -541324 -314903 -124807 -78058 -83530 -143839 -125126
15522a25126R5845r2360P6256m9210n6058j14781J83093K21735j04592j08303
$$ -125126 -29281 -121641 -45385 -94595 -150653 -265434 -82341 139394 34802 -73501
15512g3501l7248m7788J00640q8542P7708Q859K35915N042k84170q5806K5800
$$ -73501 -110749 -158537 -57897 -146439 -68731 -59872 176043 181085 -103085 -188891 -163091
15501a63091J54060j88378j50055n8725J51358K96408N9769j22402R4865n8358
$$ -163091 -9031 -197409 -347464 -406189 -254831 41577 101346 -21056 73809 15451
15491A5451j59880M3640L07566J0185k79393K8043J98763j28509k39995J01731
$$ 15451 -144429 -100789 206777 216962 -62431 -34388 164375 35866 -204129 -102398
15481a02398k31407j51874J00620L06869J83547l6452O389J21308r7724j2202
$$ -102398 -333805 -485679 -385059 -78190 105357 68905 75294 196602 98878 86676
15471H6676n7878M1716J09787k182k32401j31954k69485n3308q479J18192P3141
$$ 86676 28798 70514 180301 178119 -54282 -186236 -455721 -509029 -517508 -399316 -326175
15460c26175J32085K47276o7234q0187q2375Q4848K9425l4396r9449j1963P7545
$$ -326175 -194090 53186 -14048 -94235 -176610 -91762 -62337 -96733 -196182 -208145 -130600
15449a30600L7418M9527P5622j7318k8373O5232J82972j17047l87914k19626l3745
$$ -130600 -93182 -43655 31967 14649 -13724 51508 234480 117433 -270481 -490107 -523852
15438e23852J23946K57852r3332p9965K061O0033M7895J4930N2491M9107N8045
$$ -523852 -399906 -142054 -235386 -315351 -313290 -253257 -205362 -190432 -137941 -88834 -30789
15427c0789j2169K7334r7338j43007R6151J33635J36689o713k12430J71092p7515
$$ -30789 -42958 -15624 -112962 -255969 -159818 -26183 110506 103793 -108637 62455 -15060
15416a5060q1118J9758P9812M5449j96619o8958l7411j2610q7352K2729P6964
$$ -15060 -96178 -76420 3392 48841 -147778 -216736 -254147 -266757 -354109 -331380 -254416
15405b54416K90248J54444j53903k4711k6761j97162j01421R9130J10722k75022
$$ -254416 35832 190276 36373 11662 -15099 -212261 -313682 -214552 -103830 -378852
15395c78852j25446J65014J87544m634J8459N5879O7634O7705j26781j44828r4888
$$ -378852 -504298 -339284 -151740 -156374 -137915 -82036 -14402 53303 -73478 -218306 -313194
15384c13194R5152K107Q7964J83483n441l5152r1015k44589M7730J10633J20032
$$ -313194 -218042 -215935 -127971 55512 50071 14919 -76096 -320685 -272955 -162322 -42290
15373d2290J42305K26334j2361j51373l42291q0178Q052J79166K91748p5042j23274
$$ -42290 100015 326349 313988 162615 -179676 -259854 -251802 -72636 219112 144070 20796
15362B0796R5613j12520j03843j20674L5261J51865J58203P6536m3647p2825j61919
$$ 20796 116409 3889 -99954 -220628 -185367 -33502 124701 201237 157590 84765 -77154
15351g7154p8613M2969J21923j19860l927K5769j67049J9125K65858L7325m5299
$$ -77154 -155767 -112798 9125 -110735 -114662 -88893 -255942 -236817 29041 66366 21067
15340B1067o8896N88P5655P7912J29498j71113k04114J17825j28082J34205R0120
$$ 21067 -47829 -47241 28414 106326 235824 64711 -139403 -21578 -149660 -15455 74665
15329G4665J08129j01781q7234K00132M0806K481j61337k06713j4304J52452M40
$$ 74665 182794 81013 -6221 193911 234717 237198 75861 -130852 -145156 7296 7736
15318G736j67684n2734O0293p3966r159J4652L8381K7584o5167J67352K42358
$$ 7736 -159948 -212682 -152389 -226355 -235514 -220862 -182481 -154897 -220064 -52712 189646
15307A89646O9235k68459j26873J73690Q4536J04892l6495j3535J28790J27665
$$ 189646 258881 -9578 -136451 37239 121775 226667 190172 176637 305427 433092
15297D33092k96110j09789j8135k7274M4158M4175j01473j978k7372j55818P2333
$$ 433092 136982 27193 9058 -18216 25942 70117 -31356 -33334 -60706 -216524 -144191
15286a44191J74333J48Q384m9656J24670m0771p3683m5393O2824r1244j45648
$$ -144191 30142 30290 38674 -10982 113688 72917 -766 -46159 16665 -74579 -220227
15275b20227Q0208L6226k3954K35368Q8364M1813J13896k24448k20470O2464j03688
$$ -220227 -140019 -103793 -127747 107621 195985 237798 351694 127246 -93224 -30760 -134448
15264a34448p8449O4547k12859o979J53432J64127j57594R2612K13673P2949J6485
$$ -134448 -212897 -148350 -361209 -368188 -214756 -50629 -208223 -115611 98062 171011 187496
15253A87496q5233P1605j49586j21958R6503j68251j43457j7792n730K28060J44812
$$ 187496 102263 173868 24282 -97676 -1173 -169424 -312881 -330673 -336403 -108343 36469
15242C6469j8854k53887n1369N7066J20103N8064J47858m4073K8779n5593j49158
$$ 36469 17615 -236272 -287641 -230575 -110472 -52408 95450 51377 80156 24563 -124595
15231a24595j13334j61628k07476J67474J86172P7622j69548J98644m5282j33573
$$ -124595 -237929 -399557 -607033 -439559 -253387 -175765 -345313 -146669 -191951 -325524
15221c25524j10131j91837L00871J06049L6778M6606j04423P9590J77031k1157
$$ -325524 -435655 -627492 -326621 -220572 -183794 -137188 -241611 -162021 15010 -6147
15211f147j70623o7361J32346K26400k54986R0547l2019r042k7910K3270j26482
$$ -6147 -176770 -244131 -111785 114615 -140371 -49824 -81843 -90885 -118795 -95525 -222007
15200b22007R8635J42812l1465k00669k2877L06605K6532m3077j4456k17089k01421
$$ -222007 -123372 19440 -12025 -212694 -235571 71034 97566 54489 40033 -177056 -378477
15189c78477K16144J29906q8296L4058j55326K8155K7539K60432J47378j2775
$$ -378477 -162333 -32427 -120723 -86665 -241991 -213836 -186297 74135 221513 208738
15179B08738r8582j84268j75421k0832J63337Q7109R4175O7322k74683j82159
$$ 208738 110156 -74112 -249533 -270365 -107028 -19919 74256 141578 -133105 -315264
15169c15264Q8478K5928j17712m1468R9285P4901J26529k3007j45856J2523O0107
$$ -315264 -226786 -200858 -318570 -360038 -260753 -185852 -59323 -82330 -228186 -215663 -155556
15158a55556Q1232j14412j37414p8676L6342J23932J29804j80979M1202J53950
$$ -155556 -74324 -188736 -326150 -404826 -368484 -244552 -114748 -295727 -254525 -100575
15148a00575j26090L315o6766K06768K92047j00425j30208k68417j77025J18159
$$ -100575 -226665 -223350 -290116 -83348 208699 108274 -21934 -290351 -467376 -349217
15138c49217J80058J39034L1419L2739l7195P1268p5437j59805j00191r3138J7805
$$ -349217 -169159 -30125 1294 34033 -3162 68106 -7331 -167136 -267327 -360465 -342660
15127c42660J16749O9242R9913j2936m6711K17814J24816j1412k9130k659q4445
$$ -342660 -225911 -156669 -56756 -69692 -116403 101411 226227 214815 185685 183026 98581
15116I8581Q2969P156k75129r3588J49863j17880P2013j25325k00379J08872J77391
$$ 98581 181550 188706 -86423 -180011 -30148 -148028 -76015 -201340 -401719 -292847 -115456
15105a15456K37533J1592n3523K8918o3441N6378j29466l00553L4451J69417p6967
$$ -115456 122077 133669 80146 109064 45623 102001 -27465 -328018 -293567 -124150 -201117
15094b01117j61740L12976K34446m2229l8984J09932Q4061j41941j62228j10543
$$ -201117 -362857 -49881 184565 142336 103352 213284 297345 155404 -6824 -117367
15084a17367J27189P6964K8414J62876j82135r3917M7078r5788k12257N8730K1508
$$ -117367 9822 86786 115200 278076 95941 2024 49102 -46686 -258943 -200213 -178705
15073a78705J68365J91598m4114k01060j85652p6693r4836j21136Q4127K56277
$$ -178705 -10340 181258 137144 -63916 -249568 -326261 -421097 -542233 -458106 -201829
15063b01829K83731o3900r6158l2970j00914l7216k08404j51008J65865Q5984
$$ -201829 81902 18002 -78156 -111126 -212040 -249256 -457660 -608668 -442803 -356819
15053c56819J72611L48631O8347O0651k9668o6524k8808j98349J175j04251r3545
$$ -356819 -184208 164423 232770 293421 263753 197229 168421 -29928 -28753 -133004 -226549
15042b26549Q9951r8759j06142R1079J3909N6359Q4179O2658p7648R9470r713
$$ -226549 -136598 -235357 -341499 -250420 -236511 -180152 -95973 -33315 -110963 -11493 -21206
15031b1206j09585L6961m1877r8826M2314k0513J13431Q0746l2008L1444j94328
$$ -21206 -130791 -93830 -135707 -234533 -192219 -212732 -99301 -18555 -50563 -19119 -213447
15020b13447M0985K37440j66380k16953o0327J04490J46124J88015k67940q0466
$$ -213447 -172462 64978 -101402 -318355 -378682 -274192 -128068 59947 -207993 -288459
15010b88459J95454P9551l2959J8774J52562J38652q7843P166J75483j23706k34694
$$ -288459 -93005 -13454 -46413 -27639 124923 263575 175732 182898 358381 234675 -19
14999a9n0170J51643J33065Q3789j81757n0009L3210j02884j29332J9909J35331
$$ -19 -50189 101454 234519 318308 136551 86542 119752 16868 -112464 -92555 42776
14988D2776J23368P7251J01078j88689j49511k3421j3447J4049j46183N4477K20017
$$ 42776 166144 243395 344473 155784 6273 -17148 -30595 -16546 -162729 -108252 111765
14977A11765o516k59309j98131J50652K1616O6758o1655K985Q6924j3782j62898
$$ 111765 105249 -154060 -352191 -201539 -179923 -113165 -174820 -171835 -84911 -98693 -261591
14966b61591j42655J33349N568J9424Q4747J734O1397j37216p6958K10430K92453
$$ -261591 -404246 -270897 -265329 -245905 -161158 -159424 -98027 -235243 -312201 -101771 190682
14955A90682M575O930k17020o8455K539L117J73196J76204j69985k08255q0700
$$ 190682 195257 202187 -14833 -83288 -80749 -77632 95564 271768 101783 -106472 -187172
$$ [...]
##END NTUPLES=NMR SPECTRUM
##END=
