##TITLE=Analysis number 311511
Compound Code cc 38509
Book Reference 335/192
Project Code qc-cat
Chemist Name davee
##JCAMPDX= 6.0         $$ Bruker NMR JCAMP-DX V2.0
##DATA TYPE= NMR SPECTRUM
##DATA CLASS= NTUPLES
##ORIGIN= Bruker BioSpin GmbH
##OWNER= NMR
$$ XWIN-NMR		Version 3.5
$$ Mon Jul 11 09:39:44 2005 GMT Daylight Time (UT+1h)  MAYBRIDGE\NMR@NMR_250MHZ
##.OBSERVE FREQUENCY= 250.131544655141
##.OBSERVE NUCLEUS= ^1H
##.ACQUISITION MODE= SIMULTANEOUS (DQD)
##.ACQUISITION SCHEME= undefined
##.AVERAGES= 16
##.DIGITISER RES= 18
##SPECTROMETER/DATA SYSTEM= dpx250
##.PULSE SEQUENCE= zg30
##.SOLVENT NAME= CDCl3
##.SHIFT REFERENCE= (INTERNAL, CDCl3, 0, 16.522)
##AUDIT TRAIL= $$ (NUMBER, WHEN, WHO, WHERE, WHAT)
$$ ##TITLE= Audit trail, XWIN-NMR		Version 3.5
$$ ##JCAMPDX= 5.01
$$ ##ORIGIN= Bruker BioSpin GmbH
$$ ##OWNER= NMR
$$ C:\u/data/dgb/nmr/ADRS/5580/pdata/1/auditp.txt
$$ ##AUDIT TRAIL=  $$ (NUMBER, WHEN, WHO, WHERE, WHAT)
(   1,<2005-07-11 09:39:08.11 +100>,<MAYBRIDGE\NMR>,<NMR_250MHZ>,
      <created by zg, POWCHK disabled, PULCHK disabled
       configuration hash MD5:
       62 19 C7 07 E1 42 D1 B7 37 6C 3D D0 77 39 F9 E6
       data hash MD5: 64K
       0A 1A 08 58 5F 22 AE 93 84 59 91 1C 1E 26 CB F6>)
(   2,<2005-07-11 09:39:25.64 +100>,<MAYBRIDGE\NMR>,<NMR_250MHZ>,
      <Start of raw data processing
       ef LB = 0.3 FT_mod = 6 PKNL = 1 SI = 32K 
       data hash MD5: 32K
       BF AB F3 62 97 0C ED D9 78 0D C0 B5 29 8B 58 28>)
(   3,<2005-07-11 09:39:29.04 +100>,<MAYBRIDGE\NMR>,<NMR_250MHZ>,
      <apk 
       data hash MD5: 32K
       BA DF F7 B5 AB 72 91 B5 50 85 BF 76 DF CC 04 1A>)
(   4,<2005-07-11 09:39:30.52 +100>,<MAYBRIDGE\NMR>,<NMR_250MHZ>,
      <abs ABSG = 5 
       data hash MD5: 32K
       8B AE 61 EC 43 DD A9 D2 4D A9 09 A5 44 10 3F 94>)
$$ ##END=
$$ 
$$ hash MD5
$$ 07 8C 4A 3D 53 9E DD 00 DB F9 33 34 43 4A CD A2
##$RELAX= 
##$RELAX= 
##$RELAX= 
##$RELAX= 
##$RELAX= 
##$RELAX= 
##$RELAX= 
$$ Bruker specific parameters
$$ --------------------------
##$DU= <C:\u>
##$EXPNO= 5580
##$NAME= <ADRS>
##$PROCNO= 1
##$TYPE= <nmr>
##$USER= <dgb>
##$AMP= (0..31)
100 100 100 100 100 100 100 100 100 100 100 100 100 100 100 100 100 100 
100 100 100 100 100 100 100 100 100 100 100 100 100 100 
##$AQSEQ= 0
##$AQ_mod= 3
##$AUNM= <au_zg>
##$AUTOPOS= <7 >
##$BF1= 250.13
##$BF2= 250.13
##$BF3= 250.13
##$BF4= 250.13
##$BF5= 500.13
##$BF6= 500.13
##$BF7= 500.13
##$BF8= 500.13
##$BYTORDA= 1
##$CFDGTYP= 0
##$CFRGTYP= 5
##$CHEMSTR= <none>
##$CNST= (0..31)
1 1 145 1 1 1 1 1 1 1 1 1 1 1 1 1 1 1 1 1 1 1 1 1 1 1 1 1 1 1 1 1 
##$CPDPRG= <>
##$CPDPRG1= <>
##$CPDPRG2= <>
##$CPDPRG3= <>
##$CPDPRG4= <mlev>
##$CPDPRG5= <mlev>
##$CPDPRG6= <mlev>
##$CPDPRG7= <mlev>
##$CPDPRG8= <mlev>
##$CPDPRGB= <>
##$CPDPRGT= <>
##$D= (0..31)
0 1 0 0 0 0 0 0 0 0.06 0 0 0 0 0 0 0.0002 0 0 0 0 0 0 0 0 0 0 0 0 0 0 
0 
##$DATE= 1121071146
##$DBL= (0..7)
120 120 120 120 120 120 120 120 
##$DBP= (0..7)
150 150 150 150 150 150 150 150 
##$DBP07= 0
##$DBPNAM0= <>
##$DBPNAM1= <>
$$ [...]
##$SUBNAM7= <"">
##$SUBNAM8= <"">
##$SUBNAM9= <"">
##$SW= 20.6930455092707
##$SWIBOX= (0..15)
0 0 3 0 0 0 0 0 0 0 0 0 0 0 0 0 
##$SW_h= 5175.983436853
##$TD= 65536
##$TD0= 1
##$TE= 295.16
##$TE2= 300
##$TE3= 300
##$TEG= 300
##$TL= (0..7)
0 120 120 120 120 120 120 120 
##$TP= (0..7)
150 150 150 150 150 150 150 150 
##$TP07= 0
##$TPNAME0= <>
##$TPNAME1= <>
##$TPNAME2= <>
##$TPNAME3= <>
##$TPNAME4= <>
##$TPNAME5= <>
##$TPNAME6= <>
##$TPNAME7= <>
##$TPOAL= (0..7)
0.5 0.5 0.5 0.5 0.5 0.5 0.5 0.5 
##$TPOFFS= (0..7)
0 0 0 0 0 0 0 0 
##$TUNHIN= 0
##$TUNHOUT= 0
##$TUNXOUT= 0
##$USERA1= <user>
##$USERA2= <user>
##$USERA3= <user>
##$USERA4= <user>
##$USERA5= <user>
##$V9= 5
##$VALIST= <valist>
##$VCLIST= <CCCCCCCCCCCCCCC>
##$VD= 0
##$VDLIST= <DDDDDDDDDDDDDDD>
##$VPLIST= <PPPPPPPPPPPPPPP>
##$VTLIST= <TTTTTTTTTTTTTTT>
##$WBST= 1024
##$WBSW= 4
##$XGAIN= (0..3)
0 0 0 0 
##$XL= 0
##$YL= 0
##$YMAX_a= 502566
##$YMIN_a= -745070
##$ZGOPTNS= <>
##$ZL1= 120
##$ZL2= 120
##$ZL3= 120
##$ZL4= 120
##$ABSF1= 16.522
##$ABSF2= -4.171173
##$ABSG= 5
##$ABSL= 3
##$ALPHA= 0
##$AQORDER= 0
##$ASSFAC= 0
##$ASSFACI= 0
##$ASSFACX= 0
##$ASSWID= 0
##$AUNMP= <proc_1d>
##$AZFE= 0.1
##$AZFW= 0.1
##$BCFW= 0
##$BC_mod= 0
##$BYTORDP= 0
##$COROFFS= 0
##$CY= 12.5
##$DATMOD= 1
##$DC= 0
##$DFILT= <>
##$DTYPP= 0
##$F1P= 14.0000005364418
##$F2P= -0.99999901652339
##$FCOR= 0.5
##$FTSIZE= 32768
##$FT_mod= 6
##$GAMMA= 0
##$GB= 0
##$INTBC= 1
##$INTSCL= 1
##$ISEN= 128
##$LB= 0.3
##$LEV0= 0
##$LPBIN= 0
##$MAXI= 10000
##$MC2= 0
##$MEAN= 0
##$ME_mod= 0
##$MI= 0
##$NCOEF= 0
##$NC_proc= -4
##$NLEV= 6
##$NOISF1= 0
##$NOISF2= 0
##$NSP= 0
##$NTH_PI= 0
##$NZP= 0
##$OFFSET= 16.522
##$PC= 1
##$PHC0= -81.11738
##$PHC1= 6.557302
##$PH_mod= 1
##$PKNL= yes
##$PPARMOD= 0
##$PSCAL= 4
##$PSIGN= 0
##$REVERSE= no
##$SF= 250.13
##$SI= 32768
##$SIGF1= 0
##$SIGF2= 0
##$SINO= 400
##$SIOLD= 32768
##$SREGLST= <1H.CDCl3>
##$SSB= 0
##$STSI= 32768
##$STSR= 0
##$SW_p= 5175.98343685301
##$SYMM= 0
##$S_DEV= 0
##$TDeff= 65536
##$TDoff= 0
##$TI= <Analysis number 999999
Compound Code 99
Book Reference 9
Project Code 9>
##$TILT= no
##$TM1= 0
##$TM2= 0
##$TOPLEV= 0
##$USERP1= <user>
##$USERP2= <user>
##$USERP3= <user>
##$USERP4= <user>
##$USERP5= <user>
##$WDW= 1
##$XDIM= 32768
##$YMAX_p= 293703247
##$YMIN_p= -431354
$$ End of Bruker specific parameters
$$ ---------------------------------
##NTUPLES= NMR SPECTRUM
##VAR_NAME=  FREQUENCY,     SPECTRUM/REAL,   SPECTRUM/IMAG
##SYMBOL=    X,             R,               I
##VAR_TYPE=  INDEPENDENT,   DEPENDENT,       DEPENDENT
##VAR_FORM=  AFFN,          ASDF,            ASDF
##VAR_DIM=   32768,         32768,           32768
##UNITS=     HZ,            ARBITRARY UNITS, ARBITRARY UNITS
##FACTOR=    0.157963299565203, 1,           1
##FIRST=     4132.6476996994, 0,             0
##LAST=      -1043.33573715361, 0,           0
##MIN=       -1043.33573715361, -431354,     0
##MAX=       4132.6476996994, 293703247,     0
$$ Real data points
##PAGE= N=1
##DATA TABLE= (X++(R..R)), XYDATA
$$ [...]
19523 25940 40854 22621 20524 7690 -9970 -1921 8952 -8556 -21072 -27252 -37472 -45290
19511 -45290 -28193 -16614 -33743 -47192 -48593 -57505 -46337 -39971 -28761 -26837 -35930 -17805 3939
19498 3939 -27170 -43655 -26454 -24248 -15640 -25433 -19896 -43170 -44316 -41967 -28110 -16876 -19382
19485 -19382 -40994 -38266 -47866 -68186 -44853 392 22590 30683 -2681 -32713 -31160 -8107
19473 -8107 -523 -7875 -29399 -37502 -34688 -7367 -19028 -31371 -23054 -38754 -46571 -20384 -16199
19460 -16199 -29324 -31110 -22400 3536 10661 -17229 2969 33593 30352 30890 -6505 -20450 1628
19447 1628 -13488 -24152 -20227 7522 23294 19016 9194 -3879 -2333 -9637 -4405 10788 9189
19434 9189 5049 14857 10574 -11690 -12097 20095 37103 21534 10576 -15175 -24186 3694 -13706
19421 -13706 -11888 9943 3981 -11967 -11648 -8694 1790 15435 7841 -15374 -26874 -40442 -60437
19408 -60437 -54393 -49335 -25313 -6525 -874 -13411 -23178 -21244 -31196 -30141 -13855 -1382 -3152
19395 -3152 24914 37394 39683 27198 26421 23695 13489 17461 17517 -12529 -25922 -37053 -52406
19382 -52406 -44046 -24633 -23620 -36139 -34796 -30258 -23970 -20884 -17539 -16616 -27751 -63797 -51519
19369 -51519 -1922 30357 37823 35048 22255 24745 -1789 -6894 7301 -2549 -28999 -50067 -53945
19356 -53945 -46635 -24251 -27871 -21071 2890 20881 34815 21029 34591 36291 32534 22666 24807
19343 24807 18379 21297 -3803 -30583 -37107 -40972 -35646 -29864 -35010 -30247 -22302 3244 6920 1190
19329 1190 7302 2343 -5692 -16556 -31133 -24243 -23538 -27646 -17104 -53076 -31648 -5541 -20188
19316 -20188 4889 10525 -21280 -25842 -1958 16848 -12948 -17418 -7515 22021 27212 -26432 -30186
19303 -30186 -15933 -16757 -31878 -29239 -24880 -40266 -44783 -27536 -29514 -44054 -3336 14642 -3837
19290 -3837 -27828 -16422 -31752 -34777 -14725 21983 47391 42740 7858 -2626 10688 46391
19278 46391 34390 3387 -3485 411 -34294 -14613 -11007 -15916 -38585 -35678 -28179 -45027 -25938
19265 -25938 5873 16949 12523 17018 11379 -1544 -12005 -15520 -11052 -15355 4869 3808 10339
19252 10339 23573 9088 -19298 -25014 -27553 -17192 -21618 -29216 -13671 -8058 4399 -4276 -8430
19239 -8430 -11089 -26632 -24025 -43620 -55841 -22825 -23542 -44261 -53130 -54794 -54227 -62896 -50746 -28113
19225 -28113 -12456 -20328 -9546 -12941 -10177 4607 6157 -13352 -10764 -8411 -13024 -17953 -3710
19212 -3710 5169 -16502 -25244 -23536 -11785 -23949 -28497 -5004 -501 -887 -5661 -21869 -11335
19199 -11335 -8390 12386 26779 27406 4193 -15768 -18501 -15523 -36208 -46051 -58330 -60229 -42132
19186 -42132 3945 10943 -13136 -32824 -37258 -10647 -9412 -22591 -12116 484 -252 -1752 22560
19173 22560 15258 -7948 -278 7089 -16640 -9500 12616 23124 48384 53603 51414 28227 31477
19160 31477 28183 -101 6822 915 -4680 -8172 -14936 -7476 -24136 -31873 -54548 -51324 -48912 -41549
19146 -41549 -35895 -21877 -15536 474 8141 21220 34041 45696 57107 54701 28656 -6377
19134 -6377 -19083 -36958 -35126 -47472 -41815 -33285 -20065 -16494 -22014 84 -7991 -6566 -1268
19121 -1268 8232 -920 -39774 -54196 -52349 -53952 -53321 -18727 -19499 -9247 -6863 8656 14236 -9569
19107 -9569 -44556 -57531 -71382 -64447 -45733 -15671 9677 -17110 -19420 -9549 -2586 -22156 -27278
19094 -27278 -10894 -6029 9688 15716 568 -2106 -7746 -1103 -15245 -7668 -20907 -1465 15458
19081 15458 -3643 -6783 -7847 -12206 -14190 8677 11944 7640 3331 -9234 -12364 -27641 -11989
19068 -11989 6044 7908 17225 33430 18097 15541 28352 3956 -9354 -5171 3816 23564 18877
19055 18877 -17773 -21722 -1854 4338 -19469 -25281 -32482 -34841 -12557 1693 2691 -19840 -14300
19042 -14300 5435 22194 29688 10409 -16875 -20887 -8048 6617 11896 -11145 -16845 -19950 -39671
19029 -39671 -48091 -17125 7964 18823 3032 -9964 -12167 25311 29968 30053 25740 15909 35051
19016 35051 22994 11235 12202 -35145 -54204 -33295 -34695 -19742 -18122 3622 -4909 8741 92
19003 92 -7141 440 -18883 -37407 -17898 -7363 21722 20128 -2441 -23204 -30747 -18145 26152
18990 26152 29223 24875 15552 11601 9828 12657 14003 -5256 520 -7624 -8966 -23782 -30126 -24982
18976 -24982 -660 6435 -7748 -37371 -38642 -28949 -23646 -20394 513 -19642 -6866 27265 11188
18963 11188 12798 21594 8189 -16432 -27736 -27844 -9406 21024 20608 -5582 -22994 -52223 -85952
18950 -85952 -92985 -80856 -71962 -51443 -22480 -24968 -42776 -34631 -36077 -40838 -51952 -26153 10930
18937 10930 8450 -137 -24927 -34079 -27235 -22123 -12088 -3452 6280 -14510 -41764 -38263 -36749
18924 -36749 -35039 -10865 6101 13267 -15467 -24557 -1576 -12276 8240 4890 -17692 -40520
18912 -40520 -64140 -49402 -36263 -42697 -26159 1520 4142 -11087 -3269 -22109 -26319 -39541
18900 -39541 -24756 -17352 -13798 -15147 -5048 -394 23162 22905 1963 -1722 -13757 -8447 -15516
18887 -15516 -14674 -19340 -19059 -16168 -8741 6163 -3130 -3206 -21435 -13112 1976 11609 24056 58026
18873 58026 53752 45135 36930 43325 23585 21193 47522 58839 53251 23087 1512 4682 -18019
18860 -18019 -19215 -13290 2818 5529 -1719 6342 4490 -14071 -22576 -25574 -34251 -18474 4470
18847 4470 -1186 -29161 -40727 -26227 -7807 -474 8250 -7634 -13254 -15229 -14175 -5815 14459
18834 14459 9718 -26837 -24308 10626 35676 8072 -9073 -21758 -43739 -48330 -29233 -6778
18822 -6778 28322 20240 1085 2941 14829 24255 12098 7204 15246 34437 34450 -15938 -6558 21302
18808 21302 22046 -100 -4849 -25817 -52240 -49368 -4835 4713 -17577 -30583 -35576 -12067 -6290
18795 -6290 -4852 -17963 -16827 -23515 -35681 -54126 -61708 -43871 -12250 1602 40064 40666 34657
18782 34657 27606 21925 8133 -10812 -25683 -25935 18607 44827 39926 21062 6493 23320 40138
18769 40138 96771 131737 123794 134855 129491 124397 125861 76953 60231 47142 25 -22080
18757 -22080 -3760 35671 43117 20016 20686 32781 22171 -18485 -11392 -12985 -12818 -12111 -9016 -10916
18743 -10916 14944 30 -36091 -41773 -1290 28671 44082 55695 42051 46286 38549 21532
18731 21532 17530 25122 22448 13623 11140 25457 13109 10046 18561 -8675 -13440 12370 22870
18718 22870 30753 29668 50961 61670 31279 18433 4248 -7705 -9474 22947 19730 14711 9168
18705 9168 25143 13440 13466 5939 2622 14781 24041 34563 27202 7631 7000 6184 9806 13520
18691 13520 26934 40160 43559 31091 3062 8350 -3640 -17778 6120 27632 46091 43283
18679 43283 30165 19557 -11576 -13528 -20838 -2682 6949 23384 58095 54035 37733 -7860
18667 -7860 -11392 -18230 -26120 6396 24746 11724 17210 12797 22922 33155 29196 20519 -11271
18654 -11271 -10077 7284 2084 -4490 -1124 9056 37054 25210 14422 30988 18733 -6665
18642 -6665 5268 31641 59192 62501 41071 38249 27450 -17366 -13900 93 -7880 -8548 5236
18629 5236 12688 23690 20405 6640 -2779 -18986 -29447 -22371 -71 1473 7064 12823 2385
18616 2385 -21133 8288 19502 5593 -14721 -25568 3565 31885 60037 62010 59412 47198
18604 47198 26041 41698 44029 21692 22172 32409 34894 31670 56562 70216 64198 66905 93239
18591 93239 145163 182480 221019 275628 304455 287384 273249 249489 230511 195466 158892 138279
18579 138279 136446 119826 102406 72178 63161 68840 76148 105148 116521 95223 59650 27322
18567 27322 38691 64800 61812 51307 44473 46984 31209 47803 60097 53241 52611 47113 37424
18554 37424 32387 52523 65497 64177 63551 77167 74433 78911 110523 145817 224841 270446 306213
18541 306213 348023 365929 404816 444205 439771 456088 464839 447731 413157 370809 335149 285009
18529 285009 235062 197112 164956 145292 116180 92111 75364 46418 44593 44001 50102 62185
18517 62185 58072 50797 60982 48889 28894 32218 25671 2553 17067 32055 68266 56997
18505 56997 54770 75368 57570 71711 82202 101703 93263 50792 39401 76589 94818 134906
18493 134906 168780 189284 215774 239716 267486 303235 314289 315892 337287 301739 211971 148454
18481 148454 123421 115278 73958 32144 39107 38906 11861 27490 36210 36388 23956 47270 50170
18468 50170 56373 63089 61769 51979 50275 40476 43360 41724 33299 30184 25302 20323 41626 76673
18454 76673 50503 42465 38577 21424 24673 26277 17081 14513 17779 22852 29137 28030 1909 10908
18440 10908 27538 17590 11259 24588 41155 46043 35888 31387 26703 -7048 -3986 26666 1526
18427 1526 -15018 -4640 -11778 -14979 -26324 5246 26811 50437 67230 31565 20532 29906
18415 29906 25726 22820 24858 14775 368 33534 51093 59257 71413 62381 17740 11352 6849
18402 6849 -4597 18076 41839 13357 11997 16877 18049 12644 24035 20996 15754 23959 22940
18389 22940 13963 31827 53220 47803 47299 52853 27121 39680 29171 24844 12489 17052 -7581
18376 -7581 2452 11064 15709 -9591 -25909 -36221 -17560 -10896 -3434 7431 29030 47125 61164
18363 61164 44865 58422 77087 70062 62790 41007 41954 60475 61683 68173 60726 55153 68882
18350 68882 77427 76987 77972 83100 78612 63002 53414 74123 98657 76629 82150 68253 42556
18337 42556 37672 68984 96194 95001 98690 119898 118746 98184 88304 103590 99903 78048 70809
18324 70809 66046 50090 32590 43357 29884 32384 54787 42434 37320 56097 78393 78109 49646
18311 49646 45487 43263 45285 17856 30180 46144 50960 77032 103809 106477 129464 141458 167837
18298 167837 153862 148470 156689 153915 147028 113916 94817 90907 86049 92112 109556 110549 71820
18285 71820 44013 48121 33191 32750 39347 58227 71428 89212 124338 135589 153084 159164 156270
18272 156270 148213 153823 163879 174516 160841 156471 139078 128627 137652 131966 114835 114645 133640
18259 133640 151286 129625 116648 127899 136872 140776 144502 155482 157516 151356 184656 203999
18247 203999 182112 168224 169705 133488 119862 138686 139335 118812 107495 110004 130492 162294
18235 162294 197336 210405 223396 248427 261320 230990 198493 180616 183814 197623 226779 248642
18223 248642 250225 269426 257580 251655 231449 239702 244971 236246 205151 189413 169057 157755
18211 157755 146450 141207 140066 150324 163722 198148 193200 195156 223039 237954 233185 243364
18199 243364 258374 266794 264698 256386 246429 234061 257815 294268 336061 352836 343070 366569
18187 366569 393808 406648 410797 426585 440037 425924 388166 413248 418937 437508 453585 434084
18175 434084 450714 482206 493349 526647 498753 476611 491360 490968 475317 470953 461142 444747
18163 444747 454618 448054 419274 410221 411109 381132 381032 394675 421455 436554 479298 494411 514849
18150 514849 540924 546095 550869 569244 621350 658761 618688 593900 612486 657245 726805 761926
18138 761926 794921 846778 900244 948174 1027560 1092619 1108243 1131426 1205619 1293737 1370065
18127 1370065 1457685 1586276 1751313 1977249 2288744 2651050 3022721 3495264 4042914 4614555
18117 4614555 5238141 5932047 6823743 7934250 9515715 11829588 15220087 19899164 25188189
18108 25188189 29921474 33403947 34989733 35981346 33754454 27424939 22319116 20200148
18100 20200148 20470977 22551237 26057487 30660663 35917038 41272517 45931386 49000582
18092 49000582 49767806 47762836 43402850 37564257 30994778 24726050 19440478 15527067
18084 15527067 12901904 11155337 9934220 9097456 8535165 8125451 7865376 7639389 7426966
18075 7426966 7291455 7217589 7187020 7190973 7226652 7321642 7440755 7552247 7639925 7708069 7787912
18064 7787912 7907742 8055321 8324817 8745036 9301060 10087766 11176643 12561211 14328717
18055 14328717 16617227 19563989 23382702 28333122 34559596 42092734 50660588 59893548
18047 59893548 69217546 77707942 84415254 88388938 89532925 87923797 83461803 76530899
18039 76530899 67723408 58130052 48478657 39284163 31288615 24996201 20466871 17326931
18031 17326931 15159780 13598553 12463648 11609593 10972472 10534987 10217228 10012332 9899268
18022 9899268 9877326 9863866 9890566 9913641 9889567 9850562 9777047 9659569 9545157 9442950 9375995
18011 9375995 9372792 9480445 9697369 10085459 10662885 11476146 12556539 13936990 15778725
18002 15778725 18223829 21519368 25856383 31307825 37700095 44485710 50982126 56235445
17994 56235445 59167561 59000580 55484326 49431789 41828471 33682807 26240961 20266329
17986 20266329 15979008 13082204 11095022 9697521 8652307 7863986 7210784 6700994
17978 6700994 6295566 5996153 5746727 5567203 5405275 5297022 5215481 5178601 5190460 5191798
17968 5191798 5180530 5132638 5018618 4884939 4697394 4415252 4172797 3902021 3632466 3415487
17958 3415487 3222258 3059591 2885968 2724802 2570342 2448391 2325887 2190363 2077714
17949 2077714 1975943 1867697 1795498 1738485 1632694 1515569 1439049 1371793 1297653 1249068
17939 1249068 1191377 1160185 1097760 1037673 1008859 955112 892084 854091 829255 806571 812114
17928 812114 815412 793667 758113 760165 758857 740192 752567 752712 731066 735916 732885 703565 694956
17915 694956 679261 671830 682780 676235 654327 621314 603061 587923 597788 601158 583739 560378
17903 560378 547175 546713 535024 519270 494965 449235 413716 386214 364020 346777 352883 325639
17891 325639 314577 304316 293991 281208 291388 278792 259359 268518 306460 320531 364603 415843
17879 415843 416570 396544 402185 411252 435993 444696 422026 414369 451875 452769 462670 453861 456178 475531
17865 475531 451048 447530 428204 430030 453896 468686 491983 508368 518793 514082 487410 458187
17853 458187 464240 458796 441715 452393 449419 437359 393954 369639 352277 308137 276709 255805
17841 255805 257257 252179 215655 207272 214137 193355 171288 197825 223318 219710 230858 219561
17829 219561 192582 173490 147397 138717 157562 150150 164944 181938 149267 188374 228495 201405
17817 201405 201591 226629 230379 224543 241060 247514 235603 227856 225909 231430 242891 254292 243578
17804 243578 226187 230889 251350 256497 268690 270446 270339 278327 297809 262410 259451 253677 243446
17791 243446 259254 276545 248281 216539 205702 204322 193741 161151 166767 186738 192509 200065
17779 200065 184027 171520 169842 173054 173358 169551 158190 139326 141422 122757 135705 133923 99739
17766 99739 68836 60568 76788 115495 113352 91809 82193 104793 107926 92764 80367 55340
17754 55340 54678 78061 90283 117800 115426 100097 108707 117148 105695 88496 79645 87829 103108
17741 103108 93877 78920 95460 85330 86120 74969 68419 91435 119872 136523 131857 160195
17729 160195 179147 204531 246542 246374 231203 220294 167874 160394 148100 150959 132819 126094
17717 126094 156632 160268 137803 131461 157096 158584 182318 195300 188264 192479 200766 193690 209313
17704 209313 228635 231868 255763 279361 318413 358240 388274 433210 463826 532161 623346 663036
17692 663036 696961 721025 731607 748049 774890 738031 697013 661311 615558 558295 494357
17681 494357 464053 455617 460487 462512 482706 496957 488947 514144 551832 561293 581423 578840 603870
17668 603870 635970 637352 625857 595093 611646 625889 605712 576341 549531 511178 487537 475794
17656 475794 435957 389433 358104 352782 357358 343246 339731 323411 295567 276033 263081 253678
17644 253678 204273 195404 205039 205598 169411 184871 174641 159887 176859 178260 192723 236957
17632 236957 257359 290845 296858 278430 291630 308413 295879 302659 298178 311260 339922 377519
17620 377519 391957 395250 391464 381864 406807 439636 405920 365267 348675 361207 354831 306227
17608 306227 262515 258928 262234 268622 258008 251341 252722 259696 271664 270511 267420 278421 282269
17595 282269 329732 339557 313270 301153 309122 305912 273680 242440 201491 127112 111165 85785
17583 85785 66755 85365 106304 110258 80749 74374 85408 83782 101225 99921 76669 75524 71209
17570 71209 64880 93297 101623 101972 118925 138897 132830 116645 98446 78139 92791 101629 125744
17557 125744 162330 179506 193375 203343 247253 300136 358806 407333 462499 503576 538241 579585
17545 579585 616761 639353 648428 642016 619358 615436 606741 554350 504397 478215 456116 448491
17533 448491 472982 481093 489160 524867 545277 551753 533742 555391 541697 541661 560390 592389 576087
17520 576087 583432 591076 559588 523007 492672 478977 475488 461663 465161 497318 503032 457235
17508 457235 440529 432587 388097 354584 345107 358749 342203 330160 357601 401637 425186 442360
17496 442360 458059 448558 455399 436735 388051 343807 310683 271983 244510 222199 190172 161039
17484 161039 152347 122776 126611 143712 118018 108104 92582 89158 89875 77909 71410 82800 85534
17471 85534 99873 121331 154209 123380 114280 128613 137304 132041 156861 159290 139141 133342 111791
17458 111791 104680 140805 164563 198407 228913 247115 269335 300592 333770 338602 363687 379406
17446 379406 383979 385027 386168 397272 393224 406026 439981 445873 452349 441542 400649 380100 411825
17433 411825 426513 435301 436320 428791 416035 420127 399232 355377 324645 303871 280941 247340
17421 247340 235977 251704 231998 205304 194510 202129 195223 159304 164514 176609 173480 168506
17409 168506 172366 196079 203614 165157 164272 198307 182606 180427 214024 248372 299684 301927 286437
17396 286437 304624 326848 320810 308734 307728 314509 321237 321977 305873 283629 295827 303268 307836
17383 307836 311323 338263 363626 375657 402716 404714 402588 388884 365356 364928 374829 363825 331571
17370 331571 283849 246751 214393 220412 242773 243068 224031 204511 192621 185530 178441 139261
17358 139261 145164 170007 165402 152980 127920 108132 111018 104422 116094 114830 101253 112678
17346 112678 107703 111439 128596 144580 130151 130856 129332 129063 117912 122570 129846 118587 97027
17333 97027 98466 119398 146377 166938 172852 210498 219165 211758 211474 183324 132563 135614 140213
17320 140213 148506 163186 177085 180521 172958 165633 172904 197811 218254 219070 233503 262901 243791
17307 243791 222670 209314 240991 254650 232764 251085 286509 311540 320362 343140 340642 363147
17295 363147 396646 394248 426276 427506 408040 412840 425582 412024 428911 445238 457602 471759
17283 471759 438081 403213 406591 392519 420582 396115 361002 367791 385189 354710 338088 354192
17271 354192 365513 367649 349119 350417 353055 348944 327869 301091 291284 325298 337983 325946
17259 325946 376387 421602 435710 446945 448341 464840 500383 505323 489819 488001 514126 504958
17247 504958 500123 509344 523649 553688 543389 557116 562363 561645 572056 577261 564963 538612 516263
17234 516263 513407 524548 555066 598827 582773 546798 532848 548943 543519 570578 589456 613228
17222 613228 631917 652853 682824 737966 773475 805985 828264 851595 857532 860677 891959 925884
17210 925884 985371 1034393 1078280 1108589 1129189 1187953 1234036 1288077 1351646 1411124 1501960
17199 1501960 1598182 1718898 1843579 1984906 2121561 2299581 2538501 2770655 3013198 3301277
17189 3301277 3607272 3969964 4424543 4966201 5641361 6429151 7427492 8708131 10314797
17180 10314797 12297875 14704275 17549731 20849270 24544987 28526401 32630332 36617892
17172 36617892 40470879 44233845 47720526 50866898 53673563 56181902 58341149 60037753
17164 60037753 61079577 61280069 60795546 59866323 58458843 56412000 53842555 50944179
17156 50944179 47734533 44192718 40366003 36200429 31886531 27804531 24173159 21011009
17148 21011009 18366634 16313482 14839025 13822522 13156250 12735221 12513155 12442995 12456511
17139 12456511 12630289 12936509 13388153 14033575 14876931 15968661 17442751 19333456 21600488
17130 21600488 24237441 27210406 30468907 33821530 37077272 40223412 43278457 46153411
17122 46153411 48784534 51166558 53307427 55181488 56737697 57760618 58072161 57709551
17114 57709551 56848671 55501881 53551156 51045114 48187354 45067953 41640209 37968803
17106 37968803 34009581 29899717 25991071 22519286 19500954 16914792 14838017 13289869
17098 13289869 12144196 11318623 10697236 10202772 9778213 9418877 9119564 8849535 8599430
17089 8599430 8354754 8123911 7910652 7704458 7468576 7235588 7057996 6896928 6672832
17080 6672832 6477150 6307866 6160142 5995309 5864791 5734182 5624314 5588746 5584312 5581653
17070 5581653 5611726 5672688 5794280 5963766 6207051 6540146 6985700 7483228 8096007 8885493
17060 8885493 9880800 11119154 12652920 14613525 17059461 20075218 23697926 27885834
17052 27885834 32523000 37427442 42338044 47015881 51225788 54811753 57590160 59635338
17044 59635338 61205251 62560346 63901114 65542249 67755257 70567811 73909651 77568312
17036 77568312 81239735 84585287 87335166 89247625 90137843 89939978 88714678 86705186
17028 86705186 84209562 81518700 78897580 76443742 74194730 72077298 69891627 67343372
17020 67343372 64181306 60297811 55764439 50713932 45396838 40044500 35001342 30527240
17012 30527240 26708629 23604176 21130243 19255343 17837359 16733902 15865221 15117758
17004 15117758 14502729 13948306 13428032 12932533 12443565 11945080 11467796 11012558 10606407
16995 10606407 10195759 9814257 9460287 9121546 8812514 8499269 8132134 7801371 7514824
16986 7514824 7228111 6939433 6690340 6468989 6275567 6090219 5924555 5781461 5648293
16977 5648293 5575812 5536324 5508939 5525116 5533380 5617552 5759983 5972369 6244934 6615579 7103341
16966 7103341 7750197 8587400 9656874 11030258 12784407 15036623 17869864 21380935
16958 21380935 25517426 30116546 34955962 39737515 44045116 47570142 50142663 51677635
16950 51677635 52280878 52119994 51289450 49908848 48035408 45782125 43378322 41195848
16942 41195848 39563514 38730110 38730179 39404160 40414250 41392983 42021403 42111190 41590160 40567548
16932 40567548 39087227 37153100 34796575 31973833 28765681 25409981 22192501 19307725
16924 19307725 16927046 15130046 13834503 12955385 12338828 11904738 11695660 11647903 11709807
16915 11709807 11903121 12286021 12870023 13641685 14739140 16194145 18146491 20623156 23645337
16906 23645337 27223019 31177202 35269115 39193257 42611024 45304838 47143071 48120861
16898 48120861 48301665 47866604 46943063 45593186 43858014 41885238 39914033 38226930
16890 38226930 37150361 36857307 37273305 38191239 39270415 40140496 40546392 40407556 39690898
16881 39690898 38489866 36826029 34747526 32212404 29261098 26017858 22661888 19453291
16873 19453291 16619753 14303174 12505867 11160295 10184489 9470307 8873589 8365108 7928259
16864 7928259 7566725 7217805 6922841 6673524 6431138 6179585 5956975 5765733 5584965
16855 5584965 5392900 5169308 4976217 4790992 4597027 4389855 4211270 3979692 3777951
16846 3777951 3585176 3396418 3250524 3105777 2938282 2803788 2694075 2576222 2477581 2372013
16836 2372013 2251632 2145452 2034037 1944308 1856388 1778457 1689425 1626729 1592060 1540146 1450581
16825 1450581 1385126 1352780 1288880 1238305 1190493 1160015 1133680 1085892 1042727 980895 909850
16814 909850 865179 826151 813282 813916 787273 778718 728923 694664 694783 664452 651576 628656
16802 628656 578580 539093 512787 510086 483227 458821 442898 425561 411236 377489 390649 391883
16790 391883 383786 375389 400877 389508 345293 384428 432177 435309 424545 414345 420195 429410
16778 429410 428219 421257 404643 376363 382432 387620 394875 398815 374615 354566 338320 333062 337113
16765 337113 347670 328641 322741 309473 317821 356374 352203 322247 332516 348425 345313 349277
16753 349277 341834 297177 264298 229687 200504 208640 245106 293331 296413 273806 260589 250582
16741 250582 232842 231610 235947 228986 212036 206924 222633 246600 244163 244825 233952 228706 237272
16728 237272 248934 236206 216007 209798 199561 206608 213405 221418 225765 200740 225097 232416 241083
16715 241083 249904 246015 242591 252365 247823 236369 252491 263498 262383 253895 240558 230633 234842
16702 234842 253133 244027 259083 234835 217889 237535 254466 262673 228103 206338 186688 164113
16690 164113 169574 177027 189677 172993 173478 167394 172738 196200 189918 193056 197292 158367 127630
16677 127630 147750 170457 185162 173904 178162 215373 234773 230911 256884 289221 303061 339827
16665 339827 345705 384032 379834 340430 346765 375816 370746 387300 382043 378331 386540 387522 378820
16652 378820 366080 363663 358421 320950 322075 324312 285059 247195 207419 176692 183648 186810 157016
16639 157016 111811 94413 93477 102454 104627 134527 136338 134660 145333 163977 175456 176744 155857
16626 155857 137826 151706 182635 224304 251374 271848 269618 284480 324449 355510 357203 371311
16614 371311 368278 374884 373855 368514 371027 361937 356137 354779 335608 309527 298307 292347 285834
16601 285834 309864 298314 260531 253772 214182 183991 150937 140864 141325 152022 146869 141029
16589 141029 139136 140420 128031 103265 93516 117575 135429 158944 167666 164990 137893 102468
16577 102468 98841 92272 84896 73323 102323 128744 130093 110786 93403 78090 104262 134085
16565 134085 148058 156777 184262 175813 155256 152259 188932 251679 301753 325344 337523 366026
16553 366026 387698 391344 389357 393690 437663 474626 479614 473505 478614 484895 496402 506929 506275
16540 506275 491789 485004 471699 460119 443318 425030 434536 442441 447390 430946 373355 337058
16528 337058 336322 360499 383642 359095 332127 294426 253008 237472 229738 220037 183833 142107
16516 142107 139244 141794 141140 128486 113896 120448 100016 80222 43212 232 -9775 -1333 34339
16503 34339 58441 86436 79661 61074 52064 61292 59117 37256 37955 40813 43763 63271 55179
16490 55179 23579 2714 17461 24466 30920 35084 34245 31042 17877 -1363 198 5447 -1542
16477 -1542 -28302 -16745 -28167 -17477 702 27650 34507 28417 19504 5341 15071 25957 6490
16464 6490 3390 -1256 29480 85005 134458 132970 138297 143291 163572 178651 209133 219842 247628
16451 247628 274924 264937 254370 262237 263621 255759 236723 216745 202921 202489 214713 207508 221357
16438 221357 221316 206626 234645 257893 274432 261543 252406 233745 224557 207208 184640 172473
16426 172473 139804 92016 88896 98010 73164 77440 78304 65789 53884 69270 75874 66032 63498
16413 63498 69611 80489 70096 47458 38295 58062 80889 72098 78999 136596 161896 172598
16401 172598 195936 222061 248478 254170 262401 256647 248376 233485 212558 202329 199463 189249
16389 189249 181130 188363 184951 211712 237928 228325 218498 238162 216160 185297 188520 201689 192230
16376 192230 159259 133774 131325 119711 100069 81387 77853 56031 45845 46218 57730 61189
16364 61189 51069 24713 53621 58736 54130 45527 34823 45199 51956 66178 56411 60802 46462
16351 46462 32669 33857 36241 12605 18797 12204 2150 19399 41815 55888 54633 48652 38032
16338 38032 12842 -4354 -3434 792 -33031 -7945 32554 39832 15098 8678 -2292 4209 -9882
16325 -9882 -25270 -7416 4488 -5963 -24803 -47046 -42741 -40108 -27220 -19193 -18608 -18537 -555
16312 -555 22441 17945 2025 9132 22704 44319 76830 75078 48142 37467 39068 14787 -6920
16299 -6920 -595 10455 14303 17573 -6170 -22545 -36208 -19896 -5804 27812 50137 33195
16287 33195 35574 45745 33614 19669 13285 -1673 -26155 -49065 -61234 -49857 -45463 -50964
16275 -50964 -49660 -42056 -14807 -26052 -40121 -41354 -28725 -14308 -6511 4414 19701 2182
16263 2182 -2297 -9542 -16347 -37486 -38767 -31429 -10635 -17173 2893 33586 41249 -14175 -33105
16250 -33105 -54648 -23608 6793 29609 25384 40574 41709 28260 16144 -6025 -36645 -51962
16238 -51962 -38988 -17822 1443 1164 4829 -19649 -24911 -25088 -46722 -35673 -31842 -53417 -55414
16225 -55414 -34462 -23206 -29435 -21468 -22462 -13075 -9441 -13367 2241 7664 21684 37341 44923
16212 44923 9731 -1382 -9230 -5988 8800 13598 135 -13701 3794 1636 14875 18783 9032
16199 9032 31296 42024 19033 2392 10666 29735 19926 2531 6530 6976 8577 13025 29554
16186 29554 11571 -3065 29782 36632 16639 4965 10065 -2067 -28933 -32488 -45695 -36228
16174 -36228 -21889 936 5814 -5316 -12267 3773 -9581 -25277 -47403 -64118 -50962 -36215
16162 -36215 -14492 4499 -15981 -20927 -28271 -12949 662 5403 -34891 -43485 -30726 -31574 -12896
16149 -12896 983 -5635 -7583 -17817 -5527 15131 23726 28207 7369 -4146 -6926 -1736 -21129
16136 -21129 -52573 -61700 -50130 -20842 -21103 -35024 -53894 -28030 10814 7879 3997 19710 17575
16123 17575 4023 767 -3402 327 -876 7282 -11925 -37238 -28458 -14543 11355 5899 -13395
16110 -13395 -30755 -39089 -19207 -13506 -4389 -24483 -57003 -63883 -56898 -51921 -40620 -17415 -29852
16097 -29852 -26525 -10615 9519 7123 -15516 -32198 -25518 -34019 -35379 -33858 -40326 -13890 -5881
16084 -5881 28305 16612 22107 -8210 -29172 -13493 -11994 -6577 -27029 -35089 -46143 -53061 -27164
16071 -27164 -2095 11331 31605 31571 8140 -7540 -26069 -53761 -40641 -18317 -20064 -15146 -16817
16058 -16817 -29492 -18525 -28868 -34504 -5018 -3821 28896 29672 13142 21778 29088 47525 39746
16045 39746 10032 1231 9775 2323 -10990 -25693 -42565 -41314 6559 21460 5794 -9563
16033 -9563 -13863 -3635 -16311 -14533 -2127 2874 -29584 -22095 -19524 -16123 -1401 10910 6684
16020 6684 -28946 -23865 -34580 -29650 -12197 -10458 -17112 -1188 -17302 -7637 26104 34685 45245
16007 45245 18570 22445 41876 51528 60811 67089 33745 13937 -5256 -4899 -6634 1452 4603
15994 4603 -1312 -18324 3241 -8023 -17539 -40631 -56870 -40464 -20660 5625 -3460 -33929
15982 -33929 -54395 -29046 -11656 14765 24915 12898 -14125 -2442 6513 -7927 -13571 -2749
15970 -2749 8118 1428 4993 10249 2570 4800 2859 27426 19816 7120 -15705 -15392 -35708 -46888
15956 -46888 -26370 -11624 17950 41472 26820 -4675 -3309 -1742 -17506 -44452 -30582 -25593
15944 -25593 -24596 -14683 -12213 -29106 -3 9749 14166 8739 37731 48301 33993 17467 -1279
15931 -1279 -10779 -39255 -71020 -69111 -67383 -45298 -31091 -59121 -42992 -15933 -27395 -77958
15919 -77958 -103352 -92990 -83389 -48516 -32189 -29973 -42412 -41438 -25019 -37015 -12058 15234
15907 15234 12441 -514 -5836 -2161 984 11662 -11892 -13398 -23308 7059 18497 -6797 -31800
15894 -31800 -33999 -29554 -28310 -31003 -58066 -51452 -17166 -3857 -3141 -15566 -13517 -3468 14772
15881 14772 5135 -14666 -41489 -34147 -15120 -27002 -10629 155 -11404 -18625 -15615 -9528 -11331
15868 -11331 -38701 -51218 -46473 -30417 -7141 -15059 -40638 -33374 -12181 -25596 -15733 -20897 -22632
15855 -22632 -30874 -51155 -48861 -41911 -36220 -44485 -29402 -22111 -15030 -17109 -24574 -32103 -15704 -577
15841 -577 15429 12971 -7402 -12024 5185 -5024 4867 -5364 -17735 -6788 9117 -4536 -38404
15828 -38404 -29596 -23941 -25077 -10903 -25454 -28690 -18941 -14987 761 8270 16875 -15358 -14356
15815 -14356 -9700 -18985 -32482 -43799 -17603 11022 15741 -14113 -26874 -31767 -47595 -52019 -56816
15802 -56816 -62196 -41790 -39523 -59181 -28639 7018 20010 5840 -4497 -17257 -25709 -5155
15790 -5155 -13600 -37772 -22994 -10548 -23583 -42384 -50742 -45686 -28998 -11870 -659 -36675
15778 -36675 -44740 -44858 -29995 -31423 -50512 -44429 -53208 -60621 -39234 -7 4605 23937 43631
15765 43631 18394 -12045 -26630 -17768 -8501 -11285 -25934 -25579 -31556 -42224 -52539 -34585 2870
15752 2870 44460 25846 -4455 -20852 -28044 -37558 -21260 -12789 -29379 -28090 -12122 -1769 12476
15739 12476 -24100 -24235 -17303 -4203 16449 13716 3583 -17384 -32779 -39865 -47147 -72371 -69357
15726 -69357 -38248 -30997 -31494 -37357 -28529 -1354 19043 6631 -14910 14776 24784 1075 -19478
15713 -19478 -30139 -44427 -36775 -17063 -39360 -64605 -36283 -6255 -9333 -17206 9901 13729
15701 13729 -11251 -37799 -36069 -21912 1546 24884 43542 37583 34383 5528 -19699 -11947
15689 -11947 -29003 -33033 -23133 -37059 -35780 -27338 -30775 -21843 -4361 13073 4653 -3092 -483
15676 -483 -14653 -21358 -4490 10773 -5184 -18862 -7335 -7371 -26122 -44782 -44069 -22878 5815
15663 5815 4989 -16838 -19195 -30834 -45913 -41870 -13506 -14004 -15219 9510 -9006 -27438 -32829
15650 -32829 -31092 -38656 -38541 -62123 -58540 -71262 -66891 -55560 -53897 -63995 -64959 -39195 -40493 -54476
15636 -54476 -47042 -26481 -6352 -7529 -34472 -32896 -7450 9125 -7191 5096 -7700 18550
15624 18550 14907 -10559 -17351 -193 11218 20728 8617 -22216 -26390 -12161 -35341 -59542
15612 -59542 -61647 -65387 -40351 -51111 -63631 -63720 -61032 -19523 -21497 -41884 -57571 -56300 -40257
15599 -40257 -45620 -52367 -55381 -57707 -72198 -68302 -36081 -9686 -18262 -36872 -40759 -30710 -38006
15586 -38006 -53191 -52862 -45734 -44913 -52536 -62949 -44740 -34798 3074 36112 31477 22445 24908 27045
15572 27045 -7504 -7534 -17620 -37014 -38081 -19938 8747 740 -14529 -20917 -46786 -67058 -42136
15559 -42136 -23108 -36367 -23402 -25445 -31117 -47041 -34563 -29281 -38698 -47716 -17411 10468 5755
15546 5755 18331 25871 16811 -5229 6387 12124 24263 20391 -5357 3292 -4180 -32959 -2151
15533 -2151 17774 18838 6133 -8136 -1411 27740 35760 662 -23808 -8185 15396 29408
15521 29408 24618 -13838 -47968 -35934 -10685 1249 7664 20261 -9421 -41353 -39319 -51572
15509 -51572 -70132 -63800 -61610 -67795 -70987 -65211 -73490 -53519 -32213 -12491 -9727 -6689 -27220
15496 -27220 -23964 -10042 -17185 -9039 -3606 -502 -5344 4357 -369 -22990 -39256 -23069 -17116
15483 -17116 -23407 -37390 -48843 -51763 -29937 -25305 -18313 3913 15975 4021 -8801 -5221 25819
15470 25819 13376 -19866 -45390 -49540 -21608 -41491 -65407 -53216 -56148 -73553 -45676 -5677
15458 -5677 -10981 -26153 -37289 -52375 -54052 -44329 -15731 -16850 -3097 -1429 -13709 -8918 -12917
15445 -12917 11930 28467 35723 16003 -11384 -14219 9317 1759 -46071 -59787 -31975 -23049
15433 -23049 -30992 -50303 -49004 -43040 -33667 -31481 -52322 -44397 -28633 -18189 -45359 -67708 -90287
15420 -90287 -49010 -7127 -5654 -34767 -57088 -38952 -51737 -60653 -71764 -55228 -37197 -28769
15408 -28769 -28989 -50960 -57626 -52217 -33386 -12694 -30307 -31981 -17053 -41822 -52139 -54188 -52371
15395 -52371 -41997 -36501 -41147 -28793 -21659 -14806 7776 39380 26535 5167 -26023 -40291
15383 -40291 -17004 -6418 -6262 -17275 -38441 -27238 21395 21609 12301 12459 5245 9695 2695 -14487
15369 -14487 -29228 -24462 -21101 -25875 3955 18231 20923 3279 -22135 -22644 9116 7319 -16787
15356 -16787 -28427 -58559 -75954 -37021 -35826 -36726 -29430 -43813 -44639 -34052 -54029 -27448 -27207
15343 -27207 -32245 -24505 -36471 -56223 -39507 -14813 -4321 8519 19573 16185 2495 7985
15331 7985 1793 -27277 -36924 -39026 -46959 -55783 -51730 -45657 -46961 -20998 -17799 -10353 -7527 -20482
15317 -20482 -20692 21685 18787 -26157 -42033 -52376 -48738 -30856 -2088 6380 5929 -9886 -33632
15304 -33632 -20385 11273 3025 31429 43807 -5409 -34548 -32350 -18896 528 14192 -15035
15292 -15035 -9352 2348 -4428 -23804 -21603 -3348 -22219 -21830 1864 23992 8060 5479 -1890
15279 -1890 -9945 -43351 -71661 -60992 -46334 -53237 -55545 -45449 -20898 -37050 -35056 -13166 7792
15266 7792 25225 39535 34646 3543 4132 -25352 -19910 3614 -18322 -37499 -38814 -34897 -31220
15253 -31220 -21934 -18692 -3168 4837 -22852 -38138 -46179 -26644 -15585 -16728 -3425 6003 2255
15240 2255 -4882 4898 -10154 -32982 -30903 -15261 9476 13560 -17076 -14800 -14696 -13393 -5345 -17299
15226 -17299 -52150 -60086 -48051 -24036 -19554 -11055 -5304 -537 4001 -12531 -21844 -43827 -43974
15213 -43974 -29244 -36480 -27489 -29485 -40296 -47260 -75795 -87499 -64905 -37275 7040 10472 -14223
15200 -14223 -24637 -36423 -23153 -28739 -48436 -65208 -60976 -52479 -24862 -12598 3306 6924
15188 6924 21167 776 2597 -18918 -11136 -5536 -7700 -31200 -27860 9244 24515 23928 19460
15175 19460 -3017 -4475 -1288 15803 4383 -14906 -15335 -6015 -11697 -19481 -19019 -18489 -24912 -21435
15161 -21435 -40609 -58203 -78514 -79492 -65636 -59540 -37955 -32405 -31178 -18744 -5975 -1748 -30561
15148 -30561 -57482 -54713 -13298 23760 9708 -6371 -11273 -35010 -49321 -30884 -37434 -33166
15136 -33166 -23906 4636 14558 -23226 -32063 -7053 -9520 -3231 -18789 -34856 -20358 -26946 -19677
15123 -19677 -12544 -33766 -32698 -14916 10516 15134 6425 -28153 -19271 4728 -13694 -16019 -21401
15110 -21401 1593 -8576 -8573 3633 -13598 -44092 -61418 -54721 -41141 -60598 -76247 -44952 -25631
15097 -25631 -35875 -37722 -40660 -28293 -7208 -10497 2040 -5880 -46213 -50196 -34813 -44177 -16938
15084 -16938 -15560 -37946 -49536 -45867 -22115 -8507 -16747 -8180 9545 -239 -28180 -58710 -80180
15071 -80180 -55917 -16803 15114 -1087 -17997 -11655 -13303 3881 -1960 -19804 -13016 -26817
15059 -26817 -57346 -55328 -36729 -21908 -55685 -59079 -67169 -68604 -70495 -65647 -31484 -20076 -8259
15046 -8259 -13951 -29165 -29840 -42579 -38885 -44814 -19579 -11885 -29024 -13416 -10591 -55129 -87832
15033 -87832 -82884 -58560 -34719 -39273 -50995 -45819 -24803 -6964 -18405 -46848 -64169 -63952 -72316
15020 -72316 -78488 -52644 -47851 -65493 -64123 -41504 -33522 -26203 -12555 1727 -12516 -19090 -24886
15007 -24886 -29137 -27132 -5878 6036 15297 12984 -2274 -18309 2009 15622 7951 -7772 -5491
14994 -5491 -2500 -5491 -29549 -50169 -41504 -22884 -31139 -6826 8879 3464 14830 4701 -33922
14981 -33922 -32754 -8006 -8283 -34290 -48513 -58173 -63920 -82082 -55831 -31256 -29670 -27970 -10657
14968 -10657 6863 -3399 -13217 -39265 -51542 -39673 -35388 -46283 -31254 -6753 -19060 -41702
14956 -41702 -10685 901 14507 38901 45351 42885 21030 23570 34393 20810 16394 4191
14944 4191 -24575 -12377 -19163 -24122 -28148 -43071 -30915 -22033 -27060 -22582 -21628 -14248 -13146 -7557
14930 -7557 13237 12035 8963 7872 -6189 6437 30209 15029 -12888 -17238 -6244 16541 21814
14917 21814 29626 46034 27443 7549 25699 18528 11790 18906 11720 -5548 -20226 -21675 -31181
14904 -31181 -46742 -42646 -39125 -36822 -26114 -24332 -5844 -25153 -24873 -26441 -25689 -47365 -30616
14891 -30616 8751 24459 5023 -21160 -22642 -26456 -24046 -23389 888 -26458 -44823 -21166 -3685
14878 -3685 -8268 19101 22890 11902 44883 32977 3205 11498 17304 -340 -164 10162 7038
14865 7038 20747 29743 31439 37009 51261 31681 15313 27373 13568 28095 27698 11211 2327
14852 2327 -14974 -14455 3500 156 7787 -8523 -34207 -47185 -53290 -48968 -15313 6078 1786
14839 1786 -23086 -27380 -19019 -19650 -31970 -33439 -29196 -36562 -44452 -7607 10112 11145 14636 1355
14825 1355 -12393 -25187 -12163 -6850 -25321 -16436 21149 72822 105333 93151 48568 24617
14813 24617 52779 56945 59108 45107 45962 67141 73307 39173 18486 8191 14270 16323 5832
14800 5832 15651 -4801 -25277 -20598 -9437 5434 3212 13961 1918 -21677 -15937 11082 10285
14787 10285 -5621 27486 41332 52446 68545 41298 51855 81093 91263 85247 72733 53642
14775 53642 73712 71060 33130 -12793 -869 471 -3784 2028 13263 6556 10965 18086 5211
14762 5211 -8515 -11182 -7767 -24907 -38207 -13743 12115 -5103 -17904 -14398 -48943 -46164 -32274
14749 -32274 -33293 -29029 -25032 -34594 -40433 -54050 -49240 -54824 -30339 -36939 -26996 -17627 -14049 -34264
14735 -34264 -40254 -31657 -24571 -9388 -6796 -7982 20373 32184 22062 7358 -19540 -15398 -16737
14722 -16737 -12382 -47766 -61338 -26481 -13053 -33616 -28352 -53535 -42954 -35660 -7727 -6604
14710 -6604 -7212 -23102 -30877 -35248 -11460 10012 -29417 -50465 -43379 -44573 -39663 -20286 -25373
14697 -25373 -41242 -54461 -37072 -39163 -19001 10767 -814 6521 23714 -131 -2870 305
14685 305 3271 7393 2781 -20943 -12388 -8563 -19773 -16118 -34518 -42063 -19893 -941 23223
14672 23223 42672 41780 5710 -32504 -21047 11037 21902 14889 10789 -2318 -17086 -49556
14660 -49556 -71367 -54699 -21866 20177 28316 796 2004 8381 -6649 -3991 8677 -19382
14648 -19382 -38850 -36703 -34583 -41491 -44055 -20636 -32514 -14321 -12327 -15005 -377 25700 30944
14635 30944 25879 69129 108795 103145 131813 160213 150682 110575 114391 121457 128573 111780 86546
14622 86546 73720 72890 79088 94023 44917 14288 1733 9939 11743 -11727 -8995 8232 -92
14609 -92 3662 22742 -9886 -22839 25620 40728 52694 77966 106123 78172 50169 36874
14597 36874 31297 43066 80378 90530 124991 106499 107549 88861 80417 82908 89817 109621 138466
14584 138466 114736 100307 78304 57802 45845 86363 115623 121129 132216 137079 101919 57944
14572 57944 41175 81401 103482 117811 105622 77864 74842 40206 32566 36493 19946 1094
14560 1094 4851 23738 25311 23219 11695 12964 36384 34016 36978 32303 29642 44519 31014
14547 31014 38009 29845 26139 24797 57960 47308 15345 -15066 -26563 19408 44428 25964
14535 25964 6928 10907 300 1034 28356 45981 45851 42077 -7521 -14461 -828 -11579 -17061
14522 -17061 -35325 -32353 -31067 -4757 40988 63613 42271 19244 28115 20641 38471 43718 33492
14509 33492 33087 27215 14049 -15541 -12974 11701 14031 11039 -6077 -26749 -24084 -13676 -2941
14496 -2941 21610 20418 11462 24309 8020 -15206 -29210 -10894 -2647 -8887 -17721 -5686 21413
14483 21413 28062 18876 -1937 -32798 -12478 -3030 4316 13334 13744 14017 -5790 -22414 -17152 -2230
14469 -2230 -3890 -10383 -19904 -5477 -3879 5231 6173 11186 -3211 12792 17774 22058 3897 -18330
14455 -18330 -2722 29149 38708 43119 46357 33704 14715 23311 9915 8347 18078 39545 45235
14442 45235 47556 47249 33405 18619 12338 48937 76731 87393 89782 91252 126931 173609 209700
14429 209700 220208 246147 258442 273415 296186 328934 346233 370062 369277 385805 418467 452532
14417 452532 491316 491665 474892 503226 526276 550599 552846 555241 597434 624488 597399 560027
14405 560027 544424 550938 560873 578060 592887 597767 599249 616001 605696 611497 612423 635386 637957
14392 637957 615052 592116 601169 590730 559488 550632 543829 510798 479979 451189 427551 423854
14380 423854 375855 346056 317057 300722 307301 313539 302994 286556 258603 221798 215661 208307
14368 208307 189970 158903 137639 124351 127280 130138 121951 105574 88837 87459 81556 72850 77218
14355 77218 78934 58837 46032 49328 37337 50611 103960 120962 92606 42818 38399 75924
14343 75924 101980 93279 67966 27385 9095 31383 48203 38423 33487 28188 14358 -6903
14331 -6903 -11708 -8217 6161 18813 36857 47026 42807 24687 40907 38201 37329 35980 64052
14318 64052 71496 56802 44064 25777 36091 48820 29353 28901 32902 39192 27570 15750 -9041
14305 -9041 23810 24736 1170 -22613 -42207 -48398 -24189 -6150 12352 19388 32227 21539 19182
14292 19182 41803 53043 41567 31504 42409 42590 22234 11248 2761 9981 21561 28451 31715
14279 31715 35238 18747 32478 33070 47828 55732 43386 34600 2229 -23639 -32210 -13038 3813
14266 3813 26910 30464 36291 46328 45926 31694 47438 29894 37915 55774 64093 42584 27570
14253 27570 32640 55413 75247 93839 106824 88848 64452 54189 51101 56032 60221 61832 91309
14240 91309 98717 85277 57877 57504 95100 112310 124875 131125 126503 137394 155096 140418 135032
14227 135032 140915 135337 137203 130553 123725 168813 215562 229210 227801 197629 183688 199261 204477
14214 204477 201155 189899 193948 196595 205018 218748 226834 215617 230088 214590 187622 190488 209534
14201 209534 209313 207367 197138 191723 182648 176509 198487 204366 198871 164738 179861 198392 190421
14188 190421 180357 138019 130060 139490 140054 162573 161746 156241 144359 133934 117854 120325 137937
14175 137937 113430 96692 105348 102154 77940 66889 86026 88941 85228 88367 89284 104965 96989
14162 96989 70463 48519 35039 48470 50224 30614 37491 67718 78963 62969 49853 32613
14150 32613 36305 48286 52533 55564 53467 74073 77948 87570 107892 100816 66727 65085 95009
14137 95009 115859 136914 150466 114608 90205 116574 127750 135878 136414 155749 175448 198497
14125 198497 219442 236354 240644 241038 221964 207762 232947 224934 232591 267034 265774 249164 247081
14112 247081 274574 295036 292231 287214 285188 301656 333407 332952 355573 378853 381528 375318 400257
14099 400257 428082 443034 419402 432316 431504 446645 463374 496401 489135 469171 450228 456909
14087 456909 442784 422158 424121 443814 472891 480943 488437 493378 510257 520598 523933 505307
14075 505307 482788 524117 564108 546997 540822 583074 608860 584044 551968 580750 611589 627144
14063 627144 650769 685317 705162 730998 725531 705909 722475 757514 768970 769478 822615 865842
14051 865842 879834 889228 928667 983635 1005451 1022959 1099414 1166760 1189471 1229417 1261253 1283706
14039 1283706 1307265 1355891 1403375 1471399 1535831 1603347 1672773 1698737 1751731 1826228 1902087
14028 1902087 1989348 2072156 2142185 2232758 2348917 2458628 2555503 2657930 2763249 2892923
14018 2892923 3021356 3156982 3278262 3413608 3525355 3635900 3780970 3936820 4086569
14009 4086569 4250266 4420201 4614631 4853405 5138079 5432645 5772052 6150901 6558989
14000 6558989 7017472 7522099 8076757 8720653 9453509 10301045 11207741 12237661 13402770
13991 13402770 14667341 16100994 17724637 19531210 21567556 23827297 26303396 29068324
13983 29068324 32114456 35411351 38984485 42855971 47031115 51471178 56135049 60947074
13975 60947074 65875029 70845322 75738760 80487918 85003974 89234379 93076642 96493372
13967 96493372 99447110 101896569 103846743 105374570 106492181 107267520 107773463 108071042
13959 108071042 108269420 108410056 108544894 108672294 108887581 109203977 109620392 110136634 110708151
13950 110708151 111324502 112000745 112639999 113190106 113572451 113709936 113554273 113046764 112134775
13941 112134775 110744612 108849919 106411447 103455969 100029683 96165553 91926680 87413048
13933 87413048 82722444 77949504 73178068 68484596 63942757 59608347 55517446 51666929
13925 51666929 48094397 44833625 41855741 39129862 36634256 34374461 32301733 30394785
13917 30394785 28656138 27054946 25567743 24210868 22966371 21811287 20725716 19712558
13909 19712558 18742379 17829871 16968115 16164886 15384224 14630763 13890438 13234173 12609024
13900 12609024 11999464 11391284 10838942 10299785 9793013 9309503 8845356 8395505 7950602
13891 7950602 7587116 7238588 6895454 6538641 6230535 5938886 5649375 5363814 5094660
13882 5094660 4829378 4610909 4441340 4254791 4076580 3876778 3673240 3506101 3353143
13873 3353143 3209745 3070194 2916981 2799237 2660356 2531277 2417584 2291625 2179727
13864 2179727 2072461 1982634 1903488 1875119 1789429 1714835 1670378 1608392 1564311 1500634 1443190
13853 1443190 1400152 1355532 1328127 1305964 1260374 1218739 1200889 1166084 1105067 1063922 1054957
13842 1054957 1038474 994196 959976 926234 869277 862886 863681 827343 819555 816610 787295 792029
13830 792029 770407 754150 740709 750890 734065 707164 688052 670222 659996 618305 603510
13819 603510 590119 590986 589605 548836 521149 501961 505978 522669 546301 545428 508184 488979 479695
13806 479695 462723 461175 493045 511943 520597 502986 488226 489556 477332 456157 426146 433692
13794 433692 463950 471953 475310 496885 512733 508281 495532 489848 505311 502573 492596 508905 548977
13781 548977 543037 538730 553757 562761 560267 577867 609645 629097 656419 681583 685008 662780
13769 662780 659619 662567 669080 662766 661018 644833 613850 600586 573497 551438 552029 564000 563705
13756 563705 550180 533599 506845 484295 453842 463341 443262 428766 430411 434885 428196 437573
13744 437573 429564 421157 429709 401063 387050 381838 403391 396877 378529 363987 375933 368676 383320
13731 383320 406087 389965 370154 395317 404259 389532 363211 354394 366340 385639 388098 354819
13719 354819 335129 325671 287240 261376 270577 273256 245221 205629 178890 165754 188897 196579
13707 196579 212603 194018 187617 173348 151066 165914 156408 164642 194558 196737 176692 152967
13695 152967 112351 81516 73761 87062 102143 110565 105838 121029 150196 129227 116444 110232
13683 110232 112557 130939 128694 110089 97665 89516 80216 75337 73264 65021 29372 45545 50380
13670 50380 45925 65325 86791 101159 76753 60734 64650 55672 49438 81357 103179 76852
13658 76852 61926 72112 64900 83558 128174 136044 119937 108314 123092 146180 149255 138180
13646 138180 104367 106718 116924 139964 140717 147574 148613 161373 163182 153976 154057 168821 172300 151803
13632 151803 175219 172366 150752 137517 128149 94685 80931 81985 87277 93327 119709 133148
13620 133148 90426 89792 133685 146050 132799 116363 104167 118279 125540 122452 120883 126329 131328
13607 131328 119132 107000 96523 52575 50877 30916 72684 104781 110730 99239 84208 56724
13595 56724 45070 82051 115190 123381 110072 88022 91834 75937 53469 41920 62211 80034
13583 80034 67206 66256 78700 94873 79371 59873 74489 69697 77803 90600 80303 59753
13571 59753 75200 83359 79167 73097 70822 57480 59391 72207 78702 84407 79662 43706 35904
13558 35904 42921 82999 94118 90498 63318 68724 76885 89064 45139 52244 67972 77846 94227
13545 94227 99199 83993 69839 67684 101062 132042 113731 89587 77128 71104 92945 109930
13533 109930 136041 131971 144229 195776 224806 216502 206558 215502 256304 287061 330218 346784
13521 346784 344496 383246 442954 474444 494287 513007 550100 562265 586165 622601 631807 622985
13509 622985 601354 603446 623365 645157 642923 638492 619986 619644 649784 690131 690440 664687 626098
13496 626098 605222 636644 657928 646615 646719 644512 659224 647013 649738 666611 660741 623112
13484 623112 606138 586542 578738 555676 525180 526647 508663 469693 431179 417529 391144 329237
13472 329237 321672 303910 297868 287668 291886 281589 263398 236501 200881 183401 180557 197834
13460 197834 192126 163238 144682 142214 125146 96073 68839 66874 81119 91351 83362 86962
13448 86962 110303 87987 72738 53034 61579 23737 2942 40857 66044 57421 59407 42612
13436 42612 23512 33766 59651 71361 65217 41806 18272 8938 3116 14236 31869 37481
13424 37481 12778 18371 7221 -3952 -6747 16064 43368 63496 46086 33955 18029 1687
13412 1687 -3780 -16634 -16341 -10731 -23507 -46214 -39039 -23556 -9635 5323 30916 41693 46594
13399 46594 35575 550 -33502 -34245 -5009 10075 18763 17550 13833 -5030 -28996 -19407 -9847
13386 -9847 -2148 -5744 11921 12012 22111 11907 4765 25218 24085 29553 43033 19269 13915 20823
13372 20823 16096 -6885 -11653 -32544 -10681 -8892 16967 10448 4612 -16672 -18118 18963 24442
13359 24442 27864 9531 23065 51576 36687 60595 58226 41951 29083 16236 5108 14782
13347 14782 34418 39032 29564 9816 16572 5206 693 5757 9626 19431 19733 21297 42297 11589
13333 11589 -26640 -35637 -26827 -29899 -9189 -8881 -19985 -5225 12626 11085 8411 4568 -3391
13320 -3391 -4908 -7975 -6959 8125 471 6318 -12020 -24062 -25601 -25015 -23768 -26223 -32258 -59886
13306 -59886 -46704 -27493 -28436 -33816 -23554 -11369 1428 -9749 -38705 -34548 -25120 -24271 2113
13293 2113 -4667 -6215 -5104 5186 1220 798 4803 14042 13565 7365 8015 20012 14376 7078 38569
13278 38569 52295 15872 -19471 -20870 -13423 -5671 -17212 -23492 -25854 -18743 -34209 -63662 -22396
13265 -22396 -11036 -10355 -503 1652 19016 30872 17354 109 5217 13738 3175 -13153 -9063
13252 -9063 -19126 8574 34453 47590 58334 47489 37621 40521 55428 71852 63007 40088
13240 40088 41597 43757 58198 98748 138276 149828 146251 167153 192723 251047 304683 359478
13228 359478 427088 506050 584803 731860 947195 1198471 1473627 1782169 2045848 2214632
13218 2214632 2266303 2154013 1885451 1512256 1138699 840412 658357 522158 452070 384550
13208 384550 313679 289005 278280 289942 269816 250460 257091 261459 261598 260195 255009 272738 292951
13195 292951 296807 284877 297173 348765 405071 428673 468415 539960 626669 750083 893624
13184 893624 1055190 1258601 1511381 1808744 2187720 2737900 3464793 4344073 5254141 6066318
13174 6066318 6635257 6874636 6679823 5949992 4817531 3622353 2612520 1952252 1538784
13165 1538784 1296907 1123186 999217 913291 836019 767207 700815 657504 635361 627730 599434
13154 599434 602146 603819 578506 551634 567730 587021 586673 603164 632123 692273 754805 781740
13142 781740 852237 971920 1113179 1250583 1434818 1667565 1955089 2319994 2815702 3516108
13132 3516108 4350686 5258135 6122852 6796952 7149015 7026204 6380456 5296223 4041103
13123 4041103 2953928 2213835 1754637 1457380 1248827 1093916 1001751 912583 837855 778381
13113 778381 710423 660344 596014 552297 542185 530525 516851 501547 514098 510153 489904 491404
13101 491404 502407 547255 551616 570607 610402 625600 646567 691696 742359 765542 830159 926934
13089 926934 1061540 1268854 1557777 1881362 2182026 2400774 2501901 2488133 2304519 1962780
13079 1962780 1522118 1120778 854065 681204 569920 485111 407601 368755 332150 291391
13069 291391 274442 278858 263602 244257 223682 216256 217048 168573 136151 171526 187371 165697
13057 165697 163707 163007 180754 179609 159187 134497 129332 125613 124538 118378 123678 92555 82217
13044 82217 101930 102419 96624 82501 68454 51207 46676 61156 67180 45996 36222 43708 66162
13031 66162 85026 89817 91584 85207 70366 47111 18641 -13726 -4980 -7537 -16940 9888 -7424
13018 -7424 -1908 16818 27265 13650 3404 15535 38478 39517 25528 31781 51517 48680 37737
13005 37737 26096 34074 30394 15930 -1457 -4993 -3496 -21600 -30178 -19689 13240 19254 -10196
12992 -10196 5181 20290 1733 10141 12735 8675 8211 966 -4576 2814 24137 32614 30521 11391
12978 11391 33980 38549 25905 42625 28645 -3881 -10296 -17987 -14367 16078 22269 4310 -18130
12965 -18130 -30668 -40347 -19395 20952 28432 12465 -2493 -25447 -23355 -28429 7764 8565 11523
12952 11523 -4022 -39117 -49247 -44603 -42033 -22651 -16325 28470 22048 16862 8494 25060 28987
12939 28987 -6608 -24878 12497 4032 -4650 -16916 -23191 -13077 10490 10260 -5819 -2135 25092
12926 25092 14015 11623 28949 34865 7783 -22578 -42678 -31795 -28144 -24402 -34695 -36659 -43960
12913 -43960 -65688 -84925 -99265 -95798 -68575 -37967 -46990 -24069 11211 36486 44411 36326
12901 36326 13718 23210 20579 7470 2267 4231 -8784 1837 6655 4978 21001 29497 56814
12888 56814 41356 28364 27710 15996 38200 53384 33887 7375 34758 69697 43554 -11865
12876 -11865 -7780 26658 6345 5175 10424 1679 -23802 -13508 6372 43785 55027 55858 37449
12863 37449 9115 -8640 -9710 -29991 -22301 -11727 -10175 -19389 -8604 -899 -1064 -7097 -17496
12850 -17496 -2713 21720 32994 31264 12210 5710 -11438 -22305 -28638 -30808 -12716 8947
12838 8947 8231 -17157 5582 34538 45448 26185 -5889 -13630 -3549 -18084 -28542 -9989
12826 -9989 3720 -6860 -429 -3691 -29627 -52005 -44965 -25767 -35244 -28793 -3960 494 -12255
12813 -12255 -20008 -49746 -50105 -24507 -29472 -10619 1705 -2290 11824 -3774 -25785 -23996 -18948
12800 -18948 980 13168 15694 47710 54693 53841 30908 25005 27363 40212 10948 -10679 -27646
12787 -27646 -41003 -71908 -57319 -12584 1725 -8479 -31719 -29393 -10780 4836 40433 53084
12775 53084 27144 33302 51116 67212 48646 46982 42533 25223 43376 40606 31341 30574 8914
12762 8914 12086 33527 8656 4403 14059 -12888 -25766 -2478 -395 14868 6291 20606 7499
12749 7499 10924 44498 28351 16265 -4642 -12942 -1067 28592 -17307 1954 18363 19647
12737 19647 15162 48645 65735 42613 42916 39292 40126 41664 49253 47822 62618 65648 78223 94545
12723 94545 113884 120669 117218 162476 179837 155345 146335 132343 130935 146214 172129 188354
12711 188354 181798 152720 149598 135633 122475 108645 102956 115253 107070 93453 102859 106541 107392
12698 107392 126360 119676 106704 119690 106855 83258 88890 115879 97731 91498 108646 131787
12686 131787 169864 180568 190136 226826 265173 257842 270893 281256 293764 297643 269636 263322
12674 263322 248332 253624 259637 257565 268653 247746 224160 175631 156521 160250 141910 132030
12662 132030 132657 118328 167252 213042 213603 215740 202470 202091 198006 191091 179229 165193 178218
12649 178218 174920 161724 181217 199925 192912 169364 181276 193648 196016 176466 172937 164908
12637 164908 152161 126316 91796 79501 65848 73827 78251 92872 101801 97523 105978 119361
12625 119361 107918 88576 91430 98856 101890 86622 59706 44365 43844 73849 95852 116685
12613 116685 117610 122224 123928 133881 149649 152230 149362 119447 96794 103677 119072 143243 131322
12600 131322 124426 133282 179400 204508 233382 246081 258230 276085 276119 264777 264917 233553 224019
12587 224019 258068 253596 203971 187719 202944 228367 237654 246854 250443 253966 259328 263864 313480
12574 313480 338609 335886 332928 339810 327522 297229 314742 327746 321117 316934 320396 343371 367337
12561 367337 404778 386939 417558 453040 492584 534748 592657 652852 691348 735980 751306
12550 751306 735337 666570 587303 531775 503418 490331 483827 480594 449946 460818 451383 409913
12538 409913 387769 416682 418572 423059 391399 379946 394212 376728 341195 341769 356482 350792
12526 350792 324991 331172 338425 329354 310175 313338 311027 313498 328672 346672 352111 367541 394834
12513 394834 409950 436248 438867 441270 427211 420845 417144 370054 310098 259572 222684 203195
12501 203195 218642 237709 246798 226402 193975 193228 191928 187298 193904 198414 195133 184443 202164
12488 202164 234456 239998 219060 211093 219214 239587 275399 264793 273976 294698 295435 293349 273445
12475 273445 265117 254351 268866 302162 322326 345073 348108 312805 326655 352467 344386 360057
12463 360057 356299 366252 407991 461444 511352 537460 547643 580251 624147 658606 678845 669238
12451 669238 652258 642165 617534 617133 604699 587934 604324 601246 588835 611711 607264 627626
12439 627626 640514 643930 692988 712719 748742 777055 770014 771613 826133 853488 835178 836785
12427 836785 863129 881214 927445 972044 1032929 1097081 1164401 1256522 1340955 1395723 1436896
12416 1436896 1432056 1403790 1352876 1318158 1260293 1168933 1096720 1026069 963299 924641 909188
12405 909188 883021 834177 783854 773968 772193 756764 735441 721746 719992 705497 698385 683224
12393 683224 680141 641407 642011 624371 622296 622873 627370 634077 646884 663597 685741 697843 698301
12380 698301 705277 688175 651662 612343 590185 577706 543165 477867 441772 419440 364541 342975
12368 342975 333976 323910 308087 291295 288146 275405 254595 233193 223706 233009 242478 236603 280184
12355 280184 275555 274580 255653 240954 245718 224764 224569 204399 157244 162929 188289 169145 154429
12342 154429 183658 180473 165685 162756 164785 159149 162718 158530 154962 124156 134612 160490 170050
12329 170050 174124 159958 183497 196364 188780 198504 193997 211263 256019 306842 354855 379773
12317 379773 449583 501060 554655 606144 655289 686856 685180 691765 645828 592469 547141 524481
12305 524481 503465 481819 477159 477396 481868 472038 509814 519062 529118 496011 438359 462497 466655
12292 466655 467314 457102 441069 428861 431488 461451 479972 477385 509002 567563 584401 596719
12280 596719 660143 726510 817203 903652 994750 1136856 1290165 1412947 1526196 1585397 1617767
12269 1617767 1574362 1481953 1335715 1186756 1051106 938011 832610 782422 769143 760652
12259 760652 717237 686201 698503 687831 686505 704865 701664 693632 664975 626438 575298 552038
12247 552038 543794 536749 540470 557173 550434 559021 567360 580102 572452 550656 525498 547291 569513
12234 569513 598198 633099 653976 692138 718721 739211 769228 715605 642014 590951 541239
12223 541239 489671 428507 374039 365943 356555 339809 341404 334818 315400 295254 294340 305105 325784
12210 325784 318927 270406 230358 225833 216217 208978 200056 216151 215792 209090 219457 214849 203163
12197 203163 185456 183943 186469 167004 154452 175996 171644 149204 114580 80639 125393 156240
12185 156240 115726 90027 114190 136367 148151 142945 136983 158378 160218 142848 123392 104829
12173 104829 114717 120210 114895 95770 89254 74564 61745 53857 30230 30039 43082 66164 100115
12160 100115 123642 128025 129849 128992 121155 129239 113885 118182 112935 80215 69765 72416 67079
12147 67079 76423 114206 124871 121922 129509 140907 154303 131447 156255 151956 150444 161607 183757
12134 183757 240769 243762 216319 215241 222352 233313 223185 210142 206701 202875 207218 226702 226119
12121 226119 220094 223393 242228 227214 233013 224956 237641 273966 274724 251305 259466 248505 239802
12108 239802 260489 256825 264075 291008 262502 228077 255271 289252 296391 286080 296823 331738
12096 331738 371774 394997 418232 447123 444035 461986 476847 492651 505291 520035 509789 475738
12084 475738 438322 413256 371061 342545 338789 345864 343761 359063 355844 347432 331054 317820
12072 317820 320367 313859 310390 300273 306224 305469 295677 288804 310381 308631 305474 294699 287530 294988
12058 294988 309721 294563 291152 288921 276194 283377 282442 280196 308251 342827 322849 284612 276236
12045 276236 270165 277534 271198 281976 282332 287120 295722 261639 269018 296846 287386 289937 314909
12032 314909 322700 310482 297552 283650 262718 242471 253800 282564 292401 295095 305992 300133
12020 300133 288399 311836 330906 300965 281883 317413 353001 369420 372572 367853 388919 415464
12008 415464 459500 505154 520471 530782 549245 546929 536080 523722 501644 506481 551133 582217
11996 582217 604912 621430 622251 644693 673564 716847 744826 736532 718938 712436 714175 734679
11984 734679 734560 735750 759238 785512 821944 850661 850152 843255 910937 983357 1032102 1055348 1094441
11971 1094441 1137972 1180211 1213498 1266903 1337763 1401279 1433242 1462578 1505883 1591647 1655954
11960 1655954 1732440 1804544 1867306 1941976 2020033 2118709 2235759 2391098 2547219 2691737
11950 2691737 2822693 2918043 2987627 3004969 2958601 2911100 2901549 2883550 2863886 2857459 2854770 2904355
11938 2904355 2951956 2994629 3074998 3159586 3260619 3381827 3478765 3570290 3617886 3600129 3579458
11927 3579458 3569611 3515140 3472400 3451074 3499895 3578272 3659274 3739994 3837903 3979772 4152080
11916 4152080 4350633 4598326 4902280 5256508 5681809 6095961 6525277 7010212 7480066
11907 7480066 7906361 8298544 8700785 9172109 9673648 10251894 10932665 11652129 12391729
11898 12391729 13129151 13830889 14491593 15113095 15702602 16340592 17101749 18073741 19264861
11889 19264861 20769121 22625032 24875945 27652612 31107848 35476435 41016331 48034270
11881 48034270 56679100 66842652 77899068 88779195 98169280 104704618 107432563 105871871
11873 105871871 100347929 92139733 83194028 75361525 69771635 66541349 65226131 65368390
11865 65368390 66563827 68552544 71096139 73893067 76686241 79247971 81401716 83030893
11857 83030893 84275596 85453178 86972620 89082302 91824651 95032678 98450036 101719888
11849 101719888 104612338 107004787 108917536 110610063 112588455 115529250 120056169 126774185
11841 126774185 136266967 149237636 166218066 187239742 211339852 236144307 258345909
11834 258345909 274494459 281484867 277184110 261411909 236821110 208417267 181575156
11827 181575156 159761088 143899665 133212548 126473725 122541003 120523756 119670420 119355849
11819 119355849 118966683 117933236 115982509 113090224 109598727 106076955 103065163 100878345
11811 100878345 99501448 98614771 97921893 97191045 96213681 94848712 93084463 91064001
11803 91064001 89155934 87775960 87255276 87804006 89614894 92890055 97732267 104139542
11795 104139542 111618619 119159610 125430048 129038861 128689317 123538873 113811055 100859416
11787 100859416 86800956 73745947 62922202 54592353 48456489 44015451 40756147
11780 40756147 38321329 36416599 34883135 33585312 32488416 31515874 30627355 29783360
11772 29783360 28972146 28112503 27201483 26236722 25226127 24216556 23221298 22270332 21337772
11763 21337772 20450810 19604134 18774070 17886090 16976538 16073579 15149566 14197077 13296219
11754 13296219 12487644 11738887 11032502 10425809 9938989 9492862 9107895 8766447 8476686
11745 8476686 8233343 8038091 7860034 7712583 7558117 7404725 7234262 7096843 6964805
11736 6964805 6781807 6563611 6302557 6045849 5855530 5635369 5443079 5308397 5199154
11727 5199154 5105779 4995317 4923513 4877199 4861925 4873545 4857080 4838514 4766179 4662592 4537854
11716 4537854 4352055 4129949 3918907 3670181 3433871 3236436 3088359 2934505 2799320
11707 2799320 2658780 2541334 2486477 2426821 2374780 2330791 2292951 2213679 2145818 2107688 2052781
11696 2052781 1962775 1893543 1819988 1745341 1690507 1625546 1597740 1568335 1504980 1471932 1450548
11685 1450548 1432353 1409263 1396195 1384461 1359168 1349859 1326731 1276082 1231171 1209933 1235665
11674 1235665 1232339 1256155 1267956 1249979 1205455 1208943 1197174 1178991 1148536 1146760 1114615 1109569
11662 1109569 1095900 1077185 1085326 1064696 1041018 1035533 1024651 968997 935646 932016 912732 919849
11650 919849 932812 947646 956425 944311 906282 937722 928025 909072 890529 862641 864356 867101
11638 867101 857657 874506 864333 841220 823706 828796 862869 856214 848015 839047 829067 845757 843160
11625 843160 826073 791497 775012 758815 733554 702267 703148 709351 702933 696476 697195 695841 690607
11612 690607 684124 686154 658305 615079 623121 632426 629993 600566 576765 583708 581505 524221 497238
11599 497238 491783 508055 520111 503856 471391 468068 513389 508545 445379 427527 456651 468633
11587 468633 474609 462977 458837 457447 414392 366589 351737 347838 328595 333792 323104 318255 318729
11574 318729 317930 325567 308234 293310 316033 321274 341773 356673 343259 320777 292001 300090
11562 300090 296935 289341 257497 235684 233694 254903 263457 254568 254357 248019 237198 227946 227751 230607
11548 230607 257910 269620 282282 275655 271776 264284 249078 243337 250577 279138 278496 252338 222359
11535 222359 210892 216504 221992 222771 188304 220063 239598 230905 224416 211102 219150 234003 238594
11522 238594 277062 284512 281779 290460 264320 237532 244587 252141 245946 253865 245267 241137 245662
11509 245662 266489 267981 246487 228916 247952 267107 252359 238641 234882 238617 227008 230385
11497 230385 237694 234357 224760 210399 200473 177763 176606 179805 176166 194712 197642 186994 205647
11484 205647 210925 197877 206059 220213 257815 275454 285359 290123 285855 250806 231632 225080 229705
11471 229705 229931 242236 237162 228196 224161 213642 199893 173059 169704 188226 232528 235857 208994
11458 208994 194212 167497 174676 182642 177241 166442 182442 175613 167208 187912 223646 242204
11446 242204 224189 212706 249909 286107 316279 318053 314691 330825 396100 435253 464206 510033
11434 510033 557099 599543 645316 683694 695143 654652 609226 583694 533993 487574 473683
11423 473683 446323 433020 413580 417970 409957 413889 430221 441441 460244 459075 473075 510441
11411 510441 529510 558378 603333 624942 611126 617494 651053 664934 674111 664694 701278 750557
11399 750557 752017 738711 771697 852151 972625 1092761 1224969 1337326 1450839 1539637 1608216
11388 1608216 1619528 1584359 1475465 1329833 1186789 1048023 941709 818460 754602 724781
11378 724781 698966 673329 677107 639431 597424 564383 577511 584443 603340 598465 618115 641499
11366 641499 652494 661017 653083 642366 650724 640190 646130 658380 669921 680858 675950 655130
11354 655130 629460 642808 669115 694642 745412 797422 813292 777211 760797 718867 676241
11343 676241 608531 535308 466849 404508 389027 352802 326977 298152 286104 251626 221974
11332 221974 239000 255473 250556 220379 200025 204457 198924 183353 187159 171077 173546 194360
11320 194360 183100 174083 176383 188891 166364 161273 150298 124144 132054 156038 204927 234061
11308 234061 249104 275656 266356 255794 266681 272324 256242 212449 166983 107016 106589 98488
11296 98488 100078 98840 72200 63549 81723 64350 65329 77084 73389 81255 89015 73927 91525
11283 91525 103712 84533 87010 102444 134518 129786 102969 112777 108633 72111 52990 54526 50625
11270 50625 68729 64480 64432 60411 60023 63920 68908 113974 105488 86608 65337 33085 27369 7970
11256 7970 -6628 31766 63483 55537 43699 50090 63526 83864 67387 33971 12404 17023
11244 17023 35542 46667 16914 -22077 1798 30536 62613 47889 51213 54100 46057 60357
11232 60357 50992 16739 11583 29417 41707 34965 65175 70348 73179 79229 84911 81966 79526
11219 79526 86626 85595 70180 33071 40128 55686 62576 63283 34930 29840 29823 34673 38027 51260
11205 51260 43564 45147 43194 33870 13898 -69 37552 70880 82577 68085 74346 116839 94547
11192 94547 76874 34811 34808 42067 42135 49574 57316 73129 77221 49144 32900 31511 35700 18891
11178 18891 14334 39822 46527 48372 55398 33124 18783 38723 49100 48160 36476 32403 13830
11165 13830 -2983 17786 30069 19616 16964 42978 45934 8294 -9347 -17095 -49714 -54371
11153 -54371 -24762 -11432 11864 10179 23591 35031 30303 42228 13936 1428 9760 19514
11141 19514 17938 23639 28504 3246 -986 -14898 -26998 -341 8661 9416 17505 37272 33920
11128 33920 16026 15458 11271 14179 43818 76728 65110 52219 37463 32740 44125 52937 12128
11115 12128 320 13131 15667 32109 47098 22140 20532 -4106 -13841 -5619 5038 -1199 -5225
11102 -5225 10270 39658 53433 43281 4275 -4845 4134 4879 19843 6374 5231 2797 29280
11089 29280 43249 28401 14690 38780 63126 54147 67096 74902 67659 55668 49458 39575 53280
11076 53280 66768 45581 15859 17631 22121 1083 3119 23739 47307 44219 29682 13983
11064 13983 20148 37961 81017 68478 54091 48190 42896 25703 -849 -3077 4358 18382 -17131
11051 -17131 -34492 -7969 -4985 -43317 -40294 5444 5418 -7631 -695 -153 3010 18125 31669
11038 31669 29953 34470 53240 37557 38649 47603 58124 40870 35956 36370 -10462 -19370 -38054
11025 -38054 -28510 -26803 -32317 -11277 -5456 5433 27032 13442 25151 21068 7907 9997 3033
11012 3033 7170 22464 33072 44755 45029 43037 18870 -3821 -3539 -2584 13005 42007 24235
10999 24235 -6276 -11369 -23098 -19655 -12997 22901 38143 39247 25122 -7129 3519 173 -29968
10986 -29968 -31721 -10532 17840 39390 25400 6181 5234 35925 35792 16139 -700 -24816 -46789
10973 -46789 -37809 -13204 8710 -14811 662 5007 3651 11410 1485 2376 6821 8088 36096
10960 36096 56443 82102 66726 61392 56038 38899 19966 11080 34698 37688 48102 54105 59645
10947 59645 63442 61088 40579 33195 36767 17534 6095 1186 4761 13528 29776 6686 -7370
10934 -7370 13417 5744 -16276 -19843 -25538 -41275 -54900 -42007 -15971 9738 8677 -10459 -40662
10921 -40662 -31900 -15336 -21421 -2487 17055 38320 41296 53693 27107 -8871 -43754 -50984
10909 -50984 -25994 -23455 -35709 -40226 -52327 -45361 -9800 11158 -5702 -33494 -53584 -15203
10897 -15203 751 -22572 -30828 -14637 6216 14334 7820 7752 6691 30776 42597 36895 10665
10884 10665 -15762 4280 12140 15414 13861 5353 8304 12770 -14426 -19891 991 -4034 -10420
10871 -10420 -4483 -2479 -3942 -14204 -12888 8686 23692 11081 1067 -5504 -18047 -36086 -42757
10858 -42757 -4529 21117 35706 58199 40755 18182 -977 -24992 -10297 -21090 -24507 -14544
10846 -14544 3200 8610 18623 38219 27297 23066 5574 -10401 -20480 -15588 -21635 -26889 -2302
10833 -2302 8225 -2209 -457 -16466 -23390 -27191 -28598 -19192 3787 -3852 -18807 -28342 -37012
10820 -37012 -36198 -9763 -23362 -20144 9019 10068 -30926 -38057 -24525 -14289 -3122 -4359 -9950
10807 -9950 -40518 -39674 -21704 -18507 -21593 -15881 6306 -18600 -23840 3291 17559 22961 28474
10794 28474 25560 34984 49042 46843 47379 57174 54526 34344 25011 47643 27120 -13698 3297
10781 3297 23240 1314 -36152 -30626 -9251 6962 10111 13179 3270 -2677 1830 -8699 -35142
10768 -35142 -21328 -6491 -20017 -10469 -6032 4769 31229 48590 40142 18590 -2941 -15499
10756 -15499 -3497 -12442 -25930 -33063 -25505 5009 39886 47828 16512 17644 18888 28075 36408
10743 36408 25226 37725 16918 -12450 -8327 3123 -538 3733 1469 14917 23278 15152 24979
10730 24979 23302 25246 6410 -3273 5885 11428 -1628 -17890 2158 16189 43451 42923 16119
10717 16119 20613 27277 17759 -1889 232 21753 35566 20788 28455 9622 2920 27130 38088
10704 38088 19019 20016 33432 20855 22041 39238 76933 76843 54459 61421 79573 73453 70861
10691 70861 37473 25832 18921 6991 -7458 6819 15675 46888 65199 78129 58395 28139
10679 28139 19263 38865 41831 47924 42654 21674 13709 29574 49552 50753 29293 16692 8508
10666 8508 -1819 -2326 38567 42722 18559 -150 4130 5994 10156 -1297 9856 6048 -7061
10653 -7061 8215 -4030 -14489 -3075 3046 -16496 -55420 -64191 -23916 7064 399 -1743 -9075
10640 -9075 7308 6451 33734 30567 32770 52729 36446 32588 6969 -5529 24046 40029 38709
10627 38709 29937 35221 38288 18405 7494 27405 42880 29987 10118 9954 -3773 -11106 16331
10614 16331 21012 16687 22144 35166 56138 96180 104805 101974 92064 73880 77411 70344 71930
10601 71930 70173 99455 92482 90610 94307 66144 49862 54880 47770 53033 70595 68833 57726
10588 57726 68538 53077 45029 36021 35002 60461 78881 49953 33006 22018 28629 35223 40607
10575 40607 64175 68537 81017 96741 78355 35441 57974 68100 89949 92280 78206 74378
10563 74378 80605 62342 30070 12558 -5063 30097 52386 70977 64220 49744 57580 52932
10551 52932 22067 13030 37244 25879 18790 13627 32868 65138 44151 37779 48028 32545
10539 32545 21633 33005 50370 62811 63701 64058 44362 12520 -9847 -20958 -20599 -9734 1029
10526 1029 12807 17013 34835 41168 21184 29224 46808 60815 62831 62767 61548 56410 40026 37517
10512 37517 58998 58110 35659 45655 54415 66830 44892 21344 16473 35512 53134 76424 77923
10499 77923 50654 32548 32543 9960 5719 15094 48443 43210 23444 13541 25375 59497 88425
10486 88425 83519 68404 89087 109533 60576 35184 40487 27154 3448 -5123 5298 20583
10474 20583 33689 29721 -11814 -21329 -17782 -25219 12134 41854 35863 36657 10379 -3946 16169
10461 16169 18363 13390 10648 -710 12669 18242 47638 47033 25884 11809 4707 19883 30556
10448 30556 12316 27096 21994 6225 -14554 -10357 -2361 -9865 9369 6869 22189 37922 40980
10435 40980 50489 33816 18065 17274 541 -14843 -16997 -2788 19194 15548 2087 17822 18709
10422 18709 14618 16482 3588 4488 12390 25951 16717 19683 31700 15832 15172 28923 21784 45996
10408 45996 33348 19330 19194 8269 13811 4977 14106 25277 25865 46830 46629 33130 17853
10395 17853 12516 34637 42120 65430 76225 64299 55753 67633 56980 63547 68762 77736 78668
10382 78668 67908 40244 6393 15976 21020 14723 25475 46516 68416 83346 72724 39826
10370 39826 40125 66022 75227 79796 75654 76826 86767 84790 106365 89627 92540 100012 73194 47720
10356 47720 62670 73268 73342 61704 43924 45289 47536 78220 109428 86268 71683 61816 84554
10343 84554 106794 111663 79035 73207 80694 111296 104894 65777 77928 68849 57215 50539 72981
10330 72981 82424 100646 77582 70169 70333 86772 104853 122824 118594 100677 66450 55553 57810
10317 57810 71660 87965 98140 106574 96163 84319 84165 100593 114844 126488 134085 150464
10305 150464 148107 138159 164144 176859 179928 191842 270923 325639 343048 349448 348971 356910 340861
10292 340861 329781 309485 278263 276672 257179 246916 227860 194420 161649 151961 163848 153535
10280 153535 153155 139301 144358 191586 200921 206590 228994 261820 299479 339000 366301 385552
10268 385552 388030 371760 339886 322504 323589 321196 344308 390193 442061 522167 587601 624324
10256 624324 678058 779061 862299 906434 940670 961268 970640 983789 943455 937088 925298 859386
10244 859386 811697 811886 814824 858924 952535 1065733 1156347 1265203 1349658 1394230 1402271 1403758
10232 1403758 1341608 1229892 1117197 1028125 954189 846750 757217 669351 610884 595479 580975
10221 580975 603061 645569 694547 730825 775696 841796 900450 971258 1080324 1203654 1306161
10210 1306161 1387869 1447883 1510557 1562179 1550200 1474941 1362901 1225484 1078129 954740
10200 954740 869703 762067 673850 632668 594861 541996 517252 481471 459638 457461 449524 475089
10188 475089 492578 462922 452937 461793 468432 505823 495391 481896 505947 519593 537810 583002
10176 583002 607472 649793 683311 728296 784175 841716 915109 1002052 1115015 1206103 1289171
10165 1289171 1357404 1392477 1366204 1309307 1207863 1062926 915687 758493 657970 601846
10155 601846 553719 523567 506067 508914 505828 472714 463351 458047 452471 457013 435933 425565 431991
10142 431991 440625 448488 467724 447074 449637 438891 437794 453539 439624 440267 447217 440079 432270
10129 432270 445609 452803 474230 501919 532041 588117 618402 644785 667274 661410 646444 602778
10117 602778 563176 520645 453323 422247 400191 417827 435495 423591 395477 383387 396353
10106 396353 393282 365390 378069 418631 460187 486225 481757 470969 479132 485972 497428 505665
10094 505665 511576 522695 516927 505252 468348 451755 451674 442738 429588 427519 445368 442970 426836
10081 426836 414486 405421 405732 433942 458026 459370 446054 483423 486307 482953 479138 475847 473481
10068 473481 476096 496651 501050 488536 506003 503909 509918 525279 546936 528724 514966 540021
10056 540021 561561 570429 563279 574974 598001 633752 642306 649214 640217 650245 643364 630640 601799
10043 601799 541919 500057 448862 380870 398692 419255 415236 409708 391781 390954 404155 418104
10031 418104 406230 400067 400742 385491 404470 396540 392023 404836 416573 414828 421600 426530 438007
10018 438007 448379 408530 364827 347689 310730 305135 329733 367324 386258 400043 422006 436270
10006 436270 456997 450338 426780 426357 424874 409681 405414 415503 389735 380279 374820 356342 356725
9993 356725 396103 410387 410488 395425 380113 350288 363091 368443 358042 340067 335636 343330 344192
9980 344192 367254 355753 399598 447885 477399 468546 476537 505404 510756 489113 519552 557074
9968 557074 585462 568864 590212 589139 602715 629748 636881 641512 655764 683847 685888 653327
9956 653327 649280 681921 715359 761722 798633 852743 891840 965374 1013626 1065137 1105925 1136481
9944 1136481 1164259 1168857 1128406 1058304 1021267 1002410 1013521 1039175 1061855 1072613 1067001 1064323
9932 1064323 1101762 1154476 1211008 1243776 1273998 1318613 1381301 1437457 1463936 1522607 1606106
9921 1606106 1686066 1763077 1851330 1937154 2004125 2074153 2174988 2292018 2424933 2603430 2806925
9910 2806925 3014031 3227675 3398424 3580373 3748526 3910039 4109106 4328958 4503177 4652326
9900 4652326 4757324 4832065 4879744 4844704 4720491 4568077 4471581 4409354 4386636 4398662 4463484
9889 4463484 4557734 4731422 4959662 5275979 5647656 6094207 6662014 7347768 8119232 9061093
9879 9061093 10144713 11287981 12421218 13483299 14420132 15141996 15707081 16329478 17236697
9870 17236697 18609819 20624168 23559708 27279965 31243978 34606669 36735937 37399852
9862 37399852 36031279 31892183 25966418 20499418 16828863 14879442 13988056 13691531
9854 13691531 13763367 14170907 14805995 15704804 16875834 18382440 20309115 22621451 25415412
9845 25415412 28783324 32905954 38003081 44385530 52314994 62009633 73432166 85953919
9837 85953919 98194347 108410784 115002220 117005491 114013615 105467118 92862997 79901650
9829 79901650 69287342 61889504 57583832 55947403 56549151 59128293 63457341 69343487
9821 69343487 76480317 84495090 92924049 101142295 108310414 113839051 117639792 119756922
9813 119756922 120137948 119062601 117108923 114793298 112532575 110518894 108902825 107861978
9805 107861978 107511683 108022096 109790237 113502251 119996710 130254900 145378457 166168064
9797 166168064 192351420 222024921 251481553 275906542 290937436 293703247 282674019
9790 282674019 257450538 222451627 186612589 156477484 134544485 120362857 112218964
9783 112218964 108323395 107250521 107969792 109837753 112441096 115365414 118327186 121263769
9775 121263769 124264305 127176878 129489948 130739015 130542733 128566454 124690124 119167739
9767 119167739 112145661 104005711 95516313 87413299 80385898 75114803 71786696 70328063
9759 70328063 70638469 72751390 76804442 82917707 91009655 100378561 109609608 117099458
9751 117099458 121314424 121247475 116209094 105940588 92104604 77931995 65647601 55812700
9743 55812700 48218890 42483126 38177963 34847301 32196247 30013814 28169743 26566263
9735 26566263 25120294 23837539 22705323 21665363 20726637 19893550 19202634 18600208 18053306
9726 18053306 17607110 17269143 17061474 16908352 16774604 16603887 16402229 16253266 16162910 16119451
9716 16119451 16101755 16090952 16063528 15997531 15821664 15478859 14883173 14116204 13257237 12304402
9706 12304402 11236906 10194558 9326630 8662367 8107463 7683936 7326864 6999124 6716911
9697 6716911 6479176 6301318 6144742 6014857 5963592 5942044 5955216 5953931 5961275 5957643 5949155
9686 5949155 5914414 5803953 5690867 5524761 5323969 5114816 4878288 4663869 4503465 4350025
9676 4350025 4165691 3954677 3788425 3647701 3462584 3265668 3096623 2928329 2808578 2674552
9666 2674552 2543879 2425458 2321962 2224139 2154412 2096274 2051104 1984223 1942431 1928466 1911125
9655 1911125 1871377 1835163 1817867 1783839 1739511 1666994 1594791 1577773 1568858 1556594 1514294 1479163
9643 1479163 1455820 1413510 1369255 1343934 1318043 1294074 1279802 1289644 1298513 1311198 1319502 1332835
9631 1332835 1357210 1375586 1392603 1399390 1381880 1370543 1360006 1342771 1297762 1261704 1207596 1175519
9619 1175519 1199609 1204520 1194626 1181196 1182683 1192777 1198416 1182909 1175046 1173102 1211696 1207030 1192697
9606 1192697 1197598 1232085 1228821 1253511 1290065 1320357 1352395 1380804 1405468 1413688 1433129 1440821
9594 1440821 1400325 1373056 1363822 1329111 1334017 1329710 1285149 1289760 1317145 1335251 1382657 1391946
9582 1391946 1390302 1405857 1418194 1419980 1429855 1435578 1402388 1387591 1381618 1367394 1346566 1323126
9570 1323126 1333989 1338690 1335896 1330305 1328604 1351935 1374169 1368779 1405556 1445598 1501122 1563124
9558 1563124 1632010 1703334 1764014 1795760 1770503 1725433 1648779 1590946 1541849 1484151 1423040
9547 1423040 1383212 1393087 1412588 1405841 1410235 1411301 1442645 1455857 1469599 1499837 1530354 1550774
9535 1550774 1586380 1614341 1624665 1630968 1644641 1671197 1688927 1705637 1702895 1698282 1692283 1691385 1737840
9522 1737840 1787030 1818782 1883820 1948009 1977296 2028774 2108480 2175655 2253364 2310145 2355280
9511 2355280 2384124 2413128 2460633 2530973 2595925 2699775 2797325 2897234 3000721 3116367 3249068
9500 3249068 3406825 3581787 3724610 3887077 4075767 4276025 4494937 4723692 4982963 5233877
9490 5233877 5510854 5788875 6117554 6478519 6890263 7313396 7746954 8241158 8768567 9308572
9480 9308572 9897336 10482824 11093300 11738447 12410434 13124684 13812087 14501246 15183271 15890439
9470 15890439 16586329 17261652 17901032 18514078 19091367 19640240 20175270 20720891 21259969
9461 21259969 21739184 22213806 22710412 23180414 23641874 24106878 24622601 25172634 25744409
9452 25744409 26355511 27053934 27825997 28649561 29518161 30477861 31547332 32740537 33993480
9443 33993480 35321763 36690032 38108970 39549740 40989394 42404580 43761961 45020902
9435 45020902 46121659 47053892 47764750 48198021 48358222 48264064 47924039 47357759 46578726
9426 46578726 45613304 44527923 43354537 42103381 40867269 39677826 38540988 37466455
9418 37466455 36418962 35452053 34585749 33748558 32920002 32116273 31346394 30617152 29927582
9409 29927582 29298899 28772724 28274505 27801818 27365283 26931662 26529094 26146190 25751575
9400 25751575 25339593 24901301 24419349 23933098 23430687 22897530 22306405 21665371 21032368
9391 21032368 20393025 19691972 19025792 18339161 17623841 16967096 16328200 15715906 15114288
9382 15114288 14521480 13970728 13494821 13068523 12680178 12282641 11916288 11642613 11360887
9373 11360887 11084218 10779597 10475516 10132448 9727143 9355173 8972572 8631167 8295694
9364 8295694 7941797 7649355 7360237 7076848 6854787 6644283 6458713 6291260 6151199 6032683
9354 6032683 5905956 5790096 5681712 5575978 5494009 5436056 5370206 5307854 5258881 5189972 5144726
9343 5144726 5097313 5063344 5046432 5027142 5014653 5004552 5004201 5014764 5027392 5046239 5092208 5154641
9331 5154641 5201008 5209743 5190991 5156889 5103998 5021397 4908829 4790442 4692747 4573108 4448825
9320 4448825 4278656 4100217 3957900 3828701 3709317 3622463 3506335 3373161 3286712 3208507
9310 3208507 3149085 3081855 3007612 2909817 2835595 2750440 2659803 2560269 2443605 2369130 2310651
9299 2310651 2243632 2196701 2153042 2109101 2064120 2001054 1973008 1945862 1926348 1932575 1951334 1972237
9287 1972237 2021358 2066619 2105790 2148332 2166284 2163761 2107955 2022321 1913312 1790338 1669625
9276 1669625 1584721 1509121 1434487 1447235 1459341 1455226 1468610 1534104 1580561 1603372 1644110 1665552
9264 1665552 1659904 1622059 1542974 1509061 1479581 1469570 1448102 1431839 1414129 1395478 1378483 1398969
9252 1398969 1421150 1513110 1621981 1797848 2011510 2201733 2347936 2440159 2474034 2388657
9242 2388657 2191768 1912777 1672035 1495304 1351773 1247881 1211213 1231517 1242172 1222809
9232 1222809 1234189 1228553 1215835 1235827 1267679 1284488 1264945 1262487 1259518 1203030 1144721 1080934
9220 1080934 1011434 931808 893261 855930 859983 879217 905756 948884 994925 1066612 1111104 1139265
9208 1139265 1148113 1146437 1105522 995320 879921 756990 657626 585761 536753 530453 497577
9197 497577 479346 446864 425708 433956 450927 465690 450138 405378 419525 437159 406563 367199
9185 367199 373298 371175 367426 363311 346472 334753 367135 360744 337336 327088 318337 304843 315535
9172 315535 300960 289874 284209 290723 286666 296710 310894 298337 286187 267087 238397 245888
9160 245888 242569 222515 224536 220123 221552 214685 251577 257657 238343 205469 209446 179573 179311
9147 179311 194843 212549 222612 230816 241084 232184 212246 208043 207257 224322 232757 236493 222715
9134 222715 217583 219951 216874 212560 189101 182274 178055 206780 206668 183173 188065 185458 177346 148110
9120 148110 129473 114675 106901 167721 170936 128639 121421 148414 164642 182795 186100 181400 193261
9107 193261 222216 202588 206339 197397 163143 136983 131963 143478 171882 157104 120659 102966
9095 102966 102136 96330 77541 65892 102009 148610 165550 156355 175109 156862 111738 135575
9083 135575 147099 126583 112990 103638 121434 147465 177558 207042 218873 211670 203977 203469 198532
9070 198532 204882 221341 207592 213428 223364 194533 182075 177167 170046 141247 134082 128374 120795
9057 120795 115370 94446 81082 107845 120298 117482 108010 109013 142595 132965 130567 128037 156104
9044 156104 184859 168288 130891 118928 113529 102681 100018 109523 86378 87255 109347 130149 100392
9031 100392 104754 104495 104085 137222 135818 136225 118148 114008 105529 116529 122581 130754 133311 142438
9017 142438 134887 129745 123708 117489 133363 108499 77678 89123 102822 104907 94350 108185 117426
9004 117426 112954 119715 133026 128871 121481 129889 98193 49279 35540 48366 76063 90746 111740
8991 111740 149407 151999 102617 83742 109235 106355 122979 148716 139601 136965 142841 147207 150195
8978 150195 140501 147483 164544 149644 136458 118103 129654 127333 132214 153894 139910 132667 105387
8965 105387 89433 109658 87363 58559 62077 91080 117707 158470 184079 172037 159248 161939
8953 161939 140049 123465 102702 113459 145178 158527 147628 168681 162486 140610 157873 172307
8941 172307 144217 134712 140861 144541 129241 122583 133802 144546 131242 129408 181941 214994 222108
8928 222108 229496 234761 273332 344267 391292 442634 507717 549070 586128 663212 789441 961048
8916 961048 1112406 1274819 1480504 1693439 1915807 2168061 2453231 2832452 3373241 4144131
8906 4144131 5156520 6284386 7292889 7999616 8277545 8184931 7425210 5970318 4455477
8897 4455477 3318638 2582604 2101417 1775670 1560654 1411989 1311045 1213578 1183449 1123049
8887 1123049 1004730 900233 856277 855399 814547 785135 770146 742061 725202 729809 748042 715834
8875 715834 693060 669680 623603 610083 585089 540006 515860 513712 512480 482672 460514 446923
8863 446923 447848 410628 357434 329689 328814 339019 326988 287559 256237 256824 254738 235941 230324
8850 230324 211181 205913 215754 244569 242313 237857 253620 250867 238098 213511 187170 180578 172144
8837 172144 178400 194054 210528 199493 171292 145266 172821 178836 174328 165225 148258 160948
8825 160948 149383 162488 164343 132982 128423 130973 104716 76501 72917 80127 84104 91115 102012
8812 102012 99388 105163 108966 110340 114368 138214 142520 146158 113960 111256 109308 119519 104004
8799 104004 104741 109790 111798 122337 92928 109438 95608 64532 66410 64655 81255 106193 98761
8786 98761 122868 119847 123940 131527 118308 118382 141034 136517 128202 114719 133559 108767 74691
8773 74691 87502 89203 62080 32494 17773 42932 58167 33269 24378 46013 70220 77522
8761 77522 72588 80418 93870 108047 98762 108041 99731 89373 109716 131852 132118 141981 154327
8748 154327 147815 132837 116242 103938 108790 83728 81217 71199 73433 85621 109343 112388 86454
8735 86454 74973 97204 111061 97205 115846 138712 133061 125929 136655 164255 149458 122819
8723 122819 90437 60812 74647 97464 103942 93571 129381 135569 140809 160615 169108 144179
8711 144179 146268 129840 121869 130597 141845 142962 141945 140513 158654 191618 217896 191672 138255
8698 138255 133942 148629 179465 204862 189996 201080 242892 243999 259635 264482 288849 320654
8686 320654 341707 379996 450089 547701 650389 737623 829378 937284 1076260 1274189 1522874
8675 1522874 1844366 2298251 2909884 3717362 4783787 5945058 6896541 7475182 7667440
8666 7667440 7515082 6485763 4805867 3409242 2519342 1977656 1620158 1383362 1257828
8657 1257828 1161449 1061598 1013878 967498 926245 914232 915807 904433 884890 844215 818894 834909
8645 834909 840901 865083 901636 959731 1062258 1161543 1276389 1387985 1549119 1733230 1951184
8634 1951184 2208484 2508113 2844239 3257316 3817808 4596143 5706412 7278888 9376149
8625 9376149 11669391 13688775 15034718 15526741 15433230 13706688 10312233 7226208 5186676
8616 5186676 3926949 3142910 2661259 2311950 2045232 1859852 1742801 1647779 1565982 1492289
8606 1492289 1441949 1386803 1304028 1243772 1222053 1189678 1148771 1162675 1170233 1187366 1226985 1288302
8594 1288302 1340551 1370418 1398631 1443867 1525417 1588584 1705943 1838927 2029788 2269319 2651655
8583 2651655 3173060 3889560 4858221 5999654 7023201 7754135 8045088 7971263 7332917
8574 7332917 5781144 4141415 2973397 2262982 1849623 1575220 1361244 1206197 1085035
8565 1085035 994706 945249 906803 853428 808267 779325 742295 721934 714705 686428 651466 641112
8553 641112 659055 667994 659609 650817 652022 609435 573695 568843 571227 552045 529306 530558 511363
8540 511363 473196 471053 503585 559591 573016 554328 537217 499143 432301 383778 320015 263871
8528 263871 241083 235333 248322 234672 212546 202326 211503 207567 196951 180803 181148 141357 124388
8515 124388 142805 159689 143310 147353 168873 162745 151764 136625 148865 153938 154866 144560 144742
8502 144742 166350 157973 142134 119901 99246 108952 117447 103099 101870 117497 110854 103589 84358
8489 84358 71202 76102 83645 70601 63244 71127 85304 108455 114324 101881 98097 114706 92351
8476 92351 72995 79586 98029 105022 95104 86116 78095 53656 56046 95673 103481 71162 48022
8463 48022 49240 59033 70823 60598 62097 53569 64061 55142 72918 84429 58839 50194 34626
8450 34626 18556 30037 38040 38019 16068 29150 66976 96583 121415 125883 107854 90668 95783
8437 95783 99458 71582 70548 66277 91025 90879 82860 69554 82597 105417 123650 84550 58687
8424 58687 78810 66090 57082 50824 40937 13087 19646 48712 64401 63702 63717 79675 58111 45707
8410 45707 64704 64078 65495 45422 15195 7337 22009 29981 34409 24630 25861 17942 -1658 -149
8396 -149 32397 45057 56453 58526 39003 25063 34136 31491 31889 25168 31681 44433 32958 47157
8382 47157 63580 60555 49168 28211 19468 18430 3768 42266 56716 41759 34456 36613 17089
8369 17089 9294 15321 -19565 -30701 1811 18709 33456 24748 14218 34185 37293 -3951 8773
8356 8773 40653 37363 42573 71629 38969 16482 6495 -7664 5396 3154 6501 25500 20476
8343 20476 18204 16819 10695 32196 39090 67585 84986 47836 35072 26903 29894 28883 27541
8330 27541 43974 22580 16244 21060 37265 66696 63834 40566 44099 35764 24836 46405 60958
8317 60958 53564 33398 5733 3808 -8810 -1969 -13558 -14370 -14076 -12940 6313 8961 12790 2176
8303 2176 -17084 -22661 6 9199 5563 20346 12539 6730 2235 42459 47166 12638 -12492
8290 -12492 -16234 10605 17918 27091 17004 18154 45294 60331 16491 3839 31448 36671 39550
8277 39550 57166 68996 77135 75095 67084 67375 41535 40646 51629 52532 54310 76902 69295 59397
8263 59397 33235 1848 -665 36704 23410 8397 8551 -19257 -23740 4298 18592 23862 35871
8250 35871 41245 42297 26520 -2608 1865 -9501 -1420 -10718 -2294 14110 17525 -9510 8415
8237 8415 376 -18014 -12817 18075 7547 8937 33813 43638 31271 38485 58897 55307 45042
8224 45042 43440 55823 59230 77817 53772 45033 47937 41927 69421 51430 27076 18303 12431
8211 12431 4703 31152 38048 15249 34673 35821 39486 41343 27162 37602 35525 52917 42092
8198 42092 28653 26447 45776 54902 59438 55454 34402 13373 5767 -20979 -9319 12775 22769
8185 22769 28340 19151 38371 62316 63950 60407 59531 64630 62950 73833 107021 113104 94455 83778
8171 83778 89286 55854 30592 38837 31918 15659 -6109 -6318 28157 35565 58651 42896 31962
8158 31962 10006 4007 9309 16329 45017 36806 43475 39851 11921 -6176 11058 16197 19091
8145 19091 -4607 10965 39107 50734 51048 12172 -6983 -27218 -42035 -53176 1056 44522
8133 44522 42943 -4987 -16546 -12923 10173 33098 40060 9957 -4773 -1079 13599 32510 24607
8120 24607 18679 33841 27093 16263 53447 51061 19732 28790 26901 14732 11269 13560 44852
8107 44852 76366 69715 49921 40399 54054 67482 54781 20307 10855 3509 8985 20461 9906
8094 9906 -15990 -15063 -19991 -59749 -43295 -2536 33141 55707 56597 34168 39775 57794 57778 64724
8080 64724 54452 52201 32484 22213 35732 39266 27878 46752 36246 61342 62635 74455
8068 74455 62369 45705 51208 73773 81707 74310 76785 93704 100586 110733 76786 30769 3821
8055 3821 3339 38526 69154 81807 67485 76422 77869 76179 77186 96222 82546 61144 71215
8042 71215 75361 58316 63531 43012 47810 59717 59019 91798 95411 74711 65258 71145 80157 92809
8028 92809 107951 67435 51837 61859 61166 50265 71346 89306 79018 49708 42708 14299
8016 14299 27382 39017 63166 67101 49476 42983 60121 59437 38621 34104 35708 53042 79408
8003 79408 61863 37377 23417 12068 13824 39461 77115 60363 50891 67208 99904 105674
7991 105674 79828 86368 73199 71745 57760 32368 5778 29541 68022 59430 40843 34732
7979 34732 27205 30937 40525 28222 28855 45850 42789 40954 49304 69008 55499 50890 90847 115823
7965 115823 87912 55743 43373 9578 -13023 9665 41552 33508 38021 51789 56655 48141
7953 48141 24691 5855 5167 17192 16900 15117 17979 18466 42020 52546 48558 23500 10909 6138
7939 6138 -713 14157 30718 56009 47968 17263 15756 7925 -2511 -12114 -33418 -20766 -9218
7926 -9218 -23585 -25773 -8006 -13213 -31002 -8229 -5172 -22783 -23850 -6090 -11432 -5282 14471
7913 14471 27448 22838 22174 -4951 2203 16097 -3926 -4142 -19384 -9982 -21169 -8933 1473
7900 1473 2389 6190 12300 15608 12874 -1915 2790 9936 20605 10209 -4220 -7692 -3447 12667
7886 12667 -211 -14736 -2041 6112 31534 60834 49894 57496 36633 23495 14728 -2988
7874 -2988 -26563 -42995 -30054 -14665 17418 38591 36454 24267 5411 21597 30351 9831
7862 9831 14814 8672 348 -4434 -22440 -23786 11766 22386 10401 13476 -9578 11753 55057
7849 55057 26022 2799 -24992 -60626 -49126 -13671 11643 3713 -16199 -11988 -35948 -37412
7837 -37412 -17909 -27322 4769 29747 21119 23988 32422 12508 8446 5768 -7639 -25394 -39214
7824 -39214 -62733 -46940 -23394 -30663 -14818 -10498 -7817 -14277 -14527 -2440 -18199 -4884 -18216
7811 -18216 -14190 -3968 -15354 -21749 -17440 -736 -20472 -24834 -12365 -4748 -19614 -36671 -16429
7798 -16429 29072 42524 30988 28027 26776 13771 18417 17501 7442 13244 -9596 -53533 -47895
7785 -47895 -27288 -39213 -47987 -8609 34416 37733 6435 -9259 -16794 -18695 -40385 -52254 -41149
7772 -41149 -47372 -51271 -26446 -1248 -18544 -8543 -17985 -23513 -16744 -23686 -37227 -50574 -39062
7759 -39062 5876 32926 41653 30955 19005 39323 55528 62067 73184 52065 30728 24673
7747 24673 -8488 -25900 -44758 -42125 -24845 -47204 -43985 -22316 -27547 -32670 -19602 -18575 3136
7734 3136 -12830 -22262 -27080 4295 30206 35780 30198 28599 15934 18987 -1796 -19212 -21958
7721 -21958 -32946 -37486 -36554 -32007 -34719 22 15540 23994 20147 18033 2224 -5497 -7255 19982
7707 19982 55702 55236 19294 10158 5245 3051 -10259 -7603 -17627 -13580 15050 6152 -39932
7694 -39932 -42529 -10503 11853 -1474 17202 42278 10775 1840 -15192 6557 16761 -8124
7682 -8124 -18032 -34647 -45469 -6080 30808 20076 23970 9211 -14772 -2988 14497 -8279
7670 -8279 -11911 13994 2077 13973 10800 -11827 -3249 -36609 -40413 -11892 -6971 -3603 19496
7657 19496 23981 4095 -7914 -34095 -72773 -75303 -76465 -90168 -69192 -54329 -53978 -55176 -54501
7644 -54501 -41889 -37124 -9342 -1249 -5054 -28247 -38022 -52309 -51591 -58628 -43196 -33766 -20362
7631 -20362 -18222 -15607 -44845 -47899 -42232 -41435 -30740 -37729 -72081 -67431 -51947 -49561 -33708 -11649
7617 -11649 -9570 -33121 -47232 -28501 -13689 -5548 6438 -9252 -971 22398 29834 1226 -15246
7604 -15246 -41452 -46712 -38194 -31667 -50666 -58331 -49875 -19523 1985 9833 970 -1137 -2311 8850
7590 8850 21799 14793 -12901 -13368 -11326 -23137 -30501 -34617 -48517 -21050 -6242 3599 -13791
7577 -13791 -12860 615 16857 -5200 3504 20398 29462 32411 -3749 -42587 -28473 -12536 3600
7564 3600 -4552 -1586 -11632 -18237 -29791 -8600 -8990 15596 16706 34009 21978 16473 15272 -2
7550 -2 4310 -12634 -29549 -16619 -17268 -25829 -22062 -6599 1984 12491 17884 -2704 3149 10952
7536 10952 -3978 -26934 -31719 -29920 -29029 -43965 -36720 -22006 -49493 -73949 -49434 -12767 6973
7523 6973 11663 22458 20996 8302 -11391 -16002 -6834 -1861 -13932 -25387 -10308 324 -14022
7510 -14022 3556 5131 780 14397 36242 34227 19519 -26874 -27656 -15946 -17324 4709 4237
7497 4237 -9574 4530 -4432 -27585 -52518 -21980 4842 26189 17328 -1513 -11768 5718
7485 5718 7506 -7030 -3423 18844 4511 -12565 -46110 -42001 -24033 -32271 -36784 -28586 -7575
7472 -7575 13167 7253 1589 -5412 -23429 -45631 -52023 -41311 -11877 5354 -27254 -61934 -47106
7459 -47106 -30352 -18009 6195 14761 -8311 -23039 -22027 -26656 -25779 -7300 -12795 -9394 14782
7446 14782 27961 15933 26050 3033 -11286 -2050 -10967 -7931 2819 -7974 -27826 -26712 -27921
7433 -27921 -27616 -38287 -30120 5015 11668 -6910 -20978 -22535 -16104 -13029 -20461 -11779 -35342 -53490
7419 -53490 -57607 -55770 -38771 -16863 -24409 -41467 -33364 -6313 -23272 -23959 -14527 2962 16354
7406 16354 6974 -36440 -33459 -23258 -2358 9405 10598 9693 -1239 -15184 -1592 9965 5314
7393 5314 -8199 -9984 -20052 -53822 -34031 -21017 -10182 -3674 -7309 -28076 -23705 -15588 -23861
7380 -23861 -4023 4060 -14542 -26929 -23863 874 5102 -11203 -25987 6030 2743 22007 -1706
7367 -1706 -8240 -591 -19982 -10890 -1495 -16832 -22384 4903 12998 5913 -11916 -16402 -8235 -4728
7353 -4728 -14321 -10623 3531 -8973 -30518 -37584 -27883 -21443 -14110 -23821 -18164 -5187 -5470 -955
7339 -955 -17516 -29750 -38170 -36017 -27344 -38769 -23981 -27661 -42163 -36326 -22727 5293 17665
7326 17665 -7550 -28547 -18508 -19937 -13821 16637 20404 -422 -16721 -12637 -11890 -14021 -5560
7313 -5560 -26407 -7532 1142 -22592 -11461 13915 3742 19890 41933 11363 -20735 -46712
7301 -46712 -37436 -16117 -21001 -896 21536 25919 173 -11212 -16542 -50100 -54781 -20413 8432
7288 8432 -3993 -44313 -29933 8656 20229 46906 50456 38420 6867 -36263 -47036 -21412
7276 -21412 -22073 -27360 -32869 -14763 14092 6819 2478 -1736 -16011 -25593 -31382 -41309 -34254 -13139
7262 -13139 15839 -3869 -22270 -38282 -23007 23711 2608 -25463 -1504 6957 -27846 -42729
7250 -42729 -38030 -19099 -19086 8410 25622 27505 40053 56295 31416 11395 -11504 -10476 -5314
7237 -5314 -20624 -20001 -24921 -32123 -37325 -33566 -23386 -23687 -6682 3358 23152 43866 42415 34260
7223 34260 12732 21489 17269 -5392 8729 18947 2071 5835 26298 38619 31091 276 -11191
7210 -11191 12581 3460 -20893 -21362 -17018 -20641 259 -3298 33734 54267 52794 36102 18696
7197 18696 22790 22482 -4075 -22297 -8325 4433 15658 18142 20294 -15834 -21359 -10793 -18005
7184 -18005 -1689 -2875 -5961 24430 33263 40785 36008 20281 -4245 -22138 -35627 -52613 -25191
7171 -25191 1722 12727 3350 -14899 -28244 -15424 -275 -7298 3369 28361 22455 -1041
7159 -1041 -19307 -4034 13443 -1019 -11117 -17611 -16772 -5113 9300 -12742 -26611 -14205 -14642
7146 -14642 328 8954 -7853 -19486 -9146 -5733 -37118 -53322 -59439 -52481 -32124 -24215 -37527
7133 -37527 -39479 -24350 -22874 -50232 -33374 -29008 -1037 18964 14320 32728 41215 18607 5993
7120 5993 -839 -6119 10880 15467 4311 6314 6098 14042 18471 3111 -17583 -10617 4708 3535
7106 3535 10869 9140 24530 8608 -16940 -21179 -12946 -12867 -7670 -16413 -20910 -722 2573 -10187
7092 -10187 498 -13761 -37666 -29273 820 17585 -1373 -58747 -70696 -69182 -50693 -21255
7080 -21255 8281 21856 23862 7291 -16276 -18010 -23643 -31306 -24187 -31036 -37099 -7787 1859
7067 1859 15205 5088 -38850 -26879 -17200 12083 -4408 -15767 -28429 -16018 8159 9997
7055 9997 4296 9635 7597 -14615 -43944 -37873 -5881 2397 27 -5899 -32333 -44294 -42155 -25063
7041 -25063 588 20346 40141 6159 -589 7526 10978 26435 47245 23257 21325 26991 32937
7028 32937 20012 -17764 -51138 -53929 -42500 -12898 -992 24295 37522 29276 17505 28005
7016 28005 38011 13450 -4866 -16451 -2907 -4569 -13495 -5960 -4582 -9341 -7900 14421 26138
7003 26138 42221 27358 39470 22527 -19910 -13773 -11623 -9025 -18595 -31134 -43391 -42637 -38740
6990 -38740 -39440 -25179 -30742 -44215 -60016 -61610 -37333 -31011 -46575 -45573 -36002 -19991 -8469
6977 -8469 -14519 -14517 28337 32097 420 -12208 -6787 -8463 -11628 17359 38569 26417 -3290 -5918
6963 -5918 -24157 -22739 -35208 -60588 -77627 -68310 -52871 -16206 17972 11525 11970 -2466 -20394
6950 -20394 -23374 -1618 16015 7839 5180 -2217 -8564 -11600 -35946 -35338 -25504 -21617 -35430 -45505
6936 -45505 -42900 -19160 2423 -20441 -26846 -22194 -17422 -13504 -6317 -15344 -12295 6367 12988 -53993
6922 -53993 -45063 -19971 -30988 -50658 -48660 -37589 -36918 -39420 -33272 -18472 -3314 5658 10785
6909 10785 1010 -9736 -16377 7657 4407 -38946 -50171 -25374 7393 22861 -1325 -10672 -13755
6896 -13755 -23422 -30708 -17665 -13831 -8323 -845 -4209 -1483 7454 8904 -8831 -8114 -22128 -11694
6882 -11694 14767 36512 42303 27668 -10347 -14178 9172 2706 -12940 -28076 -16751 -27190
6870 -27190 -43424 -44240 -42507 -45526 -41050 -39066 -23939 13279 -1961 -24768 -12002 13439 38849
6857 38849 25667 -25608 -47393 -36887 -23098 14669 22121 13860 5633 4363 235 16013 167
6844 167 -30844 -45527 -27679 -28360 -16504 -42754 -25593 7328 1158 -39710 -56181 -17659 26767
6831 26767 36913 19417 10789 10366 8074 5187 32230 38041 8444 -5416 -38130 -50669 -34507
6818 -34507 -6275 11283 11060 -6629 -22115 -27986 -38408 -31955 -11180 27524 25275 6243 3326
6805 3326 -4664 -26606 -7680 -11371 -7752 -24152 -12819 14181 14308 -2966 4817 -3616 -7651 5454
6791 5454 6287 13318 18731 4142 -23751 -45555 -44195 -24106 4688 -14003 -34234 -31121 -30576 -38400
6777 -38400 -33653 -61768 -55192 -74530 -87736 -83555 -64505 -35235 4302 -11085 -53988 -74394
6765 -74394 -72455 -74002 -60445 -41454 -40699 -13838 18465 29538 -2809 -7765 -6050 15259 8506
6752 8506 3980 -11582 -19804 -16306 -19160 -28295 -16700 -7815 7433 -8709 -36867 -35995 -27866 -29657
6738 -29657 -40247 -37670 7117 33585 29148 15063 -7687 -12115 -11869 27544 43059 40535 57511
6725 57511 59914 46637 46527 11483 -3808 4853 -8175 -27456 -5631 -5213 7012 15956 10124
6712 10124 24512 12251 -18608 -20833 -26160 -46563 -40279 -8416 10526 15414 24076 3051 -18658
6699 -18658 -7512 9775 -6811 -20115 -21192 -35930 -13495 20399 36833 41747 35787 19508
6687 19508 23827 37957 28362 29090 34634 9075 -6855 -9518 -51371 -52301 -55059 -50881 -68486 -61558
6673 -61558 -50258 -20884 -12598 -21257 -32705 -34479 -35212 -37719 -57557 -36126 -10736 14419 25063
6660 25063 17296 -8478 -27195 -35660 -31866 -27344 -20799 -20784 -25258 -14693 -21479 -22368 3124 2243 -13483
6645 -13483 -16039 -23649 -5386 17228 39985 41787 49811 42927 54834 47963 28956 28345 17894
6632 17894 16368 -7227 -17022 -27423 -16905 -4740 -11671 -10985 -30226 -22269 -37829 -39131 -9566
6619 -9566 8786 13875 490 -14626 -29204 -27057 -15818 -847 4428 -1894 188 -16896 -31108
6606 -31108 -25785 -28191 -44074 -34349 -37371 1245 32676 16073 -11128 -7065 854 1916 -2679
6593 -2679 -2987 -15464 13111 10040 -2725 -25202 -29315 -25548 -32826 -39425 -42920 -21784 -10956 -2759
6579 -2759 37348 38147 -307 -13443 -10165 -13334 -15985 -15113 3414 15696 18400 -3003 -36527 -56812
6565 -56812 -43548 -32133 -35834 -9969 -3705 27408 10481 -21168 -2135 19735 23504 11866
6553 11866 -13532 10258 14537 4244 -11632 -19620 -13622 -13503 -40868 -38998 -13853 8540 8061
6540 8061 -9481 -39981 -57827 -46184 -25044 -20014 -24395 -15393 -13037 -17985 -40421 -54068 -42502
6527 -42502 -35212 -54503 -53757 -37625 -46280 -61815 -48439 -37361 -21661 -26989 -72686 -83912 -77255
6514 -77255 -77542 -74623 -61552 -62747 -50677 -8715 -1178 -6527 6195 4478 -25015 -36786 -23868
6501 -23868 -29910 -24565 -33882 -8298 23752 25421 26365 10904 2874 -2810 10775 -921 -9672 -2233
6487 -2233 22916 15104 404 12751 636 -4800 7396 -7724 10641 11761 -2671 -16071 -30846
6474 -30846 -9153 -4784 -12086 -27406 -38314 -46807 -44746 -19719 -31923 -54290 -37779 -35318 -34290
6461 -34290 -41685 -17631 -20613 -47438 -39453 -27032 -47173 -22793 -8935 -23183 -16204 -10548 7290
6448 7290 22351 16141 3959 15786 26061 33175 35074 28029 25564 48571 45318 38889 -6236
6435 -6236 -17464 -18728 -21146 -29906 -33977 -37524 -26944 -23800 -19519 -7254 2410 6582 11620 22735
6421 22735 26770 34362 35929 34230 29541 22123 16512 -6571 -4017 -31175 -41203 -37437 -31526 -34684
6407 -34684 -26097 -13439 -7962 -2100 -18245 -21269 -22050 110 -7755 -17015 -33299 -16708 -18358 -47853
6393 -47853 -69247 -48502 -36850 -28307 -16999 1474 -5310 -17688 -43040 -42121 -26969 -25670 -28795
6380 -28795 -35395 -22915 -19143 -23121 -30202 -53684 -71078 -57575 -23096 -14320 -20646 -10407 -40880
6367 -40880 -53851 -42141 -66511 -62400 -37336 -33650 -34637 -44109 -37349 -15852 -13364 -20900 -30919
6354 -30919 -29442 -45819 -50179 -45763 -46553 -6896 21095 482 -16923 -24062 -27825 -24131 -28155 -32805
6340 -32805 -31523 -26350 -27362 1612 10213 -19959 -23386 2948 16796 5627 -19920 -7902 11698
6327 11698 13968 3350 -29869 -35400 -21710 -40315 -43556 -40440 -25332 -47337 -48885 -33396 -28196
6314 -28196 -15485 17452 2998 -14719 -21656 -24094 -2406 8689 11601 4995 -23971 -60286 -42866
6301 -42866 -19115 -11191 12774 -1895 728 12254 19093 5271 1504 6534 148 -1126 -5184
6288 -5184 -223 -824 -864 -1771 -2781 -15743 -48189 -62020 -25615 -32978 -48600 -32209 -42739 -35495
6274 -35495 -25958 -17770 -24311 -36117 -50709 -48318 -37656 -65573 -88990 -76643 -51290 -19350 -30328
6261 -30328 -10056 890 -12847 -4677 20551 -2986 -14317 -26901 -24796 890 2974 -23746
6249 -23746 -35933 -47715 -66951 -63288 -54233 -43587 -21139 -11414 3613 -460 -23250 -30705 -12773
6236 -12773 119 225 -10854 -20200 -28614 -37807 -74212 -64688 -40580 -35195 -32046 -14654 -6287 6808
6222 6808 1588 -5048 5126 20509 21054 -6439 -34827 -45548 -34949 -20204 -15769 -15410 -22088 -33503
6208 -33503 -15781 -44 -1291 -14654 -19260 -12919 -33036 -35616 -14737 2454 8101 15094 25890
6195 25890 34926 44258 45086 17326 12118 32124 14012 7781 -13709 -20353 -13229 -20861 -33017 -19813
6181 -19813 -14941 -13262 9218 -14946 -21611 -4599 -1331 -6067 4778 28206 10474 -551 -26056
6168 -26056 -6019 -3266 15280 10070 -21366 -4394 18660 34405 26324 35158 49286 44574 55085
6155 55085 28933 -6246 -26714 -15175 5661 15342 976 20913 48159 37217 15832 -11341
6143 -11341 6981 7217 -22351 -13549 -5051 -11919 3975 3949 3795 -17638 -44015 -46312 -28317 -2597
6129 -2597 9138 15322 31702 19958 16922 25117 37085 19586 -288 -7095 -5702 -11724 10523
6116 10523 10940 -24335 -15392 -11538 -18258 -26785 -11880 -19089 -25029 -13568 -17161 -37829 -68479 -90977
6102 -90977 -71477 -29829 -1935 -25875 -34296 -19693 -7490 -17350 -19947 5533 14049 10561 -638
6089 -638 3528 -9857 -8196 -10802 8319 15839 25352 48850 50980 34902 31925 43167 32340 1273
6075 1273 -32502 -15781 -3700 -25804 -57262 -44404 -18337 -25771 -48203 -42213 -31898 -33058 -27509
6062 -27509 -14125 -2087 1812 -15621 -26474 -41157 -43162 -25647 5934 4435 6135 6909 -3712
6049 -3712 -15418 -24213 -27428 -649 -5443 3423 -5263 3318 -7210 -27333 -41877 -43930 -42927 -18545
6035 -18545 -13268 -30629 -44275 -32691 -1254 26369 21387 18575 11927 -11541 -43623 -20978 8566
6022 8566 17599 -20129 -39432 -991 23729 14233 -1631 2541 -14484 -30570 -11308 -22390 -34469
6009 -34469 -4029 22827 11688 -23133 460 22280 34529 11285 4470 13231 -20442 -60844
5997 -60844 -69918 -60255 -39780 -16404 804 5216 28253 36272 54617 46525 25979 16706 1689
5984 1689 -18628 -31151 -12391 -10335 -18671 -27051 -42351 -44132 -51442 -32361 -7975 -16804 -23168
5971 -23168 -5635 14778 39018 12158 9946 -15075 -30145 -18701 -9477 -40516 -63638 -32747
5959 -32747 -7063 -12330 16948 31781 26664 30847 12805 -11285 -28980 -43271 -34280 -30155 -3847
5946 -3847 -4664 -15297 -12061 -23998 -9217 29456 42673 48543 41598 2154 596 5288 -11728
5933 -11728 -23030 -23171 -19195 -16672 -41660 -28639 -36021 -51620 -58957 -57772 -66758 -71319 -60640 -49895
5919 -49895 -42600 -25779 -10765 -35105 -46289 -21486 -11850 2428 20250 10793 -11650 -16790 6456
5906 6456 36796 20239 -16021 -6785 18340 23477 -11230 -30565 -33543 -63520 -63765 -50631 -37604
5893 -37604 -23380 -5057 -473 -18741 -32646 -44395 -38291 -20303 -27134 -26885 -2951 13559 22006
5880 22006 4681 -7323 -31516 -35360 -17437 4518 19443 17317 28642 41088 44674 24130
5868 24130 17500 25913 10957 1701 -7291 -34861 -22020 -15560 1083 -3333 -41478 -69966 -71103
5855 -71103 -36447 -8509 -1386 15824 28342 30193 38897 39030 14565 -13467 -17983 2561 13440
5842 13440 12019 4523 877 -13915 -18894 -23690 -28655 -21284 -8995 -25806 -35574 -40513 -46051 -37400
5828 -37400 -20381 -14560 -20186 2525 34319 19637 27472 15102 -18078 -21365 -49339 -56518 -52354
5815 -52354 -49425 -30006 -7684 -27977 -42137 -47999 -48045 -28277 1070 24916 16761 21047 16006
5802 16006 10801 29641 44598 6067 -2723 12430 -1439 -14034 825 -14722 -14304 991 -4593
5789 -4593 17049 23866 11851 9094 -1127 -13971 3948 27304 19342 18469 991 11516 -782
5776 -782 -13642 -11971 -11751 2662 9856 -2065 -9540 -22369 -33426 -15032 1093 7328 4868 5448
5762 5448 8933 -6778 -50252 -80850 -66700 -10816 -6899 -29684 -18906 -30682 -24163 -22347 -9671
5749 -9671 18148 43905 32376 689 -11495 -15806 -9234 -13593 -23459 -33215 -4027 3943 -9158
5736 -9158 -17730 -7766 -14305 -32515 -36954 -36751 -29783 -28394 -20435 -7400 18989 59795 55377 50948
5722 50948 25763 2859 2421 -7387 -48783 -43255 -26768 -11610 -29847 -19618 -4861 -21419 -29455
5709 -29455 -43120 -39568 -51021 -61381 -47292 -6654 -6560 -10983 -14254 -30550 -26548 -22401 -30951 -37365
5695 -37365 -46985 -55425 -48603 -40974 -29141 8366 9629 -9463 -22816 -6289 -23237 -17739 -2942
5682 -2942 -3537 20 -351 -22109 -33555 -39626 -16644 -312 -35867 -57939 -49500 -52861 -27182 5863
5668 5863 13864 31604 48714 34637 38836 38165 26931 26373 14059 1620 -15605 -2919 41798
5655 41798 56779 37894 -1366 -13334 9702 7887 537 -5567 -11078 -9697 4487 4768 578
5642 578 -6598 336 8529 7214 18690 40625 40550 1190 -30231 -27549 -34010 -27768 -32873 -42829 -30985
5627 -30985 -30873 -27676 -11162 -9452 -24698 -37408 3764 6404 20839 7795 -24099 -23763 -29953
5614 -29953 -18106 6298 11070 2018 28578 6826 -1221 -6524 7155 26769 10795 7939 2528
5601 2528 -11141 -41641 -51782 -54599 -36334 -11815 -14687 -38700 -58880 -49970 -14458 -2484 -612
5588 -612 -19699 -36496 -75689 -64769 -60516 -44570 -42579 -62862 -75208 -70168 -53350 -39717 -34662
5575 -34662 -15050 10232 15418 12023 4415 6528 -4673 4017 -189 6482 -18751 -26286 -24080 -40310
5561 -40310 -34847 -29130 -26165 -34034 -39183 -23882 -36738 -47735 -8975 -6595 -17670 -31653 -16395
5548 -16395 -23020 -38395 -40855 -59349 -54581 -68783 -60802 -36412 -14431 13872 23101 14879 12670
5535 12670 10751 2180 26916 31464 15316 14388 28244 53192 62732 51179 45092 25389 1440
5522 1440 -5467 1983 3890 -19928 -3207 9557 -133 -9951 -18601 -15198 2539 14127 4354 -13594
5508 -13594 -20624 -9052 -11942 -20574 -23634 -30705 -33760 -21597 -12664 -28987 -33233 249 19486
5495 19486 13053 2065 -8011 -31440 -37095 -25100 -19498 -9015 10667 29341 42527 37331 17556
5482 17556 1156 10867 1251 -3792 2046 -7600 7015 14492 -3688 5613 860 -20505 -22758 -27919
5468 -27919 -42474 -55492 -65479 -39181 -35023 -62305 -63196 -34428 -17868 -433 1258 -23471 -50680
5455 -50680 -43568 -46465 -59801 -100060 -78917 -47121 -20499 6078 13325 6345 -16063 -28014 -292
5442 -292 5810 2013 -3480 15830 16023 21116 47174 60440 54097 64332 49840 23879 21388 -9295
5428 -9295 -22467 -8717 10801 -2303 -6909 7692 -3187 -4749 -799 4704 2559 19639 11553
5415 11553 838 -27436 -34508 -19747 -11222 -6558 -23705 -16780 -5414 -30843 -32626 -10090 368
5402 368 -4413 -6626 -16216 -2176 -1520 1877 11125 19584 19001 15624 4535 -28038 -30201 -40472 -40239
5387 -40239 -22408 -6735 -32337 -35620 -13795 -14098 -11777 -17397 -53794 -38736 -35867 -25266 -8511
5374 -8511 -12382 -26228 -25798 -17575 2061 5511 11109 19955 -13035 -14114 -7953 8369 8861 10812
5360 10812 8245 2253 4418 -5049 2989 553 12258 13312 -4103 -7869 -29499 -27970 -37182 -53405
5346 -53405 -27221 -19148 1743 -10981 -44316 -88108 -76203 -34940 -14440 -17344 -1240 20710
5334 20710 -1891 -33094 -39044 -8166 -159 11748 12666 -2989 -19963 -27497 -23940 -34855 -29696
5321 -29696 8335 36548 57206 5595 -32995 -45916 -39738 -1596 27559 54938 55578 28031
5309 28031 39179 27778 7064 380 -4973 -22467 -29021 -21319 -38749 -34220 -18623 -17756 -27143
5296 -27143 -47377 -44503 -24150 -6025 -17922 -32367 -13679 6117 1153 36513 19298 -22799
5284 -22799 -33435 -26537 -26330 -25107 -52362 -64401 -54442 -31899 137 8043 -299 -13950 -7835
5271 -7835 13239 29795 10861 -3259 -9150 11545 18849 5473 -5270 -19185 -11924 20781 46424
5258 46424 18831 28430 47133 42498 28099 11416 5109 -10569 1142 -1097 -27266 -13718 -5184
5245 -5184 12170 11194 12926 -9130 -24922 -34417 -23618 -20662 -29364 -23932 787 -5496 -7660 -7253
5231 -7253 -21833 -38355 -43385 -63190 -57442 -19150 10794 -2081 -35375 -33825 -24437 -28916 -31692
5218 -31692 -30628 -20639 -23011 -25063 -19702 -2350 -9564 -15024 -25191 -31685 -28720 -21914 -16150 -7523
5204 -7523 -14814 -6553 -23092 -21829 -14911 13593 12682 1892 1518 23482 25007 -15982 -28580 -44824
5190 -44824 -32575 -2115 22479 8591 4368 -19513 -12184 -737 7 16200 1725 -14933 -9421
5177 -9421 -18524 -14565 14943 11270 18202 -5784 -9815 -4298 -26316 -49778 -58583 -78543 -74302 -79398
5163 -79398 -91536 -55951 -27877 -52464 -62210 -39040 -14410 -4525 -4273 -21555 -11521 -22298 -40611
5150 -40611 -37948 -37349 -56181 -45706 -5736 -535 -33377 -47537 -58177 -33260 -26602 -40603 -43563
5137 -43563 -25915 -3 -9167 -16424 -15197 -9430 -14684 -25321 -20999 -1465 39147 54993 29903
5124 29903 5298 11705 298 -2557 24121 30379 28640 23683 29737 -19078 -21683 -16367 19477
5111 19477 37851 24179 2906 -43941 -33548 5458 17312 -12760 -23640 -12870 -11799 -15640
5099 -15640 -11134 -8616 1273 18375 14920 394 -28491 -21811 -2225 -3076 22001 28077 25708 19613
5085 19613 27949 23394 14917 9529 -29406 -46043 -41812 -22272 -42529 -36131 -28631 -33405 -18884
5072 -18884 -20510 -9539 -6666 -3531 -9384 -21551 -25422 3009 18354 25231 18551 10910 22413
5059 22413 28083 19433 -20038 -17328 23208 20561 27338 12549 -16052 -4983 12597 17289 -15808
5046 -15808 -28933 -21585 -19343 -9993 -6087 -6671 3201 11559 -2747 -9390 -16131 -12155 -2372 -8772
5032 -8772 -2507 914 8471 27245 28095 -10192 -24979 -49681 -67876 -43920 -31603 -21021 -43399
5019 -43399 -40461 -43804 -63189 -46503 -57842 -49418 -14872 5940 -16157 -20497 -12265 -2597 -19713
5006 -19713 -56742 -54042 -50066 -55990 -64727 -37860 -9782 -2621 -44082 -25756 -8993 -37913 -26073
4993 -26073 2149 6646 16903 8678 -10760 -7938 9562 8597 28724 8896 -23090 -7191 -8630
4980 -8630 -28401 -48888 -59736 -59866 -38956 1768 563 -196 10051 88 -9584 -1865 -20870 -36018
4966 -36018 -20031 -25497 -13152 -16333 -10848 -30084 -42665 -40161 -25730 -6359 446 -17442 -38337
4953 -38337 -37170 -34455 6026 24992 12562 16564 9539 10357 22110 42613 54132 48424 26250
4940 26250 22899 24578 10640 3054 2247 16 -4613 8770 4673 -10903 -20763 -13613 -472 12651
4926 12651 5812 -4456 23599 39647 42436 33878 22289 35143 24500 6209 7021 -3133 -6355
4913 -6355 -928 6479 -14266 -7607 30194 37352 7226 17027 -6904 -15829 -12973 -3073 -5854 4888
4899 4888 19260 27184 2200 -10448 -26639 -26989 -28212 -43618 -36988 -11552 -4079 8524 10681
4886 10681 6665 8367 -4446 -11499 -13775 -27933 -18059 -16886 -24226 -51553 -34694 -44482 -23288
4873 -23288 -7118 5477 -8394 -20041 -23927 -2614 24385 10195 -7685 -47297 -64270 -43615
4861 -43615 -39687 -25838 -6345 14823 20862 8797 21865 22923 -16384 -23806 -11930 -16866 5916
4848 5916 16705 30058 28169 19712 -14643 -11294 12455 3958 20027 8997 -1074 -4253 17227
4835 17227 13553 6696 -4050 -6424 8055 -214 -22118 -13550 -2886 -794 -12332 -22582 -7459
4822 -7459 -5823 -519 -24359 -15325 3494 11028 -742 -12272 -11991 12481 5981 -31283 -36208 -31921
4808 -31921 -21892 -21710 -21225 -16023 -6017 17857 11109 22106 2973 -50990 -53778 -25305 -8935
4795 -8935 -677 5841 -263 19503 19028 226 -6116 -8891 -3161 2826 14858 -1387 -26042 -57651
4781 -57651 -57319 -37913 -43331 -32974 -38120 -30786 -16303 -20689 -18879 -2765 14823 -2751 -5397
4768 -5397 -22209 -38316 -46378 -51433 -35410 -28088 -19976 -12129 -28825 -12098 -4417 -43830 -44250 -9855
4754 -9855 31621 33069 5061 -13949 -34419 -35155 -34012 -35344 -36880 -12940 -34377 -41058 -2027
4741 -2027 -3825 -5497 -22920 -29956 -38266 -58203 -72667 -67211 -54380 -58095 -41333 -25321 -5798
4728 -5798 11752 49617 41845 27220 12601 2610 5123 853 -44018 -32545 -9167 -19180 -25151
4715 -25151 -26277 -11313 32707 37898 13353 2228 3799 -13034 -37503 5973 38749 28189
4703 28189 -4342 -9074 9492 9269 -2700 -27184 -34144 -18096 -19401 -19507 -1403 686 -5572 -5655
4689 -5655 -3660 19831 -2435 -8286 -21100 -21839 17946 23882 17431 13758 25009 33331 25262 -8571
4675 -8571 -16845 -17597 -25298 -19557 -23150 -15930 19524 32268 16391 -14097 -27820 -18037 -23747 -21995
4661 -21995 -28688 -36533 -38112 -5659 12288 1306 -27216 -29745 -15046 -14385 -15055 -10357 -36657 -28728
4647 -28728 -6556 -1089 -585 -1137 -8353 805 -19829 -14888 -4191 8348 29176 31378 10392 6578
4633 6578 -32360 -65578 -59037 -11774 15199 45446 44696 25795 20264 18446 18229 12147 -1632 -4860
4619 -4860 4698 -17633 -48295 -43039 -31907 -39341 -34549 -29495 -36982 -12008 18837 39067 22779
4606 22779 34365 17716 -4575 -6955 -20728 -29214 -14141 10476 13994 -1788 -7166 -15919 -14128
4593 -14128 -12000 -14274 -7106 -7692 -20088 -32215 -29598 -41597 -26640 -20757 -5858 -14453 -12000 16138
4579 16138 45660 31246 38365 38178 22670 -4929 -12150 5123 14507 8852 -21948 -45502 -55868
4566 -55868 -32888 -8435 -3523 -7273 -6224 2820 46484 21011 -9699 -3040 -1020 7016 12932
4553 12932 18983 -10260 -25752 -30838 -3342 -20521 -44979 -39952 -30241 -24713 2772 17617 23241
4540 23241 3119 -32159 -51566 -68146 -45235 -2638 9848 -8255 -13597 -15274 1586 -5427
4528 -5427 1196 -2395 2196 -4102 -25941 -30287 -29781 -24361 -8906 -5970 -10892 -15153 -7419 -6794 -21981
4513 -21981 -9070 11010 9084 1557 5578 -1608 3912 -1276 5074 -6789 985 24142 41888
4500 41888 27775 -477 7484 34351 47125 44083 49550 9699 -14807 -6993 21233 16535 5890
4487 5890 11088 32111 4599 -2197 8990 -10531 -15120 -28723 -21995 -23334 -24990 -22317 16610
4474 16610 41694 25376 33905 47736 54360 47466 11694 7511 43741 37193 41444 25310 14573
4461 14573 10836 27435 13451 8150 23200 31488 12907 33771 38066 32432 22570 23930 42970
4448 42970 43119 28751 -1735 -9517 -14091 -13218 -26435 -16449 11152 -753 1500 21464 42449
4435 42449 43662 51399 19282 13414 -2469 1820 3841 3268 -5782 -11140 -19493 -9304 -201 -3923
4421 -3923 5477 10908 18551 15939 33726 56600 50662 31412 9763 16929 9118 3019 3711 706
4407 706 -4800 10350 -1056 -25261 -51131 -48685 -37022 -4825 20814 -4638 -33524 -22287 6326
4394 6326 -4694 -3430 -7325 -26375 -10022 7850 -13136 -4989 3275 -12 -25405 -23815 -9630
4381 -9630 6779 19657 26219 9800 6689 -2406 5121 11620 25102 27790 16658 20718 23336 27765
4367 27765 21619 11542 3908 -3729 -16047 -22333 -7819 -6071 -12222 -20504 -10883 -20231 -33053 -22553
4353 -22553 -7444 -2353 -22939 -28299 -9569 16140 3207 -11031 -25674 -38698 -18546 10374
4341 10374 12107 15859 15235 5503 -8115 -35214 -49411 -24032 -23223 -40422 -26005 -31191 -8773
4328 -8773 19264 19515 14194 26676 41523 25721 -8407 -10100 -14946 3487 24038 26581 41649
4315 41649 31722 -24031 -36632 -11370 -5061 -2819 -16403 -31936 -24896 -24221 -3754 6223 7569
4302 7569 -47291 -59645 -33385 -54722 -75409 -76044 -64533 -39870 -27387 -19855 -36652 -54472 -53017
4289 -53017 -59309 -68819 -51093 -41112 -33107 -390 2556 -20746 1959 8377 19019 13223 13076 6900
4275 6900 5338 -4925 -15095 -4127 19679 23689 23052 10381 3074 17754 23846 53448 49637
4262 49637 23876 9522 7294 30369 46133 69329 53885 32527 34143 17192 40 3343
4250 3343 27322 51372 14663 -27378 -26639 -33773 -4 7429 24324 26168 35728 45769 17665
4237 17665 -11212 -35203 -13864 -13715 -19594 -35475 -45604 -24407 7856 -4371 -24043 -29981 -20278
4224 -20278 10786 -2805 -16429 6930 16736 29270 33468 12443 9704 21429 15116 10979 17779
4211 17779 8293 -2909 -21311 -24131 4186 25857 12512 -5992 2447 5005 -36541 -53306 -37636
4198 -37636 -19190 -16131 -11355 -16292 -29210 -36242 -47038 -45950 -24741 -17705 -19566 -12678 -10800 -21803
4184 -21803 -11631 -15970 -30613 -32843 -15151 -15485 -18074 -18555 -13116 -998 11557 12968 -4391 -21815
4170 -21815 -52736 -65287 -34312 -8502 3412 12910 -26760 -24809 3851 -8317 -23961 -26373
4158 -26373 -24024 -19560 -18231 14247 -866 -13713 -14706 -35223 -48823 -25747 -30984 -18479 -11627
4145 -11627 -28530 -44432 -50982 -52021 -34455 -11787 -11606 -21497 -6386 102 -5173 -131 16111
4132 16111 15682 32496 13434 -5754 11548 17603 -6623 -12396 -3491 23029 28485 5329 -15088
4119 -15088 13627 25010 28155 22024 -1262 1147 2642 -3206 -29192 -19342 18361 23124 -5329
4106 -5329 -12742 12600 23453 17616 27185 20014 25818 6986 -647 6900 2923 2168 18051 16233
4092 16233 3213 -9611 -10406 -13526 -13386 -14938 1719 8118 6342 17829 39544 56703 44080
4079 44080 42175 36587 10627 -8475 10421 36173 14113 10682 12558 -3090 -9896 -14177 -7145
4066 -7145 22062 7413 -17535 -39259 -28753 -7843 -4582 10247 -6166 -13273 -35125 -37177 1495
4053 1495 29264 -930 453 25167 5232 -3151 -1912 -20784 -23777 -48002 -38550 -26839 -38867
4040 -38867 -20334 -21442 -16062 -16669 -21983 -26994 -4197 -16882 -36131 -44103 -32079 -20346 -9090
4027 -9090 17431 14167 2356 -27367 -30563 -41024 -37772 -33148 -17249 -40547 -43824 -34916 -45313
4014 -45313 -38076 -17552 -10046 -19367 -33569 -45443 -65997 -62375 -24116 -762 18297 46155 22399
4001 22399 -530 304 -10244 -13639 -5448 -15889 -23722 -27074 -22730 -1893 -1673 3346 14821 39100
3987 39100 57153 66703 60057 35613 20672 11840 -10757 -6937 -25096 -3587 -12254 -12652 -22467
3974 -22467 -26378 -17842 -28763 -48527 -24349 14359 35856 41956 15195 -24700 -44760 -24933
3962 -24933 7076 6399 13957 31280 14363 29712 14103 2772 12862 22412 -682 -24968 -29645
3949 -29645 -24220 -12535 17178 13895 3818 2032 -16766 -20108 4442 21702 23488 39494 49427
3936 49427 40031 16880 5778 11888 19839 30601 30287 14388 -2520 -6204 -35 -22155 -44832
3923 -44832 -25092 -30730 -26820 -37049 -19594 21848 26435 49267 29127 21824 -2595 -7540 -4237
3910 -4237 8102 -19314 -27430 -18790 -25763 -3248 -5874 -32778 -42035 -42908 -16005 -19666 -55413 -53680
3896 -53680 -64979 -45594 -21058 -11207 -18489 -23414 -33758 -17103 -11943 -9992 7988 1197 -23090
3883 -23090 -54346 -61316 -47502 -52628 -50080 -33109 -5017 1269 2039 1096 -18461 -48451 -17608
3870 -17608 2043 10268 19794 -10261 -23550 -20569 1895 589 13445 3343 2991 17610 -7729
3857 -7729 -45396 -59951 -23983 -8636 4747 10023 30543 29835 2559 -22093 -29209 -36398 -2166
3844 -2166 3046 140 23929 29617 6939 -14357 -35852 -56295 -51534 -31994 -12502 -39882 -69320
3831 -69320 -55260 -9011 6541 16851 9261 17259 34053 24371 17810 3879 6374 6858 1713
3818 1713 8912 37744 28798 17465 -5957 7765 18315 7750 -258 2385 -5372 -22398 -17153
3805 -17153 -20075 -37402 -47025 -69741 -44184 -6055 9159 -15421 -15525 -9438 9137 14335 10481
3792 10481 21121 23771 10137 -1628 16723 13467 11268 16404 8161 12269 13243 -1780 9552
3779 9552 -2010 -34114 -31212 -21476 -25758 -16414 -37053 -27523 -21839 -21349 -12081 975 21873 11363
3765 11363 -29222 -27622 -35546 -16123 22064 29980 -6341 -46770 -37955 -13868 -7353 4780 -18297
3752 -18297 -23319 -4919 -1870 -21425 -23678 -35983 -18123 -16297 -36262 -44828 -30598 -13704 -39571
3739 -39571 -21969 5694 -9642 -29534 -29508 -29767 -18064 12462 28971 4605 -35411 -22502 -7935
3726 -7935 -20633 -29828 -17418 -18786 -2608 -16309 -44397 -38327 -16614 -3990 -3988 -12465 -24831 -26257
3712 -26257 -58758 -54810 -22643 -4984 -19213 -11118 2057 2080 1396 -35846 -65241 -44975 -40928
3699 -40928 -32411 -28875 -23452 -4980 -2516 9179 2613 20847 20780 5211 16794 18353 2210 115
3685 115 -10999 -16249 -21327 -17738 -3823 -2639 -26199 -33660 -15277 -26330 -36018 5125 20425
3672 20425 26134 37995 29969 32286 16286 5737 15771 31273 16165 -6058 -10314 -14181 -12578
3659 -12578 3527 22797 19621 14921 1088 2816 25089 40578 30254 25980 7969 -13091 -22883
3646 -22883 -40333 -55489 -66240 -46784 -19224 -10909 -25136 -15721 -18536 -26482 -12143 -15776 -24978
3633 -24978 -42019 -29393 -12682 10391 26047 5558 19845 31122 18021 21226 12212 17266
3621 17266 27105 35707 4682 -30550 -61188 -54294 -16432 45070 61875 38075 9202 -8445
3609 -8445 11466 11128 20867 9637 24644 26787 37038 55878 30784 5370 -5593 6945 20271
3596 20271 18580 -1148 -12445 -21737 -10746 12120 23402 24105 19910 8183 10271 1898 3851
3583 3851 -7103 -15204 -14056 31756 42903 2988 6173 17398 19467 34199 30631 22680 4079
3570 4079 -20059 -18857 2356 13847 6369 -12941 -4344 -3581 -6261 -6898 2759 22935 23589 3406
3556 3406 -49814 -56126 -36635 -36661 -35158 -31653 -12267 -3054 -20168 -21525 -11067 6640 15024 10593
3542 10593 615 -5645 19775 26988 13121 -9607 -7527 38020 36948 8820 -25898 -32008 -22009
3529 -22009 -10298 -30992 -7466 -19068 -38031 -28382 -4470 1326 21756 4228 11050 19582 35978
3516 35978 24080 -7919 -20404 -5522 9892 20680 13613 15242 -207 -1286 -18618 -3135
3504 -3135 17575 8555 -10649 -12188 -31690 -15025 -19639 -40157 -54739 -37334 -12259 6184 2068
3491 2068 2753 22978 14689 18937 5477 -11301 -13428 -13903 -18781 -25644 -30896 -3528 7003 10839
3477 10839 -19930 -24362 -42590 -40368 -41552 -14025 2592 -7337 11608 8112 -20294 -19021 -19637
3464 -19637 -11995 -13361 -21598 -16943 -5987 -12232 -17948 -4034 7110 5325 20297 514 -5857
3451 -5857 -13399 16960 32211 45326 32330 23641 7226 8388 9482 26372 50135 37975 28342
3438 28342 42737 35952 4831 7003 5120 -6493 -3447 -42477 -34678 -5866 13582 22739 11785
3425 11785 9639 4659 2254 16106 19483 23437 28103 13665 16781 5572 10353 6974 -26595 -25129
3411 -25129 -25004 -36518 -39755 -44296 -58743 -52296 -34330 -27420 -6153 -8382 -21032 1279 8982
3398 8982 7314 -22235 -28994 -19933 -16707 -35008 -6972 18837 18755 8262 1868 -10590 10011 25439
3384 25439 27044 22254 23570 15574 3479 -13419 -24263 -10741 -5151 6244 36733 34613 24447
3371 24447 42821 39895 5488 -2523 11917 397 13175 13869 -4523 -4166 -7749 16137 6062
3358 6062 -1937 5898 20529 105 -34805 -52309 -45872 -57903 -45074 -29693 -39784 -27646 9780
3345 9780 24110 22231 -254 -42561 -37618 -24850 -11442 -23110 -64584 -62926 -39700 -42811 -29814
3332 -29814 -23446 -23931 -28090 -28794 1878 28931 18853 2127 2895 2291 -2260 -6478 -12904 -14786 -28047
3317 -28047 -14713 2287 6271 520 9959 934 -14879 -21238 -29231 -9450 -2627 -1551 553 6128
3303 6128 13545 31456 12938 12569 18572 -12874 -26500 -25505 -28849 -14336 -31966 -57377 -59603 -71792
3289 -71792 -42105 -11552 -13307 -14648 -29388 -24640 -17232 -25904 -21601 -2403 5487 17246 31270
3276 31270 33271 48208 43070 33192 28598 34879 20096 8524 -2892 -13556 -8092 18025 46076
3263 46076 39974 12778 -12389 1910 -6747 -33096 -24144 762 34795 73397 52723 15778
3251 15778 12411 12658 14030 18338 9022 -6810 -8613 7424 25858 7679 1769 -3178 -29994 -32504
3237 -32504 -22175 -20608 -4136 -24348 -36298 -49936 -58068 -63384 -52277 -51203 -63485 -60144 -50970
3224 -50970 -48898 -56156 -35559 -36816 -23869 27595 26012 32932 40343 20143 10705 13031 18079 11786
3210 11786 -29621 -43708 -53732 -43020 -41980 -15807 -1522 -449 -5870 -5534 22946 17883 3860
3197 3860 31813 41429 37336 522 -9612 -7517 6680 4766 -16210 -31690 -9066 447 -9274
3184 -9274 -24424 -19615 -5829 -20626 -24168 -2332 -18235 -16776 -32363 -59162 -49723 -15326 -5569
3171 -5569 -16202 -28203 -55780 -56306 -45494 -26189 -5637 3197 6983 -9748 6791 7310 9562
3158 9562 6241 3337 13906 2586 -12992 -7734 5693 6577 -6779 -19541 -27383 -17748 6602
3145 6602 16341 -71 -14621 -561 7704 10387 35999 54453 47194 24214 -2901 -4312 -7483
3132 -7483 -9824 8716 26609 23262 114 -2725 -15141 -7514 14567 10384 17549 36485 14291
3119 14291 -10825 -38210 -25867 -7010 19961 15681 27812 33283 18597 6798 3305 6537 -13241
3106 -13241 -11188 -11787 -421 6128 -10706 -44049 -39688 -24839 -13750 -16546 -33238 -19542 3546
3093 3546 -19558 -19759 -4027 2915 6916 -24511 -37179 -38196 8403 43855 49712 44942 22186
3080 22186 -7767 -27833 5852 32628 60970 50606 20506 15150 9516 -4146 -15093 13096
3068 13096 27024 -956 -29195 -28035 -12923 -20572 -29995 -2629 -14355 -27280 -36386 -20419 -14931
3055 -14931 -1844 22605 18012 33618 62051 59634 54053 48336 33103 -13632 -15397 -3353 1365
3042 1365 6143 -4133 -16231 3936 40701 37030 20543 33716 31902 11072 5449 -7954 -14395
3029 -14395 -9950 -15522 -7878 -10948 -2251 12621 5039 -4843 -7559 -1003 -23917 -28635 -21176 -21018
3015 -21018 8304 13011 -28849 -24779 -50159 -43637 -31970 -11989 -21486 -9120 16619 16677 -19274
3002 -19274 -12762 -7567 28257 51801 56069 25524 2906 1815 -5515 15302 22929 17113 37871
2989 37871 45066 57328 66158 63501 31175 20900 14256 -4738 3810 -2006 778 19546 45953
2976 45953 41384 27072 13751 11332 2792 11061 13642 39262 66223 65585 49060 45758 49727 33485
2962 33485 17124 17803 4895 -3726 18048 36725 2821 -26620 -15571 2487 1749 -17966 -19488
2949 -19488 -9720 -37932 -43833 -39645 -9920 -5660 -7241 -24011 -40130 -33789 -19125 4710 4085
2936 4085 -10655 -11638 10205 6260 -9191 -10309 -1850 -853 1266 17048 6695 -11966 -16208 9026
2922 9026 17603 7560 22635 9982 -4631 -24954 -1333 21205 31717 17112 26371 51658
2910 51658 34614 20491 19343 7834 405 6058 9506 9553 11411 23412 18904 5026 -2652 -25077
2896 -25077 -20809 -15630 -14288 -41609 -55445 -51590 -15440 11291 222 -35239 -35461 -31529 -53765
2883 -53765 -51928 -29556 -7405 -7064 -12350 -12000 705 -6964 21271 36695 49308 43662 10887
2870 10887 -10372 -33498 -49156 -27134 -15612 5435 33074 62123 41341 16681 -3568 -13889
2858 -13889 -3040 -5290 -8006 -7114 -27586 -43046 -55898 -40385 -16908 17976 35411 44834 50758
2845 50758 25869 29045 34569 29600 8334 15614 28546 34983 32396 8814 8009 -3093 -14100
2832 -14100 -28568 -13308 16835 3791 16499 15626 4563 8316 -18385 -24325 -13775 -11262 -6315
2819 -6315 -8570 -12271 -943 -6832 -17212 -27355 -30731 -15422 -32112 -35859 -35846 -41736 -49146 -50793
2805 -50793 -47631 -22259 706 31335 46027 31840 22458 22138 17668 16134 18331 48531 61391
2792 61391 41035 46706 50914 32458 6990 -36976 -48811 -34124 2612 39945 21337 6857
2780 6857 3060 16242 9816 31540 38270 14374 18758 29548 34842 23524 -475 -1029 -21489
2767 -21489 -26979 -3359 14572 1735 -31642 -47242 -17640 1171 4018 5732 -2343 -8178 -16508
2754 -16508 -21660 -573 21817 38576 23752 24668 31404 48659 39113 -8201 -20068 -18994 -2509
2741 -2509 13514 12168 459 5203 6809 -18561 -4417 4946 -849 21187 19631 18324 17834 2898
2727 2898 -7108 -1889 21070 25979 13082 15121 38703 30223 52 -10480 22768 33206 28523
2714 28523 -1879 -34034 -15116 7806 -4904 -7024 530 6286 27272 16094 -6963 4848
2702 4848 26367 28820 17742 7914 -4561 600 40836 59951 29763 -1367 -17195 -32350 -11160
2689 -11160 -1747 17019 37210 5894 -40418 -27932 -6726 4697 8443 2876 -6814 23560 13654
2676 13654 -14126 5665 39973 40690 42590 24101 11921 40075 35028 10134 15204 5613 -4650
2663 -4650 9996 -4803 -3671 7406 4591 16986 10337 -20385 -27642 -37882 -25629 -15615 -27004
2650 -27004 -3305 10376 12701 1533 7632 8139 -14627 6585 9117 -9634 -20730 -35511 -36981
2637 -36981 -32841 -30751 -29819 -9116 -12827 -5224 16401 24028 5610 -4545 -3303 -3814 -2675 -7837
2623 -7837 1897 -1877 5235 5899 8805 7234 25243 30150 19926 21779 16386 35053 55387 30667
2609 30667 4652 8401 47641 27797 -7442 -29618 -1436 15087 -11715 -15061 -844 1439
2597 1439 -20816 -37764 -19190 4092 3300 -11635 -37636 -36321 -23469 -9144 -15362 -30985 -5595
2584 -5595 13999 22721 10855 2974 -1887 15906 24998 16151 -42529 -46882 1282 22438 22465 48627
2570 48627 41355 20534 12781 28753 20215 16703 44769 41823 32091 54978 65234 53857 37140
2557 37140 19205 15519 -2862 3721 4894 32230 5693 78 -8833 7694 12993 11867 4932
2544 4932 -16862 -20073 14637 1317 -14310 -9994 -7840 185 12345 20113 17189 11579 -26698
2531 -26698 -22930 -9534 1317 42702 25477 16475 10550 31316 44329 46444 28857 4288 -3774
2518 -3774 -12621 -20785 -12650 -5819 4604 -13147 -10983 13495 5946 92 9529 -20868 -10666 18564
2504 18564 41942 44071 28089 25726 14945 -17297 -21295 -15941 -12520 -2580 -6631 -2158 5331 12408
2490 12408 7057 -884 6855 12019 29041 38706 5865 167 2649 3380 24979 43654 14151 -25114
2476 -25114 -35720 -32439 -8660 13194 7223 -22025 -33676 -39658 -26715 -23918 -20307 -3024 6512
2463 6512 -9001 -8626 13023 32440 53479 21487 16893 17451 6874 30114 27801 999 -4126
2450 -4126 -4377 -14881 -22569 -34490 -16005 -11071 -27862 -25930 -20649 -2179 280 -15300 -11266 -21105
2436 -21105 -19606 -39456 -38950 -31085 -39705 -40054 -37860 -20717 13108 7071 -48 9277 11582 19747
2422 19747 17359 -9865 18903 38496 25679 16461 35516 27746 8863 8285 10021 -10859 -647
2409 -647 34032 14816 -15506 -145 20747 42640 55203 59663 32855 10689 -4510 -16018
2397 -16018 -7683 -585 5767 28596 22025 27009 5759 -14293 -16514 -31118 -37130 -56532 -46701
2384 -46701 -39466 -18612 -12337 -5963 -24957 -24971 2803 -17433 -30667 -8789 14916 25599 29771
2371 29771 41724 34754 22711 947 -18683 -15183 3008 -31 -6414 -33528 -35767 -6098 -21367
2358 -21367 -22117 -28939 -29109 -29209 -35393 -20760 108 11402 15916 7008 -3916 -2291 6382 8114
2344 8114 18769 -2516 -15932 -8080 12770 19312 10535 11607 8930 -3727 16553 28559 16699
2331 16699 5278 5312 -7689 -38929 -38031 -40683 -46430 -43004 -32669 651 11403 6423 -14625 -22179
2317 -22179 -26228 -18518 -8235 9401 -4518 8988 37153 24032 25189 23734 10160 31862 40974
2304 40974 46756 32687 -4533 -1028 -7858 -19677 3418 6664 -1748 -4125 2742 -9070 -16363
2291 -16363 -4999 10926 15590 3143 -491 -5625 6796 16455 38927 67280 68134 44381 19013
2278 19013 6366 11742 32629 46768 32154 16128 33384 45058 42928 29724 10009 26326
2266 26326 25596 39835 17537 1712 18190 21736 5799 2118 22158 678 -2697 5593 -7507
2253 -7507 4507 38138 33642 27576 38129 21704 11780 4152 9362 -5455 -13722 -15847 -8592 -42320
2239 -42320 -68583 -60769 -47688 -31906 -15187 20601 18727 -22842 -17023 6931 -3101 9506
2227 9506 -5500 -26859 -3269 -10815 -18687 -16575 -17386 9152 3142 20847 42514 45792 28272
2214 28272 28123 26491 25882 7839 26919 55142 29847 1590 -3104 30331 38648 46231 23807
2201 23807 -10997 -9212 -2881 561 11477 -7456 -3963 25112 11861 -3166 12542 14612 33857
2188 33857 27764 23369 27704 27388 30407 20668 16768 18009 19591 7849 10212 12864 -11874 -38470
2174 -38470 -53241 -63688 -21986 -1095 -4014 19117 29208 16730 38082 57595 61640 42814
2162 42814 53702 17210 4583 14133 14216 17300 7045 -17780 -11577 17213 23381 10437 -3579
2149 -3579 3662 -13894 -36022 -17205 -32 1577 -2297 -7921 3573 10221 23258 12119 32086
2136 32086 40929 34343 19523 31930 31357 7851 940 19594 -16256 -49651 -48185 -26244 -2943
2123 -2943 13825 4736 -3202 -26631 2445 16940 30418 34824 36551 41482 25683 9262 10255
2110 10255 -10237 -3241 8724 26128 1100 10695 16954 18259 6800 5376 -5257 18598 34249
2097 34249 19255 -7576 -10323 -21597 -2637 -5390 -361 6013 -12023 -5007 23491 12151 -4182
2084 -4182 8749 9328 3795 2239 10254 -2149 -17689 -11426 11574 10276 -14533 -7237 -8866 -35630
2070 -35630 -28114 -1856 -9425 -16438 -16390 -26059 -330 10294 30774 35026 29224 24152 33786 26306
2056 26306 23380 16363 16620 25537 17629 -15288 -8681 2854 26973 56748 39732 14650 -3241
2043 -3241 -20229 9405 27701 11044 2473 15367 43718 42431 8357 -8589 -16541 -17465 -31676
2030 -31676 -37179 -11870 -1234 30455 59408 42120 40118 34877 50652 36342 11705 -20198
2018 -20198 -20931 -15869 7705 -10369 -26142 -12513 -5919 -30065 -12066 7108 -8463 -19861 -6365
2005 -6365 10692 4526 -17826 -27993 1730 15541 9330 16673 33612 34439 29915 28245 37057 43053
1991 43053 36829 20510 -6435 -28580 -4932 29439 14728 5884 17449 38828 20650 4853
1979 4853 13947 1223 -27638 -28681 2116 -2661 -6548 -23046 -9447 -10651 -15827 -27839 -55852
1966 -55852 -46288 -34942 -8050 13132 1346 217 -20224 -1259 3781 15945 -3741 -16097
1954 -16097 -10087 -23655 -29661 -19058 -27807 -58104 -79375 -59589 -44839 -23566 -5922 -2723 -4656
1941 -4656 -2085 -4909 7279 16559 18600 27849 16688 1466 2196 -20958 3608 8540 18503 10652
1927 10652 18951 31526 14860 20246 31652 14386 -9539 -44183 -44136 -17189 -9893 -12352 -14858
1914 -14858 10912 32018 43701 33818 4613 7286 25440 17415 22217 43859 60449 58166 23235
1901 23235 -3598 22455 12248 1735 11346 35082 49704 46920 38806 -730 -9781 9122 30239
1888 30239 34554 -145 -2145 4165 -82 2625 -1059 -24383 -38137 14155 21482 9291 6516
1875 6516 3820 33011 46608 47536 18220 -8446 -11894 -21406 -5151 6202 -7175 -18859 -7563
1862 -7563 -4916 -1251 5655 -10579 -22710 -42461 -36851 -12102 5239 34441 46681 16361 9976
1849 9976 18390 -3738 -10708 4814 4387 1347 21457 10297 17695 11065 -806 11862 15754 27141
1835 27141 17774 -6769 -15849 -4514 2742 -4818 -17205 -17815 -11992 -12487 -6802 16657 -3838 10876
1821 10876 45022 53247 42308 37187 51331 55893 22457 19221 55272 58348 28148 10127 13389
1808 13389 35206 77998 91516 82768 67759 45519 28804 3303 -11810 -7720 -21613 -31705
1796 -31705 -6652 12965 10229 14336 17067 13921 12578 118 11015 -6783 -17882 -18934 -19035
1783 -19035 -11353 -2042 1038 17027 32867 24804 11929 25771 13048 17651 28122 28001 7708
1770 7708 -11473 475 -9977 -20331 -37127 -30112 -18851 -19217 -6177 -18120 -19793 -1679 22671
1757 22671 27355 52128 66791 51895 9398 -7039 -8139 -20470 -1766 7468 23552 10823
1745 10823 -25967 -22812 -30518 -10439 9566 774 -5575 5300 10333 25967 5215 -20142 -1609
1732 -1609 -22536 -49278 -25005 21116 29755 19001 -3483 -28370 -43463 1434 1883 -3051 -12568
1719 -12568 -23763 -31453 -22890 -16513 -24439 -33641 -22247 15132 29537 10621 8208 20018 25498
1706 25498 26116 21883 30177 52421 58602 51739 42374 26667 25220 41723 32657 39834 26786 40465
1692 40465 31129 37791 33532 3143 -5310 11238 10365 19299 9388 -3572 -21824 -27385 -31545 -21339
1678 -21339 6757 299 2066 7441 20765 49782 43881 34041 18222 12761 -11938 -8220 12468
1665 12468 -5260 -30250 -41534 2504 27304 26325 25545 30897 23783 -7164 -21203 -23669 -7883
1652 -7883 -1313 18614 18156 11288 6851 6646 16066 19147 523 -10994 6485 4498 1626 1981 30402
1637 30402 -8264 -36042 -29733 -29804 -30139 -26542 -17636 -1334 11810 5532 -4013 -19109 -30304 -42149
1623 -42149 -29967 -33215 -3351 -915 -156 -4834 1968 358 -9955 17158 42856 11423 13072
1610 13072 20154 7753 18214 -388 3191 8317 4331 -4269 32517 54715 69100 51904 37219
1597 37219 57850 77467 73247 47792 23153 36602 18511 7253 6931 17363 29290 24601 44181
1584 44181 50397 10612 17382 28495 28869 27682 7765 -4769 -19400 -5142 23006 18185 -14314
1571 -14314 10371 44294 55143 48563 32927 35977 66595 59542 36185 29604 31446 42396 69184
1558 69184 67463 59973 30939 11768 -4794 2210 10693 6772 -3063 -14768 5305 13267 3446
1545 3446 16030 1942 6822 17790 22055 -5133 -14383 16436 43006 50795 50462 37991 152
1532 152 11043 29586 31054 30212 38158 31088 43766 31609 40441 19163 13932 17451 36641 40736
1518 40736 35216 23499 38668 41015 28521 32290 55344 53188 58174 47659 22601 -335 14585
1505 14585 12832 7685 -800 528 -16222 -43475 -33516 -20881 11272 18367 -13789 -373 2948
1492 2948 191 21798 30109 14653 -6240 -14008 12492 10929 5288 -1778 -11120 12987 -951
1479 -951 9582 9632 26120 53222 64887 49847 21517 -6029 -978 -5780 16750 24705 21003 19029
1465 19029 28319 25457 -9949 -10813 -24553 -5298 27780 19483 -3144 -28998 -36030 -2862 16521
1452 16521 40298 37301 41089 31274 11664 -4403 -19018 -30064 -29407 -2402 22101 24614 23890
1439 23890 14718 -24179 -14100 18997 33008 48098 56813 58918 25618 14787 -11447 -4377 4942
1426 4942 -2780 -12338 -12004 -26978 -25720 -20651 -19407 -31215 -9804 -14926 -36933 -17638 -37616 -43177
1412 -43177 -34969 -9540 -13724 -8051 -16421 -31241 -11191 -19568 -10564 4117 24975 18494 19368 23472
1398 23472 49841 47547 20712 5243 17420 44324 62437 50572 36303 28401 40442 50271
1386 50271 52903 45280 24267 30497 40549 15850 292 -5706 -30136 -8996 12714 1375 -22075
1373 -22075 -30176 -3096 12696 34740 33428 19481 13241 16042 -7427 -22515 -6323 11407 264
1360 264 -3334 1786 8404 -15792 -14277 -7583 -11343 -4645 15976 24476 24952 21811 35595 14759
1346 14759 10275 1220 -3116 -13257 -4366 10759 -12767 -38479 -29949 -8968 -6275 -1600 -25
1333 -25 -7079 -17107 16110 27734 26341 23714 15970 -13164 -4115 6864 6423 -18482 -4491 6401
1319 6401 14143 2354 14852 35268 20400 8207 -7433 -15292 -12253 -33264 -41106 -41038 -14963
1306 -14963 5445 7475 -3831 -12387 -26824 -483 20983 14486 39877 28632 5631 -20500
1294 -20500 -10096 -6239 13854 3842 -8692 12842 38777 51699 36392 37192 32601 -2297 -27171
1281 -27171 -14055 -21827 -5853 6938 10852 11588 18135 18270 17804 18316 30157 20019 13089 24436
1267 24436 5497 18291 29887 3561 -17095 -8782 20481 42044 48610 56413 66553 90325
1255 90325 117285 79864 28770 14731 16275 25590 11851 14667 36804 26554 22934 19393 30371
1242 30371 35662 2401 2783 5650 5447 -12479 -3349 31026 28348 21630 -7573 7225 5146 -22505
1228 -22505 -42130 -12299 -6946 -34826 -36390 -28485 802 26335 27910 40130 64924 58320 17037
1215 17037 -20112 1793 5353 -4751 1751 26550 24393 -3939 -26769 -29668 -17893 6937 22306
1202 22306 16260 8826 2621 26807 51994 31064 35100 27763 31082 51590 29828 -6901 5862
1189 5862 17026 7544 15086 37865 22675 3980 -25016 -15196 12059 19579 58180 53516 51544
1176 51544 42351 13182 6469 -4647 -12657 13719 15563 14233 13953 2870 5605 18347 25632 -643
1162 -643 -20458 -22088 -6304 -10989 -22276 -14278 -11366 4925 9170 18674 -639 -3103 2132 6152
1148 6152 12154 3875 10179 7131 -17025 -35242 -23286 -20658 -15211 10812 15183 32529 38085 28000
1134 28000 15694 17693 687 -1707 22931 63479 64277 33811 -9320 -13008 -5918 6333 24860
1121 24860 25927 34650 27348 16426 8397 696 -12970 -26847 -5863 10075 18755 22281 13446
1108 13446 -12857 -27849 -48860 -56174 -43656 -21552 -11879 -13027 -21963 -13629 -46823 -37529 -23769
1095 -23769 -10895 6509 2585 -20409 -2226 20861 17785 31371 42563 51168 50064 16329 172
1082 172 -6756 -35026 -44694 -19881 -10512 -3909 3395 6499 13699 -8397 -17300 -6343 16341 21061
1068 21061 10732 -8965 -3046 12336 15550 -19761 -24811 -20499 -16652 -41569 -37889 -25285 -3717
1055 -3717 -2274 4750 1897 36928 40197 22262 16980 25752 19470 4340 -7678 -25419 -32418 -14241
1041 -14241 -2359 3540 -1048 18137 20791 1841 -7266 -8642 2010 21484 19554 14242 11652
1028 11652 7307 13496 9796 33323 44839 33403 22084 34080 39035 27824 -7195 -30105 -32665
1015 -32665 -9579 -5213 -26469 -25273 5545 -7501 -27239 -25429 -37812 -39855 -46759 -15975 -24866
1002 -24866 -28716 -6794 -394 19571 22004 35929 47559 60143 50706 41098 32463 14429 -22731
989 -22731 -4769 22721 23076 5535 207 -20868 -41717 -17510 3155 -2481 -5807 1930 -25720
976 -25720 -3836 -8530 -11101 16576 12591 -1977 -1141 13968 19672 29455 36406 24746 12496 27134
962 27134 27382 22299 28670 11779 10170 646 -16605 -16334 -40403 -69498 -59289 -31714 17573 27774
948 27774 43865 39916 21157 5303 7083 10374 6583 -9881 -18459 -25082 -26320 -39480 -16035
935 -16035 -6676 -11332 -5066 -21204 -25697 -10282 -19456 -30353 -28307 -11562 6801 -17441 -36255
922 -36255 -9692 27649 22495 32714 16980 22537 29162 35046 58477 47096 928 -9231 7105
909 7105 1424 -1609 25970 16532 -12431 -13799 437 14112 8042 40924 41885 36643 3193 -43658
895 -43658 -56597 -34560 -11601 -4021 20722 26519 17495 27300 36795 31438 43677 30476 38111
882 38111 31462 44482 47500 41093 33514 39324 44762 44398 40379 30617 691 -10090 -7278 -11777
868 -11777 5227 24163 1257 -27035 -11497 -32173 -70805 -54822 -17305 -3464 12854 15947
856 15947 -375 -20103 -54463 -68415 -52501 -22057 -2926 -6935 -5582 -10556 -24788 -19138 15998
843 15998 20432 30577 42799 38248 -5783 -32196 -3216 11989 27870 28313 29634 45885 21267
830 21267 24488 26055 22411 3728 -7496 -15738 2201 37527 65263 72583 67524 33673 24715
817 24715 21373 52822 63705 61417 57556 54447 43984 28973 8252 -13973 -11068 8008 22792
804 22792 47047 72192 70708 36053 17666 -3554 -24155 -10533 59310 69632 42466 41263
792 41263 27518 28098 39147 32161 17862 21411 31704 31314 44493 16813 392 -10782 -6265
779 -6265 -8059 -7330 37225 32164 -22165 -45709 -29633 2047 15231 27950 40282 37662 36036
766 36036 14105 3910 -7392 8140 5230 29859 22804 8665 3577 7221 14675 -10589 -21636
753 -21636 -24224 -23291 -20383 -9979 15267 36029 54325 50853 53158 59369 18352 -3853 -6692 -6976
739 -6976 -12971 -28556 -41754 -57682 -40366 -21629 5001 6311 4107 -11503 -25760 -34109 -33657
726 -33657 -18301 13098 16157 -1499 -18515 -8277 30321 60975 73039 61665 36846 10213
714 10213 9391 45304 33981 26668 -3275 -12562 14340 52190 65629 64331 40577 41679 37142
701 37142 1244 11524 4490 17384 31489 15667 -3776 4594 18707 10795 -7559 24622 54814
688 54814 3877 -5500 4154 29766 38149 38787 23570 4549 1394 29 21792 33820 32355 19557
674 19557 40569 52216 25475 27612 -1068 -26155 -24831 -8151 -16362 -30893 -4657 18028 6377
661 6377 -10337 -19387 -18155 -32465 -12126 -10982 -17407 -10503 38975 42138 45953 51482 38609 11211
647 11211 -10552 -11405 9235 14105 -164 -29451 -15070 5102 4609 18726 24967 65884 77598
634 77598 46730 11176 -11344 -32940 -10952 7469 9033 13501 3546 8900 28632 21504 33464
621 33464 35868 35877 28668 16753 -10896 -18844 6769 -2510 -8638 -14252 -22253 -20335 -29559 -21395 1489
606 1489 14633 36508 8359 -20020 -30635 -22962 -3631 2338 11898 12187 -9659 -32227 -13207
593 -13207 13861 43141 46472 55646 36026 33572 59699 65453 50498 30828 34163 32119 21233
580 21233 33351 12757 3144 24486 11155 524 11216 6102 13426 26931 42682 29240 14236
567 14236 14983 8533 -2956 -10839 -9884 -5018 15103 13606 25364 39728 23236 6201 6242 -12230
553 -12230 -765 17885 24095 22573 13122 -12366 -31794 -33400 -28774 -13883 -14523 -49633 -80847
540 -80847 -59568 -53112 -22462 -26516 -21613 -38358 -44514 -56899 -62915 -67863 -78175 -93952 -78341
527 -78341 -55595 -17381 14415 47147 46782 42433 36058 17470 19138 15772 1926 31344 56543
514 56543 35995 9623 15428 24004 30799 830 -36648 -37481 -19561 -7737 9481 19474 -2864
501 -2864 -611 23688 19493 1953 -1340 2658 -16654 4165 17618 -3881 -1887 -23482 -28011
488 -28011 -1666 7678 5936 -22803 -27640 -36458 -53809 -58487 -40388 -31833 -34428 -23556 -8414
475 -8414 -8010 -3643 4725 9699 -5774 -20268 -16608 1649 -3113 -7362 -7341 -10734 -30344 -8420 9634
460 9634 -8128 -26345 -33762 -29480 -18079 14775 40086 27224 -2915 -14459 -6652 9826 10468
447 10468 -13808 -17552 -26030 -28432 -30531 -20044 -10722 2044 723 -22174 -15052 13658 -3511
434 -3511 -32008 -43616 -38826 -29235 -25957 -4813 -2701 -22188 -46505 -36808 -42014 -24616 -19569 -12999
420 -12999 -18076 -34112 -50257 -26798 -8813 1813 -8408 -14232 25060 35931 4964 -2594 11293
407 11293 148 -21724 -20603 -18079 -14580 -31930 -58249 -68119 -49671 -13356 -16451 -32963 -41413
394 -41413 -43188 -47057 -42399 -57233 -42327 -20503 -12967 -12346 3435 1417 5115 -34752 -72431 -62711
380 -62711 -65452 -77666 -60758 -42282 -43413 -56084 -57443 -50361 -44973 -44899 -49612 -40467 -25088 -20442
366 -20442 -30586 -42667 -36901 -47621 -71985 -79265 -48427 -55273 -68512 -65057 -56084 -62531 -47938
353 -47938 -23427 -26615 -59297 -59829 -62035 -78922 -82234 -65231 -57407 -61453 -59254 -65742 -72562 -74496
339 -74496 -75857 -47240 -16746 -9773 -45396 -83260 -83592 -86448 -77752 -66674 -77072 -91336 -86449
326 -86449 -65062 -30618 -37459 -44005 -46272 -53710 -67251 -70054 -77526 -73850 -78464 -79319 -83751 -103520
312 -103520 -113929 -85712 -79163 -91378 -112546 -103230 -70654 -44658 -42800 -59797 -74757 -99416
300 -99416 -99397 -83208 -65521 -64680 -80862 -62073 -85389 -105697 -109843 -105443 -106456 -86439 -79246 -103275
286 -103275 -99331 -84089 -77006 -81846 -112879 -106697 -104275 -111843 -99570 -90190 -81271 -77612 -95169 -106752
272 -106752 -74218 -50179 -44254 -80685 -112224 -106682 -89778 -68519 -67093 -84382 -99882 -103657 -105474
259 -105474 -104301 -95051 -89618 -105350 -108880 -122637 -130896 -112584 -99982 -93379 -87424 -115561 -114315
246 -114315 -131872 -120407 -121888 -111390 -103206 -124143 -154339 -152775 -120402 -109302 -115492 -126436 -130383
233 -130383 -131570 -135809 -105792 -99578 -129080 -144864 -158737 -184443 -180402 -162257 -173663 -171273 -159679
220 -159679 -158892 -163545 -174240 -171753 -166948 -144504 -127081 -132949 -169642 -191423 -197372 -173587 -160009
207 -160009 -155874 -183137 -207083 -230968 -209489 -164587 -152863 -158040 -168151 -172327 -167290 -170629 -167020
194 -167020 -175775 -183626 -189783 -185967 -163728 -147251 -162790 -165415 -159848 -153646 -152772 -141803 -145495 -174125
180 -174125 -190422 -204696 -225657 -228529 -245337 -237443 -220181 -200882 -198635 -208455 -205218 -184971 -173595
167 -173595 -179717 -198365 -192644 -188038 -178100 -178153 -198017 -215304 -205867 -194913 -196787 -181323 -177744 -184680
153 -184680 -180666 -193417 -200217 -198139 -201901 -209187 -212477 -216497 -220387 -222304 -236055 -250575 -248696 -222905
139 -222905 -205511 -231441 -228879 -240934 -256677 -264333 -266199 -249534 -227120 -222054 -234524 -249528 -260319
126 -260319 -269884 -261690 -272912 -276421 -282156 -264157 -240212 -242977 -249112 -245114 -250724 -248155 -237356 -221776
112 -221776 -215732 -247458 -278348 -284312 -286104 -276068 -284109 -290638 -270833 -266718 -265127 -272890 -281578 -282088
98 -282088 -272785 -280519 -293010 -298000 -309486 -308059 -293097 -290491 -301866 -299053 -280379 -251600 -246906
85 -246906 -245281 -285549 -310115 -302634 -301987 -309293 -324743 -329154 -344445 -347428 -349609 -351164 -331673 -313571
71 -313571 -304495 -305544 -317324 -308141 -300928 -314273 -331589 -347249 -360526 -361696 -329143 -311477 -328823
58 -328823 -329256 -319094 -319515 -326709 -321053 -327106 -326434 -331611 -323316 -332858 -351617 -358280 -358247 -348669 -341430 -325730
42 -325730 -332256 -349304 -344576 -332188 -341100 -369682 -375015 -369987 -370409 -368918 -352557 -361451 -373664 -352328
28 -352328 -361479 -380548 -393856 -394619 -384177 -365712 -367527 -371121 -366750 -344040 -356773 -360454 -362571 -379985
14 -379985 -382637 -377090 -371648 -371434 -394087 -399139 -405399 -413940 -421726 -431354 -410795 -399464 -400826 -406046
0 -406046
$$ Imaginary data points
##PAGE= N=2
##DATA TABLE= (X++(I..I)), XYDATA
32767 203796 198969 214935 223345 212185 216575 217095 204837 189229 196734 191608 195121 200063 216957
32754 216957 216752 201799 205178 213776 239246 254057 254602 242462 249449 251775 261276 266895 290005
32741 290005 293203 294413 282638 282989 267045 270300 284232 289753 264371 276703 280122 288493 305185
32728 305185 306643 281609 254422 251182 265775 286295 311297 330580 320429 315424 316124 326280
32716 326280 315796 326328 324120 309496 311851 310243 304888 320015 320946 322324 321334 334225 349255
32703 349255 350956 324056 326306 326203 332220 333786 340776 360813 369837 376331 372431 396970 390097 362037
32689 362037 364825 383200 402266 406880 394431 388747 386183 384199 382913 405644 425818 421150 395845
32676 395845 387606 390522 421589 432211 422754 416044 409080 401407 405883 412542 417749 415541 415109 433033
32662 433033 430596 423203 422468 422866 435342 438519 433568 434748 422708 412083 414614 443122 470100
32649 470100 470258 445476 446010 457606 468085 476441 459897 449526 451341 459567 461647 458746 453050
32636 453050 440856 436641 471853 502626 498187 505797 513527 502469 487394 479860 490960 493651 495853
32623 495853 487129 492568 485174 498361 505571 505028 513681 529040 533031 540243 525250 537673 548926
32610 548926 549902 560093 546686 532682 520876 518661 530102 552369 565885 575277 564742 557556
32598 557556 556878 557688 557252 575546 576941 571998 561595 547244 539148 549792 561575 554906 570069
32585 570069 560091 553473 559047 558373 563453 573748 584290 594009 580879 587899 595757 586560 568545
32572 568545 585993 601387 597221 590181 594236 593858 600984 606313 609053 607533 627682 632846 646303
32559 646303 645219 654362 661516 641794 626384 640253 649070 648203 638712 638376 641438 653796 686086
32546 686086 691826 676502 689349 667711 638488 636157 627393 634197 660023 679862 658645 665423
32534 665423 658916 636215 639668 645658 646259 630730 626718 632350 655391 693412 707469 693714 703719
32521 703719 709224 698252 699203 717527 708619 711678 707525 724047 720214 698516 711304 736697 734886
32508 734886 724153 713708 708548 715254 708789 704543 713736 718504 693677 709610 737880 744615 741076
32495 741076 712559 703692 709566 708389 720222 729299 740689 748454 742849 716374 721377 738482 754453
32482 754453 744281 732560 728645 726319 725132 749431 769995 751079 739300 774944 786255 787567
32470 787567 756757 749158 769501 775785 768479 766197 761344 762311 763163 757338 753082 748366 730519 737902
32456 737902 746393 765204 777138 786731 814700 826135 825767 828966 825253 809680 799844 796192 795626
32443 795626 805995 799672 803374 795174 767893 788027 815647 826001 837477 824382 812145 815514
32431 815514 818492 826715 830401 783567 758392 763724 795886 801254 806128 807752 795562 817850 817645
32418 817645 791429 795387 791224 782055 788806 772925 770387 769501 786881 797828 790179 792709 804993
32405 804993 806876 789207 797022 820419 824105 813443 831130 841482 851530 825238 826104 827280 833692
32392 833692 837803 836252 831234 823858 814383 825171 832755 829073 827724 831068 817420 803348 829945
32379 829945 826671 811884 811219 838685 834439 828863 833624 824261 819201 796907 795782 823646 823399 816087
32365 816087 820185 840431 843784 843480 847821 857484 870106 880735 890643 872050 840067 851884 857120
32352 857120 834952 851357 829903 818926 827566 840789 869239 872671 868670 867164 887540 889470
32340 889470 904036 926435 900382 886353 907368 919550 921598 890883 852838 838111 867035 903081
32328 903081 867659 857424 868429 868676 888431 872124 876012 899298 893100 899602 871860 844969
32316 844969 849736 861387 866609 875091 890559 901050 898213 908488 885374 865432 835883 837290
32304 837290 864501 870090 876933 878044 871999 862780 852742 867957 874445 917132 931347 911971 914765
32291 914765 912105 911389 905290 907516 898496 886234 866904 896463 913114 906330 893373 865289 889581
32278 889581 880873 894461 891409 895672 885935 866689 843611 832101 859143 867685 874152 864144 857397
32265 857397 852709 849141 852487 862395 889498 900553 901755 932916 935589 923707 908922 906882 900735
32252 900735 902881 912556 922932 930503 927622 928585 928133 932096 913823 901592 918152 906890 871530
32239 871530 865469 871429 884145 883111 901774 918165 948401 936287 932806 951292 955830 960785 968937
32226 968937 957066 934298 910896 929124 948365 949602 947908 958014 984016 960640 913606 893167
32214 893167 939547 947234 948123 938857 940003 930749 940529 938778 923899 933958 908416 900161 926567
32201 926567 926457 914392 943790 935683 940161 918585 904588 903875 909356 915276 897981 900752 921131
32188 921131 918463 939859 937464 904018 901534 901374 890266 888781 894071 923627 930806 925420 915927
32175 915927 921166 928742 930948 928624 951770 969056 973051 958388 942636 932084 921531 947518
32163 947518 945281 901867 913062 930742 917763 906523 904315 918462 941520 946523 942509 926906
32151 926906 909942 887857 890772 898009 905181 905399 933142 935422 910588 915814 910008 901427 918868
32138 918868 946776 955290 954481 936537 924034 902252 905860 946867 937889 904528 913063 942559 972932
$$ [...]
##END NTUPLES=NMR SPECTRUM
##END=
