##TITLE=Analysis number 308988
Compound Code cc 39146
Book Reference 399/159
Project Code adrs
Chemist Name evam
##JCAMPDX= 6.0         $$ Bruker NMR JCAMP-DX V2.0
##DATA TYPE= NMR SPECTRUM
##DATA CLASS= NTUPLES
##ORIGIN= Bruker BioSpin GmbH
##OWNER= NMR
$$ XWIN-NMR		Version 3.5
$$ Thu May 26 10:56:52 2005 GMT Daylight Time (UT+1h)  MAYBRIDGE\NMR@NMR_250MHZ
##.OBSERVE FREQUENCY= 250.131544655141
##.OBSERVE NUCLEUS= ^1H
##.ACQUISITION MODE= SIMULTANEOUS (DQD)
##.ACQUISITION SCHEME= undefined
##.AVERAGES= 16
##.DIGITISER RES= 18
##SPECTROMETER/DATA SYSTEM= dpx250
##.PULSE SEQUENCE= zg30
##.SOLVENT NAME= CDCl3
##.SHIFT REFERENCE= (INTERNAL, CDCl3, 0, 16.522)
##AUDIT TRAIL= $$ (NUMBER, WHEN, WHO, WHERE, WHAT)
$$ ##TITLE= Audit trail, XWIN-NMR		Version 3.5
$$ ##JCAMPDX= 5.01
$$ ##ORIGIN= Bruker BioSpin GmbH
$$ ##OWNER= NMR
$$ C:\u/data/dgb/nmr/ADRS/3540/pdata/1/auditp.txt
$$ ##AUDIT TRAIL=  $$ (NUMBER, WHEN, WHO, WHERE, WHAT)
(   1,<2005-05-26 10:56:33.85 +100>,<MAYBRIDGE\NMR>,<NMR_250MHZ>,
      <created by zg, POWCHK disabled, PULCHK disabled
       configuration hash MD5:
       62 19 C7 07 E1 42 D1 B7 37 6C 3D D0 77 39 F9 E6
       data hash MD5: 64K
       54 2E FD 11 AC BE E0 27 4F 3E A3 C2 5D A7 F6 17>)
(   2,<2005-05-26 10:56:44.70 +100>,<MAYBRIDGE\NMR>,<NMR_250MHZ>,
      <Start of raw data processing
       ef LB = 0.3 FT_mod = 6 PKNL = 1 SI = 32K 
       data hash MD5: 32K
       28 57 5D C7 02 46 D1 7E 5D EF A3 77 B7 D8 83 C7>)
(   3,<2005-05-26 10:56:46.54 +100>,<MAYBRIDGE\NMR>,<NMR_250MHZ>,
      <apk 
       data hash MD5: 32K
       E7 89 A2 BA 39 EB 6C F2 DE CC 29 90 1D 23 E4 CE>)
(   4,<2005-05-26 10:56:47.29 +100>,<MAYBRIDGE\NMR>,<NMR_250MHZ>,
      <abs ABSG = 5 
       data hash MD5: 32K
       6E 9A D9 6C 08 3F 8C 48 20 50 EE 14 85 A3 E4 39>)
$$ ##END=
$$ 
$$ hash MD5
$$ 20 6C AC 47 5D 45 D0 D9 80 ED 73 DA F5 F6 24 B0
##$RELAX= 
##$RELAX= 
##$RELAX= 
##$RELAX= 
##$RELAX= 
##$RELAX= 
##$RELAX= 
$$ Bruker specific parameters
$$ --------------------------
##$DU= <C:\u>
##$EXPNO= 3540
##$NAME= <ADRS>
##$PROCNO= 1
##$TYPE= <nmr>
##$USER= <dgb>
##$AMP= (0..31)
100 100 100 100 100 100 100 100 100 100 100 100 100 100 100 100 100 100 
100 100 100 100 100 100 100 100 100 100 100 100 100 100 
##$AQSEQ= 0
##$AQ_mod= 3
##$AUNM= <au_zg>
##$AUTOPOS= <11 >
##$BF1= 250.13
##$BF2= 250.13
##$BF3= 250.13
##$BF4= 250.13
##$BF5= 500.13
##$BF6= 500.13
##$BF7= 500.13
##$BF8= 500.13
##$BYTORDA= 1
##$CFDGTYP= 0
##$CFRGTYP= 5
##$CHEMSTR= <none>
##$CNST= (0..31)
1 1 145 1 1 1 1 1 1 1 1 1 1 1 1 1 1 1 1 1 1 1 1 1 1 1 1 1 1 1 1 1 
##$CPDPRG= <>
##$CPDPRG1= <>
##$CPDPRG2= <>
##$CPDPRG3= <>
##$CPDPRG4= <mlev>
##$CPDPRG5= <mlev>
##$CPDPRG6= <mlev>
##$CPDPRG7= <mlev>
##$CPDPRG8= <mlev>
##$CPDPRGB= <>
##$CPDPRGT= <>
##$D= (0..31)
0 1 0 0 0 0 0 0 0 0.06 0 0 0 0 0 0 0.0002 0 0 0 0 0 0 0 0 0 0 0 0 0 0 
0 
##$DATE= 1117101392
##$DBL= (0..7)
120 120 120 120 120 120 120 120 
##$DBP= (0..7)
150 150 150 150 150 150 150 150 
##$DBP07= 0
##$DBPNAM0= <>
##$DBPNAM1= <>
$$ [...]
##$SUBNAM7= <"">
##$SUBNAM8= <"">
##$SUBNAM9= <"">
##$SW= 20.6930455092707
##$SWIBOX= (0..15)
0 0 3 0 0 0 0 0 0 0 0 0 0 0 0 0 
##$SW_h= 5175.983436853
##$TD= 65536
##$TD0= 1
##$TE= 295.16
##$TE2= 300
##$TE3= 300
##$TEG= 300
##$TL= (0..7)
0 120 120 120 120 120 120 120 
##$TP= (0..7)
150 150 150 150 150 150 150 150 
##$TP07= 0
##$TPNAME0= <>
##$TPNAME1= <>
##$TPNAME2= <>
##$TPNAME3= <>
##$TPNAME4= <>
##$TPNAME5= <>
##$TPNAME6= <>
##$TPNAME7= <>
##$TPOAL= (0..7)
0.5 0.5 0.5 0.5 0.5 0.5 0.5 0.5 
##$TPOFFS= (0..7)
0 0 0 0 0 0 0 0 
##$TUNHIN= 0
##$TUNHOUT= 0
##$TUNXOUT= 0
##$USERA1= <user>
##$USERA2= <user>
##$USERA3= <user>
##$USERA4= <user>
##$USERA5= <user>
##$V9= 5
##$VALIST= <valist>
##$VCLIST= <CCCCCCCCCCCCCCC>
##$VD= 0
##$VDLIST= <DDDDDDDDDDDDDDD>
##$VPLIST= <PPPPPPPPPPPPPPP>
##$VTLIST= <TTTTTTTTTTTTTTT>
##$WBST= 1024
##$WBSW= 4
##$XGAIN= (0..3)
0 0 0 0 
##$XL= 0
##$YL= 0
##$YMAX_a= 594765
##$YMIN_a= -665027
##$ZGOPTNS= <>
##$ZL1= 120
##$ZL2= 120
##$ZL3= 120
##$ZL4= 120
##$ABSF1= 16.522
##$ABSF2= -4.171173
##$ABSG= 5
##$ABSL= 3
##$ALPHA= 0
##$AQORDER= 0
##$ASSFAC= 0
##$ASSFACI= 0
##$ASSFACX= 0
##$ASSWID= 0
##$AUNMP= <proc_1d>
##$AZFE= 0.1
##$AZFW= 0.1
##$BCFW= 0
##$BC_mod= 0
##$BYTORDP= 0
##$COROFFS= 0
##$CY= 12.5
##$DATMOD= 1
##$DC= 0
##$DFILT= <>
##$DTYPP= 0
##$F1P= 14.0000005364418
##$F2P= -0.99999901652339
##$FCOR= 0.5
##$FTSIZE= 32768
##$FT_mod= 6
##$GAMMA= 0
##$GB= 0
##$INTBC= 1
##$INTSCL= 1
##$ISEN= 128
##$LB= 0.3
##$LEV0= 0
##$LPBIN= 0
##$MAXI= 10000
##$MC2= 0
##$MEAN= 0
##$ME_mod= 0
##$MI= 0
##$NCOEF= 0
##$NC_proc= -2
##$NLEV= 6
##$NOISF1= 0
##$NOISF2= 0
##$NSP= 0
##$NTH_PI= 0
##$NZP= 0
##$OFFSET= 16.522
##$PC= 1
##$PHC0= -73.68124
##$PHC1= 4.733414
##$PH_mod= 1
##$PKNL= yes
##$PPARMOD= 0
##$PSCAL= 4
##$PSIGN= 0
##$REVERSE= no
##$SF= 250.13
##$SI= 32768
##$SIGF1= 0
##$SIGF2= 0
##$SINO= 400
##$SIOLD= 32768
##$SREGLST= <1H.CDCl3>
##$SSB= 0
##$STSI= 32768
##$STSR= 0
##$SW_p= 5175.98343685301
##$SYMM= 0
##$S_DEV= 0
##$TDeff= 65536
##$TDoff= 0
##$TI= <Analysis number 999999
Compound Code 99
Book Reference 9
Project Code 9>
##$TILT= no
##$TM1= 0
##$TM2= 0
##$TOPLEV= 0
##$USERP1= <user>
##$USERP2= <user>
##$USERP3= <user>
##$USERP4= <user>
##$USERP5= <user>
##$WDW= 1
##$XDIM= 32768
##$YMAX_p= 340691343
##$YMIN_p= -28900
$$ End of Bruker specific parameters
$$ ---------------------------------
##NTUPLES= NMR SPECTRUM
##VAR_NAME=  FREQUENCY,     SPECTRUM/REAL,   SPECTRUM/IMAG
##SYMBOL=    X,             R,               I
##VAR_TYPE=  INDEPENDENT,   DEPENDENT,       DEPENDENT
##VAR_FORM=  AFFN,          ASDF,            ASDF
##VAR_DIM=   32768,         32768,           32768
##UNITS=     HZ,            ARBITRARY UNITS, ARBITRARY UNITS
##FACTOR=    0.157963299565203, 1,           1
##FIRST=     4132.6476996994, 0,             0
##LAST=      -1043.33573715361, 0,           0
##MIN=       -1043.33573715361, -28900,      0
##MAX=       4132.6476996994, 340691343,     0
$$ Real data points
##PAGE= N=1
##DATA TABLE= (X++(R..R)), XYDATA
$$ [...]
17455A3810L557k264r341l443J0175M848j688p055R31J2240P011J623O773J6603
17441E3780J8070K744j0011j9545j7825j4950j3485P9J5J714P689P75N673p03
17427A4020m345l397M824M106l510m10J648n10m996J976l929p281m516l52Q098
17412A426Q180L142R2m55k311k694l332m848J709M251M363L596j315N165J605
17397A8574p270q190n446J735O704M558P40m691P51n79j294M481L964n684n981
17382B372o417N105K474k952k800J496n318J730O007j469q613J481M442k112k119
17367f693k338K317M668l765o376K446L609P488O83N69j0389K457P645L396L34
17352F051m762R99L30o160M17R932K104l247Q37K691n861o345Q48R0l269L168
$$ plain form
17455 13810 17367 15103 5762 2319 12494 17342 15654 8599 9530 21770 28781 30404 37177 53780
17441 53780 71850 74594 64583 45038 27213 12263 -1222 -1143 -1128 586 8275 9050 14723 14020
17427 14020 9675 6278 11102 15208 11698 11288 12936 12426 7430 9406 5477 -1804 -6320 -6672 1426
17412 1426 9606 12748 12840 12385 10074 7380 4048 -800 909 5160 9523 13119 11804 16969 18574
17397 18574 11304 3114 -2332 -597 6107 10665 11405 6714 7465 6886 5592 10073 14037 8353 2372
17382 2372 -4045 1060 3534 582 -2218 -722 -6040 -4310 1697 228 -8385 -6904 -2462 -4574 -6693
17367 -6693 -9031 -6714 -2046 -5811 -12187 -9741 -6132 1356 2039 2608 -7781 -5324 2321 5717 6051
17352 6051 1289 2288 2618 -3542 -3125 6807 8911 5664 6501 9192 3331 -3014 -2166 -2076 -5345 -2177
17336b177K174O973k649j368q946n277J771M595L76K528N076K678L871j784l966
17321C875m605N26L330j808l516p268N925N578L549m706n459J929J12J906p503
17306h135K563O966J509m254m310J017m371J045K703O0L405l834k818K292j27
17291f289K283m63O175L688k434k206k728p562J89P957N380O828l842l376l135
17276D65l479M85p556q117J1662K984n619k799K605Q23L995j112L98J803m851
17261h313M401P849M481j087r647m320j019M94P390L838K446j473k500q190O96
17246d954J0M496m051k06L427k320k969p15K792p00k607J04n366r08o47k28P357
17229g485L368j218k987n464O853j284k895k155J349N095k367m493L473Q955Q303
$$ plain form
17336 -2177 -3 6970 4321 2953 -5993 -11270 -9499 -4904 -4528 -2000 3076 5754 9625 7841 3875
17321 3875 -730 -204 3126 1318 -2198 -9466 -3541 2037 5586 880 -4579 -2650 -2538 -632 -8135
17306 -8135 -5572 1394 2903 -1351 -5661 -4644 -9015 -7970 -5267 -5207 -1802 -5636 -8454 -6162 -6289
17291 -6289 -4006 -4469 1706 5394 2960 754 -1974 -9536 -9347 -1390 3990 10818 6976 3600 465
17276 465 -3014 -2529 -10085 -18202 -6540 -3556 -9175 -11974 -9369 -8546 -4551 -5663 -5265 -3462 -8313
17261 -8313 -3912 3937 8418 7331 -2316 -6636 -7655 -7161 229 4067 6513 5040 2540 -5650 -4954
17246 -4954 -4944 -448 -4499 -4705 -1278 -3598 -6567 -7282 -4490 -5190 -7797 -7693 -13059 -13967 -14614 -14842 -7485
17229 -7485 -4117 -5335 -8322 -13786 -6933 -8217 -11112 -13267 -11918 -6823 -9190 -13683 -10210 -1255 7048
17214G048r97n244k408j40l466m98M209J057l306L197j006J114q49p20M498o180
17198c691l027J601k507m786m679M366M991k80k467J84M684r57J524K931m935
17183g048k822J583K566k262O143N6N070l274k098n05l026l790J372j527O190
17168c372J120m289j257k909k566L125K292k065l984k246N175M520k392O81l53
17153h520O346J2539P5k930q785p839N933O894o002o336l545k979K983L657n303
17138a3812Q45Q598L627o12o483o692L167N07O765J842n558J631M942L45J970
17123A082L655n118m451l49O346K644o12m212J499Q417j58M275p388r620r365
17108a3355J720O889j720j995M447m699p070l845K323n20Q181J030J602N707O014
$$ plain form
17214 7048 6051 807 -1601 -1741 -5207 -5705 -1496 -439 -3745 -548 -1554 -440 -1289 -2009 2489 -3691
17198 -3691 -6718 -5117 -7624 -12410 -17089 -12723 -7732 -8012 -10479 -10295 -5611 -6568 -5044 -2113 -7048
17183 -7048 -9870 -8287 -5721 -7983 -1840 -1784 3286 12 -2086 -2591 -5617 -9407 -8035 -9562 -3372
17168 -3372 -2252 -6541 -7798 -10707 -13273 -10148 -7856 -9921 -13905 -16151 -10976 -6456 -8848 -8167 -8520
17153 -8520 -2174 10365 10440 7510 -1275 -9114 -3181 3713 -2289 -8625 -12170 -15149 -12166 -8509 -13812
17138 -13812 -12967 -4369 -742 -1354 -7837 -14529 -11362 -10855 -4090 -2248 -7806 -6175 -1233 -888 1082
17123 1082 4737 -381 -4832 -5181 1165 3809 3197 -1015 484 8901 8743 13018 5630 -3990 -13355
17108 -13355 -11635 -4746 -6466 -8461 -4014 -8713 -15783 -19628 -17305 -17825 -9644 -8614 -7012 -1305 4709
17093D709n45j971k817j010k597m1l118M271l232j060K876J837R91K752k083L801
17077B763n479M907Q589m401n242r44K284m281L742O2M537j584p273k733p216
17062a2269j43P286m817l492M772O559j127J308n96M914Q058m293n939l233L272
17047B60K714j225o075n143n17k7o772l291q57M761Q600N805n148m359M156n852
17031a2970J320N771j834K968k520l067o299m077L662P143K66j368P342N625M449
17016F411l591l202m126p451p30l6M234m905O51P106Q245l161l67O895j985j566
17000B422q922O421M49l564k080n273l41L855L31L570J382p261m46l243K2M935
16984g743M759j511j096K600L681J043o360N307j753m087j414q972J219Q112J300
$$ plain form
17093 4709 4164 2193 -624 -1634 -4231 -4272 -7390 -3119 -6351 -7411 -4535 -2698 -1707 1045 -1038 2763
17077 2763 -2716 2191 10780 6379 1137 193 2477 -1804 1938 2000 6537 4953 -2320 -5053 -12269
17062 -12269 -12412 -5126 -9943 -13435 -8663 -2104 -3231 -1923 -2519 2395 10453 6160 221 -3012 260
17047 260 2974 1749 -4326 -9469 -9986 -10013 -16785 -20076 -20933 -16172 -7572 -1767 -6915 -11274 -7118 -12970
17031 -12970 -11650 -5879 -7713 -4745 -7265 -10332 -16631 -20708 -17046 -9903 -9637 -11005 -3663 1962 6411
17016 6411 2820 -382 -4508 -11959 -12689 -12725 -8491 -13396 -12745 -5639 2606 -555 -922 5973 3988 2422
17000 2422 -6500 -79 370 -3194 -5274 -10547 -10888 -7033 -6702 -3132 -1750 -9011 -9457 -12700 -12678 -7743
16984 -7743 -2984 -4495 -5591 -2991 690 1733 -4627 680 -1073 -5160 -6574 -15546 -14327 -6215 -4915
16969d915l453k122j896R277q40k186M916K939m820j370M569j310k416l197L449
16954c375O604R06K063o797o266M395k913j250J231M161k683n400o68P955L502
16939A465l729J584L657J53j357O90j322k801o89m065l733Q489J290m018k02l620
16923h208L755L414l362m004K314k121m160L389M978J939k528p567J836J503L388
16908e434N31L826l728k878l144P10K516J907l66j351o972K356Q228P998p985
16893c786n962J192J775R19O198J037l731p613j380P540M355j977q724l091M941
16878h307M899l99l314K553k115m720k249M612L320r74P131L385M70j37m709m662
16862e216q320o065J32Q157q85k582M292M127P860K570j0153R13N171J087J498
$$ plain form
16969 -4915 -8368 -10490 -12386 -3109 -3949 -6135 -1219 1720 -3100 -4470 99 -1211 -3627 -6824 -3375
16954 -3375 3229 4135 6198 -599 -6865 -2470 -5383 -6633 -5402 -1241 -3924 -9324 -9992 -2037 1465
16939 1465 -2264 -680 2977 3130 1773 2463 1141 -1660 -2349 -6414 -10147 -1658 -368 -4386 -4588 -8208
16923 -8208 -4453 -1039 -4401 -8405 -6091 -8212 -12372 -8983 -4005 -2066 -4594 -12161 -10325 -8822 -5434
16908 -5434 -4903 -1077 -4805 -7683 -10827 -10117 -7601 -5694 -6060 -7411 -14383 -12027 -3799 4199 -3786
16893 -3786 -9748 -8556 -6781 -5862 336 1373 -2358 -9971 -11351 -3811 544 -1433 -10157 -13248 -8307
16878 -8307 -3408 -3807 -7121 -4568 -6683 -11403 -13652 -9040 -5720 -6694 437 3822 4292 4155 -554 -5216
16862 -5216 -13536 -19601 -19469 -11312 -12197 -14779 -10487 -6360 1500 4070 -6083 -5170 1 1088 2586
16847B586J95J752R45l877j08o15l025n03J200J058N762K175l111j1453n93k509
16831a0121j066O515j313k473n106k805Q401N170p668J394L367l015l159m389
16817a6268O666r68o30O88M276j483L48L018p99M858J369L558L103n36r105r353
16801a1258J158J973K497N50M643K9l788j775Q646J726k410m93L283J041o474
16786f52m637j398O584M468p524m728j863k445j998M311l662n97M170o718J440
16771a5249O515Q553N12J749o458k329o856K227L964K7K94M742o03l427L8l001
16755i302k587l244P821Q594j0367r569p18L027Q224O003R51L319q1P31j599n566
16739d363N122J100n627M497K659p993m730L097L604Q19L448j509K44j918P099
$$ plain form
16847 2586 2781 4533 5478 1601 1493 878 -2147 -2650 -1450 -392 5370 7545 4434 -7019 -7612 -10121
16831 -10121 -11187 -4672 -5985 -8458 -13564 -16369 -7968 -2798 -10466 -9072 -5705 -8720 -11879 -16268
16817 -16268 -9602 -10570 -11200 -10512 -6236 -7719 -7371 -4353 -5152 -294 1075 4633 7736 7200 -1905 -11258
16801 -11258 -10100 -8127 -5630 -5080 -437 -408 -4196 -5971 2675 4401 1991 1498 4781 5822 -652
16786 -652 -5289 -6687 -103 4365 -3159 -7887 -9750 -12195 -14193 -9882 -13544 -14141 -9971 -16689 -15249
16771 -15249 -8734 -181 331 2080 -4378 -6707 -13563 -11336 -7372 -7345 -7051 -2309 -2912 -6339 -6301 -9302
16755 -9302 -11889 -15133 -7312 1282 -9085 -18654 -19372 -16345 -8121 -2118 -1167 2152 2071 2802 1203 -4363
16739 -4363 759 1859 -3768 729 3388 -4605 -9335 -6238 -2634 -1815 1633 124 368 -1550 5549
16724E549N190J92j0354n994J162P44K675N271P346r010j2739j452O772l062m560
16709a2270K967K630j891l545N426N663L355l31j203K734O86r29N81j428l614
16694a169k561M164L107n560l957P61o553m377Q684P412j724p180j141M389K924
16679b781N867k778l774K258J832M838P132p466p979k37n309R71L130n62j580
16664f438R67k331K708O999M39q206l39l6k581n942K73N966K554l385K899N083
16648a370r38m297l309j696L576M775L754J636J710l51k807m505p66N741O19m062
16632b290L506j232p38j917o108p432J48N822K784j118j545k875l014l858j447
16617b1314J1069Q58Q149K980r396k156R68K47L532K101L782l230l946o053N72
$$ plain form
16724 5549 10739 10931 577 -5417 -4255 -3511 -836 4435 11781 2771 -9968 -11420 -4648 -7710 -12270
16709 -12270 -9303 -6673 -8564 -12109 -6683 -1020 2335 2004 801 3535 4221 3292 3873 2445 -1169
16694 -1169 -3730 434 3541 -2019 -5976 -5215 -11768 -16145 -7461 -49 -1773 -8953 -10094 -5705 -2781
16679 -2781 3086 308 -3466 -1208 624 5462 12594 5128 -2851 -3088 -8397 -7426 -4296 -4858 -6438
16664 -6438 -5471 -7802 -5094 1905 2344 -5862 -6201 -6237 -8818 -14760 -14487 -8521 -5967 -9352 -6453 -1370
16648 -1370 -2308 -6605 -9914 -11610 -8034 -3259 495 2131 3841 3490 683 -3822 -4588 1153 1772 -2290
16632 -2290 1216 -16 -754 -2671 -8779 -16211 -16063 -10241 -7457 -8575 -10120 -12995 -16009 -19867 -21314
16617 -21314 -10245 -9387 -1238 1742 -7654 -9810 -8842 -8595 -5063 -2962 820 -2410 -6356 -12409 -11837
16602a1837L378K039L798k207k197Q401K870L223p71m432r93n930k330P64k237
16587h461n53K974J321l578l004P836m26K172J22j957l831r79L264k30j150p356
16571a3836K891J0390O34o541k767k68M359k273j424R485O927m110m231m145j036
16556e945j478r78N647J771q74j618L220M070o232p76l293o230r738Q082M206
16541a0166K637P134J806k867L510J165p012j262O23m170L216M425l349j968M229
16526b049J808M69J192j644p6j970j319N800J318k717l501L126M10o883J254M092
16510f90n181l3m022L652Q84k157M438j0436M624P034J334k717M822m159J12L32
16494b163K871Q486O46k800j390L723n410p271l067n63N94m343k631k32Q732O077
$$ plain form
16602 -11837 -8459 -6420 -2622 -4829 -7026 1375 4245 7468 6697 2265 1272 -4658 -6988 -6224 -8461
16587 -8461 -9014 -6040 -4719 -8297 -11301 -3465 -3891 -1719 -1597 -3554 -7385 -8364 -5100 -5330 -6480 -13836
16571 -13836 -10945 -555 79 -6462 -9229 -9497 -5138 -7411 -8835 650 7577 3467 -764 -4909 -5945
16556 -5945 -7423 -8401 -2754 -983 -1857 -3475 -255 3815 -2417 -3193 -6486 -12716 -22454 -14372 -10166
16541 -10166 -7529 -395 1411 -1456 2054 3219 -3793 -5055 -4432 -8602 -5386 -961 -4310 -6278 -2049
16526 -2049 -241 228 1420 -224 -300 -2270 -3589 2211 3529 812 -2689 437 847 -6036 -4782 -690
16510 -690 -5871 -5904 -9926 -6274 -5390 -7547 -3109 -13545 -8921 -1887 -553 -3270 1552 -2607 -2495 -2163
16494 -2163 708 9194 9840 7040 5650 9373 3963 -3308 -6375 -6938 -6344 -10687 -13318 -13550 -4818 1259
16478A259j685j512J094m921K509k338O502J737q634p837j447J990R281J910p023
16463i115o519n288N579P658J0068J569k92m18L106J204m967r35M479j250k390
16448B489j2023P943M356q445k322M191J451k002o728O85L488k702R1J645K305
16433e578j308j225N141L187p25l580k560K533k750k851M575P321L555n462Q66
16418A139o07k664K416J481L818j294r035L971j828j217o39K437q01K480O072
16403E729K159k690m194J364n901m061K985j316R003k821n034j45j887m80l143
16388a0432k385j923l580J097L861k03R74N889o08M00J112n41l598O45R17O061
16372b314R58l196k734K08o89k623L767M93l938K883M725O23k645J187L955n441
$$ plain form
16478 1259 -426 -1938 -844 -5765 -3256 -5594 908 2645 -5989 -13826 -15273 -13283 -4002 -2092 -9115
16463 -9115 -15634 -20922 -15343 -7685 2383 3952 3660 3242 6348 7552 2585 1650 6129 4879 2489
16448 2489 -9534 -1591 2765 -5680 -8002 -3811 -2360 -4362 -11090 -10405 -6917 -9619 -9528 -7883 -5578
16433 -5578 -6886 -8111 -2970 217 -508 -4088 -6648 -4115 -6865 -9716 -5141 2180 5735 273 1139
16418 1139 532 -2132 284 1765 5583 4289 -4746 -775 -2603 -3820 -4459 -2022 -2823 -343 5729
16403 5729 7888 5198 1004 2368 -3533 -7594 -4609 -5925 3078 257 -4777 -4922 -6809 -7289 -10432
16388 -10432 -12817 -14740 -18320 -17223 -13362 -13565 -12591 -6702 -7310 -6910 -5798 -6339 -9937 -9292 -8375 -2314
16372 -2314 -1356 -4552 -7286 -7078 -7767 -10390 -6623 -6130 -10068 -7185 -2460 -1837 -4482 -3295 660 -4781
16356d781j121n468J815N596K484O435n172p148n295L154P279K851M119k732o570
16341d554n809K70L182l721K782O679M299k065k270j554K056m337k223k485m09
16326a0159O919M675J01k469l538j294J077j791M310M191l571m217K735k130J128
16311d033L614J973o043l54P78l047o248j548J460Q178M343j204k508O999N653
16296H013r559l960J165J739J810K222K643l967n729j920k382M256m1K40j281
16281f751k359K238L292j231L571P95n494k075O828r40m481L489N046n006m969
16266h047N597O437j538p640m011L798O910l555o499L8O57r8K956M004l197O28
16250c560p961L68L680m29J298m796K532K120p328l331j02N707N085L729M728
$$ plain form
16356 -4781 -5902 -11370 -9555 -3959 -1475 4960 -212 -7360 -12655 -9501 -2222 629 4748 2016 -4554
16341 -4554 -10363 -10093 -6911 -10632 -7850 -1171 3128 1063 -1207 -2761 -705 -5042 -7265 -9750 -10159
16326 -10159 -3240 1435 1536 -933 -4471 -5765 -4688 -6479 -2169 2022 -1549 -5766 -3031 -5161 -4033
16311 -4033 -419 1554 -4489 -4843 -4065 -7112 -13360 -14908 -13448 -5270 -927 -2131 -4639 2360 8013
16296 8013 -1546 -5506 -4341 -2602 -792 1430 4073 106 -5623 -7543 -9925 -5669 -5710 -5470 -6751
16281 -6751 -9110 -6872 -3580 -4811 -1240 -445 -5939 -8014 -1186 -2126 -6607 -3118 1928 -3078 -8047
16266 -8047 -2450 3987 2449 -5191 -9202 -5404 1506 -2049 -8548 -8510 -7853 -7951 -4995 -991 -4188 -3560
16250 -3560 -11521 -11153 -7473 -7902 -6604 -11400 -8868 -6748 -14076 -17407 -17509 -11802 -6717 -2988 1740
16235A740r17j43j570r76m969n999q663K846J0091j851o311n831J623R668J3678
16220B416r54J948l690k471Q93q98j394l775M457P059P724l449K448q352j1809
16205i847l471K034N199j450m219m268P75R284M775l041j728p423k641n77O9L774
16189a2755P077j511N748O57J317O71j595j0602p361J142K46K351R81O858K495
16174d281j863m691K918J2381M351j865r040q701Q079k255n283N699Q1k355L831
16159b994O420k40O34k351k406j367o363K248M415K370N71m45k772j687J436L535
16143A004o89m979K830K846j865l382l428K26l35L219J327R46k912J037N502j278
16127F9k512k745q785o878K898N137N128j447l926j09j822l832k808P490K857
$$ plain form
16235 1740 823 680 -890 -1866 -6835 -12834 -21497 -18651 -8560 -10411 -16722 -22553 -20930 -11262 2416
16220 2416 1462 3410 -280 -2751 -1858 -2756 -4150 -7925 -3468 3591 11315 7866 10314 1962 -9847
16205 -9847 -13318 -11284 -6085 -7535 -11754 -16022 -15247 -5963 -1188 -4229 -5957 -13380 -16021 -16598 -16529 -12755
16189 -12755 -5678 -7189 -1441 -784 533 1204 -391 -10993 -18354 -17212 -16966 -14615 -13634 -6776 -4281
16174 -4281 -6144 -10835 -7917 4464 8815 6950 -2090 -10791 -2712 -4967 -10250 -4551 -4470 -6825 -2994
16159 -2994 3426 3186 3820 1469 -937 -2304 -8667 -6419 -2004 366 937 492 -2280 -3967 -2531 1004
16143 1004 315 -4664 -1834 1012 -853 -4235 -7663 -7437 -7772 -4553 -3226 -2280 -5192 -4155 1347 69
16127 69 -2443 -5188 -13973 -20851 -17953 -12816 -7688 -9135 -13061 -13170 -14992 -18824 -21632 -14142 -11285
16112a1285j473L016Mk355k239j800P109Q680l474l662J302J129k835j665k61
16097i809j482N893r50o404J773k638J0399M633r136m283P47J846Q675K853K59
16082B376k854j946l718m759j77l125l499K303N275k382q238k750N547J0514L028
16067d405o035J853J129m699l265L32O483K950J384n123n411j108K053j567n391
16052b0820J845J523L689L060R070M448j749l057m919O04K59K021l301l437m641
16037a5405j594R088R790N610P94k350l418M134K130p232n877k035J591k032J611
16022e195k13n812k295K773M067J692K5n728l030N74K282j51J148O733K280j785
16006b635l551K547L381L632j071o326q347n085K220L661k34k523j600O150m284
$$ plain form
16112 -11285 -12758 -9742 -9738 -12093 -14332 -16132 -9023 -343 -3817 -7479 -6177 -5048 -7883 -9548 -9809
16097 -9809 -11291 -5398 -6348 -12752 -10979 -13617 -3218 1415 -7721 -12004 -11257 -9411 -736 2117 2376
16082 2376 -478 -2424 -6142 -10901 -11078 -14203 -17702 -15399 -10124 -12506 -20744 -23494 -17947 -7433 -4405
16067 -4405 -10440 -8587 -7458 -12157 -15422 -15090 -8607 -5657 -4273 -9396 -14807 -15915 -13862 -15429 -20820
16052 -20820 -18975 -17452 -13763 -10703 -1633 2815 1066 -1991 -6910 -6306 -6047 -4026 -7327 -10764 -15405
16037 -15405 -16999 -7911 1879 7489 8283 5933 2515 6649 8779 1547 -4330 -6365 -4774 -6806 -5195
16022 -5195 -5408 -11220 -13515 -10742 -6675 -4983 -4958 -10686 -13716 -13142 -10860 -11011 -9863 -3130 -850 -2635
16006 -2635 -6186 -3639 -258 3374 2303 -4023 -12370 -17455 -15235 -11574 -11808 -14331 -15931 -9781 -14065
15991a4065J606J724l490Q454R600J199r814j595j181l921J199r16J844k049k1
15976a1426N345Q59O61J767l96m067n826N04l672K002N051j37k038k742O75N162
15960h278k637K323M218j333n145j545M082N106L908m935m339L294L865j0433
15946a1849r307J843J598N763M004R749R651o587l545l861K610j012m645m905
15932a0493O19J266M048M233M342J667j180r673q893O196K564k607J001N342l618
15917e186k335l752J666M194K373j015k776r00K930o27k193n246P19N932k93p03
15901g212M244K895L99r069o326k237O437M634O258j411m124m518k725n484N12
15886a7727L301K989m53M915J004m138j128M323N051j915l542m95P80L68K661
$$ plain form
15991 -14065 -12459 -10735 -14225 -5771 3829 5028 -4786 -6381 -7562 -11483 -10284 -11200 -9356 -11405 -11426
15976 -11426 -6081 -5222 -4561 -2794 -3190 -7257 -13083 -12579 -16251 -14249 -9198 -9335 -11373 -14115 -13440 -8278
15960 -8278 -10915 -8592 -4374 -5707 -10852 -12397 -8315 -3209 699 -4236 -8575 -5281 -1416 -11849
15946 -11849 -21156 -19313 -17715 -11952 -7948 1801 11452 4865 1320 -2541 69 -943 -5588 -10493
15932 -10493 -9874 -8608 -4560 -327 4015 5682 4502 -5171 -14064 -7868 -5304 -7911 -6910 -1568 -5186
15917 -5186 -7521 -11273 -9607 -5413 -3040 -4055 -6831 -7731 -4801 -5428 -7621 -12867 -12148 -6216 -6509 -7212
15901 -7212 -2968 -73 326 -8743 -15069 -17306 -10869 -6235 23 -1388 -5512 -10030 -12755 -18239 -17727
15886 -17727 -14426 -11437 -11890 -6975 -5971 -10109 -11237 -6914 -1863 -3778 -7320 -7815 -7035 -6667 -4006
15871d006K336K537m154K075l258m759l39R76M122L812k95q518l532O947O76l942
15855i322j0k737N806L149L341L582K827P3p042n246N64l41J020M524j591j663
15839c066r55M231Q337K966m53m390o300q609l64J387N197k690n083N267L174
15824a351R96m277Q78J606l28L139j427K182P115K672j875j574R261N709l333
15809A9393k086R67j768n010o976K205l204l036K10J068l884n992Q249J798r65
15794I69N309j716N08N692M443k426j51M692N175n018q009K226Q095l107p741
15779H941k766L745P254m323n763l446L694P71r4k735o600O33J0988m745o185
15764f31L071K711k27k963r07L230P838M651p74j95m29j469L517p07q585Q19J573
$$ plain form
15871 -4006 -1670 867 -3287 -1212 -4470 -9229 -9568 -8592 -4470 -658 -953 -9471 -13003 -6056 -5380 -9322
15855 -9322 -9332 -12069 -6263 -3114 227 3809 6636 6709 -333 -5579 -5015 -5356 -4336 188 -1403 -3066
15839 -3066 -4021 210 8547 11513 11060 6670 370 -8239 -8603 -7216 -2019 -4709 -9792 -4525 -1351
15824 -1351 -355 -4632 -3754 -2148 -2476 663 -764 1418 8533 11205 9330 7756 17017 22726 19393
15809 19393 17307 18274 16506 11496 4520 6725 3521 485 695 1763 -2121 -8113 136 1934 969
15794 969 6278 4562 5070 10762 15205 12779 12628 17320 22495 17477 9468 11694 19789 16682 8941
15779 8941 6175 9920 17174 12851 7088 3642 7336 8107 8013 5278 -1322 -689 10299 5554 -631
15764 -631 2440 5151 4924 1961 1054 4284 12122 16773 15999 15804 15375 13906 17423 16716 8131 8950 10523
15747A0523K96j888o368l956j00K922N034M079n958k394L765k431L274r275P15
15732a762N026J247J60L9J79m313n075m172L180L564O94Q98k590J107l122m585
15716i525l670L706m113l749L276K020O655K429j182M483q79l26P705l079k797
15701I54k812P37j791M231p61m053j221J067k617L99L258K909l833n423q823N11
15685a7268L630J04L761r70p71j248N376K188m326K922O020J406R49j420k369
15670b016k006M412r064j01P327l516k930o4R0R25K010J133n010m643J405L629
15654h419k087j026r40R98M290N710K285N602j12r13Q65j5n630k678n78p16J400
15637a964P608J9k145k698j961o754J082k722M93M428P808L649o767p777J440
$$ plain form
15747 10523 10819 8931 2563 -1393 -1493 1429 6463 10542 4584 2190 5955 3524 6798 -2477 -1762
15732 -1762 3264 4511 4671 4710 4889 576 -4499 -8671 -5491 -1927 -1233 -335 -2925 -1818 -4940 -9525
15716 -9525 -13195 -9489 -13602 -17351 -14075 -12055 -5400 -2971 -4153 330 -549 -875 6830 3751 954
15701 954 -1858 -1121 -2912 1319 558 -3495 -4716 -3649 -6266 -5867 -2609 300 -3533 -8956 -17779 -17268
15685 -17268 -13638 -13534 -9773 -10743 -11514 -12762 -7386 -5198 -9524 -6602 -582 824 1773 353 -2016
15670 -2016 -4022 390 -8674 -8775 -1448 -4964 -7894 -7958 -7868 -6943 -4933 -3800 -8810 -13453 -12048 -8419
15654 -8419 -10506 -11532 -12472 -11474 -7184 -1474 811 6413 6301 5388 6253 6238 608 -2070 -2648 -3364 -1964
15637 -1964 5644 5663 3518 820 -1141 -7895 -6813 -9535 -9042 -4614 3194 6843 76 -7701 -6261
15622f261K851j625l925J165M369j670o179P563P62J899J761l773m397J733R45
15607d782k63j424L050J500j595m070k20R85K876Q64k882P75k236m278j114K586
15591a0228K978k81K900R300J259P23K071K183k48k960q741m336j704o54k598
15576a0336p49j124q78m252O038O049m708r561L382M971l554J047J944P160J288
15561c283M569K585r17r624p449k187k05J0840L189K999O169m027o479j34p05
15546d659J488J296l163q709L312L591L58Q56M238q25m927K373N145P53K172l690
15530c91k730l440p361j621N455J958K364K240M58J1915K191j037j1102o189p64
15515h054K044l316o530M052L617L41J685L416k940q970P39J009L145J647M238
$$ plain form
15622 -6261 -3410 -5035 -8960 -7795 -3426 -5096 -11275 -3712 -2950 -1051 710 -3063 -7460 -5727 -4782
15607 -4782 -5045 -6469 -3419 -1919 -3514 -7584 -7804 -6819 -3943 -3079 -5961 -5186 -7422 -11700 -12814 -10228
15591 -10228 -7250 -7531 -4631 4669 5928 6651 8722 10905 10657 7697 -1044 -5380 -7084 -7738 -10336
15576 -10336 -11085 -12209 -13087 -17339 -11301 -5252 -9960 -19521 -16139 -11168 -14722 -13675 -11731 -4571 -3283
15561 -3283 1286 3871 2954 -6670 -14119 -16306 -16511 -5671 -2482 517 6686 2659 -3820 -3954 -4659
15546 -4659 -3171 -1875 -5038 -13747 -10435 -6844 -6486 -5630 -1392 -2217 -7144 -4771 374 1127 3299 -391
15530 -391 -3121 -6561 -13922 -15543 -10088 -8130 -5766 -3526 -3068 8847 11038 10001 -1101 -7290 -8054
15515 -8054 -6010 -9326 -15856 -11804 -8187 -7846 -6161 -2745 -5685 -14655 -13916 -12907 -9762 -8115 -3877
15500c877N400J677m540L43J958n933k142k672M317N411n084J470J943M164L836
15485F271q151k371J565k23k788m19J047L781K027l261K791M203J162k70K530
15470G894k424k385l534n189L060R9K46l99r483m965M794N181l714k187J630P783
15454c593j219l275j905M963j711p695R36L481K729j055J181N685K505p604j059
15439g636K455j382n117j237j411K448K407m568N621M551J926j285j568j882p65
15424g443L168l46N7j593O37M440K271L069o32q015j519l03n93J335O45L85L614
15407h23p785N249N307k615o56J556l902k187L741M111j30k050p075m770K503
15392i526J451l069m99K719O189J304q60o99N485j1098p093J33O916K955k025
$$ plain form
15500 -3877 1523 3200 -1340 -997 961 -4972 -7114 -9786 -5469 -58 -5142 -3672 -1729 2435 6271
15485 6271 -1880 -4251 -2686 -2909 -5697 -6116 -5069 -1288 739 -2522 269 4472 5634 5364 7894
15470 7894 5470 3085 -449 -5638 -2578 -2479 -2233 -2632 -12115 -17080 -12286 -7105 -10819 -13006 -11376 -3593
15454 -3593 -4812 -8087 -9992 -5029 -6740 -14435 -13499 -10018 -7289 -8344 -7163 -1478 1027 -6577 -7636
15439 -7636 -5181 -6563 -11680 -12917 -14328 -11880 -9473 -14041 -8420 -3869 -1943 -3228 -4796 -6678 -7443
15424 -7443 -4275 -4621 -4564 -6157 -5520 -1080 1191 4260 3628 -4387 -5906 -6209 -6802 -5467 -4822 -4437 -823
15407 -823 -8608 -3359 1948 -667 -1323 233 -3669 -5856 -2115 1996 1866 -184 -7259 -12029 -9526
15392 -9526 -8075 -11144 -11643 -8924 -2735 -1431 -2291 -2990 2495 -8603 -15696 -15563 -8647 -5692 -7717
15377g717k874M097L280N103k45j81j307p99K64Q99k481k201l499k000L048J784
15361d829L420l565M946M98k647l596M081j198J57J32l858m342K182K090m690
15346a1219l874j040k412R551p76r5k632K029N033N033k026p278J941j240J708
15331g297j44l236J771L433j490M102O935J591o206l016l458N43M631n114J85
15316f770N121r61O400j966j1340k319J093O96l797k690j64J025N534J046M088
15301e004k621n915k696K729K919K331N332O870M728j2452m710N3N02K651N879
15286E96L170k201J377j371k632p063m356k29n573L948L345m85N160q79m131j413
15270a2737N379N797j44n808j901m782K020J1123N710M52j634l009o360R19O714
$$ plain form
15377 -7717 -10591 -6494 -3214 1889 1644 1463 156 -643 -379 520 -1961 -4162 -7661 -9661 -6613 -4829
15361 -4829 -1409 -4974 -28 470 -2177 -5773 -1692 -2890 -2733 -2601 -6459 -10801 -8619 -6529 -11219
15346 -11219 -15093 -16133 -18545 -8994 -9770 -9865 -12497 -10468 -5435 -402 -2428 -9706 -7765 -9005 -7297
15331 -7297 -7441 -10677 -8906 -5473 -6963 -2861 4074 5665 -541 -3557 -7015 -6472 -1841 -6955 -6770
15316 -6770 -1649 -2610 3790 1824 -9516 -11835 -10742 -10046 -13843 -16533 -16697 -15672 -10138 -9092 -5004
15301 -5004 -7625 -13540 -16236 -13507 -10588 -8257 -2925 3945 8673 -3779 -8489 -8436 -7934 -5283 596
15286 596 3766 1565 2942 1571 -1061 -8124 -12480 -12709 -18282 -14334 -10989 -11474 -6314 -7193 -11324 -12737
15270 -12737 -7358 -1561 -1705 -7513 -9414 -14196 -12176 -1053 4657 5109 3475 466 -5894 -4975 1739
15255A739r392j217L262K702K900l26k305p903j9J325j808o037J911Q324K74J20
15239f450K459L019J028j3391m103J2629l409M710Q905M113m631r419j036k629
15225h205o442J0P054M150l543L168N675K97j0892N36K768J79O128M005k595q295
15209f002k595J328L389M800P14j035l431j914j543j347l217K319N280M094k464
15194a624l812p908N83L473J696N39L67J201n465o97N571M790m104r812O46P457
15178g099j4o700Q43K058K539m86j586j73p154L52K003L313k144q473L984N47
15162a8190n312M911J151J044M840m44K761J007j666J34l127j58L805j639p08
15147a1591j741P10O75L305Q45k518o43M179J0733N140l293n00m277n58q05l411
$$ plain form
15255 1739 -7653 -8870 -5608 -2906 -6 -332 -2637 -10540 -10559 -9234 -11042 -17079 -15168 -6844 -6570 -6450
15239 -6450 -3991 -972 56 -13335 -17438 -4809 -8218 -3508 5397 9510 4879 -4540 -5576 -8205
15225 -8205 -14647 -14637 -7583 -3433 -6976 -3808 1867 2164 -8728 -8192 -5424 -5245 883 4888 2293 -6002
15209 -6002 -8597 -7269 -3880 920 1634 599 -2832 -4746 -6289 -7636 -10853 -8534 -3254 840 -1624
15194 -1624 -5436 -13344 -12761 -9288 -7592 -7053 -6686 -5485 -10950 -11647 -6076 -1286 -5390 -15202 -14556 -7099
15178 -7099 -7113 -13813 -12970 -10912 -8373 -8859 -10445 -10618 -17772 -17420 -15417 -12104 -14248 -22721 -18737 -18190
15162 -18190 -23502 -18591 -17440 -16396 -11556 -12000 -9239 -8232 -9898 -9764 -12891 -13049 -9244 -10883 -11591
15147 -11591 -13332 -12622 -11947 -8642 -7797 -10315 -10958 -6779 3954 9094 5801 5301 1024 466 -339 -3750
15131c750n321Q9q44K662j559l805L429l938m03o016K311N832R26L980J617m092
15115h882p705q47K426J0313N064l85l509m12M549j855N363M508l081k907J620
15100D260K168o247o977J533J1100K116k768P1j34n051L750l512q078k54L253
15085d770r74l846O19J63O333n57R35J851N593L815j342j161n261r20m709o992
15069a1223O19j134J228N426M050k162J761k132l917O19K839Q231k616m537k232
15054e180p09J56l128M804P579L97p091M554L697l399m501q18R308n08l81p27
15038D053L320M751j583m471j0444l402L34K152n841L305J401j226Q39L084K913
15023h15M851l306j104j689k468j430L425L779j955k470o58j183k038Q092l140
$$ plain form
15131 -3750 -9071 -8982 -9826 -7164 -8723 -12528 -9099 -13037 -13440 -19456 -17145 -11313 -10387 -6407 -4790 -8882
15115 -8882 -16587 -17434 -15008 -4695 369 -16 -3525 -3937 612 -1243 4120 8628 5547 2640 4260
15100 4260 6428 181 -6796 -5263 5837 7953 5185 5256 5122 71 3821 309 -7769 -8023 -4770
15085 -4770 -5744 -9590 -8971 -8808 -2475 -3032 -2097 -246 5347 9162 7820 6659 1398 478 -4231 -11223
15069 -11223 -10604 -11738 -10510 -5084 -1034 -3196 -1435 -3567 -7484 -6865 -4026 4205 1589 -2948 -5180
15054 -5180 -5889 -5733 -8861 -4057 3522 3919 -3172 1382 5079 1680 -2821 -3639 5669 5161 4780 4053
15038 4053 7373 12124 10541 6070 -4374 -7776 -7442 -5290 -11131 -7826 -6425 -7651 -6812 -3728 -815
15023 -815 4036 730 -374 -2063 -4531 -5961 -2536 1243 -712 -3182 -3840 -5023 -7061 1031 -2109
15008b109M66K394q50L703l658o228l2L546j247m576j693n68N859N817K383l465
14992b58l775Jn93J877J293l094n496M227K120K691J889L318M034M230p46Q825
14976B0543J0222K711N804R081J4225J8440J9355L1048N9000J20333K49906L53685
14964I14353K44646n364k41221l18541k25549j30722p7997m5992l0888j9771k3171
14953C9783j7167j4151r61l265K568L815k14j14o621k573r45m736j616Q89J624
14938c684N953L657n345o992M735O248j749K365l075R69m359l559J274m440K354
14923e648K265M294O402n406k894j648p247M371J17n756j767j125m116j331O896
14908a2593J2239L015l503l343O617O931J86M95q47k660l643k218L91p77o213
$$ plain form
15008 -2109 -1643 751 -99 3604 -54 -6282 -6314 -2768 -4015 -8591 -10284 -10852 -4993 824 3207 -258
14992 -258 -4033 -4032 -4625 -2748 -1455 -4549 -10045 -5818 -3698 -1007 882 4200 8234 12464 11718 20543
14976 20543 30765 33476 39280 48361 62586 81026 100381 131429 190429 310762 560668 914353
14964 914353 1158999 1153635 912414 593873 368324 237602 159605 113613 82725 62954 39783
14953 39783 22616 8465 7504 4239 6807 10622 10408 10294 3673 1100 155 -4581 -6197 -5308 -3684
14938 -3684 2269 5926 581 -6411 -1676 4572 2823 5188 2113 3082 -1277 -4836 -3562 -8002 -5648
14923 -5648 -3383 911 7313 1907 -987 -2635 -9882 -5511 -5394 -11150 -12917 -14042 -18158 -19489 -12593
14908 -12593 -354 2661 -842 -4185 2432 9363 9549 10044 9197 6537 2894 676 1067 290 -5923
14893e923m828L405M192J401j636M57J11r2l698m64K313M926k086K479J777n722
14877c388l711M36m872J311K358j299K573Q719o032J610J216j673m455j288k242
14862a0737j890K123N502o094m40P565J49l665M584N850j090l434O34N035L769
14847G861j67L45j70n002J29n618m010L937L023M498M63j108m118L982m416l443
14831c814k443J990K751j755l439p81n80k143Q63l620K738L328r29j748M464k407
14815g525j575N942K053j491K887l001K285M698M294O678K323K913j1218q923
14801C40n000k279m971M611N281m590o2N910L192k288o040j944l341o2R155K956
14785H68n610M785J61p802p447L565N672L454J477p444j2440L056O768o46O757
$$ plain form
14893 -5923 -10751 -7346 -3154 -1753 -3389 -2932 -2821 -2913 -6611 -7075 -4762 164 -1922 557 2334 -3388
14877 -3388 -7099 -6663 -11535 -10224 -7866 -9165 -6592 2127 -3905 -2295 -1079 -2752 -7207 -8495 -10737
14862 -10737 -12627 -10504 -5002 -11096 -11536 -3971 -3822 -7487 -2903 2947 1857 -1577 -943 4092 7861
14847 7861 7694 8039 7869 2867 2996 -2622 -6632 -2695 328 4826 5289 4181 63 4045 -371 -3814
14831 -3814 -6257 -4267 -1516 -3271 -6710 -7491 -8071 -10214 -9351 -12971 -10233 -6905 -7834 -9582 -5118 -7525
14815 -7525 -9100 -3158 -1105 -2596 291 -2710 -425 4273 8567 15245 17568 20481 9263 340
14801 340 -4660 -6939 -11910 -7299 -2018 -6608 -6670 -760 2432 144 -5896 -7840 -11181 -11243 -2088 868
14785 868 -4742 43 204 -7598 -15045 -11480 -5808 -2354 -877 -8321 -20761 -17705 -10937 -11583 -4826
14770d826K086o511L285O796m370p284L817J549K151M61m008k599l666r48k05
14755a4272M14R33K723p59r756j307M157L850L356P97K643L747o808j057M885
14740f454L934Q357l27j532q126n760M398L112o545K742p46j639k323k646L286
14725a0269K97Q74K799N94Q66j864l004L289o52o894m815N202M19M892Q485J707
14709A926m743j892L364j192J256K880N12J572m716l124K937o94r820J90o600
14694a8144N015L313J668n213n89k141L430R138K127K707M272l287o338l085p99
14679g926l693l614l929M490M590M466J774j782o004P08J337j517J50M280J670
14664e000J166K391J474j635m375j936j18Q28O585L89P636j233o130k530O12m187
$$ plain form
14770 -4826 -2740 -9251 -5966 830 -3540 -10824 -7007 -5458 -3307 -2846 -6854 -9453 -13119 -14067 -14272
14755 -14272 -13858 -12925 -10202 -10961 -20717 -22024 -17867 -14017 -10661 -9864 -7221 -3474 -10282 -11339 -6454
14740 -6454 -2520 5837 5510 3978 -4148 -9908 -5510 -2398 -8943 -6201 -6947 -8586 -10909 -13555 -10269
14725 -10269 -9972 -9098 -6299 -5705 -4839 -6703 -9707 -6418 -7070 -13964 -18779 -13577 -13158 -8266 219 1926
14709 1926 -2817 -4709 -1345 -2537 -1281 1599 2111 3683 -1033 -4157 -1220 -1914 -11734 -11544 -18144
14694 -18144 -13129 -9816 -8148 -13361 -13950 -16091 -12661 -3523 -1396 1311 5583 2296 -4042 -7127 -7926
14679 -7926 -11619 -15233 -19162 -14672 -10082 -5616 -3842 -5624 -11628 -10920 -9583 -11100 -10950 -6670 -5000
14664 -5000 -3834 -1443 31 -1604 -5979 -7915 -8033 -7205 -620 -231 7405 6172 42 -2488 -1876 -6063
14648f063m797n533n564k937P960J0847j301n66m794M494N957j908L505K653n910
14633c957k411l64p309j438Q070l982J529j035K930O211L98o716J149r55k356
14618a0236M416m432N383N557o6J228j474R821p144j325m157p472k603m91O54
14603a2341l996p69O639j83J855l022P214J624M748l002m511l06r4K093k452k135
14587h638J896Q914K155m691J867J88m185l27K161Q482k092r055j569K904P621
14572E631k95m189m106O237M5k522m718m789j072M17K616L804K600j351j446p783
14556a0921j058K276J071P932J653k926ll15o897j831Q73K05K946J75o33J845
14540e608q768k005N679N459O199j207j769N874K582m468k666l866k755O103j435
$$ plain form
14648 -6063 -10860 -16393 -21957 -24894 -16934 -6087 -7388 -7954 -12748 -8254 -2297 -4205 -700 1953 -3957
14633 -3957 -6368 -6732 -14041 -15479 -7409 -11391 -9862 -10897 -7967 -1756 -1358 -8074 -6925 -7880 -10236
14618 -10236 -5820 -10252 -4869 688 622 1850 376 10197 3053 1728 -2429 -9901 -12504 -12995 -12341
14603 -12341 -16337 -17106 -10467 -10650 -8795 -11817 -4603 -2979 1769 -1233 -5744 -6050 -6144 -4051 -6503 -8638
14587 -8638 -6742 2172 4327 -364 1503 1691 -2494 -2821 -660 7822 5730 -3325 -4894 -1990 5631
14572 5631 5336 1147 -2959 3278 3323 801 -3917 -8706 -9778 -9361 -6745 -2941 -341 -1692 -3138 -10921
14556 -10921 -11979 -9703 -8632 -700 953 -1973 -1976 -2291 -9188 -11019 -10146 -9941 -6995 -6820 -7453 -5608
14540 -5608 -14376 -16381 -10702 -5243 956 -251 -2020 3854 6436 1968 -698 -4564 -7319 -1216 -2651
14525b651N257P12j57l721J215k667k622J488r614K18K573M692K060L310K790
14510B883n88j510J798O7J217j008m460n727l306m79P589N065R984k837o729n007
14494c048L334k372k490J778O215k248j159j133K031O79k098l9r60k250l681n639
14478a3080L000K861k123P15M67Q472k139m26J070p183K720N827Q390l84n747
14463B440l145l969K622m07k661k070J975J175k457o14l282O407L58k156l969
14448i753J787K998k364j384O798N103J713l234l817o141j136M310Q10O226j351
14433E65m511k789k929j854l471P487l53K077K153k783K938L458K246J812J983
14418F029r83l198p472J706L86j679k21L181n492n883k401R220P189Q5J948m595
$$ plain form
14525 -2651 2606 3318 3161 -560 655 -2012 -4634 -3146 -12760 -12542 -9969 -5277 -3217 93 2883
14510 2883 2295 785 2583 2650 3867 2859 -1601 -7328 -10634 -11113 -3524 1541 11525 8688 1959 -3048
14494 -3048 286 -2086 -4576 -2798 3417 1169 10 -1123 908 1587 -511 -550 -1510 -3760 -7441 -13080
14478 -13080 -10080 -7219 -9342 -8627 -8160 312 -1827 -2253 -1183 -8366 -5646 181 8571 8187 2440
14463 2440 -705 -4674 -2052 -2459 -5120 -7190 -5215 -4040 -6497 -7111 -10393 -3986 -3628 -5784 -9753
14448 -9753 -7966 -4968 -7332 -8716 -1918 3185 4898 1664 -2153 -8294 -9430 -5120 -4310 1916 565
14433 565 -3946 -6735 -9664 -11518 -14989 -7502 -7855 -5778 -3625 -6408 -3470 -12 2234 4046 6029
14418 6029 5046 1848 -5624 -3918 -3532 -5211 -5432 -2251 -7743 -13626 -16027 -6807 382 467 2415 -2180
14402b180K119Q264m673l901L276l472k828N388K181j3023k553N977m127O60M193
14387d699K943N1j620p240j940M827O447O908O5l436l089K471m01p748L82M976
14371a103K601m711r936J612K011j471j0479K368J980k659O957N140Q62K003L066
14356a759J578K510l908l784J31M481n613j045O687K649j65n322k930K811K665
14341a014J91K460J979m045o116m561N022R833L978j310N83r886p891j207R161
14326b823R823j571m139j670K648L04O579L443n783l922j822j206L416K064k278
14311C063Q07K313n74m608o695j312J583O11k05k494k708O964O793O320m996l891
14295I71R887L496M080L852n261l28k627m841n379K135K460k64O65K3o506n839
$$ plain form
14402 -2180 -61 8203 3530 -371 2905 -567 -3395 1993 4174 -8849 -11402 -5425 -9552 -8892 -4699
14387 -4699 -1756 -1705 -3325 -10565 -12505 -7678 -1231 5677 5742 2306 -783 1688 1287 -6461 -6079 -1103
14371 -1103 1498 -3213 -13149 -11537 -9526 -10997 -21476 -19108 -17128 -19787 -12830 -7690 -6828 -4825 -1759
14356 -1759 -181 2329 -1579 -5363 -5232 -751 -6364 -7409 -722 1927 1762 -3560 -6490 -3679 -1014
14341 -1014 -823 1637 3616 -429 -6545 -11106 -6084 3749 7727 6417 7000 -2886 -10777 -11984 -2823
14326 -2823 7000 5429 1290 -380 2268 2572 9151 12594 6811 2889 1067 -139 3277 5341 3063
14311 3063 3870 6183 5609 1001 -5694 -7006 -5423 -4812 -5017 -7511 -10219 -3255 3538 9858 4862 971
14295 971 10858 14354 18434 22286 17025 16697 14070 9229 3850 5985 8445 8181 8846 8869 2363 -3476
14279c476J96r69N158J188p01N100J0029O943n373m178J307L067k743l408n03
14264A1637m140m417K398k598l045J646O113K673L78o153O980M659l715n517j319
14249E580l576oK191j218o518L084j337k783m37P415m352l05k048L335N323K023
14233F371q94J57k911r6p202j078p8K729K006O744j979m043N41J784n158l758
14217f865q267n745N273K750L212P322K519K623L127l477L439N186K283p466N52
14202F466n491L495N885m042k785m385J321K435P569n4k690l00J162q126j895
14187a435K934P53l791R63j889n292j135L155K370R191J0885o362m823M283q648
14172A159n817L268L819k795j533K207L308o51o568L5k71o524j186j188M809K897
$$ plain form
14279 -3476 -3280 -4249 909 2097 1396 6496 16525 23468 18095 13917 15224 18291 15548 12140 11637
14264 11637 7497 3080 5478 2880 -165 1481 7594 10267 10645 4492 11472 16131 12416 6899 5580
14249 5580 2004 1998 4189 2971 -3547 -463 -1800 -4583 -5020 2395 -1957 -2262 -4310 -975 4348 6371
14233 6371 5477 5634 2723 2627 -4575 -5653 -5731 -3002 -996 5748 3769 -274 267 2051 -3107 -6865
14217 -6865 -15132 -20877 -15604 -12854 -9642 -2320 199 2822 5949 2472 5911 11097 13380 5914 6466
14202 6466 975 4470 10355 6313 3528 -857 464 2899 10468 10414 7724 7424 8586 460 -1435
14187 -1435 1499 2252 -1539 -576 -2465 -7757 -8892 -5737 -3367 5824 16709 10347 5524 9807 1159
14172 1159 -4658 -1390 2429 -366 -1899 308 3616 2965 -3603 -3568 -3839 -10363 -11549 -12737 -7928 -5031
14156e031j580o597J87N836Q906Q294o078j0438j271m3J736P083J744n15j813
14141D20j1002p045J518J676J774P162M639m857k017O774n54J606m593n027m968
14126a4494l343O846M896K139J633k92n82M586K086J214q755L766N610k247k546
14111E17M935L465J126m053j969l026n014L925Q336l560n161j163L060J453q602
14096e731P21M857J721m057k992j123l424l40M365R023L794l812K978L466m863
14081D583l659J388O107K987J0922Q061l399J819J1281Q867l953M520r30m643
14067D3951k870l852P21n1J072j600q940o367j2723r639k203q22m818L029O751
14052A639m594o249q66N537L691N31k248m983j096K621R447k087j420Q5M37K224
$$ plain form
14156 -5031 -6611 -13208 -13021 -7185 1721 10015 3937 -6501 -7772 -7815 -6079 1004 2748 2233 420
14141 420 -10582 -17627 -16109 -14433 -12659 -5497 -858 -5715 -7732 -958 -1512 94 -4499 -9526 -14494
14126 -14494 -17837 -10991 -6095 -3956 -2323 -2615 -3197 1389 3475 4689 -4066 -300 5310 3063 517
14111 517 5452 8917 10043 5990 4021 995 -4019 -94 8242 4682 -479 -1642 1418 2871 -5731
14096 -5731 -5010 -153 1568 -2489 -5481 -6604 -10028 -10368 -6003 3020 6814 3002 5980 9446 4583
14081 4583 924 2312 8419 11406 22328 30389 26990 28809 40090 48957 45004 49524 48594 43951
14067 43951 41081 37229 37950 37899 38971 37371 28431 22064 9341 -298 -2501 -3323 -8141 -5112 1639
14052 1639 -2955 -9204 -10070 -4533 -842 -311 -2559 -7542 -8638 -6017 3430 1343 -77 8 445 2669
14036B669J255K760m603L58L700k775n597K874J0067n004n312l271M594J433k807
14021C41R60n073k000m986N274Q705J187k201P14l424M062K19k9L579j126m026
14005B176j600j890q197n288L423J042J981Q963J0676K669j777L750J361M37J638
13990A9364o314j858K228O244m472R303P495R069J2797J6863J4023Q479J111l781
13976I0551l986r392j3027j2870p643p874o671j3582n395Q31j964p27l521j288
13962C442k897J364O326P358M015R663L373m535j497R513N756O522J2308O924
13948F7635L727R279J0397J1620L765k526l914j929k402p325j5965j4356l199
13935E4807q185r366n905o688p912q777r007P09J884k161L788N387K891n351k785
$$ plain form
14036 2669 3924 6684 2081 2439 6139 3364 -2233 641 10708 5704 392 -2879 1715 3148 341
14021 341 1301 -3772 -5772 -10758 -5484 3221 4408 2207 2921 -503 3559 3778 3749 7328 6202 2176
14005 2176 576 -1314 -9511 -14799 -11376 -10334 -8353 610 11286 13955 12178 15928 17289 17726 19364
13990 19364 13050 11192 13420 19664 15192 24495 31990 41059 53856 70719 84742 93221 94332 90551
13976 90551 86565 77173 64146 51276 43633 35759 29088 15506 10111 10942 8978 8251 4730 3442
13962 3442 545 1909 8235 15593 19608 29271 32644 28109 26612 36125 41881 48403 60711 67635
13948 67635 71362 80641 91038 102658 106423 103897 99983 98054 95652 88327 72362 58006 54807
13935 54807 46622 37256 31351 24663 16751 7974 -1033 -324 1560 -601 3187 8574 11465 6114 3329
13920C329m794j945J2059M371l377j513q950L198P47p52L176J023J322O375j146
13905A3123q882l515J091q92k592L85R95L908N814L274l06J493l639n816o379
13890a938n29J874k560j086j549J320L478m56M562l600p984M663M502L292p41
13875C248n354L324n26q207J589q566J721p30l739N181L630P837M862L409l192
13860D487n989l534j385j772K14J0435P111o280L920O617k039j235K196l355m
13845I387J667K116P767J513l244k354o027J532K40M836n682K837r49O85K282
13830A6606M136l697l313k886K20j997p618o174k69P271J934o6J21O645K993k609
13814A1297L757N29o981l370J348O688K996N526p71j526J943o518j3550n041j849
$$ plain form
13920 3329 -1465 -3410 8649 13020 9643 8130 -820 2378 3125 2373 5549 6572 7894 14269 13123
13905 13123 4241 726 1817 925 -1667 -1282 -287 3621 9435 12709 12403 13896 10257 4441 -1938
13890 -1938 -2467 -593 -3153 -4239 -5788 -4468 -990 -1446 3116 -484 -8468 -3805 697 3989 3248
13875 3248 -2106 1218 692 -7515 -5926 -14492 -12771 -13501 -17240 -12059 -8429 -592 4270 7679 4487
13860 4487 -1502 -5036 -6421 -8193 -7979 2456 9567 3287 7207 13824 11785 10550 12746 9391 9387
13845 9387 11054 13170 20937 22450 19206 16852 10825 12357 12597 17433 11751 14588 13639 14324 16606
13830 16606 20742 17045 13732 10846 11066 9069 1451 -4723 -4992 2279 4213 4147 4268 10913 13906 11297
13814 11297 15054 15583 8602 5232 6580 13268 16264 21790 21019 19493 21436 14918 1368 -3673 -5522
13799e522N78P61K646J754L106j307P294N192j801m233k134p888j675J630K541
13784I42k732N296j468m077q29k764k265J193M270k168K552O685L372m131m363
13769d87J893J364P41k613q846J505Q110M400m011K844P020J602j348J435L2L66
13753A4007J596k401n75N970K246O60o7n289l962O590P58j419n417K173m43m049
13737A0378l041j849l506o76L138K368l950m210N513J0051p681l097k665L44M609
13722E726k77M385O0J313j054L490j2585o729k135L113Q007M186j33k665o618
13707a916j0538p094K662m072N381Q058N937N162l00J441K477J583n477K190M179
13692I673j448O248k819k078L404M072l031p468J701K828k652l518R50m761r32
$$ plain form
13799 -5522 -4944 -4183 -1537 217 3323 2016 9310 14502 12701 8468 6334 -1554 -3229 -1599 942
13784 942 -1790 3506 2038 -2039 -2868 -5632 -7897 -6704 -2434 -4602 -2050 4635 8007 3876 -487
13769 -487 1406 2770 3511 898 -7948 -6443 1667 6067 2056 4900 11920 13522 12174 13609 13641 14007
13753 14007 15603 13202 12627 18597 20843 21503 21436 16147 12185 18775 19533 18114 12697 14870 14427 10378
13737 10378 7337 5488 1982 1306 4444 6812 2862 -1348 4165 14216 6535 3438 773 1117 5726
13722 5726 5449 9834 9894 11207 10153 13643 1058 -5671 -7806 -4693 3314 7500 7367 4702 -1916
13707 -1916 -12454 -19548 -16886 -20958 -15577 -7519 -1582 3580 3280 4721 7198 8781 3304 5494 9673
13692 9673 8225 14473 11654 9576 12980 17052 14021 6553 8254 11082 8430 4912 5862 1101 169
13677A69K525J450k433o56K554k090J325M056j908k751o525J583j005o128M767
13662e067O681L077K357j298n385p49n292j959j23M582p76j62R52J457k037K147
13646a595j044K27j099k453l423O504M163N133K608l197k236k332J195J64m799
13631b184j120K219N072m50m818J069J699L295j089L71J473j357j827K472m32
13616D393J838o433L965P37p578m709K77K593P83M2J449j006o05l447m114P516
13600d299N511k770j937M007K060J000j370L431M438N13o27m721k676L008L942
13585I510l304k015J534k160J307Q39k107M288K12p54l784p66N458P024N319m326
13569A6275m303o035n9K108K427j491K150O235k370n863o787j127N544K928o974
$$ plain form
13677 169 2694 4144 1711 1055 3609 1519 2844 6900 4992 2241 -4284 -2701 -3706 -9834 -5067
13662 -5067 1614 4691 7048 5750 365 -384 -5676 -7635 -7758 -3176 -3952 -4114 -3162 -1705 -3742 -1595
13646 -1595 -2639 -2412 -3511 -5964 -9387 -2883 1280 6413 9021 5824 3588 1256 2451 2615 -2184
13631 -2184 -3304 -1085 3987 3537 -1281 -212 1487 4782 3693 4064 5537 4180 2353 4825 4393
13616 4393 6231 -202 3763 4500 -3078 -7787 -7510 -4917 -4134 -4092 -2643 -3649 -4254 -7701 -11815 -4299
13600 -4299 1212 -1558 -3495 512 2572 3572 2202 5633 10071 10584 9957 5236 2560 5568 9510
13585 9510 6206 4191 5725 3565 4872 5711 3604 7892 8104 7350 3566 2800 8258 15282 20601 16275
13569 16275 11972 5937 5878 7986 10413 8922 11072 17307 14937 9074 2287 1160 6704 9632 2658
13554B658n249j733j192l326K6O86N338L547j476K001N99k674J309P72l866n9
13538b639k838K540L256Q33R4N747k25J678n514m30q30M365N516k968m438n79
13522C568j312N79j070J474n254J591O401j557J906k583j410N149k084m751l241
13507b594L508j575J97J052k01l44k518j413j816N622J690J181l032M94K249j693
13491H07J667o54m829l785p96m463n27N147k285O227k24n323q48J494M582L044
13475g66R36M910L457p47K77m446K513L224m25j655o612k185j211M459L492n575
13459c54R86K724J518j860l489L658l203l230n65k624J5j273L135o320J582J488
13443g812l514O496P092L854K796l39N00l730k547o64J008j383M03p88j753m828
$$ plain form
13554 2658 -2591 -4324 -5516 -8842 -8816 -8130 -2792 755 -721 1280 1879 -795 514 1286 -2580 -2639
13538 -2639 -5477 -2937 319 1152 1246 6993 6768 8446 2932 2502 1672 6037 11553 8585 4147 3568
13522 3568 2256 2835 1765 3239 -2015 -424 5977 4420 6326 3743 2333 7482 5398 647 -2594
13507 -2594 914 -661 -464 588 387 43 -2475 -3888 -5704 -82 1608 2789 -243 251 2500 807
13491 807 2474 1820 -3009 -6794 -7590 -12053 -12580 -7433 -9718 -3491 -3715 -9038 -9886 -8392 -3810 -766
13475 -766 170 5080 8537 7790 8067 3621 6134 9358 8933 7278 666 -1519 -2730 1729 5221 -354
13459 -354 632 3356 4874 3014 -475 3183 -20 -3250 -3815 -6439 -6424 -7697 -4562 -10882 -9300 -7812
13443 -7812 -11326 -4830 2262 6116 8912 8573 9073 5343 2796 2132 3140 1757 2160 1372 -381 -5209
13427e209K089O964N163L646q89j1222j0131L915K846M185P89j63m870K922L623
13412C658r257m964K345O201N544K6k091k763l210L30P970M944O385p171q447
13397e00O43L137m307K533L335Q79p95R67k199m562K956k552J241k640M116N457
13381G709k921j356j193J199o94O607q10q37l516k778P455O198j0486r345O236
13366A468R92L28M848n40l451K866o443J056L734L539n10J347J470o95Q77M039
13350A4925o731k558M56k37m169J112L196O09o218m912O066J130N153n727p653
13335e558n53N538P735j638O83L388P56k379k983q729L909K762n29K599J732j998
13319D735l880k823L873P373J133L273k153o371J580Q501j387l02O314N848j3344
$$ plain form
13427 -5209 -3120 3844 9007 12653 11764 542 -9589 -5674 -2828 1357 2146 1983 -2887 35 3658
13412 3658 -5599 -10563 -8218 -2017 3527 3553 1462 -1301 -4511 -4181 3789 8733 15118 7947 -500
13397 -500 143 3280 -1027 1506 4841 5720 4925 5892 3693 -869 2087 -465 776 -1864 2252 7709
13381 7709 4788 3432 2239 3438 2744 9351 8541 7704 4188 1410 8865 15063 4577 -4768 1468
13366 1468 2460 2788 7636 7096 3645 6511 68 1124 4858 8397 7887 9234 10704 10009 10886 14925
13350 14925 8194 5636 6092 5855 1686 2798 5994 6603 385 -4527 1539 2669 7822 2095 -5558
13335 -5558 -6111 -573 7162 5524 6207 9595 10351 7972 4989 -3740 169 2931 2402 5001 6733 4735
13319 4735 855 -1968 1905 9278 10411 13684 11531 5160 6740 15241 13854 13552 19866 25714 12370
13304A2370j1230J512L035N7K530j385L630n344n424J035q56R88K911L115J807
13289H751J373k10o969m089m11Q886M288n08j756K53P937J80k996o339q152l968
13273c730N671L435J608l539n994n26L714M843P075L148j699K58J387j0421m676
13258E54J983Q584R88K49m613m21J414N672q93k759j589k162k684q680L293J505
13242D41l293M582J717P07K506L051n164L827L903j403l396k607m228p90n030
13227e177Q49j59K553J72n118p498n58O08L735O725R127Q451M343J774l790M39
13211A6476k483n386L094K968l975k174K091OK121m584l728P335R044R60n447
13196A6318m216K49M81K97j085j0089J377l805j085k828N729Q248J1921K268j6159
$$ plain form
13304 12370 1140 2652 5687 5744 8274 6889 10519 5175 -249 786 -70 918 3829 6944 8751
13289 8751 10124 9914 2945 -1144 -1555 7331 11619 11111 9355 9608 17545 17725 14729 8390 238 -3730
13273 -3730 1941 5376 6984 3445 -2549 -3075 639 5482 12557 15705 14006 14264 15651 5230 554
13258 554 2537 11121 12109 12358 7745 7324 8738 14410 13517 10758 9169 7007 4323 -4357 -1064 441
13242 441 -2852 1730 3447 4154 6660 9711 4547 8374 12277 10874 7478 4871 643 -147 -5177
13227 -5177 -4328 -4487 -1934 -1762 -6880 -14378 -14936 -14328 -10593 -3868 5259 13710 18053 19827 16037 16476
13211 16476 13993 8607 11701 14669 10694 8520 10611 10617 12738 8154 4426 11761 20805 21765 16318
13196 16318 12102 12351 12832 13129 12044 1955 3332 -473 -1558 -4386 1343 9591 21512 23780 7621
13181G621o820M964M602R25m715l770O047K984M673L275Q785L550N247O462Q863
13166E2693J9031J9518M023j5234j3033r058j1143j1128j1872l306K74k361j185
13153A7219L450K116k042o409k835Q52L041o99n39l3j220J967K38k975m686N35
13137G980M624l570K86M982L107o36M707O50M50L180Q017J0011J3831L1114L5028
13122A23761L5917N4995N0932J4303j9284m4956n3340m2628k7545j9205j8270
13111E4680j7441o418K5o05j48n532m55L122k010n685J599N447R355J1513L0j0033
13095C7444j0309p1L196J018J794n14l923J332n66k74L032j243k140J0830K0835
13080F0441J7553R296K8435M8437N4663N5263L8813r164m6930o3030m5081l8065
$$ plain form
13181 7621 801 5765 10367 11292 6577 2807 8854 11838 16511 19786 28571 32121 37368 43830 52693
13166 52693 71724 91242 95265 80031 66998 57940 46797 35669 23797 20491 20765 18404 17219
13153 17219 20669 22785 20743 14334 11499 12351 15392 14693 14154 14121 12901 14868 15106 12131 7445 7980
13137 7980 12604 9034 9320 14302 17409 16773 21480 22130 22580 25760 33777 43788 57619 88733 123761
13122 123761 159678 214673 265605 279908 260624 215668 162328 119700 92155 72950 54680
13111 54680 37239 30821 30846 30241 30093 24561 24106 27228 25218 19533 21132 26579 35934 47447 47477 37444
13095 37444 27135 27064 30260 31278 33072 32558 28635 29967 29401 29127 32159 30916 28776 39606 60441
13080 60441 77994 87290 115725 164162 218825 274088 312901 303737 256807 193777 148696 110631
13068A10631l2595j6964k986j850n560j457l211m758j121r1j549L878J0553J2060
13054F4980P776R749O44k0J3229K1748K7955K4211K8598M2727M7484O0443O1876
13041D11400O5375N0539K8971K2803M93j6790l5530l7467n0452n0937l9088k8133
13029C21184l3061l2118l9147m5421l7536k4643j7840j605L551j0323r184j3603
13017F0254r659r51o313j458p801QJ723o425n547K493Q82L671m781p541o982M392
13001A5965N883M041o188j994K223P727o84l310l359J276N711K874N390k61r418
12986B5876q48l109m507L458M791p312r672J737J765l94n24R141K565o023l712
12971A3232N104L563k369J296j963m751J011l223l610Q321K373m843l02L421K190
$$ plain form
13068 110631 78036 61072 58086 56236 50676 49219 46008 41250 40129 40038 38489 42367 52920 64980
13054 64980 72756 82505 83149 83129 96358 118106 146061 170272 198870 241597 289081 349524 411400
13041 411400 476775 527314 556285 579088 579581 562791 527261 489794 439342 388405 349317 321184
13029 321184 288123 256005 216858 171437 133901 109258 91418 89813 93364 83041 73857 60254
13017 60254 50595 49644 43331 41873 34072 34080 35803 29378 23831 26324 27206 30877 26096 18555 11573 15965
13001 15965 21848 25889 19701 17707 19930 27657 26973 23663 20304 21580 27291 30165 35555 35294 25876
12986 25876 25028 21919 17412 20870 25661 18349 8677 10414 12179 11785 11261 20402 22967 16944 13232
12971 13232 18336 21899 19530 20826 18863 14112 15123 11900 8290 16611 18984 14141 13839 17260 19450
12956A9450m075J48j652l929j87N904K634r52K99N115J140j151K966J051O795
12941C3556M814o25J861K330j896m236L547k430n21k920k898m171P04j921q064
12926A7130J529Q546L691k778K450K93q99O622K408n048l171j042j69J050m162
12911B6450K025l103n633j087N165m81O989P492N997j863p271o630J242P661P511
12896D4464N211j637m114L512J0328R78M70J577J168J19j974p861j284j163L995
12881E3789Q807P970N31j244O636Q998M321L117k203j135l620k170n805M539K783
12866H5314J522j0067j133M108m193k338k759M154J0051J06l091J191n236m793
12852G2836J713K28l629l731L568M487k574o325l553q785o856J41o8j806n96J110
$$ plain form
12956 19450 15375 15523 13871 9942 9755 15659 18293 17341 17640 22755 23895 22744 25710 26761 33556
12941 33556 38370 37745 39606 41936 40040 35804 39351 36921 36400 33480 30582 26411 27115 25194 17130
12926 17130 18659 27205 30896 28118 30568 30861 29962 36584 38992 33944 30773 29731 29562 30612 26450
12911 26450 28475 25372 19739 18652 23817 23336 30325 37817 43814 41951 34680 28050 29292 36953 44464
12896 44464 49675 48038 43924 47436 57764 58742 59212 60789 61957 62076 60102 52241 50957 49794 53789
12881 53789 62596 70566 71097 69853 76489 85487 89808 92925 90722 89587 85967 83797 77992 82531 85314
12866 85314 86836 76769 75636 79744 75551 73213 70454 74608 84659 84765 81674 82865 77629 72836
12852 72836 74549 74777 71148 67417 70985 75472 72898 66573 63020 54235 47379 47520 47452 45646 45050 46160
12836D6160K690k04m701M202L695J804j938m050l629k8L971J0089K942n039k681
12821E3283L274K506J2513Q394N949M876n946m242J414M935j332m760j42j695
12807G9027n79J0009J0301R5N87L25L456p37O154P630L624K876K771J990o44l316
12791A23569l93N20l732p865q329Q80N751O100j985o800m615j937J288r38r24
12776A00590M16k244j505N222J191m177M15q053R24K071N708J1012q70m640K311
12761A08371P90K607R180J708N125L102K961p056k886N214L308N224Q732j38k207
12746A44035n924m848J858K484k235j956L792J696l430Q021P103M758o22R52M846
12731A60530K081M895N714J636J1083J0292R435N690L897k197j006L464K318L7
$$ plain form
12836 46160 48850 48646 43945 48147 51842 53646 51708 47658 44029 44001 47972 58061 61003 55964 53283
12821 53283 56557 59063 71576 79970 85919 90795 84849 80607 82021 86956 85624 80864 80722 79027
12807 79027 78448 88457 98758 98853 99440 99765 103221 102484 108638 116268 119892 122768 125539 127529 126885 123569
12791 123569 123176 123696 119964 112099 103770 104650 110401 116501 114516 107716 103101 101164 102452 101514 100590
12776 100590 101006 98762 97257 102479 103670 99493 99908 91855 92779 94850 100558 111570 110700 106060 108371
12761 108371 109161 111768 120948 122656 127781 130883 133844 126788 123902 129116 132424 137648 146380 146242 144035
12746 144035 138111 133263 135121 137605 135370 133414 137206 138902 135472 143493 150596 155354 154732 155684 160530
12731 160530 162611 167506 173220 174856 185939 196231 205666 211356 215253 213056 212050 215514 217832 217869
12717B17869L530O314P71O60M711P529N798M41N190O557L073P513O521J224M967
12702B82668J2738J0385M123Q849N471O638J3754J4394J6789J4206Q138J8896
12690D17049J3029J1454O714J2545J5063N189j265P610Q290J2778J8136J1852
12678E38444K1444K3717K8110K8019K9051K9248L0046K5669K6985K7696K7891
12667H36320K7978L6096M8562M5737M5523M3589N1403N7240N3229L9128M7810
12656A332615O3334P1189P8572P9440Q5269J02667J06465J20649J41666J48196
12646B330062J78560K03555K33162K73884L22361L70925M41050N22769O11390
12637E487718P09579Q11526R32085J056776J183338J344611J544697J840050K271916
$$ plain form
12717 217869 221399 227713 228484 229144 233855 241384 247182 247623 252813 259370 262443 269956 276477 277701 282668
12702 282668 295406 305791 309914 318763 324234 330872 344626 359020 375809 390015 398153 417049
12690 417049 430078 441532 448246 460791 475854 481043 479778 487388 495678 508456 526592 538444
12678 538444 559888 583605 611715 639734 668785 698033 728079 753748 780733 808429 836320
12667 836320 864298 900394 948956 994693 1040216 1083805 1135208 1192448 1245677 1284805 1332615
12656 1332615 1395949 1467138 1545710 1625150 1710419 1813086 1919551 2040200 2181866 2330062
12646 2330062 2508622 2712177 2945339 3219223 3541584 3912509 4353559 4876328 5487718
12637 5487718 6197297 7008823 7940908 8997684 10181022 11525633 13070330 14910380 17182296
12628A7182296K895226L784527M969591O437578Q053333R592548J0852766J1591976
12620G5359841J1417498R974395P207882L502654n19711m335278p582205j0034097
12612H4990979j1475692j1811235j1101709r642296p851071o101122m635552l510144
12604A8862158k682676k083478j688494j416019j216282j068456r65215q65320
12596F876218p67673o64152n68940m87144m18776l52073k94699k60761k28046
12587B833954k08979j79046j64634j45795j38213j29179j18064j13905j04268
12578A531871r3470p4124p1368p4420o7504o1427n5556m2351l7793l2218k2921
12567H98719k4115k2970j7088j6147j2293j8261k0210k6516j6685j1018j3548
$$ plain form
12628 17182296 20077522 23862049 28831640 35269218 43322551 52915099 63767865 75359841
12620 75359841 86777339 96751734 103959616 107462270 106942559 102607281 95025076 84990979
12612 84990979 73515287 61704052 50602343 40960047 33108976 27007854 22372302 18862158
12604 18862158 16179482 14096004 12407510 10991491 9775209 8706753 7741538 6876218
12596 6876218 6108545 5444393 4875453 4388309 3969533 3617460 3322761 3062000 2833954
12587 2833954 2624975 2445929 2281295 2135500 1997287 1868108 1750044 1636139 1531871
12578 1531871 1438401 1364277 1292909 1218489 1150985 1089558 1034002 991651 953858 921640 898719
12567 898719 874604 851634 834546 818399 806106 787845 767635 741119 724434 713416 699868
12556F99868k0893k3910j8676k1989k0776k8912k7283k4756j7403j4067j4309
12545D66894j2412r643m747p280n183j2960k110L93J035o260o650q598L559K039
12531C98077k293K819k09k409Q34l057j5237r067l644j589l708k0032q456j858
12517C30171j0634K877O687K180P498O788N492P800R053J2645J944L197N605O507
12503C97810O391Q081P417L119J476K1060M3054Q0629J45920K25671K09627N9916
12491A210171j24409k30533k14583j36262q7570o3835m3535k7410k5281k4153
12481B32600k3112p396j0061o438o38L73p203j575j602m540m023l357k456l044
12467A57528J1494J3041J0656J0095N267o20J172J4063J8001J2444K1418K6489
$$ plain form
12556 699868 678975 655065 636389 614400 593624 564712 537429 512673 495270 481203 466894
12545 466894 454482 444839 440092 432812 427629 414669 412559 412952 413987 407727 401077 392479 396038 398077
12531 398077 395784 398603 398394 395985 396819 393762 378525 369458 365814 364225 360517 340485 332029 330171
12517 330171 319537 322414 329101 331281 338779 345567 351059 358859 367912 380557 382501 385698 391303 397810
12503 397810 404201 412282 419699 422818 424294 445354 488408 569037 714957 940628 1150255 1210171
12491 1210171 1085762 855229 640646 504384 416814 352979 309444 282034 256753 232600
12481 232600 209488 202092 192031 185593 184955 185328 178125 176550 174948 170408 166385 163028 160572 157528
12467 157528 169022 182063 192719 202814 208081 207461 208633 222696 240697 253141 274559 301048
12455C01048M3252P1229J14118K00405L61135O06323P40014M54658r1016n56735
12445B244431o94272n23394l13695j86679j12103o9583m8185l0297k2913r669
12435B33641k314J4614K2211J8894J4888K8778L8950O1421P1894P8883J00164
12424F82024J10243J03395J13480J05438Q4666N5712K6226m364k5128o6096q3309
12413A102287q7969p4912o3605k5987J5858Q7692K25792M55699O96381O19047
12403B950283J29776m03411p10177o48296m17966k47906j55589j00528p1568n4140
12393B70478m0166k9427k0810j4656j4013j1944j2801j5528r500L9M884J447j0044
12380I7959p887K528j733n991K141P777R103K628K199R892J0790J2869R327J3837
$$ plain form
12455 301048 344300 415529 529647 730052 1091187 1697510 2437524 2892182 2801166 2244431
12445 2244431 1550159 1026765 713070 526391 414288 344705 296520 266223 243310 233641
12435 233641 231327 245941 268152 287046 301934 330712 369662 431083 502977 581860 682024
12424 682024 792267 895662 1009142 1114580 1199246 1254958 1281184 1276820 1251692 1185596 1102287
12413 1102287 1014318 939406 875801 849814 865672 953364 1179156 1634855 2331236 2950283
12403 2950283 3080059 2676648 1966471 1318175 900209 652303 496714 396186 324618 270478
12393 270478 230312 200885 180075 165419 151406 139462 126661 111133 101633 101672 106556 108003 97959
12380 97959 90072 92600 90867 84876 87017 94794 103897 106525 108724 118616 129406 142275 151602 165439
12366A65439J6227K7925M8330O9871J25730K24402K47033J21332o7766k04154
12356G74369k32358j64909r8199o0595m2242k8131k5757j8154j4328q542n105
12345G6049r466j81o043j0484N00K772r598m356O137k117L090j86o85r66L52l482
12329D1336l647j792j712L215N866m80o065j177M398M876k628m028K907j860O589
12314D5798J156J628O576n354N77K568l114k039o961p779k777L274j745lJ136
12299C2941j839J004o401K629O438J1878J139M711M943P08J593K667O454J037
12285F9902O18N197n293m394r09k053j1482n256j767m474K516J451k574n200k169
12270C4113P86N278m344l674K243N311K419p607l724n188j625k798P94N783M289
$$ plain form
12366 165439 181666 209591 257921 327792 453522 677924 924957 1046289 978523 774369
12356 774369 542011 377102 278903 218308 176066 147935 122178 104024 89696 81154 76049
12345 76049 66583 66402 60359 49875 50375 53147 43549 39193 45330 43213 46303 46117 45432 44466 44818 41336
12329 41336 37689 35897 34185 37400 43266 42786 36721 35544 39942 44818 42190 38162 41069 39209 45798
12314 45798 46954 48582 55158 49804 50381 52949 49835 47796 40835 33056 30279 33553 31808 31805 32941
12299 32941 31102 32106 25705 28334 34772 46650 47789 52500 57443 58151 59744 62411 68865 69902
12285 69902 70520 75717 70424 66030 65121 63068 51586 46330 44563 40089 42605 44056 41482 36282 34113
12270 34113 34899 40177 35833 32159 34402 39713 42132 34525 30801 25613 23988 21190 21984 27767 32056
12255C2056l861k730j718n700N44P192M832j133l467m405O135O050Q62m939l88
12240B9330L256J09k242m640L773k445l60K893J063Q118O613k767o991K921N490
12225D4121j268J329J935N011P748Q134R568N397J0764J4433M074M52P17P754
12211A20169m312o611J409m249l31O39O147P129J3718J7585J6263K0837L4167
12198B22560L7652L6263M7814N6421N9779O4481N7193L7206J8759Q921n555l0098
12186F11396m9756m5136n5823n6582l9926k8468l2205k8561k3325k1177k9227
12175B01210k5044j5623k2824k3165j6726j3717j3273p430p883k610q301k836
12163D1778j499m952m636j232l091k956J890R80J670j833Q97J566n917J373N782
$$ plain form
12255 32056 28195 25465 23747 18047 18591 25783 30615 29482 26015 21610 27745 33795 34657 29718 29330
12240 29330 32586 32695 30453 25813 29586 27141 26781 29674 30737 38855 45468 42701 35710 38631 44121
12225 44121 42853 44182 46117 51128 58876 67010 76578 81975 92739 107172 111246 111698 112415 120169
12211 120169 115857 109246 110655 106406 106075 106714 112861 119990 133708 151293 167556 188393 222560
12198 222560 260212 296475 344289 400710 460489 524970 582163 619369 638128 647049 641494 611396
12186 611396 561640 516504 460681 404099 364173 335705 303500 274939 251614 230437 201210
12175 201210 176166 160543 137719 114554 97828 84111 70838 63408 55525 52915 44614 41778
12163 41778 40279 35327 30691 29459 26368 23412 25302 26282 27952 26119 27016 28582 22665 24038 29820
12148B9820O655J261K008j218l123n003p587j258l23r056q237J400O007P742M767
12133B3855k500r94qq91o066n727K670N697O664L443N107q12J37j135l579J418
12117B7279K769k317n02j650Q925M397j3214m33Q499O088J4766K2278J8711K9806
12103A25402L6215L3538J9745o882j4975p636J014J1606K8324M8021O4851R7040
12091D36263J28487J58381J67158J71637J64079J32018Q7083K4985l6667r5242
12081A338182j36868j68333j85115j74796j52546j16313r3175o3407m3016l0638
12071A73975k6505j7150n329q827j3970j0109q547k347m60j373N313Q940K6575
12058A20186K2669R849j4102k4698k4687k0902j3271r838r728j924o657q81j48
$$ plain form
12148 29820 36475 37736 39744 38526 35403 30400 22813 21555 21232 12176 3939 5339 11346 19088 23855
12133 23855 21355 20361 20353 19462 13396 7669 10339 16036 22700 26143 31250 30438 30575 29440 25861 27279
12117 27279 30048 27731 27229 25579 34504 38901 25687 25254 33753 39841 54607 76885 95596 125402
12103 125402 161617 195155 214900 208018 193043 185407 186421 198027 226351 274372 339223 436263
12091 436263 564750 723131 890289 1061926 1226005 1358023 1445106 1470091 1433424 1338182
12081 1338182 1201314 1032981 847866 673070 520524 404211 311036 247629 204613 173975
12071 173975 147470 130320 124991 116164 102194 92085 83538 81191 80731 79358 84671 93611 120186
12058 120186 142855 152704 138602 113904 89217 68315 55044 45206 35478 33554 26897 26016 25868
12045B5868n446j738L49L486J78K835j9j010j194l03M038M194M350n045m693o128
12029A9722n644k421l751Q817N655J251J669o582n359M69j088Q106Q703K258M046
12014C5851O157L774j448p085j0901m651J777L334o675n110J474k347l002K09
12000A1357Q461L920J642l57K096L799p851r035J471k813j930O203N230M23J264
11985B3880J186n91P46j801j466o054m742J669k68n70n723l338J379L562N59j927
11969F501n50n837n622K017M685N812q94O076J423o860P05K952K521j96l702K921
11953A1952K587J2691r44j4147L27m594l533j65J010k177L658Q709O473M840l552
11938B3135K211J91l450K315n317j4475q516P000N259K679q153N79K764L767p28
$$ plain form
12045 25868 20422 18684 19033 22519 22697 25532 25513 24503 23309 23006 27044 31238 35588 30543 25850 19722
12029 19722 14078 11657 7906 16723 22378 23629 25298 18716 13357 13826 12738 20844 29547 31805 35851
12014 35851 42008 45782 44334 37249 26348 21697 23474 26808 20133 15023 16497 14150 11148 11357
12000 11357 19818 23738 25380 25023 27119 30918 23067 14032 15503 12690 10760 16963 22193 22616 23880
11985 23880 25066 24475 25221 23420 21954 15900 11158 12827 12559 11989 6266 2928 4307 7869 8428 6501
11969 6501 5951 114 -5508 -3491 1194 7006 6112 12188 13611 6751 7456 10408 12929 12733 9031 11952
11953 11952 14539 27230 26286 12139 12466 7872 4339 4174 5184 3007 6665 15374 21847 26687 23135
11938 23135 25346 25537 22087 24402 19085 4610 -3906 3094 8353 11032 2879 3458 6222 9989 9261
11923I261R97n270j638O600k421o682N350K678J116M306m345l259l624k922J558
11908A705L353M004K228m86l865j814J1580K182k259j0585q004o8K17N230L371
11893F789Q59M598M46k671j851n199J636n43m625K239j39o865p644J293N026J0337
11877C686P4j765M90j33O104L055J782k08K501m308n234j142l58K491P175j630
11861A2580m995p82j045J1491k015r082q203j130L654M519M634k255L39l8m464
11846C208M56Q34J623k3J525k660p961k246k407N051N677L481k411k680l724P12
11830a545l632O274K944j677J951K28Q165m191p572l002L28J811p82N680R752
11815A4732r74p366l333O482N256K842K389j721l489q370p462J537K624L019k825
$$ plain form
11923 9261 10258 4988 3350 9950 7529 847 6197 8875 9991 14297 9952 6693 3069 147 1705
11908 1705 5058 9062 11290 10804 6939 5125 16705 18887 16628 6043 -1961 -2029 -1812 3418 6789
11893 6789 7648 12246 12692 10021 8170 2971 4607 4064 -561 1678 1539 -5326 -12970 -11677 -6651 3686
11877 3686 3760 1995 2485 2352 8456 11511 13293 13085 15586 11278 6044 4902 4544 7035 14210 12580
11861 12580 7585 6803 5758 17249 15234 6152 -2051 -3181 473 4992 9626 7371 7710 7672 3208
11846 3208 3664 4498 6121 6098 7623 4963 -2998 -5244 -7651 -2600 3077 6558 4147 1467 -2257 -1545
11830 -1545 -5177 1097 4041 2364 4315 4543 12708 8517 945 -2057 -1729 82 -700 4980 14732
11815 14732 13758 6392 3059 9541 14797 17639 20028 18307 14818 6448 -1014 523 3147 6166 3341
11800C341O26O11j381m637k71J482P349L333q914q098J246O878j029N646N306
11785A1488n308J103J217M709k340p466K937Q623j637p214p24J694M571k058l227
11770F368o865j063M125k544L852K832k538P8N69k679n093J512M659M383J363
11755H959j901o607l53M175R30K11P919j82o897k624r340n733N809L804J207K542
11739A919L597O367L968o81o386K917j131q97m580k109j187R9L195j673n052M005
11723B371K302N346j665l565M916M78J285O35j487m592K684K963K642p40L807
11708A7380L499M73J887o265m010K264L82k934j024L654Q43k108o21L15p10l393
11692I632j259K087l460n87P863j463p267k244M39jM361J989O538L407j516n774
$$ plain form
11800 3341 3967 4578 3197 -1440 -1711 -229 7120 10453 1539 -6559 -5313 1565 536 6182 11488
11785 11488 6180 7283 8500 13209 10869 3403 6340 14963 13326 6112 5388 7082 11653 9595 6368
11770 6368 -497 -1560 2565 21 3873 6705 4167 4245 4814 2135 -2958 -1446 3213 7596 8959
11755 8959 7058 451 98 4273 5203 5414 13333 13151 6254 3630 -5710 -11443 -5634 -1830 -623 1919
11739 1919 5516 11883 15851 15170 8784 11701 10570 9673 5093 2984 1797 1896 5091 3418 -1634 2371
11723 2371 4673 10019 8354 4789 9705 10183 11468 12103 10616 6024 8708 11671 14313 13573 17380
11708 17380 20879 21352 23239 16974 12964 15228 15610 12676 11652 15306 16149 14041 13420 13735 13025 9632
11692 9632 8373 10460 7000 6413 14276 12813 5546 3302 3741 3740 8101 10090 16628 20035 18519 12745
11676A2745m390n142L051R39r025k439O761N215Q848M0J694R989L986n154q83
11661B6235m907l400O228j304k080r84l122K947M340k767r153k574j879m109Q423
11646A1894M996M55l104q398j529O151J684L070m608J09L251o45j221O57J053
11631A3815k460l321J102R279L88m486J37J00j453m864m06M34M002l002M956Q132
11615B2353q14n767O258L468q797o005j368L37q40L12m058M262k249N801J648
11600A4541j298j456J068J0372j379r113K232J090l905L632L113l496j132M871
11586A9140j22m800l25L508O921J063o048p197l868k099J642J095L889o2L230
11571A5967J800j764j213j869L0j072j058J427K652L303J062j459L665M302r75
$$ plain form
11676 12745 8355 3213 6264 7203 -1822 -4261 2500 7715 16563 16603 18297 28286 32272 27118 26235
11661 26235 21328 17928 24156 22852 20772 19788 16666 19613 23953 21186 12033 9459 7580 3471 11894
11646 11894 16890 17345 14241 5843 4314 10465 12149 15219 10611 10720 13971 13326 12105 12762 13815
11631 13815 11355 8034 9136 18415 18803 14317 14454 14554 13101 8237 7831 8265 12267 9265 14221 22353
11615 22353 21539 15772 22030 25498 16701 10696 9328 9665 8825 9137 5079 9341 7092 12893 14541
11600 14541 13243 11787 12855 23227 21848 12735 14967 16057 12152 15784 18897 15401 14269 19140
11586 19140 19018 14218 13893 17401 24322 25385 19337 12140 8272 6173 7815 8910 12799 12737 15967
11571 15967 17767 16003 14790 12921 12951 11879 10821 12248 14900 18203 19265 17806 21471 25773 24798
11556B4798p100j720r0L163L78J117M707L100q83j0472o398o289O707N115k171
11541A3962L598L242j330M389p677q438L572O322n203k564J671p40j152J155N49
11526A1356k433L878M613q366O75K960j105k240J173O901q97m314m731O37K434
11511A0541l37J198L040n059o203j834M700N277K630J340L753n253n241L065M116
11496A5733l496N298N547k245K073L621J357l084q577n561O198N712M333m900
11482B2009J561K586O128L182L510k603l51o732o555J80K648l881N12N242J239
11467B8675L800l375j627L776L327L213q250m369R383L845l010n0J2228O016K85
11452E3867L662K808P954Q638n24Q998J1569O016J3060J8325K1054L3963M3101
$$ plain form
11556 24798 17698 15978 15888 19051 19429 20546 25253 28353 27470 16998 10600 4311 11018 16133 13962
11541 13962 17560 20802 19472 23861 16184 7746 11318 17640 12437 9873 11544 10804 9652 10807 11356
11526 11356 8923 12801 17414 9048 9723 12683 11578 9338 10511 17412 16515 12201 7470 8107 10541
11511 10541 10204 11402 14442 9383 3180 1346 6046 11323 13953 15293 19046 13793 8552 11617 15733
11496 15733 12237 17535 23082 20837 22910 26531 27888 24804 16227 10666 16864 22576 26909 22009
11482 22009 23570 26156 32284 35466 38976 36373 36022 29290 22735 22915 25563 21682 22194 27436 28675
11467 28675 32475 29100 27473 31249 34576 37789 29539 25170 34553 38398 35388 35338 47566 53582 53867
11452 53867 57529 60337 68291 76929 76405 85403 96972 102988 116048 134373 155427 189390 232491
11439B32491M6853O4663Q2291J03900J20645J05950N4784r297p3320j06434j15393
11428E07133j02941p9094n5054m9824m0784k7298j4395j0261j0145j6670j6176
11417H4491p984j707m370q128p253p113r109K234L733m137p102l48l387K374J905
11402C4099J117m052L765J794K537N394n16n917L651P686N34p769p286l304P26
11387C2459p720j4445q633l472L988J4286J0331M977P059q78r30n487p422O601
11373C0714M865K182n0n10j906j854k604j112o350p594M021J726P620L153p230
11358B5071j781K799J972k786p906R78P393P82r707j943K58O065N584M451j545
11343B9685n85l099l816Q72k780j845J2044L489p302m048j592K955k458O138J135
$$ plain form
11439 232491 279344 344007 426298 530198 650843 756793 811577 802280 728960 622526 507133
11428 507133 404192 325098 270044 220220 179436 152138 137743 127482 117337 100667 84491
11417 84491 76507 74800 70430 62302 55049 47936 38827 41061 44794 40657 33555 33207 29820 32194 34099
11402 34099 35216 31164 34929 36723 39260 44654 44138 38221 41872 49558 50092 42323 35037 31733 32459
11387 32459 24739 10294 1661 -1811 2177 16463 26794 31771 38830 37952 37022 31535 24113 30714
11373 30714 35579 37761 37711 37201 35295 33441 30837 29725 23375 15781 19802 21528 29148 32301 25071
11358 25071 23290 26089 28061 25275 17369 18347 25740 26522 16815 14872 15130 21195 26779 31230 29685
11343 29685 29100 26001 22185 23057 20277 18432 30476 33965 26663 22615 21023 23978 21520 27658 28793
11328B8793k72j969j12M3k183K212k931K632N890J038l461m513J193R553L039
11313C8952m245k296M406k554j6120m96L990Q531M724l453r142J741K75J441K835
11298B8589Q401l720m140K362N331J114J027m845J60j777P894J1106J770j187
11284E2085m949k1j621R75k830J7K43K765O619M682Q128J808r975l124L392L695
11268F1889p580l738M607N947M100j252j965n456j1698j1616K446Q155J6713J0918
11254G1470J2101R601N417K565J38j948r630j1342j2621j2877n476M890J750M853
11240E8891L098l011o359r987o968R527N357P728M27l712P13l791P51R702j215
11225F1151j557M971P040p207m040o182o13m820j680j527l127N103Q595R203J2586
$$ plain form
11328 28793 28521 26552 26440 26483 24300 26512 23581 26213 32103 33141 29680 25167 26360 35913 38952
11313 38952 34707 32411 36817 34263 18143 17647 21637 30168 34892 31439 22297 24038 24313 25754 28589
11298 28589 36990 33270 29130 31492 36823 37937 38964 34119 34279 32502 40396 51502 53272 52085
11284 52085 47136 47115 45494 46469 43639 43656 43899 46664 53283 57965 66093 67901 57926 54802 58194 61889
11268 61889 54309 50571 55178 61125 65225 63973 62008 56552 44854 33238 35684 43839 60552 71470
11254 71470 83571 93172 98589 101154 101292 99344 89714 78372 65751 52874 47398 52288 54038 58891
11240 58891 61989 58978 52619 42632 35664 45191 50548 58276 58703 54991 55704 51913 52664 62366 61151
11225 61151 59594 64565 71605 64398 60358 54176 53563 48743 47063 45536 42409 47512 56107 65310 77896
11210G7896J1221R616O157P355O721j873n252L02J2729R748J0470J6203L1873
11197A93166M3580O9258R9545J58298K70725M04541M12363J87172j25593l65746
11187A347309l93526k91260j91252j20812p5440m7472l7929k6698k0926j6304
11177A25690j1599k579j523n755o686j0445m750j0325k674l859j183j253o451
11164E6608o543N115M490M135M320N72K729l460p270k350O505k758m772Q705Q91
11149F6917Q59k035j586l808K29L12O226J326K665N796O23l609n272l596l591
11134F1456o66j0056j2345J188N583N531M493k977P30j070m07j049p948j422O89
11119D1730k596n140k000r623q386n741m229K088l619n360J591J3120J8386J9281
$$ plain form
11210 77896 89117 98733 104890 112245 118966 117093 111841 112143 124872 134620 145090 161293 193166
11197 193166 236746 306004 405549 563847 834572 1239113 1651476 1838648 1713055 1347309
11187 1347309 953783 662523 471271 350459 275019 227547 189618 162920 141994 125690
11177 125690 114091 111512 109989 104234 97548 87103 82353 72028 69354 65495 64312 63059 56608
11164 56608 50065 55180 59670 63805 68125 68697 71426 67966 60696 58346 64851 62093 57321 66026 66917
11149 66917 67776 65741 64155 60347 60576 60888 67114 68440 71105 76901 77524 73915 68643 65047 61456
11134 61456 60790 50734 38389 39577 45160 50691 55184 52207 52937 51867 51460 50411 42463 41041 41730
11119 41730 39134 33994 31994 22371 13985 8244 4015 6103 2484 -2876 -1285 11835 30221 49502
11105D9502J5213J518J129L699J991P377N722l285j342l00j367l472l228n415
11091F7742j5479k1567k2450j1406L538J4994J6124J9891J3708R255M965m660
11079G4655p735k319j299o829J278N989J455k598k440K514N167K435l050J168
11065F8391l196k038n521j293j68j202l219J264M076O327O980Q151O858K059o107
11050H1362l706K246p857N707J4426J512n086L072J2055Q820O091J291j590L188
11036A21531P595J5180J0394J168J43k568j1331p490R273n407n055j090l347j2679
11022A16317p062p287J955Q709K075M182Q979N526j504l75M289L63r50J498K862
11007A39577m242j834q060p563r381n693j0894j0894o37l87L506M541N43J07K956
$$ plain form
11105 49502 64715 66233 67362 71061 73052 80429 86151 82866 81524 81224 79857 76385 73157 67742
11091 67742 52263 30696 8246 -3160 378 15372 31496 51387 65095 74350 79315 74655
11079 74655 66920 64601 63302 56473 57751 63740 65195 62597 60157 62671 67838 70273 67223 68391
11065 68391 65195 63157 57636 56343 56175 54973 51754 53018 57094 63421 70401 78552 85410 87469 81362
11050 81362 77656 79902 72045 77752 92178 93690 88604 91676 103731 112551 118642 119933 118343 121531
11036 121531 129126 144306 154700 155868 156011 153443 142112 134622 143895 138488 133433 132343 128996 116317
11022 116317 109255 101968 103923 112632 114707 118889 127868 133394 131890 131515 135804 136167 135217 136715 139577
11007 139577 135335 133501 125441 117878 108497 102804 91910 81016 80379 79992 83498 88039 88582 88689 91645
10992I1645P686L10L118L60l422l29N777j467p867l36j1423K480J8192K1660J4968
10977A41352K2250J2804J2734N928Q349l155j5901j6289p210j5856j6614o112
10965A22280J64M199J0476J9284J3186Q011Q807Q276N516Q538M135p753j0232
10952A94887O30m846m994k572r012l031K60j142P33R445p3o578q360m638J026
10937A61735N953J2646J940k2240l6893l1954k1820j2453J1867L4999K7662K5555
10925A56997J3439J688o277J158o72k439l784K654J1610O209L408J2854J2710
10912B09555R771N121K994J8534K4547J4759N915p385k3841j4201Q394M0463M8067
10899C42693N6013P3516J03888J54841J87068K06548J84041Q5732l5704j26476
$$ plain form
10992 91645 99331 99641 102759 103119 99697 99368 105145 103678 95811 95475 84052 86532 104724 126384 141352
10977 141352 163602 176406 189140 195068 203417 200262 184361 168072 160862 145006 128392 122280
10965 122280 122444 126643 137119 156403 169589 177600 186407 194683 200199 208737 212872 205119 194887
10952 194887 195517 190671 185677 183105 174093 171062 171322 170180 170913 180358 180285 173707 165347 160709 161735
10937 161735 167688 180334 182274 160034 123141 91187 69367 56914 68781 103780 131442 156997
10925 156997 170436 172124 165847 167005 166333 163894 160110 162764 174374 180583 183991 196845 209555
10912 209555 219326 224447 227441 245975 270522 285281 291196 283811 259970 245769 254163 294626 342693
10899 342693 398706 472222 576110 730951 918019 1124567 1308608 1394340 1358636 1232160
10889A232160j88967j84719j47296j13963p8289n4617m2761l1275l0638k5122
10879C34513j2352l045N033Q301P752l705j3699j0064r940j0875j4012l485L459
10866B77881J72K933J1153Q148J6916J0067N553M602Q912P992k631m043o662O543
10852C47536J7812K9925L0551K6872K2246K0646Q252p784j8152l2765k6810j0441
10840D07888J0295K5653L8926L8798L4608K6801J2035M473Q893K5182L2848L7839
10828G04239L3714M2116N3581N9483O6398N8629M6444N1425M1174K9111K7292
10817A213606K1555L4391M8001N2842O8281P1026P6593Q0066P8507Q6062J13030
10806A943960J69610K42131L28385M56591O39112P08200N26870K64498O9680O5781
$$ plain form
10889 1232160 1043193 858474 711178 597215 518926 464309 421548 390273 359635 334513
10879 334513 322161 319116 324149 332450 340202 336497 322798 312734 302794 291919 277907 274422 277881
10866 277881 278053 280986 292139 300287 317203 327270 332823 337425 346337 354329 351698 347655 340993 347536
10852 347536 365348 395273 425824 452696 474942 495588 503840 496056 477904 445139 418329 407888
10840 407888 418183 443836 482762 521560 556168 582969 595004 599477 608370 633552 666400 704239
10828 704239 737953 780069 833650 893133 959531 1018160 1064604 1116029 1157203 1186314 1213606
10817 1213606 1235161 1269552 1317553 1370395 1438676 1509702 1586295 1666361 1744868 1830930 1943960
10806 1943960 2113570 2355701 2684086 3140677 3779789 4487989 5014859 5279357 5349037 5414818
10796E414818K01925L66314N58112P67289J002736J262910J555458J927352K402093
10787A5459007L072588M084177N632887P958538J1780407J8683309L1572302N4519408
10779A52762623Q1016635P7488515K9423570k7691766o9188462p4027781n4515264
10772A15268070l5102696k2708649j5053510j0440299p415517n252710l716136
10765A5578553k590983j751652j064867m23256J923o3914n18965r84472j118475
10756G063892q69803m71647j24077k2953k16726m91079o66743o25550m79123l65608
10746B730583l03663k49830j98909j60354j32198j06689r6719p9959q3821q9841
10736A228600r2727p5703o3602n8422m3840l3555j0977L582l304j2862j9326j1977
$$ plain form
10796 5414818 5616743 5983057 6541169 7308458 8311194 9574104 11129562 13056914 15459007
10787 15459007 18531595 22615772 28248659 36207197 47987604 66670913 98243215 152762623
10779 152762623 233779258 311267773 340691343 312999577 243811115 169783334 115268070
10772 115268070 80165374 57456725 42403215 31962916 24547399 19294689 15578553
10765 15578553 12987570 11235918 10171051 9747795 9749718 9685804 9166839 8182367 7063892
10756 7063892 6194089 5722442 5598365 5575412 5358686 4867607 4200864 3575314 3096191 2730583
10746 2730583 2426920 2177090 1978181 1817827 1685629 1578940 1482221 1402262 1318441 1228600
10736 1228600 1135873 1060170 996568 938146 894306 860751 849774 853356 850052 837190 817864 805887
10724H05887j6312j9842k2073l0305l4555k3879k1254r907J0097Q959J0292n142
10712F51966l1188n1939o4969m6244k4276j1235j2800r429M378J0075M153J68
10700D18660j4941k7719j7787n956O108j740p950j823m980n754o155m235L70o679
10686C19419r52j0997q905j3331r338j3803l703m458q863K23P266Q088O253l541
10672B63358o384n927L532J1029L883n368j0219j1561k751J900J2115K4977K9893
10659C08477M1269K8115J9152J7256J4864J4375J9444J7405Q969r444l3127l7301
10647D09454l3361k1997j3508j8490k0870j0033l766J246p130n313K651l620j4747
10634B60516j1458q93p726j9642j9736k7939k077K4836L8709L7222K1027j829
$$ plain form
10724 805887 789575 769733 747660 717355 682800 658921 637667 627760 637857 646816 657108 651966
10712 651966 620778 568839 503870 457626 433350 422115 409315 399886 404264 414339 418492 418660
10700 418660 403719 376000 358213 352257 358365 356625 348675 346852 341872 336118 329963 325728 326098 319419
10686 319419 318467 307470 298565 285234 275896 262093 258390 253932 245069 245292 252558 260646 266899 263358
10672 263358 256974 251047 254579 265608 269491 264123 253904 242343 239592 241492 253607 278584 308477
10659 308477 349746 377861 397013 414269 429133 443508 462952 480357 489326 479882 446755 409454
10647 409454 376093 354096 340588 322098 301228 291195 287429 288675 281545 276232 278883 275263 260516
10634 260516 249058 248165 240439 220797 201061 173122 171045 195881 234590 271812 292839 291010
10622B91010j8300k2681l2778j8785N671M413o8k607l418n020l158j92M808J6264
10608B15159R967R23O570N96r319j6540j7828j7889k1646j0025m310J097Q046
10595A44801N211R552K0858K9005K9728K8778J4507R594N676o55q900j3665n739
10582B68751N943j384K33R99N129J9979J9689K0076K3433K4234J4933N333j008
10569D06340q58P98r24P643L540K529N098N584N737J2822Q087R662R277J2928
10555D88263J1451J5669J8802J4587J9485P938N804J1161J4552J1984J8002K7452
10543F65150J7517K2765J2087m719N597J1872K0721L0471L8789M2447L3377K9614
10531I25688L2723L2835L3582M3448M4840M2355M8454M9702N2903N3863O6053
$$ plain form
10622 291010 272710 250029 217251 198466 204137 208550 208482 205875 202457 197437 194279 194087 198895 215159
10608 215159 225126 226049 232619 233215 223896 207356 189528 171639 149993 139968 135658 136755 144801
10595 144801 150012 159564 180422 209427 239155 267933 282440 292034 297710 297055 288155 274490 268751
10582 268751 274694 273310 273543 274542 279671 299650 319339 339415 362848 387082 402015 407348 406340
10569 406340 405482 406280 405356 412999 416539 419068 424166 429750 435487 448309 456396 466058 475335 488263
10555 488263 499714 515383 534185 548772 568257 576195 581999 593160 607712 619696 637698 665150
10543 665150 682667 705432 717519 712800 718397 730269 750990 781461 820250 862697 896074 925688
10531 925688 958411 991246 1024828 1068276 1113116 1155471 1203925 1253627 1306530 1360393 1426446
10520A426446Q1206P1385O8250N7614N8970O7487P0885P4360Q5572J04379J09864
10509B276418J17801J28828J35442J56069J68438J76894J98961K28852K61814
10500C849517L13795L71246M22474M93407N89896P08064Q27304R23691J005024
10491I504418J068996J129746J252278J477531J823303K284666K891412L680617
10483B5112967M749618O243463Q365446J1424399J5812147K1863409K9205054
10476A22776503L5396285L5334067K4625559N043554j5853261l0175241l4564686
10469A42582780l1368039k5155393j9076938j4226434j0630738q015598o071352
10462B8038288m618435l534125k708623k094924j620614j296064j110709j017710
$$ plain form
10520 1426446 1507652 1579037 1647287 1704901 1763871 1831358 1902243 1976603 2062175 2166554 2276418
10509 2276418 2394219 2523047 2658489 2814558 2982996 3159890 3358851 3587703 3849517
10500 3849517 4163312 4534558 4957032 5450439 6040335 6748399 7575703 8499394 9504418
10491 9504418 10573414 11703160 12955438 14432969 16256272 18540938 21432350 25112967
10483 25112967 29862585 36106048 44471494 55895893 71708040 93571449 122776503
10476 122776503 158172788 193506855 218132414 223175968 207322707 177147466 142582780
10469 142582780 111214741 86059348 66982410 52755976 42125238 34109640 28038288
10462 28038288 23419853 19885728 17177105 15082181 13461567 12165503 11054794 10037084
10454A0037084r52523q82239p98601o90030n86803n09812m39899l69893l09070
10445D498214k73656k57961k43582k42954k30146k14590j86199j61039j51374
10436B536713j52171j47022j38916j28252j18168j15066j00390q2223p6105o3589
10426A414811n4546m9058l2949l1403m0951m0626m1527l1582k9221l6128l5867
10415I90953k5610j4563j2378j7619j7590l2465l9274l6065m4876l9409k6509
10404F84595j5715p926n497k26j0684j3032k1734j8651j7442j4187j1023j3750
10392E34728j1899n134m18r065q147j0293p131j5984j3300n852j4209k0098r358
10379D03840j8333j5914q729k277m279j032J258M878L260O357P872O822J6456
$$ plain form
10454 10037084 9084561 8202322 7403721 6713691 6126888 5617076 5177177 4807284 4498214
10445 4498214 4224558 3966597 3723015 3480061 3249915 3035325 2849126 2688087 2536713
10436 2536713 2384542 2237520 2098604 1970352 1852184 1737118 1636728 1554505 1478400 1414811
10426 1414811 1360265 1311207 1278258 1246855 1205904 1165278 1123751 1092169 1062948 1026820 990953
10415 990953 965343 950780 938402 920783 903193 870728 831454 795389 750513 711104 684595
10404 684595 668880 660954 655457 655231 644547 631515 609781 591130 573688 559501 548478 534728
10392 534728 522829 517695 517277 508212 500065 489772 482641 466657 453357 447505 433296 413198 403840
10379 403840 385507 369593 360864 358587 354308 353276 354534 359412 362672 369029 376901 383723 400179
10366D00179L1441M5515P1793J16149J86322L17680M45035L68758Q3886k28154
10356A838604l83326l42156k32408j51327r8873o3781n2049l3323k4583k4716
10346D32062k8902k5740j8161j6383j1455j6633j5956j8653k0423r140j1108r467
10334B30041j2012m026j3738q224r806j192o224q638p200J701M072M018J0091
10321A78863N903m662j3098j5918k2646k0809j0238m864N36K590o362p748q993
10308G2554j4305j1833o353L380Q027K411n6o537n076j3812j2861m459n564J362
10294F878J399K868K187K748J1387R380J2421J0701J0228M272J048m894p604n978
10280E7041k379m502k962K505o91L806J1249K950j383N840L017N006K227m031
$$ plain form
10366 400179 431620 477135 548928 665077 851399 1169079 1614114 1982872 2066758 1838604
10356 1838604 1455278 1113122 880714 729387 630514 566733 514684 481361 456778 432062
10346 432062 403160 377420 359259 342876 331421 314788 298832 280179 259756 250616 239508 230041
10334 230041 218029 214003 200265 192041 182235 181043 174819 166181 158981 160682 164754 168772 178863
10321 178863 184766 180104 167006 151088 128442 107633 97395 92531 93067 95657 89295 81547 72554
10308 72554 58249 46416 40063 43443 51470 53881 53825 47288 42212 28400 15539 11080 5516 6878
10294 6878 8277 11145 13332 16080 27467 36847 49268 59969 70197 74469 75517 70623 63019 57041
10280 57041 54662 50160 47198 49703 49012 52818 64067 67017 65634 71474 74491 79497 81724 77693
10266G7693n709q854P00R8L75J847m800j591N698M308L349L621P950n23N557m476
10250H5243l155k279o11J955K317o53j924l166p354j1885k581Q582O561Q721M46
10235H0217r36j289j206Q89P611l43N37M792J891O466O019N149J502Q084m01j0681
10219A08301n433l522p760m835p239j0418n300k945o524j162k758J953M754J866
10205E8978P81M50Q77j119M821J257L314Q751l73n830K45m421N597K645O485P069
10189H9527m90K698J0971M846M2R65M251N876R811J6262J3920J2904J8208K0495
10175B10286K4815K3332J7443J3948R587J1444Q348J4492J7114K6476L5883M4453
10163D57621N0257M7903N6456P3765J01104J42578K01473K74853L68334M98220
$$ plain form
10266 77693 71984 63130 63830 63928 64303 66150 61350 59759 65457 69765 73114 76735 84685 84162 89719 85243
10250 85243 82088 79809 79198 81153 83470 82817 80893 77727 70373 58488 55907 64489 71050 79771 80217
10235 80217 79281 77992 76786 77675 85286 84943 85480 90272 92163 98629 104648 109797 111299 119383 118982 108301
10219 108301 102868 99346 91586 86751 79512 69094 63794 60849 54325 53163 50405 52358 57112 58978
10205 58978 59759 60209 61086 59967 64788 66045 69359 78110 77737 71907 72152 67731 73328 75973 82458 89527
10189 89527 89037 91735 102706 107552 107594 108559 112810 118686 128497 144759 158679 171583 189791 210286
10175 210286 235101 258433 275876 289824 299411 310855 319203 333695 350809 377285 413168 457621
10163 457621 507878 555781 612237 686002 787106 929684 1131157 1406010 1774344 2272564
10153B272564O56836Q20520R58624J101467J182810R92227L93095m53149j174872
10144F750122j489806j376750j045417p29403m98317l48887k52231j81904j26707
10135G00700r7876q0026o3026m3397l4811l1539k7775k3952j9910j8565k2481
10124B37342j6525j7143j3570j7350j0160r045j1776m237p231q576j0842j4207
10112I6680n321K462o860p707P914Q715n241o599K539n7j0282m695M857R34l489
10097G3850l283M937m28n031J969K507l397o699q636j214M565K764N345J0485
10083G7734L012l980K843K895M266q129j0272O207N564P498L548R335N168N078
10069A10767M640R966J9415J3984J8811J9459J5673K2020M0378N6454N9826N2286
$$ plain form
10153 2272564 2929400 3749920 4708544 5810011 6992821 7985048 8378143 7924994 6750122
10144 6750122 5260316 3883566 2838149 2108746 1610429 1261542 1009311 827407 700700
10135 700700 602824 522798 459772 416375 381564 350025 322250 298298 278388 259823 237342
10124 237342 220817 203674 190104 172754 162594 153549 141773 137536 130305 121729 110887 96680
10112 96680 91359 93821 86961 79254 87168 95883 90642 84043 86582 86525 76243 71548 76405 77339 73850
10097 73850 70567 75504 75076 70045 72014 74521 71124 64425 55789 54575 59140 61904 67249 77734
10083 77734 80746 76766 79609 82504 86770 78641 68369 74576 80140 87638 91186 100521 105689 110767
10069 110767 115407 125373 144788 158772 177583 197042 212715 234735 275113 331567 391393 443679
10057D43679M1331K5940K3838M1325P1605J18766J56135J66978J31355L4720p1491
10046A184181j57246j89061j73146j36624j07597q0351n2758l4393l4400l2194
10036A86411j9653j2617j714J014j457J2894L803j999j3168j1885j0848j2637
10024A18144m184j1627j1708r121j1145j5963r54m86O912P003P234J9035K6350
10011A19490O5631J25358J79051J25209j107j17818j66862j22922p2096m1857
10001I2077j6560j1516j0133l342k10n625n593q09j053N806N335O578O378J6069
9987G7402J5489J6821K3953J6896M143m977q193k5795k5676k7462k0466j2058
9975C0077o62q928j1010k013J03l441n550N425j393n921N131L710N084M353j965
$$ plain form
10057 443679 485010 510950 534788 576113 647718 766484 922619 1089597 1220952 1255672 1184181
10046 1184181 1026935 837874 664728 528104 420507 340156 287398 253005 218605 186411
10036 186411 166758 154141 152427 153441 151984 164878 168681 166682 153514 141629 130781 118144
10024 118144 113960 102333 90625 81504 70359 54396 53442 52956 59868 66871 74105 93140 119490
10011 119490 185121 310479 489530 614739 613632 495814 328952 206030 133934 92077
10001 92077 75517 64001 53868 50526 50316 44691 39098 38289 37236 43042 48377 54955 61333 77402
9987 77402 92891 109712 133665 150561 154704 149727 141534 115739 90063 62601 42135 30077
9975 30077 29415 20487 9477 7464 7567 4126 -1424 4001 2608 -3313 1818 5528 10612 14965 13000
9960A3000L55%o2M047K200l625k577j760J83K416j517K266k812J530M207m436
9944A3415q301N784O668P01J79o993m747J927k287m734J934l962k07L5M001M380
9928G793k38n098M292P887K163P454J703o652k868l325L425K026n12k452m999
9913A0599m495L199K046k115m786N88R617K979j662j702J896J834m642o295L143
9898A0204j706L984j091J89J89j947m947n488l475J430M114j143K636o11j71m185
9882b018m138J107L985R412P020m189m141M591L043M51k445o457o197J124N068
9867F216L515L604n199q743M727N014L020Q700O322j227L945k99N435q18r014
9852B5198K247k367r950K158L752l147m398l309K877k043n875K146P256o20m316
$$ plain form
9960 13000 13355 13355 13293 17340 19540 15915 13338 11578 11761 14177 12660 14926 12114 13644 17851 13415
9944 13415 5114 10898 17566 18267 18446 11453 6706 8633 6346 1612 3546 -416 -623 -588 3413 7793
9928 7793 7555 2457 6749 14636 16799 24253 25956 19304 16436 13111 16536 18562 18050 15598 10599
9913 10599 6104 9303 11349 9234 4448 5036 14653 17632 15970 14268 16164 17998 13356 7061 10204
9898 10204 8498 12482 11391 11580 11769 9822 4875 -613 -4088 -2658 1456 313 2949 2338 2167 -2018
9882 -2018 -6156 -5049 -1064 8348 15368 11179 7038 11629 14672 15123 12678 6221 24 1148 6216
9867 6216 9731 13335 8136 -607 4120 9134 12154 20854 27176 25949 29894 29595 35030 34212 25198
9852 25198 27445 25078 15128 17286 21038 17891 13493 10184 13061 11018 5143 7289 14545 13925 9609
9837I609O152Q870n00l418J09o93N60j299K416J546N877O267J0068L567l705L95
9821D5821J0031J4128J5684K0548L0469O8291J11560K05436K95654K96444J41172
9810A255238q6925k59864k96092k25222j35077q1443m8985l2566j7099j7047j0857
9799D4061j0217R2M133j1337J018m155n347j725P300M046M383k323r535n294k687
9784A2413P62q061p622J840R489L523j603j798J128K906J265l145j580M8O584
9769A6149J892R67M978L465m184j458j619K142k919p69m141N090M538J510Q275
9754C3916J1684J4274J8893L758J750o165j2732j0293j5062m162L688n031p377
9741B7141K063J170p21n506m793L174M222m992K015L177J414M64l187K29J388
$$ plain form
9837 9609 15761 24631 24131 20713 20822 20129 20689 19390 21806 23352 29229 35496 45564 49131 45426 45821
9821 45821 55852 69980 85664 106212 136681 204972 316532 521968 817622 1114066 1255238
9810 1255238 1168313 908449 612357 387135 252058 170615 121630 89064 71965 54918 44061
9799 44061 33844 33936 38069 26732 27750 23595 18248 16523 23823 27869 32252 29929 20394 15100 12413
9784 12413 13175 5114 -2508 -668 8821 12344 10741 8943 10071 12977 14242 11097 9517 9565 16149
9769 16149 18041 19008 23986 27451 23267 21809 20190 22332 19413 18644 14503 19593 24131 25641 33916
9754 33916 45600 59874 78767 82525 84275 78110 65378 55085 40023 35861 39549 34518 27141
9741 27141 29204 30374 29653 24147 19354 22528 26750 21758 23773 26950 28364 28828 25641 25870 27258
9726B7258N574Q563K061N194M86j2903m706n396l894J244M885j712N6l105j0562
9711A3043p578j319M11K884L391L09j857m974J343N507k410n292Q80R52q32k083
9695B375M960O230Q688J4063J5933J7464J6461J0553M185N171p454k0721j8168
9682E9740j3696j4052q351q495J114L098l832k68K226p03l808K83j56K085O16
9667A5801j3207p186J452L545K770L763M68o534N001M158M496k450j81l290Q23
9652I429j766L897k014Q600l368q830k087j877j257P442O911j113m087j173L479
9637A2186q88J047l253L430L768N544m006J41r25M56J337l740k471J034n245r62
9621G453M179L201m609k620k252R967L811M649L225p984m197M525K77l602o58
$$ plain form
9726 27258 32832 41395 43456 48650 49136 36233 31527 26131 22237 23481 28366 26654 26710 23605 13043
9711 13043 5465 4146 4557 7441 10832 11141 9284 4310 5653 11160 8750 3458 4338 5290 4458 2375
9695 2375 7335 13565 22253 36316 52249 69713 86174 96727 100912 106083 98629 77908 59740
9682 59740 46044 31992 23641 15146 16260 19358 15526 15258 17484 16781 12973 13256 13100 15185 15801
9667 15801 2594 -4592 -3140 405 3175 6938 7406 872 5873 10031 14527 12077 11896 8606 9429
9652 9429 7663 11560 9546 18146 14778 5948 3861 1984 727 8169 15080 13967 9880 8707 12186
9637 12186 11298 12345 9092 12522 16290 21834 17828 17969 17044 17500 18837 15097 12626 13660 8415 7453
9621 7453 11632 14833 10224 7604 5352 15319 19130 23779 27004 19020 14823 19348 19625 16023 15365
9606A5365J06L033k38n736l500J160N617N287l540n942K648J046k914j865j003
9591I524J014K388O662l356j543l841o00K90m628l378M163J1642R135q83q198
9576A8391q853J658P069L356J5o985k967K768K95K999J508j813k581j528L214
9561A6546P665l593j887N060m251K942K490j138l366L606q57j289j001M700l819
9546B1808Q716M596O085K397J915j116m913m584L526l627m714o94j4426m513M852
9531A5308O159L818L618M748p386j06P879M772j042K289L711l749o189K686R100
9516D5616m350n310o10L367J347M02l044J909Q84j039k048L663L012N60J6021
9501F0380J1936M365k214j0245j0550p103o037J752p029j0727j192K424J653J0584
$$ plain form
9606 15365 15471 18504 18266 12530 9030 10190 15807 21094 17554 11612 14260 15306 12392 10527 9524
9591 9524 10538 12926 19588 16232 14689 10848 10248 10538 5910 2532 6695 18337 27472 26589 18391
9576 18391 9538 11196 18265 21621 21636 14651 11684 14452 14747 17746 19254 17441 14860 13332 16546
9561 16546 24211 20618 18731 23791 19540 22482 24972 23834 20468 24074 23217 21928 20927 25627 21808
9546 21808 30524 35120 41205 43602 45517 44401 39488 34904 38430 34803 30089 29395 14969 10456 15308
9531 15308 21467 25285 28903 33651 26265 26159 34038 38810 37768 40057 43768 40019 33830 36516 45616
9516 45616 41266 35956 35346 38713 40060 40462 37418 39327 40211 39172 37124 40787 43799 44359 60380
9501 60380 72316 76681 74467 64222 53672 46569 40532 42284 35255 24528 23336 25760 27413 37997
9487C7997K877j0327l666J434j122q699J1921P044L146L503k104j0022l419j000
9473B7563k663m372l086m845K35R489L345K457K581L816L437K871K477L748J0
9458D7063k227l935o030j3285k361N584j030J375N56O76p32m155N81K809M896
9443B9785l200j138O207L83j403M769J82k429k652K781j096J071n209q182L8M794
9427B4701L920J982O281K357m959l445q88l453k052P482K653r40N066J966K272
9412D2943p892p377p676k139P454r97O287J490n462L882j808K571m840L670M275
9397C4381L492l028k884j326n269j980O078L861j231n712K682Q543L295o47m601
9382C5654L134o15Q161P08p182k073k119N13j76J1565M492j016J558l045j889
$$ plain form
9487 37997 40874 30547 26881 28315 27193 18494 30415 37459 40605 44108 42004 31982 28563 27563
9473 27563 24900 20528 17442 12597 12832 22321 25666 28123 30704 34520 37957 40828 43305 47053 47063
9458 47063 44836 40901 34871 21586 19225 24809 23779 25154 25710 26386 25654 21499 22080 24889 29785
9443 29785 26585 25447 31654 32037 30634 35403 35585 33156 30504 33285 32189 33260 28051 19869 19907 24701
9427 24701 28621 30603 36884 39241 34282 30837 29949 26496 24444 31926 34579 33639 38705 40671 42943
9412 42943 35051 27674 19998 17859 25313 24316 30603 32093 26631 30513 28705 31276 26436 30106 34381
9397 34381 37873 34845 31961 30635 25366 23386 29464 33325 32094 26382 29064 37607 40902 40255 35654
9382 35654 38788 38173 46334 47042 39860 37787 35668 36181 36005 47570 52062 51046 52604 49559 47670
9367D7670J016n595j639j71k822L25j84J467m230k969L501P826p6j861O313l538
9351D5033l882j955j0014j091M368K919M020o24k880p56j856l425L054j872p91
9336C0248N159N251J640k790n668N391N353n230j139N174N253k78j822n159N640
9321D7023k586j182p86M538j393k851j245P10l838L812J065l636k799M169J0280
9306E1281K423k004K528R08m272L931M60p688R22N643J736l947K610J662L88n25
9290E6056m901j174n630l763J125L610J226j221o03P160M602J633k456L063j902
9275E6825J782P77j976L474M487o366M45k195k61J046k984o829j865M357P608
9260E8325Q211o17L56J233j221q94O891k762m322P366j919m392K679L894p98q047
$$ plain form
9367 47670 48686 43091 41452 41281 38459 38784 38600 40067 35837 32868 36369 44195 44119 42258 48571 45033
9351 45033 41151 39196 29182 28091 32459 35378 39398 38774 35894 35138 33282 29857 32911 31039 30248
9336 30248 35407 40658 42298 39508 33840 39231 44584 39354 38215 43389 48642 48364 46542 41383 47023
9321 47023 44437 43255 42469 47007 45614 42763 41518 42228 38390 42202 43267 39631 36832 41001 51281
9306 51281 53704 51700 54228 55136 50864 54795 55255 47567 48489 54132 55868 51921 54531 56193 56581 56056
9290 56056 51155 49981 44351 40588 41713 45323 46549 45328 44725 51885 56487 58120 55664 58727 56825
9275 56825 58607 59384 57408 60882 65369 59003 59448 57253 56992 58038 55054 48225 46360 50717 58325
9260 58325 66536 65919 66275 67508 66287 65393 72284 69522 65200 72566 70647 66255 68934 72828 72030 63983
9244F3983k886k053m665k761R242R103r3j954K136j016r18J223j646K354M026
9229G4075R45p387j1243M2Q359J425J426K32K131r9N053N986k747n458L655m177
9213G2218J325Q072M366l238l915N397J649O924k787n377O35k878P334J040l592
9198H7173L293O415K246j013k415L455Q9K921k828p106K493O885m989j078L689
9183I9230J260j736k270R35O013k839k469N302q47k38K036M614K971k172j195
9168A08595O005M336P40j084L10J696m396J601P711O620K249R336k494Q30l961
9153A38094l166K86J588N636j471J243N931n753J557n362l483N410m1L799j116
9138A43152l719j360L207j385R832M242l141M341O274L312n89M202j39k611K455
$$ plain form
9244 63983 61097 59044 54379 51618 60860 69963 69870 67916 70052 69036 68118 69341 67695 70049 74075
9229 74075 75020 67633 56390 56432 64791 66216 67642 67874 70005 69906 74959 80945 78198 72740 76395 72218
9213 72218 73543 81615 85981 82743 78828 84225 85874 92798 90011 84634 85269 82391 89725 90765 87173
9198 87173 90466 96881 99127 98114 95699 99154 99243 102164 99336 92230 94723 101608 96619 95541 99230
9183 99230 100490 98754 96484 97419 103432 100593 98124 103426 102579 102341 104377 108991 111962 109790 108595
9168 108595 114600 118936 119676 118592 118902 120598 116202 117803 125514 132134 134383 143719 141225 142055 138094
9153 138094 134928 135214 136802 142438 140967 142210 148141 142388 143945 138583 135100 140510 140469 144268 143152
9138 143152 139433 138073 141280 139895 149727 153969 150828 155169 161443 164755 164166 168368 168229 165618 168073
9123A68073M417K756Q80o649N99P028L199K78l548K262L498M172l902q62j454
9108A80747n170N376J751l585j987l55N183P546O328k364M98O292P945O217O09
9093B15031J520O15l564K663J728k768O54N705k677L371N678L443N849M734K810
9078B44792M540L565k288P167RN658L491n990L819N570m17R012M118l225l400
9063B76421M330N629J946K944q04K772J0865N517K300R255J0235l321k513m957
9049C20619k408O360P186L837Q995N359M093J0778O646j828Q79N181R609J1222
9035C96528Q795P45m423J626M891Q856Q030O162R788P81K082J1636Q303K166M044
9020D70010J473Q314Q645J3556J0622L774L916J3637J3547J3388J4235P915Q240
$$ plain form
9123 168073 172490 175246 176126 169477 170076 177104 180303 180581 177033 179295 182793 186965 183063 182201 180747
9108 180747 175577 180953 182704 179119 177132 176777 181960 189506 195834 193470 193968 200260 208205 214422 215031
9093 215031 216551 217166 213602 216265 217993 215225 215879 221584 218907 222278 227956 231399 237248 241982 244792
9078 244792 249332 252897 250609 257776 257785 263443 266934 260944 264763 270333 269916 278928 283046 279821 276421
9063 276421 280751 286380 288326 291270 290466 293238 304103 309620 311920 321175 331410 328089 325576 320619
9049 320619 318211 324571 331757 335594 344589 349948 354041 364819 371465 369637 370516 375697 385306 396528
9035 396528 405323 406068 401645 403271 408162 417018 425048 431210 440998 441779 443861 455497 463800 465966 470010
9020 470010 471483 479797 488442 501998 512620 516394 520310 533947 547494 560882 575117 583032 591272
9007E91272R655K0832L7414M4219M2318K3564J1836o347k1887j9959j1478K382
8995G23821K076P562J9243P303N830N851J3323J7237J4155K4818K4579J3030J8940
8982H97768K1328J0421J6183J9110K2788K1864K3037L5820L6171L8943M6926N6635
8970A246994O0807M0897K1126j679j2063K849K3266L1603L0412L0971K9608L1689
8958A536480L8764L9777M2826M9027N0262N1236N2083M7285N1627N1243N1797
8947B062407N5557O5923P2555P2881P2211P6385Q8527R3610Q9363R9700J01035
8936B950154J02815J12688J09534J13234J19848J29380J40713J42591J60507J65403
8926D246867J72763J77404J84878J99524K13691K20295K27332K47363K59663K74617
$$ plain form
9007 591272 600927 621759 659173 703392 745710 769274 781110 774763 752876 732917 721439 723821
8995 723821 725897 733459 752702 760005 765835 771686 785009 802246 816401 841219 865798 878828 897768
8982 897768 919096 929517 945700 964810 987598 1009462 1032499 1068319 1104490 1143433 1190359 1246994
8970 1246994 1307801 1348698 1369824 1368145 1356082 1358931 1382197 1413800 1444212 1475183 1504791 1536480
8958 1536480 1575244 1615021 1657847 1706874 1757136 1808372 1860455 1907740 1959367 2010610 2062407
8947 2062407 2117964 2183887 2256442 2329323 2401534 2477919 2566446 2660056 2749419 2849119 2950154
8936 2950154 3052969 3165657 3275191 3388425 3508273 3637653 3778366 3920957 4081464 4246867
8926 4246867 4419630 4597034 4781912 4981436 5195127 5415422 5642754 5890117 6149780 6424397
8916F424397K91231L03767L19499L27634L51492L69649L88023M01994M08004M15816
8906A0001506M30529M44884M58047M56033M47867M44764M35991M30228M20112
8897A3969961L88022L37325K99724K66486K17194J58945R9051M3996j9935p8527
8887A5682242j42500k02834k53921k97157l29291l67779m01486m31303m41938
8878A2814033m46062m53513m58862m50122m45015m38249m25971m10773m01260
8869H884206l82688l66204l47612l31490l23057l08825k93378k77080k64552k45717
8859E743603k32569k29290k09722j90182j81275j83395j71963j67134j52759j40407
8849C884907j28612j20021j05732o6594k5117L2992R2672J01432l464j53225k66000
$$ plain form
8916 6424397 6715628 7019395 7338894 7666528 8018020 8387669 8775692 9177686 9585690 10001506
8906 10001506 10432035 10876919 11334966 11790999 12238866 12683630 13119621 13549849 13969961
8897 13969961 14357983 14695308 14995032 15261518 15478712 15637657 15736708 15780704 15760769 15682242
8887 15682242 15539742 15336908 15082987 14785830 14456539 14088760 13687274 13255971 12814033
8878 12814033 12367971 11914458 11455596 11005474 10560459 10122210 9696239 9285466 8884206
8869 8884206 8501518 8135314 7787702 7456212 7133155 6824330 6530952 6253872 5989320 5743603
8859 5743603 5511034 5281744 5072022 4881840 4700565 4517170 4345207 4178073 4025314 3884907
8849 3884907 3756295 3636274 3530542 3463948 3438831 3471823 3564495 3665927 3662463 3509238 3243238
8838C243238k83166k28164j67588j32885j14948r0653q0402p4773o1541o4457
8828A944661n7330n5544n3571n8046n0023n0081m7553m4553m4868m2498l0017
8817A410577l4992l0128l1162l5048k6173l3476l0210k6964k4304k2602l1095
8806A084423k6392j9667j8285j4048j9021k5492k2098k2776k3260j8402j9483
8795H55499j9217j2114j4393j0333j2039j0215j8467j5356j2764k1722j6519j5578
8783F76782p291m030n822j0998q134j0779j0749j6676j2228j509j1586j1652p495
8770E57833l793k697r936j5733q432r108p311o810o201l898q144p721n196l798
8756D59055j2200p682o822r62m047j0220j2132l072o182o531J844N64q684j3098
$$ plain form
8838 3243238 2960072 2731908 2564320 2431435 2316487 2225834 2145432 2070659 2009118 1944661
8828 1944661 1887331 1831787 1778216 1720170 1670147 1620066 1572513 1527960 1483092 1440594 1410577
8817 1410577 1375585 1345457 1314295 1279247 1253074 1219598 1189388 1162424 1138120 1115518 1084423
8806 1084423 1058031 1038364 1020079 1006031 987010 961518 939420 916644 893384 874982 855499
8795 855499 836282 824168 809775 799442 787403 777188 758721 743365 730601 708879 692360 676782
8783 676782 669491 665461 659639 648641 640507 629728 618979 602303 590075 588566 576980 565328 557833
8770 557833 554040 551343 541407 525674 517242 508134 500823 494013 487812 483914 475770 468049 462853 459055
8756 459055 446855 439173 432351 431389 427342 417122 404990 401918 395736 389205 391049 391613 382929 369831
8742C69831n387n362J41q374o280m025j0734p005r177k697m06m743j515k010o803
8727B95454p80l055n472k178o291n881n514l010K085l196k124k141o2k982k842
8712B52011o718j688n022J098J799k204q097m471l842m992K167J566N387j403
8698B25591k704l520j641r166j946R275m654m071j090k102m224J025m707j984
8684A94082K84l476j284M932j247n193M236K346l484l425l515K397L958J897m912
8669A87596j588j958o583o410p3k287M831N347m542n399K460K468j864P6K36K669
8653A74979m457n603m085N193O88o116l279K569j57N704N60n210M263M816K587
8638A72452j0434p558R477L880l743p87K610l506k795n137j176l324K157J433
$$ plain form
8742 369831 364444 359082 359223 350849 344569 340544 329810 322805 313628 310931 310525 305782 304267 302257 295454
8727 295454 294674 291619 286147 283969 277678 271797 266283 263273 265358 262162 260038 257897 257835 254853 252011
8712 252011 245293 243605 238583 239681 241480 239276 231179 226708 222866 217874 220041 221607 226994 225591
8698 225591 222887 219367 217726 208560 206614 215889 211235 207164 206074 203972 199748 200773 196066 194082
8684 194082 194366 190890 189606 194538 193291 188098 192334 194680 191196 187771 184256 186653 190611 192508 187596
8669 187596 186008 184050 177467 171057 170984 168697 173528 178875 174333 168934 171394 173862 171998 172074 172310 174979
8653 174979 170522 164919 160834 166027 166715 160599 157320 159889 159732 165436 165996 160786 165049 169865 172452
8638 172452 162018 154460 163937 167817 164074 163287 165897 162391 159596 154459 153283 149959 152116 153549
8624A53549m186L679J7m451k43J463Q166K774J0114Q153J3816L4890N3571P4293
8610C55605P8736L4546m1865p7504o5895m2604k1403j6993j9895n057L792n240
8598A76223J98K384J81n912m988N588J294m725J0745N379J527J124L590M588M155
8583B01351L078J0600J0868M072J3677K1173J5303Q227J5369K0461K7486L0686
8571C82351L2300M4331N5717P6262J23413K02122K48095J92026J28155J77257
8561A662029M12814O75335N37243K1594n17379p69325o44798m04756k43289j55187
8551E74281j00814p5352n7052l1839k3834k9886j6021j903M95r679r663n010j1938
8538B01785k934N68J2859J3781J6352L4649M4043L6163K0800n175j3565q613Q706
$$ plain form
8624 153549 149363 153042 153059 148608 148365 149828 157994 160768 170882 179035 192851 227741 281312 355605
8610 355605 434341 468887 427022 349518 283623 241019 219616 202623 182728 177671 181463 176223
8598 176223 176421 178805 178986 173074 168086 173674 174968 170243 180988 186367 187894 189018 192608 197196 201351
8583 201351 204429 215029 225897 229969 243646 264819 280122 288349 303718 324179 351665 382351
8571 382351 414651 458982 514699 590961 714374 916496 1164591 1356617 1484772 1662029
8561 1662029 2074843 2750178 3287421 3309015 2791636 2022311 1377513 972757 729468 574281
8551 574281 473467 398115 341063 309224 285390 255504 239483 237580 238075 228396 218733 213723 201785
8538 201785 198851 199419 212278 226059 242411 277060 321103 357266 378066 372891 359326 350713 359419
8525C59419J5873L7726O0876J05569J65314K29163L08679M62937Q22175J400798
8515C968529J493725O09845n62658j388206j391277r31511n58068l44524k18318
8506F77537j47306j06790p0241m3000l0283k7226j5055n811n779j5046j8473j0008
8494A82519k389K978N867Q892K3495M4731O6485O4043J9908k3889n3120m5377
8482B94143k5443j2606k552R079J8535L8023N9918J01277J76137L14318N67388
8471A538217P66292N45028N656n11422p13035n59826l47646k10840j26736q2621
8461C03067n8763m8264l1096k2761q498J498M14l302n639q494j0002o705L316
8448A04771N375n94K638J2628J9163K7421J8450m128k9004l7603k4504j3076q784
$$ plain form
8525 359419 375292 413018 473894 579463 744777 973940 1282619 1745556 2567731 3968529
8515 3968529 5462254 6072099 5509441 4121235 2729958 1798447 1240379 895855 677537
8506 677537 530231 423441 353200 310200 279917 252691 237636 231825 226046 211000 192527 182519
8494 182519 180130 183108 188975 197867 221362 266093 332578 396621 416529 392640 339520 294143
8482 294143 268700 256094 253542 262621 281156 319179 379097 480374 656511 970829 1538217
8471 1538217 2304509 2849537 2855193 2343771 1630736 1070910 723264 512424 385688 303067
8461 303067 244304 196040 164944 142183 133685 135183 135597 132295 126656 118162 108160 101455 104771
8448 104771 110146 109552 112190 124818 143981 171402 189852 185724 156720 119117 94613 81537 72753
8435G2753L206q945j0899M86k80k39j164k538l251n34j46J968K025K524k352n578
8419D7036j789O065O905K271j1823q582K243K912J000p4K54j421M152j232p025
8404D0892k008j229M697j926K929L941p955M570R558k133l068l466J772p134L383
8389D2823P988L453J162L392j645j430K934k666j955j914j637M51O232J3586J3825
8374H4599J2419J1098K814j3573j4606j7448q059j702O91n468o987N42K767O295
8360E3382J805l818j212j516j2026L666L333J389l288m690K123J964M301K986
8346D8399k385N073k699K777L29o843J494j237J220K626l290j78J616L128J4112
8331F4142K2657K6048K8002J4890P272j6153l4732k7591j6228r239q355o745p556
$$ plain form
8435 72753 75959 67014 56115 56601 56321 56082 54918 52380 49129 48595 48449 50417 52442 54966 52614 47036
8419 47036 45247 51312 58217 60488 48665 40083 42326 45238 46238 46164 46418 44997 49149 47917 40892
8404 40892 38884 37655 42352 40426 43355 47296 39341 43911 53469 51336 48268 44802 46574 39440 42823
8389 42823 50811 54264 55426 58818 57173 55743 58677 56011 54056 52142 50505 50956 57188 70774 84599
8374 84599 97018 108116 110930 97357 82751 65303 57244 55542 56233 50765 43778 44320 47087 53382
8360 53382 55187 51369 50157 48641 36615 40281 43614 45003 41715 37025 39148 41112 45413 48399
8346 48399 46014 51087 48388 51165 51494 44651 46145 44908 46128 48754 45464 45286 46902 50030 64142
8331 64142 86799 112847 140849 155739 163011 146858 112126 84535 68307 59068 50713 43968 36412
8318C6412q54R153K194j3l238N988J2598Q166N862R578K5393L6014M2598K6033
8304B15884O936k0504m4112l6993k3476k0288j0068r184n126m337o650K670P313
8291E2065J433l856m24J740N407O413Q512Q514J0144J560L90m464j2898j2334
8277F2202r695k490K229j670k422P165k643p805J641J0582J8844K4665L6410M0407
8263A77420K4617n2k8843m2258l8618k2809j3440o17j0329r04r12r775q298o977
8249A8205K007N132M001K384j177L344n498J729K466m759m631r278p612K378L465
8234A2156O862J221n282m147M361O311j510J307J310O30o661n476Q461P675l077
8219B4141j451l954l824P53L216k020l273L780J151p94j764l159m522K822Q460
$$ plain form
8318 36412 35558 44711 46905 46892 43654 49642 62240 70406 76268 85846 111239 147253 189851 215884
8304 215884 222820 202316 158204 121211 97735 77447 67379 58195 53069 48732 42082 44752 52065
8291 52065 53498 49642 49218 50958 56365 62778 71290 79804 89948 91508 91898 87434 74536 62202
8277 62202 52507 50017 52246 50576 48154 55319 52676 44871 46512 57094 75938 100603 137013 177420
8263 177420 202037 201985 173142 130884 92266 69457 56017 55400 45071 44167 43255 33480 25182 18205
8249 18205 20212 25344 29345 31729 30552 33896 28398 30127 32593 27834 23203 13925 6313 8691 12156
8234 12156 19018 20239 14957 10810 15171 21482 19972 21279 22589 23219 16558 11082 19543 27218 24141
8219 24141 22690 18736 14912 15665 18881 16861 13588 17368 18519 17725 15961 12802 8280 11102 19562
8204A9562O09J165j684r504p66N666K110J972k478L02L018N069J491m797m320
8189A7415k241K125k638m74k453O291J878k752K143J111J458l58p131l110r36
8174A0328m830M246J197K359K281N21j909l113m787M992Q896P794j167M97L001
8159C0306J490k335m625j622J511R89p352p724o44n515j153p94M270M252l374
8144G680J297j699k346L009L942R6l653Q099m886l418J187N641j551j474N436
8129A7360M99o628K091O186K106j101K67o656K04O792N570J583O046N484j395
8114C8408j081k751n421m660K71m908J712l21M25O589j579k323J001Q94j108k889
8098B2259L76k724j345L590J56Q106N644M454q296j1789j902M83n866M52K378
$$ plain form
8204 19562 20171 21336 19652 10148 9382 15048 17158 19130 16652 16954 19972 25041 26532 21735 17415
8189 17415 15174 17299 14661 14187 11734 18025 19903 17151 19294 20405 21863 21505 14374 11264 10328
8174 10328 5498 9744 10941 13300 15581 16102 14193 11080 6293 11285 20181 27975 26808 27305 30306
8159 30306 31796 29461 24836 23214 24725 25714 18362 10638 9994 4479 3326 2532 6802 11054 7680
8144 7680 8977 7278 4932 7941 11883 11979 8326 16425 11539 8121 9308 14949 13398 11924 17360
8129 17360 17859 11231 13322 19508 21614 20513 20780 14124 14328 21120 26690 28273 34319 39803 38408
8114 38408 37327 34576 29155 24495 24766 19858 21570 21249 21674 28263 26684 24361 25362 26256 25148 22259
8098 22259 22635 19911 18566 22156 22312 30418 36062 40516 32220 20431 18529 19012 13146 13598 15976
8083A5976J482k852M556L702N100m25p092m462R92j064K571N867R014m98q085
8068B4782q079p495j54N109N717l414o63P011n97k795l800K180l926k975K442
8053A3343L703o688k368k72k576n029o93K976Q802K136N154M136k912J264n224
8038A5752k210J430q17K326L756r10N6m807j949N501n22K527k133j127J576J325
8022A9774J1780K9l093K284K023N658o807m204p846j814J0590N170m668K405j514
8007B9767k044L925r96l410r34Q53l687M233L297p536m761L325P465l912k817
7992B2768j429Q393N220J763r41K823L019K176l69k501l734k901L463k270P042
7977D2522P11r01P622O724k526l362M534N781N905J688n957l883j7N5K196m900
$$ plain form
8083 15976 17458 14606 19162 22864 27964 27539 20447 15985 16977 15913 18484 24351 33365 32867 24782
8068 24782 16703 9208 9054 14163 19880 16466 15803 22814 22217 19422 15622 17802 13876 10901 13343
8053 13343 17046 10358 7990 7718 5142 113 -580 2396 11198 13334 18488 22624 19712 20976 15752
8038 15752 13542 14972 14155 16481 20237 19327 19383 14576 12627 18128 17606 20133 18000 16873 18449 19774
8022 19774 31554 31583 28490 30774 32797 38455 31648 27444 19598 17784 28374 33544 28876 31281 29767
8007 29767 27723 31648 30652 27242 26308 27161 23474 27707 31004 23468 18707 22032 29497 25585 22768
7992 22768 21339 29732 34952 36715 35774 38597 41616 43792 43423 40922 37188 34287 37750 35480 42522
7977 42522 43233 42332 49954 56678 54152 50790 55324 61105 67010 68698 62741 58858 58841 58896 61092 56192
7961E6192m846R19P178p44j0852n548k058K678o674O26J24k655J85J718K968J972
7945D1183J514L171m56J858o87L247J833l200M811M195O900K882j094m838j467
7930E9852J964N962N558o532M21M408P160M56j350j989l620n258q885m159P922
7915F1910k544q706j350l417o643j769M36j325r52N971M783l188j306M08l244
7900C9064l331j596m860q371J749P459N287O893M001K697M37l984K112P81o22
7885D7716j973l248K589K929M592p022j498r55k751l92J430n372n019K150L935
7870C7111m228j777m41r347k1L340m206j147J148l291l601K890p81K716Q46j149
7854A8062J59l836J477j591O2N268K294m03Q26Q89K45o049K32m20n476QM47m685
$$ plain form
7961 56192 51346 52265 59443 58699 47847 42299 40241 42919 36245 36871 36995 34340 34525 36243 39211 41183
7945 41183 42697 45868 45412 47270 46583 49830 51663 48463 53274 57469 64369 67251 66157 61319 59852
7930 59852 61816 67778 73336 66804 67225 71633 78793 79249 77899 75910 72290 67032 58147 53988 61910
7915 61910 59366 50660 49310 45893 39250 37481 37917 36592 35640 41611 46394 43206 41900 42308 39064
7900 39064 35733 34137 29277 20906 22655 30114 35401 42294 46295 48992 49429 45445 47557 48338 47716
7885 47716 45743 42495 45084 48013 52605 45583 44085 43130 40379 39987 41417 36045 31026 33176 37111
7870 37111 32883 31106 30665 21318 21297 24637 20431 19284 20432 17141 13540 16430 15649 18365 19211 18062
7854 18062 18221 14385 15862 14271 14333 19601 21895 21492 22318 23207 23452 17403 17635 17215 11739 11747 12194 7509
7836G509M262J492K577J967o193n95l398P33O261J231L568o458m182Q083M046
7821B0903o157j198n35m778q080j624Q233p6N053K752n427p92J723J417L721R07
7805A6042l807j753Q39J067K01j377m245J831M04p993m472J347R360K797p49m430
7789E062k976M667k890q80j706K871P14p2J586j439J130n192j055p303p35J637
7773f581k367O04K026p48M274m950M624L702M010p60O216j411o90k576l669n025
7757c321L444l911r01K849O398R96M41j822n871L502M925m412n343l007k674L362
7741e345P968M279l971l81K117M067o934m204j329k007l454M974K798l186J047
7726c561L387J282k327j1k180Q505N361q19n718p405j533l737K455j83k112P092
$$ plain form
7836 7509 11771 13263 15840 17807 11614 11019 7621 8354 14615 15846 19414 12956 8774 16857 20903
7821 20903 14746 13548 13013 8235 155 -1469 6764 6688 11741 14493 9066 8274 9997 11414 15135 16042
7805 16042 12235 10482 11321 12388 12589 11212 6967 8798 9202 1209 -3263 -1916 7444 10241 9492 5062
7789 5062 2086 6753 3863 2983 1277 4148 4862 4790 6376 4937 6067 875 -180 -7483 -8218 -6581
7773 -6581 -8948 -8344 -6318 -7066 -2792 -7742 -3118 584 4594 3834 10050 8639 7949 5373 1704 -3321
7757 -3321 123 -3788 -4689 -1840 4558 5554 5995 4173 -1698 1804 6729 2317 -3026 -6033 -8707 -5345
7741 -5345 2623 6902 2931 2550 4667 8734 1800 -2404 -3733 -5740 -9194 -4220 -1422 -4608 -3561
7726 -3561 -174 1108 -1219 -1230 -3410 5095 10456 9637 3919 -3486 -5019 -8756 -6301 -6484 -8596 -1504
7710a504j315n7J676L604P44J31P61l610m481k422P995m863n98k66O908J908m066
7693E45L734M73o423j244K804k304l149L465K331P518L496p327n808l772N719
7678E8j700j574j384N96m100k42l953K262P689m885L715Q457j689p480l015l292
7662a0537J1123M097l169n209n100J25N215K823L516j023M73K28P7M189K051K142
7646A1021L042J354m612m718k690k53K987L174Q16O00j135l900l471m817J36j0604
7630a3070n659Q318M399l357J316n61l655K583K330M457j129l170j083L564k117
7615f834L037k67J244l98n996m10L034J490q633j0630J0352N796k148J739j328
7600i952M344L657M955J358k202l1p1o843q869O94L219L389L069M191J381l57
$$ plain form
7710 -1504 -2819 -2876 -1200 2404 3148 3279 4040 430 -4051 -6473 1522 -3341 -3939 -4205 2703 4611 545
7693 545 4279 4752 -1671 -2915 -111 -2415 -5564 -2099 232 7750 11246 3919 -1889 -5661 58
7678 58 -1642 -3216 -4600 -4004 -8104 -8346 -12299 -10037 -2348 -7233 -3518 4939 3250 -4230 -7245 -10537
7662 -10537 586 4683 1514 -3695 -8795 -8670 -3455 -632 2884 1861 2334 2562 2639 6828 8879 11021
7646 11021 14063 15417 10805 6087 3397 3144 6131 9305 10121 10721 9586 5686 2215 -2602 -2466 -13070
7630 -13070 -18729 -10411 -6012 -9369 -8053 -8614 -12269 -9686 -7356 -2899 -4028 -7198 -8281 -4717 -6834
7615 -6834 -3797 -4064 -2820 -3218 -9214 -9624 -6590 -5100 -13733 -24363 -14011 -8215 -10363 -8624 -9952
7600 -9952 -5608 -1951 3004 4362 2160 2129 2058 -4785 -13654 -12960 -9741 -6352 -3283 908 2289 1932
7584A932j199o640m794N709P608L892N919o449l799k936M92J194p524J604O674
7569A683L881Q366J87p868o531J696n861Q20P814K14o848N029L94m374k797j623
7553e818N999k233M65k226L067n001J002P16n570k20O603J248K190L838m171o104
7537f215k22l785O799J722j494j137m666m534m137J380Q295L550m581J334J058
7522f633M963p17n848j396N453J984j067j910j289k386j570M435J196j053k642
7507h480J672K164J481p57m279M498L546k233l599n37J399n521l946K84N483j302
7491a0127l418N885j48J452O892L077j539n253k061N200j71k143J430J726n439
7476d637J491N035m198J459L774j871l648K885J296l309p46r133p769O622P928
$$ plain form
7584 1932 733 -5907 -10701 -4992 2616 6508 12427 5978 2179 -757 -265 929 -6595 -4991 1683
7569 1683 5564 13930 14117 6249 -282 1414 -4447 -3627 4187 4401 -2447 2582 2976 -1398 -4195 -5818
7553 -5818 181 -2052 -1587 -3813 -746 -5747 -4745 -4029 -9599 -9819 -3216 -1968 222 4060 -111 -6215
7537 -6215 -6437 -10222 -3423 -1701 -3195 -4332 -8998 -13532 -17669 -16289 -7994 -4444 -9025 -7691 -6633
7522 -6633 -1670 -2387 -8235 -9631 -4178 -2194 -3261 -5171 -6460 -8846 -10416 -5981 -4785 -5838 -8480
7507 -8480 -6808 -4644 -3163 -3920 -8199 -3701 -155 -2388 -5987 -6524 -5125 -10646 -14592 -14308 -8825 -10127
7491 -10127 -13545 -7660 -7808 -6356 536 3613 2074 -3179 -5240 -40 -211 -2354 -924 802 -4637
7476 -4637 -3146 1889 -2309 -850 2924 1053 -2595 290 1586 -1723 -2469 -11602 -19371 -12749 -4821
7461d821N112M137L248o341o242j881j140m39J058M621J532J0823o298j3241p092
7446a6964K573R407M766m08k223N166J520l154m216m250k803Q5K561j085O40l205
7430a1590M64k304J19k027L05J412J841O610K233n836k954l406k045O12N704k769
7414a3631k906L613M638j548Q587J766o586m188K810L721M53n665K854j321l03
7399g706R552M733p438q413L591M62n531n74j18K663k675k438L672K432p67K029
7383f526J77o218J820N411j058l516J108K655L28K872L37K960K189l651k650o05
7367d367p54k303M679J620n256N90k478K851R397K139n208j042p196n814j540
7352a4682J310O59M001R50J63l522m946j822N51P139L67K684N096o17P851n93
$$ plain form
7461 -4821 291 4428 7676 1335 -4907 -6788 -7928 -8367 -7309 -2688 -1156 9667 3369 -9872 -16964
7446 -16964 -14391 -4984 -218 -626 -2849 2317 3837 683 -3533 -7783 -10586 -10501 -7940 -9025 -8385 -11590
7430 -11590 -11126 -13430 -13311 -15338 -15033 -13621 -11780 -5170 -2937 -8773 -11727 -15133 -17178 -16566 -10862 -13631
7414 -13631 -16537 -12924 -8286 -9834 -1247 519 -6067 -10255 -7445 -3724 -3271 -8936 -6082 -7403 -7706
7399 -7706 1846 6579 -859 -9272 -5681 -5219 -10750 -11324 -11442 -8779 -11454 -13892 -10220 -7788 -8555 -6526
7383 -6526 -6349 -12567 -10747 -5336 -6394 -9910 -8802 -6147 -5819 -2947 -2610 350 2539 -1112 -3762 -4367
7367 -4367 -5121 -7424 -2745 -1125 -6381 -5791 -8269 -5418 3979 6118 910 -132 -7328 -13142 -14682
7352 -14682 -13372 -12713 -8712 -7762 -7599 -11121 -16067 -17889 -17338 -10199 -9832 -7148 -2052 -2669 5182 4589
7336D589n68j426n951j221L463L62l680l102L473K647j935n720n39qP283M036
7320A703l05k225P82l484m857k785L858J0442Q28o181O78j232K846q95n609j0504
7304a6940J622J305l3k671O012L763p665k332L915M500r89K762L316l021M143
7289b313K238J90m464J11k273l321L113M322M607K365J334N676M42n130q696n343
7273g142K641L65M909O61R88k514r125J147N716L847L660J923J30n435j180O92
7257A283l04m898J497k883m435j852J046L795J664K485J249N701k74r604p240
7242a2770n706M788M497j91J180M079P297J945j741M7k191m04M24l875o839K085
7226g375J3243J472p81J600j57j0658o89M54l143k630N31K295M186m16J826j247
$$ plain form
7336 4589 4021 2595 -3356 -4577 -1114 -752 -4432 -7534 -4061 -1414 -3349 -9069 -9608 -9616 -2333 1703
7320 1703 1398 -827 -45 -3529 -8386 -11171 -7313 3129 3957 -2224 -1546 -2778 68 -827 -6436 -16940
7304 -16940 -15318 -14013 -14046 -16717 -10705 -6942 -14607 -16939 -13024 -8524 -9513 -6751 -3435 -6456 -2313
7289 -2313 -75 115 -4349 -4238 -6511 -9832 -6719 -2397 2210 4575 5909 11585 12027 6897 -1799 -7142
7273 -7142 -4501 -4136 773 1434 2422 -92 -9217 -8070 -2354 1493 5153 7076 7206 1771 591 1283
7257 1283 979 -3919 -2422 -5305 -9740 -11592 -10546 -6751 -5087 -2602 -1353 4348 4074 -5530 -12770
7242 -12770 -18476 -13688 -9191 -9382 -8202 -4123 3174 5119 3378 3425 1234 830 1254 -2621 -9460 -7375
7226 -7375 5868 7340 6559 8159 8002 -2656 -3345 -2891 -6034 -8664 -8133 -5838 -1652 -2068 -242 -1489
7210a489K626j069k348N329J759l891j0598k185Q140j566k72N063M155J53N27
7195D334N936K880q993r772K592O214Q2j914p937k358N947R68j388k828j736n99
7179h572K921J36r57k892p78O067N412j908l843k73J843k249J632M05l050p796
7163a3902j082L672k922o75M500K617J327L85K67J048m496K123L467J445J274
7148i52o703j152R342q97l222J440J000K37L206j017j575n766J010L094K139J757
7132A941k899n65L477k581K961M754K193j170o736r663m002J358J93L615O56J869
7116d599L743M003l274o427j0853m647Q435Q194P422N594l452j0052m67M419O96
7101a265j427l927O283l394k281p96M758k009l089n371m54O767M739K544j303
$$ plain form
7210 -1489 1137 68 -2280 3049 4808 917 -9681 -11866 -3726 -5292 -5564 -501 3654 3807 4334
7195 4334 10270 13150 4157 -5615 -3023 3191 3273 1359 -6578 -8936 -2989 -2021 -3409 -6237 -7973 -8572
7179 -8572 -5651 -5515 -6472 -9364 -10142 -4075 1337 -571 -4414 -4687 -2844 -5093 -3461 -3056 -6106 -13902
7163 -13902 -14984 -11312 -14234 -14909 -10409 -7792 -6465 -6080 -5813 -4765 -9261 -7138 -3671 -2226 -952
7148 -952 -7655 -8807 535 -362 -3584 -2144 -1144 -907 2299 1282 -293 -6059 -5049 -1955 184 1941
7132 1941 -958 -1523 1954 -627 2334 7088 9281 8111 1375 -8288 -12290 -10932 -10739 -7124 -6468 -4599
7116 -4599 -856 3147 -127 -6554 -17407 -22054 -13619 -5425 1997 7591 4139 -5913 -6380 -1961 -1265
7101 -1265 -2692 -6619 -336 -3730 -6011 -6807 -2049 -4058 -7147 -12518 -12972 -6205 -1466 1078 -225
7086b25j003n053J198l75m265K486L403k46J902q290j788J6407J1593k236o833
7071F675l774M762J509o650o023l272P64p47k294M699J141l058N127N626k072
7056B413r11j88L016m272n230K834p80L109R98n394J677N974J267j495l299j044
7040a325M102P41m174n869l842l862N715j839O49M393L986q19k388j257n225P155
7024c859O502k439N36j64K32m234o925J93J818J250L112k261K145J453m318J8
7008f941J2489L650q086p928j35J030J057O156K683k508l672M53J157L396l721
6993i20l702n908M284P556l78j978o001O701L92o424R70J127N744L18n153O93
6977b679M865q514J777K873n771l861p2M35l913o352O011O258m52P0q982j843
$$ plain form
7086 -225 -1228 -6281 -5083 -5458 -9723 -7237 -3834 -4080 -2178 -10468 -12256 4151 15744 13508 6675
7071 6675 2901 7663 9172 2522 -3501 -6773 -6009 -6756 -9050 -4351 -3210 -6268 -1141 4485 2413
7056 2413 1502 1314 4330 58 -5172 -2338 -3118 -9 989 -4405 -2728 3246 4513 3018 -281 -1325
7040 -1325 2777 3518 -656 -6525 -10367 -14229 -8514 -10353 -9704 -5311 -1325 -2144 -4532 -5789 -11014 -3859
7024 -3859 2643 204 740 576 808 -3426 -10351 -10158 -8340 -7090 -3978 -6239 -4094 -2641 -6959 -6941
7008 -6941 5548 9198 1112 -6816 -6951 -5921 -4864 1292 3975 1467 -2205 -1752 -595 2801 -920
6993 -920 -4622 -10530 -6246 1310 932 -1046 -7047 -346 46 -6378 -5408 -4281 1463 1781 -3372 -2679
6977 -2679 2186 -6328 -4551 -1678 -7449 -11310 -11382 -10947 -14860 -21212 -15201 -8943 -9395 -9325 -18307 -20150
6961b0150O166N00K227J198l489J278m548K540J4590Q28m908m104m666J244r2
6946a1386j848M972L028N80l190k564O570l369n362P603L908k521M115N581m231
6931A886K011M502k171m579K392M658N80n58k561m150L95N604j317m523j2397
6916a0228K962J145m903J368L214J071q67j561Q2P260J544o352m746m051j588
6901a5650M753p00J920N535m166J035J337m152L835O584L087J035j829k784k863
6886c023L079j261O99n51K690P449N067j4283n144J39J410O69k744L35p89j764
6870h022j260k348P870L022n7j467M003J580k573k656l378l542p55J479L622o656
6854a1138j925L644L24O01k964k178P89O847N425m001M209L769O56l526m875J7
$$ plain form
6961 -20150 -13984 -13484 -11257 -10059 -13548 -12270 -16818 -14278 312 1140 -3768 -7872 -12538 -11294 -11386
6946 -11386 -13234 -8262 -5234 -4654 -7844 -10408 -3838 -7207 -12569 -4966 -1058 -3579 536 6117 1886
6931 1886 3897 8399 6228 1649 4041 8699 9279 8721 6160 2010 2405 8009 6692 2169 -10228
6916 -10228 -7266 -6121 -11024 -9656 -6442 -5371 -6238 -7799 -7717 -457 1087 -5265 -10011 -14062 -15650
6901 -15650 -10897 -11597 -9677 -4142 -8308 -7273 -5936 -10088 -6253 331 3418 4453 2624 -160 -3023
6886 -3023 56 -1205 -506 -1057 1633 9082 14149 -134 -5278 -5139 -3729 -3060 -5804 -5469 -6258 -8022
6870 -8022 -9282 -11630 -3760 -738 -795 -2262 1741 3321 748 -1908 -5286 -8828 -9583 -8104 -4482 -11138
6854 -11138 -13063 -9419 -9095 -8494 -11458 -13636 -12847 -6000 -575 -4576 -367 3402 4058 532 -4343 -4326
6838d326m76m418k111O525k469k295J401m131o505n24K883K747J3243K325q188
6823f319j171M627l211o775l054J020K349O22O924M187p61k161k57J962N97J311
6807a10K45o150m139O070k115n209K524l75J056j567O499r96N84J855K639l930
6791c119R89M885j2963j64M119n967J192R139j883k252L366O101r38m704L637
6776A438L678J260N19m01r15P3O174l941l141J719o64k178M874J677r644k118
6760a590M862k052m521j597k983N212L004n029Q86k849l462p16j457m389L766
6745a2915J172J958M44O195L164O634P28m0k65l854o478K327K352j234o451k54
6729f517R489J695m855N8O125O904L44m747l179m074r6Q529R80K29K064K579K622
$$ plain form
6838 -4326 -4802 -9220 -11331 -4806 -7275 -9570 -8169 -12300 -18805 -19329 -16446 -13699 -456 1869 -6319
6823 -6319 -7490 -2863 -6074 -12849 -15903 -14883 -12534 -11912 -4988 -801 -1562 -3723 -3980 -2018 -1421 -110
6807 -110 135 -6015 -10154 -4084 -6199 -11408 -8884 -9259 -8203 -9770 -3271 -4267 -3683 -1828 811 -3119
6791 -3119 -2130 2755 -10208 -10372 -6253 -12220 -11028 -1889 -3772 -6024 -2658 3443 2505 -2199 1438
6776 1438 5116 6376 6895 6494 5579 5652 11826 7885 4744 6463 5799 3621 8495 10172 528 -1590
6760 -1590 3272 1220 -3301 -4898 -7881 -2669 335 -4694 -3808 -6657 -10119 -10835 -12292 -16681 -12915
6745 -12915 -11743 -9785 -9341 -3146 18 6652 7380 7340 7075 3221 -3257 -930 1422 188 -6263 -6517
6729 -6517 2972 4667 -188 -130 5995 12899 13243 8496 5317 1243 1147 9676 10656 10885 12949 15528 18150
6712A8150k218N87l838N34Q283K211L1k770N167O679Q651P615K42m619q424p373
6696B8908q822j0085p468j919K386j582m83k041j853p007n20J204k052p71J855
6681a0250j312N127J5001N774m399m601q455j573J581Q66M279k1P31j343L699
6666E104n958r585J877K638j918n721N186o34M98j205l602j658J74O579J066m89
6650g648l495N491M547K528L88p18M001l497k168j881n129m37j87P408j549m114
6634f460k634l811l775J090R802O484M56N18P59J206L067J434j23m540k391k367
6618a285r67k477r73O836L666j492J787k754o935l797l963L384k055O500P29n554
6602i350J280J454k61K570k659l610L558L808M647L5M281o45m669J988J194l117
$$ plain form
6712 18150 15932 16519 12681 13215 21498 23709 23740 20970 26137 32816 41467 49082 49324 44705 36281 28908
6696 28908 20086 10001 2533 614 3000 1418 935 -1106 -2959 -9966 -10486 -9282 -11334 -12105 -10250
6681 -10250 -11562 -6435 8566 14340 9941 5340 -3115 -4688 -3107 -2241 2038 2017 2748 1405 5104
6666 5104 -854 -10439 -8562 -5924 -7842 -13563 -8377 -9011 -8513 -9718 -13320 -14978 -14804 -8225 -7159 -7648
6650 -7648 -11143 -5652 -1105 1423 1811 1093 5094 1597 -571 -2452 -7581 -8018 -8205 -797 -2346 -6460
6634 -6460 -9094 -12905 -16680 -15590 -5788 696 1152 1670 2429 3635 6702 8136 8013 3473 1082 -1285
6618 -1285 -2252 -4729 -5702 1134 4800 3308 5095 2341 -4594 -8391 -12354 -8970 -11025 -4525 -3796 -9350
6602 -9350 -8070 -6616 -6877 -4307 -6966 -10576 -7018 -3210 1437 1472 5753 5108 439 2427 3621 504
6586E04O85k401l189l787r408r21k761K24J666O553N890K929J733j770l552R737
6570B132K571m512j0027m37J874R00n128R374O966m841o463J093q44O189N718
6555D565k227n544k902Q89j635n44k125j15J053j642k306j512J1418j654l080
6540g361j667j63l722M088L172j299l886K032k048k751r89k718k084q90M498P844
6524g944K992J519N33j852M18j304J415K101L900M51k018l424m543P567K687j719
6508G79m258r701q60O348M694m117N6J381K180n709L81K941k934p860j554K736
6492a5497Q168J284M671K59k446J16L821n81l930n02L538m554m70J442K337R68
6476a376p457n642k486M727Q434O968K805p065n001O0M005K491l271j457J046
$$ plain form
6586 504 1189 -1212 -4401 -8188 -17596 -18517 -21278 -21054 -19388 -12835 -6945 -4016 -2283 -4053 -7605 2132
6570 2132 4703 191 -9836 -10273 -8399 -7499 -12627 -3253 3713 -1128 -7591 -6498 -7342 -1153 4565
6555 4565 2338 -3206 -6108 -5219 -6854 -7398 -9523 -9638 -8585 -10227 -12533 -14045 -2627 -4281 -7361
6540 -7361 -9028 -9191 -12913 -8825 -5653 -6952 -10838 -8806 -10854 -13605 -14594 -17312 -19396 -20286 -15788 -7944
6524 -7944 -4952 -3433 -2900 -4752 -4334 -5638 -4223 -2122 1778 2229 211 -3213 -7756 -189 2498 779
6508 779 -3479 -13180 -14040 -7692 -2998 -7115 -7059 -5678 -3498 -9207 -8826 -5885 -8819 -16679 -18233 -15497
6492 -15497 -7329 -6045 -1374 -1115 -3561 -3445 376 -205 -4135 -4637 -1099 -5653 -6123 -4681 -2344 -1376
6476 -1376 -8833 -14475 -16961 -12234 -3800 3168 5973 -1092 -6093 -6033 -2028 463 -2808 -4265 -3219
6461c219K893O87N536l734o238N032j368J114m630l379O812N021L899L261o357
6446E330m940L210j548K956k232l330M000n148J010J185M91L824R17M92l058l271
6430a12k762j651J463p535j827K825N948R99n303R81L395L661n432r963L191K742
6414i380L190K273J171n021n510R466O307k435r851m628k260K793q77j21P405
6399g478P067l546n236k513L083m5r804k031j56L347O260N190O26J603K600k356
6383c389l57j260J559N412j732L920m58j523m359m417O135K895j630K252K306
6368E354o631p897j472J097J030M004O850n087p357m476R30N125M219j327l085
6353h723n906L309L005k241L448N106L233J508j985q359j864k365j596O022P912
$$ plain form
6461 -3219 -326 361 5897 2163 -4075 957 -411 703 -3927 -7306 -494 4527 8426 11687 5330
6446 5330 390 3600 2052 5008 2776 -554 3446 -1702 -692 493 984 4808 5725 6217 3159 -112
6430 -112 -2874 -4525 -3062 -10597 -12424 -9599 -3651 -2652 -7955 -6974 -3579 82 -5350 -15313 -12122 -9380
6414 -9380 -6190 -3917 -2746 -7767 -13277 -3811 2496 61 -9790 -14418 -16678 -13885 -14762 -14883 -7478
6399 -7478 -411 -3957 -9193 -11706 -8623 -8668 -18472 -20503 -20659 -17312 -11052 -5862 -5236 -3633 -1033 -3389
6383 -3389 -3746 -5006 -3447 1965 233 4153 3695 2172 -2187 -6604 -469 2426 796 3048 5354
6368 5354 -1277 -9174 -10646 -9549 -8519 -4515 2335 -2752 -10109 -14585 -13655 -8530 -4311 -5638 -8723
6353 -8723 -14629 -11320 -8315 -10556 -7108 -2002 1231 2739 754 -7605 -9469 -11834 -13430 -7408 504
6338E04O028l528m440m560l390J470K973j437N129J0595Q59l036J892n123n571
6323a635l503n593l196M548K591j887O26j275r14K383K627N457q69n457J865o68
6307d900q532O689J08p178N582J0748O31j313m262m073M854N132J110m578j984
6292a966j512j53M115M512m717j958l972q569M22O253j222L040M890k228r69L835
6276a99l79o214k302l316k028o94L031P525P572k840R26O54p53o70J439L035n142
6259c55j064J2274k389p347o246m12R57K977L301P1K553R32l778p622k72j017
6243g437O013J1613K935m993k601m860p885r685J434L893M671O435o763k464K660
6228g034k99j659l536J707L799k451j71N958N696N474N470K46q568j0375j612
$$ plain form
6338 504 6532 3004 -1436 -5996 -9386 -7916 -4943 -6380 -1251 9344 10203 7167 9059 3936 -1635
6323 -1635 -5138 -10731 -13927 -9379 -6788 -8675 -8049 -9324 -10238 -7855 -5228 229 -640 -6097 -4232 -4900
6307 -4900 -13432 -6743 -6635 -13813 -8231 2517 3148 1835 -2427 -6500 -1646 3486 4596 18 -1966
6292 -1966 -3478 -3631 484 4996 279 -1679 -5651 -14220 -13798 -7545 -8767 -5727 -837 -3065 -4034 -199
6276 -199 -578 -6792 -9094 -12410 -14438 -15132 -12101 -4576 2996 156 1082 1736 983 313 1752 4787 -355
6259 -355 -1419 10855 8466 1119 -5127 -5539 -4582 -1605 1696 1767 4320 5252 1474 -6148 -6420 -7437
6243 -7437 -1424 10189 13124 8131 5530 670 -7215 -16900 -15466 -11573 -6902 -467 -7230 -9694 -7034
6228 -7034 -7333 -8992 -12528 -10821 -7022 -9473 -9644 -3686 2010 7484 12954 13200 4632 -5743 -7355
6213g355M330O399M722K718J053j359q065m181j369L260J116K925p148p975K694
6198h235K30J112n52q89j299j274L008J29m851K479K291j801L069k799K95o50
6182i737K569J737m01m475J710L522O509l8j44j110n44J744K588M81p10k811j492
6165f02l707K904j244k756J648j948m627n590O736K901o041J538L694K527L369
6150a198K78j606j451M099m204m121K273Q709J843K340q323p03L659K642p747
6135c510q46m106k712k239k01k748J483Q028L235M02M672j612o913j281K113J92
6119f043j319J037O262j436K743L8q746K909N415k112n620m898R100p01l68K12
6103c527m02p089j339L35P136K103m525m936K23L718L268M511J277p471p083L854
$$ plain form
6213 -7355 -3025 3374 8096 10814 11867 10508 2443 -1738 -3107 153 1269 4194 -2954 -10929 -8235
6198 -8235 -8005 -6893 -7445 -8334 -9633 -10907 -7899 -7770 -12621 -10142 -7851 -9652 -6583 -9382 -9087 -9737
6182 -9737 -7168 -5431 -5832 -10307 -8597 -5075 1434 1396 1252 142 -402 1342 3930 4411 3701 890 -602
6165 -602 -4309 -1405 -2649 -5405 -3757 -5705 -10332 -15922 -9186 -6285 -12326 -10788 -7094 -4567 -1198
6150 -1198 -920 -2526 -3977 122 -4082 -8203 -5930 2779 4622 6962 -1361 -2064 1595 4237 -3510
6135 -3510 -4356 -8462 -11174 -13413 -13614 -16362 -14879 -6851 -3616 -3214 1458 -154 -7067 -8348 -6235 -6043
6119 -6043 -7362 -6325 -63 -1499 1244 1282 -7464 -4555 860 -1252 -6872 -11770 -2670 -3371 -3739 -3527
6103 -3527 -3929 -11018 -12357 -12022 -4886 -2783 -7308 -12244 -12021 -8303 -5035 -524 753 -6718 -13801 -9947
6087i947l59m436K195M810k048J0408L234l304L796m934n559o23m188n924L810
6072a3069R142M398n505l064j702j958l085R45R277o023p668K771J1184P152n789
6057b994l277Q135P292l534j206m668L476j895k39M772N208k88n327o412P314
6042F357K594l322j980K40J64m509o46N047N71k218K663J125L379k56m649m579
6026a9J882n419K230N733l052l430k338N947J0170K71m97k273m758M888M248n026
6010H557n399m396o260J884K353J343k022M92L884j512J390k2j65K56l491m94
5994c602O163J185K30K370M94J321j824o06m371m763J154J147P252J95k509r03
5978B933o163L360K673L33L162k167n191J374O83J802k540l701K556J829M027
$$ plain form
6087 -9947 -10306 -14742 -12547 -7737 -9785 623 3857 553 4349 -585 -6144 -6767 -10955 -16879 -13069
6072 -13069 -3927 471 -5034 -8098 -9800 -11758 -14843 -13898 -4621 -10644 -18312 -15541 -4357 2795 -2994
6057 -2994 -6271 1864 9156 5622 4416 -252 3224 1329 1090 5862 11070 10782 5455 -957 6357
6042 6357 8951 5629 3649 3889 4053 -456 -1102 3945 4516 2298 4961 6086 9465 9209 4560 -19
6026 -19 1863 -3556 -1326 4407 1355 -2075 -4413 1534 11704 11975 11478 9205 4447 9335 13583 8557
6010 8557 3158 -1238 -7498 -5614 -3261 -1918 -3940 -3448 436 -1076 314 292 127 383 -3108 -3602
5994 -3602 2561 3746 3976 6346 6840 8161 6337 5731 1360 -3403 -2249 -1102 6150 6345 3836 2933
5978 2933 -3230 130 2803 3136 6298 4131 -1060 314 997 2799 259 -3442 -886 943 4970
5963D970j792j597N159J518k959j707k13k663k142k49L304l534K310K554J678
5948D637J975l300j565m554K515m795N59L576J740k65K518M589o013n999Q25L846
5932B89N500n443n442n052j367N400L550J801l306N741M712K739q242l869N860
5917B871L152J719o296j0733l881l71J0341K451k064j044j817l123J294O45J586
5902e270Q568p953o947L131M175j051p743O808N696m014k068J533J833L090M2
5887a70j53k798l821L168L538Q22K733k390l176o201L680L467J452J557J468K464
5871E640j891r267L35p69N281L518l853n329P93L160p355k725M667J572j240k32
5855g695K667M656l264l672J195j456J040P084l328m949k823N259K905r79N259
$$ plain form
5963 4970 3178 1581 6740 8258 5299 3592 3379 716 -1426 -1675 1629 -1905 405 2959 4637
5948 4637 6612 3312 1747 -2807 -292 -5087 -4528 -952 788 523 3041 7630 1617 -4382 -3557 289
5932 289 5789 346 -5096 -10148 -11515 -6115 -2565 -764 -4070 1671 6383 9122 880 -2989 2871
5917 2871 6023 7742 1446 -9287 -13168 -13539 -3198 -747 -2811 -3855 -5672 -8795 -7501 -6856 -5270
5902 -5270 3298 -4655 -11602 -8471 -4296 -5347 -13090 -6282 -586 -4600 -6668 -5135 -3302 -212 -170
5887 -170 -323 -3121 -6942 -3774 -236 586 3319 929 -2247 -8448 -4768 -1301 151 1708 3176 5640
5871 5640 3749 -5518 -5183 -5952 -671 2847 -1006 -6335 -5542 -2382 -9737 -12462 -7795 -6223 -7463 -7695
5855 -7695 -5028 -372 -3636 -7308 -6113 -7569 -6529 555 -2773 -7722 -10545 -5286 -2381 -3360 1899
5840A899K324n900p566k250Q014L109q970o305J923l70r87q6K831L249M990N088
5824I93k439o066m25R21l83J883N86J631O97m925P401J596n10j247l868r88N3
5807e090k158m26L204Q10l389l107j69L902J40Q87L957O498k23K932L938j1684
5791B2j1817n235K253N446L880P610k612o75K287P86l567J507N694P36n007j871
5775e63L836J680l537J832j439n240l346M070N275P104l920o020q275J854L9J376
5759e274K484J814m82J902k830m968J361Q265K43p423k516K548l827m31L990p02
5743e846o220r82m943m112N350M537L196L64N20J008L194l008K82l750J314L69
5727h727K962L349k67j378Q05M224j5637j347J1905O920q621l63k003k948K968
$$ plain form
5840 1899 4223 -1677 -9243 -11493 -3479 -370 -9340 -15645 -13722 -14092 -15079 -15165 -12334 -9085 -4095 993
5824 993 -1446 -7512 -7937 -7016 -7399 -5516 -4930 -3299 -2602 -7527 -126 1470 960 -287 -4155 -5143 -5090
5807 -5090 -7248 -7674 -4470 -3660 -7049 -10156 -10325 -6423 -6283 -5396 -1439 5059 4836 7768 11706 22
5791 22 -11795 -17030 -14777 -9331 -5451 2159 -453 -1128 1159 1945 -1622 -115 5579 6315 1308 -563
5775 -563 3273 4953 1416 3248 1809 -3431 -6777 -2707 2568 9672 5752 -268 -8543 -6689 -6650 -5274
5759 -5274 -2790 -976 -1458 444 -2386 -7354 -5993 2272 2515 -4908 -7424 -4876 -8703 -9134 -5144 -5846
5743 -5846 -12066 -13048 -17991 -22103 -16753 -12216 -9020 -8656 -8136 -7128 -3934 -6942 -6660 -10410 -9096 -8727
5727 -8727 -5765 -2416 -2683 -4061 -3256 968 -14669 -16016 -4111 2809 -5812 -6175 -8178 -11126 -8158
5712h158p727kK191K680J488l563k643O59O988O097k299J038L25o296n45k409
5696a2176l394J22q02l973R121K553j88k475r35p31j762j925k66P854J661K33
5680g083N535m420j236J059K728J1L374J310m120n511L905M02P246k097p860o208
5664a2965M240Q72n691K688P778k162n003n467L014Q828L262O48K575K308N496
5649A0421L741n124q410M587o915l725j267N84P037k101r275j539m377M473m0
5634a1930K469O137P42K958N15m289j1345j431K601N610P019N79J322L103l550
5619E10Nl438n197o655M92l988P409P777j517j2837l159P227O778M97K50N250
5603e96r19l430q143J616K075R90l752r37O604L635J067J348k908j198k62n633
$$ plain form
5712 -8158 -15885 -15887 -13696 -11016 -9528 -13091 -15734 -15075 -8087 -1990 -4289 -3251 -2926 -9222 -9767 -12176
5696 -12176 -15570 -15448 -16250 -20223 -11102 -8549 -8737 -11212 -12147 -12878 -14640 -16565 -16831 -8977 -7316 -7083
5680 -7083 -1548 -5968 -7204 -6145 -3417 -3406 -32 1278 -2842 -8353 -4448 -4046 3200 1103 -6757 -12965
5664 -12965 -8725 -7853 -13544 -10856 -3078 -5240 -10243 -15710 -12696 -3868 -606 42 2617 4925 10421
5649 10421 14162 9038 628 5215 -1700 -5425 -6692 -6108 929 -1172 -10447 -11986 -16363 -11890 -11930
5634 -11930 -9461 -3324 -2582 376 891 -3398 -14743 -16174 -13573 -7963 -944 -365 957 4060 510
5619 510 515 -2923 -8120 -14775 -14283 -18271 -10862 -3085 -4602 -17439 -20598 -13371 -6593 -6096 -5846 -596
5603 -596 -1515 -4945 -13088 -11472 -9397 -8407 -12159 -13096 -6492 -2857 -1790 -442 -3350 -4548 -4810 -10443
5587a0443K117N412J951j756n116k866K435J919K64j17j703N222k563n692k771
5572a3707N68R194L694k165M62k282l157J204J0698M117k770k879l033m265o093
5557a0414L806N423p927n138n054L86Q37R084R067l206k506o588q249k802J3572
5542i709K189p69J112O93k315o243K650j490O17J078L028m191m138N865O571J579
5526c473J564j725L542j619m286R375M697m825K894j897J799n312M1l59J669r35
5510A150N934J535n923p119j987L954Q00k784n326K853O91N372o24k357O939K200
5494E308j2368n800j443K611K819M014L537M047l149l051K124m443j476N56L832
5479b882p10l320o62k927m052Q917j436n82O52k599j047J680j01k785L997k83
$$ plain form
5587 -10443 -8326 -2914 -963 -2719 -7835 -10701 -8266 -6347 -6083 -6200 -7903 -2681 -5244 -10936 -13707
5572 -13707 -13139 -3945 -251 -2416 -1954 -4236 -7393 -6189 4509 8626 5856 2977 -56 -4321 -10414
5557 -10414 -6608 -1185 -9112 -14250 -19304 -18918 -18081 -8997 70 -3136 -5642 -12230 -20479 -23281 -9709
5542 -9709 -7520 -8289 -7177 -6484 -8799 -15042 -12392 -13882 -13265 -12187 -9159 -13350 -17488 -11623 -5052 -3473
5526 -3473 -1909 -3634 -92 -1711 -5997 3378 8075 3250 6144 4247 6046 734 775 416 2085 1150
5510 1150 7084 8619 2696 -4423 -6410 -2456 -1656 -4440 -9766 -6913 -6222 -850 -1474 -3831 3108 5308
5494 5308 -7060 -12860 -14303 -11692 -8873 -4859 -1322 2725 -424 -3475 -1351 -5794 -7270 -6714 -2882
5479 -2882 -3592 -6912 -7574 -10501 -14553 -5636 -7072 -7654 -7002 -9601 -10648 -8968 -9069 -11854 -7857 -8140
5463h140k685J559N92N597J702k730K746O768L604m631n42m866p234k084K861
5448g483O491l030l471m47P13l35j747Q21P50K755k63L402k625l163r05n1m059
5431a2647O490J810K826N01k110k59K764l386O064P581R36q93p540J419L510m781
5415B285m497m606j012J513M943m495J529P172J687j5873m239R122Q035K940n897
5400a393k303J149K984l165n324o211K273j799j42N428K921l196j80j59J949Q550
5384A382J490o489o474L757k055k441o213M961P368l211o420J141J398K726K128
5369f952k95n94R579L06l823l135p02K957K339R007K939l739o164k668k082L63
5353b664o084n50M973j436J201r27K302N708k804r33o618m179L351K817m711L673
$$ plain form
5463 -8140 -10825 -9266 -8674 -3077 -1375 -4105 -1359 5409 9013 4382 3840 -1026 -8260 -10344 -7483
5448 -7483 -992 -4022 -7493 -7940 -7227 -7562 -9309 -8488 -7738 -4983 -5246 -1844 -4469 -7632 -8537 -8588 -12647
5431 -12647 -6157 -4347 -1521 -1020 -3130 -3389 -625 -4011 2053 9634 10570 9677 2137 3556 7066 2285
5415 2285 -2212 -6818 -7830 -6317 -1374 -5869 -4340 2832 4519 -11354 -15593 -6471 1564 4504 -1393
5400 -1393 -3696 -2547 437 -2728 -8052 -14263 -11990 -13789 -13931 -8503 -5582 -8778 -8958 -9117 -7168 1382
5384 1382 2872 -3617 -10091 -6334 -8389 -10830 -17043 -12082 -4714 -7925 -14345 -13204 -11806 -9080 -6952
5369 -6952 -7247 -7841 1738 2044 -1779 -4914 -5616 -2659 -320 8687 11626 7887 1723 -945 -3027 -2664
5353 -2664 -8748 -9298 -4325 -5761 -4560 -5487 -3185 2523 -281 -1214 -7832 -12011 -8660 -5843 -10554 -6881
5337f881M69j639M764J438M251n180o899o332j867J1282K75k736O801P614r10
5322D450L919j758m70J987J931l282J75J580j53n187r811l851m663J841N825J365
5306f102k886j526L738P285l975j0510j657M561Nj128J292Q196P497N756m495
5291F051n708M648K618L107k372l476p144L091M568m60j0464k756k413k166J959
5276a0917L174k306j569N487M384L563J87K116k27l320o111l433k645L92N129
5261f096P727o27m97N959j323o409k042R403J2359M5j4509o501m78o547K315O162
5245a059m02J803L293j503k824m127l232R42j984P157P133K903k815o613j529
5230b857M037P432l019P05M128l873m940Q38R3m05K533j672l921m89M037M24n30
$$ plain form
5337 -6881 -6412 -8051 -3287 -1849 2402 -2778 -9677 -16009 -17876 -6594 -6319 -9055 -2254 5360 4450
5322 4450 8369 6611 6141 8128 10059 6777 6952 8532 8379 3192 -6619 -10470 -15133 -13292 -7467 -6102
5306 -6102 -8988 -10514 -6776 509 -3466 -13976 -15633 -11072 -11067 -12195 -10903 -2707 4790 10546 6051
5291 6051 343 4991 7609 10716 8344 4868 -2276 815 5383 4923 -5541 -8297 -10710 -12876 -10917
5276 -10917 -7743 -10049 -11618 -6131 -1747 1816 2003 4119 3892 572 -5539 -8972 -11617 -11225 -6096
5261 -6096 1631 1004 507 6466 5143 -1266 -3308 6095 18454 18499 3990 -2511 -2989 -9536 -7221 -1059
5245 -1059 -1461 342 3635 2132 -692 -4819 -8051 -7109 -9093 -1936 5197 8100 5285 -1328 -2857
5230 -2857 1180 8612 5593 6298 10426 6553 1613 2451 2544 2139 4672 3000 -921 -1410 2627 3051 2521
5213B521k949Q06k777m395O28R149l037n269k472L552R90q93N465P260O341l621
5197A1299p254j214J495o17l236j183j835r06N346m446r168J600Q742j149O50
5182a876N150L29l334k8P32J11L001K872n498m447J739j158o377l80l829M066
5166h927M73j628L895k770m681M26k510N635N645M446l144k411m102o56J203Q279
5150h27M336q950M324k821L866M976l27L82o516m336l44M718j399K961J931L220
5134E194K616n550m840K654o67q599l163o27N989N967M335N069L032j36p104k452
5118A718n703k681M937P480o06n440o140j181j960J480K733J675j002j123K327
5103c486J512Q75M8O460o120q165N786P692l017n960O594m38l737j459Q95l775
$$ plain form
5213 2521 -428 378 -2399 -6794 -6166 2983 -54 -5323 -7795 -4243 -3253 -4146 1319 8579 14920 11299
5197 11299 4045 2831 4326 3709 473 -710 -2545 -3451 1895 -2551 -11719 -10119 -1377 -2526 -1876
5182 -1876 3274 3603 269 241 973 1084 4085 6957 1459 -2988 -1249 -2407 -8784 -9164 -12993 -8927
5166 -8927 -8454 -10082 -6187 -8957 -13638 -13212 -15722 -10087 -4442 4 -3140 -5551 -9653 -10309 -9106 -827
5150 -827 3509 -5441 -1117 -3938 -72 4904 4577 4959 -1557 -5893 -6237 -1519 -2918 43 1974 5194
5134 5194 7810 2260 -2580 74 -593 -9192 -12355 -12982 -6993 -1026 3309 8378 11410 11274 4170 1718
5118 1718 -3985 -6666 -1729 5751 5145 -295 -6435 -7616 -9576 -8096 -5363 -3688 -4690 -5813 -3486
5103 -3486 -1974 -1099 -1051 5409 -711 -8876 -3090 4602 1585 -4375 2219 1781 -1956 -3415 -2520 -6295
5087f295j306K580M32J87P608J412m72j990k295n785L643K571l63K267m867O012
5071C339M101j505l955n2q541l559L69K941j35M768J581l555o73J618P22j851
5055d387l751N67K584P979K918n414o954j817J887N918l889m459j770N162R329
5040C903N076m813o302l651M57P997M234N08q23o584j30l140k269N528m46l1n54
5023a040l314M574K194K442J082l027j006m534n55o675j050J0066p116j36J242
5008f853N173Q175K893n967m880j653j46j776K799J129M686k450q339o54R013
4993A150Q232M482J564m433p313p771q371M219m73N10k484J815P541K334m33o42
4977g3o460k539r33j080q195K898N608R69o01n471J046Q483Q462k817R27L286
$$ plain form
5087 -6295 -7601 -5021 -4589 -4402 3206 4618 4146 2156 -139 -5924 -2281 290 -73 2194 -2673 3339
5071 3339 7440 5935 1980 1928 -6613 -10172 -9803 -6862 -6997 -2229 -648 -4203 -4876 -3258 -2536 -4387
5055 -4387 -8138 -7571 -4987 2992 5910 496 -6458 -8275 -6388 -470 -4359 -8818 -10588 -5426 3903
5040 3903 8979 4166 -2136 -5787 -5330 2667 6901 7409 6586 2 -128 -3268 -5537 -9 -455 -486 -1040
5023 -1040 -4354 220 2414 4856 5938 2911 1905 -2629 -3184 -9859 -10909 -843 -7959 -8095 -6853
5008 -6853 -1680 6495 9388 3421 -1459 -3112 -3258 -5034 -2235 -1106 3580 1130 -7209 -7863 1150
4993 1150 9382 13864 15428 10995 3682 -4089 -12460 -8241 -8714 -8204 -10688 -8873 -1332 1002 569 -73
4977 -73 -6533 -9072 -10005 -11085 -19280 -16382 -10774 -9805 -10406 -15877 -14831 -6348 2114 -703 224 3510
4961C510o697k90M900J414k849p42M188k675J227J615j268n764m065M585J007
4946a904o571k791L49J268j067J665O752l034L798K422m157k334j785L428j312
4931e273M164N005j443O224P888Q39k718o719M29j606r312m663M156j547k220
4916f796J721n02l5M85M875k165J49J045j548k904O81k199J164k522k643M092
4900g102k672M15k294l422K147j200M053L120n429q726L549N865L084l200k764
4885a4576Q224K834k8m9K046J473l172J434K739l66n431l167L748K870o552J848
4869f125R361o103q553L219L533K476M765L256R726k687r940j764L745J858J930
4854H697l451K27p93O648J666j1000m539j89r9M725l481p96n269k526j37J477
$$ plain form
4961 3510 -3187 -3477 1423 2837 -12 -754 3434 759 1986 3601 2333 -3431 -7496 -2911 -1904
4946 -1904 -8475 -11266 -10917 -9649 -10716 -9051 -2299 -5333 -1535 887 -3270 -5604 -7389 -3961 -5273
4931 -5273 -1109 3896 2453 8677 16565 17404 14686 7967 8396 6790 -2522 -7185 -3029 -4576 -6796
4916 -6796 -5075 -5577 -5612 -5127 -252 -2417 -2268 -1223 -2771 -5675 -4994 -7193 -6029 -8551 -11194 -7102
4900 -7102 -9774 -9359 -11653 -15075 -12928 -14128 -10075 -6955 -12384 -21110 -17561 -11696 -8612 -11812 -14576
4885 -14576 -6352 -3518 -3546 -3595 -1549 -76 -3248 -1814 925 559 -4872 -8039 -4291 -1421 -7973 -6125
4869 -6125 3236 -2867 -11420 -8201 -4668 -2192 2573 5829 15555 12868 2928 1164 4909 6767 8697
4854 8697 5246 5473 4680 11328 12994 1994 -2545 -2734 -2833 1892 -1589 -2385 -7654 -10180 -10317 -8840
4838h840N791N929l227m044l834p083L188M257N919k877o286k953k584m137N168
4823a5613J1486k290k532Q015k78J758j222J258l330p848M180J0141M323j0055
4809b007l296j702J640K783K990L370m126J162k098K523m043l817p346L191Q217
4794b559O489J560k243p575R10J075j275l224m41M374M276Q284k410j565j894
4779C782J829N26O58J475l398m862m523l890j468L732K59j968k279m986L020M530
4763g563m63P72P857P59L28m781k631l296N303O72J934O697k160j317j226N21
4747A406o36j955K955L249o753l860J821j626J839M285O699J332l813p561L32
4732b286M95O727k929j1361m906L159R582O469P588k865l688N124O62r97l685
$$ plain form
4838 -8840 -3049 2880 -347 -4391 -8225 -15308 -12120 -7863 -1944 -4821 -11107 -14060 -16644 -20781 -15613
4823 -15613 -4127 -6417 -8949 -934 -1212 546 -676 582 -2748 -10596 -6416 3725 8048 -2007
4809 -2007 -5303 -7005 -5365 -2582 408 3778 -348 814 -1284 1239 -2804 -6621 -13967 -10776 -2559
4794 -2559 3930 5490 3247 -4328 -3418 -2343 -3618 -6842 -7283 -2909 1367 9651 7241 5676 3782
4779 3782 5611 6137 6795 8270 4872 10 -4513 -8403 -9871 -6139 -5880 -7848 -10127 -15113 -12093 -7563
4763 -7563 -8026 -7254 603 1362 1690 -3091 -5722 -9018 -3715 -3043 -1109 5588 3428 2111 885 1406
4747 1406 770 -1185 1770 5019 -1734 -5594 -3773 -5399 -3560 725 7424 8756 4943 -2618 -2286
4732 -2286 -1791 4936 2007 -9354 -14260 -11101 -1519 4950 12538 9673 5985 11109 11771 10774 7089
4717G089K512K050k735r15J323m13j328j395l549R77n060o45L379j481M892j273
4701C428J086m758k883j737L025K443K34k711m038j93N851L41m269J511J936l816
4685d550k886J804L01q81N504M177J964k305n59P99m191m454p164j252K961M470
4669f262N569R973j45l73l570m405j1270l619M118N805N569K152j657O099j912
4654F072k329J674k299m280k941R0K631M157J754j001O24O065M571m522n132j402
4638C732J704K231M665o263o790L669L213J422l056k254k850J439j30o295m266
4623i829l648N883R25k200k285j795R147Q408O75n994n074P080J046k267j537
4608a465j391L109k603n862K700K10J160K389O802k319o47Q2P90K582J523K337
$$ plain form
4717 7089 9601 11651 8916 8001 9324 8911 7583 6188 2639 3616 -1444 -2089 1290 -191 4701 3428
4701 3428 4514 -244 -3127 -4864 -1839 604 838 -1873 -5911 -6104 -253 88 -4181 -2670 -734 -4550
4685 -4550 -7436 -5632 -5331 -6212 -708 3469 5433 3128 2569 3368 -823 -5277 -12441 -13693 -10732 -6262
4669 -6262 -693 9280 9135 8762 5192 787 -10483 -14102 -9984 -4179 1390 3542 1885 7984 6072
4654 6072 3743 5417 3118 -1162 -4103 -4013 -1382 2775 4529 3528 4152 10217 14788 10266 5134 3732
4638 3732 5436 7667 12332 6069 -721 2948 6161 7583 4527 2273 -577 862 732 -5563 -9829
4623 -9829 -13477 -7594 -6669 -8869 -11154 -12949 -3802 4606 5281 -713 -5787 1293 2339 72 -1465
4608 -1465 -2856 253 -2350 -8212 -5512 -5302 -4142 -1753 5049 2730 2083 2165 2955 5537 7060 9397
4592I397J431m490k514R01n505J959L663R85k649n775j232k178j329N750P44j507
4576b349o092o69k34P74m33k004L236K729P010J864l02n81m420n484J484N373
4560i8L610k16l350o737p240j01L655O834M374n82j067J00l458j738p1J939O673
4543B527j304p56J032k488L855k984L369Q401l744r098j766l770j70l908L63P569
4527b872K62l6K109P371L548P1J297J986n580l865K41P54l960n383K386L443N277
4510G049o522n286M24M11n725N104m998J622k304k88Q07L998N234M775J499o901
4494a101j327L830r48o747l795m421N78L858m73P603Q822q3j989M76m038j968
4478a723J10k49P1p08q181m460o842L104M627P579J659K389O828J690k135K288
$$ plain form
4592 9397 10828 6338 3824 4725 -780 1179 4842 5827 3178 -2597 -3829 -6007 -7336 -1586 -842 -2349
4576 -2349 -8441 -9110 -9344 -8570 -9003 -11007 -7771 -5042 1968 3832 3530 2949 -1471 -6955 -5471 -98
4560 -98 3512 3296 -54 -6791 -14031 -14132 -10477 -3643 731 149 -918 -818 -4276 -6014 -6085 -4146 2527
4543 2527 1223 467 1499 -989 2866 -118 3251 11652 7908 -1190 -2956 -6726 -6896 -10804 -10441 -2872
4527 -2872 -2610 -2646 -537 6834 10382 10453 11750 13736 8156 4291 4532 5286 1326 -4057 -1671 1772 7049
4510 7049 527 -4759 -4335 -3924 -9649 -4545 -9543 -7921 -10225 -10513 -9706 -5708 -474 4301 5800 -1101
4494 -1101 -2428 1402 454 -6293 -10088 -14509 -13931 -10073 -10546 -2943 5879 5796 3807 4283 245 -1723
4478 -1723 -1613 -1862 -1791 -2499 -10680 -15140 -21982 -18878 -14251 -6672 -5013 -2624 4204 5894 3759 6047
4462F047P07m236l718J251m036m012l918K801O827l581k912O622J615m333j049
4447e925J514N674K39L543L762l610o54L386K002K545N197j580l718p712j798
4432B865R18J210R90n20n765p066j628p059L928M702K665j094M122J288J358l246
4416b332p630k450O384J506P575Np791n083M604N878l602q698j362K182N649o42
4400e807K345k126k97Q623M637L384k904k025N78p010n660M894N613o163m260
4385f178O494j927m167j0099O11L949J714o56K191K112p1Q18l740l70r7L351L625
4368b440k166M564O58o037n15Q069p05m967k651k86J271p943K184J674K539p03
4352g454M3N98R27K146L513r44j463q59N73k340L885J305N045j225k042K299j881
$$ plain form
4462 6047 6754 2518 -1200 51 -3985 -7997 -11915 -9114 -2287 -5868 -8780 -2158 -543 -4876 -5925
4447 -5925 -4411 1263 1502 5045 8807 5197 4543 7929 9931 12476 17673 16093 12375 4663 2865
4432 2865 3783 4993 5983 5463 -302 -7368 -8996 -16055 -12127 -7425 -4760 -5854 -1732 -444 914 -2332
4416 -2332 -9962 -12412 -6028 -4522 3053 3058 -4733 -9816 -5212 666 -2936 -11634 -12996 -10814 -5165 -5807
4400 -5807 -3462 -5588 -5885 2738 7375 10759 7855 5830 6408 -602 -6262 -1368 4245 -1918 -6178
4385 -6178 316 -1611 -5778 -15877 -15266 -11317 -9603 -10259 -8068 -5956 -6027 -5209 -8949 -9319 -9416 -6065 -2440
4368 -2440 -4606 -42 616 -5421 -5936 2133 1428 -3539 -6190 -6476 -5205 -13148 -10964 -9290 -6751 -7454
4352 -7454 -7411 -6813 -5886 -3740 -227 -1171 -2634 -3493 -2920 -5260 -1375 -70 4975 3750 1708 4007 2126
4335B126m679Q2n294j113l477J707P548j006j170J1234O922k352K046j450k620
4320H504l968p92k136l913J201L572p281R64J427L351j918J497k405o643k143
4305a0683N694R143M068k706l141jn565o761L161Q166M97J953l232p435J37J254
4289e451K01K408k932p55j467N963R737N365M013n020J725J171l485o135k1L255
4273H572n7j259l702o92J247N442J996q242o003J672l732l451n718N685M921K180
4257a141J78k00l133M704J693P691J370N11q049p845l046K75R506Q30o490P48
4241b398L659k852k079J0016k573n062n30Q38J100j065j147J323J3985j439k200
4226I576l653n717n058j344p302j481O610P087J526m412m000k051K739Q4M551
$$ plain form
4335 2126 -2553 -2471 -7765 -8878 -12355 -10648 -3100 -4106 -5276 5958 12880 10528 12574 11124 8504
4320 8504 4536 3744 1608 -2305 -1104 2468 -4813 -3849 -2422 929 -989 508 -1897 -8540 -10683
4305 -10683 -4989 4154 8222 5516 2375 2374 -3191 -9952 -6791 1375 1872 3825 593 -6842 -6705 -5451
4289 -5451 -5250 -2842 -5774 -6529 -7996 -2033 7704 13069 17082 12062 13787 14958 11473 5338 5317 8572
4273 8572 8515 7256 3554 2862 4109 9551 11547 3305 -2698 -1026 -4758 -8209 -13927 -8242 -3321 -1141
4257 -1141 -963 -1163 -4296 408 2101 9792 11162 11673 3624 -4221 -7267 -6992 2514 3344 -3146 -2398
4241 -2398 1261 -1591 -3670 6346 3773 -1289 -1819 -981 119 -946 -2093 -770 13215 11776 9576
4226 9576 5923 206 -4852 -6196 -13498 -14979 -8369 -1282 244 -4168 -8168 -10219 -7480 -7396 -2845
4211b845O089q6l688l149J321N394J153n248N879j906k625n884J854O555n69K377
4195D622J603P161k122m402j654k489j112n995K592J127N191M010K114k967l198
4180D481k750o983q787N607P020N867j195p365J675m503N56J860K069Q200R40
4165F692L231m70j124j48l400J39J831M649K6k881J535K783p905l272L96n46N39
4148B075J307l915p99P96k648m08J766m317P850O812n026q54K919L489P51l373
$$ plain form
4211 -2845 3244 3158 -530 -3679 -2358 3036 4189 -1059 4820 2914 289 -5595 -3741 2814 2245 4622
4195 4622 6225 13386 11264 6862 5208 2719 1607 -4388 -1796 -669 4522 8532 10646 7679 4481
4180 4481 1731 -5252 -14039 -8432 -1412 4455 3260 -4105 -2430 -6933 -6377 -4517 -2448 5752 6692
4165 6692 9923 9453 8329 8181 4781 4920 6751 11400 11426 8545 10080 12863 4958 1686 2082 1536 2075
4148 2075 3382 -533 -1332 -536 -3184 -3592 -1826 -6143 1707 8519 3493 2639 5558 9047 9798 6425
$$ [...]
##END NTUPLES=NMR SPECTRUM
##END=
