##TITLE=Analysis number 307225
Compound Code cc 39814
Book Reference 431/53/2
Project Code adrs
Chemist Name janea
##JCAMPDX= 6.0         $$ Bruker NMR JCAMP-DX V2.0
##DATA TYPE= NMR SPECTRUM
##DATA CLASS= NTUPLES
##ORIGIN= Bruker BioSpin GmbH
##OWNER= NMR
$$ XWIN-NMR		Version 3.5
$$ Mon Apr 25 14:02:27 2005 GMT Daylight Time (UT+1h)  MAYBRIDGE\NMR@NMR_250MHZ
##.OBSERVE FREQUENCY= 250.131544655141
##.OBSERVE NUCLEUS= ^1H
##.ACQUISITION MODE= SIMULTANEOUS (DQD)
##.ACQUISITION SCHEME= undefined
##.AVERAGES= 16
##.DIGITISER RES= 18
##SPECTROMETER/DATA SYSTEM= dpx250
##.PULSE SEQUENCE= zg30
##.SOLVENT NAME= CDCl3
##.SHIFT REFERENCE= (INTERNAL, CDCl3, 0, 16.522)
##AUDIT TRAIL= $$ (NUMBER, WHEN, WHO, WHERE, WHAT)
$$ ##TITLE= Audit trail, XWIN-NMR		Version 3.5
$$ ##JCAMPDX= 5.01
$$ ##ORIGIN= Bruker BioSpin GmbH
$$ ##OWNER= NMR
$$ C:\u/data/dgb/nmr/ADRS/2170/pdata/1/auditp.txt
$$ ##AUDIT TRAIL=  $$ (NUMBER, WHEN, WHO, WHERE, WHAT)
(   1,<2005-04-25 14:02:08.77 +100>,<MAYBRIDGE\NMR>,<NMR_250MHZ>,
      <created by zg, POWCHK disabled, PULCHK disabled
       configuration hash MD5:
       62 19 C7 07 E1 42 D1 B7 37 6C 3D D0 77 39 F9 E6
       data hash MD5: 64K
       C6 10 7C 91 15 5A 3D 48 16 99 BE 02 D3 9E 6C 57>)
(   2,<2005-04-25 14:02:19.51 +100>,<MAYBRIDGE\NMR>,<NMR_250MHZ>,
      <Start of raw data processing
       ef LB = 0.3 FT_mod = 6 PKNL = 1 SI = 32K 
       data hash MD5: 32K
       17 D5 31 B6 D6 AB 52 92 9D FC DF BD CA 12 B1 B5>)
(   3,<2005-04-25 14:02:21.27 +100>,<MAYBRIDGE\NMR>,<NMR_250MHZ>,
      <apk 
       data hash MD5: 32K
       C8 CF 9F 68 85 CC FE 8C A7 4C 61 EE 57 ED 0A 18>)
(   4,<2005-04-25 14:02:21.93 +100>,<MAYBRIDGE\NMR>,<NMR_250MHZ>,
      <abs ABSG = 5 
       data hash MD5: 32K
       C8 6B F7 21 10 21 81 F1 EF D5 63 19 FB 84 78 8A>)
$$ ##END=
$$ 
$$ hash MD5
$$ AB 27 EA 25 ED 0B FC F4 E1 07 98 77 07 33 01 2E
##$RELAX= 
##$RELAX= 
##$RELAX= 
##$RELAX= 
##$RELAX= 
##$RELAX= 
##$RELAX= 
$$ Bruker specific parameters
$$ --------------------------
##$DU= <C:\u>
##$EXPNO= 2170
##$NAME= <ADRS>
##$PROCNO= 1
##$TYPE= <nmr>
##$USER= <dgb>
##$AMP= (0..31)
100 100 100 100 100 100 100 100 100 100 100 100 100 100 100 100 100 100 
100 100 100 100 100 100 100 100 100 100 100 100 100 100 
##$AQSEQ= 0
##$AQ_mod= 3
##$AUNM= <au_zg>
##$AUTOPOS= <29 >
##$BF1= 250.13
##$BF2= 250.13
##$BF3= 250.13
##$BF4= 250.13
##$BF5= 500.13
##$BF6= 500.13
##$BF7= 500.13
##$BF8= 500.13
##$BYTORDA= 1
##$CFDGTYP= 0
##$CFRGTYP= 5
##$CHEMSTR= <none>
##$CNST= (0..31)
1 1 145 1 1 1 1 1 1 1 1 1 1 1 1 1 1 1 1 1 1 1 1 1 1 1 1 1 1 1 1 1 
##$CPDPRG= <>
##$CPDPRG1= <>
##$CPDPRG2= <>
##$CPDPRG3= <>
##$CPDPRG4= <mlev>
##$CPDPRG5= <mlev>
##$CPDPRG6= <mlev>
##$CPDPRG7= <mlev>
##$CPDPRG8= <mlev>
##$CPDPRGB= <>
##$CPDPRGT= <>
##$D= (0..31)
0 1 0 0 0 0 0 0 0 0.06 0 0 0 0 0 0 0.0002 0 0 0 0 0 0 0 0 0 0 0 0 0 0 
0 
##$DATE= 1114434127
##$DBL= (0..7)
120 120 120 120 120 120 120 120 
##$DBP= (0..7)
150 150 150 150 150 150 150 150 
##$DBP07= 0
##$DBPNAM0= <>
##$DBPNAM1= <>
$$ [...]
##$SUBNAM7= <"">
##$SUBNAM8= <"">
##$SUBNAM9= <"">
##$SW= 20.6930455092707
##$SWIBOX= (0..15)
0 0 3 0 0 0 0 0 0 0 0 0 0 0 0 0 
##$SW_h= 5175.983436853
##$TD= 65536
##$TD0= 1
##$TE= 295.16
##$TE2= 300
##$TE3= 300
##$TEG= 300
##$TL= (0..7)
0 120 120 120 120 120 120 120 
##$TP= (0..7)
150 150 150 150 150 150 150 150 
##$TP07= 0
##$TPNAME0= <>
##$TPNAME1= <>
##$TPNAME2= <>
##$TPNAME3= <>
##$TPNAME4= <>
##$TPNAME5= <>
##$TPNAME6= <>
##$TPNAME7= <>
##$TPOAL= (0..7)
0.5 0.5 0.5 0.5 0.5 0.5 0.5 0.5 
##$TPOFFS= (0..7)
0 0 0 0 0 0 0 0 
##$TUNHIN= 0
##$TUNHOUT= 0
##$TUNXOUT= 0
##$USERA1= <user>
##$USERA2= <user>
##$USERA3= <user>
##$USERA4= <user>
##$USERA5= <user>
##$V9= 5
##$VALIST= <valist>
##$VCLIST= <CCCCCCCCCCCCCCC>
##$VD= 0
##$VDLIST= <DDDDDDDDDDDDDDD>
##$VPLIST= <PPPPPPPPPPPPPPP>
##$VTLIST= <TTTTTTTTTTTTTTT>
##$WBST= 1024
##$WBSW= 4
##$XGAIN= (0..3)
0 0 0 0 
##$XL= 0
##$YL= 0
##$YMAX_a= 498550
##$YMIN_a= -339214
##$ZGOPTNS= <>
##$ZL1= 120
##$ZL2= 120
##$ZL3= 120
##$ZL4= 120
##$ABSF1= 16.522
##$ABSF2= -4.171173
##$ABSG= 5
##$ABSL= 3
##$ALPHA= 0
##$AQORDER= 0
##$ASSFAC= 0
##$ASSFACI= 0
##$ASSFACX= 0
##$ASSWID= 0
##$AUNMP= <proc_1d>
##$AZFE= 0.1
##$AZFW= 0.1
##$BCFW= 0
##$BC_mod= 0
##$BYTORDP= 0
##$COROFFS= 0
##$CY= 12.5
##$DATMOD= 1
##$DC= 0
##$DFILT= <>
##$DTYPP= 0
##$F1P= 14.0000005364418
##$F2P= -0.99999901652339
##$FCOR= 0.5
##$FTSIZE= 32768
##$FT_mod= 6
##$GAMMA= 0
##$GB= 0
##$INTBC= 1
##$INTSCL= 1
##$ISEN= 128
##$LB= 0.3
##$LEV0= 0
##$LPBIN= 0
##$MAXI= 10000
##$MC2= 0
##$MEAN= 0
##$ME_mod= 0
##$MI= 0
##$NCOEF= 0
##$NC_proc= -5
##$NLEV= 6
##$NOISF1= 0
##$NOISF2= 0
##$NSP= 0
##$NTH_PI= 0
##$NZP= 0
##$OFFSET= 16.522
##$PC= 1
##$PHC0= -74.03951
##$PHC1= 6.326003
##$PH_mod= 1
##$PKNL= yes
##$PPARMOD= 0
##$PSCAL= 4
##$PSIGN= 0
##$REVERSE= no
##$SF= 250.13
##$SI= 32768
##$SIGF1= 0
##$SIGF2= 0
##$SINO= 400
##$SIOLD= 32768
##$SREGLST= <1H.CDCl3>
##$SSB= 0
##$STSI= 32768
##$STSR= 0
##$SW_p= 5175.98343685301
##$SYMM= 0
##$S_DEV= 0
##$TDeff= 65536
##$TDoff= 0
##$TI= <Analysis number 999999
Compound Code 99
Book Reference 9
Project Code 9>
##$TILT= no
##$TM1= 0
##$TM2= 0
##$TOPLEV= 0
##$USERP1= <user>
##$USERP2= <user>
##$USERP3= <user>
##$USERP4= <user>
##$USERP5= <user>
##$WDW= 1
##$XDIM= 32768
##$YMAX_p= 334538707
##$YMIN_p= -467940
$$ End of Bruker specific parameters
$$ ---------------------------------
##NTUPLES= NMR SPECTRUM
##VAR_NAME=  FREQUENCY,     SPECTRUM/REAL,   SPECTRUM/IMAG
##SYMBOL=    X,             R,               I
##VAR_TYPE=  INDEPENDENT,   DEPENDENT,       DEPENDENT
##VAR_FORM=  AFFN,          ASDF,            ASDF
##VAR_DIM=   32768,         32768,           32768
##UNITS=     HZ,            ARBITRARY UNITS, ARBITRARY UNITS
##FACTOR=    0.157963299565203, 1,           1
##FIRST=     4132.6476996994, 0,             0
##LAST=      -1043.33573715361, 0,           0
##MIN=       -1043.33573715361, -467940,     0
##MAX=       4132.6476996994, 334538707,     0
$$ Real data points
##PAGE= N=1
##DATA TABLE= (X++(R..R)), XYDATA
$$ [...]
23316a40068J35853l0587r116o618L1885J19557N1173m5146j98893M7451J03906
23305E9397m6935K5418J00793N8496J2486j7165m0028j57237M3963j5757j21049
23294i7618P8931K1940l4030p7239j6029k5363L8234N0613k251L4017M8809m8615
23282b8601r1460N4690j0554K0629M4414q5734j08346o0031k5740R3902N1290
23271a45541j17133M1238J39697M8465o8693j3636m0640R0894L0454k92K4116
23260a1071L597M0956m785o3311M0467N6564K383m6716J6774M4763o3966o9763
23248e4108O3142n483l9811l6723P3086l6123j8124j5222J17860Q4948o2466r1238
23236b0262j3553m2466l112O1665j05984j26813M2583O6082J17231Q2435N4486
$$ y = [-140068, -4215, -34802, -43918, -50536, -18651, 100906, 152079, 106933, -91960, -44509, 59397, 12462, 37880, 138673, 197169, 209655, 192490, 152462, -4775, 39188, 23431, -97618, -18687, 3253, -30777, -108016, -124045, -149408, -111174, -60561, -62812, -28795, 20014, -28601, -120061, -65371, -75925, -55296, -10882, -96616, -204962, -264993, -290733, -196831, -145541, -262674, -221436, -81739, -33274, -101967, -115603, -156243, -65349, -34895, -35187, -11071, -7474, 33482, 28697, -34614, 5853, 62417, 64800, 18084, 34858, 79621, 15655, -54108, 9034, 3551, -36260, -72983, 103, -36020, -54144, -69366, 48494, 133442, 70976, -20262, -33815, -76281, -79393, -17728, -123712, -250525, -207942, -141860, -24629, 57806, 112292]
23225A12292L5391N7226k8785q9265q1893l4275l1085k1432r098L7746J06538
23214E3360J7880o1830P175J307k1162q1220q3778N7182R1284O2669K7630j5926
23202E4571p8251o9689j29784Q7267R0578P7597m6766r7752L7772N3426k9509
23191e0540k2037j2097j4133o8707L4568R8990k086J6052K8986j9523r959N3193
23179C2707K150J6650q5236n1672n1322j9098J28448L0136j04125l3211p32P8047
23167e7258N7366m9636m9248J1165k1709K4348P9308k2608k3690q2532k9522k3055
23155a87071Q9566k4840M2267J26238K0475m67L1088j6925L7730j4776k4709k4798
23143E3778k7424J9126q6452j24803o0697M6107J23431N0415m555p5274m1998
$$ y = [112292, 147683, 204909, 176124, 86859, 4966, -29309, -60394, -81826, -90924, -53178, 53360, 71240, 9410, 16585, 17892, -3270, -84490, -168268, -111086, -19802, 42867, 70497, 54571, -23680, -93369, -223153, -135886, -45308, 32289, -14477, -112229, -74457, -21031, -50540, -72577, -84674, -98807, -167514, -132946, -33956, -36042, -19990, 8996, -10527, -20486, 32707, 34857, 51507, -33729, -85401, -136723, -155821, -27373, 2763, -101362, -134573, -135305, -57258, 108, -49528, -98776, -87611, -109320, -84972, -5664, -28272, -51962, -134494, -164016, -187071, -97505, -122345, -80078, 46160, 66635, 66168, 97256, 80331, 118061, 103285, 78576, 53778, 26354, 45480, -40972, -165775, -226472, -180365, -56934, -6519, -11074, -86348, -128346]
23132a28346L3849k3783m2337o8522m5731J31366Q0670N760O3043N988J8158j15298
23120h5183L9717J9625M1271J3805O1676K2904m8814L2633j3144k8997q2897J4841
23108a2563J6341j1312o9897n1076L9226J9837r4884o8665O6834J26915o822j8107
23096f4173J00030J7730k7266o9868l081n378j9790K2814j01495n9445K3650J04122
23084h2150Q2068J37482R3372j4653k154j77663m0381J1410l5535N0315j9191
23073B920P6714m8013j05158J4157j8442J2075j9182r776k1994k9261L455L8583
23061a03922K5439l4874O648J39967J19618j07403o5511N7924O9777j9805n7494
23050C0364m0645L6065m3387j02557K3564K3904p5228J00299M2506L3527Q0713
$$ y = [-128346, -94497, -118280, -160617, -229139, -274870, -143504, -62834, -57074, 5969, 11957, 30115, -85183, -45466, -25841, 15430, 29235, 90911, 113815, 65001, 97634, 84490, 55493, -27404, -12563, 3778, -7534, -77431, -128507, -89281, -69444, -164328, -232993, -166159, -39244, -46066, -64173, 35857, 53587, 26321, -43547, -46628, -52006, -71796, -48982, -150477, -209922, -186272, -82150, -82, 137400, 230772, 216119, 213965, 36302, -4079, 7331, -28204, 22111, 2920, 79634, 31621, -73537, -59380, -77822, -65747, -84929, -94705, -116699, -145960, -142505, -103922, -78483, -113357, -106709, 33258, 152876, 45473, -20038, 37886, 107663, 87858, 30364, -10281, 25784, -17603, -120160, -96596, -72692, -147920, -47621, -5115, 28412, 109125]
23039A09125R70k1574K6266j54457p3591Q3157K1105n7434l2747N6096Q0292N5011
23027I2219M705m7405j66835K1473K8470L028J01303J9967q4879n7049K1624M4431
23015a8948Q6685L1791j38889r6244O94P1391K614l2263M3106J8086P5544J0536
23003E4103K0579j2594J3791q1017q9238m0057P7501n2319P2850K1011l5256l6948
22991h7594j2982R7539P8811L7834j26257o4740P4578N5387J7342L3600k4800
22980G8718o9025j5317j19851N1871J14413J42749Q6017J6296o3065j35353o9828
22969A7625K8485Q9424M1974n7458q3138j1070j5944j01981l753l3119L3528O3213
22957c2214L6760l5798M2375j0849n0301M0789j1891J3855N567N4568k6421j4180
$$ y = [109125, 110095, 88521, 114787, -39670, -113261, -30104, -8999, -66433, -99180, -43084, 37208, 92219, 96924, 49519, -117316, -95843, -67373, -64345, 36958, 56925, -27954, -85003, -63379, -18948, 67737, 99528, -39361, -135605, -134911, -63520, -60906, -93169, -50063, -31977, 43567, 54103, 74682, 62088, 75879, -5138, -94376, -134433, -56932, -109251, -36401, -15390, -50646, -87594, -100576, -3037, 75774, 113608, -12649, -77389, -2811, 52576, 69918, 103518, 78718, 9693, -5624, -125475, -73604, 40809, 183558, 269575, 285871, 222806, 87453, 17625, 46110, 135534, 177508, 120050, 36912, 25842, 9898, -92083, -95836, -128955, -95427, -32214, 4546, -31252, 11123, 274, -50027, -9238, -21129, -7274, -1707, 52861, 26440, 12260]
22945A2260j35779p0251L4080n6005M4534Q8124J9571L0826K6417K310N4837M1323
22933I2247L6105j7645m7724j5903j3212o6673q668m1766M017J09799O370j30070
22921i3123l8246J38190j477n4808j3770P6173P7556J17462N0376o0467j69592
22910B8274n5102m3477L2411J48310M61k7977n8344j10392M1478J18176K9427
22899A03245k4070J2975j6986l5874q7348P582L7223r3190m3973K2888m1403J42796
22887a6135R7302r137j34029j32366j2269l1216Q1426m3483m7202J72156J09055
22876C4102J08048o6730o4708q0923k2190L0196j09049K7817R2030l476o1215
22865a16098N1386m4441M981k4905N7953M3123M6063m6484j6522k8239J2121Q4812
$$ y = [12260, -123519, -193770, -159690, -215695, -171161, -83037, -63466, -32640, -6223, -3913, 50924, 92247, 128352, 110707, 62983, 47080, 33868, -32805, -41473, -83239, -79222, 30577, 36947, -93123, -131369, 6821, 5344, -49464, -63234, 12939, 90495, 207957, 258333, 197866, 28274, -26828, -70305, -37894, 110416, 110877, 82900, 24556, -85836, -44358, 73818, 103245, 79175, 92150, 75164, 39290, -48058, -40476, -3253, -96443, -140416, -117528, -158931, -16135, 81167, 72030, -61999, -194365, -206634, -237850, -156424, -199907, -247109, -74953, 34102, 142150, 75420, 10712, -70211, -92401, -62205, -171254, -143437, -51407, -54883, -116098, -64712, -109153, -104172, -129077, -71124, -28001, 18062, -28422, -44944, -73183, -61062, 23750]
22853B3750n6661R1281N3319k2748k1866j3522K0693q967r8452P641J03063L2613
22841A10144j02018m7129p230l3795P6883L1848M3018J2022L0518k7330n2449
22830C4482L4216j09811j60102L0309J14435J04648o5533J0892J8746j3539k6063
22819b7320m3068Q5252N8871l7550p6395N8978K577n8417p7826k4155J43095Q3684
22807H7726N2543M2121o2222k8334j1642q4519n3346O157j4298o5939k7762J49221
22795a0294M2158L8838m2758o8014q1577q6469N5579J37322k8887p6548J3208
22784a07442J05233n6722L8481q3481p2179K7328J21549N1370k8772k3512j7839
22773d5986J20210j6449r7425J6955j8006N5587J8190j7353N3643j1861k4792
$$ y = [23750, -32911, 58370, 111689, 88941, 67075, 53553, 74246, 65279, -33173, -25532, 77531, 110144, 8126, -39003, -46233, -80028, -3145, 28703, 71721, 83743, 114261, 86931, 34482, 68698, -41113, -201215, -170906, -56471, 48177, -17356, -6464, 12282, -1257, -27320, -70388, 14864, 73735, 36185, -40210, 18768, 21345, -37072, -114898, -139053, 4042, 87726, 140269, 182390, 120168, 91834, 80192, -4327, -57673, -51516, -65814, -131753, -159515, -10294, 31864, 70702, 27944, -40070, -121647, -208116, -152537, -15215, -44102, -120650, -107442, -2209, -58931, -20450, -103931, -176110, -148782, -27233, 24137, -4635, -28147, -45986, 74224, 57775, -39650, -22695, -40701, 14886, 33076, 15723, 69366, 57505, 32713]
22762C2713n0277M6880M8308K0729J0582j13474r8741l2842O6237j1217K7263
22751e3839O1395K9473n9774p9039N3941j26180L3641J49671O988j16270n0799
22740a50792J30998L2477l9986n2779o7961n5103j7122M3224l4533m1456k8214
22729b81247R6627R4486O3147j3920j5516m249O391J1120l5426K9449p7866k6630
22717a53634M8896J01517K6678K0152k1992k6154J4605l3840O7153n1356p1668
22706g9643R2257L9701J06311J65142p5193j5520j16997j1538j23397j04430N8480
22695f4827J25659L5204o8389O7082j00706m5597J7602r6935m6122n9425J04610
22684a31844N0404L3161J01566o9908n3678n2944m1793M9440O1559K2715l7787
$$ y = [32713, -17564, 29316, 77624, 98353, 108935, -4539, -103280, -136122, -69885, -81102, -53839, 7556, 37029, -22745, -101784, -47843, -174023, -140382, 9289, 16277, -99993, -150792, -19794, 12683, -27303, -80082, -148043, -203146, -220268, -177044, -211577, -253033, -281247, -184620, -90134, -26987, -40907, -56423, -60672, -54281, -43161, -78587, -49138, -127004, -153634, -104738, -3221, 23457, 43609, 21617, -4537, 10068, -23772, 43381, -7975, -79643, 12614, 52315, 158626, 323768, 248575, 233055, 116058, 104520, -18877, -123307, -64827, 60832, 96036, 27647, 94729, -5977, -51574, -33972, -130907, -177029, -236454, -131844, -81440, -48279, 53287, -16621, -70299, -123243, -165036, -115596, -54037, -31322, -69109]
22673f9109j18456K4504K8134R4653K1586j591J583l6463n9974R1811j3960L2005
22661e277J9483P3791P1218p2369J1865p2774l5064l1793o2964k1286N5536l2446
22649a02080l6959L2572O1987K1250O808J9927O6765N915j49543l4230J0315M2269
22637e5004Q8595Q021J22742p2010j71165m8027N6518M4310N1626R2707n7363
22626F0950J1161r2658j25775k7103J85977N7205L9692O3186m1396o488J5904
22615A40655L0225j27673q0758n0591K8557O3004K8752R9003n2029j36653O2652
22604E144L2598k6651O3951p0690j07521M1039N6923J04759L4337l3980m9577
22593E0332l5862L8359M7668m2777j69628j5549M7787M256Q4821O0206L476q24
$$ y = [-69109, -187565, -163061, -134927, -40274, -18688, -20279, -18696, -55159, -115133, -23322, -37282, -5277, 14206, 87997, 159215, 86846, 98711, 25937, -9127, -40920, -103884, -125170, -69634, -102080, -139039, -106467, -44480, -23230, -16422, 3505, 70270, 76185, -73358, -107588, -97273, -55004, 33591, 41612, 164354, 92344, -78821, -126848, -70330, -26020, 25606, 118313, 60950, 72111, -20547, -146322, -173425, 12552, 69757, 109449, 172635, 131239, 124751, 140655, 170880, 43207, -37551, -88142, -59585, 3419, 32171, 131174, 79145, -57508, 5144, 37742, 11091, 75042, 4352, -103169, -62130, -5207, 99552, 133889, 99909, 50332, 14470, 52829, 100497, 57720, -111908, -127457, -79670, -75414, 9407, 69613, 73089, 72265]
22581G2265m5546O0262N463k2633J3629l1639P5180M7988M0424m9251n9681N657
22569A12118q8717K8424p0216j00730Q9301J00079M4169K5001j70784l9697P882
22558f3170n1459K8325M3817k2077L1238P7229q696l561n8232L626J13866M6359
22546A37265n502o2949j34247q7595Q3443N7212j17048k09N3554K2550k1258n5009
22534a29793P4916P8782J06809l2410l2820j16776n5233N2330J2012j40024m0114
22523b22321J42459L9315o1649j3550K17084J20149n3304o9029l3073J01071j316
22512A65836j09682K375j43724q1345J09145M1923O4890p1798O430q7261m2541
22501a45752J04807M2695L8401J0032J2956p3619q016k2657j560n5181m6387q8054
$$ y = [72265, 26719, 86981, 92444, 69811, 83440, 51801, 126981, 174969, 215393, 166142, 106461, 112118, 23401, 51825, -18391, -119121, -29820, 70259, 114428, 139429, -31355, -71052, -63170, -114629, -86304, -42487, -64564, -33326, 43903, 35207, 31646, -26586, -22960, 90906, 137265, 131763, 68814, -65433, -153028, -69585, -12373, -129421, -129630, -76076, -53526, -74784, -129793, -54877, 23905, 130714, 98304, 65484, -51292, -106525, -54195, -42183, -182207, -222321, -79862, -40547, -102196, -115746, 101338, 221487, 168183, 99154, 66081, 167152, 165836, 56154, 58529, -85195, -166540, -57395, -15472, 49418, -22380, -15950, -103211, -145752, -40945, 1750, 40151, 50183, 63139, -10480, -18496, -41153, -42713, -97894, -144281, -232335]
22489b32335n4467K9703O8946Q3619m517o1942O0667m4042J4463K10091m7046
22478B3140j50513o7255r8799O4949J83616N2165r5783p9999P4062q4668o6557
22467b45642M9510P5904J17890J27755O0923q1847K7772J04808r5145j10746M1020
22456G2202l9633N5038P5471K4073L3270j7382r3809k0712K580M8330J3472k1322
22444A31578p7894l9322o0402M850P0564K5864l0636n4234o3837l7236m9266N2800
22432a27171Q5273J10526o3822j5952L1180r253j3452n200J28955N2386j34471
22421C8999M799L9335m4533o6521p3743n5786J14620J74181Q5327j4327j55261
22410D7090m9959Q2153m0679O6122R990n8828k7434m9831L6134P5915k3899j15758
$$ y = [-232335, -286802, -257099, -188153, -104534, -109051, -170993, -110326, -154368, -139905, 70186, 23140, -127373, -194628, -293427, -228478, -44862, 7303, -88480, -168479, -94417, -179085, -245642, -196132, -120228, -2338, 125417, 186340, 104493, 132265, 237073, 141928, 31182, 72202, 32569, 87607, 163078, 187151, 220421, 203039, 109230, 88518, 91098, 139428, 152900, 131578, 53684, 14362, -46040, -41190, 29374, 55238, 24602, -29632, -93469, -130705, -179971, -127171, -41898, 68628, 4806, -11146, 20034, 10781, -2671, -7871, 121084, 173470, 38999, 43798, 83133, 38600, -27921, -101664, -157450, -42830, 131351, 216678, 202351, 47090, -2869, 79284, 38605, 104727, 114717, 55889, 28455, -21376, 14758, 90673, 66774, -48984]
22398d8984l259N1123K1499n4118J0620L0820O6611j7711r7132q4091J2011J8322
22386i4289j7799L2478L5421j1923J6524K3827N8110l8973k9039L7210l8607J310
22374b5750L8307l5032j6332n1399l7965J02376P6732N015j9922N5407j48139
22363e6702j17971N9410J99924K281n9700n9726j6969j7821R1007Q8052j29643
22352a7858j1622k6858O3762k8448p9381p6229J53797R4420M5969q893r6919p4130
22340f2390n2964r414l1911N44q0791N3006P8559L3681N8198m1324k9066K448
22328h1424p1622m7061Q1952m9986K5395Q0859j190R487k9750M9533o0593j3660
22316a08060L3649K9139l4439J6249M9023L9790N0627j22141n9787O2689N1504
$$ y = [-48984, -52243, -1120, 20379, -33739, -23119, 7701, 74312, 56601, -40531, -124622, -112611, -94289, -112088, -79610, -44189, -56112, -39588, -15761, 42349, 3376, -25663, 11547, -27060, -25750, 12557, -22475, -38807, -90206, -128171, -25795, 50937, 55952, 36030, 91437, -56702, -174673, -115263, 84661, 86942, 27242, -32484, -49453, -67274, 23733, 111785, -17858, -29480, -56338, 7424, -21024, -100405, -176634, -22837, 71583, 117552, 108659, 11740, -62390, -115354, -124768, -156679, -156135, -236926, -183920, -105361, -71680, -13482, -54806, -83872, -81424, -153046, -200107, -118155, -168141, -142746, -61887, -63077, -53590, -83340, -33807, -94400, -108060, -74411, -45272, -79711, -63462, -14439, 25351, 75978, -46163, -105950, -43261, 8243]
22305H243K5799m2391k362j8193M9030L3730r3117L0794o0617l5318R450L9195
22293e5757M4732R8327m3174k8056l4013Q3814K3903p3646o7198k0587Q5160L6100
22281D9605L0123n4507r9411n927L2312J7427M3753N7724p9310j08137l3499r4617
22269b44464J08435O352J1786k0819J9898N7923N9350M3566N9087M9746j25030
22258B5830q9033N1266J71027m0664j38144N6173n3996l6308J12478Q909m4249
22247B3289J1364m5158j16356j21175K7064P5471K8761n1462K7562L7309m9890
22236a53221O6787P0602K0134m1886P805r5741k6362J26438k8634o312m1863M2029
22224f0224J07850J01773l18l8075L1052m9833K7011m0762j3166q7753k3815L4299
$$ y = [8243, 34042, -8349, -10711, -28904, 20126, 53856, -39261, -8467, -69084, -104402, -94952, -55757, -11025, 87302, 44128, 16072, -17941, 65873, 89776, 16130, -51068, -71655, 13505, 49605, 79728, 25221, -74190, -80117, -47805, -30378, 13375, 71099, -8211, -116348, -149847, -244464, -136029, -129677, -117891, -138710, -118812, -60889, -1539, 42027, 101114, 150860, 25830, -63203, -11937, 159090, 118426, -19718, 36455, -17541, -53849, 58629, 67538, 23289, 34653, -10505, -126861, -248036, -220972, -145501, -116740, -168202, -140640, -103331, -153221, -86434, -15832, 4302, -37584, -29779, -125520, -151882, -25444, -54078, -60390, -102253, -60224, 47626, 149399, 149081, 111006, 142058, 92225, 119236, 78474, 65308, -22445, -46260, -11961]
22212a1961J13944J2575n7280N4241N1846K2093M3359j42344o7726K467p3704
22201e2490q489n882m5810j05083N0095l8828O66Q9881K8043K4080l5673K4451
22189g5039n6808l0200Q7575P608j7110o1639P3883P5340L9316J494k1943k6033
22177c556m5549J7420O2110J28307j8534J0239k3924j09725l2656j3403l7843
22166f7114j8338k8357n901k1620k9397j39216L1870K21455J13745Q153r7757
22155c2477L8095J16445Q201p1880J7202L7350j10680J09293l3370j00639n0835
22144g3295r1310l091O8854Q9308J6060l433Q6590m6068o603O8419q1671n6214
22132c2454L5405m6035J2963K1051l4812p0324o3184O2058K5651j8122j2635N9030
$$ y = [-11961, 101983, 114558, 57278, 111519, 163365, 185458, 228817, 86473, 18747, 21214, -52490, -60979, -66861, -112671, -217754, -167659, -206487, -205821, -115940, -87897, -63817, -99490, -75039, -131847, -162047, -74472, -66864, -83974, -145613, -71730, 3610, 42926, 44420, 22477, -3556, -49105, -31685, 30425, 158732, 140198, 150437, 126513, 16788, -15868, -29271, -67114, -85452, -113809, -119710, -141330, -170727, -309943, -278073, -56618, 57127, 65280, -32477, 5618, 122063, 130264, 58384, 75586, 112936, 2256, 111549, 78179, -22460, -73295, -164605, -167696, -98842, -9534, 6526, 3093, 89683, 43615, 37012, 105431, 23760, -32454, 2951, -43084, -30121, -9070, -43882, -114206, -177390, -115332, -89681, -107803, -120438, -61408]
22120f1408M0259l789n6068N7517R082M3535l7378n3913M9711P4065q5208l2773
22108e6368K2928j26259K347O6050j0357r1806l3530J13293K6973P7734o1747
22097g0742o8716R5451R0262M1292j8828l140m5106j35605l0252J22365K3325
22086C06J5931M0101n9750K6905j02062m4056k3268R9571P3893l0192N6262m9050
22074D591r9357K1819J17699J07289P5445j81995m4281n4424o4563O328O4875
22063d6574j5257m5484J7224M5948J17501r3378j66465K1938n6832k9644P1725
22052a79298j556O0051R8124J5416m1644j50905q9482M817N9686J58643j8068
22041h4216p7780N138Q6355P6982L1291n0261q4310k7094R7766M5734M841l2234
$$ y = [-61408, -21149, -24938, -81006, -23489, -14407, 29128, -8250, -62163, -12452, 61613, -23595, -56368, -33440, -159699, -157352, -91302, -101659, -193465, -226995, -113702, -86729, -8995, -70742, -139458, -44007, 46255, 87547, 68719, 65579, 20473, -115132, -145384, -23019, 306, 16237, 56338, -3412, 23493, -78569, -122625, -145893, -46322, 27571, -2621, 53641, 4591, -94766, -72947, 44752, 152041, 227486, 45491, 1210, -53214, -117777, -111449, -46574, -61831, -107315, -90091, -44143, 73358, -20020, -186485, -164547, -221379, -251023, -179298, -180854, -120803, -22679, -7263, -48907, -199812, -289294, -284477, -224791, -66148, -84216, -161996, -156858, -70503, 6479, 37770, -12491, -96801, -123895, -26129, 19605, 24446, -7788]
22029g788O6749Q7689k433p5470j692J0991n7014p5740J01668M7883k4053M1578
22017A12368p5063l6006L0231j20701n0737P8326n1515p5656P6677m6488K542
22006a56022O3736l6941J1573k5104o9507N3150N5012M7382J39379O373k4874
21995F4157O244M550n1478k2135Q548j5351l5673J9375k721N7048M3252l9516
21983C6300J8230L1984n255q0544p7816o7697J6927L1295N1278N5926j48R5716
21971A06196J52521j15212j8513m2068o0009N6377l4071L5805N8123q7378j03902
21960e2131k6457p2296N4615J22040O5611L4980J8478L0343q1740k1457k788Q3040
21948A52238j05944r6818m9106k524M2002J34381k8947r2248j00863m6573N3490
$$ y = [-7788, 58961, 146650, 144217, 68747, 67055, 78046, 21032, -54708, 46960, 94843, 70790, 112368, 37305, 1299, 31530, -89171, -139908, -61582, -113097, -188753, -112076, -158564, -156022, -92286, -129227, -117654, -142758, -212265, -159115, -104103, -56721, 82658, 89031, 64157, 70401, 74951, 23473, 1338, 9886, -5465, -41138, -21763, -24484, 32564, 75816, 36300, 54530, 86514, 81259, 715, -77101, -144798, -127871, -96576, -45298, 10628, 10480, 106196, 258717, 143505, 124992, 82924, 22915, 79292, 45221, 81026, 139149, 51771, -52131, -78588, -150884, -96269, 25771, 91382, 126362, 144840, 175183, 93443, 71986, 69198, 152238, 46294, -50524, -99630, -102154, -60152, 74229, 45282, -46966, -147829, -194402, -140912]
21937a40912j17099L943k2456L6908K00365P2627J4014j8812m1218j6275q1557
21926a10472j6054J07549l6943j9593j1549M4658q0774o5206J5941K2592j3985
21915a63836k6570J5980J1412N1046J43868L3622m7852K9483j0769q7970O5005
21904A3419N5068k9670o1822M3222o2259M2060K7061m4416j22718o6563M7580
21893a59038K1368J1213j7725k1549k6047k3822L1912J02168K2400M1415k2586
21882d0291n7636k4161j4600M8848l4046M8299M1036m5878r8399k8276j7874m7359
21870b70337J04335J75964N7056l0985p3148j03366O5571N8993L7261j04980o2836
21859a46472L7313Q0180M4384l3703o5147O9200J23541l2530j10963j4271L9M723
$$ y = [-140912, -258011, -254068, -276524, -239616, -39251, 33376, 47390, 28578, -12640, -28915, -110472, -126526, -18977, -55920, -75513, -87062, -42404, -123178, -188384, -172443, -149851, -163836, -190406, -174426, -163014, -111968, 31900, 65522, 17670, 47153, 36384, -51586, 13419, 68487, 38817, -23005, 20217, -42042, 18, 27079, -17337, -140055, -206618, -159038, -137670, -126457, -144182, -165731, -191778, -215600, -183688, -81520, -59120, -17705, -40291, -97927, -122088, -136688, -87840, -121886, -73587, -32551, -78429, -176828, -205104, -222978, -270337, -166002, 9962, 67018, 36033, -37115, -140481, -74910, -15917, 21344, -83636, -146472, -109159, -28979, 15405, -18298, -83445, -14245, 109296, 76766, -34197, -48468, -48429, -43706]
21847d3706J3041Q9906L1165l6514m1780K569m7658M4644k4533n3044k6709P9085
21835a3534M5169o8725O73P1126M688k7840L823P542J22452j612j28982o6194
21823e1414M3350P7295O2557o3318o5924k7960O1172M146L2688j39304p8272J18839
21811b6145O8794o3884l7286n478j07498p2474M491N2583O5470P3965O0869o2
21799A3345r5264o6534m0178k0834J10928J03726K2556p1740m1887j20724N4553
21788a52053N7087J2243M0639k8310j19803q326J030l0235J14190J1975J02447
21777H84q695o6267n8218L8937m417K9131l7908M935P7597J13950M078j00485
21765f478m7077r575n7363k8601k1737N047M0882O9563o987m3373M7268N2547
$$ y = [-43706, -30665, 59241, 90406, 53892, 12112, 14681, -32977, 11667, -12866, -65910, -92619, -13534, 31635, -37090, -36417, 34709, 39397, 11557, 15380, 22922, 145374, 143762, 14780, -51414, -8064, 69231, 131788, 68470, 2546, -25414, 35758, 39904, 72592, -66712, -144984, -26145, 42649, -21235, -58521, -63999, -171497, -243971, -239480, -186897, -121427, -47462, 13407, 13345, -81919, -148453, -188631, -209465, -98537, 5189, 27745, -43995, -85882, -206606, -152053, -94966, -82723, -42084, -70394, -190197, -198523, -197493, -227728, -113538, -101563, 884, -7811, -74078, -132296, -93359, -97776, -68645, -106553, -101618, -24021, 89929, 94007, -6478, -53555, -63130, -120493, -149094, -170831, -165784, -124902, -55339, -62326, -105699, -58431, -5884]
21753e884P2061L2185l5158R94O1225m4788J4521K7589L7299j5604k9370o5476
21741D9594m0733O3193R1971R5355n2172j85995L792P5361N781j00647j01389
21730i5889j3239n0323M8233Q4852o5402l4958R7308O1518q1942r6469n907l1885
21718a84103k6792M9043R5533l399m8500N413R5341J47280j0718p2921o2384K8045
21706A1838O0128k84n4588j06126N933Q9722m0531n6217O9982L8260k629N3056
21694F8544P3312n6734o0638j18723Q405Q5700o5832P2556j1035m833Q4055O3897
21682A38674M5854m8815r2810j0610l8159j2810q756p7078j2266J5616m5856j8986
21670a66002J40215L0261o307j9869q4897p2408k2941L6744J10664p277j5253
$$ y = [-5884, 66177, 98362, 63204, 64198, 125423, 80635, 95156, 122745, 160044, 144440, 115070, 49594, 8861, 72054, 164025, 259380, 207208, 21213, 25005, 100366, 106147, 5500, -95889, -109128, -159451, -111218, -26366, -91768, -126726, -29418, 32100, -49842, -146311, -152218, -184103, -210895, -161852, -66319, -69718, -118218, -112805, -17464, 129816, 119098, 46177, -16207, 11838, 71966, 71682, 17094, -89032, -83099, 6623, -33908, -90125, -20143, 18117, 15488, 68544, 141856, 85122, 24484, -94239, -85834, -134, -65966, 6590, -4445, -9278, 74777, 138674, 184528, 135713, 42903, 32293, -5866, -18676, -27432, -104510, -116776, -101160, -147016, -166002, -25787, 4474, -1833, -21702, -106599, -179007, -201948, -165204, -54540, -61817, -77070]
21659g7070J27019l586j38769n1404Q6695R4057Q9366j16145l0258n8314j3103
21648i1512R1892L6193j5669L0295k1881l3420j10454J1350P1141J04849o3242
21637I542K620P7223l5601j1322K3960K0264K5638J6213L8012o2047r7240k8488
21625b1226n6735o8785K233m400N4529R2826m8570k3304r7234K9577M7433N5022
21613c8634L1967P3967L532n066j03435j1907L9429n6830O0826k1980n8223O0349
21601b6005j9640N2165l8109p624N6531O4253k8846o4736m5537j2065n0981j19879
21589b40473q945N8597J28024J33358o3595j12265L6377Q301j1543R346M5889
21578a6929R5143P4677q6704j57810o0526P1383M8886L5645m969k3370N6696l9882
$$ y = [-77070, 49949, 46363, -92406, -143810, -57115, 36942, 126308, 10163, -20095, -78409, -91512, 380, 36573, 20904, 51199, 29318, -4102, -114556, -103206, -32065, 72784, 9542, 12162, 89385, 53784, 42462, 66422, 86686, 112324, 128537, 166549, 104502, 7262, -21226, -77961, -146746, -144513, -148913, -94384, -1558, -50128, -73432, -170666, -141089, -93656, -38634, -6667, 67300, 70832, 65766, -37669, -49576, -10147, -66977, -6151, -28131, -86354, -26005, -45645, 6520, -31589, -39213, 17318, 81571, 52725, -12011, -57548, -69613, -120594, -240473, -249418, -190821, -62797, 70561, 6966, -105299, -68922, -60621, -72164, -62818, -16929, 78214, 152891, 66187, -91623, -152149, -80766, -31880, 3765, -1204, -24574, 32122, -7760]
21566g760q328O985Q2234R0383J6415j6334n8570N8534P7904n5659j11999l8583
21554C5222P3967m1120j1167n7010k6542j11300n1764L9212N443m2813k7283Q671
21542b06484N3195O9929N1479K9109R052m9303m1373P30L3820R0682o749k3817
21530A0270J3908n0979K3901o8993r2559M2533K4915O3401j2418L092K4382j130
21518a9677J0988o2494J8197o2120o8686Q2726Q1085Q038k7419k4863m3702M5052
21506f2875L5320P8191j3356J9906j1759J00406N9006p6739k058p5764q7273m47
21494c7442j35400m2058N5411R7712Q5085n6944j9476r3477k903J34367J58586
21483A43461O0032p6769j60870n1415N0271R3314p0324q2094m9786J5542J6176
$$ y = [-7760, -16088, -9103, 73131, 163514, 179929, 163595, 105025, 163559, 241463, 185804, 73805, 35222, 109189, 68069, 56902, -108, -26650, -137950, -189714, -150502, -145059, -187872, -215155, -206484, -153289, -83360, -31881, -2772, 6280, -43023, -84396, -83666, -49846, 40836, 34087, 10270, 24178, -26801, -2900, -71893, -164452, -121919, -97004, -33603, -46021, -42929, -18547, -19677, -8689, -71183, -52986, -115106, -183792, -101066, -19981, -11943, -39362, -64225, -107927, -62875, -27555, 50636, 37280, 57186, 45427, 145833, 204839, 128100, 126042, 50278, -36995, -37442, -172842, -214900, -159489, -61777, 23308, -33636, -53112, -146589, -149492, -15125, 143461, 203493, 126724, -34146, -85561, -35290, 58024, -12300, -94394, -144180, -128638, -112462]
21472a12462N2254k4100m1072J35501J25128L1070l2082p3218k7179J814K6211
21461F1865J5630p0816m2411L1345M0744K5673R0308n9973j06258r7317j1012
21450a22222j0366P803Q7905J54528M1311L2845J37453j3467r2065j47563l1408
21439D4754J3652n949K5978Q4840R984m3121r331j13691o4416q370J02581M5574
21427H2485j71878k1496M1714o9765r5970K2687O4816P4927J9311M2677m4772
21416e5264j2275m5806K615K4188P4113O3074m3245l3919J1563j3036L5096Q7695
21404I4799q7280n507K5456j6803L195Q6627n8944k0727l2750K4178J07841J951
21392A22036L0032n2734j02571o284m683J5455J4947m3240p828L0225q2788k9170
$$ y = [-112462, -60208, -84308, -125380, 10121, 135249, 166319, 134237, 61019, 33840, 35654, 61865, 77495, 6679, -35732, -4387, 36357, 62030, 152338, 92365, -13893, -111210, -122222, -132588, -124785, -36880, 117648, 158959, 191804, 329257, 315790, 223725, 76162, 44754, 58406, 52457, 78435, 163275, 173259, 130138, 120807, 7116, -57300, -65670, 36911, 82485, -89393, -110889, -69175, -138940, -234910, -212223, -147407, -72480, -53169, -10492, -55264, -67539, -113345, -110730, -86542, -12429, 50645, 7400, -26519, -14956, -27992, 7104, 94799, 7519, 2012, 27468, 10665, 13860, 100487, 41543, 20816, -11934, 12244, 120085, 122036, 152068, 99334, -3237, -9521, -14204, 1251, 16198, -27042, -34870, -4645, -87433, -116603]
21380a16603Q500R0283J06342l2116r5006r6897O2439J37741M813k3305J0253
21369E6444n1031q2298L9733R1508J7087M0065J2025q8584k4739k219L545j08212
21357i6676m5313N9462M3208N6811r3435M6003K11945j04509q1280k3132O412
21346b0504L1691k2579L7457j0595l6105j0710j0751m4275M948Q5055K8372n2887
21334b0883L281P8742N0474M7219N5378m7986j01858j0011L1016L7396k6852k6014
21322F9902M2262m5465o0505M8276K2224Q35O8767L5907l2143n1522J4338r3531
21310A9345k2432O3553L597j25723r0953O030k7672J31190N8185L1273k6898Q680
21298B8175L6475o7484k5461k6210m7437r8805J1134L3743O3312j4320L5546N0576
$$ y = [-116603, -108103, -17820, 88522, 56406, -38600, -135497, -73058, 64683, 69496, 46191, 56444, 5413, -76885, -37152, 54356, 71443, 111508, 123533, 34949, 10210, 7991, 11536, -96676, -141989, -82527, -39319, 17492, -75943, -29940, 182005, 77496, -3784, -26916, -20504, 11187, -11392, 26065, 15470, -20635, -31345, -42096, -86371, -81423, 3632, 32004, -20883, -17602, 61140, 111614, 158833, 214211, 166225, 64367, 54356, 85372, 122768, 95916, 69902, 112164, 66699, 6194, 54470, 76694, 77529, 146296, 182203, 150060, 98538, 112876, 19345, -3087, 60466, 64063, -61660, -152613, -146583, -174255, -43065, 15120, 46393, 19495, 28175, 64650, -2834, -28295, -54505, -101942, -200747, -189613, -155870, -92558, -106878, -71332, -20756]
21286b0756k7899m8364L3464M4949K3081m6718m7159Q0019N7937j3157K1001l7880
21274A8518J4184j4983L7131N8545J1262n6514p3353N6535O17M246q6041n9992
21262h9845K0309Q4702Q155j8135o2668M5199O2237J0005J7263K2896Q71O1194
21250A62183j2576j03011l9299J5621J51809P5660l5544Q022m2269j52884o6990
21239c9278k1788K1540Q0763o2549j24914M860J32645q218M4753M4798J33069
21228B05681N8403q0304j04622m5323N211N2641j1033J4616n5610n1653j3899
21217b5892l5250N693k8137N8787L9556k5243q2523J998R4608N7248M6604o2947
21205D4502o8356O7803j5327j0244O444p4139j01389j6296N1991J327J72905j2476
$$ y = [-20756, -48655, -97019, -63555, -18606, 4475, -42243, -89402, -9383, 48554, 35397, 56398, 18518, 32702, 17719, 54850, 113395, 124657, 68143, -5210, 51325, 51942, 56188, -29853, -89845, -69536, 15166, 23321, 5186, -57482, -12283, 49954, 59959, 77222, 100118, 100989, 162183, 149607, 46596, 7297, 22918, 174727, 250387, 214843, 222865, 180596, 27712, -39278, -61066, -39526, 41237, -21312, -146226, -141366, -8721, -16939, 27814, 72612, 205681, 264084, 183780, 79158, 33835, 39046, 91687, 80654, 95270, 39660, -11993, -25892, -61142, -55449, -83586, -24799, 14757, -10486, -93009, -91011, 3597, 60845, 107449, 44502, -23854, 43949, 28622, 18378, 24822, -49317, -150706, -167002, -115011, -113684, 59221, 46745]
21193D6745m9369J06045J44337P5836q6387k6209K1567j6292n9523o4114R680
21182A02316N4425l3074M3964o2056r5729K7768M1433K2879l5411j2612l1481
21171B2422l676J5096M5351K724L4486j7196k2701P7427O7959j35144p5935n2694
21159d1881j30603J2396N6642J56053J62720N3712K6220l6080o9561q74Q952M0450
21147B38146J08972J81721J49934J95771J34834O4686O1130K9687M5369k9484
21137A180766J3602P4183p5111k21223r2601O0165n5907k3595R4334J97602K29902
21126A382117J2575N6873L8800j6594j29420k05064m4279o0275j80242j82996
21116F71495r9983m5343r8892n5814j4464k5341j13174r2182n865j31L4883R2637
$$ y = [46745, -2624, 103421, 247758, 323594, 237207, 210998, 232565, 216273, 156750, 92636, 102316, 156741, 123667, 167631, 105575, 9846, 37614, 79047, 101926, 66515, 53903, 22422, 18746, 33842, 79193, 81917, 116403, 99207, 76506, 153933, 221892, 86748, 10813, -41881, -172484, -160088, -103446, 52607, 215327, 269039, 295259, 259179, 189618, 188744, 197696, 238146, 347118, 528839, 678773, 874544, 1009378, 1074064, 1135194, 1164881, 1210250, 1180766, 1194368, 1268551, 1193440, 972217, 879616, 939781, 883874, 860279, 954613, 1152215, 1382117, 1394692, 1451565, 1490365, 1473771, 1344351, 1139287, 1095008, 1034733, 854491, 671495, 571512, 526169, 427277, 371463, 356999, 331658, 218484, 126302, 120437, 120306, 155189, 247826]
21104B47826j96325m8592k9042J27187j3273K4270J94670L1385j13198j35339
21094H9569Q1998L7190o6462r9883K3289l3505Q651M0131j3587L6951m1806k3692
21082C8844l0766r9536N0635O7593L3539K4782N665M1808m373N5350k3966p1393
21070H8182o6212j26992L5077J19831L2575R1997K8063j35644R599M6974M8657
21059A72107n3970p5443o235P1077l753j7042o7252n1087N8025L6875k507l4708
21047B6087M4304L4449n612Q8858j4244r4845P2978J54466k5577r2511l7809q7295
21035F3249j16645j6327P1676k1682J6904K0139L9798l044j52089L1656R196L3707
21023b3462k1395p9851K8566J21140l956q9205J8816O6622n4264j5147m4109J14146
$$ y = [247826, 51501, 2909, -26133, 101054, 87781, 112051, 306721, 338106, 224908, 89569, 171567, 208757, 142295, 42412, 65701, 32196, 40847, 80978, 67391, 104342, 62536, 38844, 8078, -91458, -40823, 26770, 60309, 85091, 90756, 132564, 128191, 183541, 159575, 88182, 21970, -105022, -69945, 49886, 82461, 174458, 202521, 66877, 76476, 123450, 172107, 118137, 42694, 36459, 107536, 103783, 86741, 19489, -31598, 26427, 63302, 60795, 26087, 70391, 104840, 99228, 188086, 173842, 78997, 151975, 306441, 280864, 188353, 150544, 63249, -53396, -69723, 1953, -19729, -2825, 17314, 57112, 54068, -98021, -66365, -57169, -23462, -44857, -124708, -96142, 24998, 21042, -68163, -49347, 17275, -36989, -52136, -96245, 17901]
21011A7901j4491m7029n8948N5130J28981N7063O821N295j2000L1769l0052p2518
20999F7922P8971N0784M089j52631p4806O0441R616K2517r6873r5380l3633O2434
20987i6549O4624J99647L8278j43740j09899k971N8040L7252O9493r5875n8594
20976d0294J33030J15822m851M6520k1813l1332j55482j96643m4978J13411R6716
20965A0106r313J2345R7054J79030L3035m5892n1465k5577q107Q9796n2901R430
20953B37541j6136p4770m1536J3287p9315p740M4999J065L4022M1096l5686P841
20941A24668l7791r813N3529R9325J7177p4050p7085k3604n133M0139M6817M2326
20929A96505K6615p9878K079J8752J223R3036o3486j41538k6491K4563R6701M6718
$$ y = [17901, 3410, -43619, -102567, -47437, 81544, 138607, 145428, 150723, 138723, 170492, 140440, 67922, 146893, 197677, 201766, 49135, -25671, 34770, 44386, 66903, -29970, -125350, -158983, -96549, -31925, 167722, 206000, 62260, -47639, -50610, 7430, 44682, 114175, 18300, -40294, 92736, 208558, 203707, 250227, 228414, 197082, 41600, -155043, -200021, -86610, 10106, 793, 13138, 110192, 289222, 322257, 276365, 224900, 199323, 191216, 281012, 228111, 237541, 221405, 146635, 105099, 118386, 39071, 31331, 76330, 77395, 111417, 152513, 116827, 124668, 86877, 77064, 130593, 229918, 247095, 173045, 95960, 72356, 67223, 107362, 154179, 196505, 223120, 143242, 145321, 164073, 165296, 258332, 194846, 53308, 26817, 51380, 148081, 194799]
20917A94799J02043P2994O632M07Q7697k8921j73043j33024j8665p2085J7339
20906E6173J0824j07199r3804J91035J05572j26548j8705l5244j296L3879l555
20895A1132K858L2106R296l4442l7209j67374m6401J4119M2896Q6107m9233k124
20883a38269q895Q1521N5252j8281J8723l3722p5805j37900K2393O3038k9224
20872b01169p8122L8330K7611k3894J32685Q6887m8296m9315P3400N9120q4099
20861f6862L01k8747L8332M4004K4923M5926k4820q9375l099k4859o3350O2595
20849h5031Q2364j8448m1614j8281N6127k2K7682J02411J0850L0968j4809j1299
20837A20898l350p2279k6544k5742k5164R6893M0279j01779m0131N5387J61559
$$ y = [194799, 296842, 369836, 376468, 376875, 464572, 435651, 262608, 129584, 110919, 38834, 56173, 66997, -40202, -134006, 57029, 162601, 36053, 17348, -17896, -19192, 14687, 11132, 13990, 46096, 55392, 20950, -16259, -183633, -230034, -215915, -173019, -86912, -136145, -138269, -147164, -65643, -10391, -28672, -9949, -43671, -119476, -257376, -234983, -171945, -201169, -279291, -240961, -213350, -237244, -104559, -17672, -65968, -115283, -41883, 17237, -66862, -66561, -95308, -56976, -12972, 11951, 57877, 33057, -56318, -59417, -84276, -147626, -85031, -2667, -21115, -62729, -81010, -24883, -24905, 2777, 105188, 116038, 147006, 132197, 120898, 117548, 45269, 18725, -7017, -32181, 64712, 104991, 3212, -36919, 18468, 180027]
20826A80027N3762n4351l7853L3489L0774J389J728K1156p562J07410m4254q4007
20814B01708Q7111J46951O8019K2630L0200j66174j14117j00862p8598Q260K4273
20803A29401L8347N9123n109l7190K2593n6719Q5949Q9306j550n609n9358J2785
20791B71969n665O933O4719L3603l7187l1885o8757O0855J17008n767q2442N6133
20779C79517j9665j2690j17815n7881q2120P0948K2036Q9471J09688J45571J58985
20768F86045K17183K4140o8002l4799O8048j8416J16p7820q0053n4858R9551J75228
20756I36363R9482m8352o1882o3213j65095j23892L9936Q550j15717Q62j3417
20745D93625m527N1827n0725o7849L3032J08465R1833O4923N1236K13653P0813
$$ y = [180027, 233789, 179438, 141585, 175074, 205848, 207237, 208965, 230121, 222559, 329969, 285715, 201708, 288819, 435770, 503789, 526419, 556619, 390445, 276328, 175466, 96868, 105128, 129401, 167748, 226871, 221762, 184572, 207165, 150446, 236395, 325701, 324151, 318542, 259184, 271969, 266304, 273237, 337956, 371559, 334372, 302487, 233730, 294585, 411593, 405826, 323384, 379517, 359852, 347162, 229347, 171466, 89346, 160294, 182330, 271801, 381489, 527060, 686045, 903228, 927368, 859366, 824567, 892615, 874199, 874315, 796495, 716442, 661584, 761135, 936363, 1035845, 987493, 925611, 862398, 697303, 573411, 613347, 621897, 506180, 507042, 493625, 489098, 540925, 490200, 422351, 455383, 563848, 655681, 720604, 771840, 985493, 1056306]
20734A056306J8981j17043j01880j53342L4221Q4688n3313k0141J07669R8162
20724I54308M8440J2859j13112k2129j54986j83678q8274k98l2004J40243O2109
20713F23478N3113N7362m6169n3108k8956j96442p6124J39309M9578M4814J3629
20702E80484q528l116j02506p2814L3581L7511O5645L1787K14092N4857n4596
20691G76397j295p1598k2621M2593m4991r1194n7414j28857l6612J15549J45217
20680F25174R7832O4842p8610r9955p6629K7652M9927N4586k9257N2927R784k3347
20668F74926r1396M5462P4602K8646m7101n9783o448P7902r7137R0343J12654
20657H02670L6447m060k9769k2348Q0653M1876o3m9428j1969P1204L9474r5273
$$ y = [1056306, 1075287, 958244, 856364, 703022, 737243, 821931, 768618, 748477, 856146, 954308, 1002748, 1015607, 902495, 880366, 725380, 541702, 453428, 453130, 421126, 561369, 623478, 676591, 733953, 687784, 634676, 605720, 409278, 333154, 472463, 522041, 566855, 580484, 571956, 568840, 466334, 393520, 427101, 464612, 530257, 562044, 776136, 830993, 776397, 775102, 703504, 680883, 723476, 678485, 587291, 529877, 401020, 364408, 479957, 625174, 723006, 787848, 709238, 609283, 532654, 560306, 610233, 664819, 635562, 688489, 698273, 674926, 583530, 628992, 703594, 732240, 685139, 625356, 618908, 696810, 599673, 690016, 802670, 839117, 835057, 805288, 782940, 863593, 905469, 905406, 855978, 844009, 915213, 954687, 859414]
20645H59414N0521L9129P1629J09427J44276J5054j05268o3221P0577J21057R5945
20634A408540R8793J49056J45317j1590k9049K2564J14686L7361j011J13240J47366
20623B195273Q7215K24245K32314K77472K92252L39737L60680K41292K28991K41732
20613D721203K52923L59383K17616J59620J71106K46591L37680N33290P58274
20604G757686O88612P94556R83615J036960R78247J124464J344187J313154J574176
20595A7595657J878178K335042K956894L757051N135228O797353R164042J2674210
20587F2293655J7845897K4624209L0653255L1962966K5845318J5049300N696810
20580B13971410K694996M909284N700034O8992j0082857j8524890k0215360j3866195
$$ y = [859414, 909935, 949064, 1020693, 1130120, 1274396, 1289450, 1184182, 1120961, 1191538, 1312595, 1408540, 1507333, 1656389, 1801706, 1790116, 1761067, 1783631, 1898317, 1935678, 1934667, 2047907, 2195273, 2282488, 2506733, 2739047, 3016519, 3308771, 3648508, 4009188, 4250480, 4479471, 4721203, 4974126, 5333509, 5551125, 5710745, 5881851, 6128442, 6466122, 6999412, 7757686, 8446298, 9240854, 10224469, 11261429, 12239676, 13364140, 14708327, 16021481, 17595657, 19473835, 21808877, 24765771, 28522822, 33658050, 40455403, 49619445, 62293655, 80139552, 104763761, 135417016, 167379982, 193225300, 208274600, 213971410, 216666406, 221575690, 227275724, 227344716, 217261859, 198736969, 178521609, 164655414]
20572A64655414k404216J0092241K0353142K4060097J8932712Q101056j390085
20565B42400361m827940k564209j438371p158501j8009833k7667075l1331763
20558A49402669k8328877k1932010j5731103j1232210q510467o903834o183588
20551E0580580n522312m841935m317276l702302l205382k763974k464209k164145
20543B1599045j879073j667324j650925j437295j105397j022076r56610p80263
20535A1100082o41591n73138n91608o32177m42009n14269n36133m45900m51649
20526F271608n54779m57699m01161m32943l15793k26984k36712k65428k06398
20517C173711j83505j17040n8003j27648j3163j93794j62950j35380r9511o8545
$$ y = [164655414, 162251198, 172343439, 192696581, 216756678, 235689390, 243790446, 242400361, 237572421, 235008212, 233569841, 226411340, 208401507, 180734432, 149402669, 121073792, 99141782, 83410679, 72178469, 63668002, 56764168, 50580580, 45058268, 40216333, 35899057, 32196755, 28991373, 26227399, 23763190, 21599045, 19719972, 18052648, 16401723, 14964428, 13859031, 12836955, 11880345, 11100082, 10458491, 9885353, 9293745, 8661568, 8219559, 7705290, 7169157, 6723257, 6271608, 5716829, 5259130, 4857969, 4425026, 4109233, 3882249, 3645537, 3380109, 3173711, 2990206, 2873166, 2815163, 2687515, 2674352, 2480558, 2317608, 2182228, 2082717, 2014172]
20507B014172o9954q8585m6175j39322q7537Q936p8154j29808o5591n8733l7711
20496A221538R0328K8884l3853j06474n5410l6180j36370j23640o1604k2483P2398
20485H37134L3807M4676M266j00980l9568L5660m6795j1196J72485M0013j29015
20474H40487M213m4582J2022K9663K6318J8168L0236r2697j0747R143o1232M3414
20462H04406K3479n3093L1620J08531L4659m5696p7492N1654l782l2292j3702
20451H28292Q9938N5210j10945q8955K4527j0039o7860j99L9490k6621j4133K4845
20439G43550N125L3241Q111j231K3854P341j29729j16836N6580P7174L9079m6654
20427F99605j31849n1838m0003l7089Q9722P275P888J03610Q3530k0315j38225
$$ y = [2014172, 1944218, 1855633, 1809458, 1670136, 1582599, 1591535, 1513381, 1383573, 1317982, 1259249, 1221538, 1311866, 1340750, 1306897, 1200423, 1145013, 1108833, 972463, 848823, 787219, 764736, 837134, 870941, 915617, 919883, 818903, 779335, 814995, 768200, 757004, 929489, 969502, 840487, 844700, 800118, 812140, 841803, 868121, 886289, 916525, 823828, 813081, 822224, 760992, 804406, 827885, 774792, 806412, 914943, 949602, 903906, 826414, 878068, 874286, 841994, 828292, 918230, 973440, 862495, 773540, 798067, 788028, 720168, 719969, 759459, 732838, 718705, 743550, 748675, 781916, 790027, 788796, 812650, 819991, 690262, 573426, 630006, 707180, 746259, 699605, 567756, 515918, 475915, 438826, 528548, 535823, 543711, 647321, 730851, 710536, 572311]
20416E72311o1225k5131Q6820O8445j59791j15382n543P9822l9680p156J9711
20405D13201Q333n423n4416o62o885L6818N2790j07971j21012J0101R1444N2885
20393C69203o9128J9538l9462R7027l616L5870l7675K6416o751K633n4653n6132
20381B83270p8889L3858r5230O0484O7699n3515m5664M8221L917k098k5028j5645
20369A81380R4189P2988Q087j10657j24065r7410R5964M8013J15992N0132j54130
20358A80483j35181N963M3315R1239R0945L2449L7127j44558o2274l1124l4539
20347G3845K3891k0384R2246J98986R8675p1787M298J1893J1242O187j52121N5102
20335C32073O4398M6189J5202J16178K33402O2796l8626n306k8274p2369j1179
$$ y = [572311, 511086, 485955, 572775, 641220, 481429, 366047, 360504, 440326, 400646, 393490, 413201, 421534, 416111, 361695, 361033, 354148, 390966, 443756, 335785, 214773, 224874, 316318, 369203, 300075, 319613, 280151, 377178, 373562, 409432, 371757, 398173, 391422, 394055, 339402, 283270, 204381, 238239, 143009, 203493, 271192, 217677, 172013, 220234, 224151, 222053, 197025, 181380, 275569, 348557, 356644, 245987, 121922, 24512, 120476, 168489, 284481, 334613, 180483, 45302, 51265, 94580, 185819, 276764, 309213, 346340, 201782, 139508, 108384, 73845, 97736, 77352, 169598, 368584, 467259, 395472, 399770, 411663, 422905, 429092, 276971, 332073, 396471, 442660, 457862, 574040, 807442, 870238, 831612, 826306, 798032, 725663, 714484]
20324G14484p742n0976K7854N9767l6835p1437P7133O6224p7520j4197j3071N7069
20312G30753K9141m0506r3291l2489P1398J63675j0012l0910P3536J53803J21042
20301A136140P6764L8649J32537J16014R0223M6916p675m6653o9691j17905k9934
20290A365385o8919O589J49608M5232k7524k0221j46675j65951m9971l9250M5141
20279A093444m1156n6014J5752J0403m5147M4639J69562N2605J12627M6364L9790
20268A442869J8379l4949M8860j4532l9864m5443N940q62J75119L04351J76493
20257B036361J10886J23132L8133j42434j50785o3691j45925j06345n5001p713
20247A636618P7572R200O9065J61891O6253J40991J74352J90117J48195J74084
$$ y = [714484, 706742, 655766, 683620, 743387, 706552, 635115, 712248, 778472, 700952, 686755, 673684, 730753, 759894, 719388, 626097, 593608, 665006, 828681, 818669, 787759, 861295, 1015098, 1136140, 1212904, 1251553, 1384090, 1500104, 1590327, 1637243, 1629568, 1582915, 1513224, 1395319, 1365385, 1296466, 1303055, 1452663, 1497895, 1470371, 1450150, 1303475, 1137524, 1087553, 1048303, 1093444, 1052288, 996274, 1012026, 1022429, 977282, 1021921, 1191483, 1244088, 1356715, 1403079, 1442869, 1461248, 1426299, 1475159, 1460627, 1420763, 1375320, 1381260, 1380398, 1555517, 1859868, 2036361, 2147247, 2270379, 2308512, 2166078, 2015293, 1951602, 1805677, 1699332, 1644331, 1636618, 1714190, 1723390, 1792455, 1954346, 2020599, 2161590, 2335942, 2526059, 2674254, 2848338]
20237B848338K26068J49720J14789m2682J23563J53544K21103K09224L82440L83421
20227D769528M44057M97992M05481L27620L84677K68904L81516L97163N13573
20218H390511P77128R86858J188616J532632J698871J970379K703388L385600
20210B2633983M304414N752344P973730J1344104J6119674K2140646K6585599
20203A16854494K5692312J6674105K638757j0505246j7342641j6014423q738440
20196A09258918P60104J0438580J8507289K1809939J6628074L490835j1892223
20189A69001516k3263549k6703771k2932453j6428087j0471123o547285l986495
20182E8668753k481369j455735l43333J232372L559716O706586J1188143J7336449
$$ y = [2848338, 3074406, 3224126, 3338915, 3296233, 3419796, 3573340, 3794443, 4003667, 4386107, 4769528, 5213585, 5711577, 6117058, 6444678, 6829355, 7098259, 7479775, 7876938, 8390511, 9167639, 10154497, 11343113, 12875745, 14574616, 16544995, 19248383, 22633983, 26938397, 32690741, 40664471, 52008575, 68128249, 90268895, 116854494, 142546806, 159220911, 161859668, 151354422, 134011781, 117997358, 109258918, 110019022, 120457602, 138964891, 160774830, 177402904, 180893739, 169001516, 145737967, 119034196, 96101743, 79673656, 69202533, 62655248, 58668753, 56187384, 54731649, 54388316, 55620688, 59180404, 65886990, 77075133, 94411582]
20174I4411582K3476822K6668249K2414095J0044950n046391j6440527j9741446
20167A35787334j5142051n978284M221377J3638369K0250154K0010373J0835263
20160A83622535m199543j8713359k7129534k7170636k1821977j5455902j0594281
20153E8537303p535663n735691m936448m572647m174643l607406l130988k690554
20145B2153263k203715j948055j638527j419441j213727j034293r36900p76921
20137A0981684p72990o61240o08453n93770o30812n92688o42110m74671l82415
20128E622535k82505k04934j17406j97730l64250k58089k60435l32744k88913
20119C315529k20132k83164j73446j78140N3617M0324j18472j70927j87565j67809
$$ y = [94411582, 117888404, 144556653, 166970748, 177015698, 171969307, 155528780, 135787334, 120645283, 114666999, 118888376, 132526745, 152776899, 172787272, 183622535, 179422992, 160709633, 133580099, 106409463, 84587486, 69131584, 58537303, 51001640, 45265949, 40329501, 35756854, 31582211, 27974805, 24843817, 22153263, 19949548, 18001493, 16362966, 14943525, 13729798, 12695505, 11758605, 10981684, 10208694, 9547454, 8939001, 8345231, 7714419, 7121731, 6479621, 6004950, 5622535, 5340030, 5135096, 5017690, 4819960, 4455710, 4197621, 3937186, 3604442, 3315529, 3095397, 2812233, 2638787, 2460647, 2514264, 2554588, 2436116, 2265189, 2077624, 1909815]
20109A909815j20928j43072L1724l1576j4370k3043j61360q9295K8998O8870o6412
20098A389351j60581Q0551L9152j24190m0078l9519j05691m8527j2148Q9722J4501
20087A082543m2806M3127K5598k7277Q9489m793j8052O4662j43039q299J0344
20076A071497l5275k2532j02305q8436Q7235k5846k12433n8361J42595P587P8656
20065H42382J10777o6414k7423n1281o534L0390k9337M8787k7773r4549P4379
20054H03404J52745j42312l7401p2459K1450j2738r310J04835r8463j37496j08109
20043D64146m9079R9338J37204m892o9971m5014J8952N6284r5735q3066L4976
20032D63143P8972j2443k0194n3655r116O1738Q7019N5942k8459J4995J31252
$$ y = [1909815, 1788887, 1645815, 1677539, 1645963, 1631593, 1608550, 1447190, 1357895, 1386893, 1455763, 1389351, 1228770, 1309321, 1348473, 1224283, 1184205, 1144686, 1038995, 990468, 978320, 1068042, 1082543, 1039737, 1082864, 1108462, 1081185, 1170674, 1165881, 1147829, 1212491, 1069452, 1061153, 1071497, 1036222, 1013690, 911385, 822949, 910184, 884338, 671905, 613544, 756139, 763726, 842382, 953159, 886745, 859322, 808041, 801507, 831897, 802560, 851347, 823574, 729025, 803404, 956149, 813837, 776436, 703977, 725427, 712689, 703379, 808214, 709751, 572255, 464146, 415067, 514405, 651609, 646717, 576746, 531732, 550684, 606968, 511233, 428167, 463143, 542115, 529672, 509478, 455823, 446707, 508445, 595464, 651406, 622947, 637942, 769194]
20021G69194J50880M8264P0120K03584J66715k1871q119L7585Q8159N1786K5188
20010A581485r9001j13868q6355J4043j10292q3040J39583L6584J4195J56806
20000A450140J2538m6176l421q1878k7158P3737q0356j54111k08606j72582k14521
19989E47606j35291o674j1882K0119o7415p4398q9800l1952J35579J57302m8582
19978C94612j59468j19329J7415Q3908J2198J0302J0101J2301k7162l3521m0377
19967A60980l5928P4284M1669K4890j05284q704Q512l8937j864P7049L0713L5511
19955B62891K157K433m1685q8803j3333J29082J31358p0012j19463p792r365n138
19943A72330m0265n8112J18810k6579j20183l7758J90847J22930k5304j0446J21021
$$ y = [769194, 920074, 968338, 1038458, 1242042, 1408757, 1386886, 1378767, 1416352, 1504511, 1556297, 1581485, 1482484, 1368616, 1282261, 1296304, 1186012, 1102972, 1242555, 1279139, 1293334, 1450140, 1462678, 1416502, 1413081, 1331203, 1304045, 1377782, 1297426, 1143315, 934709, 762127, 547606, 412315, 405641, 393759, 413878, 346463, 272065, 182265, 150313, 285892, 443194, 394612, 235144, 115815, 133230, 217138, 229336, 239638, 249739, 262040, 234878, 201357, 160980, 125052, 199336, 241005, 265895, 160611, 151907, 160419, 121482, 119618, 196667, 227380, 262891, 265048, 267481, 225796, 136993, 123660, 252742, 384100, 314088, 194625, 186833, 177468, 172330, 132065, 73953, 192763, 166184, 46001, 8243, 199090, 322020, 296716, 286270, 407291]
19932D07291L0991r15p0648r0657j16279K5506p7496J5993L9202M2232k1632Q4305
19920B67893M3095n086m9292j06990q1488m9258N4356P9680J2953K5333K4022
19909B15218J4285L4381R941k01o2244o3519M9372O2094P6114n2663o1133n6222
19897A65423n9929L152m4021K6782O7291Q120q0171m8100k5448N4704P2645O8351
19885B08799M8651j3466M9394J0379j1708k1381k5717L3203N6343l7134j38715
19874A58648j3420j3860M2066J0050q7532k8511P6244M7715M6942M6164o4395
19863B20111J8550J7453N6308r6155k45507o5483Q0733l7306N2770N5443J93080
19852B49997m3413n0814m5728k1518O1844K7265Q7061n4906n4965j17243k713
$$ y = [407291, 438282, 437367, 366719, 276062, 159783, 185289, 107793, 123786, 162988, 205220, 183588, 267893, 310988, 305902, 256610, 149620, 68132, 18874, 73230, 152910, 165863, 191196, 215218, 229503, 263884, 273825, 273624, 211380, 147861, 197233, 259327, 335441, 282778, 221645, 165423, 105494, 108646, 64625, 91407, 158698, 166818, 86647, 38547, 13099, 67803, 140448, 208799, 257450, 243984, 293378, 303757, 292049, 270668, 244951, 278154, 334497, 297363, 158648, 145228, 131368, 173434, 183484, 95952, 67441, 143685, 191400, 238342, 284506, 220111, 238661, 256114, 312422, 216267, -29240, -94723, -13990, -51296, 1474, 56917, 249997, 206584, 155770, 110042, 88524, 150368, 177633, 264694, 209788, 154823, 37580, 34867]
19841C4867P8455j16686l6866K4569k330L4319m5241L9111p2728j00453k9572
19830a92555p4944j5753R0131n9611m0006j315R8398J12274j6369j34659R664
19819b24745N0601q335l0058O029J8713K7198K7060p432Q3553j3669k6662J13207
19807A5460n030j6202N7464q200l9568m1926n7093n0692m0070M8575Q8237P9438
19795C0393K6271r6831j05641q2942k621J33000K6148N145q140M9597P7106J18085
19783A69570j4209j26753r4741j55536m2766M7804K9400K5052P6183L305L5667
19772d7024L9438l7506j39841o0496N0965J31673J7839M383K315p6964n3535L6655
19760a32098R6814J91605O92k7222L4185Q5317j94626j13948J14254K0616n7081
$$ y = [34867, 113322, -3364, -40230, -15661, -17991, 16328, -28913, 10198, -62530, -162983, -192555, -267499, -283252, -193121, -252732, -292738, -294053, -195655, -83381, -99750, -234409, -224745, -174144, -182479, -212537, -206508, -187795, -160597, -133537, -140969, -57416, -71085, -97747, 15460, 10430, -5772, 51692, 43492, 3924, -38002, -95095, -145787, -185857, -137282, -49045, 30393, 56664, -40167, -145808, -228750, -231371, -98371, -72223, -67078, -75218, -25621, 51485, 169570, 155361, 28608, -66133, -221669, -264435, -216631, -187231, -162179, -85996, -82691, -47024, -7586, -45092, -184933, -245429, -194464, -62791, -44952, -40569, -38254, -115218, -168753, -132098, -35284, 156321, 157013, 129791, 163976, 249293, 54667, -59281, 54973, 75589, 18508]
19749A8508M9556m0833l8766J46140L0893r2265q6460m5138N4021l9342n4179
19738i7865K9266l6273N7393k1356M7775L7923q3398o7478Q033P9059L2924k2266
19726c6263q6553J15495O6224o8757N2603O6854K941J1040j4901l927p7448j0610
19714A6698k5491j5694N93Q1879N4681j16240j34850j5993n050J02271J29481
19703G2285n3467J3880P8725r688j01399Q579l7886j7019R5694l6208R7198o2520
19691D8174o3771R2453J4265m3800n7353Q1480o1273l8885m6244L5570O6343j24127
19679i7168K8062R7548N4095l1774l1967q9018o9459M5490P6093L9170o0181Q5465
19667D6356M5033m3213j5155K7737p5734j19350K8069P4529K5248O1444Q4449
$$ y = [18508, 68064, 27231, -11535, 134605, 165498, 73233, -13227, -58365, -4344, -43686, -97865, -68599, -104872, -47479, -68835, -21060, 16863, -66535, -134013, -125980, -46921, -13997, -36263, -122816, -7321, 58903, -9854, 42749, 109603, 112544, 123584, 108683, 104756, 27308, 16698, -8793, -24487, -23894, 57985, 112666, -3574, -138424, -154417, -159467, -57196, 72285, 18818, 32698, 111423, 101735, 336, 8915, -28971, -45990, 49704, 13496, 110694, 48174, -15597, 76856, 91121, 47321, -10032, 71448, 10175, -28710, -74954, -39384, 26959, -97168, -69106, 28442, 82537, 50763, 18796, -70222, -139681, -94191, -18098, 21072, -39109, 46356, 91389, 48176, 33021, 60758, -14976, -134326, -106257, -31728, -6480, 54964, 139413]
19656A39413J30632M1402k9241k1547o5904r9558m1951j2553q2486J4313q5899
19645a13379N6307J30890K7077K0706J4057M496r25k2662k6100J61173K49706
19634E01346K45300M4880N5062l0089m9421K5558R6819M49m7613j70164o0026
19623F12101J52262M2611J23173M4475p8628j82493j74717j86636l2712j1605
19613C07831m6339m6524k9897m797o1578j0634P1725J280J10193K32851K94481
19602H18592M8585N8253J4712j07474l0760n9575k3194Kl1199l2159J59876J82655
19590I98314n651j30190r4864n9538j35423o2043m15L7163k6515o132O3287K1710
19578E99703q0064j37044k7949p2644K6209K6904M3975k0109M0872N7298J25463
$$ y = [139413, 270045, 311447, 282206, 260659, 194755, 95197, 53246, 40693, -41793, -27480, -113379, -57072, 73818, 100895, 121601, 135658, 140154, 139229, 116567, 90467, 251640, 501346, 746646, 791526, 846588, 816499, 767078, 792636, 889455, 889904, 842291, 672127, 612101, 764363, 806974, 930147, 974622, 895994, 713501, 538784, 352148, 319436, 307831, 261492, 214968, 185071, 180274, 118696, 108062, 179787, 181067, 291260, 524111, 818592, 867177, 925430, 940142, 832668, 801908, 742333, 719139, 719141, 687942, 655783, 815659, 998314, 992663, 862473, 767609, 708071, 572648, 510605, 510190, 547353, 520838, 514706, 577993, 599703, 519639, 382595, 354646, 282002, 308211, 335115, 379090, 358981, 399853, 457151, 582614]
19567E82614J06217K8026j06795k6329o0997r5983q436Q019R2195K40027J16177
19556H74735n0698j8611k9363K4972n749j12063j50793o4719N6323J88799P83
19545G13616k7848J3133J0971K3508l9056j64883j57296q3933r4759j00046l2450
19534F0957P2014J12021K3422r0247j1119M2899o1533l0768j0864L8072K7878
19523A72732P0165P4320J13633J61838m686o4160p6561j5812k4019j0348l4570
19512C62532j9745M4937O2892J62952K14719Q3611m5066J3519L4681J7845r7084
19501H35793k01143j50005p2170P160J05771J6912J08377J27887J3239p0457j68915
19490E52449j15032k1382J6801j21770q1617L1667Q7232K0224o5520m3182J9888
$$ y = [582614, 688831, 716857, 610062, 583733, 522736, 426753, 418317, 426336, 518531, 758558, 874735, 824037, 805426, 776063, 801035, 795286, 683223, 532430, 467711, 524034, 712833, 713616, 685768, 698901, 709872, 733380, 694324, 529441, 372145, 288212, 193453, 93407, 60957, 132971, 244992, 268414, 178167, 167048, 209947, 148414, 117646, 106782, 144854, 172732, 242897, 317217, 430850, 592688, 588002, 523842, 447281, 431469, 407450, 397102, 362532, 342787, 387724, 450616, 613568, 828287, 911898, 866832, 880351, 915032, 932877, 835793, 634650, 484645, 412475, 419635, 525406, 542318, 650695, 778582, 791821, 721364, 552449, 437417, 416035, 432836, 311066, 229449, 261116, 348348, 368572, 303052, 259870, 279758]
19479B79758k9598n7030m3108m9456r7280N0178R8695K9022k4965k9370m3195
19468H3651N0891k7819q8937l5056n6990r1620J12023J59776o869m4174j8372
19457C6504O76m3858N5820j4474K8683J137K1754M1861j4180l578m7551p4676
19445a1882N344K5967J3951l003Q779o6095p1576N6589L2996M766l9536j7089
19433f0789Q0928J10015N244L5814J0675K8354l2326O0027M7501l8622p9039k8482
19421A39300l0280L0855n0742K1016l3074L0080j4006O9158K0736o084j05917
19410G1042j43921k5657O2295P6804J60379q5099n0662M4564m7693p66j3485n9749
19398a1948N5451J05579Q4156L5759J2118J0061m2699o9029J1142o0781j35631
$$ y = [279758, 250160, 193130, 150022, 100566, 3286, 53464, 152159, 181181, 156216, 126846, 83651, 134542, 106723, 17786, -17270, -74260, -165880, -53857, 105919, 99050, 54876, 36504, 37180, -6678, 49142, 34668, 63351, 64488, 86242, 128103, 113923, 110345, 62794, -11882, -6538, 19429, 33380, 30377, 39156, -26939, -98515, -41926, -8930, -4164, -43700, -60789, 20139, 130154, 135398, 171212, 181887, 210241, 177915, 237942, 285443, 246821, 167782, 139300, 109020, 139875, 89133, 110149, 77075, 107155, 93149, 162307, 183043, 176959, 71042, -72879, -98536, -36241, 40563, 200942, 115843, 65181, 109745, 62052, 61286, 47801, -11948, 43503, 149082, 233238, 268997, 281115, 291176, 248477, 179448, 190590, 129809, -5822]
19387e822J32728O8489M8952N85p7460j0776J5783N072k2385J15488o382J1852
19375B76124j13534m4367O1525O7627p31j18428j49663l5485J4674J6981N8397
19364C3120k4323j04197M594O3222j5339O6952N3628j13138q2315J41338m9464
19353b5922r904P7576M1455k2256p5628R558J21902K7517J6851J07400o520j24774
19341A37255o6854j21796K1455R393J20655P7754N1059K5562L2411P287q7745
19330B06436M8091j6959j57111j57501m0651M1091L051l1225j6536J80444J19596
19319A78726k2065r2028M3210P6782P7373m2114j22304P4912M4240J1493N2373
19308B80598j12989j38200r2211O1552N8882M9567Q1125k7169k5364P0985R5860
$$ y = [-5822, 126906, 195395, 244347, 244932, 167472, 156696, 172479, 177551, 155166, 270654, 264272, 276124, 162590, 118223, 179748, 247375, 246644, 128216, -21447, -56932, -42258, -25277, 33120, 8797, -95400, -90806, -27584, -42923, 24029, 77657, -35481, -117796, 23542, -25922, -35826, 41750, 83205, 60949, -14679, -5121, 116781, 144298, 161149, 268549, 262029, 137255, 70401, -51395, -29940, -20547, 100108, 177862, 228921, 254483, 286894, 294181, 206436, 254527, 237568, 80457, -77044, -117695, -76604, -73553, -104778, -121314, 59130, 178726, 156661, 64633, 107843, 184625, 261998, 219884, 97580, 172492, 216732, 228225, 280598, 167609, 29409, -62802, -1250, 57632, 107199, 188324, 161155, 135791, 206776, 302636]
19297C02636r5140l1396P832m4668K2583K6532M4886o7663m3334j8940O9761l91
19285A72698j7469N6821J36319j55142o8200l1402J1781l3841N3055M6640q290
19274A62970O4865M279O165j11013k2598l566m304L5003J3708M4293m3963n5561
19262I0278L7028m8320J55999J20000q901p0837k4699j01092J3730R2610J32856
19251C88652J39184r5190j32102k5381m6298n5436J9333M6596k3730r9612n3681
19240F2335K373J25084J35915l7888p1690j2755l7032o077l7065j9627n8296M3474
19228H8751Q7994Q1034q6310m6220j9500M6967j8874j14180n5633P3970J06012
19217A44011Q1947J8057m3529j22903N1455k8487m2822O6012N3460N7009q8967
$$ y = [302636, 207496, 176100, 183932, 139264, 161847, 188379, 233265, 165602, 122268, 103328, 173089, 172698, 155229, 212050, 348369, 193227, 125027, 93625, 105406, 71565, 124620, 171260, 162970, 227835, 232114, 238279, 127266, 104668, 101102, 96798, 131801, 145509, 189802, 145839, 90278, 127306, 78986, 234985, 354985, 346084, 275247, 250548, 149456, 163186, 255796, 388652, 527836, 432646, 300544, 275163, 228865, 173429, 192762, 239358, 215628, 116016, 62335, 64708, 189792, 325707, 287819, 216129, 203374, 166342, 160265, 123200, 103573, 45277, 88751, 176745, 257779, 171469, 125249, 105749, 152716, 133842, 19662, -35971, 37999, 144011, 225958, 244015, 200486, 77583, 129038, 100551, 57729, 123741, 177201, 234210, 145243]
19206A45243m4183k149K925L966q41p2917p3595N3275J02787K9867M5968L9583
19194B29929K1511R075j1778O3388M1558j880j399j08015q3645m9704R7101j1621
19182A94520l0615j9082k2759J12257R7743J8069k4003J5286m0086m0432N9201
19171C20099l8377Q011m4610M8341Q1016M1124L9750K2743L4672o4769j70281
19160B77719j22831L3331j8404j8625J10218n8177M3120P9847j39599j23809Q0915
19149A43705P9750P6482O6595n0260o5877L4984l5755j13478P374J64625N7963
19138C66108J5646k1649l8405P3762O8020m1763K7104J13983L7664M5702O1835
19127G08007O5407k2467r1402l4406Q5262O189j03963l9073j6129L4929P7156
$$ y = [145243, 101060, 98911, 101836, 105802, 104961, 32044, -41551, 11724, 114511, 144378, 190346, 229929, 251440, 260515, 248737, 312125, 353683, 351803, 350404, 242389, 158744, 109040, 206141, 194520, 163905, 144823, 122064, 234321, 332064, 350133, 326130, 341416, 301330, 260898, 320099, 281722, 289733, 245123, 293464, 374480, 415604, 455354, 478097, 512769, 448000, 277719, 154888, 188219, 169815, 151190, 261408, 203231, 246351, 326198, 186599, 62790, 143705, 223455, 299937, 366532, 316272, 250395, 285379, 249624, 136146, 143520, 308145, 366108, 381754, 360105, 321700, 395462, 463482, 421719, 448823, 562806, 600470, 646172, 708007, 773414, 750947, 659545, 625139, 710401, 716590, 612627, 573554, 557425, 592354, 669510]
19116F69510J8038N352j6304Q6571j5185o8535k0229j9238K7458K3802M6189n261
19104G32168p2085J07776L3671q7781J24118O0393m7187R1182N9179N1002J61618
19093A214054J67563J01464J31578l2778N1299O3522J19017K40283J78517K23880
19083B458399K35141L01492L16236L18756L01780K51930L91841O33878Q81240
19074F090693J027548J049813J302759J547175K112853K731388L915862N930069
19066B5708160R593187J4656205J8915485J7747232Q492212k862075j1709892
19059H0540514j4094548r568782l028918L458345J0022957J6702741K0241808
19052A04274117J6390453P898824J876478k63502j61143l942762j0794697j6542466
$$ y = [669510, 687548, 692900, 676596, 763167, 747982, 679447, 659218, 639980, 667438, 691240, 737429, 732168, 660083, 767859, 801530, 713749, 837867, 898260, 851073, 942255, 1001434, 1052436, 1214054, 1381617, 1483081, 1614659, 1581881, 1633180, 1696702, 1815719, 2056002, 2234519, 2458399, 2693540, 2995032, 3311268, 3630024, 3931804, 4183734, 4575575, 5209453, 6090693, 7118241, 8168054, 9470813, 11017988, 13130841, 15862229, 19778091, 25708160, 35301347, 49957552, 68873037, 86620269, 95112481, 92250406, 80540514, 66445966, 56877184, 53848266, 57306611, 67329568, 84032309, 104274117, 120664570, 128563394, 130439872, 130176370, 130015227, 126072465, 115277768, 98735302]
19044I8735302j7167298j2248606n836157J60601O171209J2074623J4433364Q998881
19036A05321919k320040j2461393j8348533j7016774j1729034p290556m528144
19029C1627445k792054k008195j776962j402925r90168q51193m88442r382N53441
19020B1861565J280151K048905L461565N906543R781535J5385326K0742648K0272915
19012A00741153J0705293k318811j2770079j6560888j1967257m479778K905716
19005F6255349J0242048J7717456K2040699J8845283R951713K988453K79932M21265
18997A48742198l480174j1498484j8693238k0719807j5133874p451269p36931
18990G1028421N944215J2649781J5942316J0799394j404415j3145741k0740602
$$ y = [98735302, 81568004, 69319398, 63483241, 63643842, 69815051, 81889674, 96323038, 105321919, 103001879, 90540486, 72191953, 55175179, 43446145, 36155589, 31627445, 28835391, 26827196, 25050234, 23647309, 22657141, 21805948, 21317506, 21308124, 21861565, 23141716, 25190621, 28652186, 34558729, 44340264, 59725590, 80468238, 100741153, 111446446, 109127635, 96357556, 79796668, 67829411, 63349633, 66255349, 76497397, 94214853, 116255552, 135100835, 145052548, 148041001, 148320933, 148742198, 145262024, 133763540, 115070302, 94350495, 79216621, 71765352, 71028421, 76972636, 89622417, 105564733, 116364127, 114959712, 101813971, 81073369]
18983H1073369k0078980j4356026r118102n647324l555553k647604k385078k401285
18975B0883417k471902k155665j891553j585960j337555j169773j083802q92152
18967H295055p57637p66784o26251n83527n16924m84691m29942k89980k78254
18958C561065k42735k89822j66136j51773j48026k43507j38610m8723q6705j08007
18948A937021j38646p312o0445K4604j86641m1422m0291l0103j18611j18616n9933
18937A159605j8691J13703k7315k07293r7255n5753l6570Q0674p7295j03114m5067
18926F85629J5897o4982M0843Q9062m7590r2885M4906j4482o3781p098l6920L6615
18914E85214J37509J27427n7377o6519p7951j43528n6307J02087P5015p3749K3325
$$ y = [81073369, 60994389, 46638363, 37520261, 31872937, 28317384, 25669780, 23284702, 20883417, 18411515, 16255850, 14364297, 12778337, 11440782, 10271009, 9187207, 8295055, 7537418, 6770634, 6144383, 5560856, 5043932, 4559241, 4129299, 3839319, 3561065, 3318330, 3028508, 2862372, 2710599, 2562573, 2319066, 2180456, 2131733, 2045028, 1937021, 1798375, 1791063, 1730618, 1755222, 1568581, 1527159, 1486868, 1456765, 1338154, 1219538, 1159605, 1140914, 1254617, 1227302, 1020009, 922754, 867001, 830431, 911105, 833810, 730696, 685629, 701526, 636544, 677387, 766449, 718859, 625974, 670880, 656398, 592617, 585519, 548599, 585214, 722723, 850150, 792773, 726254, 648303, 504775, 448468, 550555, 625570, 551821, 575146]
18903E75146Q9950K0718O666n4983n7731P1698m6386j27993l6222J45620p1687
18892E14796n1747K5468M6764J34396K9545n7170o6204N1974L7120J3154K9739
18881G07835P128k00289j03137L7199P6478J992l4290M8073Q2625j2559l5452
18870E75603m5277p9496j1571M7515k5467j9081q5668m4141M7918M558j3687r691
18858C41515O575k5729n0801M1849Q112J14734K0106l0538r5704J9829P2905n8670
18846C64183K99L4553L1072K7782q9459p0429P911J4281R0141K0402J9456R8254
18834E48446j15338j06611m0073o9216r2816R3388J63696O4467l0524k4576r1795
18823B99048j27625j00978J19213L0143j34508p4685J23480P5594J16509N3142
$$ y = [575146, 665096, 685814, 692480, 637497, 579766, 651464, 605078, 477085, 440863, 586483, 514796, 463049, 488517, 535281, 669677, 699222, 642052, 575848, 627822, 664942, 678096, 707835, 714963, 514674, 411537, 448736, 525214, 527206, 492916, 540989, 623614, 611055, 575603, 530326, 450830, 439259, 486774, 461307, 442226, 356558, 312417, 360335, 364893, 351206, 341515, 348090, 322361, 271560, 313409, 321521, 436255, 456361, 425823, 330119, 349948, 422853, 364183, 364482, 399035, 430107, 457889, 368430, 298001, 305912, 320193, 410334, 430736, 450192, 548446, 433108, 326497, 286424, 217208, 124392, 217780, 381476, 445943, 415419, 390843, 299048, 171423, 70445, 189658, 219801, 85293, 10608, 134088, 209682, 326191, 379333]
18813C79333j57190j58296R4607Q9027O182j8267j00586R040O153j24188N562
18802C1377O3567J04756K3374n4557K0363m7572J18973N0502L0983P6399j6634
18791D01531J01644k0935p1372P8346J97511J95770J95643l7159j86982l9199
18781H14798L9654M0931N0181j84456o3335R8905R148j0193j1375l2127P059R4493
18769H53683J56003J46362l5992m6211j55786j32116j12562j59124k3588n2429
18759D38240N5443J90589Q5217P2001J26975J51109l391k16067n9980Q2910M0418
18748I63464o0439r4926n4260Q946L3986r449j8219j01478n5276K0586O2921P4965
18736G70821N6560J44546O5390J3543p8384n4984l47n862r4202k13388o9800n3160
$$ y = [379333, 222143, 63847, 158454, 247481, 253663, 235396, 134810, 143850, 150003, 25815, 31377, 94944, 199700, 223074, 168517, 188880, 141308, 260281, 310783, 341766, 418165, 401531, 503175, 482240, 410868, 489214, 686725, 882495, 1078138, 1040979, 853997, 814798, 854452, 895383, 945564, 761108, 697773, 796678, 805826, 795633, 784258, 752131, 759190, 853683, 1009686, 1156048, 1120056, 1073845, 918059, 785943, 673381, 514257, 490669, 438240, 493683, 684272, 769489, 841490, 968465, 1119574, 1116183, 900116, 840136, 923046, 963464, 903025, 808099, 753839, 762785, 796771, 787322, 769103, 667625, 612349, 632935, 695856, 770821, 827381, 971927, 1037317, 1050860, 972476, 917492, 917145, 911283, 817081, 603693, 533893, 480733]
18724D80733j4170l6569q8943J3819n0077J6468N2014M6336l3783l5010O7838
18713D18656J1629k2060j09297J03666L6186P87L1560Q5218K5326L79j2581j7729
18701E51740p3295J04312K9729p5186j3450n2832q3379j10983n5122K023R17O0241
18689B84715M6068J983l4473L4454j9171j10148j03588K4271m7742l732o3836
18678H801J6029N5011J84296J82794p6888k4305r4997o1220j69603p0702K6967
18667b3817P0857J00885k7197m1129m1750K2284P0152Q6801J8781k9031J26488
18656C33324m2476K6770J70208J17961J34994P4716m1618j01342j20803n5926
18646D95808l8101M36r3611j46677j5588M6150O4710p1264q6948L8933K9517j2270
$$ y = [480733, 466563, 429994, 341051, 354870, 304793, 321261, 373275, 419611, 385828, 350818, 418656, 430285, 408225, 298928, 402594, 438780, 439567, 471127, 556345, 581671, 582050, 569469, 551740, 478445, 582757, 612486, 537300, 523850, 471018, 387639, 276656, 221534, 223557, 224474, 284715, 330783, 332766, 298293, 332747, 313576, 203428, 99840, 124111, 76369, 72637, 8801, 24830, 79841, 264137, 446931, 370043, 345738, 250741, 189521, 19918, -50784, -23817, 47040, 147925, 120728, 79599, 37849, 60133, 130285, 217086, 235867, 206836, 333324, 290848, 317618, 487826, 605787, 740781, 815497, 773879, 672537, 551734, 495808, 457707, 458143, 364532, 217855, 202267, 248417, 313127, 241863, 154915, 193848, 223365, 211095]
18634B11095j37239n1472J1481N9272J6566L6597N0895k1330m6822R941O6621
18623B05605M1338p264r1274j28009M5827K08963K2510p2398L3474l8660J9614
18612B39726J35151J45273M4760J9237J15135J10483K46122K53341K37365R5166
18602A641759J08171J8556p6806k82219j95153j89962k30206k04398j33492K2175
18592D78425m1401Q976K7078l5229j41050j6995M8374K8172K1430q147j21276
18581B48357k5461J17694m2493p5848N9791K09740Q4624j42013j59595j14188
18571A60608n302j2443p2909j07936L4330M3558n603L3893J29021J00950L1297
18560C29464o0179P7154J24495Q3770J54871K03298J79699K40708J07819J7809
$$ y = [211095, 73856, 22384, 33865, 93137, 109703, 146300, 197195, 175865, 129043, 138984, 205605, 246943, 239679, 148405, 20396, 66223, 275186, 297696, 225298, 258772, 220112, 239726, 374877, 520150, 564910, 584147, 699282, 809765, 1055887, 1309228, 1546593, 1641759, 1749930, 1768486, 1691680, 1409461, 1214308, 1024346, 794140, 589742, 456250, 478425, 437024, 446000, 473078, 437849, 296799, 279804, 328178, 356350, 377780, 369633, 248357, 222896, 340590, 298097, 222249, 282040, 491780, 576404, 434391, 274796, 160608, 155306, 142863, 69954, -37982, -3652, 39906, 34303, 68196, 197217, 298167, 329464, 269285, 346439, 470934, 554704, 709575, 912873, 1092572, 1333280, 1441099, 1458908]
18550A458908m5764j14124j57705k55071k04064j12109M410r8751K2124N8868
18540E56722N2273J34538J08550M3755n7943r476K0752p709M98r1086r3403K7200
18528F84671P5431O9544K6856O7468m3931m3135j62130j47474r9545k3611N67
18517D04711J120q4945q4180q7587K229p1186k1834M5562J77799L7413p383l6235
18505B75484J46497J53974k0242M5984J80008m7163n1664j9204q486K9325m8110
18494F36403o3372R9576R1326J98371J43466R5319L5807o5844j14858j04744q0573
18483H70877q8001j24224j75962Q8469J39234J52089P7929K80236J51867J11934
18473A484448J21862p2463r3550j01178j52293k00561j29491O2599K8626J22923
$$ y = [1458908, 1413144, 1299020, 1141315, 886244, 682180, 570071, 574481, 475730, 497854, 556722, 608995, 743533, 852083, 895838, 837895, 828419, 849171, 841462, 841960, 750874, 657471, 684671, 760102, 829646, 856502, 923970, 880039, 836904, 674774, 527300, 427755, 404144, 404711, 405831, 320886, 236706, 149119, 151348, 80162, 58328, 103890, 281689, 319102, 311719, 275484, 421981, 575955, 555713, 601697, 781705, 734542, 682878, 663674, 655188, 684513, 636403, 573031, 672607, 763933, 962304, 1105770, 1201089, 1236896, 1171052, 1056194, 951450, 870877, 782876, 658652, 482690, 571159, 710393, 862482, 940411, 1220647, 1372514, 1484448, 1606310, 1533847, 1440297, 1339119, 1186826, 986265, 856774, 919373, 947999, 1070922]
18463A070922j0276O346l8946j60253m1377j70939j40679p453P4364M7392k1387
18452F07714o7584j3870l8757J3266Q6187J14803J32227J63894J53944l3064K634
18441A121394n2295n2028P3479n6819o5870M6302Q0548j1905P1655J2881j90443
18430I76899j93930k26391j28460n3740n4197j31626j18098K115O3863J13730
18420B50165k3898M1101P6411p305r2684r2557m0767K5753K5828P0476J01856
18409C34379J28094L8593p7015M7140Q4887J1811l168j18781L8522Q085o736K5189
18397E11000k2167P4337k7863O916N2617m3992j51983l6192o446n1866j53M3540
18385C47748K724n9101k1625k3274m4055j30222j04391r203J35807J50853J04621
$$ y = [1070922, 1060646, 1066992, 1028046, 867793, 826416, 655477, 514798, 507345, 581709, 629101, 607714, 540130, 526260, 487503, 500769, 586956, 701759, 833986, 997880, 1151824, 1118760, 1121394, 1069099, 1017071, 1090550, 1033731, 967861, 1014163, 1094711, 1082806, 1154461, 1167342, 976899, 782969, 556578, 428118, 374378, 320181, 188555, 70457, 72572, 136435, 250165, 226267, 267368, 343779, 336474, 243790, 151233, 110466, 136219, 162047, 232523, 334379, 462473, 501066, 424051, 471191, 556078, 567889, 564721, 445940, 484462, 492547, 485811, 511000, 488833, 563170, 535307, 542223, 594840, 550848, 398865, 362673, 356227, 304361, 304208, 347748, 350472, 291371, 269746, 246472, 202417, 72195, -32196, -41399, 94408, 245261, 349882]
18374C49882M8132l3385l8772o0783J0117R643O4469M432K9218P4036J66056Q7786
18362G10831P9438P5247Q7701J0217N9027q0826M5611J02457J3286o9426k795
18351A030768p0163J2445Q460o8999j93630k7876J43430J14621J7232o5189j64610
18340G36489m3388m0204L8258L3073k1537k4588j17900N3570J9381r1529j9516
18329E22109L6996O1360M9410j8767L9698J32811N8617K0621K4249N8471n260
18318I80315K2129J4880J28990J05731P2362M8798L3466N5022L1985p1994L2502
18307A454186K0275P1811j9717P2954J37699J75547K60903K26439J03282O1357
18297B564736K11735K89719J95220K32643J50275J39992K56640M02071N31242
$$ y = [349882, 398014, 364629, 325857, 265074, 275191, 284834, 349303, 353735, 382953, 456989, 623045, 710831, 790269, 865516, 953217, 963434, 1022461, 941635, 987246, 1089703, 1102989, 1033563, 1030768, 960605, 973050, 981510, 912511, 718881, 691005, 834435, 949056, 966288, 901099, 736489, 693101, 652897, 691155, 724228, 702691, 678103, 560203, 613773, 633154, 541625, 522109, 559105, 620465, 669875, 651108, 690806, 823617, 882234, 902855, 927104, 985575, 980315, 1002444, 1017324, 1146314, 1252045, 1324407, 1373205, 1406671, 1461693, 1493678, 1421684, 1454186, 1474461, 1546272, 1526555, 1599509, 1737208, 1912755, 2173658, 2400097, 2503379, 2564736, 2776471, 3066190, 3261410, 3494053, 3644328, 3784320, 4040960, 4443031, 4974273]
18288D974273M93524M65712O55585Q24429J227196J577265J920904K352537L123495
18279A7614920M319184O223208R460455J4249196K0106212K3176029J8233107
18272A13382311P778954o41263l309594J749117N725437N67118r275272j7846695
18264I8130113k0801210j6859298j1421095p344132m849536l314394k598405k475532
18256B8466511k093362j546835j074019n43349N281O20908J533116K649452M187706
18247C2205409O520846J0440904J5785452K0800556K0755555J3255234L457934
18240A23221890k815986j775053M108674M632523l383403j2650542j8884767j8201807
18232G4251529j2827428p459418l640001q29565J843769M923099R187445J4564021
$$ y = [4974273, 5467797, 5933509, 6589094, 7413523, 8640719, 10217984, 12138888, 14491425, 17614920, 21934104, 28157312, 37617767, 51866963, 71973175, 95149204, 113382311, 121161265, 120520002, 117210408, 118959525, 124684962, 125252080, 115976808, 98130113, 77328903, 60469605, 49048510, 41704378, 36854842, 33540448, 30942043, 28466511, 26373149, 24826314, 23752295, 23208946, 23214227, 23835135, 25368251, 28017703, 32205409, 38726255, 49167159, 64952611, 85753167, 106508722, 119763956, 123221890, 120405904, 118630851, 122739525, 127372048, 123988645, 111338103, 92453336, 74251529, 61424101, 53964683, 50324682, 49495117, 51338886, 56261985, 65449430, 80013451]
18224H0013451J8137442J4859182O172731j324251m440937l84471M073773N78110
18216A17685030q057388j5761948j8941532j5956388j1007820p184989m901967
18209C5872998l342319k618336k474172k087901j594821j176116p91633j67955
18201B1619745M23459J095738J885924L167286N338056Q619447J3140284J7976811
18193G3266750J8837219J2628468L514378k597190k698001K802002M053858k371129
18185A07436355j0874320j7170520j7573781j3180573q550757n628762m038532
18178C0419110k923837k595460k551020k325815j943144j629688j349934j109596
18170A3990616p77199m59630k88977J24511M77993P34596R95471J379065K123149
$$ y = [80013451, 98150893, 113010075, 119182806, 117858555, 113417618, 113033147, 117106920, 117685030, 109627642, 93865694, 74924162, 58967774, 47959954, 40774965, 35872998, 32530679, 29912343, 27438171, 25350270, 23755449, 22579333, 21787700, 21619745, 22043204, 23138942, 25024866, 28192152, 33530208, 42149655, 55289939, 73266750, 92103969, 104732437, 108246815, 105649625, 102951624, 105753626, 109807484, 107436355, 96562035, 79391515, 61817734, 48637161, 40086404, 34457642, 30419110, 27495273, 24899813, 22348793, 20022978, 18079834, 16450146, 15100212, 13990616, 13213417, 12753787, 12464810, 12589321, 13067314, 13801910, 14797381, 16176446, 18299595]
18161A8299595L143250M682204P436333J1654722J7593391K2862617K2810230
18154A08482342J7171829R502970k319371j3466240j9016934k1674799j9024272
18147E9655525j2748679p767360n101625l708503k736738k248037k184026j984142
18139B1176415j800005j591099j319116r14246m96254j40550J24140J45578L8527
18130A5223390k65800m02565k71475j25107J68316L35224N15249O37867Q92741
18121A6707840J393969J952669K652524L557520M878033O421063Q874330J3170064
18113E9608012K0815875L3785466N0745788N9281180M7468242K9302634J4963667
18106C15970864L903341Q529034O135468p583666k2858955l8802289m5942868
$$ y = [18299595, 21442845, 26125049, 33561382, 45216104, 62809495, 85672112, 108482342, 125654171, 135157141, 132837770, 119371530, 100354596, 78679797, 59655525, 46906846, 39139486, 34037861, 30329358, 27592620, 25344583, 23160557, 21176415, 19376410, 17785311, 16466195, 15551949, 15055695, 14915145, 15039285, 15184863, 15223390, 14957590, 14555025, 14283550, 14158443, 14326759, 14661983, 15177232, 15815099, 16707840, 18101809, 20054478, 22707002, 26264522, 31142555, 37563618, 46437948, 59608012, 80423887, 114209353, 164955141, 224236321, 271704563, 301007197, 315970864, 319874205, 328403239, 334538707, 326955041, 304096086, 265293797, 219350929]
18099B19350929m3817865l7240846k6868803j8015913j2571432r988318q502604
18092F2345148p505443o767642o097817n257684m538457l694326k961259k410076
18084B3112444j738927j418313j102438j009233q95146p94708n27472n35025o56100
18075A4435082o62542p75381o56155m80557k09407J9089K86971O30895J100359
18066A3688354J572332J911862K599620L534613N038116P533092J1820292J8117713
18058F5815994K6264259L2280534K9805764K1171120R390119p898059k1396549
18051A55433182k7747772k9890670k4337330j5760943r614436o506787m922713
18044C6652531m024458l877073l684306l354265k959709k401841k056723j752394
$$ y = [219350929, 175533064, 138292218, 111423415, 93407502, 80836070, 70847752, 62345148, 54839705, 48072063, 41974246, 36716562, 32178105, 28483779, 25522520, 23112444, 21373517, 19955204, 18852766, 17843533, 16948387, 16153679, 15626207, 15091182, 14435082, 13772540, 12997159, 12341004, 11860447, 11651040, 11670129, 11957100, 12587995, 13688354, 15260686, 17172548, 19772168, 23306781, 28344897, 35877989, 47698281, 65815994, 92080253, 124360787, 154166551, 175337671, 184727790, 176829731, 155433182, 127685410, 97794740, 73457410, 57696467, 48082031, 41575244, 36652531, 32628073, 28751000, 25066694, 21712429, 18752720, 16350879, 14294156, 12541762]
18036A2541762j401646j102643r39593q24022n02604l76654k02545k13274j57619
18027F821162j50993m01563n08886o29195n74408o08227l30937j91310j68698
18018C256945k66673j46533j77728k09620j16319j28682p2120m0218l6204l2244
18008B030604n2942O5419O3939K0425M918J12773M8826J12438m0631k49169j35382
17997A981218J15926p5030K3142O4667k750J10365K40750J84936R3462k6473j04622
17986B605591l2418L6238j07651j70072k18736k65969p2532N4181P4929K7493
17976A931054j7250l5215o549j27434j66602j54883j59948j12846m4818K719R594
17965A117822j18802j26308J589P9907J0516p7491k3924q513l615k7821k2841
$$ y = [12541762, 11140116, 10037473, 9097880, 8273858, 7771254, 7394600, 7192055, 6978781, 6821162, 6670169, 6268606, 5759720, 5130525, 4556117, 3947890, 3616953, 3425643, 3256945, 2990272, 2843739, 2666011, 2456391, 2340072, 2211390, 2139270, 2099052, 2062848, 2030604, 1977662, 2043081, 2107020, 2127445, 2132363, 2245136, 2293962, 2406400, 2365769, 2116600, 1981218, 2097144, 2022114, 2045256, 2109923, 2107173, 2217538, 2458288, 2643224, 2736686, 2710213, 2605591, 2573173, 2609411, 2501760, 2331688, 2112952, 1846983, 1774451, 1828632, 1903561, 1931054, 1913804, 1878589, 1872040, 1744606, 1578004, 1423121, 1263173, 1150327, 1105509, 1108228, 1117822, 999020, 872712, 874301, 954208, 964724, 887233, 863309, 854796, 851181, 823360, 800519]
17954H00519J0166L8540j9747J1733l2661O3018M8002j18841o0783k0812q6156
17943F32978j9949M1236m5645q4401n8145O286O840L9582M2799k5407o5679p115
17931D63380n1886k3375k8326o8062L4428R6616K9040O8279p349O0944M4897k77
17919F18309j7375p6677q8135q2224p7210K1457j4733J661l8499K6197L9138R238
17907C21147P4223M4368k2032j06568Q094J5825M0287n0771o724k8989L7504J02127
17895D28491M1748j62717P862j6545p9283Q5306N1573Q7565j09757o4184Q5333
17884C55392o6425o5095J20876M1797L4127l912J3462j4428M6481q5587j66379
17873B10309l5452J25428J11029M2902k5845Q283o6744j0953L9775k49Q830m9779
$$ y = [800519, 810685, 849225, 829478, 841211, 808550, 871568, 919570, 800729, 739946, 719134, 632978, 613029, 654265, 608620, 524219, 466074, 472360, 479200, 518782, 561581, 536174, 470495, 463380, 411494, 388119, 359793, 291731, 326159, 422775, 451815, 520094, 512745, 573689, 618586, 618309, 600934, 524257, 436122, 353898, 276688, 298145, 283412, 285073, 246574, 272771, 311909, 321147, 395370, 439738, 417706, 311138, 319232, 335057, 375344, 324573, 317849, 288860, 326364, 428491, 470239, 307522, 315384, 298839, 219556, 304862, 356435, 444000, 334243, 270059, 355392, 288967, 223872, 344748, 386545, 420672, 416760, 430222, 415794, 462275, 376688, 210309, 174857, 300285, 411314, 454216, 428371, 436654, 369910, 358957, 398732, 398483, 407313, 357534]
17861C57534K1449M5770J680J2687m0246n1083J08956Q7369Q8597J10896N3730
17850G97339L6682p48j00263p4512j5955n095l7687r0350n7241M8572O9413k8041
17838E42114j7457o4836l8347N8304O4061Q3018K3980k0225l1000m7821j53773
17827C98018o1058J3037o0829n0870J5913l4140j5622Q5659j8617l2231p7246
17816A62014K9921L0249q885l7824o2007R6162j52048p1238o3126P3912J30962
17805A28092J12521q2880R1121K7071m7643K824K387J1305J53671J62214N1038
17794F11721Q2340J23613J52743N0851J1941k8760J0640P4900R4335Q32J06516
17783A291672J37045O5055k3124L5561j11688j61498j2009Q6901K7658L2086q4050
$$ y = [357534, 378983, 424753, 426433, 439120, 398874, 347791, 456747, 544116, 632713, 743609, 797339, 834021, 833273, 733010, 658498, 642543, 637448, 599761, 509411, 452170, 500742, 570155, 542114, 524657, 459821, 421474, 479778, 543839, 626857, 650837, 630612, 599612, 551791, 398018, 336960, 349997, 289168, 238298, 254211, 220071, 204449, 290108, 271491, 239260, 162014, 191935, 222184, 213299, 175475, 113468, 209630, 57582, -13656, -76782, -2870, 128092, 240613, 157733, 248854, 275925, 228282, 231106, 233493, 244798, 398469, 560683, 611721, 694061, 817674, 970417, 1021268, 1033209, 1004449, 1015089, 1089989, 1184324, 1185156, 1291672, 1428717, 1493772, 1470648, 1506209, 1394521, 1233023, 1221014, 1307915, 1335573, 1367659, 1283609]
17772A283609j32185p5704L2273l7523m5074o1913r2593j27813n4832m6090j4682
17761F27473r2356o80J74060J13959P7336N2507J10306N5765J10425n000M3094
17750A266889o1089K706O2903Q4438J11838K4448k7108r2805Q063N0031J01515
17739A531829L4603l7628m1215J2833l2593O8596J4209k2271r5844o4555M6353
17728A414317Q6407L8942l822O3956J44306O0671K0142j4348K0861L6041k5194
17717A842279m6377p0979p7503l0792n2863m4679K3697L3644J3323M1125O8605
17706A699480j8182M6452P1288R5603J48495J55620L9183P2561O5181j9107l2927
17695B323647K9169K1131R733J39521J72693K26542K49859K45324K05445K59541
$$ y = [1283609, 1151424, 1075720, 1107993, 1070470, 1025396, 963483, 870890, 743077, 688245, 642155, 627473, 535117, 534437, 708497, 822456, 899792, 952299, 1062605, 1118370, 1228795, 1223795, 1266889, 1205800, 1208506, 1271409, 1355847, 1467685, 1492133, 1465025, 1372220, 1380283, 1430314, 1531829, 1566432, 1528804, 1487589, 1500422, 1467829, 1536425, 1550634, 1528363, 1432519, 1367964, 1414317, 1500724, 1539666, 1535844, 1599800, 1744106, 1804777, 1824919, 1810571, 1831432, 1867473, 1842279, 1795902, 1724923, 1647420, 1616628, 1563765, 1519086, 1542783, 1576427, 1589750, 1630875, 1699480, 1681298, 1727750, 1799038, 1894641, 2043136, 2198756, 2237939, 2310500, 2375681, 2356574, 2323647, 2352816, 2373947, 2383680, 2523201, 2695894, 2922436, 3172295, 3417619, 3623064, 3882605]
17685C882605L88602M01974M58601M72440M15405N31078O88621Q40049R68454
17676I047829J057482J433133J684716K170292K870186M108144N688148Q527592
17668C6587522J3179022J8813831K2033882J7983851Q281162J64466k912345K959692
17660A17091083J2451243J5285516J0044185M646845K457467L393731K078834
17653A67448904l979000r586377j0468006k693895O442615N894579m610369j6006149
17645A32442302k4076213k4349926j8055542j1817301p600190n124063l745230
17638C7673837l217240l042064k808404k331953j906845j550095j009418p47963
17630B1059855n73682l15209j90726P4141N11463J022678J464625K008359L221285
$$ y = [3882605, 4271207, 4673181, 5131782, 5604222, 6019627, 6550705, 7239326, 8079375, 9047829, 10105311, 11538444, 13223160, 15393452, 18263638, 22371782, 28059930, 36587522, 49766544, 68580375, 90614257, 108598108, 116879270, 117043736, 114131391, 117091083, 129542326, 144827842, 154872027, 159518872, 161976339, 165370070, 167448904, 163469904, 153883527, 143415521, 140721626, 147164241, 153058820, 148448451, 132442302, 108366089, 84016163, 65960621, 54143320, 46543130, 41419067, 37673837, 34456597, 31414533, 28606129, 26274176, 24367331, 22817236, 21807818, 21059855, 20486173, 20170964, 19980238, 20054379, 20565842, 21588520, 23053145, 25061504, 28282789]
17621B8282789N210211Q438102J3155535J7142423J6057439Q921993J425737k971243
17613I5662986j071492O590147J1670645R830744N913243M415624N068251M569464
17605A42649612j175230p424176j0668875o497873K646597N845336o35088j0404358
17597A14335945j8333562k1068978j6924250j1238595p237351m885193l383756
17590C1264260k816338k865475k565257k258680k021789j876571j780316j522920
17582A3556914j281509j096979r71767p87474p21436o98630o43501n47252m97632
17573F310734m41474n59333m49778k85533k35178k29421k08697j96432j86697
17564C518191p3098q7731j27330o6204Q408j52862j39656k28122j38771L1296
$$ y = [28282789, 33493000, 41931102, 55086637, 72229060, 88286499, 97208492, 98634229, 95662986, 94591494, 101181641, 112852286, 122683030, 128596273, 133011897, 138080148, 142649612, 141474382, 134050206, 123381331, 116883458, 119530055, 125375391, 124740303, 114335945, 96002383, 74933405, 58009155, 46770560, 39533209, 34648016, 31264260, 28447922, 25582447, 23017190, 20758510, 18736721, 16860150, 15079834, 13556914, 12275405, 11178426, 10206659, 9419185, 8697749, 7999119, 7355618, 6808366, 6310734, 5869260, 5309927, 4860149, 4574616, 4339438, 4110017, 3901320, 3704888, 3518191, 3445093, 3357362, 3230032, 3163828, 3172236, 3019374, 2879718, 2651596, 2512825, 2544121]
17554B544121o2912o6764J82734k0863L1018o6048o282N6683N9896J23767J56295
17543B931645J54956L13270K04725K89888K21439K28549K18738M10326N67382
17534E540918M13999L66006N48536P92225Q60958J043912J230822J134695J249393
17525A3181464J618196K146290K802428L658827N106970P439940J1112940J6809905
17517F3876960K3810554K8557684K7258623K1355053J2574714p53255j1949826
17510A64730507j7048656j7138329r012893M063408J6827265K5781768K9189221
17503A97392291L0113606K9225499K1840491R960448j887321j3897509k4835079
17496B47912426k9599378k9752196k6137830j5231967q06329J1385131J7101456
$$ y = [2544121, 2481209, 2414445, 2597179, 2576316, 2607334, 2541286, 2535004, 2591687, 2651583, 2775350, 2931645, 3086601, 3399871, 3604596, 3894484, 4115923, 4344472, 4563210, 4973536, 5540918, 5954917, 6320923, 6869459, 7661684, 8522642, 9566554, 10797376, 11932071, 13181464, 14799660, 16945950, 19748378, 23407205, 28514175, 35954115, 47067055, 63876960, 87687514, 116245198, 143503821, 164858874, 177433588, 176680333, 164730507, 147681851, 130543522, 121530629, 125594037, 142421302, 168203070, 197392291, 227505897, 256731396, 278571887, 288532335, 286645014, 272747505, 247912426, 218313048, 188560852, 162423022, 147191055, 146384726, 157769857, 174871313]
17489A74871313J4869207P597001l305786j6375435k4421718k7599069k6801652
17482I8833861k0616865j3724403r124006o751636n533571m688681m306811l961787
17474C0126101l375302k917460k627003k243916j811441j665353j690520j478086
17466A2317020j227882j129286j081067q90008o80723o12450n73717m38125l83828
17457E299934l31485k88891k70652j87917k29368k90584l11329j95995j71555
17448C022158k42858m236P7568J62764M8829m6942j3131r8841l34216l06724j42379
17437B121992k04455k35732j07449k0775m5938j22221l1653j24121n1065K7610
17427A206193J6542k7964R6562J04140M7735j22812m6720J416O609O7533m9473
$$ y = [174871313, 189740520, 197337521, 194031735, 177656300, 153234582, 125635513, 98833861, 78216996, 64492593, 55368587, 48616951, 43083380, 38394699, 34087888, 30126101, 26750799, 23833339, 21206336, 18962420, 17150979, 15485626, 13795106, 12317020, 11089138, 9959852, 8878785, 7988777, 7308054, 6695604, 6121887, 5683762, 5299934, 4968449, 4679558, 4408906, 4220989, 3991621, 3701037, 3389708, 3193713, 3022158, 2779300, 2775064, 2852632, 3015396, 3064225, 3017283, 3004152, 2905311, 2571095, 2264371, 2121992, 1917537, 1681805, 1574356, 1553581, 1507643, 1385422, 1353769, 1229648, 1178583, 1206193, 1222735, 1194771, 1291333, 1395473, 1443208, 1320396, 1273676, 1275092, 1281701, 1349234, 1299761]
17416A299761k7445p2721r8836L400M2870N024O3003K2674l9238J00226J5831
17405A314549o2676r5261j7219J5173k2865p8850q0976l0979J72611N171j12659
17394A006019r9366p7020N0861J44292O2290L7632L9688l6318n0095m2656J43421
17383A178748R2492M292l2069k0556p2706N2549R8060n1817r7920l4799P0158
17372A186432J55058K45990L0263r1603j06168j9021n502L186L3245l4037k8792
17361A369051l8786j6611M5639J21604k6982K7475J2171M597n6734q4722k8043
17350A328659J12864J03677N7205k5086j05593L3303P352J7179J07655Q7951J34988
17339A860154k7757o3075q4506o6205J3924K5883L8301J01509J29267J09304O985
$$ y = [1299761, 1272316, 1199595, 1100759, 1104159, 1147029, 1152053, 1215056, 1237730, 1198492, 1298718, 1314549, 1251873, 1156612, 1139393, 1154566, 1131701, 1052851, 971875, 940896, 1113507, 1118678, 1006019, 906653, 829633, 880494, 1024786, 1087076, 1124708, 1164396, 1128078, 1077983, 1035327, 1178748, 1271240, 1275532, 1243463, 1222907, 1150201, 1202750, 1300810, 1248993, 1151073, 1116274, 1186432, 1341490, 1587480, 1617743, 1526140, 1419972, 1400951, 1395449, 1398635, 1431880, 1397843, 1369051, 1330265, 1313654, 1359293, 1480897, 1453915, 1481390, 1493561, 1498158, 1441424, 1356702, 1328659, 1441523, 1545200, 1602405, 1577319, 1471726, 1505029, 1512381, 1529560, 1637215, 1725166, 1860154, 1832397, 1769322, 1684816, 1618611, 1632535, 1658418, 1696719, 1798228, 1927495, 2036799, 2043784]
17328B043784p5138j9196J17784K09906O8201N9846L1175J46523J80335K19277
17318B982497K12921K07873J88976K68001K63818L35626L47050M70194M55184
17309E732140O88142Q16815J058545J294586J602759J922420K339872L237315
17301A8692594M553311O940589J0911680J6404416K2302543K3947822J6933026
17294A20685981N489761l313939n435134J670767R522170Q124515j493202j1215853
17286A24035066j6935423j4292326n125159N057353J3295927J5662876R560839
17279A31259153J28p132980p615594p74693M969028K399863o375664j4917966
17271A01811275k0153952j8406077j3073537q508221n521136l582367k544024
$$ y = [2043784, 1968646, 1949450, 2067234, 2277140, 2345341, 2405187, 2436362, 2582885, 2763220, 2982497, 3195418, 3403291, 3592267, 3860268, 4124086, 4459712, 4806762, 5276956, 5732140, 6420282, 7237097, 8295642, 9590228, 11192987, 13115407, 15455279, 18692594, 23245905, 30186494, 41098174, 57502590, 79805133, 103752955, 120685981, 126175742, 122861803, 117426669, 119097436, 128619606, 136744121, 135250919, 124035066, 107099643, 92807317, 87682158, 92739511, 106035438, 121698314, 131259153, 131259281, 124126301, 116510707, 115736014, 120705042, 123104905, 116729241, 101811275, 81657323, 63251246, 50177709, 41669488, 36148352, 32565985, 30021961]
17264C0021961k351240k390313k082667j870541j623453j323768p77467k46060
17256A7356452j24921J15601O12879J179295J952564L120574M701630P425332
17248C6339406J1749766J7173987K1116261J8202582Q683628p26316n840869k711466
17240A03986979N502542Q791004L142326n913837j3170153j4477586q372745O76325
17232H0164855R303572J4330999J1870669L194356m939464q586068m436054K977337
17224A03880202M646514j712808r927739j6491894j7944820j4062751r437508
17217C8949196o229920m102215k991942k587759k426909k435374k249419j901717
17209A4023941j470162j292541j092017r30818r68574r13692o21070n96715n88953
$$ y = [30021961, 27670721, 25280408, 23197741, 21327200, 19703747, 18379979, 17602512, 17356452, 17231531, 17347132, 17960011, 19139306, 21091870, 24212444, 28914074, 36339406, 48089172, 65263159, 86379420, 104582002, 113265630, 112539314, 106698445, 103986979, 109489521, 118280525, 121422851, 115509014, 102338861, 87861275, 79488530, 80164855, 89468427, 103799426, 115670095, 118864451, 113924987, 105338919, 100902865, 103880202, 108526716, 106813908, 96886169, 80394275, 62449455, 48386704, 38949196, 32719276, 28617061, 25625119, 23037360, 20610451, 18175077, 15925658, 14023941, 12553779, 11261238, 10169221, 9238403, 8269829, 7356137, 6735067, 6138352, 5549399]
17200E549399m94589k62010m14392l31654l69030l83804k18902j44699j38792
17191B791527q1877j20299j05220k05152k33448j01759j25088o3038m0039l7304
17181A678303l8954j23652j39304j7208L5665L8734j0820o4073j74502r3393r5118
17170I95678m1929L4054j9090j97656r1861k9659K903J20571J20959L8648P7973
17159A010591r3007k6645p5466J10442J61958J2012O4857L1520L5883L7376P2945
17148A342466O5908P0306R771l8471r7799M7833p6119q7063j18412p3692L117
17137A047845M9943K1556q7283n2928p9715j51737j27335k8729n1327k1247L7434
17126E56477N1558m2743j34395n7917n291K1411J08362n212J2491p3674n3028
$$ y = [5549399, 5054810, 4792800, 4378408, 4046754, 3677724, 3293920, 3075018, 2930319, 2791527, 2709650, 2589351, 2484131, 2278979, 2045531, 1943772, 1818684, 1755646, 1715607, 1678303, 1639349, 1515697, 1376393, 1359185, 1394850, 1433584, 1422764, 1358691, 1184189, 1090796, 995678, 953749, 987803, 968713, 771057, 679196, 649537, 652440, 773011, 893970, 932618, 1010591, 917584, 890939, 815473, 925915, 1087873, 1099885, 1164742, 1196262, 1232145, 1269521, 1342466, 1408374, 1478680, 1488451, 1449980, 1352181, 1400014, 1323895, 1236832, 1118420, 1044728, 1047845, 1097788, 1119344, 1032061, 979133, 899418, 747681, 620346, 591617, 540290, 519043, 556477, 608035, 565292, 430897, 372980, 367689, 389100, 497462, 492250, 504741, 431067, 378039]
17115C78039N5639J50921M5161n422j6478o2695M887J20231R6388R8533P1468
17104I36672R83L2591n9879M2557M8377l7821p1814J02565J35079r7780p0797
17093I60733m7625r0006j17565r754M4918n5210k3716K1850m3762q8588k7119
17082E24156K266m281q7984j23858p8002m1138L6630L6444j25555q2046J6210
17071G2842O9062M8912N9267m5254o1251j19668K5117j8635j01948J881R8642
17060B8967J21132P3410J21685o277j29327j1270M7581L7315k407q1743o2742
17049A36324J0391J9993j04303r8851K9618O4789J58837O7836p8699K5266N9223
17038B90424K6430p2025l3069N8202J6021J8586M0061j00259M6342R0560o9325
$$ y = [378039, 433678, 584599, 629760, 624338, 607860, 545165, 550052, 670283, 766671, 865204, 936672, 937655, 970246, 910367, 952924, 1001301, 963480, 891666, 994231, 1129310, 1031530, 960733, 913108, 823102, 705537, 695783, 740701, 685491, 661775, 683625, 639863, 551275, 524156, 526422, 522141, 434157, 310299, 232297, 191159, 227789, 264233, 138678, 56632, 72842, 141904, 190816, 250083, 204829, 143578, 23910, 49027, 30392, -71556, -69675, 28967, 150099, 223509, 345194, 338917, 209590, 198320, 245901, 283216, 280809, 199066, 136324, 146715, 166708, 62405, -36446, -6828, 57961, 216798, 284634, 205935, 231201, 290424, 316854, 244829, 211760, 269962, 285983, 304569, 344630, 244371, 290713, 381273, 311948]
17027C11948r1327n3381J74848J92069Q2543N7736J27680J02772R8931j9623o5522
17016I18674l8624M7434M204J3107l3257J38082K91789K62630j5149m8802k43
17005A539845m7216j16170j83294j51946j34124j02920L5451J56678P3077P2578
16995A141959K7377j33635j28468o8163J4508j57501k28766J6467M8929q6518
16985D46189L108j3295p2563L3179j1436K3911n4419l5687n646n65J6871m0703
16973B88944j12751L7257P2648J00185M453m4118K8170n8269o9169j20722q1293
16962D5335R77L2879L4470J01179j2753j04962q0529j12856K580J09682n56K0019
16950C5465o464M196L9085J9719J7527m0378l0391l3702P027p003M3872k1287
$$ y = [311948, 220621, 167240, 342088, 534157, 616700, 674436, 802116, 904888, 1003819, 984196, 918674, 880050, 927484, 931688, 944795, 911538, 1049620, 1341409, 1604039, 1588890, 1540088, 1539845, 1492629, 1376459, 1193165, 1041219, 907095, 804175, 839626, 996304, 1069381, 1141959, 1169336, 1035701, 907233, 839070, 853578, 696077, 467311, 483778, 532707, 446189, 449297, 436002, 363439, 396618, 385182, 409093, 354674, 318987, 313341, 312776, 329647, 288944, 176193, 213450, 286098, 386283, 390736, 346618, 374788, 316519, 247350, 126628, 45335, 46312, 79191, 113661, 214840, 202087, 97125, 16596, -96260, -93680, 16002, 15446, 35465, 29001, 33197, 72282, 92001, 109528, 69150, 38759, 5057, 12084, 5081, 48953, 27666]
16938B7666k00270m2450P6833M6324M8483J4612R48j3904L1495l7628O1032o7280
16926e4139N5145Q6239m3029r7927N5972P4445j8512j11228l0600N7549O0786
16915C4701L3975L3335K0483J3410K568n8351n3846l5464k8534m2093O4637L9507
16903B4328M065l3425k9595L4220Q0560j4013m1863n7945p9471P336j26171r3454
16891c25428j3670j7114O0535o9261j03002M9784J87906Q9295M4684m6294L0057
16880a12508J9387l5079M5211J09831R8554J1704l2688o1286k3285o3442j16672
16869a60273m7697M4797P2166o2050K4370J08598K3584O9592n4245p1186p9943
16858a32287j977N843p287m2405m1309j605R2556P3410j2054K0487J8834q409
$$ y = [27666, -172604, -215054, -138221, -91897, -43414, -28802, -27854, -41758, -10263, -47891, 13141, -54139, 1006, 87245, 44216, -53711, 2261, 76706, 58194, -53034, -83634, -26085, 34701, 68676, 102011, 122494, 135904, 138472, 80121, 26275, -9189, -37723, -79816, -15179, 24328, 28393, -5032, -34627, -407, 80153, 66140, 24277, -33668, -113139, -105803, -231974, -325428, -339098, -356212, -295677, -364938, -467940, -418156, -230250, -140955, -96271, -142565, -112508, -93121, -128200, -82989, 26842, 125396, 137100, 104412, 43126, 19841, -43601, -160273, -207970, -163173, -91007, -153057, -128687, -20089, 3495, 73087, 18842, -52344, -132287, -134264, -128421, -135708, -178113, -219422, -221027, -128471, -55061, -67115, -46628, -27794, -36203]
16846c6203M1055P5656P2095L7422K8322o5620o9782k9686m7772K9729o8670k5601
16834e9055K6192L6667p2503o1612O6752J24508M7809o9911n6131j32444q716
16823a58444R3792O8901p0612p5386L454L8016J33942O7475m2257n2676l5660
16812b9455L5244j2805j09533j00872P2616J59895J728r4636j569r8610Q5899
16801i2098J12652M435R7459R3345O0504J31688J66159L0494O021o2424O9682
16790F17917M6158o6124l6009j3818r1443l3636O375P3649K3477M4787N2139O08
16778F24080J7580j3920n9276j2646K6750r1973N6507k6636j53535j67251O1806
16767B61486J5288l2187p5401q0649J05997k8733o0009J7385n8183J13543O7356
$$ y = [-36203, 4852, 80508, 152603, 190025, 218347, 152727, 82945, 53259, 5487, 35216, -33454, -59055, -32863, 3804, -68699, -130311, -63559, 60949, 108758, 38847, -17284, -149728, -158444, -64652, 4249, -66363, -141749, -138295, -100279, 33663, 101138, 58881, 6205, -29455, 5789, -7016, -116549, -217421, -144805, 15090, 16818, -77818, -79387, -177997, -92098, 20554, 24989, 122448, 215793, 276297, 407985, 574144, 604638, 610659, 548235, 617917, 664075, 597951, 561942, 548124, 456681, 423045, 429420, 503069, 526546, 571333, 623472, 624080, 641660, 627740, 568464, 555818, 582568, 490595, 547102, 520466, 366931, 199680, 261486, 276774, 244587, 169186, 88537, 194534, 165801, 105792, 123177, 64994, 178537, 245893]
16756B45893m2323p3641j29289j1721J37242J37145M7380N6037q725J2192J50677
16745E20867P5361L2160L5097l7806Q0884J39655q0635j22977o4781r0402J224
16734D88647K1883r7578m8585j9646K01895J20588o0851l6165M1175K2823j4400
16723F19786k7420K1895l6219j58185j21741j6792L8825o7916p4488p5491N9795
16712A62049k7358l3758o8654N6389O9683Q1317j38603n7567K8926l1166r6906
16701e5648Q3438J10783p0230j657J03842J8377p9739j40439j37683M7474k0749
16690a42231K0977m578l8841K917Q6329N4648K065q1828k8048P9385M8245j6332
16678a7292J4001k8647J3705q015l5728O1983J5248j31220j1985Q0294j8396N8947
$$ y = [245893, 203570, 129929, 640, -11081, 126161, 263306, 310686, 366723, 357998, 370190, 520867, 596228, 628388, 663485, 625679, 706563, 846218, 765583, 642606, 577825, 487423, 488647, 510530, 412952, 364367, 344721, 546616, 667204, 606353, 570188, 611363, 634186, 619786, 592366, 614261, 578042, 419857, 298116, 281324, 320149, 252233, 177745, 102254, 162049, 134691, 100933, 32279, 88668, 158351, 239668, 101065, 43498, 72424, 41258, -55648, 27790, 138573, 68343, 66686, 170528, 188905, 109166, -31273, -168956, -121482, -142231, -121254, -125832, -164673, -161756, -75427, -20779, -18714, -100542, -128590, -49205, -960, -17292, -3291, -31938, -18233, -26248, -61976, 7, 15255, -115965, -127950, -47656, -66052, -7105]
16666g105J14085J1292m4156j49888p6466K842L1195J34878N1266n5668j22144
16655a09869k3887L6989J24805K6250N4052k3643j08246K1508p419J7032N1970
16644E9542j7915k4279J06611k0130m3735j27909m3318l04m5905j41754m6671
16633c45767J23767k3076L5440K9983Q042l6269j7333l3280j4245K50028J10089
16622H7379p2495m3695j1183O5581Lj58976n6684O0143L2909J7277O3632K3931
16610G822K9848o6477m0662R2590k1879P3364J20459L3767l8218J8742r49J4408
16598B22815K6779m0005L4635L110J0587j36270p1840q1151k2917O2212J0195
16587A8150M1015J29797P9220J1076j983o687k1194j7315n8321j17364n8227J08665
$$ y = [-7105, 106980, 118272, 74116, -75772, -152238, -149396, -118201, 16677, 67943, 12275, -109869, -133756, -96767, 28038, 54288, 108340, 84697, -23549, -2041, -9460, 7572, 59542, 41627, 17348, 123959, 103829, 60094, -67815, -111133, -111437, -157342, -299096, -345767, -222000, -245076, -209636, -179653, -171611, -207880, -225213, -258493, -272738, -22710, 87379, 14884, -28811, -39994, 25587, 25590, -133386, -190070, -129927, -97018, -79741, -16109, 7822, 37670, -28807, -69469, 23121, 1242, 74606, 195065, 228832, 190614, 209356, 208407, 222815, 249594, 209589, 244224, 247334, 257921, 121651, 49811, -31340, -54257, 7955, 18150, 59165, 188962, 268182, 279258, 277275, 270588, 249394, 232079, 173758, 56394, -1833, 106832]
16575A06832M0552k3004j16688n1213r9653J45m7553N5841R4767M4737l3806L0421
16563A378K8383J9329l7861M73m079j17649n9197q516j8842j399P8478L8551l5275
16550a16226k4742p5243n484J04069J39868N3701J2583L6679o4640j06202j7202
16539f2839J67445J06156l9969q9604k15249n2229j0124j2436J78958J32706j09607
16528f792o1792L3464k8472j01800K9898j0093J04672M9738k2113n2308q3902
16517a49500q0434j1591l6808R0n6797K9079M5793J1253O781N1804n265J03372
16505i2223P8K7620l8126o051k2797n3727L2003l3980j8513J3729N5829M4427
16493i1731O2035p9076n214P444k3388R5805J5769P1722M023m1059j34738M6373
$$ y = [106832, 147384, 124380, 7692, -43521, -143174, -143029, -190582, -134741, -39974, 4763, -29043, 1378, 29761, 49090, 11229, 11702, 7623, -110026, -169223, -177739, -196581, -197980, -119502, -80951, -116226, -140968, -216211, -221695, -117626, 22242, 75943, 88526, 125205, 60565, -45637, -62839, 104606, 210762, 170793, 81189, -134060, -186289, -196413, -208849, -29891, 102815, -6792, -68584, -35120, -63592, -165392, -135494, -145587, -40915, 8823, -13290, -65598, -149500, -229934, -241525, -278333, -278243, -335040, -305961, -260168, -248915, -242134, -190330, -195595, -92223, -92145, -64525, -102651, -108702, -131499, -185226, -153223, -187203, -205716, -191987, -136158, -91731, -29696, -108772, -113986, -106542, -129930, -34125, -18356, 53366, 57389, 16330, -118408, -72035]
16481g2035P498L1764R8239J1060m7054r170n4002q6298r20P072J20752Q7802
16469I4708m107j15232p1520m2514m2641L9308L0135n2885L8683Q3956j0770k0513
16457g3392M424j56257p2527J43878Q3652l0657O7918N6145n2745K802l8160P0627
16445E708J02769m4802k4677p6563k2169j3454L9751Q3925o4046k6051L8377L8001
16433C6769J14667k9978k0001m184p8867j33648l4191P0282p045O6546j9071j7267
16421e5988N4124J24113L4399j57407j807R1980O6181j02665k7960J17526M0909
16410A83405o2691j21074r9574K8510N3987l6336o1114m9469M6100N5130N7437
16399e689M9726N3409j257j3570N3407j8556J5168k8786o8475Q6177J2167j30103
$$ y = [-72035, -64537, -32773, 65466, 76526, 29472, 20302, -33700, -119998, -120918, -113846, 6906, 94708, 90601, -24631, -96151, -138665, -181306, -141998, -111863, -164748, -126065, -42109, -52879, -73392, -68968, -225225, -297752, -153874, -70222, -100879, -32961, 23184, -29561, -26759, -64919, 5708, 108477, 63675, 38998, -37565, -59734, -73188, -33437, 50488, -13558, -39609, -1232, 36769, 151436, 121458, 101457, 97273, 18406, -115242, -149433, -79151, -86196, -19650, -38721, -55988, -1864, 122249, 156648, -759, -2566, 89414, 155595, 52930, 24970, 142496, 183405, 120714, -360, -99934, -71424, -17437, -53773, -114887, -164356, -118256, -63126, -5689, 44037, 97446, 96189, 82619, 136026, 117470, 132638, 103852, 35377, 121554, 133721, 3618]
16387C618j25347J8501J6368L1520L0058P7340J07805p2615j06680j9959K1750
16376a7641p3044n9143j0933L4405L7801l3740O4222Q9627K0184j31250p753O7275
16364a9990P5723m8455j28364M646L6019K1722m8583l0156M453J6084p1423J7547
16352a70777R2748P0755J5963n102j96p486M3599n1967p3559L899J0848P26Q7401
16339A6852j8898j09387r306J9688N6416K6023l0065j2945J688o1734p0500R5579
16327i6589M9213R494l5128p952k7675K5232n8076n4454M2290N7695N8544J6943
16315b0463M6803p9774n4248J0300O8385L4721N3547j320K7388M8918j04672j20957
16303i1372N1379J09690j8147j05240n7861M9844j460m7241O9991K4378m5232
$$ y = [3618, -121729, -103228, -86860, -55340, -25282, 52058, 159863, 87248, -19432, -39391, -17641, -90685, -149828, -160761, -126356, -88555, -122295, -58073, 31554, 51738, -79512, -87265, -19990, 55733, 7278, -121086, -116440, -80421, -58699, -107282, -137438, -132985, -116901, -188324, -170777, -78029, -7274, 8689, 3587, 3391, -4095, 39504, -12463, -86022, -82123, -71275, -70549, 16852, -2046, -111433, -120739, -101051, -44635, -18612, -48677, -61622, -59934, -121668, -192168, -96589, -47376, -37882, -73010, -80962, -108637, -83405, -141481, -195935, -153645, -95950, -37406, -20463, 26340, -53434, -107682, -97382, -28997, 5724, 59271, 57951, 85339, 134257, 29585, -91372, -39993, 69697, 51550, -53690, -111551, -61707, -63167, -110408, -40417, -16039, -61271]
16292f1271N0693K2833k8122n2958N2127O9945o7276j22604n7298m998N1407O8253
16280g9269j7215Q257l8217R2935Q0838L8997r402j26867O9410J15091n3550j62307
16268h1299j40448j5513R0459J15201K1514p0639L8174J9709r4082Q304O5044
16257d3576L458j2099M0588L973n5460J03342K2626p9630P2270j3571M7762L9823
16245A29506L1219k1809n7984r5437r498J18042O8083k9644o207m4115j13165
16234c1009j18583P3196J22369J53029K473K0131r7659O9213J81831m283o4348
16223C06360o8714q0482o2937j09071K5877o852k7301j6161l7902Q2846L868l1189
16211b1658M5215l3480Q55L2298J1210j1703j05692o2057l216Q7940J07716p0245
$$ y = [-61271, -10578, 12255, -15867, -68825, -16698, 53247, -14029, -136633, -193931, -198929, -147522, -79269, -96484, -88227, -126444, -33509, 47329, 86326, 76924, -49943, 19467, 134558, 81008, -81299, -221747, -237260, -146801, -31600, -10086, -80725, -42551, -22842, -116924, -108620, -43576, -40118, -52217, -11629, -7656, -63116, 40226, 62852, -16778, 55492, 41921, 89683, 129506, 160725, 138916, 80932, -14505, -24003, 94039, 162122, 132478, 126271, 82156, -31009, -149592, -76396, 45973, 199002, 201475, 221606, 123947, 193160, 374991, 370708, 306360, 237646, 157164, 94227, -14844, 11033, 4181, -23120, -39281, -77183, 5663, 9531, -21658, 23557, -9923, -9068, 23230, 34440, 22737, -82955, -145012, -148228, -60288, 47428, -22817]
16199b2817j04095q030j01449M7782N1909l2995k1214N6566R6899J06312m5186
16188B3682n6026k817m5217R371L000J427K737L7880j4199J18634J11043n5593
16176A33922j51551N1956K5539j5843o5734j31983j11574N4767J72058R2930P5141
16165A29628N2756j9369o5943K9311L5846p706k7709k6058r9365l9218j3843K1948
16153b9722n5399Q9088J7448m789Q4382J5530m6268K6399l3384j09745p2572l3436
16141a52468m1655M536R8995Q6968k8298J9927L9306J5606Q2681M462K565j05623
16129B7002J5715Q2837L5481l6588n1060n6482o0405r1501P600P3303k1792j3961
16117h9851j3066N7211p998k8198M8297R4419n3776j3670p6957K70l3208q323
$$ y = [-22817, -126912, -134942, -236391, -188609, -136700, -169695, -190909, -134343, -37444, 68868, 23682, -32344, -35161, -80378, -71007, -68007, -66580, -63843, -25963, -40162, 78472, 189515, 133922, -17629, 34327, 59866, 44023, -21711, -153694, -265268, -210501, -38443, 54487, 129628, 182384, 163015, 97072, 126383, 162229, 154523, 126814, 100756, 1391, -37827, -51670, -29722, -85121, 3967, 21415, 16626, 101008, 116538, 70270, 96669, 63285, -46460, -119032, -152468, -194123, -189587, -90592, -3624, -31922, -11995, 27311, 42917, 125598, 130060, 132625, 27002, 42717, 125554, 161035, 124447, 73387, 16905, -43500, -135001, -127401, -54098, -75890, -89851, -102917, -45706, -53704, -81902, -33605, 60814, 7038, -6632, -83589, -83319, -116527, -124850]
16105a24850O4146p6193J8741P5833n4820O6872L3935n1544Q670L832Q5304J14733
16093A64659J30903N179l5117L4824n4298o8922k3716k02659k20014M8630J04178
16082a16353Q3041L0870p6021l6288P5239N4395N3723L365J4991l2151n5397k2115
16070b2701M1738q8809N2246R2122l1411r073P072Q077M5927O9627J27284j11648
16058A80451k10170j48765j06013J7719R2405Q2960L4921M0036n0105m4621m3236
16047a54418k5974K0428P7938P724J5669J534N2786q597m622n6157R369l0505
16035i4825K3006Q8368P0872J1754n9058j23383J0176P4351K2827k9738j05173
16024a10823k9087k7838L4040k7027L3950J7452R6483R3419r7178P745K3429j9043
$$ y = [-124850, -60704, -136897, -118156, -42323, -97143, -30271, 3664, -47880, -39210, -35378, 49926, 164659, 295562, 300741, 265624, 300448, 246150, 177228, 153512, -49147, -269161, -220531, -116353, -33312, -2442, -78463, -114751, -39512, 14883, 68606, 71971, 86962, 54811, -586, -22701, 19037, -69772, -17526, 74596, 43185, 34112, 41184, 49261, 95188, 164815, 292099, 180451, -29719, -178484, -284497, -266778, -174373, -91413, -56492, -16456, -66561, -111182, -154418, -180392, -159964, -82026, -74302, -58633, -57099, -4313, -12910, -17532, -73689, -64320, -94825, -71819, 16549, 87421, 99175, 40117, -83266, -73090, 1261, 24088, -5650, -110823, -139910, -167748, -133708, -160735, -126785, -109333, -12850, 80569, -16609, -8864, 14565, -4478]
16012d478k9947j02289n1177J2509J15028Q011O0596N9369q590K4802J01622k7474
16000A57982n9213q2995J7400k6887J1220o6705j8696P4846K4614N2340K5568
15989A09474p9446m3547k9528Q5226J27432J9677n2791j31469o8234R3651M1218
15978G1663k9613m8735j3955p943q1466n2381q3829L6561K6320Q8363J04665L6044
15966D5694m4776O136j53495l9743J09844O2008r3488Q66J8634M6306O3670o5303
15954d3647q6395J4416O4510k7369P1400R7633r574o6703J4729N967J9456m4941
15942I482j02814m9587J22671L4648Q9818n8294r649L939m8821L9633M6724N7007
15930A34757M1166r4694j3762j0443p8213L3305M8694n0867L0722N5732n8489
$$ y = [-4478, -34425, -136714, -187891, -175382, -60354, -52343, 8253, 67622, 59032, 83834, 185456, 157982, 98769, 15774, 33174, 6287, 17507, -49198, -67894, 6952, 31566, 83906, 109474, 30028, -13519, -43047, 42179, 169611, 189288, 136497, 5028, -63206, 30445, 71663, 42050, -6685, -20640, -28583, -110049, -162430, -246259, -209698, -183378, -95015, 9650, 45694, 918, 7054, -146441, -186184, -76340, -14332, -107820, -106954, -88320, -42014, 21656, -43647, -130042, -115626, -51116, -78485, -7085, 90548, 80974, 14271, 29000, 34967, 54423, 9482, -93332, -142919, -20248, 14400, 104218, 45924, 36275, 40214, -8607, 31026, 77750, 134757, 175923, 81229, 67467, 57024, -21189, 12116, 60810, 9943, 40665, 96397, 37908]
15919C7908L2180l5253m9293o8405Q718n3159Q7488J0663M0992m2974j6471o6217
15907a13823N0757L4879K0297N898p8322n7672R247M683Q1765M9092q987M0025
15895C7839P44o6896k4744k5830r495L9558k0181n6843l5040L0029K8656l0644
15883a32847J4306q7620j7668N1553O4176o467M3020j2151j8207o4330j3854K3589
15871a56500J74667k4886R740k8630M183O8304j2798n1820l5255j225L6550J39932
15859A22262J0544r7507J854J3338M2393J4899j14395k0460p7274J3779Q51k8088
15847a17804J05050n7969m4108j5989M8043J08709P5216j8745L0281M0996J1302
15836A64982J4960n7176j08554l6257N9484L7329N1327m9710n3636M0432p9065
$$ y = [37908, 70088, 34835, -14458, -82863, -74145, -127304, -39816, -29153, 11839, -31135, -47606, -113823, -63066, -28187, -7890, -1992, -80314, -137986, -128739, -124056, -42291, 6801, -2186, 37839, 38583, -28313, -53057, -78887, -88382, -48824, -69005, -125848, -160888, -130859, -102203, -132847, -118541, -206161, -223829, -172276, -108100, -114567, -71547, -83698, -101905, -166235, -180089, -156500, 18167, -6719, 3021, -25609, -21426, 46878, 34080, -17740, -52995, -54220, -17670, 122262, 132806, 35299, 37153, 50491, 92884, 107783, -6612, -27072, -104346, -90567, -89716, -117804, -12754, -70723, -114831, -130820, -82777, 25932, 101148, 82403, 112684, 153680, 164982, 179942, 122766, 14212, -22045, 37439, 74768, 126095, 76385, 22749, 63181, -15884]
15825a5884j38013N8248M4249m4919p3275k1996k2850J02522L8078M5871j7211
15814d5180j01389j4218P6026O2196N6309j13912N1608N2557m8247j19869K3407
15803a20712J93498L7607L6394J8946p2250r1121p8703k1904j9883N7965L6457
15792b3706k2487Q787j7984K867l8026j691L8082Q0386p2423N4251j1364l7529
15780d0837J0220L9844M470j07654j4015R2963R9096j8525j5125q0027q5214l5587
15768a50391N8439p802n3999j45935Q8668L292O4480j3951N0756J5641J305r6826
15756a86323j4628R9501O2895m0084L6213J04684r187L8963l2188p3438L5215
15745B1623n2422k6317P6083K1965P6707K9459k5823j523j3980j32632L8835L059
$$ y = [-15884, -153897, -95649, -51400, -96319, -169594, -191590, -214440, -111918, -73840, -27969, -45180, -146569, -160787, -84761, -22565, 33744, -80168, -28560, 23997, -24250, -144119, -120712, 72786, 110393, 146787, 165733, 93483, 2362, -76341, -98245, -118128, -60163, -23706, -46193, -37406, -55390, -52523, -90549, -92240, -54158, 26228, -46195, 8056, -3308, -40837, -30617, 9227, 13697, -93957, -107972, -15009, 84087, 65562, 50437, -29590, -114804, -150391, -91952, -99754, -153753, -299688, -211020, -207728, -143248, -157199, -106443, -90802, -89497, -186323, -200951, -101450, -38555, -78639, -42426, 62258, 53071, 92034, 59846, -13592, 21623, -30799, -57116, 18967, 40932, 117639, 147098, 121275, 119752, 105772, -26860, 11975, 15034]
15733A5034Q6392P116j42410j1897q7772P0589k5116k2535J02539O9011o1493
15722e42l4353O4238N7079K7525p5161O6949J10696m0377r7124P6555l0168N3065
15710A78382L1266m0309J9272j1335j20611j41259n4231K5082L9094p1459j6005
15699a62113J698O756K0521J31434n4287P3001M6214n9445M4487j6450o9798r3153
15687a31135k9182M007L8690k522R3761P362j00169N3443L2139l8161O2351P7748
15675F8332n6150o2450o7061q258P7237J7613K7880M7205l1711p4520j8161j493
15663h1537K2873N5017o2607K0893N5454o529n1217P523P685J20970J1290K2679
15651A22494k203O6735j14779p727q1052p4407O168n6607n5233L7846R6866N9917
$$ y = [15034, 101426, 108542, -33868, -45765, -133537, -62948, -88064, -110599, -8060, 60951, -542, -34895, 29343, 86422, 113947, 38786, 105735, 216431, 176054, 78930, 155485, 125317, 178382, 209648, 169339, 188611, 177276, 56665, -84594, -138825, -113743, -74649, -146108, -162113, -160415, -153659, -133138, -1704, -55991, 17010, 63224, 3779, 48266, 31816, -37982, -131135, -160317, -156310, -117620, -120142, -26381, -19019, -119188, -65745, -33606, -71767, -9416, 68332, 12182, -50268, -117329, -125587, -48350, -30737, -2857, 44348, 12637, -61883, -80044, -81537, -58664, -3647, -66254, -45361, 10093, 3564, -47653, -40130, -32445, 88525, 99815, 122494, 120291, 187026, 72247, 64520, -16532, -90939, -84771, -141378, -196611, -158765, -61899, -1982]
15639a982p1763K3205j8332N6923P830l1317J3173J01558Q0528m4303j8888p1014
15627B5618j40765N7388j7892p8072r8854J9437R0441J23817J20548m598n8730
15616C8338j14761o1668O6831n4642j65160p6039N7865Q6302J62810M8011K5769
15605A3656n9207n4404P9000j262P1637M9651r2918j33667O3701R1370l9855l4395
15593d6693M8344N0767M4148n8122q9650K5707n3327m0557J2927N3963j2883k1037
15581h6413N118j13620Q5444K2611l9134j6139J0353M4493P8794J33992m4478
15570H1021j36107p534M7726P7025k5376O0619N2989j20453m2280m147l9670l7282
15558i3469P5023Q0484N7246p9071n9795M647k4459q207P8655J5347n6989l8839
$$ y = [-1982, -73745, -50540, -68872, -11949, -4119, -35436, -22263, 79295, 159823, 115520, 96632, 25618, -115147, -57759, -75651, -153723, -252577, -233140, -142699, -18882, 101666, 97068, 38338, -76423, -138091, -71260, -125902, -291062, -367101, -309236, -222934, -60124, -12113, 13656, -45551, -99955, -20955, -22217, 49420, 99071, 6153, -127514, -63813, 27557, -12298, -46693, 1651, 52418, 96566, 38444, -51206, -25499, -78826, -119383, -106456, -52493, -65376, -86413, -81295, -194915, -109471, -86860, -125994, -142133, -131780, -87287, -8493, 125499, 81021, -55086, -62620, -14894, 62131, 36755, 97374, 150363, 29910, -12370, -16517, -56187, -93469, -18446, 62038, 119284, 40213, -19582, -14935, -39394, -47601, 31054, 46401, -10588, -49427]
15546d9427j5184k8868J16405m5967O825k6070j01834q677K0393L3810O1367M8609
15534A1382j6038k5243l4928j26732j28127P1668O7828R6976P2481N9615m3926
15523D956o3443N6176O5500K1953J5330M2907k0229p0057j6254r6407m8369p9359
15511a87296M2044R0658n5634O8393L3448m0162N6348P2368O9883n9266L7960
15500A28744k8889m4492q5750l0541k7839o0468n3863L9877l5552O2984Q3960
15489e1829J3885p8366r240K7350N3833M3764M329l5088O0233M5842R974l3641
15477E1046j10606j9334l9964M8403r468N415L7003O8191M5718P393p658j25257
15465d9118K2173N5099P318j5293N2382k4642l9587L9024N7881R023l6787j06785
$$ y = [-49427, -64611, -93479, 22926, -23041, -16216, -42286, -144120, -152797, -132404, -98594, -37227, 11382, -4656, -29899, -64827, -191559, -319686, -248018, -180190, -83214, -10733, 48882, 4956, -58487, -2311, 63189, 85142, 100472, 143379, 123150, 53093, 36839, -59568, -107937, -187296, -145252, -54594, -110228, -41835, -8387, -48549, 7799, 80167, 150050, 90784, 128744, 99855, 55363, -30387, -60928, -88767, -149235, -203098, -163221, -198773, -135789, -51829, -37944, -116310, -125550, -98200, -44367, -603, 3726, -31362, 28871, 74713, 84687, 51046, -59560, -78894, -118858, -70455, -79923, -74508, -37505, 30686, 76404, 83797, 76139, -49118, -26945, 28154, 35472, 20179, 72561, 47919, 8332, 47356, 105237, 114260, 77473, -29312]
15453b9312q3243j6046Q6122r0134R027Q9848L6829K1055N413N9187q89p6315
15441A1542k0519p0352j4931N9836J4211L5782l0156L3001O0660p9899j41570
15430a42395l9444O3769m3901L0355J28435M3045l7551n2493j4623P81l236p3771
15418a41029L0273N6478M5310N0356k3264P996L2756m6911o328r208Q700K3017
15406B8146j21637j17177K19729R0389k3202k21662j10837P4994R8297l9089L5590
15395h6459J48092q050j40219q3254n2234m5041K3838K7039L5489l0747K2220
15384a89326L5760M4392M0618j3018n9293K7428O1751L1405p7964l581k1628J3498
15372a09958R1026P1370J7798p4462q5274k9497j9533K9142M5891K0727K6198
$$ y = [-29312, -112555, -128601, -42479, -132613, -123586, -33738, 3091, 24146, 29559, 88746, 87857, 11542, -8977, -79329, -94260, -34424, -20213, 15569, -14587, 18414, 79074, -825, -142395, -181839, -118070, -161971, -131616, -3181, 39864, 2313, -50180, -64803, -64022, -67258, -141029, -110756, -54278, -8968, 41388, 18124, 26120, 58876, 11965, 5637, -3571, 5129, 28146, -93491, -210668, 9061, 99450, 76248, -145414, -256251, -181257, -82960, -122049, -86459, 61633, 53583, -86636, -169890, -222124, -267165, -243327, -216288, -180799, -211546, -189326, -153566, -109174, -68556, -81574, -140867, -113439, -51688, -20283, -98247, -101828, -123456, -109958, -18932, 52438, 70236, -4226, -89500, -118997, -138530, -109388, -63497, -42770, -16572]
15361a6572j4109m7716n9136K4449J2411R2967l4393P8151M2519q240K1466j02276
15349a0479l3626J7492m1199n6009p566N5846j64440J5214J11104J22962O5990
15338G5289n5320j18890l1488P4859n1321L3818M841O9329M3845j5265m7119m7494
15326f4916k9888J09449j8601K044k6739m0545K1916J03576N2763j04636q8472
15315h4049K1558K5005M1221J9513k6233o1830n6048n8730K509K5997K7087m7885
15303a71885P2202J23443j9141p1910k2218J8405O3385L1250j05183p3065Q164
15292a46553r207m3971O1666J11158R3415J7532K3989n9219J6624j22468p2654
15281a29688l3602P3344R2916L8706r8095o6059j05340M9235J41474R094M146
$$ y = [-16572, -30681, -78397, -137533, -113084, -100673, -7706, -42099, 36052, 78571, 70331, 91797, -10479, -44105, -26613, -67812, -123821, -131387, -75541, -239981, -224767, -113663, 9299, 75289, 19969, -98921, -130409, -55550, -106871, -73053, -68212, 1117, 44962, 29697, -17422, -64916, -94804, 14645, -3956, -1912, -28651, -69196, -47280, 56296, 109059, 4423, -84049, -62491, -37486, 3735, 23248, -2985, -64815, -120863, -179593, -177084, -151087, -124000, -171885, -99683, 23760, 4619, -67291, -89509, -71104, -7719, 23531, -81652, -154717, -146553, -155760, -199731, -138065, -26907, 66508, 84040, 108029, 48810, 65434, -57034, -129688, -163290, -89946, 2970, 41676, -56419, -122478, -227818, -178583, -37109, -28015, -23869]
15270b3869k393j4570m042j53839j43127N2380R7084J64888J10266n7341p2417
15259d6980q0641k0864M0752l0513m6555j1702R7065P4970p198j0482p1111J3809
15247i9450j3503J2915J16316N479p8566P6895p1700l615J2054l2121j1462P4787
15235a1971R3590J02004o6354j20831L2605m5680p0370n6848j8630K4701N7968
15224g9816J3661n072n384k212O7374L4397q7585n9466R9498L8970K7441m4069
15212b263q4793r0011P3264L3027k4978K0586L9554o6647J31503L9747j8728o1098
15200a0837J3694L9525K0330P2756l7438o5847k8315Q0787k221q8460J2414K3156
15188B9544j7867M085K6147N3704r323q9687N4175J1825j00417l9760q382R4949
$$ y = [-23869, -26262, -40832, -44874, -198713, -341840, -289460, -192376, -27488, 82778, 25437, -46980, -127621, -148485, -107733, -138246, -184801, -196503, -99438, -24468, -31666, -42148, -113259, -99450, -112953, -100038, 16278, 21757, -56809, 20086, -51614, -55229, -43175, -75296, -86758, -11971, 81619, 183623, 117269, -3562, 29043, -16637, -87007, -143855, -162485, -137784, -79816, -66155, -71227, -76611, -78823, -11449, 22948, -64637, -124103, -24605, 14365, 41806, -2263, -87056, -177067, -103803, -70776, -95754, -75168, -35614, -102261, 29242, 68989, 50261, -10837, 2857, 42382, 62712, 135468, 98030, 32183, 3868, 84655, 82434, -6026, 6388, 29544, 11677, 15762, 41909, 95613, 86290, -3397, 50778, 62603, -37814, -77574, -85956, 8993]
15176H993m7920L543P7549j796o63j48010j03261L5029M5959j2501N7558P4550
15164a0970l3682n6954J25937K0735l4414o1609n4416L3892J5660N3984n5761
15153e7598k0369n0215O1564m0557J03253P4557m7268q8501k9651m8898M0302
15142a03381P5636m3529J23007J8104k1558k7334j29376J1689O2126k5247m0964
15131a00827l5796K168m4331n4548L9169P0454L1700J312J13095N9768M9765J5549
15119A47478Q755j03604l0465J23349Q728p7611l010L0982n6486o942k7211M116
15107A8079N2765j13218L2440J0849L5825J19312J5197j06329r4534J06651J19747
15096A96784r6962j17443k1475r222p3254J38626J04517o0081j23077m7276o5819
$$ y = [8993, -38927, -35384, 42165, 40369, 39706, -108304, -211565, -176536, -130577, -143078, -85520, -10970, -44652, -101606, 24331, 45066, 10652, -50957, -105373, -71481, -55821, -1837, -57598, -77967, -128182, -66618, -107175, -3922, 70635, 23367, -65134, -94785, -143683, -103381, -27745, -71274, 51733, 69837, 48279, 20945, -108431, -96742, -34616, -59863, -100827, -136623, -134455, -178786, -233334, -194165, -123711, -92011, -90699, 22396, 82164, 131929, 147478, 156233, 52629, 22164, 145513, 154241, 76630, 73620, 104602, 48116, 41174, 13963, 18079, 70844, -42374, -9934, 915, 36740, 156052, 171249, 64920, -29614, 77037, 196784, 99822, -17621, -39096, -48318, -121572, 17054, 121571, 61490, -61587, -108863, -174682]
15085a74682p9422J05071J29182N3754j22295j20669M1816J02785J6061M6850
15075a549N4315r9502q4981O2101L1153l382j7158o1294m0835R4839O8691m5315
15063d2917M1614J50144K5051p2255o2809k6919Q326N3637P3065k9845r9257K4585
15051D2420k10L5061O4513m5349J8089L1895n3637j75321J9815J47904l2799j9760
15039C2621k1733j9669k0955m8463p384l7727n5170k3829l0638J67811Q260R401
15027d7475O3237L902j6019n150j61J3960P8338n4772l1415m537K4301j7643q1563
15014g4997q1487m7621o7863K8648N6464J2041m9338O68j2427N8925Q1476N0096
15002d5415M8388r3444k8433L7455N5485J23386k4500J4937J51504p7845j18026
$$ y = [-174682, -254104, -149033, -19851, 33903, -88392, -209061, -167245, -64460, -48399, -1549, 52766, -46736, -131717, -69616, -38463, -41845, -59003, -120297, -161132, -66293, 2398, -42917, -1303, 148841, 173892, 101637, 38828, 11909, 20235, 73872, 146937, 117092, 17835, 42420, 42210, 77271, 141784, 96435, 114524, 146419, 92782, -82539, -62724, 85180, 52381, 32621, 10888, -8781, -29736, -78199, -85583, -123310, -178480, -202309, -232947, -65136, -56876, -47475, 15762, 19664, 3645, -1505, -1666, 12294, 90632, 35860, 4445, -92, 24209, 6566, -74997, -156484, -204105, -271968, -243320, -186856, -174815, -224153, -223485, -235912, -176987, -95511, -45415, 2973, -90471, -118904, -81449, -25964, 97422, 72922, 87859, 239363, 161518, 43492]
14991D3492j61065o8555J1411R0391O0596m0115J35353j6288j01398N6457K5604
14980C5883k5816n9084L1638J06174j0627M9075k3077r1748n0103m1691p1399
14969a50775n4108j5170J13767l2994Q6766J45443k2629q7622j1282J768K1467
14958e369K1496k9246P0413l9770o0700R3761k7681N0242J7157k5275Q356o4028
14946I356j37868L763J8204Q2533O141J5718P3709l2969j16747l0650j0633r8714
14934b18157R5450J51751J8449j02509p8708J24558P8610j7256q7609j16924K4563
14923a27782N1992p0238L2593K0280N3559O7473N6881Q183j8007J06866k9799
14912A52001m1860j06190O4659J1301n8640n4604k5493l5929O1574j7296o243
$$ y = [43492, -117573, -186128, -174717, -84326, -23730, -63845, 71508, 55220, -46178, 10279, 35883, 10067, -49017, -17379, 88795, 78168, 127243, 104166, 12418, -37685, -79376, -150775, -204883, -220053, -106286, -139280, -52514, 92929, 70300, -17322, -28604, -26836, -5369, 16127, -13119, 57294, 17524, -43176, 50585, 22904, 73146, 90303, 65028, 73384, 9356, -128512, -124749, -106545, -24012, -17871, -2153, 71556, 38587, -78160, -108810, -119443, -218157, -122707, 29044, 47493, -55016, -133724, -9166, 69444, 52188, -35421, -152345, -127782, -75790, -146028, -113435, -93155, -39596, 27877, 84758, 92941, 74934, 181800, 152001, 110141, 3951, 68610, 79911, 21271, -33333, -58826, -94755, -33181, -50477, -56720]
14901e6720m7358o2375M3598M6457P5417J0609n0335k05376m314o2462m4127M0443
14889c16543N3153J35686J24326J20734j25785q7820M2048N5679M5879M0513K7141
14878A15011j32669q6965L3568l3460j5648R275K3500R1058l7356m5069k4331
14867a03086J9568o3073j629R4024j9611r1319P0041O6729o446j00607j14688
14856b50097Q390j3593M7076J68231l5621O6314o2435K004Q722M9811J38302J1043
14844A38147j03537p1047j7248q5885K7685R7651O4995O682K841Q15k306o9662
14832a0869m4469L2783L6409o9079j5001l5243J7938J2990p7128J28807R2841
14821F9979L2408j22622k8862l9938N8400O5112m1401N3577K8813J7059N8734
$$ y = [-56720, -104078, -166453, -122855, -76398, -981, 9628, -40707, -246083, -250397, -312859, -356986, -316543, -263390, -127704, -3378, 117356, -8429, -96249, -54201, 1478, 47357, 87870, 115011, -17658, -104623, -71055, -104515, -120163, -110888, -87388, 3670, -33686, -78755, -103086, -83518, -146591, -148220, -54196, -73807, -165126, -95085, -28356, -34802, -135409, -250097, -241707, -255300, -208224, -39993, -75614, -9300, -71735, -69731, -61009, -11198, 127104, 138147, 34610, -36437, -53685, -139570, -111885, -14234, 50761, 57443, 60284, 61099, 58793, -10869, -55338, -22555, 13854, -55225, -70226, -105469, -87531, -74541, -151669, -22862, 69979, 102387, -20235, -49097, -89035, -30635, 34477, -6924, 46653, 75466, 92525, 151259]
14810A51259M5277L3986p5357o5027n760j01131r3961j0773n903M5161Q0082O2
14798b085O413J1703J3265r0104o7177l9379J9479Q8018J01361J78891j5952j27050
14786G7383o9687j15857j31935N4921J21928N2137j449M8448j0256n5341j16579
14775a46287j8188K1814r457J0883p0764J3654J29693O8075J05882m9931j11229
14764e5855k7984L3823j1626J9958J20214q5023k4925N6415M522k3887J0956J1013
14752B7601L9998j58222q6672M0510J94809O2511n6379j34259l0290J1191J8921
14741g0281J8715j7893K8784k4986r0557j15650P8300Q5464K6888K7435J4329
14730c9452M692m275R758j3904K3429q211N9087o47K6750k1256j05817j7757K0828
$$ y = [151259, 196536, 230522, 155165, 90138, 84378, -16753, -110714, -121487, -127390, -82229, -2147, -2085, 4328, 16031, 29296, -60808, -127985, -167364, -147885, -59867, 41494, 220385, 204433, 77383, 7696, -108161, -240096, -185175, -63247, -11110, -12559, 35889, 25633, -29708, -146287, -164475, -142661, -152118, -141235, -211999, -198345, -68652, -577, 105305, 55374, -55855, -83839, -50016, -61642, -41684, 78530, -6493, -31418, 24997, 29519, 5632, 16588, 27601, 67599, -90623, -177295, -136785, 58024, 120535, 64156, -70103, -100393, -89202, -70281, -51566, -69459, -40675, -65661, -156218, -271868, -193568, -108104, -81216, -53781, -39452, -34760, -39035, -29277, -43181, -19752, -27963, 31124, 30477, 57227, 35971, -69846, -87603, -66775]
14717f6775N3603L9612n8069J3581K3042r4571K8076J24973j1003K1087L247L5605
14705A12408k3577j1825J9305m421r094k6667n6772P4041M8724j7195M2169o0852
14693H6244m1594r985j06400L034l991J4340O7211J27905j3784K9366j9539o5317
14681F7490n5746L7329Q8301j2387q1157r3914J7017J18080q3317r2757J04196
14670A3135J7336K6024Q9245m7960l6059j45419k3801M1464L5803n8994Q3036
14659f190j6449N1285R1151o525N2892m4080l0613m9932K4185L7948L3286K210
14647A39168l3408q6339L2535O7503j8873O8039o4298j88207m7620m0087j279
14636a72866m700k059N9508K4361J01711R4818n9604r9424j2334l1710O7621K126
$$ y = [-66775, -13172, 26440, -31629, -18048, 4994, -89577, -61501, 63472, 52469, 73556, 76803, 112408, 88831, 77006, 96311, 91890, 82796, 56129, -643, 73398, 122122, 104927, 147096, 86244, 44650, 34665, -71735, -68701, -72692, -58352, 8859, 136764, 122980, 152346, 132807, 67490, 11744, 49073, 137374, 124987, 43830, -50084, -33067, 85013, 1696, -91061, 13135, 30471, 56495, 145740, 97780, 61721, -83698, -107499, -66035, -30232, -89226, -6190, -22639, 28646, 119797, 113272, 166164, 122084, 91471, 41539, 65724, 103672, 136958, 139168, 105760, 19421, 51956, 119459, 100586, 168625, 104327, -83880, -131500, -171587, -172866, -177566, -179625, -120117, -95756, 5955, 100773, 41169, -58255, -70589, -102299, -34678, -32552]
14624c2552M0703N4162J2298Q0891n5556J5994j6565p1648K937N0924K8689p1059
14612C9218m3356J5809o7304P5175N3714l3232Q690l0017L3293n1000q6319m6154
14600a31483J34055l4563q1617m3878l1917N2835J5816J8427P0950N0141q0019
14589f1253L1548R575k7704N6329O1755R9918o8057q4231k5235R5211j5717m1556
14577C0583p7059L274J14556P0844M3190j58116l0297P4063j03363k9242R3096
14566C1529J3600l119k628M029N2092j1563p0193K9503o3973p417J7752J9830
14554I442R3586Q0628j9762k4575o4205q3386J1273J33088J9058O3849n8650j70330
14542i984k0176J01085J17295O3564n4264n5974k2762j35177P722k104J850p9338
$$ y = [-32552, 8151, 62313, 74611, 155502, 99946, 115940, 99375, 27727, 30664, 81588, 110277, 39218, -4138, 11671, -55633, 19542, 73256, 40024, 48714, 18697, 51990, 990, -85329, -131483, 2572, -31991, -113608, -157486, -189403, -136568, -120752, -102325, -31375, 18766, -61253, -29705, -20130, -47834, 8495, 70250, 170168, 102111, 17880, -7355, 87856, 72139, 30583, -46476, -43202, 71354, 142198, 185388, 27272, -3025, 71038, -32325, -61567, 31529, 45129, 42010, 39382, 43411, 95503, 83940, 13747, 43250, -20723, -28140, -10388, 9442, 103028, 183656, 163894, 139319, 75114, -8272, 3001, 136089, 155147, 218996, 160346, -9984, -30160, 70925, 188220, 251784, 197520, 141546, 118784, -16393, -8671, -10775, -8925, -88263]
14530h8263o4005L695J25637J57999L0564K9021r4935p8186K3808L6424M1148
14519A22907p6041m4991n2318P885K8312K9101l9604p1179Q1751N3569J5156p681
14507D6867N1284n9759r1706n7093l9616l3647J6423J12880o4646M052L5791n810
14495h4980j9834k2019J26252O0940l2458j27276R917N4248n552p8464J0199K6758
14483h2269M0431p7570n1856P1644N3583P6067J870p3353Q1985J37084o1035j18735
14471b154m2736J4711j6695o3674O1963K4050q815J09735l7495q4054j733M9966
14459C069P0976O4661r276L3600n5165q1586p4662n2741K9172K1327j17471m3365
14447b11461l0403M0315r0676R554J32538N1784K3741p9788L3141K0030N0023
$$ y = [-88263, -152268, -148573, -22936, 135063, 165627, 194648, 99713, 21527, 45335, 81759, 122907, 46866, 1875, -50443, -42558, -14246, 14855, -24749, -95928, -14177, 39392, 54548, 46867, 98151, 38392, -53314, -110407, -150023, -183670, -167247, -54367, -119013, -114961, -79170, -84980, -104814, -126833, -581, 60359, 27901, -99375, -89458, -35210, -40762, -119226, -109027, -82269, -41838, -119408, -171264, -99620, -46037, 30030, 31900, -41453, 40532, 177616, 116581, -2154, -44890, -30179, -46874, -110548, -48585, -24535, -33350, 76385, 38890, -45164, -46897, 3069, 74045, 138706, 129430, 163030, 107865, 26279, -48383, -101124, -71952, -50625, -168096, -211461, -241864, -201549, -292225, -282671, -150133, -98349, -74608, -154396, -121255, -101225, -51202]
14436e1202N5719K4930K3646j2145l417l324J1870k2287l701L9735q83p6282O303
14423a1038q695o950M1723n6598Q3054K5249n5228K5987p4981j08900M070Q0566
14411f1741N9840M48J7460k7902k415j7930m245R1494J6382p5681K0471N5644
14399G1825J0908o2911L717L0772K8017M5433M4508l1873p2641j39126j9058j3112
14387a03541K0107Q5162L5035N294p6966p948J32658k6714k3429Q1128L2619q5683
14375F7722r8520q949Q2499J5359R0316L0283o2457r7739J460j8248o1329j8814
14363g8417O1594q6294M4737L4478l4854n0947N330j3621J37553N5437j7897p4984
14351a7885J01150j9939p9929Q8149o51m1390m168j01762m0440k3205J4945K1946
$$ y = [-51202, 4517, 29447, 53093, 40948, 37531, 34207, 46077, 23790, 20089, 59824, 58941, -17341, -11038, -19733, -26683, 15040, -41558, 41496, 66745, 11517, 37504, -37477, -146377, -142307, -61741, -1901, -1453, 16007, -11895, -14310, -32240, -36485, 55009, 71391, -4290, 16181, 71825, 82733, 19822, 23539, 54311, 82328, 127761, 172269, 140396, 67755, -71371, -90429, -103541, -83434, 1728, 36763, 42057, -34909, -42857, 89801, 63087, 39658, 120786, 153405, 67722, -30798, -39747, 42752, 58111, 148427, 178710, 116253, 18514, 19974, 1726, -59603, -78417, -16823, -103117, -58380, -23902, -58756, -109703, -104373, -117994, 19559, 74996, 57099, -17885, 83265, 63326, -16603, 71546, 70895, 29505, 25337, -76425, -116865, -140070, -125125, -103179]
14339a03179O1757N1366P8131L8828n749l2243j0790r0022q5522J2641M1972L5034
14327g776J01707l6528o6046j25019N3141J36842j24p835m7916o7877l3688J2100
14315h9019R873k7315J5927k0055N3770P6000L0308l6538n4796k0012k1536O6535
14303a6858J19809P0764m6505p0135p2144m0766J14389k7146n7609P4895J00610
14292A49304p9177q1405l2836p1215N5680R7246R687m8165M0140M3553M1057O1803
14280A85672l1496o3814o4885L6401Q9193N1587j7374q7723p3192o6918l0353
14269g2902k8132k3970J10022N7443k1821k7243p4471j13766M2924O3111l8777
14258a27582l5770J7967R2857m245Q0061Q6508L4647o3146r8259o0201l8658K5730
$$ y = [-103179, -41422, 9944, 88075, 126903, 121154, 88911, 78121, -11901, -97423, -84782, -42810, -7776, 93931, 57403, -8643, -133662, -80521, 56321, 56197, 48362, 446, -67431, -101119, -89019, -79146, -106461, -90534, -110589, -56819, 19181, 49489, 12951, -41845, -61857, -83393, -16858, 102951, 173715, 127210, 57075, -15069, -55835, 58554, 31408, -26201, 48694, 149304, 70127, -11278, -44114, -115329, -59649, 37597, 47284, -881, 39259, 82812, 123869, 185672, 154176, 90362, 25477, 61878, 151071, 202658, 185284, 97561, 24369, -42549, -72902, -101034, -125004, -14982, 42461, 20640, -6603, -81074, -194840, -151916, -88805, -127582, -163352, -145385, -52528, -56773, 23288, 109796, 144443, 81297, -16962, -77163, -115821, -90091]
14246i0091J12060p393j2972p5171n9293m3459p7786N2145Q7393j9358M6443N3246
14234c4236j00783J2041J6626O3389J49038M631o9505m7315M0845k8824M6550
14223E2457k5963j22282r8508j063M1136L8196L2310k2533Q9376Q5572L5840q5240
14211A9298k4682l1580o3531n118l6868N347N6229K1485j1318p2956k4868M3464
14199a25098m6716L3088J00384m1868n209J69907K9543k20554l2233k3229R4501
14188f7484M7199j1522K2392K9175L966K8056l1835p5141R2241M0336p055r5219
14176b4891Q50O6694o8841l7565j11905N6690L3764m6388K3612J00837M1146K7702
14164F1705l5793r8268M0881J05501J4855l8025r6854J7504M5443k3612n5066
$$ y = [-90091, 21969, 14576, 1604, -73567, -132860, -176319, -254105, -201960, -114567, -133925, -87482, -34236, -135019, -122978, -106352, -42963, 106075, 110706, 41201, -6114, 34731, 5907, 52457, 26494, -95788, -194296, -195359, -154223, -116027, -83717, -106250, -16874, 68698, 104538, 19298, -5384, -36964, -100495, -105613, -142481, -137134, -80905, -59420, -70738, -143694, -168562, -125098, -171814, -138726, -38342, -80210, -85419, 84488, 114031, -106523, -138756, -161985, -67484, -20285, -31807, -9415, 19760, 23726, 51782, 19947, -55194, 37047, 77383, 70328, -24891, -24041, 42653, -26188, -63753, -175658, -118968, -85204, -131592, -107980, -7143, 34003, 61705, 25912, -72356, -31475, 74026, 88881, 50856, -45998, -28494, 16949, -6663, -61729]
14153f1729j25159n622N0910P7462M3636m7153l1556J32827P7748M4736p2865
14142H3235j30783q3l6601J30614j08902k6872N4938n995L4889o4211l1141m5469
14130a46381N3819P0827o520J99089J5886o4486j9699j2910L7772n3488q0195
14119f286o2338j1405l1259l563J18754j8258P0329P2813l2518j20288N166Q4310
14107F5457M3617K6448J9997n0050q6467q845l8513L6592n598k6232J28448Q946
14095A13800Q22m3277L1898r8445k7567m564P591n5767M54j8379k3749Q9569M5422
14082A7808J10398J01152P15j16332j6514o5691j13902L6402R0898K8484L9911
14071A13329N1813p1351J9004J1813J3865p3570p2183j16777p6223q68J6609R1751
$$ y = [-61729, -186888, -192510, -141600, -64138, -20502, -67655, -99211, 33616, 111364, 156100, 83235, -47548, -47631, -84232, 46382, -62520, -89392, -34454, -40449, -5560, -69771, -100912, -146381, -92562, -21735, -28255, 170834, 186720, 122234, 102535, 89625, 127397, 73909, -6286, -68624, -80029, -111288, -114851, 3903, -14355, 55974, 128787, 96269, -24019, -18853, 65457, 109074, 135522, 155519, 105469, 19002, 10157, -28356, 8236, 2638, -23594, 104854, 113800, 114622, 71345, 103243, 4798, -22769, -27333, -19742, -75509, -75055, -93434, -117183, -27614, 17808, 128206, 229358, 230073, 113741, 97227, 31536, -82366, -45964, 44934, 73418, 113329, 165142, 93791, 112795, 124608, 138473, 64903, -7280, -124057, -200280, -201148, -184539, -92788]
14059i2788Q3496n1884l6809J4436N1947K8927l5860N613P7012O2665j5967j10352
14047a9564m2744j212K5957N6097R3220o7161m8206n740N4495m130M4356Q9774
14035A75142Q6901j3665r0665P0250r3298k8015k6378j59782j12527l3258K8709
14024a96586J85032O0925p108k7119M8797J4281m6593K502k1074L0347P4846m31
14012A17819j7304j6482l429l2163m3594N5887N3878j17004q7696N4738l1381
14001f6731L6483J09826M5156j41296m7755J5383L7115P1714L6720q2413r1229
13990g7027Q4622M8786R4275J0442l6349j2361O215m2118o9919j6823l3575o0543
13978a04375K9166K0060O301Q432O3757J8603N2340K5310J14891q605K7303p0225
$$ y = [-92788, -9292, -61176, -97985, -83549, -31602, -2675, -38535, -32922, 44090, 106755, 90788, -19564, -62308, -63520, -37563, 18534, 111754, 44593, -3613, -9353, 45142, 41012, 85368, 175142, 262043, 248378, 157713, 227963, 134665, 106650, 80272, -79510, -192037, -225295, -196586, -11554, 49371, 42263, 15144, 63941, 78222, 31629, 34131, 13057, 43404, 118250, 117819, 100515, 84033, 80604, 48441, 4847, 60734, 114612, -2392, -90088, -35350, -66731, -30248, 79578, 124734, -16562, -64317, -48934, -11819, 59895, 96615, 14202, -77027, 7595, 56381, 150656, 161098, 124749, 112388, 118603, 76485, 6566, -10257, -43832, -104375, -75209, -55149, -48848, -40416, 23341, 41944, 94284, 119594, 234485, 225880, 253183, 182958]
13966A82958j31458n8657l4301O6331R0601m4205p0666j6311j3275j8551K5005
13955b2529N3742L2327J281k5883j940o0439l8683m4516P4475J13957N5744j029
13943A36507l1786n3871p0893k1744N4127K8429M4690n1728k7399j02754K4945
13932g1477K934Q2301K0118j6640k6703O0932L4657k6117M9248K8120P8442j4896
13920B00919r2670J1435l348j08561k1813Q2650M1643q1425K4234R2126q1957
13909F3233r2971n3255K8672R6462M6979J0547J0321N4504N577M923j52291o1114
13897c8413j4800j36016l6036l801J31479j3274j7108J13362k1924l9973L4757
13886d1747P4307J2581j9516L5318k9768l3571r756M2666r3978L585J35925j6231
$$ y = [182958, 51500, -7157, -41458, 24873, 115474, 71269, 603, -15708, -28983, -47534, -22529, 31213, 63540, 64821, 38938, 36998, -23441, -62124, -106640, -32165, 81792, 137536, 136507, 104721, 50850, -20043, -41787, 12340, 40769, 85459, 33731, 6332, -96422, -71477, -68543, 13758, 33876, 17236, -9467, 51465, 86122, 60005, 109253, 137373, 215815, 200919, 108249, 119684, 116336, 7775, -14038, 68612, 110255, 28830, 53064, 145190, 63233, -29738, -82993, -54321, 42141, 89120, 99667, 109988, 164492, 170069, 174992, 22701, -38413, -53213, -189229, -225265, -229066, -97587, -110861, -127969, -14607, -36531, -76504, -41747, 32560, 45141, 25625, 60943, 31175, -2396, -12152, 30514, -63464, -59879, 76046, 59815]
13874E9815J2499J5570N1748L5362L5206M7319r0192p2662j116N130O4962j12579
13862E1062J0555O1219o9205j06750l5489L8647K7619O5935j9179R3282k4108
13851I3588r8631n9961K5292N5828J3974o4064m513L8625j07583O8683J54468
13840A15706k079r326n7883P3591Q5346j881o0017m0908n2279k9539K7500Q8284
13828A36515K6676p0854P5642n6121j3660L180k1784l3836q0392q6981J22178
13817E63J67309K9796L2717L0066m4082n6693j05955j4212q0454K1527L1361n0348
13805c8405n3999m570j8008N9434R7391N0519O0981o5480m3932n5927L5802N872
13793B9678m5211O3566p3120j02161Q0212J62357j21634L4986J2255P5460K5198
$$ y = [59815, 72314, 87884, 139632, 174994, 210200, 257519, 167327, 94665, 93549, 98679, 163641, 51062, 61617, 122836, 53631, -53119, -88608, -49961, -22342, 43593, 24414, 117696, 93588, -5043, -65004, -39712, 16116, 30090, -33974, -38487, 138, -107445, -38762, 115706, 113627, 104301, 46418, 120009, 205355, 203474, 143457, 102549, 50270, 20731, 48231, 136515, 163191, 92337, 167979, 111858, 98198, 101378, 79594, 45758, -34634, -121615, 563, 167872, 197668, 230385, 260451, 216369, 159676, 53721, 39509, -40945, -19418, 11943, -38405, -92404, -96974, -114982, -55548, 41843, 92362, 153343, 87863, 43931, -11996, 23806, 29678, -15533, 48033, -25087, -127248, -47036, 115321, -6313, 28673, 40928, 116388, 141586]
13782A41586q1757m6532q2197J02919L5854o2461N753o3670q5832J0326l8327
13771a64338j7514J180J06872J22387J00658j4117j52964o56J9219M6090n0466
13760c649L5739N2864Q3501L2559p8885l3961J00950R0887j9514j00618o0034
13749I9839J811Q0935N1493r1305p224O1668r004k877o4644l0682L3862P2370
13737A96242j1391r0432m032J4130j0112o0200k7198J9472j0249r1576q5865M256
13725a56955L7558J49195M0745p5871l4153p8788k0677k7391M3872j9184M1405
13714a00244J08851j69221n8472L3847m0098N5175J09775P7408J21112k9181K9963
13703A38915M526j10933n0569J8589Q4516O9088N6808n097j25285k02259l1579
$$ y = [141586, 59829, 13297, -68900, 34019, 69873, 7412, 13165, -50505, -136337, -126011, -164338, -181852, -180672, -73800, 48587, 149245, 135128, -17836, -18492, 727, 46817, -3649, 32090, 84954, 168455, 201014, 122129, 88168, 189118, 280005, 260491, 159873, 99839, 101650, 182585, 234078, 142773, 135549, 197217, 188213, 185336, 120692, 90010, 123872, 196242, 184851, 94419, 90387, 104517, 94405, 34205, 7007, 26479, 16230, -75346, -161211, -156955, -119397, 29798, 70543, -5328, -39481, -118269, -138946, -166337, -122465, -141649, -100244, 8607, -160614, -219086, -185239, -225337, -170162, -60387, 17021, 138133, 108952, 138915, 143441, 32508, -18061, 528, 85044, 154132, 210940, 205843, 80558, -121701, -153280]
13692a53280J38270j1707l8852J1969O4766j7700J11432K26r6872r0351j0197
13681i2296N9793j1634L5904N3673n719m4121R5964L1352o3128J27068n7349p9404
13669E0103P6677M1820j0379n2887O139j04526l6188k7318j9737N5452M523m0425
13657e6746J10733J7115R94J7420j4013m5273k4692L3199L3078L1144K8969M34
13645A32362q636n9284r1666n6037K2227L1330P21M942q2480O3986J75868J67578
13633C00911q4894j80931K9304k5553J0002R4377j9622k6531K5425Q34J7790M2768
13621A83880m9595m1967L425o9339n1377J9593j02250K2004P8233L4868k1371
13610F104k1445p23P4002J36515r6512p5775k1520j8680K3319L0377L044j0780
$$ y = [-153280, -15010, -26717, -65569, -53600, 11166, -6534, 104898, 105124, 8252, -82099, -92296, -32503, -44137, -8233, 45440, 39721, -4400, 91564, 122916, 59788, 186856, 129507, 50103, 126780, 168600, 158221, 105334, 111473, 6947, -29241, -56559, -76296, -20844, -16321, -56746, 53987, 71102, 72096, 89516, 75503, 30230, 5538, 38737, 71815, 102959, 131928, 132362, 123726, 64442, -27224, -83261, -61034, -29704, -28983, -24041, -106521, -42535, 133333, 300911, 216017, 35086, 64390, 38837, 48839, 143216, 123594, 97063, 122488, 123322, 141112, 183880, 134285, 92318, 95743, 26404, -24973, -5380, -107630, -85626, -7393, 27475, 6104, -15341, -16064, 57938, 194453, 97941, 22166, 646, -18034, 5285, 35662, 38706, 27926]
13598B7926k1098o8992o303K7949n9225J06036J20643k4716n599k4854K3730Q4903
13586A80400j00770M2652O7640k166p3823K3569k3670J1574N2874l304p5249l6424
13574F3303k3836l5873j05431j1984j2329k3073m051N0527J09664l820j29287
13563a26190j5514M3734n2487l815L2215N4197L4274N7951K0530O1743K6858l9522
13551I3974o2426n4620K1674l7537M532P0278Q146L0426N3436K9082J17242O0648
13539C34855k7506j03633j16100q3545o6797P5054R4754k1019n403N8545n505
13528A33700m2932l6308j7118J00783k8051J8310N190L0497o9313l1543L0906
13517I4121P1101L5285k9631K2628k7190l2252j250M893k2319j62010M6135J20739
$$ y = [27926, 6828, -62164, -68467, -40518, -99743, 6293, 126936, 102220, 96621, 71767, 95497, 180400, 79630, 122282, 189922, 187756, 113933, 137502, 113832, 125406, 178280, 174976, 99727, 63303, 39467, 3594, -101837, -113821, -126150, -149223, -153274, -102747, 6917, 3097, -126190, -141704, -97970, -150457, -154272, -122057, -67860, -33586, 24365, 44895, 106638, 133496, 93974, 31548, -23072, -1398, -38935, -34403, 35875, 44021, 74447, 127883, 156965, 274207, 334855, 307349, 203716, 87616, 4071, -62726, 12328, 107082, 86063, 80660, 139205, 133700, 90768, 54460, 37342, 138125, 110074, 128384, 133574, 164071, 94758, 63215, 94121, 165222, 200507, 170876, 193504, 166314, 134062, 132812, 137705, 115386, -46624, -489, 120250]
13505A20250N1486L5317J4013m556j14668l5228N3350j4220J4482j0174N646L9032
13493A54730k4361l8220j6530p7956K6524L9413L4722o997p5975O5157P316r3584
13481e761m8845M4196J24105P9663o5875j08942Q8470k2491J1336Q238o3773O146
13469D6467m7826L6085P8841Q7484j18389j39485L6870J16584Q7300J8476m9586
13458A52821R8859K634o9501n2924r5774l1023M7385J13522J5300p7761j18541
13447a5003l3785o4214o9524j735M9042k2113L6916J66507J03304r529q1887j75753
13435a17774O7587J01491j1865L2815J8177r3490n0321J71377J44644L2083r1780
13424B02944j10204l9836K6717P8805K4207l3354l9548m0973j42038P5821M5603
$$ y = [120250, 171736, 207053, 221066, 216510, 101842, 66614, 119964, 105744, 120226, 110052, 115698, 154730, 130369, 92149, 75619, -2337, 24187, 63600, 98322, 91325, 15350, 80507, 87823, -5761, -54606, -10410, 113695, 193358, 127483, 18541, 107011, 84520, 95856, 104094, 40321, 46467, -1359, 34726, 113567, 201051, 82662, -56823, -19953, 96631, 183931, 202407, 152821, 251680, 254314, 184813, 131889, 36115, 5092, 52477, 165999, 181299, 103538, -15003, -48788, -113002, -182526, -184261, -135219, -157332, -120416, 46091, 149395, 139866, 57979, -117774, -50187, 51304, 39439, 72254, 90431, -3059, -53380, 117997, 262641, 294724, 202944, 92740, 52904, 79621, 158426, 182633, 149279, 109731, 68758, -73280, 2541, 48144]
13413D8144j5323M8939o1416m4894J38963J00231q768r3449j6097Q1442J03722
13402B81494p5907o4808n2404R225L8857J0804l3302J4373L5667K4128k3202N2706
13390B17631J4402m5318P1285M3845l2473P7004n088p375p2598k0997j30106j81546
13378g1334j03420J59601J5602L3575J4161q550L0790N0901j9850L7766J1484
13367A50726Q397Q9471Q267l6858j36793j4592J22264P3518m9844q2225m0173
13356I2158n4678L3230J19589k7193K4688o9864J6774M316l1430n8688m751L6886
13344H1037N4860J15778q884J1962k8240p0488L197R2016n7335n7751o9630J4303
13332H0825o855O561k4563k004O4030r0856P309J9135k5346M3630J5329l9093
$$ y = [48144, 32821, 81760, 20344, -24550, 114413, 214644, 205876, 112427, 96330, 177772, 281494, 205587, 140779, 88375, 97600, 136457, 147261, 113959, 128332, 163999, 188127, 164925, 217631, 232033, 186715, 258000, 301845, 269372, 346376, 341288, 333913, 261315, 240318, 110212, -71334, -174754, -15153, 449, 34024, 48185, 39635, 70425, 121326, 101476, 139242, 150726, 159123, 248594, 256861, 220003, 83210, 68618, 190882, 264400, 214556, 132331, 92158, 37480, 70710, 190299, 163106, 187794, 117930, 134704, 139020, 107590, 48902, 44151, 81037, 135897, 251675, 242791, 254753, 226513, 156025, 159222, 251238, 193903, 136152, 66522, 80825, 73970, 80531, 55968, 53964, 117994, 27138, 34447, 53582, 28236, 71866, 87195, 48102]
13320D8102R1325K2326o3984k2008M3052K932K2525K0508K5522p4737P170N7401
13308A80134q895n3404L365l1449k764J0558Q381n578O2121M3899P9793K897j42559
13295A46499k2001K5760k0645R8407K9889l0961j33669l0365J31199O3941J14625
13284C72679m6787k09437k6505K4096J2247l959l7234M8646J21189Q5749j74227
13273A66457k254L0245R7221K8545q1880k3453k4466P8069J39217j607j83848
13262B22246q9653j5127o074O9147O3987k7403L7448l7218P399J1681j41095m2626
13250E2712J6048M8046M194N283K072p771J7117J0953o7830o5278O8622J14283
13238A98451R4651j02172r6749M6559J07109l442J4983J0486q9305N1081J34721
$$ y = [48102, 139427, 161753, 97769, 75761, 118813, 121745, 144270, 164778, 190300, 115563, 122733, 180134, 171239, 117835, 121200, 89751, 86987, 97545, 105926, 100348, 162469, 206368, 286161, 289058, 146499, 124498, 150258, 129613, 228020, 257909, 226948, 93279, 62914, 194113, 258054, 372679, 325892, 116455, 89950, 114046, 126293, 122334, 85100, 133746, 254935, 340684, 166457, 164203, 194448, 291669, 320214, 238334, 214881, 190415, 268484, 407701, 406094, 222246, 132593, 117466, 111392, 180539, 244526, 217123, 254571, 217353, 224752, 236433, 95338, 52712, 68760, 116806, 121000, 126283, 128355, 120584, 137701, 148654, 80824, 15546, 84168, 198451, 293102, 190930, 94181, 140740, 247849, 244407, 259390, 269876, 180571, 231652, 366373]
13227C66373n0896j69246M2840O1065Q4623m4499r2185J0408O2634K3602M3292
13216C38011L9109l1141j2017p0309m2792p7224Q64O1542O9056K2629L9718j1501
13204C25945o7754J59971M0607o863o8490o5794M4254k5412j48725l5386j1745
13193A40608J04194L4845J33626N8950p6376n1978Q497k8025P5396m4030J458
13182C57165K653N3729k8781m1282j23580k9003J04636J6086M5860N3518j6330
13171C94671m8687l8563n4770L9368J7665N0395k204l0781J823o2055K2416K932
13159B92210L6383M6613N5750J00877k5802J2635O8999Q7200m5810j53835o9165
13148D06055O937l4692j53191K7762Q9596L2007n8765j5956j3246M7409J07381
$$ y = [366373, 315477, 146231, 189071, 250136, 334759, 290260, 198075, 208483, 271117, 294719, 338011, 377120, 345979, 333962, 263653, 220861, 143637, 144501, 206043, 275099, 297728, 337446, 325945, 258191, 418162, 458769, 451906, 383416, 317622, 361876, 336464, 187739, 152353, 140608, 244802, 279647, 413273, 472223, 395847, 343869, 352366, 324341, 399737, 355707, 357165, 359818, 413547, 384766, 343484, 219904, 190901, 295537, 311623, 357483, 411001, 394671, 345984, 307421, 252651, 292019, 309684, 360079, 357875, 327094, 328917, 266862, 289278, 292210, 328593, 375206, 430956, 531833, 506031, 518666, 587665, 674865, 629055, 475220, 406055, 412992, 378300, 225109, 252871, 342467, 374474, 315709, 299753, 286507, 333916, 441297]
13137D41297o0693P2021m5222q1570M9309P5570q4357p2548j34l427R9052P877
13125C97175k1652N4360Q3580K1253r6060j35145K4069Q8639P0322l0156p8818
13114C77567M0207L1490K1239J26861J60511N0852n540j09363l7616n6854q4564
13103E14790L4893Q2570p7301j69184K0858P0289J14469O7936q9490q3415l3137
13092D53278K7673k6267o5432L8843M8990n9235J717Q1435M3222r0570P7758m4992
13080D86420n5846L2728O9083m5861l5614j4975r072m5347K1133J15645J7642
13069E35936n7509l8617L694M1944Q6686J31128J3594r3289j1029p1487n878L9982
13057E75155j21645m6500j05381J9184M7664Q6726N6522Q0989o2846j83234j10365
$$ y = [441297, 380604, 452625, 407403, 325833, 375142, 450712, 366355, 293807, 293673, 290246, 389298, 397175, 375523, 429883, 513463, 534716, 438656, 303511, 327580, 416219, 486541, 456385, 377567, 417774, 449264, 470503, 597364, 757875, 808727, 803187, 693824, 656208, 599354, 514790, 549683, 632253, 554952, 385768, 406626, 476915, 591384, 659320, 569830, 486415, 453278, 480951, 454684, 389252, 428095, 477085, 417850, 419567, 501002, 544224, 453654, 531412, 486420, 430574, 463302, 532385, 486524, 450910, 435935, 426863, 381516, 402649, 518294, 535936, 478427, 439810, 443504, 485448, 572134, 703262, 716856, 623567, 612538, 541051, 535173, 575155, 453510, 407010, 301629, 320813, 368477, 455203, 511725, 592714, 529868, 346634, 236269]
13046B36269k5424k9669N5420K5219K0069k3622J8632J2941J04376J03857o9329
13035D28739P533P3382j6332L5349j0938p1195p0264m821n5082p97M3611J06338
13023D65523J10304K8496K9214j5019M0425p8461N221k5026r3046n7417P7322
13012D87536R8980J3979l5059Q359k9164j5275K6253K8712k2131K2957M0497l6791
13000E88853q1646M6456N1061j2654K5352k7353j17058L3254J11811O4117l9889
12989F42304j16014r8576o4577M1081J2432Q246J19201M7873m3862n5259J41926
12978F34775J37368N1418q6016q4570J9406L9364k2718j3803J1146R2326m311
12967G74385N4q3083m6207p7112n5125R6509J19135M6124O1707Q6367N6022N1820
$$ y = [236269, 210845, 181176, 236596, 261815, 281884, 258262, 276894, 289835, 394211, 498068, 428739, 436272, 509654, 493322, 528671, 517733, 446538, 376274, 371453, 316371, 315574, 359185, 465523, 575827, 604323, 633537, 618518, 658943, 580482, 585703, 560677, 467631, 410214, 487536, 586516, 600495, 565436, 573795, 544631, 529356, 555609, 584321, 562190, 585147, 625644, 588853, 507207, 553663, 604724, 592070, 617422, 590069, 473011, 506265, 618076, 682193, 642304, 526290, 427714, 363137, 404218, 416650, 424896, 544097, 591970, 548108, 492849, 634775, 772143, 823561, 737545, 652975, 672381, 711745, 689027, 675224, 686370, 778696, 774385, 774439, 691356, 645149, 568037, 512912, 609421, 728556, 774680, 836387, 922754, 978776, 1030596]
12955A030596m3945o9227O6820m6913r6343r4351K6488L5022p9545j0956J39959
12944H57605P6477P1584n0568r848M3328j3703R1453K8368o5393j34611j464J3387
12932I06615K8076K8955J05340J9229j45978l3412K7798P322L6350J3959J8723
12921A012977L047K7410L2219j17015n5613n31m2169o3725M2615J17390J3458
12910I70063j34570k1810m6212n2998r979k0507q8281O4922Q2531q1837P7720
12899G39042N0004k191K4352K9993l3128p2146K9431N2961m1328p2450l498R2809
12887G93851J44757N6615m4165M2727o6220j7434J28923p2124j12650K5677L4837
12876I14794P3919L6144J1630M6345J8872n1102j06316p0956j157J56192M7638
$$ y = [1030596, 986651, 917424, 984244, 937331, 840988, 746637, 773125, 808147, 728602, 717646, 857605, 934082, 1005666, 955098, 945250, 988578, 974875, 1066328, 1094696, 1029303, 894692, 893228, 906615, 934691, 963646, 1068986, 1088215, 942237, 908825, 936623, 943945, 980295, 994254, 1012977, 1016024, 1043434, 1075653, 958638, 903025, 902494, 860325, 796600, 839215, 956605, 970063, 835493, 813683, 767471, 714473, 704494, 683987, 595706, 660628, 743159, 661322, 739042, 789046, 786855, 811207, 841200, 808072, 735926, 765357, 818318, 776990, 704540, 701042, 793851, 938608, 995223, 951058, 993785, 927565, 910131, 1039054, 966930, 854280, 879957, 914794, 988713, 1024857, 1036487, 1082832, 1101704, 1050602, 944286, 873330, 872173, 1028365, 1076003]
12865A076003M0648P0021l8644q2036j8547M2618L7608Q1070R938M8139J11755
12854A378573o4968N6613N6698K8567M5136n2362j7157j333r7915n3844K1115
12843A299123Q1312l5798l5690Q2137N907P5012M4924R0692J09593n6212n1641
12832A609359K7762J4598J32954N9260M290q8251m6856Q6677o9084j18020k9116
12821A583573M6947Q3422J4408k611J4207o9098o1252K4725j4954Q5583J24567
12810A829517N9228J36775P7401l5690p8521k9571L6923P4739R936o9900M4313
12799B055150L6865l7438J61260J09093M1382j1036l7839n7587l678J11505K5473
$$ y = [1076003, 1116651, 1186672, 1148028, 1065992, 1047445, 1090063, 1127671, 1208741, 1218679, 1266818, 1378573, 1313605, 1370218, 1426916, 1455483, 1500619, 1448257, 1431100, 1429767, 1331852, 1278008, 1299123, 1380435, 1344637, 1308947, 1391084, 1396991, 1472003, 1516927, 1607619, 1717212, 1661000, 1609359, 1637121, 1651719, 1784673, 1843933, 1848223, 1759972, 1713116, 1799793, 1730709, 1612689, 1583573, 1630520, 1713942, 1728350, 1725739, 1739946, 1670848, 1609596, 1634321, 1619367, 1704950, 1829517, 1888745, 2025520, 2102921, 2067231, 1988710, 1959139, 1996062, 2070801, 2080737, 2010837, 2055150, 2092015, 2054577, 2215837, 2324930, 2366312, 2355276, 2317437, 2259850, 2256172, 2367677, 2393150]
$$ [...]
##END NTUPLES=NMR SPECTRUM
##END=
