##TITLE=Analysis number 312074
Compound Code cc 40109
Book Reference 350/168
Project Code adrs
Chemist Name chrisr
##JCAMPDX= 6.0         $$ Bruker NMR JCAMP-DX V2.0
##DATA TYPE= NMR SPECTRUM
##DATA CLASS= NTUPLES
##ORIGIN= Bruker BioSpin GmbH
##OWNER= NMR
$$ XWIN-NMR		Version 3.5
$$ Mon Jul 25 08:56:07 2005 GMT Daylight Time (UT+1h)  MAYBRIDGE\NMR@NMR_250MHZ
##.OBSERVE FREQUENCY= 250.131544655141
##.OBSERVE NUCLEUS= ^1H
##.ACQUISITION MODE= SIMULTANEOUS (DQD)
##.ACQUISITION SCHEME= undefined
##.AVERAGES= 16
##.DIGITISER RES= 18
##SPECTROMETER/DATA SYSTEM= dpx250
##.PULSE SEQUENCE= zg30
##.SOLVENT NAME= CDCl3
##.SHIFT REFERENCE= (INTERNAL, CDCl3, 0, 16.522)
##AUDIT TRAIL= $$ (NUMBER, WHEN, WHO, WHERE, WHAT)
$$ ##TITLE= Audit trail, XWIN-NMR		Version 3.5
$$ ##JCAMPDX= 5.01
$$ ##ORIGIN= Bruker BioSpin GmbH
$$ ##OWNER= NMR
$$ C:\u/data/dgb/nmr/ADRS/6440/pdata/1/auditp.txt
$$ ##AUDIT TRAIL=  $$ (NUMBER, WHEN, WHO, WHERE, WHAT)
(   1,<2005-07-25 08:55:42.36 +100>,<MAYBRIDGE\NMR>,<NMR_250MHZ>,
      <created by zg, POWCHK disabled, PULCHK disabled
       configuration hash MD5:
       62 19 C7 07 E1 42 D1 B7 37 6C 3D D0 77 39 F9 E6
       data hash MD5: 64K
       FF FF EB 9A 55 CC F7 7F 83 8C A4 18 F7 26 FE 39>)
(   2,<2005-07-25 08:55:57.18 +100>,<MAYBRIDGE\NMR>,<NMR_250MHZ>,
      <Start of raw data processing
       ef LB = 0.3 FT_mod = 6 PKNL = 1 SI = 32K 
       data hash MD5: 32K
       AF 0F 0D C5 67 81 7C 04 81 BC C9 18 68 17 D3 99>)
(   3,<2005-07-25 08:55:58.91 +100>,<MAYBRIDGE\NMR>,<NMR_250MHZ>,
      <apk 
       data hash MD5: 32K
       95 5C 93 CB 74 6E 84 4B 2D C1 D8 CF D0 DA F6 75>)
(   4,<2005-07-25 08:55:59.63 +100>,<MAYBRIDGE\NMR>,<NMR_250MHZ>,
      <abs ABSG = 5 
       data hash MD5: 32K
       6B CF 25 3B 3E 19 E0 3B 30 0F 1B AE D1 47 1B B7>)
$$ ##END=
$$ 
$$ hash MD5
$$ 4D EB 3E CC 3B EE 85 68 40 03 79 7C 9E EC 00 E0
##$RELAX= 
##$RELAX= 
##$RELAX= 
##$RELAX= 
##$RELAX= 
##$RELAX= 
##$RELAX= 
$$ Bruker specific parameters
$$ --------------------------
##$DU= <C:\u>
##$EXPNO= 6440
##$NAME= <ADRS>
##$PROCNO= 1
##$TYPE= <nmr>
##$USER= <dgb>
##$AMP= (0..31)
100 100 100 100 100 100 100 100 100 100 100 100 100 100 100 100 100 100 
100 100 100 100 100 100 100 100 100 100 100 100 100 100 
##$AQSEQ= 0
##$AQ_mod= 3
##$AUNM= <au_zg>
##$AUTOPOS= <1 >
##$BF1= 250.13
##$BF2= 250.13
##$BF3= 250.13
##$BF4= 250.13
##$BF5= 500.13
##$BF6= 500.13
##$BF7= 500.13
##$BF8= 500.13
##$BYTORDA= 1
##$CFDGTYP= 0
##$CFRGTYP= 5
##$CHEMSTR= <none>
##$CNST= (0..31)
1 1 145 1 1 1 1 1 1 1 1 1 1 1 1 1 1 1 1 1 1 1 1 1 1 1 1 1 1 1 1 1 
##$CPDPRG= <>
##$CPDPRG1= <>
##$CPDPRG2= <>
##$CPDPRG3= <>
##$CPDPRG4= <mlev>
##$CPDPRG5= <mlev>
##$CPDPRG6= <mlev>
##$CPDPRG7= <mlev>
##$CPDPRG8= <mlev>
##$CPDPRGB= <>
##$CPDPRGT= <>
##$D= (0..31)
0 1 0 0 0 0 0 0 0 0.06 0 0 0 0 0 0 0.0002 0 0 0 0 0 0 0 0 0 0 0 0 0 0 
0 
##$DATE= 1122278141
##$DBL= (0..7)
120 120 120 120 120 120 120 120 
##$DBP= (0..7)
150 150 150 150 150 150 150 150 
##$DBP07= 0
##$DBPNAM0= <>
##$DBPNAM1= <>
$$ [...]
##$SUBNAM7= <"">
##$SUBNAM8= <"">
##$SUBNAM9= <"">
##$SW= 20.6930455092707
##$SWIBOX= (0..15)
0 0 3 0 0 0 0 0 0 0 0 0 0 0 0 0 
##$SW_h= 5175.983436853
##$TD= 65536
##$TD0= 1
##$TE= 296.16
##$TE2= 300
##$TE3= 300
##$TEG= 300
##$TL= (0..7)
0 120 120 120 120 120 120 120 
##$TP= (0..7)
150 150 150 150 150 150 150 150 
##$TP07= 0
##$TPNAME0= <>
##$TPNAME1= <>
##$TPNAME2= <>
##$TPNAME3= <>
##$TPNAME4= <>
##$TPNAME5= <>
##$TPNAME6= <>
##$TPNAME7= <>
##$TPOAL= (0..7)
0.5 0.5 0.5 0.5 0.5 0.5 0.5 0.5 
##$TPOFFS= (0..7)
0 0 0 0 0 0 0 0 
##$TUNHIN= 0
##$TUNHOUT= 0
##$TUNXOUT= 0
##$USERA1= <user>
##$USERA2= <user>
##$USERA3= <user>
##$USERA4= <user>
##$USERA5= <user>
##$V9= 5
##$VALIST= <valist>
##$VCLIST= <CCCCCCCCCCCCCCC>
##$VD= 0
##$VDLIST= <DDDDDDDDDDDDDDD>
##$VPLIST= <PPPPPPPPPPPPPPP>
##$VTLIST= <TTTTTTTTTTTTTTT>
##$WBST= 1024
##$WBSW= 4
##$XGAIN= (0..3)
0 0 0 0 
##$XL= 0
##$YL= 0
##$YMAX_a= 400451
##$YMIN_a= -614928
##$ZGOPTNS= <>
##$ZL1= 120
##$ZL2= 120
##$ZL3= 120
##$ZL4= 120
##$ABSF1= 16.522
##$ABSF2= -4.171173
##$ABSG= 5
##$ABSL= 3
##$ALPHA= 0
##$AQORDER= 0
##$ASSFAC= 0
##$ASSFACI= 0
##$ASSFACX= 0
##$ASSWID= 0
##$AUNMP= <proc_1d>
##$AZFE= 0.1
##$AZFW= 0.1
##$BCFW= 0
##$BC_mod= 0
##$BYTORDP= 0
##$COROFFS= 0
##$CY= 12.5
##$DATMOD= 1
##$DC= 0
##$DFILT= <>
##$DTYPP= 0
##$F1P= 14.0000005364418
##$F2P= -0.99999901652339
##$FCOR= 0.5
##$FTSIZE= 32768
##$FT_mod= 6
##$GAMMA= 0
##$GB= 0
##$INTBC= 1
##$INTSCL= 1
##$ISEN= 128
##$LB= 0.3
##$LEV0= 0
##$LPBIN= 0
##$MAXI= 10000
##$MC2= 0
##$MEAN= 0
##$ME_mod= 0
##$MI= 0
##$NCOEF= 0
##$NC_proc= -4
##$NLEV= 6
##$NOISF1= 0
##$NOISF2= 0
##$NSP= 0
##$NTH_PI= 0
##$NZP= 0
##$OFFSET= 16.522
##$PC= 1
##$PHC0= -81.62758
##$PHC1= 5.448143
##$PH_mod= 1
##$PKNL= yes
##$PPARMOD= 0
##$PSCAL= 4
##$PSIGN= 0
##$REVERSE= no
##$SF= 250.13
##$SI= 32768
##$SIGF1= 0
##$SIGF2= 0
##$SINO= 400
##$SIOLD= 32768
##$SREGLST= <1H.CDCl3>
##$SSB= 0
##$STSI= 32768
##$STSR= 0
##$SW_p= 5175.98343685301
##$SYMM= 0
##$S_DEV= 0
##$TDeff= 65536
##$TDoff= 0
##$TI= <Analysis number 999999
Compound Code 99
Book Reference 9
Project Code 9>
##$TILT= no
##$TM1= 0
##$TM2= 0
##$TOPLEV= 0
##$USERP1= <user>
##$USERP2= <user>
##$USERP3= <user>
##$USERP4= <user>
##$USERP5= <user>
##$WDW= 1
##$XDIM= 32768
##$YMAX_p= 301817814
##$YMIN_p= -108854
$$ End of Bruker specific parameters
$$ ---------------------------------
##NTUPLES= NMR SPECTRUM
##VAR_NAME=  FREQUENCY,     SPECTRUM/REAL,   SPECTRUM/IMAG
##SYMBOL=    X,             R,               I
##VAR_TYPE=  INDEPENDENT,   DEPENDENT,       DEPENDENT
##VAR_FORM=  AFFN,          ASDF,            ASDF
##VAR_DIM=   32768,         32768,           32768
##UNITS=     HZ,            ARBITRARY UNITS, ARBITRARY UNITS
##FACTOR=    0.157963299565203, 1,           1
##FIRST=     4132.6476996994, 0,             0
##LAST=      -1043.33573715361, 0,           0
##MIN=       -1043.33573715361, -108854,     0
##MAX=       4132.6476996994, 301817814,     0
$$ Real data points
##PAGE= N=1
##DATA TABLE= (X++(R..R)), XYDATA
$$ [...]
$$ plain form
17884 60809 48869 57663 59808 62384 74855 81719 88770 96250 73221 64437 70630 80771 106260
17871 106260 112769 104717 112907 125123 110953 84385 77754 103399 102220 84478 87832 87082 69630
17858 69630 68821 53093 44111 47288 37019 38850 40323 31770 73615 70977 40355 23391 35556
17845 35556 51684 42564 19965 6607 4862 13137 29302 55096 48878 41111 52971 42343 47667
17832 47667 70937 52343 54995 54807 63586 83431 83092 74051 83508 67788 69816 70942 59281 47057
17818 47057 40194 63313 39887 32321 27456 19796 19374 18167 15276 19631 22847 5931 5616 1683
17804 1683 -10769 -15774 1764 12777 2884 16905 43131 37507 51930 83117 62464 46011
17792 46011 33235 23475 10434 -4517 -13723 -3718 12418 18600 13373 16411 19857 -13322 -11167
$$ packed form
17884F0809j1940Q794K145K576J2471O864P051P480k3029q784O193J0141K5489
17871A06260O509q052Q190J2216j4170k6568o631K5645j179j7742L354p50j7452
17858F9630q09j5728q982L177j0269J831J473q553M1845k638l0622j6964J2165
17845C5556J6128r120k2599j3358j745Q275J6165K5794o218p767J1860j0628N324
17832D7667K3270j8594K652j88Q779J9845l39r041R457j5720K028J126j1661j2224
17818D7057o863K3119k3426p566m865p660m22j207k891M355L216j6916l15l933
17804A683j2452n005J7538J1013r893J4021K6226n624J4423L1187k0653j6453
17792D6011j2776r760j3041j4951r206J0005J6136O182n227L038L446l3179K155
$$ plain form
17779 -11167 7809 3108 -4528 6042 20426 12871 22080 40035 24212 4519 -13444 4859
17767 4859 6797 -10050 -19437 -11010 -21813 5733 19423 10474 -3484 -14662 -20360 6552 35137
17754 35137 24133 13547 33907 37195 51529 27881 23160 13679 14181 18491 22673 21300 40504
17741 40504 42639 62574 88654 88556 80154 90337 105384 137969 181413 217252 214201 211257 249164
17728 249164 275417 274095 308572 339363 402753 418278 443874 479935 497732 528744 552108 591230
17716 591230 640973 673366 679033 657309 619885 589150 519857 469573 433825 409483 365242 301618
17704 301618 242619 225352 217288 198498 146564 97048 66123 65216 59836 54132 36447 18361
17692 18361 22968 10542 25899 39406 48886 36224 21359 36398 28290 28199 22503 55597 64688
$$ packed form
17779a1167J8976m701p636J0570J4384p555R209J7955j5823j9693j7963J8303
17767D859J938j6847r387Q427j0803K7546J3690q949j3958j1178n698K6912K8585
17754C5137j1004j0586K0360L288J4334k3648m721r481N02M310M182j373J9204
17741D0504K135J9935K6080r8q402J0183J5047L2585M3444L5839l051k944L7907
17728B49164K6253j322L4477L0791O3390J5525K5596L6061J7797L1012K3364L9122
17716E91230M9743L2393N667k1724l7424l0735o9293n0284l5748k4342m4241o3624
17704C01618n8999j7267q064j8790n1934m9516l0925r07n380n704j7685j8086
17692A8361M607j2426J5357J3507R480j2662j4865J5039q108r1n696L3094R091
$$ plain form
17679 64688 72644 91317 79433 80247 94526 115609 148106 173282 205862 231722 283943 332370
17667 332370 371705 400886 458812 469176 461366 460316 416413 355855 312369 278627 266344 228254
17655 228254 218149 200662 164340 157666 145142 106449 70769 39258 35582 28466 40962 42951
17643 42951 43574 53098 48950 41827 39055 69328 83388 74211 74275 92727 84927 79115 98747 84171
17629 84171 86681 110635 134822 142544 167237 201181 198884 207268 244856 312865 360098 380428
17617 380428 416410 446684 455118 421672 411034 384712 353302 315147 299776 328561 331955 320162
17605 320162 304924 290929 292363 284228 301753 306664 279014 269047 259701 264049 287701 301707 303697
17592 303697 286467 275521 275003 284070 284121 270789 261208 265294 263676 251124 196880 217470 239104
$$ packed form
17679F4688P956J8673j1884Q14J4279K1083L2497K5176L2580K5860N2221M8427
17667C32370L9335K9181N7926J0364p810j050m3903o0558m3486l3742j2283l8090
17655B28254j0105j7487l6322o674j2524l8693l5680l1511l676p116J2496J989
17643D2951O23R524m148p123k772L0273J4060r177O4J8452p800n812J9632j4576
17629H4171K510K3954K4187P722K4693L3944k297Q384L7588O8009M7233K0330
17617C80428L5982L0274Q434l3446j0638k6322l1410l8155j5371K8785L394j1793
17605C20162j5238j3995J434q135J7525M911k7650r967r346M348K3652J4006J990
17592C03697j7230j0946n18R067N1j3332r581M086j618j2552n4244K0590K1634
$$ plain form
17579 239104 244844 234972 205782 200110 177629 155074 180324 206708 237231 268598 270569 269031
17567 269031 254543 271183 275761 253557 232662 249955 265231 265470 245511 235746 243886 266851
17555 266851 268509 251534 248772 264693 265982 249049 224226 187721 148878 145000 144380 141561 127826
17542 127826 118849 138983 139854 126361 104899 76465 53300 38320 45651 55583 49287 13884 18972
17529 18972 9808 -21384 -9894 286 -12925 -10960 -559 9485 -20267 -29852 13130 21422
17517 21422 14724 -2424 -28137 -32291 -8974 17464 -13019 -30840 -36448 -62547 -84006 -83996 -73289
17504 -73289 -48333 -52390 -40252 -20951 3051 -8862 -27816 -42211 -43376 -37049 -17409 -8530
17492 -8530 -22623 -19649 14977 -686 -17746 -16046 -21367 -6551 -758 -44174 -65104 -61304 -47512
$$ packed form
17579B39104N740r872k9190n672k2481k2555K5250K6384L0523L1367J971j538
17567B69031j4488J6640M578k2204k0895J7293J5276K39j9959r765Q140K2965
17555B66851J658j6975k762J5921J289j6933k4823l6505l8843l878o20k819j3735
17542A27826q977K0134Q71j3493k1462k8434k3165j4980P331R932o296l5403N088
17529A8972r164l1192J1490J0180j3211J965J0401J0044k9752r585M2982Q292
17517B1422o698j7148k5713m154K3317K6438l0483j7821n608k6099k1459J0J0707
17504g3289K4956m057J2138J9301K4002j1913j8954j4395j165O327J9640Q879
17492h530j4093K974L4626j5663j7060J700n321J4816N793m3416k0930L800J3792
$$ plain form
17479 -47512 -14588 1163 37547 19956 -9313 -4948 -9679 -12312 -21898 -11347 -12503 -6876 -2799
17466 -2799 -32753 -34696 -14708 -14786 -21881 -9819 1870 7255 -2296 2142 3525 3146 -11547 -766
17452 -766 4522 17045 12803 15291 27809 4937 -8901 9838 40852 78704 122847 217442 239321
17439 239321 170499 134219 107852 88403 63238 30047 9377 11550 20951 26945 -3282 -29000
17427 -29000 -23479 -52255 -62822 -51362 -25650 -24465 -25450 -29185 -14149 5974 1480 4600 13163
17414 13163 8993 -6282 2890 8616 -4378 -35661 -46259 -54010 -74674 -55121 -46126 -39392 -50556
17401 -50556 -41077 -39961 -17083 -7513 1025 -362 -27595 -25701 -23630 -1342 885 -23339 -40381
17388 -40381 -34135 -51203 -49214 -58091 -62622 -49237 -47994 -52062 -45606 -43973 -33708 -8588 -4751
$$ packed form
17479d7512L2924J5751L6384j7591k9269M365m731k633r586J0551j156N627M077
17466b799k9954j943J9988p8p095J2062J1689N385r551M438J383l79j4693J0781
17452g66N288J2523m242K488J2518k2872j3838J8739L1014L7852M4143R4595K1879
17439B39321o8822l6280k6367j9449k5165l3191k0670K173R401N994l0227k5718
17427b9000N521k8776j0567J1460K5712J185r85l735J5036K0123m494L120Q563
17414A3163m170j5275R172N726j2994l1283j0598p751k0664J9553Q995O734j1164
17401e0556R479J116K2878R570Q538j387k7233J894K071K2288K227k4224j7042
17388d0381O246j7068J989q877m531J3385J243m068O456J633J0265K5120L837
$$ plain form
17375 -4751 -35717 -61481 -57755 -66803 -45683 -10347 -3715 -33541 -52254 -52061 -46424 -46691 -47457 -60761
17361 -60761 -68114 -61273 -72511 -58511 -32511 -50447 -53279 -41638 -53800 -48071 -14765 3239
17349 3239 -35489 -13925 -7561 -25051 -31802 -24213 -13895 -31134 -38373 -48854 -67055 -68576 -63124
17336 -63124 -64917 -40981 -43933 -42526 -47857 -59533 -63785 -49261 -41033 -57177 -64709 -76292 -87033
17323 -87033 -72531 -86926 -87718 -68720 -48073 -28882 -30405 -26892 -40986 -35874 -46699 -30799 -5730
17310 -5730 -9850 -41479 -49464 -45382 -54762 -48493 -50968 -44789 -48192 -35819 -34105 -41726 -15811 1493
17296 1493 -20 -11975 -24430 -17155 -28721 -33649 -35498 -40927 -53253 -61234 -39464 -42529 -45640
17283 -45640 -32503 -47124 -58855 -53386 -19660 -4771 -14061 -48198 -46190 -63111 -54787 -34727
$$ packed form
17375d751l0966k5764L726r048K1120L5336O632k9826j8713J93N637k67p66j3304
17361f0761p353O841j1238J4000K6000j7936k832J1641j2162N729L3306J8004
17349C239l8728K1564O364j7490o751P589J0318j7239p239j0481j8201j521N452
17336f3124j793K3936k952J407n331j1676m252J4524Q228j6144p532j1583j0741
17323h7033J4502j4395p92J8998K0647J9191j523L513j4094N112j0825J5900K5069
17310e730m120l1629p985M082r380O269k475O179l403J2373J714p621K5915J7304
17296A493j513j1955j2455P275j1566m928j849n429j2326p981K1770l065l111
17283d5640J3137j4621j1731N469L3726J4889r290l4137K008j6921Q324K0060
$$ plain form
17271 -34727 -41258 -47385 -67228 -63476 -49729 -25092 -26534 -11036 -20211 -12518 -3648 -18778 -17547
17258 -17547 -3195 -537 -2630 -26420 -57556 -68499 -52748 -40865 -36874 -14771 -11557 -21650
17246 -21650 -5362 -6571 -15834 -1097 -6683 -27402 -30590 -13043 -30761 -54721 -70946 -66861 -68316
17233 -68316 -58388 -36542 -27062 -47563 -62927 -64518 -37697 -33759 -26311 -26986 -26386 -33456 -34473 -23673
17219 -23673 -7914 -1072 -14273 -48661 -53158 -51380 -40987 -24324 -6694 15324 -18208 -65923
17207 -65923 -81281 -64028 -41126 -50960 -38189 -25856 810 -26370 -61086 -60833 -52589 -37256
17195 -37256 -50369 -60087 -45132 -24642 -41347 -74808 -72433 -51823 -19179 -24907 -33541 -29538 -34662
17182 -34662 -51171 -41961 -19970 -25475 -49371 -68882 -51696 -44313 -42610 -47094 -79140 -86710 -48807
$$ packed form
17271c4727o531o127j9843L752J3747K4637j442J5498r175P693Q870j5130J231
17258a7547J4352K658k093k3790l1136j0943J5751J1883L991K2103L214j0093
17246b1650J6288j209r263J4737n586k0719l188J7547j7718k3960j6225M085j455
17233f8316R928K1846R480k0501j5364j591K6821L938P448o75O00p070j017J0800
17219b3673J5759O842j3201l4388m497J778J0393J6663J7630K2018l3532m7715
17207f5923j5358J7253K2902r834J2771J2333K6666k7180l4716K53Q244J5333
17195c7256j3113r718J4955K0490j6705l3461K375K0610L2644n728q634M003n124
17182c4662j6509R210K1991n505k3896j9511J7186P383J703m484l2046p570L7903
$$ plain form
17169 -48807 -26536 -33359 -24520 -14397 3989 -15755 -43332 -59597 -54675 -33850 -43597 -56711
17157 -56711 -71120 -56565 -32131 -37343 -31677 -32977 -31990 -29470 -32237 -41950 -55461 -82387 -72882
17144 -72882 -70065 -57395 -52361 -30400 -11550 357 -18704 -18791 7593 9198 4699 -23789 -47746
17131 -47746 -59778 -24831 -11152 -20944 -37993 -52641 -15335 3457 -6121 -32811 -40674 -29517
17119 -29517 -32069 -33075 -64541 -68399 -65801 -39659 -43893 -74818 -88074 -61543 -25874 -12607 -29257
17106 -29257 -31390 -26064 -46175 -55361 -53725 -25673 84 5946 -29330 -66997 -81356 -67172 -44231
17093 -44231 -47921 -49371 -13190 -21043 -47132 -56546 -65603 -76824 -28066 -52469 -85494 -52154 -9719
17080 -9719 27389 26480 -9865 -2243 14619 9507 -17494 -39172 -67623 -70337 -63375 -54038 -23821
$$ packed form
17169d8807K2271o823Q839J0123J8386j9744k7577j6265M922K0825r747j3114
17157e6711j4409J4555K4434n212N666j300R87K520k767r713j3511k6926R505
17144g2882K817J2670N034K1961J8850J1907j9061q7K6384J605m499k8488k3957
17131d7746j2032L4947J3679r792j7049j4648L7306J8792r578k6690p863J1157
17119b9517k552j006l1466l858K598K6142m234l0925j3256K6531L5669J3267j6650
17106b9257k133N326k0111r186J636K8052K5757N862l5276l7667j4359J4184K2941
17093d4231l690j450L6181p853k6089r414r057j1221M8758k4403l3025L3340M2435
17080i719L7108r09l6345P622J6862n112k7001k1678k8451k714O962R337L0217
$$ plain form
17067 -23821 -11730 -29954 -28927 -14276 -9967 -7344 -18006 -49911 -66117 -64185 -42550 -29005
17055 -29005 -21702 -20035 -26238 -22528 -22917 -20099 -13850 -10414 -15022 -21244 -22537 -24555 -42973 -69058
17041 -69058 -53695 -49068 -34229 -23224 -41174 -67517 -72218 -37046 -24808 -3111 -25463 -34654
17029 -34654 -26636 2314 6664 -8727 -11518 10061 15731 6041 -17172 -10462 -36295 -34515 -3465
17016 -3465 19315 17887 -10010 -7604 -26071 -37500 -10373 2296 -33064 -38722 -44629 -36473 -12177
17003 -12177 -12773 -15440 2026 -7074 -30706 -29412 -6400 -30099 -49231 -39350 -41027 -59750 -35127
16990 -35127 -30838 -26148 -12925 15417 1869 -6919 -14236 -33729 -42045 -49625 -32602 -30336 -29247
16977 -29247 -34098 -39051 -19078 -11843 -1988 7110 -3318 -40098 -71917 -65132 -58055 -52585 -46592
$$ packed form
17067b3821J2091j8224J027J4651M309K623j0662l1905j6206J932K1635J3545
17055b9005P303J667o203L710l89K818O249L436m608o222j293k018j8418k6085
17041f9058J5363M627J4839J1005j7950k6343m701L5172J2238K1697k2352r191
17029c4654Q018K8950M350j5391k791K1579N670r690k3213O710k5833J780L1050
17016c465K2780j428k7897K406j8467j1429K7127J2669l5360n658n907Q156K4296
17003a2177n96k667J7466r100k3632J294K3012k3699j9132R881j677j8723K4623
16990c5127M289M690J3223K8342j3548q788p317j9493q316p580J7023K266J089
16977b9247m851m953J9973P235R855R098j0428l6780l1819O785P077N470N993
$$ plain form
16964 -46592 -29229 -40110 -74429 -57604 -50514 -52965 -53200 -48412 -37479 -58545 -63860 -24012 4434
16951 4434 4336 -33941 -46102 -32249 -14213 -18106 -35576 -21856 -2761 -18059 -9483 -9284 7211
16938 7211 14138 4343 -16610 -29092 -70253 -69036 -48847 -38097 -53121 -35670 -45396 -76104 -62887
16925 -62887 -41829 -37756 -47740 -37205 -15646 -1660 1231 -33876 -37504 -45139 -41516 -35812 -21544
16912 -21544 -36115 -65302 -75671 -84652 -84799 -47345 -26699 -12138 -3033 -26808 -31655 -46403 -62501
16899 -62501 -44989 -59070 -88005 -82842 -57542 -39678 -40385 -17334 14347 -1535 -11448 -11337 -31722
16886 -31722 -41591 -26401 -27113 -60798 -77058 -43250 -35153 -36595 -36323 -35561 -41616 -7597 3133 -14781
16872 -14781 -7817 -852 -32704 -56976 -59788 -43837 -43714 -44306 -35954 -84842 -87844 -65791 -74533 -68659
$$ packed form
16964d6592J7363j0881l4319J6825P090k451k35M788J0933k1066n315L9848K8446
16951D434r8l8277j2161J3853J8036l893j7470J3720J9095j5298Q576J99J6495
16938G211O927r795k0953j2482m1161J217K0189J0750j5024J7451r726l0708J3217
16925f2887K1058M073r984J0535K1559J3986K891l5107l628p635L623N704J4268
16912b1544j4571k9187j0369q981j47L7454K0646J4561R105k3775m847j4748j6098
16899f2501J7512j4081k8935N163K5300J7864p07K3051L1681j5882r913J11k0385
16886c1722r869J5190p12l3685j6260L3808Q097j442K72P62o055L4019J0730j7914
16872a4781O964O965l1852k4272k812J5951J23n92Q352m8888l002K2053q742N874
$$ plain form
16858 -68659 -60470 -48404 -43416 -41297 -30884 -22105 -18839 -34897 -50056 -28504 -17578 -11743 -24206
16845 -24206 -48587 -53311 -60763 -68349 -64424 -55908 -45636 -45569 -40226 -37081 -7127 3405 -14270 -30003
16831 -30003 -50950 -54433 -22043 2120 12877 -6737 -1294 12458 46620 61309 49877 14997
16819 14997 -3465 -19138 -52349 -34648 -17368 -27187 -24241 -52722 -56166 -52168 -42563 -26790 -17388
16806 -17388 -9564 21537 3255 -29703 -22264 -19650 -11877 -24666 -35623 -34154 -20315 -13045 -9902
16793 -9902 -6486 -17267 -30279 -37636 -34298 -48230 -19075 -6670 -12545 -8721 -3308 -28709 -29033
16780 -29033 -32015 -22686 866 -5042 -33102 1893 12429 -7931 1957 -13109 -12962 -28726 -50328
16767 -50328 -49420 -56363 -49791 -37554 -33559 -12079 -15152 -21211 -42618 -42611 -37241 -25986 -31290 -30494 -40315
$$ packed form
16858f8659Q189J2066M988K119J0413Q779L266j6058j5159K1552J0926N835j2463
16845b4206k4381m724p452p586L925Q516J0272O7N343L145K9954J0532j7675j5733
16831c0003k0947l483L2390K4163J0757j9614N443J3752L4162J4689j1432l4880
16819A4997j8462j5673l3211J7701J7280r819K946k8481l444L998R605J5773R402
16806a7388P824L1101j8282l2958P439K614P773j2789j0957J469J3839P270L143
16793i902L416j0781j3012p357L338j3932K9155J2405n875L824N413k5401l24
16780b9033k982R329K3552n908k8060L4995J0536k0360R888j5066J47j5764k1602
16767e0328R08o943O572J2237L995K1480l073o059k1407PN370J1255n304P96r821
$$ plain form
16752 -40315 -25234 3193 27887 18443 -12287 -10547 -17001 -29936 -60469 -60653 -50704 -56574 -53324
16739 -53324 -61305 -50395 -67025 -80193 -79261 -80158 -54595 -55935 -34133 -37504 -22480 9729 -3067
16726 -3067 -32889 -26689 -23442 -21613 -29277 -25330 -12452 -787 -9935 -27626 -27617 -40125 -21407 -31513
16712 -31513 -25645 -15229 -22842 -7360 12976 20640 -365 -8909 -8271 -4510 -15304 -12979 -10141
16699 -10141 -15392 -10381 -17134 -21594 12012 29689 24067 -23341 -46373 -50238 -51409 -58424 -60315
16686 -60315 -43461 -32412 -62982 -61939 -50542 -41766 -27452 -27356 -40900 -28593 -12325 -2782 8631
16673 8631 -10553 -29517 -36824 -31659 -16093 -21413 -33558 -23734 14012 7605 5483 -2326 -342
16660 -342 -16144 -12804 -18224 -29285 -35022 -43872 -51823 -57505 -41039 -43252 -79049 -51853 -20043
$$ packed form
16752d0315J5081K8427K4694r444l0730J740o454j2935l0533j84R949n870L250
16739e3324p981J0910j6630j3168R32q97K5563j340K1802l371J5024L2209j2796
16726c067k9822O200L247J829p664L947J2878J1665r148j7691Rj2508J8718j0106
16712c1513N868J0416p613J5482K0336P664k1005q544O38L761j0794K325K838
16699a0141n251N011o753m460L3606J7677n622m7408k3032l865j171p015j891
16686f0315J6854J1049l0570J043J1397Q776J4314R6j3544J2307J6268R543J1413
16673H631j9184j8964p307N165J5566n320j2145R824L7746o407k122p809J984
16660c42j5802L340n420j1061n737q850p951n682J6466k213l5797K7196L1810
$$ plain form
16647 -20043 -2201 5433 4811 -11590 -53897 -41615 -7507 7779 -21474 -49979 -69294 -50241
16635 -50241 -39880 -40338 -20616 -15084 -18863 -30893 -32181 -8632 4291 22769 31201 7127 4364
16622 4364 19469 2221 -29374 -21666 4950 -200 -10119 -30686 -51339 -70801 -56874 -21331
16610 -21331 -18226 -27099 -36390 -42654 -45725 -66982 -53598 -44678 -68062 -69622 -66529 -49779 -50697 -48516
16596 -48516 -50617 -47234 -38265 -51303 -46544 -44781 -37555 -28801 -63038 -108854 -91803 -53736 -48250
16583 -48250 -23819 -8558 -10013 -15621 -18302 -40550 -74413 -67441 -65989 -40493 -14988 1168 -13006
16570 -13006 -22373 -27525 -38460 -33311 -25398 -20702 -12798 -18115 -28131 -40455 -34287 -49896 -42574
16557 -42574 -6045 -8742 4467 4937 6139 21332 47222 33535 -300 -19770 -8952 20253
$$ packed form
16647b0043J7842P634o22j6401m2307J2282L4108J5286k9253k8505j9315J9053
16635e0241J0361m58J9722N532l779j2030j288K3549J2923J8478Q432k4074k763
16622D364J5105j7248l1595P708K6616n150r919k0567k0653j9462J3927L5543
16610b1331L105q873r291o264l071k1257J3384Q920k3384j560L093J6750r18K181
16596d8516k101L383Q969j3038M759J763P226Q754l4237m5816J7051L8067N486
16583d8250K4431J5261j455n608k681k2248l3863O972J452K5496K5505J6156j4174
16570a3006r367n152j0935N149P913M696P904n317j0016j2324O168j5609P322
16557d2574L6529k697J3209M70J202J5193K5890j3687l3835j9470J0818K9205
$$ plain form
16545 20253 18396 -8237 -22355 -12093 -19893 -38079 -7764 -6712 9016 22797 -4114 -33658
16533 -33658 -21277 -22360 -32333 -43239 -65157 -39153 -16941 -14622 -23209 -38643 -27768 -23810 -29424
16520 -29424 -27509 -16431 -14026 -27083 -36129 -62744 -75732 -65867 -69057 -75704 -87297 -70150 -30713
16507 -30713 -2441 -6641 -22255 -4729 -12294 -13009 -10262 -30219 -45608 -47632 -50400 -59556 -48260
16494 -48260 -12742 460 -11640 -12549 5255 1292 3205 5830 2557 -6559 -15558 -20932 -18136 9499
16480 9499 -10759 -19793 -19642 -4142 -4561 -4795 -8452 -3381 11698 36769 8427 2743 -1054 -5174
16466 -5174 -6362 18560 -19135 -30134 -13600 -20097 -34572 -14356 -34737 -53464 -36190 -26345
16454 -26345 -16822 -20471 -8881 -21660 -43238 -42648 -41238 -73437 -75304 -43891 -39814 -68316 -55531
$$ packed form
16545B0253j857k6633j4118J0262p800j8186L0315J052J5728J3781k6911k9544
16533c3658J2381j083r973j0906k1918K6004K2212K319q587j5434J0875L958n614
16520b9424J915J1078K405j3057r046k6615j2988R865l190o647j1593J7147L9437
16507c0713K8272m200j5614J7526p565p15K747j9957j5389k024k768r156J1296
16494d8260L5518J3202j2100r09J7804l963J913K625l273r116q999n374K796K7635
16480I499k0258r034J51J5500m19k34l657N071J5079K5071k8342n684l797m120
16466e174j188K4922l7695j0999J6534o497j4475K0216k0381j8727J7274R845
16454b6345R523l649J1590j2779k1578N90J410l2199j867L1413M077k8502J2785
$$ plain form
16441 -55531 -52027 -55069 -50114 -24203 -39300 -54387 -47678 -52099 -62541 -58116 -40574 -25593 -24906
16428 -24906 -31287 -25917 -11499 -12092 -25241 -28549 -44225 -67914 -69374 -37277 7793 23932 6751
16415 6751 2973 -25351 -49282 -46793 -39180 -35126 -55664 -27101 -17601 -62 13238 21492 8824
16402 8824 -14868 -15072 -15157 -25511 -32306 -48359 -43971 -36757 -27195 -32284 -32743 -44376 -57050 -66078
16388 -66078 -45019 -38530 -20443 -25338 -16284 2540 -28446 -56555 -63179 -44218 -23184 -26882 -6579
16375 -6579 -13918 -17655 -24672 -28731 -27598 -13786 -10986 -10899 -27510 -31950 -39222 -41969 -33895 -21297
16361 -21297 -26710 -30588 13208 30007 13238 -4445 -3502 -4422 -30432 -47406 -29772 -3522 -8579
16348 -8579 -14710 4251 94 -7376 -25069 -35987 -14342 -11155 1174 11336 24912 48917 74349
$$ packed form
16441e5531L504l042M955K5911j5097j5087O709m421j0442M425J7542J4981O87
16428b4906o381N370J4418n93j3149l308j5676k3689j460L2097M5070J6139j7181
16415F751l778k8324k3931K489P613M054k0538K8563R500J7539J3300Q254j2668
16402H824k3692k04q5j0354o795j6053M388P214R562n089m59j1633j2674r028
16388f6078K1059O489J8087m895R054J8824l0986k8109o624J8961K1034l698K0303
16375f579p339l737p017m059J133J3812K800Q7j6611m440p272k747Q074J2598
16361b1297n413l878M3796J6799j6769j7683R43r20k6010j6974J7634K6250n057
16348h579o131J8961m157p470j7693j0918K1645L187J2329J0162J3576K4005K5432
$$ plain form
16335 74349 70433 49567 24913 9907 25806 30839 -2501 -50983 -35241 -6113 -3853 -12956
16323 -12956 -56852 -68809 -74990 -86512 -78923 -54747 -40848 -28969 -31991 -32393 -22640 -21472 1426
16310 1426 14524 15486 19596 10835 -8022 -25934 -17026 -40625 -40778 -33874 -37667 2254 321 -25585
16296 -25585 -49923 -40133 -39278 -38852 -20627 -7199 -9875 -42138 -30072 -21082 1006 -8149 -12087
16283 -12087 -7348 -14540 -26250 -32211 -36919 -46158 -40689 -43530 -27880 6339 -2597 -7631 -25805
16270 -25805 -38357 -39444 -25731 -22168 -32198 -45120 -43038 -30781 -43557 -56051 -23868 -23134 -25601
16257 -25601 -6612 -2334 -446 10137 14964 -4761 -7139 2167 -17589 -34694 -23685 -13001 -22918
16244 -22918 -35802 -26834 -17648 -30192 -31241 -13048 -1694 2593 -24454 -36665 -64981 -66796 -39443
$$ packed form
16335G4349l916k0866k4654j5006J5899N033l3340m8482J5742K9128K260r103
16323a2956m3896j1957o181j1522P589K4176J3899J1879l022m02R753J168K2898
16310A426J3098R62M110q761j8857j7912Q908k3599j53O904l793L9921j933k5906
16296b5585k4338R790Q55M26J8225J3428k676l2263J2066Q990K2088r155l938
16283a2087M739p192j1710n961m708r239N469k841J5650L4219q936n034j8174
16270b5805j2552j087J3713L563j0030j2922K082J2257j2776j2494L2183P34k467
16257b5601J8989M278J888J0583M827j9725k378R306j9756j7105J1009J0684r917
16244b2918j2884Q968R186j2544j049J8193J1354M287k7047j2211k8316j815K7353
$$ plain form
16231 -39443 -20265 -14128 -22562 -11520 8109 23759 38426 47274 62174 51064 33244 36570
16219 36570 25751 15849 17745 21340 -17674 -41683 -57884 -55557 -51232 -58988 -47013 -21746 -19951
16206 -19951 -32937 -17180 -22144 -27619 -21565 -17091 -34463 -45166 -27357 2805 696 -8940 -32879
16193 -32879 -47157 -68409 -61713 -37524 -31813 -9776 -20400 -25204 -16055 -7741 -113 -3856 -20860
16180 -20860 -14908 -18999 -30879 -9073 4897 -17417 -62614 -65780 -31312 -6264 -30276 -24602
16168 -24602 -11121 -4702 34129 61780 67389 65242 66185 33938 1006 -4961 237 18059 25030
16155 25030 20677 21030 34767 41326 16763 -5061 -25432 -5913 9678 11804 -10930 -27112 -55095
16142 -55095 -26991 -6864 7698 -17916 -22469 -17611 -19469 -14053 -41414 -42688 -24287 -7382 -3036
$$ packed form
16231c9443J9178O137q434J1042J9629J5650J4667Q848J4900j1110j7820L326
16219C6570j0819r902J896L595l9014k4009j6201K327M325p756J1975K5267J795
16206a9951j2986J5757m964n475O054M474j7372j0703J7809L0162k109r636k3939
16193c2879j4278k1252O696K4189N711K2037j0624m804R149Q314P628l743j7004
16180b0860N952m091j1880K1806J3970k2314m5197l166L4468K5048k4012N674
16168b4602J3481O419L8831K7651N609k147R43l2247l2932n967N198J7822O971
16155B5030m353L53J3737O559k4563k1824k0371J9519J5591K126k2734j6182k7983
16142e5095K8104K0127J4562k5614m553M858j858N416k7361j274J8401J6905M346
$$ plain form
16129 -3036 5448 29611 22505 -9401 -10147 -12635 -1727 38133 22923 -497 19476 26274 25133
16116 25133 12445 8958 5628 -981 -1293 11547 21480 -16723 -28374 -5915 -29296 -34258 -23867
16103 -23867 -28680 -7906 -3530 -16038 -41007 -43865 -13059 -754 -17436 -30817 -28390 7761
16091 7761 25424 9644 -666 9256 23310 19867 19819 1175 -10026 -12944 -14444 -5442 8109
16078 8109 -14962 -2044 1136 -5780 -11880 6394 3347 -24399 -26578 -19406 -19835 -31640 -49429
16065 -49429 -44555 -49790 -44321 -38767 -44563 -42566 -27648 -19345 -4998 11706 -9090 -32170 -42242
16052 -42242 -27937 -15088 -28446 -30000 -16034 -14132 -29348 -35740 -40273 -29644 -23334 369 -4950
16039 -4950 -13665 -5148 1467 -4339 -13259 -7370 10170 27513 25143 -1595 2635 -4561 10406 3526
$$ packed form
16129c036Q484K4163p106l1906p46k488J0908L9860j5210k3420J9973O798j141
16116B5133j2688l487l330o609l12J2840R933l8203j1651K2459k3381m962J0391
16103b3867m813K0774M376j2508k4969k858L0806J2305j6682j3381K427L6151
16091G761J7663j5780j0310R922J4054l443m8j8644j1201k918j500R002J3551
16078H109k3071J2918L180o916o100J8274l047k7746k179P172m29j1805j7789
16065d9429M874n235N469N554n796J997J4918Q303J4347J6704k0796k3080j0072
16052d2242J4305J2849j3358j554J3966J902j5216o392m533J0629O310K3703n319
16039d950q715Q517O615n806q920N889J7540J7343k370k6738M230p196J4967o880
$$ plain form
16025 3526 2381 -10468 -17007 -9908 -35209 -44224 -28666 -7921 -13897 -18065 -20145 -39116 -32752
16012 -32752 -57323 -64916 -45654 -26833 -36362 -30001 -41298 -35128 -15531 -12985 16798 28389 45213
15999 45213 54570 68037 70197 65323 48746 8727 -48182 -58603 -31108 -44489 -46606 -27910
15987 -27910 -46386 -38689 1150 14878 12672 21988 7742 4420 -17309 -32436 -57167 -61153 -25278
15974 -25278 18197 31454 18724 -30729 -12743 5573 14956 18605 24210 18408 10857 1428 -306
15961 -306 8942 26946 35868 39966 57209 39783 -6768 -37210 -48757 -41602 -30834 -30757 -29022 -27361
15947 -27361 -29765 -9316 2868 8672 -3740 -21547 -22821 -40874 -16461 -2929 4889 11462 32526
15934 32526 2316 -30002 -34374 -33574 -23597 -16097 198 -6596 -16883 -19939 -28011 -26647 -33776 -34045
$$ packed form
16025C526j145j2849o539P099k5301r015J5558K0745n976m168k080j8971O364
16012c2752k4571p593J9262J8821r529O361j1297O170J9597K546K9783J1591J6824
15999D5213R357J3467K160m874j6577m0019n6909j0421K7495j3381k117J8696
15987b7910j8476P697L9839J3728k206R316j4246l322k1729j5127k4731l986L5875
15974b5278M3475J3257j2730m9453J7986J8316R383L649N605n802p551r429j734
15961c06R248J8004Q922M098J7243j7426m6551l0442j1547P155J0768P7J735J661
15947b7361k404K0449J2184N804j2412j7807j274j8053K4413J3532P818O573K1064
15934C2526l0210l2318m372Q00R977P500J6295o794j0287l056q072J364p129k69
$$ plain form
15920 -34045 -50111 -21621 -9098 -35369 -63082 -50007 -42099 -52367 -56960 -59678 -63819 -57212 -44177
15907 -44177 -19487 9808 -76 -29986 -67259 -70671 -54328 -32772 -16261 -15417 3580 -15937
15895 -15937 -52581 -73352 -71240 -41087 -43796 -27397 -4767 20225 40179 30151 22679 17758
15883 17758 8009 13895 39528 42661 20426 -7815 4532 3120 1350 -14616 -15998 -23791 -27264
15870 -27264 -38627 -51539 -47402 -32707 -26621 -21321 5943 -7027 -14983 -39080 -47519 -31530 -39825
15857 -39825 -24418 -7289 -3370 -19110 -50692 -63215 -56352 -22580 14786 34555 28935 29079 -19085
15844 -19085 -60731 -77656 -75847 -60151 -70142 -68886 -35679 -40872 -26296 -17291 -43358 -63082 -64912
15831 -64912 -27812 -11406 -3158 -25079 -23689 -8774 11434 -14457 -58139 -52741 -41736 -29108
$$ packed form
15920c4045j6066K8490J2523k6271k7713J3075P908j0268m593k718m141O607J3035
15907d4177K4690K9295r884k9910l7273l412J6343K1556J6511Q44J8997j9517
15895a5937l6644k0771K112L0153k709J6399K2630K4992J9954j0028p472m921
15883A7758r749N886K5633L133k2235k8241J2347j412j770j5966j382p793l473
15870b7264j1363j2912M137J4695O086N300K7264j2970p956k4097q439J5989q295
15857c9825J5407J7129L919j5740l1582j2523O863L3772L7366J9769n620J44m8164
15844a9085m1646j6925J809J5696r991J256L3207n193J4576R005k6067j9724j830
15831f4912L7100J6406Q248k1921J390J4915K0208k5891m3682N398J1005J2628
$$ plain form
15819 -29108 -52572 -43493 -31074 -30107 -11138 -37867 -40731 -23575 -35474 -54285 -36486 -10119
15807 -10119 11048 2541 -30346 -69168 -36918 -22091 -35871 -54819 -56510 -917 26190 19373
15795 19373 19494 19866 -9132 -23964 -56766 -57132 -35946 -43506 -53963 -39495 -54000 -49537 -55587
15782 -55587 -71343 -52415 -42924 -36227 -32747 -30697 -21496 -2082 -17872 -34709 -34037 -41319 -52361
15769 -52361 -66695 -72766 -62785 -51046 -56126 -44498 -28888 -13338 -2797 9320 24289 29173
15757 29173 26676 11244 24145 15994 -14593 -14874 -34176 -29729 -16696 -15468 3127 8589 3213
15744 3213 22890 18855 -14617 -14175 -20009 -18662 -11531 -6797 25697 29289 27696 23268 4372 14486
15730 14486 56036 51855 12965 -1297 -19873 -29179 -18696 -11770 -31877 -70143 -73537 -42833
$$ packed form
15819b9108k3464R079J2419R67J8969k6729k864J7156j1899j8811J7799K6367
15807a0119K1167q507l2887l8822L2250J4827j3780j8948j691N5593K7107o817
15795A9373J21L72k8998j4832l2802l66K1186p560j0457J4468j4505M463o050
15782e5587j5756J8928R491O697L480K050R201J9414j5790j6837O72p282j1042
15769e2361j4334o071R981J1739n080J1628J5610J5550J0541J2117J4969M884
15757B9173k497j5432J2901q151l0587k81j9302M447J3033J228J8595N462n376
15744C213J9677m035l3472M42n834J347P131M734L2494L592j593m428j8896J0114
15730A4486M1550m181l8890j4262j8576r306J0483O926k0107l8266l394L0704
$$ plain form
15718 -42833 -40928 -30507 -24028 -16976 -34806 -28474 -7607 -7641 -7298 -57 12017 31571 38317 27167
15704 27167 10595 5711 -4967 -3334 -27145 -32868 -55669 -54835 -43319 -40403 -38231 -31277 -35125
15691 -35125 -36705 -29958 -26973 -41402 -37795 -16245 -7973 23261 20309 12599 -18352 -44062 -56716
15678 -56716 -49264 -15777 -19812 -38098 -41793 -13534 -9036 -30097 -10543 -1700 -43566 -52980 -55650
15665 -55650 -44915 -26192 12578 16583 8058 -3963 -1799 -248 11960 -15474 -41504 -57810
15653 -57810 -53671 -27832 -15093 7991 16383 14840 -15107 -15041 -23068 -20991 -26211 -21815 -29378 -15784
15639 -15784 -13201 -2445 -13619 -50230 -58926 -26300 -5621 -2928 -15392 -12125 7545 -16401
15627 -16401 -38687 -22669 -19717 -21917 -19053 5224 20168 38221 34438 15643 26070 42929
$$ packed form
15718d2833J905J0421O479P052j7830O332K0867l4L43P241J2074J9554O746j1150
15704B7167j6572m884j0678J633k3811n723k2801Q34J1516K916K172O954l848
15691c5125j580O747K985j4429L607K1550Q272L1234k952p710l0951k5710j2654
15678e6716P452L3487m035j8286l695K8259M498k1061J9554Q843m1866r414k670
15665e5650J0735J8723L8770M005q525j2021K164J551J2208k7434k6030j6306
15653e7810M139K5839J2739K3084Q392j543k9947O6q027K077n220M396p563J3594
15639a5784K583J0756j1174l6611q696L2626K0679K693j2464L267J9670k3946
15627a6401k2286J6018K952k200K864K4277J4944J8053l783j8795J0427J6859
$$ plain form
15615 42929 8227 -50801 -56288 -37078 -28335 -4143 -18158 -3359 24666 31883 42192 71611
15603 71611 89662 55533 28591 -14106 -42578 -37202 -40147 -38217 -26217 -13841 -6304 25066
15591 25066 42283 43122 20241 6766 24147 34306 44080 48630 32736 15893 -9554 -32799
15579 -32799 -29535 -38184 -41323 -17970 -15548 10533 3727 10614 18223 28888 27424 19171 38288
15566 38288 16574 11030 15825 -1617 8010 28322 49652 27019 9634 -427 -24425 -6506
15554 -6506 14269 9941 14354 -3173 -24285 -19346 6625 -17877 -35483 -37326 -41408 -31166 -24471
15541 -24471 -15936 -25379 -13233 -3489 21287 34813 39692 31986 19189 28751 19972 20488 5811
15528 5811 28598 5649 -9132 -13470 -48332 -60712 -46527 -29785 -16786 2244 26821 -10524
$$ packed form
15615D2929l4702n9028n487J9210Q743K4192j4015J4799K8025P217J0309K9419
15603G1611J8051l4129k6942m2697k8472N376k945J930J2000J2376P537L1370
15591B5066J7217Q39k2881j3475J7381J0159R774M550j5894j6843k5447k3245
15579c2799L264q649l139K3353K422K6081o806O887P609J0665j464q253J9117
15566C8288k1714n544M795j7442R627K0312K1330k2633j7385j0061k3998J7919
15554f506K0775m328M413j7527k1112M939K5971k4502j7606j843m082J0242O695
15541b4471Q535r443J2146R744K4776J3526M879p706j2797R562q779N16j4677
15528E811K2787k2949j4781m338l4862j2380J4185J6742J2999J9030K4577l7345
$$ plain form
15516 -10524 -55390 -55344 -31772 -20819 -38898 -48878 -29413 -39717 -55653 -66401 -48448 -56095 -67560
15503 -67560 -56083 -45412 -24629 -21113 -25173 -19412 30652 39568 34947 2132 -22588 -25055 -12958
15490 -12958 -28608 -48224 -20961 5820 15006 21623 30582 38108 22458 -5819 21995 37941
15478 37941 16553 -19442 -26293 -17518 -2550 23358 44265 19519 -2606 -24675 -14235 31563
15466 31563 40478 16409 18956 -638 -1798 27238 27283 34733 28914 835 -20254 -23038 -14067 -18025
15452 -18025 -19543 -21771 -27616 -16863 -4566 13390 29565 39722 22348 42201 44863 13189
15440 13189 26721 41434 42935 2676 -22541 -7580 8118 14003 21598 29266 32555 33645 14644
15427 14644 21014 265 -31873 -41924 -42218 -15081 -18160 -139 28037 57415 46151 35991
$$ packed form
15516a0524m4866M6K3572J0953j8079r980J9465j0304j5936j0748J7953p647j1465
15503f7560J1477J0671K0783L516m060N761N0064Q916m621l2815k4720k467J2097
15490a2958j5650j9616K7263K6781R186O617Q959P526j5650k8277K7814J5946
15478C7941k1388l5995o851Q775J4968K5908K0907k4746k2125k2069J0440M5798
15466C1563Q915k4069K547j9594j160K9036M5P450n819k8079k1089k784Q971l958
15452a8025j518k228n845J0753J2297J7956J6175J0157j7374J9853K662l1674
15440A3189J3532J4713J501m0259k5217J4961J5698N885P595P668L289J090j9001
15427A4644O370k0749l2138j0051k94K7137l079J8021K8176K9378j1264j0160
$$ plain form
15415 35991 45449 47114 41336 37259 20051 -7036 -25169 -10700 -15683 -17469 19369 40663 31718
15402 31718 2399 -16201 -2905 14296 7310 7031 9487 -10694 -28097 -24745 -1624 15019 2704
15389 2704 -17350 -29616 -31145 -32109 -31059 -22572 -13869 -4501 -787 -9141 5146 10649 15834 20604
15375 20604 8487 -39346 -36515 -14442 -7842 -6224 -32778 -57842 -54353 -35542 -40464 -36810 -47309
15362 -47309 -36800 -36145 -41976 -13254 1505 -2451 -25538 -19792 -14352 -14611 -4713 -20400 -24616 -11317
15348 -11317 -19402 -22295 -34361 -39200 -47092 -46890 -35145 -27482 -12664 23143 15102 9770 26658
15335 26658 29804 19907 -15274 -36476 -22645 -3817 -9105 -13900 -6011 -21838 -26486 -6337 452
15322 452 -27705 -43423 -23554 22391 56177 64988 65067 28861 15743 15378 24780 23341 15560 -4830
$$ packed form
15415C5991R458J665n778m077j7208k7087j8133J4469m983j786L6838K1294q945
15402C1718k9319j8600J3296J7201o986k79K456k0181j7403L352K3121J6643j2315
15389B704k0054j2266j529r64J050Q487Q703R368L714q354J4287N503N185M770
15375B0604j2117m7833K831K2073O600J618k6554k5064L489J8811m922L654j0499
15362d7309J0509O55n831K8722J4759l956k3087N746N440k59R898j5687m216J3299
15348a1317q085k893j2066m839p892K02J1745P663J4818L5807q041n332J6888
15335B6658L146r897l5181k1202J3831J8828n288m795P889j5827m648K0149O789
15322D52k8157j5718J9869M5945L3786Q811P9l6206j3118l65R402j439p781k0390
$$ plain form
15308 -4830 -27947 -47144 -20012 -436 3693 -17474 286 29928 33357 25439 26500 23958 6316
15295 6316 -4830 -3999 926 10615 20846 -23047 -47100 -35730 -21598 -33244 -40050 19838 62706
15282 62706 62443 57279 39417 30885 -516 -25293 -8090 -11016 -15533 7622 13821 17353 23773
15269 23773 36603 39669 52296 23078 -9568 -26482 -25725 -24639 -26805 -33295 -29841 -18198 2238
15256 2238 11700 23226 894 -6846 -1599 -7740 1262 12331 4932 -14881 -18133 -9174 -835 -967
15242 -967 13988 34022 54275 36220 10125 -8462 -21562 -6620 20216 51412 30204 26336
15230 26336 45388 54951 61243 39673 35925 38954 45855 34184 26950 30367 13877 9658 9952 -16288
15216 -16288 -30543 -17821 14402 25708 1491 -26333 -23425 -25087 5619 36188 32372 16804
$$ packed form
15308d830k3117j9197K7132J9576M129k1167J7760K9642L429p918J061k542j7642
15295F316j1146Q31M925R689J0231m3893k4053J1370J4132j1646o806N9888M2868
15282F2706k63n164j7862q532l1401k4777J7203k926m517K3155O199L532O420
15269B3773J2830L066J2627k9218l2646j6914P57J086k166o490L454J1643K0436
15256B238R462J1526k2332p740N247o141R002J1069p399j9813l252Q959Q339j32
15242i67J4955K0034K0253j8055k6095j8587j3100J4942K6836L1196k1208l868
15230B6336J9052R563O292k1570l748L029O901j1671p234L417j6490m219K94k6240
15216a6288j4255J2722L2223J1306k4217k7824K908j662L0706L0569l816j5568
$$ plain form
15204 16804 7666 25050 38754 31336 13547 18273 14989 16711 11617 -12955 -33009 -15490 13449
15191 13449 13453 16753 -2811 -10553 -7189 14542 31309 19556 11555 -16888 -10604 -46 17930
15178 17930 32608 12033 5819 27949 25854 28980 32379 25653 26401 8594 16773 22987 18885 10708
15164 10708 -5223 -10322 1278 12265 39133 46622 59597 65012 32930 45961 45702 47173 29788
15151 29788 8768 -7365 -4669 -20291 -15924 2251 2293 -12096 -8527 1673 -16304 1448 -6662
15138 -6662 -13054 -8737 1014 7167 18707 4202 17063 33755 23730 1197 -3598 12909 24713
15125 24713 21907 25987 21855 43729 54592 39821 26146 9679 3148 -19736 -21813 -2243 8880
15112 8880 10815 4868 2714 -5584 -29148 -29020 -28994 8208 41550 25174 2458 7559 -19862 -34272
$$ packed form
15204A6804r138J7384J3704p418j7789M726l284J722n094k4572k0054J7519K8939
15191A3449ML300j9564p742L364K1731J6767j1753q001k8443O284J0558J7976
15178A7930J4678k0575o214K2130k095L126L399o726P48j7807Q179O214m102q177
15164A0708j5931n099J1600J0987K6868P489J2975N415l2082J3031k59J471j7385
15151B9788k1020j6133K696j5622M367J8175M2j4389L569J0200j7977J7752q110
15138f662o392M317R751O153J1540j4505J2861J6692j0025k2533m795J6507J1804
15125B4713k806M080m132K1874J0863j4771j3675j6467o531k2884k077J9570J1123
15112H880J935n947k154q298k3564J28K6L7202L3342j6376k2716N101k7421j4410
$$ plain form
15098 -34272 -22040 -28280 -28094 11203 36176 27329 9533 751 -8962 -19533 -24667 -7886 -35523
15085 -35523 -41490 555 -7352 -22742 -35185 -40267 -43922 -15649 132 -15914 -14666 2511 27101
15072 27101 36508 22912 -8212 -29473 18296 18961 42603 55596 33919 5740 -18331 -13315
15060 -13315 -24081 -28847 -19143 -3428 -931 31769 57038 55692 25068 21589 10200 -17249 -30040
15047 -30040 -25893 1609 21595 -7422 -37650 -38436 -38238 -34210 -13631 -8869 -24867 -27604 -20690
15034 -20690 -31521 -8313 27902 33695 -1262 -4820 18746 17338 39613 32552 31392 22076 11588
15021 11588 26599 37666 28163 13503 -14855 -21639 -11904 971 20237 33834 24678 -450
15009 -450 -25254 -26779 -19393 -52233 -55484 -24161 -50070 -27831 -6876 -25859 -41260 -13459 19692
$$ packed form
15098c4272J2232o240J86L9297K4973q847j7796q782r713j0571n134J6781k7637
15085c5523n967M2045p907j5390j2443n082l655K8273J5781j6046J248J7177K4590
15072B7101R407j3596l1124k1261M7769O65K3642J2993k1677k8179k4071N016
15060a3315j0766m766R704J5715K497L2700K5269j346l0624l479j1389k7449j2791
15047c0040M147K7502J9986k9017l0228p86J98M028K0579M762j5998k737O914
15034b0690j0831K3208L6215N793l4957l558K3566j408K2275p061j160r316j0488
15021A1588J5011J1067r503j4660k8358o784R735J2875J9266J3597r156k5128
15009d50k4804j525P386l2840l251L1323k5909K2239K0955j8983j5401K7801L3151
$$ plain form
14996 19692 -296 -13688 -3930 18366 26123 47404 44173 22912 18059 22354 52606 42718 31854
14983 31854 36006 32604 52205 61641 44949 18216 14482 31477 38405 40869 16737 204 11041
14970 11041 35438 24366 17845 -629 -19236 -16267 -18104 -15448 -19363 -26590 -28692 -1153 24346
14957 24346 30592 35233 25968 25477 9368 16341 16930 20267 17862 14960 44037 34546 35523 60398
14943 60398 33328 3110 13820 27644 39057 46295 49322 33626 13554 -3751 7653 9358
14931 9358 19668 26799 20270 12094 -8396 10036 34358 30464 23745 25241 38532 18896 1744
14918 1744 -2672 14498 15068 528 -9265 -14014 -13562 1636 2771 -8676 -14795 -3427 11901 39234
14904 39234 56827 54492 35922 12939 1371 11052 24018 47248 28336 -4158 -4422 24008
$$ packed form
14996A9692j9988j3392R758K2296P757K1281l231k1261m853M295L0252r888j0864
14983C1854M152l402J9601R436j6692k6733l734J6995O928K464k4132j6533J0837
14970A1041K4397j1072o521j8474j8607K969j837K656l915p227k102K7539K5499
14957B4346O246M641r265m91j6109O973N89L337k405k902K9077r491R77K4875
14943F0398k7070l0218J0710J3824J1413P238L027j5696k0072j7305J1404J705
14931I358J0310P131o529q176k0490J8432K4322l894o719J496J3291j9636j7152
14918A744m416J7170N70j4540r793m749M52J5198J135j1447o119J1368J5328K7333
14904C9234J7593k335j8570k2983j1568R681J2966K3230j8912l2494k64K8430
$$ plain form
14892 24008 53718 75736 72212 59346 53805 21802 13784 10743 23457 13962 10877 29995 63787
14879 63787 61068 20300 -15667 -38310 -37543 -16414 -6095 2655 33315 55031 46101 10405 4065
14866 4065 -5521 -10083 -14369 -7453 3257 17449 1890 -7811 2636 -6591 -1032 2738 -6995 6319
14852 6319 568 10767 295 -3489 45423 66540 64220 52581 51244 51031 19443 21156 36042
14839 36042 36685 31651 13664 15590 17270 21368 26320 18384 18060 18094 51860 60072 69070 55322 40396
14824 40396 58267 62863 50953 38085 -3285 -12224 -10518 19833 24198 4341 -16630 -9651 -14704
14811 -14704 -7228 -10929 -22528 -39416 -21768 3394 5155 5026 18209 6064 25096 15328 288
14798 288 3870 20222 40696 40627 17132 17727 42353 45212 28667 33098 32944 26809 31611 49677
$$ packed form
14892B4008K9710K2018l524j2866n541l2003q018l041J2714r495l085J9118L3792
14879F3787k719m0768l5967k2643P67K1129J0319Q750L0660K1716q930l5696o340
14866D065r586m562m286O916J0710J4192j5559r701J0447r227N559L770r733J3314
14852F319n751J0199j0472l784M8912K1117k320j1639j337k13l1588J713J4886
14839C6042O43n034j7987J926J680M098M952p936l24L4L3766Q212Q998j3748j4926
14824D0396J7871M596j1910j2868m1370q939J706L0351M365j9857k0971O979n053
14811a4704P476l701j1599j6888J7648K5162J761j29J3183j2145J9032r768j5040
14798B88L582J6352K0474o9k3495N95K4626K859j6545M431j54o135M802J8066
$$ plain form
14784 49677 55389 43382 13238 22886 22139 19859 16279 25355 40683 17827 13807 17553 29534
14771 29534 31027 15197 10816 3080 6386 45623 17210 20581 24646 -12865 -8785 3178 196
14758 196 -7610 -10204 -27448 -15977 14763 43492 31935 12494 26416 603 -37796 -54546
14746 -54546 -37355 -6043 17448 44138 36061 17634 20145 6524 -9436 -27373 -848 42775
14734 42775 64859 46465 38472 51553 47597 48604 33899 1762 -6502 600 27202 47533 61283
14721 61283 71765 53050 40487 41156 38726 45895 40174 50820 65437 62636 38218 31086 27622
14708 27622 -7743 -5425 -25292 -16517 15576 23629 11162 9282 6519 5417 -4678 -16975 -20093
14695 -20093 8145 62579 104187 85728 53563 56484 83834 89228 71203 48212 71851 63073
$$ packed form
14784D9677N712j2007l0144R648p47k280l580R076J5328k2856m020L746J1981
14771B9534J493j5830m381p736L306L9237k8413L371M065l7511M080J1963k982
14758A96p806k594j7244J1471L0740K8729j1557j9441J3922k5813l8399j6750
14746e4546J7191L1312K3491K6690q077j8427K511j3621j5960j7937K6525M3623
14734D2775K2084j8394p993J3081l956J007j4705l2137q264P102K6602K0331J3750
14721F1283J0482j8715j2563O69k430P169n721J0646J4617k801k4418p132l464
14708B7622l5365K318j9867Q775L2093Q053j2467j880k763j102j0095j2297l118
14695b0093K8238N4434M1608j8459l2165K921K7350N394j8025k2991K3639q778
$$ plain form
14683 63073 47826 49563 44684 49672 52621 79659 129607 200864 199826 215186 253449 295478 326842
14670 326842 324850 295095 240756 207480 174438 144626 121310 95368 92114 105730 102364 95303
14658 95303 70290 65672 76147 67021 89358 96367 73495 46362 37891 10979 -5578 1073 -20486
14645 -20486 -31806 -19341 6543 32791 43450 47417 38020 60449 74529 73105 77167 75231 66110
14632 66110 50526 40390 60122 60453 47780 42427 15747 12320 -1962 42835 70869 85354
14620 85354 72108 74020 79638 56761 41238 35436 43378 30466 12503 41016 64131 54204 54328
14607 54328 59279 34945 18528 19392 17110 16272 29870 34102 37463 49986 73161 61821 62380 77222
14593 77222 70373 75911 98033 116985 108579 80092 93475 102630 112525 119479 115851 81787 96760
$$ packed form
14683F3073j5247J737m879M988K949K7038M9948P1257j038J5360L8263M2029L1364
14670C26842j992k9755n4339l3276l3042k9812k3316k5942l254J3616l366p061
14658I5303k5013m618J0475r126K2337P009k2872k7133q471k6912j6557O651k1559
14645b0486j1320J2465K5884K6248J0659L967r397K2429J4080j424M062j936r121
14632F6110j5584j0136J9732L31j2673n353k6680l427j4282M4797K8034J4485
14620H5354j3246J912N618k2877j5523n802P942j2912j7963K8513K3115r927J24
14607E4328M951k4334j6417Q64k282q38J3598M232L361J2523K3175j1340N59J4842
14593G7222o849N538K2122J8952q406k8487J3383R155R895O954l628l4064J4973
$$ plain form
14580 96760 139758 132629 109245 104036 95039 93936 94297 111764 136608 145261 134233 133200 165316
14567 165316 170578 183764 195369 231943 269599 289108 273351 279812 293876 269746 213913 207227
14555 207227 193011 198171 210762 178223 129806 146902 171298 166382 149559 166309 190783 208641
14543 208641 211537 196175 183600 215630 216670 232984 240945 254083 261164 267088 280235 307251
14531 307251 307168 296116 322630 344629 327076 329778 325818 363850 392109 429972 434970 435839 475283
14518 475283 517942 545847 576466 613239 680186 728405 761185 808822 866736 919120 974901
14507 974901 1064031 1143012 1206519 1282875 1395322 1504128 1628538 1801350 1956019 2079718
14497 2079718 2257075 2458298 2640728 2853234 3077951 3312290 3589756 3871330 4128803
$$ packed form
14580I6760M2998p129k3384n209q997j103L61J7467K4844Q653j1028j033L2116
14567A65316N262J3186J1605L6574L7656J9509j5757O461J4064k4130n5833o686
14555B07227j4216N160J2591l2539m8417J7096K4396m916j6823J6750K4474J7858
14543B08641K896j5362j2575L2030J040J6314P961J3138P081N924J3147K7016
14531C07251q3j1052K6514K1999j7553K702l960L8032K8259L7863M998Q69L9444
14518D75283M2659K7905L0619L6773O6947M8219L2780M7637N7914N2384N5781
14507I74901Q9130P8981O3507P6356J12447J08806J24410J72812J54669J23699
14497B079718J77357K01223J82430K12506K24717K34339K77466K81574K57473
$$ plain form
14488 4128803 4380614 4612780 4852846 5028744 5166879 5265413 5331524 5364051 5338970 5256714
14478 5256714 5157486 4983937 4773929 4580797 4367943 4136796 3906157 3666429 3464321 3283051
14468 3283051 3102717 2936467 2755386 2640897 2544609 2452791 2352552 2282167 2277673 2274054 2325855
14457 2325855 2420201 2539842 2631168 2698978 2744845 2744790 2680800 2598947 2462287 2281757 2117097
14446 2117097 1987518 1823926 1636228 1514018 1403026 1306568 1238755 1177992 1131218 1076826
14436 1076826 1055600 1046324 1012842 974738 967595 956617 906541 909983 893421 856295 810549 811510
14424 811510 826872 837397 817338 789907 770772 769245 755223 746908 741882 735833 719147 713533
14412 713533 706131 684441 652364 672589 675976 654863 632256 624778 628075 614464 572837 532454
$$ packed form
14488D128803K51811K32166K40066J75898J38135R8534O6111L2527k5081q2256
14478E256714r9228j73549k10008j93132k12854k31147k30639k39728k02108j81270
14468C283051j80334j66250j81081j14489r6288r1818j00239p0385m494l619N1801
14457B325855R4346J19641R1326O7810M5867n5o3990q1853j36660j80530j64660
14446B117097j29579j63592j87698j22210j10992r6458o7813o0763m6774n4392
14436A076826k1226r276l3482l8104p143j0978n0076L442j6562l7126m5746R61
14424H11510J5362J0525k0059k7431j9135j527j4022q315n026o049j6686n614
14412G13533p402k1690l2077K0225L387k1113k2607p478L297j3611m1627m0383
$$ plain form
14400 532454 509194 490059 470973 462746 459668 460573 475870 472343 451240 434291 417073 408565 395751
14387 395751 374043 334664 334847 369889 388303 393516 376463 357998 358783 361799 359190 344826 351865
14374 351865 330200 355877 356829 348699 348833 352313 345658 330235 299253 286407 281659 294675 303150
14361 303150 297571 282106 255968 251305 257659 264418 282241 275059 266257 264312 278037 282741 269965
14348 269965 256217 245100 221318 177102 174076 196029 200847 196467 193793 208971 234530 240702
14336 240702 221586 209773 215325 225957 231976 218230 206230 202412 219034 227916 229797 226608 211915
14323 211915 203530 221899 213625 200064 170037 160539 155624 161454 188804 199997 198931 205834 186789
14310 186789 167540 192059 206099 209358 209481 204376 191022 161246 167786 187713 218401 232864
$$ packed form
14400E32454k3260j9135j9086q227l078R05J5297l527k1103j6949j7218q508j2814
14387C95751k1708l9379J83L5042J8414N213j7053j8465P85L016k609j4364P039
14374C51865k1665K5677R52q130J34L480o655j5423l0982j2846m748J3016Q475
14361C03150n579j5465k6138m663O354O759J7823p182q802j945J3725M704j2776
14348B69965j3748j1117k3782m4216l026K1953M818m380k674J5178K5559O172
14336B40702j9116j1813N552J0632O019j3746j2000l818J6622Q882J881l189j4693
14323B11915q385J8369q274j3561l0027r498m915N830K7350J1193j066O903j9045
14310A86789j9249K4519J4040L259J23n105j3354k9776O540J9927L0688J4463
$$ plain form
14298 232864 230642 233311 241226 250884 250752 224234 221794 228952 180612 167421 168551 161037 132941
14285 132941 153498 173475 184787 211595 216952 215131 228405 230506 204945 194937 201008 236975
14273 236975 234756 214337 224836 245152 258544 263861 252575 270112 273051 284379 317075 335637
14261 335637 329466 315256 354440 379583 413394 442967 451900 433883 399486 353688 313820 282085
14249 282085 275751 265382 234147 225009 249756 263688 282384 279380 251694 223332 188294 203001
14237 203001 237143 262811 275415 287828 277936 259541 239835 229601 232422 266701 285653 244833
14225 244833 209045 197196 159992 154501 163561 183312 183516 193098 223132 245221 247595 234734 208492
14212 208492 188809 202152 235409 231195 228035 207305 171873 162642 156563 158019 159109 173436 164868
$$ packed form
14298B32864k222K669P915R658j32k6518k440P158m8340j3191J130p514k8096
14285A32941K0557J9977J1312K6808N357j821J3274K101k5561j0008O071L5967
14273B36975k219k0419J0499K0316J3392N317j1286J7537K939J1328L2696J8562
14261C35637o171j4210L9184K5143L3811K9573Q933j8017l4397m5798l9868l1735
14249B82085o334j0369l1235r138K4747J3932J8696l004k7686k8362l5038J4707
14237B03001L4142K5668J2604J2413r892j8395j9706j0234K821L4279J8952m0820
14225B44833l5788j1849l7204n491R060J9751K04R582L0034K2089K374j2861k6242
14212B08492j9683J3343L3257m214l160k0730l5432r231o079J456J090J4327q568
$$ plain form
14199 164868 169082 153622 159973 162704 168416 172516 194093 227593 262718 297912 300666 296439 297577
14186 297577 294871 278356 274935 255826 234801 212563 218397 226805 237165 257991 261866 255788 236995
14173 236995 244320 274821 288256 291127 306468 321475 306691 285939 307130 332332 366674 374868
14161 374868 365005 350478 360250 363646 339086 336919 376814 401800 366599 377752 387725 374835
14149 374835 385352 390836 381558 392043 422285 418234 408903 399780 405674 401841 409090 461981 483929
14136 483929 499728 501334 512353 533624 566876 573216 583800 600152 628699 631676 616070 614852
14124 614852 609167 615217 619095 586539 559472 547721 561622 567262 592509 611663 614697 630018
14112 630018 643656 653487 646530 651474 642305 642745 664454 667920 683489 677597 663366 692556 691549
$$ packed form
14199A64868M214j5460O351K731N712M100K1577L3500L5125L5194K754m227J138
14186B97577k706j6515l421j9109k1025k2238N834Q408J0360K0826L875o078j8793
14173B36995P325L0501J3435K871J5341J5007j4784k0752K1191K5202L4342Q194
14161C74868r863j4527R772L396k4560k167L9895K4986l5201J1153R973j2890
14149C74835J0517N484r278J0485L0242m051r331r123N894l833P249N2891K1948
14136D83929J5799J606J1019K1271L3252O340J0584J6352K8547K977j5606j218
14124F14852n685O050L878l2556k7067j1751J3901N640K5247J9154L034J5321
14112F30018J3638R831o957M944r169M40K1709L466J5569n892j4231K9190j007
$$ plain form
14099 691549 724140 721272 730939 720311 704960 717438 716165 721708 760554 770338 771247 789925 824682
14086 824682 872773 885733 889166 918173 959104 994339 1003354 1015692 1042419 1030191 1030755 1045437
14074 1045437 1067520 1102993 1114655 1140335 1193830 1229738 1267925 1300237 1319655 1359927 1407531
14063 1407531 1447243 1493897 1554081 1610737 1684870 1739832 1827901 1931732 2017145 2088154 2195137
14052 2195137 2317351 2458413 2589011 2712274 2846543 2957501 3096265 3267742 3457904
14043 3457904 3640848 3819617 4047993 4294950 4573934 4875656 5216484 5626243 6056036
14034 6056036 6517078 7042532 7692388 8405727 9173183 10063822 11075654 12208493 13548487
14025 13548487 15072896 16829588 18903014 21284718 24034389 27242023 30988436 35536556
$$ packed form
14099F91549L2591k868R667j0628j5351J2478j273N543L8846R784R09J8678L4757
14086H24682M8091J2960L433K9007M0931L5235R015J2338K6727j2228N64J4682
14074A045437K2083L5473J1662K5680N3495L5908L8187L2312J9418M0272M7604
14063A407531L9712M6654O0184N6656P4133N4962Q8069J03831Q5413P1009J06983
14052B195137J22214J41062J30598J23263J34269J10958J38764J71477J90162
14043C457904J82944J78769K28376K46957K78984L01722L40828M09759M29793
14034F056036M61042N25454O49856P13339P67456Q90639J011832J132839J339994
14025A3548487J524409J756692K073426K381704K749671L207634L746413M548120
$$ plain form
14017 35536556 41182387 48453971 58056304 70840601 87723348 109319378 135391675
14010 135391675 164532268 194572830 223136002 247653150 265464563 274443382 273608125
14003 273608125 262967148 243628564 218031439 189338190 160249108 132731886 108146710
13996 108146710 87381453 70711666 57741682 47760561 40062732 33990667 29095496
13989 29095496 25102872 21784132 18975785 16594158 14576989 12871113 11444554 10247793
13981 10247793 9235609 8363040 7652363 7026526 6480010 6003137 5573181 5188009 4841238
13972 4841238 4529985 4264842 4032013 3813755 3599724 3386475 3204989 3037917 2884353
13963 2884353 2753016 2645641 2570082 2477109 2372664 2271435 2219440 2164027 2073120 2006647
$$ packed form
14017C5536556N645831P271584R602333J2784297J6882747K1596030K6072297
14010A35391675K9140593L0040562K8563172K4517148J7811413Q978819q35257
14003B73608125j0640977j9338584k5597125k8693249k9089082k7517222k4585176
13996A08146710k0765257j6669787j2969984r981121p697829o072065m895171
13989B9095496l992624l318740k808347k381627k017169j705876j426559j196761
13981A0247793j012184q72569p10677o25837n46516m76873m29956l85172l46771
13972D841238l11253k65143k32829k18258k14031k13249j81486j67072j53564
13963B884353j31337j07375p5559r2973j04445j01229n1995n5413r0907o6473
$$ plain form
13953 2006647 1940767 1875872 1825473 1742593 1653905 1597405 1518836 1432245 1365959 1326716 1294790
13942 1294790 1272002 1223633 1194573 1148662 1105137 1048298 984959 957118 940135 889537 851668
13931 851668 813402 796405 764438 732074 742728 706385 672975 683536 668014 639260 632843 606172
13919 606172 588063 616085 602034 571515 523446 484781 470466 486262 483983 481088 449623 416330
13907 416330 370147 334639 300197 320398 357884 369772 372444 356389 374491 378212 368486 374292
13895 374292 384677 374408 362606 359003 350567 368457 364395 363835 398876 433369 492239 537522
13883 537522 540263 529391 556212 597178 624026 613686 564040 516383 531740 512391 467008 420270
13871 420270 381721 356414 342461 335168 287801 247027 218780 210003 206422 215656 208495 194831
$$ packed form
13953B006647o5880o4895n0399q2880q8688n6500p8569q6591o6286l9243l1926
13942A294790k2788m8369k9060m5911m3525n6839o3339k7841j6983n0598l7869
13931H51668l8266j6997l1967l2364J0654l6343l3410J0561j5522k8754o417k6671
13919F06172j8109K8022j4051l0519m8069l8665j4315J5796k279k895l1465l3293
13907D16330m6183l5508l4442K0201L7486J1888K672j6055J8102L721r726N806
13895C74292J0385j0269j1802l603q436J7890m062n60L5041L4493N8870M5283
13883E37522K741j0872K6821M0966K6848j0340m9646m7657J5357j9349m5383m6738
13871D20270l8549k5307j3953p293m7367m0774k8247q777l581R234p161j3664
$$ plain form
13859 194831 188924 181170 181661 186174 171076 159847 155404 155658 163381 137997 106348 107608 93558
13846 93558 94658 129135 136274 143978 153528 125512 90342 103304 149590 134589 121537 140163
13834 140163 140266 152848 165126 150681 181996 198223 195623 180192 193497 171070 114947 109836
13822 109836 137271 150195 160076 181588 194204 172343 165475 178365 182728 171227 160988 158529
13810 158529 150784 122752 152605 142098 122364 76277 65877 57531 54973 76521 85304 79816
13798 79816 99863 100342 64936 42033 48592 72331 66011 64754 51793 46499 52295 61520 65704
13785 65704 49414 54791 69416 67588 48244 1302 -4065 21723 18467 6591 9192 11617 8776
13772 8776 37917 46306 43795 44122 56936 61946 48503 33094 61855 74879 76458 61056 52068
$$ packed form
13859A94831n907p754M91M513j5098j1229m443K54P723k5384l1649J260j4050
13846I3558J100L4477P139P704R550k8016l5170J2962M6286j5001j3052J8626
13834A40163J03J2582J2278j4445L1315J6227k600j5431J3305k2427n6123n111
13822A09836K7435J2924R881K1512J2616k1861o868J2890M363j1501j0239k459
13810A58529p745k8032K9853j0507j9734m6087j0400q346k558K1548Q783n488
13798G9816K0047M79l5406k2903O559K3739o320j257j2961n294N796R225M184
13785F5704j6290N377J4625j828j9344m6942n367K5788l256j1876K601K425k841
13772H776K9141Q389k511L27J2814N010j3443j5409K8761J3024J579j5402q988
$$ plain form
13759 52068 50085 61156 92700 88879 65282 76751 82288 71888 56976 38927 47050 43830 64809
13746 64809 72177 68163 72453 93801 71749 55009 46638 36811 50659 57711 41654 24712 28158
13733 28158 9554 32190 41145 42735 33290 34635 19176 3669 22988 39909 24059 29964 23007
13720 23007 23552 32313 59456 75024 68566 77529 63338 39953 28774 24574 6812 4039 12209
13707 12209 15463 9468 15106 11068 24225 14144 22832 21975 27102 52932 41785 34812 27319 41218
13693 41218 53928 44736 25954 15358 15527 6282 7285 30539 46087 29022 23574 35519 59270
13680 59270 44467 550 -7940 -14854 -17329 -10838 7435 18626 16252 4251 -21528 -45089 -24792
13667 -24792 7155 37948 42299 54331 67889 73248 79586 72992 70621 93889 85817 86832 89630
$$ packed form
13759E2068j983J1071L1544l821k3597J1469N537j0400j4912j8049Q123l220K0979
13746F4809P368m014M290K1348k2052j6740q371r827J3848P052j6057j6942L446
13733B8158j8604K2636Q955J590r445J345j5459j5507J9319J6921j5850N905o957
13720B3007N45Q761K7143J5568o458Q963j4191k3385j1179m200j7762k773Q170
13707A2209L254n995N638m038J3157j0081Q688q57N127K5830j1147o973p493J3899
13693D1218J2710r192j8782j0596J69r245J003K3254J5548j7065n448J1945K3751
13680E9270j4803m3917q490o914k475O491J8273J1191k374j2001k5779k3561K0297
13667b4792L1947L0793M351J2032J3558N359O338o594k371K3268q072J015K798
$$ plain form
13654 89630 106914 110627 110359 80942 39476 12598 12357 -18905 -24585 -13603 7304 -5765 -6155
13641 -6155 1559 6000 -18020 1474 12275 -13584 -22898 -37181 -27229 -10243 18347 29870 561
13628 561 32138 78626 70240 59052 51320 68820 83689 73638 64347 39191 38909 16735 8661
13615 8661 -9721 -13540 29629 23163 22219 25715 37991 30587 23046 23416 59991 70001 53442 34434
13601 34434 6934 24602 34579 -1671 -8830 14028 46304 67258 66306 38547 32384 63092 61367
13588 61367 25415 -10497 -14066 14160 32061 53656 79646 59018 43391 50671 70378 67426
13576 67426 84196 102638 108431 102727 103163 97592 96949 111421 108344 143656 175533 201462 223518
13563 223518 242917 307684 358543 421510 500151 615837 760968 884104 1018567 1192650
$$ packed form
13654H9630J7284L713k68k9417m1466k6878k41l1262n680J0982K0907j3069l90
13641f155P714M441k4020J9494J0801k5859r314j4283R952J6986K8590J1523k9309
13628E61L1577M6488q386j1188p732J7500J4869j0051r291k5156k82k2174q074
13615H661j8382l819M3169o466r44L496J2276p404p541L70L6575J0010j6559j9008
13601C4434k7500J7668R977l6250p159K2858L2276K0954r52k7759o163L0708j725
13588F1367l5952l5912l569K8226J7901K1595K5990k0628j5627P280J9707k952
13576F7426J6770J8442N793n704M36n571o43J4472l077L5312L1877K5929K2056
13563B23518J9399O4767N0859O2967P8641J15686J45131J23136J34463J74083
$$ plain form
13553 1192650 1326994 1420801 1480193 1469580 1403091 1288389 1139678 1000786 859519 713449
13543 713449 597833 485317 414859 358902 289707 240938 218316 173705 137006 94442 101652
13532 101652 95892 93966 54166 44623 61021 51910 55467 68462 66453 87254 87890 78995 48543
13519 48543 27855 24495 17562 22348 11791 1377 12639 58290 73839 72062 84511 80193 64492
13506 64492 41316 25913 18479 13738 6097 -7908 -23639 -1992 18679 39826 26296 11511
13494 11511 -1502 18932 15452 -2137 27271 35957 38034 39961 23334 -9608 5189 45988
13482 45988 40756 27655 10471 19605 40631 36927 31662 37770 26240 25763 39316 29308 41515
13469 41515 76332 62807 53345 48105 24111 27013 42052 25069 6312 -1381 14146 12483 25716
$$ packed form
13553A192650J34344R3807N9392j0613o6489j14702j48711j38892j41267j46070
13543G13449j15616j12516p0458n5957o9195m8769k2622m4611l6699m2564P210
13532A01652n760j926l9800r543J6398r111L557J2995k009K0801O36q895l0452
13519D8543k0688l360o933M786j0557j0414J1262M5651J5549j777J2449m318j5701
13506F4492k3176j5403p434m741p641j4005j5731K1647K0671K1147j3530j4785
13494A1511j3013K0434l480j7589K9408Q686K077J927j6627l2942J4797M0799
13482D5988n232j3101j7184R134K1026l704n265O108j1530m77J3553j0008J2207
13469D1515L4817j3525r462n240k3994K902J5039j6983j8757p693J5527j663J3233
$$ plain form
13456 25716 30064 35284 32906 36708 32137 43309 41033 54280 32113 19807 39196 43753 53481
13443 53481 60209 28389 29038 19061 30907 35591 38238 63420 86073 85973 57789 55725 44750
13430 44750 32041 19594 -6917 -11379 3609 9750 14310 29151 40898 26575 57593 31013
13418 31013 7784 14911 20867 25620 27945 27222 43127 26134 30116 44562 56496 56167 47380 44598
13404 44598 50802 61309 71752 58008 32748 26237 12343 -5255 -6720 9045 34897 41574
13392 41574 40663 37962 48590 35484 8970 -5081 -9611 6637 57758 39558 23101 30997 22799
13379 22799 13281 14367 24943 61096 72221 27879 -5160 -17217 -9078 -4356 15065 52577
13367 52577 55111 44417 24908 -10653 14648 38051 26328 26652 27975 34149 41977 24640 11141
$$ packed form
13456B5716M348N220k378L802m571J1172k276J3247k2167j2306J9389M557R728
13443E3481O728l1820O49r977J1846M684K647K5182K2653j00k8184k064j0975
13430D4750j2709j2447k6511m462J4988O141M560J4841J1747j4323L1018k6580
13418C1013k3229P127N956M753K325p23J5905j6993L982J4446J1934l29q787k782
13404D4598O204J0507J0443j3744k5260o511j3894j7598j465J5765K5852O677
13392D1574r11k701J0628j3106k6514j4051m530J6248N1121j8200j6457P896q198
13379B2799r518J086J0576L6153J1125m4342l3039j2057Q139M722J9421L7512
13367E2577K534j0694j9509l5561K5301K3403j1723L24J323O174P828j7337j3499
$$ plain form
13354 11141 21777 25436 27012 14754 3078 22161 41440 40914 40972 58006 52366 39179 43840
13341 43840 65232 45493 29032 20032 18844 34572 27877 36391 44303 61916 59572 27732 6946
13328 6946 -988 12636 9688 21015 13879 16049 38734 17190 23857 41593 60350 62714 57243
13315 57243 63708 62779 33414 35007 44324 38479 18207 21407 35940 26009 32246 55205 62514 66774
13301 66774 50226 44770 52803 53759 39017 44532 50472 51284 67460 58165 46780 31628 35028 38377
13287 38377 31596 37087 62818 68741 61463 30771 -14293 -13925 -2112 -19526 -4729 10090 14296
13274 14296 10014 -4818 18926 17559 -13044 1382 7095 10029 2374 -8587 -3664 16169 46147
13261 46147 43559 22056 -17387 14978 10877 -8303 -7914 26661 13768 -14321 -4837 51070 68822
$$ packed form
13354A1141J0636L659J576j2258j1676J9083J9279n26N8J7034n640j3187M661
13341D3840K1392j9739j6461r000j188J5728o695Q514P912J7613k344l1840k0786
13328F946p934J3624k948J1327p136K170K2685k1544O667J7736J8757K364n471
13315E7243O465r29k9365J593R317n845k0272L200J4533r931O237K2959P309M260
13301F6774j6548n456Q033R56j4742N515N940Q12J6176r295j1385j5152L400L349
13287C8377o781N491K5731N923p278l0692m5064L68J1813j7414J4797J4819M206
13274A4296m282j4832K3744j367l0603J4426N713K934p655j0961M923J9833K9978
13261D6147k588k1503l9443L2365m101j9180L89L4575j2893k8089R484N5907J7752
$$ plain form
13248 68822 69770 83863 55304 59022 44644 49534 52070 47867 50451 48864 14754 -96 4952
13235 4952 14522 22045 43205 65428 56479 42966 16339 -9315 -10142 -2156 22194 40241 41123
13222 41123 52092 57727 48723 53235 41357 46366 61716 72263 74268 88499 72150 55999 39215
13209 39215 49582 59368 94208 101080 90579 107345 132358 141819 148423 169601 190152 213449
13197 213449 245511 333629 454919 634875 805842 895594 891288 796674 627146 479981 375551
13186 375551 292446 235457 182450 174096 171354 157843 142964 107366 87235 106432 136338 132102
13174 132102 100747 62578 25272 36456 81399 79614 46209 73189 92244 89522 110165 115159
13162 115159 146341 164793 161053 168861 175385 200353 228315 272069 355327 445149 574451 791868
$$ packed form
13248F8822R48J4093k8559L718j4378M890K536m203K584j587l4110j4850N048
13235D952R570P523K1160K2223q949j3513k6627k5654q27P986K4350J8047Q82
13222D1123J0969N635r004M512j1878N009J5350J0547K005J4231j6349j6151j6784
13209C9215J0367R786L4840O872j0501J6766K5013R461O604K1178K0551K3297
13197B13449L2062Q8118J21290J79956J70967Q9752m306r4614j69528j47165j04430
13186C75551q3105n6989n3007q354k742j3511j4879l5598k0131J9197K9906m236
13174A32102l1355l8169l7306J1184M4943j785l3405K6980J9055k722K0643M994
13162A15159L1182J8452l740P808O524K4968K7962M3754Q3258Q9822J29302K17417
$$ plain form
13150 791868 1096667 1515073 2013599 2444140 2578715 2372985 1903854 1406804 1000087 731876
13140 731876 563006 433530 380637 343874 297787 239960 180919 152580 148089 147669 140555 112647
13128 112647 113549 123592 154770 159842 134939 128871 115438 103647 95216 115636 154684 192662
13116 192662 198560 193568 187083 197657 221264 244818 274080 329823 435164 559675 738637
13105 738637 1052386 1476303 2014843 2522195 2689344 2507922 2037675 1530787 1104313 780900
13095 780900 562514 433095 362622 314028 291776 278282 237917 180648 154828 169439 152064
13084 152064 105798 100335 92105 93052 89397 79732 91243 97032 99585 111124 78061 71765 83939
13071 83939 120704 141567 137844 135140 141986 139451 143616 160384 183613 228718 299170 405552
$$ packed form
13150G91868L04799M18406M98526M30541J34575k05730m69131m97050m06717k68211
13140G31876j68870j29476n2893l6763m6087n7827n9041k8339m491m20p114k7908
13128A12647R02J0043L1178N072k4903o068j3433j1791q431K0420L9048L7978
13116A92662N898m992o485J0574K3607K3554K9262N5743J05341J24511J78962
13105G38637L13749M23917N38540N07352J67149j81422m70247n06888m26474l23413
13095G80900k18386j29419p0473m8594k2252j3494m0365n7269k5820J4611j7375
13084A52064m6266n463q230R47l655r665J1511N789K553J1539l3063o296J2174
13071H3939L6765K0863l723k704O846k535M165J6768K3229M5105P0452J06382
$$ plain form
13059 405552 565038 711949 875598 953762 891003 735191 581748 451246 338433 256109
13049 256109 212057 175335 168711 171065 130136 110594 118595 119382 132697 118957 124151 124941 124149
13036 124149 105389 122804 115516 99196 101361 115507 97721 65830 79636 103401 99843 93427
13024 93427 75907 52141 54517 77957 96957 81826 62442 71251 92049 90105 79807 96749
13012 96749 123345 95368 99896 95085 71903 84358 107739 106726 106964 104741 122049 150222 158529
12999 158529 136064 115735 93030 101061 102965 107923 105886 115020 120556 109493 89168 78294 109114
12986 109114 123560 132767 97194 85729 79884 72543 69322 92942 102951 104297 106069 122278 155387
12973 155387 138866 144407 165876 167095 149810 145573 124136 131599 165030 176337 170529 177247 184441
$$ packed form
13059D05552J59486J46911J63649P8164o2759j55812j53443j30502j12813q2324
13049B56109m4052l6722o624K354m0929j9542Q001P87J3315j3740N194P90p92
13036A24149j8760J7415p288j6320K165J4146j7786l1891J3806K3765l558o416
13024I3427j7520k3766K376K3440J9000j5131j9384Q809K0798j944j0298J6942
13012I6749K6596k7977M528m811k3182J2455K3381j013K38k223J7308K8173Q307
12999A58529k2465k0329k2705Q031J904M958k037R134N536j1063k0325j0874L0820
12986A09114J4446R207l5573j1465n845p341l221K3620J0009J346J772J6209L3109
12973A55387j6521N541K1469J219j7285m237k1437P463L3431J1307n808O718P194
$$ plain form
12960 184441 175724 156438 165073 177562 172166 144091 131724 131308 144006 157180 169451 192463
12948 192463 227863 248061 251582 239071 216374 172527 191337 230336 234821 240515 235077 245564
12936 245564 254534 267388 281885 327191 359470 429293 519722 623853 736875 847207 934558
12925 934558 995342 1000121 950898 879051 796913 736549 692728 616345 572163 547177 516236 500455
12913 500455 510960 485305 473144 497841 519153 587238 641516 662470 707625 738921 749988
12902 749988 798482 841126 885581 921769 957630 987709 1029068 1032738 1014427 999301 985483 958366
12890 958366 914840 870238 848242 805055 795642 786984 711896 646009 623080 606953 572013 545830
12878 545830 514431 527697 559582 564699 546952 583196 586722 614193 684508 750335 880839 972224
$$ packed form
12960A84441q717j9286Q635J2489n396k8075j2367m16J2698J3174J2271K3012
12948A92463L5400K0198L521j2511k2697m3847J8810L8999M485N694n438J0487
12936B45564Q970J2854J4497M5306L2279O9823R0429J04131J13022J10332Q7351
12925I34558O0784M779m9223p1847q2138o0364m3821p6383m4182k4986l0941j5781
12913E00455J0505k5655j2161K4697K1312O8085N4278K0954M5155L1296J1067
12902G49988M8494M2644M4455L6188L5861L0079M1359L670j8311j5126j3818k7117
12890I58366m3526m4602k1996m3187r413q658p5088o5887k2929j6127l4940k6183
12878E45830l1399J3266L1885N117j7747L6244L526K7471P0315O5827J30504R1385
$$ plain form
12866 972224 1006374 1000245 955431 873102 783955 696735 616350 553790 478532 401496 364891 361633
12854 361633 329897 297758 274062 266819 268095 267462 276774 249209 228448 213302 191912 163919
12842 163919 175944 204211 212990 203793 193596 178077 172122 140877 134327 145987 165986 155761
12830 155761 162533 157609 171852 183525 166417 145427 148290 141685 141364 168717 166039 153056 132928
12817 132928 125705 123533 128899 126434 117193 133575 152527 145604 145168 134194 143554 157808 136876
12804 136876 145586 128347 149462 177909 171056 175409 185570 170475 171993 181600 185766 201346 190641
12791 190641 190526 177721 141486 122738 132012 146274 136845 168427 197300 201508 168185 146945
12779 146945 158235 144040 118467 133462 174067 191030 168878 153102 174881 189472 195643 229036
$$ packed form
12866I72224L4150o129m4814q2329q9147q7220q0385o2560p5258p7036l6605l258
12854C61633l1736l2139k3696p243J276o33R312k7565k0761j5146k1390k7993
12842A63919J2025K8267Q779r197j0197j5519n955l1245o550J1660J9999j0225
12830A55761O772m924J4243J1673j7108k0990K863o605l21K7353k678j2983k0128
12817A32928p223k172N366k465r241J6382J8952o923m36j0974R360J4254k0932
12804A36876Q710j7239K1115K8447o853M353J0161j5095J518R607M166J5580j0705
12791A90641j15j2805l6235j8748R274J4262r429L1582K8873M208l3323k1240
12779A46945J1290j4195k5573J4995M0605J6963k2152j5776K1779J4591O171L3393
$$ plain form
12767 229036 210454 172358 151999 180109 218243 236979 217789 203520 196344 209019 212653 213686
12755 213686 217101 232535 260550 268594 278889 255649 259089 259025 260288 257905 238050 229162 223880
12742 223880 219007 233437 266867 254946 241755 266570 277433 247790 213259 208678 244041 276397
12730 276397 298796 319179 328164 329955 345283 354074 349886 346739 333105 312856 297374 298544 322005
12717 322005 327567 315234 300053 280870 279539 305070 340193 345904 347681 345843 338221 348352 381927
12704 381927 408492 409585 417753 435220 428922 426166 423933 441490 459350 467373 450484 427456 418826
12691 418826 410480 394335 378000 352327 328256 338373 352358 344378 357942 362552 364141 376180
12679 376180 373140 378524 369497 383176 395298 402449 410142 399847 395535 394993 406159 404727 384400
$$ packed form
12767B29036j8582l8096k0359K8110L8134J8736j9190j4269p176J2675L634J033
12755B13686L415J5434K8015Q044J0295k3240L440o4J263k383j9855q888n282
12742B23880m873J4430L3430j1921j3191K4815J0863k9643l4531m581L5363L2356
12730B76397K2399K0383Q985J791J5328Q791m188l147j3634k0249j5482J170K3461
12717C22005N562j2333j5181j9183j331K5531L5123N711J777j838p622J0131L3575
12704C81927K6565J093Q168J7467o298k756k233J7557J7860Q023j6889k3028q630
12691D18826q346j6145j6335k5673k4071J0117J3985p980J3564M610J589J2039
12679C76180l040N384r027J3679J2122P151P693j0295m312n42J1166j432k0327
$$ plain form
12666 384400 370637 383696 397684 414661 385979 389895 400533 376921 361638 331816 317550 324140
12654 324140 327090 330772 344692 338329 344732 349188 362616 383328 391107 391040 397915 404770 408465 395869
12640 395869 383445 377929 399108 389911 400791 438177 447415 455487 484864 490432 470962 494384
12628 494384 497034 495636 486238 494744 497963 479101 461479 489827 517237 533945 560394 568091 580950
12615 580950 567952 562406 562705 578898 570786 579703 583903 594458 615999 632362 647851 652217 684998
12602 684998 736434 785698 819688 855874 887917 881602 900804 908448 925865 924357 955417 963877
12590 963877 944965 964528 984857 999459 1032997 1022902 999249 1000229 1024679 1014393 999784 998502
12578 998502 1007212 1016844 1017015 1032565 1071128 1087804 1097421 1119392 1150625 1167607 1170346 1169869 1182732
$$ packed form
12666C84400j3763J3059J3988J6977k8682L916J0638k3612j5283k9822j4266O590
12654C24140K950L682J3920o363O403M456J3428K0712P779o7O875O855L695j2596
12640C95869j2424n516K1179r197J0880L7386R238Q072K9377N568j9470K3422
12628D94384K650j398r398Q506L219j8862j7622K8348K7410J6708K6449P697J2859
12615E80950j2998n546K99J6193q112Q917M200J0555K1541J6363J5489M366L2781
12602F84998N1436M9264L3990L6186L2043o315J9202P644J7417j508L1060Q460
12590I63877j8912J9563K0329J4602L3538j0095k3653R80K4450j0286j4609j282
12578I98502Q710R632J71J5550L8563J6676R617K1971L1233J6982K739m77J2863
$$ plain form
12565 1182732 1200361 1198679 1221054 1213251 1200837 1213197 1238742 1294048 1337883 1364822 1437871 1511582
12553 1511582 1577091 1639968 1772877 1910646 2081286 2241402 2393272 2564639 2722527 2865504
12543 2865504 2977298 3014100 2969702 2903659 2812808 2690876 2502947 2342728 2253137 2167074
12533 2167074 2123397 2108369 2088882 2086371 2119309 2160501 2211857 2287732 2376987 2470566 2567662
12522 2567662 2654888 2719009 2790841 2827203 2874910 2937155 3017467 3089315 3190797 3315409 3445206
12511 3445206 3606936 3771164 3946253 4136589 4370864 4626258 4898710 5220937 5583014
12502 5583014 5983088 6401546 6924243 7512029 8166853 8881385 9717399 10660125 11675161
12493 11675161 12784772 14057197 15542858 17277770 19317627 21816567 24916654 28818202
$$ packed form
12565A182732J7629j682K2375p803j2414J2360K5545N5306M3835K6939P3049P3711
12553A511582O5509O2877J32909J37769J70640J60116J51870J71367J57888J42977
12543B865504J11794L6802m4398o6043r0851j21932j87929j60219q9591q6063
12533B167074m3677j5028j9487k511L2938M1192N1356P5875Q9255R3579R7096
12522B567662Q7226O4121P1832L6362M7707O2245Q0312P1848J01482J24612J29797
12511C445206J61730J64228J75089J90336K34275K55394K72452L22227L62077
12502E583014M00074M18458N22697N87786O54824P14532Q36014R42726J015036
12493A1675161J109611J272425J485661J734912K039857K498940L100087L901548
$$ plain form
12485 28818202 33889422 40510103 49121595 60313913 74617940 92183591 112390676
12478 112390676 133211614 151050706 161699961 162559083 154232496 139916539 123397221
12471 123397221 107645565 94282600 83816725 76190551 71083016 68138938 67068926
12464 67068926 67731578 69965330 73546294 78341110 84142482 90718352 97909429 105559405
12456 105559405 113518556 121767779 130237745 138859804 147447277 155709896 163255345 169675148
12448 169675148 174513527 177431718 178240785 176912496 173598284 168638922 162459587 155492630
12440 155492630 148065648 140475392 132952202 125544866 118272827 111173112 104252301 97600147
12432 97600147 91331473 85632562 80701235 76732796 73918267 72485571 72654823 74697981
$$ packed form
12485B8818202N071220O620681Q611492J1192318J4304027J7565651K0207085
12478A12390676K0820938J7839092J0649255Q59122q326587j4315957j6519318
12471A23397221j5751656j3362965j0465875p626174n107535k944078j070012
12464F7068926O62652K233752L580964M794816N801372O575870P191077P649976
12456A05559405P959151Q249223Q469966Q622059Q587473Q262619P545449O419803
12448A69675148M838379K918191Q09067j328289l314212m959362o179335o966957
12440A55492630p426982p590256p523190p407336p272039p099715o920811o652154
12432I7600147o268674n698911m931327l968439k814529j432696J69252K043158
$$ plain form
12424 74697981 78931143 85842225 95799571 109018115 125065626 142455197 158371863
12417 158371863 169164826 171462762 164134939 149065754 129860224 110089691 92018297
12410 92018297 76626109 63964765 53784619 45697037 39261319 34127290 30020029 26701449
12402 26701449 23999770 21763209 19857107 18216876 16757916 15472289 14336804 13277172
12394 13277172 12307130 11425079 10624440 9843292 9150171 8515645 7905415 7377260 6932117
12385 6932117 6504982 6104149 5730659 5393855 5088723 4828843 4599915 4373104 4125741
12376 4125741 3889092 3664613 3481445 3300157 3124610 2971687 2842360 2738009 2633279
12367 2633279 2526049 2422732 2349173 2295064 2253633 2194887 2147947 2104024 2064486 2024320 1969196
$$ packed form
12424G4697981M233162O911082R957346J3218544J6047511J7389571J5916666
12417A58371863J0792963K297936p327823j5069185j9205530j9770533j8071394
12410I2018297j5392188j2661344j0180146q087582o435718n134029m107261l318580
12402B6701449k701679k236561j906102j640231j458960j285627j135485j059632
12394A3277172r70042q82051q00639p81148o93121o34526o10230n28155m45143
12385F932117m27135m00833l73490l36804l05132k59880k28928k26811k47363
12376D125741k36649k24479j83168j81288j75547j52923j29327j04351j04730
12367B633279j07230j03317p3559n4109m1431n8746m6940m3923l9538m0166n5124
$$ plain form
12356 1969196 1884473 1790043 1753039 1706498 1667577 1632196 1602764 1568389 1569185 1527767 1466272 1400977
12344 1400977 1356442 1326819 1296636 1243833 1204268 1178444 1162544 1144626 1092411 1074136 1098892
12333 1098892 1097837 1063890 1074778 1078730 1087516 1070851 1029645 1013950 1002115 984937 956838 942489
12321 942489 930788 926709 927220 929841 934003 906119 885182 878103 887661 904706 925747 939082 919876
12308 919876 936963 936952 949559 971371 979323 976378 962097 934060 913847 910580 894484 865713 860495
12295 860495 849227 845372 855639 851662 861190 887245 887343 876086 848325 799124 776748 778289 771335
12282 771335 765260 729313 703699 666828 663623 643076 617753 619599 598146 560323 550869 577445
12270 577445 567685 590057 606144 591013 563315 547437 548068 539606 552643 577457 582373 608014
$$ packed form
12356A969196q4723r4430l7004m6541l8921l5381k9432l4375P96m1418o1495o5295
12344A400977m4535k9623l0183n2803l9565k5824j5900j7918n2215j8275K4756
12333A098892j055l3947J0888L952Q786j6665m1206j5695j1835j7178k8099j4349
12321I42489j1701m079N11K621M162k7884k0937p079R558J7045K1041J3335j9206
12308I19876J7087j1J2607K1812P952k945j4281k8037k0213l267j6096k8771n218
12295H60495j1268l855J0267l977R528K6055R8j1257k7761m9201k2376J541o954
12282G71335o075l5947k5614l6871l205k0547k5323J846k1453l7823r454K6576
12270E77445r760K2372J6087j5131k7698j5878O31q462J3037K4814M916K5641
$$ plain form
12258 608014 631216 641508 663590 722132 755710 767139 747843 747013 756444 765091 768617 747254
12246 747254 697958 696357 678213 679592 682078 677540 694806 713075 707090 675082 667796 708404 728609
12233 728609 715936 709210 692577 662438 691168 720479 731977 738286 739408 768862 782853 808685
12221 808685 772707 728141 716373 739605 719617 692637 691921 693803 681638 676311 682891 677529 703781
12208 703781 729743 736525 746473 765434 770952 784471 793354 803936 827712 852353 867578 852673
12196 852673 855692 858865 876026 925486 951552 975665 995422 1021068 1059907 1102855 1139469 1162888
12184 1162888 1176701 1194860 1246680 1271807 1303283 1363924 1425821 1519132 1646334 1743230 1840208
12173 1840208 1953382 2043780 2141181 2265274 2403004 2560987 2673016 2797957 2915761 3059328
$$ packed form
12258F08014K3202J0292K2082N8542L3578J1429j9296q30R431Q647L526k1363
12246G47254m9296j601j8144J379K486m538J7266J8269n985l2008p286M0608K0205
12233G28609j2673o726j6633l0139K8730K9311J1498O309J122K9454J3991K5832
12221H08685l5978m4566j1768K3232j9988k6980p16J882j2165n327O580n362K6252
12208G03781K5962O782R948J8961N518J3519Q883J0582K3776K4641J5225j4905
12196H52673L019L173J7161M9460K6066K4113J9757K5646L8839M2948L6614K3419
12184A162888J3813J8159N1820K5127L1476O0641O1897R3311J27202R6896R6978
12173A840208J13174R0398R7401J24093J37730J57983J12029J24941J17804J43567
$$ plain form
12163 3059328 3256143 3462122 3656636 3904936 4254031 4597221 4951659 5357688 5832450
12154 5832450 6386310 7000027 7738501 8608167 9611861 10816089 12280165 13995454 15973186
12145 15973186 18198508 20657087 23313548 26137753 29184414 32595023 36605085 41649154
12137 41649154 48484468 58135645 71882963 91030602 116432619 147734387 183016120
12130 183016120 219177269 252715304 279792992 296843278 301817814 294158922 274617442
12123 274617442 245936928 212471173 178302656 146265677 118203918 95169258 77373738
12116 77373738 64151455 54468464 47379110 42052349 37874512 34430284 31435982 28711616
12108 28711616 26199018 23928113 21897678 20083490 18508621 17139767 15949904 14894684
$$ packed form
12163C059328J96815K05979J94514K48300L49095L43190L54438M06029M74762
12154E832450N53860O13717P38474Q69666J003694J204228J464076J715289J977732
12145A5973186K225322K458579K656461K824205L046661L410609M010062N044069
12137D1649154O835314R651177J3747318J9147639K5402017L1301768L5281733
12130A83016120L6161149L3538035K7077688J7050286M974536p658892j9541480
12123B74617442k8680514l3465755l4168517l2036979k8061759k3034660j7795520
12116G7373738j3222283r682991p089354n326761m177837l444228k994302k724366
12108B8711616k512598k270905k030435j814188j574869j368854j189863j055220
$$ plain form
12100 14894684 13906377 12977275 12122935 11328081 10535028 9775200 9074942 8374013 7712813
12091 7712813 7090014 6508440 5988288 5507538 5070803 4690866 4355541 4036698 3751404
12082 3751404 3535413 3298427 3081370 2918667 2750075 2583940 2470931 2387937 2318287 2220602
12072 2220602 2110051 2032706 1960590 1876325 1763648 1667602 1590072 1500639 1433066 1398651 1353685
12061 1353685 1282892 1196901 1119321 1075053 1033870 979852 936832 924195 902082 852766 804016
12050 804016 757189 741607 729688 722384 694126 688428 668688 654768 657279 669117 648994 639482
12038 639482 609228 598125 600944 607687 578238 547189 525665 536913 532519 560667 590950 647189
12026 647189 681688 709497 785091 861199 942355 1005638 1068881 1068536 1052774 1024183 947257 878204
$$ packed form
12100A4894684r88307r29102q54340p94854p93053p59828p00258p00929o61200
12091G712813o22799n81574n20152m80750m36735l79937l35325l18843k85294
12082C751404k15991k36986k17057j62703j68592j66135j13009q2994o9650r7685
12072B220602j10551p7345p2116q4265j12677r6046p7530q9433o7573l4415m4966
12061A353685p0793q5991p7580m4268m1183n4018m3020j2637k2113m9316m8750
12050H04016m6827j5582j1919p304k8258n698j9740j3920K511J1838k0123r512
12038F39482l0254j1103K819O743k9449l1049k1524J1248m394K8148L0283N6239
12026F47189L4499K7809P5594P6108Q1156O3283O3243l45j5762k8591p6926o9053
$$ plain form
12014 878204 820687 769060 739908 760099 772176 757636 758882 781267 815898 882160 986958
12003 986958 1079793 1152617 1180629 1226045 1262302 1272405 1287034 1306053 1291699 1270478 1267181 1252554
11991 1252554 1237982 1199341 1164754 1146702 1133045 1108765 1038055 991185 927558 858731 807539
11980 807539 760232 723986 698616 685763 650335 598627 562040 523871 481649 496680 500348 487957
11968 487957 521587 552298 615070 688629 746058 821404 899317 944539 995307 964379 872169
11957 872169 770725 672498 585642 517304 465387 421566 385884 367185 350929 326762 289770
11946 289770 232914 208054 196802 195246 201762 196146 220043 225810 209505 228024 241205 221116
11934 221116 185363 202868 191726 209599 237782 205392 184965 162077 133778 127114 111743 88091
$$ packed form
12014H78204n7517n1627k9152K0191J2077j4540J246K2385L4631O6262J04798
12003I86958R2835P2824K8012M5416L6257J0103J4629J9019j4354k1221l297j4627
11991A252554j4572l8641l4587j8052j3657k4280p0710m6870o3627o8827n1192
11980H07539m7307l6246k5370j2853l5428n1708l6587l8169m2222J5031L668j2391
11968D87957L3630L0711O2772P3559N7429P5346P7913M5222N0768l0928r2210
11957H72169j01444r8227q6856o8338n1917m3821l5682j8699j6256k4167l6992
11946B89770n6856k4860j1252j556O516n616K3897N767j6305J8519J3181k0089
11934B21116l5753J7505j1142J7873K8183l2390k0427k2888k8299o664j5371k3652
$$ plain form
11922 88091 54163 40180 50380 56372 60942 55780 28982 24638 46983 77230 73910 39469 24959
11909 24959 28683 40014 20905 9485 9248 31956 49026 28415 9836 7092 24478 27657 14146
11896 14146 -1589 119 7496 49025 65294 41795 59194 69271 33654 26291 41463 58736
11884 58736 56410 38962 29235 26623 18440 31292 68225 72660 60719 63398 82199 76872 57043
11871 57043 36123 61807 94744 81869 81757 80194 54101 33575 44969 41657 48074 56705 68252
11858 68252 67652 60538 65627 59387 47624 35860 30011 -11513 -14576 4149 29917 19391 16535
11845 16535 41571 40524 8203 -14721 -5466 34013 53130 33389 27155 24042 17871 9487 24637
11832 24637 43154 52171 48021 34407 -1471 -18639 -25588 -7602 339 -19712 6356 17632
$$ packed form
11922H8091l3928j3983J0200N992M570n162k6798m344K2345L0247l320l4441j4510
11909B4959L724J1331j9109j1420k37K2708J7070k0611j8579k744J7386L179j3511
11896A4146j5735J708P377M1529J6269k3499J7399J0077l5617p363J5172J7273
11884E8736k326j7448r727k612q183J2852L6933M435j1941K679J8801n327j9829
11871E7043k0920K5684L2937j2875j12j563k6093k0526J1394l312O417Q631J1547
11858F8252o00p114N089o240j1763j1764n849m1524l063J8725K5768j0526k856
11845A6535K5036j047l2321k2924R255L9479J9117j9741o234l113o171q384J5150
11832B4637J8517R017m150j3614l5878j7168o949J7986P941k0051K6068J1276
$$ plain form
11820 17632 -6320 5605 29070 23988 9427 744 -9191 -43057 -28883 -861 4937 30743
11808 30743 68921 85148 81208 62218 33204 23722 19685 40469 36845 19740 -13003 -5850 -10308
11795 -10308 -44700 -55398 -52114 -5840 23397 40914 31995 10767 -15314 -2781 18715 9799
11783 9799 5489 979 9364 13873 28351 47167 38442 11146 4676 30804 15287 -11343 -21859
11770 -21859 -13859 -9655 1621 21927 17715 9544 13987 16634 27516 17785 334 4064 24061
11757 24061 24934 20714 6042 34205 36830 29418 37150 25190 16260 16150 27661 29418 11569 28254
11743 28254 32574 42186 54257 62107 60906 40433 27102 50219 55861 59844 67020 56893 55213
11730 55213 46621 44754 20413 16310 35140 58438 88465 92719 108075 98835 125153 186942 230506
$$ packed form
11820A7632k3952J1925K3465n082j4561q683r935l3866J4174K8022N798K5806
11808C0743L8178J6227l940j8990k9014r482m037K0784l624j7105l2743P153m458
11795a0308l4392j0698L284M6274K9237J7517q919k1228k6081J2533K1496q916
11783I799m310m510Q385M509J4478J8816q725k7296o470K6128j5517k6630j0516
11770b1859Q000M204J1276K0306m212q171M443K647J0882r731j7451L730J9997
11757B4061Q73m220j4672K8163K625p412P732j1960q930j10J1511J757j7849J6685
11743B8254M320R612J2071P850j201k0473j3331K3117N642L983P176j0127j680
11730E5213q592j867k4341m103J8830K3298L0027M254J5356r240K6318O1789M3564
$$ plain form
11717 230506 258714 254409 266109 333650 408387 472071 542810 675516 842287 1008851 1166510
11706 1166510 1331392 1482927 1544985 1527576 1481775 1395639 1252747 1079999 901454 754095
11696 754095 616084 522806 457124 384518 334898 292038 255119 230134 223227 208091 184737
11685 184737 164434 151716 108568 103446 114888 95034 75996 63617 58067 66764 51351 58412
11673 58412 32229 30685 58601 34302 17758 21080 25372 25411 9733 20776 26386 11779 -3077
11660 -3077 -7908 -28525 -32990 -60683 -58962 -51033 -36799 -28123 -31230 -282 866 -4611 8393
11647 8393 1453 -29295 -21415 -3605 -7653 -4511 -7830 -10088 -3108 -1348 -7289 10346 -4108 536
11633 536 -3292 -15295 -15026 -6584 12090 10919 -1128 3205 2523 -8060 12797 8191 -9845 -23195
$$ packed form
11717B30506K8208m305J1700O7541P4737O3684P0739J32706J66771J66564J57659
11706A166510J64882J51535O2058j7409m5801q6136j42892j72748j78545j47359
11696G54095j38011r3278o5682p2606m9620m2860l6919k4985o907j5136k3354
11685A84737k0303j2718m3148n122J1442j9854j9038j2379n550Q697j5413P061
11673E8412k6183j544K7916k4299j6544L322M292L9j5678J1043N610j4607j4856
11660c077m831k0617m465k7693J721P929J4234Q676l107L0948J148n477J3004
11647H393o940l0748P880J7810m048L142l319k258O980J760n941J7635j4454M644
11633E36l828j2003K69Q442J8674j171j2047M333o82j0583K0857m606j8036j3350
$$ plain form
11619 -23195 -15156 -16662 -25799 -31029 -40618 -34895 406 47842 67677 65501 34913 17117 36531
11606 36531 10451 9637 19162 32378 60446 63080 36523 14280 4059 7119 16387 24749 3458
11593 3458 -26320 -31972 -15592 -18122 -10514 2473 243 13119 48233 74710 71750 40034 52376
11580 52376 40933 34181 41577 32909 25254 -277 -17740 -33416 -42896 -41484 -24554 -16256 9406
11567 9406 41555 34341 36581 46832 42442 30912 43862 65660 59734 51216 43727 25734 17339
11554 17339 32514 33912 31277 45058 42016 21142 15039 44321 43386 62925 46063 45341 51410
11541 51410 46471 58115 76184 50446 31232 40228 61100 57900 53360 71418 65454 54048 38702
11528 38702 27068 20854 11762 -5121 -556 7571 13908 29906 27218 15963 37757 22799 -4541
$$ packed form
11619b3195Q039j506r137n230r589N723L5301M7436J9835k176l0588j7796J9414
11606C6531k6080q14R525J3216K8068K634k6557k2243j0221L060R268Q362k1291
11593C458k9778n652J6380k530P608J2987k230J2876L5114K6477k960l1716J2342
11580E2376j1443o752P396q668p655k5531j7463j5676r480J412J6930Q298K5662
11567I406L2149p214K240J0251m390j1530J2950K1798n926q518p489j7993q395
11554A7339J5175J398k635J3781l042k0874o103K9282r35J9539j6862p22O069
11541E1410m939J1644J8069k5738j9214Q996K0872l200m540J8058n964j1406j5346
11528C8702j1634o214r092j6883M565Q127O337J5998k688j1255K1794j4958k7340
$$ plain form
11515 -4541 10404 32466 22000 4865 11947 22891 36009 14109 23736 28203 6128 26348
11503 26348 40254 26727 24457 14491 11210 8724 -4646 -5081 9863 13237 4030 -3559 13451
11490 13451 23831 23629 15022 17838 13916 3756 6233 12294 14323 41388 72141 61917 32013
11477 32013 26977 32251 37405 30342 24602 25579 27742 31097 20791 33700 59825 67239 75255 88407
11463 88407 111042 105751 96473 81584 94516 85653 82011 82947 68489 45994 41161 34854 32467
11450 32467 38080 43449 53497 61384 76565 97417 88929 45423 35171 42063 59501 75981 87327
11437 87327 76295 46089 40612 60117 78503 89714 104026 97513 86541 86921 82235 66421 34554
11424 34554 47458 61580 52821 27670 24238 31035 6145 1537 12640 23623 53758 68708
$$ packed form
11515d541J4945K2062j0466j7135P082J0944J3118k1900R627M467k2075K0220
11503B6348J3906j3527k270r966l281k486j3370m35J4944L374r207p589J7010
11490A3451J0380k02q607K816l922j0160K477O061K029K7065L0753j0224k9904
11477C2013n036N274N154p063n740R77K163L355j0306J2909K6125P414Q016J3152
11463H8407K2635n291r278j4889J2932q863l642R36j4458k2495m833o307k387
11450C2467N613N369J0048P887J5181K0852q488m3506j0252O892J7438J6480J1346
11437H7327j1032l0206n477J9505J8386J1211J4312o513j0972L80m686j5814l1867
11424C4554J2904J4122q759k5151l432O797k4890m608J1103J0983L0135J4950
$$ plain form
11412 68708 71163 55030 54802 38351 18151 7305 33134 43095 34243 34487 19071 35026 23493
11399 23493 27304 11265 447 3428 -3228 -10045 2160 -21312 -40781 -12344 18834 18411 28388
11386 28388 28214 19338 5638 5277 2767 -15050 -16006 19347 23276 15964 38028 38016 11541 9292
11372 9292 20966 35829 49254 23155 7107 5146 -3630 -14061 -3501 -17024 -18240 15874
11360 15874 6517 -23090 -29101 -12991 -18139 3751 39686 39041 8324 668 16964 46443 49325
11347 49325 50898 52709 36344 38203 23289 10331 -17351 -40988 -29181 14782 39029 50969
11335 50969 37746 21219 20965 -10828 12047 49561 49769 48514 41211 56416 86499 64250 37083
11322 37083 44514 60529 67794 37057 39083 40586 36382 22605 29070 45173 29321 2322 -4052
$$ packed form
11412F8708K455j6133k28j6451k0200j0846K5829R961q852K44j5416J5955j1533
11399B3493L811j6039j0818K981o656o817J2205k3472j9469K8437L1178m23R977
11386B8388j74q876j3700l61k510j7817r56L5353L929p312K2064j2k6475k249
11372I292J1674J4863J3425k6099j6048j961q776j0431J0560j3523j216L4114
11360A5874r357k9607o011J6110n148K1890L5935o45l0717p656J6296K9479K882
11347D9325J573J811j6365J859j4914j2958k7682k3637J1807M3963K4247J1940
11335E0969j3223j6527k54l1793K2875L7514K08j255p303J5205L0083k2249k7167
11322C7083P431J6015P265l0737K026J503m204j3777O465J6103j5852k6999o374
$$ plain form
11309 -4052 -13665 -6128 37603 44896 27732 35150 60082 73901 73308 66268 42249 52367 60821
11296 60821 69673 34969 31421 44333 33496 42110 62502 41108 22886 11626 19968 55960
11284 55960 40888 11871 10671 16212 18826 5170 133 8086 37681 76141 82789 75686 50982
11271 50982 35464 26851 -1640 -15268 -5549 27703 55081 61258 56691 66695 29899 19532
11259 19532 38093 36930 54268 46676 24241 13733 -3307 5510 45757 50250 25117 28362 29859
11246 29859 23179 35375 59407 65527 71182 58826 49131 43359 63654 47131 64013 99311 80413
11233 80413 48550 49182 30806 18354 8778 -583 -321 22302 31763 45295 40675 29354 35646
11220 35646 52698 65327 68798 56452 72451 71128 53286 61969 65602 58303 52501 51778 31063
$$ packed form
11309d052r613P537M3731P293j7164P418K4932J3819n93p040k4019J0118Q454
11296F0821Q852l4704l548J2912j0837Q614K0392k1394j8222j1260Q342L5992
11284E5960j5072k9017j200N541K614j3656n037P953K9595L8460O648p103k4704
11271E0982j5518q613k8491j3628R719L3252K7378O177m567J0004l6796j0367
11259A9532J8561j163J7338p592k2435j0508j7040Q817M0247M493k5133L245J497
11246B9859o680J2196K4032O120N655j2356r695n772K0295j6523J6882L5298j8898
11233H0413l1863O32j8376j2452r576r361K62K2623R461J3532m620j1321O292
11220C5646J7052J2629L471j2346J5999j323j7842Q683L633p299n802p23k0715
$$ plain form
11207 31063 42247 54994 78757 85850 96108 89156 71074 106926 126103 101100 64006 66448
11195 66448 65175 53828 36034 46973 59721 58023 54034 40397 37825 50423 54264 64033 38090
11182 38090 30755 61386 46389 46598 59906 84888 94029 81862 102541 117633 89116 71874
11170 71874 97642 130565 128791 92905 74291 107326 113855 77173 74134 105015 135950 106892
11158 106892 83493 82505 78868 70902 72026 68679 73798 82738 78249 92214 92816 65044 81127 94848
11144 94848 112868 99516 83393 77279 64614 47205 68734 98444 118956 87697 61332 51769
11132 51769 86539 105582 91617 111844 108509 103775 100383 83230 103059 106946 94400 97226 83029
11119 83029 85137 74852 67066 72746 102333 141359 167066 153262 129494 143360 141140 170136
$$ packed form
11207C1063J1184J2747K3763P093J0258o952j8082L5852J9177k5003l7094K442
11195F6448j273j1347j7794J0939J2748j698l989j3637k572J2598L841R769k5943
11182C8090p335L0631j4997K09J3308K4982R141j2167K0679J5092k8517j7242
11170G1874K5768L2923j774l5886j8614L3035O529l6682l039L0881L0935k9058
11158A06892k3399r88l637p966J124l347N119Q940m489J3965O02k7772J6083J3721
11144I4848J8020j3352j6123o114j2665j7409K1529K9710K0512l1259k6365r563
11132E1769L4770J9043j3965K0227l335m734l392j7153J9829L887j2546K826j4197
11119H3029K108j0285p786N680K9587L9026K5707j3804k3768J3866k220K8996
$$ plain form
11107 170136 191252 159972 160317 176519 182149 182370 174766 148341 113963 88608 69563 87944 89203
11094 89203 92668 92512 104907 99273 93015 96730 92306 83458 94527 109323 89857 50343 33241
11081 33241 44784 68306 91826 105804 86819 76186 90838 94165 85045 88998 70609 60035
11069 60035 35447 38387 49511 40483 29199 56331 79863 102592 119219 110144 110660 129555 139469
11056 139469 112148 100468 100945 83545 66979 54444 68068 100419 108021 113240 109674 114142 123453
11043 123453 151520 174543 149594 141153 129818 120497 140360 133910 139998 151963 161315 154157 139662
11030 139662 136736 136184 141882 112782 106556 108385 107934 114872 165628 186345 147595 137228 142682
11017 142682 130209 125039 121171 118470 144425 165339 164581 139391 121519 118826 105117 106869 116298
$$ packed form
11107A70136K1116l1280L45J6202N630K21p604k6425l4378k5355j9045J8381J259
11094H9203L465j56J2395n634o258L715m424q848J1069J4796j9466l9514j7102
11081C3241J1543K3522K3520J3978j8985j0633J4652L327r120L953j8389j0574
11069F0035k4588K940J1124r028j1284K7132K3532K2729J6627r075N16J8895R914
11056A39469k7321j1680M77j7400j6566j2535J3624L2351P602N219l566M468R311
11043A23453K8067K3023k4949q441j1335r321J9863o450O088J1965R352p158j4495
11030A39662k926n52N698k9100o226J829m51O938N0756K0717l8750j0367N454
11017A42682j2473n170l868k701K5955K0914p58k5190j7872k693j3709J752R429
$$ plain form
11004 116298 117949 118928 130352 142301 149158 171439 153671 162413 160240 141500 167132 166603 143129
10991 143129 145950 158353 164444 165789 141268 110354 94978 121916 144000 161318 157898 148298
10979 148298 126243 126539 139443 154674 178102 177512 156089 134694 122983 141383 172106 176518
10967 176518 180807 180453 182667 180652 182980 194728 204406 198178 188885 196600 180972 155844 184061
10954 184061 184672 170996 186016 195924 184036 151482 161335 165734 147661 155002 172886 183018 194210
10941 194210 193459 166191 171085 185855 204052 215257 214320 209481 214268 182211 193736 211184 213966
10928 213966 236708 243698 228632 225455 200827 187895 208735 233524 264297 259623 285242 288067
10916 288067 280916 302717 335297 360796 400658 451863 444403 487512 533462 598871 671333 724495
$$ packed form
11004A16298J651R79J1424J1949O857K2281j7768Q742k173j8740K5632n29k3474
10991A43129K821J2403O091J345k4521l0914j5376K6938K2084J7318l420r600
10979A48298k2055K96J2904J5231K3428n90k1423k1395j1711J8400L0723M412
10967A76518M289l54K214k015K328J1748R678o228r293P715j5628k5128K8217
10954A84061O11j3676J5020R908j1888l2554R853M399j8073P341J7884J0132J1192
10941A94210p51k7268M894J4770J8197J1205r37m839M787l2057J1525J7448K782
10928B13966K2742O990j5066l177k4628j2932K0840K4789L0773m674K5619K825
10916B88067p151K1801L2580K5499L9862N1205p460M3109M5950O5409P2462N3162
$$ plain form
10904 724495 759926 793881 834741 854553 835356 791975 767506 776998 736976 694624 677593 669674
10892 669674 640628 615345 616043 643155 658127 705454 719128 748085 762772 794827 824059 837235
10880 837235 845040 852717 853177 867000 896385 946582 972221 955151 940720 945444 904787 877925
10868 877925 874554 862542 840890 850408 824738 783784 771000 754065 744839 716931 711165 686225
10856 686225 682183 666154 627504 612598 637616 674654 700554 715864 730889 737403 741063 773020
10844 773020 793557 789401 790252 806914 775922 740590 707086 674386 633506 565311 527609 521443
10832 521443 499934 460840 440100 417843 399332 394536 366363 337595 319178 316097 311273 314973
10820 314973 317816 320298 321096 310396 310420 322907 322101 329815 316984 315017 321311 311499 309794 319604
$$ packed form
10904G24495L5431L3955M0860J9812j9197m3381k4469R492m0022m2352j7031p919
10892F69674k9046k5283O98K7112J4972M7327J3674K8957J4687L2055K9232J3176
10880H37235P805P677M60J3823K9385N0197K5639j7070j4431M724m0657k6862
10868H77925l371j2012k1652R518k5670m0954j2784j6935r226k7908n766k4940
10856F86225m042j6029l8650j4906K5018L7038K5900J5310J5025O514L660L1957
10844G73020K0537m156Q51J6662l0992l5332l3504l2700m0880o8195l7702o166
10832E21443k1509l9094k0740k2257j8511m796k8173k8768j8417l081m824L700
10820C14973K843K482P98j0700K4J2487q06P714j2831j967O294r812j705R810
$$ plain form
10806 319604 308756 292917 298922 289540 273356 305240 315231 271639 262677 274828 261069 277521
10794 277521 284572 273521 262411 294850 292655 277127 266125 272203 255518 259700 253555 283003
10782 283003 322845 323059 320223 327299 332058 354210 378627 360085 359099 352615 334002 353693 377163
10769 377163 423787 458182 485495 512783 549499 563697 548184 533193 507150 509144 506948 473436
10757 473436 434210 422431 412400 401678 415587 412670 398155 382108 368152 399456 413200 401058
10745 401058 414138 414889 440773 456524 449674 480455 489731 493710 485883 480879 503676 485288 460911
10732 460911 441622 448913 482960 499939 463947 456242 456084 457800 453233 484676 477036 464666 465141
10719 465141 474004 511071 555815 555341 554475 554649 561503 587653 590956 570103 569503 594389 607450 585773
$$ packed form
10806C19604j0848j5839O005r382j6184L1884R991m3592q962J2151j3759J6452
10794B77521P051j1051j1110L2439k195j5528j1002O078j6685M182o145K9448
10782B83003L9842K14k836P076M759K2152K4417j8542r86o484j8613J9691K3470
10769C77163M6624L4395K7313K7288L6716J4198j5513j4991k6043J994k196l3512
10757D73436l9226j1779j0031j0722J3909k917j4515j6047j3956L1304J3744j2142
10745D01058J3080P51K5884J5751o850L0781R276L979p827n004K2797j8388k4377
10732D60911j9289P291L4047J6979l5992p705j58J716m567L1443p640j2370M75
10719D65141Q863L7067M4744m74q66J74O854K6150L303k0853o00K4886J3061k1677
$$ plain form
10705 585773 588691 617508 602191 588112 571520 558347 559241 608253 587849 571566 551249 534187
10693 534187 529427 512275 514831 521089 553698 586166 598205 590380 573398 577827 582051 584405 605624
10680 605624 622657 627455 616820 605262 583213 562413 574994 597378 598737 600730 594173 609569
10668 609569 652127 646698 631750 606840 608842 611966 630633 649695 635307 643833 664753 663413
10656 663413 636297 582699 567687 587256 628817 660252 671524 672418 656913 668987 691297 700940
10644 700940 712863 725646 732409 757908 772570 765431 751176 756918 797863 808851 784454 764074
10632 764074 771442 805707 838021 856989 839889 842052 864766 887657 898874 924054 929643 942391
10620 942391 941798 961956 976838 994540 1045908 1058820 1097049 1131806 1162256 1198504 1250022 1279204
$$ packed form
10705E85773K918K8817j5317j4079j6592j3173Q94M9012k0404j6283k0317j7062
10693E34187m760j7152K556O258L2609L2468J2039p825j6982M429M224K354K1219
10680F05624J7033M798j0635j1558k2049k0800J2581K2384J359J993o557J5396
10668F09569M2558n429j4948k4910K002L124J8667J9062j4388Q526K0920j340
10656F63413k7116n3598j5012J9569M1561L1435J1272Q94j5505J2074K2310R643
10644G00940J1923J2783O763K5499J4662p139j4255N742M0945J0988k4397k0380
10632G64074P368L4265L2314J8968j7100K163K2714K2891J1217K5180N589J2748
10620I42391n93K0158J4882J7702N1368J2912L8229L4757L0450L6248N1518K9182
$$ plain form
10608 1279204 1297806 1313039 1352094 1412946 1469655 1499958 1518426 1551646 1611123 1675396 1668691
10597 1668691 1647323 1660366 1656736 1639928 1622335 1608991 1622868 1627233 1615871 1610315 1588760 1589996
10585 1589996 1610717 1628149 1629078 1633033 1673762 1686654 1709695 1761316 1781541 1776369 1752080 1755162
10573 1755162 1794105 1806018 1850636 1872163 1858367 1899992 1942461 1986920 2018174 2018673 2044942 2097139
10561 2097139 2140287 2158757 2176743 2208604 2240159 2263067 2290093 2343136 2385758 2431361 2497186
10550 2497186 2546684 2583050 2640831 2726839 2790184 2834930 2908538 2984149 3019060 3051420 3125838
10539 3125838 3230399 3319110 3394975 3485149 3571080 3671682 3752494 3866152 4012685 4135489
10529 4135489 4278510 4431672 4593481 4739940 4919240 5080788 5298259 5504302 5736333
$$ packed form
10608A279204J8602J5233L9055O0852N6709L0303J8468L3220N9477O4273o705
10597A668691k1368J3043l630j6808j7593j3344J3877M365j1362n556k1555J236
10585A589996K0721J7432R29L955M0729J2892K3041N1621K0225n172k4289L082
10573A755162L8943J1913M4618K1527j3796M1625M2469M4459L1254M99K6269N2197
10561B097139M3148J8470J7986L1861L1555K2908K7026N3043M2622M5603O5825
10550B497186M9498L6366N7781Q6008O3345M4746P3608P5611L4911L2360P4418
10539C125838J04561Q8711P5865R0174Q5931J00602Q0812J13658J46533J22804
10529D135489J43021J53162J61809J46459J79300J61548K17471K06043K32031
$$ plain form
10520 5736333 5985469 6232330 6527402 6844392 7213115 7593345 8019604 8462896 8961823
10511 8961823 9488391 10077639 10745670 11506469 12373448 13322860 14355858 15527895 16857403
10502 16857403 18331510 20022044 21967755 24183769 26736632 29741075 33316443 37578069
10494 37578069 42664489 48756048 56016166 64592922 74512816 85642550 97512887 109336819
10486 109336819 119844701 127718870 131952310 132055189 128476483 122240081 114586967 106633721
10478 106633721 99292963 93190390 88575695 85562895 84201685 84433178 86171265 89272237
10470 89272237 93422596 98144940 102934115 107247991 110674588 113169942 114990472 116664308
10462 116664308 118892664 122150104 126729708 132548138 139196454 145903649 151696471 155626119
$$ packed form
10520E736333K49136K46861K95072L16990L68723L80230M26259M43292M98927
10511H961823N26568N89248O68031P60799Q66979R49412J032998J172037J329508
10502A6857403J474107J690534J945711K216014K552863L004443L575368M261626
10494C7578069N086420O091559P260118Q576756R919894J1129734J1870337J1823932
10486A09336819J0507882P874169M233440J02879l578706o236402p653114p953246
10478A06633721p340758o102573m614695l012800j361210K31493J738087L100972
10470H9272237M150359M722344M789175M313876L426597K495354J820530J673836
10462A16664308K228356L257440M579604N818430O648316O707195N792822L929648
$$ plain form
10454 155626119 156915332 155374924 151327891 145538644 138989300 132619412 127100884 122759683
10446 122759683 119558476 117177723 114993814 112456699 109203656 105162617 100564755 95793392
10438 95793392 91333383 87578667 84835678 83316537 83151670 84450091 87183561 91292696
10430 91292696 96592762 102779546 109260947 115211525 119682681 121710660 120724625 116612227
10422 116612227 109806202 101155803 91601555 82020448 72914555 64647506 57332568 50949701
10414 50949701 45453165 40735091 36687467 33227470 30232714 27649463 25401452 23436942
10406 23436942 21707396 20160862 18727977 17437415 16290652 15265158 14337297 13502658
10398 13502658 12719745 12016039 11359776 10789372 10206227 9708745 9234501 8783635 8379758
$$ packed form
10454A55626119J289213j540408m047033n789247o549344o369888n518528m341201
10446A22759683l201207k380753k183909k537115l253043m041039m597862m771363
10438I5793392m460009l754716k742989j519141j64867J298421K733470M109135
10430I1292696N300066O186784O481401N950578M471156K027979r86035m112398
10422A16612227o806025q650399r554248r581107r105893q267049p314938o382867
10414E0949701n496536m718074m047624l459997k994756k583251k248011j964510
10406B3436942j729546j546534j432885j290562j146763j025494r27861q34639
10398A3502658p82913p03706o56263n70404n83145m97482m74244m50866m03877
$$ plain form
10389 8379758 8012641 7695064 7384165 7085309 6816999 6594005 6383250 6174117 5996387
10380 5996387 5834778 5679093 5535557 5382503 5228141 5084334 4994539 4952702 4851047 4748526
10370 4748526 4689202 4637370 4583707 4517096 4458543 4445591 4406353 4372446 4349727 4319777 4290696
10359 4290696 4231781 4214470 4192668 4154740 4109504 4073591 4034243 4016348 4000507 3963098 3941550
10348 3941550 3967935 3992639 3969399 3957361 4002105 4065879 4101129 4137083 4168999 4246317 4321802
10337 4321802 4375475 4414272 4435645 4473255 4500869 4485384 4477700 4473867 4485324 4484267 4483138 4488763
10325 4488763 4538057 4582364 4616148 4645936 4717325 4780105 4848205 4893612 4957392 5047814 5099081
10314 5099081 5118466 5154915 5246972 5341593 5397048 5480689 5579150 5641954 5672787 5740864 5830188
$$ packed form
10389H379758l67117l17577l10899k98856k68310k22994k10755k09133j77730
10380E996387j61609j55685j43536j53054j54362j43807q9795m1837j01655j02521
10370D748526n9324n1832n3663o6611n8553j2952l9238l3907k2719k9950k9081
10359D290696n8915j7311k1802l7928m5236l5913l9348j7895j5841l7409k1548
10348C941550K6385K4704k3240j2038M4744O3774L5250L5954L1916P7318P5485
10337D321802N3673L8797K1373L7610K7614j5485p684l833J1457j057j129N625
10325D488763M9294M4307L3784K9788P1389O2780O8100M5407O3780R0422N1267
10314E099081J9385L6449R2057R4621N5455Q3641R8461O2804L0833O8077Q9324
$$ plain form
10303 5830188 5901992 5984297 6078179 6194554 6289542 6393718 6496639 6589381 6676119 6774619 6853530
10292 6853530 6952123 7069915 7172731 7293901 7414048 7566985 7708779 7847737 7963473 8086976
10282 8086976 8217411 8399606 8564172 8723561 8908647 9099851 9272973 9459571 9673083
10273 9673083 9897709 10105256 10295246 10497099 10710769 10964664 11207766 11438180 11687139
10264 11687139 11887174 12120301 12356062 12591007 12810791 13046985 13298042 13528479 13772669
10255 13772669 14036406 14311603 14577399 14846479 15115606 15385904 15634834 15867111 16116993
10246 16116993 16362871 16582735 16758467 16941657 17137930 17310124 17470811 17634578 17763025
10237 17763025 17894723 18016357 18127005 18235123 18314405 18374621 18387414 18433897 18454334 18423222
$$ packed form
10303E830188P1804Q2305R3882J16375R4988J04176J02921R2742Q6738R8500P8911
10292F853530R8593J17792J02816J21170J20147J52937J41794J38958J15736J23503
10282H086976J30435J82195J64566J59389J85086J91204J73122J86598K13512
10273I673083K24626K07547J89990K01853K13670K53895K43102K30414K48959
10264A1687139K00035K33127K35761K34945K19784K36194K51057K30437K44190
10255A3772669K63737K75197K65796K69080K69127K70298K48930K32277K49882
10246A6116993K45878K19864J75732J83190J96273J72194J60687J63767J28447
10237A7763025J31698J21634J10648J08118P9282O0216J2793M6483K0437l1112
$$ plain form
10227 18423222 18385856 18348001 18305582 18237983 18149758 18044097 17966057 17873380 17732582 17566025
10217 17566025 17368410 17182531 17020685 16843467 16624345 16430185 16264282 16061356 15837002
10208 15837002 15647942 15461194 15263112 15053869 14840723 14627762 14424711 14179774 13880153
10199 13880153 13591096 13294935 13002784 12725745 12462138 12192654 11955929 11704614 11476688
10190 11476688 11271793 11059488 10852697 10627816 10394166 10194848 10015201 9826125 9622505
10181 9622505 9430172 9245183 9054075 8872420 8695165 8527682 8379937 8219130 8030140
10172 8030140 7877674 7738335 7599156 7464690 7301904 7123067 6950513 6812034 6705617
10163 6705617 6584097 6461332 6338022 6178993 6064647 5968413 5863971 5753554 5672550 5565702
$$ packed form
10227A8423222l7366l7855m2419o7599q8225j05661p8040r2677j40798j66557
10217A7566025j97615j85879j61846j77218k19122j94160j65903k02926k24354
10208A5837002j89060j86748j98082k09243k13146k12961k03051k44937k99621
10199A3880153k89057k96161k92151k77039k63607k69484k36725k51315k27926
10190A1476688k04895k12305k06791k24881k33650j99318j79647j89076k03620
10181I622505j92333j84989j91108j81655j77255j67483j47745j60807j88990
10172H030140j52466j39339j39179j34466j62786j78837j72554j38479j06417
10163F705617j21520j22765j23310j59029j14346r6234j04442j10417q1004j06848
$$ plain form
10153 5565702 5443388 5332780 5234753 5167601 5095277 5031601 4943599 4849996 4777672 4699598 4638307
10142 4638307 4567415 4503572 4433367 4359943 4264160 4208983 4156831 4107711 4029979 3948258 3875469
10131 3875469 3823760 3775569 3711597 3643958 3600406 3528802 3473928 3443186 3408143 3362539 3319972
10120 3319972 3274925 3230729 3169917 3124219 3051314 2989772 2960391 2947353 2944982 2890671 2817398
10109 2817398 2765328 2739944 2699748 2681508 2650679 2620965 2586329 2561539 2567582 2547655 2495115
10098 2495115 2447103 2410478 2372742 2334843 2312128 2307147 2284949 2260046 2230842 2220875 2210312 2216497
10086 2216497 2181511 2166584 2161815 2100612 2033234 2018365 2025489 2012045 1996022 2009890 2021523 1986551
10074 1986551 1955326 1980232 2017370 2022290 2035760 2020031 2004155 2033615 2087300 2120136 2142410
$$ packed form
10153E565702j22314j10608r8027o7152p2324o3676q8002r3603p2324p8074o1291
10142D638307p0892o3843p0205p3424r5783n5177n2152m9120p7732q1721p2789
10131C875469n1709m8191o3972o7639m3552p1604n4874l0742l5043m5604m2567
10120C319972m5047m4196o0812m5698p2905o1542k9381j3038k371n4311p3273
10109B817398n2070k5384m0196j8240l0829k9714l4636k4790O043j9927n2540
10098B495115m8012l6625l7736l7899k2715m981k2198k4903k9204r967j0563O185
10086B216497l4986j4927m769o1203o7378j4869P124j3444j6023J3868J1633l4972
10074A986551l1225K4906L7138M920J3470j5729j5876K9460N3685L2836K2274
$$ plain form
10063 2142410 2165895 2197860 2247767 2274570 2239211 2190976 2165964 2129083 2080747 2064705 2038697
10052 2038697 2025674 2034597 2061114 2117585 2180092 2236819 2288855 2335328 2309068 2272768 2234066
10041 2234066 2181307 2108765 2049681 2037091 2025740 2000120 1995022 2014347 2021249 2011872 2013594 2028018
10029 2028018 1994875 1919877 1887599 1847266 1779345 1745869 1711026 1703724 1686919 1684724 1692344 1651420
10017 1651420 1607737 1595279 1573578 1564162 1528600 1482911 1459158 1463316 1469663 1463098 1443813 1443896 1452817
10004 1452817 1488536 1511666 1534552 1551466 1554385 1517609 1467163 1437224 1366886 1289233 1242210
9993 1242210 1203678 1169808 1141264 1105230 1060984 1031298 1003850 976664 951601 918403 861241
9982 861241 834358 830260 833367 831487 808681 788445 812487 828198 807128 800009 809306 798613 760201
$$ packed form
10063B142410K3485L1965M9907K6803l5359m8235k5012l6881m8336j6042k6008
10052B038697j3023Q923K6517N6471O2507N6727N2036M6473k6260l6300l8702
10041B234066n2759p2542n9084j2590j1351k5620n098J9325O902r377J722J4424
10029B028018l3143p4998l2278m0333o7921l3476l4843p302j6805k195P620m0924
10017A651420m3683j2458k1701r416l5562m5689k3753M158O347o565j9285Q3Q921
10004A452817L5719K3130K2886J6914K919l6776n0446k9939p0338p7653m7023
9993A242210l8532l3870k8544l6034m4246k9686k7448k7186k5063l3198n7162
9982H61241k6883m098L107j880k2806k0236K4042J5711k1070p119R297j0693l8412
$$ plain form
9969 760201 752109 736603 749039 778133 744791 727004 710841 705933 723065 724053 725139 689651 685738
9956 685738 689055 690982 698621 708720 698758 683976 681642 660012 664793 695242 719850 751075 757667
9943 757667 779067 848627 948173 1108103 1250598 1265660 1139826 975604 878320 823769 750224
9932 750224 685666 649070 641318 637990 641860 642106 620781 592513 564153 546676 560736 551631 527107
9919 527107 520227 523121 539668 515054 533605 536773 549533 543555 535930 536936 559110 578535 563790
9906 563790 534197 512335 514939 500260 504569 504081 468955 457691 484523 496782 509783 524721
9894 524721 505975 510041 501709 495707 487279 494077 474530 468117 482913 491493 493158 471383 474684
9881 474684 448032 435404 441104 438931 459583 461835 439874 437394 462539 457567 455762 433467 428531
$$ packed form
9969G60201q092j5506J2436K9094l3342j7787j6163m908J7132R88J086l5488l913
9956F85738L317J927P639J0099r962j4782k334k1630M781L0449K4608L1225O592
9943G57667K1400O9560R9546J59930J42495J5062j25834j64222r7284n4551p3545
9932G50224o4558l6596p752l328L870K46k1325k8268k8360j7477J4060r105k4524
9919E27107o880K894J6547k4614J8551L168J2760n978p625J006K2174J9425j4745
9906E63790k9593k1862K604j4679M309m88l5126j1264K6832J2259J3001J4938
9894E24721j8746M066q332o002q428O798j9547o413J4796Q580J665k1775L301
9881D74684k6652j2628N700k173K0652K252k1961k480K5145m972j805k2295m936
$$ plain form
9868 428531 421310 417481 437245 500038 536780 514830 529245 551232 562996 596843 624883 630551
9856 630551 645570 637603 616209 608533 661218 704899 750913 819997 874064 965560 1076120 1182604
9844 1182604 1342539 1639298 2106682 2884979 4232239 6333541 9055152 11458438 12181861
9835 12181861 10782295 8201844 5730297 3922403 2759787 2039757 1564266 1249149 1040583
9826 1040583 885674 778692 701629 638614 574807 550933 555437 520361 491754 471745 477280
9815 477280 503855 481319 446050 408869 382437 386143 364659 367454 373299 378178 367595 369868 368062
9802 368062 351318 326994 315557 287434 276818 306836 324813 324781 326288 317212 330123 333804 323468
9789 323468 317912 275145 261006 263416 281047 277376 280490 268068 254705 264930 240823 214312
$$ packed form
9868D28531p221l829J9764O2793L6742k1950J4415K1987J1764L3847K8040N668
9856F30551J5019p967k1394p676N2685M3681M6014O9084N4067R1496J10560J06484
9844A182604J59935K96759M67384P78297J347260K101302K721611K403286P23423
9835A2181861j399566k580451k471547j807894j162616p20030m75491l15117k08566
9826A040583j54909j06982p7063o3015o3807k3874M504l5076k8607k0009N535
9815D77280K6575k2536l5269l7181k6432L706k1484K795N845M879j0583K273j806
9802C68062j6744k4324j1437k8123j0616L0018J7977l2J507r076J2911L681j0336
9789C23468n556m2767j4139K410J7631l671L114j2422j3363J0225k4107k6511
$$ plain form
9777 214312 234450 269392 298138 295027 292058 299789 285251 267279 255831 260711 270009 268278 261264
9764 261264 245031 246062 261582 287051 268471 230553 213110 212204 247382 264838 259645 271339
9752 271339 285891 283502 250938 214652 185066 193066 192019 178984 166101 171178 200026 223384
9740 223384 224726 201299 205328 221969 229349 209764 203867 191376 189859 194595 191886 185823 152950
9727 152950 158181 167170 167694 185524 186182 182461 183150 208348 213385 225197 232891 215061 195144 186671
9713 186671 200056 192738 178302 192685 202453 186881 165113 177978 214326 217150 216222 217244 208324
9700 208324 200100 201532 179462 164187 159410 159987 147873 153398 162277 131136 133274 163635 179513
9687 179513 192769 198217 185276 162337 149567 142083 139533 147193 179016 168683 168242 163021 151519
$$ packed form
9777B14312K0138L4942K8746l111k969P731j4538j7972j1448M880R298j731p014
9764B61264j6233J031J5520K5469j8580l7918j7443r06L5178J7456n193J1694
9752B71339J4552k389l2564l6286k9586Q000j047j3035j2883N077K8848K3358
9740B23384J342k3427M029J6641P380j9585n897j2491j517M736k709o063l2873
9727A52950N231Q989N24J7830O58l721O89K5198N037J1812P694j7830j9917q473
9713A86671J3385p318j4436J4383R768j5572k1768J2865L6348K824r28J022q920
9700B08324q224J432k2070j5275m777N77j2114N525Q879l1141K138L0361J5878
9687A79513J3256N448j2941k2939j2770p484k550P660L1823j0333m41n221j1502
$$ plain form
9674 151519 139508 154904 158378 147084 133908 157928 148572 137296 146755 167745 161312 145435
9662 145435 144888 157867 139786 140709 143151 133831 139887 139345 150296 153084 141105 141219 144000 152714
9648 152714 139229 133264 119885 119376 148021 165677 151458 129179 125781 141546 148686 160341 118785
9635 118785 126199 129331 126383 140270 134770 111466 106117 122918 112327 103982 103747 97828 97398 116807
9621 116807 115625 96681 121179 137560 127943 130928 115226 119223 124124 122333 119428 108060 105908
9608 105908 112370 114100 110915 82431 88555 99034 108322 112037 109440 94904 86946 98640 94212
9595 94212 85185 97852 123925 132901 125630 113863 111348 128614 139382 136375 127052 134707 128480
9582 128480 87451 72603 91717 121031 132605 127873 115936 138350 177265 209775 223892 217759
$$ packed form
9674A51519j2011J5396L474j1294j3176K4020r356j1276R459K0990o433j5877
9662A45435n47J2979j8081R23K442r320O056n42J0951K788j1979J14K781Q714
9648A52714j3485n965j3379n09K8645J7656j4219k2279l398J5765P140J1655m1556
9635A18785P414L132k948J3887n500k3304n349J6801j0591q345k35n919m30J9409
9621A16807j182j8944K4498J6381r617K985j5702L997M901j791k905j1368k152
9608A05908O462J730l185k8484O124J0479R288L715k597j4536p958J1694m428
9595I4212r027J2667K6073Q976p271j1767k515J7266J0768l007r323P655o227
9582A28480m1029j4848J9114K9314J1574m732j1937K2414L8915L2510J4117o133
$$ plain form
9570 217759 205010 191225 161484 169372 182254 171216 155172 144361 156006 166617 191214 179233
9558 179233 165000 163078 169282 195560 238112 239091 224611 205557 184114 168721 190773 232608
9546 232608 226182 217733 185635 172058 171815 181619 201750 180326 173150 189507 189700 211030 232357
9533 232357 266084 317347 365177 435796 422888 376908 337721 277384 226797 190694 149432 132438
9521 132438 138673 149825 150978 171607 146511 148270 163940 160856 159549 154480 131383 163643 172750
9508 172750 150567 146435 139834 145809 156479 186401 167330 104136 109155 123571 111541 99128
9496 99128 127424 133224 106428 101413 134605 164869 175525 180740 180781 188526 166399 130838 116206
9483 116206 110445 111597 95777 66010 68523 59442 61772 70137 54310 37353 70904 89254 69174
$$ packed form
9570B17759j2749j3785k9741P888J2882j1038j6044j0811J1645J0611K4597j1981
9558A79233j4233j922O204K6278M2552R79j4480j9054k1443j5393K2052M1835
9546B32608o426q449l2098j3577k43R804K0131k1424p176J6357J93K1330K1327
9533B32357L3727N1263M7830P0619j2908m5980l9187o0337n0587l6103m1262j6994
9521A32438O235J1152J153K0629k5096J759J5670l084j307n069k3097L2260R107
9508A72750k2183m132o601N975J0670K9922j9071o3194N019J4416j2030j2413
9496I9128K8296N800k6796n015L3192L0264J0656N215M1P745k2127l5561j4632
9483A16206n761J152j5820k9767K513r081K330Q365j5827j6957L3551J8350k0080
$$ plain form
9470 69174 73045 76626 72819 61104 50957 58268 65353 68487 65561 66069 82608 73600 48317 14099
9456 14099 -6176 4645 32572 30374 24218 9993 31862 69335 102037 85266 60893 63463
9444 63463 81186 74276 75329 92730 86677 63490 50983 39264 16297 51295 92889 73503
9432 73503 74369 77335 66568 64483 38583 39954 81640 106230 106349 118535 106808 55999 63416
9419 63416 82026 68727 75038 59090 33423 21494 29494 31796 48898 58097 53298 45457 72757
9406 72757 76271 47751 34082 45104 46256 53496 60096 65630 103872 116486 99006 96342 101208
9393 101208 119923 119496 86842 76354 69355 69974 85889 89490 76884 74473 75713 73364 69571 89412
9379 89412 107120 91663 38588 26587 19062 37395 45801 74362 93406 103235 92079 95527 87108
$$ packed form
9470F9174L871L581l807j1715j0147P311P085L134k926N08J6539r008k5283l4218
9456A4099k0275J0821K7927k198o156j4225K1869L7473L2702j6771k4373K570
9444F3463J7723o910J053J7401o053k3187j2507j1719k2967L4998M1594j9386
9432G3503Q66K966j0767k085k5900J371M1686K4590J19J2186j1727n0809P417
9419F3416J8610j3299O311j5948k5667j1929Q000K302J7102R199m799p841K7300
9406G2757L514k8520j3669J1022J152P240O600N534L8242J2614j7480k664M866
9393A01208J8715m27l2654j0488o999O19J5915L601j2606k411J240k349l793J9841
9379H9412J7708j5457n3075j2001p525J8333Q406K8561J9044R829j1156L448q419
$$ plain form
9366 87108 76603 95984 88307 77133 76687 70121 59438 85808 95269 75705 58160 72938 103815
9353 103815 116125 92760 69710 58449 52664 67158 91642 80058 73482 79736 89430 89083 78228
9340 78228 57272 63984 71993 79444 56181 49059 25156 25647 49771 87760 67801 47397 61369
9327 61369 70808 56034 63126 75870 68438 29377 40927 54774 49099 39483 46194 70919 85382
9314 85382 82312 86583 83927 63618 19284 12404 45263 66455 58862 47902 52359 94634 80543
9301 80543 62581 31303 20940 47963 75973 94872 90636 77397 90331 116506 144479 167327
9289 167327 189347 194908 203770 206189 202436 177628 171386 138575 123474 145680 155121 140966 128051
9276 128051 122622 136651 154222 190572 196273 196260 179776 166865 157993 171067 188482 194878 221914
$$ packed form
9366H7108j0505J9381p677j1174m46o566j0683K6370R461j9564j7545J4778L0877
9353A03815J2310k3365k3050j1261n785J4494K4484j1584o576O254R694l47j0855
9340G8228k0956O712Q009P451k3263p122k3903M91K4124L7989j9959k0404J3972
9327F1369R439j4774P092J2744p432l9061J1550J3847n675r616O711K4725J4463
9314H5382l070M271k656k0309m4334o880L2859K1192p593j0960M457M2275j4091
9301H0543j7962l1278j0363K7023K8010J8899m236j3239J2934K6175K7973K2848
9289A67327K2020N561Q862K419l753k4808o242l2811j5101K2206R441j4155j2915
9276A28051n429J4029J7571L6350N701j3j6484j2911q872J3074J7415O396K7036
$$ plain form
9263 221914 223027 223340 222329 208138 227401 228801 217248 218768 249176 270565 307701 347949 368813
9250 368813 361145 350447 362620 327766 273046 237548 216201 209066 208951 203756 185125 177323 160760
9237 160760 153835 157736 159868 166994 159836 156122 176105 172931 170677 164910 186503 202863 179397
9224 179397 153327 151416 153789 144717 144022 139797 143465 136477 138750 166273 201898 192585 158996 128366
9210 128366 109083 87562 65374 75523 95304 127852 99952 75776 64342 72253 57051 48443
9198 48443 39086 73409 85614 75856 45562 23851 22025 50974 77075 89327 83030 58991 48528
9185 48528 52368 62225 79249 74728 65672 59815 36681 23614 13826 13976 19036 19560 17649 34834
9171 34834 43147 39388 48511 34781 22871 39838 27933 40409 30281 37838 26416 -5340 11881
$$ packed form
9263B21914J113L13j011j4191J9263J400j1553J520L0408K1389L7136M0248K0864
9250C68813p668j0698J2173l4854n4720l5498k1347p135j15n195j8631p802j6563
9237A60760o925L901K132P126p158l714J9983l174k254n767K1593J6360k3466
9224A79397k6070j911K373r072o95m225L668o988K273K7523L5625r313l3589l0630
9210A28366j9283k1521k2188J0149J9781L2548k7900k4176j1434P911j5202q608
9198D8443r357L4323J2205r758l0294k1711j826K8949K6101J2252o297k4039j0463
9185D8528L840R857J7024m521r056n857k3134j3067r788J50N060N24j911J7185
9171C4834Q313l759R123j3730j1910J6967j1905J2476j0128P557j1422l1756J7221
$$ plain form
9158 11881 31277 18693 30285 3465 -30860 -21733 289 -2245 -468 -5955 -20108 -31194 -19244
9145 -19244 1640 -9190 -7187 -18656 -27425 4415 36777 28528 31580 31049 9740 -5355 44877
9132 44877 68454 79637 67736 61299 81383 82372 53040 33619 30841 26222 23148 4093 -2529
9119 -2529 1222 18583 35988 -3564 -36577 -13017 -6237 -9173 -18566 4693 27475 31940 26046
9106 26046 45786 50545 44368 12585 -11370 -20010 -5952 35726 41917 34362 -17623 -9769 79
9093 79 9159 31941 47259 20111 -10853 4246 5418 11391 1557 11059 -4557 -8357 9134 8277
9079 8277 5150 -34322 -31214 -12263 17659 39991 57689 40882 41308 35995 28908 24997 9692
9066 9692 -21659 -25744 -6900 24637 35879 34680 44949 38574 55315 36092 30708 38935 14147
$$ packed form
9158A1881J9396j2584J1592k6820l4325R127K2022k534J777n487j4153j1086J1950
9145a9244K0884j0830K003j1469q769L1840L2362q249L052n31k1309j5095N0232
9132D4877K3577J1183j1901o437K0084R89k9332j9421k778m619l074j9055o622
9119b529L751J7361J7405l9552l3013K3560O780k936r393K3259K2782M465n894
9106B6046J9740M759o177l1783k3955q640J4058M1678O191p555n1985P854R848
9093G9R080K2782J5318k7148l0964J5099J172N973r834R502j5616l800J7491q57
9079H277l127l9472L108J8951K9922K2332J7698j6807M26n313p087l911j5305
9066I692l1351m085J8844L1537J1242j199J0269o375J6741j9223n384Q227k4788
$$ plain form
9053 14147 -1999 3056 -11981 -31744 -4887 7102 -9861 -19996 -22154 -32110 -40696 -43600 -37881
9040 -37881 -30305 -1766 1837 10457 9230 25380 45482 37973 20969 20311 5254 892 -2044 3850
9026 3850 -5322 -17031 -24649 -12288 16263 36649 27385 5649 10134 12279 -7990 -17336 -4585
9013 -4585 16464 -714 -9798 -24487 -9816 -21553 10013 42185 38360 28160 23826 575 -5292
9000 -5292 8239 -4071 8623 17301 23332 38671 43571 49868 32459 6660 -4307 -16010 -14364
8987 -14364 -7299 -6943 17870 21568 -8699 -6196 -5491 -20235 -3908 4749 22548 18065 15272 -4163
8973 -4163 -14685 -7756 -4721 6587 33810 44584 53257 27263 -1268 707 27364 25182 17838
8960 17838 20485 31602 31253 44562 44191 36518 19777 26780 10677 13073 22657 28343 3256 -9636
$$ packed form
9053A4147j6146N055j5037j9763K6857J1989j6963j0135k158r956q586k904N719
9040c7881P576K8539L603Q620j227J6150K0102p509j7004o58j5057m362k936N894
9026C850r172j1709p618J2361K8551K0386r264k1736M485K145k0269r346J2751
9013d585K1049j7178r084j4689J4671j1737L1566L2172l825j0200m334k3251n867
9000e292J3531j2310J2694Q678O031J5339M900O297j7409k5799j0967j1703J646
8987a4364P065L56K4813L698l0267K503P05j4744J6327Q657J7799m483k793j9435
8973d163j0522O929L035J1308K7223J0774Q673k5994k8531J975K6657k182p344
8960A7838K647J1117l49J3309l71p673j6741P003j6103K396R584N686k5087j2892
$$ plain form
8946 -9636 -21238 -297 14053 7495 4915 5098 10700 5705 22079 40049 40847 40696 26665 -8214
8932 -8214 26803 58941 47299 29503 -1313 -207 15077 17495 -3371 -1968 -1785 -17618 -5198
8919 -5198 -11623 -23327 7071 20301 15784 10089 -3551 -14100 -42582 -35968 12772 7452 -6591
8906 -6591 -13070 -13766 9790 45432 28171 32697 43042 48573 70594 66434 61634 57747 57686 93220
8892 93220 107580 117293 120590 103371 87683 114639 142121 176993 180952 171970 193538 227952 259235
8879 259235 321952 410582 529157 736800 1055114 1497350 2068302 2554093 2658200 2336474
8869 2336474 1781298 1248684 861522 616719 453905 366463 299302 228404 205964 181629
8859 181629 158533 143276 132118 130250 104731 60083 43058 20141 43020 43249 33182 64861
$$ packed form
8946i636j1602K0941J4350o558k580J83N602m995J6374J7970P98j51j4031l4879
8932h214L5017L2138j1642j7796l0816J106J5284K418k0866J403J83j5833J2420
8919e198o425j1704L0398J3230m517n695j3640j0549k8482O614M8740n320j4043
8906f591o479o96K3556L5642j7261M526J0345N531K2021m160m800l887o1L5534
8892I3220J4360R713L297j7219j5688K6956K7482L4872L959q982K1568L4414L1283
8879B59235O2717Q8630J18575K07643L18314M42236N70952M85791J04107l21726
8869B336474n55176n32614l87162k44803j62814q7442o7161p0898k2440k4335
8859A81629k3096j5257j1158j868k5519m4648j7025k2917K2879K29j0067L1679
$$ plain form
8847 64861 74008 56586 37567 35357 32120 269 -515 953 2906 22173 35232 10130 -10377
8834 -10377 2644 37288 42326 62516 29957 5432 -7754 -13863 -23804 -51504 -49106 -31157 -28991
8821 -28991 -21684 -18698 -17863 -22114 -9278 -9926 -11101 -2428 -846 16352 22568 21228 31254 25894
8807 25894 10998 6654 -5690 7593 17034 7552 -3117 5160 13643 28202 -18831 -21255 -4895
8794 -4895 -19523 -4105 -9603 -7737 16432 48909 22892 5844 6617 2417 -9404 -12206 -14030
8781 -14030 -32898 -18949 -14299 -42254 -49443 -48289 -24433 7035 35922 7782 12437 13463 38864
8768 38864 69468 45429 25577 20519 33494 48958 52083 35786 24670 20935 18794 7540 -16057
8755 -16057 4532 26210 40453 44435 37280 64013 63429 40750 11878 4993 19770 43306 82450
$$ packed form
8847F4861R147j7422j9019k210l237l1851p84J468J953J9267J3059k5102k0507
8834a0377J3021L4644N038K0190l2559k4525j3186o109r941k7700K398J7949K166
8821b8991P307K986Q35m251J2836o48j175Q673J582J7198O216j340J0026n360
8807B5894j4896m344j2344J3283R441r482j0669Q277Q483J4559m7033k424J6360
8794d895j4628J5418n498J866K4169L2477k6017j7048P73m200j1821k802j824
8781a4030j8868J3949M650k7955p189J154K3856L1468K8887k8140M655J026K5401
8768C8864L0604k4039j9852n058J2975J5464L125j6297j1116l735k141j1254k3597
8755a6057K0589K1678J4243L982p155K6733n84k2679k8872o885J4777K3536L9144
$$ plain form
8742 82450 48898 14738 24416 24080 8862 8160 -5406 -15275 5517 34401 22861 -6806 -2974
8729 -2974 -8257 -6484 -28351 -18176 8043 11112 13057 24736 30417 24336 18750 65250 92838
8716 92838 75263 76749 60230 19551 4947 26707 58373 47319 21246 10151 34980 33284
8704 33284 6673 30034 26406 9510 20900 19539 22682 29838 27306 20877 33224 80411 111927
8691 111927 105613 67837 59211 76785 73587 43972 20955 22711 25830 8916 11527 20380 44189
8678 44189 41377 34602 43043 39094 40805 52520 48293 57029 63929 77357 63224 46432 61915
8665 61915 77911 85212 69130 30734 22139 49072 69692 86164 79768 90790 118184 126731 158401
8652 158401 169052 202853 218732 252391 286236 351424 435205 592300 823499 1189742 1771856
$$ packed form
8742H2450l3552l4160R678l36j5218p02j3566r869K0792K8884j1540k9667L832
8729b974n283J773k1867J0175K6219L069J945J1679N681o081n586M6500K7588
8716I2838j7575J486j6519m0679j4604K1760L1666j1054k6073j1095K4829j696
8704C3284k6611K3361l628j6896J1390j361L143P156k532o429J2347M7187L1516
8691A11927o314l7776q626J7574l198k9615k3017J756L119j6914K611Q853K3809
8678D4189k812o775Q441l949J711J1715m227Q736O900J3428j4133j6792J5483
8665F1915J5996P301j6082l8396q595K6933K0620J6472o396J1022K7394Q547L1670
8652A58401J0651L3801J5879L3659L3845O5188Q3781J57095K31199L66243N82114
$$ plain form
8641 1771856 2508205 3078942 3020800 2409791 1734609 1196069 833282 604820 456897 355941
8631 355941 279496 220495 191726 164274 144033 145071 138053 150319 157713 145319 137116 115930
8619 115930 139366 155479 172931 184656 177843 203983 215920 210246 201921 217630 245024 273275
8607 273275 313607 339057 363805 426340 506122 627943 785175 1010447 1423169 2140234 3249786
8596 3249786 4685920 5993155 6164932 5109752 3717894 2616541 1904414 1545036 1435264
8587 1435264 1409855 1423501 1415152 1281904 1055831 851614 676937 529989 443049 365332 303176
8576 303176 264985 255075 231851 178262 152837 164742 160093 125891 108724 111288 106251 115151 123172
8563 123172 131410 143072 187006 208833 201850 204191 244637 317224 398046 577665 910390 1402618
$$ packed form
8641A771856P36349N70737n8142o11009o75182n38540l62787k28462j47923j00956
8631C55941p6445n9001k8769k7452k0241J038p018J2266P394j2394q203k1186
8619A15930K3436J6113J7452J1725o813K6140J1937n674q325J5709K7394K8251
8607B73275M0332K5450K4748O2535P9782J21821J57232K25272M12722P17065J109552
8596C249786J436134J307235J71777j055180j391858j101353p12127l59378j09772
8587A435264k5409J3646q349j33248k26073k04217j74677j46948q6940p7717o2156
8576C03176l8191r910k3224n3589k5425J1905m649l4202j7167K564n037Q900Q021
8563A23172Q238J1662M3934K1827o983K341M0446P2587Q0822J79619L32725M92228
$$ plain form
8551 1402618 2077598 2748855 3032297 2676610 1972677 1351735 924071 644910 463021 339212
8541 339212 241015 180386 153745 136803 102533 99503 90720 71814 59585 76318 123617 132956
8529 132956 144650 158117 234221 321257 449405 547439 503383 378381 280988 210759 138544
8518 138544 106382 75642 84650 68035 58822 43929 37490 8654 -7839 21422 57407 68643
8506 68643 46704 39404 32357 26294 34136 34685 14028 9565 4700 7589 16850 31599 45288 37672
8492 37672 56032 83080 101350 153411 236952 348947 487301 572599 522700 373768 266549
8481 266549 201154 141225 127160 116390 94366 74190 68669 65263 54292 41213 31769 6457
8469 6457 -25646 -21013 -31407 -36637 466 17658 31006 62548 30534 12100 13888 -12841 16134
$$ packed form
8551A402618O74980O71257K83442l55687p03933o20942m27664k79161j81889j23809
8541C39212r8197o0629k6641j6942l4270l030q783j8906j2229J6733M7299R339
8529A32956J1694J3467P6104Q7036J28148R8034m4056j25002r7393p0229p2215
8518A38544l2162l0740R008j6615r213j4893o439k8836j6493K9261L5985J1236
8506F8643k1939p300p047o063P842N49k0657m463m865K889R261J4749J3689p616
8492C7672J8360K7048J8270N2061Q3541J11995J38354Q5298m9899j48932j07219
8481B66549o5395n9929j4065j0770k2024k0176n521l406j0971j3079r444k5312
8469F457l2103M633j0394n230L7103J7192J3348L1542l2014j8434J788k6729K8975
$$ plain form
8456 16134 -10046 -33317 -24057 -8067 12923 13983 -1403 -4597 -8705 213 12960 7605 -7540
8443 -7540 -24289 -39235 -21455 -32672 -57277 -43001 -30256 -36856 -10457 -15520 -21497 -18727 -18078
8430 -18078 5166 -8635 -18424 -34 7917 -9218 1969 9114 -15389 -12023 -3958 -2441 -23753
8417 -23753 -30093 -21774 -9072 12330 16406 -2661 -40437 -54510 -50142 -30914 -8554 18748 -6478
8404 -6478 -41824 -40740 -14868 18648 21737 10324 6529 -10037 -15693 -30000 -32475 -16645 -15848
8391 -15848 -35224 -32940 -101 15318 13539 16261 -10259 -29360 -53288 -45646 -35430 -37469 -21261
8378 -21261 -13126 1866 15170 10293 -11192 -24774 -9219 -12725 -26017 -30984 -23333 -22737 -24006
8365 -24006 -6300 3368 -31559 -61614 -35693 -8575 -28239 -43726 -39882 -37063 -40674 -6261 -4940
$$ packed form
8456A6134k6180k3271R260J5990K0990J060j5386l194m108Q918J2747n355j5145
8443g540j6749j4946J7780j1217k4605J4276J2745o600K6399n063n977K770O49
8430a8078K3244j3801r789J8390P951j7135J1187P145k4503L366Q065J517k1312
8417b3753o340Q319J2702K1402M076j9067l7776j4073M368J9228K2360K7302k5226
8404f478l5346J084K5872L3516L089j1413l795j6566n656j4307k475J5830P97
8391a5848j9376K284L2839J5419j779K722k6520j9101k3928P642J0216k039J6208
8378b1261Q135J4992J3304m877k1485j3582J5555l506j3292m967P651N96j269
8365b4006J7706R668l4927l0055K5921K7118j9664j5487L844K819l611L4413J321
$$ plain form
8352 -4940 -12117 -26740 -37365 -6108 -9785 -35195 -35790 -6606 12393 19182 19249 33972 36191 4220
8338 4220 10420 -9683 2558 -7343 12196 11944 9626 1031 9794 4712 17070 23910 21135 29308
8324 29308 962 -22260 -10321 -30675 -31349 8839 28210 21089 14008 21373 19533 -12111 -13225
8311 -13225 -1026 -18468 -26865 -16145 -7717 -9707 660 -8050 -16357 -15775 -8429 -7833 -28137 -23337
8297 -23337 -5368 -11747 10077 42689 39657 20762 16837 21474 1188 -18058 -19559 -977 -14165
8284 -14165 -29836 -37963 -18596 -21549 -40950 -51092 -57115 -21056 -1031 -4787 -11308 -18361 -11533
8271 -11533 -2422 29475 41644 33941 16678 16803 4428 3679 5887 5760 -23991 -36325 -21729 -6009
8257 -6009 1205 10797 26686 49025 38865 21889 14125 22729 23413 25079 29048 39699 32165 53929
$$ packed form
8352d940p177j4623j0625L1257l677k5410n95K9184J8999O789O7J4723K219l1971
8338D220O200k0103J2241r901J9539k52k318q595Q763n082J2358O840k775Q173
8324B9308k8346k3222J1939k0354o74M0188J9371p121p081P365j840l1644j114
8311a3225J2199j7442q397J0720Q428j990J0367q710q307N82P346N96k0304M800
8297b3337J7969o379K1824L2612l032j8895l925M637k0286j9246j501J8582j3188
8284a4165j5671q127J9367k953j9401j0142o023L6059K0025l756o521p053O828
8271a1533R111L1897J2169p703j7263J25j2375p49K208j27k9751j2334J4596J5720
8257f009P214R592J5889K2339j0160j6976p764Q604O84J666L969J0651p534K1764
$$ plain form
8243 53929 63234 75978 65581 68660 65197 57964 23299 23921 43621 68549 86186 87988 77893
8230 77893 77523 87297 73787 31452 21523 50906 63607 70415 78409 74399 82279 74984 77005 45281
8216 45281 33492 60777 101308 106697 84307 69893 53331 52434 68314 64850 41501 38871 47689
8203 47689 50474 75612 86200 112154 126240 130640 122248 151654 196187 178347 139700 128340
8191 128340 115721 118138 82714 64237 74192 66046 52498 60063 34660 22213 22532 36368 45650
8178 45650 48887 74984 90031 70474 41546 -8050 12626 30058 23202 22295 -5198 -402 -15004
8165 -15004 -12437 2143 4124 16330 12163 25339 13975 19587 49048 62547 87995 75903 73942
8152 73942 98210 105287 106724 126846 140074 132730 117891 144131 200092 238334 271378 285922
$$ packed form
8243E3929R305J2744j0397L079l463p233l4665O22J9700K4928J7637J802j0095
8230G7893l70R774j3510m2335r929K9383J2701O808P994m010P880p295K021l1724
8216D5281j1789K7285M0531N389k2390j4414j6562q97J5880l464k3349k630Q818
8203D7689K785K5138J0588K5954J4086M400q392K9406M4533j7840l8647j1360
8191A28340j2619K417l5424j8477R955q146j3548P565k5403j2447L19J3836R282
8178D5650L237K6097J5047j9557k8928m9596K0676J7432o856r07k7493M796j4602
8165a5004K567J4580J981J2206m167J3176j1364N612K9461J3499K5448j2092j961
8152G3942K4268P077J437K0122J3228p344j4839K6240N5961L8242L3044J4544
$$ plain form
8140 285922 233340 167502 140785 138079 130646 141699 128433 82029 67747 77471 69858 73419 80524
8127 80524 84260 64025 50990 34327 29352 13354 15666 30778 28523 41097 23191 14345 10420
8114 10420 5524 21056 25812 8421 18129 12989 30279 27009 6159 -438 8601 28538 42197
8101 42197 49271 39428 58521 75970 73528 72994 66773 90730 101164 96243 80922 57162 56814 71480
8087 71480 74979 76253 50149 44637 66089 70244 50153 66733 75340 92549 96032 104298 80645
8074 80645 75057 74222 70201 43078 45959 44054 62192 68851 81813 63671 35686 34729 35662 79305
8060 79305 84657 70977 74194 94559 97462 77082 72293 88735 63326 39734 42657 79300 104406
8047 104406 111872 112925 135004 160955 171361 186356 192789 190607 170247 173690 172354 185944 203432
$$ packed form
8140B85922n2582o5838k6717k706p433J1053j3266m6404j4282R724p613L561P105
8127H0524L736k0235j3035j6663m975j5998K312J5112k255J2574j7906q846l925
8114A0420m896J5532M756j7391R708n140J7290l270k0850o597R039J9937J3659
8101D2197P074r843J9093J7449k442n34o221K3957J0434m921j5321k3760l48J4666
8087G1480L499J274k6104n512K1452M155k0091J6580Q607J7209L483Q266k3653
8074H0645n588q35m021k7123K881j905J8138O659J2962j8142k7985r57R33M3643
8060G9305N352j3680L217K0365K903k0380m789J6442k5409k3592K923L6643K5106
8047A04406P466J053K2079K5951J0406J4995O433k182k0360L443j336J3590J7488
$$ plain form
8034 203432 185743 165861 168907 174765 171797 145213 127311 104092 87279 98251 111979 106104
8022 106104 107060 83319 71894 55955 42763 48677 31277 28928 32338 34696 18979 20241 31877
8009 31877 25413 14132 29382 23003 18733 4074 9002 6994 -8445 4692 6094 22345 32801
7996 32801 27712 53204 62583 86892 70497 38732 44663 62218 52168 51588 54128 52387 31817
7983 31817 -11141 -28365 -8872 -12868 -11132 4805 20714 18112 -5928 -11456 -6033 -1650 26689
7970 26689 33777 -995 -34655 -55968 -40737 -5278 -5206 12375 32048 23260 11173 16836 8687
7957 8687 -2402 -20629 -12496 2260 4045 16537 19874 28185 19773 25812 26154 20195 24134 12515
7943 12515 -10213 -25168 -20088 -25437 -16348 -6752 4376 1793 -4844 -13620 -669 4524 23188
$$ packed form
8034B03432j7689j9882L046N858k968k6584j7902k3219j6813J0972J3728n875
8022A06104R56k3741j1425j5939j3192N914j7400k349L410K358j5717J262J1636
8009C1877o464j1281J5250o379m270j4659M928k008j5439J3137J402J6251J0456
7996C2801n089K5492R379K4309j6395l1765N931J7555j0050n80K540j741k0570
7983C1817m2958j7224J9493l996J736J5937J5909k602k4040n528N423M383K8339
7970B6689P088l4772l3660k1313J5231L5459P2J7581J9673q788j2087N663q149
7957H687j1089j8227Q133J4756J785J2492L337Q311q412O039L42n959L939j1619
7943A2515k2728j4955N080n349R089R596J1128k583o637q776J2951N193J8664
$$ plain form
7930 23188 15966 10702 3870 2074 13890 29477 22535 -2930 5400 44712 63764 56965 52506
7917 52506 56795 30405 11049 7356 878 29525 22282 5200 -4628 -21351 -3547 32606 43326
7904 43326 18440 13417 81 4383 -4326 -25253 -47682 -49905 -51844 -39584 -22087 -10875 -22657
7891 -22657 -24835 -27926 421 6643 -18182 -43472 -40689 -35668 -41116 -34847 -27476 -20904 -30365 -33299
7877 -33299 -21184 -16667 -14166 -68 3522 2850 7910 3336 -1653 11332 10823 8405 2816 11906
7863 11906 -908 -11157 -37115 -43221 -45362 -63903 -51119 -28791 -31041 -36668 -57845 -57402 -37316
7850 -37316 -32905 -40190 -33334 -34946 -15560 9213 5019 -4960 -7711 -19168 -28133 -15251 -23940 -30724
7836 -30724 -5218 18903 11279 -776 -19905 -28827 -26349 -15759 -17510 -23164 -31807 -45871 -5333
$$ packed form
7930B3188p222n264o832j796J1816J5587o942k5465Q330L9312J9052o799m459
7917E2506M289k6390j9356l693o478K8647p243j7082r828j6723J7804L6153J0720
7904D3326k4886n023j3336M302q709k0927k2429k223j939J2260J7497J1212j1782
7891b2657k178l091K8347O222k4825k5290K783N021n448O269P371O572r461k934
7877c3299J2115M517K501J4098L590o72N060m574m989J2985n09k418n589R090
7863A1906j2814j0249k5958o106k141j8541J2784K2328k250n627k1177M43K0086
7850c7316M411p285O856j612J9386K4773m194r979k751j1457q965J2882q689o784
7836c0724K5506K4121p624j2055j9129q922K478J0590j751n654q643j4064M0538
$$ plain form
7823 -5333 12920 -7200 -24820 -44324 -49262 -20299 -13018 -10705 -10007 -20632 -20607 -26780 -32554 -38519
7809 -38519 -38167 -32881 -49418 -44788 -21790 -24342 -37685 -32980 -14144 -17391 11340 26440 -3168
7796 -3168 -36818 -17446 1755 -11341 -21635 -27474 -25449 -21718 -16565 -3692 753 -14354 2386
7783 2386 -6017 -22318 -23754 -1921 -7511 -13413 -16619 -11628 -8493 -2657 -3367 -17246 -23935 -32020
7769 -32020 -20564 -18502 -19448 6034 17742 20549 46544 63504 51340 24955 4535 -591 14234
7756 14234 15434 3806 19830 29723 14249 -12827 5667 -4339 -11802 -13823 -4324 14595 21116
7743 21116 17852 3186 -4311 -3279 23588 8433 3747 21420 34701 27537 14244 23480 26584
7730 26584 12148 1507 -8012 -2023 -17665 -34948 -25322 -41257 -43364 -13701 5522 24100 27760
$$ packed form
7823e333J8253k0120j7620j9504m938K8963P281K313O98j0625K5o173n774n965
7809c8519L52N286j6537M630K2998k552j3343M705J8836l247K8731J5100k9608
7796c168l3650J9372J9201j3096j0294n839K025L731N153J2873M445j5107J6740
7783B386q403j6301j436K1833n590n902l206M991L135N836p10j3879o689q085
7769c2020J1456K062r46K5482J1708K807K5995J6960j2164k6385k0420n126J4825
7756A4234J200j1628J6024R893j5474k7076J8494j0006p463k021R499J8919O521
7743B1116l264j4666p497J032K6867j5155m686J7673J3281p164j3293R236L104
7730B6584j4436j0641r519N989j5642j7283R626j5935k107K9663J9223J8578L660
$$ plain form
7717 27760 -25992 -44160 -17056 8943 38998 17687 -4508 -23631 -37389 -21591 -36232 -53989
7705 -53989 -40422 -12117 -1254 -22515 -10538 -39748 -73938 -66906 -58951 -57651 -18092 -8277 -18064
7692 -18064 -33727 -33303 -53516 -58184 -29109 -19727 -8633 -3945 -10210 -37511 -53366 -24066 -32072
7679 -32072 -24987 -30679 -61937 -78218 -40052 -17319 -263 16493 22393 14987 10910 -3257 -31114
7666 -31114 -38940 -37809 -54886 -64923 -60977 -37813 -40874 -26895 -27546 -45992 -35568 -13306 -5411
7653 -5411 -13247 -28902 -10911 9339 5620 -1525 -5338 -16701 -17051 -26952 -38725 -65614 -60146 -50380
7639 -50380 -58013 -44518 -47140 -56646 -53618 -24616 10188 6445 -11527 -22242 -12286 13877 18802
7626 18802 -1365 9909 12661 1721 12341 -7375 -22683 -25517 8917 11495 15407 13028 -459
$$ packed form
7717B7760n3752j8168K7104K5999L0055k1311k2195j9123j3758J5798j4641j7757
7705e3989J3567K8305J0863k1261J1977k9210l4190P032P955J300L9559R815r787
7692a8064j5663M24k0213m668K9075R382J1094M688o265k7301j5855K9300q006
7679c2072P085n692l1258j6281L8166K2733J7056J6756N900p406m077j4167k7857
7666c1114p826J131j7077j0037L946K3164l061J3979o51j8446J0424K2262P895
7653e411p836j5655J7991K0250l719p145l813j1363l50r901j1773k6889N468R766
7639e0380p633J3495k622r506L028K9002L4804l743j7972j0715R956K6163M925
7626A8802k0167J1274K752j0940J0620j9716j5308k834L4434K578L912k379j3487
$$ plain form
7613 -459 -43229 -53759 -38711 -32276 -24885 -16867 -19226 -20700 -22678 -11332 14374 -8883 -11824 9046
7599 9046 3393 4447 28 -17546 -23466 -27748 -52349 -52726 -29498 -8356 256 -23233 -50209 -56910
7585 -56910 -51992 -68245 -65130 -51483 -30152 -16896 -11058 -16328 -8198 -2726 -14276 -18739 -16273
7572 -16273 -33251 -32810 -49110 -54109 -63756 -64989 -73615 -41329 1687 -42680 -66032 -42544 -15751
7559 -15751 -18997 -42399 -17573 -10782 -8900 -16418 -19291 -25127 -37425 -16307 -4648 5643 6312
7546 6312 -25190 -20477 -16103 -19365 -12827 -9591 -32570 -65189 -67174 -45416 -27761 -17260 -16112
7533 -16112 -25289 -28728 -28390 -10535 -9441 -22419 -53918 -62275 -61910 -47000 -25945 -16600 5594 25262
7519 25262 -2436 -34236 -52187 -50335 -20034 -3886 -2066 -28455 -36297 -30607 -22889 -10668 -14738
$$ packed form
7613d59m2770j0530J5048O435P391Q018k359j474j978J1346K5706k3257k941K0870
7599I046n653J054m419j7574n920m282k4601l77K3228K1142Q612k3489k6976o701
7585e6910M918j6253L115J3647K1331J3256N838n270Q130N472j1550m463K466
7572a6273j6978M41j6300m999r647j233q626L2286M3016m4367k3352K3488K6793
7559a5751l246k3402K4826O791J882p518k873n836j2298K1118J1659J0291O69
7546F312l1502M713M374l262O538L236k2979l2619j985K1758J7655J0501J148
7533a6112r177l439L38J7855J094j2978l1499q357L65J4910K1055R345K2194J9668
7519B5262k7698l1800j7951J852L0301J6148J820k6389p842N690P718J2221m070
$$ plain form
7506 -14738 -29606 -30194 -33924 -10353 -13531 -53274 -62277 -43876 -51303 -69615 -63799 -65115 -51379
7493 -51379 -25976 -11944 -26794 -18696 4832 20406 31296 16615 15523 29399 10895 -21463
7481 -21463 -35698 -26048 -26883 -38232 -34144 -17273 -6526 17719 34995 3376 -42333 -69756 -71621
7468 -71621 -57199 -42289 -52231 -19041 -381 -20706 -44270 -23623 1726 6975 8459 3213 -24669
7455 -24669 -30781 2831 11418 6805 3068 16969 8068 -5899 -23307 -26609 -12725 10621 17663
7442 17663 6750 19600 19082 -7702 -7149 -1081 8272 16016 18793 15984 17479 -12836 -43417 -37523
7428 -37523 -18610 -15951 -12301 -11075 -6246 22549 30762 14382 -14654 -21515 -52872 -45852 -31532
7415 -31532 -21727 -18098 -10997 -6912 -33675 -54029 -58651 -51696 -50646 -67863 -78632 -69471 -51371
$$ packed form
7506a4738j4868n88l730K3571l178l9743r003J8401p427j8312N816j316J3736
7493e1379K5403J4032j4850Q098K3528J5574J0890j4681j092J3876j8504l2358
7481b1463j4235R650q35j1349M088J6871J0747K4245J7276l1619m5709k7423j865
7468g1621J4422J4910r942L3190J8660k0325k3564K0647K5349N249J484n246k7882
7455b4669o112L3612Q587m613l737J3901q901j3967j7408l302J3884K3346P042
7442A7663j0913J2850n18k6784N53O068R353P744K777k809J495l0315l0581N894
7428c7523J8913K659L650J226M829K8795Q213j6380k9036o861l1357P020J4320
7415c1532R805L629P101M085k6763k0354m622O955J050j7217j0769R161J8100
$$ plain form
7402 -51371 -46806 -47422 -46862 4695 17221 -21310 -30571 -26249 -36044 -27948 -28736 -27801 -18738 -11586 1918
7387 1918 7097 4822 -42464 -66414 -51290 -25869 -23525 -3434 -9667 -12648 -17760 -9001 -12541 -2544
7373 -2544 18083 34798 19446 7853 -24430 -20999 -13494 -16586 -28650 -37374 -58866 -77679 -69097
7360 -69097 -65416 -60803 -49421 -26588 -45827 -57695 -41328 -34544 -29173 -9944 -10950 6261 -1655
7347 -1655 4775 -1993 -3283 -32115 -53932 -52466 -40271 -16688 -6200 -25098 -25010 -4909 -6132 -5521
7333 -5521 -3247 26661 12787 -13119 -34667 -36477 -25343 -24627 -28757 -14002 -12886 -3921 -11506 -23849
7319 -23849 -36641 -36451 -10286 9242 6881 -10426 -1627 14635 19552 -24519 -29831 -23223 -28426
7306 -28426 -8025 2396 3056 -6952 -26084 -57611 -52861 -61985 -67122 -66757 -37182 -19800 -27731
$$ packed form
7402e1371M565o16N60N1557J2526l8531r261M322r795Q096p88R35R063P152J3504
7387A918N179k275m7286k3950J5124K5421K344K0091o233k981n112Q759l540R997
7373b544K0627J6715j5352j1593l2283L431P505l092j2064q724k1492j8813Q582
7360f9097L681M613J1382K2833j9239j1868J6367O784N371J9229j006J7211p916
7347a655O430o768j290k8832k1817J466J2195K3583J0488j8898Q8K0101j223O11
7333e521K274K9908j3874k5906k1548j810J1134P16m130J4755J116Q965p585j2343
7319b3849j2792J90K6165J9528k361j7307Q799J6262M917m4071n312O608n203
7306b8426K0401J0421O60j0008j9132l1527M750r124n137L65K9575J7382p931
$$ plain form
7293 -27731 -31144 -27896 -30682 -16920 -24152 -18145 -16567 640 -9718 -3587 -38618 -32869 -29496 -17684
7279 -17684 -17036 -24019 -10527 -20190 1528 7152 15273 -12075 -33497 -47611 -23228 -19257 -16710
7266 -16710 -11216 567 8410 15564 21743 4631 1835 -1564 -3662 -19331 -50231 -63463 -47238
7253 -47238 -31213 -14287 -6863 -27939 -49713 -50993 -54772 -43023 -38766 -46960 -27603 -7267 -46875
7240 -46875 -71826 -36117 -4265 -1526 -23060 -23769 -24684 -12283 -8636 -4874 2307 -28414 -52296
7227 -52296 -32703 -2438 -179 1137 31824 47217 50170 28872 -33076 -57826 -41661 -36088 -17781
7214 -17781 -22329 -21814 -22274 -37498 -54433 -43448 -34673 -58262 -46020 -6262 -23924 -41086 -37586
7201 -37586 -39487 -31025 -23681 -33523 -49842 -42313 -45477 -59313 -50040 -16131 -12109 -3459 -2298 -6806
$$ packed form
7293b7731l413L248k786J3762p232O007J578J7207j0358O131l5031N749L373J1812
7279a7684O48o983J3492r663K1718N624Q121k7348k1422j4114K4383L971K547
7266a6710N494J1783P843P154O179j7112k796l399k098j5669l0900j3232J6225
7253d7238J6025J6926P424k1076k1774j280l779J1749M257q194J9357K0336l9608
7240d6875k4951L5709L1852K739k1534p09r15J2401L647L762P181l0721k3882
7227e2296J9593L0265K259J316L0687J5393K953k1298o1948k4750J6165N573J8307
7214a7781m548N15m60j5224j6935J0985Q775k3589J2242L9758j7662j7162L500
7201c7586j901Q462P344r842j6319P529l164j3836R273L3909M022Q650J161m508
$$ plain form
7187 -6806 -21103 -54016 -36796 -15220 -33512 -10680 1554 1488 -8313 -2084 -7463 -36288 -50579
7174 -50579 -49979 -48556 -53099 -34125 -18932 8975 -16517 -14346 -26173 -38933 -23484 -10046 -16605
7161 -16605 -19984 -28197 -28457 -28209 -42349 -62049 -44372 -23980 -17857 -54888 -69326 -37301 -40121
7148 -40121 -44531 -45220 -40768 -59364 -55862 -52417 -22406 -20545 -22485 -34414 -12455 14044 29655
7135 29655 4060 -7683 -5591 2965 -30296 -27564 7079 23640 31178 23833 5322 10125 7458
7122 7458 -30818 -41462 -41821 -53680 -46093 -32154 -20234 -11848 -17442 -26721 -38331 -50313 -30710
7109 -30710 3531 -7908 -28798 -35626 -24945 -12037 -19729 -2527 8592 4074 -9554 -22354
7097 -22354 -50445 -66787 -64223 -45295 -49032 -66005 -53915 -36335 -20809 -27276 -38827 -49169
$$ packed form
7187f806j4297l2913J7220K1576j8292K2832J2234o6r801O229n379k8825j4291
7174e0579O00J423m543J8974J5193K7907k5492K171j1827j2760J5449J3438o559
7161a6605l379q213k60K48j4140j9700J7677K0392O123l7031j4438L2025k820
7148d0121m410o89M452j8596L502L445L0011J861j940j1929K1959K6499J5611
7135B9655k5595j1743K092Q556l3261K732L4643J6561P538p345j8511M803k667
7122G458l8276j0644l59j1859P587J3939J1920Q386n594r279j1610j1982J9603
7109c0710L4241j1439k0890o828J0681J2908p692J7202J1119m518j3628j2800
7097b2354k8091j6342K564J8928l737j6973J2090J7580J5526o467j1551j0342
$$ plain form
7085 -49169 -26773 -12148 -1582 -34398 -50738 -32464 -37987 -39993 -38178 -38517 -44084 -20848 -6744
7072 -6744 -30527 -42902 -34562 -27541 -27019 -24812 -11363 -18359 -22584 -13427 -4535 -4941 -21483 -21708 -16885
7057 -16885 -37053 -61714 -39156 -23117 -16401 -1485 -60 -26733 -54853 -38780 1209 17254
7045 17254 25182 14988 -1714 10430 10646 2915 -10908 -10704 4364 21465 3840 7528 -3603
7032 -3603 -21097 -4486 13936 25291 32748 24388 -1933 -21256 -32341 -21448 -6671 -3345 -34577
7019 -34577 -49209 -29662 -18358 -55487 -63775 -54586 -26262 -2032 4714 954 -13432 402 2862
7006 2862 1206 -267 -6560 775 320 3907 -31887 -42192 -25476 18271 7840 -4704 -18661
6993 -18661 1917 26659 32183 24111 11156 -14425 -8854 -15238 -18968 -18596 13917 14814 18235 3360
$$ packed form
7085d9169K2396J4625J0566l2816j6340J8274n523k006J815l39n567K3236J4104
7072f744k3783j2375Q340P021N22K207J3449o996m225R157Q892m06j6542k25M823
7057a6885k0168k4661K2558J6039O716J4916J425k6673k8120J6073L9989J6045
7045A7254P928j0194j6702J2144K16p731j3823K04J5068J7101j7625L688j1131
7032c603j7494J6611J8422J1355P457q360k6321j9323j1085J0893J4777L326l1232
7019c4577j4632J9547J1304l7129q288R189K8324K4230O746l760j4386J3834K460
7006B862j656j473o293P335m55L587l5794j0305J6716M3747j0431j2544j3957
6993a8661K0578K4742N524q072j2955k5581N571o384l730L72L2513Q97L421j4875
$$ plain form
6979 3360 6161 11878 -669 4763 14657 74794 126077 138141 137640 113303 84976 87385 95014 77238
6965 77238 41857 21299 6194 -15904 -7710 7312 -5673 4077 21424 -3913 -17756 -568
6953 -568 11186 22242 27850 35142 25867 30166 40113 24595 17829 2263 551 -17644 -13544 26878
6939 26878 34345 15873 42534 37895 20000 15761 -13033 -39319 -29309 -23326 -50319 -62863 -34540
6926 -34540 -11886 -10340 -13420 1448 -22118 -29369 -6343 11030 -10306 -40165 -16536 15753
6914 15753 21383 17850 7431 -9428 -14065 -12695 -15463 -3484 29786 36898 11315 3532 -10547
6901 -10547 -18418 -29991 -47036 -56354 -28772 -3338 -7745 -1826 -12888 -11725 -9735 20032 35898
6888 35898 71359 130814 198898 300454 325758 278645 204765 132477 65670 18504 16414 12940
$$ packed form
6979C360K801N717j2547N432R894O0137N1283J2064n01k4337k8327K409P629j7776
6965G7238l5381k0558j5105k2098Q194J5022j2985R750J7347k5337j3843J7188
6953e68J1754J1056N608P292r275M299R947j5518o766j5566j712j8195M100M0422
6939B6878P467j8472K6661m639j7895m239k8794k6286J0010N983k6993j2544K8323
6926c4540K2654J546l080J4868k3566p251K3026J7373k1336k9859K3629L2289
6914A5753N630l533j0419j6859m637J370k768J1979L3270P112k5583p783j4079
6901a0547p871j1573j7045r318K7582K5434m407N919j1062J163J990K9767J5866
6888C5898L5461N9455O8084J01556K5304m7113p3880p2288o6807m7166k090l474
$$ plain form
6876 12940 -297 -462 11373 24752 13778 -30190 -54613 -60249 -47962 -31683 -3587 17947
6864 17947 15259 18274 -2717 -4939 6444 22779 32654 26669 4008 2120 -2141 36797 69423
6851 69423 76126 95309 61593 47453 63667 57412 40224 26380 4557 1091 -19579 -25814 -12817
6838 -12817 -10015 -15134 -22029 7899 29771 32012 25762 21026 -3048 -25951 -10973 -867 3338
6825 3338 -1530 -958 -7115 -25511 -28068 -29399 -29957 -30215 -24414 1570 21881 6357 -8178 -35480
6811 -35480 -18709 20299 47695 39922 -8605 -29039 -6681 -16179 -32885 -33265 -30792 -33764 -42941
6798 -42941 -45870 -19462 11588 -2099 -6732 -3238 -5204 -28905 -32632 -38002 -52782 -30939 -37930
6785 -37930 -20549 -19828 -34554 -36031 -53990 -44819 -22060 -2360 -21950 -36187 -35247 -45392 -55261
$$ packed form
6876A2940j3237j65J1835J3379j0974m3968k4423n636J2287J6279K8096K1534
6864A7947k688L015k0991k222J1383J6335R875n985k2661j888m261L8938L2626
6851F9423O703J9183l3716j4140J6214o255j7188j3844k1823l466k0670o235J2997
6838a2817K802n119o895K9928K1872K241o250m736k4074k2903J4978J0106M205
6825C338m868N72o157j8396k557j331n58k58N801K5984K0311j5524j4535k7302
6811c5480J6771L9008K7396p773m8527k0434K2358r498j6706l80K473k972r177
6798d2941k929K6408L1050j3687m633L494j966k3701l727n370j4780K1843o991
6785c7930J7381P21j4726j477j7959R171K2759J9700j9590j4237R40j0145r869
$$ plain form
6772 -55261 -35035 -22804 -17835 -12714 7510 -12946 -27722 -44133 -48254 -41470 -40549 -47622 -62967
6759 -62967 -25917 4223 7452 3278 13247 7508 -3143 -2676 -20024 -16818 -3567 -23410 -42392
6746 -42392 -43737 -23117 -20309 -43367 -49014 -46976 -45818 -35716 -27009 -14378 -3412 -17543 -3912
6733 -3912 9615 1998 -6070 -4695 -2869 -5783 -27313 -64598 -69932 -40577 -7379 15742 55002
6720 55002 90527 95079 69095 26793 17702 20308 20912 -12650 -30562 -13332 -148 30341 44293
6707 44293 27264 17883 8641 15431 20575 -5077 -33566 -21582 -26404 -50092 -45279 -47386 -45472
6694 -45472 -42148 -34834 -54116 -50552 -57610 -56884 -32960 -31444 -23190 2191 -22228 -44332 -51879 -35909
6680 -35909 -34149 -51508 -23601 -29964 -9750 641 -18680 -41521 -39651 -18432 9685 -9124
$$ packed form
6772e5261K0226J2231M969N121K0224k0456j4776j6411m121O784R21p073j5345
6759f2967L7050L0140L229m174R969n739j0651M67j7348L206J3251j9843j8982
6746d2392j345K0620K808k3058n647K038J158J0102Q707J2631J0966j4131J3631
6733c912J3527p617q068J375J826k914k1530l7285n334K9355L3198K3121L9260
6720E5002L5525M552k5984m2302r091K606O04l3562j7912J7230J3184L0489J3952
6707D4293j7029r381r242O790N144k5652k8489J1984m822k3688M813k107J914
6694d5472L324P314j9282L564p058P26K3924J516Q254K5381k4419k2104p547J5970
6680c5909J760j7359K7907o363K0214J0391j9321k2841J870K1219K8117j8809
$$ plain form
6668 -9124 -40195 -54023 -61413 -37328 -26984 -21855 8587 32821 24664 5159 3248 -6837 3663
6655 3663 -13162 -48936 -46972 -37849 -22135 434 -22860 -56562 -67363 -69856 -51187 -2702 17852
6642 17852 -7420 -11704 -15350 -27088 -25122 4321 7679 -158 -20436 -15313 -12035 2098 8202
6629 8202 17057 6985 -13837 -41608 -40514 -55788 -47125 -41531 -31368 -53631 -71202 -43689 -16963
6616 -16963 -2217 6872 -11979 3379 -3791 -17798 -22370 -34985 -43693 -26671 -36444 -34088 -20226
6603 -20226 -2572 -7419 -8530 -8728 -17462 -28728 -46514 -28416 -22806 -35523 -37979 -18126 -28374
6590 -28374 -45743 -47219 -5930 15752 -4322 -32229 -17797 -4823 -16702 -51419 -41268 -34579
6578 -34579 -23565 -20752 -13452 -11232 17727 19575 1632 -14380 5975 15713 -24279 -21241 -3900
$$ packed form
6668i124l1071j3828p390K4085J0344N129L0442K4234q157j9505j911j0085J0500
6655C663j6825l5774J964R123J5714K2569k3294l3702j0801k493J8669M8485K0554
6642A7852k5272m284l646j1738J966K9443L358p837k0278N123L278J4133O104
6629H202Q855j0072k0822k7771J094j5274Q663N594J0163k2263j7571K7513K6726
6616a6963J4746R089j8851J5358p170j4007m572j2615q708J7022r773K356J3862
6603b0226J7654m847j111j98q734j1266j7786J8098N610j2717k456J9853j0248
6590b8374j7369j476M1289K1682k0074k7907J4432J2974j1879l4717J0151O689
6578c4579J1014K813P300K220K8959J848j7943j6012K0355R738l9992L038J7341
$$ plain form
6565 -3900 -5001 -18524 523 8310 -20373 -30022 -8800 -7453 -5623 -7496 -26908 -38890 -28241
6552 -28241 289 -16422 -35969 -29966 -7907 7867 -2454 -35639 -65620 -70220 -36602 -28536
6540 -28536 -22727 -24181 -38294 -29524 -35938 -27892 -19352 -3199 -644 17783 6821 -46668 -67830
6527 -67830 -40501 -46158 -69519 -79574 -82699 -78156 -70732 -43978 -51276 -30500 -48585 -44140 -47809
6514 -47809 -37730 -21375 -40890 -57150 -49007 -21802 1889 -26739 -15890 -24942 -44346 -36503
6502 -36503 -27426 -20155 -3305 -17343 -43886 -32280 1921 1523 -3401 1897 6685 2719 -28912
6489 -28912 -22404 -22326 -8130 24895 38137 -413 -28161 302 9803 -23178 -40408 -40691 -41085 -54227
6475 -54227 -60980 -77056 -77150 -83044 -69264 -47207 -46427 -17338 -1448 -6340 -24520 -12484 -18856 -3666
$$ packed form
6565c900j101j3523J9047P787k8683r649K1222J347J830j873j9412j1982J0649
6552b8241K8530j6711j9547O003K2059J5774j0321l3185k9981m600L3618Q066
6540b8536N809j454j4113Q770o414Q046Q540J6153K555J8427j0962n3489k1162
6527f7830K7329n657k3361j0055l125M543P424K6754p298K0776j8085M445l669
6514d7809J0079J6355j9515j6260Q143K7205K3691k8628J0849r052j9404P843
6502c6503R077P271J6850j4038k6543J1606L4201l98m924N298M788l966l1631
6489b8912O508P8J4196L3025J3242l8550k7748K8463R501l2981j7230k83l94j3142
6475e4227o753j6076r4n894J3780K2057P80K9089J5890m892j8180J2036o372J5190
$$ plain form
6461 -3666 2139 -15711 -39872 -32527 -15960 -25334 -18588 -22137 -19933 -24412 -26833 -19197 -12838 -17599
6447 -17599 -44664 -54381 -50276 -22703 -531 22120 12419 -7849 -802 -6169 15828 22248 29456
6434 29456 20684 -3679 -28555 -29090 -27670 -25568 -51114 -45447 -33921 -44579 -43557 -24947 13782
6421 13782 24365 33200 28299 10390 21183 19094 -598 -36582 -58397 -45861 -43791 -54277 -38760
6408 -38760 -27923 -11489 -26207 -41848 -49742 -27821 6065 26022 24952 16950 19626 22483 8260
6395 8260 -14387 13098 7268 -16296 -9974 4873 8826 9307 12271 7867 24016 14530 4550 -20512
6381 -20512 -53040 -36738 3492 -5487 -43739 -48908 -42080 -21262 -16881 -22323 -18781 -23376 -21446
6368 -21446 -5540 5071 -8679 -5386 14526 8110 17570 25949 16348 22489 3183 9555 2922
$$ packed form
6461c666N805j7850k4161P345J6567r374O746l549K204m479k421P636O359m761
6447a7599k7065r717M105K7573K2172K2651r701k0268P047n367K1997O420P208
6434B9456q772k4363k4876n35J420K102k5546N667J1526j0658J022J8610L8729
6421A3782J0583Q835m901j7909J0793k089j9692l5984k1815J2536K070j0486J5517
6408c8760J0837J6434j4718j5641p894K1921L3886J9957j070q002K676K857j4223
6395H260k2647K7485n830k3564O322J4847L953M81K964m404J6149r486r980k5062
6381b0512l2528J6302M0230q979l8252n169O828K0818M381n442L542m595J930
6368b1446J5906J0611j3750L293J9912o416R460Q379r601O141j9306O372o633
$$ plain form
6355 2922 8152 22685 6784 8808 8744 -27950 -17316 6361 23876 17731 7204 10305 6026 6239
6341 6239 6597 5845 -23855 -40331 -16084 -4497 5855 -20057 -30470 -31569 -40251 -30920 -31015 -18545
6327 -18545 -50237 -47677 -32740 -26824 -50045 -58259 -27198 -12595 -59133 -69362 -29360 6839
6315 6839 3950 -865 2978 16969 9045 3762 -14709 -15359 -29711 -47464 -39709 -31323 -11529 -425
$$ packed form
6355B922N230J4533j5901K024o4l6694J0634K3677J7515o145j0527L101m279K13
6341F239L58p52k9700j6476K4247J1587J0352k5912j0413j099q682R331r5J2470
6327a8545l1692K560J4937N916k3221q214L1061J4603m6538j0229M0002L6199
6315F839k889m815L843J3991p924n283j8471o50j4352j7753P755Q386J9794J1104
$$ [...]
##END NTUPLES=NMR SPECTRUM
##END=
