##TITLE=Analysis number 308002
Compound Code cc 40303
Book Reference 259/190
Project Code adrs
Chemist Name emmab
##JCAMPDX= 6.0         $$ Bruker NMR JCAMP-DX V2.0
##DATA TYPE= NMR SPECTRUM
##DATA CLASS= NTUPLES
##ORIGIN= Bruker BioSpin GmbH
##OWNER= NMR
$$ XWIN-NMR		Version 3.5
$$ Wed May 18 16:04:41 2005 GMT Daylight Time (UT+1h)  MAYBRIDGE\NMR@NMR_250MHZ
##.OBSERVE FREQUENCY= 250.131544655141
##.OBSERVE NUCLEUS= ^1H
##.ACQUISITION MODE= SIMULTANEOUS (DQD)
##.ACQUISITION SCHEME= undefined
##.AVERAGES= 16
##.DIGITISER RES= 18
##SPECTROMETER/DATA SYSTEM= dpx250
##.PULSE SEQUENCE= zg30
##.SOLVENT NAME= CDCl3
##.SHIFT REFERENCE= (INTERNAL, CDCl3, 0, 16.4499)
##AUDIT TRAIL= $$ (NUMBER, WHEN, WHO, WHERE, WHAT)
$$ ##TITLE= Audit trail, XWIN-NMR		Version 3.5
$$ ##JCAMPDX= 5.01
$$ ##ORIGIN= Bruker BioSpin GmbH
$$ ##OWNER= NMR
$$ C:\u/data/dgb/nmr/ADRS/3140/pdata/1/auditp.txt
$$ ##AUDIT TRAIL=  $$ (NUMBER, WHEN, WHO, WHERE, WHAT)
(   1,<2005-05-18 16:04:23.35 +100>,<MAYBRIDGE\NMR>,<NMR_250MHZ>,
      <created by zg, POWCHK disabled, PULCHK disabled
       configuration hash MD5:
       62 19 C7 07 E1 42 D1 B7 37 6C 3D D0 77 39 F9 E6
       data hash MD5: 64K
       43 55 E6 99 CC 2C 74 4A E3 15 BD 4D FA 06 A1 80>)
(   2,<2005-05-18 16:04:33.98 +100>,<MAYBRIDGE\NMR>,<NMR_250MHZ>,
      <Start of raw data processing
       ef LB = 0.3 FT_mod = 6 PKNL = 1 SI = 32K 
       data hash MD5: 32K
       02 01 33 6D 2A 64 C6 3A 80 0C D1 0F A3 3C 58 59>)
(   3,<2005-05-18 16:04:35.90 +100>,<MAYBRIDGE\NMR>,<NMR_250MHZ>,
      <apk 
       data hash MD5: 32K
       F0 3B 00 D1 B1 40 8A A1 4D AA 01 AC 50 2B 8E BC>)
(   4,<2005-05-18 16:04:36.59 +100>,<MAYBRIDGE\NMR>,<NMR_250MHZ>,
      <abs ABSG = 5 
       data hash MD5: 32K
       C6 67 D0 EA 3C 5C 51 07 89 B4 B9 FD D8 F9 47 5F>)
$$ ##END=
$$ 
$$ hash MD5
$$ 7B E7 48 10 D8 EC CA 1C 33 29 5B 7F F1 CA 6E B7
##$RELAX= 
##$RELAX= 
##$RELAX= 
##$RELAX= 
##$RELAX= 
##$RELAX= 
##$RELAX= 
$$ Bruker specific parameters
$$ --------------------------
##$DU= <C:\u>
##$EXPNO= 3140
##$NAME= <ADRS>
##$PROCNO= 1
##$TYPE= <nmr>
##$USER= <dgb>
##$AMP= (0..31)
100 100 100 100 100 100 100 100 100 100 100 100 100 100 100 100 100 100 
100 100 100 100 100 100 100 100 100 100 100 100 100 100 
##$AQSEQ= 0
##$AQ_mod= 3
##$AUNM= <au_zg>
##$AUTOPOS= <51 >
##$BF1= 250.13
##$BF2= 250.13
##$BF3= 250.13
##$BF4= 250.13
##$BF5= 500.13
##$BF6= 500.13
##$BF7= 500.13
##$BF8= 500.13
##$BYTORDA= 1
##$CFDGTYP= 0
##$CFRGTYP= 5
##$CHEMSTR= <none>
##$CNST= (0..31)
1 1 145 1 1 1 1 1 1 1 1 1 1 1 1 1 1 1 1 1 1 1 1 1 1 1 1 1 1 1 1 1 
##$CPDPRG= <>
##$CPDPRG1= <>
##$CPDPRG2= <>
##$CPDPRG3= <>
##$CPDPRG4= <mlev>
##$CPDPRG5= <mlev>
##$CPDPRG6= <mlev>
##$CPDPRG7= <mlev>
##$CPDPRG8= <mlev>
##$CPDPRGB= <>
##$CPDPRGT= <>
##$D= (0..31)
0 1 0 0 0 0 0 0 0 0.06 0 0 0 0 0 0 0.0002 0 0 0 0 0 0 0 0 0 0 0 0 0 0 
0 
##$DATE= 1116428662
##$DBL= (0..7)
120 120 120 120 120 120 120 120 
##$DBP= (0..7)
150 150 150 150 150 150 150 150 
##$DBP07= 0
##$DBPNAM0= <>
##$DBPNAM1= <>
$$ [...]
##$SUBNAM7= <"">
##$SUBNAM8= <"">
##$SUBNAM9= <"">
##$SW= 20.6930455092707
##$SWIBOX= (0..15)
0 0 3 0 0 0 0 0 0 0 0 0 0 0 0 0 
##$SW_h= 5175.983436853
##$TD= 65536
##$TD0= 1
##$TE= 296.16
##$TE2= 300
##$TE3= 300
##$TEG= 300
##$TL= (0..7)
0 120 120 120 120 120 120 120 
##$TP= (0..7)
150 150 150 150 150 150 150 150 
##$TP07= 0
##$TPNAME0= <>
##$TPNAME1= <>
##$TPNAME2= <>
##$TPNAME3= <>
##$TPNAME4= <>
##$TPNAME5= <>
##$TPNAME6= <>
##$TPNAME7= <>
##$TPOAL= (0..7)
0.5 0.5 0.5 0.5 0.5 0.5 0.5 0.5 
##$TPOFFS= (0..7)
0 0 0 0 0 0 0 0 
##$TUNHIN= 0
##$TUNHOUT= 0
##$TUNXOUT= 0
##$USERA1= <user>
##$USERA2= <user>
##$USERA3= <user>
##$USERA4= <user>
##$USERA5= <user>
##$V9= 5
##$VALIST= <valist>
##$VCLIST= <CCCCCCCCCCCCCCC>
##$VD= 0
##$VDLIST= <DDDDDDDDDDDDDDD>
##$VPLIST= <PPPPPPPPPPPPPPP>
##$VTLIST= <TTTTTTTTTTTTTTT>
##$WBST= 1024
##$WBSW= 4
##$XGAIN= (0..3)
0 0 0 0 
##$XL= 0
##$YL= 0
##$YMAX_a= 367546
##$YMIN_a= -302741
##$ZGOPTNS= <>
##$ZL1= 120
##$ZL2= 120
##$ZL3= 120
##$ZL4= 120
##$ABSF1= 16.44988
##$ABSF2= -4.243292
##$ABSG= 5
##$ABSL= 3
##$ALPHA= 0
##$AQORDER= 0
##$ASSFAC= 0
##$ASSFACI= 0
##$ASSFACX= 0
##$ASSWID= 0
##$AUNMP= <proc_1d>
##$AZFE= 0.1
##$AZFW= 0.1
##$BCFW= 0
##$BC_mod= 0
##$BYTORDP= 0
##$COROFFS= 0
##$CY= 12.5
##$DATMOD= 1
##$DC= 0
##$DFILT= <>
##$DTYPP= 0
##$F1P= 14.0000005364418
##$F2P= -0.99999901652339
##$FCOR= 0.5
##$FTSIZE= 32768
##$FT_mod= 6
##$GAMMA= 0
##$GB= 0
##$INTBC= 1
##$INTSCL= 1
##$ISEN= 128
##$LB= 0.3
##$LEV0= 0
##$LPBIN= 0
##$MAXI= 10000
##$MC2= 0
##$MEAN= 0
##$ME_mod= 0
##$MI= 0
##$NCOEF= 0
##$NC_proc= -3
##$NLEV= 6
##$NOISF1= 0
##$NOISF2= 0
##$NSP= 0
##$NTH_PI= 0
##$NZP= 0
##$OFFSET= 16.44988
##$PC= 1
##$PHC0= -67.52624
##$PHC1= 2.866695
##$PH_mod= 1
##$PKNL= yes
##$PPARMOD= 0
##$PSCAL= 4
##$PSIGN= 0
##$REVERSE= no
##$SF= 250.130018038776
##$SI= 32768
##$SIGF1= 0
##$SIGF2= 0
##$SINO= 400
##$SIOLD= 32768
##$SREGLST= <1H.CDCl3>
##$SSB= 0
##$STSI= 32768
##$STSR= 0
##$SW_p= 5175.98343685301
##$SYMM= 0
##$S_DEV= 0
##$TDeff= 65536
##$TDoff= 0
##$TI= <Analysis number 999999
Compound Code 99
Book Reference 9
Project Code 9>
##$TILT= no
##$TM1= 0
##$TM2= 0
##$TOPLEV= 0
##$USERP1= <user>
##$USERP2= <user>
##$USERP3= <user>
##$USERP4= <user>
##$USERP5= <user>
##$WDW= 1
##$XDIM= 32768
##$YMAX_p= 542158844
##$YMIN_p= -177155
$$ End of Bruker specific parameters
$$ ---------------------------------
##NTUPLES= NMR SPECTRUM
##VAR_NAME=  FREQUENCY,     SPECTRUM/REAL,   SPECTRUM/IMAG
##SYMBOL=    X,             R,               I
##VAR_TYPE=  INDEPENDENT,   DEPENDENT,       DEPENDENT
##VAR_FORM=  AFFN,          ASDF,            ASDF
##VAR_DIM=   32768,         32768,           32768
##UNITS=     HZ,            ARBITRARY UNITS, ARBITRARY UNITS
##FACTOR=    0.157963299565203, 1,           1
##FIRST=     4114.6089312076, 0,             0
##LAST=      -1061.37450564541, 0,           0
##MIN=       -1061.37450564541, -177155,     0
##MAX=       4114.6089312076, 542158844,     0
$$ Real data points
##PAGE= N=1
##DATA TABLE= (X++(R..R)), XYDATA
$$ [...]
21193 -1078 40138 31394 -36840 -21539 8647 20494 -18867 -21851 -18652 -9258 16223 3003 -18545
21180 -18545 -32247 -50695 -53281 -33312 -8346 -48922 -60333 -23266 -9999 19678 42222 36705
21168 36705 40303 37384 -6392 -47048 -10803 23789 7713 -13868 -18108 -30349 -44983 -17259
21156 -17259 7968 -31128 -21312 -10630 15712 -17574 -2955 -19652 -15419 30812 10510 -42611
21144 -42611 -67168 -46784 -80571 -104373 -88942 -26492 -41257 -30930 9225 8954 11987 3067
21132 3067 42584 54704 -8439 -37372 4877 -8846 -22116 -53028 -96945 -85133 -53814 -23128
21120 -23128 -63744 -66324 -22168 26203 56640 25679 -15865 -25084 -60401 -61112 -97706 -75173
21108 -75173 -71575 -85962 -47186 -13232 -27465 -40265 -21101 -45829 -87001 -90834 -27839 3344
21096 3344 -35898 -26023 -17853 -27404 1798 3579 18523 985 13529 53167 41184 29626 35535
21083 35535 4683 10698 -17813 -39583 -38400 -57960 -69212 -42174 -29572 -14850 65557 97859
21071 97859 -9012 -43960 -35700 -37865 -39958 -43332 -20610 12275 28329 67613 79545 72536
21059 72536 21976 -43024 -61004 -38648 10827 6585 -49969 -52675 -43110 -76003 -58251 -27405
21047 -27405 -52676 -100608 -59660 -1389 707 -30440 -48250 -67159 -77895 -32779 -15412 4025
21035 4025 -6783 14184 8039 11656 24749 2223 -25857 -67254 -57457 -37350 29045 89987
21023 89987 68861 29474 40176 16268 -29316 -67997 -64269 -58135 -52094 -74639 -63566 -20826
21011 -20826 58750 67631 33381 13410 10582 -53459 -87000 -48491 14854 31695 33893 25839
20999 25839 33666 35187 26957 1292 -20127 -12913 -19109 -33708 41108 9572 -27218 17255 35315
20986 35315 30437 28194 10709 -21575 -51259 -36227 -47226 -57500 -54484 -82031 -65276 35547
20974 35547 25646 -23263 -25262 -79133 -113983 -107102 -66791 -13336 58597 79310 68806 54450
20962 54450 12357 19709 -8639 -29929 -34276 -56707 -50303 -10589 25092 25303 -16839 -26849 -29188
20949 -29188 -27983 -77016 -61791 -62060 -106547 -100013 -77223 -30328 -13939 -42466 -6564 -33068
20937 -33068 -19609 -16043 -57757 -80412 -24918 2636 -13614 -52232 -7771 3072 -44620 -94231
20925 -94231 -107656 -86544 -76106 -91577 -94749 -88412 -54064 -87324 -106943 -101752 -125159 -117645
20913 -117645 -77447 4614 84895 67969 47319 60864 56562 56199 57580 63740 -8458 -6131 2635
20900 2635 10594 48061 49788 -14599 -17941 -6682 -1987 10015 52459 86090 87381 29202 27328
20887 27328 19958 -35939 -13894 -35933 -11026 -6467 -55575 -38734 -39362 -39144 -70771 -50108 -3506
20874 -3506 16134 11461 40354 12403 18777 38193 -13858 -25692 13898 -13786 -51855 13497
20862 13497 44583 52702 65512 68885 42239 46468 106639 111116 47549 -15301 -30263 -5509
20850 -5509 17878 13319 -28083 -33895 18141 -3125 -25439 -15473 -3089 15232 38619 20177
20838 20177 6331 -31940 3787 24530 46901 7221 -72656 -72952 -34841 -34200 -39924 -24908 26689
20825 26689 34922 23868 15842 83108 89720 52262 41488 52040 43358 -40509 -41045 -21631 -50246
20812 -50246 -4256 16624 475 -55001 -76640 -34735 7679 -17648 -45336 -31172 -24692 -35694
20800 -35694 -46863 -24894 -5519 -11146 -32253 -4578 42955 72603 63851 47539 19810 28974
20788 28974 22145 4794 21221 37849 72505 64627 51307 67079 52573 10443 -448 42604
20776 42604 48305 69400 65291 15893 -15431 -8128 14142 31258 101855 112518 59028 -14924
20764 -14924 -59170 -27750 10458 31145 13251 -26563 -67805 -44072 -37443 -42994 -25667 -29921
20752 -29921 -40757 -56510 5001 12611 -38282 -49104 25097 88821 104727 88530 90904 74061
20740 74061 45484 1087 -21234 -30633 -66080 -80777 -43079 -32013 -37836 -50006 -62500 -22931
20728 -22931 -4982 -51902 13951 17388 -21643 -35459 -31865 -9906 72107 87707 33115 -6503
20716 -6503 -5937 -8012 4446 42012 12662 31089 15135 -5548 -16144 -35484 -21826 -50855
20704 -50855 -65484 -61103 -38935 -17323 -16449 -6422 -7614 -17335 -43801 -79167 -78919 -63609 -57768
20691 -57768 -42799 24629 28063 47913 20744 20387 -11578 -29384 23469 73857 36871 -2262
20679 -2262 -25129 -33774 -26938 -7113 -9770 12088 -21682 -22502 32633 55238 29979 43510 49153
20666 49153 57334 32343 16978 -48616 -51218 -2629 -12315 -54543 -71102 -78609 -59474 -4965
20654 -4965 3241 -40533 -72876 -77592 -58708 -52412 -99506 -117269 -132878 -87760 -71890 -17424
20642 -17424 -5844 -29654 -25109 -5115 -23964 -24934 -70642 -64507 -27528 -12763 -26156 -31498 19703
20629 19703 721 -21985 33504 5253 -42202 929 4250 -21560 -30424 -40831 -80689 -97982
20617 -97982 -64173 -16555 -18119 -51423 -77956 -60994 -16451 38603 27367 46777 32977 29261
20605 29261 -17204 -36311 4980 -733 -49121 -38051 -41815 4117 -22398 -31618 -42638 -64403
20593 -64403 -74726 -13803 52943 33944 22163 -9738 -9720 -22802 5732 -8581 -37157 -52135
20581 -52135 -8497 6824 -4534 -56947 -88928 -66778 7197 31226 -17857 -9881 -4670 41119
20569 41119 31271 -18956 -60261 -61251 -98600 -100610 -60257 -36744 3279 -33227 -3633 24449
20557 24449 7799 -13301 -61019 -63508 24556 22278 -1901 51592 38769 3773 44103 33922
20545 33922 4147 -9619 10320 7058 18159 10005 7856 44704 17555 2000 47038 103969
20533 103969 112771 71674 82930 94141 96036 79499 35744 6569 -17516 -23345 -35787 -16565
20521 -16565 -29154 -38321 -31435 -60272 -19064 47479 54754 4509 -11242 -19275 -24608 -50177 -16976
20508 -16976 22158 37979 50565 51976 52253 25135 12548 -18666 -18970 -35445 -42548 -2564 17740
20495 17740 25188 66122 32446 7695 -30977 -38482 -29275 -44164 24813 73572 68750 13584
20483 13584 23215 53965 61822 46230 43084 75783 78999 84615 49346 32228 24788 4531 4962
20470 4962 10484 70013 70450 9193 -490 13127 8900 -12112 -39398 -16591 36174 23005 47721
20457 47721 67665 110225 112612 43881 40556 50248 76992 65751 58729 39881 54425 53960 35997
20444 35997 41720 35363 36524 49731 32978 18662 53313 78447 104987 62899 16887 31362
20432 31362 56485 19641 -13974 18174 33600 45505 39949 4949 3437 -16357 -35654 -34993
20420 -34993 -844 34999 2292 -23452 31545 41756 50600 28871 -8614 -6042 60728 54360
20408 54360 55625 63405 44758 82889 65569 49587 27747 -5895 -10577 11627 55149 10412
20396 10412 -36403 -43533 -86193 -90513 3896 27272 -48763 -71273 -44441 23891 5294 -1788
20384 -1788 5201 -28296 -51742 -59230 -62300 -50652 -69300 -48110 -45539 -41635 7499 34267 -22343
20371 -22343 -72461 -57714 -41056 -19233 -25282 -3511 6518 13464 45120 -2659 -18834 18417
20359 18417 53780 31212 28026 17884 4508 15173 -12988 5588 22185 -26539 -31012 -50962
20347 -50962 -36490 -3232 -16133 -32858 -30837 18459 40017 43956 -8696 -19108 11966 19531
20335 19531 39786 80127 74169 38572 2401 -30342 -36179 8328 33720 37336 55953 8167
20323 8167 -42313 -34300 -4937 38783 51303 24494 5685 -27952 -68206 -125912 -107041 -22957
20311 -22957 39902 -25348 -3191 -6646 -46276 -50266 4401 34176 16407 17417 26450 37337
20299 37337 65118 63952 44913 59488 19193 236 -1954 -27515 -72455 -68406 -30900 11123
20287 11123 12926 -9788 -65103 -73901 -31728 -84007 -119040 -79936 -12420 25699 4357 -18554
20275 -18554 -51628 -90646 -63427 -45618 -41393 4447 28643 31304 48800 25151 6227 20638
20263 20638 19308 -742 -58272 -76458 -36967 -16102 -50834 -23763 14731 -22750 -63185 -19558
20251 -19558 18213 47645 28534 -24087 -73789 -84168 -99341 -84634 -65636 -24180 -17483 -59442
20239 -59442 -75956 -62904 -23478 -47830 -41672 -27494 30030 41610 78955 125880 92439 57064
20227 57064 70370 71243 47778 20529 14218 -5049 -23481 -37759 -57007 -73048 -53382 -71225
20215 -71225 -53880 -19552 14423 10914 -8821 1489 14475 28586 13592 -19604 4692 -16692
20203 -16692 29434 54402 26639 828 -14081 -30168 -76647 -63215 -21171 13912 2762 -29080
20191 -29080 5955 52609 33061 41691 -5018 -57016 -19853 3034 -2386 6561 -16343 -44353
20179 -44353 -17358 868 38368 49291 11980 -21776 -15460 12430 24338 42949 -1779 -16622
20167 -16622 -21654 -18198 -43633 2896 -16465 -36556 -33583 -23018 14873 -5851 -31932 -19489
20155 -19489 13375 42334 11934 15069 36952 44515 3432 -66134 -49666 40944 78809 63165
20143 63165 29279 35979 -12479 22794 38463 693 15122 31 -58908 -40535 -45388 -27210
20131 -27210 1606 15083 51723 92581 62337 6539 62446 71557 69812 43319 18800 27929
20119 27929 21887 -9789 -21375 -34303 -20960 -6141 -92 34162 58038 59986 95718 155773
20107 155773 83624 12775 -10771 12660 -13232 -10138 -10852 28774 59873 18184 -21254 -20322
20095 -20322 -12520 -2509 -10660 -24540 -79013 -98622 -120533 -120690 -70241 -21930 -44257 -83890
20083 -83890 -34434 -23384 -51327 -48539 -47971 -73368 -45772 -8392 -3593 -12364 13373 -7927 2710
20070 2710 -40400 -68497 -41660 -9317 36074 40660 -6090 -68273 -86932 -78826 -48561 40
20058 40 31060 28753 -21098 -14304 18609 92354 98789 49298 17341 2115 -6029 47155 46116
20045 46116 22016 14950 26753 39270 70783 34171 332 -49379 -39773 -25974 -25939 12817 43096
20032 43096 67841 70508 42469 43503 87235 177762 281779 309289 260159 167237 169171 170971
20020 170971 165482 129123 123812 135866 179857 255153 293354 307932 350426 373242 365002 328669
20008 328669 283019 295338 248454 198104 143733 66424 4376 38887 53300 70367 50406
19997 50406 115728 131906 128411 105701 79545 38990 5071 -17545 -19064 37966 97136 172420
19985 172420 199322 166080 96737 74078 95275 88652 44746 3155 -36983 6165 102604 118874
19973 118874 78886 100260 182745 337484 451903 519332 562290 534468 491048 505329 479578
19962 479578 424245 375792 384897 419383 421309 475356 483206 414727 366438 276292 247144 253927
19950 253927 272047 255013 271461 296093 299060 271708 274920 295217 331592 301580 292510 218158
19938 218158 141401 92928 41854 31259 23519 36311 93414 121448 132939 100355 49127 56159
19926 56159 37868 73588 102815 91300 88021 38419 41766 53071 48025 -25716 -26856 6920
19914 6920 4930 32830 40165 103510 113193 79068 70716 113114 159197 214694 251165 332746 332929
19901 332929 271198 238365 284904 342546 422295 472166 478164 375684 280253 235806 205188
19890 205188 204483 193614 227573 235370 263265 314731 351162 317798 203296 116406 56043 50675
19878 50675 34338 -5243 19595 74639 95540 77168 46543 4994 -10443 -8215 9906 26591
19866 26591 40167 12165 13277 12235 8830 -6772 6783 15791 -13665 -37046 -43597 -24459 -40057
19853 -40057 -52799 -48659 -45796 -21826 -18960 -22679 -26971 -67675 -41673 -31812 -36980 5250 62613
19840 62613 96561 44704 -6400 29502 36679 33504 39453 10758 39010 35209 15056 -5626
19828 -5626 8579 3841 -295 25357 22934 23358 42706 47723 -24265 -61422 -33830 -18111 3609
19815 3609 -42877 -40600 -57809 -102374 -125574 -108257 -111534 -71992 -58241 2180 57446 55390
19803 55390 6157 -63180 -61863 -37185 -21192 20362 20216 40646 50785 46592 70475 87935
19791 87935 56430 30681 18653 20615 -269 33043 104867 102524 109088 154598 130214 120691
19779 120691 90395 93688 74717 64459 90239 36092 -13102 -3707 -13122 -50717 -51404 -49164 -68826
19766 -68826 -38249 -2089 13807 32684 36835 -6002 -8175 18098 43112 43115 16596 19419 59180
19753 59180 104216 50275 23145 79709 110513 132113 121580 82499 87648 117344 184139 163329
19741 163329 100932 62837 111935 174445 194343 140474 81357 41111 11057 14645 38374 106470
19729 106470 181470 171771 123987 79149 59918 99775 97180 29241 -6064 29771 109215 146359
19717 146359 110952 84010 103007 88265 41044 18018 -6464 -10851 28392 65857 111900 143144
19705 143144 132535 109444 84360 113263 106355 132098 153741 156289 171474 151993 146364 160599
19693 160599 112568 50965 59382 104657 203072 198101 168283 198510 339324 356620 311409 201212
19681 201212 156147 95256 21075 6871 32846 81109 98825 111322 115016 154660 133891 94041
19669 94041 86666 64494 60354 81927 117945 152058 195246 261557 276533 225848 202768 165467
19657 165467 145571 83241 53278 22606 65628 114436 116822 115143 109686 104527 97139 122725
19645 122725 157511 193655 159686 148355 146791 156314 189492 138616 134933 117877 142191 136848
19633 136848 106758 78709 46669 51854 50592 75089 116760 112813 82199 114229 101260 70643
19621 70643 74812 82605 103721 87588 98656 129774 141386 133575 89731 100020 98124 59084
19609 59084 5025 -11781 -3972 29346 68371 116403 138790 152087 143004 104063 70080 71463
19597 71463 64124 115761 107165 153047 139646 76336 86902 93888 105645 103014 49851 61105
19585 61105 84981 82427 69631 -7970 -57881 -91601 -73595 -59205 -13738 43956 48403 85705
19573 85705 136579 168512 199617 216673 194573 171034 127093 112544 125044 136750 67697 89312
19561 89312 144242 163497 171982 167969 205725 201817 218044 225859 246380 246571 272265 328087 385275
19548 385275 369373 336772 303647 274834 287979 310925 346439 404181 442068 466852 506656
19537 506656 589847 719796 831081 924119 1039737 1150257 1214210 1243074 1263537 1275413 1327287
19526 1327287 1413173 1450466 1582798 1850779 2235274 2711630 3421513 4366507 5636632 7011397
19516 7011397 7988933 8233187 8141563 8350013 9510197 12182001 17240874 25580905 36434206
19507 36434206 44994628 45882321 41376235 36801373 34116048 31799089 28089919 22974199
19499 22974199 17973453 14434828 12808092 12997577 14839129 17881071 20433061 20299595
19491 20299595 17355178 13310341 9799095 7338860 5842863 5028986 4601768 4265059
19483 4265059 4060784 3971018 3974584 4032298 4201273 4443839 4753298 4983596 5060378 5145650
19473 5145650 5368362 5886440 6730388 8126675 10432415 14072270 19431207 26184046 32041939
19464 32041939 33787920 31212060 26979562 23414597 21544870 21535888 23496805 27991989
19456 27991989 36171523 50080407 71849024 100902124 132776838 161296913 177527118
19449 177527118 176296005 158232742 128367117 96724240 71613265 55956207 48814660
19442 48814660 47079987 45491814 40177404 32329020 24858276 19310448 15484659 12891717
19434 12891717 11157237 10027451 9347708 9057066 9004747 9081607 9081124 9092123 9181445 9399837
19424 9399837 9776580 10365028 11380076 13120366 16105785 20891088 27943236 36360301
19416 36360301 42746144 45060381 46184988 50782801 62659977 84320042 115260015 148078437
19408 148078437 172763064 182541371 172182874 146423596 114418128 84039123 60051098
19401 60051098 43527953 33147817 26938531 23400549 21956256 22452619 25008671 29314032
19393 29314032 33212947 33265097 28822803 22562062 16969476 12926866 10369766 8741735
19385 8741735 7601876 6700758 5921582 5311039 4782870 4356915 4059517 3822183 3679367
19376 3679367 3590821 3552018 3695583 3926994 4302040 4869414 5681828 6921485 8940363
19367 8940363 11992986 15903050 19388849 20325515 18489130 15501660 13262737 12501430
19359 12501430 13360250 16103597 20713127 26043656 30411098 33134039 35412315 39802349
19351 39802349 45786656 47259528 40615944 30275986 21096553 14934065 11286239 9433642
19343 9433642 8832136 8880420 8702394 7710218 6221355 4810337 3700332 2950373 2501715
19334 2501715 2236571 2021873 1848703 1749709 1656176 1594557 1545821 1480630 1402489 1302101
19324 1302101 1176362 1099950 989223 926890 905832 893480 851776 796848 757255 759502 710812
19313 710812 678674 683144 690182 624959 555222 545829 523323 499543 490626 452554 393818 387454
19301 387454 410538 373241 392169 434609 444510 414979 411171 417793 441140 425032 392771 405308
19289 405308 474410 484967 468479 457073 425523 421625 397033 389588 423427 435311 445732 461800
19277 461800 436338 387231 387758 404142 397974 378762 367943 331841 291448 266886 232371 257995
19265 257995 234191 249296 207950 145000 164553 185588 183210 172298 174150 233604 203084 134362
19253 134362 142625 190200 220203 241321 251520 179437 170978 217830 282929 235218 199947 161401
19241 161401 132889 146001 183782 162612 80616 78908 140112 146314 156268 125904 140413 180637
19229 180637 210735 199423 157569 119135 112139 99526 149616 107038 75237 89640 106708 74445
19217 74445 61022 66991 94857 118823 158006 197173 200988 203987 201039 189683 138976 142877 158686
19204 158686 146542 161676 140874 97530 109347 186612 178864 116527 101638 134508 120632 129728
19192 129728 142299 149905 150209 161402 176897 204267 232435 271609 274470 376435 521204 749832
19180 749832 938067 914004 751810 614854 492683 366163 294628 231528 193132 124358
19170 124358 115873 91066 88726 79559 84355 101146 53849 49037 90394 133199 212348 240305
19158 240305 197012 163533 142634 115751 97649 140632 156523 180813 173949 180349 184021 138258
19146 138258 154276 167225 123608 91980 38737 103646 96712 71524 87091 82147 45952 17935
19134 17935 2091 1833 42230 94613 115959 123227 74476 77467 73340 80096 124113 130114 37586
19121 37586 49159 70702 92162 98317 96064 108437 90931 119134 169007 158013 119709 110899
19109 110899 114245 107612 141408 143825 159446 120404 91940 121488 87189 64978 108278 135822
19097 135822 124989 141720 125102 84975 86785 91764 79435 57771 4827 26091 66751 102195
19085 102195 137315 136888 118978 121348 137489 163149 167914 105098 75589 81987 104683 97580 66776
19072 66776 68524 100984 110309 63835 42120 115286 118227 92303 70647 67787 78898 40242
19060 40242 73611 72814 56920 40471 77316 74396 97873 112181 123012 128355 107245 101359 126389
19047 126389 89650 66842 56928 56928 49041 73248 101400 60872 3125 -17051 -11391 26712 58848
19034 58848 65651 86038 92145 58704 34620 18786 31092 52988 54274 49006 76533 133559
19022 133559 185232 210750 201529 196523 228120 267324 267133 237798 236133 254905 257062 203737 155997
19009 155997 105084 100265 73771 72634 114911 182362 163715 112193 96482 72235 39125 68857
18997 68857 108395 104066 63464 56632 93704 138896 107833 26596 2384 -15888 -22452 -68673
18985 -68673 -71082 -68116 -56684 -12976 72977 172056 285924 369270 451538 514484 454483 372251
18973 372251 352189 293168 274047 269570 329093 451217 479632 516789 550981 520212 480157
18962 480157 499849 465881 423400 406248 337829 298185 250344 211936 223689 188317 134685
18951 134685 132965 115667 81625 55918 38962 29449 43239 55068 83127 79876 69413 82106
18939 82106 90362 102138 105355 103349 124754 152782 175203 153999 128437 114898 116660 131711
18927 131711 101671 83347 129373 115955 139519 148282 219984 269756 338550 374400 392425 401393
18915 401393 349783 262864 207677 145879 185787 273756 323486 330483 265473 218461 202646 202853
18903 202853 171853 116025 112949 113307 98726 47962 67796 57273 90296 109628 81227 24747
18891 24747 44441 40435 48536 120111 203645 288332 320476 352397 362663 396548 396777 339101
18879 339101 296162 272286 293404 305140 323707 395872 435435 486658 476914 437659 341299 197841
18867 197841 116915 95780 110294 147833 136851 106533 83003 121326 122883 130073 120543 146887
18855 146887 164409 130938 63687 38280 79282 130609 151406 151936 193213 212805 213119 200308
18843 200308 198584 202972 159124 117475 141056 166408 195820 217064 262953 305741 334179 350109
18831 350109 311222 298485 325129 381364 338425 221637 140916 128449 157110 173659 216298
18820 216298 270491 275003 285768 364601 440408 475260 408591 312252 231067 170549 114564 37383
18808 37383 11199 53669 83602 90186 114877 146697 112976 75631 55292 53094 51273 57839
18796 57839 18411 63058 93958 151660 166192 188690 138601 153567 178648 176555 218860 178922
18784 178922 143435 132760 178688 201203 173268 105618 118336 117869 95223 71022 38931 54619
18772 54619 102902 116396 153697 171960 253133 423925 592465 645117 580399 442313 282582
18761 282582 167176 101570 66123 70572 131469 148705 114378 103173 68856 48989 27628
18750 27628 32595 3589 11349 60813 106533 143293 145653 102248 70653 62749 88548 70158
18738 70158 21779 11770 9066 -972 -6638 -23355 -24441 -53835 -30977 -46050 -104695 -29775
18726 -29775 -6759 -43514 -56978 -35979 -13087 -22870 -7254 27925 57380 34858 71269 128881
18714 128881 165744 109820 114564 96738 85464 106413 99548 72879 58889 59001 85591 101306
18702 101306 69008 72262 67688 72100 82130 80143 32170 46852 67027 36739 23784 -12122
18690 -12122 22472 11454 -28666 -40852 -39844 -36193 22053 60134 61624 37290 61102 107481
18678 107481 115267 137776 158045 140564 68280 73172 107779 107673 77202 148632 186796 100828
18666 100828 80829 115403 136841 118167 88857 85024 88334 106822 136097 132101 106200 88329
18654 88329 66027 160934 184843 136236 142214 168065 182534 193595 248071 333227 327765 265907
18642 265907 226048 228307 319290 411173 463176 500964 503241 513353 483294 414571 433963 465396
18630 465396 543293 573178 614589 650322 693617 746185 830018 985512 1092977 1258906 1376665
18619 1376665 1541581 1810551 2178067 2493958 2594592 2563542 2548426 2587992 2796298 3298157
18609 3298157 3985899 4548824 4940542 5384190 6103803 7232504 8762719 10992021 14389295
18600 14389295 19663705 27991413 41704641 65056629 102488516 150262198 185287450
18593 185287450 181222864 144273797 99921817 65137896 42734508 29099935 20659832
18586 20659832 15162352 11472004 8945683 7208556 5960443 5015607 4395085 4046502
18578 4046502 3909893 3870154 3714755 3386613 3039219 2818403 2687248 2564467 2324932 1978826
18568 1978826 1573860 1332920 1200561 1080228 1026693 977529 952385 919779 884427 795132
18558 795132 754699 733496 667739 611736 588720 555995 460681 418933 410620 393418 420519 463229
18546 463229 438862 473814 567377 654802 694699 666298 609218 553162 534535 536913 527833 461544
18534 461544 421136 385653 333200 295038 247828 279966 293342 290724 289182 336431 355070 350008
18522 350008 353537 316303 309278 316239 299531 204610 138587 161726 191047 177763 166879 184592
18510 184592 205034 214494 181726 182116 158253 171024 193950 218135 252457 259807 232512 214933
18498 214933 155388 135686 135184 121038 125980 89099 114511 87108 35249 50498 87826 104554
18486 104554 8730 4908 63749 79028 62363 32920 23536 72215 94202 71932 41131 60507
18474 60507 49665 36382 39640 14818 39021 112357 151519 124313 123170 119838 112081 138763
18462 138763 132828 132196 129414 145065 144532 147789 168374 170543 152786 149220 154556 145025 97355 103560
18448 103560 81670 75494 40633 3834 1817 -15677 11076 96757 101731 72376 17913 -15989
18436 -15989 58587 73561 77153 64806 46599 71215 48934 17860 -2898 -15241 13396 80246
18424 80246 91770 88215 63325 14072 36983 82497 115085 85883 29548 -11291 33689 85955
18412 85955 58827 56180 70731 74972 73019 67120 60620 93910 94701 31305 1759 -710 6568
18399 6568 45761 47884 50734 37975 22694 66937 81998 92584 42680 3299 -8351 29501
18387 29501 39323 33013 29134 38988 69881 102841 110652 78542 70473 80064 113275 79893 33909
18374 33909 16867 32868 -3086 -28476 -19483 50164 3563 -42466 -44058 -15198 38200 87055
18362 87055 109581 111908 78220 65175 84773 116581 103599 92767 86549 51131 36310 43552
18350 43552 51872 21455 -26037 -44618 -22083 17438 65367 57402 53113 110813 130977 138746
18338 138746 140093 147793 177928 192864 131113 97194 98517 118061 113781 123289 61915 50284
18326 50284 74989 79515 92449 107683 172161 186139 194282 229643 238337 244156 195979 125153
18314 125153 77999 -3783 -28309 -10535 24192 87388 102862 90881 55980 41493 61069
18303 61069 104348 137318 136197 105356 93929 102842 119858 131377 137413 88452 55338 57358
18291 57358 48104 1165 9424 47845 47967 76437 34068 57951 57190 25028 33956 70121 77210
18278 77210 94837 84474 109201 110118 55387 50580 77889 86250 76381 122825 172850 185500 193123
18265 193123 180272 154360 166796 153819 132378 75825 62814 14777 -13323 22193 41485
18254 41485 -44077 -94626 -74346 -48551 -19077 -31356 6799 8099 -38373 -46129 -15644 -18837
18242 -18837 -23133 3755 9557 20368 5093 -29326 -51159 -76913 -63719 -82721 -85168 -88798
18230 -88798 -33922 -30457 -31597 25039 48202 27648 31685 30049 26977 35605 46392 65543 63230
18217 63230 104651 80285 34935 79442 98983 80524 76609 33277 -31520 11584 49297 53459
18205 53459 13325 31438 50040 46461 35117 32595 21474 -34086 -64242 -31708 9485 30627
18193 30627 62149 94569 45319 -948 5037 -7924 53546 104273 61739 27972 73326 169042
18181 169042 213956 277067 347177 415480 394602 319111 285111 232245 158783 111547 75249
18170 75249 46516 54136 93719 108093 68730 97631 110496 82144 48503 66469 124031 162332
18158 162332 227721 203033 142978 137812 169330 185589 218600 188594 146861 133484 142767 166312
18146 166312 209241 184539 192637 220260 255380 269838 261326 318274 375222 453558 518412 508573
18134 508573 540970 574390 587280 620651 667992 719204 770558 820211 935176 1009207 1103995
18123 1103995 1273736 1480950 1849890 2205320 2516171 2943991 3541831 4464595 5730842
18114 5730842 7559657 10438117 15195011 23534967 38430178 63263085 94521143 111616082
18106 111616082 99126936 71456979 45621421 28417182 18316630 12456155 8937173
18099 8937173 6633140 5037482 3988344 3251669 2667578 2225450 1895267 1637449 1456944
18090 1456944 1320733 1163057 992739 885293 801909 712004 616377 542964 485598 451047
18080 451047 421417 371502 307891 313862 322408 345843 328545 304747 321962 347051 320811 294541
18068 294541 259835 237276 208598 169411 128413 91027 112872 162799 183312 205552 218262
18057 218262 227674 203904 123625 122922 110300 158960 208034 218245 202315 192317 165199 129686
18045 129686 135110 171789 184124 194130 202803 165680 181322 134481 139552 99199 47821 42479
18033 42479 942 -15314 -16938 41140 70754 23802 25841 28601 33633 30457 33461 55391 87862
18020 87862 113559 114975 84819 88018 116151 106170 94815 102031 88710 112151 114324 108884 153779
18007 153779 188226 184623 241667 339611 487831 690861 908377 1033724 931292 726417
17997 726417 512764 391923 298583 205847 215824 251012 248093 197081 138463 86377 36976
17986 36976 -4655 12306 -374 62890 125309 108744 104449 138168 180203 191994 141158 54380
17974 54380 -9883 17190 59618 33790 23009 32233 44612 46514 37405 12827 21095 47072
17962 47072 25244 25130 3005 -3371 -4683 41015 51635 51837 17997 -13604 -56 24393 45799
17949 45799 -15808 -24303 15467 21311 -16553 -11263 11216 32998 15659 -35486 -24563 -9389
17937 -9389 -68633 -85594 -32748 -14766 -42681 -46383 -22878 -61245 -20622 55883 92912 67553
17925 67553 54071 120850 124810 88763 6479 -53928 -76062 -66478 -68464 -49972 -22616 -19084
17913 -19084 7731 20085 39175 41895 13959 1188 15265 23872 46887 29959 31330 8186
17901 8186 -5858 54450 43777 47369 68951 96441 66246 16667 10419 16092 -41784 2521
17889 2521 50620 27900 -12649 -51094 -39528 13128 57456 63506 -194 -13879 20643 6103
17877 6103 -38773 -5024 -10523 -4676 25191 68047 41735 -20873 -36689 28534 8403 -43117
17865 -43117 -45016 -31640 18455 65132 38464 2901 19891 54161 55431 61764 60280 27139
17853 27139 2642 -14529 -16899 -31534 -61092 -35964 26105 18744 20097 -45284 -32546 -5223
17841 -5223 -14583 -30681 -40580 -33058 -3444 17376 -26639 -74809 -118919 -92581 -62314 -46903
17829 -46903 7064 -43169 -137703 -134538 -112360 -97980 -69694 -35848 -29116 -62066 -12811 -23065
17817 -23065 -48576 -58455 -14146 26563 46871 61355 42829 77596 100692 54830 8973 -5408
17805 -5408 -7421 -68 -34953 -44086 -8968 -4091 -40004 -87957 -82005 -12552 37937 46447 7609
17792 7609 -50882 -100273 -75370 -61038 -31979 -10589 -12761 -35877 -5457 16193 37145 23517
17780 23517 23015 68997 45266 -9620 -35338 -31928 -12953 9792 -13436 4794 -9931 -8464
17768 -8464 -23189 -53463 -48365 -79547 -96699 -85808 -59386 -56739 -24353 -6890 933 -11003
17756 -11003 15920 -14155 -24832 -53012 -35587 -29847 -25029 -41145 -11911 -20007 -24193 8446
17744 8446 -38264 -48951 -37774 -42607 -43760 -29853 35598 59425 22971 -1423 -31443 -6626
17732 -6626 1019 6690 -371 18983 17141 30392 55620 51513 1612 32721 35037 6659 -20614
17719 -20614 -45854 -40164 -18355 -21001 -1684 24343 10636 21348 174 -8736 -38661 -57634
17707 -57634 -89552 -70094 -3252 24411 21475 -4459 2084 -16269 -12971 -27259 -29686 -21329 -33597
17694 -33597 43975 42266 3110 -9870 16401 -3886 7424 44576 80972 95668 92916 22045
17682 22045 -60490 -46035 7016 -12623 -22992 10375 -1198 -16368 -81356 -74947 -60144 -35550
17670 -35550 -23778 -10030 18628 27847 14777 -8122 -85370 -85681 -61109 -91488 -82484 -26408
17658 -26408 4451 1313 2273 31647 55159 47902 82012 86333 49218 36479 -16473 -73760 -116187
17645 -116187 -102694 -68751 -46023 -38180 -49771 -59502 -48080 -42776 -46330 -73159 -28850 17570
17633 17570 -11473 -55399 -40443 31039 92326 81448 42167 78163 90402 56631 -17062 -30254
17621 -30254 26247 117017 155355 101187 22482 -24566 -996 -24633 -63779 -32794 -42128 -8652
17609 -8652 7033 14754 -41657 -88476 -18206 14461 13754 9236 10081 -42932 -101252 -67234 -19892
17596 -19892 5991 13365 6233 21877 1998 -19704 -7323 21115 33224 51498 24909 9281
17584 9281 -32997 10219 47398 28517 -2368 -28262 -44954 -7704 45199 42256 51447 23049
17572 23049 -48088 -68923 -56350 -32920 -47374 -44430 -47626 -41357 -2960 -6619 -75869 -89362
17560 -89362 -27577 -27910 -10515 63242 57044 38335 20483 48634 15313 -70190 -37998 -72316
17548 -72316 -64635 -72357 -112316 -101859 -66632 -107728 -119594 -122901 -83442 -32451 -4226 2690
17536 2690 -53848 -96141 -97294 -80290 -28835 -5860 8827 -8650 -32100 -72175 -82943 -76488
17524 -76488 -73694 -45957 -39547 -2726 10850 -1072 -23633 -10429 -9772 -20088 -35126 -68936
17512 -68936 -36720 -12455 5841 10339 49703 27789 10888 18906 -16075 -43053 -81005 -106546
17500 -106546 -105753 -69996 -71794 -95223 -97444 -38238 -27462 -52974 -33952 -7003 -20186 -39481
17488 -39481 -25138 13284 14231 -12354 -66494 -38863 -13045 -12621 -33081 -11613 -85872 -99202
17476 -99202 -66489 -65561 1236 63293 52553 25507 10380 68715 103910 125031 79037 29032
17464 29032 961 80 51860 70169 60778 11425 6977 15167 -13060 -16878 -10428 -835 -3357
17451 -3357 664 39719 40097 26473 24876 31994 60762 126662 279554 468486 580183 546888
17439 546888 436868 308208 160030 58352 -5245 -2462 -34905 -26912 936 13229 -20338
17428 -20338 -22156 19710 18554 35092 13475 -39040 -55932 -64342 3247 48902 59042 74983
17416 74983 53806 36031 52837 97573 98323 103110 90673 48381 19554 43476 108635 90826
17404 90826 -6049 -10883 31255 82684 24055 -54053 -34520 1782 8063 -4385 25609 36060
17392 36060 19930 24253 30654 -11731 -32581 -22235 -10980 1955 -61093 -73102 -30385 7701
17380 7701 -2 13766 9443 26595 58611 39832 3539 -1589 -25550 -14364 -2142 -23870
17368 -23870 -18029 -20614 -30634 -9125 54271 24534 -22792 -14981 -18924 -36387 -17863 -6974
17356 -6974 -59715 -70884 -55721 -11838 -27557 -31914 -8739 -33521 -24291 -17338 -9401 -56624 -42224
17343 -42224 6313 -15986 -89010 -44858 -14062 621 8913 36196 39947 27755 23985 47026
17331 47026 -9662 -17206 -14116 -21484 -27124 -30723 1918 5113 40287 46984 35996 21032 -55385
17318 -55385 -125973 -100596 -66914 -22253 38884 38204 35791 63853 99795 81814 31989 -2992
17306 -2992 -32186 -25230 -6313 -20837 -29373 -71968 -39496 38671 10785 -60097 -58594 -59589 -69153
17293 -69153 -75325 -47557 -24979 -14091 -22442 -9687 -15767 -25978 -40775 -1066 22790 -6199
17281 -6199 -51403 -15693 2451 2500 20620 58245 64115 32650 -12834 -25033 -19321 -40905 -37210
17268 -37210 -63392 -49453 -11676 27721 18167 30849 22501 -5045 1928 8943 5012 23798 33754
17255 33754 72010 77097 -6589 -41680 -27579 -33338 -21989 -37824 -9764 20809 34081 50955
17243 50955 44651 32502 40051 63057 96160 127289 75002 -15077 -54055 -35389 -50984 -76208
17231 -76208 -69832 -40320 -26883 -5519 -17061 -3138 32786 48048 27452 -52245 -37588 5165
17219 5165 4064 3743 -17405 -6045 36692 40386 40853 35955 4727 12978 62102 60431 2873 -21828
17205 -21828 -34195 -74683 -68208 -35605 -38266 -55725 -46972 -49849 -14638 36037 12100 5276 -1246
17192 -1246 -24015 -19198 -7154 7909 25988 29763 -5108 -13550 -3526 147 -7042 -37964 -47437
17179 -47437 -63511 -25884 69593 56619 11756 9593 3227 7194 -8482 -27366 -32334 -22917 -24384
17166 -24384 -58428 -91251 -117641 -101009 -113871 -108594 -96599 -122078 -75990 -36942 -43470 -26752
17154 -26752 738 -21803 -46649 -49733 -80485 -121199 -78620 -68272 -70618 -51309 -12939 7943
17142 7943 -6756 -4607 -16270 -73236 -103873 -48205 8052 87984 81441 11077 -1533 -18646
17130 -18646 -60419 -42007 3383 47683 20813 12022 -39190 -29853 -60978 -104145 -69592 -22602
17118 -22602 5431 -45613 -52522 6130 -8838 -39694 -19084 -51395 -81821 -37537 -14744 -40096
17106 -40096 -82307 -59092 -4596 -15937 3821 6309 26709 31471 30047 -6168 -50249 -18767
17094 -18767 19102 -23675 -109659 -161481 -151933 -107475 -45519 -37867 -13544 -19769 -87765 -93846
17082 -93846 -67116 -107675 -87331 -34269 42486 35558 13099 -46199 -74904 -49424 -35140 -72077
17070 -72077 -74108 -28199 -37313 -37294 -47869 -61145 -17598 44175 57790 11781 -7981 -21386 -61802
17057 -61802 -37369 15148 11313 17531 16328 31635 5725 -31191 -42394 -89265 -67947 -14365
17045 -14365 12381 9746 29188 -22748 41325 34270 4461 -15087 -43758 -51836 -14825 11800
17033 11800 16797 9254 -34526 -25426 16426 11655 32274 37370 -1926 14275 50213 37146 37016
17020 37016 21544 34114 34727 -17653 -30703 -34913 -30434 -1257 -34699 -29083 4639 58447 90057
17007 90057 53520 58358 29364 37508 37528 5322 6610 20994 -22191 -16897 2482 -8953 -18179
16994 -18179 -17409 15355 -2417 39752 78108 49164 11709 157 -26051 -49498 -45785 -6058
16982 -6058 49930 59220 69660 84304 90533 111214 73759 58149 47212 22021 -25454 -14707
16970 -14707 16489 6270 -11748 -26388 -15104 -21604 41782 5180 -35558 -50282 -23530 -58858
16958 -58858 -81021 -13167 -6620 -22302 21012 47934 1307 -30675 -22922 -7772 17995 30762
16946 30762 -17104 -37011 -69150 -36942 40561 78217 77355 60823 54698 64942 31190 13139
16934 13139 1735 2108 223 16923 -18226 -68353 -51502 -30502 -39797 -46424 -28118 -38402 -18718
16921 -18718 22042 -18007 -69438 -65956 -63312 -74133 -51514 -47551 -52325 -49547 -22268 -32577 -52776
16908 -52776 -26544 30350 32382 49758 30821 6336 36511 20728 -558 -16236 -52841 -29827
16896 -29827 -45835 -21494 15612 16658 2552 41173 3737 -71324 -56888 -11340 -831 34343
16884 34343 -14541 -45062 -15741 2947 -4767 -52545 -74653 -62073 -49763 -7390 13568 -7226
16872 -7226 -64490 -64420 -2853 899 -11673 -29001 -25026 15089 21598 5379 -16889 -63026 -46682
16859 -46682 -39863 -57391 -63082 -37167 30787 41942 34532 38476 25480 17505 -19733 -30339 -12849
16846 -12849 24891 19460 -2121 -18151 -24334 -20056 -56847 -51618 -2383 -13746 6252 33142
16834 33142 65821 48785 52747 30777 6850 -17208 -23115 1906 15786 -5962 2875 5331
16822 5331 -43106 -88333 -94707 -102361 -85454 -79315 -43615 5806 -7495 14213 44278 36193 49006
16809 49006 53329 2422 -46971 -36348 -13792 -2760 -18781 -28725 43774 68974 -21522 -30280
16797 -30280 -32401 -42333 -67122 -45821 -43401 -50121 -37084 8277 38677 3291 -33193 -42411 -12500
16784 -12500 5276 58793 96245 59253 10378 -3509 12477 22756 -30147 -85339 -66318 -16108
16772 -16108 30022 -5012 -27548 -33215 -21864 -68819 -38074 20535 4559 -27987 6752 23278
16760 23278 10277 -11828 13849 55563 99178 23518 -46 53050 15334 14873 6862 32220
16748 32220 49416 -4678 -70612 -38553 21035 12560 16556 10104 62651 78533 50852 38923
16736 38923 31644 32429 29177 27648 29760 49700 11566 -16959 24638 14101 8270 22775 58489
16723 58489 35739 -5444 -23882 -10842 -1099 -16509 -45456 -45521 -43961 -63370 -46802 -45038 -44153
16710 -44153 -8648 -19412 -8834 -7448 -33512 -4490 -28076 -30587 3057 52256 22618 -16461
16698 -16461 431 37246 30653 22592 34715 47930 65079 15888 -47593 -54139 -54090 -16379 -20079
16685 -20079 -52780 -73559 -43080 -7113 2422 -2868 -39575 -33727 -9278 12388 20914 31194
16673 31194 37643 48421 67914 50747 -45639 -61867 -33122 -31306 -23655 -60471 -92807 -88628
16661 -88628 -38162 -6352 -22895 -18241 -27493 -40720 -19571 34299 42820 32120 -30483 -29791 -8908
16648 -8908 -31914 -61091 -37222 19828 20800 -17314 810 69564 36373 29194 14666 -36410
16636 -36410 -56255 -101772 -81906 -55079 -51987 -46481 -79853 -59990 -10263 -65514 -113992 -80464
16624 -80464 -41066 -34400 -62622 -17651 -16977 -39306 -26045 -45598 -66079 -68508 -53929 -66531
16612 -66531 -111953 -129520 -75716 -15332 20351 19045 12266 14669 33153 -18639 -59374 -54725
16600 -54725 -82533 -49718 -34658 -36131 -45712 -14289 44671 45567 12538 -570 -42388 -102288
16588 -102288 -86409 -13254 4891 -16469 4880 10613 37084 40083 3257 9429 -9181 -25428
16576 -25428 -38581 -31977 -12448 -23276 -28509 -19115 -43835 -101082 -64585 -24599 -787 30479
16564 30479 38392 53051 52715 28062 -2482 -50273 -13514 32458 2736 -1122 -15287 13045
16552 13045 46420 44419 23006 8373 2773 18250 32865 20946 31760 36890 5218 -37711
16540 -37711 -53313 -41775 -13770 23811 16914 -12363 -32707 -27839 1944 -21302 -33144 -2117
16528 -2117 17915 -15777 -24979 -52033 -38832 -13817 23130 32348 -4185 -25212 14694 -39696
16516 -39696 -43096 -16195 8016 -7873 -14149 -21169 -57772 -9269 3337 -30552 -72844 -99385
16504 -99385 -104936 -77735 -13371 -18884 -7080 -51409 -58150 -24350 -7325 -5603 -18998 -17676 -54011
16491 -54011 -48875 -41603 -32165 -43116 -15203 30 7369 -24220 -63258 -86336 -66096 -22294
16479 -22294 -22940 -41891 -29826 -82116 -46590 -25627 -29761 -22453 4450 14496 -14872 -48071
16467 -48071 -60161 -7659 21135 22153 14587 23015 -6712 -9562 -4283 -18595 3065 56205 33432
16454 33432 2450 -46618 -38359 6610 -15626 -75975 -51912 -3970 8192 -12879 10005 22685
16442 22685 44107 84124 83953 48475 25950 37934 49790 13887 -4343 -3330 -20521 3869
16430 3869 35036 70543 93193 55593 16849 -12929 -19030 19767 23857 -27011 -9386 15178
16418 15178 3261 -1873 28303 58642 12511 -41222 -74917 -84325 -101977 -106316 -97695 -76158
16406 -76158 -62522 -66923 -31561 -31664 -26586 -14253 1206 -34758 -60894 -91583 -105373 -44158
16394 -44158 -22335 -25309 -14386 -17795 -16121 -17251 12870 967 -16235 7322 -9580 15360
16382 15360 -25449 -88808 -57091 -2802 4393 -28942 -43789 -12830 -13983 -38341 -51372 -59420
16370 -59420 -57350 -19644 19834 20786 20627 -5648 -43179 -18876 -6940 -14222 -10849 19532 19425
16357 19425 -1628 -27112 -32974 25687 51173 75583 56068 33195 33724 -4460 -27139 -25074
16345 -25074 -6602 21250 40925 37049 64679 25486 -16145 3128 30448 -2493 -14065 -36908
16333 -36908 -57816 -37919 4489 -2199 -56103 -9484 22041 95 16910 -6922 -48770 -42372
16321 -42372 -66847 -67731 -37116 -2611 17162 25335 37796 25091 23097 -21042 7489 36414
16309 36414 34494 14976 5301 64271 103744 102668 47262 -23766 -16580 -21888 30173 107977 91689
16296 91689 31490 35978 42115 -8687 -43488 -78056 -58655 -60290 -82106 -110253 -94456 -27180
16284 -27180 -24758 -10196 -33995 -1518 24226 36816 34018 29902 14370 427 23772 41815
16272 41815 358 -3891 -16496 -34044 -6299 9516 -4931 9118 -30385 -21533 5742 -27768
16260 -27768 -8068 3530 -18168 -29950 9721 40969 29309 12009 31263 74072 83214 66790
16248 66790 46820 -14045 -21095 -51241 -55847 -42214 -42710 -14527 43572 24180 -36578 -51304
16236 -51304 -24478 14359 31162 2478 -79696 -96871 -33696 -19070 -2437 2861 18142 19975
16224 19975 11220 -899 13325 20996 37509 28206 -14578 -22028 -35765 -96467 -108437 -93150
16212 -93150 -64321 -33165 -11302 -51380 -35904 -31995 -87965 -75568 -40776 -8531 -39474 -46137
16200 -46137 -26929 -18519 483 -30561 -12984 -29021 -38491 12114 56949 23669 -1796 -9409
16188 -9409 -37405 -75825 -79375 -39753 -25786 13519 -8532 -20162 -35210 -51893 -54288 -63958
16176 -63958 -52433 -2971 30057 13812 -22724 -37653 1244 16021 48234 58189 38118 26431
16164 26431 33930 1580 -25893 -39795 -52765 -39589 -7672 -7282 -3308 -13419 -1481 27168
16152 27168 12136 15178 9817 -25452 -50514 -48620 -47023 -21020 -41470 -31316 -4439 -28681
16140 -28681 -73401 -66471 -55023 -73540 -89514 -73781 -88355 -32879 -62183 -90395 -78151 -98615
16128 -98615 -88143 -77740 -73017 -73117 -72505 -53369 8593 -500 -36914 -22847 -8596 5405 10422
16115 10422 3128 -36733 -23535 42285 34480 10550 30704 26615 52176 28376 53496 28908
16103 28908 -10030 333 22288 22271 -6790 -91316 -78353 -35332 -18277 5001 -10022 14630
16091 14630 -5196 -2137 -5545 -36081 -75098 -44461 -36000 2494 -16932 -29830 -45820 -40149
16079 -40149 -38424 10894 82037 38627 11812 -9675 13244 26868 30700 48935 34402 -15591
16067 -15591 -54334 -104719 -113312 -43340 -18073 -9415 -16988 -24779 -43947 6587 77219 51039
16055 51039 3129 -7960 -34741 -54402 -81870 -96870 -69481 -30022 -44434 -5290 46070 76515
16043 76515 62468 63279 -15549 -47716 -63127 -88635 -96493 -62215 3105 20326 -4262 -46169
16031 -46169 -64663 -73089 -59671 -48237 -44862 -20772 -14583 15268 39290 37568 33067 26183 29347
16018 29347 12733 -41389 -254 23567 10255 5115 25535 23983 -33207 -18136 18807 22640
16006 22640 -18486 28588 63651 26592 1128 -34595 -20936 30822 21976 11459 23676 30436
15994 30436 10184 -33246 -51206 -60143 -5931 37943 11643 27160 2298 6960 -18234 -25140
15982 -25140 -32752 -18055 -32504 16635 28381 60733 38281 -8620 9710 45248 57403 55824
15970 55824 69829 1501 -70199 -94013 -70961 -17142 -11445 -39435 -47312 -14003 -11407 -69706
15958 -69706 -65337 -66958 -40487 -63639 -60877 -22916 -6336 -3813 -12283 -19879 -37590 -9259 28208
15945 28208 31967 9716 -54286 -89236 -82912 -54896 -28171 -13534 57402 77091 61525 -4874
15933 -4874 -32931 -31091 -23667 -19827 -63728 -87592 -96230 -101664 -116562 -50696 -35173 -15046 24146
15920 24146 25590 -34961 -29576 -19743 -6553 36727 35646 21057 21417 33183 -36098 -32709 -18984
15907 -18984 19545 44589 66993 34531 36135 9048 -21134 -58659 -115142 -100519 -48513 -2728
15895 -2728 33668 56891 -8288 -22544 -12637 -10900 27210 47836 2672 -5261 42972 70841
15883 70841 90066 74120 30839 37240 15114 1143 58221 24669 -15355 -19204 -38527 -45984
15871 -45984 -11268 2590 -5566 -32211 -51305 -26595 -26113 -41656 -41692 -3275 -14536 -46859 -23806
15858 -23806 1425 23698 41516 55047 38065 22746 -27198 -88070 -62338 -19965 6573 3906
15846 3906 -4937 -35835 -37820 -7689 -6438 -53325 -78264 -27965 1212 21169 17715 33195 44384
15833 44384 -15841 -13296 -23597 -85869 -101650 -59560 5958 33857 23483 3012 9938 7472
15821 7472 47456 37781 19460 40473 24716 22717 20318 -13344 -55166 -81749 -62796 -55912 -71882
15808 -71882 -54271 -46021 2397 1075 -9130 -28004 -59768 -13109 15792 -3162 471 -43954
15796 -43954 -74309 -20001 -7063 -78211 -57760 -23044 14640 -7773 -36559 -41036 -32769 -10371
15784 -10371 -11726 -19879 -16094 -34024 -14752 12442 8522 1249 4193 3033 -14526 -1808 31352
15771 31352 63153 52631 8456 -16698 -29803 -22463 -28282 25282 34068 17006 -829 -20004
15759 -20004 -46788 -54014 -47827 15830 -11144 -72182 -55676 18989 13119 -14229 -19457 -22921 9353
15746 9353 14413 36908 63129 8619 -14676 -21124 -26354 -9094 9632 8890 6177 19186 14676
15733 14676 -27151 -33448 -25122 -100709 -108851 -35118 -37258 -59282 -19430 24985 47448 44850 36531
15720 36531 39461 44509 29227 -12239 5627 23433 68244 72561 14400 -2482 44522 21880
15708 21880 -37448 -28534 23364 31656 -39285 -48719 -32811 -72235 -64449 -12948 21944 -26572
15696 -26572 11634 33211 9253 -22511 15222 63165 39745 65817 57933 -29803 -43106 13994
15684 13994 27679 46018 23474 29013 1561 -45567 -37513 -34697 19527 42066 31313 16664
15672 16664 -14229 -4427 -9188 -19118 -18497 -6837 17826 -24980 -6988 19719 15324 46224 44082
15659 44082 10726 13993 -2217 -25921 -43972 -29713 -24956 -36046 -52712 -31857 -21448 -30507
15647 -30507 -60606 -59875 -10258 -46751 -61039 -19533 8533 -32177 -60028 -83365 -78673 -90450
15635 -90450 -114749 -118435 -70049 17533 50461 67883 26328 8902 -21377 11288 40926 -10398
15623 -10398 1666 6137 -6776 -12336 -1111 -25966 2429 -10424 32590 67465 14732 40807
15611 40807 -6498 -57078 -62348 -103307 -110974 -77495 -22843 -40155 -36309 -25939 26014 95832
15599 95832 92747 24101 10901 2521 -47584 -38887 -38348 -24113 26053 28210 -16706 -2526 -41390
15586 -41390 -73972 -65424 -59246 -33346 -3580 -49791 -75216 -77786 -89844 -70710 -30682 -2644
15574 -2644 19633 21366 -659 -24485 -55580 -42720 -26455 -19470 -68177 -84927 -70202 -20554
15562 -20554 78397 107528 60068 14060 -51795 -48526 -62066 -45653 -50589 -52769 -51119 -54970 -23292
15549 -23292 3911 -24681 -19409 -13991 -39670 99995 155133 107593 63899 -7741 -48716 -68120
15537 -68120 -26877 22167 24003 -1948 -10567 17250 30998 51630 1209 -54787 -63976 -17426
15525 -17426 17374 45014 29893 13081 3747 -12380 -251 -25901 -81609 -2529 16620 32330
15513 32330 30718 32854 1717 -51008 -25205 4026 39524 27654 28938 8742 -21047 -1621
15501 -1621 -14618 -23218 -40845 -23390 42114 59028 26910 -10378 39458 32627 -4786 15167
15489 15167 10695 27462 64154 36582 25080 16252 -14160 8227 101006 119464 115538 118681
15477 118681 100650 28217 -34702 -65579 -86327 -81724 -74657 -62973 -22004 1295 -37852 -38032
15465 -38032 -15135 -1698 22551 40644 59893 23830 -17247 -42612 -7239 7440 29782 41788
15453 41788 8440 262 40901 40239 67009 82848 60500 18395 17611 18719 79374 78074 10927
15440 10927 1535 23084 23276 12468 -8221 -33336 -25364 -20798 -567 5998 2203 -40071 -30206
15427 -30206 -12320 42374 63278 45705 8865 667 -22043 -1244 -380 -27319 -23536 -12677
15415 -12677 -7784 51258 91204 85840 49138 33182 30885 53444 73268 50960 44237 -6310
15403 -6310 25126 51212 46358 62906 48712 30772 35522 63071 83017 113070 66588 18814
15391 18814 15711 12743 14849 -49462 -71423 -93260 -80313 -47626 -15887 -9847 -3124 36616 36294
15378 36294 24576 -23727 -59677 -40327 -42363 -27789 -8160 -6919 -38755 -38695 -32757 19621 44585
15365 44585 54375 32882 20219 27038 51061 65282 17029 36666 101475 56585 34558 33860
15353 33860 16630 37982 41500 16814 26068 -9197 -2842 10415 -49898 -113794 -135368 -104003
15341 -104003 -29588 2646 -12848 -49375 -84670 -47093 -6854 22896 27097 -19625 -37355 -8623
15329 -8623 15806 12887 42382 97721 105107 65845 58474 42618 27995 17206 8447 18100 21051
15316 21051 32439 48187 29480 32710 43361 -18228 -44497 -56866 -36841 -51005 -15001 -18743
15304 -18743 -24936 19296 11430 -685 22071 68526 35006 12289 -18808 -39304 -51633 -20260
15292 -20260 -99668 -67964 33332 20986 -13310 -10790 23385 53238 70272 29306 3789 -18984
15280 -18984 -72446 -63180 -6567 30805 68674 36909 -670 23444 -6408 36847 57229 55672
15268 55672 20147 45122 70606 112753 182937 190574 129052 67178 40601 39941 46155 21829
15256 21829 -21524 -29622 -40095 -57261 -8442 -22980 -65760 -76685 -91588 -87285 -75010 -48019
15244 -48019 -61894 -41084 -17781 32710 7309 -30657 -31126 -23428 7649 8797 -44586 -94392
15232 -94392 -54253 -11806 7268 -17106 -3287 30867 25526 -7377 -42754 -26068 -2233 -31288
15220 -31288 -25821 23951 35532 44782 55958 7426 -28507 -19472 -3363 43634 88041 129130
15208 129130 67687 56865 72357 -10437 -33428 -62717 -49683 -1664 54 13430 -15632 -31094
15196 -31094 -43031 -12045 43002 5511 -36180 -3252 23360 17061 18091 60911 60588 22052
15184 22052 8606 29280 15649 28967 -1171 24272 31187 2909 -34853 -32300 -25703 -30221
15172 -30221 -52568 -55452 -70889 -80116 -74644 -23102 -7259 -2340 15919 40795 63839 41045
15160 41045 8347 8519 -431 -2955 13649 -2899 -54736 -114400 -109119 -26890 7850 -4322 -41292
15147 -41292 1717 45409 26041 -3895 -24189 -39826 -36251 -13060 20651 33321 33961 28495
15135 28495 -38158 -50334 -28548 -51928 -30398 -31470 -69163 -93790 -90303 -90080 -82205 -35710 28071
15122 28071 37284 -1063 11486 86131 105469 21598 -58856 -120926 -107032 -71173 12705 46949
15110 46949 -1422 -54486 -21779 -5688 -8269 -16644 -78462 -99512 -59835 9839 4228 -42542
15098 -42542 -13159 36687 10053 63875 74750 47527 -51640 -61170 -17698 -10397 4823 20007
15086 20007 9365 -5512 -6611 2788 40047 30833 -4066 -27539 -39175 -26559 -33388 -18204
15074 -18204 -13378 24457 52339 57966 42173 11948 1245 34252 35999 39526 14828 -21433
15062 -21433 38755 24743 -21775 8873 6808 -35680 -22200 -20309 -43383 -84506 -73391 -79362
15050 -79362 -56097 -56032 -20938 42881 42181 8461 -21944 -10503 41315 69608 83181 82135 20111
15037 20111 30376 30529 18127 -20895 -21812 -12781 44367 44330 -10199 -44107 -2556 18896 -15093
15024 -15093 -21236 -13563 -4924 35896 27117 35083 86002 64196 79924 73268 42421 -25649 -2935
15011 -2935 85296 131279 134032 164316 176057 246135 334320 554520 922933 1298305 1348476
15000 1348476 1097293 746572 447486 277214 194304 97158 65135 37918 24353 -19351
14990 -19351 -21606 -41650 -38826 -35377 -245 46418 54590 54738 40834 18534 32996 22548 20321
14977 20321 -2055 -25633 1359 51732 62765 23394 -14271 10460 -18230 -58539 -50953 -18770
14965 -18770 31941 3994 -32310 -35015 -35884 -88110 -76891 -54559 -62481 -97799 -101766 -106556 -78314
14952 -78314 -48548 -111511 -124650 -102345 -10871 -1987 26039 59534 98103 75800 37788 2874
14940 2874 69996 96964 40052 -9881 -62950 -67088 -110934 -66998 -36231 -17262 -54770 -56761
14928 -56761 10095 53084 49264 32912 25601 399 -38739 -60083 -37870 -18394 -8219 13219
14916 13219 50501 56881 48761 34537 -7777 -18508 -3290 6618 -21348 -77539 -62713 -36524
14904 -36524 -18505 -23171 4250 6013 -11041 -9097 -41236 -32771 -46994 -39902 -1279 -3498 15555
14891 15555 -17180 -6536 14272 7774 27259 -27585 -63191 -43868 -17364 -31605 -52834 -16335
14879 -16335 -9097 -11601 -45969 -94881 -92218 -94548 -65819 -20114 -6349 -10798 114 23148 17675
14866 17675 8419 15233 -742 -23481 -10210 -24596 18685 94210 59897 11013 -42251 -7965
14854 -7965 -28799 -68124 -45348 -35474 -11539 18889 24246 30457 10413 2048 34391 31329 19526
14841 19526 39112 12622 -6000 11871 8913 8529 10672 8259 14249 27549 -6221 -7111 30269
14828 30269 14118 -53205 -37699 -41015 -56299 -53820 -68111 -41738 -37052 -44104 -44661 -54911 -64503
14815 -64503 -50174 -1302 -6589 -52959 -86438 -56305 -55395 -15599 -16885 -4242 -13609 -21881 7831
14802 7831 -4496 -52540 -93481 -76969 6052 33745 24253 -2911 -1408 -512 -8331 -2302 27690
14789 27690 22101 22454 -20208 -53477 -73346 -76644 -26340 41023 67817 51689 30706 -8346
14777 -8346 -16431 37122 58663 8888 8678 69896 117760 46981 -13625 -65396 -46511 -12395
14765 -12395 -23555 -19218 -1648 22873 12607 -3007 -16193 10619 -26348 -41672 -47751 -41672
14753 -41672 -14674 -19528 -9967 1648 -58488 -100738 -73406 -77305 -30747 21075 61241 98469
14741 98469 112439 47352 20669 27799 35380 25955 24568 -1666 -17734 -21775 -22893 -55724 -57378
14728 -57378 -50851 -50723 -65043 -56017 -77920 -43391 1095 -13553 3849 -15288 -14667 3053 -2775
14715 -2775 -19341 -31349 15390 3806 20671 59054 68708 84466 8084 -5981 -4774 -2342
14703 -2342 -53916 -86361 -33876 -6597 -28076 10342 27249 22398 -52328 -71873 -43451 -7462
14691 -7462 -12071 -10832 -21870 1829 -14101 -26768 -50701 -33478 26825 47073 4039 -38485
14679 -38485 -49120 -35501 2946 70074 97031 121877 114754 96638 12629 -33296 -83409 -27898
14667 -27898 -17647 -6564 -8454 2217 -6351 -11680 -24742 -16045 16931 63683 52115 25326
14655 25326 12858 195 -2397 -15665 -8202 30814 25672 25102 22593 -29115 -44848 6998 -20786
14642 -20786 -10206 63546 61667 25875 26796 40410 22652 23893 3164 14848 -20154 18234
14630 18234 -35037 -92998 -79247 -25404 -21333 -72875 -86010 -22992 -32975 -41502 -47331 -4820
14618 -4820 19476 18825 16274 60449 65586 114559 87781 56466 33198 15990 -20544 -25115 -42686
14605 -42686 -36913 -41469 22761 31717 16617 -28554 -22985 4023 19439 14529 -19393 -28483 -6433
14592 -6433 12483 20383 4264 -16565 -12024 23326 69963 6556 -13338 -21233 -12028 26140 17062
14579 17062 -16681 -9181 -25005 -13771 9503 -16679 -17600 8697 11178 -24761 -6186 10663
14567 10663 8855 45976 46519 -8656 -10651 -4334 -6749 47429 55927 13029 16155 46035 8441
14554 8441 -14906 -64861 -81963 -22704 4221 35914 47089 68913 74666 76909 43733 29688
14542 29688 31094 29628 20609 20012 19338 32266 31071 39497 -20012 -41315 -32654 -1538 28951 43793
14528 43793 31807 17030 -18967 -4093 -112 -520 -9360 -38858 650 18991 37510 44193 75599
14515 75599 100753 76716 15509 31177 26480 -14164 -6042 52464 86512 57126 50395 46709
14503 46709 61902 99490 87314 116378 121118 99780 29980 -12863 -6844 -389 5809 35914
14491 35914 36387 54680 58947 28404 34193 53128 70676 80047 90592 58959 63947 78892 41017
14478 41017 -12416 -13876 13798 13075 -13999 -28469 -33392 -53668 -70988 -59089 -66525 -11742 -24180
14465 -24180 -70127 -63346 -43426 8972 52034 84942 64827 31789 68331 72073 51926 23543
14453 23543 21622 34090 1851 -46788 -76829 -41853 -23992 -10811 -8378 44014 67266 22420
14441 22420 -12073 -42113 -49830 -36177 26395 69316 69564 33958 -11769 583 -18567 -43744
14429 -43744 -8232 4587 13243 77250 78922 31052 -8789 1766 -3491 -72516 -98774 -108587
14417 -108587 -62321 -10456 9855 -7915 -34181 -51563 -44543 -29385 -33320 -8014 -4384 -24766
14405 -24766 12860 2208 -68031 -88495 -97274 -82939 -56933 -922 82040 93856 89974 52042
14393 52042 36065 58212 31499 1595 -1846 6434 6855 6403 -3793 -64975 -34948 15670 13825
14380 13825 -29950 -36771 -62375 -104955 -102355 -68265 -27561 -6673 1777 31865 15778 -1065
14368 -1065 3804 -16345 -60336 -96059 -62713 -5843 -506 564 18792 25267 65694 45126 -28974
14355 -28974 -18025 25970 5793 4605 -18656 23641 -40827 -59739 -59527 -27473 2224 71452
14343 71452 71039 30743 31306 14008 -20449 -24950 -75483 -89383 -66063 -4492 -7815 7872 -12307
14330 -12307 894 19030 -31111 -68478 -46180 -18135 -12177 26931 71716 72221 74902 48602
14318 48602 34280 38562 63616 56036 6502 33991 23696 16041 -14717 -19019 36833 95490
14306 95490 85472 76364 81565 84984 55977 44334 40094 66591 86544 110731 90735 57027
14294 57027 28429 60285 83370 76013 -2263 5447 9814 9318 2215 -31863 -56140 -9462 31597
14281 31597 34522 46123 53814 39760 3710 -6875 17249 12049 38145 42559 18509 4992
14269 4992 58725 59638 -28402 -47388 -22697 1112 -34139 -37453 -17883 -36978 -4835 44449
14257 44449 50255 49769 49003 31269 -21326 -34618 -37855 -26484 -32378 2385 -21374 -77229 -75826
14244 -75826 -37290 -7071 32985 63367 926 -5944 52766 37845 53812 4300 -49154 -66195
14232 -66195 -46343 -54957 -43107 -39164 -50226 -55826 -34195 -1545 -54528 -48348 5444 -15233
14220 -15233 -23830 -35358 -297 22036 15062 11983 25498 41692 23943 7521 23931 50089
14208 50089 50153 41732 28204 20897 -30861 -60421 -16616 36225 37563 42575 11691 -13103 -11601
14195 -11601 -48167 -96427 -77099 -27741 -1056 12351 15083 22543 6646 -51409 -21996 5111
14183 5111 24960 44253 83932 123003 129458 57744 -11245 -46427 -59618 -14850 -13210 -4061
14171 -4061 -3939 1966 20325 70276 60919 12698 -20465 -4320 -8559 -4104 18179 63210 55512
14158 55512 45771 55514 77804 111928 47609 31232 14015 3973 3081 46461 60978 55815 8280
14145 8280 -61286 -14366 1320 -3897 30632 23603 -24090 -54705 -31124 17501 16190 -30143
14133 -30143 6914 50943 70875 64949 44127 56790 51660 -3681 -42627 -30815 -29204 -25498
14121 -25498 -226 -25321 -6003 -15347 -17793 -33389 -45513 -71666 -61672 -12915 34972 46843
14109 46843 123346 109622 54122 3913 -13828 -7764 -29029 -1396 59117 51625 11517 -27279
14097 -27279 -53497 -58773 12412 -16825 -34026 -6052 14302 -27946 -23721 -59008 -80040 -48084
14085 -48084 -39829 -43216 -21934 -345 11020 13800 2182 21466 20588 -22310 -78812 -46710 -44884
14072 -44884 -14203 -9443 21371 16903 -18237 -23726 -33545 -109479 -136935 -98978 -78274 -76950 -52756
14059 -52756 -48133 -32527 -34046 -20697 -7702 324 -35007 -30132 -34170 -59790 -28991 1355 -14742
14046 -14742 -2867 -27046 -31790 -36342 -17967 158 20219 36402 27086 785 -63393 -80296
14034 -80296 -42137 -41094 -26210 -69705 -28082 14441 2604 41158 80800 8424 -69069 -79026
14022 -79026 -61279 -63299 -63682 -71979 -85823 -12339 18171 51372 48794 28470 47515 42018 -8696
14009 -8696 -653 -68982 -78648 -11968 24704 16790 25081 64118 44579 23157 44622 38052 14721
13996 14721 -43525 -80364 -29727 53130 49033 50272 39377 8115 3486 52610 35848 31714
13984 31714 25337 47435 38724 18161 27257 41820 44300 663 -71137 -113492 -94096 -60838
13972 -60838 -11388 -28764 -40813 -35650 -58045 -44984 -3658 57279 68005 26139 -26774 -13539
13960 -13539 35033 6083 19726 -16564 -12983 32180 49592 -12662 3004 -12777 -30777 -20867
13948 -20867 -22293 -58124 -40446 15250 23013 16624 26090 48935 35773 13765 22077 -14901 -67430
13935 -67430 -63435 -49056 -14631 -9980 12126 -9647 -6400 -22792 -26803 -28379 -8653 -5232 -28324
13922 -28324 9985 -634 13993 21505 38363 24787 900 52531 98623 67320 22016 69965
13910 69965 76750 79591 45588 57473 77244 21299 13203 -18359 -36670 7557 36550 15518
13898 15518 -35071 -36375 -76218 -72562 -51231 -73037 -57015 19883 52513 30067 33540 64799
13886 64799 68021 36824 64718 76064 45718 27090 11784 17345 46036 81694 90940 64868
13874 64868 44559 2447 -59200 -30528 11813 -19986 -35496 -39350 -14457 28903 44853 55386
13862 55386 65486 45204 43416 9361 18733 47001 35643 -43918 -70813 -65758 -40908 -4919
13850 -4919 -2400 1875 -43301 -47810 -10954 33493 74874 59740 22068 25 10144 -24282
13838 -24282 -45315 -6146 8634 1000 -20323 -91495 -103185 -81726 -69693 -67475 -23254 15300
13826 15300 13435 -45322 -62974 -32908 -30098 -48010 -45864 6524 42139 60292 45063 -4974
13814 -4974 -53933 -93962 -43484 -40665 -58724 -116669 -98611 -79614 -91418 -85955 -82113 -44335
13802 -44335 -39293 -47975 -63521 -18330 12800 38210 17268 2021 28505 10113 -15808 26896
13790 26896 33380 11305 -12134 -73138 -73538 -25119 -1351 2886 1648 -22764 -83295 -121510 -115167
13777 -115167 -66918 -56158 -46860 -40238 -35419 -7863 18313 50624 44619 39242 24128 -20483
13765 -20483 -14484 23097 42367 51461 33334 51576 8313 -10270 5168 8233 73717 80685
13753 80685 45191 23668 -1111 2969 22171 34018 42657 -1149 6180 20033 21429 3758
13741 3758 19001 12902 -15485 -41565 -33587 -2198 -35572 -98449 -82025 -89035 -120278 -102384
13729 -102384 -53133 -53688 -50532 -29188 -27246 -9055 34968 19795 -53466 -65041 -76680 -54974
13717 -54974 -47152 -27867 -15454 -3172 -8089 20099 58187 38091 28170 15055 29433 25130
13705 25130 -34104 -4029 -2590 -60122 -53878 -51975 -1312 16704 7595 -41416 -33416 17761 -2844
13692 -2844 355 -35801 -46953 -22414 -13165 26373 40738 25746 -3879 -973 7668 17937 -2304
13679 -2304 45606 90316 61888 41513 43528 22656 -10487 -56168 -38029 -53930 -51353 -53926
13667 -53926 -45921 -17910 -23478 -59246 -81603 -60404 -70609 -48751 -52173 -96004 -80244 6389
13655 6389 43553 80729 67503 11376 -4869 7071 12816 26738 -695 46701 10661 -25752
13643 -25752 -37920 -32463 19070 41892 35946 80586 78033 93800 64890 23702 40156 29503
13631 29503 -32021 -33807 -56337 -46394 26137 8603 13236 3273 -11915 -6124 9450 16778 23519
13618 23519 41943 15349 22964 -8599 6282 10375 -40759 -78989 -79911 -84613 -32524 20119 -24780
13605 -24780 -16811 -183 19141 1566 -35406 -7915 17653 -7809 -35062 -35906 -5105 18081
13593 18081 -5304 -23851 -40151 -21257 -16094 -5478 5153 -37525 556 99407 108865 63052
13581 63052 59568 63088 29327 5112 -4781 52929 66833 47830 4152 -15815 24357 -11948
13569 -11948 -25647 -25796 7146 67945 44713 50086 68533 28851 2178 25230 54832 55470 58963
13556 58963 18566 11167 31331 2988 3283 31469 31884 37525 55929 65804 42922 3502 21083
13543 21083 36758 71787 82114 35406 10509 -13483 -13858 2262 -9449 2033 22795 30647
13531 30647 -53529 -75206 -31416 -34282 -39637 -24133 -25182 -53983 -47754 -2228 55108 74748
13519 74748 68783 37432 8665 7551 -4036 50953 67440 94477 60470 30008 7805 -11563
13507 -11563 -8169 -22157 23883 83313 114652 101199 61646 38425 -8251 -45419 -60139 -52920
13495 -52920 -42321 -13867 -71641 -126572 -103591 -60567 -78667 -86619 -38033 -33030 -44886 -68790
13483 -68790 -54646 -16142 17678 31455 -1980 -16954 -102992 -107384 -30794 -23808 -4929 15095
13471 15095 -13070 -15745 -45595 -56054 -19478 34137 64814 15128 -23166 -10024 33465 63133
13459 63133 77689 24250 25655 27413 11799 47781 64577 41755 12422 8018 49477 -15979
13447 -15979 -67125 -73735 -44371 -25956 -64550 -59448 -53248 -12340 33098 -579 -53285 -12381
13435 -12381 1566 -5876 -46341 -27994 -17173 -50345 -52276 -46449 -55654 -38015 9649 30627
13423 30627 -18406 -13869 30036 57310 42583 -9248 -19755 -5794 -16970 -32127 679 33354
13411 33354 -3234 -20122 25375 37668 50484 -18262 -33006 -42536 -57089 -35243 -61297 -70787
13399 -70787 -45681 -62738 -104664 -82237 -65170 -63504 -71223 -259 5916 -19381 -3900 -426
13387 -426 5426 -8619 -8464 3849 35504 79952 59794 74536 92119 73738 69475 86233 80019
13374 80019 79005 3317 10226 35027 43149 41551 30170 -24447 13501 19440 16496 -18011 -39439
13361 -39439 -56003 -74047 -76450 -41295 -35148 -19061 -8001 11197 18270 49444 62580 33160
13349 33160 18865 37332 46636 36974 -14687 -28156 -135 62221 105673 33642 -20630 -24686
13337 -24686 12534 42451 50017 26801 -21382 -36961 -46280 -6183 7991 12739 -2224 -7395
13325 -7395 3244 14931 -21850 -28199 4620 32573 101874 147685 90388 93726 64698 49034
13313 49034 55552 85629 67590 -1169 21239 16252 42091 98153 79323 37841 29478 66597
13301 66597 48000 73873 113844 109464 73957 58551 62804 32797 10633 38226 13595 -13406
13289 -13406 -2829 50360 44168 30790 27922 25549 1682 39527 58375 111322 116488 140410
13277 140410 166037 136554 31761 7833 23587 36818 32028 41960 38588 25210 20162 56841
13265 56841 109967 110800 89717 68731 55833 91723 69361 46687 79596 64250 40458 7181
13253 7181 20070 76980 36880 -66530 -92026 -6860 32781 44733 55676 13018 5572 30084
13241 30084 47227 30493 12920 -4681 12265 24902 7922 13719 5267 -11178 -40242 -13790
13229 -13790 41603 49965 12164 -28138 -23157 23434 30693 329 456 33432 45394 38902 28856
13216 28856 18921 4288 25353 49665 48311 57059 37026 32577 27243 34356 90589 44839 32104
13203 32104 57838 59248 16066 32028 44348 77487 65975 49305 30163 43189 88781 51302
13191 51302 54124 68450 35171 14595 -5628 -11200 -26249 -51437 -63142 -64638 -25325 -20534
13179 -20534 -43288 -54957 -9930 25389 -65159 -142907 -139481 -100175 -76467 -40967 -29883 -42751
13167 -42751 -12209 20396 30672 25011 -15513 -8472 -1486 -3254 13448 -7566 2362 -17482 -15613
13154 -15613 -24451 -32754 -14080 -16135 -16640 19102 41979 32963 5849 -19864 -34243 -66074 -33419
13141 -33419 -14356 -68199 -63298 -39308 -22871 -21426 32657 28242 -15654 -12605 14052 61070
13129 61070 27884 51134 42514 12772 2181 5665 16584 36151 18927 26631 16409 25916
13117 25916 17742 5513 7761 17536 -13257 -46591 -51931 -8083 -21738 -1872 2263 -12200 -6894
13104 -6894 22854 75843 73641 -6738 -38132 -51665 -63864 -61142 -41390 -53998 -55005 -19918
13092 -19918 615 -21690 -35313 -78460 -132791 -139742 -124152 -115054 -61694 -20970 -30112 12537
13080 12537 13855 26413 14726 -9564 12213 42414 54545 17674 -43784 -71934 -79856 -73278
13068 -73278 -49117 -45219 -39615 -22636 -55723 -99118 -75347 -26483 -29988 1652 -1512 -4637 -33830
13055 -33830 -72078 -84564 -24976 10195 5321 51197 41841 -35481 -49701 -13778 41410 21409
13043 21409 2722 -23149 -4457 -29188 -40401 -46330 -19589 34332 33625 19719 3789 19025
13031 19025 -35207 -32958 -30920 -14181 -34624 -118843 -92515 -14654 34706 34355 13988 -43556
13019 -43556 -66045 -43758 -32142 -34337 12258 7106 -35577 -52226 -59901 -38646 7908 51962
13007 51962 5236 -22063 821 -3307 -24348 -15497 -13531 -27928 3566 49300 63478 66565
12995 66565 55642 30845 13913 -17332 -57555 -73982 -26741 -29965 -96670 -102336 -39949 -4910
12983 -4910 -1155 -38836 -14306 -48086 -80991 -16456 -20585 -9805 -46572 -31324 -6997 53734
12971 53734 70861 64987 81723 67965 17741 3565 955 43368 63367 60104 28369 21287
12959 21287 -16337 -11947 36018 56539 83502 67712 19172 26082 52381 8458 -40009 -49146
12947 -49146 -29183 -29461 -31826 -3608 37001 20875 -3493 -49284 -56493 -24619 -77856 -110396
12935 -110396 -68549 -18749 2524 16324 12027 60447 74329 -11871 -55566 -51359 1985 39761
12923 39761 26717 -2948 -28535 -76475 -32751 31553 20979 -14164 -6148 -28736 -14976 -35098
12911 -35098 -50311 -57604 -68543 -75533 -79155 -48967 -11395 -30014 -35276 -623 37472 21511
12899 21511 -15323 -18097 -32343 -74278 -52114 -11959 -35150 -38040 34139 73540 11363 37897
12887 37897 51228 13018 11556 -3480 -28298 -40244 -17087 245 -17981 -28724 -63020 -81826
12875 -81826 -95604 -45499 -6156 -6241 -31515 -33253 -18652 -30837 -19161 -31719 -83655 -62359
12863 -62359 -30429 -69360 -113759 -61596 4817 12965 14077 34832 -10512 -61225 -68672 -19856
12851 -19856 33780 54639 61094 25292 23824 -28215 -27350 15592 16250 -30320 -14376 -23190 -51551
12838 -51551 -18500 -22648 -37175 -54025 -59871 -27043 21485 14800 -33344 -93818 -128298 -92540
12826 -92540 -25603 -44291 -113540 -145513 -103502 -38293 42500 33673 -9420 13639 47379 57757
12814 57757 50441 -17772 -70725 -56405 -30720 -25072 -14908 -4156 -26312 -21275 28098 44350
12802 44350 12947 -34720 -58013 -71356 -58441 -4967 7631 495 26177 70256 4807 -37122
12790 -37122 -69589 -55162 -50296 -57784 -1298 681 29177 70130 32869 -19398 -23832 -42224
12778 -42224 -35366 -4093 2169 -37215 -67880 -4703 10225 -3065 -36896 -8770 -37640 -75146
12766 -75146 -38298 -10268 -17626 -4047 -28016 -40944 -63143 -72403 -83569 -52195 -30598 -50263
12754 -50263 -82546 -77220 28350 61538 10198 -2033 5491 12362 -9898 -51241 -86139 -119770
12742 -119770 -138881 -40692 42992 74912 97737 66521 9688 -23764 -71001 -56023 -45188
12731 -45188 -48910 -67383 -56245 -13637 20370 24859 71579 76726 62914 17511 5336 17842
12719 17842 32061 24131 23764 35747 36950 29536 30731 -4532 -10737 60462 130466 112914 51194
12706 51194 9151 5557 -2702 2305 -45754 -20608 -13317 -35921 -5416 955 13110 47761 29948
12693 29948 20900 -12811 44091 81922 76190 40950 18912 -14862 -36319 -11803 44898 53560
12681 53560 27802 9021 27840 28118 -615 -6517 -19178 -40305 -59069 -55203 -38554 -18567
12669 -18567 -14141 -8606 4574 15157 25179 40999 -22267 -106859 -96970 -86328 -50756 -48396
12657 -48396 -28311 -41918 -56220 -45937 -76663 -114557 -85387 -58578 -6384 28723 39224 22161
12645 22161 28626 -34494 -58348 -14152 -906 -2691 16355 50297 98111 149970 230496 197744
12633 197744 142470 72829 41145 7847 -14533 1157 7229 -14863 -23736 -46808 -80156 -66218
12621 -66218 -10653 4348 4302 -32416 -57920 -67682 -55265 -39053 -98099 -66585 -44544 -88119
12609 -88119 -89155 -104759 -141837 -103017 -78769 -46004 4265 30323 -9458 46113 98563 79632
12597 79632 74088 37559 -2451 18468 -4948 30540 19184 -4240 -14251 12364 33511 45401
12585 45401 15384 -32579 -9167 -19016 -6173 37708 76479 85052 101573 92419 27182 -3471
12573 -3471 -44359 -45455 -40914 -29552 -39078 43754 68029 48878 47718 35141 66629 62253 49140
12560 49140 38556 6159 5894 48086 17022 -14742 -26190 -57695 -73604 -93970 -46568 -38440
12548 -38440 -41210 6572 32264 25964 5976 -34516 -51067 -31297 27891 25508 -5819 -11085
12536 -11085 -13800 -25020 -24409 15826 49284 42465 50510 50046 70269 104270 79542 7009 15608
12523 15608 28941 11606 53688 87805 72310 16643 -6605 -21825 -4473 45090 56911 84009
12511 84009 68952 38132 23943 65737 5769 -40368 -48704 -41901 -52180 -22482 -26995 -61638
12499 -61638 -85320 -49186 -28533 -73977 -113471 -117788 -92083 -35624 -19666 -18661 -52209 -25806
12487 -25806 -1035 -42082 -43282 -36653 8014 52885 11837 46054 81928 52524 54100 45672
12475 45672 -39632 -90917 -91393 -37095 3196 -9312 -19477 -4021 9226 46260 55754 -21841
12463 -21841 34013 91825 84138 21362 -16716 -26573 -43773 3466 2970 -32702 -54823 -29674
12451 -29674 -37323 -43413 -27571 -25851 -16387 -28557 -57518 -50103 -4618 32673 26326 8283 44923
12438 44923 38742 23431 12192 -16787 -38391 -9715 8598 19383 -1083 -4603 20008 12979
12426 12979 -12874 -10322 -45360 -73266 -44636 564 15270 39577 18191 9400 5908 -32613
12414 -32613 -67514 -34528 -4942 -16886 -6319 31684 41791 38415 17689 13281 81653 104393
12402 104393 71615 55105 -1396 -71127 -26399 16630 49189 45530 72554 137530 109033 89078
12390 89078 73008 25857 34612 37808 34545 54944 85370 62204 -5876 -18337 -16613 25649
12378 25649 32269 62367 18084 -14523 -28433 -9904 -45666 -81825 -49029 3518 23638 51332
12366 51332 74815 83276 28036 9178 -2579 -19192 -45207 -34465 -32215 -31831 -16309 16791
12354 16791 -9816 -58427 -65980 -9991 4055 14427 23036 26833 4304 -35275 -19108 45206
12342 45206 47548 25040 36069 -8014 -54280 -34133 17342 8462 10215 37264 46261 47138 20254
12329 20254 -8860 3624 19197 11765 -24469 -34277 -73625 -100113 -66080 -31971 -21823 4551
12317 4551 60229 100744 67103 53468 38912 6169 56850 80073 45380 57390 25977 -12354
12305 -12354 -2260 37185 32979 30076 36454 14191 43206 69226 98397 43063 1790 -15291
12293 -15291 -14586 25744 9356 28512 16810 26927 49702 88507 92165 103977 100119 38813
12281 38813 -40594 -52369 -60888 -86278 -84040 -69339 -26629 -35673 -39549 2336 -37927 -46821 -40408
12268 -40408 -50083 -42684 -18347 -38297 -31327 -55810 -56173 -40322 -69195 -54661 -4552 52069 52744
12255 52744 24108 -8624 -69770 -57209 18970 81913 112829 118313 82616 29533 -46781 -66826
12243 -66826 -62230 -90712 -64308 -33823 10473 17576 17098 23069 -17747 -59062 -66410 -47394 -10946
12230 -10946 -17649 -52626 -35465 1549 -16943 -41857 -50651 -15373 2811 -29298 -48609 -10757
12218 -10757 6264 -23224 -56199 -50667 -64977 -38329 -10792 -13024 -26005 -62694 -45284 -89313
12206 -89313 -80104 -27796 -21450 -21105 -48610 -11393 17550 4898 3233 21428 42803 10867 7654
12193 7654 -17952 -22047 23482 41054 14600 32534 32940 -2910 -16102 -11031 -17479 -28790 -45366
12180 -45366 -43122 -76711 -78311 -38384 -16662 37679 -5414 -53399 -101490 -88823 -38476 -14634
12168 -14634 9219 12759 -35898 -11094 -6927 -56181 -34230 8751 7348 32941 38919 -30967
12156 -30967 -28514 -25321 -12518 -29154 9775 50055 5518 37471 84470 118746 128424 84956
12144 84956 45330 18869 4715 24556 40999 15471 -17938 -54002 11979 81358 55659 14545
12132 14545 -6561 -1921 12046 16231 39227 -28103 -42215 -51501 -19936 -26288 -48100 -36381
12120 -36381 -6024 51400 77475 50565 35855 4480 6928 -5440 -50532 -57009 -14098 8978
12108 8978 32513 -11138 -18208 3418 19694 -6401 -39814 -42197 -33644 -35490 -57273 -52744 -45452
12095 -45452 -40201 -22921 -5943 -2052 -1471 -21300 -21377 -24606 -15450 36514 -818 -35847 -69266
12082 -69266 -24327 51251 30583 61284 59646 10661 -48927 -54260 -45912 -35911 -45909 -19978
12070 -19978 42854 49676 43750 -20008 -22536 -24232 -12507 -47291 -59451 -9862 21904 45171
12058 45171 52230 19676 -28794 -54226 -7047 33371 -34477 -58730 -81462 -107375 -74779 -64188
12046 -64188 -57091 -33811 -2102 50326 35996 33309 30820 -47754 -25133 -18511 -69101 -30134
12034 -30134 -25436 -37501 -2448 51789 62629 27347 3198 21648 38084 61495 62419 56634
12022 56634 49094 89690 100654 59367 30064 41825 34175 -1655 2347 13457 -33259 -43400
12010 -43400 -11048 -17005 4957 9220 -18594 -39935 36563 78384 80655 55035 56932 45495
11998 45495 63658 96787 78266 58864 97707 117958 89001 45842 84615 97146 80994 71197
11986 71197 54336 89960 106317 82138 35453 7468 38204 51509 61864 87323 94025 80225
11974 80225 36679 -4763 6565 58313 70219 38376 49504 41259 -24489 -31926 12272 -4576
11962 -4576 7989 6766 16126 -3340 14371 36573 75386 103501 99735 81787 69839 43097
11950 43097 57039 41156 8334 -21086 -34043 -13247 39561 35611 5439 25778 69898 65665
11938 65665 43877 34259 41511 -4480 -34107 -35936 -41706 -19881 21792 52964 66742 23023
11926 23023 -29884 -41445 -4775 8565 -10960 28066 61287 -3667 -31254 34609 76207 70647
11914 70647 85053 123716 121806 80557 47665 14178 -9774 -11276 -549 15881 9616 46612
11902 46612 21201 -13759 17829 50896 62282 66601 36462 13292 5448 32488 22112 -38729
11890 -38729 -50040 -412 34928 60050 69040 83519 47549 13280 -11681 -11027 7091 13779
11878 13779 -5531 15065 39268 -7531 -12540 -21773 1424 17746 43063 39348 710 -31997
11866 -31997 -22103 -10110 18743 87888 133667 149013 148424 92020 72417 44568 16307 -14346
11854 -14346 9152 41090 70138 79600 43904 31951 -8293 -8585 39843 -9577 3318 15140
11842 15140 34178 6334 29785 44077 47604 48983 70777 56202 32196 75473 90081 47718
11830 47718 -8393 -89667 -73226 -106554 -83296 -47096 -997 60070 67110 66330 52542 18100
11818 18100 26871 26075 -31322 -36811 -28040 23 -22572 -51726 -15192 19850 20397 29630 33538
11805 33538 25838 37284 28253 3154 -20991 -18696 -1465 20519 13561 -3351 11786 -17409
11793 -17409 -61730 -25574 1290 -7782 5392 50617 51154 43944 3225 -46206 -14285 41103
11781 41103 53758 7363 -8477 9529 3599 -8331 -37347 -61733 -41900 -58015 -41950 -22969
11769 -22969 -46052 12696 21117 26411 74860 77056 50276 53126 106235 98883 94079 85917 32345
11756 32345 -47005 -67175 -48098 -57449 -16754 40450 12682 5897 16405 -75959 -125841 -86118
11744 -86118 -48728 12606 48621 67736 29659 -18290 -13523 -11744 -11440 -32912 -10637 9576
11732 9576 12950 -10563 -30735 6200 7925 41345 29450 23814 48472 63156 72548 23016 6723
11719 6723 7560 -19013 -46168 -34492 -36307 -20750 41146 16348 44491 49177 33610 -38024 -69658
11706 -69658 -69838 -88204 -91931 -66601 -51436 -11457 -1107 14563 34427 -4495 18224 21535
11694 21535 -6006 -15270 -17452 -25109 -25841 -17068 13296 -3976 46024 72400 1882 -21132 -23993
11681 -23993 -7921 2137 9753 46499 17954 37294 59765 42112 23762 24470 10698 30668
11669 30668 69570 125298 102229 38699 -22041 18167 74641 90257 85676 21078 13959 8531
11657 8531 6558 18206 24688 17745 15159 21249 35555 88960 53565 -16382 6582 25702 9500
11644 9500 87284 66866 59431 28302 -4600 7475 8082 -15650 30549 18439 19811 48291 62454
11631 62454 82200 44492 38024 53049 68128 529 -15019 13197 -11347 -51097 -95514 -50723
11619 -50723 41575 98989 85964 57980 59521 50786 64878 67827 47225 27619 -22015 -61643
11607 -61643 -55298 -21816 48581 97954 90663 73226 32973 49208 78062 85797 89265 64432
11595 64432 4653 1307 -11785 3336 75235 69949 46718 22634 67512 55782 43927 13855
11583 13855 43840 70094 41128 55136 7482 -58755 -52051 -15512 11105 30802 11835 -13657
11571 -13657 -45800 -53315 -17538 12988 12579 4781 46452 77481 71580 83498 59811 43855 71341
11558 71341 97842 94939 91201 78774 82045 46836 23668 58381 20303 -60970 -78179 -93680
11546 -93680 -95741 -86660 -22624 39486 63024 36874 60767 86865 68411 67880 101600 79294
11534 79294 113696 100675 62701 37422 -23981 6340 86695 67613 26289 -15898 37027 31811
11522 31811 27852 22709 26662 18055 7218 61319 100897 94010 107390 75981 38711 30947 27841
11509 27841 21647 45784 34667 22880 6712 68992 96502 55169 58976 42537 56544 109148
11497 109148 104033 98814 61854 77019 25396 -14360 3822 13870 58821 81025 65137 36116
11485 36116 33907 19196 -2649 9706 -42186 -90124 -59387 -41190 -4850 36631 43260 62812
11473 62812 106042 62707 59237 47054 31292 64729 96622 119208 117546 76172 106125 197683
11461 197683 249226 262507 247495 231101 253891 334266 501057 724821 1131944 1692672 2395484
11450 2395484 2914616 2829112 2274819 1631022 1093464 732168 480867 356123 304380 250124
11440 250124 231829 227929 230579 200938 143237 136502 161151 114343 75174 77977 61304 113426
11428 113426 147968 151466 148319 110843 64819 75773 82715 -17094 -30444 968 47876 81805
11416 81805 65098 63443 67262 73976 9557 -52936 -71270 -55590 -35208 -45589 -45947 18545 81273
11403 81273 77660 53974 22884 20550 15779 43864 72725 9299 -38230 -25218 28393 59460
11391 59460 8348 -8891 -32325 -3486 38153 51269 57504 66610 66786 114661 74947 53075
11379 53075 69937 77317 63032 64601 87231 74138 80253 94435 118139 112404 56020 6141
11367 6141 34627 9957 -23414 -33670 18569 11392 10248 29086 54026 67359 88276 51376
11355 51376 30910 40231 77464 81640 95634 76068 69204 73610 78676 93549 45689 10551 1593
11342 1593 37206 61628 45157 -792 -44573 -57844 -76147 -77034 -77695 -104457 -123116 -81454 13277
11329 13277 80934 164980 195183 174040 156682 147568 103263 99049 40282 -3478 3821 55657
11317 55657 105196 127827 127430 135852 151092 140349 140101 138065 118769 124728 154035 150750 140034
11304 140034 68681 23373 16815 82505 149040 189637 219752 268762 362638 373168 390672 422506
11292 422506 381427 305698 235089 190725 198489 197792 154135 136023 174838 188958 141901 107351
11280 107351 114287 131353 144272 132825 116823 160178 172381 126160 123771 169056 163590 180636
11268 180636 165023 149712 137313 115651 121480 108799 107705 125053 154679 152221 178852 214987
11256 214987 233372 236207 203129 181888 159328 132868 156752 137641 161324 120627 107069 128228
11244 128228 105089 109339 122287 164948 172050 184570 181646 184750 240450 270198 283233 274111
11232 274111 279779 312782 311844 322124 272368 256468 223066 189508 180616 198439 196595 147597
11220 147597 130810 185995 173083 161198 162365 163439 158735 165373 207753 216696 233276 242927 247533
11207 247533 313702 319641 272164 218506 211636 178109 109751 118962 136454 123126 63324 63275 129063
11194 129063 230920 280584 293687 327211 281129 274205 227343 217847 222163 214835 203045 198937
11182 198937 179989 150756 117376 129455 125782 126656 120009 97286 95101 27842 -13988 -29893
11170 -29893 -80857 -125099 -55379 42768 152651 198966 244209 322794 385940 471440 451823
11159 451823 420989 392672 352027 331974 365273 393378 378246 368819 321286 297879 327352 294523
11147 294523 333748 351570 358825 367205 374703 380717 368328 351774 343040 375910 382964 348997 292738
11134 292738 262004 253921 261764 268180 229505 289129 388506 409630 416877 397792 402523 382403
11122 382403 423925 497567 509360 563586 640017 689183 646588 637738 637460 647085 650435 617334
11110 617334 590944 557587 538675 578230 628345 666527 710049 737753 726330 774106 797963
11099 797963 856192 920133 954940 991016 1061095 1226661 1317955 1360562 1392714 1397970 1443848
11088 1443848 1500477 1592356 1705501 1802939 1812189 1907649 2031229 2048189 2056258 2048904 2067045
11077 2067045 2168743 2338000 2511545 2668648 2864252 3079745 3363017 3765035 4256643
11068 4256643 4762111 5235810 5837294 6713171 7731776 8432977 8631326 8476288 8425039
11059 8425039 8633530 9153833 10064035 11346078 12983519 14919472 17274112 20333183 24447878
11050 24447878 29874533 37118746 47228915 62404840 86361853 125351644 189862700
11043 189862700 291637677 426205534 537927044 542158844 444200262 315786895 209770927
11036 209770927 138612272 94340405 66987963 49508241 37887995 29730305 23860600
11029 23860600 19453454 16076144 13541850 11672319 10366782 9425859 8707311 8097124
11021 8097124 7512423 7049337 6811470 6788957 6867583 6573549 5715412 4674568 3815525 3199801
11011 3199801 2775189 2529208 2396382 2284742 2166514 2068675 1940903 1817715 1697491 1580286
11001 1580286 1428908 1250073 1109490 1030582 967802 887722 823752 793251 850062 857524 847603
10990 847603 790781 709989 670000 673528 696810 723298 699388 694227 681309 678311 652245 618990
10978 618990 546089 574291 565201 557870 576730 587847 520399 469558 455787 425887 389485 331399
10966 331399 342248 294010 272103 277996 235706 243988 254164 201852 228261 312528 333253 361084
10954 361084 394565 393488 390616 362825 321820 266210 198829 145365 158235 137283 130102 143407
10942 143407 133166 110958 115876 85743 46656 35418 61143 60587 24084 -5169 22088 23418
10930 23418 -35806 24674 65499 60923 51343 29963 50429 74194 12034 29452 82145 113329
10918 113329 129915 151151 268755 402477 433121 403443 504099 547601 542433 459860 421549
10907 421549 340344 313469 270822 190008 163648 157282 145715 80863 32651 58268 88037 77619
10895 77619 62581 101366 86623 20639 8609 10279 11999 77322 174666 205883 201752 223274
10883 223274 222732 213674 171520 82456 47287 60099 117617 114694 55596 -33446 -27279 -26121 -42697
10870 -42697 -46261 -61789 -60956 -38310 -37722 -12413 32222 47086 28891 18488 -6585 -19143 -43529
10857 -43529 -55250 -79263 -55814 -17617 -1195 -13562 -65159 -95529 -160535 -150775 -124971 -148205
10845 -148205 -158083 -160241 -133091 -94158 -47471 2002 21618 -10499 -75005 -74106 -56633 -46227
10833 -46227 -58821 -38215 12869 28046 -4244 -62466 -114299 -103150 -62475 -61979 -86834 -106455
10821 -106455 -67593 -54375 -41161 -56296 -27160 39346 -8553 -37918 -28734 35580 45031 -18689
10809 -18689 -54311 -104889 -147559 -98935 -50627 -70096 -46676 -20610 -27631 -25193 -14882 24896
10797 24896 -4961 -104385 -100844 -35448 24591 10253 10144 17760 6309 -2392 16406 -17652 -48224
10784 -48224 10344 51299 51041 -21972 -29680 9131 -5177 -31754 -39010 3328 35099 36883 20059
10771 20059 -20596 -71094 -75968 -77599 -78348 -36657 4570 14853 11695 -21188 -11773 3797 -34119
10758 -34119 -106365 -90858 -42976 -33830 4010 28278 28157 69974 166774 187820 192023 144771
10746 144771 89565 59976 67836 66861 106832 120750 95312 36578 48164 58800 26665 5381
10734 5381 41168 36335 37346 -17679 -54280 -58366 -73350 -24782 -5178 -32196 -55437 -14193
10722 -14193 12021 -39519 -107244 -106098 -120332 -99559 -73295 -70582 -79814 -43055 -28567 -49775
10710 -49775 -65189 -77280 -45685 -36103 43903 83156 63004 56445 44977 70668 6180 -23752
10698 -23752 22692 27185 23611 41572 13938 -46754 -78107 -86973 -53101 -18091 18656 18274 -8647
10685 -8647 44986 30559 -4570 -24661 546 9168 37479 34954 95149 112842 59745 16906
10673 16906 -31931 3000 -10800 -30445 2606 29923 8142 14384 54505 38772 42042 41585
10661 41585 -16315 -46710 -44518 -17401 6607 25748 922 27881 49208 85110 98348 80719
10649 80719 54738 47597 59114 41613 39109 78664 72759 68151 17688 9661 58840 81469 81837
10636 81837 125005 175290 234508 249415 303275 475649 704460 1071402 1660716 2377203 2857696
10625 2857696 2718310 2148002 1479017 933043 597139 412356 295857 187201 141537 139784
10615 139784 57549 44518 62119 81846 30435 23576 31184 1187 1421 2565 1619 20957 50770
10602 50770 54357 88595 113562 104615 15593 -15907 -40648 -22356 35381 38764 50119 81168
10590 81168 105182 100715 49499 8240 -21126 -23439 -19875 -15363 -24993 -36896 -14552 -13323 -9835
10577 -9835 7283 18266 -3125 -19318 7867 3334 -10164 -6479 -43662 -39040 -16499 34056
10565 34056 15122 -25443 -72139 -70009 -69128 -51441 -26707 -253 25443 35613 54703 41538
10553 41538 50133 13909 -29684 -35602 -23242 28844 42710 -39680 -98709 -68195 -31025 -50796
10541 -50796 -58669 -44269 -22561 -28850 -49031 -49739 7167 534 -10766 7340 6898 -39431 -59713
10528 -59713 -64755 -29830 -42883 -67055 -58211 -41067 -29355 -3976 43970 86613 48854 26840
10516 26840 26418 -12223 -40656 -48389 -31811 -19894 -9823 67723 62701 9270 11561 -25129 -46156
10503 -46156 -28772 -80760 -103010 -95936 -53680 -67086 -104347 -93987 -33471 37964 48719 18884
10491 18884 -48542 -80682 -94371 -21772 -10208 -16339 17720 14124 51158 -12085 -37867 -40844
10479 -40844 -20144 -36013 -27738 -58465 -52456 -73745 -85028 -47632 -42126 -43338 -35519 -24407 10353
10466 10353 -16736 -77608 -56825 -23565 -42079 -74518 -111898 -117407 -95454 -94696 -40831 -2770
10454 -2770 -7608 10462 52384 22919 -51677 -122538 -101304 -87789 -126665 -122425 -15950 1388
10442 1388 -20272 -53543 -58555 -32740 18714 58533 30525 19636 48039 42304 13728 -42186
10430 -42186 -33202 -8759 -63393 -14516 -8630 -17330 -52270 -108377 -122983 -98209 -39886 12672
10418 12672 5785 18094 28687 2149 -5719 -27781 -6525 -24038 -55047 -42636 -14142 -62587
10406 -62587 -62796 -67506 -52636 -25380 -24569 24913 22814 9600 16088 49470 16918 18121 -17316
10393 -17316 -60179 -67858 -99723 -90887 -62482 -32521 -33377 -28155 -67949 -87305 -99430 -122434 -121097
10380 -121097 -55939 26363 28708 36424 -10356 10290 11721 -21533 -2228 4034 16081 -23970
10368 -23970 -44209 -42538 -69865 -57291 -5900 -22625 -24135 -9157 -8121 -12913 -30205 -26882 -40493
10355 -40493 -30384 -57822 -81133 -95194 -75267 -119774 -94831 -44742 -49023 -67809 -99814 -147289
10343 -147289 -102073 -41128 -9345 -442 -10444 -17430 -10145 -41264 -33811 47607 97852 57788
10331 57788 35803 66954 36401 -29968 -32512 -15052 965 28161 17450 -27055 -10040 3397
10319 3397 -82555 -77429 -1140 26335 41168 18731 -20289 -64719 -43191 -2307 -13601 -60426
10307 -60426 -79968 -53623 -13975 -17696 -29323 -61078 -69431 -45132 2951 788 -27773 -59591
10295 -59591 -67408 -108486 -135881 -126147 -134663 -78342 -8276 26463 33227 22467 12689 -2209 32223
10282 32223 -431 44385 9523 -38461 19259 39824 32328 -9823 -22052 -12151 -48777 -72779
10270 -72779 -31557 4991 11698 6193 4651 -26868 -73469 -66513 -69372 -56007 -18448 -11338 -66277
10257 -66277 -39879 -37406 -26693 7607 12036 48054 13193 -18876 -14191 -13980 -33871 10301 4984
10244 4984 -24972 18608 5110 -67070 -89877 -86144 -72684 -104826 -87011 -58809 -39562 -46995
10232 -46995 22477 16406 -26401 -36227 16060 56977 84519 35590 -8849 3692 8488 -3630
10220 -3630 -11438 -25370 -53305 -46486 -17324 -9953 -21518 19853 33668 37894 10395 -41390 -73865
10207 -73865 -114227 -158747 -157225 -98069 -82886 -68228 -55964 -86295 -102604 -36434 20762 -26200
10195 -26200 -73195 -65446 -8979 -15949 -43976 16029 28915 18188 -22830 -36664 -57079 -45036
10183 -45036 -6362 -4197 42339 62289 23667 -17130 32093 83194 61610 32127 43925 92059
10171 92059 80098 61433 29157 -12774 -41300 -34151 39150 35965 33070 8063 -54629 -57737
10159 -57737 -52037 -50293 -35992 -24521 -51420 -26611 8297 -20268 -78683 -102013 -78837 -94290
10147 -94290 -91931 -5479 98185 68138 59559 65795 72589 33097 55775 88662 66632 50558
10135 50558 29766 16397 -3751 -2007 -58068 -94651 -73828 -69314 -45671 -35238 -42843 -26613
10123 -26613 -14251 -46680 -2930 3790 -9522 -6272 -47593 -14836 5555 -36225 -47353 2012
10111 2012 11408 1262 -1571 -21126 -17865 -28400 -55406 -53047 -33036 -16346 48876 42342 44013
10098 44013 63408 20268 -4101 1125 -45943 -32116 -20896 -28334 -22644 -66075 -50190 -37413
10086 -37413 -50773 -42097 -60064 -71043 -24966 -27013 -46775 -49563 -53139 -84410 -106381 -45359
10074 -45359 38725 42016 1729 -11810 13003 8397 6155 -11824 -16925 -16061 12230 35789 7402
10061 7402 8867 23820 23934 34054 74962 19454 -1788 11528 6806 49748 53437 33111 13719
10048 13719 33290 27198 51571 45801 4228 -8152 6176 57243 41274 3966 2246 22507
10036 22507 -4337 -16271 -34675 -24273 -15840 -50852 -57107 -39987 -57880 -35927 50049 57446
10024 57446 69567 66602 37996 39165 15904 -4423 -11823 -8630 4173 44379 47112 -14901 -51387
10011 -51387 15455 28634 -17378 -6436 17702 78766 44735 33286 -9283 -3927 29967 28610
9999 28610 -13651 -5378 5116 3579 8126 -29708 -67210 -39318 1260 -105 -7522 28413 41987
9986 41987 29595 20033 -32881 -58899 -62476 -18628 -9379 2552 -23674 -61492 -50541 -35770
9974 -35770 -16517 -9885 41345 40784 11463 22317 1878 -14193 -26813 10638 27912 21426 4970
9961 4970 -24168 8538 -21831 -77385 -78736 -63700 -3273 33388 18271 39739 12898 1469
9949 1469 14826 57670 53029 56651 108180 126348 141457 196202 291036 437105 639396 878987
9937 878987 1187784 1311640 1150978 852030 520654 311094 150904 111662 93563 54990
9927 54990 47475 55648 65385 37115 34508 34596 20244 -45829 -58936 -21736 -6995 25708 54824
9914 54824 65780 64827 -3085 -9196 -11790 -17669 -4968 39129 49342 39844 26212 27356 49763
9901 49763 82601 61938 56615 75458 135430 131732 119616 78705 70774 91597 137867 153122
9889 153122 96348 90761 122708 38926 15287 42486 68453 37365 25006 43539 83367 82495
9877 82495 71140 43938 55151 74959 97754 77567 75292 97463 92453 88526 54738 71884
9865 71884 81002 100693 73856 -8862 14149 40327 16713 3287 30017 54907 84004 117170
9853 117170 91963 31295 -11000 1539 24153 13551 30222 64566 72356 130571 109156 70827
9841 70827 52148 49998 80364 82377 53924 35824 4639 -31600 -43994 43040 86515 82608
9829 82608 60587 53528 25535 51404 63652 73682 30662 1723 55578 103770 145276 132713
9817 132713 166726 170310 165169 122420 70022 53338 62134 90855 49831 27478 46922 52899
9805 52899 95617 63505 27686 38234 48622 49085 32585 35747 18361 22619 21757 44975 71585
9792 71585 69577 90643 43968 -26519 -30463 53772 54717 71627 92114 52410 20233 24034 30176
9779 30176 35858 57367 75413 49697 15280 -15572 -60989 -75846 -22934 13245 51693 14810
9767 14810 17772 56175 53784 62501 54587 36927 3130 18528 8680 -37404 -33380 3678 -2890
9754 -2890 18347 12055 4809 558 -18195 763 60962 123799 141979 75647 56834 91690 82772
9741 82772 100981 79332 104295 132246 165662 136673 94163 109145 126864 97896 56646 63632
9729 63632 53778 81170 114526 134911 119061 91435 78811 81473 39872 5948 -14301 -5212
9717 -5212 20064 12634 29351 89743 78218 82394 28546 -4203 31050 60119 108501 111713 74024
9704 74024 95858 52944 27847 56511 39825 37222 68429 70541 48823 49577 69178 74270 100806
9691 100806 86425 44961 13808 30696 -1621 -9154 8273 60401 61322 -5325 19235 47676
9679 47676 1365 71499 112030 55815 15642 3637 51269 74569 89325 88618 63364 40064
9667 40064 28785 63585 71611 78910 40565 -8315 18634 80871 64937 49422 74105 64129
9655 64129 50167 51408 78635 71878 101544 110338 34463 3518 56358 125822 112420 77223
9643 77223 72831 91812 112104 106756 122255 150052 164658 194949 187227 161787 168713 166200 102375
9630 102375 69005 83032 56178 12967 20623 23079 6847 31783 69586 113687 83251 28959
9618 28959 14226 16254 34185 39253 15119 -13286 44633 66994 91418 106415 105694 78343 42436
9605 42436 35494 12861 30623 60150 63054 119203 119482 80353 92414 96998 145801 205328 213447
9592 213447 194292 192301 190684 179387 139842 128472 149673 130453 122594 178685 183865 177016 124360
9579 124360 124699 143954 117513 107445 143210 214126 187189 219125 217828 206019 179283 161637
9567 161637 166024 112407 134056 160640 130006 96339 87659 113579 137671 68383 55842 79315
9555 79315 72279 72020 106085 166881 170061 169216 205255 184588 203999 216890 190188 201003 194603
9542 194603 213438 251038 213063 166694 130274 146744 190289 207786 207137 195967 205116 183323
9530 183323 202718 188351 134110 120650 139532 132825 139371 156924 199394 219341 235294 213647
9518 213647 189736 210652 202689 211077 222658 204403 148860 177050 196719 228425 216550 192555
9506 192555 188551 181137 183290 191812 197048 216005 175885 170933 219005 212035 177876 197450 223672
9493 223672 252328 230821 187717 190671 174798 215337 265763 253637 218184 197620 175403 213957
9481 213957 272048 255258 199440 150798 90185 77871 104487 138926 183390 207424 187877 242928
9469 242928 285587 249166 192024 171071 147327 159085 152684 142943 169750 174657 148318 126331
9457 126331 120020 135456 197696 205673 197232 223284 247364 253527 249943 282838 316874 325554 295670
9444 295670 298399 325756 271645 259711 267179 259549 244662 258180 243160 214070 227341 243474
9432 243474 269683 260665 217327 241650 248169 251192 207487 199327 186294 180169 199397 219720 221893
9419 221893 259857 266183 262300 273316 262829 287682 278579 257329 221917 225239 244334 229599
9407 229599 272138 271179 251020 222406 237850 225508 162467 131566 213974 250129 230207 239516
9395 239516 267014 220104 201034 209122 220125 235518 265208 285026 300192 299122 259411 217088
9383 217088 278304 262232 231417 250127 247256 244473 242118 251991 264340 337158 320428 308204
9371 308204 259743 231905 226332 262228 272350 256989 235258 248387 300475 327906 314874 295308
9359 295308 230699 183170 187310 215892 238972 274063 265588 241243 233114 226836 186348 152653
9347 152653 187949 212592 215250 168694 140594 162845 215103 267245 277952 266882 224057 205310
9335 205310 185559 174797 119929 115414 159850 203254 192085 179158 200110 239704 272658 315158
9323 315158 275998 199942 153080 110637 97797 171718 186704 211243 247757 235996 226823 197871
9311 197871 171011 158619 184187 172360 136896 162538 196827 155258 118516 129454 177583 189272
9299 189272 176493 196330 179962 170116 233572 252865 236117 191165 194889 198661 189531 157908
9287 157908 132504 133791 169173 154721 179599 151898 159961 178752 194256 220980 228620 212776
9275 212776 255119 256036 187649 183019 180598 198753 187788 167127 164436 215284 203662 175732 195417
9262 195417 200591 221692 165671 114339 94437 121461 108009 74810 72663 119975 166920 131911
9250 131911 96041 129273 133459 90575 98220 119845 92077 92419 103450 135896 150434 127642
9238 127642 125237 141508 122234 72015 104651 133582 153775 83307 73244 109329 74875 45166
9226 45166 48777 126716 143612 108972 110372 162458 199336 205134 234418 218336 85875 65929
9214 65929 126040 192116 166179 125799 147732 114506 138320 144755 120559 104503 122221 118748
9202 118748 79279 40674 38892 63176 96186 30372 8883 22378 65336 100721 106946 148309
9190 148309 203973 134964 89496 95472 83612 102838 88668 137753 147906 91025 97096 89115
9178 89115 67314 72628 79109 38159 62429 99877 118486 171589 169509 132269 119711 117993 159652
9165 159652 212166 198449 163685 103441 66864 74230 79052 28220 24223 100128 94910 68010
9153 68010 90727 87974 39102 42004 43684 41062 43693 81737 113768 90387 38198 41766 108549
9140 108549 125625 105771 79892 121553 152416 148417 153188 119846 116563 116794 135301 130403 124407
9127 124407 142713 144791 152798 115478 39669 31906 -22428 -22227 -3204 9424 30100 988 -64336
9114 -64336 -8583 70496 72155 29219 22440 51443 78792 76961 80623 60767 56734 37561 41156
9101 41156 58995 94378 116569 153718 179340 190608 152241 136956 98236 118599 79893 29772
9089 29772 34836 45705 98900 120942 107600 97025 101138 122676 119361 122941 125987 116645 116531
9076 116531 113654 77291 41710 17675 15867 36459 38485 33188 42914 78981 97797 94879 88068
9063 88068 92960 93181 93846 125577 126615 91426 26126 32570 82112 104100 82981 30420 23839
9050 23839 6993 -11424 -21127 -31316 -17302 -6146 54787 621 -26584 -9512 -7020 -24530
9038 -24530 -11926 -8990 18570 46239 43342 29100 31467 22771 44044 1986 -25406 39995 31349
9025 31349 8640 10058 69567 102930 50679 -20809 -1019 46919 75155 75111 88793 67314 59021
9012 59021 82458 58125 58852 41217 63292 136024 133467 106483 84057 32232 -12975 8212
9000 8212 75990 102285 60702 50561 74424 87941 112048 110819 95657 81945 44174 73665
8988 73665 108018 116235 106084 68879 39323 47425 42156 55792 74992 65022 43733 29428 7568
8975 7568 41486 73901 113344 64963 25859 27454 40351 22977 26891 60515 54124 52076 74130
8962 74130 80831 65359 -14008 -46822 -46870 -46465 -26608 7889 44548 54975 22558 56090 62209
8949 62209 28270 38572 56102 48358 28462 -12571 -23748 32249 66206 34799 41359 25934
8937 25934 52245 9540 -10795 4643 41961 20803 -21814 -30878 -8550 41160 54774 75030
8925 75030 80491 56846 60943 67225 15999 -16873 -16434 33377 64629 63814 43069 28219 28142 23820
8911 23820 30223 45345 96003 70326 79966 102192 74331 51778 61285 35241 24306 37498
8899 37498 14402 10286 4457 12834 14113 7150 -15466 -50956 5495 73642 93228 123470 142733
8886 142733 60687 14324 -47545 -13314 19880 32900 34376 22667 15842 12687 23792 -498
8874 -498 27008 43937 61001 91034 98322 96600 133895 106450 87768 94324 92729 61543 81568
8861 81568 64273 41130 54665 73876 90926 116699 107829 62096 58127 74519 75478 86226 92285
8848 92285 84790 68218 61423 103443 95644 67762 83730 124704 111723 96980 74067 38228
8836 38228 40155 62933 100076 62425 -4238 -15109 27177 24086 34481 28945 57890 86870
8824 86870 50567 19658 52624 98555 77790 86853 86848 64794 73125 88164 85715 106577 153016
8811 153016 105853 31216 9934 -3461 12288 57884 39581 44330 28985 38865 16878 69873
8799 69873 92968 93960 50837 19090 2368 33134 73632 79730 89182 86279 82560 81445 99293
8786 99293 129095 145954 108344 43512 11070 39145 72890 46375 24190 42522 20747 2897
8774 2897 24571 78581 123269 149254 161661 180218 116433 86850 124848 123260 97534 115840
8762 115840 143142 84818 46854 37650 19888 45110 95269 131027 104834 86554 52681 67937
8750 67937 92392 93954 71073 48719 91860 108548 118767 121669 130184 153029 119314 67379
8738 67379 70119 106886 125918 148451 179781 138471 71604 65977 75629 97103 105720 86298 107574
8725 107574 113062 135764 78688 57486 79831 135153 224062 245060 223817 191353 220513 243921
8713 243921 234435 197918 169969 186421 214800 247614 250700 244650 202948 209135 216924 232417 268611
8700 268611 256857 225990 197740 168768 136352 129232 165489 167674 178669 218564 184674 171979
8688 171979 155545 154595 122144 66532 65870 138245 165123 107383 125003 117641 123464 130000 156033
8675 156033 181432 172134 120308 126651 112652 154889 183188 187266 202063 175255 163792 165255
8663 165255 178994 204272 161333 161640 164149 178738 183246 127264 118760 102329 56911 93935 104942
8650 104942 93641 86991 84163 33090 16981 11883 26602 99163 78690 75572 72588 92936 115825
8637 115825 131224 94470 70647 108185 110714 102349 53462 58618 100281 109353 107737 133818 148553
8624 148553 144710 127281 134053 139776 156934 156765 140135 176664 199263 182437 154477 128883 129975
8611 129975 178265 208917 241109 236359 203150 227504 263381 228646 190339 206427 237487 265694
8599 265694 297478 332379 354110 354812 373984 413786 428327 357153 332369 298059 250422 208363
8587 208363 195355 219686 192236 134994 90338 84318 100193 103371 90799 44608 53508 98524
8575 98524 89483 75869 9782 31598 92967 115571 115823 136508 108358 89534 107641 85477
8563 85477 102342 100541 53790 25678 21227 85985 72249 48667 45391 76178 55852 43540
8551 43540 61652 44025 41193 29265 29699 63227 75129 101639 116803 80268 46868 84965
8539 84965 58559 54264 89785 108981 79336 74833 57519 44479 89165 96596 52089 23210
8527 23210 44351 35946 -40908 -36292 -1620 31111 66556 72804 39808 52498 54567 27069 10301
8514 10301 24902 45293 22475 11507 26636 9518 -5258 -17871 -64838 -82057 -92982 -69748
8502 -69748 -46672 -81922 -49637 -26296 -33609 -13003 12995 42688 53712 75279 94925 25262
8490 25262 -41068 -61160 -29026 6884 29616 90174 105199 72697 18604 -24894 22225 79555
8478 79555 45271 63133 75461 63501 35976 11710 -14000 13382 41613 9235 -26070 -37116
8466 -37116 -42248 -20812 -30218 1997 -18551 -26112 21253 8942 -13405 -1219 9911 -9897
8454 -9897 -33974 -15936 -10312 -12442 10157 -14022 -9078 -6729 -773 -11341 -23893 -36990 15247
8441 15247 38366 7425 6791 3824 -6550 59805 95922 43261 -16670 -42941 -24842 -34053 -11100
8428 -11100 -30069 -22798 19602 31226 36338 51639 83989 35347 13580 3124 21248 43888
8416 43888 44391 16091 6854 -35929 -35165 -21504 -14927 -648 30435 58002 55388 14381 -20542
8403 -20542 -67222 -34540 17532 1876 -15868 -6505 31570 77388 39177 3695 8348 31423
8391 31423 59264 82282 68977 88965 55627 -10290 -20387 -4823 26026 65730 39803 44572
8379 44572 30900 26793 24441 75021 78124 82782 44481 4877 7132 896 -35495 13082 63931
8366 63931 90891 68154 64074 89954 45556 4535 22408 -7525 -7183 52236 85396 77296 58755
8353 58755 6070 -25385 -10247 -23493 -2571 -9752 -34870 -54092 -22740 -11623 -54942 -64530
8341 -64530 -49403 -65696 -88150 -99058 -84035 -29685 3256 40129 29445 9318 -11405 -27373
8329 -27373 -20108 -17020 -43074 4554 5434 12582 25372 45346 42933 46984 16800 39214 36848
8316 36848 72603 23550 -2761 9928 66491 55411 73373 44698 17004 46301 51810 42810
8304 42810 13926 -10321 434 -6360 13502 3283 -30127 -50281 -132100 -125104 -72580 -49259
8292 -49259 -6806 -37698 -55201 -62293 -80674 -31973 34507 70880 35390 55234 78473 87229
8280 87229 101562 98430 55376 -185 29799 -13419 -31222 -9562 64743 113622 114168 112173 121869
8267 121869 85731 22872 6641 36930 17878 -88155 -92851 -70098 -83070 -55008 -24912 4131
8255 4131 -1403 5061 15660 8455 12851 -3731 -2175 16825 18877 -24429 -72235 -97077 -66185
8242 -66185 -24565 7084 9792 -23407 -47633 -84490 -103060 -72789 -64114 -72303 -37413 6539
8230 6539 48533 43168 12225 11183 6484 -28375 -33072 -58185 -18170 7389 13530 43107 26390
8217 26390 15942 2406 -12352 -43979 -24148 17439 62654 30709 -23905 -5104 16369 -25226
8205 -25226 -84951 -33912 -12960 -48225 -12741 -16720 -5855 24004 24448 -23182 -43089 -36635 -54118
8192 -54118 -82775 -46656 -39814 10729 46596 53441 60999 9234 29125 64501 64835 49517 42897
8179 42897 9421 -36246 -41410 -75022 -35304 -8073 -6637 -6476 -60799 -93282 -90532 -70549 -39432
8166 -39432 -54893 -78553 -72248 -80198 -28239 35709 82271 84394 33066 41447 39613 6870 18648
8153 18648 26761 -17592 -26691 -1571 5214 -8643 7730 17998 19857 29692 22552 45411 3637
8140 3637 -44760 4604 82148 87694 33457 15842 40659 46263 25457 22146 28321 69196 31748
8127 31748 -7219 -31864 14671 35966 43631 30857 10024 36239 88113 109402 89015 72346
8115 72346 97247 122144 169995 157233 146481 162914 203423 169411 134374 63034 52074 50204
8103 50204 31433 37950 41240 676 -31986 -12547 22582 41273 54660 33906 54680 80827
8091 80827 82810 94426 186 168 12837 11536 30960 36976 56245 132186 84705 24646 60421
8078 60421 64934 73466 80799 105651 139601 129699 84983 51269 53020 135870 254481 322155 379148
8065 379148 442251 472661 429965 332604 284211 232149 165376 136351 147266 102917 89808 125977
8053 125977 142441 114010 97611 62047 30328 49552 80852 76978 15436 -17044 -25854 -139
8041 -139 86665 100492 63704 62130 116656 102025 106665 104241 87426 166513 208324 129249 115870
8028 115870 182002 240670 325784 380078 371612 336030 306947 287291 311550 253738 211796 232243
8016 232243 217062 189536 195238 224514 256118 254007 211424 213727 192353 129794 127306 114031
8004 114031 89397 115932 151688 153174 145978 129607 149536 145671 149302 142707 165296 184723 196688
7991 196688 148325 102502 92475 121483 143409 175715 154806 77913 62511 93713 77618 102843
7979 102843 126249 94479 95814 86152 94565 121146 137360 129507 120893 126712 118117 119432 86754
7966 86754 55220 56470 118325 150944 178117 126172 118451 93139 100961 92513 99335 124269 133999
7953 133999 111592 105618 142453 118557 80459 99039 126795 134561 105583 86223 59280 73071
7941 73071 79811 70823 82930 51128 -19370 -17255 26216 40312 91964 122648 154139 126646
7929 126646 75612 13772 -7133 36391 86248 47125 -19469 19486 31576 45935 25701 33844
7917 33844 68700 77176 17515 6098 39703 36114 22350 19546 65437 67004 37075 62791 93468
7904 93468 39444 -6938 -6151 49980 38146 46610 51445 29416 14671 34458 32900 7695 22301
7891 22301 68095 84508 72714 94889 59025 54718 56988 -10496 -67220 -69491 -32403 -7984
7879 -7984 29576 55059 59690 42903 79937 123139 85616 69218 64220 26752 25100 48637 54705
7866 54705 12048 -43979 -3554 28829 50543 61915 81123 101647 77192 36880 6411 -10900
7854 -10900 -9432 14268 42838 -11964 8803 19065 -29088 -25286 -6998 -24055 -21770 -39172
7842 -39172 -39791 -22704 8006 33011 49644 7752 -39803 -6988 -38666 -22168 15825 30763
7830 30763 6481 2113 -13820 -23230 9843 20025 22079 -41759 -86111 -81011 -31681 -47082 -42123
7817 -42123 14167 6897 11674 35505 -22987 -66818 -59639 -39045 -17036 -12976 -50592 -58679 -83883
7804 -83883 -26678 -9360 -19152 -46917 -54470 -44345 -13212 2799 -2136 26428 43029 38794 17842
7791 17842 6702 -4230 -24560 3049 -17250 -62867 -54918 -17319 -10859 -30573 -66335 -54927
7779 -54927 -10510 -25561 -48070 -35755 -14656 -49257 -94742 -93691 -11941 18007 9344 47817
7767 47817 30718 -20859 -36861 -15724 34975 65806 14761 -17182 1591 43258 44208 32872
7755 32872 18039 8186 12178 69434 113710 67127 -24274 -67200 -106395 -59465 -64931 -95857
7743 -95857 -125341 -124026 -77798 -48645 -43210 -52993 -59300 -3277 39936 20019 20021 -3503 -16177
7730 -16177 -64733 -76847 -57558 -18100 -73944 -74972 -38644 -15755 -18651 -45816 -65909 -16605
7718 -16605 -10496 -42835 -40981 -21122 -1386 -44303 -42106 12378 -9549 -42452 -27249 -34179 -82246
7705 -82246 -74973 -58882 -32631 -3839 16070 17157 -7079 -39955 -111849 -117207 -37720 44868
7693 44868 17933 -43267 -104518 -112453 -90163 -121626 -119776 -110663 -120729 -49808 -35596 -12704
7681 -12704 11886 16027 35333 24340 -28344 -30822 -5672 -12891 -60895 -56269 -53029 -9389 52944
7668 52944 63138 43767 54800 35670 35213 8185 -34689 -46033 -43754 -16387 -23770 -32557 10526
7655 10526 52330 46509 9976 25220 14355 11280 -16435 -47038 -44105 -86125 -52248 -29741
7643 -29741 -48998 -67242 -99452 -31944 -19457 -5722 34163 21123 -3152 -50846 -114160 -80774
7631 -80774 -52819 -92431 -56540 -11081 -5014 -17964 -22334 1329 -15200 41677 46663 -2182
7619 -2182 -19052 -44477 -67734 -8974 16663 -18684 -44873 -27823 -21456 -22543 18814 28766 28136
7606 28136 23947 -13763 -10418 -23632 -20465 3291 19926 27864 32317 16109 -2798 29818 4699
7593 4699 -461 -8907 -8091 -24398 41868 79962 65673 67428 120908 104303 14992 -6589 4271
7580 4271 37952 57893 16499 -3058 -19437 -49462 -6034 19595 23952 45097 45300 33650 29378
7567 29378 72809 24274 -69390 -60765 -57933 -4670 88090 123292 117092 85656 7259 -26912
7555 -26912 -23142 -7464 -45415 -36565 -40253 -62070 -81710 -27075 -7025 -12344 4736 3779 -27617
7542 -27617 -116874 -149278 -107951 -52818 -2921 40659 39891 21847 -24123 -31900 -19530 -43295
7530 -43295 -102429 -71107 -77840 -107806 -87722 -9848 23889 -39086 -27954 -66377 -85811 -98903
7518 -98903 -71841 -22204 -9159 36363 86362 118782 105264 26371 -34628 -71458 -39559 -40801
7506 -40801 -23457 21318 5893 -827 24422 27528 52012 33009 36047 13584 -15142 25195
7494 25195 -12161 -68310 -63712 -46548 -18914 -13962 -41955 -65519 -48229 18771 17042 -2442
7482 -2442 -21123 -3566 5663 -1529 -18281 -44228 -46319 -79772 -59092 13146 4649 -35576 -60184
7469 -60184 -66832 -1204 46844 25308 -33654 -45848 -71211 -97922 -117516 -74642 -46627 -42043
7457 -42043 -21961 21355 6397 12892 45993 59278 19917 -9106 -34594 -8147 -33163 -48877
7445 -48877 10833 -16686 -100932 -115763 -85506 -72274 -90695 -108067 -85316 -88305 -67470 -52926
7433 -52926 -43887 -78785 -58248 -5876 3696 -23526 -29066 -55922 -89595 -91808 -67652 -49479 -62214
7420 -62214 -33030 -76674 -105020 -113236 -83528 -6818 75484 80506 56834 -10756 -21898 -10028
7408 -10028 -37198 -12093 -10349 76 -20819 -42368 -15671 -47331 -65048 -59543 -47257 -12593
7396 -12593 -60125 -62407 -63592 -13386 23182 7617 -41529 -83569 -85167 -35236 -22175 30993
7384 30993 60863 19874 255 51601 34832 743 -64385 -97240 -46323 -45939 -14143 -8198
7372 -8198 -18700 -27331 -10491 24318 60270 78858 79106 31008 22052 10158 10397 -194 6562
7359 6562 -18165 -102402 -106190 -37706 -22466 25092 8900 -28106 1285 -15240 -67086 -151606
7347 -151606 -132918 -37563 -16808 -19082 -18011 9711 -148 -14075 -35303 -66172 -71574 -93068
7335 -93068 -43979 -53095 -74607 -89807 -82636 -77316 -22469 11158 -7079 -8217 48392 68492 19573
7322 19573 465 -3276 -38470 -51248 -52865 -23204 -38927 -56089 -21381 -38484 -19423 37132
7310 37132 55228 16532 -9480 -10248 -15630 4842 -5104 -11042 -73038 -70822 -32204 7195 -7322
7297 -7322 42234 93978 56647 -37075 -20470 4054 19131 32306 26821 31156 17977 9797 37242
7284 37242 71374 42717 -14574 -29773 -13175 29858 46211 18026 -11512 -15598 17509 29845
7272 29845 -2585 -62566 -94445 -78865 -37435 -14994 -5003 -19822 -32294 -27342 -50523 -52634
7260 -52634 -43517 -67381 -100913 -65105 -13915 59322 78487 37285 70430 67646 10703 -15899
7248 -15899 3567 -39436 -33443 -30436 -23124 -26421 -17277 13689 -14768 -48946 -52650 -24104 25788
7235 25788 39850 28007 58462 26959 -38673 -65818 -58898 -16399 40673 -2928 -68031 -91349
7223 -91349 -59928 -49822 22306 63875 20900 -7575 -51818 -47353 -50683 -55243 -32379 17417
7211 17417 26925 33478 22773 3575 -39133 -43462 -315 60203 50162 54250 52392 5202 4296
7198 4296 24493 40887 27295 4087 5213 -53545 -105290 -58064 -34981 -21812 -16990 9513
7186 9513 50427 28864 -8916 5460 3960 19081 11321 730 22544 52771 35859 35544 32693
7173 32693 21973 26542 16033 -23876 -1150 5991 -16215 -8832 26467 26329 19212 10697 26705
7160 26705 64985 44524 29743 19391 53424 49586 24365 -25963 -76694 -56152 -33892 -81911
7148 -81911 -76785 -25851 -50215 -90292 -86943 -119476 -148451 -125850 -77841 -68232 -48657 -27275
7136 -27275 -26665 25691 50170 -27526 -21704 -42451 -15409 -45275 -86662 -50157 -24811 -26155 -21122
7123 -21122 28999 10050 -57322 -71039 -52237 -44356 -36464 -40466 -73592 -86363 -75608 -40319
7111 -40319 19660 37394 8682 49340 55780 29580 -4682 4512 21349 34180 24555 -11547
7099 -11547 -17904 21695 34204 23144 2991 -1757 -6696 -44181 -41354 -31733 -21890 -66915 -37304
7086 -37304 1547 -35366 -70176 -123179 -138421 -114607 -113478 -84065 -66752 -37804 36574 26042
7074 26042 36498 42620 43395 14720 15592 29423 -35648 -54112 -78457 -39273 29496 25725 10770
7061 10770 -32673 -8640 3767 -31181 -12027 17248 57997 13210 24306 -1183 2620 28172
7049 28172 52181 57570 33862 -21008 -58885 -61660 -83630 -63608 -14688 -4492 -6630 -17260
7037 -17260 -75352 -96750 -75827 -34194 12783 -13262 -42110 -47360 -36817 12459 36355 8370
7025 8370 22627 59431 74323 74342 56193 36136 8333 3728 -35697 -45168 -29714 -10451 -12729
7012 -12729 -56946 -79015 -69813 -53122 -1270 4184 -5275 -43382 -48905 -38650 -24032 -13381 -7739
6999 -7739 -42934 -57789 -61256 -76512 -20280 -56340 -58187 -45803 -26970 -24234 -50741 -65402 -36359
6986 -36359 -21415 -48782 -64191 -20301 -15365 -10370 -56599 -73527 -91362 -20998 20509 -7849
6974 -7849 -6078 9714 26761 610 -4562 -24637 -25164 -30360 24225 51300 5108 -31454 -62726
6961 -62726 -73334 -9232 38807 49260 39566 30449 56767 36327 148 6911 3180 15123 41056
6948 41056 41725 62432 2556 -17518 3671 -18793 -4275 -23673 -14470 -42652 -87371 -75451
6936 -75451 -46591 -55331 -94983 -114564 -102746 -94088 -98926 -66654 -4778 41519 -2187 322 18277
6923 18277 -26848 -69487 -20539 18189 -5648 -24489 -51740 -74626 -74865 -63249 -96896 -91489
6911 -91489 -69873 -65567 -51304 -21174 828 -5111 -11867 31808 59767 19762 -6687 -39282
6899 -39282 -60377 -24993 6903 -8057 -5956 -28860 -67911 -41644 -56855 -34439 6233 -26060
6887 -26060 -80171 -82677 -60402 -60646 -65535 -32424 9659 49028 53997 44350 -7166 5868 -6313
6874 -6313 -5364 20608 -29132 -61519 -86742 -74510 -95489 -90404 -43588 -26120 -14189 5471 -73125
6861 -73125 -149005 -128678 -73692 -53497 -390 27781 37762 35095 15340 -14959 -19356 11362
6849 11362 28371 20030 79289 89840 75235 39475 7330 17183 -8583 -43005 -52253 -60074 -64410
6836 -64410 -83035 -71917 -73224 -92319 -48451 22703 25835 31831 -16926 -11874 2680 27398 24140
6823 24140 -11252 -68985 -89706 -28554 18315 -29927 -51603 -61205 -78900 -6117 46298 56979
6811 56979 26931 -22629 -15194 -11817 -60866 -69461 -11015 -8634 -9198 -525 -15011 -43068 -23382
6798 -23382 -83212 -115772 -84421 -125868 -74028 -28449 -7120 17563 32959 12273 -46765 -48655
6786 -48655 -9641 -3427 21225 64911 12449 -16925 -15695 10584 54442 62046 42683 20497
6774 20497 -5328 -30469 -9048 -31859 -28898 -14225 -13529 -28744 -32677 -14492 -5218 -14100 25288
6761 25288 55220 36342 40318 27892 -2559 -14940 -34377 -50941 -19966 19345 49196 88088
6749 88088 110736 79198 52894 54016 53083 33594 35550 18266 22593 43901 67374 75869 52738
6736 52738 9265 8028 81932 87478 87757 105411 120151 172829 212136 261701 343566 387638 450645
6723 450645 649548 1017438 1458170 1810661 1871451 1572485 1109183 718047 493729 369304
6713 369304 295953 261131 220278 167060 70384 -9948 -43267 -31249 -15028 -23907 -4961 26049
6701 26049 -14019 -62049 -22685 17340 23923 59125 99717 112605 109044 154347 142758 139351
6689 139351 150748 80759 87849 79248 26784 -7846 5946 5414 4269 18625 4837 -39849 -78226
6676 -78226 -18138 14324 19811 25880 -20248 -50377 -49701 -51374 -59431 -46679 -47978 4774 -1049
6663 -1049 27011 80035 84798 59883 51771 31487 24826 54200 47392 13804 -22362 -38406 31170
6650 31170 64691 56309 32896 13010 22275 5755 18487 23535 -19379 -56819 -54533 -28725 -6243
6637 -6243 44293 56361 6782 -4324 -21653 -36456 -43116 -9824 41073 12621 34070 -8343
6625 -8343 -52318 -43795 -52094 -32523 -28967 -12454 26629 -14390 -38115 13813 6184 -26686 -71054
6612 -71054 -36428 -21634 -10904 -22947 -80053 -98033 -62524 -98839 -71593 7551 95306 46425
6600 46425 -31866 -19266 -23006 7378 5486 65145 105273 38624 -22648 -7421 1347 -3605 -2892
6587 -2892 -10469 -34759 -2424 26424 279 -27057 -10360 -28108 -63601 -116450 -91369 -34849
6575 -34849 -7626 267 -37040 -103983 -45621 -12545 -46118 -83188 -89577 -101161 -74448 -50776
6563 -50776 -23003 14140 -27122 -95404 -75089 30486 61052 20956 -25109 -380 -4925 -14682
6551 -14682 -20522 -8507 -50652 -46566 -42160 -63102 -67005 -64553 -65255 -80760 -69319 -31466 11377
6538 11377 13413 -45581 -47666 -20602 -6507 -16360 24428 72291 84631 89070 97767 113790 58813
6525 58813 41908 -11302 -48822 -40246 -54355 -46994 -26016 -22462 -36177 -12012 20166 -39605
6513 -39605 -101950 -68399 -7928 -29341 -58248 -50004 -37954 -45674 -35662 -65548 -62398 -56363 -8803
6500 -8803 17747 -3948 -35136 -37646 12435 46739 70553 71777 43345 15282 -24022 -52937
6488 -52937 -66581 -28563 -8438 -23306 5755 5279 -5372 -7110 1864 17598 9563 -23090 -54472
6475 -54472 -23869 30798 19602 6092 -10482 198 -62437 -103423 -48364 -54805 -73188 -92217
6463 -92217 -63912 12061 44764 30496 58252 66876 40999 29078 -15418 -25732 -8486 53501
6451 53501 74373 83818 78074 -4241 -43600 -58297 -37798 -1419 7728 14344 4597 -17840 7300
6438 7300 25676 -49742 -87326 -83055 -49845 -36650 -24451 -32813 -36511 -58298 -67801 -15477 -23926
6425 -23926 -76230 -63011 -32945 -19185 -88236 -80423 -41106 -32508 -60449 -76181 -39169 -30144
6413 -30144 -44685 -44372 -63497 -42206 13095 22995 7349 53454 30604 -25720 -24912 -28044 21160
6400 21160 66719 120249 130799 84737 43206 44955 26229 9702 -9394 -41934 -25695 10310
6388 10310 -21984 -48373 -21834 -31574 -11919 3230 -4601 17142 21823 5893 27037 25162 -7905
6375 -7905 -51872 -55148 -25828 14686 26780 -15203 -64077 -69739 -31173 -23014 -40292 -58719 -18396
6362 -18396 -20086 -45567 -74896 -1960 5979 -952 -20766 1396 -11271 -26057 -35873 -32865 22678
6349 22678 7040 -19256 -22389 -17965 -57124 -85662 -90012 9517 32764 -31131 -47402 -31347
6337 -31347 -26583 22445 39883 35950 36147 43054 88884 109642 76493 24260 13575 -5443 -30839
6324 -30839 -42733 -33749 -19738 1118 49951 38370 13690 -7086 4757 32002 29557 4552
6312 4552 247 20635 55013 43647 -2744 -22813 -21033 -41929 -36489 6555 13310 14739 -12649
6299 -12649 -51327 -14506 5275 -13877 -46523 -63128 -58122 -68588 -82943 -14765 -24058 -43627
6287 -43627 -73001 -76513 -55829 -58118 -83573 -69154 -24694 20750 11348 -14629 11034 -23660
6275 -23660 -86823 -67803 -46294 -38179 -25979 5086 7937 -8225 -50175 -19945 2778 -30761
6263 -30761 -50316 -62537 -7585 38104 -2812 -78657 -110898 -86420 -37408 -34383 -20991 -5382
6251 -5382 -97450 -107258 -73661 -45349 -22584 10006 19767 12466 35129 -2987 -16345 3754 53381
6238 53381 46443 10277 -67346 -81749 -47360 -37741 -84118 -86664 -20706 68480 77023 62152 31208
6225 31208 30406 13255 21441 38981 -19315 -64036 -39605 -41063 -38722 -15842 -13298 -535 7358
6212 7358 4324 28278 41395 59133 21354 3270 29028 51007 41798 35694 27500 7787 33636
6199 33636 29179 10435 15173 65719 60232 32539 -13824 -71999 -79161 -17201 -12656 4476 3582
6186 3582 10420 46799 66726 15416 -49033 -56246 -68345 -18939 -13594 -23229 29916 47871 30427
6173 30427 22464 2878 7935 30764 -10914 -67693 -44000 -69066 -72817 -29141 -22726 -64801 -87699
6160 -87699 -74182 -23715 1082 -27903 -20514 -32472 -7859 1047 9793 16491 -25336 -69269 -58116
6147 -58116 -14878 -24073 -10586 12049 7779 18984 12503 -62668 -49013 27868 65708 61378 22470
6134 22470 -34243 -24988 223 -41022 -68828 -47467 -8348 12787 -11643 10843 -11939 -23661
6122 -23661 -9556 -8765 77858 45483 10281 -15779 -44467 -6 53228 61946 78473 35866
6110 35866 26706 2247 11561 -13123 -16172 -25216 -33357 -41852 -65894 -45635 -12305 -30331 13473
6097 13473 7161 32558 58606 61579 25569 -14624 -19654 -78596 -92774 -107669 -131896 -121257
6085 -121257 -50198 -30281 -58869 -38560 -17317 -10427 -14253 15739 78287 110556 84310 61039
6073 61039 -6791 5635 19487 9190 -13625 -35999 -18127 -16608 -9858 -28869 -44292 -58438
6061 -58438 -97208 -89636 -29000 -4496 20569 22658 -24718 -60447 -38282 -6008 -17923 -65664
6049 -65664 -70066 -53115 -20270 -65611 -48179 -6425 -17333 -62343 -87151 -79102 -51412 14322
6037 14322 40309 70825 82665 61361 61759 42634 -6573 -14157 18824 -13005 -53960 -65255
6025 -65255 -70592 -31135 -30442 -33243 -28566 -80546 -84079 -32299 13597 -13600 -11729 -4691 -18072
6012 -18072 -19644 -41767 -62045 -69281 -39665 38129 19492 -15208 -53927 -70795 -44707 -2696
6000 -2696 -4862 -7939 -41632 -72927 -89580 -98944 -91258 -78207 -29609 23128 2057 -15109 -23701
5987 -23701 -26649 -20444 -22390 -39815 -9595 48381 5366 -15398 22200 3384 -15408 -35429
5975 -35429 -21638 -33058 -15994 18441 29274 65703 46880 -5511 5351 34984 96790 100881
5963 100881 67283 100461 122630 123280 85066 29221 43388 44090 49924 50805 -6126 -25473 -11592
5950 -11592 -31086 -13059 28727 56432 -3021 24544 13441 -44661 15357 57530 17286 -38381
5938 -38381 -42277 11809 41517 14423 -53747 -71428 -44558 -8650 12456 -6499 -26083 -74858
5926 -74858 -71063 -27427 -57610 -63050 -76447 -92423 -55364 -423 19121 14189 6962 -39127 -54731
5913 -54731 -69774 -92568 -51154 4301 1984 -1412 -19847 -10150 -33866 -73563 -81176 -69214 -83535
5900 -83535 -77753 -44142 15999 31894 24683 34157 27676 26446 -32779 -59184 -24439 -6310 -13295
5887 -13295 -26531 -3071 -17746 -40374 -64446 -109184 -71110 -44334 -57384 -46045 -46901 -24367
5875 -24367 -15595 -23424 -24414 -20489 -7701 -33460 -45193 -44117 -33019 31969 28085 3369 -17883
5862 -17883 -20489 -26861 -11812 74600 95780 39199 -12245 -43034 -61821 -113407 -146236 -129638
5850 -129638 -52945 -87458 -122328 -63142 -49431 -89014 -76798 -45187 -27501 -22596 -32420 -9709
5838 -9709 -22580 -34031 -60479 -78355 -80302 -64008 -36682 -58271 -91105 -53680 21398 27617
5826 27617 39609 -44 -57602 -57085 -60347 -95986 -126357 -39178 9585 14905 -28468 -81817 -81811
5813 -81811 -4719 54453 49461 11398 -14926 -3993 -15657 -17553 18064 34516 35371 384 1455
5800 1455 -29231 -50612 -90678 -91584 -73779 -6714 34124 11363 401 68035 57217 -1707
5788 -1707 -50886 -37722 -40035 -42877 -7257 15327 -5954 -60692 -90426 -90521 -34111 -14395 -45630
5775 -45630 -80376 -37359 -2645 -2372 24177 65061 25101 -18898 -44050 -7994 25686 62153
5763 62153 48004 49762 55132 13513 -20411 -21544 44376 54720 319 -67773 -71907 -26468 13267
5750 13267 -13414 -24163 39703 56623 88940 63220 43739 -7805 -31440 -44023 -55358 -21048
5738 -21048 6543 -59065 -92178 -36973 -25511 -30134 -26321 -27107 -17662 -50691 -30734 -17984 -53289
5725 -53289 -33329 -49268 -21855 10568 16901 -10868 -27105 -1451 -13707 -30208 -42761 -57730
5713 -57730 -66276 -9493 -51309 -66027 -37771 10969 25573 10008 7170 -14009 5397 17713
5701 17713 -20370 -23144 -39903 -64217 -101739 -122272 -129503 -120020 -80591 -66339 -58649 1223 11797
5688 11797 -6455 -14625 -20296 910 -9534 -31288 -42497 -3475 24547 -16670 -62382 -30944
5676 -30944 26701 17505 -41060 -56595 -49754 -18850 23532 32540 28924 6531 -851 10038 74483
5663 74483 91749 73071 44945 16915 -22056 2017 -20877 -21348 -5157 24414 28556 -3401
5651 -3401 4231 4998 9127 -7289 -36005 -53856 -61372 -25897 -17181 -22209 -28149 -15412 16833 21591
5637 21591 26552 32644 -14013 -44683 -55264 -44528 -30109 -44205 -86363 -93833 -29920 18079
5625 18079 25265 41663 37278 14258 8895 -10669 -47519 -79838 -88326 -74775 -116762 -159017 -153598
5612 -153598 -149133 -70633 -19328 -22950 -10462 21383 39694 -3665 -31478 -29476 -25466 -18532 -11014
5599 -11014 -7440 -15919 29351 6780 -4103 52930 70548 21410 -87365 -118445 -122248 -81746
5587 -81746 -75265 -42122 -1365 -29945 23327 54709 71129 46302 -34852 -62036 -58384 -37165
5575 -37165 -253 31078 78956 73531 112862 123302 57235 8975 5703 -7639 -1139 -19211
5563 -19211 4181 30055 -12330 -10017 -9152 -30744 -104807 -122389 -91123 -72834 -39376 -2040
5551 -2040 -6244 -23825 11694 -15037 -8521 -42084 -73003 -63045 -49425 -20576 -4258 68626 19922
5538 19922 -7448 -18757 -30433 -13893 18211 11980 -13297 -19914 -18122 -23110 -24823 -40303 -17681
5525 -17681 -22019 -53624 -47708 21859 5144 -35117 -39660 -41317 -48758 72955 93227 59954 32262
5512 32262 -3993 -36986 -34401 -20538 28969 -27308 -54644 -38006 -61872 -42121 -49507 -51101
5500 -51101 -32013 -69413 -70191 -34062 -35917 -10570 18097 -23358 33719 78701 57045 48788 28143
5487 28143 20504 1329 26255 -12761 -43715 -28483 -28337 -985 49605 71483 57083 11893
5475 11893 -1413 -24935 -29659 -28706 2069 -6640 -30885 -28744 -63623 -39562 21606 28753 19591
5462 19591 46696 52349 35712 42091 42844 60241 45654 1778 -31252 -31260 -5013 10695 23416
5449 23416 1528 4210 18984 -53754 -57126 -64269 -55317 -11191 24503 7150 -29434 -22242 -54386
5436 -54386 -101063 -49256 15957 1173 -39134 -5678 -4932 -22034 -13335 -7267 -7027 -93786 -96032
5423 -96032 -46469 -12021 -50250 -81426 -50995 5934 45038 39795 56240 42267 41371 59035
5411 59035 61293 48428 34197 25668 -5324 -76121 -78501 -5316 37737 24739 2092 -14724
5399 -14724 5955 -15117 -13879 26791 60631 73507 66799 17343 -33507 -57501 -35561 -14527
5387 -14527 -13752 19628 74767 33062 -2849 7273 49076 21980 -31862 -44013 -16698 22733
5375 22733 23283 1560 -45637 -34615 -19310 -926 18693 19659 39589 4015 -29882 -56733 13411
5362 13411 40044 74052 1268 -74511 -91710 -60214 -31165 -47638 -24458 -1440 -14142 -34146
5350 -34146 18991 9154 9692 64928 43420 31406 -2855 -7340 15308 -25801 -50997 -23136 -7339
5337 -7339 4413 -11505 -13123 -19656 -13925 -26480 -29387 -2862 17669 41861 25505 22225 13383
5324 13383 9242 44524 20345 5564 -15152 -38172 -32796 -47441 -65588 -77519 -35790 13399
5312 13399 23368 37422 29374 55320 45749 26085 43026 90481 91470 85670 106041 140240 74615
5299 74615 44314 6477 -34031 -8010 20127 -17695 -47958 -32196 -4583 18392 11477 -16343
5287 -16343 -28647 -19538 14821 21737 4685 57213 61650 26857 37982 12593 -45457 -67696
5275 -67696 -20441 -15182 7463 23090 12728 8162 -33600 -55163 -36868 -36681 -26907 25112 -3942
5262 -3942 -29828 -52741 -65737 -63195 -49055 -77768 -36353 -72857 -67910 -38212 -25760 -56292
5250 -56292 -79638 -81409 -75738 -70457 -78633 -47664 -17294 -21605 -31881 2561 -25496 5153 8836
5237 8836 -3687 -58866 -70901 -61570 -38406 -17020 -72457 -116449 -118509 -96187 -61791 -73623
5225 -73623 -73528 -23339 9085 -6384 -84 45729 1014 -50863 -26247 -44326 -52638 -74459 -94501
5212 -94501 -87217 -135220 -105849 -34506 48124 83883 41975 56564 50180 -8445 -60849 -54668
5200 -54668 -30952 -62971 -97782 -85641 -50054 -46110 -61430 -64497 -107108 -75229 -55972 1538
5188 1538 16758 -26844 -25845 -65371 -16058 -16477 -38817 -79910 -50710 6275 32545 33572 11740
5175 11740 14453 -4181 -18882 -47929 -84749 -76517 -32218 -4651 10546 3297 1000 45635 42428
5162 42428 42091 24821 -17800 10107 25517 25347 2945 -4702 39535 9540 -16099 -59029 -57339
5149 -57339 -17308 -28724 -8691 -30325 -52706 -15435 13520 -27144 -56658 -12512 8500 -20382
5137 -20382 -31859 14052 4954 -19577 -28711 16750 65230 37618 9932 -1208 4028 58287
5125 58287 47730 -25363 -43223 -46692 -34839 6177 -14938 -59210 -45918 -25675 7983 28614
5113 28614 58203 56220 47014 63098 67870 69649 102155 67359 75068 82735 52683 8186 -22333
5100 -22333 -9164 -16425 -44947 -69931 -77117 -10762 -3008 -5297 -10762 -34325 -3869 28714 14478
5087 14478 35937 45577 -7099 -23685 -2925 9333 19066 10971 -16169 -26252 942 10013 1159
5074 1159 -40489 -37365 -50800 -56844 -91604 -93804 -74006 -57592 -59764 -53894 -33918 2630 -16721
5061 -16721 -33766 1766 12554 33896 67100 42325 1897 18476 68114 44959 -26244 -48918
5049 -48918 -62644 -50776 -22118 -18786 -858 37272 59980 17238 -50458 -44765 -27211 -28397
5037 -28397 -28523 -50649 -20715 -22720 -14428 -48812 -63024 -21785 -2523 -7326 -10988 17511 811
5024 811 26 70036 90059 53865 51718 60149 57461 20944 21882 31750 13086 -4538 -50397 -54406
5010 -54406 -13180 -6801 16251 73354 34863 6406 45385 78863 62355 21578 -61693 -81216
4998 -81216 -60212 -46213 5413 -23401 -14209 19204 7901 2088 373 20464 40926 17108
4986 17108 21887 -8037 -14374 10278 -21879 -72397 -77798 -64486 -45092 -4197 40818 13359
4974 13359 -10294 40433 111126 93183 10329 -17266 9726 10485 31006 34586 -9359 17366
4962 17366 20702 -18145 -23473 1862 25660 72483 44817 44247 54476 6236 16629 53587 62337
4949 62337 57474 72513 95890 21624 -15541 -24225 27984 15551 32406 80031 56182 -37839
4937 -37839 -98712 -107607 -115405 -97042 -62898 -43234 -74361 -82024 -122306 -119542 -81843 -101119 -121188
4924 -121188 -117090 -84035 -83892 -26574 73476 96068 62532 -32750 -91704 -89684 6990 51302
4912 51302 16756 -25274 -25693 49499 29531 19330 27947 -25737 -54928 -63340 -42090 -81021 -141534
4899 -141534 -82773 -73625 -67713 -68284 -96660 -61541 -90329 -114517 -150457 -124801 -56238 5728
4887 5728 -8577 -8334 -66653 -58587 -31889 -22467 -22773 -23093 -25880 -53168 -61474 -73214 -55883 -39480
4873 -39480 -63643 -57933 -45888 -7346 21377 4934 18074 -5486 -6529 45719 72931 31961
4861 31961 7506 6480 -53377 -38059 9847 23627 -4656 -68202 -63852 -49245 -34374 -11841
4849 -11841 3970 22223 -13506 -27394 -45106 -75191 -72997 -23369 1619 -14049 -43622 -26076
4837 -26076 -17167 1783 -7013 35632 81688 77720 79860 47990 25100 29002 -4257 -37693 -1710
4824 -1710 34669 37169 -7316 -64139 -62827 11510 28395 -36249 -49588 -48604 -16121 12654 -21583
4811 -21583 -38428 -35038 31831 69788 22558 -39044 -27304 -7839 21009 47781 23438 -14290
4799 -14290 -33185 4978 29257 53399 88850 65448 67157 53333 27366 -54311 -103815 -59928
4787 -59928 9295 12294 -13291 60664 96742 99713 31742 6920 -14289 5995 7553 5950 -15320
4774 -15320 -23970 -61696 -88042 -107778 -56039 -27861 -9471 13621 56582 83214 60166 -27876
4762 -27876 -67436 -56892 -57942 -48080 -54523 -56314 -44280 -17568 -28241 -12466 -15925 -65817 -65855
4749 -65855 7511 47394 56293 20094 -13149 -55806 -69618 -98426 -86077 -14274 33712 70461
4737 70461 34004 50516 17855 -13671 29691 -26887 -42582 -26489 6924 42432 19210 28
4725 28 7197 -67618 -68665 -7204 15860 10905 -25655 -38511 43856 50112 14519 -11318 -7666
4712 -7666 -23631 6541 21330 -2459 585 -7237 -58270 -82458 -28791 9726 41353 57267
4700 57267 93248 75943 16478 4849 -896 3061 8433 -11827 -56475 -46241 -30926 -34495 -72590
4687 -72590 -77843 -11197 32257 35909 -579 -52013 -25923 -18406 -26625 -15486 14588 36213 -3741
4674 -3741 -58584 -49282 20302 29870 -23683 -42252 -31137 -30340 -66704 -74908 -29609 18207 23654
4661 23654 60627 66532 72950 78475 91808 91480 58484 41065 47430 35336 17459 -10229 -46105
4648 -46105 -64534 -7327 8469 30177 39735 7762 11104 49871 45127 6596 15357 59727 54295
4635 54295 55772 -18611 -87042 -55545 -24936 -904 -31718 -14410 16149 -4919 -44682 -30575
4623 -30575 8385 6687 -17448 7855 -69758 -99198 -59677 -31495 -51450 -36390 13465 37739
4611 37739 30729 37257 17950 1181 -1058 -31637 -21237 13630 41212 53086 26896 -15057
4599 -15057 31197 56299 -12496 -77529 -70870 -57624 -54318 -68734 -57954 -51031 -38460 -59423
4587 -59423 -81183 -31070 42863 63964 62629 59619 7490 -17421 17901 55299 72817 12163
4575 12163 3137 -8880 -24475 -106187 -121210 -77394 -35439 23816 101027 95965 94107 76447
4563 76447 70033 69335 38270 38245 48287 24713 3794 1272 81215 76946 46358 53893 20712 9304
4549 9304 -21645 -32741 -38102 -32876 -33832 -3362 6693 1341 16438 53367 47422 34758 12137
4536 12137 11434 -34777 -36440 3380 -11904 -14529 20622 27067 28187 -19424 -31889 -23689 25446
4523 25446 46229 68663 91821 44089 36025 16716 9875 -2116 -41033 -44787 -42969 15896 45149
4510 45149 45989 81680 26815 31761 49727 65730 37533 75868 65318 46291 45140 45789 53285
4497 53285 72451 50826 80781 16471 -39707 -68707 -79973 -5732 37240 -19526 -2033 25000
4485 25000 -12446 -37146 34089 52037 18869 3916 -4536 4073 3674 -12244 -4556 -7694 -9657
4472 -9657 -50687 -32662 -43204 -36792 -18716 -1103 -18571 -50861 -76407 -45993 -3257 -51358
4460 -51358 -77027 -39277 -24911 -75785 -122955 -152789 -123503 -117237 -110610 -73732 -56980 -96252
4448 -96252 -69866 -41217 -28769 25066 47860 82101 97545 90048 76638 44057 52484 56814
4436 56814 26643 22425 26690 -12285 23272 -9281 -9023 24668 -19270 -54470 -59482 -28153 5697
4423 5697 41029 8939 -28666 -25948 13982 70459 41852 10235 3910 -24215 -32354 -36749 -52693
4410 -52693 -14377 -18298 -20944 -72319 -77188 -31348 21391 51266 -4396 -30895 -27281 -36241 -28876
4397 -28876 -49222 -81344 -63638 -26986 5945 21933 4777 12017 2033 46150 62667 55551
4385 55551 75268 56317 4832 -38521 -29521 -8611 -3640 -9218 -15224 5744 -5627 -50188 -11042
4372 -11042 29288 38864 49788 29353 60386 68492 44637 16022 -6035 -43991 -54329 -22473
4360 -22473 5297 -68245 -24968 1621 26145 -5211 207 -22026 -55429 -22012 31036 19042
4348 19042 -14722 -50368 -55685 -20686 9226 -26288 -26251 -15806 4752 8583 5384 24720 39497
4335 39497 61622 28313 37674 22082 -39123 -79558 -48924 11173 42282 60264 22011 -47992
4323 -47992 -66927 -44776 -11620 -6474 -18038 -12449 3944 37404 61204 41531 5000 -13089
4311 -13089 1251 -20531 -38050 -44578 -71753 -104654 -119979 -92453 -79304 -89014 -94027 -47960
4299 -47960 -23364 -37708 -27579 -26236 -31613 -67275 -92746 -37858 -40432 -66954 -82277 -20669
4287 -20669 13338 -45098 -31331 -18511 -40545 -8481 8157 -1490 19297 55170 6492 11124
4275 11124 33733 16989 -17557 23116 76926 107106 75167 -19512 -80806 -67666 -29338 16236
4263 16236 -1440 64315 91459 48579 43735 29400 -17954 -47966 -88970 -81580 -30405 -3724
4251 -3724 -51496 -31778 -47581 -26574 2824 16653 50430 -2390 -25187 64503 90213 79429
4239 79429 53718 25837 29770 15144 -42152 -59179 2961 46912 16198 28714 -2304 -16867
4227 -16867 15735 14114 31332 53627 73248 26025 -6564 612 18968 56920 68966 85715
4215 85715 75790 42920 7450 58378 38208 3215 25929 11220 -16457 -20850 12620 65637
4203 65637 86365 68387 86638 63822 8455 25809 -14376 -7581 24787 -17760 -38080 -56591
4191 -56591 -37986 -444 46962 -8297 -34954 -12314 -13157 -54475 -31996 -9398 -27841 481
4179 481 -17229 -50881 -38769 -46245 -30510 19616 30637 13176 -21387 -21994 -37478 -5359 4396
4166 4396 5651 1170 5209 -3662 -77467 -101197 -83863 -44504 18753 48275 34961 2321 41221
4153 41221 57291 17219 23510 44585 33786 8960 -15653 -48201 -62797 -74344 -60628 -72845
4141 -72845 -87589 -71962 -45710 -74390 -77159 -71746 -58329 -61000 -61362 -54260 -41197 -35678 -18619
4128 -18619 -39351 -46143 -102200 -101566 -36188 25623 41232 55027 29810 20295 -23932 -59131 -26542
4115 -26542 -8562 45046 18867 12835 4544 -50412 -72606 -29839 60045 100156 87890 53260
4103 53260 3330 -20843 -6854 6940 -17273 -23866 -2325 -477 35476 58341 42668 34134
4091 34134 25370 37672 41801 33755 36883 28037 15220 32207 31863 -7709 -48965 -101720 -110151
4078 -110151 -32378 -51236 -13756 7706 2131 4232 30485 62801 39605 59527 57920 14238
4066 14238 52403 69510 91199 74895 40581 61239 88883 59703 47142 15280 -1936 48007
4054 48007 26072 -16817 25338 61631 27861 1493 21095 12293 -42141 -6785 3595 19545
4042 19545 19485 10546 289 -39745 -32046 -5607 5519 -12982 -58392 -61155 -26053 7162 17682
4029 17682 44692 9028 -21025 -1628 16496 8748 20086 -15026 -12764 -11459 -18480 -28938 -41177
4016 -41177 -20161 -24267 -36223 -5763 11885 -8246 -21278 -15643 -24876 -42815 -36591 -78592 -77135
4003 -77135 -60267 -58233 -105707 -82451 -85172 -82344 -49933 -71465 -44454 -41879 -32494 -39252 -15259
3990 -15259 7942 62343 65872 71495 87978 31570 33488 27123 24740 49037 51319 47932 6151
3977 6151 27239 68539 71846 62926 44146 49488 47600 26910 28783 73509 107282 36033 -9585
3964 -9585 -13403 29564 64404 6775 8329 42554 59994 23416 -46308 -10447 -2847 -7365 -25647
3951 -25647 -52528 -19601 1420 859 11250 18335 45495 35864 1131 2126 41452 65519 56754
3938 56754 22045 -26970 -71318 -65827 -31185 -23582 -17411 -43822 15017 53490 84463 97755
3926 97755 88568 110919 118379 116188 105762 84633 92111 68156 5573 -16599 -2326 36588 37397
3913 37397 33354 52131 67565 51423 75020 28859 13335 19168 18742 16826 3072 34117 50437
3900 50437 82768 100647 98371 69444 38194 37855 720 -41288 -66626 -67349 -57102 -23121 -13981
3887 -13981 385 23292 35319 24072 9532 -4028 -12340 -6466 19643 45157 55881 33466
3875 33466 18706 6767 11594 -3094 32634 86002 50195 17753 28731 -6715 -48814 -40930
3863 -40930 -24354 -9885 -21441 -74055 -77741 -56429 10251 127 -45060 -27321 -31844 -51534
3851 -51534 -25427 50518 51699 18509 -28087 -45156 -31499 -12254 -23782 -4100 31086 53668
3839 53668 85515 63818 30415 22000 15996 -9987 -13911 -2114 29839 49068 13307 -58910
3827 -58910 -34814 27190 92836 52139 -25517 -63102 -106442 -117783 -77122 -47022 -23303 -3038
3815 -3038 19838 44193 44542 17575 3747 7881 -31284 -21482 -27688 -757 -9566 11384 16430
3802 16430 -1168 12983 34860 58325 74122 52748 -5075 7876 32359 51764 2648 -19696
3790 -19696 -71277 -36638 -3108 1508 1191 -2145 -6679 -5311 -25885 -877 -15991 -5220 -27220
3777 -27220 -11650 -5549 -59881 -65237 -56874 -35090 -19572 -7423 14816 -8395 33225 50322
3765 50322 29128 61690 49709 6709 23099 32416 50345 102971 86741 52973 40005 10022
3753 10022 28931 31582 39694 45974 13420 22778 36859 19183 -8874 -18716 8156 35779 45716
3740 45716 19894 4625 46119 58593 -17946 -67059 -25886 -46709 -39394 -18019 -30670 -56538
3728 -56538 -88457 -86174 -26964 -74900 -108795 -77763 -20341 915 17534 49854 46851 9270
3716 9270 -63468 -41317 -33084 -25971 3374 26823 23709 8373 -10982 6506 37838 1970 18223
3703 18223 24244 12334 -14456 -7106 27205 -9889 12591 11631 -28336 -35684 5069 50325 100382
3690 100382 68645 100437 89223 55498 13106 -43455 -46691 -56725 -75778 -25769 43318 58129
3678 58129 97040 120246 30708 -20315 -27378 -76694 -50069 -19199 -29986 3176 -24012 -26549
3666 -26549 -54451 -86955 -32718 44295 89063 84337 12959 -9452 12475 14600 13884 59421 45138
3653 45138 52665 26130 8956 24266 54882 63470 40211 59816 63816 38360 18984 26190 -23654
3640 -23654 -21855 39090 39251 -38746 -70371 -60618 -27420 -36902 -21359 -24530 -1247 37738 61450
3627 61450 26164 19091 36399 28118 38379 29933 3344 -23090 -18034 -19676 -11080 -56260 -78811
3614 -78811 -73135 -55669 -33242 -45062 -57048 -71021 -92876 -86070 -93833 -29112 7978 34163
3602 34163 -26101 -48715 -51643 -27183 14193 6970 20969 -49240 -88992 -78830 -63203 -33451
3590 -33451 -13490 38257 49883 36855 25871 12358 -18647 -31516 -15990 -9559 -40665 -19141
3578 -19141 6754 9537 44499 55187 50539 52661 31090 18723 35005 55709 15616 -14517
3566 -14517 4443 -2244 -48061 -61226 -64918 -10829 46790 -2944 -28324 33838 17708 -30409
3554 -30409 1786 21879 7603 -15931 -41360 -72666 -89598 -73943 -43819 -52337 -57038 -36533
3542 -36533 -29827 -67868 -47501 -30484 -3269 -54010 -110119 -123412 -114119 -41087 -5452 -27676
3530 -27676 -6482 -758 34370 10611 -25718 -38120 -67883 -33405 -10342 -74162 -47735 -42495
3518 -42495 -71239 -81818 -89964 -95047 -87104 -53411 -41311 -31928 -57913 -57307 -38245 -13448 -57683
3505 -57683 -70136 13636 -2576 -45284 -2464 -2889 41336 20638 -21760 -8198 -3713 -34222
3493 -34222 -27552 -36149 -44481 2512 52015 76106 72274 28739 52126 24094 25767 74375 44975
3480 44975 31722 18853 -49643 -74586 -44547 -17392 -34916 -48386 -25321 57192 66869 46358
3468 46358 46086 42890 27968 39467 18161 17586 -4423 35225 74342 75164 43378 -16128 -42093
3455 -42093 -31974 -17063 1234 18658 1486 38457 24222 -9996 -64962 -59683 -45180 -33252
3443 -33252 -29869 -25430 25057 33123 34611 59515 55110 14954 -11261 -7667 -59953 -60505 -47822
3430 -47822 -61386 -72055 -77828 -82588 -64601 -18167 -1115 8200 25682 13000 -7901 -12454 8266
3417 8266 33834 30118 -4473 -23821 7465 44477 25762 -12518 25493 89475 56593 -33992
3405 -33992 -90254 -128889 -73803 -2709 28941 17509 -31158 -25069 13965 -2787 965 6550
3393 6550 -1949 -932 -922 14319 -12005 -9157 -17495 -31209 2885 59962 100437 127898 112844
3380 112844 51203 2893 -49486 -57467 -2782 -3461 -32414 -46064 14817 101415 144276 89981
3368 89981 47529 34079 8429 -3994 -9817 -6248 -21895 32883 -274 -28664 -33052 -36010 -26918
3355 -26918 -45423 -29706 -40814 -18498 39445 43873 74189 73233 49185 -46075 -31528 32811
3343 32811 13048 -14850 -1741 -26459 -10077 21902 8284 -3260 -33794 -48652 -63242 -20811
3331 -20811 32463 -14457 -21113 22336 18673 50763 51045 14330 -1107 -53334 -51918 22388 33860
3318 33860 35499 7224 71993 103262 97077 38046 -8945 -26163 -28421 -5298 17147 11961 19741
3305 19741 23237 -3377 -39080 -44780 5354 23860 25196 57096 50121 -9641 -56638 -10097 13808
3292 13808 7625 28540 15720 -23194 -3977 17666 -10791 -31415 -17267 -24750 -1207 20734
3280 20734 33114 37639 33757 -31 -25654 -32546 -7607 38873 54854 17293 21132 31414 2555
3267 2555 -38821 -34959 -20013 19922 33045 13416 14611 -14454 -14184 -22234 -39760 1638 52435
3254 52435 88781 45100 -20358 -20156 8518 828 24385 47985 56632 9937 51550 62451 -31141
3241 -31141 -47731 -50072 -33029 31145 32142 21053 9378 -3721 -1623 -18110 -48469 -19927 25813
3228 25813 27692 59104 36797 33708 42491 4788 -33516 -73350 -31618 8465 -18537 -29631
3216 -29631 15055 9758 17858 10763 23522 -1731 54881 96856 69983 50902 17 -29559
3204 -29559 -29217 -41965 -61599 -6768 70186 113700 88688 67804 57703 -7268 -28446 -21183
3192 -21183 -26254 -6353 -19789 -59475 -81526 -116213 -125693 -85704 -66782 12325 57612 83850
3180 83850 76812 81916 28637 -13056 -10671 29245 83263 117878 50764 186 31753 50555
3168 50555 48855 34488 7440 -34337 -33369 9668 6533 19831 -2563 -200 -19845 -50708 -54258
3155 -54258 -54914 -63381 -51466 -50217 -80228 -70658 -63096 -63142 -18180 7070 45852 48758 2770 -7801
3141 -7801 -9420 -74247 -70530 -70877 -42592 -17933 -24220 4493 94767 105314 54576 -1233 -54494
3128 -54494 -51566 -48616 -61030 -42258 -24215 -725 -24263 -74725 -51254 -57558 -87779 -77780 -12285
3115 -12285 -3847 -14512 34523 28292 15573 2257 -18639 -16547 -24426 -78964 -65044 -33253 -29973
3102 -29973 -42133 -78841 -95413 -84485 -37557 -3772 -2175 -9374 14832 61664 64798 40811
3090 40811 5639 -16595 -34163 -8084 -20202 -20777 8309 17211 28280 10310 6842 -852 -8056
3077 -8056 -27673 -37913 -24889 -26264 -45868 -37779 -79878 -72862 -32889 -50011 -21945 -6185 3968
3064 3968 -3198 5416 -1324 -24401 17354 32941 5955 -12490 -48019 -23928 -40632 -49200 -37335
3051 -37335 21160 73272 105791 70878 57886 57134 70902 24826 2585 -8169 -34530 11118
3039 11118 69579 53253 51493 17875 9086 6063 -37906 -89696 -125044 -88933 -92513 -102385 -69539
3026 -69539 -42167 11013 -5432 -12117 60263 126377 87094 21247 -4874 -13731 4238 23905
3014 23905 24491 68269 73819 81754 47668 9276 -12254 48465 42615 -26672 -62044 -27979 25786
3001 25786 48504 58139 41110 15224 380 -18267 -18184 -587 6141 8909 25416 23596 -259
2988 -259 -26349 -3501 -4625 4033 21034 7119 11356 4391 -51300 -73721 -62805 -58091 -51392
2975 -51392 -72962 -60941 -27913 -61978 -119573 -115958 -129124 -125376 -137663 -86691 -66268 -32046
2963 -32046 -36100 -6828 2806 38588 28659 11636 -7257 -4462 -8179 11943 40639 38998 33479
2950 33479 -19131 -41436 -6216 -20829 -65259 -74602 -40825 27148 61827 80965 86998 61952
2938 61952 57600 36044 7084 5799 -31502 -54185 -44321 -16194 -15350 -25580 -9591 160 -1586
2925 -1586 11951 20597 -21971 -54247 -23949 21661 20860 -25970 -45525 -15146 -10667 -17777 5532
2912 5532 12612 -7236 -48428 -6199 63165 49697 -4478 -26963 5948 41150 56183 51771
2900 51771 96967 68994 -22299 -88412 -45452 10969 63629 -3633 -62810 -18664 -5480 -8202
2888 -8202 -19275 -58228 -36185 70081 37248 -57879 -90551 -72861 -57979 -59484 -26493 -27098
2876 -27098 -31932 -19025 -30720 -59018 -66374 -84509 -38148 -24827 -38603 -9915 57929 77634
2864 77634 58260 15199 1513 17039 17475 9873 -9935 -71149 -81902 -17541 57290 16057
2852 16057 -34609 -23609 33408 60994 27416 15124 22129 -24260 -89544 -54494 -21018 -29624
2840 -29624 -261 -3298 -76105 -69237 -23748 -25409 -35155 -4220 -28535 -18871 -28166 -677 23784
2827 23784 46588 45249 36014 14019 -22912 -40600 -45546 -24990 -14360 -10513 -8744 -41939 -41883
2814 -41883 -229 4989 2383 36408 57871 65031 54595 57839 19477 27413 3577 -24534 -51664
2801 -51664 -75041 -34681 28847 5901 -18475 -10558 -35211 3229 18644 -2958 -3598 33781
2789 33781 51287 36722 17044 14513 65512 95488 99284 109463 38880 34834 63921 35765
2777 35765 -11506 -39526 -32216 -89336 -56187 -74231 -63965 39095 105426 92015 96952 93820
2765 93820 47408 -28753 13960 68960 46543 18662 5659 2775 -22354 -9002 -21524 -55023
2753 -55023 -44460 -38957 -29085 -49368 -42099 -17258 15864 45834 -23423 -37834 -24794 10389
2741 10389 41398 12239 10538 -2019 -41612 -39094 7488 22234 -24633 -32425 3205 1705 4910
2728 4910 34235 41360 33392 33829 31242 35888 -10332 -9670 81092 110752 116850 80842 68701 42919
2714 42919 26356 -44876 -54718 -51402 -11941 16420 10268 -43195 -73443 -49659 -10506 -32780
2702 -32780 -10333 4755 3754 -10223 -47874 -53363 -21198 1035 -10080 -48436 -20030 577
2690 577 -27058 -1327 14918 -15407 10508 53241 59180 69315 4989 -20123 -28470 11434 37013
2677 37013 34739 -3272 32682 80935 105563 71110 -15020 -35900 -58687 -50022 -32408 8821
2665 8821 18814 17194 12168 9883 -22564 -15227 -29586 -67307 -17066 3758 764 18592 38088
2652 38088 1477 -61636 -73985 -17886 -5986 -18405 6950 26687 22722 28839 2060 26739
2640 26739 51436 29755 -5939 -28174 -5429 19756 16156 8214 21109 20382 35171 14940 10665
2627 10665 13377 5064 35159 13188 17910 33926 55558 85493 50322 13724 12771 61880 68059
2614 68059 27136 34648 -12606 3321 39783 3674 -6791 -6457 -23517 9973 39514 16655
2602 16655 32510 33267 4144 26280 55728 62320 62979 76928 84550 36425 -20601 -5016 31128
2589 31128 45203 14447 7449 25346 10574 24819 5776 7311 16316 -4817 -4161 30335 53384
2576 53384 39148 36373 57866 28939 22612 18383 -34642 -41955 -63421 -47013 -24275 3820 25360
2563 25360 -14213 -4971 -59903 -36554 -47044 -18049 36150 5021 -17413 -33499 -51710 -71940
2551 -71940 -83673 -68460 -53216 -20562 -8909 -20175 -20726 -13672 -39318 -38368 -8257 40856 58773
2538 58773 56254 44511 30561 -29077 -54531 -22489 12920 44257 7990 -16008 -7594 8394
2526 8394 29022 36333 56465 86264 70922 15977 -67469 -41777 21683 68212 84708 100654
2514 100654 55907 -12406 -21658 -31608 7772 5570 -17984 39634 28067 -32568 -11298 39492
2502 39492 65262 33524 4763 35969 67581 69827 18254 28930 2237 26406 20119 41697
2490 41697 28100 -20730 -54851 -82380 -110377 -60973 -47937 -14141 -20779 -41090 -41284 -73573
2478 -73573 -68952 -9166 8519 -5883 -344 -33312 -14628 24744 9904 -26929 -15891 20620
2466 20620 -14406 -50253 -14446 -50403 -44434 -32297 -49418 -50415 8316 -7944 -21957 -33852
2454 -33852 -25123 -22035 -45988 -20300 32667 89385 27231 17625 59679 97577 42893 -14766
2442 -14766 -10856 15094 -27381 -38729 -30512 4121 28780 40467 -4417 -36090 -15347 -13339
2430 -13339 -18770 -33066 -50191 -40239 -37465 -26441 -28517 -15485 -570 -38607 -31070 -21213 -28656
2417 -28656 -6246 -6174 -35449 -4992 1852 -23157 -62211 -22380 78460 70222 -26277 -66789 -55956
2404 -55956 -26014 -29178 -56459 -31938 -61534 -94643 -52854 -7375 29911 17913 236 5869
2392 5869 -4247 -30548 -9268 -26651 -23295 -27011 -6560 40928 -7492 -13787 -5746 -10993 40218
2379 40218 50660 94406 77900 51464 56588 74154 73407 24340 27248 59636 91474 44727 21536
2366 21536 44611 37954 24152 -7751 12119 41328 58999 2717 -71958 -76627 -34754 3929
2354 3929 28850 32038 21076 -7660 -26148 -16610 -3015 8428 -12556 -6306 83941 90823 101754
2341 101754 109357 71550 31977 -29089 -47339 -61773 -55279 -21256 38814 41795 30069 45085
2329 45085 10885 339 54474 44705 -2720 -24336 26785 64080 16513 -67625 -115000 -70364
2317 -70364 -53340 -61144 2131 -7840 -13126 54329 33322 -4033 -22406 -57724 -14700 85423
2305 85423 26797 -4750 24641 11234 -20155 -40099 -57048 -45088 -66262 -42879 67682 61069
2293 61069 43294 38310 51358 32153 21663 16435 32501 31813 -16008 -7350 9350 -25043 -49415
2280 -49415 -25894 6426 17510 31931 61656 -12236 -91730 -142634 -91990 -25077 -31831 -11748
2268 -11748 26265 62456 56976 47385 15100 -6489 37204 30078 -9736 21171 52605 42619 38597
2255 38597 8749 -5485 -56958 -51171 -5188 26686 3 28149 3463 11583 18380 -28442
2243 -28442 -8230 -14880 -36645 -8506 66547 80579 78954 79712 63970 33994 9669 51699 33084
2230 33084 -20820 8216 1659 42180 6846 -47310 -37138 -19729 -12741 25217 11922 -5540
2218 -5540 39114 73986 78886 -17470 -41146 28734 35129 -17585 4598 17415 27476 14993
2206 14993 40854 59360 51188 49598 53414 55157 15226 -48438 -33364 7700 23064 34894 9710
2193 9710 607 5839 -15962 -36538 -24476 -23440 7303 10062 -41531 -44534 -66767 -28959 5272
2180 5272 -20887 -19018 17024 -16614 -31084 -30027 -45848 -32348 -1596 15941 21908 13000 8538
2167 8538 18124 -23846 -33910 -37343 -41511 -3127 -45389 -104826 -89505 -59730 -49613 -19162 -2911
2154 -2911 -11126 4119 -19029 -38281 -886 -28709 -31731 -33065 -37005 -35907 20405 53629 35546
2141 35546 -25152 -52966 -17659 1715 6515 -3853 -79854 -68374 -39301 -76247 -16748 43102
2129 43102 -3575 -16027 -18166 -20 37006 49097 30408 48605 55102 55294 29789 17755 28096
2116 28096 38469 35680 26582 -12748 -23577 -25977 2004 47413 7750 17133 18545 17400 40443
2103 40443 24031 -8998 12693 19794 30496 59524 66628 23193 50832 40658 44087 64311
2091 64311 68207 22275 1949 -23457 -42364 -34296 -29982 -22399 19378 44211 45917 -3288 -33339
2078 -33339 -33338 -71523 5424 37236 -16228 -48213 -88167 -21963 38424 90146 82483 51944 47324
2065 47324 46272 59777 59786 18591 -3864 12231 -13559 -51455 -89441 -88422 -56447 -22633 -6349
2052 -6349 257 60123 35817 4885 -47883 -41999 -75005 -46480 -2326 34583 33325 -65757 -48479
2039 -48479 -37896 -66780 -82207 -50104 -25332 1564 -34560 -52008 -13947 18636 55746 57992
2027 57992 16125 10423 27139 53975 67977 21102 -49724 -18828 -7815 -16911 -1855 -40496
2015 -40496 -43246 -34753 -1872 8086 27191 18056 6872 -22540 -60583 -19705 -8255 33372 61500
2002 61500 62423 66286 82980 81832 27445 -4933 612 -428 15126 5226 -27342 -29665 -22861 13762
1988 13762 40050 28204 5401 -14080 -61493 -47540 -49854 -41194 -37548 -25680 -25374 -46200 -44421
1975 -44421 -67372 -82255 -35327 -12837 -3921 -21357 -37351 -47830 -32165 7988 22039 25480
1963 25480 -23127 -51701 -69508 -76888 -34139 24007 40417 33750 5569 -74755 -97435 -85008
1951 -85008 -70232 -36300 43433 51199 31219 2542 22479 12716 9814 -7165 11748 37695
1939 37695 16859 53878 51366 67352 72794 71314 71225 84672 53058 15304 -4337 -43003 -4443
1926 -4443 16060 10081 18531 -12756 14789 45498 37566 -26952 -25802 3815 34090 23082 -20599
1913 -20599 -30203 -24378 -46850 -59237 -14177 13511 -24050 -26021 -15689 -15927 -38657 -36364 -30852
1900 -30852 -20874 -16832 -11896 38122 37769 31407 -19949 -76124 -112605 -102378 -98179 -86828 -74481
1887 -74481 -70356 -14854 -29069 -56414 -36813 16810 42300 102538 70688 25239 -2323 -13225
1875 -13225 -23093 -21395 -700 -8833 -20035 -23184 -25666 8545 22798 61840 107951 95704 108341
1862 108341 66749 31643 35635 72612 56994 54633 30997 -24717 -43266 -71320 -80315 -41404
1850 -41404 -31501 -19607 6901 34057 50882 42811 64702 43675 44447 43247 40242 43693 21323
1837 21323 61694 77847 51808 57005 108666 93467 91495 77534 79681 53075 40199 44032 49340
1824 49340 17136 19201 912 -58579 -63412 -15596 27574 20249 23279 36212 57027 44300 43908
1811 43908 59588 77246 103926 102773 44010 26947 -1103 13031 30652 71356 86577 85770
1799 85770 73838 17961 -10017 -19691 24195 -20665 -31119 -13392 9017 24370 22748 10750
1787 10750 37070 69272 43123 44157 65225 32244 -24015 -9803 11448 38746 52093 45438
1775 45438 13148 -5453 -30221 -23088 28838 69300 72701 26490 -11482 -5707 -477 21782 13124
1762 13124 19685 44988 16747 46731 43483 50898 78800 87243 47271 34251 26141 50736 43741
1749 43741 19094 46108 61688 93501 81854 90436 98654 59546 21892 -3094 8187 5354
1737 5354 14868 73673 75833 44876 44676 30147 -23969 -58491 -70047 -55735 -4359 59374 34942
1724 34942 44232 82277 62518 21541 -8143 -3638 -21822 7301 60979 53589 56749 56733 55470
1711 55470 51707 65111 92378 57710 8215 -19977 -46318 -64595 -53706 18552 59004 67033
1699 67033 84246 69138 44801 18027 11262 20209 6770 -20869 -19309 13747 68028 101114
1687 101114 84636 53076 27458 3826 -2945 -22888 5982 40180 52064 85541 73311 22844
1675 22844 -17755 -6235 23924 37735 41854 28732 42052 18105 -37108 -51542 -25746 11790
1663 11790 -11309 -63942 -17739 29644 60866 90119 61774 31280 -6260 -3789 -26910 -48573
1651 -48573 -44930 149 28146 54468 55779 57323 65319 68130 46189 33253 -29750 -98007 -63655
1638 -63655 -15101 -23428 -72835 -39651 1136 6677 -18900 -18311 -47568 -51905 -2585 38268 47465
1625 47465 16323 -19822 -42913 -21852 -23555 299 23901 813 4796 -5848 -12374 -8252 1063
1612 1063 10852 36252 40369 60347 12452 -18593 -20253 -10664 -29112 -40273 20939 20432 -15404
1599 -15404 -34975 8465 51478 56606 107974 88094 38529 -1890 5194 -550 -67300 -66044 -22971
1586 -22971 4443 -12041 -21572 -37848 -30437 -28680 -51286 -24237 -11957 5055 40529 65429
1574 65429 72478 93798 58386 36082 57934 67094 73483 52237 54172 62607 56432 64490 77417
1561 77417 60783 27597 -27823 -20980 -25385 -13493 -7035 30908 54555 54326 61593 43789 73517
1548 73517 76033 44397 43480 -11133 -2192 45501 7458 -208 -9958 -55702 -31588 -19630 -19147
1535 -19147 27910 52311 77857 71771 34380 45326 39189 35088 72587 72007 42026 13908 -40046
1522 -40046 -40681 -46655 -51755 -72576 -99255 -50969 -21315 -51954 -28693 -39291 -37750 -30056 -34366
1509 -34366 -14641 18682 -20655 -33959 -12580 48456 40087 -2892 -13264 -841 -36887 -635
1497 -635 57225 36805 16627 39124 33236 7814 -6095 -1790 5248 1404 16840 12172 -18542
1484 -18542 3159 42057 52765 -6026 -21984 -54061 -50546 -52367 -81206 -35367 4679 8707
1472 8707 7674 21704 18290 -2968 440 4973 10777 -3646 -11501 -943 43468 19901 -1722
1459 -1722 -37826 -27772 -20053 -33543 -16983 -3151 -19317 -34801 -61240 -46992 -41370 -50043 -44721
1446 -44721 -33114 -1371 45670 40691 -14446 -31955 -24929 -3033 28699 48423 41742 23154
1434 23154 -17055 -32939 -5328 -42749 -51374 -17547 15716 6012 -1382 -30823 -38202 -33517 20718
1421 20718 7737 -21910 -44932 -31327 -5294 -35326 -18774 43615 41431 32046 21059 -30069
1409 -30069 -46832 -72444 -74631 -52538 -25864 -9146 10415 65585 30051 1493 8309 -16712
1397 -16712 -23209 26414 37081 31794 31614 39485 34425 43749 59462 75418 50997 19268 65461
1384 65461 93025 87779 74849 72117 20197 -18595 28700 24281 10825 5964 -36977 -96190 -82549
1371 -82549 -42248 -28356 -21495 -6169 25482 4880 -50922 -19469 -13144 -43178 -29067 -9708
1359 -9708 -7292 17852 18552 -9187 -35885 -48072 -56766 -797 -18316 -60866 -50089 25424 69968
1346 69968 51716 476 -75794 -80516 -31476 24224 79126 61818 71283 152940 171309 162519
1334 162519 123041 64246 11361 -3598 17320 31712 24900 36587 58080 52280 13197 31567
1322 31567 36057 20824 4327 -10224 -12225 3569 -10660 -60232 -72106 -77161 -79354 -70597 -25302
1309 -25302 -4846 14668 49629 -4268 -64748 -72349 -101991 -116801 -92320 -65549 -68002 -90802
1297 -90802 -75593 -25815 -15441 -12418 -33058 -25716 25258 25094 -11706 -10594 -47409 -13559 26332
1284 26332 19992 37417 4864 -26045 -4654 12136 41727 84745 103013 68507 60940 45844
1272 45844 -6556 -34636 -54956 -56589 -18469 238 59615 106593 83137 41390 37475 17222
1260 17222 -33253 -22026 19784 40594 61214 98215 96546 111339 108779 122739 173400 143610
1248 143610 102505 42280 -3615 -8486 3368 -3518 9224 -13135 -79080 -139399 -122988 -101683
1236 -101683 -39130 -6696 32715 19981 -14599 -35786 6509 16658 -52719 -52021 -55035 -44411
1224 -44411 -5987 9048 -26756 23733 52160 28975 8941 -3413 11208 -1259 4799 1812
1212 1812 -46315 -105479 -48960 -4395 29221 57018 85424 66830 32638 20920 -34846 -71539
1200 -71539 -77010 -14584 16548 28156 45667 25730 28017 23196 21227 52975 18002 -27810 -74536
1187 -74536 -40773 -45327 -15008 4661 -1897 21934 -20021 -47591 1111 12702 -6840 -16084
1175 -16084 -5356 -6310 42228 102050 67741 38172 -123 19418 56149 73957 63489 41560
1163 41560 108389 146063 98665 60756 11684 -49909 -32409 -53681 -47009 -21291 -53725 -83614
1151 -83614 -45330 -50534 -71255 -52580 -42645 -39255 -40809 -100154 -90725 -52473 -62042 -60599 -67944
1138 -67944 -59706 -78193 -103253 -41936 -2019 18255 -2924 8938 31489 1870 -31157 -100647
1126 -100647 -110798 -57182 -47372 -27655 24862 22047 4971 -6329 -90185 -128283 -140300 -75221
1114 -75221 -31417 19513 33522 -34506 -28436 530 52474 82834 88073 27015 41272 10382
1102 10382 -26855 -49546 -41512 -30163 -51199 -63865 -21030 31712 61911 46303 13133 2099
1090 2099 -46034 -7791 2871 6300 3929 56184 37322 -16113 -14078 3129 -26313 25954 35458
1077 35458 -6232 -32861 -377 63304 9878 -26854 4861 19299 24404 -9819 -21872 -4290
1065 -4290 63127 21913 -4807 12164 36427 42019 56351 17755 29838 32368 15554 -25322
1053 -25322 -21206 -9991 -20328 16728 51473 74851 36405 1636 -59283 -49617 -31739 18379
1041 18379 19757 10146 1346 -46945 -55348 12752 57416 42751 -5720 -27055 -34674 -46205 -35526
1028 -35526 -44258 -43013 -34672 -15859 -41331 1426 30346 30133 -14719 -34115 16771 5733 -22979
1015 -22979 -10294 2217 17786 39578 -3629 15651 25115 20919 24392 38016 78029 46707
1003 46707 31815 49623 59044 37474 30267 22745 -57015 -25105 10202 25685 -5306 -13197 19951
990 19951 32312 9034 35311 33219 35239 14371 -36004 -46866 -15768 -18571 -49971 -84549 -25263
977 -25263 23817 37996 48787 55982 52764 17251 14306 19209 48816 79211 27582 33115 49792
964 49792 7416 -17267 -53203 -35009 -58623 -79789 -64556 -63998 -28949 16306 45176 20953
952 20953 27364 481 8559 9699 17612 37843 14483 -43059 -58032 -52730 -47092 -9096 57075
939 57075 24442 -53182 -73895 -2068 44233 87900 26213 -13173 5746 17844 790 -40083
927 -40083 -116142 -110635 -18424 36238 24569 20463 6641 14761 35536 62158 48783 33334 42258
914 42258 4863 -34624 -15385 13021 56836 29642 20063 29112 21485 -13408 -44470 -44579 -22765
901 -22765 -6044 -10052 3745 48582 77759 55364 34749 -17938 -74444 -60105 -14746 -1367
889 -1367 33511 21182 51947 92405 90039 43456 20730 60967 76040 52524 20990 -20014
877 -20014 -49129 -21812 -3015 627 24752 63585 68898 72329 75716 40868 13019 -16918 -42248
864 -42248 -20586 -32795 -39809 -31276 -31767 -39731 -28026 -8470 -30734 -57083 -74414 -75817 -44003
851 -44003 -7757 8302 -15484 -30776 -50852 -29100 -28475 -35493 -13470 -736 -4286 -19879 -45429
838 -45429 -15960 13941 -8203 -35958 -83366 -91360 -52360 -40277 1402 31466 13839 -11834
826 -11834 3311 71960 79398 34552 -6378 -18352 17608 57778 54643 55351 70795 41953 25105
813 25105 18730 -7916 -6401 18427 16114 -27788 -42481 -7709 6816 10851 15427 33569 7269
800 7269 17509 6013 19373 36522 50832 76099 50446 61890 59720 34071 37386 44200 76059
787 76059 37061 42163 71198 51998 31498 -16593 -61245 -80496 -53356 -7873 4655 2339
775 2339 -13546 4272 2136 -19896 -32000 13396 43973 11068 17847 12313 67490 117860 83127
762 83127 54161 60241 83887 73073 50277 7804 20758 43959 56725 25902 32918 21675
750 21675 10634 33594 14490 4753 24507 32225 31079 7820 23635 58514 31823 -16191 -45047
737 -45047 -99889 -91870 -3402 -15282 -13920 -28259 -41420 -41902 -31689 -26960 -27568 2391 42275
724 42275 29872 -22894 5779 -4487 4360 42083 62887 56221 47581 -4257 -25613 8450 47476
711 47476 27938 3057 -4433 1792 63103 76931 103435 118206 88651 55539 36793 38031 22515
698 22515 -10527 19176 -14476 -21770 40965 53910 20597 -41492 -50589 -18880 15674 -6273
686 -6273 -24984 -63649 -50794 -23063 29313 13087 83 10141 40203 21955 -19621 33154
674 33154 28926 -4569 13077 61292 64734 55014 56418 78356 19224 39274 106243 91550 63630
661 63630 44149 54972 64311 70947 58904 43606 39584 43674 73745 114683 151258 120119 88352
648 88352 68181 30968 8940 -27176 -26110 -32515 7203 5505 5618 50802 54642 32468 47648
635 47648 70178 18561 4751 29266 38170 23028 -49368 -76652 -27500 -30124 -21237 -6377 53599
622 53599 57701 25091 -5192 1225 -3755 -9412 -20386 -47567 30976 88644 107926 33908 9393
609 9393 31022 39784 32743 25098 27456 67242 99071 128684 130099 93222 93509 119432 90455 68543
595 68543 84400 82002 72257 130426 68663 40521 5328 -17621 2424 -12553 -38700 -51833
583 -51833 -55773 -30236 -1352 -22308 -39757 -45791 -26482 47881 66871 4922 29730 55129
571 55129 30730 31222 57822 56422 33783 43277 46607 11589 26039 40912 35527 50347 32704
558 32704 12844 10965 29173 26849 88870 83064 79463 34960 19045 39520 43099 -4189 3333
545 3333 20820 -14709 13563 45435 3685 -54911 -78219 -53422 -26816 11030 10253 28698 25910
532 25910 53170 50795 -30554 -44921 -2151 11090 16978 -17238 -116491 -73449 -28418 8285
520 8285 7727 -29258 1793 32755 32298 19708 -23525 2001 11708 26214 32316 47514 53046 19644
$$ [...]
##END NTUPLES=NMR SPECTRUM
##END=
