##TITLE=Analysis number 312378
Compound Code cc 40309
Book Reference 382/88/1
Project Code adrs
Chemist Name simons
##JCAMPDX= 6.0         $$ Bruker NMR JCAMP-DX V2.0
##DATA TYPE= NMR SPECTRUM
##DATA CLASS= NTUPLES
##ORIGIN= Bruker BioSpin GmbH
##OWNER= NMR
$$ XWIN-NMR		Version 3.5
$$ Tue Aug  2 13:57:12 2005 GMT Daylight Time (UT+1h)  MAYBRIDGE\NMR@NMR_250MHZ
##.OBSERVE FREQUENCY= 250.131544655141
##.OBSERVE NUCLEUS= ^1H
##.ACQUISITION MODE= SIMULTANEOUS (DQD)
##.ACQUISITION SCHEME= undefined
##.AVERAGES= 16
##.DIGITISER RES= 18
##SPECTROMETER/DATA SYSTEM= dpx250
##.PULSE SEQUENCE= zg30
##.SOLVENT NAME= CDCl3
##.SHIFT REFERENCE= (INTERNAL, CDCl3, 0, 16.522)
##AUDIT TRAIL= $$ (NUMBER, WHEN, WHO, WHERE, WHAT)
$$ ##TITLE= Audit trail, XWIN-NMR		Version 3.5
$$ ##JCAMPDX= 5.01
$$ ##ORIGIN= Bruker BioSpin GmbH
$$ ##OWNER= NMR
$$ C:\u/data/dgb/nmr/ADRS/7050/pdata/1/auditp.txt
$$ ##AUDIT TRAIL=  $$ (NUMBER, WHEN, WHO, WHERE, WHAT)
(   1,<2005-08-02 13:56:54.09 +100>,<MAYBRIDGE\NMR>,<NMR_250MHZ>,
      <created by zg, POWCHK disabled, PULCHK disabled
       configuration hash MD5:
       62 19 C7 07 E1 42 D1 B7 37 6C 3D D0 77 39 F9 E6
       data hash MD5: 64K
       5C 6D 10 E7 A1 C6 13 D1 C5 A1 97 BF 63 09 20 69>)
(   2,<2005-08-02 13:57:05.18 +100>,<MAYBRIDGE\NMR>,<NMR_250MHZ>,
      <Start of raw data processing
       ef LB = 0.3 FT_mod = 6 PKNL = 1 SI = 32K 
       data hash MD5: 32K
       CE 79 E1 4A B6 8F E5 06 00 DC AE D9 A9 81 00 C7>)
(   3,<2005-08-02 13:57:06.87 +100>,<MAYBRIDGE\NMR>,<NMR_250MHZ>,
      <apk 
       data hash MD5: 32K
       35 24 D8 A5 9E B0 74 B1 79 66 E0 71 44 36 47 44>)
(   4,<2005-08-02 13:57:07.57 +100>,<MAYBRIDGE\NMR>,<NMR_250MHZ>,
      <abs ABSG = 5 
       data hash MD5: 32K
       07 52 90 C7 FA F1 C3 47 7C 08 07 3E C1 24 79 9E>)
$$ ##END=
$$ 
$$ hash MD5
$$ 5F 97 AE F1 85 1C BF BA 36 58 68 EF C7 24 42 DE
##$RELAX= 
##$RELAX= 
##$RELAX= 
##$RELAX= 
##$RELAX= 
##$RELAX= 
##$RELAX= 
$$ Bruker specific parameters
$$ --------------------------
##$DU= <C:\u>
##$EXPNO= 7050
##$NAME= <ADRS>
##$PROCNO= 1
##$TYPE= <nmr>
##$USER= <dgb>
##$AMP= (0..31)
100 100 100 100 100 100 100 100 100 100 100 100 100 100 100 100 100 100 
100 100 100 100 100 100 100 100 100 100 100 100 100 100 
##$AQSEQ= 0
##$AQ_mod= 3
##$AUNM= <au_zg>
##$AUTOPOS= <30 >
##$BF1= 250.13
##$BF2= 250.13
##$BF3= 250.13
##$BF4= 250.13
##$BF5= 500.13
##$BF6= 500.13
##$BF7= 500.13
##$BF8= 500.13
##$BYTORDA= 1
##$CFDGTYP= 0
##$CFRGTYP= 5
##$CHEMSTR= <none>
##$CNST= (0..31)
1 1 145 1 1 1 1 1 1 1 1 1 1 1 1 1 1 1 1 1 1 1 1 1 1 1 1 1 1 1 1 1 
##$CPDPRG= <>
##$CPDPRG1= <>
##$CPDPRG2= <>
##$CPDPRG3= <>
##$CPDPRG4= <mlev>
##$CPDPRG5= <mlev>
##$CPDPRG6= <mlev>
##$CPDPRG7= <mlev>
##$CPDPRG8= <mlev>
##$CPDPRGB= <>
##$CPDPRGT= <>
##$D= (0..31)
0 1 0 0 0 0 0 0 0 0.06 0 0 0 0 0 0 0.0002 0 0 0 0 0 0 0 0 0 0 0 0 0 0 
0 
##$DATE= 1122987413
##$DBL= (0..7)
120 120 120 120 120 120 120 120 
##$DBP= (0..7)
150 150 150 150 150 150 150 150 
##$DBP07= 0
##$DBPNAM0= <>
##$DBPNAM1= <>
$$ [...]
##$SUBNAM7= <"">
##$SUBNAM8= <"">
##$SUBNAM9= <"">
##$SW= 20.6930455092707
##$SWIBOX= (0..15)
0 0 3 0 0 0 0 0 0 0 0 0 0 0 0 0 
##$SW_h= 5175.983436853
##$TD= 65536
##$TD0= 1
##$TE= 295.16
##$TE2= 300
##$TE3= 300
##$TEG= 300
##$TL= (0..7)
0 120 120 120 120 120 120 120 
##$TP= (0..7)
150 150 150 150 150 150 150 150 
##$TP07= 0
##$TPNAME0= <>
##$TPNAME1= <>
##$TPNAME2= <>
##$TPNAME3= <>
##$TPNAME4= <>
##$TPNAME5= <>
##$TPNAME6= <>
##$TPNAME7= <>
##$TPOAL= (0..7)
0.5 0.5 0.5 0.5 0.5 0.5 0.5 0.5 
##$TPOFFS= (0..7)
0 0 0 0 0 0 0 0 
##$TUNHIN= 0
##$TUNHOUT= 0
##$TUNXOUT= 0
##$USERA1= <user>
##$USERA2= <user>
##$USERA3= <user>
##$USERA4= <user>
##$USERA5= <user>
##$V9= 5
##$VALIST= <valist>
##$VCLIST= <CCCCCCCCCCCCCCC>
##$VD= 0
##$VDLIST= <DDDDDDDDDDDDDDD>
##$VPLIST= <PPPPPPPPPPPPPPP>
##$VTLIST= <TTTTTTTTTTTTTTT>
##$WBST= 1024
##$WBSW= 4
##$XGAIN= (0..3)
0 0 0 0 
##$XL= 0
##$YL= 0
##$YMAX_a= 312317
##$YMIN_a= -473890
##$ZGOPTNS= <>
##$ZL1= 120
##$ZL2= 120
##$ZL3= 120
##$ZL4= 120
##$ABSF1= 16.522
##$ABSF2= -4.171173
##$ABSG= 5
##$ABSL= 3
##$ALPHA= 0
##$AQORDER= 0
##$ASSFAC= 0
##$ASSFACI= 0
##$ASSFACX= 0
##$ASSWID= 0
##$AUNMP= <proc_1d>
##$AZFE= 0.1
##$AZFW= 0.1
##$BCFW= 0
##$BC_mod= 0
##$BYTORDP= 0
##$COROFFS= 0
##$CY= 12.5
##$DATMOD= 1
##$DC= 0
##$DFILT= <>
##$DTYPP= 0
##$F1P= 14.0000005364418
##$F2P= -0.99999901652339
##$FCOR= 0.5
##$FTSIZE= 32768
##$FT_mod= 6
##$GAMMA= 0
##$GB= 0
##$INTBC= 1
##$INTSCL= 1
##$ISEN= 128
##$LB= 0.3
##$LEV0= 0
##$LPBIN= 0
##$MAXI= 10000
##$MC2= 0
##$MEAN= 0
##$ME_mod= 0
##$MI= 0
##$NCOEF= 0
##$NC_proc= -3
##$NLEV= 6
##$NOISF1= 0
##$NOISF2= 0
##$NSP= 0
##$NTH_PI= 0
##$NZP= 0
##$OFFSET= 16.522
##$PC= 1
##$PHC0= -82.7799
##$PHC1= 12.0337
##$PH_mod= 1
##$PKNL= yes
##$PPARMOD= 0
##$PSCAL= 4
##$PSIGN= 0
##$REVERSE= no
##$SF= 250.13
##$SI= 32768
##$SIGF1= 0
##$SIGF2= 0
##$SINO= 400
##$SIOLD= 32768
##$SREGLST= <1H.CDCl3>
##$SSB= 0
##$STSI= 32768
##$STSR= 0
##$SW_p= 5175.98343685301
##$SYMM= 0
##$S_DEV= 0
##$TDeff= 65536
##$TDoff= 0
##$TI= <Analysis number 999999
Compound Code 99
Book Reference 9
Project Code 9>
##$TILT= no
##$TM1= 0
##$TM2= 0
##$TOPLEV= 0
##$USERP1= <user>
##$USERP2= <user>
##$USERP3= <user>
##$USERP4= <user>
##$USERP5= <user>
##$WDW= 1
##$XDIM= 32768
##$YMAX_p= 381248637
##$YMIN_p= -631481
$$ End of Bruker specific parameters
$$ ---------------------------------
##NTUPLES= NMR SPECTRUM
##VAR_NAME=  FREQUENCY,     SPECTRUM/REAL,   SPECTRUM/IMAG
##SYMBOL=    X,             R,               I
##VAR_TYPE=  INDEPENDENT,   DEPENDENT,       DEPENDENT
##VAR_FORM=  AFFN,          ASDF,            ASDF
##VAR_DIM=   32768,         32768,           32768
##UNITS=     HZ,            ARBITRARY UNITS, ARBITRARY UNITS
##FACTOR=    0.157963299565203, 1,           1
##FIRST=     4132.6476996994, 0,             0
##LAST=      -1043.33573715361, 0,           0
##MIN=       -1043.33573715361, -631481,     0
##MAX=       4132.6476996994, 381248637,     0
$$ Real data points
##PAGE= N=1
##DATA TABLE= (X++(R..R)), XYDATA
$$ [...]
21105 -21042 -18341 -17020 -1567 -7402 -13665 -1689 5396 11582 10156 -2407 -14618 -15829 -30626
21092 -30626 -24231 -14658 -2007 21863 21031 20859 12506 9244 -10044 -24595 -22593 -31626 -20733 408
21078 408 26014 22751 6034 -8812 4467 14010 16760 14309 462 -1420 1146 12433 26949
21065 26949 28238 18502 13426 13055 -12174 -16981 -27650 -29750 -10958 -14330 19128 22594 27282 25647
21051 25647 -3703 -17634 -15066 -4588 -13563 -17305 -34309 -49845 -14411 -7630 -9273 -14663 -7020
21038 -7020 7297 2409 -2327 3864 14359 11181 7209 5354 10120 9620 4041 -29188 -20654 -11243
21024 -11243 -34602 -28070 -5398 -1192 -4786 4095 -2655 -7287 -807 -1381 -2351 23558 13319 -5645
21010 -5645 1186 10876 17103 8098 20189 50129 56509 52642 33325 40891 33406 16076 3187
20997 3187 22486 32006 31407 47627 37407 264 18071 41078 34357 26770 23558 17975 4792
20984 4792 -3574 -5348 -18543 -7612 -7316 12313 19961 11095 7882 11389 10919 21592 11100 2396
20970 2396 18426 21004 -3498 11357 29038 17643 -8363 -15614 -7036 14459 25594 27249 1316
20957 1316 3069 -14189 -5122 12394 10507 2078 -8375 6113 7571 12551 5627 14837 27901
20944 27901 487 -6270 12130 20041 13332 10013 -7389 -15604 3984 20107 55574 47067 16791
20931 16791 -16662 -36855 -27027 -5295 11565 22900 24044 25513 6910 -6391 4260 -4144
20919 -4144 -18637 -18188 -10980 -9649 -2257 10390 13065 14601 -5467 -10556 -16102 -12978 -8123 11317
20905 11317 1188 -14774 -10065 -24517 -19861 -7214 9772 12586 10792 10141 3897 -2469 -12954
20892 -12954 -24526 -9873 4272 -3577 9052 9297 20702 36330 42276 62059 55577 26283 -605
20879 -605 -25918 -11491 10781 36622 25930 17482 26409 27314 30126 43652 56783 35076 -2211
20866 -2211 2565 -2841 15433 2027 7102 -6487 -17998 4666 449 838 -7658 5840 11269
20853 11269 27381 40462 34773 15684 -10963 -24265 -143 9265 -11877 -7213 -11589 -27132
20841 -27132 -14728 17308 37049 27751 7010 23462 32715 45108 37803 26717 33444 15937
20829 15937 19135 19415 21649 26093 34472 27044 11226 7526 2823 7492 -5518 12316 42248 51579
20815 51579 36592 23676 27513 34353 31181 10987 6096 21159 25435 10330 -5881 3286 23137
20802 23137 38950 53100 52025 29765 14229 2303 -4466 -5626 -2844 -14774 -7950 18887 6897
20789 6897 -14248 -20626 -26439 -7672 -1077 -8466 1505 19188 13019 12839 30494 24848 5314 22504
20775 22504 26982 17813 19776 9032 5560 28837 27931 15517 25554 13375 31246 43611 35091
20762 35091 23795 5791 -19445 -3843 12038 42390 61803 55555 34009 28187 23844 5569
20750 5569 10101 16270 15736 3511 -15168 6092 4789 31161 37592 40083 19836 -4876 -20062
20737 -20062 -13862 9892 16523 20194 8239 14902 19799 32911 5637 -18424 -22462 2179 7203
20724 7203 2168 6746 15447 30687 32338 46182 45078 40432 31344 37883 50544 37677 29917 25369
20710 25369 27557 5106 -16460 -7164 17705 14600 11514 -6938 16672 29112 44777 49510 54207
20697 54207 42307 46292 21300 2398 -10161 -2084 1889 32762 51216 50035 47260 48207 33247
20684 33247 13305 12867 23544 29903 -2422 -1200 12111 16049 16559 35560 47130 37449 23107
20671 23107 26630 -3819 -7025 31508 34696 11562 24388 22654 26831 37035 55066 62933 30397
20658 30397 18781 4454 23130 27959 19673 -2902 -11904 -1941 1059 -25175 -17169 -1488 621
20645 621 -21685 -9142 11118 32288 30885 21205 24492 32728 24649 10420 6430 -10728 -33082
20632 -33082 -35143 -12972 -8370 -30602 -29348 -12863 10100 22977 18180 11767 4074 -14866 -857
20619 -857 -3002 2520 13242 -199 11763 22510 21119 21839 9114 8265 15570 17079 8753 -17731
20605 -17731 -34887 -7733 11324 13576 9078 22321 23122 38698 56623 56454 55997 51373 43023 48051
20591 48051 20462 9540 18039 6578 -15286 -14886 -17689 13959 31301 48558 48340 35111 21085
20578 21085 1599 -1742 -1900 -16784 -30417 1728 26124 29414 38808 38489 46866 58463 34193
20565 34193 13179 8237 25546 29561 25536 -1849 16856 47146 43595 30598 38398 23658 9173
20552 9173 -8844 -11271 -2852 19636 25893 24611 15330 16086 7227 3113 30851 14116 5859 -4341
20538 -4341 -6669 6455 26409 35041 14024 -10222 -6202 9147 5144 8615 17397 44150 65557
20525 65557 60156 53736 38194 22828 18694 18208 26982 9719 -6479 -8275 17864 40437 52758
20512 52758 23938 3077 19761 20128 14936 5739 -9909 -10603 -12123 -10717 8887 15808 32915
20499 32915 50608 60913 54121 56873 41003 32837 41413 37881 44750 40724 13472 292 2643
20486 2643 11805 -6671 -577 13837 32190 21063 29489 31198 26464 13621 17806 36311 43833
20473 43833 26267 15829 11402 15691 10086 -4473 8055 26773 31819 46047 37490 12802 8712
20460 8712 3100 3059 -11281 -11111 10199 31199 532 -9301 -3997 12431 10042 -5010 6691 31300
20446 31300 26395 32122 55161 69046 49790 35217 -5890 -15027 -26201 -11875 16514 14294
20434 14294 11433 12426 15385 26786 8881 790 35186 50065 39385 33483 31314 11300 21213
20421 21213 20261 30796 31100 10056 13852 35887 12437 1298 -7948 -10250 -9078 -10795 -1479 -599
20407 -599 -1422 19796 31179 27841 21744 24892 32190 29924 49574 73845 61816 32192 14176
20394 14176 23829 29301 48696 43628 45646 33485 21310 36415 21903 9415 3672 13753 32546
20381 32546 44871 47049 27673 8668 22601 36786 35083 20921 27002 17771 14437 22629 24266
20368 24266 -4510 -3579 -6240 -7873 -15927 -8828 33112 35882 17533 -871 31524 44509 42006
20355 42006 55456 66812 62911 48786 51146 38202 20117 25246 9556 21050 25395 22405 25720
20342 25720 12890 -6122 -15244 -5402 17296 27650 37641 30638 55094 62797 63949 65562 45169
20329 45169 30030 35574 45703 37977 28787 27074 11808 19783 17505 17880 11491 -10861 -2858 -21352
20315 -21352 -21668 8583 21039 20456 11865 -19354 -19791 -4668 6811 7722 -1208 9221 -4663 -6330
20301 -6330 19483 19582 8494 -11032 -15241 -19600 12396 38691 48031 51636 82008 88204 76410
20288 76410 65545 37577 19303 32575 19538 20662 26318 30812 25683 29900 47366 28112 15858
20275 15858 15499 31441 52064 29287 -15677 -4234 6511 4905 17719 31139 32802 24935 26457
20262 26457 33092 58649 64448 65655 65007 58927 61857 51567 31521 38365 30880 4509 2001 14201
20248 14201 31686 26308 41110 51606 52170 50414 40957 49644 46658 37417 28016 25706 13961 -4208
20234 -4208 24086 68357 63740 27165 37827 18052 7430 14878 42530 46954 52190 45661 21678
20221 21678 2426 -5864 -1453 21445 42236 25238 11747 9885 9598 -778 10363 46786 53497
20208 53497 34979 19277 28728 30426 14281 13617 27735 57791 72069 68133 33754 21711 6541
20195 6541 8522 37331 32116 46951 50072 15430 -899 -1294 16742 30767 42132 43840 51771
20182 51771 67750 53168 32667 19975 4711 -8258 21931 48501 62630 55806 46203 13828
20170 13828 22896 23216 23337 15450 27317 23966 16094 18039 15553 24386 3346 3514 24470 37454
20156 37454 12715 543 935 1138 10693 -8478 4985 14677 9830 26658 45078 47399 54531
20143 54531 45766 38616 40889 43045 50744 40095 8026 17827 22653 7115 5367 13236 16774 15776
20129 15776 19918 23197 12810 10997 1215 13520 26961 15894 13018 8929 6907 2714 -5362
20116 -5362 -18948 -13865 7465 32526 39253 23114 38240 52504 33650 3310 403 35189
20104 35189 65430 61926 58477 74560 69008 65065 61812 39484 24144 9030 7138 19925 23770
20091 23770 22566 20819 30552 32068 47724 28810 8079 -3268 4569 11636 14719 18514 29325
20078 29325 37632 40694 39197 20119 14806 10043 33707 37517 18994 21884 48721 27708 -3827
20065 -3827 3635 26427 35788 48217 51196 28483 6612 20104 29344 16571 -26 3497 25953
20052 25953 29019 40476 42821 34471 24468 7950 818 22738 31393 42684 40708 45078 34386
20039 34386 43075 31534 30205 50988 41409 28938 47978 59824 74562 68695 59327 52463 40606
20026 40606 27891 21564 32469 50972 35127 -16077 -12661 2642 6773 24598 70034 75635
20014 75635 73632 67302 49046 34685 37209 57242 62886 39569 26552 22853 31599 20562 29849
20001 29849 32791 6748 2142 10358 2865 6239 5606 -2543 -3342 7207 25963 55589 68394 57753
19987 57753 39197 53133 40296 27558 26055 48198 60519 48699 42690 33856 49831 61081
19975 61081 47792 20763 31669 47593 73048 72172 78714 60837 51045 58878 51975 40444 33675
19962 33675 25205 2248 7049 10766 24022 38311 36516 44300 63827 75608 56013 42053 48025
19949 48025 45320 44197 56320 80814 64569 42396 34158 43722 54805 44738 39741 44315 22798
19936 22798 25659 49744 47079 31811 32313 43315 44669 43949 39405 38664 34800 20821 36859 31536
19922 31536 37057 48087 42452 22234 29691 27005 23387 20742 29502 58658 42873 42967 67940 62105
19908 62105 30535 34429 54922 62273 43877 55281 49991 62734 73667 55226 33393 22003
19896 22003 17001 39456 55572 36182 28110 27087 23418 33910 22581 18183 20678 3185 561
19883 561 15700 24250 35212 38881 44880 41977 32054 37259 70016 89899 65960 43132 42781 48557
19869 48557 45864 59632 87863 82128 47888 23934 29839 30815 47801 64221 66627 40619 15588
19856 15588 16420 13656 18291 45420 70812 49676 31815 38987 43714 37373 46155 54101 31156
19843 31156 40712 32378 33146 39613 38553 48779 60963 31249 36996 63837 60838 43823 34849
19830 34849 41134 36250 34594 36108 55241 48466 49009 43195 24628 -3205 -4875 11117 28797
19817 28797 28788 31247 17488 10579 9415 -4994 -5893 -1919 8542 35054 60367 86387 70084 67008
19803 67008 90440 86465 72158 67991 77332 69979 46754 41303 29872 30893 26248 21123 35375
19790 35375 38029 36594 50539 46421 40231 33429 21486 31726 46223 29588 13978 22290 27163
19777 27163 26164 32570 48604 22041 5338 7651 21564 30997 35751 42665 51644 69242 78639
19764 78639 76842 80801 92716 94404 72553 56770 45899 51361 45497 31213 50977 73745 58977
19751 58977 53073 33387 34539 41968 72801 64449 49363 23348 17499 31264 57136 69247 69936
19738 69936 66614 64714 73786 82805 83375 57056 47748 35350 33198 61229 47957 41100 67137
19725 67137 86260 92089 70909 82282 68518 66391 63598 67120 65174 64667 51144 48377 52825
19712 52825 47253 7003 28607 25058 27751 48734 66300 57147 67483 74845 47876 52078 65089
19699 65089 67000 62855 56305 62004 72368 70630 92347 96899 70717 67063 67297 79170 93092
19686 93092 88216 76566 66732 57054 35038 44820 62121 37395 14242 38385 69069 76775 91968
19673 91968 91569 59420 61799 71937 89954 99389 74152 65736 50839 31654 48920 61729 66800
19660 66800 73047 64470 52490 35448 57585 100028 114435 90221 73945 57454 47624 51251
19648 51251 56254 63151 48919 31506 15440 25806 34437 33253 27450 45447 57300 67163 65872
19635 65872 83730 112087 108157 110160 108051 101448 98052 110256 111526 100204 72451 72789 98411
19622 98411 97990 82355 66580 64062 44431 56984 85606 105310 107810 78201 93872 77027
19610 77027 54840 49883 60248 72620 71791 73012 89978 76054 88495 93495 79443 75315 82694
19597 82694 79794 84419 89225 68314 63428 40338 18598 4542 34310 45638 61322 68685 89082
19584 89082 96151 68180 59483 56506 75780 85072 108775 97277 85445 94175 103810 105303 79891
19571 79891 79121 89128 106455 104377 100938 111159 108152 119384 146182 176660 218326 270784 313132
19558 313132 337858 337323 320702 281507 272387 278557 251209 239062 244488 247064 255525 296451 350831
19545 350831 365561 358159 354904 337416 331695 329692 315930 295876 283890 275547 231909 205447
19533 205447 200595 152926 110006 98856 90000 111744 128970 113033 100247 86733 112129 131034
19521 131034 132845 117399 115927 109762 118619 147876 146066 148167 142525 138103 156315 160322 157439
19508 157439 159808 182458 219296 252309 312707 368506 427724 443833 441340 426591 431976 406710
19496 406710 389557 375175 338999 335414 323463 301933 292745 307926 296728 276402 247858 207938
19484 207938 179416 186288 173275 169210 139046 122610 134650 134353 122066 135420 118739 115773
19472 115773 113291 121190 116344 98008 87677 90377 77663 85856 77812 77533 98280 115678 103491
19459 103491 105628 122352 148672 160631 141086 142200 149821 162973 150512 133583 121462 118711
19447 118711 110349 129100 124270 122163 128227 133543 115665 96180 98844 131513 161474 156776 145598
19434 145598 166184 206927 203815 201031 185170 164463 150209 130196 101951 106028 138212 174890
19422 174890 171007 155500 153731 144452 158006 147948 137342 115410 105825 102438 106318 138021 143576
19409 143576 140066 146944 138582 136592 121347 122016 119866 109702 120113 121312 133241 142348 147268
19396 147268 138064 154630 191987 201752 186993 194090 204556 194354 182199 177246 192400 212119
19384 212119 248131 288682 326862 333362 323321 311018 300624 278104 255333 238346 226543 214314
19372 214314 227177 251355 259151 246046 246144 259140 262269 259023 239155 202099 181834 176806 167352
19359 167352 167380 180887 198803 207895 196689 169821 145251 147117 139822 138245 157275 160692 150919
19346 150919 133165 135605 145566 167190 169336 169577 173842 187127 182977 169345 157693 147210 144996
19333 144996 140206 124849 122419 128495 147202 159859 154838 158430 186895 219013 223017 232265 228295
19320 228295 218699 223676 228954 238721 238990 228948 244975 242226 224557 207472 218427 208118 203534
19307 203534 207209 180742 178313 206226 241944 258368 230831 231135 230143 225654 211405 220712 215151
19294 215151 203781 219988 238440 235083 225293 237803 272876 281630 294391 315330 331835 339321
19282 339321 338549 349518 349638 341744 341555 365099 373531 374238 410454 427488 427044 435179 410800 383358
19268 383358 382990 413584 404097 368683 376582 392052 411465 422239 416158 402885 382207 383846 380327
19255 380327 373879 382619 393218 424447 446893 468460 476769 502841 524312 504170 467611 440340
19243 440340 412809 402882 402621 377599 386403 413263 431125 447268 479386 523058 553833 560034
19231 560034 574666 571624 547591 520773 529241 536512 535788 559654 584484 645691 704310 756459
19219 756459 840690 880011 867585 849944 799405 720187 669809 624395 595546 585223 551854
19208 551854 498999 467528 460329 427910 391008 377365 392451 383915 380464 381975 393222 422789
19196 422789 425270 444281 486059 499438 481832 486837 488789 501804 503767 517784 507997 502886 509870
19183 509870 508202 525438 543046 551422 569734 588300 610740 616921 632936 646225 636592 641903
19171 641903 662613 680321 688893 687300 680500 674455 706009 752687 809436 892927 952979 990097
19159 990097 996532 964526 897398 801356 716037 632517 552903 504426 503096 530701 535382 566181
19147 566181 588742 609686 632397 644449 637385 627290 631589 637800 620535 636210 650901 646276
19135 646276 646201 631795 612837 641870 659003 681771 690154 688580 706294 723479 773955 823115
19123 823115 832948 834222 831217 819484 813980 815040 814777 805747 794688 803430 812779 813068 824193 830137
19109 830137 852999 877019 904936 927852 939484 947262 966821 962860 923655 896537 922326 951764
19097 951764 964763 984392 989428 1011482 1050790 1085273 1087082 1098564 1171560 1272018 1350475 1400463
19085 1400463 1454598 1524952 1597414 1661006 1742719 1846506 1969476 2093236 2253999 2442994
19075 2442994 2680709 2905798 3125409 3366963 3668495 4003886 4410714 4985151 5785801
19066 5785801 6819299 8120233 9654581 11271995 12706498 13728828 14353238 14730627
19058 14730627 15164700 15993472 17657399 20815797 26248989 34311681 44348913 55140401
19050 55140401 64385106 70157579 72663758 71670592 67251256 60450591 52565416 44745770
19042 44745770 38188260 33486050 30711346 29511718 29044841 28259051 26666904 24351240
19034 24351240 21420837 18303611 15325265 12673808 10544219 8985468 7899349 7204098
19026 7204098 6781553 6556364 6436261 6410571 6440163 6531308 6693132 6922395 7243441 7756011
19016 7756011 8482204 9533762 11102596 13363268 16436195 20167242 24102540 27419869
19008 27419869 29396063 30174641 30115182 29845291 30344529 32536725 37029393 43935949 53054203
18999 53054203 63278887 73174201 81372378 85460478 83778345 77593825 68124743 56972626
18991 56972626 46137896 36518735 28842871 23392042 19923561 17933506 16784900 15782683
18983 15782683 14539176 13067482 11416886 9711318 8136752 6751726 5651717 4836167
18975 4836167 4240337 3778308 3456984 3167127 2869555 2580231 2304541 1995005 1738070
18966 1738070 1565229 1407580 1269365 1145515 1031292 942763 868923 802801 761577 732923
18956 732923 678981 620415 587298 549172 504265 470525 446048 421787 386864 355906 335601
18945 335601 336887 328280 306007 300935 285394 275329 267788 295881 305606 302853 309569 309853 307890
18932 307890 318636 299613 300681 319621 325489 324045 343461 354317 364019 350014 325201 310304
18920 310304 265671 250960 263408 234890 212208 190587 169144 143701 151066 133201 106722 86216
18908 86216 78701 95029 117182 134413 121436 104639 118130 133958 124851 167153 176561 164862
18896 164862 180559 197678 237074 277453 268839 286859 317087 327611 286541 240850 213954 200456
18884 200456 202982 201225 201173 210947 196743 179883 176098 170246 172327 177971 204757 220087 187337
18871 187337 172684 158695 122002 94240 80008 82278 70458 85351 104253 93602 100011 111146
18859 111146 100582 93221 85961 105165 138429 149175 136899 148211 172653 176791 167499 167860 196096
18846 196096 217347 256216 289827 305626 310460 359766 411640 442221 469323 489840 533934 568238
18834 568238 573709 614678 662638 705749 706190 668440 619708 569673 535994 512787 489225 451625
18822 451625 440595 440927 435003 447224 464316 470480 460215 450029 432015 426833 394311 391416 377661
18809 377661 361154 362278 387775 375531 375832 379735 329040 275468 267204 249436 241947 247086 245721
18796 245721 250681 282739 299366 295909 313885 309020 292898 321119 359540 387002 429841 492971
18784 492971 557883 590865 625568 632179 618537 604917 578466 566092 531017 486929 483761 485991
18772 485991 494082 525930 555856 546187 551249 572747 569126 536082 503938 435158 368870 351937
18760 351937 322495 296858 269706 270058 256439 251449 249533 251563 269667 289900 323518 376876
18748 376876 481619 617552 736371 800648 753680 677629 608276 522555 430635 348060 266249
18737 266249 216102 201034 185141 185499 153263 156703 155584 148864 126042 116781 98398 83826 72444
18724 72444 66227 78268 104958 128269 150459 146001 131468 140514 162281 149060 134881 150866
18712 150866 165568 181477 199137 223202 254630 282792 288038 302300 352596 382302 409682 446239
18700 446239 497939 568013 658399 751694 850631 967412 1075021 1149785 1181728 1144330 1067000
18689 1067000 962609 816127 721492 642264 574725 530921 490343 458548 456579 455504 414036
18678 414036 382606 342803 289379 238850 221129 204840 198888 205621 190137 199409 209111 198892
18666 198892 195503 192503 192271 197717 204412 225835 241658 262543 278177 308966 336619 402226 440613
18653 440613 462794 491240 526919 580712 620455 645538 657732 707092 764755 807707 855168
18642 855168 906550 960136 954520 923597 882527 819741 722153 588871 499243 432489 377625
18631 377625 313806 271465 253951 245968 227474 222392 221906 221914 228520 217528 214573 220658 209168 183203
18617 183203 179707 171061 178430 185702 202239 207871 215565 229878 231259 205417 202629 229039 248351
18604 248351 269958 273557 249359 230768 229963 234008 231848 246320 263064 301290 318185 318893 309406
18591 309406 306649 286873 243909 224718 236090 217929 210439 206878 213435 223372 226704 228418 241768
18578 241768 247289 259052 228274 215375 217398 224698 235584 223404 204249 189370 215037 214175
18566 214175 205035 235588 240767 254680 277643 265265 250720 255356 258906 235131 219539 236007
18554 236007 279666 322759 343185 366465 363983 362229 380219 396684 388303 421408 452782 460746
18542 460746 435714 430334 457906 503533 544516 546708 509933 501353 500122 503165 487575 479819 477800
18529 477800 501279 542776 586912 647746 707387 781210 820194 848046 864770 824527 772791
18518 772791 715630 659361 625248 582999 550327 534012 521485 522852 494006 447369 442089 493195
18506 493195 502862 493770 522300 546285 548633 579474 603829 591239 609863 620880 629854 604781
18494 604781 582226 566078 532662 528625 528757 544059 568275 633477 687997 716194 784235 803599
18482 803599 793977 787912 770996 767340 765106 793629 860887 954819 1086199 1213427 1282875 1299294
18470 1299294 1291141 1236050 1145460 1027025 931413 862762 775132 721729 677715 630289 627399
18459 627399 648200 659918 678803 690170 733113 772629 785843 791143 795285 768640 726906 703211
18447 703211 669430 638838 617471 596472 602842 603485 592120 588650 575969 525150 495597 509116
18435 509116 516897 502047 492837 480673 449110 428207 442584 462288 497512 540488 568018 590732
18423 590732 625454 653889 710917 783670 825422 879028 967354 1020714 1049735 1080628 1113783
18412 1113783 1111711 1087111 1063578 1040042 1026932 1022227 984530 955942 943030 935385 941050 947361
18400 947361 943946 934017 933087 913527 899762 912020 920443 931697 949953 951456 967652 986182 998552
18387 998552 1013592 1014789 1017151 1009762 996351 999374 1002921 1004598 1019493 1044647 1060941 1095893 1146391
18374 1146391 1174014 1196266 1222178 1262889 1306204 1355887 1421153 1497301 1589974 1650890 1723297
18363 1723297 1788158 1847704 1931257 2010530 2093831 2209846 2320599 2438952 2575135 2727114
18353 2727114 2898197 3102232 3311080 3567875 3907594 4275912 4754346 5389319 6253131
18344 6253131 7309263 8443334 9632873 11020600 12623842 14023652 15056231 16184078
18336 16184078 17787639 20049794 23409931 28251580 33947880 39601160 46484900 55492346
18328 55492346 63785517 67997972 70007754 72136774 71960476 67932702 62230040 56730326
18320 56730326 51222285 45563869 40270269 36111321 33315636 31247362 28943008 26524005
18312 26524005 24406710 22294580 19886633 17318779 14867503 12717161 10896642 9441239
18304 9441239 8343186 7557678 7026132 6713125 6541106 6470793 6485931 6602407 6827146 7243340
18294 7243340 7886405 8877843 10381458 12293708 14282817 16392272 18903173 21639133
18286 21639133 23894382 25309499 26732841 28737924 31070433 33411236 36305958 40982839
18278 40982839 46883999 51549410 54597385 58549031 62819202 63569258 60337127 56395105
18270 56395105 52140321 46534976 39867498 33475317 27944108 23204185 19483838 16803034
18262 16803034 14839109 13150164 11675439 10531837 9483789 8364059 7243090 6228381
18254 6228381 5368133 4635553 3987197 3464289 3092784 2757298 2467856 2267895 2093177
18245 2093177 1932677 1791182 1629335 1498874 1396800 1294525 1228332 1206158 1192460 1164757
18235 1164757 1122714 1063450 1017953 987853 956162 903418 876769 873159 862669 850903 849421 857747
18223 857747 821506 799445 794870 793580 794587 779478 789056 776990 770843 779572 798027 762274 753085
18210 753085 784006 832836 860668 894049 916482 929873 944752 955411 976677 1001655 1045303
18199 1045303 1103876 1154672 1244935 1325221 1387367 1423025 1444162 1478721 1517591 1543959 1579858
18188 1579858 1662702 1777714 1923130 2080234 2302582 2610994 2990505 3309894 3556273 3830079
18178 3830079 4179800 4647713 5192566 5840363 6539697 7361756 8417304 9669728 10950769
18169 10950769 12293735 13944570 16152594 19343496 24333002 32535441 46772101 70106733
18161 70106733 99747255 122137818 126474634 118596244 105372910 87889286 68967913
18154 68967913 51447912 37224154 26917552 19827576 14970914 11591280 9232983 7598475
18146 7598475 6468316 5693874 5146220 4765144 4402819 4007698 3671634 3435070 3278400
18137 3278400 3098975 2865161 2614464 2399843 2218284 2050665 1909129 1817840 1752880 1706068
18127 1706068 1754370 1820571 1902080 1998853 2125857 2277717 2462986 2695972 2955521 3243854
18117 3243854 3612977 4087920 4701194 5594236 6998164 9396282 13787232 21618498 31864070
18108 31864070 37554022 35934000 32880204 28594081 22909975 17377225 12504820 8835342
18100 8835342 6341039 4687254 3541321 2747494 2185698 1772707 1490258 1280609 1091941
18091 1091941 931479 836616 774699 737887 664863 590972 535872 486369 447813 429136 419295
18080 419295 404159 371460 362004 339966 316788 304739 290181 281599 248640 218057 188610 160136
18068 160136 140054 130267 126919 127153 134664 129899 112620 120599 93125 98028 105310 104948 126005 141244
18054 141244 140664 153445 150009 138439 136919 124580 95476 90972 94515 97918 89809 97635 128580
18041 128580 154105 176814 181311 180339 211167 196947 173870 154330 127402 101544 87191 68378
18029 68378 35239 14458 25959 24124 -1650 -2280 -13776 -24408 -39972 -48971 -40585 -26914 -28820
18016 -28820 -26898 -3714 -1645 -15991 -19117 -20699 6254 16530 47419 104500 134622 197365
18004 197365 256382 260763 277462 256308 223248 182618 157420 118779 116152 103857 114948 118668
17992 118668 96054 78196 75360 106757 136558 129061 106052 108480 118956 118902 102702 66100 32993
17979 32993 16769 9282 8143 -4519 -3509 21622 39253 40956 28031 32942 36885 37541 54222
17966 54222 77553 75701 65527 72102 80037 56288 27326 25468 30860 60039 81062 116739 141766
17953 141766 151718 143947 121445 110141 81644 55708 47536 16489 1340 8323 -1217 -12055
17941 -12055 -11136 -11199 -14503 -2568 -23599 -52539 -55407 -73723 -70015 -52187 -51323 -70868 -76606 -48289
17927 -48289 -19215 -8215 -11977 -14002 -24640 -41700 -55473 -51186 -32191 -631 18530 17674 42480
17914 42480 49171 38000 11783 -20999 -25980 -28179 -21715 -16216 -7043 35726 30777 30904 3861
17901 3861 -2553 7928 16866 14497 -16474 -51924 -45736 -20798 -9075 -28607 -28617 -7767 -9637
17888 -9637 -38013 -70480 -69039 -68908 -68750 -60277 -58570 -70317 -67834 -67267 -51481 -43909 -46664 -56183
17874 -56183 -62588 -53444 -47968 -44599 -45821 -34337 -25517 -21365 -30475 -33365 -29316 -34269 -41374 -23276
17860 -23276 -23764 -36259 -49513 -46883 -64283 -70318 -54988 -39422 -41424 -30367 -26515 -13830 -8232
17847 -8232 -10440 -55124 -88024 -95758 -73945 -66128 -56072 -68643 -66410 -50401 -48987 -22236 5836
17834 5836 15781 20403 41095 67253 98162 129289 125030 120927 157022 168139 199267 210863 219968
17821 219968 226416 253770 252736 205131 170950 136819 136269 136329 140100 138640 124964 97246 68840
17808 68840 40196 11231 -3894 7150 32965 52489 58051 41097 15342 12115 10578 5149
17796 5149 -4719 -3288 -18208 -32727 -49095 -24142 8366 4357 18910 27267 29816 44247 87630
17783 87630 124838 143315 137846 140647 161730 166372 166847 165816 153456 156402 157948 156100 144813
17770 144813 96413 64033 80009 101871 117248 136686 163550 171355 169081 143013 134576 133723
17758 133723 92293 64531 39375 30715 15931 -22952 -41302 -37386 -29461 -28024 -37113 -36559 -39270
17745 -39270 -26999 -34576 -45733 -47199 -54220 -51274 -45383 -40563 -32877 -35713 -40854 -50503 -57457 -88500
17731 -88500 -88045 -47735 -40868 -40437 -65806 -73390 -45223 -35731 -57077 -80064 -85291 -90877 -84952 -71876
17717 -71876 -82728 -82118 -82768 -87792 -91746 -78351 -67034 -70332 -79330 -85008 -102779 -97386 -70664 -57128
17703 -57128 -47660 -11938 -22435 -48908 -56984 -77393 -84542 -70208 -58577 -57325 -51735 -51125 -23728
17690 -23728 -10145 -35810 -47190 -40408 -43687 -51393 -54299 -69633 -52135 -49370 -45456 -29626 -25120
17677 -25120 -55672 -54124 -32154 -35740 -40067 -33959 -27744 -36818 -17226 -11322 -16602 -40696 -61636
17664 -61636 -54391 -72983 -97152 -96391 -79730 -43637 -46380 -74664 -94838 -103362 -91780 -82097 -71791
17651 -71791 -88158 -77252 -71465 -68627 -65927 -69880 -59849 -52940 -42712 -31980 -34815 -53034 -58958
17638 -58958 -40015 -46009 -48601 -56671 -35259 -11544 -11206 -186 -11587 -23338 -53997 -70172 -69014
17625 -69014 -65734 -41491 -32285 -55198 -58786 -53645 -35727 -32106 -34446 -30108 -42830 -51575 -51545 -40384
17611 -40384 -41747 -50383 -48882 -53310 -29764 -30402 -49045 -52924 -34527 -41813 -51546 -47100 -35934 -27581
17597 -27581 -28100 -44366 -58972 -70703 -75968 -70309 -62956 -57934 -72565 -60085 -29491 -2277 5492
17584 5492 735 -13077 -41993 -40479 -3091 18864 22683 28502 28657 27419 30642 32729 73093 124068
17570 124068 195432 323921 472672 585133 607021 593980 534963 436754 338953 235387 167782
17559 167782 111106 43564 5245 -2758 -6102 -6533 2225 -6655 -5637 2085 -26599 -26418 -27612 -35992
17545 -35992 -40141 -18441 -26797 -42341 -48913 -44696 -54466 -58937 -43164 -47664 -62809 -64100 -52550
17532 -52550 -82221 -61962 -41962 -41290 -48011 -90435 -67653 -59846 -74109 -70969 -76969 -76005 -60783
17519 -60783 -72884 -79054 -66236 -64136 -76483 -84257 -68185 -64378 -61316 -46862 -65439 -50687 -35230
17506 -35230 -35715 -39287 -54204 -75640 -89210 -93111 -84747 -74431 -69971 -59508 -66465 -82786 -104484
17493 -104484 -112577 -77312 -65851 -51603 -48982 -48537 -53798 -58866 -47117 -33407 -46599 -82949 -97065
17480 -97065 -80764 -50486 -37796 -54779 -58504 -68477 -67543 -77367 -92760 -68445 -47655 -51704 -55134
17467 -55134 -56125 -39612 -48016 -50863 -51946 -42063 -22340 -21972 -50384 -73455 -48544 -18452 -19570
17454 -19570 -18756 -35327 -42384 -33859 -13410 -5269 -23390 -11833 13803 36011 45081 92821 139071
17441 139071 130095 112180 118786 105158 73324 56407 40804 32522 -4718 -19701 -41924 -50311
17429 -50311 -42492 -37365 -52171 -33556 -23645 -41677 -65191 -87944 -80785 -51505 -55174 -63246 -71408
17416 -71408 -77604 -71054 -71974 -89082 -94993 -60602 -58431 -69327 -88489 -85759 -64521 -32653 -36211
17403 -36211 -61094 -68933 -87421 -78667 -89398 -85966 -79512 -84561 -92966 -90129 -95438 -97473 -68077
17390 -68077 -74512 -87812 -88107 -80774 -60403 -49688 -46817 -49620 -54880 -49430 -47979 -64142 -49828
17377 -49828 -35418 -54318 -60541 -58946 -55473 -50658 -45410 -59470 -53642 -44610 -48509 -95220 -78200
17364 -78200 -76456 -95192 -104321 -77255 -66756 -65785 -58333 -64334 -70522 -72966 -61461 -50639 -35446
17351 -35446 -35547 -52436 -30428 -45993 -55419 -42266 -35731 -37795 -62528 -76497 -67992 -44643 -29600
17338 -29600 -28931 -63518 -57948 -44237 -56105 -73403 -82662 -87215 -64209 -41179 -33510 -38995 -38681
17325 -38681 -26691 -27509 -45389 -36217 -28631 -39488 -34018 -56503 -47679 -42208 -32739 -23800 -35896
17312 -35896 -45497 -46709 -33944 -29111 -25473 -27155 -12433 -27997 -60585 -62475 -52955 -77001 -87135
17299 -87135 -68680 -56984 -54271 -40055 -57344 -71078 -70186 -75113 -58057 -52149 -55901 -59876 -56540
17286 -56540 -40662 -12563 -5260 -39713 -58933 -42781 -32570 -29059 -25950 -37121 -47708 -59239
17274 -59239 -65388 -77475 -79377 -76698 -81873 -85223 -77640 -75004 -91754 -98258 -92671 -99312 -95604 -97183
17260 -97183 -86214 -70608 -79334 -93608 -70243 -17119 -19636 -32717 -43127 -54132 -52926 -42341
17248 -42341 -75567 -81332 -69744 -49385 -22628 -9582 -30708 -44440 -25955 -15463 -35522 -28496
17236 -28496 -32822 -41230 -23090 -22803 -43928 -48566 -70096 -74629 -85769 -85766 -79211 -56116 -49205 -48397
17222 -48397 -56056 -67249 -59329 -58532 -53613 -69685 -57725 -52291 -59858 -66019 -81852 -69164 -71089
17209 -71089 -62596 -44303 -42011 -53799 -56725 -62064 -64326 -54435 -47914 -48632 -55588 -62378 -63358 -48135
17195 -48135 -33950 -35138 -35389 -27466 -28728 -49050 -43644 -50947 -47413 -34980 -21706 -28760 -54931
17182 -54931 -52560 -33022 -25570 -35003 -43335 -57978 -39634 -23377 -49565 -58008 -56524 -35689 -21452
17169 -21452 -16795 -21378 -44915 -58199 -50800 -62483 -60374 -55073 -74116 -81607 -61433 -56732 -66340
17156 -66340 -43104 -35160 -51464 -65585 -52686 -37372 -68043 -61833 -61752 -61737 -46282 -42868 -52941
17143 -52941 -59959 -56088 -58404 -69390 -67816 -48711 -40375 -30684 -28880 -58365 -85247 -86211 -71364
17130 -71364 -57069 -45429 -32091 -46463 -57241 -76803 -71101 -54779 -72315 -65681 -73628 -89229
17118 -89229 -81546 -79922 -87684 -112502 -94868 -62027 -57187 -42892 -46281 -68259 -43536 -9873 -18324
17105 -18324 -40528 -44660 -51771 -56292 -43884 -38538 -24771 -21460 -26619 -28252 -21554 -28789 -16677
17092 -16677 -10588 -14614 -30082 -39027 -17828 -1706 -6057 -24679 -10559 1743 -9891 -43864
17080 -43864 -48183 -39656 -65183 -95311 -85381 -67030 -58518 -47280 -46165 -50035 -55475 -55741 -69575
17067 -69575 -63179 -63642 -80565 -55936 -23078 -6883 -3749 -16212 -46569 -44111 -47868 -33744 -27767
17054 -27767 -45037 -62288 -64410 -49580 -59449 -80123 -75023 -70451 -78926 -96565 -65904 -28852 -28332
17041 -28332 -33040 -33548 -43870 -37887 -13194 -11465 -37697 -80218 -65462 -39135 -17764 -35043 -77785
17028 -77785 -98683 -82284 -66552 -60388 -30196 -27684 -28542 -31010 -47067 -42240 -48305 -46973 -45548
17015 -45548 -19756 -690 424 -37868 -62515 -60123 -52941 -26848 -18406 -35774 -29905 -14391 -22156
17002 -22156 -36607 -61108 -66000 -50271 -53133 -58677 -69055 -57368 -49768 -47244 -58575 -72394 -66808
16989 -66808 -60370 -80121 -82568 -61013 -48141 -48657 -53724 -58166 -64444 -58023 -69851 -60650 -51457 -37377
16975 -37377 -42444 -38308 -46827 -25805 -18344 -20391 -21308 -19864 -27432 -33252 -58441 -54584 -33574 -37757
16961 -37757 -57249 -43316 -47031 -51874 -54848 -51585 -40498 -42084 -24286 2049 -10850 -32950 -36460
16948 -36460 -17294 -11467 -26194 -19912 -24526 -33783 -31824 -24771 -34485 -56496 -88595 -89477 -76172
16935 -76172 -85911 -102598 -104569 -84989 -86014 -69503 -37883 -21950 -34961 -40602 -18842 7086
16923 7086 21160 2215 -32312 -48883 -43860 -35101 -57605 -62561 -43049 -37823 -28831 -50130 -62678
16910 -62678 -58886 -44718 -48289 -38443 -20497 -16338 -37903 -59658 -49227 -59568 -53747 -67901 -86529
16897 -86529 -84718 -93056 -110164 -79935 -51927 -48525 -55354 -71014 -64985 -83180 -87451 -86131 -83023
16884 -83023 -74080 -52557 -28549 -18405 -32231 -34840 -54075 -52319 -54981 -38021 -21621 -33965
16872 -33965 -34727 -21685 -21217 3413 -7201 -19178 -26228 -9304 -1344 -14130 -12933 -3129 -5549
16859 -5549 -27853 -28275 -51689 -72002 -45337 -39641 -37602 -48235 -51406 -53705 -50012 -42026 -78958
16846 -78958 -81986 -60145 -66498 -65339 -77258 -78084 -74947 -72041 -63015 -50607 -64669 -63775 -43866 -49444
16832 -49444 -41001 -37721 -49411 -71813 -57477 -55332 -66873 -68042 -55900 -43191 -41468 -49288 -61737
16819 -61737 -43727 -17241 -24458 -25129 -27945 -26606 -35421 -31062 -42639 -46767 -35829 -33094 -25883 -17181
16805 -17181 -42350 -60766 -74069 -92874 -70172 -22581 -11684 -37213 -31945 -28052 -31663 -30106
16793 -30106 -45292 -56547 -64339 -78291 -76570 -71555 -52766 -51535 -45875 -41692 -48046 -52791 -47492
16780 -47492 -59826 -64766 -68979 -63746 -65261 -45384 -47627 -54744 -46330 -52449 -44366 -33557 -41296 -49439
16766 -49439 -57214 -49008 -14476 2835 282 -9006 -18554 -43513 -53632 -60707 -85685 -82133 -75419
16753 -75419 -72792 -81337 -81017 -71307 -73558 -61480 -44670 -59749 -50770 -42433 -32783 -27889 -21118 -7307
16739 -7307 9638 -14500 -50593 -48495 -39227 -31733 -41256 -48115 -66037 -63787 -61907 -66945 -87585
16726 -87585 -87506 -80533 -76586 -57471 -55183 -43999 -28606 -12761 -22480 -34800 -73372 -105059 -76128
16713 -76128 -76810 -84638 -62552 -50946 -44561 -35016 -16382 -21653 -35737 -36232 -41223 -52587 -50119 -45235
16699 -45235 -49712 -49496 -51403 -43385 -53055 -61196 -46486 -54484 -57620 -44216 -29068 -35544 -67122 -39031
16685 -39031 -39302 -60936 -83094 -78831 -44987 -17561 -19792 -10668 -15478 -30405 -28454 -45838 -44727
16672 -44727 -41832 -48303 -64588 -57383 -45503 -47354 -40082 -54632 -65258 -48862 -35252 -50825 -67538
16659 -67538 -67659 -65802 -50073 -53737 -53520 -41580 -32010 -31406 -46013 -58414 -61211 -69004 -53136 -53707
16645 -53707 -40268 -35215 -37382 -27451 -13356 -24312 -33850 -50381 -53553 -39797 -34022 -44042 -47327
16632 -47327 -31571 -42544 -38040 -28161 -32624 -38162 -54775 -68323 -58854 -47620 -60120 -62908 -45703
16619 -45703 -55951 -55209 -27700 -15427 -16464 -9740 -18610 -33302 -16310 -14395 -21843 -6394 -7547
16606 -7547 -34772 -48107 -48046 -30092 -21401 -26866 -54383 -58450 -56995 -79095 -90319 -73371 -82111
16593 -82111 -73257 -42396 -41316 -46639 -48823 -32056 -15108 -16923 -36753 -52965 -52094 -56578 -55050
16580 -55050 -50566 -43537 -44299 -70394 -63219 -52735 -41106 -51189 -67737 -69552 -65640 -50449 -42539
16567 -42539 -28008 -24766 -22238 -4663 9083 -1502 -4053 -2154 -9108 8136 31818 25879 -11978
16554 -11978 -13910 -38071 -17347 -33647 -51029 -41404 -51749 -52717 -55743 -82157 -78389 -67920 -66670
16541 -66670 -61319 -49827 -49861 -42280 -55462 -78849 -47368 -25188 -28525 -32200 -41707 -19006 -18825 -12718
16527 -12718 -25625 -30860 -47437 -60767 -36832 -452 8233 -31048 -58931 -51500 -48058 -37920
16515 -37920 -32143 -40743 -43334 -68768 -77543 -60787 -40860 -17038 -4198 -27562 -48628 -44939 -23162
16502 -23162 -20074 -23289 5446 -636 -12255 -17290 -34294 -39941 -44614 -29496 -33178 -32996 -44719
16489 -44719 -60168 -53822 -36276 -13319 -1400 8339 -6916 -18553 -26294 -24659 -16139 -19451 -35556
16476 -35556 -32812 -32690 -59740 -69451 -52624 -39826 -30016 -35708 -13603 -35540 -43198 -15591 -15494 -28866
16462 -28866 -10256 -1141 -20574 -5429 5034 5511 749 -32852 -36636 -18074 -24576 -32721 -7339
16449 -7339 -16076 -34932 -61734 -74765 -84500 -71143 -62139 -47476 -34675 -5766 -16686 -21723 -26765
16436 -26765 -29782 -39683 -45291 -33558 -32283 -53114 -44270 -40596 -66574 -85614 -92730 -92268 -73150
16423 -73150 -71966 -49263 -40654 -59474 -79353 -68454 -64698 -56644 -48647 -48395 -48395 -26415 -13766 -24916
16409 -24916 -19238 -5495 21094 17395 4460 -4622 4509 -14748 -22767 -12118 -14619 -7671 -33125
16396 -33125 -37627 1901 -6405 5325 27832 5945 2187 2752 -179 -1140 10337 16672 29846
16383 29846 17347 11021 22181 25776 9464 -2908 -3561 -19758 916 -19404 -31817 -25571 -21358
16370 -21358 -8447 -20338 -27079 -36013 -34924 -39004 -33338 -11401 16566 45043 38785 -3665 -6643
16357 -6643 27445 23343 11866 29069 34074 20057 6866 -4659 -23407 -72432 -80479 -59623
16345 -59623 -52651 -47677 -41014 -26446 -24245 -17285 -15479 -20120 -13062 -17665 -13009 -3998 -6642 -20740
16331 -20740 -23747 -13649 2215 -11660 -38567 -43835 -46918 -54088 -49193 -54595 -57752 -52056 -42446
16318 -42446 -23974 -24527 -15700 -23001 3386 -4926 -21828 -30373 -19578 -11906 -27804 -62692 -20601
16305 -20601 -5876 -3081 10804 1891 -30937 -64269 -61766 -34598 -12901 -29103 -34455 -13590
16293 -13590 5831 5983 4221 -1709 1614 2478 -7294 -25448 -45307 -19992 4425 -30105 -67646
16280 -67646 -53923 -28353 -29499 -15512 -29551 -49545 -35216 -12154 -21723 -43684 -28090 -32840
16268 -32840 -30592 -52153 -79609 -69287 -62707 -45205 -42220 -37936 -20683 -15311 -12039 -30713 -31838
16255 -31838 -14544 10049 14873 -13952 -38510 -18164 -5428 -1723 -14142 -12218 -11379 -38022 -40138
16242 -40138 -19268 -8731 -537 29261 21706 -1354 -22990 -53846 -90807 -78525 -58639 -52132
16230 -52132 -39235 -43548 -31947 -22705 -14416 8367 8293 -6877 -28720 -43748 -58048 -58095 -45329
16217 -45329 -40454 -34443 -49084 -33880 -11716 -3513 -6808 -30614 -56930 -68702 -77411 -45101 -17929
16204 -17929 -26571 -33589 -55004 -58038 -50057 -41739 -53767 -61998 -69363 -77263 -58269 -42625 -22116
16191 -22116 -20552 -46641 -38643 3714 7093 -21023 -32688 -27753 -26874 -14328 -6847 10776 3060
16178 3060 -9955 -25888 -1161 4429 17968 29138 24850 7168 -11422 -20723 -16551 -4006 22354
16165 22354 20743 9885 -19263 -24504 -11232 -13311 -24530 -12848 1927 -11991 -30698 -35080
16153 -35080 -34120 -31901 -3319 -17365 -9159 8227 26778 28156 10390 15409 29496 24636 4192
16140 4192 20136 11118 -7415 -3094 -8249 -17514 1730 5930 9812 18446 19792 16141 30837 13801
16126 13801 -4722 -2626 -25110 -12769 -6511 -10808 262 -38800 -43879 -34527 -52252 -39834 -48167
16113 -48167 -56654 -32298 -45141 -43339 -54873 -48572 -36876 -30292 -25480 -33983 -26101 -26501 -31929 -24349
16099 -24349 -4031 15710 34245 -8771 -31404 -21812 -4997 -4355 -8242 -17251 -12953 -20513 -30068
16086 -30068 -38284 -60811 -74910 -65803 -47562 -39849 -31016 -665 16732 10217 2042 13216 17373
16073 17373 27858 26790 -2398 -4444 -7994 2725 24844 24724 -3129 -5198 -15103 -17293 -1734
16060 -1734 24545 6184 -8153 -26369 -14751 -2794 -7021 -26416 -33565 -38500 -20522 -18622 -10175
16047 -10175 -19502 -40201 -36010 -21169 -3030 -3463 -2348 8523 11162 16440 16294 5428 -17535
16034 -17535 -27939 -35397 -32254 -629 15922 8650 -944 -17914 -14586 -9908 -35671 -29526 -14234
16021 -14234 -20670 -52986 -59382 -47275 -32345 -44586 -40348 -45259 -41520 -29843 -32606 -27034 -19464
16008 -19464 -36895 -44900 -23828 -19860 -22367 -22367 -51550 -52070 -52488 -55150 -42978 -24235 -26735 -20184
15994 -20184 945 -16610 -25369 -25010 1309 13606 -694 -14052 -11280 -21989 -9922 -16371 -30926
15981 -30926 -53040 -71233 -58588 -18214 9716 7670 -4328 -29124 -36989 -70506 -67869 -52377
15969 -52377 -49150 -29748 -31318 -55269 -66252 -59705 -55617 -48375 -54573 -9444 19964 -10692 -26702
15956 -26702 -2909 9975 5794 -3631 2414 -10723 -14238 -18141 -35134 -33066 -11407 -20998 -37675
15943 -37675 -32322 -45557 -48976 -41153 -11068 -22645 -49783 -48029 -31447 -13925 9459 21381
15931 21381 25969 4749 3992 13441 29751 7698 6014 602 -16615 -7151 4506 -874 -9491
15918 -9491 -21686 -25896 -16099 2493 4550 2492 18135 9946 11997 10963 -21756 -31000 -11199
15905 -11199 -17847 -11776 10602 20418 9836 20370 29343 24793 18848 13542 11215 18860 16187 22602
15891 22602 17903 -7234 -10123 -809 -14940 -18429 -16940 -31203 -35672 -38091 -14357 1025 1768
15878 1768 86 13751 8372 -9479 24893 15565 6752 4336 2775 5574 19209 29349 15369
15865 15369 -12795 -192 9373 -7704 -21723 -31564 -47884 -55441 -54373 -39851 -12193 -3512 -10450
15852 -10450 -5896 1460 1449 -7061 -8347 -5754 2489 -1918 -21112 4670 2090 -32834 -33214 -37496
15838 -37496 -49964 -44325 -57644 -77365 -66979 -52035 -38766 -35338 -31535 -19756 -39283 -54857
15826 -54857 -40455 -7871 14505 13065 10543 -271 -10332 -13584 3316 11091 15854 2049 -5084
15813 -5084 -9530 -2987 -6152 -5739 -5393 -5643 -2873 5141 -8811 -24741 -40976 -38695 -33118 -43510
15799 -43510 -48286 -46161 -44224 -45598 -24732 3580 27443 2555 8242 6997 -11571 -23510 -33927
15786 -33927 -23219 -12138 -30196 -60539 -58936 -41723 -8636 15324 29573 37879 26896 16357
15774 16357 -3601 17670 8071 -4715 19712 22525 11833 -1192 -314 -4213 9832 7819 17614
15761 17614 27770 29308 11278 3524 10923 14418 -3839 -18486 -142 3722 4785 22408 39837
15748 39837 51265 50339 31424 17255 22615 860 -6115 -8778 -7351 -3870 -26497 -35923 -36389 -29586
15734 -29586 -30078 -9757 31050 35153 27380 49955 61629 35082 21809 -1810 361 -19780 -27656
15721 -27656 -25322 101 7258 1114 26676 32967 40359 56966 66392 73299 62046 42936 27185
15708 27185 20861 47306 60115 39928 21776 2619 -215 19212 19982 30029 38257 66978 55560
15695 55560 60861 64249 17315 6134 14305 -4852 13247 57705 64342 37209 14532 18510 12599
15682 12599 22460 23894 27640 23794 -215 -7863 -21519 -31801 -16941 -3392 -2999 -1135 6585
15669 6585 31215 20067 21654 37870 13128 4030 10775 20995 6363 6366 16822 13646 5114 -2657
15655 -2657 7300 -3791 -19935 -15017 -8979 -34685 -42653 -33263 -13962 -20531 -10800 -8198 8741
15642 8741 5782 5711 -3819 -8486 -22966 -25612 -30695 -28370 -12650 7482 5910 -14272 -16792 -11434
15628 -11434 -7927 3563 5872 -186 -8458 -20247 -3806 2037 -26 -12279 -543 16282 -12176
15615 -12176 -11573 -1668 16050 26377 22799 21486 29654 20485 23541 6950 -1076 13628 15667 29356
15601 29356 47158 39933 26776 22329 12387 -6859 -41123 -10126 3987 14788 35328 23968
15589 23968 4565 1771 -23928 -49858 -34616 -26498 -59697 -92007 -67827 -32133 -32257 -29924 -19103
15576 -19103 1282 28673 32647 41851 34076 21818 21320 35551 41173 250 -3643 -15548 -35810
15563 -35810 -23913 -19713 -32133 -49032 -51289 -46013 -38586 -44643 -30251 -46867 -41609 -29555 -3070
15550 -3070 15407 10896 16234 10579 -5657 -19647 -20745 -8291 9569 18466 42670 51407 28630
15537 28630 2408 8147 20570 21081 5409 -88 -4529 -288 12203 9349 6758 21690 30073
15524 30073 40773 38462 3438 -25623 4558 184 -12247 -14329 17422 37071 56041 46986
15512 46986 14186 5822 29270 45963 39909 28548 18577 39316 57307 61850 51045 48575 49108
15499 49108 39815 28441 8604 12823 20700 33697 16655 12146 6711 -1309 5683 6537 6260 1019
15485 1019 3857 -11875 -35104 -12218 -1300 10364 33444 7433 3376 9700 18699 13347 18948
15472 18948 29850 34036 16559 4629 7827 14098 7973 -13009 15087 24216 23845 21777 22062 28691
15458 28691 16796 13124 3359 14968 -3248 -7974 -13811 -23516 -5511 8669 -5254 -29040 -34370
15445 -34370 16120 32204 10632 16323 10248 10075 23244 22813 4788 30926 37014 20262 10450
15432 10450 18106 24953 30075 31110 28707 38662 4443 -21667 -18261 -6957 -31940 -55121 -37297
15419 -37297 4868 14643 35616 51441 35662 27599 30044 9105 -27 3123 28811 32283 18503
15406 18503 20472 6490 7784 3145 -220 8008 25277 45845 58677 52173 46681 28560 28432
15393 28432 22057 379 12879 25221 14494 30806 28315 29373 32605 40213 44879 48107 26246
15380 26246 13 14996 22602 16564 2981 10773 28958 39340 54704 51452 48793 65110 65036
15367 65036 36480 25084 14099 39265 56874 73166 86499 76915 71296 58903 28092 26490
15355 26490 54274 61365 57001 50102 67041 92726 104791 131524 125188 110823 131703 164733
15343 164733 183270 176489 170584 182419 179176 169362 154526 134638 102129 68591 57896 64618
15331 64618 61180 58697 58016 58690 43474 30377 26877 16801 13125 18214 30015 32714 27653 32173
15317 32173 34310 25095 44616 34639 42297 35419 13356 20987 24122 38244 58941 67486 88249
15304 88249 90340 60202 28917 37219 28933 13237 37687 41760 24904 27172 48215 30249 17206
15291 17206 27077 44831 31155 12256 3958 3906 -1778 5027 39056 78387 55839 25641 9568
15278 9568 9874 26885 21147 15368 -2573 -23226 -2920 26942 51727 79802 79153 67790 47947
15265 47947 56445 57972 48817 28196 27916 37116 16333 13194 27487 42443 49975 34146 23186
15252 23186 35704 59759 72275 59735 50889 45840 65546 75913 62100 25942 25776 52924
15240 52924 45055 33038 28434 40320 63967 93360 88317 58089 32618 23372 23169 11115 26858
15227 26858 45214 44294 28487 29527 36649 51228 57306 30867 33988 31284 46482 41033 27725
15214 27725 43341 51666 49124 49600 57630 64443 65535 54777 47709 41829 26737 10671 9907 25620
15200 25620 26432 30862 37457 55201 67601 48894 52221 73153 91551 62555 54812 47601 42788
15187 42788 34277 65169 78269 63535 57384 71726 99229 93795 60720 52278 58187 52287 55378
15174 55378 35624 36209 22912 17210 49975 44391 15409 22180 53557 62699 30381 13058 9229
15161 9229 23121 25291 53740 66241 57686 44949 38458 24811 33942 21744 23465 44128 48692
15148 48692 54535 89188 88895 72989 79415 83579 80841 101390 111037 99582 78117 73598 90754
15135 90754 71669 49711 44927 57974 66222 77613 81513 72466 77195 80855 95355 101118 80228
15122 80228 61093 53024 36206 33310 46297 71217 92711 104267 93242 79344 89723 72240
15110 72240 76294 83600 61185 36120 39872 44755 41400 51123 83811 97744 108716 114009 96509
15097 96509 87515 73242 46087 65085 93121 101767 109984 94637 78628 72760 81276 96465 81506
15084 81506 51745 52758 61600 59581 60108 56252 61344 63308 49212 48206 69097 73244 64152 42410
15070 42410 37799 45064 41834 55376 66246 68195 65420 63164 83830 98533 100216 99181 99325 99482
15056 99482 108842 111571 117515 121551 91249 75140 97042 102619 106675 114747 117918 111470 91721
15043 91721 73496 73303 75018 62116 70784 94073 107874 95702 91647 102664 84602 81461 97178
15030 97178 98221 89927 79333 70925 78808 91699 118614 131012 122665 134035 151435 125273 115593
15017 115593 117315 121376 149223 172697 153081 148561 154727 149931 116608 100888 109739 124309 143558
15004 143558 146092 141658 130944 127227 109013 104250 93017 96338 81622 82419 88808 79088 92983
14991 92983 94232 118084 136804 138887 136143 127820 127333 122638 133084 137788 124835 103180 95579
14978 95579 103598 132992 145532 118445 102777 130984 124188 115621 111751 133951 122561 131158 135773
14965 135773 140506 127164 117059 109201 124523 129539 122818 119292 115853 113564 116699 108221 132373
14952 132373 137973 139895 129250 121831 108805 113080 128781 116690 111277 116331 124063 148005 162441
14939 162441 164753 180914 169678 147150 151154 137506 119489 133418 151097 152989 160384 159169
14927 159169 163327 160729 169781 158839 113930 104418 107495 108933 117562 141808 159586 152905 139134
14914 139134 141346 152231 147673 154639 142361 120234 112577 122205 125612 121633 136420 158643 148820
14901 148820 154783 165184 155277 152190 136170 139235 130960 110465 148082 183292 175746 166815 135993
14888 135993 129924 142889 149700 161781 173059 163731 176144 176779 186087 189723 203044 189852 156442
14875 156442 162148 166868 146365 138713 139912 165679 165933 167078 161947 146802 164425 173747 150502
14862 150502 133606 151603 167425 181520 205142 191315 175046 163427 182017 192530 199919 220111
14850 220111 214430 209878 218318 207440 189005 190248 171314 160181 183091 182784 181388 175605 167326
14837 167326 172850 188835 206858 224439 228606 223743 228829 251421 237356 215222 211074 204838 208855
14824 208855 208810 202006 208048 215760 223772 212155 202240 211329 236185 251347 258443 243809 237861 226633
14810 226633 212946 203135 199877 245839 274808 276443 280481 270816 261983 274032 268267 266690 288708
14797 288708 310590 328260 343950 367429 424057 469352 491944 540890 593213 688577 793167
14786 793167 890599 985316 1079904 1148249 1156195 1160077 1119099 1056105 932968 812441 723103
14775 723103 640042 600527 529800 454181 426726 389402 362783 335328 309536 292464 296841 293802
14763 293802 289692 297149 313401 315722 302517 322957 342005 324907 274294 282923 282126 277538 293319
14750 293319 308541 316534 307943 296689 301966 300094 304438 307808 321538 315878 307484 327553 323881
14737 323881 321902 335729 326221 310951 278755 268537 274283 300400 331661 336585 328970 317587
14725 317587 312860 305270 289205 296023 286917 327264 364127 351631 336780 327393 339078 364720
14713 364720 370154 386763 354265 335858 342800 346644 337521 352754 383095 408698 419905 420926
14701 420926 434369 413591 402752 410048 400374 404615 423744 419415 445859 450458 421883 409522
14689 409522 410529 407710 428534 446519 440991 452406 464487 472109 453540 457538 483301 496459
14677 496459 498150 498883 523566 528681 528013 535548 533980 532459 516541 521697 520902 551150 581829 587040
14663 587040 591784 608004 616405 614836 614593 635769 653690 644307 654680 703627 728699 730648 742031
14650 742031 730524 726646 732065 752937 764606 771724 800083 821722 835777 856025 850662 860075
14638 860075 900997 907002 882437 906863 919344 917284 926148 936116 952682 969899 980016 1014123
14626 1014123 1024676 1010239 1022317 1038917 1066521 1091232 1095337 1115322 1128591 1128587 1110467 1104545
14614 1104545 1139622 1163195 1164261 1179019 1209880 1211828 1214248 1247350 1274490 1276681 1286031 1303430
14602 1303430 1325304 1349481 1357375 1379915 1387048 1392045 1413715 1421032 1447302 1485690 1488666 1469171
14590 1469171 1499297 1538971 1528284 1552620 1590372 1614121 1644994 1655309 1633321 1669627 1673928
14579 1673928 1693152 1710102 1716324 1739341 1771853 1796154 1807025 1848634 1884738 1885729 1905385 1942407
14567 1942407 1946391 1971369 1997280 2009525 1996759 2008302 2010935 2027965 2069708 2094833 2105270 2131969
14555 2131969 2169914 2178759 2180184 2178971 2183317 2230292 2243545 2240382 2247817 2221058 2229733 2257645 2275905
14542 2275905 2282634 2280583 2312334 2326048 2334240 2343864 2355921 2341664 2336349 2357798 2355185 2348906 2335038
14529 2335038 2306881 2300695 2307452 2318653 2332315 2345172 2329587 2328763 2362513 2393608 2389199 2373796
14517 2373796 2370548 2363978 2366812 2380039 2405013 2415502 2417312 2429790 2442619 2446321 2450834 2465713
14505 2465713 2484254 2486764 2474657 2488009 2483028 2470349 2451328 2445202 2443525 2438427 2419765 2402577
14493 2402577 2372651 2341978 2311545 2291233 2264635 2253608 2256636 2202610 2128977 2097252 2096008 2086955
14481 2086955 2055274 2028423 1981473 1969884 1969935 1964450 1944596 1920052 1874917 1831376 1807641 1780461
14469 1780461 1758360 1758845 1743711 1739205 1733224 1703311 1678369 1658374 1643642 1639427 1625381 1629277
14457 1629277 1637412 1630700 1611354 1567247 1519745 1508917 1491418 1493154 1508661 1500771 1496967 1481969
14445 1481969 1451067 1441949 1429934 1423792 1403360 1375897 1356886 1362112 1367211 1353258 1338102 1344197
14433 1344197 1341156 1311596 1300466 1308371 1306779 1303206 1308712 1296363 1277799 1271288 1278119 1260986 1229401
14420 1229401 1229106 1236137 1262497 1250837 1247333 1244013 1206341 1175279 1165776 1191151 1206440 1186071
14408 1186071 1177302 1185949 1168530 1173487 1177751 1157247 1151471 1157698 1161819 1154604 1155569 1162314 1125824
14395 1125824 1096093 1093604 1130751 1129890 1107776 1082041 1074085 1069573 1064593 1056708 1067214 1055240 1041009
14382 1041009 1042243 1054445 1070655 1047517 1026223 1013870 1026352 1026783 1026997 1016466 995681 991937
14370 991937 988449 999110 1004648 975726 962263 948897 946126 933938 941604 937386 942846 941040 953170
14357 953170 945284 920714 921633 914829 889141 885407 866002 875095 902988 892132 868224 845664 810079
14344 810079 795202 803879 800056 787150 785179 809811 815962 821170 822802 797375 779522 796492 792773
14331 792773 785067 772681 762541 745433 741734 732989 739026 723655 716664 739703 729248 727137 719586
14318 719586 714608 731829 740830 728911 705039 692273 688847 686087 679289 656649 643156 671403
14306 671403 642011 628335 640656 663372 662099 660954 638000 626192 627632 646192 646641 628888
14294 628888 616942 621858 616581 615541 614665 610376 605644 602278 601780 587936 567261 528539 503390
14281 503390 509827 534819 521795 527287 545738 521117 496194 491865 483014 489901 505447 516188
14269 516188 504046 496757 481711 460502 470417 459617 444528 448257 443316 445949 434839 434942 450446
14256 450446 443112 450522 453896 445596 400159 396359 397650 405042 412819 421073 441483 423381 406291
14243 406291 366719 352911 374052 380167 377620 383671 398902 407672 406258 377726 361825 375336
14231 375336 391357 375190 360619 348740 379726 387257 385194 389297 369970 352973 354607 367531
14219 367531 376640 346982 334281 311617 304773 331360 325613 312477 305325 303906 285440 287194 314588
14206 314588 293123 265768 292905 311175 329757 336928 348401 374992 383096 388229 394966 429413
14194 429413 461431 470412 456951 464836 482001 497088 527592 562991 579627 608436 640474 642031
14182 642031 651097 640990 626893 640259 651628 666849 671661 653587 647021 661668 644444 625408
14170 625408 604545 599831 577780 592308 603538 603514 608598 603947 610148 635977 649290 638716 620545
14157 620545 619730 584917 562770 576098 577521 577525 588495 618292 662790 651903 649241 665573 693887
14144 693887 702181 736890 755846 790246 794687 789509 804596 825530 833292 851202 872236 908627
14132 908627 972868 1006599 1042530 1059740 1102500 1156559 1179132 1232942 1276269 1318476 1369393
14121 1369393 1414299 1479069 1554935 1606185 1656513 1706745 1772809 1838815 1909112 1971343 2060902
14110 2060902 2153894 2240934 2327361 2402892 2487707 2576492 2668293 2777301 2869784 2959150 3085715
14099 3085715 3214285 3379989 3553822 3724397 3900320 4099963 4302070 4516997 4776455
14090 4776455 5083613 5438051 5808060 6175339 6600759 7080616 7624130 8214932 8847624
14081 8847624 9522283 10303425 11183790 12098321 13103006 14225302 15472077 16811017 18295443
14072 18295443 19892784 21628665 23530597 25571542 27799930 30182180 32711316 35392221
14064 35392221 38231017 41164979 44197415 47271335 50400055 53561726 56648009 59623297
14056 59623297 62440354 64963623 67179494 69004759 70422801 71385134 71853668 71804943 71218370
14047 71218370 70160790 68660719 66721376 64413188 61818683 58996342 56007946 52898717
14039 52898717 49719581 46539954 43413921 40386663 37466680 34652435 31993287 29477605
14031 29477605 27127243 24938606 22893436 21032271 19313265 17719530 16301986 14995949
14023 14995949 13793862 12671728 11663153 10747840 9896442 9133580 8440389 7798914 7216176
14014 7216176 6650235 6164606 5751964 5370679 5013969 4663697 4354729 4079128 3837673
14005 3837673 3615834 3408519 3195022 2980201 2826682 2685980 2537520 2394025 2243676
13996 2243676 2117061 2000621 1889528 1800015 1729731 1643204 1563386 1522316 1448569 1367304 1326768
13985 1326768 1260590 1210991 1194380 1159142 1109463 1063686 1033445 1000405 954341 932828 906512
13974 906512 883774 864222 819370 794079 774823 756387 752905 745310 716517 699917 689271 695891
13962 695891 688180 659573 645844 631577 612079 613185 615198 612092 601419 603807 584789 569837
13950 569837 579244 575096 555791 573204 588927 581244 551063 507396 496647 487057 477736 480780 467383
13937 467383 460652 448566 449207 453104 455664 449575 413163 403969 401473 391339 390717 398782 369688 371056
13923 371056 386857 371278 351523 339981 338723 325995 300662 288843 281085 292254 309835 310362
13911 310362 308566 307084 318685 339831 324971 301324 308784 342721 339294 290104 295008 316985
13899 316985 326826 335520 315887 316260 338132 367618 398898 386318 381203 388526 387906 403484 393017
13886 393017 375064 356853 350422 359374 357939 344091 312350 286185 293928 310324 281173 270141
13874 270141 281834 279765 273531 259128 255508 260963 259177 227504 222150 243110 233941 215457 196362
13861 196362 209510 221592 224640 225177 224179 225422 220408 202527 193937 199416 193341 173812 153491
13848 153491 124235 117211 148288 164314 159073 154937 175337 169033 146450 122731 138967 120374
13836 120374 95557 79083 71984 91941 105156 119430 121784 107001 88990 83057 94288 79420
13824 79420 65439 90674 81192 63802 54250 65273 70362 53536 59624 73961 79985 80234 64221
13811 64221 73524 98548 114792 102441 79008 64845 82518 72178 70231 70232 56335 70847 82923
13798 82923 80659 76407 64254 69892 78488 94165 78639 86147 77311 65472 68733 51536 58075
13785 58075 70557 65649 76483 49470 8073 21771 52168 62324 79757 108506 117365 130481
13773 130481 149765 142509 143818 138888 131809 109079 100229 100503 98736 101639 69809 56639 43658
13760 43658 3078 31892 56306 75979 72579 43917 34121 45971 55167 55657 79682 102126 76327
13747 76327 42929 47620 49445 74678 90305 105106 116679 127733 129078 138435 126301 111110
13735 111110 125688 120508 123607 109335 101784 106718 112938 122379 85645 61611 83276 81323 66675
13722 66675 42164 43745 61486 56178 47334 52628 67332 64941 66918 62670 77924 90934 71616
13709 71616 39020 16962 34812 15507 5058 3294 4562 21446 40680 47700 48559 45502 60003
13696 60003 91976 101831 113115 85660 60898 44803 50968 46855 28535 38777 50582 14525
13684 14525 -8033 21493 43753 22476 27577 35316 30358 20323 1138 -18127 -12321 28037
13672 28037 32510 15019 4992 37551 48950 57802 67172 62390 50291 28289 21674 7012 -18035
13659 -18035 -17868 -6105 7658 11344 17825 33549 50190 62678 77488 70772 47868 30461 27307
13646 27307 32914 28067 29238 6757 9429 18793 25762 31553 18228 2556 19570 18345 24060
13633 24060 41628 49685 30396 37548 56110 73184 60538 48039 52508 56733 48630 43432 52503
13620 52503 82524 94315 122085 124066 112159 113446 147398 190076 197576 204838 195361 213556 231583
13607 231583 247427 264632 274157 290708 321857 326658 345353 362086 385010 402354 418178 453793
13595 453793 449009 436064 417399 377777 350586 351738 334641 337262 334748 307074 296057 264714
13583 264714 233735 231877 241108 244753 210400 184433 165653 147355 141064 151720 162007 160839
13571 160839 148096 140263 139003 124031 110856 103882 98166 98797 119302 108838 87626 81776 84046
13558 84046 57892 48058 55088 68899 88042 77017 81640 76999 54957 82632 99627 92180 80818
13545 80818 81933 81196 83325 48861 33046 36878 47386 44669 40663 31918 48631 65101 65524 64749
13531 64749 68262 64560 56528 36533 21197 21914 25082 31786 29708 46320 70657 81605 67507
13518 67507 63102 65309 47297 44337 28715 24402 16544 -2184 -16437 6607 36602 64585 56621
13505 56621 45062 69860 73285 39207 37450 29285 34016 52841 50061 46610 47305 42958 44332 53588
13491 53588 42801 46864 48938 40558 38650 27582 23773 23980 30306 24385 36198 34898 19762 13194
13477 13194 6939 9320 21342 40043 59708 74890 72890 80830 77137 61209 43305 43888 72457
13464 72457 83994 78735 50201 52643 59420 77712 94449 107304 102358 115981 125227 105136 92896
13451 92896 106075 121519 114223 112066 124290 151440 190277 237185 297213 318945 361114 438508
13439 438508 525375 568343 581232 601666 610880 616169 605259 573358 539898 490386 438054 391342
13427 391342 324003 271452 242713 196182 149890 135920 131182 127444 103039 71504 61392 57175
13415 57175 59763 93182 93154 73318 60816 47710 42689 51879 46794 50398 35099 39410 53199
13402 53199 69479 42359 45749 40602 30934 30523 27581 6970 3760 18313 23328 25316 30066 28828
13388 28828 16553 10387 27672 52559 45807 25229 30073 55552 38236 11763 31431 38017
13376 38017 40335 13390 23283 38057 21914 22707 10271 16922 6956 -6836 4691 31161 48311
13363 48311 52834 34129 28486 36998 42507 64254 89374 92775 74363 45137 40952 25907 7736
13350 7736 -5 -27202 -19409 -12821 -17347 -3134 13212 20307 19910 19215 14272 9628 29343 34858
13336 34858 20938 -921 -2406 -5708 12947 15266 -3653 -5517 -926 638 16938 29548 45742
13323 45742 49320 42262 57613 60369 63038 76380 73207 46597 32495 10450 6778 16649 28260
13310 28260 27568 38132 30760 22291 21802 29360 8374 -7329 -12675 6260 17874 37811 25599
13297 25599 18089 9568 4823 -8409 -4755 -361 4517 24439 6099 -2489 -9333 1281 -3946
13284 -3946 4705 35010 32232 7664 -5813 -14116 -2326 867 7689 23042 22528 5421 -15801
13271 -15801 -10477 12436 14945 33650 54379 44724 36105 12467 5495 3048 -20717 -7490 7972
13258 7972 -7732 -13498 -9192 -6695 -9772 -12095 -2228 -19507 -35895 -34001 -24886 4446 1205 -13743
13244 -13743 -6929 -2608 -1284 14830 6457 15885 17671 26960 26794 29555 12140 9423 21930 13498
13230 13498 -4023 -25877 -27336 -24952 -25837 -20038 -23713 -21066 -9607 -6911 -25184 -36045 -15329
13217 -15329 -12366 -6579 13355 20654 28516 31233 21192 11948 12957 8385 -1865 -7805 -4147 -26260
13203 -26260 -13266 -5941 6718 13475 10712 42694 41926 29381 34659 14231 5147 15959 4186
13190 4186 -3019 18992 22707 28192 47842 50690 89874 94012 95997 73315 87734 115993 137142
13177 137142 138200 176312 211250 224468 205554 185731 181285 142788 111634 93757 66479 64673
13165 64673 49552 59131 60755 58250 57011 46362 44916 50904 49425 37417 44125 52085 49305 39569
13151 39569 33456 19448 31617 41270 40661 21670 16838 18117 31967 53803 68720 64431 67585
13138 67585 88901 110979 113893 108138 98719 133481 193599 210356 235598 278771 320120 368942
13126 368942 422894 427308 426080 393153 355301 294917 226425 196614 182865 157902 134427 113949
13114 113949 83067 87229 75307 48155 25078 26346 59315 77355 76260 59204 56017 38847
13102 38847 26500 26736 28324 16774 7135 7579 18954 30920 36387 58597 56038 24801 12550
13089 12550 34031 58384 61643 60553 75100 92645 97014 92667 109659 154416 175725 192714
13077 192714 217011 243241 228870 210553 194276 159814 140129 130304 126671 113410 93686 58064
13065 58064 19301 26752 55041 66077 54677 26345 12929 34603 60579 62719 85671 106335
13053 106335 72045 31757 8636 -29807 -29963 -11344 1096 12312 11964 21579 21847 18619 -2495
13040 -2495 13561 -911 -21691 -39645 -31310 2059 -8202 -43381 -21944 -15912 -14491 741
13028 741 6606 17715 45 12270 7215 -4252 -11613 -2018 14857 12440 -9535 -9905 -7521 -22072
13014 -22072 -29815 -14380 5923 22337 4662 2531 6674 -3874 -5168 6566 -5009 -27504
13002 -27504 -15758 -7365 -2788 -2347 -14072 -34596 -41425 -36771 -4036 -4865 20440 26029 -510
12989 -510 -7559 -21206 -14502 -16468 11911 441 -12807 -24688 -35749 -25945 -20265 4207 12939
12976 12939 11324 24601 16153 5896 21200 33069 32516 13884 -24572 -36387 -14666 -3931
12964 -3931 3219 -13681 -34950 -15479 15189 13403 13392 17213 35207 40984 26973 16589 20917
12951 20917 1078 -12021 -19623 -8002 2779 -23629 -11810 2079 -14361 -19582 -20601 -9082
12939 -9082 4492 17348 4786 -15166 -13203 -11641 -20530 3306 10307 6829 -6866 -15023 -29159
12926 -29159 -20701 -2640 23414 21822 14997 12989 -20214 -31711 -15714 -12091 -5076 -7026 -34092
12913 -34092 -41494 -40129 -25279 -2767 -1423 -16978 -35201 -29174 -4867 2400 4440 1245 9828
12900 9828 13476 8073 25300 24682 -2673 -19055 -20663 -45649 -38963 -18183 13492 6673 7981
12887 7981 1683 -18441 -22957 -28342 -13687 4227 6060 9359 3276 -15401 -17202 -33445 -29214
12874 -29214 -15462 -30602 -29723 -38955 -63545 -27542 -10155 -603 2368 -6535 24701 62730 49349
12861 49349 25862 31883 52538 55180 39580 22198 31990 23422 -2490 -5237 -2865 -3108 -17967
12848 -17967 -34404 -36350 -26255 -24276 -31368 -27715 -16577 3670 10907 13084 19422 33853 43882
12835 43882 57438 49984 40703 21473 24731 40373 49242 29582 15856 -16575 -1541 38859
12823 38859 62427 66631 71299 90281 79320 50413 43923 48776 45621 11627 -14623 -7110 1902
12810 1902 13828 17324 18393 28673 12775 -522 -6096 -6775 -3727 3889 12132 20442 19557 22309
12796 22309 24882 53667 64355 43988 33539 8566 -3487 -1148 3838 12710 15582 18702 -330
12783 -330 736 20440 29324 26157 30338 20627 42624 50076 34255 19157 22299 11568 18273 -707
12769 -707 -11653 1972 -3920 -6020 7839 14450 6767 -7825 -8156 4627 1837 -8697 -5053 3009
12755 3009 1569 14285 39814 27529 12339 -7199 1388 -4068 3754 15000 14985 1387 -13837
12742 -13837 949 -15246 -16489 -13707 -6285 2090 27234 24075 24816 32339 47107 36791 5795
12729 5795 -7883 26991 55119 57327 53358 44398 35771 32872 33568 27925 21852 32106 41924 46200
12715 46200 37606 32354 37229 43222 33120 39527 53578 50308 54714 35899 -4160 2921 10366
12702 10366 -1675 7673 4429 11119 28265 17196 -261 -18429 -5509 5615 25324 17301
12690 17301 3070 11863 10605 10526 12346 17711 32161 29320 35551 22994 10679 512 21810
12677 21810 20664 5360 -1061 508 2378 10535 3614 8494 -1197 9527 7256 -70 5816 4121
12663 4121 17336 8448 20401 6429 -22036 -51511 -18535 -1000 5408 -6285 -16001 -12734 9501
12650 9501 31340 48108 45023 44574 51796 42630 38796 44766 44452 38745 48618 44061 39315 35869 19191
12635 19191 -2236 1583 -3578 6413 5507 18020 26260 8469 10507 7236 -9081 -20557 -15145
12622 -15145 10559 19213 21403 9832 -2355 -13789 -11310 -15928 11720 13416 -19039 -7924 109
12609 109 -89 -11530 -6403 10057 27465 16299 10518 16970 -145 -10197 11502 11552 6119 -925
12595 -925 -22973 -17650 -5472 -4187 -11581 -16318 9602 18997 1103 1636 -8063 -154 -434 -10172
12581 -10172 -6008 -3273 7131 12332 20273 19434 18447 -320 2187 17083 12617 5168 19358 1153
12567 1153 -24504 -8289 -19594 -17788 33986 20576 2654 -8892 -4470 -14970 -11238 -4734 -5546
12554 -5546 -8518 -31263 -33625 -34930 -12839 6527 7155 18498 28994 31508 28926 8120 -8581
12541 -8581 -21743 -3897 1552 -14710 -24903 -20018 -38484 -36811 -53057 -33823 -30952 -32814 -24376
12528 -24376 -18494 -9195 13267 8145 -8693 14126 14177 7820 -18249 -37222 -16500 -17188 -18334 -16819
12514 -16819 -15965 14099 10734 -8259 -30777 -19236 -23879 -22134 -20397 -9321 719 4979 -3968
12501 -3968 -4581 -2426 -564 -31953 -25447 -10881 -30475 -27414 2627 26423 20661 19431 8079
12488 8079 -16671 -25549 -1190 23631 26439 24180 9873 7463 16635 10369 30956 42482 15433
12475 15433 -7344 -17366 -2471 16087 22927 44492 54896 7026 -11835 -10246 6336 5932
12463 5932 1228 -3792 -7124 9128 6912 5224 11981 -1384 -20310 -3765 -875 4861 16407
12450 16407 5529 -9100 -38773 -57477 -26836 -3315 19087 5048 6385 -2684 -17100 3704
12438 3704 15603 28266 31307 37231 42237 21798 22132 20253 -4652 -5513 17928 23006 34615 58278
12424 58278 74771 97243 80178 43560 28266 52754 68199 57861 28495 4865 4720 -13350
12412 -13350 7478 7294 9745 18570 28177 18802 -914 -255 10293 14276 12592 30027 26197 22482
12398 22482 10686 -1100 4179 23621 16651 -8061 -7428 9853 21974 20440 19949 18202 16073
12385 16073 12577 13329 37217 38597 50001 33259 14764 1726 -1976 2766 9468 17488 5977
12372 5977 9843 -3902 -21019 -36337 -32898 -23002 -5834 -10164 -4784 10439 23530 27242 37786
12359 37786 68986 80764 86984 72508 56068 43657 52789 38453 20793 33614 56360 42369
12347 42369 9412 6791 22973 24754 26095 23337 17235 24563 38277 57877 59765 61007 43223
12334 43223 15965 25775 48312 46530 39121 17567 7507 23415 34267 34006 42820 45002 35144
12321 35144 5037 -5788 -14342 -5937 -6135 -12732 10899 -2416 -8674 -29262 -26422 -32749 -11988
12308 -11988 -8550 -3021 -4135 -21039 -28448 -7163 12591 2891 3108 2067 -6025 11574 15952 8689
12294 8689 -17153 -12324 -5282 12333 31195 52327 53829 29562 -4379 -11219 1261 -1187 10042
12281 10042 25298 59303 52806 29142 27404 13398 -15538 -23573 -30325 -28587 -12020 15566 27052
12268 27052 4523 8709 17342 10307 64 -33638 -33638 -20757 4759 4855 7747 -5359 -2270 -6951
12254 -6951 3239 4286 -1169 11852 20412 15589 -11282 -5858 -11909 -23274 -28575 -16629 4418
12241 4418 23870 16841 -7818 -26717 -22928 -2887 3337 14234 17626 -7578 -8311 4668 13252
12228 13252 24640 36988 45642 45158 35570 32135 22708 17327 29625 39375 19360 19508 38116 15343
12214 15343 283 4615 19805 9732 -14755 -17546 -30964 -25506 -2798 12931 14808 33581
12202 33581 48264 44570 25303 3392 -967 8455 11640 13478 13387 -812 3058 -14285 -17642 23031
12188 23031 10278 -17124 8956 27473 35628 12838 -16006 -9291 -6913 -10579 -3036 -6435 -17099
12175 -17099 -3812 14559 39302 50557 62006 49024 39918 37506 44778 52202 51171 31375 10699
12162 10699 7114 -4367 22369 47186 22038 23822 53584 38723 23199 19547 46510 71315
12150 71315 76349 60667 88592 77196 45506 43305 60596 71198 92498 75949 70040 83654
12138 83654 74406 53906 69842 68958 65645 66213 57073 64690 63766 51540 51277 26445 34086 33835 -3917
12123 -3917 -3065 17351 29516 39075 53889 48458 37107 43838 64565 101148 103754 117690 126291
12110 126291 113850 105267 121318 148302 143920 161223 174484 207726 233194 289895 365060 493467
12098 493467 664985 803083 940899 1015979 1008738 950873 867017 754695 641285 527416
12088 527416 423886 359746 297389 242847 209652 162027 137868 83980 65802 72463 84056
12077 84056 80469 54391 54021 66469 67050 53494 27914 -404 17319 40901 56142 51642 29330
12064 29330 37197 50041 41461 33259 34030 33856 24510 30094 42776 62535 75977 82736 77179 95699
12050 95699 100294 103289 97939 93265 92461 91626 53444 56634 37336 17033 14644 9602 2842 -1615
12036 -1615 9885 28981 45288 21144 -3176 11080 35121 48271 65188 48730 24760 19238
12024 19238 35171 43493 34141 23434 28904 46917 44762 36840 16697 7224 -243 1562 4616
12011 4616 -3031 -21778 -38062 -35713 -29769 -1236 18364 2331 3656 13278 21107 39256 40101
11998 40101 48086 39318 49321 35209 20576 19222 33123 44518 22007 21392 10375 18853 30500
11985 30500 23469 22032 4356 15217 14678 -15393 -20579 4445 22577 39561 54802 53471 47614
11972 47614 37438 44450 51943 44551 34806 14242 15809 7251 6082 18242 23927 21496 11063
11959 11063 7757 -2004 -18012 -21338 2018 6476 6185 8388 6059 -29175 -41773 -42126 -13708 31276
11945 31276 30323 22181 9342 16929 634 -10209 -1899 -2281 -12959 -3124 16707 29115 19174
11932 19174 14049 5344 14048 4014 189 -13043 -9591 10869 20391 -900 -12908 3683 -7063
11919 -7063 -14715 -13157 -25486 -12883 -6045 1920 20337 36764 19055 14327 19263 28619 26931
11906 26931 28497 16161 10369 25259 11685 7612 30886 31703 21035 11433 11424 12347 39641 51386
11892 51386 57214 35763 35854 49133 68156 80154 58739 58343 61006 54690 34130 23388 62112
11879 62112 62357 36792 56919 75693 70084 45512 32133 47742 54701 51051 44653 45621 30371
11866 30371 26799 44461 20301 8805 8569 13219 15723 13197 13500 15482 38809 36683 23335 29228
11852 29228 18590 10927 17180 33819 16496 12254 12061 11486 36486 66872 67626 56365 42141
11839 42141 48046 45893 53316 82346 84582 77332 60114 30456 12987 43105 55302 47666 51464
11826 51464 36896 39426 39978 45242 60042 56984 65343 48051 33704 62534 75101 65425 46480
11813 46480 34334 26423 1515 -9420 8999 25690 38347 52021 45930 41963 37192 35556 37566
11800 37566 63154 63614 41566 3220 3117 19925 12292 24776 53058 48086 53706 58098 54624
11787 54624 39209 25461 39543 55861 46346 44291 35944 25977 29182 43242 39033 35867 38845
11774 38845 58275 46231 42355 51591 52974 26838 4133 19797 62107 83056 78800 70684 50677
11761 50677 49425 48263 43380 47351 28384 23324 24818 23958 26917 34934 30178 33156 42404 40271
11747 40271 43101 29060 34984 38140 40082 39303 25362 14931 19516 15453 -11998 -28177 -36216
11734 -36216 -29612 -8187 -6132 -22193 -10917 31659 36789 49203 53123 55385 47931 33386 26845
11721 26845 47534 32143 30448 38167 44884 34688 62431 66227 57453 53323 52489 60349 57552 48722
11707 48722 23581 17433 19871 7270 11212 22317 36406 28787 2812 8036 22824 32259 45184
11694 45184 31103 46421 44339 27205 55816 61361 61727 71898 80807 79992 88141 91868 99661 93230
11680 93230 85056 85983 68917 61194 43213 29437 9554 7365 -15745 -29960 5843 41272 51890
11667 51890 58047 64014 67025 71622 58948 67930 76616 99321 74737 85318 120643 105878 81561
11654 81561 86586 101148 101778 76428 76078 65254 70542 75284 76196 88220 106891 95509 113914
11641 113914 121436 130670 156047 157049 140901 145595 147144 136023 123273 123626 124129 158162 205608
11628 205608 216989 227869 257429 268770 305256 342728 375603 434550 503208 605678 703502
11617 703502 847741 986018 1063913 1074555 1012402 904156 759882 664170 574770 473513
11607 473513 409528 341217 288115 256138 214414 164851 135195 123062 145722 156911 143895
11596 143895 136174 113120 118614 117108 112908 118726 122739 133698 141855 158831 163900 162065 155377
11583 155377 162560 158465 151021 166082 191975 235809 254298 287850 320009 341436 337022 378008
11571 378008 455554 547488 666726 785909 918430 977429 950145 906693 841708 746992 646402
11560 646402 529376 414685 323728 268446 230433 191326 155393 143739 111967 126769 133462
11549 133462 107073 100777 106949 100840 83262 72104 74397 76802 54692 46688 54326 71102 72472
11536 72472 73995 76697 59202 38044 28827 50242 70703 56302 40654 44452 58397 49347 48428
11523 48428 51879 37822 40383 67522 76881 60724 64091 70116 58098 45821 19248 7455 3354
11510 3354 1855 4091 13561 27372 38639 26403 10567 8067 4289 -3870 27148 23034 17713
11497 17713 10212 1194 40720 65732 50633 28759 26650 27114 31779 9558 18351 14150 23637
11484 23637 28510 15182 16162 20632 44452 59621 63769 62135 56983 43138 39422 35086 41117 23990
11470 23990 30952 40515 36596 28114 9039 -7712 -29897 -31014 -53767 -94637 -112454 -91210 -76575
11457 -76575 -46182 -23413 -17275 4966 45484 36434 40358 76496 85332 93072 77214 70319 66298
11444 66298 53914 47032 36870 56922 71195 63532 69196 96300 101161 86081 65883 55995 61276
11431 61276 62623 77414 78081 78025 88223 97667 91455 96612 120203 149536 122638 106663 108826 102499
11417 102499 111964 116722 135711 152226 166898 191071 215611 225340 225259 253326 262012 299532 397667
11404 397667 535277 747242 1049902 1486637 1912646 2077518 1983993 1815166 1551726 1259213
11394 1259213 975872 742721 561657 433927 344627 279896 244075 217524 176349 158179
11384 158179 155062 125419 84150 75881 79602 108588 114285 107870 103404 73587 76594 81316 70627
11371 70627 50091 51559 41468 58680 90482 116147 104430 83180 96257 98129 82801 82532
11359 82532 78969 79674 52768 55258 62476 41764 42397 72261 57556 38461 48549 72304 88493
11346 88493 81825 37823 12224 30274 53420 76963 88342 89209 53613 24790 6630 5927 26533
11333 26533 13832 26780 32699 61033 104063 102564 79489 51532 27171 19009 22673 18713 15604
11320 15604 43575 54273 59965 71688 92259 94512 105700 115075 111361 110597 115189 122700 97518
11307 97518 88506 96060 76949 63086 41383 20476 -1214 -30384 -56908 -36127 -27160 -9574
11295 -9574 -2525 13734 22452 25690 34365 28830 16465 19225 51053 61088 61707 60501 39747 12267
11281 12267 23639 61824 84194 48638 43898 51359 26963 45385 65215 60005 51083 30933
11269 30933 28293 48541 51657 70525 79445 80173 86066 80068 94500 114887 112984 94357 77218
11256 77218 96518 103356 121383 127386 127006 132815 153282 183833 224473 244169 266816 319344 322335
11243 322335 304972 271401 228578 205378 178468 171101 165113 137093 127457 128726 137218 141920 136995
11230 136995 125997 140593 135745 128490 139826 128622 117839 104164 91418 99981 118271 109116
11218 109116 86184 80060 70619 64921 61487 66644 64963 59208 68517 48293 36768 19279 1117
11205 1117 14810 48151 54636 69659 113223 151368 135516 116196 108292 118251 115354 77005 24241
11192 24241 9010 26481 39651 16035 -4012 -2400 -28127 -61847 -105151 -118350 -117015 -102264
11180 -102264 -91807 -88340 -59838 -28364 -20485 19749 67038 62922 56919 72572 106873 99618
11168 99618 79960 76348 65351 79858 108450 107742 111852 102855 100284 101103 101856 94228 71101 57501
11154 57501 29824 -8527 -76506 -148893 -243685 -381417 -557947 -631481 -579780 -478369 -361063
11143 -361063 -232350 -91987 45448 133325 186283 217218 231939 247200 266047 284812 299665
11132 299665 305706 310179 340620 371568 390732 425861 442433 447363 503030 564479 602011 681091
11120 681091 836475 999379 1125568 1104202 983726 836991 677379 587580 552482 526795
11110 526795 521837 496740 428425 399842 361512 327490 322922 312794 312586 301734 285244 277733
11098 277733 258745 258623 254627 238984 233476 247561 241940 218272 216306 228127 246412 245365 252484
11085 252484 283688 312552 325856 369121 394023 402012 389049 396197 428806 483709 501925 461979
11073 461979 435082 403866 383483 361381 358803 370178 394691 411868 388895 390941 420944 445128
11061 445128 483871 514943 525570 548821 591979 644504 684294 699745 712884 721012 746087 779429
11049 779429 821894 837257 867939 929190 987845 1040508 1078965 1144346 1241973 1326469 1408322
11038 1408322 1494474 1565086 1617852 1698087 1824374 1974667 2162506 2368650 2472899 2542546
11028 2542546 2603583 2687979 2799338 2935534 3116761 3342829 3585846 3800626 4057718 4379239
11018 4379239 4751583 5236751 5923495 6858685 7850497 8602849 9189245 9788502 10432107
11009 10432107 11238400 12260200 13613571 15396685 17577825 20284232 23493062 27066851
11001 27066851 31142670 35966504 41854545 49939172 62090210 81079999 112102567 164430669
10993 164430669 246237733 337489969 381248637 369118642 341225484 298247182 243632365
10986 243632365 189394463 141666301 105174213 79425906 61337084 48242332 38528268
10979 38528268 31164861 25603186 21435087 18264914 15775549 13775859 12163430 10859520
10971 10859520 9851114 9150372 8753036 8582153 8342600 7866191 7313636 6728579 6054599
10962 6054599 5419870 4858048 4402092 4015273 3688747 3413985 3200960 3010312 2836757
10953 2836757 2729778 2598839 2465518 2336176 2217975 2108734 1969137 1829934 1718453
10944 1718453 1623714 1530541 1458179 1376223 1340126 1296435 1263489 1241093 1200445 1181248 1173487
10933 1173487 1142800 1092822 1030777 1009334 973480 932082 899779 882004 904031 889715 871743
10922 871743 871256 878420 874838 845813 821626 798219 789882 757504 727230 710398 707995 679044 664421
10909 664421 676964 692273 655604 608131 581295 536749 511778 503941 506674 509252 522128 517445
10897 517445 508687 489785 477754 482865 507562 513806 491277 492897 504718 506496 518249 517613 520644
10884 520644 512995 488685 483722 477074 467227 465441 454630 449708 443342 441988 425148 414390 420352
10871 420352 447205 476914 512150 556475 595865 580436 510504 411673 324422 283250 263402
10860 263402 268426 247849 213695 177640 181868 185730 170485 168798 168676 154537 147860 184000 158036
10847 158036 138629 161743 170972 192018 202014 229844 256141 286780 368902 477642 662607
10836 662607 864318 955750 940773 906403 818284 712514 609908 535532 451879 370595 320567
10825 320567 301211 291639 274495 244378 236081 238544 214285 201857 199467 189107 200447 237413
10813 237413 221426 190090 182049 188210 194387 193203 200869 228257 254241 267379 291565 324050
10801 324050 366411 412793 415551 375263 343046 326316 321058 291865 286340 295264 296366 276803
10789 276803 261820 242681 212115 179768 161916 152499 157285 145596 151662 133199 128929 110911
10777 110911 137289 189458 229003 238697 248715 221160 180322 141507 134321 128621 118871 142682
10765 142682 153281 141159 134961 137376 118776 104710 93557 111873 153171 173739 160856 139533
10753 139533 142614 170899 186765 185196 215996 233045 242739 248594 246221 236600 209608 195941 217302
10740 217302 210600 196848 194934 195542 194381 190563 178668 170246 181285 169711 168228 164199 175905
10727 175905 172895 132007 116121 121737 129060 108310 95443 108949 146632 163854 155210 161706
10715 161706 165184 193492 208678 217299 245779 271390 283464 305621 330032 355504 377333 372835
10703 372835 409905 430995 425716 390178 372429 338937 305430 290338 290577 279076 274741 243647
10691 243647 227065 226523 235377 251290 214524 227049 215184 209662 213121 231272 251628 242570 214690
10678 214690 196083 189336 172461 146743 161893 175678 171470 168499 170245 175388 180625 183085 189037
10665 189037 210512 247631 247113 245430 261398 280542 298396 368163 417905 449734 470989 473821
10653 473821 489801 484911 465745 442259 433844 410919 380820 356554 342830 330896 275888 221959
10641 221959 210244 205983 188932 176592 167689 155474 159758 156211 149535 137259 135224 129077 131000
10628 131000 121367 145985 143509 139928 142709 157181 167918 180739 180804 179811 185124 185128 171188 177856
10614 177856 211528 245277 270901 306688 334766 384274 434028 454823 470940 479512 445851 414347
10602 414347 382084 354228 335845 332058 314030 280460 257739 214748 215306 220860 235802 245315
10590 245315 249549 274132 290733 301700 325257 365414 415944 485722 621534 805826 1096502
10579 1096502 1541824 1997867 2209960 2159437 1971275 1719265 1417208 1118351 847304 672841
10569 672841 573556 500733 427766 393259 376771 362408 369082 376534 368382 349252 299640 261277
10557 261277 255590 242842 215435 205453 197270 156630 142600 115762 91593 84993 69369 52998
10545 52998 59421 80007 111666 124007 96302 86409 93062 82549 77437 97560 124363 155322
10533 155322 155725 146510 129594 127070 114800 109022 114171 141630 179739 179909 190669 225362 221796
10520 221796 224678 229474 235473 251801 222971 210448 205900 216229 192542 167761 162890 144297
10508 144297 148922 149102 148210 123768 124013 133283 133671 120635 139276 163922 145954 129384 152941
10495 152941 150309 151640 159121 145046 135669 152392 132730 120373 123484 146787 147434 124777 133533
10482 133533 127280 111927 97428 104867 133868 160960 170271 176644 171644 133578 126491 143070 156547
10469 156547 151916 146810 155092 147292 132257 139110 140054 143320 137971 131155 143824 163509 167881 145948
10455 145948 125038 136118 138942 143050 130511 112773 109211 114705 106054 105480 127221 143161 127345
10442 127345 108457 121675 126471 117637 120935 123630 133875 125692 118102 103508 120142 142004 142366
10429 142366 133388 125311 103768 101640 107115 137881 150365 118915 111842 113697 121625 149346 170037
10416 170037 180123 154541 141251 133701 113142 130764 130932 121388 111290 115700 114182 109389 96749
10403 96749 102601 117003 110980 125318 123254 113676 126400 120940 120911 146777 152538 146205 148739 144569
10389 144569 161974 156482 131574 132268 163931 146548 133341 138623 138477 145322 142397 140699 123726
10376 123726 116905 116774 127288 156690 179114 166529 167203 180187 192572 185001 156150 124972 131629
10363 131629 146777 155957 152302 159531 157510 166243 179581 189446 190007 161869 162329 173260 174327 160678
10349 160678 162114 195719 204124 210893 197735 174609 161827 160103 176662 177311 187408 192020 177238
10336 177238 163078 146148 149250 161439 168407 186741 195213 203426 196493 213987 212502 194118 160517
10323 160517 156321 164646 161486 161437 165205 183549 170383 170790 175026 181246 174708 175511 166468 167029 168242
10308 168242 169894 195286 212602 230155 229186 245237 234013 205873 209961 219047 230214 215993
10296 215993 197078 191261 226252 239692 232747 211012 204657 219246 223691 237886 232306 248504
10284 248504 260832 263697 283910 271681 271041 259086 249034 253223 242961 245812 228458 219188 235587
10271 235587 264158 289003 315695 311122 278900 252246 246027 250305 285655 289723 281494 294815
10259 294815 311206 330571 333244 307320 308801 305778 333365 335756 310589 299755 307082 293572
10247 293572 308326 331248 327777 326257 321138 325410 330135 340208 359225 360459 368490 369364 383426
10234 383426 400570 377790 368711 368794 370288 387409 387065 378511 380420 363854 353094 357150 352953 359938
10220 359938 392893 415324 413180 420499 446063 440850 438529 450461 461370 483564 499153 517118
10208 517118 537901 542381 543214 534744 537075 539691 548417 548455 559228 570382 575117 584903 569989 570639
10194 570639 593325 606174 595558 619213 649060 646564 654571 647108 635929 640501 648132 656882 655132
10181 655132 671891 726814 732922 742191 760635 748330 743449 760991 773876 795719 818661 836138
10169 836138 858263 889819 919444 945576 982677 1011968 1008809 1023395 1028115 1038497 1057705 1082556
10157 1082556 1088826 1107365 1125277 1160672 1201294 1230220 1267475 1294371 1325009 1349673 1374750
10146 1374750 1411982 1429542 1464396 1492309 1523892 1565387 1613320 1645256 1685093 1737612 1795454
10135 1795454 1846095 1919438 1968159 2033512 2080576 2123385 2209829 2280739 2343480 2401899 2473862
10124 2473862 2556265 2642788 2716185 2804656 2887792 2957207 3049494 3136981 3227778 3314699 3417579
10113 3417579 3518866 3616455 3731253 3842818 3949007 4064531 4221738 4381012 4522053 4645931
10103 4645931 4757875 4892515 5030895 5175768 5293506 5428891 5587960 5754192 5911706
10094 5911706 6059729 6201259 6350535 6494149 6633821 6776648 6917172 7064885 7246071
10085 7246071 7420049 7565604 7724129 7870757 8007869 8166593 8317258 8484362 8648420
10076 8648420 8801941 8978726 9152311 9303238 9426063 9578819 9719809 9865769 10023727
10067 10023727 10149225 10271758 10403568 10534490 10659949 10783006 10882526 10985215 11100498
10058 11100498 11203382 11282965 11335272 11369895 11415778 11446700 11460987 11488856 11510865 11496018 11443459
10047 11443459 11401556 11347762 11293433 11203202 11144667 11066585 10991248 10896488 10803148 10692655 10586119
10036 10586119 10470122 10335570 10218610 10113174 9998716 9863865 9725937 9586227 9451404
10027 9451404 9332616 9185576 9062793 8944508 8815117 8674046 8526124 8401049 8288708
10018 8288708 8135407 7998024 7862480 7714220 7565242 7441218 7300619 7144767 7009726
10009 7009726 6862319 6734227 6586365 6447974 6323446 6191238 6079234 5959807 5817836
10000 5817836 5683839 5569851 5437165 5282246 5152125 5059383 4956869 4871465 4753864 4633240
9990 4633240 4510057 4413234 4316668 4204928 4105080 4019702 3936448 3864898 3776664 3710490 3638696
9979 3638696 3562120 3494952 3423185 3338171 3294147 3257153 3187238 3106736 3056950 3015194 2957473
9968 2957473 2888747 2857196 2819464 2755580 2703555 2666699 2617725 2568520 2558426 2507559 2438667
9957 2438667 2411482 2385475 2361343 2336760 2292432 2278517 2255535 2205436 2171253 2152549 2142914 2144012
9945 2144012 2127236 2110076 2087654 2057613 2011659 1977476 1982672 1970350 1932638 1897594 1913945 1900099
9933 1900099 1870349 1854248 1861705 1855790 1845291 1821596 1799892 1787766 1797336 1776369 1745796 1703054
9921 1703054 1691292 1692027 1671925 1699842 1692678 1672139 1640452 1630335 1625602 1640678 1667821 1648894
9909 1648894 1622014 1606136 1582979 1560067 1537766 1533386 1527360 1517030 1522527 1528443 1537457 1549347
9897 1549347 1568065 1544866 1547081 1552092 1569613 1572470 1538804 1506907 1502001 1520586 1540551 1531460
9885 1531460 1509872 1495571 1493721 1502481 1472040 1473440 1486542 1465987 1446473 1456836 1455602 1461508
9873 1461508 1443116 1405447 1381302 1379663 1397391 1419197 1415358 1414119 1432581 1427901 1416081 1414820
9861 1414820 1421349 1411792 1424199 1421206 1402075 1391965 1401750 1431140 1423737 1401729 1392284 1393393 1389200
9848 1389200 1392208 1405292 1438637 1435817 1407955 1387757 1378501 1373202 1376321 1382707 1385476 1372668 1355211
9835 1355211 1362725 1380922 1391465 1386145 1362270 1390442 1390981 1395396 1381602 1364626 1347192 1359865
9823 1359865 1378873 1385215 1368549 1380438 1378554 1379235 1377812 1387700 1400200 1399015 1399944 1397009 1412083
9810 1412083 1434210 1450578 1454359 1453068 1474778 1499771 1485881 1458551 1450508 1434412 1423062 1444410
9798 1444410 1457662 1475170 1481813 1478403 1500650 1511851 1497359 1522454 1540540 1534387 1529185 1560566
9786 1560566 1569828 1554241 1571083 1579506 1586436 1577585 1566708 1587583 1590166 1615154 1651209 1656669 1671241
9773 1671241 1653953 1672161 1657009 1672665 1649631 1658990 1697826 1715898 1693340 1687323 1722434 1743996
9761 1743996 1762719 1772661 1766751 1749879 1755813 1767047 1778688 1813564 1830414 1833886 1844730 1875531
9749 1875531 1898075 1922773 1960548 1972136 1972838 1977564 1999212 2010104 2019628 2018459 2032459 2028380 2023814
9736 2023814 2059992 2104153 2131787 2143855 2161956 2180829 2200446 2203227 2189340 2203335 2228354 2251094
9724 2251094 2249395 2296427 2325400 2356589 2384971 2428483 2468929 2484237 2495843 2509970 2516456 2543210
9712 2543210 2568838 2603867 2643094 2666454 2681037 2703829 2714874 2749152 2784349 2801330 2810078 2842026
9700 2842026 2874684 2908730 2941066 2960950 3023698 3062262 3109821 3140949 3172854 3204499 3230673
9689 3230673 3265855 3297872 3339862 3385622 3394050 3424632 3471847 3503529 3560387 3593948 3633240 3695702
9677 3695702 3743283 3778111 3822011 3880759 3935140 3977561 4005053 4059664 4104640 4142911 4213564
9666 4213564 4256258 4286976 4325903 4401078 4469699 4527818 4585900 4647103 4715120 4752041 4814262
9655 4814262 4893657 4967599 5018823 5072279 5170433 5260318 5327251 5410796 5462287 5513963 5580617
9644 5580617 5636850 5697006 5781187 5883701 5956446 6021646 6090816 6202494 6299816 6366241 6411335
9633 6411335 6512848 6604431 6660715 6731766 6805506 6884540 6959472 7046880 7135106 7204467 7293308
9622 7293308 7394312 7464119 7551775 7638950 7715234 7800442 7892894 7985601 8036744 8104009 8206522
9611 8206522 8322431 8405493 8481851 8565700 8648121 8734963 8811157 8892168 8984956 9067836 9146039
9600 9146039 9219914 9308162 9394343 9457554 9545834 9625133 9693648 9765147 9829940 9865579 9875171 9858519
9588 9858519 9813708 9763627 9699965 9624424 9562776 9511166 9447592 9366447 9282377 9239809 9196368
9577 9196368 9157396 9082212 9010181 8936095 8878138 8829020 8794890 8732027 8666475 8610903 8554484
9566 8554484 8474192 8375259 8295547 8222604 8110661 8029264 7943464 7824539 7726255 7645026 7567286
9555 7567286 7490611 7396511 7328841 7245759 7126611 7018906 6939772 6860264 6782390 6686354 6576257
9544 6576257 6471318 6374377 6265930 6180903 6086337 5994322 5914548 5856879 5782524 5693052 5609701
9533 5609701 5520280 5428338 5349258 5273387 5219241 5120664 5034024 4972408 4915676 4847685 4760348
9522 4760348 4692388 4627286 4557347 4475562 4386520 4333896 4282556 4213021 4149709 4090660 4017242
9511 4017242 3962291 3924193 3872613 3788740 3717946 3654961 3613650 3577557 3518695 3466128 3414379
9500 3414379 3355555 3307945 3251419 3196286 3162678 3117132 3076834 3036471 2988716 2951068 2927820
9489 2927820 2878478 2830687 2787472 2748065 2687869 2673296 2640134 2611044 2565751 2506954 2485735
9478 2485735 2480413 2469999 2441982 2403557 2378766 2318524 2278817 2244648 2218806 2172758 2168065 2154587
9466 2154587 2131674 2097017 2067354 2053830 2006465 1980776 1976467 1956277 1920932 1870401 1851203 1831766
9454 1831766 1815800 1805392 1772103 1731382 1705798 1697968 1671859 1634250 1579536 1542289 1539413 1549058
9442 1549058 1538427 1501676 1482262 1471418 1480411 1439441 1427388 1416229 1392035 1374843 1359835 1343004
9430 1343004 1343929 1350126 1329057 1307750 1280524 1250808 1226342 1234463 1224973 1225517 1232191 1228063 1220376
9417 1220376 1212799 1195900 1168307 1140951 1115369 1100304 1084591 1075981 1067187 1067459 1071255 1086467 1084614
9404 1084614 1057566 1017755 992624 1008214 1016096 1008300 974260 963249 1002825 1012538 975189 936951
9392 936951 922793 908760 901193 889269 887679 882259 868482 857513 829332 809824 796083 826508
9380 826508 830209 808504 777785 771801 763985 785275 773565 755688 746631 731223 720203 720523 717007
9367 717007 694137 699236 694445 690325 705412 720670 722111 703540 694278 678100 664633 645914 635831
9354 635831 646029 625206 627252 635599 635750 654066 667415 646952 645638 635805 603669 593135 581908
9341 581908 586960 594498 584594 573710 612233 607605 588851 559720 558467 561503 561796 565637 558996 541171
9327 541171 526766 517634 473001 480110 512795 521586 512479 498056 494223 478904 471129 455075 458845
9314 458845 464277 474397 473111 455338 452689 453641 437329 441165 439227 425794 415757 435584 450520
9301 450520 436528 443946 433791 413660 422219 418547 414237 433539 429021 393774 372830 382716 407372
9288 407372 416215 398354 404937 401802 406734 397072 364361 352111 343421 346327 339685 326364 325245
9275 325245 327162 314420 322284 326953 358381 359081 340452 359229 358660 340556 318077 325740 333490
9262 333490 328831 305624 290395 307355 299683 302070 300068 288623 323740 338390 322749 318896 324651
9249 324651 340987 349756 325511 301967 289138 276919 271485 301951 294366 307908 308556 309816 300436
9236 300436 290360 271178 236906 249348 280421 275897 246458 256858 260989 242875 229031 233262
9224 233262 242964 261153 258128 258998 272807 285615 271426 251895 230700 208017 213070 220531 237125
9211 237125 243408 240556 243957 233332 240704 251778 222963 226007 244654 220054 205633 246924 265885
9198 265885 258671 237885 208990 221068 235263 217593 222915 209004 194975 188775 191194 203302
9186 203302 202553 217951 202048 194945 186045 193554 208016 217746 235441 226639 222058 206507 191112
9173 191112 190388 208977 229691 227717 211694 195280 188395 184513 204043 204295 182123 151987 165932
9160 165932 175168 167005 165908 188485 208311 210801 189627 187228 208217 198986 195936 170287 181376
9147 181376 177841 161456 160518 168491 171090 166240 164438 156982 148190 160234 196161 202653 195274 179325
9133 179325 172513 176511 181951 175084 191054 175017 147017 137016 126023 125706 156064 168647 170023
9120 170023 175741 196665 193955 156236 132357 120756 128942 124656 131692 131291 146731 157294 157552
9107 157552 137431 121022 124541 148022 169241 177006 139984 120464 129800 120459 126070 143805 143680
9094 143680 134201 146642 160972 131877 119461 147316 157641 172279 175402 193019 159677 129705
9082 129705 128713 135567 138026 132849 127981 133231 142206 140522 131289 148280 138018 113989 102390 106304
9068 106304 108408 115858 114548 91217 76842 103587 125840 129869 120593 86252 93020 101528 87836
9055 87836 76394 74751 73980 78228 101083 103307 88726 103620 120804 122771 142261 133138 105839
9042 105839 92889 89857 87007 74871 94804 131788 129072 123336 114322 111523 104835 106105 124245
9029 124245 137338 140544 137859 129015 137358 137713 139459 155540 171128 150431 122057 130366 122552
9016 122552 114183 104223 89780 89176 81444 77600 78196 79333 77346 103877 111238 90745 76786 90655
9002 90655 76925 65050 81334 89399 99416 96595 96369 131700 145072 144154 129646 116509 120745
8989 120745 105258 105074 101932 107980 107278 102640 106316 106073 99954 125146 146606 158866 148589 151012
8975 151012 149395 136254 122190 91127 84609 87356 103929 102389 79088 72285 86325 76692 106681
8962 106681 127026 137815 125098 122909 101302 84189 76797 79934 92169 101186 88403 69586
8950 69586 74960 93110 124702 122143 104070 79550 47991 42255 66946 76132 86556 105394 101578
8937 101578 87358 94950 134579 135892 135108 127934 135192 124959 101262 96814 87414 75693 64549
8924 64549 67458 68818 66194 45939 49285 59279 93237 98529 88100 85629 63408 59772 51525 48781
8910 48781 77315 69677 73385 57610 43367 54007 67554 75992 66638 59591 77154 68623 64357
8897 64357 65482 64651 72627 92450 83874 77709 74763 44831 29642 32261 47052 72052 78903 67309
8883 67309 58465 49026 64892 66915 38177 41820 45914 50251 71019 78556 77590 104363 105986 93390
8869 93390 98040 74936 75725 60388 40501 45037 68152 72553 55349 39144 53949 61660 46807
8856 46807 25047 36647 56595 52248 36410 18757 27871 61988 73151 65012 68745 69141 54855
8843 54855 45667 46104 37721 22032 29447 36075 29758 43101 38430 41926 54686 48243 53404 46420
8829 46420 30508 22141 31249 30742 20509 45798 73628 61422 60499 65925 58115 63177 49685 38559
8815 38559 51019 53972 31324 34695 38921 59862 83906 81684 54238 57783 79403 101684 76206
8802 76206 76131 74976 91827 90511 95259 88942 79510 51261 37793 49749 36573 34504 36087 40125
8788 40125 32803 40028 44761 60422 69257 59355 49349 55783 64035 72083 65549 50437 43178 50239
8774 50239 63861 48220 23054 26791 31605 56189 83960 68188 35821 31791 42098 34683 23474
8761 23474 48818 61746 62964 68630 55120 45742 43857 57459 84162 88174 75393 69769 53251
8748 53251 34086 43863 59778 51938 75950 88825 63815 49710 54800 50327 39936 30543 40312
8735 40312 40891 25152 18848 15609 42232 59309 36977 20768 25367 24761 25729 41288 39863 39089
8721 39089 53002 48763 30847 44096 56345 52885 60982 46055 33336 29653 61769 75816 63653
8708 63653 50463 42609 27981 19408 19787 15419 25732 34461 38350 46112 31215 29137 24134 8511
8694 8511 24095 35014 41816 26187 14736 26835 23465 11658 21504 39690 54581 61930 44959
8681 44959 44277 36511 23299 19484 10482 20818 45425 61420 49243 50313 50668 34113 7385
8668 7385 -1641 24252 43847 52424 41672 38783 37712 37253 58217 46227 32518 30175 35909 48144
8654 48144 47998 53754 52598 31139 29630 54657 68280 75502 66869 68073 61898 49343 51956 83320
8640 83320 85410 62057 42194 6889 2618 30603 27153 15593 31314 36169 53690 62591 62288
8627 62288 47187 39085 58867 88657 98736 84462 65512 43872 40144 37348 44003 48066 55572
8614 55572 45069 54019 53840 71048 83561 63945 53969 55119 71242 103903 78574 52005 49833
8601 49833 51416 48041 62799 83628 69899 76513 89046 117444 122647 104249 106336 107475 83672
8588 83672 71318 66681 87050 84170 88827 89605 90378 97242 63576 16570 -1772 19436 45585
8575 45585 52315 71707 55241 38362 39052 49296 68419 75927 83682 101497 103182 78764 54803
8562 54803 54408 55207 52166 53777 47017 32133 34438 51946 52909 47379 61087 55472 60607 75381
8548 75381 82488 67704 56756 51195 45777 43328 55751 72296 83476 78318 73600 69114 48438
8535 48438 57339 72200 75569 60982 56350 58148 70751 74620 75679 40430 22266 41427 38238
8522 38238 28053 21386 29994 18759 10684 23644 52753 27347 16419 31451 23486 24435 17576
8509 17576 17032 16007 31543 51215 57487 35921 27385 25524 34899 21065 9131 -6705 8192
8496 8192 13030 10713 6630 22421 40108 59792 58652 31341 22831 32235 50149 63037 58312
8483 58312 47455 45319 36711 34075 28508 7255 7131 14662 -205 14126 22382 29854 22730 9534
8469 9534 18959 50753 47927 37614 30538 40494 28632 31059 31965 31307 23570 20683 15624 -4810
8455 -4810 -3759 6470 16842 21898 35331 4342 -4287 2379 9979 19986 41617 20033 11510
8442 11510 43074 39000 50991 52034 25942 722 19838 45633 43529 34152 19175 31107 34035
8429 34035 34661 46130 50549 37123 -11380 -8092 18451 38017 52890 47562 32086 26872 37448
8416 37448 34587 40789 42446 55181 44592 7894 -15127 -2438 452 24258 57765 68578 60365
8403 60365 47865 51055 55812 33488 24453 5604 9774 25692 21307 24257 25608 12580 13491 -873
8389 -873 3944 14080 16273 6903 5628 24675 28464 32679 43426 48922 65200 50551 33037 39130
8375 39130 63072 40592 39773 26639 22787 -3125 -1385 -12596 10843 30944 51939 39356 21684
8362 21684 11964 20212 57999 46505 15715 13390 38710 63998 63524 61284 71667 64076 67852
8349 67852 55798 48073 41204 47294 46631 33344 50488 55818 36664 39334 18113 17341 36218 85106
8335 85106 143828 182039 204242 222727 212433 213520 208686 193732 178100 146538 140542 121990
8323 121990 80854 79294 78929 64901 77589 72696 74166 89016 88972 80300 89015 97774 108323 100102
8309 100102 89252 84554 73528 53856 71579 77348 74087 96150 88291 64892 75038 91892
8297 91892 92879 77601 68446 97827 136985 140182 136351 161008 195702 256275 314729 322462 348194
8284 348194 346228 329983 316387 283393 269065 217307 177034 163721 168547 162036 149757 128546
8272 128546 98989 84022 76403 90107 98483 115131 151123 130082 115000 126025 118060 108265
8260 108265 91960 81877 70872 74121 83618 70569 70342 93536 105367 88429 65876 49629
8248 49629 57823 72805 95002 105139 128877 144990 152094 163071 196318 207993 211163 189444
8236 189444 165695 146812 141332 125430 86674 65397 64377 56640 63799 78818 88698 109506 89454
8223 89454 51655 22027 36862 41389 19295 1351 3261 9445 10437 19344 35340 70162 72278
8210 72278 54289 82274 85089 79817 59811 41039 52625 54691 39643 27886 31050 38457 43434
8197 43434 59567 64126 64827 69894 77922 88888 62800 48337 34563 26345 42650 35515 70110
8184 70110 92292 78425 73384 73356 61449 62061 74457 81715 70446 46673 28494 5642 6526 16635
8170 16635 15917 22847 7148 -7980 -10757 -7563 -2643 42186 45607 9823 -3556 -14357 9099
8157 9099 36018 36162 31866 15638 27865 23137 25357 32061 10183 31168 41204 22855 26411
8144 26411 24515 9101 -9246 -14085 23747 19785 7020 -404 -4669 -12996 -1528 21538 52009
8131 52009 60217 74416 56563 54871 56849 20502 30740 38881 38167 45484 29183 7180 47734
8118 47734 64980 49602 42277 25568 29570 43123 60261 58390 33575 46817 55691 49429 34274
8105 34274 22668 29220 11674 1633 12794 26054 29539 30876 24636 12890 9558 15991 16317
8092 16317 17325 31415 40882 55488 53211 42512 52387 57065 42995 25056 39342 46784 28444
8079 28444 39845 39466 42312 27385 28894 30864 39326 44651 33844 46796 28488 33536 31852 33273
8065 33273 56116 63764 61629 47855 52361 47792 46349 59518 48523 23955 12842 -5646 -21556
8052 -21556 4657 38759 36234 32741 41530 27573 35564 37866 11395 -16834 -16727 6983 22581
8039 22581 27532 11357 -7774 -14647 -429 14688 21177 32498 47694 51871 42906 19769 -4862
8026 -4862 -5220 -8614 -21233 -42437 -49006 -23968 -25803 -41632 -31789 -20118 -2476 -9659 -12568 -29579
8012 -29579 -36788 -21097 4494 -19451 -19278 -7203 -6175 -4309 29373 22248 5467 -3338 15636
7999 15636 19988 10738 19667 29033 59199 66703 77367 75118 59503 44764 38801 11275 -14123
7986 -14123 -38887 -46789 -53786 -35847 -27889 -25676 -15461 16761 40916 25565 19194 38574 36869
7973 36869 39727 48310 33883 40221 35124 20872 20401 21581 41450 59330 50386 27395 9435
7960 9435 -411 19541 34263 50254 42350 45553 56051 60255 62882 53423 37989 27000 30658
7947 30658 46810 64268 61975 59967 41539 37567 51528 57627 46982 46821 52658 34970 14526
7934 14526 4340 25817 38613 39722 39154 37636 18822 20577 44268 62472 59778 59770 62732 64920
7920 64920 60314 37423 8490 -2639 -7766 23907 17341 -1185 11894 39545 52789 51907 49755
7907 49755 54803 49611 34368 49344 53552 47116 46347 34165 32051 50785 58816 77039 92034
7894 92034 79463 60200 35012 11287 29234 50295 37113 414 -8908 -2548 -9607 -390 10449
7881 10449 549 -8535 -690 -1826 -2855 2777 3021 20363 21298 16671 24697 43635 57916 63078
7867 63078 49465 38970 52457 45106 28881 15388 -10522 -10496 -7241 -152 18513 15629 28869
7854 28869 34093 25775 16991 23700 33963 37542 25589 31793 16646 17574 21468 8876 24321 19336
7840 19336 2342 4127 13091 19970 16696 30240 17898 8418 18976 37737 22755 23750 20646
7827 20646 23930 26603 24516 29730 33770 48239 58830 52221 44603 37913 31938 43204 56605 61937
7813 61937 44296 53479 65453 91471 103869 103571 111942 130734 149611 167530 188696 211088 277816
7800 277816 350760 434119 531025 633613 695859 707266 706673 653910 574774 482904 399193 365058
7788 365058 332599 291048 285100 269639 220876 210046 209750 208196 161862 144369 144116 147007 149608
7775 149608 174010 168206 147315 140631 140303 132405 137569 137552 138180 157470 198842 220135 232382 243744
7761 243744 246682 251810 275814 326406 388070 487507 598417 798472 1040070 1251673 1428760
7750 1428760 1519893 1499057 1406080 1264636 1069089 907073 756364 615721 478203 366072
7740 366072 297179 273580 261560 225068 190519 181691 192103 177711 151609 156048 160020 169368
7728 169368 163897 150976 169331 165582 135639 128919 140058 135936 142736 158826 157573 185041 184829
7715 184829 173110 184621 204195 234035 261923 291137 347191 439369 518480 565861 605438 624627
7703 624627 620163 590070 510928 443252 378075 328299 280496 253844 218684 164099 131680 106572
7691 106572 93674 90968 81975 82501 70851 81454 72357 61145 47789 28193 29613 45637 48082
7678 48082 35022 41320 29542 19154 39020 55586 65197 74727 67823 62993 58308 51992 44505
7665 44505 39148 23609 11898 14526 38427 33631 24950 29283 28426 31355 24212 8646 6855 29706
7651 29706 27916 26067 36053 31800 4867 -14886 -17474 -13435 6965 22214 18073 17746 21883 41224
7637 41224 45435 40160 26832 26263 23178 2962 -5540 -25390 -25159 -12481 -4914 -5796 -355 2449
7623 2449 6483 1608 30937 58857 63705 35497 15567 12433 28557 20840 9774 15815 28356
7610 28356 31875 46295 30864 10963 3489 17940 33049 15659 -1553 -15037 -10788 -1611 -4311
7597 -4311 18961 20119 23232 16371 9184 745 10024 13033 9312 1482 8384 5085 -4133 -14211
7583 -14211 -14038 -12969 -35403 -50366 -43625 -49787 -44135 -27639 -38136 -36866 -14628 2543 23290
7570 23290 29848 15706 36893 41765 16471 3129 515 7324 16456 17409 15880 11027 34269 39450
7556 39450 15811 -7554 -5147 -18559 -21149 -17681 -9339 -18546 -21192 -22509 -41377 -37028 -30713 -8987
7542 -8987 -15954 -40111 -52590 -36926 -29560 -13426 -3796 -12345 -21073 -30549 -26130 -38058 -24960
7529 -24960 -1204 1207 10832 3596 -10348 -7375 -7036 374 726 402 6689 4847 2368 -4680 15122
7514 15122 4188 -12144 -8016 -10467 12587 15828 6537 -8809 -6302 -25487 -27773 -3090 -20812
7501 -20812 -48514 -25203 -17952 -4345 -7855 1431 8590 20300 24578 21620 13629 10121 -6675
7488 -6675 15886 33340 22073 4497 5003 2848 -13680 -21472 -21640 -4802 -4354 -3793 -2006 -10740
7474 -10740 -23519 -19362 -19419 -21657 -16008 -15291 -13632 1758 -8585 -5691 -1215 2047 9214 3599 -4360
7459 -4360 -13244 -31650 -11164 -7802 2355 13817 3028 -466 2669 -2676 10357 18178 10987
7446 10987 -3630 -32052 -29701 -10416 5926 11804 783 -3608 -11417 -1047 19347 14586 -2413
7433 -2413 11878 11130 17737 31819 2236 5558 18370 -4284 3533 -14771 -7775 1352 -7701 -1293
7419 -1293 11034 -1073 -15792 5342 33355 32770 6710 -14304 -25684 -35987 -19009 -15274 -23153
7406 -23153 -32379 -36209 -32491 -6963 656 -20117 -23659 -19797 -19141 -23114 -22951 -22716 -29981 -27255 -27111
7391 -27111 -17182 -12005 2633 8894 -11297 3509 2047 790 2824 1838 8981 23329 10078 -7285
7377 -7285 -17454 -7883 6827 -5188 -18920 -35878 -39050 -69751 -61959 -34039 -53994 -61147 -47487
7364 -47487 -55444 -26204 11702 27304 -706 -25916 -8728 24462 33034 31803 41272 36870 9601
7351 9601 -32664 -28080 3653 -2723 -22532 -10416 7655 7975 -4404 -17908 -1099 13569 11275
7338 11275 20592 31596 24364 16590 -3627 -23928 -4375 -7132 -18875 -2029 16355 14369 -8204
7325 -8204 11362 -10024 -25133 -22788 -26069 -35639 -30962 9225 21537 10960 -1495 3451 -7108
7312 -7108 -12416 -8892 -22665 -12612 -18276 -20874 -16935 5120 5891 28285 56347 59883 60930 26618
7298 26618 -6297 -24079 -16467 7204 16120 -4275 -15102 -22465 -45390 -49899 -30292 -36944 -32251
7285 -32251 -22629 -39401 -30835 -16723 -34777 -58007 -51635 -42019 -25284 -4953 4106 -3950 -8089
7272 -8089 -29222 -40998 -48926 -29401 -12054 -16113 -10082 2143 8970 712 7816 13162 3338 9727
7258 9727 15659 8275 -17906 -33754 -13310 -2879 17560 31526 48565 42577 1695 -12580 -4169
7245 -4169 -14552 -15784 -36257 -41540 -22990 -18627 -11616 -14569 -29925 -2722 17879 -63 14054
7232 14054 8623 6164 2019 -18124 -19859 -13525 -19690 -17091 9790 1078 -5235 -12596 -8462 -1477
7218 -1477 11864 13737 -5859 -12901 -24638 -20558 -5767 5868 6996 -15445 -35155 -34295 -17255
7205 -17255 868 10814 -4573 -17838 -30337 -10645 -4107 6469 30607 30063 6029 -11280 8496
7192 8496 17275 5502 2615 -8971 -28765 -51892 -40291 -20571 13550 1905 16131 26299
7180 26299 18052 29632 15892 8254 2983 -10406 -22842 -23831 -42875 -46026 -16835 332 11317
7167 11317 10541 -2064 6687 -2177 -859 8166 -12983 -20977 -31044 -35416 -6398 17128 21080 13432
7153 13432 20759 18552 23907 24510 8904 -589 -4024 -4739 -12260 -38552 -23315 5370 10435 8590
7139 8590 2814 6226 17332 22785 -4635 -15241 1285 -12171 -35050 -28423 -27988 -17478 11863
7126 11863 23407 9695 -7531 -16326 -11062 10488 8640 -19301 -23880 -29501 -21199 -6606 7062
7113 7062 6035 28961 44594 7295 -17109 -5819 -15743 -19885 -11788 -761 7726 -2364 -31267
7100 -31267 -7216 -7495 -9708 8577 12700 13201 30844 23604 1272 -25709 -16588 -8096 -22564 -35740
7086 -35740 -20139 -28200 -45354 -42685 -29582 -26086 -19032 -13499 -15305 -10450 -472 -23154 -24674 -6526
7072 -6526 8603 11723 -5287 -8585 -7359 -9781 -23228 -34498 -45820 -37892 -27138 -5807 -11025
7059 -11025 -2917 -12858 -19948 -37364 -26701 -20311 -15857 11132 18652 16353 414 -8163 -6081 -12520
7045 -12520 -43692 -37632 -6610 -9184 -26234 -6219 21714 -1089 -20163 -30692 446 18982
7033 18982 1795 -6608 1873 -357 5065 6316 -7170 -10092 -26205 -25853 -9665 -10140 -12955 -15541
7019 -15541 -5995 4547 18202 12075 -13111 -36604 -53411 -17084 15249 22401 17557 2333 -26954
7006 -26954 -20759 -13247 -25441 -24309 -23643 -31440 -57632 -43342 -31658 -28846 -31952 -10298 -9565 -11434
6992 -11434 -5738 7531 9457 -3444 -34884 -49869 -77286 -54321 -45890 -45461 -61114 -46154 -28026
6979 -28026 -5410 -1881 -28906 -33507 -9856 7533 3023 26953 34184 9836 1581 11641 -6195
6966 -6195 -18352 -1625 21678 35940 5509 11883 -4778 -14096 -11463 -26095 -33878 -52997 -65369
6953 -65369 -58468 -45355 -57498 -32574 -11907 -5732 -13814 -19437 -13860 10173 20569 12673 -5592
6940 -5592 -9074 -15289 -7822 5056 19156 14138 -11436 -33421 -40201 -19295 265 17371 26910
6927 26910 13277 7920 -5369 -6759 -23541 -14924 -9802 2842 -7900 -18653 -19937 -13184 2586
6914 2586 12536 -5605 3702 31162 32953 11108 1081 -16781 -11154 -26120 -1100 7860 -29354
6901 -29354 -40362 -6678 9941 512 2239 -8049 -29714 -15543 -1370 -8500 -9372 -8698 1274
6888 1274 26577 34659 25122 -9598 -8175 23234 23682 22941 22440 -841 -27132 -31513 -10926 -15975
6874 -15975 -20380 -16366 7166 -8184 -28831 -10894 13527 -3703 6094 -1638 -16884 -8812 -9822
6861 -9822 -13816 -10700 -19142 -12900 -6221 -12006 -9769 -18691 -30853 -4018 4867 -4545 -19170 3939
6847 3939 11344 -15051 -37960 -35693 -35938 -22902 393 -1202 -21320 -40586 -47474 -33504 -29667
6834 -29667 -34701 -41311 -41127 -49685 -37808 -15321 4535 25986 20991 3876 -15210 -39187 -52360
6821 -52360 -45494 -36692 -29853 -29917 -21405 -9393 -9976 -4861 -12768 -5779 12259 25892 33779 17523
6807 17523 -5924 -2864 6588 -17901 -7642 9145 -6245 -16643 -19642 -23540 -48490 -51187 -42360
6794 -42360 -29394 -15083 5865 14090 25100 3695 4445 -7811 -20051 -34307 -39787 -40403 -28970
6781 -28970 -17008 -10490 -18450 -10519 -13619 -19240 -9393 2860 -2653 -17179 -13247 -3154 4854 12164
6767 12164 11793 -1877 3712 -595 -7834 7063 29858 22251 14130 27369 3989 -16317 -25459
6754 -25459 -31428 -32113 -38328 -16900 -24713 -52960 -17721 950 -12179 -12045 -13104 -11708 5868 -15529
6740 -15529 -21766 -11675 -15733 -40071 -41086 -25373 -2218 6565 427 -19107 -9264 11594 53682
6727 53682 46178 42525 38092 21873 27557 57681 73184 53170 42528 33804 26125 23375 24624
6714 24624 30378 19056 24840 25720 37495 21460 -12292 5788 14941 5537 -4452 -8008 -23508
6701 -23508 -31521 -28440 -50828 -47692 -32082 -26576 -18905 -12701 -9194 4213 -10957 -43564 -45802
6688 -45802 -45943 -42269 -30285 -6893 19899 11133 -3774 -34899 -47088 -65288 -50089 -26506 -30445
6675 -30445 -32042 -32549 -32638 -27141 -38827 -41843 -46361 -26603 -21675 -33616 -11883 -9877 -384 2562
6661 2562 -15463 -28727 -25190 -2568 4453 -9392 4085 17970 19982 23604 23159 8893 3530
6648 3530 -24132 -23341 -2358 -16613 -7058 13657 19617 -6330 -19023 -22157 -9527 -21919 -31584
6635 -31584 -12809 -18973 -7541 -2643 -25053 -25756 -6334 10948 14070 7615 -12474 -12877 -14035 -13967
6621 -13967 -17870 -15125 -990 -3259 -18625 -42368 -46809 -18546 -17170 -22247 -25175 -22542 -16328 -372
6607 -372 7695 -22496 -52580 -27343 8793 19421 22157 7694 -16441 -38736 -51476 -57508 -46410
6594 -46410 -25177 -11125 -13440 -9155 9254 8 16 -105 -13924 -21087 -29153 -30983 -31003 -9430 -11037
6579 -11037 -32391 -45712 -50559 -23020 -1043 -15249 -22894 -13709 -18170 -10123 -283 458 -11197
6566 -11197 -14883 4235 7774 -9121 -40017 -26723 -33638 -32956 -8940 10900 1707 -28623 -33816
6553 -33816 -21834 -28753 -33772 -40063 -44073 -56882 -45081 -25123 -19538 -27242 -32266 -37705 -36038 -13841
6539 -13841 28129 37199 15937 -236 3075 11550 1573 -8173 -9090 6796 11471 -6307 -14881 -7087
6525 -7087 3640 -6926 -35817 -51637 -30904 -17756 -6380 -17645 -14174 -5852 -4544 -13878 -8135
6512 -8135 7426 11157 1860 -5393 -991 -4406 -13223 -14117 -27937 -17936 9864 33324 24638 9269
6498 9269 -5016 -34166 -31882 -21080 6196 21765 6152 -14788 -29296 -42523 -52096 -35090
6486 -35090 -8757 -10047 -5126 4007 -8651 -8055 7157 -152 -23780 -10438 3023 -5253 -1434
6473 -1434 -8386 -6093 1353 12016 32378 33071 4447 -8088 -7525 -25846 -43907 -32009 -7096
6460 -7096 4880 2737 13973 4796 -12893 -32778 1716 3367 -7572 -14937 -26220 -28673 -14498
6447 -14498 -13200 1738 10154 -3937 -14594 -14830 -23804 -13794 -12643 3260 13918 9597 -89
6434 -89 -23253 3626 21221 19430 18540 15551 26132 10305 162 -5220 14324 8617 -1883 -8576
6420 -8576 -6005 21804 12053 -4180 -28674 -13304 23273 22872 19219 -5913 -14092 1384 12626
6407 12626 8126 19254 21608 4256 -18316 -13397 -23767 -11284 -6064 -25015 -35849 -35568 -34993
6394 -34993 -24629 -25283 -26853 -22155 -28657 -32902 -47132 -40835 -28299 -13549 -7560 -30902 -33698 -24505
6380 -24505 -7624 11160 13259 6300 1081 -13937 -22986 -28053 -24697 -6100 17840 1068 -19960
6367 -19960 -26569 -23596 -38185 -40355 -18125 -23578 -34971 -40899 -24955 -2021 17042 -6481 -739
6354 -739 27277 41849 24335 -20831 -29045 -36195 -39374 -42197 -43685 -30262 -24198 -35082 -46301
6341 -46301 -18858 -5604 -22037 -35188 -58497 -37463 -7719 -2578 -13096 -27372 -18014 7782
6329 7782 7169 -25958 -17373 -4255 908 14182 -7522 -2905 3126 -3478 -4186 3060 -315 4224
6315 4224 11433 4182 17794 9377 -7154 -15419 -16267 -5058 4306 -22883 -23874 11989 15115 18806
6301 18806 23180 6067 -1490 8346 14479 24180 -5669 -20332 -24480 -15374 -12756 -16588 -17313 -1563
6287 -1563 8336 18683 -6893 -25965 -18195 -13155 -9852 -28474 -25506 -24095 -12219 -22140 -17241 -4978
6273 -4978 -27645 -12878 -3251 -10985 -15280 -2976 -10195 2137 -5414 -14266 -7826 6888 -9356
6260 -9356 -22171 -16976 -8433 -47824 -66418 -50538 -43386 -32049 -7938 -3078 -7144 -2621 -14346
6247 -14346 -40295 -34465 -37560 -14568 7387 -12088 -11031 -12202 -40028 -55241 -63361 -32549 -4551
6234 -4551 1544 4332 26176 20972 17581 12251 -450 -15928 -2723 24302 3243 -22765 -42453
6221 -42453 -26820 -9103 -12115 -21695 -16494 -25004 -17526 8526 10065 13278 -1627 4651 26906
6208 26906 24998 35063 22494 -6174 -16206 -42378 -34260 -1807 18731 10161 -4771 -4741 -11454
6195 -11454 -19057 -17634 -12986 14270 27030 36710 28472 13764 9459 8031 10791 8883 -1987 -4528
6181 -4528 873 -336 -12283 -895 -21368 -24209 -12408 -21763 -10489 4603 394 -16844 -14944
6168 -14944 -20662 -41660 -55842 -30238 -11669 -12176 -21337 -21478 -18410 -3980 417 12271 -5107
6155 -5107 -15763 -28597 -26142 -36230 -33910 -25337 -16007 -3902 4005 1512 16881 4540 13567
6142 13567 2649 -26222 -26929 -27386 -25474 -17521 -676 -6052 -28980 -30087 -14145 -13608 -18192 -23028
6128 -23028 -11198 -6375 -4666 12024 24599 14647 -23859 -38772 -40803 -8347 978 -8296 -4982
6115 -4982 -15551 -16494 7403 31182 38208 44257 28920 5726 8443 4063 22729 40837 25111
6102 25111 -2745 -28016 -22263 -33465 -26211 -20074 -21077 -18604 -5073 -18308 -46040 -36437 -26759
6089 -26759 -22330 -23438 -28625 -22262 -23325 -22545 -4188 -2562 -5573 -13589 -29935 -25385 -6165 -2728
6075 -2728 -15796 -296 -6789 -25362 -17912 -14139 -17157 9591 14904 -2434 809 -9901 -8427
6062 -8427 -25382 -16280 704 -6 -15980 -7975 -9412 -1512 774 7272 3973 -28118 -25947 -24192
6048 -24192 -27146 -26332 -9287 -2708 14402 8559 -4891 -161 -19107 -19530 -27836 -24134 -8002 -14318
6034 -14318 -27129 -18064 -26625 -14475 -15354 -23480 -28487 -14678 -4503 -11176 -11430 -6876 -6486 -12413
6020 -12413 2333 -6935 -20942 -11404 -5472 -3740 -15590 -22159 -12859 -5339 18980 5728 -917
6007 -917 13157 26439 -991 -14190 -33476 -20229 -12275 -23486 -39715 -47538 -8483 952 -3247
5994 -3247 -1881 -3126 6557 6021 13126 -13854 -29076 -37721 -26463 -21488 -22662 -21142 -17226 -22972
5980 -22972 -8844 -5604 12752 29496 16250 -1639 -7599 -2410 -18210 -3102 -10592 -21252 -31911
5967 -31911 -32758 -12579 -783 12119 17175 -7528 -20676 -25559 -6216 -1455 -5605 3072 625
5954 625 -12653 -12107 -13036 -4922 -10448 -5724 -2640 -18845 -31813 -41294 -44961 -34257 -23189 -13524
5940 -13524 -12023 -13899 -16393 -14917 -11274 -7414 -608 -811 -5798 693 16675 20602 7641 4087
5926 4087 25943 -6497 -13727 -27158 -12682 -1326 2880 1618 29091 28436 17368 23926 34207
5913 34207 38387 44688 36621 12730 2027 -723 -18331 -7709 -1473 -15574 -9946 12808 -92
5900 -92 1808 -3153 -630 -36123 -34535 -20526 -10757 -12305 -9213 -14339 -44751 -63641 -47727 -23468
5886 -23468 -3127 -16385 -25223 -19809 -16123 7967 23629 8957 3669 -2001 4101 145 14153
5873 14153 26811 19029 25082 19702 17401 22828 23189 2709 3654 -3593 -17938 -37301 -42752 -23711
5859 -23711 -6941 4776 7160 -3868 10877 27851 37369 20226 10297 6542 900 -9052 -42040
5846 -42040 -49070 -15375 -11999 -24912 -30914 -27145 -10521 -9537 -8737 6466 2807 -27105 -36333 -50755
5832 -50755 -39738 -35204 -55604 -44307 -34463 -33572 -28886 -16439 -24721 -12688 -399 -12915 -8157
5819 -8157 7502 6873 203 -8677 -24820 -38878 -37129 -32821 -29529 -20928 -22236 -26277 -32298 -10848
5805 -10848 19302 27101 10272 -10106 -11506 -36207 -33726 -40407 -45420 -31225 -2418 -8579 -18830
5792 -18830 -17484 -10463 -9233 -18463 -2317 4058 18805 38082 24242 13622 395 6846 554
5779 554 -10528 -46880 -38030 -20016 -16987 -15337 -32268 -39466 -30810 -28570 -41270 -43635 -35563 -25362
5765 -25362 -14066 329 -7864 -14561 -27140 -19412 -16629 -11413 -12745 -5985 20459 17255 -2017
5752 -2017 -15569 -8578 8056 19094 23246 581 -37014 -51177 -21367 -19978 -14817 -19738 -27789
5739 -27789 -16054 -18471 5127 -14668 -38887 -42102 -23164 -22940 -31109 -19956 -25667 -56435 -50259
5726 -50259 -31650 -53420 -50916 -46949 -41890 -20317 3864 -1556 -14731 -10195 -6978 -7068 -23579 -32766
5712 -32766 -21284 -17908 -11577 -2339 12628 27794 22712 -2209 -4811 6382 -12962 -38624 -20815
5699 -20815 24650 18164 -11539 -8906 -6938 -10707 -40157 -49503 -18809 -7365 -12695 7560 7690
5686 7690 20785 15180 21246 30048 587 -26641 -52939 -44278 -3712 7616 14360 14644 26122
5673 26122 23451 20735 40428 19498 19543 15276 -6325 -3495 15913 24544 4855 -15404 -23766 -18196
5659 -18196 -2488 2203 -1307 3068 -3004 -11052 -7092 -1189 -2523 -22753 -24443 8563 30075 16973
5645 16973 10898 6005 1836 -14572 -10503 -9748 -2410 11849 16650 12989 6026 -1122 -5076 -8949
5631 -8949 -7140 -17049 -8238 -13316 -24768 -28259 -23691 1122 -5574 186 5976 -18475 -46878 -39684
5617 -39684 -5325 15340 9553 6729 -12764 -26892 -19209 -25628 -14430 -20103 -48447 -37940 -7527
5604 -7527 1493 10258 9579 18537 5976 15889 8314 -13278 -2164 -7860 -7316 -5813 -14707 -30588
5590 -30588 -39588 -38613 -41001 -21143 17439 28072 19930 -10675 -26956 -27569 -26797 -19077 -21454 -20918
5576 -20918 3210 5740 2447 20524 15302 -77 5336 -13752 -12704 3647 -1980 -28293 -30473
5563 -30473 -7918 -2971 -5094 -32894 -23820 -13012 -24242 -17157 -12207 7291 21203 28028 25705
5550 25705 13198 12245 20451 20867 -14751 -17678 25007 1256 -3489 -6227 -21086 15325 21003 20435
5536 20435 -8289 -21169 -16967 -11247 2570 1540 -3210 7374 -30 -11447 -1815 9993 -13
5523 -13 -33490 -28926 1982 -16671 -30540 -36710 -46813 -40383 -23302 -22198 -16751 -6761 3687 9286
5509 9286 1643 -9265 -16539 -16191 -631 6273 4243 9355 8899 13182 13377 5624 -23288 -47927 -33551
5494 -33551 -16069 -16252 -33726 -37729 -27516 -19218 -23234 -34057 -19375 -10401 -13151 5861 -789
5481 -789 -9460 -86 -14904 -19459 -14353 -13090 -21365 -22186 -19011 -19821 -19530 -2051 613 10775 -9548
5466 -9548 -9815 -2508 24788 27991 832 -38058 -31642 2171 19061 -18850 -28855 -32403 -47694
5453 -47694 -42398 -19826 -12127 -11297 -9972 -6833 14348 10620 -4645 -11937 -23565 -4089 -17552
5440 -17552 -1642 19575 1470 -2396 15758 31270 13616 -6731 -8466 6155 7979 -8884
5428 -8884 -26571 -42216 -31655 -2650 -19 3160 -6841 17403 20566 17957 34436 33131 -2846
5415 -2846 -19614 -19699 -18773 -5482 -4739 -22393 -41311 -38826 -32652 -29928 -35219 -38149 -29455 -11425 -5423
5400 -5423 26853 31821 23636 2615 13802 21767 9030 -23226 -24037 -13472 18936 45611 31183
5387 31183 -15416 -3808 9006 -27533 -29414 -30796 -35577 -40888 -19339 22344 15602 7741 1716
5374 1716 -1092 -6939 -7465 -4631 -3125 17688 7502 -3754 2164 -4445 -2331 2617 -3189 1584
5360 1584 1045 -15388 -27519 -11346 -75 -6459 7336 18961 11335 -616 -3140 -9630 -5357
5347 -5357 -5001 -8607 -11329 -28318 -25098 -24629 -36730 -25160 -14462 -14508 -25492 -26910 -21039 -32095
5333 -32095 -37595 -45052 -42976 -42219 -48672 -43628 -36053 -47160 -53756 -41451 -3981 23623 24289 -10368
5319 -10368 -34267 -21948 -31267 -29427 -31123 -34463 -35350 -49912 -43536 -28542 -5473 12683 9939
5306 9939 -5373 -32000 -50570 -22156 28425 48723 1076 -33792 -21304 7025 11164 5006
5294 5006 4072 10274 26564 9934 -593 25913 40311 19006 28904 25526 39352 33884 17131
5281 17131 14790 27989 1815 -14893 -6334 8125 12022 9071 -2361 -16346 -22306 -32396 -21521
5268 -21521 2095 -6708 -21359 -28167 -12457 15168 -13210 -39284 -36962 -17377 8653 15145 17540
5255 17540 41665 58830 43847 28000 575 -17535 -15004 -1366 5767 4954 9919 26415 32591
5242 32591 8036 619 9981 6373 -26445 -38946 -53743 -40725 -42723 -44236 -39769 -33123 -14163
5229 -14163 -2462 9529 16638 -10836 -7315 -1175 -7356 18711 28029 15171 -4096 -1096 -10195
5216 -10195 -24751 -24156 11273 -5792 -18329 -20987 9972 19913 -5908 -26132 -10734 23633 20585
5203 20585 -1392 -6965 9661 -11561 -17176 -42544 -59466 -49876 -16452 -9541 -11617 -28058 -22526
5190 -22526 -14955 -9915 -11158 -10385 -13164 -9818 18619 45528 28309 7528 -2834 -22121 -40918
5177 -40918 -26945 -9329 3413 5096 9474 14345 -4763 -7968 -2354 6795 -1190 -7021 -14728 -14174
5163 -14174 6573 8306 18990 15948 -10557 -1416 -13430 -13857 -841 -23315 -42051 -39186 -32715
5150 -32715 -3819 9941 5060 22719 34035 34859 20740 -827 -4270 4799 5506 -3404 -18577
5137 -18577 -29793 -20656 12741 39852 52423 33910 14033 5136 -15621 -19145 -12845 -10707 -7400
5124 -7400 -20269 -969 540 -9044 -8839 -21231 -17463 -10458 -10968 2781 -2496 -1637 13970 43448
5110 43448 34035 8091 -11936 -12076 -29533 -30179 -46510 -28254 -12281 -18226 -7377 -9717 2963
5097 2963 -24061 -49304 -45793 -39249 -59194 -64611 -51117 -32393 -17903 -25751 -15377 -26288 -28026
5084 -28026 -3850 -19314 -46013 -49536 -31528 4747 -17595 -861 3208 -10838 -10346 -19472 -17668
5071 -17668 -19239 -5710 -1114 -2488 12164 12468 14144 23472 4355 -8814 -23732 -15232 -28305
5058 -28305 -41757 -20354 736 -4235 -252 24971 19541 27505 55757 52955 31534 31548 35328 29916
5044 29916 14663 1766 -10946 -12095 -10477 -13549 -28873 -39081 -47121 -28509 -676 13601 9542
5031 9542 390 14715 21515 7519 867 -601 -3711 -11386 1754 14423 22084 14365 -435 2616
5017 2616 3094 490 5998 15711 13398 8469 3448 20475 35878 13954 -2180 -3128 -9261 22328
5003 22328 45201 49475 52673 36111 17942 12161 -3409 -23741 -10906 16833 33132 42688 48090
4990 48090 50539 45856 32481 12068 -14625 -8006 -11058 -302 -18654 -41178 -32071 -20664 -24349
4977 -24349 -22680 -7824 11108 48899 70054 54195 41040 7030 5530 3413 -6835 -26787
4965 -26787 -26825 -28448 -30646 -6991 -5296 -16678 -17841 6527 -8442 -10411 6753 8482 16949 -5807
4951 -5807 -60066 -49844 -22095 -15618 -37313 -46770 -31207 -40820 -48375 -20793 -5754 -26854 -26680
4938 -26680 -25927 -43136 -45221 -43090 -14988 296 4038 -1313 -8139 3468 7675 -7605 -18481
4925 -18481 23 12425 57507 60706 12485 -4224 13532 6669 31732 24662 3638 2891 -11110
4912 -11110 -17840 -15118 -20186 -27655 -36680 -42017 -64707 -59430 -15648 7391 4844 -2720 -19290 -21098
4898 -21098 -17134 -13437 -18051 -4988 -16742 -22236 -30809 -36180 -21176 -9897 -3981 -15945 -17278
4885 -17278 -2394 -1721 6190 -21433 -29651 -15690 -24469 -42321 -45841 -38553 -18768 -5367 7401
4872 7401 3435 7800 5492 -968 -39352 -51537 -52967 -36401 -43868 -46707 -22815 2455 11145 1116
4858 1116 -1316 -21679 -28382 -19486 -26160 -42948 -44823 -22857 -20556 -25884 -28117 -21067 -21825 -12798
4844 -12798 3518 13511 9436 -13873 -21659 1416 11013 7105 23636 9492 -24866 -23169 -26410
4831 -26410 -1775 16702 17422 33579 22647 12333 18448 21557 3741 13689 23195 17557 22011
4818 22011 -12125 -34554 -39056 -42126 -40285 -25981 -4621 -4209 -20300 -19117 -13515 -19562 -28750 -19019
4804 -19019 -19574 -21273 -13753 -25632 -40029 -43421 -17750 -3635 2522 14234 18734 152 14525
4791 14525 1380 -14367 -11413 -11911 3059 -1001 -13846 -12265 -10796 -7408 -7036 -11137 15663 10719
4777 10719 15253 13451 4533 -28545 -30894 -38308 -29924 -35420 -10537 21273 38768 7217 9995
4764 9995 2151 -20838 -6294 12212 -4259 -10317 1268 -18350 -15110 -100 21208 7207 14616
4751 14616 8956 16456 40698 25580 29372 39740 22968 6307 -12899 -6246 -12434 -15762 -19096
4738 -19096 -2400 15022 26541 8295 -19642 -28954 -19354 -6213 5397 -6065 -15580 -9550 -18819
4725 -18819 -16089 8198 10152 3416 -3854 -13080 -16252 -19593 -31760 -29601 -20193 -15634 -1215 -23483
4711 -23483 -32075 -53403 -53770 -55381 -50405 -36120 -15873 4371 11063 4241 2657 -20295 -19912 -9362
4697 -9362 -8236 -15137 -11976 -13423 -15469 -12208 3508 6819 3537 11086 22551 37970 53296 30830
4683 30830 15138 23429 16776 13209 6250 1004 10464 29501 30781 22558 38831 46282 27314 25434
4669 25434 37224 41227 40337 43843 44643 20363 3878 11480 5177 -3933 -10981 -10477 -16744 -27467
4655 -27467 -17450 -13406 -13968 4907 22012 27104 16130 -10018 -3562 2147 -13006 -12533 -1738
4642 -1738 -3365 8614 26905 9310 16990 36971 43936 9852 18408 38466 23355 -3289 -22410
4629 -22410 -9824 -6252 -7923 -2732 12493 14000 10030 17091 1911 3322 23738 16963 16946 3586
4615 3586 4121 -11374 -13142 -13568 -18843 -22005 -32635 -10571 17242 -4565 -28760 -15009 7382
4602 7382 2115 4454 -5858 -17006 -21930 -41123 -45664 -26975 2207 -13315 -8245 12068 -4299
4589 -4299 4876 -19823 -34670 -52595 -55613 -29483 -15563 4012 7940 10367 -8924 -18100 -24805
4576 -24805 -27231 -10712 16006 35927 32041 18355 6396 -12352 -28724 -33814 -46742 -49659 -33880
4563 -33880 -8193 -12205 -36426 -39236 -28616 -46258 -44614 -46612 -25648 -14023 4892 15926 22102
4550 22102 20577 7864 13330 11524 -792 5085 -7825 -41172 -47295 -41956 -14805 8820 35920
4537 35920 27255 31392 22454 21951 15835 27456 32585 18667 23027 35884 20766 -53 -4655 -10490
4523 -10490 -3419 -5428 -18044 -30779 -42402 -58588 -43805 -27218 -15726 -21507 -28302 -3309 9019
4510 9019 2091 458 3743 5931 2771 -1680 -272 -9465 998 9573 22067 26049 31508 16069
4496 16069 -4541 -27636 -32467 -13110 -26626 -33070 -13440 7486 -16163 -24040 -10649 -2396 -4833
4483 -4833 -2833 8512 -14094 -49783 -48717 -42084 -47272 -43778 -24779 -16699 -37272 -42104 -22270
4470 -22270 -1862 8733 11875 12496 9673 16268 14943 9901 14853 14625 9241 11219 8118 -6282
4456 -6282 -15378 453 -11049 -19190 -24251 -8089 -8516 5322 8861 -10137 -30188 -36024 -28085 -7248
4442 -7248 -3576 7151 2675 -13763 -3163 14632 18466 20615 20359 11952 9672 3221 -6732 -8926
4428 -8926 17975 15054 13085 47335 25009 7435 10565 43 10396 10977 3648 -15288 -32880
4415 -32880 -12595 5124 -10862 -19698 -30053 -21974 -13028 -18519 -20115 -33834 -38219 -33681 -40283
4402 -40283 -38807 -35416 -54347 -39097 -11385 19229 15247 -109 -6547 6758 35647 17648 738
4389 738 768 7856 -5771 -10140 -2710 -2238 -11578 -11784 5015 18969 49215 48720 15558 13279 -3776
4374 -3776 -8224 -7380 -7404 -4103 3472 14487 20103 21899 9350 -18002 -6759 -8625 65 -2164 -6989
4359 -6989 -289 2999 28697 46184 33339 24881 4994 -10377 -15528 -6848 -7095 -30869 -26019 3647
4345 3647 9520 48 -5060 417 -2314 -15640 -18225 -21258 -37240 -36058 -15836 -3457 1587 2909
4331 2909 -3736 -4024 10877 14370 33290 30725 14341 -8559 -21620 -14264 -15493 -18316 -35678 -48428
4317 -48428 -18288 36664 28502 -6735 -2437 10450 5070 -8434 -8440 -4486 -1627 -11585 -19173 -16905
4303 -16905 -6601 4398 12957 20159 28445 22659 22110 40161 37359 43295 43831 21966 27945 25238
4289 25238 17375 22015 19542 19446 4842 -7375 13670 18317 19309 20263 26344 12984 4052 27029
4275 27029 9145 -14077 -15259 -2967 894 1100 27668 36561 13564 21390 38596 35956 31620
4262 31620 -726 -5186 14706 27113 21480 -7008 10775 1148 -13000 -10205 -16435 -10563 721
4249 721 -17614 -28428 -30473 -23001 -5793 16359 35890 27925 36530 37636 17256 7647 -832 18065
4235 18065 8608 -1251 -9650 -17108 -11986 -4344 13747 15234 23750 18473 19964 28500 29853 24063
4221 24063 13409 1017 5457 23633 43808 19736 9134 -9956 -17882 -2718 -256 -4735 -23142
4208 -23142 -42435 -34368 -12275 -2125 -1001 -6372 -30300 -30824 -22027 -3017 6469 16205 7666 -1436
4194 -1436 10643 13243 7696 -19380 -26869 -14946 5259 7783 10163 5947 -6016 -7048 -10107 -17899
4180 -17899 -6732 10081 -4191 -10514 -14626 -16451 -2335 10297 -11558 -23707 -27617 -34878 -31570
4167 -31570 -37400 -26166 -13920 -7120 -30290 -25956 -24423 -25452 -9734 -2629 -26700 -42277 -37320
4154 -37320 -26701 -174 -2842 -9677 -19007 -4647 -5807 3680 25272 17472 5757 4495 -6537
4141 -6537 -20456 1971 26983 29271 14816 -3791 -10470 -4215 -13141 -29741 -41529 -48134 -25204
4128 -25204 -780 19663 12501 -3466 16740 9110 2489 6575 1011 12334 12142 17410 11480 -15230
4114 -15230 -17709 -31746 -43255 -33320 -16992 -4647 -3384 15775 14744 -34982 -37853 -12989 -9148
4101 -9148 2159 12635 3287 -8057 -16725 -10338 -13953 -32717 -48370 -30406 -19317 -10321 9455
4088 9455 13817 35698 25527 24821 14637 11770 -6584 -5881 9852 18779 -2977 -23015 -26608 -37596
4074 -37596 -59433 -53683 -58533 -73622 -74967 -63120 -64808 -66010 -42704 -28344 -22105 -20898 -17732
4061 -17732 -4385 -20924 -38927 -22056 -1166 12587 8391 -10625 -3775 2438 -9713 -6871 1104
4048 1104 -21969 -31172 -25158 -33679 -40200 -28605 5255 -4902 -19354 -20800 -11085 4938 1672
4035 1672 -1907 -9069 -22048 -41035 -21711 12157 22999 4833 21490 17385 14683 13289 5459
4022 5459 -4914 -9749 -17717 -23732 -20108 -6206 -2675 8376 -3884 -4137 1822 -21942 -27185 -5375
4008 -5375 11023 -5457 -11968 -15329 -12539 2747 4625 -10534 -19868 -9336 2606 9249 28942
3995 28942 27695 20383 2359 18438 28392 21103 30371 11645 4514 -6260 -24012 -30360 -14276
3982 -14276 9708 13089 35338 45893 29545 1166 -15700 -22727 -13203 3267 2648 -14417 -19425
3969 -19425 -22143 -18552 -16570 -6096 -14440 -16020 -31609 -37575 -23442 -16838 -9271 -10640 -29774 -35035
3955 -35035 -36477 -51910 -32245 -15627 -18293 -10701 -30060 -30975 -38910 -54294 -62645 -64396 -43056
3942 -43056 -16640 14383 24359 4439 -18121 -33753 -31613 -21253 -11661 9576 23336 23997 18901
3929 18901 23191 607 5377 11251 6951 12992 10657 7943 20052 19963 24593 22216 16971 22774 20816
3914 20816 5712 14925 5827 9063 -15205 -6990 6883 28631 51726 56902 26909 26210 9457
3901 9457 7039 10039 -6030 -13016 -10266 -9695 -4209 -17875 -32143 -30701 -31335 -35140 -29270 -2152
3887 -2152 10115 499 -11632 -15185 -13886 -6931 6527 565 3486 -3583 6508 -13525 -6656 4727
3873 4727 22066 21408 4136 -903 15529 12968 8648 17561 20436 -183 488 -13601 -5918 -6689
3859 -6689 -26720 -55256 -37609 17169 8837 13571 6347 -2842 -3616 -12728 -14721 454 4155 -2288
3845 -2288 14956 18705 11628 5449 9240 6734 27398 22709 -9511 -32339 -15227 19546 13571
3832 13571 7052 2072 -11056 -43615 -58072 -45283 -29903 2527 43109 48655 58224 85565 67190
3819 67190 29009 15125 12584 -1961 13138 10791 2013 -26479 -18631 14056 24075 22866 11095
3806 11095 26310 9727 6947 13327 15174 10135 -5846 -24675 -2859 -4393 -22883 -30818 -22835
3793 -22835 -24356 -7504 10566 -4975 -8302 1836 17101 -11287 -25410 -47482 -55817 -59872 -29779
3780 -29779 -23195 -44755 -33147 -20697 -18794 -24314 -14 11366 697 -16077 -28658 -32741 -27005
3767 -27005 -9326 -6685 -25443 -20764 -22488 -38366 -22375 -18717 -19912 -31084 -9932 4241 13554
3754 13554 37469 14516 6277 14837 26077 12228 -14143 -9459 -9034 -8777 -30105 -30769 -28640 -16172
3740 -16172 25185 15783 -16918 -28915 -22254 -16184 -14018 -32171 -24943 4062 -7015 -19482 -17275
3727 -17275 -14354 19805 36694 47334 54744 20007 21752 19605 -1950 -6827 1671 23878 30019
3714 30019 24287 19718 -1404 -17215 -10120 10450 3174 11506 26967 26918 16379 19148 12882 36210
3700 36210 15495 7315 9904 10796 26923 29713 32743 44768 16114 -4968 -38869 -45455 -44307
3687 -44307 -38867 -15027 11581 16515 -2472 -24854 -21972 -14832 6667 26291 25521 -3414 -25009
3674 -25009 -10357 9833 5686 12335 35078 22879 12844 34620 40213 15499 16156 21812 -7460
3661 -7460 -27532 1866 9863 15223 27635 7538 -1158 18579 19311 12373 9748 2727 -19613 -32779
3647 -32779 -19999 7391 6906 158 9998 27416 7386 -2117 15049 2863 965 -16081 -22305
3634 -22305 -22518 -2230 19052 28493 14275 -3087 -19732 -4752 9229 -20623 -35168 -224
3622 -224 18081 19751 10408 9965 17207 15018 -1244 -10913 6349 20987 6865 6705 -6644 -8881
3608 -8881 -26332 -31152 -6069 19631 13088 8871 -9996 -12808 1069 -16417 -36819 -44972 -34972
3595 -34972 -23708 -12835 -7717 -9259 -24324 -38388 -23001 -6712 -4157 -7749 5055 11179 11505
3582 11505 -8161 -11332 -39335 -29439 9452 16734 1128 -20220 -40023 -5400 9440 1800 -10571
3569 -10571 -29388 -51755 -58677 -35805 -10687 5577 -5284 -6757 -31550 -25968 -5793 14631
3557 14631 8489 -3247 -10036 -4410 -354 16465 20938 14702 13145 9778 8801 5163 9271 12647
3543 12647 13167 -14797 -16773 3039 25045 22612 16814 -3222 3482 13208 -2161 -18736 -27331
3530 -27331 -30843 -41703 -28968 -15895 -28075 -36147 -15476 8467 20835 1844 7074 18372
3518 18372 15196 9006 1924 3369 -6090 -27499 -20260 -7852 -11898 12922 -8570 -34542 -34914 -37677
3504 -37677 -49319 -40581 -7460 12091 -863 -26628 -11587 8630 4247 12956 11162 -3969 6761
3491 6761 12739 6625 25650 21808 15423 20863 14604 -7523 -28280 -5087 -96 6843 9210 -3062
3477 -3062 -10956 -275 8992 -7773 -19804 -17081 -6270 7314 23809 13931 -624 8740 12687
3464 12687 4138 6463 11951 -12744 -25700 -18315 -8766 -9487 -4506 -953 6750 36707 43178 37943
3450 37943 39436 18502 7603 39160 43315 29635 -13039 -49260 -60720 -57097 -30800 -29874 -22345
3437 -22345 -14889 4996 25108 19959 -4722 -9346 -19855 -30474 -26350 -21904 -12126 -3371 -5748
3424 -5748 -18490 -16320 -19789 -28019 -30152 -16004 -4519 13379 22855 18784 13205 15528 31668 36960
3410 36960 31570 -6393 -18851 -20151 -3542 16367 44723 27421 11926 39562 31672 18057
3398 18057 22550 27116 16097 5026 17026 13601 3611 -21410 -32532 -21890 -14802 -30448 -35774
3385 -35774 -39804 -31233 -55532 -57868 -18845 11308 -4324 -31287 -4818 -2818 -10609 -28451 -34307
3372 -34307 -16843 -9354 -7041 -31536 -29199 -19768 -23841 -17167 6125 21769 5440 -2641 1203
3359 1203 -12287 -25423 -9053 7739 -1016 4306 -2641 -24406 -18313 -21401 -7546 8162 -674
3346 -674 3581 -1954 9616 19523 31246 26937 3145 -2876 11157 10280 17389 8550 -12113 -8300
3332 -8300 -10308 -11160 -18740 -21264 -3440 1486 -4556 -5358 -5378 9443 30810 23358 22926 19055 -14259
3317 -14259 -31398 -13039 -18806 -14339 3933 5548 -22417 -33599 -55039 -45696 -26643 11549 26230
3304 26230 7342 12122 11433 -4232 -4724 -3543 17211 11675 3578 -6043 14613 24669 9636 6789
3290 6789 5152 37636 48543 40537 21258 16316 34145 50150 54481 32512 18742 26496 10996
3277 10996 -334 -9278 -10947 -3970 -4834 -43199 -26773 -31550 -34514 -36795 -29409 -21718 -13132 -13670
3263 -13670 -8663 -11372 3569 23179 27223 26191 10275 1485 -13093 -290 1574 10201 21794
3250 21794 35147 24082 16049 4878 -7324 -21362 -12635 -12182 -27584 -30321 -36251 -39188 -37219
3237 -37219 -13027 -15678 -16076 -4018 -1383 -9854 1621 -283 -9236 -14499 -12146 -12881 -3168 21634
3223 21634 11883 21065 22377 24884 30657 23404 12933 13501 -2542 -18688 -16995 -9688 -8175 -6166
3209 -6166 9099 5257 13548 5661 2990 -12756 -4342 21006 2205 -10535 -3023 -17440 -16922 -36743
3195 -36743 -6523 11546 -2913 -7189 1259 -19984 -5976 25580 22360 18506 3428 15645 23914
3182 23914 21456 15690 4915 7184 3689 11685 5643 8971 20800 9016 658 28604 33299 16757
3168 16757 16993 47711 25821 4549 -6444 -13251 -14837 11118 18042 -6127 -23430 -14214 4555
3155 4555 466 -9262 9003 18235 12811 -609 -19586 -18478 -10271 -1339 12546 25819 4034
3142 4034 -5516 5160 4512 -7901 -25814 -43469 -24677 -11189 -11277 1879 -12581 -36205 -36654 -24655
3128 -24655 -2013 38 9043 32571 27532 -2039 -18957 -24363 -15550 -32508 -56493 -20762 -7281
3115 -7281 -31476 -38605 -37162 -20677 -11116 -17060 -22623 -26870 -14592 -30710 -30399 -19710 982 -9666
3101 -9666 -32607 -39913 -24685 23 22884 43655 45847 27897 -5085 -24125 -19007 -4898 12350
3088 12350 15698 27351 36995 41204 26965 -192 678 2407 -6841 -13644 -6014 -24878 -44000 -30949
3074 -30949 -27505 -18977 -13872 -19259 -45866 -63429 -39309 -20961 -21406 -19017 -17708 -19065 -13771 -20770
3060 -20770 -25135 -12530 -4418 -9931 -23095 -43392 -45491 -38409 -10053 4975 -969 5410 -9413
3047 -9413 -25816 -14777 10294 3837 1428 -7504 1640 23052 11792 -11688 -30128 -52989 -13012
3034 -13012 9118 -6657 -5130 2548 -12098 -14606 -17316 -21861 1556 2996 -24336 -13960 591
3021 591 13821 -6183 -35038 -22336 -6026 11569 16414 14558 -5266 -24638 -8269 -21828 -22542
3008 -22542 7101 -14588 -58884 -59194 -57355 -20098 9169 3837 -2178 4758 2450 -7332 12633
2995 12633 2061 -5289 15940 13722 8345 33132 26793 12444 32429 37101 32164 28389 16684
2982 16684 24881 10490 -9133 -16513 -18474 -20556 -2923 29043 41805 34099 -5238 -9922 -24293
2969 -24293 -28352 -32558 -36715 -16081 -18232 -10360 568 -9591 -23029 -27539 -31314 -14602 -14856 -4132
2955 -4132 -16107 -25298 -27066 -13959 -2271 30234 15640 -4980 9542 7923 10132 19325 11558
2942 11558 9526 5257 4733 -3386 -3463 20871 32485 38446 8144 -4965 4441 25343 25164 28659
2928 28659 23224 10316 -1346 1954 15839 7271 -5111 13924 41178 38746 9514 7801 21472
2915 21472 21133 14333 10240 1099 10675 20442 6597 -4719 -9377 13034 21483 11866 8170 17314
2901 17314 14463 14620 32841 40566 24889 31137 27346 35149 37396 25029 13506 18753 19457 13221
2887 13221 5076 14099 -13850 -28725 -49683 -80576 -50527 -18877 -9642 1321 2124 4712 -8981
2874 -8981 992 10258 8594 -282 -2672 -328 -19559 -47164 -53692 -52484 -46489 -21766 -6460 6917
2860 6917 -4901 -27268 -37126 -5045 28240 18767 -6591 -12139 4924 3656 6212 -19578 -9664
2847 -9664 14184 20824 22003 28782 14621 -21480 -10877 14584 10206 33878 43617 -2031 5900
2834 5900 23994 53713 68894 61293 45755 24309 12216 5671 3608 -20463 -9559 6386 -5657
2821 -5657 -6820 14415 27737 22397 1239 -17616 -31196 -52051 -23810 -1432 -15305 -14857 -15732
2808 -15732 -16657 10021 17413 26216 19368 21174 -1398 11264 22203 30639 18499 -17857 -18931
2795 -18931 -29560 -25982 -23492 15192 33028 37570 21726 4704 22186 23995 14080 27680 47770
2782 47770 39975 44624 44674 1684 3058 9025 11715 30001 16750 28627 30064 24158 30446 18379
2768 18379 133 16099 44435 32838 5452 13649 -12297 -24194 -26427 2761 9815 -1344
2756 -1344 -3356 -7014 277 -21957 -41943 -32769 -25097 -7941 1410 11043 5156 -11036 -9850 -12854
2742 -12854 11765 32827 18534 13270 12979 25214 29263 31705 40303 18531 -3996 -14357 -13427
2729 -13427 -4985 4765 9468 3322 11655 14432 -1006 -6390 8128 16598 39898 40544 20002 -4516
2715 -4516 -24254 -21516 -19419 -2267 22058 41321 30160 25312 24522 2500 -4628 -15805 -35812
2702 -35812 -21254 -25900 -19789 8039 19443 15336 14368 4028 -3240 5829 -2134 -4488 -11567 -9663
2688 -9663 5583 12049 7374 6837 16508 7195 13667 11820 17676 13738 -17362 -14100 -5239 15323
2674 15323 18293 7467 30194 32958 25563 37400 21745 5141 -1426 -4176 -17347 -25115 -16082
2661 -16082 5074 12700 -8535 -28894 -46712 -38554 -27621 -18353 -16104 -26554 -28067 -38869 -23974
2648 -23974 -22312 -46547 -65721 -38658 -16715 -26918 -30242 -25565 -38573 -28147 -34106 -49153 -37977
2635 -37977 -29996 -30840 -7941 21524 20097 -761 -9599 -6232 -16902 -13503 -15257 -13417 -15395 7843
2621 7843 14099 13085 19070 7642 -2937 -14329 -6204 7315 4539 6975 10293 34195 58405
2608 58405 46583 7331 -8046 -3120 12178 17670 17656 14947 19750 28549 30706 24560 -3339 -9303
2594 -9303 -12001 -28884 -28717 -26578 -12804 -1809 -20561 -30398 -8640 4784 -24423 -22849 -1290
2581 -1290 -7127 -4853 -23429 -22335 -29243 -23719 -5407 5325 4913 10573 1073 -3808 4310 -6052
2567 -6052 1727 -1250 -6688 -858 -4991 -11965 -17807 -21923 -8614 -14048 -26117 -21661 -1086 -7977
2553 -7977 -3597 11056 21860 8572 -12384 -20757 -33322 -21911 -5238 -6425 -8366 -14337 -3986
2540 -3986 -1428 -6989 1479 32719 27473 4669 19634 21948 14696 -8835 -16257 -22065 -22633 -32489
2526 -32489 -37729 -28823 -36104 -27877 -21560 -14560 -14017 1893 25011 20799 4989 38024 26881 7384
2512 7384 26045 47062 17951 -514 -13634 -28827 -7162 23221 20728 6763 14850 15395 8271
2499 8271 19070 45111 42856 -756 -20154 -11377 -8905 -21063 -28456 -31058 -34053 -19822 4291
2486 4291 28490 51326 35769 4757 3218 27012 31676 8181 -27553 -45642 -38390 -17536 -8287
2473 -8287 -1347 -5528 5251 2946 -11867 -8916 -1715 -4567 779 7080 -2651 -31793 -31360 -3742
2459 -3742 10066 7398 -7894 -18098 1632 5319 4267 7910 -9101 -6486 3412 24124 25671
2446 25671 10236 11152 20566 13818 5556 15191 5570 995 -7430 2604 20782 28869 23494 18382
2432 18382 28968 44306 47688 48650 59745 63216 46526 19184 8840 -11872 -41097 -38910 -24628
2419 -24628 -1172 3291 -10563 9363 11527 -12956 -36468 -41581 10829 15099 12304 5593 -21629
2406 -21629 -21962 -5116 1503 -4478 2484 7245 4874 7853 -731 -48680 -63420 -50800 -26990 -30294
2392 -30294 -20020 2779 53 -29667 -33157 -22459 -4678 1070 24301 42232 44480 39090 9346
2379 9346 18713 13167 -8371 -15441 -22701 2917 28232 45138 35253 13654 10771 18055 31554
2366 31554 42483 38672 30266 13916 -1972 -8666 -3680 -1284 -18893 -21601 -4341 6942 5888
2353 5888 -16618 -41781 -38666 -30839 -23319 -5133 -6000 8897 24209 29507 18084 15057 17775 8460
2339 8460 5062 23434 30162 4069 -3767 -644 -5130 -7748 12997 6694 8054 16494 20086 -3345
2325 -3345 -16189 -1072 2486 -3850 -1103 19045 5245 -17504 -5359 10105 20496 34348 27564
2312 27564 46922 18960 12632 9479 27318 16949 5301 327 1105 12125 -8864 -17978 -7686
2299 -7686 -5584 -9480 -12668 -25335 -29124 -22949 -20420 -52821 -47720 -35394 -26552 39 -12502 -30118
2285 -30118 -37381 -33617 -13784 -2536 -20997 -17982 -15935 -3070 -6695 -19799 1746 14298 13741
2272 13741 2231 -23316 -6311 24433 35337 39572 27776 3397 -10546 17231 12132 -3748
2260 -3748 -4622 9291 15390 12273 -9110 -4773 17896 33832 39374 52218 39064 -4912 -26228
2247 -26228 -17372 6320 23390 16806 -5139 -9437 2697 -9131 -19987 -35541 -44361 -14867 -19603
2234 -19603 3482 16719 17121 31863 41902 24878 20133 36405 15637 -2534 -24705 -44268
2222 -44268 -33043 -22440 -31540 -30568 -12306 -14369 -5659 3888 14409 9791 -18186 -30496 -24040
2209 -24040 -20205 -5872 -3693 -9763 1031 32885 57455 41835 23251 17665 -6615 -9857 10338
2196 10338 5702 12103 3653 -3441 -9060 -6187 14372 1723 -32815 -28436 -14676 -13340 -4399 10865
2182 10865 -3844 -13285 -8993 2687 14487 9572 -9836 -26851 -22143 -33759 -30994 8013 33430
2169 33430 41629 35397 28657 25229 31184 35690 19374 22702 21256 25233 33317 27767 24625 37583
2155 37583 46129 31166 -716 -16369 -16709 -3812 -2078 -8553 -40800 -36431 -20798 -24700 -31004
2142 -31004 -3590 10803 -2358 -6203 2269 20522 24899 35621 47263 30027 -14086 -16611 267
2129 267 32502 50950 42750 10066 1118 3919 13565 21827 36000 35828 -6538 -48370 -30155 -42839
2115 -42839 -38194 -10616 -6831 11414 10876 160 11521 24540 4952 -16896 -9786 6266 18935
2102 18935 2174 -23933 -33084 -44942 -29728 3888 4842 -20267 -14748 19927 14206 2611 4370
2089 4370 6012 -4318 5519 -2068 -15918 -339 366 17444 19115 13197 33437 31405 28025 33726
2075 33726 48047 28557 17243 4763 20325 37150 38401 22934 -13416 -54153 -47405 -16876
2063 -16876 -1165 791 -14797 -27439 -30557 -724 22023 21219 35970 23787 28290 17707 5100
2050 5100 5292 11809 -13245 -28359 -21378 -28507 -23402 -10240 3338 17939 20000 796 -4793 -12950
2036 -12950 -156 10050 7674 -2325 -3489 -12509 -5303 13812 30786 16089 10316 14330 8422
2023 8422 24561 39886 28356 401 -12542 -9516 -15249 -12406 -6423 -791 -1730 13835 3297
2010 3297 -19589 -19926 5536 41170 66524 61386 39014 -3124 -16551 3090 -219 -3836 16306
1997 16306 8271 21379 28772 2376 9143 -16754 -32395 -42727 -48682 -45771 -21663 -12394 -33572
1984 -33572 -28509 -15705 -6566 -1895 1281 -982 -3156 -16632 -27986 -23113 -25325 -25963 -18346 -22736
1970 -22736 -30430 -13810 -16484 -6192 894 -5262 -5737 -14861 20336 38036 18753 2995 -3418
1957 -3418 -2225 9987 -8687 -36014 -24707 -8522 14602 30985 34551 7477 -14220 -1465
1945 -1465 6772 -5848 -10568 -21485 8423 23823 18567 -14561 -20081 -8771 4766 2997 8807
1932 8807 -5317 -9239 -19138 -12947 -23415 -38787 -43392 -23914 -14252 10287 11955 5691 8856 7338
1918 7338 8356 -1702 -33791 -39901 -28934 -55169 -55780 -43339 -42394 -46476 -33100 -40641 -30319 -21972
1904 -21972 -1221 2000 933 26279 32821 17910 176 -17322 -7281 -12164 -13859 -5337 9926
1891 9926 -3205 -14087 -28451 -15978 14065 -5583 -13912 -18055 -6760 -26906 -38015 -29153 -1246
1878 -1246 -31568 -42811 -53642 -53004 -32210 -11319 -1982 -32877 -29601 -7338 8822 5701 -11384
1865 -11384 -17264 -5653 -2398 -7328 -14636 -16066 -20253 2964 8875 632 4780 25266 28199 22245
1851 22245 6951 7319 15388 7507 -9636 -5383 20770 31359 29819 36547 33887 57297 45111
1838 45111 46460 44488 35358 23110 11559 -30346 -31620 3596 -491 -14878 -30658 -33884 -42457
1825 -42457 -45914 -18848 -4841 -6568 4232 1913 3643 20738 21841 32282 34956 30029 -901
1812 -901 5811 5438 -6107 -13633 -18953 -10217 3249 10357 -10389 -24735 -24352 -141 2248 19873
1798 19873 30330 28066 719 4210 15589 14852 12799 -13756 -8936 8070 4840 19583 -7023
1785 -7023 -15408 -8730 107 8649 12215 10709 22726 47968 38879 16583 -15837 4490 12449 20103
1771 20103 6272 1627 4495 22495 28678 29944 35097 15842 22317 38284 29803 17893 15389
1758 15389 5744 -7728 -19002 7083 17363 15484 10289 21631 8460 15198 38329 35268 24876
1745 24876 17695 16002 13975 3091 -4267 -17088 -21957 2513 23287 24430 43129 35789 12190
1732 12190 27545 24468 28173 25703 16996 5597 -10206 17624 25771 19620 15950 26902 2436
1719 2436 -2099 366 5803 9855 -16543 -31140 -31628 -22517 -19464 -22511 -5712 11752 17130 15346
1705 15346 23900 18215 3161 4471 11830 6826 -3591 5146 2464 6971 16913 17978 7181 -5261
1691 -5261 -11253 -25052 -33929 -33234 -13387 -18331 -29361 -28699 -25269 -6870 4240 -14708 -20183 -11779
1677 -11779 -14767 8336 12327 6719 3401 -15528 -28194 -38387 -25434 -37348 -26628 -5803 20708
1664 20708 40838 39978 49394 31481 10258 -5913 11010 15660 5670 -37062 -34394 -26555 -36816
1651 -36816 -38357 -30703 -23153 -1417 -424 7063 14646 1028 7373 16072 10495 17603 2907 -462
1637 -462 9262 8902 3188 -18367 -29942 -18783 -6771 -8365 -16581 -15920 -6074 -3676 9727 -13617
1623 -13617 -14538 -1780 16638 4648 -26666 -36832 -18812 -16883 -30967 -14446 -1693 -4076 8922
1610 8922 18445 15584 322 -18069 -5640 -4765 -6389 10193 17168 12320 13806 30562 20061 -734
1596 -734 -25870 -4756 10565 14896 13612 19003 19505 29015 15541 14062 -576 22278 36429 54562
1582 54562 41714 23768 37364 55502 44124 32470 30475 8584 -3116 -21256 -31951 -13635
1570 -13635 10097 -22411 -18446 5709 29647 23104 23720 48797 63507 58240 36280 18743 22853
1557 22853 17112 34715 47910 32202 11219 -1530 -4068 3100 8121 11794 11187 20615 18895 17589
1543 17589 -467 1850 -13213 -6661 -5336 -3494 -8914 7197 9396 2430 16439 27564 47543
1530 47543 53166 36294 24055 14945 5767 -1447 24430 31061 30590 12735 -440 -15683 -24743
1517 -24743 -13749 -339 17891 32870 13631 -2976 -25665 -4573 11060 3873 2138 -1406
1505 -1406 17696 10003 9333 34378 39090 51927 36401 39833 38615 37885 39120 14444 8418 40291
1491 40291 62819 52150 36766 18739 8525 -4599 10415 11735 29537 42435 38242 39871
1479 39871 38250 25367 25060 30372 19634 21017 28296 24986 17134 -5506 -793 26119 14842 39172
1465 39172 35597 21668 7013 5375 11402 -5547 -34784 -18808 -3086 16008 12355 -11140 -36622
1452 -36622 -30117 -22149 -13629 -24572 -41602 -58097 -38742 -10764 -13086 6506 23884 -7753 -28319
1439 -28319 -23774 -11530 -35540 -28536 -11497 -6458 -19066 -8087 31447 40531 22572 1608 8363
1426 8363 22159 26670 10192 4721 19152 6538 4041 12641 35147 34906 28639 26700 22628 30920
1412 30920 46429 42788 48068 34755 36375 43958 40289 31647 26480 11729 5445 7725 -23537 -17189
1398 -17189 -18357 -38237 -32027 -6481 -3577 2773 -7696 -28250 -30460 -15815 885 30387 40820
1385 40820 24334 28899 26871 5249 -417 -8396 -26611 -43927 -51399 -39529 3256 7121 25588
1372 25588 1470 -29688 -33325 -16133 10814 -10585 -20945 -18772 -8462 -4955 -6274 11891 32827
1359 32827 19825 4187 15062 8781 28381 16609 22531 41773 44510 28708 2085 -9578
1347 -9578 -5711 23463 27377 12652 -9534 -12781 -13242 11588 42861 33997 -4117 -27445 -28828
1334 -28828 -6859 -4475 -8777 -6182 -4503 -20795 -6779 36845 62501 86050 86025 38650 -4288
1321 -4288 -18590 -30684 -14956 15950 10735 3534 -16361 -13947 -4557 -5839 10502 34614 31079
1308 31079 10626 11200 22055 10523 36461 33326 6946 -6520 -10352 857 1568 2697 17839
1295 17839 9620 -8522 -10223 -21088 -35147 -9843 15724 18277 14404 7918 5035 1838 -4392
1282 -4392 -30372 -20897 -6749 -21221 -14084 -1006 -6210 8520 40721 22528 8743 6824 4988
1269 4988 16118 33640 32548 16350 -1212 -10466 -15723 -27228 -19602 -12546 -3501 9900 5586
1256 5586 6331 13512 18538 11339 4586 2777 -3466 -5610 -14888 -23044 -4827 -28945 -25519 -26873 -39805
1241 -39805 -50902 -49917 -24378 -3166 15246 9859 37015 56233 45147 18077 1386 -4183 10593
1228 10593 15099 19760 24569 27790 41063 26449 13317 433 13227 -16575 -40885 -62824 -55795
1215 -55795 -39771 -31650 -22399 8546 24042 21787 11587 29251 22670 193 -3722 -4944 9833
1202 9833 5348 14206 19114 17849 -13664 -3931 5396 -21244 -22722 -8710 -9786 6979 4614 -11327
1188 -11327 -4471 3802 1192 2726 -4997 20697 38074 36238 17710 8533 -4839 -9430 2361
1175 2361 30136 23075 5155 -10080 -18985 -10723 -21841 -25117 -8134 -2232 -9198 -12589 -16451 -3569
1161 -3569 -286 -17121 -21102 -6417 16154 27118 28676 16467 14479 21267 927 16251 20220
1148 20220 28588 7798 -18864 -20604 -12598 -3427 -13912 -3367 1823 -11701 -28374 -34335 -25052
1135 -25052 -35165 -23983 8090 9587 -3794 297 20491 42315 60793 52623 26345 20131 -1360
1122 -1360 19171 28611 11784 -5008 -10097 11481 28230 41581 29411 15311 -4857 -37048
1110 -37048 -30820 -27463 -11257 -3606 -23462 -35580 -21794 9251 42371 33747 9829 -10967 -18070
1097 -18070 -668 9629 13955 21402 14902 -9906 -26170 -32277 -13816 -3813 29722 49020 45296
1084 45296 56305 42706 11244 11200 2325 -6000 6129 9380 -2162 10782 30123 40780 47180
1071 47180 29523 23932 23504 15390 17626 9649 5575 24510 19539 39150 32151 33829 35056 35048 10374
1056 10374 7537 13880 21127 18348 13155 9428 9611 19541 7611 -6261 -12964 -6043 -4431 -27600
1042 -27600 -29403 -9441 -8004 -6257 5351 28982 37228 12960 4408 7822 8188 40960 33917 33681
1028 33681 39272 40499 33408 24773 2782 -24826 -34457 -19198 -710 -4460 -22245 -31066 -20277
1015 -20277 6202 31867 41797 17750 -4127 -28252 -27647 -20533 -30989 -40159 -44328 -26148 26057
1002 26057 25222 8745 5236 828 18194 15679 -5972 -7973 -970 10087 5695 -21546 -24941 9721
988 9721 36430 19746 -5332 -29418 -42242 -19695 -19282 -32113 -4918 26912 22982 25342 23855
975 23855 6535 13390 19170 9687 29763 12999 -36192 -35364 -9221 17259 19607 31806 24474
962 24474 134 -12637 9287 12715 -652 60 16519 20178 4581 9364 23974 38064 33947
949 33947 22333 23612 26352 33248 40297 48034 37528 20163 -658 -6076 -3772 9547 12686 -4173
935 -4173 7988 29765 6824 -7125 5104 20669 42899 20362 -2695 -14354 -27725 -15375
923 -15375 2844 15912 41336 14754 3637 16471 -4281 26375 48817 46333 46530 48839 37746
910 37746 32583 33484 23620 15848 -508 21607 20919 18992 -3543 -19039 -25861 -13613 -25077 -12764
896 -12764 -9224 12500 24150 17978 12695 13005 11772 32449 31059 2424 -25166 -33648 -6134 13566
882 13566 24339 37786 39462 36656 33916 4880 -4844 10851 17569 24745 10629 131 7194
869 7194 21926 14741 -4622 -6648 -1765 -2331 -4956 -8870 -37793 -59319 -36372 -19539 -35322 -9020
855 -9020 12872 -7756 -19183 -32805 -27194 -9012 -22929 -20271 -11747 -132 -1365 726 -4703
842 -4703 -19914 -32676 -25667 -22058 -2015 6567 12923 19051 41269 55083 28404 6698 2
829 2 13147 29507 16457 14883 8863 2163 19938 31359 26686 -6830 -28666 -12922 6452 36300
815 36300 36704 17946 7892 -6224 -36718 -34290 -14860 -8381 -6187 -2214 7969 -3831 -19107
802 -19107 -18119 -4372 6858 7177 12560 7331 -12807 -17590 -8764 -34803 -42932 -24864 -9335 -20541
788 -20541 -18971 -16868 -22803 -11669 -24438 -13787 4663 3640 13253 25751 32395 36225 31195 10400
774 10400 4499 -631 2296 19389 45741 37737 40839 35327 26854 3232 -11953 -4613 1737 37166
760 37166 50845 30067 946 -13189 -16014 -21352 -13161 -10652 -19611 -24067 -14017 955 -16373
747 -16373 -43363 -30853 -31473 -13657 1713 -16834 -2110 14061 4888 3196 4005 -17087 -21369
734 -21369 -12349 -15676 -15672 -7005 -4852 16347 8309 2321 -7379 -22836 -16233 -6606 -3793 -13630 -11196
719 -11196 -22151 -8776 32029 53375 45393 27808 13431 -6659 -6211 -4558 10740 3525 -8870
706 -8870 -2949 3844 7319 -1938 -9778 -6923 -9823 1970 -11403 -25703 -52610 -63153 -18827 -15062
692 -15062 -35957 -24787 -11335 9834 12882 2864 18679 12844 8155 14450 16785 -4433 2343
679 2343 17281 11725 7776 11695 -11263 -18128 4325 4259 5057 6668 -23510 -38195 -40306 -47869 -16673
664 -16673 7784 9038 -6240 -5425 -10209 8536 38736 38053 21544 7385 -6649 9535 18407
651 18407 -2685 -735 23024 6957 -15399 -22870 -19962 -20982 -10020 -2279 14278 37248 35151
638 35151 9532 10367 -6633 -29155 -19072 1337 3666 5570 6538 -1612 -3558 3261 -13289 -7485
624 -7485 9185 -15058 -19121 -31663 4206 -4264 -19927 -16308 -28940 -26072 -10554 9242 -150
611 -150 -19276 -17380 -10707 10874 14213 11980 -4826 102 6972 15517 12247 -8460 11725 -12254
597 -12254 -44751 -25011 24039 17615 5444 18445 34713 11411 2280 1467 -6475 -10031 -1998
584 -1998 13609 26191 13630 -19339 -38300 -44657 -50463 -22013 395 8597 14178 -5518 -11402
571 -11402 -13933 -13400 -7784 -21590 -20208 -26132 -6189 23739 29026 22218 3294 -13372 -47835 -31614
557 -31614 -11567 17223 6927 -10943 -6827 2616 -7375 -6031 5735 -9938 -31180 -34076 -44231
544 -44231 -42468 -26893 -7808 19100 26411 14025 -17325 -32799 -31235 -31161 -29956 -28680 -14769 -34417
530 -34417 -48809 -15239 -15018 1174 19999 6915 -3472 -17332 -4943 -3834 -7645 -5976 10751
517 10751 23125 21046 10898 14306 -405 -2084 10670 30975 55866 39487 27722 36637 25580
504 25580 32001 4006 -15565 -31544 -22949 -2101 -8700 -5548 20510 36214 21215 3865 367
491 367 20863 19521 3197 6365 12548 18607 28108 31632 20485 8032 1561 -680 -33457 -49191
477 -49191 -2362 8325 -846 -8325 -18465 -27289 -11288 4992 6412 14309 -11366 -21301 -12614
464 -12614 -8077 -14635 -4011 -197 -5605 -5791 18506 23878 25603 10662 -5518 -16584 -322 25023
450 25023 21755 23054 7035 12754 -3558 -14770 -14703 -7148 -23004 -21277 -5069 23365 24600 3308
436 3308 -10106 -11502 -3632 -21008 -46259 -36545 -27170 -17391 -21626 -13345 9712 3963 1084 -5584
$$ [...]
##END NTUPLES=NMR SPECTRUM
##END=
