##TITLE=Analysis number 311210
Compound Code cc 40904
Book Reference 413/164
Project Code adrs
Chemist Name stevem
##JCAMPDX= 6.0         $$ Bruker NMR JCAMP-DX V2.0
##DATA TYPE= NMR SPECTRUM
##DATA CLASS= NTUPLES
##ORIGIN= Bruker BioSpin GmbH
##OWNER= NMR
$$ XWIN-NMR		Version 3.5
$$ Mon Jul  4 11:01:04 2005 GMT Daylight Time (UT+1h)  MAYBRIDGE\NMR@NMR_250MHZ
##.OBSERVE FREQUENCY= 250.131544655141
##.OBSERVE NUCLEUS= ^1H
##.ACQUISITION MODE= SIMULTANEOUS (DQD)
##.ACQUISITION SCHEME= undefined
##.AVERAGES= 16
##.DIGITISER RES= 18
##SPECTROMETER/DATA SYSTEM= dpx250
##.PULSE SEQUENCE= zg30
##.SOLVENT NAME= CDCl3
##.SHIFT REFERENCE= (INTERNAL, CDCl3, 0, 16.522)
##AUDIT TRAIL= $$ (NUMBER, WHEN, WHO, WHERE, WHAT)
$$ ##TITLE= Audit trail, XWIN-NMR		Version 3.5
$$ ##JCAMPDX= 5.01
$$ ##ORIGIN= Bruker BioSpin GmbH
$$ ##OWNER= NMR
$$ C:\u/data/dgb/nmr/ADRS/5250/pdata/1/auditp.txt
$$ ##AUDIT TRAIL=  $$ (NUMBER, WHEN, WHO, WHERE, WHAT)
(   1,<2005-07-04 11:00:41.79 +100>,<MAYBRIDGE\NMR>,<NMR_250MHZ>,
      <created by zg, POWCHK disabled, PULCHK disabled
       configuration hash MD5:
       62 19 C7 07 E1 42 D1 B7 37 6C 3D D0 77 39 F9 E6
       data hash MD5: 64K
       11 17 76 4F 39 E3 C7 B1 5A E3 67 82 4C 56 6D 60>)
(   2,<2005-07-04 11:00:54.82 +100>,<MAYBRIDGE\NMR>,<NMR_250MHZ>,
      <Start of raw data processing
       ef LB = 0.3 FT_mod = 6 PKNL = 1 SI = 32K 
       data hash MD5: 32K
       95 C3 45 BA C0 0C 57 CD 7C 08 B7 FC 5B 95 A1 01>)
(   3,<2005-07-04 11:00:56.68 +100>,<MAYBRIDGE\NMR>,<NMR_250MHZ>,
      <apk 
       data hash MD5: 32K
       10 06 C1 DA 49 71 E4 8F C9 69 36 EC 44 8A 92 11>)
(   4,<2005-07-04 11:00:57.69 +100>,<MAYBRIDGE\NMR>,<NMR_250MHZ>,
      <abs ABSG = 5 
       data hash MD5: 32K
       DD 9E 9D 5C A2 80 6C 64 7F 67 FD DB F6 36 26 18>)
$$ ##END=
$$ 
$$ hash MD5
$$ 2A 79 E2 2A EE 9C B9 57 7A 7E 0F 49 B0 3E B8 83
##$RELAX= 
##$RELAX= 
##$RELAX= 
##$RELAX= 
##$RELAX= 
##$RELAX= 
##$RELAX= 
$$ Bruker specific parameters
$$ --------------------------
##$DU= <C:\u>
##$EXPNO= 5250
##$NAME= <ADRS>
##$PROCNO= 1
##$TYPE= <nmr>
##$USER= <dgb>
##$AMP= (0..31)
100 100 100 100 100 100 100 100 100 100 100 100 100 100 100 100 100 100 
100 100 100 100 100 100 100 100 100 100 100 100 100 100 
##$AQSEQ= 0
##$AQ_mod= 3
##$AUNM= <au_zg>
##$AUTOPOS= <19 >
##$BF1= 250.13
##$BF2= 250.13
##$BF3= 250.13
##$BF4= 250.13
##$BF5= 500.13
##$BF6= 500.13
##$BF7= 500.13
##$BF8= 500.13
##$BYTORDA= 1
##$CFDGTYP= 0
##$CFRGTYP= 5
##$CHEMSTR= <none>
##$CNST= (0..31)
1 1 145 1 1 1 1 1 1 1 1 1 1 1 1 1 1 1 1 1 1 1 1 1 1 1 1 1 1 1 1 1 
##$CPDPRG= <>
##$CPDPRG1= <>
##$CPDPRG2= <>
##$CPDPRG3= <>
##$CPDPRG4= <mlev>
##$CPDPRG5= <mlev>
##$CPDPRG6= <mlev>
##$CPDPRG7= <mlev>
##$CPDPRG8= <mlev>
##$CPDPRGB= <>
##$CPDPRGT= <>
##$D= (0..31)
0 1 0 0 0 0 0 0 0 0.06 0 0 0 0 0 0 0.0002 0 0 0 0 0 0 0 0 0 0 0 0 0 0 
0 
##$DATE= 1120471240
##$DBL= (0..7)
120 120 120 120 120 120 120 120 
##$DBP= (0..7)
150 150 150 150 150 150 150 150 
##$DBP07= 0
##$DBPNAM0= <>
##$DBPNAM1= <>
$$ [...]
##$SUBNAM7= <"">
##$SUBNAM8= <"">
##$SUBNAM9= <"">
##$SW= 20.6930455092707
##$SWIBOX= (0..15)
0 0 3 0 0 0 0 0 0 0 0 0 0 0 0 0 
##$SW_h= 5175.983436853
##$TD= 65536
##$TD0= 1
##$TE= 295.16
##$TE2= 300
##$TE3= 300
##$TEG= 300
##$TL= (0..7)
0 120 120 120 120 120 120 120 
##$TP= (0..7)
150 150 150 150 150 150 150 150 
##$TP07= 0
##$TPNAME0= <>
##$TPNAME1= <>
##$TPNAME2= <>
##$TPNAME3= <>
##$TPNAME4= <>
##$TPNAME5= <>
##$TPNAME6= <>
##$TPNAME7= <>
##$TPOAL= (0..7)
0.5 0.5 0.5 0.5 0.5 0.5 0.5 0.5 
##$TPOFFS= (0..7)
0 0 0 0 0 0 0 0 
##$TUNHIN= 0
##$TUNHOUT= 0
##$TUNXOUT= 0
##$USERA1= <user>
##$USERA2= <user>
##$USERA3= <user>
##$USERA4= <user>
##$USERA5= <user>
##$V9= 5
##$VALIST= <valist>
##$VCLIST= <CCCCCCCCCCCCCCC>
##$VD= 0
##$VDLIST= <DDDDDDDDDDDDDDD>
##$VPLIST= <PPPPPPPPPPPPPPP>
##$VTLIST= <TTTTTTTTTTTTTTT>
##$WBST= 1024
##$WBSW= 4
##$XGAIN= (0..3)
0 0 0 0 
##$XL= 0
##$YL= 0
##$YMAX_a= 424972
##$YMIN_a= -368696
##$ZGOPTNS= <>
##$ZL1= 120
##$ZL2= 120
##$ZL3= 120
##$ZL4= 120
##$ABSF1= 16.522
##$ABSF2= -4.171173
##$ABSG= 5
##$ABSL= 3
##$ALPHA= 0
##$AQORDER= 0
##$ASSFAC= 0
##$ASSFACI= 0
##$ASSFACX= 0
##$ASSWID= 0
##$AUNMP= <proc_1d>
##$AZFE= 0.1
##$AZFW= 0.1
##$BCFW= 0
##$BC_mod= 0
##$BYTORDP= 0
##$COROFFS= 0
##$CY= 12.5
##$DATMOD= 1
##$DC= 0
##$DFILT= <>
##$DTYPP= 0
##$F1P= 14.0000005364418
##$F2P= -0.99999901652339
##$FCOR= 0.5
##$FTSIZE= 32768
##$FT_mod= 6
##$GAMMA= 0
##$GB= 0
##$INTBC= 1
##$INTSCL= 1
##$ISEN= 128
##$LB= 0.3
##$LEV0= 0
##$LPBIN= 0
##$MAXI= 10000
##$MC2= 0
##$MEAN= 0
##$ME_mod= 0
##$MI= 0
##$NCOEF= 0
##$NC_proc= -3
##$NLEV= 6
##$NOISF1= 0
##$NOISF2= 0
##$NSP= 0
##$NTH_PI= 0
##$NZP= 0
##$OFFSET= 16.522
##$PC= 1
##$PHC0= -75.6563
##$PHC1= 6.547692
##$PH_mod= 1
##$PKNL= yes
##$PPARMOD= 0
##$PSCAL= 4
##$PSIGN= 0
##$REVERSE= no
##$SF= 250.13
##$SI= 32768
##$SIGF1= 0
##$SIGF2= 0
##$SINO= 400
##$SIOLD= 32768
##$SREGLST= <1H.CDCl3>
##$SSB= 0
##$STSI= 32768
##$STSR= 0
##$SW_p= 5175.98343685301
##$SYMM= 0
##$S_DEV= 0
##$TDeff= 65536
##$TDoff= 0
##$TI= <Analysis number 999999
Compound Code 99
Book Reference 9
Project Code 9>
##$TILT= no
##$TM1= 0
##$TM2= 0
##$TOPLEV= 0
##$USERP1= <user>
##$USERP2= <user>
##$USERP3= <user>
##$USERP4= <user>
##$USERP5= <user>
##$WDW= 1
##$XDIM= 32768
##$YMAX_p= 396068047
##$YMIN_p= -193433
$$ End of Bruker specific parameters
$$ ---------------------------------
##NTUPLES= NMR SPECTRUM
##VAR_NAME=  FREQUENCY,     SPECTRUM/REAL,   SPECTRUM/IMAG
##SYMBOL=    X,             R,               I
##VAR_TYPE=  INDEPENDENT,   DEPENDENT,       DEPENDENT
##VAR_FORM=  AFFN,          ASDF,            ASDF
##VAR_DIM=   32768,         32768,           32768
##UNITS=     HZ,            ARBITRARY UNITS, ARBITRARY UNITS
##FACTOR=    0.157963299565203, 1,           1
##FIRST=     4132.6476996994, 0,             0
##LAST=      -1043.33573715361, 0,           0
##MIN=       -1043.33573715361, -193433,     0
##MAX=       4132.6476996994, 396068047,     0
$$ Real data points
##PAGE= N=1
##DATA TABLE= (X++(R..R)), XYDATA
$$ [...]
18901B2754j2258m433J8478j0053j1073N62l011p239J047j4993J104p219K0241
18888f093k992J8351M801j6625L5108j3626j7580q142M107J4842L169j0041O351
18875A1630K8566L222j1644J6856p419l1793k4103L838j5621J8501K6461J6805
18863C5299J2323l1194l2921L630J1437j1116M434K1728m536J3687K681P202Q172
18850D0826l404j0742p719J026N808O334N601K202k0984J107J8175k3900r701
18837D629P979r303N142J1584K971J2833m538k4211L681K4711l751n3j4419J1001
18823B8256O993o860m3058P27L4898J709K4268j4045p140M120k6125J1642J7704
18810C3089N739k1085k4175q422P445N371J5972l863j344J9828K2960L987l767
$$ y = [22754, 10496, 6063, 24541, 14488, 3415, 3977, 966, -6273, -5226, -20219, -19115, -26334, -6093, -9085, 9266, 14067, -2558, 32550, 18924, 1344, -6798, -2691, 12151, 15320, 5279, 11630, 40196, 43418, 31774, 48630, 41211, 9418, -14685, -10847, -26468, -7967, 18494, 35299, 47622, 16428, -16493, -12863, -1426, -12542, -8108, 13620, 9084, 22771, 25452, 32654, 40826, 37422, 26680, 18961, 19987, 25795, 32129, 37730, 39932, 18948, 20055, 38230, 14330, 4629, 12608, 3305, 8447, 20031, 23002, 35835, 31297, 7086, 10767, 35478, 31727, 31674, 17255, 28256, 35249, 28389, -14669, -13942, 20956, 22665, 46933, 32888, 25748, 29868, 3743, 15385, 33089, 38828, 17743, -6432, -14854, -7409, -2038, 13934, 10071, 8727, 28555, 51515, 55502, 51735]
18797E1735r726l266J1463j8888p856j1754j0342L2591J4231o278o337J6113J1181
18784F2867l93j9280j7069K6866P56l0412Q607J8946j9314j3419k6424O685M9167
18771D7583K7620J1462P797J3947K6934j0341r964j7035j3904k161j9120l1136
18759C1682n653L974J9738J6383J7317k7298k6973K831j3069q641J6435j784o404
18746A8538Q485L955j3011P315o482n726k3660o369R954L4904L8937L631k4527
18733D5944l554j3085j4153N312K3776O823p249r422P886o071o980J9890J8253
18720F7370l3505m4404J186M2166o970O485L4572Q573K0532L537m256K0434J5264
18707A30984j1585R560l586o544J2747J5053k0636J910R979k5640l4739o387j2181
$$ y = [51735, 42009, 38743, 50206, 31318, 23462, 11708, 1366, 33957, 48188, 41910, 35573, 51686, 62867, 62474, 43194, 26125, 52991, 53747, 23335, 31942, 50888, 31574, 18155, -8269, -1584, 47583, 75203, 86665, 94462, 108409, 135343, 125002, 115038, 98003, 84099, 81938, 62818, 31682, 26029, 30003, 49741, 66124, 83441, 56143, 29170, 32001, 18932, 10291, 26726, 24942, 18538, 27023, 30978, 17967, 25282, 18800, 13074, -10586, -16955, -7001, 27903, 66840, 70471, 45944, 42390, 29305, 15152, 20464, 44240, 51063, 43814, 34392, 42278, 36207, 29227, 49117, 67370, 33865, -10539, -9353, 32813, 25843, 32328, 66900, 75473, 96005, 99542, 95286, 115720, 130984, 119399, 128959, 125373, 118829, 131576, 146629, 125993, 127903, 137882, 112242, 77503, 71116, 58935]
18694E8935K6900o292l705m696R72p080k0326N956J6465j188m045K0096l172o168
18680G2652N998K941J0805r048R589J1521o651R202K2136j6332l88m366K2981
18667A31040J4120R067k158j8990m4246k2600K2623O440q809r873r87R508j0742
18654G4393o597o862k3143k3782J0013L1497j7151O500J5630N191j4447o21R814
18641F0435j6123k3832J2634j633l6787K6489M7268l521p538P480j5847J0922
18629E9947R64k6828o300l955J2917R116J4760L206J7474k0466K6036k8126l714
18616E5031o178J11n2991k0468L8559M2124Q930r866m808n767o785J4464K5270
18603G7626j2737j2982O015j012J6222J6361J2227o141k0536Q53J3783L2407k869
$$ y = [58935, 85835, 79543, 75838, 71142, 72114, 65034, 44708, 50664, 67129, 65941, 61896, 81992, 78820, 72652, 78650, 81591, 92396, 83348, 92937, 104458, 97807, 107009, 129145, 112813, 112425, 108059, 131040, 145160, 154227, 152069, 133079, 88833, 66233, 88856, 95296, 86487, 76614, 75627, 85135, 74393, 67796, 60934, 37791, 14009, 24022, 55519, 38368, 44868, 60498, 65689, 51242, 50621, 60435, 44312, 20480, 33114, 31481, -5306, 21183, 68451, 64930, 57392, 64872, 49025, 59947, 60911, 34083, 27783, 23828, 36745, 45861, 60621, 63827, 81301, 60835, 86871, 58745, 55031, 48853, 48964, -4027, -24495, 14064, 56188, 65118, 55252, 50444, 44677, 37892, 52356, 77626, 64889, 51907, 57922, 56910, 73132, 89493, 101720, 95579, 75043, 75896, 89679, 122086, 119217]
18590A19217k4532l0499L442J174O637J0804J1159r460n382l2R196J8472L6865
18577A47061l624m548Q416k929K821O528r52N877J010k5231J1646J6118k6457
18564A35736j0085j6500j3068K804M951J7334J3625O187R527j4822j1426R651
18552A33914J9038J4332M601m999j968J6570k889K4265K9327k739j0656o917L9548
18539B51427O1887J9914N79K2974J8098j1092Q400L7228M8467J5022k7097m0544
18527D05263N095P194K3417K3770j3547J6775K7437K1681K3324J6958l345J0030
18515E64052j2254J9044p163J4119L5470N1257M7356J5675M770J8722L635%K6377
18502G81060L2693K8379J8291J1315j3127J894N9397P9886N9894N1022P9203N2599
$$ y = [119217, 94685, 64186, 67628, 68802, 75439, 86243, 97402, 87942, 82560, 82528, 91724, 110196, 147061, 143437, 138889, 147305, 144376, 147197, 153725, 152773, 158650, 159660, 134429, 146075, 162193, 135736, 125651, 109151, 96083, 98887, 103838, 121172, 134797, 140984, 150511, 135689, 124263, 133914, 152952, 167284, 171885, 166886, 164918, 181488, 178599, 202864, 232191, 229452, 218796, 211879, 251427, 313314, 333228, 333807, 356781, 374879, 363787, 372187, 409415, 457882, 472904, 445807, 405263, 410358, 417552, 440969, 464739, 451192, 467967, 495404, 517085, 540409, 557367, 554022, 564052, 551798, 570842, 563679, 577798, 613268, 664525, 711881, 727556, 732326, 751048, 754683, 754683, 781060, 813753, 842132, 860423, 871738, 858611, 860505, 919902, 999788, 1059682, 1110704, 1189907, 1242506]
18490A242506O0517O3677J17132J24543J26606Q0370L6229J9676K8233N7728Q1748
18479B038965J09691J72715K09651K11413K56821L14470L48576L73181N01226
18470D536709O12815P07487Q05218Q50684P45475M87026K38974R3967K9761M6406
18460I154522J03584K63816N06912R06787J343879J883815K563404L362667M549841
18451B4639227O511035R200548J1409610R931447K570651o528081j1048931r756734
18443C6928772o751686m456125l014016k122581j504698j018737o43645l13410
18435A7103874Q322K64955M49762M63671K39373p190j91605k38287k56923k29860
18425A7606092n2775K48717O37676J133435J745338K429896L293626M461831O282603
$$ y = [1242506, 1303023, 1366700, 1483832, 1608375, 1734981, 1815351, 1851580, 1871256, 1899489, 1957217, 2038965, 2148656, 2321371, 2531022, 2742435, 2999256, 3313726, 3662302, 4035483, 4536709, 5149524, 5857011, 6662229, 7512913, 8258388, 8745414, 8984388, 9078355, 9108116, 9154522, 9258106, 9521922, 10028834, 10935621, 12279500, 14163315, 16726719, 20089386, 24639227, 31150262, 40350810, 51760420, 61691867, 64262518, 57734437, 46685506, 36928772, 30177086, 25720961, 22706945, 20584364, 19079666, 18060929, 17417284, 17103874, 17112196, 17377151, 17826913, 18290584, 18529957, 18522767, 18331162, 18092875, 17835952, 17606092, 17553317, 17802034, 18439710, 19573145, 21318483, 23748379, 27042005, 31503836, 37786439]
18416C7786439R030749J1838389J1789485N452950m793727j1774232j1989325
18409D7340728q817858o051520m322356l205636k451141j920983j599942j310165
18401A7661127j059679q79245p09619o14036n39942m92396m39520l92515l93007
18392A2141168l96120l53046l10886k47724k07500j64898j39698j18110o8454
18383A0134732l7636j7363k1521j23401k60777l62964l92080m01286m51235m97357
18373G569112m98664m16330l87477m05405l22523k95824k68854k63741k75527
18364D434767k27590k03324j96133k02823k02137j59201j60124j69415j61678
18355B752342j31245j21399j36098r9081j03382j10743j04955q8720n8856p9567
$$ y = [37786439, 46817188, 58655577, 70445062, 75898012, 71104285, 59330053, 47340728, 38522870, 32471350, 28148994, 24943358, 22492217, 20571234, 18971292, 17661127, 16601448, 15722203, 15012584, 14398548, 13858606, 13366210, 12926690, 12534175, 12141168, 11745048, 11392002, 11081116, 10833392, 10625892, 10460994, 10321296, 10203186, 10134732, 10097096, 10079733, 10058212, 9934811, 9674034, 9311070, 8918990, 8517704, 8066469, 7569112, 7070448, 6654118, 6266641, 5861236, 5538713, 5242889, 4974035, 4710294, 4434767, 4207177, 4003853, 3807720, 3604897, 3402760, 3243559, 3083435, 2914020, 2752342, 2621097, 2499698, 2363600, 2264519, 2161137, 2050394, 1945439, 1856719, 1797863, 1718296]
18345A718296r8979p4700n1097o3012o9710p4552n9930m8353p8430n4075m3203
18334A002255l0835n2629m0205k5826j3793J98n0060k7817r850l3223m0053k6075
18322F52087k7195m5408m9120n2374J04M358j4169q281j543r294k4573k5364j1182
18309C88046q393K183k9568j1770J641j6903j7566q934k1486q431l69J209J9451
18296B89110R99j0501r194N806K2180J9063L829J15r051J6047l122m0353l7366
18283B47562l33L9896K4793J1007O491J614j756k5336J0536j5843O820j9997r606
18270B75848P168J9761l553l3412M52q917P868J5841J3198K1289J1606l5651j0075
18257B81423K4394J7285P091K517J5481p991m5256R391L9963L216M47L472l295
$$ y = [1718296, 1619317, 1544617, 1493520, 1430508, 1360798, 1286246, 1226316, 1177963, 1099533, 1045458, 1002255, 971420, 918791, 878586, 852760, 838967, 839165, 789105, 761288, 751438, 718215, 678162, 652087, 624892, 579484, 530364, 477990, 478094, 482452, 468283, 460002, 458459, 449165, 424592, 399228, 388046, 379653, 381836, 352268, 340498, 342139, 325236, 307670, 298736, 277250, 268819, 268450, 269659, 289110, 290109, 279608, 270414, 276220, 298400, 317463, 321292, 321407, 312356, 328403, 325281, 284928, 247562, 247229, 287125, 311918, 322925, 329416, 331030, 329274, 303938, 314474, 298631, 305451, 285454, 275848, 283016, 302777, 299224, 265812, 266264, 257347, 265215, 281056, 294254, 315543, 327149, 291498, 281423, 305817, 323102, 330193, 332710, 348191, 340200, 294944, 304335, 344298, 347514, 347961, 351433, 348138]
18244C48138p630J2895k6604l6835J6934J2324J5744K3167j7125j500J5530M03
18232C55441j7783j3514j5520j3430Q439j0526k1376M759L6172L786q850J1148
18220C18746J179J9731l1410k8333n823j352J0494N292k6298M31J8603J271k834
18207B79697n061l384J4071L5347k401K667J2399j6216k6719k0823O793K0056
18195B96426K475K3151K0664j3274m944K2381m121j7939P484J7142p087J3740
18183C56098J6766j0284j0403J042r70J5776L0260L4836L3853L9332L5740J2675
18171E54721j2132K0125L0585J0965l3077l7355l8680k9711l7683l8275k6585
18160C62898J7480n872k6015n780R758o550k0508K9073L9892K9401L4094M6464
$$ y = [348138, 340508, 353403, 326799, 289964, 306898, 319222, 334966, 358133, 341008, 339508, 355038, 355441, 337658, 324144, 308624, 295194, 303633, 293107, 271731, 276490, 312662, 316448, 307598, 318746, 319925, 339656, 308246, 279913, 274090, 272738, 283232, 288524, 262226, 262657, 281260, 282531, 279697, 274636, 271252, 285323, 320670, 318269, 320936, 333335, 317119, 290400, 269577, 276370, 296426, 298901, 322052, 342716, 329442, 324498, 346879, 342758, 324819, 332303, 349445, 342358, 356098, 372864, 362580, 352177, 353219, 352249, 368025, 398285, 433121, 466974, 506306, 542046, 554721, 542589, 562714, 593299, 604264, 571187, 533832, 495152, 465441, 427758, 389483, 362898, 380378, 374506, 348491, 342711, 352469, 345919, 325411, 354484, 394376, 423777, 457871, 504335]
18148E04335J9505Q91o274M3339N8663N9421O6387L7877O0886O6417Q7377M6501
18136A045325P7397J10444J20120R9743R6916J28825K07415K59810L05535L02738
18126B754268K38015R4530M2256K5924j0800J1207J5900N7885J75334L71840N43641
18115D320000P04135R43664J254046J793240K633778L925632N192750M460684
18107B5227929l70073n118695m960163l272349k071818j427533j042869p61615
18099F202814n92317m68729l57404k93601k43691k12565j92004j46361j26578
18090C569564r7254p8235j16705r9026o7912m4431n3744l1450l451k1935m9375
18079B906046l013L9652L9142K4992K1028l7592j11691j63671j86335j75024j50116
$$ y = [504335, 523840, 524731, 518457, 561796, 620459, 679880, 746267, 784144, 845030, 911447, 998824, 1045325, 1122722, 1233166, 1353286, 1453029, 1549945, 1678770, 1886185, 2145995, 2451530, 2754268, 2992283, 3086813, 3129069, 3154993, 3144193, 3155400, 3171300, 3229185, 3404519, 3776359, 4320000, 5024135, 5967799, 7221845, 9015085, 11648863, 15574495, 20767245, 25227929, 24857856, 19739161, 14778998, 11506649, 9434831, 8007298, 6964429, 6202814, 5610497, 5141768, 4784364, 4490763, 4247072, 4034507, 3842503, 3696142, 3569564, 3472310, 3394075, 3277370, 3178344, 3110432, 3066001, 3012257, 2980807, 2977356, 2955421, 2906046, 2903033, 2942685, 2981827, 3006819, 3027847, 2990255, 2878564, 2714893, 2528558, 2353534, 2203418]
18068B203418r9637j07451j23726j22254j14651r4766r0046o3116n3723o0469
18058A273579p2776j17105p3467j2025k6285n2002n6993m4136l7412n3366j2296
18047G15716n339l1446l3038l9645p0245l2426k0960j7593j7009N164J5227M795
18035D73201j3875k0185l2621j4286p515j0523j7609k0224k6603k2948L296Q06
18023B90914p656k5522j1896Q153L640k409J7369J5419j3228j7725j1712k6045
18011B19302j1540J9944J2053j3948k2669r154m1599J0192K4556J0597p798J0761
17999B00697o760K223n851r505p239n180P073k147J5395R27P375j0887J8776j2851
17985A92046j2908j2841N066J7944K361j3463j1773L1879J036J7656n763k7136
$$ y = [2203418, 2103781, 1996330, 1872604, 1750350, 1635699, 1540933, 1450887, 1387771, 1334048, 1273579, 1200803, 1083698, 1010231, 998206, 971921, 919919, 862926, 818790, 781378, 728012, 715716, 710377, 678931, 645893, 606248, 536003, 503577, 482617, 465024, 448015, 453179, 468406, 473201, 459326, 439141, 406520, 392234, 384719, 374196, 356587, 336363, 309760, 286812, 290108, 290914, 283258, 257736, 245840, 253993, 257633, 255224, 272593, 288012, 274784, 257059, 245347, 219302, 207762, 227706, 239759, 225811, 203142, 193988, 152389, 162581, 187137, 197734, 189936, 200697, 193937, 196160, 190309, 180804, 173565, 168385, 175458, 173311, 188706, 189633, 197008, 186121, 204897, 192046, 179138, 166297, 171363, 189307, 191668, 178205, 166432, 198311, 199347, 217003, 211240, 184104]
17973A84104p430M538j7092l439J2380K89K3381L5487J2077j4045Q320q259M0234
17960B70545K0438k2307l50Q697L910J166J4116l7822j4808O16K671K4133p487
17947B63518j6502J6423J3170P72j2631J2721R713R220j2260K7321K7960k3378
17935C16047L6215K9769q18j5810J7635K1171J6758K5312L0295L9573K0435j1502
17923E25080K274L2659K1485M160J3341L1972N5190L0679J5436K8229J9969K0355
17911H00829L0504K6048J2642N136k983J6730L0686L676K3683M7510K6229j4698
17899A005992p345K0421K3778J0315L3156K0731J6324L6846J8302L1167M9406
17888A259093J7308J6809L1567J0219K4398M9722Q5162N3209M2470M3856P5703
$$ y = [184104, 176674, 181212, 164120, 160681, 173061, 173350, 196731, 232218, 244295, 230250, 238570, 230311, 270545, 290983, 268676, 268326, 277023, 280933, 282099, 296215, 258393, 243585, 244201, 246872, 271005, 263518, 247016, 263439, 276609, 277381, 264750, 277471, 287184, 296404, 284144, 311465, 339425, 316047, 352262, 382031, 381213, 365403, 383038, 404209, 420967, 446279, 476574, 516147, 536582, 525080, 527354, 560013, 581498, 585658, 598999, 630971, 686161, 716840, 732276, 760505, 780474, 800829, 831333, 857381, 870023, 875159, 872176, 888906, 919592, 923268, 946951, 994461, 1020690, 1005992, 998647, 1019068, 1042846, 1053161, 1086317, 1107048, 1123372, 1160218, 1178520, 1209687, 1259093, 1276401, 1293210, 1324777, 1334996, 1359394, 1409116, 1494278, 1547487, 1589957, 1633813, 1709516]
17877A709516Q5486Q4515Q7457R9725J03323J34603J11492J05759J58429K06731
17867B887036K09166K41362L11009L51061M15129N16419N75073P06722Q22555
17858G035532R24638R71528J028499J134066J147528J089493J026936R02130P73666
17849A6034016O85315N83902N46148O46274Q52124J237728J773433K540731L555830
17840B8455501N010584P032313R488414J1607872J1908614R465548N358691K133528
17832I0461065R68524Q7422k724694p189463j0715792j1410726r682997p262509
17824D2530830n275945l948101l106478k489769j995108j652756j351595j130867
17816B1580211r23639p62032o57818n33735m46997l93784l06847k51700k38329
$$ y = [1709516, 1795002, 1879517, 1966974, 2066699, 2170022, 2304625, 2416117, 2521876, 2680305, 2887036, 3096202, 3337564, 3648573, 3999634, 4414763, 4931182, 5506255, 6212977, 7035532, 7960170, 8931698, 9960197, 11094263, 12241791, 13331284, 14358220, 15260350, 16034016, 16719331, 17303233, 17849381, 18495655, 19347779, 20585507, 22358940, 24899671, 28455501, 33466085, 40498398, 49986812, 61594684, 73503298, 82968846, 88327537, 90461065, 91429589, 91517011, 88792317, 81602854, 70887062, 59476336, 49793339, 42530830, 37254885, 33306784, 30200306, 27710537, 25715429, 24062673, 22711078, 21580211, 20656572, 19894540, 19236722, 18702987, 18255990, 17862206, 17555359, 17303659, 17065330]
17807A7065330k13965j20674q0341m9295n0890j33832j96434k48527l09547l97489
17797A5264336m90445n91653o38903p22704o97617o80649o51615o02704n53615
17788I634431n46239n30257m90478m14337l81324l96518l76465l32462l12361
17779E853990l21994k75787k68375k54796k57214k36687k23986k02590j95371
17770C617190j73075j63036j49775j32233j34086j43897j04279q8045p5523j27931
17760B325310j36396r4550r7584p4432o0270r6112p0377m2354o4109p5132q8301
17749A425693q1446m4729k1316m5510m8801o4459m0249k8362l8737k9397l3960
17738I48727l8157j1501n7605n3314o877q836k530k1288j3159o498L035j1790
$$ y = [17065330, 16851365, 16730691, 16650350, 16601055, 16550165, 16416333, 16219899, 15971372, 15661825, 15264336, 14773891, 14182238, 13543335, 12820631, 12123014, 11442365, 10790750, 10188046, 9634431, 9088192, 8557935, 8067457, 7653120, 7271796, 6875278, 6498813, 6166351, 5853990, 5531996, 5256209, 4987834, 4733038, 4475824, 4239137, 4015151, 3812561, 3617190, 3444115, 3281079, 3131304, 2999071, 2864985, 2721088, 2616809, 2528764, 2453241, 2325310, 2188914, 2094364, 1996780, 1922348, 1862078, 1765966, 1695589, 1653235, 1589126, 1513994, 1425693, 1344247, 1299518, 1278202, 1232692, 1183891, 1119432, 1079183, 1050821, 1012084, 982687, 948727, 910570, 899069, 841464, 788150, 781273, 772437, 769907, 748619, 735460, 728962, 731997, 720207]
17726G20207l0326O13J2816M9033L3774J2236j8944l0585j8310J4106K9200R524
17714G83344k69R888Q456K807O815j9873o545j8267k7339Q911J5831k0249M793
17701G48303N801o792P315L6859L5319L6089J3876n906L056O350J5500P385j799
17688I01356K8586J949N866K7331O410K8856N2394O4353M5430O0010O2782N0921
17676A336244M9714M2283N8527O7093M0482N3271Q0842J00512Q7604R4587R1413
17665B102572J17743J31125J38584J80186K06298K66974K66223K97653L91897
17656D099255M49941N08384N43774O77208P45077P07401N48750M30826M41811
17647I152427M36375L43671K06745K23931L36288M91192P77057J180178J653477
$$ y = [720207, 689881, 690494, 703310, 752343, 786117, 798353, 779409, 748824, 730514, 744620, 773820, 783344, 783075, 792963, 801419, 804226, 811041, 791168, 784623, 766356, 739017, 747928, 763759, 743510, 748303, 754104, 747312, 754627, 791486, 826805, 862894, 876770, 870864, 873920, 880270, 895770, 903155, 901356, 929942, 931891, 937757, 965088, 971498, 1000354, 1052748, 1117101, 1162531, 1222541, 1285323, 1336244, 1385958, 1428241, 1486768, 1553861, 1594343, 1647614, 1728456, 1828968, 1916572, 2011159, 2102572, 2220315, 2351440, 2490024, 2670210, 2876508, 3143482, 3409705, 3707358, 4099255, 4549196, 5057580, 5601354, 6278562, 7023639, 7731040, 8279790, 8710616, 9152427, 9588802, 9932473, 10139218, 10363149, 10699437, 11190629, 11967686, 13147864, 14801341]
17638A4801341K217402L111079M598815O688917Q688078Q317803L331948j928235
17630D9827148j242994J779212J660260l546442q085066p441899n108434l330010
17622B4511775k207935j472421r82602o17759l24096j10847j01760j31818r9687
17613A8462850k8365K4046j451q428L7343J72179M23255Q04327J263800J744957
17603B2894513K442679L648059N412599P438078Q032359M677010j051068k139045
17595E1355184N82408J673351j972882p328376q068076n967901m131781k944267
17587B3197660k191114j736543j440798j184339r79675q55309p35677o61769n80033
17578A2832403n05487m14824l23594l56866l59123k87756k38759j62113j71643
$$ y = [14801341, 17018743, 20129822, 24728637, 31417554, 40105632, 48423435, 51755383, 49827148, 48584154, 50363366, 52023626, 48477184, 40392118, 32950219, 27841785, 24511775, 22303840, 20831419, 19848817, 19231058, 18906962, 18796115, 18694355, 18562537, 18462850, 18434485, 18458531, 18457080, 18448652, 18485995, 18658174, 19081429, 19885756, 21149556, 22894513, 25337192, 28985251, 34397850, 41835928, 49868287, 54545297, 53494229, 51355184, 51937592, 53610943, 51638061, 44309685, 36241609, 30273708, 26141927, 23197660, 21006546, 19270003, 17829205, 16644866, 15665191, 14809882, 14074205, 13412436, 12832403, 12326916, 11912092, 11588498, 11231632, 10872509, 10584753, 10345994, 10183881, 10012238]
17569A0012238j95440j58235j39913r1037q0964j46265k01025k52940k53310l15252
17559H177857l69128m14656m13718m10033l80034l39245l36634l23727k98199
17550D892483k61155k46107k40585k15141j89279j79795j58526j54884j48682
17541C098329j84099j40989j22180j10961j56605j51408r5805q5128j06503p7426
17531A867225o6018p7304q6253n0204o4795o4068n3378q3515o6859m4872l9608
17520A170351l2790m7197o4602n6780k8261k917l1346l1176N548k9394m2081l8536
17508G70819j4523m2422l3106n2130m9438j0752n916l6463k7536N640j3578r015
17496D81580l7526j2037N704j2076j1534j4396m157l5887l4166J4647J5870j1403
$$ y = [10012238, 9816798, 9658563, 9518650, 9427613, 9346649, 9200384, 8999359, 8746419, 8493109, 8177857, 7808729, 7394073, 6980355, 6570322, 6190288, 5851043, 5514409, 5190682, 4892483, 4631328, 4385221, 4144636, 3929495, 3740216, 3560421, 3401895, 3247011, 3098329, 2914230, 2773241, 2651061, 2540100, 2383495, 2232087, 2136282, 2051154, 1944651, 1867225, 1801207, 1723903, 1637650, 1587446, 1522651, 1458583, 1405205, 1321690, 1254831, 1209959, 1170351, 1137561, 1090364, 1025762, 968982, 940721, 937804, 906458, 875282, 880830, 851436, 809355, 770819, 756296, 713874, 680768, 628638, 579200, 568448, 562532, 526069, 498533, 504173, 490595, 481580, 444054, 432017, 437721, 425645, 414111, 399715, 395558, 359671, 325505, 340152, 356022, 344619]
17484C44619j8645J2069J272p24N3j6632j1319R937j2597j5764K8949K6140j4657
17471C32701l952K8833J1505n478j3073j4062L864K1097K2485K754m1578k6851
17459C18245J957J7218J6759P967k6502m076J0045k8326j8114m816J4512N709
17447C10578K4720K1070L860Q682J7308K6542K8339J3191k8025k3340l4916j5895
17435C52114j4002r320J9138R281m446r173J4409j875q770m953K7436K07O376
17422C76422Q295j7956o2435l397R417k1355k8566P621J9185R426k3043k9527
17410B44087O021J7400O050R485R879J1238k3859l1248j3680Q906K3449J1358
17398B79086n807j4048J525k2717K998M638k9667j8851K3628O163k2907J7159
$$ y = [344619, 325974, 338043, 339315, 338591, 338644, 322012, 310693, 320630, 308033, 292269, 321218, 347358, 332701, 328749, 357582, 369087, 363609, 350536, 336474, 340338, 361435, 383920, 386674, 345096, 318245, 320202, 337420, 354179, 362146, 335644, 331568, 341613, 313287, 295173, 290357, 304869, 310578, 335298, 356368, 360228, 368910, 386218, 412760, 441099, 454290, 426265, 402925, 368009, 352114, 338112, 328792, 347930, 357211, 352765, 343592, 358001, 356126, 347356, 342403, 369839, 370046, 376422, 384717, 366761, 304326, 300929, 310346, 288991, 260425, 268046, 287231, 296657, 273614, 244087, 250108, 267508, 273558, 283043, 292922, 304160, 280301, 249053, 235373, 244279, 267728, 279086, 273279, 259231, 260756, 238039, 241037, 245675, 216008, 197157, 220785, 226948, 204041, 221200]
17386B21200J880J5564L1903Q85m0422k7937k1739j364M840J7137n485k1346k71
17373A74845j2513m666j1642m754L1641k76l3969l1681j2608K249J1101q42j4130
17360I2755P254K1144K210k7698p280R497j1798j7901K2491L1525j5557J1490
17348A18132J3925q664J5187j182j9847n193k4647k6794j9160L600q175Q235J4783
17335F0200R100m64j0375J6559M6495J0710j9878l2399r986r326J1837j5697n581
17322E1195J2722K1829o687j4625R08K782P368K9689L09M160N738L5209K534k4821
17308A28310k5569o264J443Q328m899p324j5290J2203L2457k237K493k211J0639
17295A32079K008j6546j0434K2917K5316M555J4260K8999k8549J005J5505k2892
$$ y = [221200, 223080, 238644, 270547, 271432, 231010, 203073, 181334, 179970, 184810, 201947, 196462, 175116, 174845, 162332, 157666, 146024, 141270, 172911, 172635, 138666, 106985, 94377, 96626, 107727, 106885, 92755, 100009, 121153, 123363, 95665, 88385, 97882, 86084, 68183, 90674, 122199, 106642, 118132, 132057, 123393, 138580, 137398, 117551, 112358, 87711, 60917, 41757, 45357, 37182, 45417, 60200, 69300, 68836, 58461, 75020, 121515, 132225, 112347, 79948, 69962, 60636, 72473, 56776, 51195, 63917, 85746, 79059, 64434, 65342, 68124, 75492, 105181, 105490, 109650, 115388, 150597, 153131, 128310, 102741, 96477, 97920, 106248, 101349, 94025, 78735, 90938, 123395, 121158, 123651, 121440, 132079, 134087, 117541, 107107, 130024, 155340, 159895, 174155, 203154, 174605, 175610, 191115, 168223]
17283A68223k4052R686K5917J4884O177M5515P2462M3938O5240L5885M8751M7433
17271E60059N464J9552J020k5960n352n2135o3720m0477m9673k9581m2084k7108
17259B50005k0673p684R041k0746j551j9036q673j901q676r600l222q09j3776
17246A42699j7142K8299l933P887K636j3892j3563J6252k5198p521O178M807m882
17233A22627k4965j0146j948J9881m231p041P109R235o337P201j3725k0348n289
17220G2023j2166L4703Q165j9652j3724N186O474j7921m3667O439J168K969M597
17207C4594m023J9007J9182k5321j1751Q287K314K651q925m238r005l1302L87
17194h143N660M090N561L6006J8687r443j5185J6408O330q948q082k607j4753
$$ y = [168223, 144171, 153857, 179774, 194658, 200835, 246350, 318812, 362750, 427990, 463875, 512626, 560059, 565523, 585075, 586095, 560135, 554783, 502648, 438928, 398451, 348778, 319197, 277113, 250005, 229332, 221648, 230689, 209943, 208392, 189356, 180683, 178782, 170106, 160506, 157284, 156475, 142699, 125557, 153856, 149923, 157810, 160446, 146554, 132991, 149243, 124045, 116524, 122702, 127509, 122627, 97662, 87516, 85568, 105449, 101218, 94177, 101286, 110521, 104184, 111385, 97660, 77312, 72023, 59857, 94560, 102725, 83073, 69349, 74535, 81009, 63088, 19421, 25860, 27028, 29997, 34594, 30571, 49578, 68760, 43439, 31688, 39975, 42289, 44940, 36015, 31777, 22772, -8530, -8143, -2483, 1607, 7168, 43174, 61861, 52418, 37233, 53641, 59971, 51023, 42941, 40334, 25581]
17181B5581P10K92n55K9695l017j172k2428k9945L250L63M3023j1233k0891M831
17167A8504j5948P567O252K5283n663j6170K6437j0303J98n304J719p995J7133
17154D1710N34k0370O085Q079l992p818j4050j0396n533L0526J1482j6724K2954
17141D2487K0011k4558j22J2845J5880K3811j1606l0906j3310Q704M41M006J5023
17128F2706J534k4789j9801J5611j1429j100J2362J9095n440j7630J6352J4276
17116F1747k6406j7465M543K7116L486Q388o131J1310j1708l9000j821j050J9315
17103C2324J2657j1677m796J5062K1005K0173n959M126J1341L2739k756N594O52
17090A30485p402K9187K8901N4573N2553m34l0513k4171L0657M9309l2021n4429
$$ y = [25581, 26291, 26583, 26028, 55723, 52706, 51534, 29106, -839, 2411, 2774, 45797, 34564, 13673, 18504, 2556, 10123, 16375, 41658, 35995, 19825, 46262, 35959, 36157, 30853, 32572, 24577, 41710, 42244, 21874, 27959, 36038, 32046, 24228, 10178, -218, -5751, 24775, 36257, 19533, 42487, 62498, 37940, 37818, 50663, 66543, 90354, 78748, 47842, 34532, 43236, 43677, 47683, 62706, 64240, 39451, 19650, 35261, 23832, 22732, 35094, 54189, 48749, 31119, 47471, 61747, 35341, 17876, 22419, 49535, 53021, 61409, 55278, 66588, 54880, 15880, 14059, 13009, 32324, 44981, 33304, 28508, 43570, 64575, 84748, 78789, 82915, 94256, 126995, 124239, 129833, 130485, 123083, 152270, 181171, 235744, 288297, 287863, 257350, 233179, 263836, 313145, 281124, 226695]
17078B26695o4439m2786q697J0040r50K3078r663j4395l6215L469o693k6344N137
17065E8237J6717K3154K7680j2418K0618P17J3507p705j124r686L6254L9576L9309
17052B44836M0226J523m360k6074j8285J2005J2915j5907l8470k6276k8473q172
17040A45488p385j8095k1694k5670j659K7163J5716l1889j3600j802k0099J203
17028D7677N562J3849R429k1631p507M311J316J0520m166M670K3731Q842o912
17015H9691k9983r552J3274O969J1549m066q853J5541j8407m0677q907K303L6261
17002E5143L0839j927l0549j3022J8667J1001k5246o280j1671L352Q72K94o78
16989C0795K7069J7770J3044m148l2156j2116K2193M04n290j4373n684J2052J9847
$$ y = [226695, 162256, 119470, 110773, 120813, 119863, 142941, 133278, 118883, 82668, 86137, 79444, 53100, 58237, 74954, 98108, 125788, 113370, 133988, 134705, 148212, 140507, 139383, 129697, 165951, 205527, 244836, 285062, 286585, 282225, 256151, 237866, 249871, 262786, 246879, 208409, 182133, 153660, 145488, 138103, 120008, 98314, 72644, 70985, 98148, 113864, 81975, 68375, 66573, 46474, 47677, 53239, 67088, 76517, 54886, 47379, 51690, 53006, 63526, 59360, 64030, 87761, 96603, 89691, 59708, 50156, 63430, 70399, 81948, 77882, 69029, 84570, 66163, 25486, 16579, 18882, 55143, 85982, 84055, 53506, 40484, 59151, 70152, 44906, 38626, 26955, 30307, 31179, 31473, 30795, 57864, 75634, 88678, 84530, 52374, 40258, 62451, 62855, 57565, 43192, 37508, 49560, 69407]
16976F9407k8182l5968k6159j5429j0119P222L818P703J3037L853o748J6433J8729
16963A7597J1044n615k3361m982q399r132J0552N578r418p005J7649j402q501
16950a5395K188K7239J9138j7950j6039l1483L869M3215L424O01p796k0591j882
16937a1462L365j1142k6900j5705K7505K6999k239j543l293J4916J380j7809m888
16924b0816J0925k1987J1036K3171K3301R253j8701m970l280O22N235j4405j4460
16911a5076J3917K0854j7823k9784n721J4404M6064J5718J389k2471k1350K8685
16899B8806J9064L721l6208L21m381k1990J4522K935q447j2167l184J7371K8504
16886B8867N112l1920R169J3189O43J1836j2674k924m132j0378M2J2713L65j1352
$$ y = [69407, 41225, 5257, -20902, -36331, -46450, -39228, -35410, -27707, -14670, -10817, -17565, -1132, 17597, 28641, 23026, -335, -5317, -13716, -22848, -12296, -6718, -16136, -23141, -5492, -6894, -15395, -13207, 14032, 33170, 15220, -819, -32302, -28433, 14782, 18206, 18807, 11011, -9580, -11462, -8097, -19239, -46139, -61844, -34339, -7340, -9579, -11122, -14415, 501, 1881, -15928, -20816, -9891, -31878, -20842, 2329, 25630, 34883, 16182, 11212, 7932, 8554, 13789, -616, -15076, -1159, 19695, 1872, -27912, -33633, -19229, 26835, 42553, 43942, 21471, 121, 28806, 47870, 51591, 15383, 15704, 11323, -10667, 3855, 6790, -1657, -13824, -17008, 363, 28867, 33979, 2059, 11228, 24417, 25060, 36896, 24222, 21298, 17166, 6788, 6830, 19543, 19908, 8556]
16872H556J5440K0924r54k0721j7926o34j2337j599K2615m356J0492K7436K9366
16859G6302l1708k4541k9871k6327J6255J7200K2053J48r992j863k3770k3362
16847c9476n58K6628J1708J6438k4531l2196K4889K3928N658R584J3878m122L370
16834C5198M49n509o761l6771j1372J4958K5100j2230N61J7006P207j3071J5857
16821C0622K3368k8487k4797r344k0663j0536J2098K3006P921j6230J162j732
16809a3612K0851k3666m8046J0936K5258J6800L9049k371j1207r820K3278Q010
16797C5460p461k7210j0244L2123k7180k1268J4822j1498L508J682J8704J6366
16785A7804R920n955k0399p369K5574J2309M368j9278j6335j0667n143K1541j663
$$ y = [8556, 23996, 44920, 43966, 23245, 5319, 4685, -7652, -9251, 13364, 9008, 19500, 46936, 76302, 44594, 20053, -9818, -36145, -19890, -2690, 19363, 19511, 9519, 7656, -16114, -39476, -40034, -13406, -1698, 14740, -9791, -41987, -17098, 6830, 12488, 22072, 35950, 31828, 35198, 35647, 30138, 23377, -13394, -24766, -9808, 15292, 3062, 3623, 20629, 27836, 14765, 30622, 53990, 25503, 706, -8638, -29301, -39837, -27739, -4733, 3188, -13042, -11880, -13612, 7239, -16427, -64473, -53537, -28279, -11479, 27570, 25199, 13992, 4172, 27450, 35460, 27999, 789, -9455, 22668, -4512, -25780, -10958, -22456, -18948, -17266, 1438, 17804, 27724, 21769, 1370, -5999, 19575, 31884, 36252, 16974, 639, -10028, -15171, 6370, 4707]
16772D707k808J3019R773M519o457J4823j3078j1615j7057K195L094k7114R097
16759a6902J2895j3451M555p317L575J0435l156j355m806q386J5851L7066K5500
16746E4504j2041j8000J156O252P218p955N119J6335L511j6473j7222J4981P343
16733D4728j8377k2791L111N782J4096q70J3321j812l4545j1879k1003O625K1284
16720b330J6426j7607j4354M198K005Q729J5221k6964Q045J4393k5836m980m24
16707b3478o317K0106o65r272J9440J5347j1142n308J8625J3433q621K188k215
16694B2121j8657r564q866Q698J8917J6899q676J812k5114j4460J6106M066N176
16681H458l3631N117K7761L055k1297k8031K9076J2281r221j5287O054J754p407
$$ y = [4707, 1899, 14918, 24691, 29210, 22753, 37576, 24498, 12883, -4174, -1979, 1115, -25999, -16902, -4007, -17458, -12903, -20220, -16645, -6210, -9366, -10721, -15527, -23913, -8062, 29004, 54504, 42463, 24463, 25619, 31871, 39089, 31134, 36253, 52588, 56099, 39626, 22404, 37385, 44728, 26351, 3560, 6671, 12453, 26549, 25679, 39000, 37188, 2643, -9236, -30239, -23614, -2330, 14096, -3511, -17865, -13667, -11662, -2933, 12288, -14676, -6631, 7762, -18074, -23054, -23478, -29795, -9689, -10354, -19626, -186, 15161, 4019, -1289, 17336, 30769, 22148, 24336, 22121, 3464, -6100, -14966, -6268, 12649, 29548, 20872, 22684, -2430, -16890, -784, 3282, 8458, -25173, -20056, 7705, 10760, -10537, -38568, -9492, 2789, -6432, -21719, -15665, -13911, -21318]
16668b1318K1125M980J6973J1372p190j1082j1693J1590M806p783j5537k0626
16656b4383j5747L0330J8547m898k2151k2475M5150M9737m102l4087j6064n423
16644e566r575P746J5794m479m032J499K6771J1786j095j4434O577o697j1521
16631A2774l0236j0859K3007k247R910p546N341P911j8865k5901j4097K89L3171
16618a7348Q658j5071L313K8739K2481p636j2331K670L499j8085n934j8944n30
16605b6519m690q87m269J343o570J4539M769j349j038J6713N749p903p765m025
16591b1902R790J0204l677j4172r37K45Q473K1822N04j8713l1027n935J5497j067
16577c0895J8303Q565j5308k0108k8629M153K0206J3346L8135N857k6417L715
$$ y = [-21318, -193, 4787, 21760, 33132, 25942, 14860, 3167, 14757, 19563, 11780, -3757, -24383, -40130, -9800, 8747, 3849, -18302, -40777, 4373, 54110, 50008, 15921, -143, -5566, -15141, -7395, 8399, 3920, -112, 1387, 28158, 39944, 38849, 24415, 30992, 24295, 12774, -17462, -28321, -5314, -7561, 2349, -5197, 144, 8055, -10810, -36711, -50808, -50519, -17348, -8690, -23761, -20448, 8291, 30772, 23136, 10805, 13475, 16974, -1111, -7045, -25989, -26519, -31209, -32096, -36365, -35022, -41592, -27053, -22284, -23633, -24671, -7958, -2209, -10112, -17877, -21902, -12112, -1908, -5585, -19757, -20694, -20449, -11976, 9846, 10350, -8363, -39390, -45325, -29828, -30895, -12592, -4027, -19335, -39443, -68072, -63919, -43713, -30367, 7768, 13625, -12792, -9077]
16565i077Q989n5p472o282K4188J038K1062o969j3830j0842j3317j9885j1274
16552d3726K978M1480M4603R795l933k1080m3744J7818L3072n451j9452j9152
16540f792J3148J1455k400o799j6817J957J0887M928K484R788L576N896P013l6869
16526A455p828L454j5600j6761J4874K2883P432r610n751N68j315p219q221r957
16512c1596k1429k0793J0556L304K4574O895k6792O879K1406O511J8780J2445
16500A0740j5033K496N636O46O530J461p641Q175J6006R939J6471J5397J0916
16487H1739q805l2744J069n092J1375J969k0202l7701j4257k484j3027O458J8449
16474a3253j0875K075J2777N247M397p002J4792j1119j9613p385j5385K672Q986
$$ y = [-9077, -88, -143, -7615, -13897, 10291, 11329, 32391, 25422, 11592, 750, -12567, -32452, -43726, -40748, 732, 45335, 55130, 51197, 30117, -13627, 4191, 37263, 31812, 12360, -6792, 6356, 17811, 15411, 8612, -8205, -6248, 4639, 9567, 12051, 21839, 25415, 31311, 38324, 1455, -6373, -2919, -18519, -35280, -20406, 2477, 9909, 299, -5452, -4884, -6199, -13418, -21639, -31596, -53025, -73818, -63262, -59958, -35384, -28489, -55281, -48402, -26996, -20485, -1705, 10740, -4293, -1797, 3839, 4485, 11015, 12476, 4835, 13010, 29016, 38955, 55426, 70823, 81739, 72934, 40190, 41259, 36167, 47542, 49511, 29309, -8392, -22649, -25133, -38160, -31702, -13253, -24128, -22053, -9276, -4029, 368, -6634, 8158, -2961, -22574, -29959, -45344, -42672, -33686]
16461c3686M0206j3787J1253J6105J1189j3921j4514n988r610J5948j3122m5526
16449e5453p654L3669K1421j606J8520K4515l4018j8953L265J758J4946L209n275
16436a656o039L493L955Q203K2333M36Q601j8321j1785N887L948j7039l865L0294
16422B8445J3495m749j1981p224j7460o59j236j3362J3988O229j1765n398L36
16409a1341J3909K4087m348l0994o767O271k8767Q551O31J1416Q080n582o955
16396b1809n870J563J4056O99j6589o992j5745J1787J6724j8944M408K4344J3001
16383F33Q080O415O953l3576j5478J2470o733q110M099K6837J9922J3065j2372
16370B2205j9653o046Q61K82j4668o113J3392N271j2334k6284j5992L510K3090
$$ y = [-33686, 6520, -7267, 3986, 20091, 31280, 17359, 2845, -3143, -12753, 3195, -9927, -55453, -63107, -29438, -8017, -9623, 8897, 33412, -606, -19559, -16294, -14536, 410, 3619, -1656, -7695, -4202, -247, 7956, 30289, 30725, 39326, 21005, 9220, 15107, 19055, 2016, -1849, 28445, 41940, 37191, 25210, 17986, 526, -133, -1369, -14731, -743, 5486, -6279, -11677, -11341, 2568, 26655, 22307, -8687, -15454, -9183, -37950, -29399, -28768, -17352, -9272, -14854, -21809, -27679, -26116, -12060, -11361, -27950, -34942, -50687, -38900, -22176, -41120, -36712, -12368, 633, 8713, 15128, 22081, -11495, -26973, -14503, -21236, -29346, -25247, 1590, 21512, 34577, 22205, 2552, -3494, -2633, -2351, -17019, -23132, -9740, -4469, -16803, -43087, -59079, -55569, -32479]
16357c2479J3957J9184o055j5828j2857m555o327K2594L1738N650j1550j4383
16345a0911J3413J5997j5461J6347J100K717k5419j6528J768K603J6901K9087
16333C1614K3973q171k3233J6056P542J0345J1124p695o120j2747j8369p363O826
16320B3782J6701m6078q805J0543k451K359K6209J9733P409k6209J5920j0984
16308B8129l5994j5340q626J1595q546j2310R905P808J7080q010k1357j2558K2605
16295b5619n363Q164J7902M398j8282n128r119K7992K1909J7610j1065k9320j3798
16282a9719L5421P001r978l7497p173K7984q293j3041k0455k6277j7793K2839
16270f6981J9604J2919J6194K533k0012R913k560R376l462k7570m517K5673J180
$$ y = [-32479, -18522, 662, -5393, -21221, -34078, -38633, -44960, -22366, 9372, 15022, 3472, -10911, 2502, 18499, 3038, 19385, 20485, 23202, -2217, -18745, -16977, -14374, 2527, 31614, 55587, 47416, 24183, 40239, 47781, 58126, 69250, 61555, 55435, 42688, 24319, 16956, 23782, 40483, -5595, -14400, -3857, -6308, -3949, 22260, 41993, 49402, 23193, 39113, 28129, -7865, -23205, -31831, -20236, -28782, -41092, -31187, -23379, -6299, -14309, -35666, -48224, -25619, -30982, -22818, -4916, -518, -18800, -23928, -33047, -5055, 16854, 34464, 23399, -5921, -19719, 15702, 22703, 12725, -24772, -31945, -3961, -12254, -25295, -45750, -72027, -89820, -66981, -47377, -34458, -18264, -15731, -35743, -25830, -28390, -19014, -22476, -50046, -54563, -28890, -27710]
16257b7710j7121q031K3444J7247j2532Q772q899Q501K2064M135m478N684K7876
16244C8952j7875k5617J1730j6465n271K0173n930l338k1560n318K2127j7494
16232b5886j7645m337L0539K0971J773j3523j5160l573j9146o046Q299J6783K4687
16219b264O841j4832j2104j669J9128J0459j7960k8437q411J5552L0439j9242
16207b2500p568J6782N900k3231j5091k138k579K7174J8817k1379O743n981j0592
16194c5643m664k49k421L501O663j2447j8490M891K487K9305K3324J1049j7164
16181i858l997K4133N703j5427j5894k4397R24K9666K6241L935q690j2753j622
16168b036J895R624p422j3176o240J0197K4883j723k5021j4774J5359R575j8616
$$ y = [-27710, -44831, -52862, -29418, -12171, -24703, -15931, -24830, -16329, 5735, 9870, 5392, 11076, 38952, 21077, -4540, 7190, -9275, -14546, 5627, -303, -3641, -25201, -30519, -8392, -25886, -43531, -47868, -17329, 3642, 5415, -8108, -23268, -26841, -45987, -52033, -43734, -26951, -2264, 4577, -10255, -22359, -24028, -4900, 5559, -12401, -40838, -49249, -33697, -3258, -22500, -30068, -13286, -7386, -30617, -45708, -47846, -50425, -23251, -4434, -25813, -19070, -25051, -35643, -40307, -40556, -42977, -39476, -32813, -45260, -63750, -58859, -56372, -27067, -3743, 7306, -9858, -13855, 10278, 15981, 554, -15340, -39737, -38813, -9147, 17094, 21029, 12339, -414, -2036, -141, 9483, 2061, -11115, -17355, -7158, 17725, 16002, -9019, -23793, -8434, 1141, -17475]
16155a7475Q096J6277K5191M701j1392n983p417Q778L146r91J2872q451j3653
16142A3699J478r05j868K4346k590j6626n586O303k1356k38K2635P636o068k9709
16128h849j5620K1764K9502m50o12k1403l776J738L010j7575K4282J4722j0345
16115A6388l305o603k2005j2204j035q024o573r7K2693K4435q528k2723j0207
16102c7788J614N787k050k2154K2728M762j4689m257J2061J350O640j1479j8250
16089e5725l136J7111J7095P496J2409R405m115m0134J772K4546K40k497L6455
16076B0922O185k3150j0797J8838n351L591J313j6568k1666J2773L1454m240Q694
16063B1998J1536r650j6825k1596J3595r7l0453l0986K1579J1889M743p918K271
$$ y = [-17475, -9379, 6898, 32089, 36790, 25398, 19415, 11998, 20776, 23922, 22931, 35803, 27352, 13699, 15177, 14272, 12404, 36750, 34160, 17534, 11948, 18251, -3105, -3343, 19292, 26928, 20860, -8849, -24469, -2705, 26797, 26347, 25735, 4332, 556, 2294, 5304, -12271, 12011, 26733, 16388, 13083, 6480, -15525, -27729, -28764, -36788, -43361, -43458, -20765, 3670, -4858, -27581, -37788, -36174, -30387, -32437, -54591, -31863, -27101, -41790, -46047, -33986, -32636, -25996, -37475, -55725, -58861, -41750, -24655, -17159, -4750, 4655, 540, -39594, -37822, -13276, -13036, -15533, 20922, 27107, 3957, -6840, 11998, 6647, 10238, 11551, -5017, -26683, -13910, 17544, 13304, 21998, 33534, 23884, 7059, -14537, -942, -1039, -31492, -62478, -40899, -29010, -24267, -32185, -29914]
16050b9914K3731O690j1888k5689N782M353r854J9663L6317J8958o050j0768j2178
16037I153r724r640m367L206M688j6471j2511j4345j3068o312L9200J1339J0227
16024h625R417o391J076j6563O861q535R048J2511k2209r299l8107k0131J5837
16011g5110J3873L1943J1364n726k282k0196Q635K8941j492j8805N418K171K386
15998a8880O225L686k1466r680R524J8455J1793l1801r262o549P17K4798K4706
15985B266R905j2554n443R32l107j3000k8831J1481L1388J4064j2141j131N810
15972c61J5780K670P354M796j1452k2186N324p686Q948J1j44j3369K642J5404
15958G731M945q869j7393j0936J5148J5353j1952k085J325Q121K4144m931J3906
$$ y = [-29914, -6183, 507, -11381, -37070, -31288, -26935, -36789, -17126, 19191, 38149, 32099, 21331, 9153, -571, -10211, -14578, -11372, -6684, -23155, -35666, -50011, -63079, -69391, -30191, -18852, -8625, 792, -5599, -4523, -21086, -14225, -22760, -13712, -1201, -23410, -32709, -70816, -90947, -75110, -61237, -29294, -17930, -23656, -25938, -46134, -37499, -8558, -10050, -28855, -23437, -21266, -18880, -12655, -8969, -30435, -40115, -30591, -12136, -343, -32144, -41406, -47955, -47238, -22440, 2266, 12171, -383, -5826, -4894, -8001, -21001, -49832, -38351, -6963, 7101, -5040, -6171, -361, 15419, 18089, 25443, 30239, 18787, -3399, 1925, -5761, 3187, 3198, 3054, -10315, -7673, 7731, 12676, 3807, -13586, -24522, -9374, 5979, -5973, -8058, -6733, 1388, 25532, 20601, 34507]
15945C4507j1218j0333j3065n24J5322J1536j1797k9277k5856p594m408O405J1606
15932c4696J35j3845K3987m005J7682q514j4384J9518M3101r794k1872J076j0333
15919a1944k2604j516K0699J3225P087j0822o123j0046l64P012O464l815j2504
15906b5251L811L6715K14o623j0713J5896J5474r698l1548j2095J3083K316K2185
15893A3766o506p45j1659o705J3881O758q290n926K413M758q239N010j460k3156
15879b6100K76K2845L0238K0811P407r341o398l5864q018o841Q669J7435j2082
15866C037k1885J757n07j0431K597L3846j0067j9144J651N976M068m290j1439
15853b4831J7566M048K2292l279j3185j3722K244j386K129o957J1243J2845o791
$$ y = [34507, 23289, 12956, -109, -633, 14689, 26225, 14428, -14849, -40705, -48299, -52707, -46302, -34696, -34561, -48406, -24419, -28424, -10742, -19256, -33640, -14122, 28979, 19185, -2687, -1611, -11944, -34548, -36064, -15365, -2140, 4947, -5875, -11998, -22044, -22408, -15396, -8932, -12747, -25251, -21440, 15275, 15489, 8866, -1847, 14049, 29523, 19825, -11723, -23818, -10735, -8419, 13766, 7260, 6515, -5144, -11849, 2032, 8790, 500, -5426, -3013, 1745, -6494, -1484, -2944, -26100, -25824, -2979, 27259, 48070, 55477, 46136, 39738, 3874, -4144, -10985, -2316, 15119, 3037, -18848, -17091, -17598, -28029, -25432, 8414, -1653, -20797, -19146, -13170, -9102, -13392, -24831, -7265, -3217, 19075, 15796, 2611, -11111, -8867, -10253, -8124, -15081, -3838, 9007, 2216]
15840B216P674r556j6997L782K5576j5838j0814J3260o902q359j6550j0695k839
15827d6042Q729J0606J7317n137k5647k5381J0096K4904j4438n412K9737J5121
15815e547j040J6800J1041j3119k2542j3238J0364j4139l833K5873k1989n92J5838
15802a6123j9761o328J2539L6438N743K0328J7342j9217l8045k0033J708M629
15790b0780j1253k3966J6952K1804K676j750l007j2157K0653K4002j6076k3101
15778b6003j570N322l602O416N92J1803k7988O504P854P853K0733q572j8750J454
15764a7954K321J7680R907J910k0302j1208j8609j3279O381l984Q915M513L0874
15751b835J4220P50O449k5618j9215M0483K8124J2272k7828J202j8939j1159J3843
$$ y = [2216, 9890, 334, -16663, -12881, 12695, -3143, -13957, -697, -7599, -15958, -32508, -43203, -46042, -37313, -26707, -9390, -14527, -40174, -65555, -55459, -30555, -44993, -50405, -20668, -5547, -6587, 10213, 21254, 8135, -14407, -27645, -17281, -31420, -35253, -9380, -31369, -31961, -16123, -35884, -42212, -29673, 6765, 12508, 32836, 50178, 30961, -7084, -27117, -25409, -20780, -32033, -55999, -39047, -17243, -14567, -16317, -19324, -31481, -10828, 13174, -2902, -26003, -27573, -22251, -25853, -19437, -18845, -7042, -35030, -28526, -20672, -12819, 7914, -658, -19408, -17954, -15633, 2047, 11954, 13864, -6438, -17646, -36255, -49534, -43153, -47137, -38222, -33709, -2835, 11385, 12135, 18584, -7034, -26249, 14234, 42358, 54630, 26802, 28004, 9065, -2094, 11749]
15738A1749J0532p675J459M005J1304j7009l800l398j9857j1765J7637M772p74
15725b820m0243J685L4021J1588K8071K2808m853K49k0040j5452K0536j8795l0929
15712a4174M736R481m827J4366J0730j2660o437n52J0743j1695Q343K0577j6666
15699A1965m19J0779o230o474R555J4422m1564l7622J5738k648j1650M923R442
15686b9783K296K0311M5884o032j6562k1237o234k293J5827K0816n496M100J1856
15673C3453k104k1115j9805j7612j7019R085O628J3563O04k326K2809Q636l4821
15660b0024j9889p059j4994O187J8712J3460L749K0377K2684q500K561q919q281
15647F4O545m915l2725j5918K3489K719n329K7190M1722P219m803k403k6980l0656
$$ y = [11749, 22281, 14606, 16065, 20070, 31374, 14365, 10565, 7167, -12690, -24455, -6818, -2046, -2820, -43063, -41378, -7357, 4231, 32302, 55110, 50257, 50506, 30466, 15014, 35550, 16755, -14174, -9438, 43, -4784, 9582, 20312, 7652, 1215, 663, 11406, -289, 8054, 28631, 11965, 11546, 22325, 16095, 9621, 19176, 33598, -7966, -45588, -29850, -32498, -44148, -39225, -29783, -27487, -7176, 38708, 32676, 16114, -5123, -11357, -13650, 2177, 22993, 17497, 21597, 33453, 31349, 10234, -9571, -27183, -44202, -35117, -28489, -14926, -14322, -16648, 6161, 14797, -20024, -39913, -46972, -61966, -55779, -37067, -23607, -19858, 519, 23203, 14703, 17264, 8345, 64, 6609, 1694, -31031, -46949, -23460, -20741, -26070, 1120, 42842, 50061, 45258, 42855, 15875, -14781]
15633a4781m0922J482R879J2986j4086j842K27m738L3998k930j9025J2062L3378
15620E688K1200k216n469j6221j807J2710J8523N904j8812j5430l90L446j7600
15607a0474j9527m2966l5064K3097N5334J8298m010j0098j0416j9209L0440J8966
15595e629j4075j5409P491J4029j895Q871K5578P014l7204j8658R254j0222k5405
15582e6260L3312r903r517M8273P670m634k667k042J2486J228m287k2807L84j462
15568a0226j3669N479K5201K0137j7568k7174j1792j3480J8188q846j1441J1776
15556c3415J4460K1793j1132M908P281j1321L243j2940k635j3362k5757n848J8532
15543d6193L0924P907R092j8057N97J1696J4235k500j7788m2778J5881L3571N682
$$ y = [-14781, -55703, -54221, -44342, -31356, -45442, -47284, -47057, -51795, -17797, -20727, -39752, -27690, 5688, 26888, 24672, 19203, 2982, 1175, 13885, 32408, 38312, 19500, 4070, 3680, 7126, -10474, -30001, -72967, -108031, -84934, -29600, -11302, -15312, -25410, -35826, -55035, -24595, -5629, -19704, -35113, -27622, -13593, -15488, -6617, 18961, 25975, -11229, -29887, -20633, -30855, -56260, -22948, -32851, -42368, 5905, 13575, 8941, 6274, 4232, 16718, 17946, 13659, -9148, -8764, -10226, -23895, -18416, 6785, 26922, 9354, -17820, -29612, -43092, -24904, -33750, -45191, -33415, -18955, 2838, -8294, -3386, 3895, -7426, -4183, -17123, -19758, -33120, -58877, -64725, -46193, -15269, -7362, 1730, -16327, -15730, -4034, 10201, 7701, -10087, -52865, -36984, -3413, 2269]
15530B269j2081l3401J4927P030J677J7810N987j8315j1333L1509j40p802j0133
15517a1996o768j9439j4253J3626L7447J7298j4576o717k0035j8622r510K0853
15505c2692J8712J9946r118l8799k7834K271Q026J9387J2941R360K9692K498L209
15492A7599K357J4036o402l8483k0291j0809J008o408J1735K4213J0623J8870
15480A8048j2532k9607O35J901J6488P551J8028j5906o474J8591j2921l3007j1277
15467d0482J2847K0304L1164L0337L0001j2009m1628k1992j4173n656k2773K4400
15455i660J2301L753J4422m470j6089K23K857k5166J4181J3585R505j9290o041
15442i889J9048j0072n111j0143K0854J2429Q093K635m2007j4195j0234J5062
$$ y = [2269, -9812, -43213, -28286, -21256, -19579, -1769, 4218, -14097, -25430, 6079, 5939, -1863, -11996, -18764, -38203, -52456, -38830, -1383, 15915, 1339, -5378, -25413, -44035, -53545, -32692, -13980, 5966, -3152, -41951, -69785, -67514, -59488, -40101, -27160, -17800, 11892, 14390, 17599, 19956, 33992, 27590, -10893, -31184, -41993, -40985, -47393, -35658, -11445, -822, 18048, 5516, -24091, -23456, -21555, -5067, 2484, 20512, 4606, -1868, 16723, 3802, -29205, -40482, -27635, -7331, 23833, 54170, 84171, 72162, 30534, 8542, -5631, -11287, -34060, -9660, 2641, 6394, 20816, 16346, 257, 480, 3337, -21829, -7648, 5937, 15442, -3848, -9889, 9159, -913, -6024, -16167, 4687, 17116, 25209, 27844, -14163, -28358, -38592, -23530]
15430b3530J7463J4936k793J011j1924j0265K334K3645M416j0906k277j8767J2677
15417c980K2674J1870r904l686p628J2861k6343l4570O17j3511N290L3757p029
15404a9582L985J9958K5838J049q189j311j2285k3145J2208j3287l784O191l847
15391a6201P223K264L5122K1723k4719k8852J0784K2662o18k4285j8311l3366
15379d6574n024J9119j510r358R641K5758K1051k5898p234J6297j1570J4174K3496
15366B2368K708q722O032M731J3967l016k3206k055j451j0162j0065j3697M168
15353a8400j8213j4452k057O433M3994J1892l397Q690j5970n663k0376q705K011
15340c4213n705N00q856R628R674m272J9372J1738j0475j8265j4997O236P89J4972
$$ y = [-23530, -6067, 8869, 6076, 7087, -4837, -15102, -12768, 10877, 15293, 4387, 2110, -16657, -3980, 18694, 30564, 20660, 16974, 9346, 22207, -4136, -38706, -38089, -51600, -46310, -12553, -19582, -15597, 4361, 30199, 31248, 23059, 21748, 9463, -13682, -1474, -14761, -18545, -12354, -16201, -8978, -6714, 28408, 50131, 25412, -3440, 7344, 30006, 29388, 5103, -13208, -46574, -51598, -32479, -33989, -43347, -33706, -7948, 13103, -12795, -20029, -3732, -15302, -1128, 22368, 25076, 16354, 22386, 27117, 41084, 38068, 14862, 12807, 11356, 1194, -8871, -22568, -18400, -36613, -51065, -53122, -46689, -2695, 9197, 5800, 14490, -1480, -7143, -27519, -36224, -34213, -39918, -39418, -48274, -38646, -28972, -33244, -13872, -2134, -12609, -30874, -45871, -39635, -38846, -23874]
15326b3874J6169J2049r693M877J3306L482r977q671n452k7658j3001J4897K2488
15313a1058j3528k7933P706K3165N971K9047J8481k5142J216r92k5069k9992p501
15300e5629J5223Q361J5756J0070J5089K695Q790L412j9367L639q993k4953j9703
15287d5610j179M6021R956K2367O279k4416r351j0782j052J9201k1408j9271q940
15274c8185J4270k5762j2322K1101j8698n025J0424J3378J8218J5363K74N75J3446
15261G057j259k8550k4682J1283P579m978L449r366K389J8030K2644P417j3522
15248b509n088J0632q429l4152P215R722J7192K5398R362j429J436J6495P654
15235E3499J6730l974k2161k159k0015k0733j4038k2534n662J5904j0755q199
$$ y = [-23874, -7705, 4344, -5349, -472, 12834, 16316, 6339, -2332, -7784, -35442, -48443, -33546, -11058, -24586, -52519, -44813, -21648, -15677, 13370, 31851, 6709, 7925, 6933, -18136, -48128, -55629, -40406, -32045, -16289, -6219, 8870, 11565, 20355, 23767, 4400, 8039, -954, -25907, -45610, -46789, -768, 9188, 31555, 37834, 13418, 4067, -6715, -7767, 11434, -9974, -29245, -38185, -23915, -49677, -61999, -40898, -59596, -64621, -54197, -40819, -22601, -7238, -6964, -6389, 7057, 5798, -22752, -47434, -36151, -28572, -33550, -30101, -39467, -37078, -19048, 3596, 11013, -2509, -7597, 3035, -5394, -39546, -32331, -22609, -5417, 19981, 29343, 27914, 29350, 45845, 53499, 70229, 66255, 44094, 41935, 21920, 1187, -12851, -35385, -41047, -25143, -35898, -44097]
15223d4097L1872J7177m98j2991L5896J9538K1672n237k6001l2182j3198O775
15211a274j310r525k1701j388K8729m542J3741J6183R717q653j1822j2269k1448
15198b5562O832R469K869q703O043K4117N656M024q772N884Q348j3838J9626R021
15184D5014m349L718k5538k7113J9888o356k2761m195L6046K7363O614k9028r406
15171I897J280j7784N003P23k4847k522R839O045O029L3530j2937k4479p50Q450
15157b523K03o033r519K0454K0880J5906L703l192l8416n507j7595R139Q7R74
15143a1439O643J1261L1367J6390j3742j5131o563j2913r636o773p90m470K4716
15130H920P867p839j0634M467k014K1505k27q900k7213J3054K0147j2146J4640
$$ y = [-44097, -12225, 4952, 4454, -8537, 27359, 46897, 68569, 63332, 37331, 5149, -8049, -1274, -2584, -12109, -33810, -35198, -6469, -11011, 2730, 18913, 28630, 19977, 8155, -4114, -25562, -18730, -9261, -6392, -15095, -9052, 15065, 20721, 24745, 15973, 21857, 30205, 16367, 35993, 45014, 40665, 44383, 18845, -8268, 11620, 5264, -17497, -21692, 14354, 41717, 48331, 19303, 9897, 11177, -6607, -1604, -881, -25728, -28250, -18411, -12366, -6337, 27193, 14256, -10223, -10973, -2523, -2320, -8353, -17872, 2582, 23462, 39368, 43071, 39879, 1463, -4044, -21639, -12500, -12413, -11439, -4796, 6465, 37832, 54222, 40480, 25349, 18786, 5873, -3763, -10536, -11326, -15796, 8920, 16787, 8948, -1686, 2781, 767, 22272, 22045, 13145, -14068, -1014, 19133, 6987, 21627]
15117B1627M520O313k523j2285j3277k6n225N284K0567J729l2532k2757j705o245
15103c6535J3365J3412k153l7976J0034J2759o81j5867r665P453K5425p096j0868
15090c8393M459J0958O833p836J2791J9037L316j1032J2307j7858q775J1648J644
15077i01k383m694J4380N66n2326J4459O661o007m0K0165K7911J8050Q149n834
15063C8156J0760k4841l0675k3178J5137j417J6618J448K3947j1956M108m880
15051A3227j6805K3485R342m726k430j5709j6469K903J6653L0981J6177j4782
15039D1847k9609q67j3929Q697K4878l088k7498l2190J0630K8528Q674l09K0753
15026C6517O513m1531l2445O277Q9J0290J0614k516J8435M029l6432N309L197
$$ y = [21627, 26147, 32460, 29937, 17652, 4375, 4349, -876, 4408, 24975, 26704, -5828, -28585, -30290, -36535, -23170, -9758, -11911, -49887, -39853, -27094, -27775, -43642, -53307, -45854, -20429, -27525, -38393, -33934, -22976, -16143, -23979, -11188, 7849, 11165, 133, 12440, -5418, -14193, -2545, -901, -3284, -7978, 6402, 6968, -45358, -30899, -24238, -30245, -30285, -10120, 17791, 35841, 43990, 38156, 48916, 24075, -6600, -29778, -14641, -16058, 560, 2008, 25955, 13999, 18107, 13227, -3578, 19907, 29249, 24523, 22093, 6384, -10085, -7182, 9471, 40452, 56629, 41847, 12238, 11371, -2558, 6139, 31017, 27929, 431, -31759, -21129, 7399, 16073, 15764, 36517, 43030, 1499, -30946, -24669, -24580, -14290, -3676, -6192, 12243, 16272, -20160, -14851, -11654]
15013a1654o022N63P364K632J0262o91j3583J8275J5140k3524k3291P933k3071
15000c9667K385J2641J6911L21J7615K0327q84l4726k1120K766J2404Q617J308
14987a102Q750N892j3027O902m858l4378J7615J178r457K527m720P341J2240L5050
14973B9953J0855k9624j0970m729j731n439Q393j105L989k0773k5525J8751J7192
14960a0763M1559n138m3939m472j2912J3279K454j319J4095J8506r256k7233P577
14947a7562L4899L514r683Q080o488j2471p419O860P444j0524p828j4750L2114
14934F186J5460k7022j4517n314P333J4390M138J7674j8790O675N948m209p913
14921C9j1914L450j9352J0023k78m105k35j1095p751Q31J6824J8033l6676j4984
$$ y = [-11654, -17676, -17113, -9749, -7117, 3145, 2454, -11129, 7146, 22286, -1238, -24529, -16596, -39667, -37282, -24641, -7730, -7409, 10206, 30533, 29649, -5077, -26197, -23431, -11027, -2410, -1102, 7648, 13540, 513, 7415, 2557, -31821, -14206, -13028, -22485, -19958, -24678, -17337, -5097, 29953, 40808, 11184, 214, -4515, -6246, -11685, -3292, -4397, -408, -21181, -46706, -27955, -10763, 30796, 25658, -18281, -22753, -35665, -22386, -19932, -21251, -7156, 11350, 2094, -25139, -17562, 17337, 20851, 11168, 19248, 12760, 289, -7130, -270, 7174, -3350, -11178, -25928, 6186, 21646, -5376, -19893, -25207, -17874, -3484, 654, 18328, -462, 6213, 12161, 7952, 39, -11875, -8425, -27777, -17754, -18032, -22137, -22372, -33467, -41218, -40387, -23563, -5530, -42206, -57190]
14907e7190J8691J1011L0438J2168m944k19l764J8961l730j7921M743J8337j6635
14894I946j108o87Q167J3337j4755k9539o60J6716P737O014J208k61l0702K2597
14880H010K7380k3125l2706l909O060k7054l079K3318O526j2124k9500Q134k921
14867e4990J6654K4200K5465k32j8538O678L565k433l6363N840L7700L9694J439
14854D8679l8827k1143J46L430R343k077j1443p838l742P697N469n937j5221k0314
14840e1778R659K0531k293J7929O444m948n259K714j0699r163J5472J3592K3004
14827B5205N379j267j6061j1564k7779j5431K747J8304J6763k2157R214J1879
14815d768N981o946J4582k5905k3545J6137J1942p197N552P740j468k6954O903
$$ y = [-57190, -38499, -27488, 2950, 15118, 10174, 9955, 6191, 25152, 21422, 3501, 8244, 26581, 9946, 8838, 8151, 16318, 29655, 14900, -14639, -15299, 1417, 9154, 15168, 16376, 16115, -14587, 8010, 35390, 12265, -20441, -24350, -18290, -45344, -48423, -25105, -18579, -30703, -60203, -52069, -54990, -38336, -14136, 11329, 11097, -7441, -763, 2802, 369, -35994, -30154, 7546, 47240, 48679, 9852, -11291, -11145, -7715, 1628, -449, -11892, -19730, -23472, -15775, -10306, -16243, -31464, -51778, -42119, -21588, -23881, -5952, 492, -4456, -9715, -7001, -17700, -26863, -11391, 2201, 25205, 30584, 29317, 13256, 1692, -26087, -41518, -38771, -20467, -3704, -25861, -16647, -4768, 1213, -5733, 8849, -17056, -40601, -24464, -12522, -19719, -14167, -6427, -7895, -34849, -27946]
14802b7946J5989J3186J3834j4913J0852L3304j5998j1611J363l749K134J0974
14790B7419p818k4175Q962q42K900p196j4307m581K9922j6052l4734j1337K0349
14777c1490m793J5602J1782n993M110J0800k0792k3079N940J621n426J2522M178
14764b5018J8558K7371K571Q949N225Q206O88o693p703j5469l2816k5415p9K0717
14750b0908J815j245O920M762j0451L359J1028R594r680l654k729R497l856m674
14736a0222K284K79J6990k0253l4356J2988J4711J5001R871L111k5929J764J5317
14723A556j317J6921J7197Q981k743j5012k934j3441j0987J5784p399n55O531
14710A2582N585O927m437r657L254k704R743n940j5095q193q149l412K6428R757
$$ y = [-27946, -11957, 1229, 15063, 150, 11002, 44306, 28308, 16697, 18060, 14311, 16445, 27419, 19601, -4574, 4388, 3546, 6446, -750, -15057, -19638, 10284, -5768, -40502, -51839, -31490, -36283, -20681, -8899, -14892, -10782, 18, -20774, -43853, -37913, -36292, -41718, -29196, -25018, -6460, 20911, 23482, 32431, 37656, 45862, 46550, 39857, 32154, 16685, -16131, -41546, -41625, -20908, -19093, -20338, -13418, -8656, -19107, -15748, -4720, 4874, -4806, -8460, -11189, -1692, -5548, -10222, -7938, -7659, 9331, -10922, -45278, -32290, -17579, -2578, 7293, 10404, -15525, -13761, 1556, 239, 17160, 34357, 43338, 40595, 25583, 22649, 9208, -1779, 14005, 6606, 6051, 12582, 18167, 25094, 20657, 11000, 14254, 11550, 21293, 15353, 258, -7935, -16084, -19496, 6932, 16689]
14696A6689j7085R377N273l6290l7376M794K0044J6546N608l773K6130K5594l195
14683C2336n2327l4788J3480K5074k4716l958K3374L6881J5405l865o68J2944
14671C9172M515j0756k6484N707L592J2613l925k2379o241j2571J8468r362k1537
14658b9188J5210K9180p521q456q563N911N84R341Q940l99p593k94j1490k3458
14644b7796K1383n637L0R968J3763j6347k2262O959R871R033L265L501j3813j2589
14630b0671n983o734J9037K0289j4853j6747P390l639J2786r056j3216J6402k251
14617a7246l077Q934j1847k4442j203J7352K4188j805j7116P001O080o596j5477
14604c5254J2864J1215L457j2073J499J2512j7070m292k4256O749J9514K1476
$$ y = [16689, -396, 8981, 14254, -22036, -59412, -54618, -34574, -18028, -12420, -16193, 9937, 35531, 32336, -19991, -54779, -41299, -16225, -40941, -44899, -21525, 15356, 30761, 26896, 26228, 39172, 43687, 32931, 6447, 12154, 15746, 28359, 24434, 2055, -4186, -16757, 1711, -7651, -29188, -13978, 15202, 7681, -775, -9338, -3427, -2843, 6498, 15438, 15039, 7446, 7152, -4338, -27796, -6413, -12050, -12020, -2052, 11711, -4636, -26898, -19939, -10068, -1035, 2230, 5731, -8082, -20671, -26654, -33388, -14351, 5938, -8915, -25662, -18272, -21911, -9125, -18181, -31397, -14995, -17246, -20323, -11389, -23236, -47678, -48881, -31529, -7341, -9146, -26262, -19261, -13181, -19777, -35254, -22390, -11175, -7718, -19791, -18292, -5780, -22850, -27142, -51398, -44649, -25135, -3659]
14592c659Q987m978o423L600J4722o691J6878j3463k3268P304J1556o643q744
14579a0822k0429m069J5078K484P207K7616O385P611q114M408J3317p370k5931
14566G371L408P436P736K0614O083j1984k1078M417n96p032J0062J3236l9706
14553c3j7226p735J2150R018j553l901N088J0656j2186l4710K466J3992J2939
14540a1035q098N857q355j02R128K5237j376k2186k7668k0996J4706L2124M610
14527h154l8551K691K0587J098J4947J2311P964l883J1207j7039j3085o86Q421
14514b172p535R604K0186J1047j2480r123n095K0650J6049j1278j7261o797J5671
14501B1466K6045j9128k0431Q876K454r032J0525P07j2404j0568k6779l05l290
$$ y = [-3659, 5328, 350, -6073, -2473, 12249, 5558, 22436, 8973, -14295, -6991, 4565, -2078, -10822, -31251, -35320, -20242, -17758, -10551, 17065, 23450, 31061, 22947, 27355, 40672, 33302, 7371, 10779, 18215, 25951, 46565, 52648, 40664, 19586, 24003, 23407, 16375, 26437, 39673, -33, -17259, -24994, -12844, -3826, -5379, -9280, -4192, 6464, -5722, -40432, -37966, -23974, -11035, -19133, -13276, -21631, -21733, -12605, 12632, 11256, -10930, -38598, -59594, -44888, -12764, -8154, -46705, -44014, -23427, -22329, -7382, 4929, 12893, 9010, 20217, 3178, -9907, -10593, -2172, -9707, -103, 20083, 31130, 18650, 9527, 4432, 25082, 41131, 29853, 12592, 5795, 21466, 47511, 28383, 7952, 16828, 19282, 10250, 20775, 21482, 9078, -1490, -28269, -28574, -31864]
14488c1864P068K9690N57q649n79K1511K3563K218l0391n131R34J5829J0257k4641
14474A0372k2621N948m536j5720r021o471l655Q991M1560J0457N392q026j2773
14461a03k2009n695p406r060P509L5937J8056k4294k5308J1963Q320j1321j018
14448b4429J1118N690L398m596j4490j2551J2252j6631J6875K0992k7580j1811
14436d1763K1393K3465r618k4448l473M610L358Q172P742q483p841N1986J6132
14423D1232K636j1327j9722l6119m988J7070q56O91N372m130J5675M673m4517
14410c4310n258L8389M354J2749K431r261r592P141l478j5739j0783k4433L1646
14397a6144J5756o345J0420j0210Q174N20J5682k3706j0386O23K1298K4672l242
$$ y = [-31864, -24796, 4894, 5451, -3198, -3777, 17734, 41297, 43515, 13124, 7993, 8927, 24756, 35013, 10372, -12249, -6301, -10837, -26557, -35578, -42049, -45704, -36713, 4847, 15304, 20696, 12670, -103, -22112, -27807, -35213, -44273, -36764, -827, 17229, -7065, -32373, -20410, -12090, -23411, -24429, -13311, -7621, -4223, -8819, -23309, -35860, -23608, -40239, -23364, -2372, -29952, -41763, -20370, 3095, -6523, -30971, -34444, -29834, -26476, -18304, -10562, -19045, -26886, 25100, 41232, 43868, 32541, 12819, -23300, -28288, -11218, -12074, -11383, -6011, -10141, 5534, 10207, -34310, -39568, -1179, 3175, 15924, 18355, 9094, -498, 6643, 3165, -12574, -23357, -47790, -16144, -388, -6733, 3687, -6523, 1651, 2171, 17853, -5853, -16239, -15616, 5682, 30354, 27112]
14384B7112o868r612l3245K33O98J667J4366R268j9424j5566O422K6582K029j6410
14370a2748K7392K9335M564m205j3143j728j5740q223M360K7332q56k8369k7965
14357a9994j240j0841j4550J1744n629L6603n608o648M811J9270m399j0934L774
14344c641O495r669n699k71J6505L017j1219j8245j5911J3614J2082o821k3713
14331d3476N235M068P709N770Q512M429J693J1589k264K3134L691l0069M077p044
14317b946Q925j3834j3856M949K2843j4667j9087l040K1666L9191J331k6724j1437
14304f686j7718j3173J7812J3018J818J3659M301Q075k6591m595J1366R978j623
14291I641k3403o372J7163M564p154N37j4859k8837N17J6986K1555l498J7828
$$ y = [27112, 20244, 10632, -22613, -22380, -21682, -20015, -5649, 3619, -15805, -31371, -24949, 1633, 3662, -12748, 14644, 43979, 48543, 44338, 31195, 29467, 13727, 5504, 9864, 37196, 36340, 7971, -19994, -21234, -32075, -46625, -34881, -40510, -3907, -9515, -16163, -11352, 7918, 3519, -7415, -3641, 2854, -6815, -12514, -12785, 3720, 6737, -4482, -22727, -38638, -25024, -12942, -19763, -43476, -38241, -34173, -26464, -20694, -12182, -7753, -6060, 5529, 3265, 26399, 30090, 21, 4098, -2946, 5979, -7855, -21711, -16762, 6081, -8586, -27673, -30713, -9047, 30144, 31475, 4751, -6686, -24404, -37577, -19765, -6747, -4929, 8730, 13031, 21106, -5485, -10080, 1286, 11264, 9641, -13762, -20134, -2971, 1593, -5561, -5024, -19883, -48720, -48203, -31217, -9662, -13160, 4668]
14278D668m371l2892K0663K4871j4831j7250L0290M2049j2588k3227r351l0k2924
14265a4923r418M3631M627m758J329j566k7249j0496j9352J940J6706M0900K371
14252B3742o500j173k5360J0781R612r564l597l294m274J3551J831r016J3549
14239A0288L6104K4609M651p892m8818P136J1214j3285j3987r813j6180J5344
14227f29l707k258K7359n911k0393N707j0514p960K5008j6301J5910J4091J5760
14214C6162j6182l3598j5886O930J9131J1239P624j2904k3762j0398j9457M086
14202d7015O945K2045K4816o494k2123J9281K0932q232k7169k8440j3320L0579
14190b8195R287K0085J5462Q00j5257j5677j2305J7320J8849j513j1155J9798
$$ y = [4668, 297, -32595, -11932, 12939, -1892, -19142, 11148, 53197, 40609, 17382, 8031, 8001, -14923, -24341, 19290, 23917, 19159, 20488, 18922, -8327, -18823, -38175, -36235, -19529, 21371, 23742, 17242, 16069, -9291, 1490, 11102, 1538, -2059, -5353, -9627, 3924, 5755, -3261, 10288, 46392, 71001, 75652, 67760, 18942, 26078, 37292, 24007, 10020, 207, -15973, -629, -4336, -6594, 20765, 14854, -5539, 168, -10346, -18306, 6702, -9599, 6311, 20402, 36162, 19980, -13618, -29504, -22574, -3443, 7796, 15420, 2516, -21246, -31644, -51101, -47015, -40070, -18025, 6791, 297, -21826, -2545, 18387, 10155, -17014, -45454, -58774, -28195, -18908, 1177, 16639, 17439, 2182, -13495, -25800, -8480, 10369, 8856, -2299, 17499]
14178A7499M533j3054j6453k7103M936L1449j5288j9533r02J4693J5568K2391
14166A8736K705k0761m684l306J5042K5646q480j1890r965J2101L1551M925j6737
14153C4883K765l8181p590J8902R65r661j7801j4900J4090J1132K1318L255k4952
14140e775r569J351K305N604J753M810r591J5011l1361j8640r729n519M045j7814
14126g3119M019J872j1535j3932L0252M3561J1423J2403j01L0374K905N035o32
14113D2525m0563l1324J4597J652J1556O715j5096k8867J1113J6227l23j2367
14101b4155M86L3913N877L190k0570j3051Q784J77R205K4243J0799q899l8268
14088h269M579J371K0182M592J6470o599k1891k9920K774O594m30j6523J3728
$$ y = [17499, 22032, 8978, -7475, -34578, -29642, 1807, -13481, -33014, -33916, -19223, -3655, 18736, 21441, 680, -4004, -7310, 7732, 33378, 24898, 13008, 3043, 15144, 46695, 51620, 34883, 37648, -533, -8123, 10779, 11744, 2083, -15718, -30618, -16528, -5396, 15922, 19177, -5775, -15344, -13993, -11688, -6084, -4331, 479, -9112, 5899, -25462, -44102, -53831, -59350, -55305, -73119, -69100, -67228, -78763, -92695, -62443, -18882, -7459, 4944, 4843, 35217, 38122, 43157, 42525, 1962, -29362, -14765, -13113, -1557, 5158, -9938, -38805, -27692, -11465, -11788, -24155, -23669, 10244, 16121, 19311, -1259, -14310, -5526, -5349, 3856, 28099, 38898, 29999, -8269, -3690, -2319, 17863, 22455, 38925, 32326, 10435, -19485, -16711, -10117, -10547, -27070, -13342]
14075a3342L4619N350k7782O351m00l814M774k5352j9600K6378K180Q378K997
14062G37N293k4804K1309R566j5769j1736K3637J4872j7031l5633J895J0217l6197
14049e3644n035J9779K9074M0195k3533k0237j8050R295L6467K141l2744k6003
14037d2295K5490J8967J1876l664J9652j187j9593q805N432K9419K4261M979j9585
14024D4947j0593j4304q402q915J7195K85j3802j3538k801j013M891j198M653
14011b595k243k0037K2491n035k7561m047P635R485K2106k1074l173k728k543
13998b9319N008o718l445P208K6834J3523j5886k657Q445J9871j0504J6098J1452
13985C9910k5520k9880J7856K3765j0989k0759k113L062J6191J4266J4597O32
$$ y = [-13342, 21277, 26627, -1155, 5196, 4796, 982, 5756, -19596, -39196, -12818, -10638, -2260, 737, 6030, -18774, 2535, 12101, -3668, -15404, 8233, 23105, 6074, -29559, -27664, -17447, -53644, -58679, -38900, -9826, 30369, 6836, -13401, -31451, -22156, 14311, 16452, -16292, -42295, -16805, 2162, 14038, 10374, 30026, 28839, 9246, 441, 5873, 35292, 59553, 64532, 44947, 34354, 20050, 11648, 2733, 19928, 20213, 6411, -7127, -9928, -10941, -6050, -7248, -2595, -4838, -24875, -2384, -7419, -34980, -39027, -31392, -21907, 199, -20875, -24048, -26776, -29319, -24311, -31029, -34474, -27266, -432, 13091, -2795, -5452, 2993, 22864, 12360, 28458, 39910, 14390, -15490, 2366, 26131, 15142, -5617, -7730, -4668, 11523, 25789, 40386, 41018]
13973D1018k9675K767M008q149k3034O028k0424P231J3278j0305k95p210K514
13960b2248L8311M770J0162J2180j4766j5466j1513l4437M205L3060K1956N747
13948C1961l6873q12j4588J1087J7595P890j4975l6215k0683J5714L5824L5293
13936C1218K5902k0878k8315J480L090K7277J6873k0631l9569j66J4118l4422
13924b4023j3104n690K7063M479L724J2694K2202p098K639J3079k0451j0910J4510
13911A9114p015M729p124k8452n192O03K3590O207j8599l5107j0443O400J8520
13898c2769R014l803k548m36j7789l802J0467L6723k336j2959n930K4952K4628
13885B3412k1663O443J1517j6190n208K4841J4032j1546j6023O936o632j4977
$$ y = [41018, 11343, 14110, 18118, 9969, -13065, -7037, -27461, -20230, -6952, -17257, -17552, -24762, -22248, 16063, 20833, 30995, 43175, 28409, 12943, 1430, -33007, -28802, 4258, 26214, 31961, -4912, -5724, -20312, -9225, 8370, 16260, 1285, -34930, -55613, -39899, -4075, 31218, 57120, 36242, 7927, 9407, 12497, 39774, 56647, 36016, -3553, -3719, 10399, -24023, -37127, -42817, -15754, -11275, -7551, 5143, 27345, 20247, 22886, 35965, 15514, 4604, 19114, 12099, 16828, 9704, -18748, -23940, -23337, 253, 6460, -12139, -47246, -57689, -51289, -32769, -23755, -27558, -30106, -30542, -48331, -52133, -41666, -4943, -7279, -20238, -26168, -1216, 23412, 1749, 8192, 19709, 3519, -1689, 23152, 37184, 25638, 9615, 16551, 9919, -5058]
13873e058j1823J386J3544L3080K199k1882j830O407q931N740J712K1201j4761
13860B0984l2731L0896K3152l0771J6775R986m173j4200J1386m10q465k319J3729
13847C3839J6004o501j8638m4206k3646m158r982M2748L4386j3110o716j9276
13835a9256p916N620k9507r04K2810K6089K4804k355j0103j6046O991j1156L1092
13822B0163L1902R586n1068k6368L968J2220K3099j398j6839j8719j2667J1887
13810a4234j4333J0596K819j1870k1365r791K8257k1294j7148J1314M1174J4299
13798a576j7302m600J1829K6779o339j16Q044r882O000K280m349J0541L65j887
13784A9787j3149j0153J9121M127J7488J8600R87k5593O212j8134j2390j6740
$$ y = [-5058, -16881, -15495, -1951, 31129, 33328, 11446, 9616, 16023, 7092, 12832, 14544, 35745, 20984, -11747, 19149, 42301, 11530, 28305, 38291, 34118, 19918, 31304, 30894, 22429, 20110, 33839, 49843, 43342, 24704, -19502, -43148, -47306, -57288, -14540, 19846, 6736, 20, -19256, -27172, -21552, -51059, -51963, -29153, -3064, 21740, 19385, 9282, -6764, 227, -10929, 20163, 52065, 61651, 10583, -15785, -11817, 403, 23502, 22104, 5265, -13454, -26121, -14234, -28567, -17971, -15152, -27022, -48387, -58178, -29921, -51215, -68363, -57049, -15875, -1576, -18878, -23478, -11649, 15130, 8791, 8675, 16719, 6837, 12837, 15117, 10768, 21309, 21674, 19787, 6638, -3515, 15606, 19733, 37221, 55821, 56808, 31215, 37427, 19293, 6903, -9837]
13772i837m197K6608j1742k645q029j3560j5032O423K1479J7082K0104J4610j8402
13759B2862j5997q834l870J0823l84J5672J3261J1494l122k5767j5699M284K9569
13746C4292j3800p454K6595m756O364j4381k2183m814K4452J7469J722k4840j1609
13733G057n338K07j0502o238O285k0995M997P779J8853M136l490j2017j54j5659
13719b5079J2643K0063J9711K1082M593j0260Q128k388o508j6666j6079K4351
13707C3591j147n521q345j6426j7965k4847N426j4321N82M2614K8767K4036K353
13694D8797J396k49J3060j6878r634P895R748J6126L520j2249J3289j5959k8864
13681B9998k2178J0050J7284j5912O603J8931m827k0437N391K6983j179j3407
$$ y = [-9837, -14034, 12574, 832, -1813, -9842, -23402, -38434, -32011, -10532, 6550, 26654, 41264, 22862, 6865, -1969, -5839, 4984, 4600, 20272, 33533, 45027, 41905, 16138, 439, 4723, 34292, 20492, 13038, 39633, 34877, 41241, 26860, 4677, -137, 24315, 41784, 43506, 18666, 7057, 1719, 1926, -8576, -14814, -8529, -29524, -24527, -16748, 2105, 6241, 2751, -9266, -9420, -25079, -12436, 7627, 27338, 48420, 53013, 42753, 50881, 48493, 41985, 25319, 9240, 33591, 32444, 26923, 18578, 2152, -15813, -40660, -35234, -49555, -48973, -6359, 22408, 46444, 48797, 50193, 49944, 63004, 46126, 36492, 44387, 54135, 70261, 73781, 61532, 74821, 58862, 29998, 7820, 17870, 35154, 19242, 25845, 44776, 39949, 19512, 24903, 51886, 50707, 37300]
13669C7300q752o34l399L308J0912l677Q747J0715l12k0690n660j642j6720k2292
13655a2796o825P54L3484J90k7337J201R795J418q44q061K578J0924K3372j287
13641B6566n330j4822k8827q15K3283L1356J1265l836J0766N717J7694M147K149
13628G9313l3516l2726O329k110J1895j0506J1213K4284J0470J7815k0188Q05
13616F3078l027l286r336j4461J0060K047l5299j7974J1347Q104M862K6259p19
13603D1655r822p749K689Q534J5602n088q39M954j2380J2509J7927p423m288J0409
13589F6690o566O009j2303l3745j6423J3293M6957K8704r074p826p699l8560q456
13576B1001J0484l2147O35N4387O932M20M887m01j2006p678j7517q158K3645J0399
$$ y = [37300, 28548, 27914, 24515, 27823, 38735, 35058, 43805, 54520, 54208, 33518, 27858, 26216, 9496, -12796, -19621, -18867, 14617, 14807, -12530, -11329, -1534, -116, -960, -9021, -6443, 4481, 27853, 26566, 21236, 6414, -22413, -23228, 55, 31411, 42676, 38840, 49606, 55323, 73017, 77164, 79313, 45797, 13071, 19400, 17290, 29185, 18679, 29892, 54176, 64646, 82461, 62273, 63078, 60051, 56765, 47429, 32968, 43028, 45075, 9776, -8198, 3149, 11253, 16115, 42374, 41655, 31833, 24084, 26773, 35307, 50909, 45821, 44982, 49936, 37556, 50065, 67992, 60569, 56281, 66690, 60124, 66133, 53830, 20085, 3662, 16955, 63912, 92616, 83542, 75716, 68017, 29457, 21001, 31485, -662, -27, 54360, 61292, 61712, 66599, 66198, 54192, 46514, 28997, 20839, 44484, 54883]
13562E4883q161j990P286k9084j9828Q834J8319K2979K2976p376k2980J708J7753
13549F5319O231J9499K2435M574k3284p153L983K8351J8957K298J8500J2057N705
13536A77472P718j3176p308L4042O5083M0078J2993Q738j4788J5265M0604J4878
13524C81599K0099L6854N2944Q4168P7880J22948K02865K67995L53552L22530
13514A923434J32832j79642l55858l35791k52854j34752r3050r3155p0347n2337
13504D88480r467j3526n0014k0986k6787k6916n893R4j4965k4242m058l5869j0228
13491B45623l045O424J1057j5162Q479J8607o981K7567J3893J3768l6465k5822
13479B57943J9372J5962k3190l4225m0169q47k1031J0805N637j7203j0782j0858
$$ y = [54883, 46722, 44732, 52018, 22934, 3106, 11940, 30259, 53238, 76214, 68838, 45858, 47566, 65319, 71550, 91049, 113484, 118058, 94774, 87621, 91604, 119955, 138912, 141210, 159710, 171767, 177472, 185190, 172014, 164706, 198748, 263831, 303909, 316902, 325640, 310852, 326117, 366721, 381599, 401698, 438552, 491496, 575664, 653544, 776492, 979357, 1247352, 1600904, 1923434, 2056266, 1876624, 1520766, 1184975, 932121, 797369, 704319, 611164, 540817, 488480, 479013, 465487, 415473, 394487, 367700, 340784, 334891, 334985, 320020, 295778, 291720, 255851, 245623, 242578, 249002, 260059, 244897, 253376, 271983, 265002, 292569, 306462, 320230, 283765, 257943, 277315, 293277, 270087, 235862, 195693, 194846, 173815, 184620, 190257, 173054, 162272, 151414]
13467A51414K761K39Q122k2509q491m814K2476M102J2308J1272J4115n022L285
13454A89258j8046N685P606J2607m550k3010j0863M463J630k0931k1496k9515
13442I2838N027j2831o599K4028J5932j857j9747j8194j3716j1471J014J0759
13430F5183J9669Q55J5139L910k6691l5355l534K8266K6054j5757l929K383J0397
13417H6590k5783j1008j420J5529J9569J8913J1939p912k9558m666o594R379J5305
13404I0283J0050k4966O429j5605k3996m0763o1138k9270m40p788K3921J7351
13392e5932l0550O064L7344K2014J5552j0753J3284l365K8347J8521j4777K346
13380B8095j7861j6193j5200L318l212R059M9536M689j9140K0677K5068m9009
$$ y = [151414, 154175, 154414, 162536, 140027, 131536, 126722, 149198, 153300, 165608, 176880, 190995, 185973, 189258, 171212, 176897, 184503, 197110, 192560, 169550, 158687, 163150, 164780, 143849, 122353, 92838, 97865, 85034, 78435, 102463, 118395, 116538, 96791, 78597, 64881, 53410, 54424, 65183, 84852, 85707, 100846, 104756, 78065, 42710, 39176, 67442, 93496, 77739, 73810, 76193, 86590, 60807, 49799, 48379, 63908, 83477, 102390, 114329, 106417, 76859, 72193, 65599, 74978, 90283, 100333, 75367, 81796, 66191, 42195, 1432, -59706, -88976, -89416, -97204, -73283, -55932, -86482, -80418, -43074, -21060, -5508, -16261, -2977, -6342, 22005, 40526, 25749, 28095, 10234, -5959, -21159, -17841, -21053, -11994, 37542, 42231, 23091, 43768, 68836, 19827]
13368A9827k5181J4813J6969K3841L7738j3570m452J215J8904k283j642q434J465
13355G9210n689j3711k2362j2831M3612l831R738K4612R235J0187K5073J6275
13343A59518K1724o346K2429j415k6239n664N7984K5123L4375J2540K8380P3231
13331C95640Q6745M2057P4228P8825Q7889K3961p1485j57128j03990l0522k1739
13320D04481j0475L333n3431o3427j2094j9367k7163j2944L814n494K0436P86
13308B28455m4851m4424j988N33n526p920n454l160J6725j7486l791J8896j2570
13295A17439j9544j910K0852J7366O383N819J6735P247j3905k2406o905l2923
13283I4248R082Q135o885K2074Q080q587l837K3471j1495R239L5815J0247j0322
$$ y = [19827, -5354, 9459, 26428, 50269, 88007, 74437, 69985, 71200, 90104, 87821, 86179, 77745, 79210, 73521, 59810, 37448, 24617, 68229, 64398, 74136, 98748, 107983, 118170, 143243, 159518, 181242, 174896, 197325, 195910, 169671, 164007, 221991, 247114, 281489, 294029, 322409, 395640, 482385, 524442, 598670, 677495, 765384, 789345, 717860, 560732, 456742, 426220, 404481, 394006, 397339, 343908, 280481, 268387, 249020, 221857, 208913, 212727, 207233, 227669, 228455, 183604, 139180, 137192, 137725, 132199, 124279, 118825, 115665, 132390, 114904, 111113, 130009, 117439, 97895, 95985, 116837, 134203, 140586, 146405, 163140, 170387, 156482, 134076, 127171, 94248, 103330, 111465, 104580, 126654, 134734, 126147, 122310, 145781, 134286, 143525, 179340, 189587, 179265]
13270A79265l73R796j5438j8608R37L9142p88j0787J8532J8803L2260J9137N521
13257B77399J5964M480n417q472L331k7819j1871q429K059l6955R573Q09m2457
13244A72195j0110K369K5339J6972J0357J0214J5924p565j0400n653j2642J0163
13232B17163l391M82K0105L4320j0594j3676K8177K1546O439O704j0292N957K4159
13219C27099J6333J4181J0208M826k5118j9630O26j235J3916M6040J3654J4181
13207D15081N5375K9289J1062o268K0728K7401L8994N5727M7078J9582k9135j8743
13195F66171n0523k8781k3981J2704K5342j1237j0710j8124n949j4712p14J282
13183E40768J7261K1726n997J4591J5263K1241K1483L2407O7930L4544J4650M6881
$$ y = [179265, 178892, 188688, 173250, 154642, 155579, 194721, 193933, 183146, 201678, 220481, 252741, 271878, 277399, 293363, 297843, 292426, 283954, 287285, 259466, 247595, 239166, 241225, 204270, 213843, 214652, 172195, 162085, 164454, 189793, 206765, 217122, 227336, 243260, 235695, 225295, 219642, 207000, 217163, 213772, 214254, 234359, 268679, 258085, 244409, 272586, 294132, 300571, 307275, 296983, 302940, 327099, 343432, 357613, 367821, 372647, 347529, 327899, 328525, 327290, 341206, 387246, 400900, 415081, 470456, 499745, 510807, 504539, 525267, 552668, 591662, 647389, 694467, 714049, 684914, 666171, 615648, 586867, 562886, 575590, 600932, 589695, 578985, 560861, 554912, 540200, 539486, 540768, 558029, 579755, 573758, 588349, 603612, 624853, 646336, 678743, 746673, 781217, 795867, 842748]
13171H42748N8289R7230N7550M9838M4673L9723L9699M1859O6556P2364P4284
13160A484813R5261Q9467P5688J00334P4146P8369Q1889L8399L9316L5083J4751
13149B207516j4967M0623N0070N0692O2327O1621N4650N8705O4115N9032N8696
13138B753080P4916P2819R0471N3841M4726O7338L3356K7283M5025L2794J7969
13127C313618M5569O9286O8508Q4670J14188J17483J30693J14117J24667J92043
13117D374842K13021K40787K61272K57231L06112L43592L11356L75969M39810
13108G123992N37561O29667O93797P68173Q55491R91775J209214J404450J622049
13099A5836169J846809K168949K566683L050413L665112M366754M964533N050182
$$ y = [842748, 901037, 998267, 1055817, 1105655, 1150328, 1190051, 1229750, 1271609, 1338165, 1410529, 1484813, 1580074, 1669541, 1745229, 1845563, 1919709, 1998078, 2079967, 2118366, 2157682, 2192765, 2207516, 2192549, 2233172, 2283242, 2333934, 2396261, 2457882, 2512532, 2571237, 2635352, 2694384, 2753080, 2827996, 2900815, 2991286, 3045127, 3089853, 3157191, 3190547, 3217830, 3262855, 3295649, 3313618, 3359187, 3428473, 3496981, 3581651, 3695839, 3813322, 3944015, 4058132, 4182799, 4374842, 4587863, 4828650, 5089922, 5347153, 5653265, 5996857, 6308213, 6684182, 7123992, 7661553, 8291220, 8985017, 9753190, 10608681, 11600456, 12809670, 14214120, 15836169, 17682978, 19851927, 22418610, 25469023, 29134135, 33500889, 38465422, 43515604]
13091D3515604M266143K814976J458236O44247L57967N83971J369378K559514
13083E7570036M107719O260159R127087J2677035J6767762K2136046L0563918
13076A59209762M4028735O1481853P2421061N5449931L476705n1007293p1033466
13069B74027288n8929942m0516889k7433506j9501293j4607783j1280460q724306
13062I3033109p012730n899772n192967m538799l880744l257703k730105k349420
13054E8170869k100864j830893j537712j228789r86097q17978o88186m61430k33322
13045D8285598J3152L32678N84783N80762L58226r659p15959j548243k156343
13036D5724995k426274k514077k397027k223968k062839j927782j804534j744264
$$ y = [43515604, 47781747, 50596723, 52054959, 52699206, 53057173, 53641144, 55010522, 57570036, 61677755, 67937914, 77065001, 89742036, 106509798, 128645844, 159209762, 203238497, 264720350, 337141411, 392591342, 396068047, 345060754, 274027288, 215097346, 174580457, 147146951, 127645658, 113037875, 101757415, 93033109, 86020379, 80120607, 74927640, 70388841, 66508097, 63250394, 60520289, 58170869, 56070005, 54239112, 52701400, 51472611, 50486514, 49668536, 48980350, 48518920, 48285598, 48298750, 48631428, 49216211, 49796973, 50155199, 50145540, 49429581, 47881338, 45724995, 43298721, 40784644, 38387617, 36163649, 34100810, 32173028, 30368494, 28624230]
13028B8624230j662256j514909j383262j317799j260347j196520j098687j049495
13020A8140955r95625r29521q46196p80094p39459p41952p18500o77642o15912
13011A1096054n79363n39222n02290m71536m11886l64036l71418l76300l58158
13002G121845l36909k95410k87932k92057k65072k72015k75663k51887k33764
12993D611136k53508k19303j70973j82314j49787j44507j13658j34373j14820
12984C127893j46464j33595j28162j09094j23329j45895j17014j51610j12480
12975A960250m5085n4906n6023l9091o7326q3844n8142m1353n1039n7054q2456
12964A323931o2260l8712q6714q1232m3114p762j9480j3700J7784L0638K4437
$$ y = [28624230, 26961974, 25447065, 24063803, 22746004, 21485657, 20289137, 19190450, 18140955, 17145330, 16215809, 15369613, 14589519, 13850060, 13108108, 12389608, 11711966, 11096054, 10516691, 9977469, 9475179, 9003643, 8591757, 8227721, 7856303, 7480003, 7121845, 6784936, 6489526, 6201594, 5909537, 5644465, 5372450, 5096787, 4844900, 4611136, 4357628, 4138325, 3967352, 3785038, 3635251, 3490744, 3377086, 3242713, 3127893, 2981429, 2847834, 2719672, 2610578, 2487249, 2341354, 2224340, 2072730, 1960250, 1915165, 1860259, 1804236, 1765145, 1697819, 1613975, 1555833, 1514480, 1463441, 1406387, 1323931, 1261671, 1222959, 1136245, 1055013, 1011899, 1004137, 984657, 970957, 988741, 1019379, 1043816]
12953A043816J5688K5801M0409L421o5253j03273q9669m3097l9592l7724m3949
12942G06578m0296l7256j4283l1896j6591j3404j2016L6559K2872m3483k4591
12931E32193N104k8126m312K0175j4280j8110L2269M2942J1160J5682J5307L1758
12919F41762O2447L6556K3120J6747L4113J2104P370L4040O3505O1522N0570j744
12907A042112k02j277m370M5410L8413R804M660n832K3692J9746K332l5558k1242
12894A117688k326l0291j420m725n7785m3875q669n651N928R193K4496J918k5474
12881I79007l7895q065L0482q492k9576J2326j0587j0465J7765m252l4042l1624
12869H64582m322j44k4620j5974j0862k0794p211p723j693n491k5350k3998m5881
$$ y = [1043816, 1059504, 1085305, 1125714, 1129135, 1063882, 960609, 870940, 827843, 788251, 750527, 706578, 666282, 629026, 614743, 582847, 566256, 552852, 540836, 577395, 600267, 556784, 532193, 537297, 509171, 504859, 525034, 510754, 492644, 524913, 567855, 579015, 594697, 610004, 641762, 704209, 740765, 763885, 780632, 814745, 826849, 834219, 868259, 931764, 993286, 1043856, 1042112, 1041910, 1040633, 1036263, 1081673, 1120086, 1129890, 1134550, 1128718, 1152410, 1172156, 1174488, 1138930, 1117688, 1115362, 1085071, 1083651, 1078926, 1021141, 977266, 968597, 962946, 968874, 978067, 1002563, 1004481, 979007, 941112, 933047, 963529, 955037, 925461, 937787, 927200, 916735, 934500, 930248, 896206, 864582, 860260, 860116, 835496, 819522, 808660, 787866, 780655, 772932, 771239, 765748, 740398, 716400, 670519]
12856F70519q5121l5904n698Q227K089k5072k1693j1308J7234j4214l0143n185
12844D63731P530j7430q125K8902K8830L437l6846m2610l116P213P426J5414j0858
12831D43498o671L766M533J6678J6453o551r126J5480k3406l2131M226N444j7392
12818D14801m3410o4847l3390k8169l6976J1412K390k4156l3790j4940k9857K331
12806A21399J0188K459O457l464n677J350M742o372J3527j2636k4739K4313q35
12793A30712p925K7670K587j9243j5025O924l575J6072J8368k133P010J2799J4839
12780A89080K3015J7604J7788R399l865O258l142M048j7295L095o508J2480L2355
12767B84312K1450k3414j4355Q408M0319J2959q900R066o110M338m22K503J6440
$$ y = [670519, 585398, 549494, 543796, 552023, 554112, 529040, 507347, 496039, 513273, 499059, 468916, 463731, 471261, 453831, 445706, 474608, 503438, 506875, 470029, 427419, 424303, 431516, 438942, 454356, 443498, 436827, 440593, 445126, 461804, 478257, 471706, 462580, 478060, 454654, 422523, 426749, 432193, 414801, 371391, 306544, 273154, 244985, 208009, 219421, 221811, 197655, 163865, 148925, 119068, 121399, 131587, 134046, 140503, 137039, 131362, 132712, 137454, 131082, 144609, 131973, 107234, 131547, 130712, 122787, 150457, 153044, 133801, 118776, 125700, 122125, 138197, 156565, 154432, 161442, 174241, 189080, 212095, 229699, 247487, 256886, 253021, 259279, 256137, 260185, 242890, 245985, 239477, 251957, 284312, 305762, 282348, 267993, 276401, 316720, 329679, 320779, 329845, 323735, 328073, 327651, 330154, 346594]
12754C46594M1880L1769k765P223P437m7j1812r397l9398m6114r140m0569j1410
12741B64251l344j3376N573j4116K0975j174J4017J0180O253k4113k1224j403
12729B42499k0506L30J1688R149M14j8493m2104J1813j470L041K5606q611k5334
12716A88022m536J1706n06K2742p071l3117q739L1413J4683K2059k1413l4651
12704A80592l879l140l786j4763j9604J0301K8228j1849k7151K871Q663O992q211
12691A45264j9362k8986k7883l2516Q576J7600J2136o246J0871j0069j2355p239
12679D9791o071J009L592j570K4100N539k2706k0852r869j9461L3486K9979O207
12666G3174R454R402O179K4840J0676Q450j3820J1204l6838j1889J2667J6886
$$ y = [346594, 388474, 420243, 417478, 424701, 432138, 432091, 420279, 410882, 371484, 325370, 316230, 275661, 264251, 260907, 247531, 253104, 238988, 259963, 258789, 272806, 282986, 289239, 265126, 243902, 242499, 221993, 222323, 234011, 243160, 243574, 225081, 182977, 194790, 193320, 196361, 221967, 213356, 188022, 183486, 195192, 194686, 217428, 210357, 177240, 168501, 199914, 214597, 236656, 215243, 180592, 176713, 173573, 169787, 155024, 135420, 145721, 173949, 162100, 134949, 137820, 146483, 153475, 145264, 125902, 96916, 69033, 36517, 45093, 62693, 74829, 68583, 79454, 69385, 57030, 49791, 43720, 44729, 48321, 46751, 70851, 76390, 53684, 32832, 22963, 3502, 36988, 66967, 73174, 82628, 92030, 98209, 123049, 133725, 142175, 128355, 139559, 102721, 90832, 103499, 120385]
12654A20385K7089J1772J6077L464N792r434K634L1324L1025L6924K6252K3778
12642C27082J1599J1724p887J8367L0047j3890j8682o225L9898M7514N4437Q4526
12630E78510J13725J30892J90001K44840L14041L73154K02390j00937l22601l62098
12620A361917k73994j60861j02922p6496l2808o1544m4859n0655k1817K025L069
12609E41055l1668m3507k5047j0748k3523k9473n210O879K0400j8257O126n331
12597C81696m626M35N520K8134j3166k3059Q307p935j9855k6298K617J0176k8170
12584C13776l1521J056k125J2618k2910m0408k0071J0430j6690k3746k4428K5454
12572A81435K887J197L326k6415r785j7912O022K415k056K629o285j1365p989
$$ y = [120385, 147474, 159246, 175323, 178787, 184579, 175145, 177779, 209103, 240128, 277052, 303304, 327082, 338681, 350405, 342518, 360885, 390932, 377042, 358360, 352135, 392033, 439547, 493984, 578510, 692235, 823127, 1013128, 1257968, 1572009, 1945163, 2147553, 2046616, 1724015, 1361917, 1087923, 927062, 824140, 747644, 714836, 653292, 608433, 557778, 535961, 537986, 541055, 509387, 465880, 440833, 430085, 406562, 377089, 371879, 378758, 399158, 380901, 387027, 381696, 377070, 377505, 383025, 411159, 397993, 374934, 383241, 375306, 355451, 329153, 331770, 341946, 313776, 282255, 283311, 281186, 293804, 270894, 230486, 210415, 220845, 204155, 180409, 155981, 181435, 184322, 185519, 188845, 162430, 152645, 134733, 140755, 143170, 141114, 143743, 137458, 126093, 118104]
12559A18104j7659J40j5155o975n689j3874P951J2287J7283o504J3150j3577o89
12546H8793J9830k5806m433K917n866J3098M537r038l3585R744l621P769L771
12533F8110n40j2r859j2604J8684N226j3025k7631K4301n841j0663L909J8490
12520E8545J663J9284k1188k4373j2448O410J0761R496j2983k097Q083k148j7401
12507B1604j3124R406J7432q41K1184J7653R165n738j8542J5758m509Q813J0348
12494H8609P936P71j3898K535k307j0152n863n681L954K0116J4646q36j1539J2141
12480A00432k0702j2426J0759n877N538K951j1215k5145j8945L0443K8782J933
12468H6528m557k1415j1504J7378M217M903P605J3737j3383k0172J8210J1939
$$ y = [118104, 100445, 100585, 85430, 78455, 72766, 58892, 66843, 79130, 96413, 89909, 103059, 89482, 88793, 108623, 82817, 78384, 81301, 75435, 88533, 93070, 84032, 50447, 60191, 56570, 64339, 68110, 67570, 67558, 57699, 45095, 63779, 69005, 55980, 28349, 52650, 46809, 36146, 40055, 58545, 60208, 79492, 58304, 33931, 21483, 27893, 38654, 48150, 35167, 33070, 41153, 39005, 21604, 8480, 17886, 35318, 34477, 55661, 73314, 82479, 76741, 58199, 73957, 69448, 78261, 88609, 96545, 97316, 83418, 85953, 83646, 73494, 67631, 61950, 65904, 86020, 100666, 99830, 88291, 100432, 79730, 67304, 78063, 72186, 77724, 80675, 69460, 44315, 25370, 55813, 84595, 86528, 81971, 60556, 49052, 66430, 70647, 75550, 83155, 96892, 83509, 63337, 81547, 93486]
12456I3486R358j5684p310j6400j2246Q91J8307O622k2855j3420o888K720J8236
12443E4817J5150p950p773o007k1783m644P232R557J1204o343r699K8397R081
12430G1239k2799k573J4149J3618j7975q820J1253P058l7361l6578P948J6185
12418A5344R576Q000n892j4116n105K5211L5269J1834n982m0750m3618M809J1462
12405F042j3400O416p110o377R661J2694o255K493K1388J3858l926J9127J527
12392E6138l0276k7389J6474J948j7362j8174j7562P179k3225M430L0405L2827
12380A5413L4873m882k5872o842l970j2046m363Q100J3581J0711J7489j0070r188
12367B2934M965j9116Q069J6443p459J3073Q455p641l046J7684J0983J0799l458
$$ y = [93486, 102844, 87160, 79850, 63450, 51204, 52095, 70402, 77024, 54169, 40749, 33861, 36581, 54817, 69967, 62017, 54244, 48237, 26454, 21810, 29042, 38599, 49803, 43460, 33761, 62158, 71239, 48440, 45867, 60016, 73634, 55659, 46839, 58092, 65150, 27789, -8789, -841, 15344, 24920, 32920, 27028, 12912, 7807, 33018, 68287, 80121, 74139, 33389, -10229, -5420, 6042, -7358, -942, -8052, -14429, -4768, 7926, 1671, 4164, 25552, 39410, 35484, 54611, 56138, 25862, -1527, 14947, 16895, -467, -18641, -36203, -29024, -52249, -47819, -17414, 15413, 50286, 45404, 19532, 12690, 8720, -3326, -7689, 411, 13992, 24703, 42192, 32122, 22934, 27899, 8783, 16852, 33295, 25836, 38909, 47364, 39723, 36677, 54361, 65344, 76143, 72685]
12354G2685j5735N372Q720J5739Q343o516N229m7996m2757N039j075Q284J211
12341A6543M749J8790K6081R693j6760J688l646K7040J321j7041K687J0552l9889
12328D1808k9279J5209J1195M147j8484j0414J6854L0463O175l111j8839l6251
12316I473k0603J3141J4783J4613p202K630O001q018K5810N673J0354j1537j9195
12303C5923p034j5801j4153j2426O731J119L173J241K1990K4535l176j7890K708
12290B6940m404R30k6165o686r63K6924L0281j4896N817p937j5472L759r919O445
12276A4654K3132j2904J8917R038j2763k8693L097J269rj0339k7138n539Q327
12263a8951m665K784J9627J7610P033R880q958k5283j2002n502K1295J7906j3702
$$ y = [72685, 56950, 62322, 71042, 86781, 95124, 88608, 93837, 45841, 3084, 8123, 7048, 15332, 16543, 21292, 40082, 66163, 75856, 59096, 60784, 57138, 84178, 85499, 68458, 71145, 81697, 41808, 12529, 27738, 38933, 43080, 24596, 14182, 31036, 61499, 67674, 64563, 45724, 9473, -11130, 2011, 16794, 31407, 24205, 26835, 32836, 24818, 50628, 56301, 66655, 55118, 35923, 28889, 13088, -1065, -13491, -6760, -5641, -2468, -1227, 20763, 45298, 42122, 24232, 26940, 22536, 23466, -2699, -9385, -10348, 16576, 46857, 31961, 37778, 29841, 14369, 18128, 8209, 14654, 37786, 24882, 43799, 52837, 40074, 11381, 14478, 15747, 15738, 5399, -21739, -27278, -18951, -23616, -20832, -1205, 16405, 23438, 33318, 24360, -923, -12925, -18427, 2868, 20774, 7072]
12250G072N93K8685j4004m70m909J9872M790j1040n538K3071j4647j6011n866
12237A1598r3R662Q362J1972N905o704k0644k831j2084M69R567K215q269J4648
12223B3773q691J7463l882k4363j0565j2343J9585J951p851J3548O486M212M906
12210B4229K3636L333n412O135J5109P703r207j4316Q8k445j739l4220j6272M435
12196A057o501K4861K4601k547m764j2209p596J89J8925P490k9285r693L4911
12183C9439N895l920m61J3330j785k3950J2647J9658R487l8395k7118k0531K005
12170a3699M881Q683L851j934J915K0037L6034M354l7448k9892l404K1135R10
12157A5423k4019N392K9456q863k3950M43K2855J7710o156j9012K03o961N093
$$ y = [7072, 7665, 36350, 22346, 21876, 16967, 36839, 41629, 30589, 25051, 48122, 33475, 17464, 11598, 11505, 21167, 29529, 41501, 47406, 40702, 20058, 17227, 5143, 5612, 15179, 17394, 9125, 23773, 15082, 32545, 28663, 4300, -6265, -18608, 977, 2928, -4923, 8625, 15111, 19323, 24229, 47865, 51198, 45786, 51921, 67030, 74733, 65526, 51210, 51298, 48853, 47114, 12894, -3378, 1057, -5444, 19417, 44018, 41471, 36707, 24498, 16902, 17091, 36016, 43506, 14221, 4528, 39439, 45334, 41414, 40953, 54283, 52498, 28548, 41195, 60853, 70340, 31945, 4827, -15704, -13699, -8818, -135, 3716, 1782, 3697, 23734, 59768, 64122, 26674, -3218, -6622, 14513, 15423, -8596, -3204, 26252, 17389, -6561, -6118, 16737, 34447, 28291, 9279, 9482, 2521, 7614]
12144G614J9549J545j5133n033J3778N060q309N254j0853p651k858J2105Q921
12131B3989Q148J0267j2383m661j6563k0243K1699J0703k4878J0940J6554r907
12119A3665k4300O332J3174M344j0335O227K621P174k246k3618k7926l815L1156
12106g547Q434j169j700R635j1045r296N052L8940J9498j9682k4176J3962J8651
12093C9557p499l5970j7823P70j0046j0507M0017L009k302j6910n893K9618K5345
12080C1366k773j7013q291K7990J7271l5138k7414j1714K6731K2224n449K4742
12068D2532L6078j8538j4973K3616L542j2188n194j2198j8333J04k2638p699J4230
12055H341K4374R601K73j1389P665O42K1338j8947l6401n203j2999N466k6703
$$ y = [7614, 27163, 28708, 13575, 8542, 22320, 27380, 19071, 24325, 13472, 5821, 2963, 15068, 23989, 32137, 42404, 30021, 25360, 8797, -11446, 10253, 20956, -3922, 7018, 23572, 13665, -10635, -4303, 8871, 13215, 2880, 9107, 11728, 18902, 16656, -6962, -34888, -38703, -7547, 887, -282, -1982, 7653, -3392, -12688, -7636, 31304, 50802, 31120, 6944, 20906, 39557, 32058, -3912, -21735, -20965, -31011, -41518, -1501, 1508, -794, -17704, -23597, 6021, 31366, 28593, 11580, 3289, 31279, 48550, 13412, -14002, -25716, 1015, 23239, 17790, 42532, 78610, 60072, 45099, 68715, 72257, 60069, 54875, 42677, 24344, 24448, 1810, -5889, 8341, 32715, 42316, 42589, 31200, 38865, 39507, 60845, 41898, 5497, 294, -12705, -7239, -33942]
12042c3942J5895L9459n935j4324n133j5977K003L7279L3852J1398k6248k0665
12030A7662j1021k400N184L7893M739M00O44l6680l5118r080K7532M9523J4990
12017F4268j3278j0906M637q391j9631n798K586J4109n683r727l3801R125J2528
12004C8l974J6824J5103j1782l0124k160J6373J8975j425l880P926r435j0854
11991A605J3280k707R736K8036j627j7931j2889l488j5610j3359k39K6006J9116
11978B9929p848j0199Q416j6297l0407K4271J130Q632K5633R21r871j1620J968
11965A4658K5384Q192j1527N17j3751k7484k7112J9454L1856J1993K7747J6692
11953G6619k0887K5819l818l0841J657O458l1822L197k285J768K81k6263L255
$$ y = [-33942, -18047, 21412, 15477, 1153, -3980, -19957, -17954, 19325, 53177, 64575, 38327, 17662, 6641, 4241, 9425, 47318, 52057, 52457, 53101, 16421, -18697, -27777, -245, 49278, 64268, 50990, 40084, 44721, 36330, 16699, 10901, 13487, 27596, 21913, 12186, -21615, -12490, 38, -3936, 12888, 27991, 16209, -13915, -16075, 298, 19273, 17848, 13968, 21894, 12459, 1605, 14885, 12178, 21914, 49950, 48323, 30392, 17503, 14015, -1595, -14954, -15193, 10813, 29929, 22081, 11882, 20298, 4001, -26406, -2135, -1005, 7627, 33260, 34181, 24310, 12690, 14658, 40042, 48234, 36707, 37224, 23473, -4011, -31123, -11669, 20187, 32180, 59927, 76619, 55732, 81551, 77733, 46892, 48549, 55007, 23185, 26382, 24097, 25865, 26146, -117, 3138]
11940C138j792J1599M066n949P549q958r8R732K9876J5702K383m7088o682N852
11926A9330j3438p452R703Q058K5233O659j8726m1541J171L6016J2404k7676j3527
11913c786J8703K8330r914m208m423O997j164j8318l9172n962J6759J4120j0689
11900a2727j3656R782N310K6768J0765r097k8445j0684K8510J0378k3699j4068
11888b0863m120j0924M168J7821J8852k6149k5992Q002J4148R584N070L6519j279
11875B4837J0036J392k3845j625J8278k628L122j517j3658o212J3423j961j4559
11862E083k5322j8114L370L936K4342J4010P782j1036J523J6720k0210Q447K7372
11849C7903k3961j0951j3856m098L3410L2212j3863j2405r313J9643J6162Q508
$$ y = [3138, 1346, 12945, 17011, 11062, 18611, 9653, 9555, 19287, 49163, 64865, 67248, 20160, 13478, 19330, 5892, -1560, 8143, 16201, 41434, 48093, 29367, -12174, -11003, 25013, 37417, 9741, -3786, 14917, 43247, 33333, 29125, 24702, 31699, 30535, 12217, -26955, -32917, -16158, -2038, -12727, -26383, -16601, -11291, 15477, 26242, 17145, -11300, -21984, 6526, 16904, -6795, -20863, -24983, -35907, -31739, -13918, 4934, -21215, -47207, -39205, -25057, -15473, -10403, 26116, 24837, 34873, 36265, 12420, 10795, 29073, 26445, 29567, 28050, 14392, 8180, 21603, 19642, 5083, -20239, -38353, -34983, -31047, -6705, 7305, 15087, 4051, 5574, 22294, 2084, 10531, 37903, 13942, 2991, -10865, -14963, 18447, 50659, 36796, 24391, 15078, 34721, 50883, 59391]
11837E9391j9774j6950j2712k812j3209j1619K1710j410L567N2889R199k3371
11825D4899l741J0927j8785n401k9853O458m038l9149L299R246j475M6204J5865
11812C4456k2201l064j0415o223Q447J224j1022J449K2012J3547J146j6736M540
11799A7160m06k3572R867Q446O156N223j8382k4887K7227l939J5621m315k145
11786A2054J1350j1897j577k216J602Q11l5994o78J4361J7853l289j961N633r357
11772c305K620Q649J1281J512J4567O456l1378k2951p685J5612K6261k2815j5330
11759a6506k605J0128j288j49K9508q332l5334O217K5158J4684o692j759J1626
11746B4656L922j4258j2566k0900j7620P573K2684K21m880K0758n407j1672J1599
$$ y = [59391, 39617, 22667, 9955, 7143, -6066, -17685, 4025, 2615, 6182, 59071, 68270, 44899, 41158, 52085, 33300, 27899, -1954, 4504, 466, -38683, -35384, -26138, -27613, 18591, 34456, 12255, 9191, -1224, -7447, 1000, 2224, -8798, -7349, 14663, 28210, 29356, 12620, 17160, 16754, -6818, 3049, 11495, 17651, 22874, 4492, -20395, 6832, 2893, 18514, 14199, 12054, 23404, 11507, 9930, 7714, 9316, 10127, -25867, -26545, -12184, 5669, 2380, 419, 6052, -3305, -685, 7964, 19245, 20757, 35324, 41780, 10402, -12549, -20234, -4622, 21639, -1176, -16506, -19111, -8983, -10271, -10420, 19088, 10756, -24578, -18361, 6797, 21481, 14789, 13030, 24656, 28578, 14320, 1754, -19146, -36766, -29193, -6509, -6288, -11168, 9590, 4183, -7489, 4110]
11733D110k914M328J1781N125l3761J130J5324J2211j536k4349Q622J2814l3207
11720b0322j3907M8608K8570n223J4331K9810k5840N499J380L84r188J9227o529
11707F6800k9126l6433m188J1597R573M490O496m913J3254j925j4138m578j4755
11694B154J5241j51K1155R784K2646m121j0090P449J1257q723k803j6259k0464
11681B7075o901m432J5974L272j1466j473l1667K3197K9903m640l6205m296N965
11668D306J6017p825J3929k3080k9996k1675j8464n015J1197M262K9641K7660
11656I57J8544J493L293Q424k0798k2438J0924o097j9405j9996L7457N0830J6033
11643E9221k2349n2543k8013K0757l248J4596n233M031M6689J0097j1891l5797
$$ y = [4110, 1196, 5524, 17305, 22430, -11331, -10201, 5123, 17334, 15798, -8551, 71, 12885, -20322, -34229, 14379, 42949, 37726, 52057, 81867, 56027, 61526, 62906, 63290, 54102, 73329, 66800, 37674, 1241, -2947, 8650, 18223, 22713, 29209, 24296, 37550, 35625, 21487, 16909, 2154, 17395, 17244, 38399, 48183, 70829, 66708, 56618, 64067, 75324, 66601, 63798, 47539, 27075, 20174, 15742, 31716, 34988, 23522, 22049, -9618, 13579, 43482, 38842, 2637, -1659, 4306, 20323, 12498, 26427, 3347, -26649, -48324, -66788, -71803, -60606, -56344, -26703, 957, 19501, 20994, 24287, 32711, 11913, -10525, 399, -5698, -25103, -45099, -7642, 43188, 59221, 36872, -15671, -43684, -22927, -26175, -11579, -16812, -12781, 33908, 44005, 32114, -3683]
11631c683k9733j3407K4116P817J7660m235k1389R074P396J162j1404j1807p230
11618c5663m703J6221J6593o526J2933Q908J9952L8428m284k7123l1249P093J836
11605A2416k0048J4074Q160J4546j0865J184j1092j493L618m927k7195N119j2095
11592b8598o815O722N6472J3465q609q894L9537J843k6888k2035k3575J3309l946
11579A988j2646m60q416P826J391q495k2637M967J9073K8681O518r087P568J592
11565A7863j5082j8546K1617Q379n860o568M740K6559J3335j4535k6894K065k402
11552D671j7125j5982K1340K3121J9406q988l3467j074Q116j6744r332Q284L2422
11539A4648l864j7688k024N236L4393m978k4951L860Q9K410K263r934K8424K7160
$$ y = [-3683, -33416, -46823, -22707, -14890, 2770, -1465, -22854, -13780, -6384, -5222, -16626, -28433, -35663, -40366, -24145, -7552, -14078, -1145, 7763, 27715, 66143, 61859, 34736, 3487, 10580, 12416, -7632, 6442, 14602, 29148, 18283, 19467, 8375, 6882, 10500, 5573, -21622, -16503, -28598, -35413, -28691, 27781, 41246, 32637, 23743, 63280, 65123, 38235, 16200, -7375, 5934, 1988, -10658, -11118, -19534, -11708, -10317, -18812, -41449, -36482, -17409, 11272, 17790, 8703, 16271, 17863, 2781, -15765, 5852, 14231, 8371, 1803, 6543, 33102, 46437, 31902, 5008, 7073, 4671, -12454, -28436, -7096, 16025, 35431, 26443, -7024, -8098, 18, -16726, -26058, -17774, 14648, 10784, -6904, -8928, -3692, 30701, 25723, 772, 4632, 4721, 7131, 9394, -540, 27884, 55044]
11525E5044K716l0995m2087j8392J1534L3329N60N668J400m0487N160N2090Q292
11512D3832K72q994r16J4816j4866n002j080J98J2664p210q484q199m463j0675
11498A893J0688q283L71m09j1657J4647J3793j0964k832j138N603O033n085j5535
11484b875m0551k1944J9841l710K5792J0717o281q146O23J0697J2016K3981P813
11471B7973j5218L792K0428Q898J7769j4003k0160o500j0999j7692m3106R725
11459c9093K4174J1614q624J8497o347J5092M34j4906o508j488Q813k4220j4788
11446c7350O158o842J5311J364j3616J0146M6957L1320k4515k5482j9783P672
11434h660M93k372k8756q788Q754R806N369K2817j510M381P10j7493o681K0132
$$ y = [55044, 57760, 26765, -15322, -33714, -22180, 11149, 11709, 17377, 18777, -21710, -16550, 35540, 43832, 44104, 35110, 34194, 49010, 34144, 29142, 28062, 28260, 40924, 33714, 25230, 17031, 12568, 1893, 12581, 4298, 4669, 4260, -7397, 7250, 21043, 10079, 7247, 6109, 11712, 17745, 12660, -2875, -43426, -65370, -45529, -49239, -23447, -12730, -19011, -27157, -26534, -15837, -3821, 20160, 27973, 12755, 16547, 36975, 45873, 63642, 49639, 29479, 22979, 11980, -5712, -48818, -39093, -14919, -3305, -11929, 6568, 221, 15313, 15747, 841, -5667, -7155, 1658, -22562, -37350, -31192, -38034, -22723, -21359, -34975, -24829, 22128, 53448, 28933, 3451, -16332, -8660, -8167, -10539, -39295, -48083, -39329, -29523, -24154, -1337, -2847, 1534, 2244, -15249, -21930, -1798]
11420a798J9189l4254l8341o750J1120K7444K6084L205j7672n347j8011k5561
11408f0692k043J3470k2781K5495m755M304K1758l119j4130L1136J0485O308J0276
11395A5712K3115N66j3802j032j0729r986j2649Q269J0444M167j791P017K929
11382B2230n284j6055j6544j8025N745L3612m743j2448k1235m955j2141L0038
11370a9805M5739J5992l0678O74J2577k9836q251K3489n583j3087j4625J3149
11358a0245J0126j5537j1639o900K4214M2109j6999j7214J3340j8862p957m13
11346a5977K6682N453J302o938K487M922o18L696k0821J0794N001O136L451j3816
11332A1754J852K9782J1383o867j2916m2537J3789K8402J6792k0639j3617M79
$$ y = [-1798, 17391, -16863, -55204, -61954, -50834, -23390, 2694, 5899, -11773, -17120, -35131, -60692, -62735, -49265, -72046, -46551, -51306, -47002, -25244, -28363, -42493, -11357, -872, 5436, 15712, 38827, 39393, 25591, 24559, 13830, 3844, -8805, -536, 9908, 14075, 12284, 19301, 22230, 16946, 891, -15653, -33678, -27933, 5679, 936, -11512, -32747, -37702, -49843, -19805, 25934, 41926, 11248, 11922, 24499, -5337, -13588, 9901, 4318, -8769, -23394, -10245, -119, -15656, -27295, -34195, -9981, 32128, 15129, -2085, 11255, -7607, -15564, -15977, 10705, 16158, 17460, 10522, 13009, 17931, 17313, 21009, 188, 10982, 15983, 22119, 25570, 11754, 13606, 43388, 54771, 47904, 34988, -7549, 6240, 34642, 51434, 30795, 17178, 17657]
11320A7657o587j2327j2133j2112K2616K1155p198Q803j9190l259J422q30j4424
11307a6407K3411Q096k5076j5798J5797J3639k534M621p446j3957J882L8538J384
11294B6150m293P184j6236k3605K817K3046n757J1033Q052k2660o454J6943j086
11281A5134l040j5712n207k4021p789o449J247R766K9867J5973J495q40R275j9932
11267b33J003j6598Q827L365M553m675j9328K7092K3787j834j4159k4335r670
11254b2205J8084L6319n338k7052j8245P174N372j6307j4183L1425O794k6036
11242b4198o487K0383j6757p722r830L9960M3797J181r203j6301N401k136L809
11229B1897J412j2269n296M041K862K0883j9232j4875k836j7522k660O821J403
$$ y = [17657, 11070, -1257, -13390, -25502, -2886, 18269, 11071, 19874, 684, -2575, -1153, -1983, -16407, 7004, 15100, -9976, -25774, -9977, 3662, 1128, 5749, -1697, -15654, -13772, 24766, 26150, 21857, 29041, 12805, -10800, -7983, 15063, 9306, 20339, 28391, 5731, -723, 16220, 15134, 12094, -3618, -8825, -32846, -40635, -47084, -45837, -36071, -6204, 9769, 11264, 10424, 19699, -233, 770, -15828, -7001, -3636, 917, -3758, -23086, 4006, 27793, 25959, 11800, -12535, -22205, -4121, 32198, 26860, -192, -18437, -11263, -5891, -22198, -36381, -4956, 1838, -24198, -30685, -10302, -27059, -34781, -44611, -4651, 39146, 40327, 31124, 14823, 20224, 18088, 21897, 23309, 11040, 5744, 9785, 12647, 33530, 14298, -577, -3413, -20935, -23595, -16774, -15371]
11216a5371Q735j006J0566M27k4196J4567J6328j8766l6581j848K171K9493R581
11203e900j0211l282J5002J4294j0648l632j3533J5861L5219L1221O432j70j1242
11190E9411k3379l5572n897J4654k931m8768l642L3059j989L957p180O587R701
11177a989L074k4185j3194n162K2377K0287J5224L688J5433K389J4459k8881o463
11164A7057N131r25J4505j0245l7697k9574M0566K6460p376j8808J6140J1323
11152B6557j2813j4288k4611j667J1586j1267J714K5355m448p641L1682M354j7684
11139F829Q486N443j7651J81J2310j5504j168k0732Q922N210K653j7871l1920
11126e4812R030K4290J7267o4n558r137M281K813J7982J708k7032J74J4999J1599
$$ y = [-15371, -6636, -7642, 2924, 3351, -20845, -6278, 10050, -8716, -45297, -47145, -44974, -15481, -5900, -16111, -19393, -4391, 9903, -745, -4377, -17910, -2049, 33170, 64391, 70823, 70653, 59411, 36032, 460, -5437, 9217, 6286, -42482, -46124, -13065, -15054, -11097, -18277, -11690, -1989, 1085, -23100, -36294, -41456, -19079, 1208, 16432, 20120, 35553, 37942, 52401, 23520, 17057, 22188, 21263, 35768, 25523, -12174, -41748, -1182, 25278, 17902, -906, 15234, 26557, 13744, -544, -25155, -26822, -15236, -26503, -24789, 566, -3882, -11523, 20159, 24513, 6829, 15315, 20758, 3107, 3288, 15598, 94, -1074, -21806, -12884, -7674, -5021, -22892, -54812, -45782, -21492, -4225, -4289, -9847, -18984, -14703, -11890, 6092, 7800, -19232, -19058, -4059, 7540]
11112G540k9288p61J2773l9427N264K7012J4542m45J503j6574j1349j760J0349
11099b0621j188J192J9343K5550J2374J0226O111j5366n938k3779l7356k3954
11087e3406K894K1465j80k3817j2203K5140L8072K4944K0738j0879r935p285k5132
11074i584k765j0807j4679n008J6296j3854L6088J2145J5013J2950J107k9336
11062G566k6315J7106J5821K7974j4546m3680k7414k897l843Q242M6448K0970
11050B5432j7385M525K628l6022j5454J0721K4352q71J6404j6460j0626j2621
11038b5377j233J2603J4475K4386k1619j2503J6218j8042m966o435L078m327r949
11025c3691J117J2424k435j1116k602J5782K5573N264J045L7374j32k4029q896
$$ y = [7540, -21748, -22509, -9736, -49163, -43899, -16887, -2345, -2790, -1287, -17861, -29210, -30970, -20621, -21809, -20617, -1274, 24276, 36650, 46876, 52987, 37621, 31683, 7904, -29452, -53406, -50512, -29047, -29227, -53044, -65247, -40107, -2035, 22909, 43647, 32768, 22833, 15548, -9584, -12349, -23156, -37835, -42843, -26547, -40401, -4313, 7832, 22845, 35795, 36902, 7566, -18749, -1643, 14178, 42152, 27606, -16074, -43488, -46385, -50228, -41986, 4462, 25432, 8047, 12572, 15200, -20822, -36276, -25555, -1203, -2074, 14330, -2130, -12756, -25377, -26610, -14007, 468, 24854, 3235, -9268, 6950, -11092, -16058, -22493, -19415, -23742, -33691, -32574, -20150, -22585, -33701, -36303, -20521, 5052, 10316, 11361, 48735, 48603, 24574, 15678]
11012A5678K547K0511q668k5643p658q205J1324n444K8601j6008j9090j2193k23
10999b4471P516J2291j8371J3618O127K8442J8711r975j8747R398p777m523N975
10986A8214q133k1945k2519o737M907R60o232o005L1908j250m020J9094k412J252
10972b918O955r949j4019J1483K0904j0186o591K5122Q078l3173l1294j4794J5494
10959c4888N848K7936L417l6009Q258K1936j3411j3651P118J7641q85j7050j1160
10946c4900J065M693l2810J0345N305j7216J98Q736K5506k37j5963j9888M532
10933f0634L0798l284p896L2597K3110n84j324R495J8129p803j5783p926r653
10920g58K0125L1860J6182L047j9346j4849r353j4911j4507j0112O734M081J3500
$$ y = [15678, 18225, 38736, 30068, 4425, -3233, -11438, -114, -5558, 23043, 7035, -12055, -24248, -24471, -16955, -4664, -23035, -9417, -3290, 25152, 43863, 33888, 15141, 24539, 16762, 12239, 18214, 10081, -11864, -34383, -41120, -36213, -35253, -41485, -47490, -15582, -16832, -20852, -1758, -4170, -2918, 4037, -5912, -19931, -8448, 12456, 2270, -4321, 20801, 28879, -4294, -35588, -50382, -34888, -29040, -1104, 2313, -33696, -25438, -3502, -16913, -30564, -23446, -5805, -6690, -23740, -34900, -33835, -29142, -61952, -51607, -46302, -63518, -63320, -54584, -29078, -29315, -45278, -65166, -60634, -29836, -33120, -41016, -8419, 14691, 14107, 12783, 22278, 40407, 32604, 16821, 8895, -758, 19367, 51227, 67409, 70456, 51110, 36261, 26908, 11997, -2510, -12622, -5888, -1807, 11693]
10907A1693n986k3663l2843K1029L2351Q447k3542P555m02O16k082q463K0056
10894D766Q062J06r686j906k1558q580n665J7123k2184l157J6932J5703K5112
10881A5068q309k123o749l4309L516M4477L313k5133j0631o845j5818J7824j0059
10868c5778R105k126j2726J0479L0488K3012k762q466k0275k2515l3272K2264
10856d2572L0820J7999J0645q823l6808p677N074K2225J6002J6887j5416j8368
10844a0012J3150J5047j8552p976K1701P515k3282J940k0554J0616K4122j8852
10832e137K419L1360J0854j1265j1081j1703L087J8589J9201m826j8385l964j5304
10819C845k0964J4701L1505O669r208j7804K1253J5858j7578j3920L126j2989
$$ y = [11693, 5707, -17956, -50799, -29770, 2581, 11028, -12514, -4959, -5361, -4745, -6827, -15290, 4766, 12828, 12934, 3248, 1342, -20216, -28796, -34461, -17338, -39522, -42679, -25747, -10044, 15068, 6759, 4636, -2113, -36422, -32906, 11571, 14884, -10249, -20880, -27725, -43543, -25719, -35778, -26673, -28799, -41525, -31046, -558, 22454, 19692, 11226, -9049, -31564, -64836, -42572, -11752, 6247, 16892, 8069, -28739, -36416, -31342, -9117, 6885, 23772, 8356, -10012, 3138, 18185, -367, -8343, 13358, 20873, -2409, -469, -21023, -10407, 13715, -5137, -2718, 28642, 39496, 28231, 17150, 5447, 8534, 27123, 46324, 41498, 23113, 19149, 3845, -17119, -2418, 29087, 35756, 26548, 8744, 29997, 45855, 28277, 14357, 17483, 4494]
10807D494m6936K400P181M123M218j1624l8425j302K5096K6969k987j402J0005
10794a8190J1321Q446J2481j2637k6129J964L0690L67Q980J9779j1452l6243n491
10781a6114K0987K6715p769l1932l5337J0913L0432J8045P216k508n547o707N988
10768A4382j2629O589m847j7225J7921K1004j0945J228O397m4343j3304M479j2791
10755d4084L5785M223k3877r657K47L6826K2049J5573p641k1999r325o398j6181
10742b4459L6907J8357j4464J316k4532l2248L533J7460J2262O52M107k2560K056
10729b1613K1003p976k3450m340J1362Q759J420k6100J2609P724j1561J6147L440
10716a2576L12J7079N429l5897M144M094j5146j4003Q967K3128j0072J934j5825
$$ y = [4494, -42442, -40042, -32861, -28738, -24520, -36144, -74569, -75871, -50775, -23806, -26793, -28195, -18190, -6869, 1577, 14058, 1421, -24708, -22744, 7946, 8313, 17293, 37072, 25620, -10623, -16114, 4873, 31588, 23819, -8113, -43450, -32537, -2105, 15940, 23156, 20648, 15101, 8394, 14382, 1753, 8342, 3495, -13730, 4191, 25195, 14250, 15478, 21875, -22468, -35772, -31293, -44084, -8299, -4076, -27953, -37610, -37363, -537, 21512, 37085, 29444, 7445, -1880, -8278, -24459, 12448, 30805, 16341, 17657, -6875, -39123, -35590, -18130, -5868, -5216, -1109, -23669, -21613, -610, -8586, -32036, -36376, -25014, -16255, -14835, -40935, -28326, -20602, -32163, -16016, -12576, -12264, 4815, 10244, -25653, -21509, -17415, -32561, -46564, -37597, -14469, -24541, -22607, -38432]
10703c8432J7799L580Q104O184j1977q885L381J4219J617l4372j288Q512J4421
10690a7137K3711o07P036j3205j4133j1599k709J3004j4000m938O397q481R21
10677c5740K969p57K2562J2348o541J7484R276j4485l0628k090j4144L838R553
10664b6355p795J0007L0895M5529K6029k9062j0793j4772J3563o586Q261J1106
10652E0027j0748q786R109j3893j3612K5926J5771j82m1149n353O809j2727o843
10639e651j4143M471K0658J9652q158m964j1983k4275j2576J3416K2258J0767
10627I472P529j4865l3043Q117P957J3626m675p586j343l990J8306K5710k431
10614B2784j7875j8695l499J2935R867M238J6356r455j8105k3342j5315p56J4817
$$ y = [-38432, -20633, -17053, -8949, -2765, -14742, -23627, -20246, -6027, -4410, -38782, -40070, -31558, -17137, 6574, 5967, 13003, -202, -14335, -25934, -28643, -15639, -29639, -34577, -28180, -36661, -35740, -32771, -33528, -10966, 1382, -5159, 12325, 21601, 7116, -23512, -25602, -39746, -35908, -26355, -34150, -24143, 6752, 52281, 78310, 49248, 38455, 23683, 37246, 30660, 38921, 50027, 39279, 30493, 39602, 25709, 12097, 38023, 53794, 53612, 12463, 7110, 13919, 1192, -5651, -19794, -15323, 5335, 24987, 16829, 11865, -118, -24393, -36969, -23553, -1295, 9472, 17001, 2136, -30907, -22790, -14833, -1207, -5882, -13468, -14811, -18801, -495, 25215, 22784, 4909, -13786, -17285, -4350, 5517, 9755, 26111, 16656, -1449, -24791, -40106, -40862, -26045]
10601b6045o711J888k6392J040J231L516P357Q596J0739K4483o175m327P725K2672
10587A9597j2167k2785K1496p467n011J6570J4536Q462j5842n955J0081N222j3901
10574A2836l8921k3408K1090J9429L903J6363q920j5935J1760K3762q229j8342
10562d612o298P513j2425Lj3n37j7423J2879L4014l247n235k6380N935r20L002
10547a3744R010Q292n037q821j2126L499O143J480J6917j1709J159r231R977K0572
10533A6381J3573N848k4929k9634j0597k6916j2548J1108J1039J0468j2324J3577
10521c4954P997N489j289k93P279J4368m204P625O695j3084o800M0339M908j8849
10507A5227J3289R24q657J3272N006m7241l1950q241J9176K7345k96Q313P510
$$ y = [-26045, -32756, -30868, -57260, -56220, -54989, -51473, -44116, -35520, -24781, -298, -6473, -10800, -3075, 19597, 7430, -15355, 6141, -1326, -6337, 10233, 24769, 33231, 17389, 11434, 21515, 26737, 12836, -26085, -49493, -28403, -8974, -5071, 11292, 2372, -13563, -1803, 21959, 13730, -4612, -10910, -3397, -15822, -15819, -15832, -16369, -33792, -20913, 13101, 9854, 4619, -21761, -15826, -16746, -13744, -4734, 3558, -1479, -10300, -22426, -18927, -12784, -11304, 5613, -6096, -4937, -14168, -4191, 16381, 29954, 35802, 10873, -18761, -29358, -56274, -68822, -57714, -46675, -36207, -48531, -34954, -26957, -21468, -22757, -23050, -15771, -1403, -5607, 2018, 8713, -4371, -11171, 29168, 34076, 15227, 28516, 29440, 20783, 34055, 39061, -8180, -40130, -48371, -29195, -1850, -2146, 6167, 13677]
10494A3677k2028J8088j0129j1307M041K243k4669J0178K4363j956j8944L0451
10482A4008j03k1600n076K3122J546k1853j476j1634K2688K9424q738k2207J5189
10469A3290J3567m0883k8413K2054O812P302J0920O001n696J921K913k0202l663
10456a4077j797J7783J2845j1677n637M550Q415K734j0026j3215k5122n207j545
10443d1976K3376J2319j461k0086K178j5996J292r536L0026L1282M259q355L938
10430A1260j86j5771Q502l569L961k451j6940O210J0614j0604J485j0416p241
10417b5146J1350j3682J5138q806o863K894k5547k3057k1227J6257M6300K1944
10405a0445J0075j5733K7692J3927Q806k4325l7224k5069k545j11J3525K3542
$$ y = [13677, -8351, 9737, -392, -11699, -7658, -5415, -30084, -19906, 4457, 2501, -16443, 14008, 13905, -7695, -12771, 10351, 11897, -9956, -11432, -23066, -378, 29046, 20308, -1899, 13290, 26857, -14026, -42439, -20385, -13573, -6271, 4649, 10650, 4954, 6875, 9788, -10414, -14077, -15874, 1909, 14754, 3077, -2560, 1990, 10405, 13139, 3113, -10102, -35224, -40431, -41976, -18600, -6281, -7742, -27828, -25650, -41646, -40354, -49890, -19864, 11418, 15677, 7322, 11260, 11074, -4697, 3805, 236, 4197, 1746, -15194, -8984, 1630, -8974, -7489, -17905, -25146, -13796, -27478, -12340, -21146, -28009, -25115, -50662, -73719, -94946, -78689, -32389, -10445, -370, -16103, 11589, 25516, 34322, 9997, -27227, -52296, -54841, -54952, -41427, -17885]
10393a7885O455k5283j4656K6502J2252m376j707j564J2356K481p698M225j314
10380a0212j6960K0489N394j3657J4209n719R226J138R016l4810j5777K8462O402
10367b799Q49k1809J1530J6812m924p954M082l048j0718J680l863j3562J6488
10354a7236J361k102L811J8788M709K672M836j861k5115k1068J5879J0329m503
10341i500q698r612O812K7172j581M299K2216k66j5657n539L716o138J6979j0780
10327A3423k3659j2992J5286K616J915k607l2440K4297J5286J614p218k9158Q286
10314b5351K819p255J0315R086J8816m831M335j690l876k4099J129Q472q548K3001
10300B323K2564o925j8741k5380k4102K9175K0140j4060j3141j856p573j1684
$$ y = [-17885, -11430, -36713, -51369, -24867, -12615, -16991, -18698, -20262, -7906, -5425, -13123, -8898, -10212, -27172, -6683, -1289, -14946, -737, -6456, 2770, 3908, 12924, -21886, -37663, -9201, -2799, -1950, -23759, -12229, 4583, -341, -8295, -4213, -7261, -17979, -16299, -20162, -33724, -17236, -15875, -17977, -14166, 4622, 9331, 12003, 16839, 14978, -10137, -31205, -15326, -4997, -9500, -18198, -27810, -20998, 6174, 4593, 8892, 31108, 30842, 15185, 9646, 13362, 7224, 24203, 13423, -10236, -23228, -7942, -5326, -3411, -6018, -38458, -14161, 1125, 2739, -4479, -33637, -25351, -22532, -29787, -19472, -10386, 8430, 3599, 7934, 6244, 2368, -21731, -20602, -12130, -20678, 2323, 24887, 17962, -779, -26159, -50261, -21086, -946, -15006, -28147, -30003, -37576, -49260]
10288d9260L2689J5629J9285p540l4888j6531k4721K2388L7331k2470j9008o259
10276e3355n813K1452r017Q950L0443M590m626J3258j4015J6289J471l369Q23
10263G081j8566O198J4821J542J141j122o615j587R886o068J6534J3395j1526
10250B5114k796L331m198r759j218R432O051k901n463l7438J1297K29J0J2006
10236C697J6647K9403L5410j5495k6664j977q594k6068k700j3796R876J473j8238
10223a7026j690K3936o678o896J9441j5445J1880K6082l3444j9728L891j1000
10211b6677L935n426M752K2052L2105J2143k5058n427j3676j9710o322L1927M557
10198I175j9894J8218Q849K617j6310j1228R288K996n200j1222K1275J046k138
$$ y = [-49260, -16571, -942, 18343, 10803, -24085, -40616, -65337, -42949, -5618, -28088, -47096, -53355, -59168, -37716, -46733, -37783, -7340, -2750, -7376, 5882, -8133, 8156, 9627, 6258, 7081, -11485, -5287, 9534, 11076, 12217, 11095, 4480, 2893, 12779, 6711, 23245, 36640, 25114, 22318, 25649, 21451, 11692, 10474, 19906, 25957, 23056, 17593, -19845, -8548, -8319, -8309, 3697, 20344, 49747, 85157, 69662, 42998, 41021, 32427, 6359, 3659, -10137, -261, 1212, -17026, -18716, 5220, -1458, -8354, 11087, -4358, 7522, 33604, 160, -19568, -15677, -26677, -22742, -28168, -23416, -1364, 30741, 42884, 17826, 12399, -1277, -20987, -27309, 4618, 9175, -10719, 7499, 16348, 18965, 2655, -8573, 715, 3711, -1489, -12711, 8564, 9610, 7472]
10185G472K0905j8092k6325n656K3832K2517p570N181Q134Q727O502j3967l2938
10172a278k5705r259J3568M67K6870K8382j1829r212q414j4756J3129K068J027
10159E058j0565J0162p81O607K0530M748j2976k5252l5497O049L591K1548L2261
10146B5483j3291J1562J1517O353k7737l2017J0048J7031j4628m112l168k380
10134a5339J3247j356n425j3767J0982L5919Q168j2842j536q025k2625k391L970
10121a1020j3156J4979p801k2625N024l047J0314K6259r419k1209P997R532K8032
10108A3860O418J2122j6993j1687J1728q55N323r06k1811j4485l6181j6492L988
10095f5971J3824j3071j2471K8623J9835R846J5382K0272J092k6948J2830K0214
$$ y = [7472, 28377, 10285, -16040, -21696, 2136, 24653, 17083, 22264, 30398, 39125, 45627, 31660, -1278, -26983, -36242, -22674, -22207, 4663, 33045, 21216, 12004, 3590, -11166, 1963, 4031, 5058, -5507, 4655, 3874, 10481, 31011, 35759, 22783, -2469, -37966, -31917, -28326, -6778, 25483, 12192, 23754, 35271, 41624, 13887, -18130, -8082, 8949, -5679, -9791, -12959, -15339, -2092, -3448, -8873, -22640, -11658, 24261, 32429, 19587, 18051, 10026, -12599, -14990, -11020, -24176, -9197, -16998, -39623, -34599, -37646, -27332, -1073, -10492, -31701, -23704, -14172, 13860, 20278, 32400, 15407, 3720, 15448, 14593, 19916, 19010, -2801, -17286, -53467, -69959, -65971, -52147, -65218, -77689, -49066, -29231, -19385, -4003, 16269, 17361, -9587, 3243, 23457]
10083B3457j1621o247o601o201K900M999R832N902Q712j679Q103j2613k181K386
10069A9148J5313j7241j048n539L2323J3868m830k3746J6741O414n818k410M696
10056D7871J0213k880J0091K354M6382L2586L6827M5066P2613O4013L6129m4432
10044C56833j01950o0470k9743m2412r888K1908O748j8655m1590j4368L493N880
10032G5786l5042k681o954J7528K3746k254k6393k8947j3457n138O240L8109p063
10019C3480k0883R164M218o928J6251n581j9110o649J5334J2189J3524J7971l2073
10006C0907j5664p416j8445N993K8199K757j5472k9033m297J9491j3374j5475
9994c1829k9688l283J8703L0549M2559j1864j5864n782o017M937O474J4224M08
$$ y = [23457, 11836, 5589, -1012, -7213, -4313, 686, 10518, 16420, 25132, 23453, 31556, 18943, 16762, 19148, 34461, 17220, 16172, 10633, 42956, 56824, 51994, 28248, 44989, 51403, 45585, 43175, 47871, 58084, 55204, 65295, 67649, 114031, 146617, 183444, 228510, 301123, 365136, 401265, 356833, 254883, 194413, 164670, 122258, 112370, 134278, 141026, 122371, 80781, 66413, 69906, 75786, 40744, 38063, 31109, 48637, 72383, 70129, 43736, 14789, 1332, -3806, 2434, 40543, 33480, 12597, 21761, 25979, 19051, 35302, 29721, 10611, 3962, 19296, 31485, 45009, 62980, 30907, 15243, 7827, -10618, -4625, 23574, 26331, 10859, -18174, -22471, -2980, -16354, -31829, -61517, -64800, -46097, -15548, 27011, 15147, -717, -6499, -12516, -7579, -1105, 13119, 13527]
9981A3527J3696j0370q922r055o565r002L168J9085k58N131K953j3267O655k085
9967D691K181R548K2902m696m1182l4140k817R387K7957K3237P095K6193P953
9954E8309l1878o404j3304N66n290n722j7203l383l5626J2136K6472J1248M82
9941i597L524J8595j9623k0365K6141N562J1638M918j1813j49m744P296r519J5426
9927A7290K1469j0889j9938j1415j5759j2044o275m833j263j3346j0489M452K4410
9914c8630J5806j556R89k7697K5137K2098m521j780o200O596L0455k735N068k3951
9900i21k3407P591K0949Q319K1436P535J0661M862l2897K2008p281k7875l5928
9887b4948j2708K600K0958J1347q803k0034k8569R456M5113J7195Q699j1170p338
$$ y = [13527, 27223, 16853, 7931, -1124, -7689, -16691, -13523, 5562, 5304, 10435, 13388, 121, 6776, 4691, 6872, 16420, 39322, 34626, -6556, -40696, -43513, -34126, -6169, 17068, 24163, 50356, 58309, 26431, 20027, 6723, 7289, 1999, -3723, -20926, -24309, -59935, -47799, -21327, -10079, -9597, -6073, 12522, -7101, -27466, -1325, 4237, 15875, 20793, 8980, 8831, 4087, 11383, 1864, 17290, 38759, 27870, 7932, -3483, -19242, -31286, -37561, -42394, -43657, -57003, -67492, -63040, -38630, -22824, -24380, -23391, -51088, -25951, -3853, -8374, -10154, -16354, -9758, 20697, 17962, 23030, -921, -24328, -16737, 4212, 12531, 33967, 41502, 52163, 57025, 24128, 46136, 38855, 10980, -24948, -37656, -35056, -14098, -2751, -11554, -31588, -60157, -50701, -5588, 11607, 20306, 9136, 1798]
9874A798R090p2p788k4550j8340J2270K555k0001k0235J1994K7869M1103k705
9861A2988o98k0666m1546o22K1281L1971J3865j8336K724j0742r809J5409p223
9848a1404J540K3854j8162j8339J2603K2662k9205j177M506k304K6762J1815L593
9835B6744j9155j4217L915J2269J1660K714j0451j6337j9220k775L1798K6060
9823C3005P971l75j7421k7810k0206L0632l443O719l5057j4221o029j4106J9044
9810d1297M5727K0196j9917m927N304O96J2768j6545k6615O730J921p076O133
9797a6902O836K129j3159j422K062K148J7571m124k142M614m0808o835K5667Q132
9783a6233k1031K673j3371k0534K7747K0280J6503K5411P158O048k1018O573j3249
$$ y = [1798, 10888, 10816, 3028, -21522, -39862, -27592, -25037, -45038, -65273, -53279, -25410, 15693, 12988, 12290, -8376, -49922, -50544, -29263, 2708, 16573, -1763, 961, -9781, -19590, -4181, -11404, -9864, 13990, -4172, -22511, -9908, 12754, -16451, -17628, -13122, -15426, 11336, 23151, 26744, 7589, -6628, -2713, 9556, 21216, 23930, 13479, -2858, -22078, -24853, 6945, 33005, 40976, 40601, 23180, -4630, -24836, 5796, 2353, 9072, -25985, -40206, -46235, -60341, -41297, 4430, 24626, 4709, -218, 5086, 5782, 18550, 2005, -24610, -17880, -15959, -23035, -16902, -10066, -7937, -21096, -22518, -20456, -18308, -737, -4861, -7003, -2389, -43197, -50032, -24365, -16233, -37264, -34591, -47962, -68496, -40749, -20469, -3966, 21445, 28603, 34651, 13633, 20206, 6957]
9770F957j9579K1891P298l05j3659j5122N961J8331M520j5781j2870p96K3604
9757A0450L7455J4014j5568k4600k9175n95l069l213J9578k7917j7337J268J3696
9744b5013K6491J9686N558k9779R504N26J9193O096k3519k1444j7611j250J1902
9731a9660Q628J236N940r656k639Q62n908J8053p508n638M311J967J1328k9604
9717b8288k2192L480J849L8018J1241m009K1929Q49p620k5037l792K2722L1851
9704D1001L3242J4480j8201l3225j3219J0603k0099K970J1799J1288K496M050
9692D7185k517k9893p773m911m285R903N869j7604l0073k599n759j8485j441K8542
9678c3841Q183J9108o05L0010J5789j5897j4730j8K446N454o050k5022J5761n270
$$ y = [6957, -12622, 9269, 16567, 16262, 2603, -12519, -6558, 11773, 16293, 512, -12358, -13154, 10450, 47905, 61919, 46351, 21751, -7424, -8019, -11088, -14301, 5277, -22640, -39977, -38709, -25013, 1478, 21164, 26722, -3057, 6447, 6973, 26166, 32262, 8743, -12701, -30312, -31562, -19660, -11032, -9796, -3856, -13512, -16151, -15289, -21197, -3144, -10652, -16290, -11979, -10012, 1316, -28288, -50480, -47000, -45151, -7133, 4108, 99, 22028, 22877, 15257, -9780, -13572, 9150, 41001, 74243, 88723, 70522, 37297, 24078, 34681, 14582, 17552, 29351, 40639, 43135, 47185, 44668, 14775, 7002, 2091, -2194, 7709, 13578, -4026, -34099, -36698, -42457, -60942, -62383, -33841, -25658, -6550, -7155, 22855, 38644, 22747, 8017, 7999, 10445, 15899, 9849, -15173, 588, -4682]
9664d682j922J1412p409R910K8379j4056j0572k0672j8866m631J9576o63J0652
9651c544j3059J3919j4058j9941K2494K1172j314l8913J3034J7607J1957P686
9639A7040J637j0640J988j435J3143j78k3965p645j5939P684J3648M721k1922
9626b1863j7249J1198L535L041N117j5054p27L146J0339K2971J3676J0663J4746
9613D3539k1186k7128r703K0979r542P973j4783j2131j9303M911L8925L0413l381
9600B9583o60k4119j7197J308m5001q081J4696N558M4302J3687j1418m656n280
9587g278R088P549K76R349j350j7613k2327O392K1732j016J0427j2822l9302j5984
9573e2879P39J2959R337J9616K2033M966o535l1809p232J7605j4363R89J191J1358
$$ y = [-4682, -6604, 4808, -2601, 7309, 35688, 21632, 11060, -9612, -28478, -33109, -13533, -14196, -3544, -16603, -2684, -16742, -36683, -14189, 6983, 5669, -33244, -20210, -2603, 9354, 17040, 18677, 8037, 10025, 8590, 21733, 21555, -2410, -10055, -25994, -18310, -4662, 59, -21863, -39112, -27914, -24379, -21338, -16221, -31275, -32002, -28856, -18517, 4454, 18130, 28793, 43539, 22353, -4775, -14478, 6501, -3041, 4932, -9851, -21982, -41285, -36374, 2551, 32964, 29583, 28923, 4804, -12393, -11085, -56086, -64167, -49471, -43913, 389, 14076, 2658, -1998, -7278, 1810, 9359, 9635, 18984, 17634, 21, -22306, -15914, 5818, 4802, 15229, 2407, -36895, -52879, -52140, -39181, -29844, -10228, 11805, 16771, 10236, -21573, -28805, -11200, -25563, -24574, -23383, -12025]
9559a2025O024j0966P181J1383L310J0549J4395k1928p407K697P962J7008l4087
9546e904j6955J9155J1954J2434j822l5307j8686J1698K0943m715J4595J6159
9534B3549o046j4253r257j054K3271j5344j0461j1872L341N883j4908l0871p14
9521e8736L4325K8229r435j2834k6759q835J3211M0099j5171j8814j973J6729
9509a9964J3476k0846J3627K433L746J4511J1158J7240K468Q64P695l4387J5774
9496B7795O415q112J605l146k198R201j1637q911P744K2470J4116k6850l524L8628
9482F3596p147m2822J2090M4427m440k5062j2154j3598k1705m033K1280P693Q090
9469B6215l7354o268K095J1405J8458j1651j3023o427K3508L302j5583J215M854
$$ y = [-12025, -6001, -16967, -9786, 1597, 4907, 15456, 29851, 7923, 516, 3213, 11175, 28183, -5904, -22859, -3704, 8250, 20684, 18862, -16445, -35131, -23433, -2490, -7205, 7390, 23549, 17503, 3250, -6007, -7061, 16210, 866, -9595, -21467, -18126, -12243, -27151, -58022, -58736, -24411, 3818, -5617, -18451, -45210, -54045, -40834, -735, -15906, -34720, -36693, -19964, -6488, -27334, -13707, -11274, -7528, 6983, 18141, 35381, 37849, 38713, 46408, 12021, 27795, 34210, 26098, 27703, 24557, 22359, 31560, 19923, 11012, 18756, 41226, 55342, 28492, 24968, 63596, 56449, 13627, 25717, 70144, 65704, 40642, 28488, 14890, -6815, -10848, 10432, 18125, 26215, -11139, -17407, -15312, -3907, 14551, 2900, -10123, -16550, 6958, 10260, -5323, -4108, 746]
9456G46N226J0403m339L704j0268Q026k0633q416P18J7580J3581j2016k1015J5267
9442a436K0973M313j3839k6982j7474r60J8039j9926j0665K8115J0971K6654p983
9429I800j2967l503L2438p619k7635k5078J0112k2516m311l560o085Q786M539
9416d7599K4386R114J1553J1291J1874J4793M157n578k7112k4099j5110N753N433
9403b1144o929M3071Q454N700r446p29k389p185N078l50j0840J2723K919J2189
9389C1122J7802k8316N018L838J374j7367p939J9188K7830q905l874j3188j1660
9376A4923J4059j9231R009M83l197N327j8027l618P546N705k1755j9427J1542
9363a6661L2802J9568M013j0216k0656m041K0425n791l519J4693R999o99J8012
$$ y = [746, 5972, 16375, 12036, 15740, 5472, 13498, -7135, -15551, -14833, 2747, 16328, 4312, -16703, -1436, 19537, 23850, 10011, -16971, -34445, -35405, -17366, -37292, -47957, -19842, -8871, 17783, 9800, -3167, -6670, 25768, 18149, -9486, -34564, -24452, -46968, -51279, -54839, -60924, -52138, -47599, -23213, -14099, -2546, 8745, 20619, 35412, 39569, 33991, 6879, -17220, -32330, -26577, -21144, -28073, 14998, 23452, 29152, 19706, 18977, 16588, 9403, 14481, 14131, 3291, 16014, 18933, 31122, 48924, 20608, 25626, 29464, 30838, 13471, 5532, 24720, 52550, 43645, 39771, 26583, 14923, 28982, 9751, 18760, 19243, 16046, 21373, 3346, -272, 7274, 12979, -8776, -28203, -16661, 16141, 35709, 39722, 29506, 8850, 4809, 25234, 19443, 15924, 30617, 40616, 39917, 57929]
9350E7929j5747n848N487M696m928k9994j3338j1294L746J2813q659Q633J1296
9337A4792J916L077n388P198J2024n951j8665O865j660j0611R95K5276J3003N83
9323D3454j1258k2817l1393J6796M6450P589j4108j1699L5444J4178J2167j5971
9311F8832l1525P960P418j255K1925j0326J9036K1259j530l1538j2247N777K2804
9298H6590J1950j3953n772J5647J9318K2073o709r40j4065k5863M735M530k0680
9285G6861J076L5557J2362J0355M662R185J29k2410N318j2179o524q223L946M1314
9271A51429J3688j4455j4930L7747K6685j3385j2530m331K6489L9799n480K2930
9259B53656L5783J3697K3221M1045M2578O5214O5808P5510Q6627P7079J00387
$$ y = [57929, 42182, 36334, 41821, 46517, 41589, 11595, -1743, -13037, -9291, 3522, -5137, 3496, 14792, 16708, 19785, 14397, 21595, 33619, 27668, 9003, 15868, 14208, 3597, 4592, 29868, 42871, 43454, 32196, 9379, -22014, -5218, 41232, 48821, 34713, 23014, 58458, 72636, 84803, 68832, 37307, 45267, 52685, 51430, 73355, 63029, 82065, 103324, 101794, 70256, 58009, 63786, 86590, 98540, 84587, 78815, 94462, 113780, 135853, 129144, 128204, 114139, 88276, 93011, 97541, 76861, 77937, 113494, 125856, 136211, 140873, 150058, 150187, 127777, 133095, 120916, 114392, 106169, 110115, 151429, 165117, 150662, 135732, 173479, 200164, 186779, 174249, 169918, 196407, 236206, 230726, 253656, 289439, 303136, 326357, 367402, 409980, 475194, 541002, 616512, 703139, 780218, 880605]
9248H80605J58918J68202J47704J46385P9345L0856K1389Q795N259J5970K6434
9237A689862R4812J81105K47776L71701N00169O45714Q63313J223757J738716
9228G556925K413834K487510R25342j685464k612784k090825j394962r11850o59619
9219D028107m94616l60522k91910k03845j62359j57653j51676j23853j03223j17632
9209A860818q0137l0950n3500l9179o615j4933p0610p2461j9964L5809n354Q010
9197A510934M1040q906j4444M060N048j6212m6051q3111p4629p6148p7729o8918
9185A094934o1204n1965n5709o1286p3128m4063k8717n3777m1352j5932k6353
9174E81448k3571j3277j9413m3328l7540m3010l9176J3998j1386l7660k5800l56
$$ y = [880605, 1039523, 1207725, 1355429, 1501814, 1581159, 1612015, 1633404, 1642199, 1647458, 1663428, 1689862, 1784674, 1965779, 2213555, 2585256, 3085425, 3731139, 4594452, 5818209, 7556925, 9970759, 12458269, 13383611, 11698147, 9085363, 6994538, 5599576, 4687726, 4028107, 3533491, 3172969, 2881059, 2677214, 2514855, 2357202, 2205526, 2081673, 1978450, 1860818, 1780681, 1749731, 1696231, 1657052, 1650437, 1635504, 1564894, 1492433, 1472469, 1508278, 1502924, 1510934, 1551974, 1543068, 1528624, 1532684, 1537732, 1521520, 1475469, 1392358, 1317729, 1241581, 1163852, 1094934, 1033730, 981765, 926056, 864770, 791642, 747579, 718862, 665085, 623733, 607801, 581448, 557877, 544600, 525187, 481859, 444319, 401309, 362133, 376131, 364745, 327085, 301285, 300929]
9162C00929Q091Q461k2611m9474j9766J8360L382q084k3672j7139l105j1805k2816
9149A60751M47L69O708k7499j4658N042K3408o97M371j1732j2044q222r416j1116
9135A05712o553k770k638k162j045O868m699k6847R765j5496K7942j353r977j2056
9121F4691K4027J4855j3662q51J8175j1443l7373j1126m077J9390J7230p027q022
9108F4787J2632K02j3419j3383K620K7083O249r481k0537j4697m84n943J2028
9095D7657j9970K7280K5627K619o407k2322k9253J0793J4050J636j4561K05Q836
9082D6190j70J360L380K3830j2788k3586j2200K0612K7245j0164j2373l376j8333
9069B9627K0q709J0302m692q045N8j4549k476k7922O880J3573L353J3852K0835
$$ y = [300929, 309020, 317481, 294870, 245396, 225630, 243990, 247372, 239288, 215616, 198477, 195372, 183567, 160751, 161198, 161567, 168275, 140776, 126118, 131160, 154568, 153871, 158242, 146510, 134466, 126244, 116828, 105712, 99159, 96389, 93751, 91589, 90544, 97412, 92713, 65866, 75631, 60135, 88077, 86724, 76747, 64691, 88718, 103573, 89911, 89060, 107235, 95792, 58419, 47293, 43216, 62606, 79836, 72809, 64787, 77419, 77621, 64202, 50819, 53439, 80522, 86771, 77290, 56753, 42056, 41572, 35629, 47657, 27687, 54967, 80594, 83213, 76806, 54484, 25231, 36024, 50074, 51710, 37149, 37354, 46190, 46020, 47380, 50760, 74590, 61802, 38216, 26016, 46628, 73873, 63709, 51336, 47960, 29627, 29647, 20938, 31240, 26548, 18503, 18561, 4012, 1536, -26386, -19506, -5933, -2580, 11272, 32107]
9055C2107J4040Q039j4505j7234J6226J346j5310N24K631L686M826N735J4247
9042E6358K7876J0441p717o563j2294m547J7681J0126q869l0053j8422K1136P348
9029F2501l5605p327Q418R389R474N068L116K200k6551R063L364K9048J4305j5944
9015G0519j584j7164p480J0010L3294J4257k303P035j0392M957l0782q772p511
9002E4084J6119k4854k0997J8399J3378l908j4061n140K3655J1564j0280M798
8990F2757m090P738R582J3114j3492k0775p405J022j2211J220R894J1008M139
8977F2501K130n471j6361n982Q175j7521j6197j7080N62P311N614M751J6226l94
8963B8264n33m698K3476K2007M134k0636j438j3357L61l735m240j1210j3161j4162
$$ y = [32107, 46147, 54186, 39681, 22447, 38673, 40019, 24709, 25233, 27864, 31550, 36376, 42111, 56358, 84234, 94675, 86958, 80395, 68101, 63554, 81235, 91361, 82492, 52439, 34017, 55153, 62501, 26896, 19569, 27987, 37376, 46850, 51918, 55034, 57234, 30683, 39746, 43110, 72158, 86463, 70519, 68935, 51771, 44291, 54301, 87595, 101852, 99549, 106584, 96192, 101149, 70367, 61595, 54084, 70203, 45349, 24352, 42751, 56129, 52221, 38160, 33020, 56675, 68239, 57959, 62757, 58667, 66405, 75987, 89101, 75609, 54834, 47429, 48451, 36240, 37460, 47354, 58362, 62501, 64631, 59160, 42799, 36817, 44992, 27471, 11274, -5806, -5244, 2067, 7681, 12432, 28658, 28264, 27731, 23033, 46509, 68516, 72650, 52014, 50576, 37219, 37580, 33845, 29605, 18395, 5234, -8928]
8949h928j551K0214L6950J423k1842j307J4853J6692k5871n73K562j2648r866
8936A0108J6553K5424K38j8199Q009K4401M3462P886l71l9109k3287p616k0154
8923B7345k9649P153J6545j5953R573p620K4660J3944j7596k0988L2892J2010
8911E2316r513P728K930K243j1259l3139m660m50J5373l184l0758k4133J2558
8898b3948l405K1746J7761J0846J090m043J0717j4618r590n630Q067L966R43L526
8884A7428m791J5521J8028K5675J3150J0039k2355l0377k0301K1991L0219J5891
8872I0118K8519j1774K9454N0683R806J9249N6053J9794l188m4757n2423m3172
8860A48362l0180m0835k588n215m917k224k0105P116J4081q446q969J5680p048
$$ y = [-8928, -10479, 9735, 46685, 48108, 26266, 24959, 39812, 56504, 30633, 30060, 32622, 19974, 10108, 26661, 52085, 52323, 34124, 42133, 66534, 109996, 117882, 117511, 78402, 55115, 47499, 27345, -2304, 4849, 21394, 5441, 15014, 7394, 32054, 45998, 28402, 7414, 40306, 52316, 42803, 50531, 53461, 55704, 44445, 11306, 6646, 6196, 21569, 18385, -12373, -36506, -23948, -27353, -5607, 12154, 23000, 24090, 20047, 30764, 16146, 6556, 926, 8993, 12959, 13902, 17428, 12637, 28158, 46186, 71861, 85011, 95050, 72695, 42318, 22017, 44008, 74227, 90118, 118637, 106863, 136317, 187000, 196806, 216055, 272108, 291902, 288714, 243957, 191534, 148362, 118182, 77347, 74759, 69544, 64627, 62403, 42298, 49414, 63495, 55049, 46080, 61760, 54712]
8847E4712j326J177L209K789j0057j0338r565k1070j3914J0213L0823l768K584
8834C5469J4368j209r601l1006r92J8041J0250J5384k959l4924N468J0181k7949
8821E21K3144M1976K5575j7358l0271l5425j5662o4M833N364J0423R519K4723
8808D7298j5883o523j5720j623l5534M362Q180m981K0749K8763P634k2528j2593
8795A601J0437O838P087k0099J4505J1156p729j865Q794J4650J1042j3535j1555
8782C1327K1629p546r304K0508J389n186p54p45M475n295k6254j5502J3650o396
8768A5996Q506P969k2479j479J2994j1697J2254J7621j3526j5169O579O693J6580
8755D0842J2409j5757J2964O650k0691l117j014K163j659k726j7917k545K8596
$$ y = [54712, 53386, 54563, 57772, 60561, 50504, 40166, 30601, 9531, -4383, 5830, 36653, 32885, 35469, 49837, 48628, 39027, 8021, 7029, 25070, 35320, 50704, 47745, 12821, 18289, 28470, 521, 23665, 65641, 91216, 73858, 43587, 8162, -7500, -7564, -2731, 2633, 13056, 22575, 47298, 31415, 24892, 9172, 7549, -27985, -23623, -15443, -20424, 325, 29088, 36722, 14194, 1601, 12038, 18876, 25963, 5864, 20369, 31525, 23796, 21931, 30725, 45375, 56417, 42882, 31327, 52956, 45410, 36106, 56614, 58003, 52817, 52063, 51318, 55793, 50498, 24244, 8742, 22392, 15996, 24502, 32471, 9992, 8513, 21507, 9810, 22064, 39685, 26159, 10990, 17569, 24262, 40842, 53251, 37494, 50458, 57108, 36417, 33300, 32286, 34449, 32790, 30064, 12147, 9602, 38198]
8742C8198L4390j3269J0480P46k5422j2219m743j5836j3487M2722J2169J0167
8730F3896P386P259r593k437K8618n110Q298J7851K226o814j1173o62J423j8957
8716H2211J4800N048j1345j0253j5957J0972M7388j9421j3695j2759k2032K1818
8704G6775J1797n141K6207J4300j9606j3727J5244P537N770O371M011K655l6242
8691I5951j5848K7073L3431R624k2041l8744L708K3690L7924J9082j3876M605
8679A64579K131j4452r256M098j0389R954K0823J098k3226l2620j52K4680L8100
8666A75368o752J0350Q272q747k3278P79K367K1714J4214k826j7537r901J4033
8653A78056L6246K141J23K2471L5899J6261m742J3261j398K1812m25m305k1281
$$ y = [38198, 72588, 59319, 69799, 70545, 45123, 32904, 28161, 12325, -1162, 41560, 53729, 63896, 71282, 78541, 68948, 66511, 95129, 90019, 98317, 116168, 118394, 111580, 100407, 99745, 101168, 82211, 97011, 102059, 90714, 80461, 64504, 75476, 122864, 103443, 89748, 76989, 54957, 76775, 88572, 83431, 109638, 123938, 104332, 90605, 105849, 113386, 119156, 125527, 129538, 132193, 95951, 80103, 107176, 140607, 150231, 128190, 89446, 93154, 116844, 154768, 173850, 159974, 164579, 166710, 152258, 143002, 147100, 136711, 146665, 167488, 168586, 145360, 112740, 112588, 137268, 175368, 168616, 178966, 187238, 178491, 155213, 155992, 158359, 180073, 194287, 191461, 173924, 164023, 178056, 214302, 216443, 216566, 239037, 274936, 291197, 286455, 299716, 298318, 320130, 319705, 315400, 294119]
8640B94119j2037J3750k169L902J7900j1628J3704Q737p330J0426P043L8178K2051
8627C96646L3895J8040j385J1694J7803K5004M6687L2021n503N634R828R310K6118
8614F25792l936j5913J2981K0346k794p816k6612k7984m1440p226J9526J3974
8602E58898k5762n0161k2876j1052N841M521j0450l590j1286J0530j7740q898
8590D17975M870L0408m3312n5253j6457j8232j5809L379j5891J3177k007l2496
8578B70352j0264q937J3612J7264l4450j7105p133j3702j4486q432J8019L573
8566B08311n140J941R729k178l2133q569J4025m271k2995k1465J153J0884J0333
8553A59625q16r157q99l0624N371k952k7370J2468J2810l0297j6378L967n334
$$ y = [294119, 282082, 295832, 293663, 297565, 315465, 303837, 317541, 326278, 318948, 329374, 336417, 374595, 396646, 430541, 448581, 447196, 458890, 476693, 501697, 548384, 580405, 574902, 580536, 590364, 599674, 625792, 621856, 605943, 618924, 639270, 636476, 628660, 602048, 574064, 532624, 525398, 544924, 558898, 533136, 482975, 460099, 449047, 454888, 459409, 448959, 445369, 434083, 444613, 426873, 417975, 422845, 453253, 409941, 354688, 338231, 319999, 304190, 307569, 291678, 304855, 302848, 270352, 260088, 251151, 264763, 282027, 247577, 230472, 223339, 209637, 195151, 186719, 204738, 208311, 203171, 205112, 214841, 212663, 180530, 171961, 185986, 181715, 158720, 137255, 138408, 149292, 159625, 158809, 149652, 148753, 118129, 123500, 120548, 93178, 105646, 118456, 88159, 71781, 75748, 70414]
8540G0414R365O92k2242J3407J1605r322p49q09K3175J4150j2843k1957k1715
8527E3171r9o811m014P161j3166J1936J2330Q146J7817P11r222l3665k6704K559
8513B0150L7166J8550J0119j4457j4149j6940j1074k7284K90O519k140R306r559
8500F497l177J0928L234M9732J0193k1521j4310j7882j1815J2053j1519k3715
8488a1302p945k973J6009O883J5226L5715O029j032r219j0644j2987J004J9550
8475D4314j4872P272K2780j7465O936j5195l2619j0595k212J7349J0089L4644
8463E0426J0832j3453N063r853P05N802m403R936J0900j2246j4482k1566j6406
8450A255r614L868M9232K8394J0155j04N589L83j2524J0090J7376q052k3670q951
$$ y = [70414, 79779, 80471, 58229, 71636, 83241, 73919, 73170, 72361, 95536, 109686, 96843, 74886, 53171, 53072, 46261, 42247, 49408, 36242, 48178, 60508, 68654, 86471, 87182, 77960, 44295, 17591, 20150, 57316, 75866, 85985, 71528, 57379, 40439, 29365, 2081, 2371, 8890, 6750, 16056, 6497, 3320, 14248, 17482, 67214, 77407, 55886, 41576, 23694, 11879, 23932, 12413, -11302, -19247, -22220, -6211, 672, 15898, 51613, 57642, 56610, 47391, 36747, 23760, 24764, 44314, 29442, 36714, 59494, 42029, 48965, 33770, 1151, -9444, -11656, 5693, 15782, 50426, 61258, 47805, 52868, 43015, 43720, 49522, 45119, 55055, 65955, 53709, 39227, 17661, 1255, -8359, -4491, 44741, 73135, 83290, 83186, 88775, 89158, 76634, 86724, 104100, 96048, 72378, 63427]
8436F3427k400k1826l2891p686J2535j6685O272p069O65K6359J5391J9773j3378
8423D2487M64J1794J7223o770j7870j5421J753j0258O86L3955J8935k9465l565
8410D3948M373j4188Q12k7758k182Q135R575J6245k4634k0R034K5953O334o15
8396E5012k9239J3743J0415l148Q960Q043k3505j0759J6037K530j1920K0369N418
8383F1956r211K2009j314k0316O839j5758j1317l924K2781N0646j8883k6551o348
8370E0609N622j9874J1604N57K354K1596k2420n362j667L723J9816Q687J0256
8357H5501k2109k1925p491j9905P850j2597J0982j1615m3668j4817Q179M7137
8345E522K1971K629j2313m8434M561O0654J6762M54J0181m656l2023k8807J7839
$$ y = [63427, 61027, 39201, 6310, -1376, 11159, -5526, 746, -6323, -5658, 20701, 36092, 55865, 42487, 42951, 54745, 71968, 65198, 47328, 31907, 33660, 23402, 24088, 58043, 76978, 47513, 43948, 48321, 34133, 34945, 7187, 5005, 13140, 22715, 38960, 14326, 14306, 23340, 49293, 55627, 55012, 25773, 39516, 49931, 46783, 55743, 63786, 40281, 29522, 45559, 48089, 36169, 56538, 61956, 52745, 74754, 73440, 53124, 59963, 44205, 32888, 28964, 51745, 102391, 83508, 56957, 50609, 56231, 36357, 47961, 48518, 50872, 72468, 50048, 44686, 43019, 46742, 66558, 75245, 85501, 63392, 41467, 33976, 14071, 21921, 9324, 20306, 8691, -34977, -49794, -41615, 5522, 27493, 30122, 17809, -30625, -26064, 34590, 51352, 51806, 61987, 57331, 25308, -3499, 14340]
8332A4340n717K545L995k1049J2843N713K1602J6642l090J8740j5991l6788o146
8319G639J6814N526q0O741Q387K2636O906j9729j5456j262k5907p323o316j5223
8305a6647R184j6631J1590L8461K3710J3563J0551L943k6290m0163j4996N284
8293A559J4715r185n846J7017q090O134K5155J810j0481o596j180j8009k4993
8280a7990q3L2840K083k605k1365J7438J2397r780J0474j7738j148j2190l1950
8267c9617l769K2729Q877j6169K781K5840J3523m933n751J6348j5288q278o457
8254a0164j2321K3103K0289j1539p65m967r557L4305j008j2823q184J1957J2120
8241C0446l726k91J081k5033J4791K0689M455K2762j229m2189j9718J20J4710
$$ y = [14340, 8623, 11168, 15163, -5886, 6957, 12670, 34272, 50914, 47824, 66564, 50573, 13785, 7639, 24453, 29979, 29899, 36640, 45027, 67663, 74569, 54840, 39384, 38122, 12215, 4892, -1424, -16647, -7463, -24094, -12504, 25957, 49667, 63230, 73781, 77724, 51434, 11271, -3725, 1559, 16274, 7089, 1243, 18260, 10170, 16304, 41459, 43269, 32788, 26192, 25012, 7003, -17990, -18073, 14767, 16850, 14245, -7120, 10318, 22715, 12935, 23409, 5671, 4523, -7667, -39617, -43386, -20657, -11780, -27949, -25168, 672, 14195, 9262, 3511, 19859, 4571, -3707, -10164, -22485, 618, 20907, 9368, 8603, 3636, -5921, 28384, 27376, 14553, 6369, 18326, 30446, 26720, 26429, 27510, 2477, 17268, 37957, 42412, 65174, 63945, 21756, 2038, 2158, 16868]
8228A6868J886M805P310k5773j2144K6813J0661r801k5811J3224J3609k598k6101
8215g052j9320R050K2635M2721j0054l6696j4053J5844J3051J5898J282j3901
8203A9405n055K9578k2304m46j904p071l49o463J0765l886p557j1278r118J7217
8189A534J666o976j4618N618K960J0672K5974k498j4289K3126K2014R063n13k1417
8175D2316j0854m549K0595P917j8300l676R88p113J9776L4549l6853k4514L769
8162B4051K5561M7820K0874J1981r228m2418k1079J1627k0708m879n804K208k6521
8149A3485l2281K2054L6591j0555K5429J0862m7120k2384J2110j2173J0995R653
8137A6666j5065J1407J4299J7635L710L050P224k8350k4385k4054j286Q865K8188
$$ y = [16868, 18754, 23559, 30869, 5096, -7048, 19765, 30426, 20625, -5186, 8038, 21647, 19049, -7052, -26372, -17322, 5313, 48034, 37980, 1284, -12769, 3075, 16126, 32024, 33306, 19405, 14350, 43928, 21624, 21178, 19274, 12203, 11854, 5391, 16156, 12270, 4713, -6565, -15683, 1534, 3200, -3776, -18394, -12776, -9816, 856, 26830, 24332, 10043, 33169, 55183, 64246, 63733, 42316, 31462, 26913, 47508, 55425, 37125, 33449, 34437, 27324, 47100, 81649, 44796, 20282, 24051, 49612, 97432, 118306, 130287, 121059, 78641, 57562, 69189, 48481, 43602, 37798, 40006, 13485, -18796, 3258, 39849, 29294, 54723, 65585, 18465, -3919, 8191, -3982, 7013, 16666, 1601, 13008, 27307, 44942, 48652, 51702, 58926, 30576, 6191, -17863, -19149, -10284, 17904]
8124A7904M885n570J6946K4278J2314N565j417J4681K0912j1442j5435j5764k2395
8111D5462j5453P291l188K0512j3806M656j6994m0901k3773r601N957J6327J8506
8098e005N913k465J9080K828J7871j1156r705J5336m032J4189o441j0471N499
8085C1441Q648j032J0799J7522N432k729j5573J308k333j3204k9073j2046J0763
8072I923K3047K3558J0420J5893J3062j4970r048J7627l654k273P271J0894J3447
8059A15197K9819k6239Q258M70m022L4182j993O304L2229K0622J6864J977l2866
8046B00802r499K2767r234r426O920M9672K2608j3096j6242J2176j377j03J0768
8033B66736j8069o829K2178L7752M832k0224k0803L2293J3913J111k569k246o151
$$ y = [17904, 22789, 17219, 34165, 58443, 70757, 76322, 74905, 89586, 110498, 99056, 83621, 67857, 45462, 30009, 37300, 34112, 54624, 40818, 45474, 28480, -12421, -36194, -45795, -39838, -23511, -5005, 908, -1557, 17523, 20351, 38222, 27066, 17361, 32697, 28665, 42854, 36413, 25942, 31441, 40089, 39057, 49856, 67378, 72810, 70081, 54508, 55816, 53483, 40279, 11206, -840, 9923, 32970, 56528, 66948, 82841, 95903, 80933, 71885, 89512, 85858, 83585, 90856, 101750, 115197, 145016, 118777, 127035, 127505, 123483, 157665, 155672, 161976, 194205, 214827, 231691, 233668, 200802, 191303, 214070, 204836, 195410, 202330, 252002, 274610, 261514, 245272, 257448, 256071, 255968, 266736, 248667, 241838, 264016, 301768, 306600, 286376, 265573, 297866, 311779, 312890, 310321, 308075, 301924]
8020C01924J2675J1021J9724Q457Q112R527K9660M9033N9065K7713J2825N7745
8008F07481L6005Q4355L1490l1088m2091l7161n1141n4476l304p737L748K9689
7996E65770N7430N6484J572l3660l0755m1273n0484p3126o2998q965r320n669
7984C65006M71l13j3154q932J5755K3455P733j968m716K2382j1558j034K8287
7971D21414K6609J079o695o28L1836N1342N6471O7634K8515j7661j3380m388j5003
7958F27145m3701j2903K4904K7042L1393k462o781j8814o5885n7214m1698l0921
7946D30105k3853j4298k5419p958j2408j2232k7786l551j1347j8889J572J3082
7934B87018j920P278J1417k889j8662k05m686j7245l373J7461K0029J1114K2384
$$ y = [301924, 314599, 325620, 345344, 353801, 361913, 371440, 401100, 450133, 509198, 536911, 549736, 607481, 643486, 727841, 759331, 728243, 686152, 648991, 597850, 543374, 540070, 532333, 536081, 565770, 623200, 679684, 681256, 647596, 616841, 575568, 525084, 451958, 388960, 379995, 370675, 365006, 365477, 365164, 352010, 343078, 358833, 382288, 390021, 388053, 383337, 405719, 394161, 393127, 421414, 448023, 449102, 442407, 441779, 473615, 524957, 581428, 649062, 677577, 659916, 646536, 642148, 627145, 583444, 570541, 595445, 622487, 653880, 651418, 644637, 625823, 559938, 502724, 461026, 430105, 406252, 391954, 366535, 358577, 346169, 333937, 306151, 302600, 291253, 272364, 273936, 287018, 285098, 292376, 303793, 300904, 282242, 282037, 277351, 260106, 256733, 274194, 294223, 305337, 327721]
7921C27721K1377l770k6447k4274l537j8280j7613J8956k4239j4408j098k1135
7909B13253K305Q17j8865k621J716k0546l2538k6000J3483L611O096O978M987
7896A52676k6682j4492J7361j496o95P220J9866j9184k3613J8449J4981m152o012
7883A34227k6873j7333J0393K1806j614M908j0715j7369r412k0473j3916j1762
7871D1867L4192K0144k1979M560J9116m3651l1466J526J3939J3459j019p561m296
7858C8831L4893J8737j4984j4871m2072k5767l528J7118P611n188K351p425j47
7845E559q34j6815k0012P266J2916K0142j7895j2333l591K4022R090L263K4068
7832C4846J012J628p854k4262k2927K2632K1311J9204k2474j1280j1511j9169
$$ y = [327721, 349098, 345328, 318881, 294607, 291070, 272790, 255177, 274133, 249894, 235486, 234388, 213253, 215558, 216375, 197510, 194889, 196605, 176059, 143521, 117521, 131004, 134615, 140711, 147689, 152676, 125994, 111502, 128863, 127367, 126672, 133892, 153758, 134574, 110961, 129410, 144391, 140239, 134227, 107354, 90021, 100414, 122220, 120606, 125514, 114799, 97430, 88018, 67545, 53629, 41867, 76059, 96203, 74224, 78784, 97900, 54249, 22783, 24309, 38248, 51707, 50688, 43127, 38831, 73724, 92461, 77477, 62606, 20534, -5233, -8761, 8357, 15968, 10780, 13131, 5706, 5559, 4725, -12090, -32102, -24836, -11920, 8222, -9673, -22006, -25597, -1575, 7515, 10778, 34846, 35858, 37486, 29632, 5370, -17557, 5075, 26386, 45590, 23116, 11836, 325, -18844]
7820a8844n299J951L0661P513k8250j8758K7909M467j8509j5871j1150k024j0683
7807e6887J1173K3100K8681l136k1334k0394j7531J6649K9361m746M101k455J6177
7794B759j0736k0881l36K868J6864O698J505j0321J2325J0997M026R335l1528
7781f425j4998Q054N079J2442k1164l3732J1186j1787j872n325K0196N37J9798
7768a8011J9953K0189m016j9184J4149j1318k5864j372j101r928o234j216N445
7755c8508J6848M249j229q994L021J079j2205n495J6501J9099L4092O191q318
7742B6331o492O983o605o654j6575m568j7319o076L0404K3978J9490N77k3823
7729A9651j8638J7487r013j2771K5313p79j4824k2756O925J7571K2659L621k5704
$$ y = [-18844, -24143, -22192, 8469, 15982, -12268, -31026, -3117, 1350, -17159, -33030, -44180, -46204, -56887, -45714, -22614, 6067, 2931, -18403, -38797, -56328, -39679, -10318, -15064, -10963, -13418, 2759, -7977, -28858, -29194, -26326, -9462, -2764, -1259, -11580, 745, 11742, 15768, 25103, -6425, -21423, -13369, -8290, 4152, -17012, -50744, -39558, -51345, -53217, -58542, -38346, -37809, -18011, 1942, 22131, 18115, -1069, 13080, 1762, -24102, -25474, -26575, -36503, -42737, -43953, -38508, -21660, -17411, -18640, -27634, -24613, -23534, -35739, -41234, -24733, -5634, 28458, 34649, 26331, 19839, 26822, 20217, 13563, -3012, -7580, -24899, -30975, -571, 23407, 42897, 43474, 19651, 1013, 18500, 9487, -3284, 22029, 21250, 6426, -16330, -9405, 8166, 30825, 34446, 8742]
7716H742K665l875j2390m088k2594L149J4351r59l159N650J1899j7768p4J6676
7702a775j5487l109R201n980K5311K4071j2849p346p967j6328O509M910l6386
7689c7225j0639J6657Q275k7051j106K5961M214n22m45J5157J066j0945L2403
7676A5800r899j3506j3622o568R213o990J0894M709k174r758k158K7609K3877
7663B7427Q473j2716j4591j3488j6451j0650J5029J7884J4427q093n236j2409
7651a0394M376j5652Q983M067J8107O476J6619M746j5320J538j5436j1892O040
7638B258J0246K3377O936J4429m1232q164Q138o806J6057K1047j0422K939N913
7625D4716j1207J4335j7628k8158O898P716k906j3429J5683p243l0055K1740P448
$$ y = [8742, 11407, 7532, -4858, -8946, -31540, -28391, -14040, -14999, -18158, -12508, -609, -18377, -18451, -1775, -17262, -20371, -11170, -17150, 8161, 32232, 19383, 12037, 4070, -12258, -5749, -839, -37225, -47864, -31207, -22932, -49983, -51089, -25128, -20914, -21436, -21881, -6724, -5658, -16603, 15800, 5901, -7605, -21227, -27795, -18582, -25572, -14678, -9969, -12143, -21901, -24059, 3550, 27427, 35900, 23184, 8593, -4895, -21346, -31996, -16967, 917, 15344, 7251, 2015, -10394, -6018, -21670, -12687, -8620, 9487, 15963, 32582, 37328, 22008, 23546, 8110, -3782, 2258, 12504, 35881, 42817, 57246, 16014, 7850, 15988, 9182, 25239, 46286, 35864, 38803, 44716, 33509, 47844, 30216, 2058, 8956, 16672, 13766, 337, 16020, 8777, -21278, 462, 7910]
7612G910j5592l003Q8m481j650l5310k55M7503J5650j7823J9734n410n338k0538
7598a8515K819J8907j7478k4101p056M313O793K9190L1933K349k2888j6157J1811
7585A920o41P689n950p204j8596k7711M198N2875J5887P407O404o021J9449j2727
7571C6979j4357J2433m413j2567n508j4033r781o050o923n825J9585N103J5226
7558I869J1578p060J0261K2012p771k2370j105j2216n864l8140M112L3865M99
7545b330L916J0792J6802k68l1254J3325J9294J7077J0208k7338k6602r741j4611
7532b0730J3850J9801j0730l520N20J2301O31j800l70j4608l4772p898k5065N073
7518f7317J0412k240J4984J9919j0519m593L4921o441l902O479L0692J0672q975
$$ y = [7910, -7682, -10685, -10597, -15078, -16728, -52038, -52293, -4790, 10860, -6963, 12771, 7361, 2023, -18515, -15696, 3211, -14267, -38368, -45424, -41111, -34318, -5128, 26805, 29154, 6266, -9891, 1920, 1279, 8968, 3018, -4186, -22782, -50493, -46295, 6580, 22467, 29874, 36278, 30257, 49706, 36979, 22622, 35055, 30642, 18075, 12567, -1466, -11247, -17297, -24220, -30045, -10460, -5357, 9869, 21447, 14387, 24648, 46660, 38889, 16519, 15414, 3198, -2666, -40806, -36694, -2829, -2330, 1586, 12378, 29180, 28912, -2342, 10983, 30277, 47354, 57562, 30224, 3622, -6119, -20730, -6880, 12921, 2191, -1329, -809, 11492, 12123, 10323, 9953, -4655, -39427, -47325, -72390, -67317, -56905, -59145, -44161, -24242, -34761, -39354, -4433, -10874, -14776, -8297, 22395, 33067, 24092]
7505B4092J0178j9933j4338L637R372m374n316M046N181L113j735l7237j626J2604
7491a2336J4754L260J1012r463J5702N2723k423m488j5790j1179k6715P33J0470
7478B6260N956k4635k6266J2520J221r655k119n891K1110n685k4310j4708j0573
7465e6775K6591J4370J3447L6164M704k883n503K889l556k573J6981l1063n0960
7452c8167J658n483K297j178q084L1856Q952O671J8964M270j5186K0514J473k8798
7438b41P22J1208j809j5622j3747K7489K573l402J507j0530j7993r632L255M307
7424b1915o668k3719L1883K9391J5110p494m265j6013p005j0084j8Q677K6673
7411A4553P770r177M330j3657J2689k2646J7835P086l133j9207q739o531K8106
$$ y = [24092, 34270, 14337, -1, 3636, 13008, 8634, 3318, 7364, 12545, 15658, 13923, -23314, -24940, -12336, 2418, 5678, 16690, 7227, 22929, 75652, 73229, 68741, 52951, 41772, 15057, 15790, 26260, 32216, 7581, -18685, -6165, -4944, -14599, -16718, -22609, -1499, -7184, -31494, -46202, -56775, -30184, -15814, -2367, 33797, 38501, 35618, 30115, 33004, 29448, 26875, 43856, 12793, -38167, -36509, -41992, -39695, -40873, -48957, -17101, -8149, -1478, 17486, 21756, 6570, 27084, 28557, -241, 481, 11689, 9880, -5742, -19489, 8000, 10573, 7171, 8678, -1852, -19845, -29477, -26222, -21915, -28583, -52302, -20419, 8972, 24082, 16588, 12323, -3690, -10695, -20779, -20797, -12120, 14553, 22323, 13146, 17476, 3819, 16508, -6138, 11697, 18783, 15650, -3557, -12296, -18827, 9279]
7398I279Q300j4259l0650p205L0478K3822J914q494j3679j536J0146J1238k1670
7385b316J4741O951J6482l7441m1857n685K266J1877O620L8742l51o319q810O949
7371A849j503J14O411k7692m0k5791j8806L4085L8720Q748j5340j068L655J98
7357C540L9522J6792k8557p245J3356j2705n682k4658j378J8648j9544j5163O201
7344a6873J6701N694j2865j1016J1705J761q612K5344P479J302j1280k3146K2556
7331H750N262l1411l7293K0067K5115J2966j0241k5k1220n44p348L463N409Q585
7317a8465j0698L732R178j381o008P791n227J1807L8901q81o275j7074m6471J9333
7303b1738J9790l0467N521p217R538J1686j4687q860M1902L1524k1110m6891j493
$$ y = [9279, 17579, 3320, -27330, -34535, -4057, 19765, 21679, 13185, -494, -2030, 8116, 19354, -2316, 12425, 19376, 35858, -1583, -43440, -49125, -46859, -34982, -28362, 10380, 10029, 3710, -5100, 1849, 346, 460, 6871, -20821, -20861, -46652, -65458, -31373, 7347, 16095, 755, -313, 3342, 3540, 43062, 59854, 31297, 24052, 37408, 24703, 19021, -5637, -7015, 11633, -7911, -23074, -16873, -172, 5522, -7343, -18359, -6654, -4893, -13505, 11839, 19318, 20620, 9340, -13806, 8750, 14012, -17399, -54692, -34625, -9510, 3456, -6785, -6810, -28030, -28574, -35922, -32459, -27050, -18465, -29163, -25431, -16253, -17634, -23642, -15851, -21078, -9271, 29630, 28749, 22474, 5400, -41071, -21738, -1948, -32415, -26894, -34111, -24573, -12887, -27574, -36434, 5468, 36992, 15882, -31009, -32502]
7290c2502L7581K5150M61j1794l3107j5637J2600K0135p013k3966K5088J4354
7278A1350r46j5572j2009j844K77k7227j6476j1071J8557m449L485k032J1230
7265d6727o783K5029J183k3065N28j631m794K4688K7656l899r697k9825R76N736
7251d0625J2628L7454j8925l1701J7990o641R413J3276j4804J4069J1172J1918
7239A5224J7140j4264k2153J5146J115j7424Q548p15l025j5557j1357K5042k4938
7226b7218J1210p475k3806M682J9280J8204K3874L237j4067j6187J0606j2282
7214i942p621j2519J4996J9356Q741j9345o080J1161J5908k914K955L215j1014
7201F897l6144j6043J0685L7862l746k3780m376J9812K2386K1911l2359j0709
$$ y = [-32502, 5079, 30229, 30690, 18896, -14211, -29848, -17248, 2887, -4126, -28092, -3004, 11350, 10404, -5168, -17177, -19021, -18744, -45971, -62447, -73518, -54961, -59410, -55925, -57957, -46727, -53510, -28481, -27298, -50363, -49835, -51466, -56260, -31572, -3916, -7815, -17512, -47337, -46361, -40625, -27997, 9457, -9468, -41169, -23179, -29820, -20407, -7131, -21935, -7866, 3306, 15224, 32364, 18100, -4053, 11093, 12208, -5216, 3332, 2617, -408, -15965, -27322, -2280, -27218, -16008, -23483, -47289, -42607, -23327, -5123, 18751, 21988, 7921, -8266, 2340, -9942, -17563, -30082, -15086, 4270, 13011, -6334, -12414, -1253, 14655, 11741, 14696, 17911, 6897, -29247, -45290, -34605, 3257, -489, -24269, -28645, -8833, 13553, 35464, 3105, -7604]
7189g604q611k466M366m855m847L2118J0521r299l7899L285J4388L516J7501J8245
7175B8359M651l6648r987j71K7968J1764k1415j2284q481q614J7017K5988k2607
7162d460k4603m805n510r781J1650K7578N965J0067K5309J1113k9428j7791j6891
7149b1587j5092P088K0748R435j793J1707M264J0543l5007l507J3201q618j8797
7136b7415q602M683N403j27K6131K3659m3304o009R891R893k219j78K7204j0785
7122H225K457J5394j2732l0266j6011Q023k071j9668j6075j2494J6568K8404J2953
7109a7293N738j6873L638J0070n332k785j8234J1801J418j082k941R163K4579
7096A867p78J395j325j6885n643J054R888O693r766j6193K0880J1777j3998j5192
$$ y = [-7604, -16215, -18681, -14315, -19170, -24017, 8101, 18622, 9323, -28576, -25291, -10903, -7387, 10114, 28359, 33010, -3638, -13625, -13796, 14172, 25936, 4521, -7763, -16244, -24858, -7841, 18147, -4460, -29063, -33868, -39378, -49159, -37509, -9931, -3966, 6101, 31410, 42523, 13095, -4696, -21587, -36679, -29591, -8843, 592, -1201, 10506, 14770, 25313, -9694, -13201, 0, -8618, -27415, -36017, -31334, -25931, -26058, 73, 23732, -19572, -25581, -15690, -5797, -8016, -8194, 19010, 8225, 10682, 26076, 13344, -16922, -32933, -24910, -26981, -46649, -62724, -75218, -58650, -30246, -17293, -11555, -28428, -24790, -14720, -20052, -22837, -41071, -29270, -27852, -28934, -31875, -22712, 1867, 1089, 2484, 1159, -15726, -21369, -20315, -10427, -3734, -13500, -29693, -8813, 2964, -11034, -26226]
7082b6226R669J5966J5954m957n218j824q849J2567n476J7855k283r806L271q794
7068A849q410j4597J074q821j5276Q966J1495K6897K4442J4569p267J111p064
7055B8968j7649j0533J8484J1562q648j1052O792j8354l0240q420J6544k381j3409
7042c8336N912J3513K3849J6041L353k9659p794L8876J3283k595j9755k0532O625
7029B781j638q214J5j601k1889j878K3594K5270j4774j0615p314j3349Q620J0647
7015a0345N942j6901j0186J9367J7439k0762k0417l368M811K1402K3090o375j9013
7002a5316J0994K5747M225j3592n689O768K079j2522q527k0642j6051R057J1720
6989b1749N732j4300n793K458j0464R766k305m380k8051J3781K5042K9444J782
$$ y = [-26226, -16557, -591, 15363, 10406, 5188, 3364, -5485, 7082, 1606, 19461, 17178, 7372, 10643, 1849, -6561, -21158, -20084, -28905, -44181, -35215, -23720, 3177, 27619, 42188, 34921, 36032, 28968, 11319, 786, 19270, 30832, 22184, 11132, 17924, -430, -30670, -39090, -22546, -24927, -38336, -32424, -18911, 4938, 20979, 24332, -5327, -13121, 25755, 39038, 36443, 16688, -3844, 2781, 1143, -7071, -7056, -8657, -30546, -32424, -8830, 16440, 1666, -8949, -16263, -29612, -20992, -10345, -4403, -21304, -31490, -12123, 5316, -15446, -35863, -39231, -34420, -13018, 10072, 3697, -15316, -4322, 21425, 25650, 12058, 6369, 13137, 15216, 2694, -5833, -26475, -42526, -33469, -21749, -16017, -30317, -36110, -33652, -44116, -34350, -36655, -41035, -69086, -55305, -30263, -819, 963]
$$ [...]
##END NTUPLES=NMR SPECTRUM
##END=
