##TITLE=Analysis number 311975
Compound Code cc 40996
Book Reference 413/168
Project Code adrs
Chemist Name stevem
##JCAMPDX= 6.0         $$ Bruker NMR JCAMP-DX V2.0
##DATA TYPE= NMR SPECTRUM
##DATA CLASS= NTUPLES
##ORIGIN= Bruker BioSpin GmbH
##OWNER= NMR
$$ XWIN-NMR		Version 3.5
$$ Wed Jul 20 16:09:33 2005 GMT Daylight Time (UT+1h)  MAYBRIDGE\NMR@NMR_250MHZ
##.OBSERVE FREQUENCY= 250.131544655141
##.OBSERVE NUCLEUS= ^1H
##.ACQUISITION MODE= SIMULTANEOUS (DQD)
##.ACQUISITION SCHEME= undefined
##.AVERAGES= 16
##.DIGITISER RES= 18
##SPECTROMETER/DATA SYSTEM= dpx250
##.PULSE SEQUENCE= zg30
##.SOLVENT NAME= DMSO
##.SHIFT REFERENCE= (INTERNAL, DMSO, 0, 16.522)
##AUDIT TRAIL= $$ (NUMBER, WHEN, WHO, WHERE, WHAT)
$$ ##TITLE= Audit trail, XWIN-NMR		Version 3.5
$$ ##JCAMPDX= 5.01
$$ ##ORIGIN= Bruker BioSpin GmbH
$$ ##OWNER= NMR
$$ C:\u/data/dgb/nmr/ADRS/6210/pdata/1/auditp.txt
$$ ##AUDIT TRAIL=  $$ (NUMBER, WHEN, WHO, WHERE, WHAT)
(   1,<2005-07-20 16:09:14.41 +100>,<MAYBRIDGE\NMR>,<NMR_250MHZ>,
      <created by zg, POWCHK disabled, PULCHK disabled
       configuration hash MD5:
       62 19 C7 07 E1 42 D1 B7 37 6C 3D D0 77 39 F9 E6
       data hash MD5: 64K
       15 3E 82 D8 E3 0F 25 66 81 D5 9C F9 51 AF 8F 97>)
(   2,<2005-07-20 16:09:25.35 +100>,<MAYBRIDGE\NMR>,<NMR_250MHZ>,
      <Start of raw data processing
       ef LB = 0.3 FT_mod = 6 PKNL = 1 SI = 32K 
       data hash MD5: 32K
       D2 24 0F DD 93 16 96 61 CE 14 1A 3D 85 A4 C9 86>)
(   3,<2005-07-20 16:09:27.13 +100>,<MAYBRIDGE\NMR>,<NMR_250MHZ>,
      <apk 
       data hash MD5: 32K
       41 00 EA BA 36 23 79 B4 CA FF B0 62 1C A2 32 9B>)
(   4,<2005-07-20 16:09:27.86 +100>,<MAYBRIDGE\NMR>,<NMR_250MHZ>,
      <abs ABSG = 5 
       data hash MD5: 32K
       2B 8A 48 15 35 F3 8D A6 CA DC F2 6B 6E 4E AE F4>)
$$ ##END=
$$ 
$$ hash MD5
$$ 96 60 86 D6 19 4A 8D C2 A1 51 EF 7C 2D B4 F6 5C
##$RELAX= 
##$RELAX= 
##$RELAX= 
##$RELAX= 
##$RELAX= 
##$RELAX= 
##$RELAX= 
$$ Bruker specific parameters
$$ --------------------------
##$DU= <C:\u>
##$EXPNO= 6210
##$NAME= <ADRS>
##$PROCNO= 1
##$TYPE= <nmr>
##$USER= <dgb>
##$AMP= (0..31)
100 100 100 100 100 100 100 100 100 100 100 100 100 100 100 100 100 100 
100 100 100 100 100 100 100 100 100 100 100 100 100 100 
##$AQSEQ= 0
##$AQ_mod= 3
##$AUNM= <au_zg>
##$AUTOPOS= <49 >
##$BF1= 250.13
##$BF2= 250.13
##$BF3= 250.13
##$BF4= 250.13
##$BF5= 500.13
##$BF6= 500.13
##$BF7= 500.13
##$BF8= 500.13
##$BYTORDA= 1
##$CFDGTYP= 0
##$CFRGTYP= 5
##$CHEMSTR= <none>
##$CNST= (0..31)
1 1 145 1 1 1 1 1 1 1 1 1 1 1 1 1 1 1 1 1 1 1 1 1 1 1 1 1 1 1 1 1 
##$CPDPRG= <>
##$CPDPRG1= <>
##$CPDPRG2= <>
##$CPDPRG3= <>
##$CPDPRG4= <mlev>
##$CPDPRG5= <mlev>
##$CPDPRG6= <mlev>
##$CPDPRG7= <mlev>
##$CPDPRG8= <mlev>
##$CPDPRGB= <>
##$CPDPRGT= <>
##$D= (0..31)
0 1 0 0 0 0 0 0 0 0.06 0 0 0 0 0 0 0.0002 0 0 0 0 0 0 0 0 0 0 0 0 0 0 
0 
##$DATE= 1121872153
##$DBL= (0..7)
120 120 120 120 120 120 120 120 
##$DBP= (0..7)
150 150 150 150 150 150 150 150 
##$DBP07= 0
##$DBPNAM0= <>
##$DBPNAM1= <>
$$ [...]
##$SUBNAM7= <"">
##$SUBNAM8= <"">
##$SUBNAM9= <"">
##$SW= 20.6930455092707
##$SWIBOX= (0..15)
0 0 3 0 0 0 0 0 0 0 0 0 0 0 0 0 
##$SW_h= 5175.983436853
##$TD= 65536
##$TD0= 1
##$TE= 295.16
##$TE2= 300
##$TE3= 300
##$TEG= 300
##$TL= (0..7)
0 120 120 120 120 120 120 120 
##$TP= (0..7)
150 150 150 150 150 150 150 150 
##$TP07= 0
##$TPNAME0= <>
##$TPNAME1= <>
##$TPNAME2= <>
##$TPNAME3= <>
##$TPNAME4= <>
##$TPNAME5= <>
##$TPNAME6= <>
##$TPNAME7= <>
##$TPOAL= (0..7)
0.5 0.5 0.5 0.5 0.5 0.5 0.5 0.5 
##$TPOFFS= (0..7)
0 0 0 0 0 0 0 0 
##$TUNHIN= 0
##$TUNHOUT= 0
##$TUNXOUT= 0
##$USERA1= <user>
##$USERA2= <user>
##$USERA3= <user>
##$USERA4= <user>
##$USERA5= <user>
##$V9= 5
##$VALIST= <valist>
##$VCLIST= <CCCCCCCCCCCCCCC>
##$VD= 0
##$VDLIST= <DDDDDDDDDDDDDDD>
##$VPLIST= <PPPPPPPPPPPPPPP>
##$VTLIST= <TTTTTTTTTTTTTTT>
##$WBST= 1024
##$WBSW= 4
##$XGAIN= (0..3)
0 0 0 0 
##$XL= 0
##$YL= 0
##$YMAX_a= 273772
##$YMIN_a= -426604
##$ZGOPTNS= <>
##$ZL1= 120
##$ZL2= 120
##$ZL3= 120
##$ZL4= 120
##$ABSF1= 16.522
##$ABSF2= -4.171173
##$ABSG= 5
##$ABSL= 3
##$ALPHA= 0
##$AQORDER= 0
##$ASSFAC= 0
##$ASSFACI= 0
##$ASSFACX= 0
##$ASSWID= 0
##$AUNMP= <proc_1d>
##$AZFE= 0.1
##$AZFW= 0.1
##$BCFW= 0
##$BC_mod= 0
##$BYTORDP= 0
##$COROFFS= 0
##$CY= 12.5
##$DATMOD= 1
##$DC= 0
##$DFILT= <>
##$DTYPP= 0
##$F1P= 14.0000005364418
##$F2P= -0.99999901652339
##$FCOR= 0.5
##$FTSIZE= 32768
##$FT_mod= 6
##$GAMMA= 0
##$GB= 0
##$INTBC= 1
##$INTSCL= 1
##$ISEN= 128
##$LB= 0.3
##$LEV0= 0
##$LPBIN= 0
##$MAXI= 10000
##$MC2= 0
##$MEAN= 0
##$ME_mod= 0
##$MI= 0
##$NCOEF= 0
##$NC_proc= -3
##$NLEV= 6
##$NOISF1= 0
##$NOISF2= 0
##$NSP= 0
##$NTH_PI= 0
##$NZP= 0
##$OFFSET= 16.522
##$PC= 1
##$PHC0= -89.41704
##$PHC1= 11.92819
##$PH_mod= 1
##$PKNL= yes
##$PPARMOD= 0
##$PSCAL= 4
##$PSIGN= 0
##$REVERSE= no
##$SF= 250.13
##$SI= 32768
##$SIGF1= 0
##$SIGF2= 0
##$SINO= 400
##$SIOLD= 32768
##$SREGLST= <1H.DMSO>
##$SSB= 0
##$STSI= 32768
##$STSR= 0
##$SW_p= 5175.98343685301
##$SYMM= 0
##$S_DEV= 0
##$TDeff= 65536
##$TDoff= 0
##$TI= <Analysis number 999999
Compound Code 99
Book Reference 9
Project Code 9>
##$TILT= no
##$TM1= 0
##$TM2= 0
##$TOPLEV= 0
##$USERP1= <user>
##$USERP2= <user>
##$USERP3= <user>
##$USERP4= <user>
##$USERP5= <user>
##$WDW= 1
##$XDIM= 32768
##$YMAX_p= 346501831
##$YMIN_p= -172959
$$ End of Bruker specific parameters
$$ ---------------------------------
##NTUPLES= NMR SPECTRUM
##VAR_NAME=  FREQUENCY,     SPECTRUM/REAL,   SPECTRUM/IMAG
##SYMBOL=    X,             R,               I
##VAR_TYPE=  INDEPENDENT,   DEPENDENT,       DEPENDENT
##VAR_FORM=  AFFN,          ASDF,            ASDF
##VAR_DIM=   32768,         32768,           32768
##UNITS=     HZ,            ARBITRARY UNITS, ARBITRARY UNITS
##FACTOR=    0.157963299565203, 1,           1
##FIRST=     4132.6476996994, 0,             0
##LAST=      -1043.33573715361, 0,           0
##MIN=       -1043.33573715361, -172959,     0
##MAX=       4132.6476996994, 346501831,     0
$$ Real data points
##PAGE= N=1
##DATA TABLE= (X++(R..R)), XYDATA
$$ [...]
22037 -47030 -78563 -73419 -75805 -66128 -29518 7568 1568 8938 34416 16903 20194 27322 38989
22024 38989 6563 4164 -1192 21929 -12855 7616 25008 11891 -16512 18758 57598 25627
22012 25627 3886 -6686 -18071 -26563 -41866 -34176 -37381 -44113 -35416 -20045 16358 41986 54298
21999 54298 46555 10740 -15780 -10620 -15485 -16962 11405 18308 35234 13114 -11317 -31710 37501
21986 37501 58897 8466 -41004 -47595 -32686 -36634 -59092 -44645 -9694 -8829 414 -27719 6239
21973 6239 38841 64111 62128 20891 -8754 -13970 -32482 2477 25388 42642 46673 53987 54575
21960 54575 33135 27213 23554 42411 60944 73693 44841 23319 -4611 1803 23908 271
21948 271 -3321 -27316 -29918 19079 40624 -5436 3885 16737 2462 7095 27671 10430 29088
21935 29088 54094 44272 16800 9895 44413 18164 -777 14587 38851 44250 66011 85443
21923 85443 84001 94700 88406 50174 30996 47555 75436 80803 72010 45199 7932 -20373
21911 -20373 -28318 34696 88225 126800 101909 69836 9699 -57 -33826 -29553 -11537 22219
21899 22219 75317 75095 44852 18658 10470 28175 16154 27283 80535 104229 99912 93226 75703
21886 75703 35896 -7624 -76690 -37750 -28077 -33807 -41377 -6688 -17243 -1015 -6164 -13053 8465
21873 8465 -136 -19707 933 -33881 -52727 -62179 -65488 -17893 10032 -16776 -23968 6088 21431
21860 21431 -38624 -73017 -62807 -38065 -63023 -31624 16158 69979 41586 -3436 7631 3063
21848 3063 62192 74090 67053 18496 -1279 1572 24555 26074 -6515 15708 24414 68307 53905
21835 53905 15638 36405 73881 66441 60922 62473 83579 105582 45636 -16141 -19249 -20771 6125
21822 6125 59051 71902 21261 3918 52528 76685 64779 13290 -48720 -21662 -5036 23447
21810 23447 4795 -4175 14471 31604 64979 77111 89283 60494 39704 33001 35458 20831
21798 20831 10363 2625 -5028 -10692 -3475 -30771 -46739 -18682 30331 47726 86426 87006 71918
21785 71918 71564 62223 77028 97049 45943 12974 5027 -4123 1793 -9506 -54414 -75720 -65891
21772 -65891 -43544 -28170 -11026 -1305 7354 47403 73038 78780 63934 62050 66403 52357 71764
21759 71764 107756 96642 89693 85839 46355 46980 83189 110411 110234 95044 83454 58423 32773
21746 32773 16253 38146 60443 82716 81439 77732 65482 24626 19379 20207 28520 73968 85903
21733 85903 80137 93199 66366 58182 72418 58827 63042 40314 17638 -6382 -1286 25703
21721 25703 47190 61654 52175 50468 40719 56972 67941 72337 48382 41773 19111 16074 930
21708 930 -11361 34117 10799 -28448 -55594 -12473 26204 55871 77393 57899 58844 34673
21696 34673 9284 21852 27281 50477 60256 76185 59715 34486 8003 26854 38347 5246
21684 5246 -21837 -31873 -14098 -2477 -26353 -28286 -43279 -33608 -30706 18380 84566 97642
21672 97642 82388 66627 73070 68864 109926 133527 135140 109080 75986 33387 29260 33799 44118
21659 44118 49044 58798 62210 62243 56852 59711 61791 45814 -9782 16511 66179 67710 58765 54117
21645 54117 82868 77138 29757 45400 78604 25936 -2800 9399 41685 90406 121607 88437
21633 88437 33666 24123 15074 47126 70889 50506 54039 98976 128390 111620 111500 75762 42278
21620 42278 633 23960 44928 58710 39804 60721 62545 76078 72822 77494 129345 147834
21608 147834 102726 79253 73938 41242 25355 7606 33627 60773 16660 -2385 -11192 40430
21596 40430 70339 46781 62299 28412 25432 40636 54604 75708 122962 129442 96770 102397
21584 102397 94619 69658 71070 82045 110748 113569 133097 126221 102629 71504 63269 79100
21572 79100 63492 21946 20919 12474 59953 64351 30211 65598 68549 60510 56690 59514 80714
21559 80714 81021 91984 71489 67106 27422 23112 57028 94691 98284 75656 80417 84205 70150
21546 70150 89130 112945 109555 138968 119389 105158 70538 61612 65180 68885 68670 99601 139968
21533 139968 107647 101272 119777 119080 80042 54782 23548 31024 47334 63095 64063 48826 39730
21520 39730 77670 133239 146605 102831 56706 58472 85107 103905 101287 95391 55447 57115
21508 57115 95887 118581 124113 130595 123746 113615 112492 91078 80540 88608 101756 96898 77901
21495 77901 76214 92909 68965 91944 108285 141970 170160 143498 116394 99379 51752 75584
21483 75584 120618 136525 142934 131292 142254 165575 190111 182312 171852 137075 114052 133706
21471 133706 99217 103661 134474 120674 119826 136405 133520 120347 119426 121023 104385 125228 142139
21458 142139 126692 93243 80625 74980 51313 71281 76002 111159 127349 117907 91796 125884
21446 125884 153894 150534 138327 153580 162752 143405 154124 159676 151638 159061 181992 198043
21434 198043 158735 126215 110510 120496 114427 136795 126629 121808 139858 175989 197396 203927
21422 203927 181647 157839 136249 124975 137304 151703 138422 122773 149054 181249 216292
21411 216292 231687 232626 192589 158550 143847 117670 141648 189030 166837 141473 159688 213375
21399 213375 239026 194184 144940 161803 169402 186054 185416 209714 210147 191611 180984 215688
21387 215688 187618 203919 212729 219559 234020 216502 194863 210005 213597 184595 185493 236107
21375 236107 288421 269863 235141 217673 211702 231798 253510 242191 254871 299509 261221 275991
21363 275991 303657 328280 310971 295412 238781 203948 218980 207936 234910 280335 269416
21352 269416 211160 197355 250348 278383 260087 259166 259156 244828 256295 257100 229786 243937 248341
21339 248341 276359 299008 304112 290988 310045 303986 270368 275176 323057 328347 328341 332266 304215
21326 304215 292179 288579 302392 325423 338992 345920 376023 377836 388453 379172 386812 370780
21314 370780 356809 323921 346830 338815 360096 419065 442110 483377 466217 423914 396114 377440
21302 377440 328124 319545 333410 389618 407304 392605 370992 379217 366772 381307 415739 441421
21290 441421 431400 427104 395254 372850 398014 412070 436049 452741 435159 443303 472572 453690
21278 453690 470642 514816 502651 425055 402009 419252 480944 505219 490085 460793 503693
21267 503693 535853 533811 545972 576874 556973 574444 606785 599330 601081 589397 595883 624582
21255 624582 654305 682797 658004 677698 675623 686285 697511 697952 722082 755618 780416 759016
21243 759016 737009 761940 769504 743493 756895 767632 801357 815145 788485 794740 809761 819954
21231 819954 868021 912881 931839 950785 984340 980535 985905 989120 971488 969866 962904 1006146
21219 1006146 1034149 1055791 1059614 1074646 1108775 1120413 1117545 1107368 1114052 1140804 1214989 1274014
21207 1274014 1283435 1315743 1329118 1292122 1261312 1285630 1328213 1326225 1331336 1344448 1403715 1429202
21195 1429202 1475607 1569792 1590540 1619548 1678028 1702182 1728217 1759681 1746934 1743454 1786802
21184 1786802 1814917 1886894 1916610 1971099 2015912 2059565 2061221 2127871 2195867 2294917 2311598
21173 2311598 2336965 2379784 2434193 2502065 2557189 2608517 2637316 2683299 2751814 2819979 2897687
21162 2897687 3006298 3064299 3119713 3207829 3270686 3359844 3446421 3569760 3646390 3726617 3795961
21151 3795961 3938872 4049383 4105886 4178740 4285731 4399257 4512596 4633717 4785230 4924265
21141 4924265 5074646 5216188 5366786 5544098 5689829 5790833 5968746 6156803 6308177
21132 6308177 6453735 6614025 6808316 7006840 7185771 7366537 7525892 7706634 7917032
21123 7917032 8058168 8208950 8406642 8609545 8822605 9037330 9209341 9363206 9553912
21114 9553912 9731321 9937872 10115524 10240024 10393833 10520601 10630428 10715041 10784037 10863719
21104 10863719 10965564 11035658 11056322 11059104 11050568 11058545 10995517 10972688 10950421 10905190 10821425
21093 10821425 10707852 10600032 10501910 10371245 10239884 10084737 9951830 9797526 9657280
21084 9657280 9475322 9272745 9079554 8903919 8765767 8593960 8369518 8138257 7958967
21075 7958967 7768470 7556638 7347035 7151828 6944769 6796234 6631742 6448671 6267884
21066 6267884 6105906 5980056 5846368 5705082 5529482 5357247 5245680 5112746 5006453
21057 5006453 4845536 4694349 4586929 4465561 4370498 4279800 4148327 3996853 3882156 3840911
21047 3840911 3712972 3560137 3433091 3342090 3310660 3270098 3152575 3074237 2996943 2894463
21037 2894463 2840795 2796468 2716828 2616489 2512415 2458336 2407070 2349722 2322255 2283746 2235623
21026 2235623 2199352 2168153 2103356 2028179 1982603 1946628 1892161 1876430 1814001 1735118 1692317
21015 1692317 1627986 1617044 1654555 1617577 1538128 1485673 1478683 1462059 1473970 1433176 1388127
21004 1388127 1361908 1341965 1303301 1281672 1247034 1189038 1139046 1074248 1099318 1113570 1090390
20993 1090390 1093996 1096348 1093441 1063091 1007135 1018752 1055963 1030816 988647 932839 945307 929819
20981 929819 930255 930863 890110 828969 829160 846354 801924 795773 766978 760186 770840 756812 712272
20968 712272 696288 684076 649557 647750 690858 690347 675790 689937 664702 626335 566279 579374
20956 579374 613043 595102 548936 551658 564841 534871 516122 546490 553835 499405 502397 541805
20944 541805 495622 465286 494913 481629 461062 461852 472238 472529 467354 445476 430071 390595
20932 390595 384605 371485 378311 390938 437155 438285 417205 397933 361436 364121 363419 388486 383725
20919 383725 373907 347549 315272 328426 353919 350015 317851 300880 304666 303698 266801 281213
20907 281213 317428 355736 334072 294137 224646 209926 200176 242393 254676 249093 207490 218718
20895 218718 238940 253426 252133 221965 226931 244553 251539 255104 244644 191694 192963 206445
20883 206445 214279 189351 138896 178086 213838 179512 171763 217631 219478 222950 225666 239548
20871 239548 223340 204016 193862 182024 159503 151786 160359 177287 185033 159739 129285 124189
20859 124189 133488 138809 156576 173967 207790 202828 160765 119825 125332 116329 142679 182251
20847 182251 177378 165109 181744 155455 157735 176111 189613 198934 158473 146786 189162 138475
20835 138475 99732 125893 131891 138401 155394 159118 137137 95687 114982 126372 156203 226252
20823 226252 208775 150264 117741 109957 81809 91324 109287 106119 74483 32134 52355 106798
20811 106798 118481 119632 157049 179208 173269 180592 168200 152443 176709 131022 77897 95754
20799 95754 108957 93733 96147 97608 82664 77979 105654 90308 109578 116357 100841 59290
20787 59290 68220 87676 66331 94367 116454 79797 86625 104252 118977 66578 41327 63602
20775 63602 101195 115785 73871 55783 84398 96536 88678 111677 150640 127729 99085 109571
20763 109571 110956 78856 63562 25931 14246 32247 62425 86384 88947 95214 109553 117652
20751 117652 108314 86367 106154 137092 144931 108507 99602 114881 87534 27242 6604 19438
20739 19438 6875 -7092 33654 54439 11506 -19535 -17662 20208 34942 77881 101555 104380
20727 104380 110805 117802 84730 60754 11611 -15633 15573 11900 4165 2484 24185 50297
20715 50297 48647 69872 77596 80041 66452 -4681 -66271 -36104 -33818 -11673 41261 61184
20703 61184 60586 67881 45099 -10887 -21609 25304 67037 53464 59171 90582 81911 68712 50051
20690 50051 23165 41948 40788 23254 47883 56293 23463 48821 65601 68568 18631 8463
20678 8463 6498 -13471 -32086 -42853 -50329 -43169 -29414 61692 92731 70576 37767 -4420
20666 -4420 11805 5795 -15956 12015 21049 27233 12159 -954 2368 -21914 -2559 18853 41674
20653 41674 19081 -5886 -9586 13783 2607 -9184 -42697 -40009 -27879 -44260 -39436 -40884
20641 -40884 -39504 -41209 -45369 -24381 7141 27810 38659 82 5786 11079 3401 40563 63114
20628 63114 39802 41276 50441 72588 69228 47991 47648 65855 77707 65946 6526 -30840 -21975
20615 -21975 30739 72630 94245 70974 29026 -6043 10279 42100 50296 35046 1336 -27380
20603 -27380 -40013 -2064 17902 28321 27479 5687 -6770 10961 -8287 -54771 -65639 -30743
20591 -30743 -19148 -32001 -7571 37542 16062 22313 69855 91966 78214 56313 52380 48450
20579 48450 -5663 8240 30985 34833 35957 17944 5413 -15378 -9292 12555 24086 29045
20567 29045 5019 21160 25322 28304 53272 44494 61523 53853 57511 44678 39179 12001 4174
20554 4174 22494 55745 67915 70781 6134 -30121 -29851 20224 38512 15559 1334 9443 16834
20541 16834 33740 10994 -22228 -13175 26896 29872 3259 3802 -6879 41980 39968 30377 41126
20528 41126 8385 8276 20104 31387 39792 6425 -23881 -50586 -53046 -27494 5928 8820 31018
20515 31018 54272 29413 10524 16565 19525 28413 48931 675 -5610 27082 39957 50010
20503 50010 45908 65186 6608 -18686 -41580 -18152 9610 3178 -2834 26631 49877 44938
20491 44938 50352 31150 -3136 -31169 -25554 15887 17404 5615 44015 29890 10335 7022
20479 7022 -29334 -47580 -71626 -83429 -46623 -39635 -70799 -89014 -89071 -69987 -54347 -25703 2468
20466 2468 -1906 -50578 -38356 -21253 -25743 -1651 4270 -42554 -75070 -74342 -26348 -10568 2836
20453 2836 18161 28484 -4340 -55899 -74063 -58090 -34822 -1634 -17415 -42721 -30037 -30018
20441 -30018 -27225 -22456 18484 25159 42329 31183 13859 25957 -586 -8547 25558 43574
20429 43574 58472 85741 72033 39365 26146 9631 -7385 -24047 12570 69204 81566 46190
20417 46190 38604 41880 45850 29236 -26936 -37806 99 41851 38646 46260 31716 5379 -4767
20404 -4767 -2072 27375 35156 16812 194 4617 -11678 5623 37534 56261 20943 -65126
20392 -65126 -35051 -34271 -24165 -9432 12837 5178 -1889 7029 35105 49471 -16595 -72378 -114445
20379 -114445 -86446 -58197 -76967 -69948 -37006 -29956 -4455 15561 -3519 3738 10142 36714
20367 36714 27121 -3253 -22596 5844 16593 6923 39311 50811 41662 56566 25431 -19726
20355 -19726 -15531 30853 4312 -14652 -6174 12905 -13496 -6163 -32433 -35775 -39351 -14895 6697
20342 6697 -15298 -20047 -20105 2080 -2097 -32309 -24970 -14626 -14739 13707 39933 7735 18057
20329 18057 266 1634 16361 1231 13318 29551 41693 23755 -14939 -34185 -51468 -83873
20317 -83873 -64799 -21970 18533 15274 8034 -2973 35397 -29262 -61502 -47791 -29653 -5281
20305 -5281 -9165 -4296 2823 7565 669 -18684 -52275 -60680 -20550 17771 19424 10519 36887
20292 36887 26497 54564 25321 -38953 -43624 -5728 3733 -24404 -13202 6087 6199 -27690
20280 -27690 -9083 -28645 -47702 -71823 -77557 -57622 -51093 -23709 -11603 7258 -13267 -37630
20268 -37630 -27197 -10163 -18817 -35398 -39496 -11146 1759 3367 -14023 7782 22584 21586 13828
20255 13828 11186 -6436 -9317 -21388 -45257 -73244 -71913 -37973 -24908 -50311 -31775 15
20243 15 297 -9007 -6903 29178 49258 14760 -25691 -24440 -38313 -60969 -47149 -40311 -35545 -36666
20229 -36666 -12728 -9763 3082 1699 -37077 -43917 -52056 -47726 -56228 -80144 -66150 -80045 -66437
20216 -66437 -37012 -36863 -21784 -13096 -12935 9707 15447 1288 -11763 -4805 -21960 -38992 -26887
20203 -26887 -24853 -20503 -22592 -21134 -23135 -37547 -56990 -67159 -59898 -47032 -52842 -48659 -70680
20190 -70680 -55992 -62859 -52110 -8705 23771 27305 49657 81159 70586 28804 -69648 -79858
20178 -79858 -48380 -8852 35527 3449 -29259 -30451 -24002 -41015 7411 20160 25174 -6705
20166 -6705 -64981 -79910 -72940 -58792 -48718 -12025 -5370 -16028 -32341 101 13307 -24964
20154 -24964 -55144 -62253 -21807 10955 47152 49806 47628 -12128 -59470 -82194 -72244 -41534
20142 -41534 5338 22257 11535 29769 22274 7961 14985 -2915 -2703 1318 25533 25483 49600
20129 49600 70089 73373 36537 -5312 30412 64256 23217 19661 19501 24159 11892 3579 27021
20116 27021 23726 -19617 -34218 -36201 -1877 16367 19053 65765 45905 -39 -19676 6881
20104 6881 5083 2754 -10966 -21497 32285 58953 69938 68410 40199 4884 -20720 -1118
20092 -1118 -11861 10595 48118 53995 40208 25580 7563 23702 26374 -25006 -28572 -17042
20080 -17042 -10566 -17449 -21763 -33684 -7530 2328 -7781 -19634 7052 41174 7323 -41075
20068 -41075 -21568 -10323 -23014 -25307 -22343 -30354 -27254 -8689 7721 -27996 -19790 -57199 -84208
20055 -84208 -54465 -30945 -52190 -58434 -47963 -97768 -123680 -101078 -40662 2979 8009 -26407
20043 -26407 -47974 -37610 -7241 14694 -7291 33095 62908 74552 44488 -4158 19743 43740
20031 43740 36477 14571 590 -12595 -11544 -47425 -41536 -21572 -17310 14708 35680 17567
20019 17567 -17543 -76266 -71475 -37861 -33935 -6415 7911 -20653 -49551 -44450 6029 6183 -16704
20006 -16704 -35212 -56573 -27877 1012 19824 19449 25519 15277 -8146 -31546 -71471 -83712
19994 -83712 -58086 -81359 -29041 -42309 -28568 -23801 -15329 -10520 -7222 -36550 -39978 -49759 -51704
19981 -51704 -50138 -39259 -56161 -15869 -16263 -62261 -61049 -13986 -42353 -25843 12087 38258
19969 38258 47108 45795 37040 39693 -8693 -38971 -14907 -18026 -27706 -55938 -44711 -79481 -75885
19956 -75885 -58250 -65009 -40734 -54542 -67775 -32537 -17288 -53483 -35003 -19395 -37061 -48708
19944 -48708 -64057 -70032 -104197 -74393 -27879 -40079 -19933 -10633 29408 79874 94391 72465
19932 72465 37616 14699 -19609 -994 -6561 -20792 27056 17921 -23165 -7979 7156 -11933
19920 -11933 -12052 -34722 -53122 -6208 -3656 119 24488 59298 31827 44798 66294 53008
19908 53008 38928 23486 4447 18970 14802 4421 -4780 -36612 -43035 5001 14690 -26117
19896 -26117 -12065 -28195 -13749 2592 -7232 140 38598 42007 63365 63898 54563 -13753 -39764
19883 -39764 -31997 -7847 -14114 -50232 -110189 -89305 -35870 -29996 -48258 -20414 7517 19217
19871 19217 62534 89735 104235 74985 18011 -10613 21714 75394 71618 27768 27475 25013
19859 25013 3273 -22722 -34648 -886 7764 -11813 -35842 -47745 -85541 -85345 -62315 -71112
19847 -71112 -60973 -32602 -10242 -26659 -22948 7354 80366 74963 29206 25305 23671 -14841
19835 -14841 -31490 -42375 -2307 -7543 -23441 -36669 -30494 -2233 -8495 -6275 -17408 -19177 -21207
19822 -21207 -30987 -42444 -35129 -38953 -22397 -14372 -7471 -44241 -15202 25712 65707 51557 28606
19809 28606 22604 18032 31441 24196 9536 61654 93509 97743 26001 37307 65327 44483
19797 44483 7090 -13714 -40070 -79889 -37884 18601 26092 38492 38617 33733 5727 -29325
19785 -29325 -45405 -17147 14579 48968 61076 14751 -32411 -9078 -3175 28894 13334 1888
19773 1888 19676 59707 100204 95150 62834 50090 334 228 -10758 6305 9721 17596 14986
19760 14986 28098 -6464 -31261 -38607 -37901 -32726 -45849 -43276 -57103 -63007 -63745 -19022 11172
19747 11172 26303 1901 -10822 7811 -4784 480 17664 18201 -19527 -15462 -9411 3698 6486
19734 6486 13816 7856 -29848 -32371 -1452 26999 -6693 -15552 -17386 -61038 -48476 2355 -60
19721 -60 -7038 27829 19542 30206 -1429 -24597 -53774 -80539 -71339 -21060 28302 44214 -16858
19708 -16858 -41119 -29108 -46373 -93714 -99871 -102916 -109987 -71560 -35430 -21952 -12016 -37977
19696 -37977 -22847 34166 65271 72406 50560 32136 412 -30862 -8577 6075 7157 15633
19684 15633 28466 -22021 -53726 -5749 -2142 37332 47425 -166 -28624 2231 -28993 -15649
19672 -15649 10855 12437 -11403 -6400 1408 17035 19219 12934 49369 45431 46063 30228 -486
19659 -486 -4500 -58893 -62822 -16807 14609 26549 23266 41338 5877 -21937 -19898 28182 78726
19646 78726 82808 64754 43348 38257 36578 14075 27528 41962 55754 42158 29963 45801
19634 45801 13903 -21452 2962 42955 31716 7686 19436 37025 -10193 -35930 -24329 2200
19622 2200 29578 24146 18183 17226 21489 35991 37982 17151 -16220 -6157 3109 -27064 -33139
19609 -33139 -12704 27529 9357 821 17959 15478 -10185 -15031 -14365 -6176 -8575 -31441 -30926
19596 -30926 -40200 -48321 -41884 -12717 15475 15892 -41944 -68601 -12449 1872 -40574 -65216 -57293
19583 -57293 -30303 -41911 -108313 -102618 -59222 -7850 23092 -1520 -7953 -18438 -23030 -27700
19571 -27700 -44697 -24645 -10261 -16924 -7560 18690 52958 78541 95379 56122 5297 -19886
19559 -19886 -10137 -17306 21459 -452 -5895 -4736 -11186 8664 4021 -47883 -61207 -27083 -34783
19546 -34783 -75466 -126828 -102628 -64212 -64795 -27076 36210 38038 31564 -2674 -4277 1279 1735
19533 1735 -19351 -17907 2976 -34008 -36703 5551 11611 -15726 -20964 -4365 -11852 1528 -14077
19520 -14077 -48712 -45866 -27521 719 18231 3715 4699 4699 -19851 -4413 43625 57203 41445
19507 41445 13622 -28786 -40314 -14471 -2548 -15597 -14593 -609 -3265 -30511 -53632 -67296
19495 -67296 -81402 -105018 -67803 -44430 -63250 -28044 -5580 22783 6785 21608 23180 1720
19483 1720 21187 41492 17646 -16258 -6231 -6823 41166 64986 59754 61111 57951 53148 34446
19470 34446 24230 -2523 -42378 -49591 -12536 -22825 -38773 1194 17426 22754 34767 24840
19458 24840 3471 -35602 -31041 -20154 -15769 -21324 1280 22818 27940 11085 -18781 -38287
19446 -38287 -34220 -48834 -56060 -44546 -40867 -75875 -25575 17428 -16667 -36443 -43058 -26659
19434 -26659 -15594 -9159 -32181 -40089 -59313 -87283 -53677 -38615 -46448 -28098 13756 9603
19422 9603 6513 216 -36945 -5197 44295 28126 14060 -706 535 5263 -23364 -10592 -8495
19409 -8495 -29615 -44595 -35736 93 17501 46328 20258 33604 16665 998 -9031 -52822
19397 -52822 -77603 -51961 -60562 -45979 -10442 -15370 -32069 -54519 -61315 -59602 -46041 -24608
19385 -24608 -50867 -78223 -71197 -35565 -20388 -30274 -37790 -28030 8124 9944 22039 43547 22445
19372 22445 36221 31565 34840 20588 -27313 -40694 -26785 7398 -31236 -14860 2918 27045
19360 27045 19222 -8782 -51475 -19938 -8300 -23241 -52415 -71197 -71776 -25885 -15523 -40418
19348 -40418 -43654 -45609 -31367 -44697 -41535 277 19145 23560 26473 -1406 -3071 -32691 -56089
19335 -56089 -48672 -32812 -37997 -77561 -91097 -99592 -75584 -54479 -11713 -11985 13608 4777 -70015
19322 -70015 -102322 -89986 -48652 -5250 10155 4925 -31886 -21018 39496 28363 9971 -3632
19310 -3632 -12391 -24819 -32557 -43448 -28566 19597 819 -32385 81 50327 24912 -13602
19298 -13602 -35103 -20240 -7439 -8856 -24948 -49933 -55983 -55244 3555 32258 10189 -3373
19286 -3373 -24268 -12170 -7773 -26915 -77097 -60119 -45774 -66306 -88491 -88007 -88658 -53143 -23814
19273 -23814 -2188 18549 7291 -20100 15608 6890 -42945 -67187 -56741 -51332 -33209 20179
19261 20179 51836 35963 14479 17113 -10319 -32765 -57747 -25096 -48567 -57556 7490 21707
19249 21707 -13918 -20536 -39189 -44048 -21352 -24354 -4985 9465 13476 43280 8521 -20966
19237 -20966 -59977 -54201 -26086 -12990 -6416 -7080 -15438 -47036 -84006 -44306 -44580 -70088 -93934
19224 -93934 -41517 -47281 -64956 -55337 -67879 -44843 -46535 -59015 -16026 -7678 -45452 -13222
19212 -13222 -26535 -74708 -90672 -68483 -59178 -49426 -26841 -13021 -8717 -8817 4625 7201 -33481
19199 -33481 -44742 -43584 -32475 -13376 -3476 -27768 -38241 -34869 -42850 -35328 -43814 -84295 -98161
19186 -98161 -96635 -36432 25259 -8598 -32518 -37576 -5611 33055 59983 36310 14545 -16962
19174 -16962 -26805 -21599 13171 -12634 -56194 -57883 -20836 -5026 -6349 4914 29364 25413 22775
19161 22775 -4811 5003 4586 43587 90522 109711 75808 48122 10168 -19938 -12444 2117
19149 2117 5093 -28759 -17840 -10940 1003 16917 -10431 -49707 -50296 -4796 -5422 -8527 -3155
19136 -3155 -24239 -50006 -69217 -83205 -93053 -58665 -16137 14394 -7447 -22726 -28299 -20684
19124 -20684 26817 36930 7844 11525 -21781 -53109 -67236 -39361 -39104 -60543 -55042 -35919
19112 -35919 -43627 -58386 -47049 -71143 -47974 -42155 -18938 -9541 -14601 -23345 -53071 -68872 -82278
19099 -82278 -89869 -29258 29487 55612 18999 12415 34864 -5756 3124 36670 45007 24266
19087 24266 37416 16259 -7641 -23065 -48755 -58570 -30958 -4298 -721 -14881 12431 -13375
19075 -13375 -44056 -39596 -54471 -48827 -47895 -25059 3987 33201 26904 -23021 -51436 -35900 -16911
19062 -16911 14266 -11225 -54972 -19621 -16222 -14963 6871 16318 -3435 -10909 -8049 -8496 3335
19049 3335 -25254 -13930 -28895 -20589 -35087 -62105 -4436 7927 -26855 12919 -1673 -3623
19037 -3623 12489 -34114 -57791 -42251 887 41504 43242 -12300 28146 48492 45153 48079
19025 48079 32688 26785 10258 15100 17998 20205 26710 26896 20208 -6396 -30100 -13413 -2619
19012 -2619 -8274 -49436 -63073 -40823 -17508 16353 57354 100555 56415 23274 28187 -18690
19000 -18690 -44990 -22652 -17619 13888 15833 25277 50770 33513 1051 -3538 16243 23273 22044
18987 22044 5187 3196 31990 32388 11979 -8355 6765 33215 -595 -18083 -32670 -39995
18975 -39995 -62369 -51460 -52852 -26742 8555 -11648 -24954 -47753 -26901 11625 -44668 -67167
18963 -67167 -898 18352 -9009 -22208 -6222 9436 10750 36118 54371 33969 25725 17917
18951 17917 24263 -29798 -40806 -16842 3071 -8076 -19264 -12195 -14556 -11185 -15421 14342 36333
18938 36333 -2128 -9812 -3815 -11481 -38723 -22596 8691 38174 88137 104588 97886 79422
18926 79422 84719 69498 43410 37105 64742 62628 10646 -4081 -17355 -42543 -40603 -23407
18914 -23407 9666 24575 19100 -45990 -64015 -52902 -19531 21560 61064 72975 34311 -6510
18902 -6510 -2552 12747 12210 18261 4592 1288 -23848 -38868 -17742 -17966 -13440 -37616 -11777
18889 -11777 -40767 -66215 -44775 -44088 -26582 -8535 6865 -9720 -6962 -31268 -42648 -15941
18877 -15941 -10170 -24304 -1438 23195 3822 -11448 -35212 -57039 -63244 -50955 4841 23741
18865 23741 20271 -917 15928 37245 30531 27913 17761 -33256 -11690 14945 39915 53241
18853 53241 22552 -25628 -12299 5213 33243 41017 67294 55880 29519 65398 102683 58661
18841 58661 48944 28227 -25645 -27593 -42249 -48939 -59045 -60302 -43716 -30027 27192 65565
18829 65565 29928 28483 37968 36777 39758 77356 59008 24629 57913 102579 84195 61046
18817 61046 9831 13673 21649 28295 2181 -18208 14469 10823 -1614 7489 27984 9528 20693
18804 20693 30102 26188 30717 100569 117122 125534 146301 118366 105538 51644 34809 88465
18792 88465 112467 70153 -22366 -72669 -53801 -75660 -40922 11498 35415 22372 6129 -24848
18780 -24848 -14522 15532 3618 43193 72313 82897 88155 85493 92191 57161 67864 84176
18768 84176 94730 135746 133543 119129 111784 88468 62873 68103 58558 58133 81526 104799 112648
18755 112648 100058 93972 72731 24680 37806 18203 -1657 2071 18227 -1060 -32226 -57419
18743 -57419 -34291 -3034 473 -11884 -40394 -51469 -19238 -10414 -30389 -18666 -15059 -48382
18731 -48382 -37761 -46333 -52275 -63636 -38722 -316 64267 102306 54048 74385 44536 38120
18719 38120 18179 -17780 3014 32618 35940 19309 -10646 -30433 -20196 2336 -3675 1845
18707 1845 -53755 -39290 -20614 -22343 -5593 12157 -8063 -12690 3504 -27528 -2120 -22851
18695 -22851 -32808 -2203 7080 19133 32255 39705 -480 -62712 -64892 -10943 -12450 -35438 -30092
18682 -30092 -81399 -35920 -10128 10484 7135 10644 -10498 17932 12137 -6064 -25551 -8187
18670 -8187 -28601 -33633 -459 4411 -26279 -25857 -29719 -35538 -19211 18287 23955 14412 -21246
18657 -21246 -51842 -53617 -45695 -45871 -23978 3950 39117 58671 35838 5782 -7430 -27320
18645 -27320 -46084 -51675 -36603 14611 7361 8756 36704 38152 38518 33120 56576 88738 81086
18632 81086 57784 45845 6212 5569 36334 69756 53904 64600 86315 17956 11920 60518
18620 60518 58275 7868 -30312 -33346 -42276 -31406 -16014 24839 38417 41911 33716 11992 32308
18607 32308 18882 31183 6502 -21357 -26721 -17022 -30555 -19503 -13552 -24017 -12099 21879
18595 21879 6178 -11623 -3073 -3416 35407 31925 -4650 -439 -23431 -39472 -49457 -42543 2709
18582 2709 -1358 -32206 3498 31605 25794 27096 -21898 -41558 3954 67150 87083 75803
18570 75803 63295 91082 66042 18381 -3540 -11327 18319 17005 -11377 -14066 -39406 -40010 -28719
18557 -28719 -10114 7757 12619 -25609 -87867 -73317 -63893 -10075 58282 56972 53411 44835 33009
18544 33009 26041 4833 -13520 -5268 -4480 -5475 26735 60601 50804 65316 49680 4698 3428
18531 3428 36237 55864 79962 111516 112589 121408 125973 140964 146504 160481 124810 122136 128243
18518 128243 76147 31484 40507 25753 17961 -13699 14745 30818 30295 18394 15590 18261 32657
18505 32657 51838 34379 36969 74196 113959 106199 67393 70920 124638 169407 177177 143838
18493 143838 88574 81381 114393 149829 111269 69849 13211 -21552 17420 70997 105947 119852
18481 119852 114281 136232 114714 121613 90133 68539 61531 24731 -2400 -14479 8051 7751
18469 7751 23031 12711 8401 41569 66650 63911 41715 80746 75470 50880 15132 -435
18457 -435 12773 59941 101187 82251 64484 77817 22718 14287 11377 23961 38369 64929
18445 64929 65411 74452 93757 59871 30982 6575 24186 29132 30996 64994 59654 -6712 -2913
18432 -2913 28363 32444 41928 93373 121012 59559 13463 -8852 718 32952 57140 48295 40421
18419 40421 66333 30390 4994 -25740 -10609 63263 60256 14610 -9746 2438 1803 -6143
18407 -6143 -5664 -24984 2132 42341 29361 -5009 -48825 -45276 5669 45337 45000 -5061 -27011
18394 -27011 14677 39563 47265 24771 -738 27545 30345 6359 19026 66583 70539 74888
18382 74888 105653 69659 26547 19448 52971 50523 47130 46726 55479 73560 62370 55018 58549
18369 58549 73427 27810 17446 25208 27698 30167 41772 46235 49406 56338 55373 51058 73975
18356 73975 64360 58210 45748 40226 33010 58393 57678 27877 13386 14306 34076 -7705 6406
18343 6406 17785 57551 77502 82392 164345 240712 223154 154613 121493 125900 106115 79498
18331 79498 57663 34634 -8493 -21699 -3332 59229 68885 72717 74435 50592 4189 10634
18319 10634 4200 -22542 -11764 25431 52153 54217 54918 49796 49123 29509 32847 98425 139036
18306 139036 136072 160494 183824 166816 86887 47767 12461 14412 -8357 -3146 35324 44956
18294 44956 50765 40330 72863 111285 96274 73527 88047 80143 97433 122383 129301 92251
18282 92251 71609 46885 59848 54756 62268 69497 45740 34792 55847 100083 122807 115017
18270 115017 127497 143069 145347 205714 281154 322338 369562 379470 363551 306866 244314 283123
18258 283123 281577 254043 249529 276149 278076 259759 290154 323678 383691 378918 339710 368315
18246 368315 342777 319916 338614 354689 368287 370517 398130 420423 412982 435029 448025 511700
18234 511700 590964 726935 878194 1060438 1195065 1162253 1107739 1083747 1124814 1171083 1284097
18223 1284097 1444145 1661118 1926331 2311760 2871603 3833282 5322442 7739015 11852802
18214 11852802 18658817 27472934 33740494 33056477 26575539 18703130 12485431 8466350
18206 8466350 6015961 4481073 3478785 2813498 2370156 2030649 1786204 1626287 1624132
18197 1624132 1715099 1737240 1783505 1836806 1915091 1949579 1975027 2010371 2155822 2447585 2850243
18186 2850243 3484224 4453388 5928592 8349899 12550024 19824581 30752289 41725570
18178 41725570 45661284 40151004 29842274 20227269 13469486 9214644 6559117 4852710
18170 4852710 3664770 2848973 2266175 1839694 1514505 1328940 1191015 1105147 1016815 979588
18160 979588 959945 853529 724599 615883 510771 437866 394274 325106 282825 260881 269805
18149 269805 287801 266514 235161 211765 207105 187665 227411 305318 322918 321079 296435 263074
18137 263074 254323 238115 199585 171625 123672 114235 113913 95907 68025 53718 75200 74955 49350
18124 49350 62264 105918 112571 103319 82050 65462 55548 70235 84610 101380 116348 118550
18112 118550 136221 154773 152276 168535 221387 223109 205918 184878 212845 247303 334565 474828
18100 474828 569655 546304 442346 329192 231176 190590 147541 121075 114095 103423 93810
18089 93810 72166 93184 111057 113366 61306 45516 58242 65566 82928 120037 120776 151774
18077 151774 183217 162568 150577 164223 164892 155280 184717 331995 454178 588221 672043
18066 672043 648803 520540 367200 261925 191592 153670 120550 136736 142817 117883 130287
18055 130287 104352 81941 47963 49492 84689 153467 189349 205337 171483 116530 119644 102919
18043 102919 129035 146659 142134 144914 136158 114070 120227 164112 202151 166646 126224 140861
18031 140861 158776 175127 155331 154326 154407 185135 210610 186628 197193 203094 206608 229763 269301
18018 269301 320773 340543 328859 354569 405839 461093 539824 611722 655703 703504 778962
18007 778962 866063 917974 968759 991340 1043980 1144204 1238516 1322101 1445403 1603099 1775592
17996 1775592 2012219 2272736 2615785 3159132 4035040 5343278 7594967 11591401 17949385
17987 17949385 25294293 29362348 29347225 28839588 30235063 30640955 26633576 19952996 13724960
17978 13724960 9407077 6722217 5128607 4111065 3403502 2891871 2543494 2342538 2155901
17969 2155901 2021882 1902872 1850073 1841030 1880401 1998192 2145970 2254247 2434564 2692424
17959 2692424 3113830 3798345 4973907 7140124 10904381 16305349 21024991 22341620
17951 22341620 21742718 22106881 23397169 22238866 17880017 12661366 8548646 5893524
17943 5893524 4294720 3370058 2814230 2355708 2010462 1750366 1587844 1463682 1269332
17934 1269332 1066877 908060 812207 758056 728218 703161 682102 695846 728615 670790 589534
17923 589534 565769 579153 601257 654381 750154 849499 941514 870717 651576 488115 417649
17912 417649 360574 294973 310054 330438 395060 426805 422579 386048 394600 462537 443404 353694
17900 353694 279774 243602 208468 182228 161641 150664 169814 193143 273065 400529 443390
17889 443390 545906 727251 1024574 1490872 2019283 2367504 2236297 1776438 1301341 895771
17879 895771 622609 489000 400953 327787 307323 290102 213069 242177 282429 310368 305891
17868 305891 294055 304935 310445 276062 287667 370612 504071 721578 1034005 1398952 1615346
17857 1615346 1677848 1700282 1715293 1636435 1388658 993035 684169 569598 482512 411168
17847 411168 381281 359746 299056 266079 250804 219536 214482 193450 186369 242148 236761 190964
17835 190964 184118 188613 182833 163906 182283 247553 280774 312013 366279 436533 526160 526625
17823 526625 506761 536957 492354 404400 311433 223549 155519 126265 168268 187485 187110 158277
17811 158277 115393 142716 163371 173945 151603 127904 119983 91888 44180 34893 40197 53666
17799 53666 35904 -29506 -10002 16944 14457 -3420 -7600 -16445 6438 11748 -6173 9333
17787 9333 -23776 -31199 7557 44725 17697 25593 5208 -29635 5831 6509 18742 63124 36614
17774 36614 12956 9222 -6296 -19702 -57824 -84911 -53753 -24422 -25960 14431 62411 64790
17762 64790 65680 32017 -2063 -2020 12311 28507 78317 118931 105052 45812 39416 69823 45335
17749 45335 -10383 -11926 -13040 -32377 1958 4891 -24175 -19382 10222 22611 29824 16853 4910
17736 4910 -16106 -6774 -16616 -18998 -11321 -38122 -39888 3333 23654 24336 8833 -12969 -26950
17723 -26950 -40206 -40771 -43210 -71648 -77170 -41759 19965 34690 26432 5955 -23551 -30002 -19420
17710 -19420 4570 -7676 -13924 9780 17066 -7028 -43659 -72249 -91600 -50003 -18332 1213
17698 1213 35161 38045 15774 6047 10674 14816 33094 21488 -23459 -49819 -50367 -49850 -53615 -52570
17684 -52570 -38704 -50749 -79524 -82880 -44999 -50509 -33633 -34130 -13598 8762 38272 62346
17672 62346 38538 21080 45121 63115 53693 3364 -23455 19099 47906 29079 17691 12237
17660 12237 -18345 -14633 -1671 705 23332 24449 31824 47948 58140 56484 84617 106645 138105
17647 138105 136085 152807 182403 146506 183876 204663 216220 240334 279313 232504 155998 110468
17635 110468 79209 37321 11038 30271 8006 -17913 -13322 -31149 -53446 -24701 13103 9996
17623 9996 -13648 32234 40689 27641 15988 18967 47954 106497 157383 133725 53808 44658
17611 44658 107928 124194 107504 71126 50149 49005 50184 24895 36351 -121 -29362 40076
17599 40076 41552 26539 -1154 13471 17316 -12938 4145 45756 24812 17014 17186 22582 -7347
17586 -7347 5614 41107 31160 51214 100973 124582 130706 104031 88236 92459 84753 53135 41477
17573 41477 54551 94463 102951 73878 39991 22953 24568 3458 -22206 -64949 -78514 -14823
17561 -14823 30435 -7914 -19776 6311 36960 53265 17881 -7450 -27661 -55225 -84183 -63091
17549 -63091 -33751 -13663 -32642 -58876 -53790 -43811 -6760 17840 39192 46940 16155 -26898
17537 -26898 -44794 -50193 -22966 -879 10948 1035 -9319 -5425 -21242 -34127 4575 -16196
17525 -16196 -16062 -3764 7774 -5723 -22604 524 6688 493 15073 6096 19204 57103 57541
17512 57541 40974 22134 -3980 -28589 -27471 -16247 4775 -7942 -5466 37337 27697 -8482
17500 -8482 20554 28962 -2129 10538 37933 28148 -7098 -17147 -34630 -16673 -22565 -35478
17488 -35478 -11317 -21583 -31981 -21798 -2221 2857 -4616 -3761 8452 -22331 -41428 -35312 -47632
17475 -47632 -32718 -54845 -53555 -60982 -45986 -29110 -19513 -36550 -40280 -23578 -19600 -9071 27584
17462 27584 57736 85076 107166 80982 57255 34913 3929 -1288 30535 32442 -11712 -42614
17450 -42614 -11080 14174 10110 9273 -24626 9046 31927 59154 81439 84255 83105 146716 175511
17437 175511 156161 137793 110392 90076 73690 77848 50208 10993 11869 15494 -9 -16817
17425 -16817 -6706 5701 43833 61418 70912 59204 53351 29614 58113 73799 84873 25940
17413 25940 15008 6736 22882 93310 167251 183343 87668 62435 81282 65702 45472 35563
17401 35563 32220 53484 49971 -7655 -38127 -25336 -1497 20494 -17937 -51590 -3081 39247
17389 39247 29620 27989 23546 35755 23780 -1209 -19233 -39034 -57779 -45795 -12379 15956
17377 15956 12681 -60088 -83005 -59757 -26493 -29161 -45100 -51184 -9573 -18447 -29710 -18315
17365 -18315 -8942 -21221 -20987 -2188 -14222 -8360 53398 88753 92488 59893 28477 34766 38244
17352 38244 -4625 -4256 41227 98828 82011 76773 49717 5213 8091 -3507 -28696 -38674 -53714
17339 -53714 -31901 20034 -2918 -13992 -13294 4320 37524 18927 -1025 -22493 -48541 -30663
17327 -30663 10862 45301 60442 62179 49660 9705 -12304 2214 -37937 -33060 -5368 -4606
17315 -4606 -55157 -45725 -4668 29824 20633 7944 28722 10929 -5773 -21783 -38341 -19828
17303 -19828 -42114 -44136 -39100 -16431 21082 22102 -9387 -51067 -77673 -27616 37722 40029
17291 40029 31913 2746 -5825 -8185 -25626 -64699 -66175 -62109 -24743 8686 12184 35297 11599
17278 11599 -14802 -1692 30299 49330 72176 76988 60325 -10512 -8524 28119 36802 75130
17266 75130 24116 -21487 25088 50256 46122 14801 -12335 -37242 -39728 -40622 -5219 49313
17254 49313 38020 52718 41242 19690 41467 12428 -20663 41878 63870 59208 74018 84365
17242 84365 79125 61646 107940 92476 54814 33758 75670 74120 68758 42079 -35297 -65063
17230 -65063 -45637 6249 58472 76726 69351 26893 19468 37468 51462 22415 -43678 -47491
17218 -47491 -22521 -12073 -2582 12611 55858 56134 48537 90083 99449 96142 80209 63452 63563
17205 63563 66944 93315 84796 97021 80796 62166 61617 83595 74364 39931 39248 43728 60386
17192 60386 63768 41787 10140 34530 85371 121358 114770 117507 98983 96624 116976 145958
17180 145958 184722 213927 226100 238703 222428 225025 262231 263325 313635 312038 291768 267797
17168 267797 261181 278125 262873 261773 209772 200801 169849 159469 148376 120826 71007 78062
17156 78062 83688 33409 35258 60637 66587 46510 15083 26792 72897 120821 135938 167970
17144 167970 185202 207854 228416 203413 196631 185832 153789 146142 135917 159784 184690 188574
17132 188574 185133 197664 204265 257979 294435 300281 279767 258002 276243 323984 392791 380018
17120 380018 374975 402562 416768 456796 465587 510001 574334 697395 855791 976118 1060883
17109 1060883 1174244 1307114 1440776 1522368 1598016 1657706 1748546 1882424 2005660 2244943
17099 2244943 2618254 3143215 3841418 4837667 6316278 8534295 11732431 16248757 22203695
17090 22203695 29309717 36650057 42520039 45916984 47333354 47383031 45608491 41238828
17082 41238828 34769738 27592879 21005706 15589702 11471850 8510702 6436625 4975126
17074 4975126 3914944 3154147 2588430 2223289 1940166 1684810 1466607 1305624 1151424
17065 1151424 1074255 1024730 980012 956032 841898 801212 765029 715426 629999 545840 434626
17054 434626 311633 268825 244242 219273 230473 227149 222603 219151 169998 115310 113308 116191
17042 116191 139943 145316 125102 134758 118247 97500 93373 88451 85989 65809 79440 85309 72136
17029 72136 83454 76506 59341 85438 108975 106958 115026 99379 83961 103077 87792 84638
17017 84638 112919 108995 68326 52147 83195 86857 72060 53020 19240 -10262 51699 15919
17005 15919 -23052 -36844 -44825 -27656 -43950 -73902 -34235 40774 57088 65158 104499 43140
16993 43140 -5761 4662 34234 72426 45828 76114 77173 90086 84572 44923 22360 65052
16981 65052 65128 -12172 -9894 -12239 -40804 -43376 -32007 -41948 -28156 -20299 -21002 -25547 29145 62340
16967 62340 43114 -15851 -37332 -47198 -52857 -36943 -29952 -26342 29263 26718 -10467 -14367 33596
16954 33596 38623 24483 52004 9843 24624 27683 29617 10807 30030 40141 66304 54865
16942 54865 33911 19554 61377 10206 -25881 -47654 -27092 -25676 -42118 -35703 -33165 -44726
16930 -44726 11647 529 -11013 -29969 -37605 -35365 -66689 -73407 -87422 -92565 -80298 -72197 -37631
16917 -37631 -22695 -32787 -15230 -23553 -4850 4148 -31022 -42470 -20502 -22914 -2944 16679
16905 16679 13613 -27439 -33518 -40746 -36820 -21178 5847 18242 14487 -3170 -3447 19420 23871
16892 23871 -826 -27114 -13330 -26580 -40464 -17464 14620 18868 26976 54975 40245 -28869
16880 -28869 -47191 -32914 -17672 -19355 -9203 11967 41998 66720 60317 54288 77663 110989
16868 110989 195491 355682 456340 498056 518261 560929 583504 592487 561005 479228 383653
16857 383653 256836 198076 166955 88094 64258 60150 19529 -7197 -15016 24110 38201 57626
16845 57626 41716 9597 -13343 -17522 -761 -19947 -22792 -19991 5251 25084 -33781 -59688
16833 -59688 -65686 -24749 29279 64588 62671 -10257 -91831 -116848 -110307 -77932 -65870 -58665
16821 -58665 -92346 -76517 -41520 -36026 -33242 -23305 -27208 -41604 -42876 237 19932 19780 7428
16808 7428 -977 1917 -1344 9543 5034 -41491 -19739 -6804 -16985 1397 34197 56903 43473
16795 43473 20108 -45990 -65495 -38309 -33119 -30425 -43238 -79601 -56287 -46620 -52840 -48539 -63800
16782 -63800 -94464 -117644 -118648 -76176 -53631 -24451 11414 -311 -18757 -31269 -12990 4063
16770 4063 8362 585 -25667 -87912 -55771 -62659 -57165 -13375 -33011 5209 7045 -5820 -16761
16757 -16761 -32911 -62973 -92863 -82205 -82569 -60800 -19705 19542 30389 49756 46434 63994
16745 63994 52801 50307 3211 1395 28963 34038 -3010 -13653 13690 -37391 -41062 -24738
16733 -24738 -14626 12710 18822 27076 -7906 -27927 10954 -5284 -3864 -10044 -36591 -27159 -6970
16720 -6970 -38577 -49799 -35942 -21510 16220 -37077 -93508 -90939 -35584 -2104 -3238 -17058
16708 -17058 12754 -903 -65119 -66902 -56140 -28182 -12105 -15532 14009 15376 19868 21717 475
16695 475 -2830 -21753 -44265 -60133 -9881 50826 58276 28190 12316 -6834 -15073 -17095 10453
16682 10453 -13301 -41127 -35693 -17817 -323 13964 -3207 -6478 50304 37631 11966 -13374
16670 -13374 -31983 -33081 -4992 -31428 -29360 -67259 -74347 -73769 -63142 -54568 -41584 -12433 27499
16657 27499 29524 -32785 -57135 -64825 -105687 -76004 -24685 12960 24859 -9825 -35448 -24023
16645 -24023 -18301 -3686 12255 40084 46970 14173 37122 34892 -9198 -3859 5094 -6132 -18114
16632 -18114 -24912 -23211 21832 -46333 -34065 -3327 -4995 -6160 8467 8542 -1812 -10040 -16654
16619 -16654 -33068 -57726 -20399 21657 14673 40911 -18575 -4013 4595 -13929 12235 14010
16607 14010 -62824 -52775 17207 46117 34673 -28208 9095 15684 -10012 -41449 -31910 -35767
16595 -35767 -41953 -34628 -22801 -33391 -14503 -6353 -34441 -36996 -20508 -37108 -38283 -21498 2643
16582 2643 -15134 4507 -1386 14835 -16820 -6474 -31988 -42432 -36172 -26120 -2918 -10903
16570 -10903 -15905 -26853 6255 17278 -6698 -19290 -28583 -40282 -60837 -92966 -58436 -49701
16558 -49701 -63512 -49482 -30054 -50308 -60740 -11416 -12090 -32671 -73293 -56253 -33056 6474
16546 6474 -19857 -29662 -8017 39226 44174 22092 -8550 2598 23803 1493 56628 100391
16534 100391 106961 129950 127804 123535 179597 202363 246669 272062 272981 267608 282126 259688 201259
16521 201259 186661 167610 113976 90459 95989 61651 11088 -29741 -24697 -9109 36085 37025
16509 37025 50140 77026 84889 72195 69638 38114 4070 8299 11538 -36919 -41459 -35240 -11103
16496 -11103 44265 53008 800 -30533 14051 9709 24415 20040 14689 -22904 -46386 15795
16484 15795 26320 -11752 -53392 -57550 -75221 -107970 -55682 9852 9286 -15221 -21815 -5717
16472 -5717 -34029 -24885 -18928 -47343 -39083 -22103 -48603 -64820 -58060 -72821 -76119 -94021 -70156
16459 -70156 -33413 -15549 -2537 30946 39627 41324 12624 -40089 -98187 -74210 -32760 -61254
16447 -61254 -60816 -57130 -64311 -84035 -61555 -58613 -74923 -83197 -63430 -14015 -23327 -49537 -44734
16434 -44734 -29503 -19191 -24657 -5049 47875 66591 66959 68764 51741 -4163 -20226 -40660
16422 -40660 14059 18551 2277 2925 2561 36665 35849 13641 -3862 -2036 -12226 -1857 5343
16409 5343 7435 7343 -21763 -47536 -23937 -46526 -48746 -50048 -90401 -102784 -105683 -60895 -52833
16396 -52833 -62560 -66024 -63018 -29884 -379 -3033 23495 19956 -8331 -31437 -37308 -42665 -29154
16383 -29154 7393 15202 3759 -49836 -32357 -2411 11939 11977 33294 57298 19225 -10021
16371 -10021 -21323 1468 -23592 -56225 -103666 -91687 -59130 -61443 -47098 -26981 -32540 -22926
16359 -22926 -25217 12170 29573 25649 40215 26994 -14115 -52128 -88495 -52283 -25805 -14950
16347 -14950 12560 34514 2715 -31105 22890 41551 34173 42204 57056 55081 42925 -8947
16335 -8947 -15865 12236 -5229 -25752 5353 913 -3581 10779 20819 25953 39462 19667 30450
16322 30450 47374 52564 51693 2415 16003 9689 22983 28922 11068 36687 29543 42817 48060
16309 48060 46419 28734 4097 -21328 -8898 -9524 24457 33439 22532 18517 14115 26667 52616
16296 52616 19822 -18544 -4135 20996 16377 32196 52808 61062 31153 32417 32676 -14573 -23008
16283 -23008 30156 120542 112654 89590 74295 83506 103232 100677 72131 39755 24398 11827
16271 11827 19151 47737 76407 67227 48061 51683 56459 16784 26173 69030 100153 73655 24957
16258 24957 39199 59082 60712 7052 -33751 -34342 -2063 48191 83178 121861 168657 249741
16246 249741 309667 417821 548422 727872 894074 1065662 1278959 1460448 1557596 1601074
16236 1601074 1600181 1547602 1421719 1209304 984266 843498 730673 539487 393646 350337
16226 350337 313597 273552 222518 156518 135331 117031 84659 81847 116120 102455 92040 139143
16214 139143 145236 122536 102205 113966 95709 92069 32629 -17163 -45661 -84695 -65689 -36634
16202 -36634 -17568 -24863 -22557 -23603 6938 -1854 -30135 -39365 -23604 -53197 -52720 -69856 -56926
16189 -56926 -44214 -65427 -65332 -41936 20145 26687 15220 1357 -6482 -27394 -59310 -53104 -65194
16176 -65194 -29000 -9839 -24304 -26042 -27998 8637 -9727 -29997 -15454 -6608 -29713 -29121 -44222
16163 -44222 -44834 -42667 -12008 40978 41641 42577 37452 31563 -11277 -48778 -28865 -37721 -35510 -4727
16149 -4727 25782 24739 -18376 -54663 -56920 -65453 -73384 -71410 -62362 -55480 -60380 -49637 -65487
16136 -65487 -39911 -28561 -24502 -10482 -5685 -38191 -43158 -4181 27378 58281 61574 59561 40124
16123 40124 -6978 -66545 -100320 -122683 -85285 -12341 4666 -14037 -11099 -12978 -37925 -43528
16111 -43528 -18563 -12581 -39585 -57902 -22519 31158 55532 16302 22819 90503 82483 28791
16099 28791 -25070 -33154 -83637 -86634 -41869 -2995 8766 -28111 -44176 -40600 -16192 -1773
16087 -1773 -36929 -25486 -18858 -49303 -96558 -90037 -31174 -26208 -65579 -97400 -99168 -74028 -56704
16074 -56704 -76148 -70821 -39616 6834 -18747 -77784 -35681 -21886 -32687 -50066 -58315 9080
16062 9080 19092 30443 14165 30864 25320 -18584 -10218 -30528 -34928 -26159 -20792 -31759 -40818
16049 -40818 -8909 -6542 -22106 -501 16189 20496 15236 10439 -21143 -62013 -85241 -96634
16037 -96634 -89650 -69190 -7136 29297 30097 35947 22375 33007 3449 -9310 1121 12906
16025 12906 -3993 -10923 -21504 -28382 -32530 -40246 -51867 -61902 -60824 -48872 -34349 -10526 -21423
16012 -21423 -36961 -7939 4309 8349 -6131 1384 -2578 -3048 -20415 -31115 -62010 -109840 -122141
15999 -122141 -90254 -37694 -5571 -10744 -7631 -4503 29097 17268 -30728 959 5233 18702
15987 18702 12213 16743 32986 47095 54071 41750 -17425 -23345 -36550 -12337 -14687 -19710 -23465
15974 -23465 -1961 -22006 -73682 -39146 -9114 -47356 -49048 -58512 -26155 1485 -18598 6364
15962 6364 -8365 -14295 -25883 -43040 -63233 -49269 -14298 -9948 -11627 -5289 11289 23993 3237
15949 3237 -82126 -103539 -109740 -93030 -102277 -86108 -78846 -72395 -62329 -40127 -6096 40454 46682
15936 46682 54421 26095 -19851 -32276 -41781 -35487 -29693 -27828 -20942 -6356 -6237 -55099 -84851
15923 -84851 -82042 -60004 -6495 24298 7868 -3955 -11567 -29730 -23701 -70516 -108649 -99109
15911 -99109 -52920 -12982 4250 8334 195 -9955 -51423 -46434 -49604 -56752 -60518 -58581 -38120
15898 -38120 -73567 -105166 -125336 -117465 -88708 -67365 -89500 -69901 -57500 -84968 -62463 -33780
15886 -33780 -19608 -37406 -30983 -13800 -9622 -15984 16290 9838 -12601 -54395 -42907 -16125
15874 -16125 -3401 -28667 -63834 -7221 -13436 -10329 -22036 -12715 -19191 -7165 -42031 -71770
15862 -71770 -69562 -40249 -23699 -3012 -29452 -29743 -34223 -46234 -20669 -18576 -19472 -20232 -19605 -435
15848 -435 9101 -10228 -21475 -30192 -73461 -22386 11365 -1122 -7263 15321 15751 9656 -6112
15835 -6112 -57330 -98920 -48596 -29644 -39438 -56565 -42649 -35314 -60686 -93789 -99944 -66780
15823 -66780 -23069 -20296 -38611 -16076 -24543 -64782 -81860 -33228 26665 48352 57107 44220
15811 44220 40451 20175 -9679 11517 -20717 -48803 -30247 7895 13374 -14781 -50836 -64624
15799 -64624 -18699 -2292 4846 -22863 -11541 39656 16000 6061 -18011 -35106 -30727 -22253
15787 -22253 -20236 -28121 -75352 -46217 -13958 1032 35299 -2847 3931 1625 -11050 36104
15775 36104 19237 -13453 13184 17522 10218 -2478 -29779 -18977 -16217 -1350 38765 22732
15763 22732 -6100 -33284 -45060 -16235 -11541 -25464 -8800 -4746 -9332 5987 3415 -8610
15751 -8610 -27612 -23913 -28734 -42449 -60934 -62134 -43784 -30832 -23154 -5129 -8183 21660 -25867
15738 -25867 -67987 -85645 -70323 -82867 -28234 -10728 -85460 -100993 -39418 -14775 -41726 -79100
15726 -79100 -88122 -62267 -23730 -5298 23637 -25752 -91054 -115300 -94212 -91539 -68190 -63984
15714 -63984 -41143 -44297 -55483 -50375 -20723 32224 31935 11119 13873 31303 62423 71514 63579
15701 63579 12882 -22589 3332 -15633 -25576 -24823 -3390 4384 32408 14160 -12311 -41046
15689 -41046 -33312 -49788 -46278 -32049 -39273 -11033 5441 -51078 -73173 -14539 -17606 -36534
15677 -36534 -28541 -19156 7763 -1789 -5531 4766 -16807 7062 -2864 -62515 -90442 -72406 -50440
15664 -50440 15751 9954 -31230 -30584 -44105 -47249 -39736 -43371 -38054 -5359 -13875 -55232 -69679
15651 -69679 -66967 -70421 -58829 -20539 -1459 -123 15027 22789 21148 21676 49790 14613 -2895
15638 -2895 214 -52748 -63622 -44638 -39920 -17854 -12074 -20925 -12861 -248 -9120 -22532 -13496
15625 -13496 -13920 -13696 -8949 -7914 -10866 -27322 -14643 -32046 -34549 -31598 -34670 -53040 -53972 -16920
15611 -16920 -11969 -37915 -48129 -7253 2331 -8723 -26494 -28967 -53177 -64109 -67958 -55118
15599 -55118 -32429 -15245 12747 -6932 -10868 21590 26128 -19823 -35465 -38057 -30603 -784
15587 -784 -49419 -52698 -13520 6882 21956 41168 41804 19829 -17001 1436 -14772 -23449 -867
15574 -867 13445 -8872 -26342 -7935 30130 3182 -29735 -27055 -39797 -48606 -50734 -70025 -73613
15561 -73613 -78024 -78665 -16647 -18526 -27229 -3020 -42111 -92484 -85495 -61606 -44958 -50197 -44866
15548 -44866 -4670 -2260 -8542 -23137 -48660 -38005 -4624 -4787 -22515 -51558 -98768 -44593
15536 -44593 14729 10737 -8414 -57783 -15211 2033 -37902 -12857 -37252 -47315 -46529 -26658
15524 -26658 -4560 -1795 -35008 -13898 21041 29552 51353 37581 41804 12232 18441 22962 23041
15511 23041 46565 30494 -12879 -33006 -46300 -13442 -25247 -15724 -12543 -24003 21490 59479
15499 59479 59464 64771 53938 14582 -6178 -26838 -1990 2942 -30315 -37244 -46050 -61268 -73842
15486 -73842 -62427 -48482 -28117 -47503 -44571 -19076 -15171 -10775 -34359 -18350 -16095 -36117
15474 -36117 -50590 -42919 -50953 -32631 -54664 -39547 -11960 5407 -10963 -44698 -99632 -102091
15462 -102091 -87698 -40533 -50202 -84215 -83031 -59647 -85047 -112565 -99918 -55208 -49526 -81521
15450 -81521 -59602 -65531 -54950 -55503 -66343 -9146 40642 64001 20794 -50849 -38992 11313
15438 11313 48973 52459 29250 -924 6898 13140 -1901 15479 21095 2987 6006 -12288 -23313
15425 -23313 12101 41593 24146 22510 26058 13246 32008 8376 -21633 -9106 -9113 7705 -15524
15412 -15524 -32293 -30129 -39837 -28219 -17837 -17911 -47762 -37944 -38780 -39772 -36610 -48730 -9546 19217
15398 19217 10078 -16761 12572 23576 -12129 -37686 -45178 -69494 -100028 -85282 -62080 -50311
15386 -50311 -67185 -63572 -66847 -58631 -55563 15000 27662 -22388 -32467 -63556 -76019 -61948
15374 -61948 -15616 7755 -6755 3152 28521 6883 -24524 -61256 -35749 12406 21775 14917
15362 14917 -5395 -21919 -16768 -36506 -15542 19631 26348 -33358 -65720 -68575 -55077 -38232
15350 -38232 -46833 -25915 607 -3435 28817 35405 39477 34834 -10155 -15960 -41727 -56899 -77984
15337 -77984 -83869 -70097 -63481 -11353 -12631 -56493 -62879 -41492 -40520 -61082 -43749 -26350 -35732
15324 -35732 -32793 -14887 14833 28616 86 -19734 -4495 -13068 -38927 -18934 3269 -4949
15312 -4949 899 -1544 -9221 -34988 -71149 -53617 -27104 -28585 -53592 -33375 -15312 -35743 -56088
15299 -56088 -80803 -68738 -50288 -33174 -36889 -6173 20711 -4792 -42191 -33477 -3951 -1423
15287 -1423 2014 201 2856 18425 19749 13679 34788 25981 40818 50006 88834 93389 78794
15274 78794 50901 1346 -3196 -5192 -1345 -20847 -53851 -54247 -65643 -112281 -89292 -56504 -40081
15261 -40081 -25026 -24914 -21903 -29406 -1414 43591 97262 80535 51134 34096 36207 51222 39610
15248 39610 4288 -27448 -31246 -7984 31416 56791 94268 138974 81374 15883 -20612 -33478
15236 -33478 -16126 812 8045 -5643 -3248 10652 469 1404 3858 -5720 3687 54866 11588
15223 11588 -34187 -57252 -13969 5292 -21980 -37365 -38526 -64623 -42580 -58089 -100735 -51633
15211 -51633 -19067 -34153 -37298 6587 -1772 -9414 -40296 -69604 -25949 -33502 -4062 20825
15199 20825 30539 -18311 -45272 -23138 -17380 -11452 -11863 -26290 -47895 -1520 12688 15043 61751
15186 61751 71303 41056 9880 -1799 25539 -7881 -15910 4581 -52493 -80825 -50882 -30318
15174 -30318 -26480 -16057 12342 1110 1299 800 4911 5571 -17174 -33840 -28034 -14683 19647
15161 19647 24974 9667 -18898 -15804 11768 29753 22982 18862 5291 -19176 -36701 -60616
15149 -60616 -32707 -37660 -38450 -58737 -64552 -54525 -42971 -41236 223 13447 18128 39616 20929
15136 20929 2424 -42442 -36148 -52240 -67935 -39916 -40072 -35071 -13216 -1073 -6125 11234 9895
15123 9895 6118 22648 11614 11513 -2225 -28776 -32091 -22325 -12824 -26661 -64250 -28947 3006
15110 3006 -18164 -48825 -60834 -22492 -21964 -55537 -50689 -41439 -12811 -14954 -24019 -43329 -26963
15097 -26963 -36666 -35449 -32262 -20489 7821 51432 64248 19460 3458 -5445 -50048 -23782
15085 -23782 -17555 -11258 20061 9394 -15257 -37127 -59446 -62818 -85301 -85124 -103821 -98134 -73699
15072 -73699 -49596 -47783 -53450 -31332 6736 11495 20563 -12341 -35424 -20527 -2614 37495
15060 37495 56079 4342 -55115 -36382 -26800 -27780 -30306 -24718 -33091 -37665 -66579 -61244 -24631
15047 -24631 -23067 -66760 -100408 -89338 -35056 -24889 -33663 -52351 -29654 -35141 -18457 4947
15035 4947 -15882 -9155 -26689 -30751 -22490 -17738 4687 14973 39627 26888 10444 -27988 -20413
15022 -20413 -24320 -37995 -45029 -47016 -43854 -33259 -38815 -49464 -58474 -40237 -8553 -19433 -44486
15009 -44486 -81761 -80554 -44049 -35631 -40425 -40549 -34456 -27719 -19718 -11584 -31546 -16187 -3565
14996 -3565 -6633 -28154 -20118 3674 9956 15003 17226 -28467 -3441 24220 5103 -26259 -32822
14983 -32822 -52998 -56669 -46243 -8008 -17020 -14334 203 -697 -14296 -30287 -47984 -31918 -45824
14970 -45824 -76392 -55554 392 -33522 -46192 -34764 -38764 -46676 -46039 -34763 -48770 -21474
14958 -21474 7609 13877 50323 48669 54549 34564 206 -31782 -30096 -20895 -33077 -35386 -21172
14945 -21172 -7387 27325 -4884 -25247 -37801 -28549 -36995 -48071 -64733 -28700 1282 24664
14933 24664 26802 -19357 -39934 -33020 -44990 -45835 -42772 -38611 -36945 -27246 -28835 -14017 -47853
14920 -47853 -53370 -31844 -77401 -97083 -91894 -70869 -40363 -23018 -44722 -59249 -61827 -115748
14908 -115748 -122515 -72204 -51989 -48691 -56018 -22867 -40945 -63869 -36310 -46428 -24850 -41040
14896 -41040 -120064 -83162 -2887 2551 -25838 -15431 -33829 -50250 -44224 -46917 -68015 -64802
14884 -64802 -38249 -1802 1526 -52108 -69112 -30290 -26750 -31540 -18489 876 -8876 -29066
14872 -29066 -51474 -22812 -15694 -16300 -37782 -42582 -32147 -25756 -11170 12570 12300 34249 42824
14859 42824 41005 21784 10793 -32532 -45288 -17167 47991 17161 -10439 -35438 -50480 -80167
14847 -80167 -87255 -58699 -26847 17160 42764 61669 39883 29757 2023 -6116 -20753 -19090
14835 -19090 -58567 -60233 -53360 -63780 -90482 -84722 -46618 -59663 -58719 -46048 -37833 -9417 -30319
14822 -30319 -40291 -2612 20491 13822 -1631 5359 9687 -16728 -50921 -53919 -28798 -51298 -52329
14809 -52329 -66927 -61754 -23903 34877 83677 69269 77241 41328 27991 3411 7551 1171
14797 1171 -39584 -44298 -65022 -49962 -29494 -11697 -35170 -38322 -9381 -21475 -35279 -41789
14785 -41789 -24215 -79519 -83107 -55147 -44446 -22815 -40701 -51265 -34890 -32847 -8852 -11071
14773 -11071 -52158 -70216 -14687 24439 52780 38962 -31982 -40366 -18503 11199 3749 -7038
14761 -7038 -2928 -54018 -52707 -24035 4752 -27833 -14302 6821 -7488 -6618 -45755 -44849 -45736
14748 -45736 -48140 -28580 27997 5343 1179 16269 27321 53957 23492 10064 -5705 -16233
14736 -16233 -52654 -54648 -43457 -35970 -37789 -18430 -22635 -31666 10365 -4168 405 23940 20783
14723 20783 -5918 11877 12922 -5076 -33666 -29211 -38467 -41117 -24087 -29444 9025 10202 -23849
14710 -23849 6465 10232 15064 -75 -24494 -47094 -45358 -61514 -44903 -8160 -48640 -33310
14698 -33310 -23709 -29383 -22413 -27230 -20486 -34340 -28656 -1585 -2438 -28052 -14895 4940 -575
14685 -575 -4460 -27511 -21527 -18955 97 -5485 -26779 -26687 -27647 12594 48206 29297 30529 56326
14671 56326 38959 21348 -4293 9055 22215 20796 22452 21929 11117 44926 46445 32477 -25429
14658 -25429 -15920 -6902 345 -26617 -7019 14367 -19140 1437 27087 -19486 -56837 -38963
14646 -38963 -28868 -54462 -71622 -40497 -45356 -41439 -575 -13669 -18793 13260 -20107 -20419 -17548
14633 -17548 20827 19658 3004 -23427 -70610 -89298 -115483 -152586 -73806 -19039 -28565 -19713
14621 -19713 -13476 11184 25839 -2851 -317 -259 -3258 -22706 -53271 573 -2185 4461 -48085
14608 -48085 -93149 -59387 5473 27321 8390 -12672 -11009 -28576 -47690 -58087 -57467 -40837
14596 -40837 -21561 -30156 -46052 -58210 -47658 -24562 2892 -1198 -29934 -53411 -31589 -34436
14584 -34436 -42538 -31818 -9909 10504 47085 71282 31420 -14428 -8592 -37518 -27609 31476
14572 31476 14803 7692 40323 23941 -13401 9294 -12785 -29849 -43102 -29379 9195 5029
14560 5029 -5339 -3004 -21997 -34049 -60671 -73149 -58552 -20575 13985 -22213 -68256 -65072
14548 -65072 -26435 -60456 -10412 -7815 -8389 18177 -11266 -15265 2445 -3590 -45505 -98552 -99841
14535 -99841 -81270 -83114 -87566 -60027 -1152 417 -13329 -9877 -39022 -64041 -100866 -124011
14523 -124011 -89922 -71308 -66135 -74201 -52173 16120 7735 837 -50733 -59130 -42648 -36421 -27632
14510 -27632 -43311 -60985 -68650 -64157 -56459 -33236 -17138 -6205 -14488 -50614 -93422 -95348 -91591
14497 -91591 -88141 -72834 -38265 -29318 -27048 -17246 -10902 -1805 9390 6882 -5741 42078 45561
14484 45561 39058 12676 -13258 -41644 -22273 -6488 19042 20188 -5055 -24556 -24553 9436 273
14471 273 19871 60739 60600 3018 -29638 -42937 -21680 -6365 28433 4296 -35687 -23468
14459 -23468 -11250 12707 17628 -45253 -37928 1560 -8125 -36175 -35091 -27158 -6517 -9546 -24721
14446 -24721 -48647 -55673 -73094 -77697 -56311 -41031 -29139 -1648 2418 -21101 4031 23447
14434 23447 -17076 -39547 -28050 15984 8780 -3724 8375 30092 60528 81097 57255 20069
14422 20069 -22375 -20662 -35034 -4820 25357 33372 8877 4720 5232 33899 56035 55930 -9952
14409 -9952 -38552 -41021 -21928 -2248 2367 -2134 -6531 -15311 -28379 -21312 3517 -2052 -4477
14396 -4477 34689 37327 -2414 -30409 -43028 -52004 -78085 -64993 -29912 -18233 7373 1087
14384 1087 -28256 -51874 -36627 1829 15415 -22602 -24485 -42727 -59916 -44927 -14032 20724
14372 20724 -10060 -37517 -14676 -243 -8170 19542 28462 14818 7128 -12071 14975 5776
14360 5776 18765 14738 18999 -18123 -58344 -52064 -36250 -42530 -6259 17860 29795 50385 29650
14347 29650 55925 71660 58909 17273 -28419 -14049 19966 48400 20283 13314 2348 -1723
14335 -1723 -21311 -19871 -15816 -16849 -31036 -15527 -52331 -63043 -71994 -63122 -72014 -56764 -7326
14322 -7326 -19407 -10387 -3839 -10639 -46395 -43190 -5672 12587 609 -38295 -53101 -22296 -7681
14309 -7681 25202 28495 1976 -48508 -76778 -54405 -47928 10351 29117 37286 7247 -82693
14297 -82693 -89424 -80317 -112939 -62578 42851 52187 38466 35955 49974 30831 -36062 -58373
14285 -58373 -38677 -46948 -41775 -39592 -41208 -4319 1769 -3022 -18418 -54237 -76310 -63011 -60720
14272 -60720 -58629 -79376 -55273 22013 37877 32180 2561 -6434 -24892 -8775 -52186 -25794
14260 -25794 -11051 100 17867 -32185 -62657 -72316 -16642 -2143 -14160 -875 20415 31756
14248 31756 29016 18092 -20141 -13233 25043 48612 51651 -8516 -50741 -91778 -95356 -52881
14236 -52881 -43619 -16922 12872 37657 42012 36254 47247 53904 46044 23372 -2258 -56764 -59796
14223 -59796 -57370 -53034 -33590 20856 37275 -16634 -1054 4135 14651 5404 -33631 -49797
14211 -49797 -4813 5941 18393 -19980 -20619 -2860 1763 -28527 -68814 -72255 -54460 -49401 -35973
14198 -35973 111 6215 -33710 -69215 -56049 -72349 -86917 -53132 -10820 6608 36935 33498
14186 33498 29179 7796 -19036 -66948 -50886 -10955 12032 17283 28103 -16778 3811 37839
14174 37839 69343 43782 67649 93219 51578 7618 -20203 -7385 909 -17342 12224 30733
14162 30733 -12408 -63583 -97359 -97527 -47827 -57298 -40508 -35100 -35387 -5775 -1839 2283 -41464
14149 -41464 -93416 -128442 -96715 -76400 -37951 -50357 -29939 -19566 -12071 -46490 -58807 -31467
14137 -31467 20628 1615 -47398 -28884 -23833 -73362 -68015 -42388 -24056 -19398 -63427 -52699
14125 -52699 -36846 -49292 -43454 -20005 -29265 -31208 -39989 -14358 10535 -23439 -32234 -17833 -6319
14112 -6319 -25288 12754 62010 84583 53900 -38713 -61835 -71435 -69276 -53665 -31314 25393
14100 25393 60403 49090 10622 -61366 -46035 -9465 21749 32018 29003 63514 77535 60347
14088 60347 46660 61821 66935 49831 30341 -7435 -31277 -34620 -29867 -4156 15151 9050
14076 9050 -39333 -36966 -20547 -30209 -49080 -55787 -78744 -50864 -2619 2617 -31185 -63889 -46254
14063 -46254 -40075 -70010 -67091 -47110 -40113 -15930 12299 60346 71748 -11091 -48087 -31396
14051 -31396 -37620 -39239 7306 32610 1581 -14559 -21455 2830 -22727 -9164 24022 -788
14039 -788 -38588 -36707 514 20454 7821 9805 -35 2825 -7554 -16879 -27133 -30484 -22637
14026 -22637 2456 -10962 -57133 -60098 -24599 41320 44372 19416 17874 19297 -5966 -26764
14014 -26764 -44487 -39628 -43576 -39182 -49125 -40042 -20688 -35888 -7196 29809 51372 18718 -7612
14001 -7612 -5456 -27041 -23914 5919 -1113 -2496 2014 -7520 16018 25805 40911 44799 22617
13988 22617 -4301 8672 26100 7929 14277 -1071 -42453 -2849 978 9159 15836 41625
13976 41625 702 -47577 -42754 -55456 -47731 -33957 -27784 -450 2727 18916 16151 -17664 -36138
13963 -36138 -97462 -79060 -36591 -41107 -32590 -27944 -5578 43963 5617 -6423 16900 10554
13951 10554 -12967 -23917 -34815 -28342 -3533 33485 34455 -21719 -26487 -23956 -5236 30939 -3381
13938 -3381 -50114 -93367 -75179 4339 37533 18767 19862 16916 9428 -22625 -23657 12565 32379
13925 32379 7357 2089 8179 -19138 -38873 -25405 -35157 -12082 2765 -6659 -21392 -24415 -20308
13912 -20308 -13839 8656 -13043 -27181 -2266 13176 -12009 3212 46644 34165 2790 -23717
13900 -23717 -44048 -37171 -39091 -16802 -27751 -44198 -59109 -56596 -43787 -4778 41450 62197
13888 62197 38431 7131 -18924 -38611 10763 -12740 -19900 35770 29707 16741 15719 -7056
13876 -7056 24089 22359 6163 15316 4323 -36643 -12837 -24559 -39028 -13205 28013 64849
13864 64849 64896 51656 34774 52352 14241 -14330 -42459 -28782 -1305 22990 21851 32637
13852 32637 37714 6623 28164 51210 34401 29354 47498 39503 21321 28353 16627 11626 55163
13839 55163 53734 60307 14041 8295 20928 -9565 24822 77441 69111 53424 48622 23917 29789
13826 29789 67296 103196 117340 138185 127777 138002 168882 174445 227750 263616 260378 250211
13814 250211 199596 185196 207630 230060 236594 227142 162791 123316 96371 73078 81398 114599
13802 114599 145712 136375 96484 96072 71653 -2580 -40904 -15918 4943 6460 13115 16327 11700
13789 11700 488 -50107 -41503 -26196 -37376 -22756 -6162 -1335 14003 -1857 10021 7567
13777 7567 13591 -29938 -13803 341 42308 60387 -2513 -8471 16744 46244 61016 43556
13765 43556 17845 25076 37840 26834 -6008 21243 4872 37699 21383 3546 -14506 -21859
13753 -21859 -33946 -10240 2086 3185 18953 7448 -20710 13406 26845 10951 27245 34011
13741 34011 30939 39382 43970 10953 16348 37339 50671 39686 39506 45620 70236 24522 -52152
13728 -52152 -74207 -46541 23105 59806 43578 45491 46391 20098 -7841 -14176 2690 46012
13716 46012 14396 -41213 -26027 21221 35350 28864 38268 74093 64275 44572 -23882 -48976
13704 -48976 -32700 -15375 -30673 4588 31761 42163 71381 92862 116357 115990 83650 65633
13692 65633 90487 121455 97152 74445 26749 52292 65536 56898 40592 19497 50693 74163
13680 74163 81055 49543 29987 9286 -11993 -15909 -23337 20730 79974 109166 110850 65231
13668 65231 27248 -15325 -11921 -24325 -76419 -104758 -87538 -3017 10020 17037 -29509 -25466
13656 -25466 26360 22892 46986 72031 37038 48721 87516 61420 -10622 -58925 -47029 -2580
13644 -2580 15418 6148 42896 64688 43520 19479 38379 67200 44591 30766 12881 -332
13632 -332 45552 38782 -22737 -52229 26553 76969 113665 104106 59666 48874 70764 82698
13620 82698 69601 71753 118770 122046 82493 82959 86015 32918 24689 2718 9646 13727 30387
13607 30387 74179 77079 42705 12149 30706 54155 110303 90840 85741 116145 135792 128300
13595 128300 131825 116793 128137 128767 121308 118008 137103 149365 130478 113510 166031 206809
13583 206809 192986 203411 206103 184956 171641 224388 259497 257621 257428 253767 273408 291311
13571 291311 331278 345174 341288 369774 373928 346737 306453 264198 267448 287133 258974 232830
13559 232830 210966 229692 218414 207186 183159 157915 165888 186424 177669 160625 150196 124393
13547 124393 120323 131614 123347 116792 119313 118140 99669 78469 71442 123364 166196 149925 123467
13534 123467 121042 108134 82753 86458 111440 128996 137169 144744 107979 75108 98973 147140
13522 147140 195081 197554 197971 250862 257624 235764 192570 194844 159486 92602 102493 124760 184434
13509 184434 241015 186814 143530 147187 147212 134877 126840 145270 150687 168225 174492 183936 187493
13496 187493 226452 213003 193558 198830 207583 249352 241786 222515 218553 199875 191167 176967
13484 176967 201483 210909 207986 211337 180293 182640 192211 207403 212161 187835 190061 181368 160111
13471 160111 215151 204713 177190 198920 217885 250904 279864 249693 243518 206845 207643 251897
13459 251897 268482 247285 242490 283668 282632 284715 274298 262370 295260 322814 338007 349072
13447 349072 356108 340128 317931 329899 342173 347886 365574 388232 417307 424548 447036 465071
13435 465071 503536 519952 492105 497158 528963 548472 578334 587684 601817 617302 653117 698112
13423 698112 730311 747701 776557 808256 830390 834564 896469 957225 986844 1032786 1071578 1083669
13411 1083669 1133318 1185432 1237774 1294366 1349585 1416439 1456603 1534036 1623431 1690090 1753241
13400 1753241 1879732 1970634 2065945 2200620 2341835 2539929 2737442 2894512 3067864 3281926
13390 3281926 3559770 3863555 4241293 4653167 5114704 5593078 6123038 6792139 7535173
13381 7535173 8385098 9320727 10404707 11666726 13221706 15074878 17341023 20040984
13373 20040984 23343075 27299716 31970002 37273728 42945934 48640229 53763138 57608833
13365 57608833 59685145 59670774 57600614 53794232 48818334 43330953 37856266 32744099
13357 32744099 28209321 24311284 20988213 18213065 15915721 13986497 12366393 11036760
13349 11036760 9860294 8825889 7912736 7085154 6436662 5841843 5363519 4896960 4490410
13340 4490410 4110269 3752470 3442616 3196572 3002731 2803475 2601172 2425150 2276693
13331 2276693 2130083 2008656 1897507 1844678 1733506 1612227 1539177 1458731 1408506 1348563
13321 1348563 1332626 1314183 1246410 1186664 1153062 1160923 1157992 1076307 997330 1038189 1023311 988639
13309 988639 947529 919879 923264 892594 796093 726703 682779 653158 652595 643521 691375 668375
13297 668375 617896 572696 576738 569098 571174 549796 546833 525819 528043 496462 427503 420606 499899
13284 499899 520302 498543 511906 489225 478252 482507 453688 450551 451011 462551 464957 460251 415651
13271 415651 345827 278103 244558 301981 347438 371862 350024 327231 340315 342605 322111 278277
13259 278277 286972 335820 280206 265936 328486 322014 313865 347796 356175 363999 358679 355421 383562
13246 383562 349004 351723 401398 433512 446128 430057 463169 518493 546751 611643 684674 755808
13234 755808 888523 997058 1078268 1157596 1286653 1388390 1441331 1410944 1403128 1377643 1289316
13223 1289316 1177208 1091809 998877 903325 809130 707901 639753 606307 557435 501384 435264
13212 435264 392704 353619 368862 378441 384402 349030 300897 277265 296865 334330 365421 358123
13200 358123 355833 306424 292226 323463 349004 404025 406777 393534 386427 383259 416108 427724
13188 427724 451561 467083 476687 442457 405039 446841 495827 533580 536376 505845 510024 543913
13176 543913 545499 551615 555820 539381 548501 517467 487230 473609 467232 416316 422730 441963 387535
13163 387535 354730 353662 335744 343016 350196 394071 383567 381067 396073 382391 377642 403761
13151 403761 448965 481408 485271 520173 549998 567942 563735 548567 520641 477184 492480 469252
13139 469252 427997 375762 372631 381884 310167 273905 309197 308988 299502 297043 324728 343677 339401
13126 339401 335404 343804 338667 331787 338197 357899 366328 370964 391790 400957 449221 481980 536736
13113 536736 594768 667077 800429 935425 1039224 1033042 925149 795806 649930 483175
13103 483175 405449 351618 277130 240789 247475 239640 233560 218835 188511 180253 214623 196874
13091 196874 218366 197226 146080 115490 102736 87194 92854 83084 75428 59937 35787 47627
13079 47627 85441 99416 87320 79019 96196 90026 61663 74804 102555 127369 122161 111932
13067 111932 120123 138204 122236 76281 71223 86088 75364 74667 86894 98398 88308 100202
13055 100202 94918 86183 93275 79613 79267 64512 51227 15338 17708 -9102 259 -1466 -23356
13042 -23356 -12815 45472 87768 114994 76154 30003 54935 88612 86340 77424 71101 102990
13030 102990 127548 141232 122823 109046 100819 87229 84711 85608 44284 14294 23645 43783
13018 43783 34392 57872 60008 93157 100932 104397 97968 77258 53634 65948 97204 133746 159547
13005 159547 121904 87206 73512 98011 86686 75253 69742 81025 53281 3655 -6277 -13569
12993 -13569 35140 67857 78508 67493 65863 58585 76842 47299 55939 93166 98607 87718
12981 87718 120177 125224 116228 91682 59731 74661 46262 52410 65865 55650 21403 44924
12969 44924 54485 49966 36898 59888 90269 77197 59571 58699 63622 33920 25560 34882 49860
12956 49860 64084 76389 65585 104550 91467 91692 128028 122057 101316 101938 100263 120508 148237
12943 148237 128011 85454 81457 91866 103686 150108 190645 186826 178963 193473 228037 236660
12931 236660 214624 239296 267940 278180 293183 301619 294577 299657 329989 326881 289351 261412
12919 261412 241327 240807 257112 259145 292740 309328 315736 351504 386191 403728 411128 417497 418768
12906 418768 375750 326755 304447 302933 264597 234442 234282 219248 211612 193740 164444 138947
12894 138947 125104 130935 142746 139770 137450 121699 94532 68020 58258 42241 59565 53434
12882 53434 52870 73120 41710 33386 67290 67564 56041 34850 43384 52121 46856 73616 82612
12869 82612 79065 57856 26393 1220 28119 41342 13490 -10985 -9561 21080 48183 83502
12857 83502 80297 59032 79170 99982 76735 33388 69865 76648 59063 69467 61535 51432
12845 51432 -10434 -65334 -25764 26986 31385 18132 54254 57344 52734 53875 51633 55510 106774
12832 106774 88230 94725 80810 81326 113672 144530 175930 184358 110545 85269 60664 92631
12820 92631 90083 75608 63872 52364 43305 64333 49261 17773 -3458 -23564 -13273 -14717
12808 -14717 -2701 28904 26518 56006 86493 85826 58080 107428 198025 256294 279145 327811
12796 327811 277374 214498 174242 167613 204742 167969 127435 113731 107159 122372 110545 104153
12784 104153 110707 112658 124543 134143 120815 99340 51729 10835 64713 113578 161590 168690
12772 168690 154224 155710 157646 165733 174241 177210 177295 147665 137731 140038 123780 116273 114047 76447
12758 76447 83610 89868 86104 111882 129392 161841 162453 161428 178589 193750 194851 186561 233182
12745 233182 235139 231338 270914 264409 245929 281849 327499 326031 306723 313522 283305 311541
12733 311541 347147 375266 419761 450100 477866 533437 577788 613278 622412 686034 755777 856219
12721 856219 963887 1100265 1253725 1479698 1770131 2067208 2263384 2241893 2070141 1860579
12711 1860579 1725772 1595096 1490202 1403443 1401207 1428747 1477173 1586902 1648138 1685978 1711740
12700 1711740 1801853 1881459 2033963 2233100 2379307 2575457 2816540 3048578 3316004 3651036
12690 3651036 4024090 4464973 4942842 5531321 6292269 7218426 8443152 10031288 12096106
12681 12096106 14627740 17653249 21271419 26181984 33521135 44783267 62376101 89280174
12673 89280174 127582756 171251996 198538571 190412305 157024184 118361189 86027971
12666 86027971 62845739 46999986 36227126 28880923 23643531 19697496 16427960 13663777
12658 13663777 11374166 9565737 8128487 6988609 6090197 5336164 4743145 4208654 3789914
12649 3789914 3435763 3134122 2919610 2703464 2512461 2330850 2172780 2018598 1877902
12640 1877902 1764945 1663705 1557784 1475045 1411462 1337177 1270513 1189067 1154111 1123942 1064203
12629 1064203 993958 1006282 1026088 977111 905356 869290 830767 820080 802697 769894 728203
12618 728203 686499 711653 745033 741838 704608 677625 653308 633406 619370 629747 610771 603519
12606 603519 585578 572778 519585 454472 413711 425271 423818 417261 396462 400929 421857 419244
12594 419244 453498 500302 484565 457874 422066 452001 453701 430392 427255 399240 437440 453874
12582 453874 441321 442361 421107 419121 450560 507960 563201 556697 558095 543227 510305 461607
12570 461607 440241 454048 427244 372969 320719 320740 290684 262875 273635 297290 275306 245659
12558 245659 218994 215793 198554 215925 241259 271234 276017 283446 306201 317521 396387 486139
12546 486139 547016 584248 639733 729138 883607 1154440 1577619 2124359 2714858 2933928
12536 2933928 2638716 2079793 1582163 1199317 955326 771576 591098 478814 482306 499908
12526 499908 463599 388232 330880 293048 290048 287125 235313 170565 174098 162109 118333 75055
12514 75055 53081 55313 74211 98135 93526 84629 103910 114536 121770 134289 161801 125517
12502 125517 112928 117398 101631 120140 174582 181546 148063 156895 171449 164220 164052 191764 165840
12489 165840 141154 116309 121459 146593 165019 189229 172961 194977 230868 271761 309316 342231
12477 342231 351655 395913 384110 407723 440563 486138 515877 569020 679285 749114 834361
12466 834361 1028414 1333685 1757477 2365382 3338996 4831098 6585704 7711887 7358015
12457 7358015 5981627 4462147 3221304 2372135 1831435 1448872 1141077 937105 773159
12448 773159 690458 624383 517001 474361 425562 373316 322364 297490 297876 307112 307366 333051
12436 333051 358169 353431 339725 344883 319932 309611 279982 280576 276026 247409 268022 248634
12424 248634 243751 266102 277655 274409 247833 230177 242015 253930 275064 267173 220525 202045
12412 202045 217974 215049 204801 221182 247684 290612 285866 239566 237118 245665 255365 248858 211761
12399 211761 193811 227168 206938 189747 174789 136429 104677 124738 136592 105581 93278
12388 93278 168325 205323 202269 171285 168977 240953 278802 292359 325173 320279 302414 333336
12376 333336 330787 363133 400458 448743 531600 534084 466865 416003 376997 368244 363637 350520
12364 350520 314968 326844 366830 359320 370773 396566 405683 398065 383268 353058 316228 286265
12352 286265 264583 225514 202214 207093 205869 203399 206471 215867 184941 107827 96582 151200
12340 151200 160704 177410 199625 226827 207555 147190 126423 132590 106595 134439 146472 148568
12328 148568 162305 119693 67868 39229 57119 106013 135353 174278 181821 166987 147709 125108
12316 125108 126864 135597 165585 172344 163307 161371 157838 157146 167137 167201 182164 207256 272588 266084
12302 266084 244549 266051 246288 204058 151442 141308 138854 183488 207471 213996 229215 221550
12290 221550 152946 108554 99935 72294 105083 107117 101415 122500 98214 90755 133383 180230
12278 180230 174537 190939 212875 187548 148936 128777 191279 217330 209178 169175 209486 250393
12266 250393 244050 213804 236367 239243 226808 175196 161927 200397 188353 177541 167615 158163
12254 158163 103512 89641 118595 133121 98745 114013 158455 168600 131483 150595 189833
12243 189833 182344 174984 171969 172668 189875 195638 179178 146282 146010 181554 235658 288747 338637
12230 338637 436309 537050 667651 910840 1090257 1049045 870745 699308 523213 396530
12220 396530 344797 299919 246249 194231 148899 115493 135520 183293 240799 268162 310129
12209 310129 282248 232038 249597 262637 258278 209074 178979 114219 84631 99322 130342 126144
12197 126144 107281 100488 66511 93115 75804 60208 99206 116972 125208 144709 171628 215546
12185 215546 271599 281930 289475 278823 273279 300342 254116 219173 186852 126768 114457 127792
12173 127792 121627 100859 81545 82659 124199 89216 54789 74668 117550 125327 121313 131888
12161 131888 109217 112786 83211 37641 45509 21320 24235 23963 137 28951 90448 69450
12149 69450 85917 92998 81422 72750 60013 62854 88239 97962 88749 144825 169362 117611 75064
12136 75064 72596 72697 131819 168436 155266 171373 159444 142339 133320 116610 86895 104915
12124 104915 123555 136304 145349 146761 141244 146326 163834 229652 205163 175625 213333 225363
12112 225363 221555 189776 147881 170167 207531 194702 140412 86926 93267 84391 76288 83585
12100 83585 105285 122966 145832 117872 112864 155904 148082 121784 144659 187750 245483 229968
12088 229968 269237 263260 243900 305294 392832 411389 419255 328898 238366 187152 167058 137561
12076 137561 147942 161925 169952 200439 200319 142390 108872 98732 67752 73512 79604 93279
12064 93279 121033 126147 130011 131739 160450 183746 253293 377985 501090 655750 742221 750719
12052 750719 652080 542873 509786 456829 460752 444707 430218 384583 305669 285353 269306
12041 269306 243483 272166 263277 252545 255264 259963 233819 208909 219496 254383 278043 263783
12029 263783 257150 274588 278371 288252 295292 310583 314614 304624 308062 295171 304797 344345 385116
12016 385116 406130 423528 443434 485624 490322 492364 467462 482640 490838 465127 452641 458080
12004 458080 470689 550411 617904 592700 557474 531621 541346 582071 641487 685875 705247 729407
11992 729407 719970 701243 709144 780004 812613 864550 885371 942924 1010465 1045840 1047854 1077668
11980 1077668 1133848 1188278 1248520 1286000 1367920 1502987 1612931 1716063 1772342 1853600 1981222
11969 1981222 2069723 2140961 2235159 2343391 2486905 2634502 2786222 2959126 3141612 3358968
11959 3358968 3549804 3768381 4010430 4255483 4529268 4883588 5355024 5832575 6366608
11950 6366608 6906165 7565881 8365419 9194966 10158075 11246340 12532769 14083927 15924737
11941 15924737 18164721 21016491 24624114 29261184 35227738 43043698 53646160 68361623
11933 68361623 89276124 119464243 162536304 220387383 285825592 336163050 346501831
11926 346501831 314112024 258171559 200305377 152226936 116087922 89926621 70993457
11919 70993457 57053735 46616992 38619828 32397765 27481884 23585319 20359728 17696863
11911 17696863 15547993 13740017 12215208 11003450 9952355 9083168 8340144 7669199
11903 7669199 7079076 6573887 6109461 5688986 5321068 4954398 4627787 4359579 4094804
11894 4094804 3838442 3627277 3415109 3187038 3020858 2887805 2752299 2647004 2529458
11885 2529458 2428486 2343498 2230835 2126025 2042652 1985155 1923516 1874968 1777211 1724651 1682620
11874 1682620 1630411 1593311 1529535 1445980 1394641 1374653 1358972 1337662 1275283 1259408 1221712
11863 1221712 1222070 1207347 1127949 1075380 1054066 1049052 1034842 962053 880769 870735 873881 892628
11851 892628 874207 840861 819709 780389 782924 759391 745733 685687 677762 679825 678171 697252
11839 697252 651348 617943 632477 604395 575320 525821 539901 551394 527932 529706 561004 536502
11827 536502 524820 508439 491570 527867 531876 487668 455449 452691 435793 440064 426440 421902
11815 421902 440849 442740 403372 404712 451141 431241 396194 372692 363357 359412 395285 397122
11803 397122 426795 517597 544598 572615 662822 705260 663837 625695 594264 558284 488413
11792 488413 436164 443754 390767 381549 401317 393934 413648 407735 391101 392702 379501 339473
11780 339473 303109 272474 255216 266896 209700 135672 55896 25422 39184 7451 42745
11769 42745 32085 27937 113307 167402 162095 132693 123319 144766 168074 129041 124060 137150
11757 137150 127519 92024 119357 155420 159924 176350 145846 101045 127898 131682 97268 58672
11745 58672 63653 60339 55779 77128 80285 78654 65506 75506 125349 150374 135327 121751 135969
11732 135969 169840 152244 151680 164351 159762 169265 168887 127344 87771 73151 61694 69576 106791
11719 106791 121242 92372 67196 49673 68629 119873 173833 199913 187071 163462 142158
11708 142158 137066 125804 156354 120015 94091 104130 136833 147216 165528 180334 223382 251613
11696 251613 231058 191461 178428 183016 142280 129807 144487 172428 184541 191222 194448 237104
11684 237104 272192 279886 259850 209466 234602 232283 207879 202249 237123 227125 280752 296494
11672 296494 283807 308328 363018 367872 363349 460736 616962 705240 792141 923418 1103426
11661 1103426 1314403 1558780 1820072 2085087 2360283 2636313 2850495 2933546 2910686 2871846
11651 2871846 2785397 2635128 2494286 2295464 2149947 2040670 1898184 1832061 1740797 1687199
11641 1687199 1672433 1660724 1646090 1645146 1654024 1656239 1703565 1789352 1880854 1981514 2110823 2284786
11629 2284786 2464506 2649543 2818196 2910770 2959856 2949847 2805009 2592613 2320481 2037811
11619 2037811 1775115 1515650 1275127 1113422 967979 849296 738102 626964 563351 486667
11609 486667 421912 384333 330413 303578 287738 244401 236540 220181 216531 205569 216632 258689
11597 258689 268388 267430 231634 199676 177730 154610 159198 116270 99793 87748 86971 120192 122763
11584 122763 137843 109311 103955 113196 110767 138599 138482 108729 64253 68219 83006 88439 34311
11571 34311 13907 2639 5780 27751 49306 85820 53443 48425 68175 71137 93619 86941
11559 86941 75736 51439 98284 118160 125691 163354 139619 90370 80706 47043 -28953 -18204
11547 -18204 30175 72795 82083 22012 21560 10849 35401 36258 19828 28517 49890 55381 55725
11534 55725 36963 38259 58560 54129 44282 56276 43167 15710 12303 -15630 -51979 -46581 -16804
11521 -16804 18395 33965 47806 51097 108284 125771 108494 42562 16557 45793 98007 91973
11509 91973 59657 112345 123056 78348 42922 66729 61736 79527 82573 87862 70647 88650
11497 88650 72744 29757 38002 86503 141445 138206 103569 71661 72432 101848 128996 105038
11485 105038 94800 91416 66255 111083 92565 33603 55505 86148 159103 195083 237048 227919
11473 227919 201683 168329 146954 113981 108605 132441 146204 125421 110620 122433 122191 106128
11461 106128 68023 31585 1497 -2413 2585 23162 -18539 -77488 -71589 -81372 -72790 -50143
11449 -50143 -47707 -56167 -33024 7307 -19909 -34155 -31941 -15538 8838 -4263 -6475 -298 19098
11436 19098 44932 50206 46519 43760 29729 7380 -2752 12307 64337 78647 81777 73929 39287
11423 39287 36434 693 -11249 -8343 10674 21084 5834 -6957 16459 75180 74434 59412
11411 59412 14289 -28261 -50116 -16005 1558 24047 16088 10206 -42374 -66812 -43281 -25264
11399 -25264 10107 52888 39621 -2712 -11470 2987 5629 14086 31405 35592 24200 64770
11387 64770 88594 78892 81825 48507 33382 43707 29502 72577 71675 58053 75688 74839 63223
11374 63223 72850 64459 49564 52706 23834 -13006 43458 45190 26796 23049 31971 59102 89437
11361 89437 76827 80826 86449 55066 34796 26485 -7485 -9667 -40966 -36852 -9461 -2272 17524
11348 17524 29349 18492 -2906 -27326 -9583 -32324 -21909 40822 37642 4318 -9074 4972
11336 4972 44167 57023 34636 32765 24994 33682 -14218 -46635 20739 44479 -30800 -35713 22044
11323 22044 19729 16075 12423 4833 -2776 -63285 -58039 11139 10027 40599 68445 77196 53613
11310 53613 44117 12463 7404 9622 20730 49443 79667 48685 57816 35742 34240 29945 11715
11297 11715 18975 27918 9557 20894 66269 65954 5020 10957 31622 47386 89075 89729 78519
11284 78519 32392 34236 8227 47 -259 9700 -338 -33456 -44156 -66177 -56679 -59091 -36550
11271 -36550 4926 26987 -2248 -18197 11032 27397 21267 21012 17889 17332 27385 46827 61572
11258 61572 51585 30965 22831 21164 269 -186 -10953 8787 -7245 -17558 -9118 -11419 -2977
11245 -2977 -31095 7912 28113 20051 19466 1618 20416 11783 3585 1343 -9526 7102 -25667
11232 -25667 -21118 -24705 -19019 -16446 -10371 -34936 -11639 33610 53450 66628 48011 9895 19387
11219 19387 33388 26934 16152 29210 64657 104392 95793 102069 105069 90327 41191 -13172
11207 -13172 -51702 10455 70075 55407 62264 58714 22800 46685 102898 91055 69616 70306
11195 70306 64486 44457 73305 69081 56295 61309 74176 87950 80908 71941 91133 139988 178822
11182 178822 140692 91070 43158 -15528 -6157 -16014 -20449 -21081 10055 53007 48913 47658 45649
11169 45649 61698 65955 54431 65276 56062 44778 16320 9793 22863 55455 110767 86714
11157 86714 51180 80884 80529 71971 83517 93855 110646 114414 101059 88826 62012 55022 62054
11144 62054 37586 29978 40821 -18118 -36606 7816 22146 3187 -12626 -871 -4148 -15276
11132 -15276 -41581 -41063 -39138 9514 38500 40553 105211 175664 211848 210499 251156 310562 366548
11119 366548 415192 516559 594320 588913 528093 470595 383879 294223 242587 208493 238131
11108 238131 221811 213446 207534 147559 111375 90111 56494 28021 18363 42342 28244 7472
11096 7472 -10171 -28668 -25471 3285 28305 54822 41217 17215 54594 30733 -13886 -42067
11084 -42067 -40930 1045 25597 8176 25315 14638 2306 9975 59178 34543 6573 11982
11072 11982 -2865 18322 8253 -1976 4946 35794 33802 18699 -9259 28355 50440 49748
11060 49748 67901 75704 64057 44199 18304 19834 1155 -7961 27835 55437 75237 95857
11048 95857 109309 120638 83856 88262 82554 93702 152664 153105 117331 112686 166324 172171 140804
11035 140804 166973 173080 206802 256850 248849 228441 222296 230326 241530 228295 201979 182498
11023 182498 215731 291242 342872 336724 332731 335911 302239 276754 226591 153283 121473 111065
11011 111065 111056 134675 194642 214355 239501 256070 232470 165491 142383 113577 81943 85504
10999 85504 122517 128554 103259 108603 96215 86626 80047 82758 76740 56847 36600 22926 31823
10986 31823 12825 -29082 -56197 -2073 23819 -4473 34453 47334 12087 36558 53890 44743
10974 44743 52948 56082 59650 62625 43524 33768 19721 24456 39622 11770 -11076 19509 33036
10961 33036 52903 51861 54573 21365 3866 -12850 -2286 23397 79255 94393 141874 110904
10949 110904 112839 109559 83907 84710 105858 108411 87077 121705 126264 143327 158888 164937 143504
10936 143504 137170 176846 217232 200515 207912 232110 260869 285190 335603 373074 412452 462559
10924 462559 523744 585543 673980 750841 862055 924526 987724 1075413 1138079 1212811 1266583
10913 1266583 1244214 1198190 1127352 1030970 937139 884035 832060 768470 723899 614670 524166
10902 524166 470330 408262 360576 303701 308412 318812 270516 264351 258987 260693 242633 212318
10890 212318 194437 151451 165904 162607 173301 187790 173608 169427 193234 172027 125259 111783
10878 111783 130107 129375 102659 116385 133648 135857 131957 100428 66302 52595 79657 62330
10866 62330 52369 47873 98066 129482 151641 133283 156465 195763 180609 206063 230016 265916
10854 265916 252724 228893 235428 232520 184021 126001 142840 192644 165479 165210 166857 141153
10842 141153 127244 173726 152400 126820 156423 192910 193206 176459 160385 204107 214440 192040
10830 192040 112766 87588 109667 155861 173795 149065 115759 144944 182211 163961 153998 118063
10818 118063 111520 131257 120042 81344 79901 102412 116336 116763 109791 75565 86991 84104 88549
10805 88549 155181 166995 123601 122891 168789 213710 262198 331750 349646 354068 357246 346905
10793 346905 302703 296558 281928 224425 220162 222703 221127 231999 231592 233765 217893 184885 196897
10780 196897 190295 199633 247619 301788 242499 241147 275244 259445 269869 272259 261805 248039
10768 248039 269511 258597 251458 303823 377318 394705 380012 381188 390820 352233 348348 375921
10756 375921 342685 345712 376398 402965 392617 376987 406808 406055 408705 431811 476681 490810
10744 490810 492708 524061 555812 614281 632466 596786 610505 639894 667244 695230 715631 709938
10732 709938 705177 722749 781866 805206 844217 869272 903455 900426 941733 955935 1019056 1081573
10720 1081573 1096490 1160222 1239066 1303365 1358429 1415751 1476140 1547236 1565046 1627008 1724145
10709 1724145 1800405 1905034 2008101 2126178 2253458 2402748 2580452 2745968 2906777 3047565
10699 3047565 3228185 3451538 3732500 4000695 4342983 4771929 5239896 5768011 6362157
10690 6362157 7025871 7749319 8590080 9553853 10683734 12036715 13626098 15544443 17876328
10681 17876328 20758843 24411551 29035119 34933162 42503705 52132865 64091141 78111528
10673 78111528 93013267 106213069 114585726 115874183 109927414 98741773 85179895
10666 85179895 71705502 59659468 49519497 41277150 34654697 29302098 25026364 21596163
10658 21596163 18768351 16427658 14510959 12853520 11420071 10207160 9185261 8314659
10650 8314659 7583445 6946365 6404044 5945083 5521542 5179806 4844134 4560623 4327376
10641 4327376 4101020 3873786 3694108 3512101 3344806 3263316 3189137 3117459 3039271 2975452
10631 2975452 2959095 2927586 2924907 2939095 2971839 2977884 3023965 3179328 3397242 3733376 4166449
10620 4166449 4803300 5679230 6849565 8518195 10775851 13594970 16468643 18617479
10612 18617479 19471771 19106224 18104441 17153112 16731336 17151741 18674191 21598346 26090647
10603 26090647 31892257 37697089 41361109 41490968 38717877 34809172 31414640 29411402
10595 29411402 29141248 30772574 34508897 40445232 47983847 55005066 58340678 56338478
10587 56338478 50317014 43093974 36841474 32479938 30061716 29559440 30894256 33904328
10579 33904328 37967335 41395498 42081581 39239468 34002739 28281210 23466602 20034320
10571 20034320 17951821 17027211 17126635 17869591 18883057 19481560 18947326 17123635 14434369
10562 14434369 11607266 9175096 7299872 5838061 4753960 3935184 3295569 2847738
10554 2847738 2507588 2260260 2093946 1872236 1717054 1573211 1452879 1375186 1279157 1208167
10544 1208167 1174016 1116749 1094324 1062653 1030018 1003777 939474 898310 864830 815615 749431
10533 749431 716665 694678 650403 639594 661392 639177 600426 543320 531910 585250 598743
10522 598743 596321 541550 476515 470077 485298 447049 403227 383478 358381 377644 395440 370266
10510 370266 368894 369760 371228 363131 358923 365486 344669 302337 318355 354525 332907 278762 271687
10497 271687 265796 240699 259351 295995 326521 295583 301559 307435 301629 290036 291134 314216
10485 314216 302207 247230 228027 211750 199420 227375 275860 286083 248726 266564 299269
10474 299269 301007 263090 256418 270791 281773 244526 224036 240377 232291 216258 223118 254764
10462 254764 239076 265953 288689 267033 243798 236785 240972 218944 203317 220040 236522 233783
10450 233783 235429 261597 258321 252663 275028 280003 270084 244514 228201 206032 191294 177004
10438 177004 176104 169373 189999 216736 210445 222936 207465 173433 181359 170078 157139 130671
10426 130671 125685 144545 173427 166477 186335 160698 105497 89974 83717 66662 119828 126302
10414 126302 98336 102757 76735 94285 108282 103458 94131 114526 107536 112745 116585 119761 106237
10401 106237 82769 74836 135370 182736 195080 185940 163856 123161 122806 136375 105429 82224
10389 82224 97429 105464 89272 61538 70939 106395 108408 95945 118801 121756 104401 123513
10377 123513 117877 113023 113072 131331 158006 149217 106559 94016 48144 46144 38539 41623 76728
10364 76728 97509 111502 100038 71479 71644 65488 100165 115520 120929 107544 110687 97986 89282
10351 89282 88081 123527 110846 87510 95822 127886 124574 76800 24053 9578 32995 53772
10339 53772 59358 60356 45682 56953 87236 123427 136385 96946 125477 126142 87332 64696 78792
10326 78792 98352 83359 30906 -12669 -31288 11409 54883 38564 15334 32933 36255 14666
10314 14666 40219 82356 124044 124693 100398 96677 113440 86752 47752 38610 57347 71234
10302 71234 101906 133590 149864 126989 86034 62502 65833 72846 92383 76506 60445 39312
10290 39312 56781 108915 141843 157628 141350 80691 55961 38519 43386 36188 46788 93280
10278 93280 144530 150630 157431 149287 174780 151860 85417 58527 89718 122509 156501 166102
10266 166102 145391 107190 97950 97012 89407 96791 109416 116398 74322 24441 59561 102519 99144
10253 99144 80068 55048 29681 26426 62723 72402 62250 69534 81531 108550 134196 119272
10241 119272 96775 94987 122706 128253 113090 68920 90674 144511 186776 231986 231563 197462
10229 197462 159968 144035 166232 178627 200910 246107 307972 347656 405879 451453 535681
10218 535681 595283 630121 631556 623179 550662 506974 459525 440557 415808 352506 348927 325242
10206 325242 293498 325803 304584 256207 219788 203144 197183 210276 210169 184592 168912 204891
10194 204891 253555 308549 358943 424896 546127 663970 738367 815752 830426 807941 726509
10183 726509 629577 546202 493574 447802 414151 389540 353759 345166 285422 272499 288864 298639
10171 298639 265321 276815 298680 303115 336157 357002 397610 476681 524123 465025 422593 449610
10159 449610 465019 500842 631101 763639 901071 993869 1072657 1126964 1097484 1003919 861792
10148 861792 756624 654183 605557 540170 457916 413405 389487 404335 408344 413651 419051 369362
10136 369362 341286 320930 242699 202392 202414 250098 231725 224313 226352 190327 146834 136932 113254
10123 113254 107909 89761 70670 69824 79596 50204 49342 57552 66181 54103 44087 36184 35498 52127
10109 52127 60625 31122 13892 32268 36475 48786 45979 45928 54664 79100 64989 33228 38857
10096 38857 19722 4181 17669 16051 37384 53363 19599 27222 32965 64803 64324 14577 2792
10083 2792 -1877 31695 67601 76526 49852 31734 56255 43708 25000 -24609 -1129 41064
10071 41064 74654 42555 -3959 -50339 -29647 8510 6960 7941 -42425 -79366 -76468 -43633
10059 -43633 -18108 32932 55122 92533 102670 78556 48067 72614 95411 70818 77219 55979
10047 55979 34604 437 -10999 -20690 10593 25850 57579 77744 96934 111264 111308 115601 89021
10034 89021 71140 53662 30857 9803 34659 28058 14740 16151 61908 38547 39207 42436 -16516
10021 -16516 -724 14223 -13873 16339 30712 48933 70903 53597 9535 -8612 10932 20998
10009 20998 -16652 -32072 -31550 -28299 -29342 -11206 34405 57568 25129 19371 8518 48146 60645
9996 60645 49058 17658 39026 56675 57335 75543 94057 73140 26534 21426 -12075 -22604
9984 -22604 -54464 -54065 -14355 -2392 5371 -4178 -11172 32915 54362 66093 103081 133465 117899
9971 117899 100862 122408 164365 146220 113461 102568 84482 72358 27100 24454 49297 48285
9959 48285 26464 1181 -5067 19796 36050 76645 73159 79016 53937 55265 70676 77472 66933
9946 66933 32704 44305 101848 132986 110531 85099 84016 121140 142053 121457 111791 143265
9934 143265 197056 215024 230453 251654 271782 279842 286256 275630 289499 301800 283179 255926
9922 255926 256066 221420 214898 222195 213496 184244 140255 53168 20327 49861 69884 72190 79349
9909 79349 72249 89620 112188 78686 51855 27796 47428 92107 82447 59360 35374 35583 43126
9896 43126 53434 55075 19646 15027 13157 34010 31710 35723 37421 40994 26338 2342 8693
9883 8693 2069 -10429 -32221 -11892 -5967 -21464 -42356 -55118 -59789 -59159 -15211 12590 26492
9870 26492 -1400 1365 15140 15344 -52 42993 41172 9908 -39537 -51407 -80550 -87992 -76323
9857 -76323 -48724 -53220 -28859 -42260 -22646 -30041 5270 15039 42244 53277 41356 15179
9845 15179 -6443 -989 21458 24240 -38101 -54842 -49744 -52784 -58445 -60979 -67351 -45292 -34672
9832 -34672 -32111 -20143 16246 22528 60190 70814 85846 86847 70053 72457 81438 23843 10458
9819 10458 15061 11191 -51013 -67011 -28166 -15307 10546 51337 43804 25722 -6695 8005
9807 8005 54442 45174 4343 -23718 10298 32084 660 -20354 15557 32390 4104 -26242
9795 -26242 -18755 2234 28885 49265 65893 97350 65505 49682 28792 13360 18423 20210
9783 20210 34774 -26311 -38231 -12486 -27234 -44252 -61457 -26647 19084 50165 29782 -17300
9771 -17300 -19416 12156 71486 125065 131499 103699 74013 61143 24685 10285 17319 19747 12654
9758 12654 24452 44323 44355 30059 5271 -4045 370 25577 19637 10766 17109 -9613 -23286
9745 -23286 12147 50097 75804 58113 43016 57810 11075 -43592 -43824 -31957 10086 40577
9733 40577 53170 66766 60205 83041 94808 33446 50693 70897 70298 65293 20031 -12554 -4699
9720 -4699 10578 -11418 10876 18086 12395 30519 54633 56859 48609 62005 54145 38224 3824
9707 3824 -9618 -21608 -21120 -3527 52628 61709 42862 41793 20160 21309 50692 57781 40243
9694 40243 -2383 3965 26973 29810 69600 41895 33592 60385 62612 32806 33708 27866 38213
9681 38213 76915 89238 44620 -2570 2641 10836 27804 66080 57373 45569 39343 3460 -35356
9668 -35356 409 46323 57486 71444 83451 46309 12415 34436 50318 34050 18087 35520
9656 35520 37529 68426 115488 120724 160860 196774 168770 115778 95915 84290 38220 24622
9644 24622 32554 18448 -5630 19587 36104 27738 18729 32365 -4699 -67678 -40789 2959
9632 2959 -9159 -6929 -16284 -33571 -10962 22147 -17302 -25513 -35391 -46674 -23240 17101 16504
9619 16504 14188 67801 55260 29587 -15476 -32453 -28072 -40132 -20361 -1044 -28707 -34393
9607 -34393 -14160 -15349 -35217 -5536 36431 40637 14380 13764 16678 35300 57923 32560 21353
9594 21353 3990 26758 27120 15889 18860 31022 33302 -4206 7367 13349 132 -39304 -53125
9581 -53125 -56343 -3629 26851 -7566 -9131 24537 22254 -11104 -46993 -14382 -15551 -66451 -82580
9568 -82580 -102055 -101333 -53352 -27587 -20960 -18636 -22270 -6940 -22426 -20441 22149 23463 20105
9555 20105 -23031 -33373 11010 22521 9712 -33535 -31791 -22847 -9492 -28332 13745 37073
9543 37073 5592 23730 56806 33550 -5865 -2445 -29361 -19529 -24942 -21419 -13356 5845 6956
9530 6956 -5181 21785 28068 29627 17084 -10168 -29021 -33187 -63952 -34449 14436 26440 27102
9517 27102 -8154 7692 24534 -6631 -34144 -33676 14945 18320 58357 61937 40853 41057 11811
9504 11811 1830 35305 54754 32639 8359 -38779 -56767 27616 22782 42921 48001 168
9492 168 9093 2629 17910 29024 39106 57668 46575 31654 20286 26603 -2826 -23745 -57988
9479 -57988 -60819 -27470 22550 37359 59334 67908 55014 4466 -41266 -14538 -20154 12850
9467 12850 48033 53656 33209 15648 24736 15448 18913 15887 44403 22434 45032 98336 113159
9454 113159 82708 60521 49339 23531 31856 53869 9240 7576 8339 -5919 -16747 -28442
9442 -28442 -36188 -30393 -25439 -31079 -31741 -26422 831 -14812 -60748 -34535 2637 43779 42940 39637
9428 39637 19714 26068 36265 49363 19963 -2220 3266 -17648 -45027 -11327 66347 54358
9416 54358 30618 46510 43717 21674 51170 28795 6814 3151 8607 5568 752 30232 42238
9403 42238 30868 17449 38592 54323 7967 -48146 -37905 -12473 48459 15785 -10486 -6842
9391 -6842 32267 52732 47449 19773 37171 33528 -8778 3534 33490 28653 1319 -9035 15149
9378 15149 -31904 -91672 -77984 -670 34687 10804 3240 27449 26078 12032 32538 38482
9366 38482 28550 65456 87376 84851 72515 26377 -24850 -42709 -29003 4438 9360 33907
9354 33907 86491 108172 107238 69831 35915 28517 14361 10033 37593 28308 -192 10530 12896
9341 12896 16060 27624 57838 71753 75651 84063 50930 16683 -25038 -77535 -88240 -79196 -37802
9328 -37802 17753 32619 49476 29476 -32862 -27601 30180 59222 59176 32356 -24870 -67523 -45003
9315 -45003 -44945 -45044 -9893 13259 12503 4062 -7895 14636 38543 73416 104878 65713 45692 35629
9301 35629 11338 13219 -29138 -49140 -14660 -4407 20391 49564 16051 -45854 -19939 4758
9289 4758 41526 27896 6576 30554 53979 51890 28058 16439 12326 24202 21726 51308 58706
9276 58706 21941 7617 -7141 9251 25670 16925 23349 41507 39748 30581 -6812 -19393 2657
9263 2657 52813 43756 39000 30106 27284 20899 58354 48212 -1283 -37182 -16468 19323 29755
9250 29755 25085 25874 35314 33027 47897 34995 18022 -21410 -61613 -24580 -20230 -12258 -18167
9237 -18167 -13065 5514 29802 55791 36785 51044 51597 12229 -47603 -32680 20406 32987
9225 32987 28762 43357 58946 35130 -13890 34279 71812 66540 54958 52470 6692 -85285
9213 -85285 -75766 -5699 24066 47360 56204 24167 12550 19839 16041 18968 39451 15181 -17308
9200 -17308 -3249 12137 37048 13767 10790 -8007 -36379 -28823 -26619 -18068 5620 24890 23853
9187 23853 21337 -28402 -88973 -110844 -81815 -77286 -81076 -51593 -9680 -26117 -39474 -36263 -37282
9174 -37282 -29204 -49257 -34899 -5701 15943 -10020 -3819 449 22137 10955 27191 52224
9162 52224 48175 29942 27540 50622 88349 76443 52551 84427 80965 47179 70131 79354 78285
9149 78285 51469 -2735 -14241 -12208 7166 23536 28928 10434 -2066 1764 9172 10728 11636
9136 11636 3161 -30029 -84236 -99471 -70227 -89655 -110340 -116242 -72175 -38635 308 16066
9124 16066 13371 27370 50681 48037 39544 9439 10566 32265 69234 86894 44641 3573 24347
9111 24347 21995 20775 11069 -46703 -35495 3806 3098 -21097 -4964 2864 16258 731 -6833
9098 -6833 -26276 -46687 -59881 -37737 -48045 -30948 -36554 -34854 -53313 -83583 -102241 -65095
9086 -65095 -10347 13606 20433 23966 13908 -1915 5558 -4923 5148 35568 17204 -3892
9074 -3892 96 4176 901 -10839 -4641 2367 -25310 -46316 -3329 37047 64301 67205 64663
9061 64663 65001 49971 51573 61414 54779 61127 51699 -4201 -10646 2455 7556 -15782 -31379 -21278
9047 -21278 -3580 25393 19034 -5481 -6765 23289 25042 14528 38094 66857 96187 85735
9035 85735 72692 50315 -2960 -35002 1302 9913 30217 54572 36141 56127 43113 4891
9023 4891 941 26772 56030 47773 63897 104270 81850 59747 66385 -1052 -3949 45124 64291
9010 64291 74314 67621 48158 72065 68280 50660 73446 59836 47164 16566 -1409 27461
8998 27461 14985 17129 16168 1714 31091 31844 22204 42769 24927 -45857 -13107 26071 33081
8985 33081 22898 29166 3177 5201 12183 22099 29599 53374 65042 60937 40283 71862 101922
8972 101922 81575 126013 108527 70937 53901 61892 111015 138157 134337 158493 126570 64805
8960 64805 39357 43305 36870 47902 118326 116009 68681 76063 76741 58872 52971 19561 -12936
8947 -12936 20611 30613 4181 41884 49125 23441 54418 48799 11917 7007 8626 -14390 11671
8934 11671 35014 53077 49458 40772 67437 74507 26583 18528 6134 -9465 9391 61056 44714
8921 44714 21040 43387 65565 22616 45322 35385 45478 55417 54016 45205 2635 -15975 -33437
8908 -33437 -5805 -22919 -28157 9334 20905 26879 21518 48315 21859 3634 -16229 15071
8896 15071 46429 56711 40651 27380 -603 3232 1211 10383 23940 43881 34409 39835 33761
8883 33761 3461 -12323 3176 -20844 -10473 -64070 -71832 -33625 -31408 -7287 13857 6108
8871 6108 -3885 -579 19130 10794 12389 43598 49073 -4181 -8650 21725 37904 36841 48151
8858 48151 82063 75185 52450 53230 59440 56282 52806 46210 40405 25098 12604 25907 19179 10867
8844 10867 2167 -8762 -40749 -66211 -35768 -16166 -43007 -46412 -49713 -36003 5206 9116 2882
8831 2882 22525 6138 41351 78072 48103 51143 24825 -3576 -8167 21547 -369 -26230
8819 -26230 -2054 4011 45112 26736 6314 10391 29346 11619 25700 65347 56345 25126
8807 25126 34134 9716 1562 24623 43612 60895 56958 36069 14367 37406 50271 66918
8795 66918 38789 -14731 -39368 -29174 -58954 -47587 9619 61099 47231 8250 -10356 -13027
8783 -13027 -40390 -31734 -33580 -46486 -27587 -6338 2768 18638 25883 15054 2674 -17000 -42461
8770 -42461 -43766 -20905 10991 5602 28071 52027 66832 84044 80489 28445 -11402 -26809
8758 -26809 -25445 -4373 -6293 -14891 6452 38239 81301 102545 105598 95969 83645 88853 60613
8745 60613 48600 36824 17434 51096 60778 51247 36040 54125 50426 34199 20476 42656
8733 42656 76985 106822 71754 51996 56400 51124 43753 53867 50911 36798 70751 81299 63407
8720 63407 53102 36358 17581 18504 6659 -2165 -10916 5144 48184 63077 48112 40144 2739
8707 2739 14739 54424 75584 81037 79168 79758 112673 98590 54966 51359 45523 51533 54713 53395
8693 53395 41998 20993 11869 19913 33125 31765 21869 29395 23736 45274 77691 97409 95949
8680 95949 75992 78242 66268 55676 30775 12031 27077 45817 57419 41462 42206 59843
8668 59843 74013 58205 59952 49826 83757 110225 46942 7762 20375 72320 58508 50810
8656 50810 -13412 -41968 -12728 -16565 -18412 15120 39780 57642 67745 37321 -2115 12382
8644 12382 9411 -12910 -33333 -71038 -28605 -15904 -9326 2209 -8130 11748 35137 35248 18050
8631 18050 13003 9724 27063 60775 85963 57846 -15835 -33480 16226 37307 25002 8646
8619 8646 26678 49650 73827 94300 128950 136169 112522 116698 101828 88546 66893 29263
8607 29263 54284 81653 52797 54244 20853 -9274 624 4011 15321 18932 -691 -24595 9811
8594 9811 -8582 -42664 -42237 -7482 13613 26645 59002 81045 100852 102454 87852 96775 115710
8581 115710 123479 107777 128634 181408 149235 119436 116111 101353 115949 117522 94852 74269
8569 74269 73348 11184 -32665 -1300 1779 31910 81724 93625 80428 82754 69347 47587 37901
8556 37901 1784 -26 37816 39577 37746 33349 13914 11081 4724 14344 65198 83546 99320
8543 99320 82483 55222 73133 57097 40462 23087 1203 -3403 44078 55306 7927 1485
8531 1485 -4022 49830 66445 63250 54753 43691 -26571 -26525 -7535 11287 5683 49929 26142
8518 26142 29907 9447 43726 58331 46743 46207 37596 99 -5172 11010 20654 28861 30895
8505 30895 6540 -20677 28725 32331 34317 16859 -62935 -80030 -80014 -51020 -12304 19155 17351
8492 17351 25877 51850 50972 -15735 -47058 -26135 -9725 12903 22984 32961 -672 -3958 14986
8479 14986 28135 9399 -3878 -9494 14527 -204 11485 31003 42178 42102 68202 94447 62388
8466 62388 12401 -1124 505 -6724 554 20768 11329 11807 21574 49946 49642 62953 32918 7529
8452 7529 -10055 -11665 40786 37467 24026 6137 4638 25184 36434 49552 83835 132204 103870
8439 103870 67818 69056 58338 22402 -10484 4004 60112 78318 50898 47314 60054 51876
8427 51876 -24091 -39414 -22537 34261 85973 90070 30058 -34487 -12424 20849 38820 45365
8415 45365 48379 25865 33627 45692 43395 50286 41683 14894 -17396 -21630 -8861 -37944 -32690
8402 -32690 -1465 1214 -72863 -66347 -7194 -18353 -11475 -16742 9356 -9627 -25385 -22542 5768
8389 5768 22222 28611 18983 -55 12651 37940 32167 36240 9666 -23730 -14767 -27690 -29591
8376 -29591 -36501 -44774 -15554 -223 -25196 -50350 -12076 26015 25786 35918 54912 62138 26558
8363 26558 28959 64407 85633 56122 27439 25992 -2616 -7747 -20176 -10737 6767 41950 18297
8350 18297 870 -4122 -39671 -8005 46915 40875 10263 -3500 32826 29102 29303 29716 51033
8337 51033 37697 12292 18994 33756 51822 56553 56839 43199 -2045 -16929 32805 11744 -6413
8324 -6413 17521 -6373 -35190 -42742 -24689 -11326 -42472 -71847 -84273 -62668 -36275 -41711
8312 -41711 -39726 13940 32680 21880 10794 -8841 -41718 -42891 -46049 -46669 -56271 -58134 -33201
8299 -33201 -1138 -104 -44684 -47135 -20073 -64137 -56079 -55148 -64290 -12408 7602 4063 -19607
8286 -19607 -6729 61043 55829 6478 -22862 -13259 -22185 -14552 -10149 -3306 -2585 16549 -12050
8273 -12050 -5319 21394 2221 -18374 -42753 -17950 41146 70418 65364 31348 20710 21063 -31156
8260 -31156 -9867 -44578 -57659 -52042 -40494 -6524 18294 2663 1753 -10897 -4555 -31060 -26179
8247 -26179 -60023 -52919 -34577 10498 58210 67500 68270 27778 -34050 -51878 -31418 21149 40785
8234 40785 52922 80736 125523 98805 47824 40431 30652 16460 14184 -10351 -1839 17164 27706
8221 27706 12319 -321 6304 15070 -5802 -27119 -8770 -59206 -53846 -41682 -36345 -44993 -75918
8208 -75918 -62122 -34489 3439 -4648 3344 386 6095 -8309 -10323 -4185 -1300 -5950 10927
8195 10927 17931 32055 30796 23798 19271 24236 7778 14304 8449 29956 70108 64567 33588
8182 33588 -8347 7608 56763 45630 30533 13632 9485 9548 3325 1390 8280 11721 19520 40317
8168 40317 9319 -17375 27723 51739 11876 -22133 23611 25140 21459 20810 18995 42888 55077
8155 55077 34839 16803 -20639 -50129 -49272 -50618 -42300 -40289 -41820 -14284 31713 42706 58457
8142 58457 2492 -17900 4034 -4024 -11006 11655 10954 -2931 -19124 -18988 13248 4187 -42543
8129 -42543 -9954 41176 35117 45099 38282 61506 104456 72762 17114 -13661 -34108 -43625 -39234
8116 -39234 -18452 6277 26568 25901 30249 56790 28363 1687 12262 46123 39004 58904 24155
8103 24155 43484 60540 75226 100313 81083 81205 74282 27956 9030 12630 -2548 21322 64472
8090 64472 56122 48815 30042 51184 48993 -8098 -1740 50497 107331 82511 35438 44972 24916
8077 24916 23646 29312 23991 24909 35521 -2298 -50537 -45291 -4244 9609 -27044 -32796 -49313
8064 -49313 -27136 -42834 -47008 -22957 -4855 -16634 -13146 -10986 -1174 20687 8835 -17479 -29423
8051 -29423 -12164 39516 88824 67330 64192 31428 20604 -219 -9063 -11694 -20465 -13516 -32458
8038 -32458 -90190 -87788 -33932 4848 8923 -21235 -41247 -20450 -22297 -27455 -18994 -6175 -19995
8025 -19995 -23853 -17018 -3439 -4415 -11217 -2793 6613 29309 42911 37691 61868 112386 71753
8012 71753 35074 211 -38701 -78422 -81055 -64137 -22335 24661 35850 41171 28943 49980
8000 49980 52662 52379 62016 57500 63555 73669 83190 67903 28587 -29885 -28812 6070 1954 -3527
7986 -3527 18828 32487 34273 7147 20483 74782 73210 41487 39636 9878 18608 23321 7010
7973 7010 -5200 21755 16801 12791 298 -8059 -18690 -30544 -13439 -22208 -53479 -66388 -26966
7960 -26966 -2755 208 -9065 11627 20957 37055 62895 74522 81541 91354 86148 76619 82700
7947 82700 72723 50154 31250 26363 16424 -799 14918 12286 13859 9251 25182 23929 -10784
7934 -10784 -46442 -27397 -15759 -9769 -573 -17856 -9574 -5327 37035 48133 63561 74976 76209
7921 76209 14402 -94 14032 38244 33689 42403 32173 -12244 -23732 4214 11702 37924
7909 37924 35976 26855 19832 18586 42732 62438 52225 -6963 -6425 -8516 3421 28038 69866
7896 69866 54095 61973 51341 50999 43367 22369 -6209 39878 60830 -10734 -43728 -47835 -42941
7883 -42941 -8060 16885 9305 -2613 -39328 -29496 9452 10977 11771 17396 27915 10625 -15849
7870 -15849 -31160 8663 28855 33763 18079 -11086 -2208 12657 -7583 -28498 -31390 165
7858 165 4895 -15188 21687 8036 -25503 -25384 -60534 -37595 -14076 6511 39156 38336 18326
7845 18326 1633 3795 22154 -29935 -67282 -30744 -39637 -55487 -30768 -29368 -21508 -30358 -56667
7832 -56667 -22032 -32219 -74769 -63000 -39067 -59558 -82174 -56365 -39268 -65829 -41594 12631
7820 12631 65450 40075 -31578 -22097 -2507 10613 -6430 -340 -23574 -32772 -28208 -20954 -32007
7807 -32007 -45074 -23904 -27462 -63859 -15249 27224 25744 39321 26040 43117 14991 -12306
7795 -12306 6665 21439 268 6206 -24643 367 17759 13499 1517 22548 43510 11684
7783 11684 -58934 -75195 -43784 -33668 -20828 -35134 -41646 -36003 -30658 17440 54642 42542
7771 42542 41720 281 11524 12904 56322 19920 12570 72863 62106 73736 35390 -36114 -58104
7758 -58104 -27361 -25816 -11041 -3377 4349 -32770 -58753 -13808 25030 425 -25284 -16591 -5023
7745 -5023 15695 18131 11174 -18692 -36642 -20225 -31074 -26360 -39396 24258 30491 -16907 -17196
7732 -17196 1517 35544 66362 57778 1568 -3231 -23684 -15529 -2524 -12200 -40621 -10172 845
7719 845 -13299 -5754 -2773 31791 16005 22354 39890 635 -43123 -48612 -41521 -14155 -7984
7706 -7984 31025 36415 32021 36768 57962 52577 33630 3440 3470 -16361 -15651 -40238 -19901 -579
7692 -579 32431 38592 31441 23459 19257 32027 17092 -28719 -54128 -25386 15941 -3802 -34049
7679 -34049 -56634 -74408 -48784 -5135 13443 14115 3125 17484 -27 -32891 -49525 -26928
7667 -26928 21251 4587 -11805 -26446 -33450 -6272 -3693 -3997 19718 11876 -54879 -45024 -33417
7654 -33417 -57662 -22001 -20965 -7032 51669 43201 613 -2371 51849 45581 32229 11242 -18142
7641 -18142 12129 60311 71137 53081 24526 17682 37711 4037 -13296 7052 -8539 -14930
7629 -14930 -30600 -18555 -5298 -25668 -54494 -66694 -51647 -9151 -6087 -6821 -9295 -12224 -2258
7616 -2258 22715 20515 25993 30079 -10630 -46553 -58203 -73760 -46615 -17656 -397 -5610 -10156
7603 -10156 -66768 -67182 -31204 -5378 -12870 -34269 -49853 -28662 -9023 -5947 24753 33670 53679
7590 53679 58762 -12849 -28389 -36478 -37353 -18435 19181 70184 85416 50368 50419 47303 -44085
7577 -44085 -92296 -45154 30855 28390 -3478 -8555 18505 2209 -48025 -66826 -44157 -17826
7565 -17826 -30694 -24583 -26732 -15759 -24982 -36621 -35986 -61010 -64360 -13299 -42528 -37898 -7237
7552 -7237 -10185 -42164 -65768 -55774 -85874 -61755 -6271 -25424 5326 -5882 -9612 4818 -3138
7539 -3138 -3520 -21921 -45842 -64666 -73616 -39640 -19740 -28618 -9993 11106 -4402 -47232 -25404
7526 -25404 49235 66007 15224 -52441 -40270 50078 98706 76459 29689 -18458 -41546 -86306
7514 -86306 -79423 -55964 -22494 -43671 -113920 -133969 -59992 -22728 -3768 13468 -9128 -35382
7502 -35382 -23295 -11195 -28112 -33310 -32299 -41716 -48811 -20658 -27136 -17574 -205 12313 64392
7489 64392 88872 75241 45139 71670 58743 -22282 -39740 -33283 14393 41816 20729 27725
7477 27725 22776 19475 29492 -7406 -7827 -34750 -36010 21812 50120 35742 27231 14799 -24677
7464 -24677 -39264 -6174 -4704 -29280 -46746 -57322 -36246 13440 38574 42629 6853 -16136
7452 -16136 -22590 19048 45875 46315 56107 42726 5436 30563 15356 3545 -32591 -20769 -13021
7439 -13021 43855 91813 73821 40855 56637 50429 12328 -30044 -57585 -52758 -332 15419
7427 15419 31887 40435 1852 -13347 -24822 -50708 -65568 -51890 -19655 24002 10102 23702
7415 23702 26748 -2519 -30726 -38930 -17777 -22722 3176 13196 -36222 -53455 -43935 -31339 -38296
7402 -38296 -31490 -42550 -36928 -16773 -39286 -36090 -22640 7475 -43056 -34135 11192 53615 73903
7389 73903 19738 -28910 -13547 7409 -18119 12118 60996 63495 51684 23335 16318 16605 -3370
7376 -3370 -33859 -19350 6358 38010 37708 55214 26081 5566 -45539 -66557 -55482 -4539
7364 -4539 -42355 -118472 -111576 -55022 -31518 -39989 -25429 -34873 -11438 -2348 -28800 -636 7880
7351 7880 -27013 -55818 -79846 -62021 -4188 29225 -14633 -37559 -2044 -2343 -15972 -25955 -45056
7338 -45056 -57310 -7891 6871 57154 66999 46846 34619 38104 60306 63081 -763 -19517
7326 -19517 -438 -7658 -30404 -43418 -63775 -27940 2046 4340 -5466 12490 4921 -16056 -31943
7313 -31943 -5841 -5255 -38144 -58177 -61457 -57880 -14827 13190 8471 13287 29816 4999 -23295
7300 -23295 8836 18080 16180 42777 69213 80421 44883 15035 23218 -10064 -2465 50811 74096
7287 74096 62920 35154 22618 -5918 -20646 6428 2872 -26344 -25735 -12136 10572 7424 13538
7274 13538 40933 40425 34864 50544 5406 -6396 -24944 -58573 -42981 -9918 -41591 -84071
7262 -84071 -73192 -29566 -8208 5487 -27900 -46870 -68052 -63635 -11405 7111 35066 43269
7250 43269 -9007 -39477 -40209 -25035 -28080 -26025 20410 13895 -37245 -40713 -10478 -5711 -16385
7237 -16385 25968 35706 11608 -3242 -38560 -71265 -41228 -24866 -23214 10365 25798 64720
7225 64720 37150 24043 18052 8649 12293 7315 -18528 -20282 -21198 -49408 -25200 1095 -15884
7212 -15884 -7765 -6446 -39918 -46852 -15183 3842 23237 43679 14343 -26167 -24858 -22528 -53823
7199 -53823 -34758 -4200 -10359 -43086 -16903 13846 14565 7313 -31758 -37351 -43030 -47094 -46693 17125
7185 17125 32822 -6480 -23587 8406 35016 7698 -41764 -34040 -25089 -41214 -28465 -23970
7173 -23970 1272 -13012 -9241 11125 -4829 -34308 -24725 -40762 -19997 18841 1406 -4341
7161 -4341 20358 29012 13492 -12990 -2452 22016 650 -22958 -57126 -47268 -30820 -11911
7149 -11911 -8343 -23045 -6688 751 15964 8015 -589 40055 96475 99949 75052 54611 46773
7136 46773 7667 -16757 -9505 6853 -15019 27851 53201 63545 77088 51542 60583 41599
7124 41599 -19985 -42361 -40949 -11356 -21265 15146 8459 23044 11287 -44495 -43823 -33787 -3055
7111 -3055 -10323 -31328 -28334 -22424 -10 26131 -4648 -38251 -8237 -10400 9893 41269 59165
7098 59165 28081 731 -13079 24910 10478 -11448 19702 10949 -7101 -19010 2432 1947
7086 1947 21238 50516 64303 35840 29179 9886 23657 8966 -29114 -3944 -984 -26781
7074 -26781 -40017 10223 32081 30640 14709 9140 24576 37674 39062 40356 50821 41202 16973
7061 16973 19280 4683 16117 39515 17517 13653 78490 94632 21192 -13917 19971 3876
7049 3876 -4976 10376 20811 18566 26303 4936 -942 11878 17161 3576 -24909 -11099 19674
7036 19674 23399 -8302 -36079 -24449 -49959 -59887 -65767 -41135 -66257 -53557 -11451 -6492 26492
7023 26492 16460 -4636 -34819 -53299 -12104 33138 29987 20541 39355 61752 24855 11992
7011 11992 34155 28447 -21661 -35000 -48566 -23037 -19827 -52634 -55436 -35575 -24866 -6119
6999 -6119 -21628 -26200 -33165 -66041 -45501 17491 40814 18422 2721 2526 33013 51248 62830
6986 62830 53577 61315 31920 -8018 -10253 5357 11619 19955 24485 -10994 -45140 -35415 -26790
6973 -26790 -29630 -29888 -42220 -33822 11729 32742 26531 30513 504 -19613 -67912 -98567 -67935
6960 -67935 27857 70943 13895 -17499 -28203 17313 54793 63784 69852 71281 58579 53278 29477
6947 29477 864 32482 40606 11503 -21825 -37644 -43836 -54168 -43138 -31259 -41004 -18467
6935 -18467 -28588 -47114 -72126 -114497 -77519 -29150 -36716 -42855 -64521 -61030 -51725 -21368 4475
6922 4475 -3145 15261 33459 7990 8319 33894 46517 35014 45563 38762 33844 -7199 -1822
6909 -1822 17308 7817 15760 -9190 -44100 -34285 -19898 -6172 -4708 17718 26417 11910 7927
6896 7927 -13339 -13396 -6923 -337 -24301 -60071 -61895 -23297 -28683 -27450 -47993 -52351 -36010 -12883
6882 -12883 14530 43858 48523 50463 -7772 -27829 -28589 -11067 -41073 -53834 -57205 -37135 -53810
6869 -53810 -103957 -87315 -59051 -44510 -13096 31091 15020 -13884 -9606 -8172 -43872 -51403
6857 -51403 -26167 -13196 -18285 -44227 -54793 -64345 -72608 -92419 -40568 16131 28458 11834
6845 11834 54495 39096 14708 21180 14744 -5650 5505 -21920 -13698 -14889 -62226 -82205 -43546
6832 -43546 -8610 -6581 18157 7956 716 -17407 -16477 -41876 -33462 -5929 4742 -1640 1820
6819 1820 -5557 24097 36827 55057 19671 4343 -19007 -41566 -23855 50920 92212 103328
6807 103328 36005 -33476 -25819 29316 25721 37027 9446 35363 10974 -14281 -18499 -25670
6795 -25670 -49495 -95879 -68605 -14542 -5928 -12452 -26378 -23540 -14269 14699 -16355 -48115 -5446
6782 -5446 -9259 -45044 -61271 -50353 -41698 -28852 -37983 -6572 58632 67156 71078 17880 2372
6769 2372 30040 42229 25966 -5162 -5355 -12307 -46648 -82597 -44819 11665 -27328 -55714 -50773
6756 -50773 -97125 -89367 -71538 -22989 13746 47937 32933 5609 -49070 -49087 -11723 -23630 -53954
6743 -53954 -31724 -29381 -1470 -10079 -25813 -9741 -2363 -14073 -21689 3289 2138 -25608 8293
6730 8293 31074 17783 -7042 4636 37376 20475 -7652 146 -14714 -38155 -45124 -66092
6718 -66092 -71525 -71802 -37737 -49893 -65479 -74457 -56214 -19850 -14142 -49966 -69804 -71538 -44198
6705 -44198 -36759 -18713 -15369 1156 -31787 -22182 10608 30668 23541 8213 -22319 -51899 -76117
6692 -76117 -79783 -75174 -19475 -407 -2951 -6133 2772 -17500 -7771 -16954 -5642 23393 44538
6679 44538 16649 -24311 -35453 -26833 1199 49 -47748 -18327 -26743 -33089 -21776 -10825 -19581
6666 -19581 -74839 -98946 -111330 -63841 -53307 -50263 -50075 -72975 -64534 -45422 -33739 -40497 -61213
6653 -61213 -89226 -68096 -9164 1822 13306 -3516 -9134 18746 28957 55871 79055 42992
6641 42992 6700 -5517 -34314 13355 3811 8223 -30146 -38836 -24660 -21975 -26036 3687 -13126
6628 -13126 -11885 7923 10515 25241 13259 8121 -35028 -34031 -8550 -10349 -40589 -56018 -64174
6615 -64174 -67151 -104133 -65174 -37288 -29108 -47508 -47090 -19796 -19665 6618 -9012 -22668 2716
6602 2716 14878 -5685 -21711 -48004 -30849 -25834 -49911 -55588 -50808 -70878 -78632 -36724 -40527
6589 -40527 -28735 -4146 32694 14460 22526 -4829 25548 26601 15413 -4820 -10936 37132
6577 37132 58773 15221 -18783 -24775 -6099 11819 14491 6883 21305 -38979 -46622 -54096 -46280
6564 -46280 -30337 -29322 -14644 16763 28332 34440 1622 -23857 -52396 -40496 -5422 37585
6552 37585 8111 -21425 -29811 -34047 -50118 -43661 -33713 -35587 -29978 -471 35440 8361 -23739
6539 -23739 -57983 -26625 23266 26800 1990 11853 -14336 -26628 -14862 11427 15206 -4338
6527 -4338 -40133 -10577 19494 27653 61126 59418 26553 2797 -36442 -20790 -20232 -22770 -18222
6514 -18222 -52644 -36857 -22033 -17327 -35282 -17709 -4379 -28423 9710 44457 4198 -29584
6502 -29584 -9888 41279 58764 24300 29629 11932 6705 16821 -12672 2724 -9938 -56866
6490 -56866 -80789 -59853 -60430 -74767 -84844 -74078 -46326 -27775 -28184 -23611 -29541 -791 17106
6477 17106 3036 40563 41464 49208 84127 98147 65954 28556 -12254 -38665 -28055 -23745 -25249
6464 -25249 -17154 -1846 -15258 -19449 32227 67358 37955 -10082 -9020 -2521 19552 30556 19784
6451 19784 -8215 9051 11446 28030 43400 7259 -48642 -51429 -56618 -92310 -106391 -80083
6439 -80083 -58553 -80581 -57001 -31066 -13541 -10530 -31417 -47201 -78409 -38924 -13159 1919
6427 1919 11005 -19132 -31651 -24194 -11567 -893 44104 43502 29325 18925 17800 22800 -7025
6414 -7025 -41812 -11110 17355 17909 22976 13025 25581 25589 -913 -67338 -74872 -22707 -31657 -15050
6400 -15050 3550 16241 -7005 -36625 778 44077 12810 -32682 -35223 -33306 -149 246 -2290
6387 -2290 3620 -18076 -44999 -25495 -20894 -8864 -10564 -11267 -330 -15480 -40007 -45704 -21169
6374 -21169 -9831 -6736 -12712 -5780 -32930 -19484 8762 4885 -40004 -23827 -23447 -14833 -6061
6361 -6061 27828 57676 58779 12516 15313 27923 21157 -15383 -32410 -59629 -63982 -51905 -32330
6348 -32330 -41021 -67417 -49935 -49140 -15439 10264 -42744 -42512 -29408 -2797 2500 1161 -10039
6335 -10039 -45139 -68817 -52439 -17337 -28528 -75241 -93946 -38374 1306 -3226 -15964 -26070
6323 -26070 -52010 -99455 -56316 182 24286 26604 1988 -26756 -30259 -39719 -37423 -4025 3810
6310 3810 -39597 -89556 -51572 -68378 -46602 -21163 -21407 -19753 -9915 10331 10738 8757 18911
6297 18911 -18497 -89459 -83000 -44632 6271 20430 22246 4355 1905 9452 -18765 -48320 -12780
6284 -12780 15383 1434 -13244 -22523 -45791 4358 29076 21837 34642 29392 30558 -5460 -3507
6271 -3507 25442 -113 -49717 -81487 -42756 -25450 -27205 -41698 -55319 -47050 -53107 -28874 -21403
6258 -21403 -2263 1350 -12354 -22929 -40562 -52626 -48102 -47469 -34347 -52089 -52081 -59015 -42208 -25476
6244 -25476 -39738 -4066 16109 35210 11273 14228 -387 -54 15900 -39419 -53750 -42248
6232 -42248 -45779 5502 23753 14431 26317 26390 36147 38976 428 -4811 35666 57560 38629
6219 38629 44933 48530 9291 -5293 35314 15916 798 -15439 -30593 -43590 -61514 -46406
6207 -46406 -26690 -29316 -6684 1810 33960 17408 -4705 16620 24371 -3627 -15495 -25666
6195 -25666 -9151 24856 15804 -7586 -3104 2560 5934 -14507 -6879 -3407 27852 16529 6174
6182 6174 -48014 -57926 -38567 -10357 -7857 14581 -24102 -36399 -20495 8320 24275 17213 -14887
6169 -14887 -24779 -28756 -54964 -56609 -24479 -5219 -11077 -22690 -8084 5000 -16304 -6417 -20270
6156 -20270 -37316 -19410 -38788 -46585 -58814 -22749 -72880 -103684 -96309 -84109 -82113 -108883
6144 -108883 -81440 -66828 -82757 -81484 -85174 -15515 -40218 -64074 -62487 -25680 -9299 26375
6132 26375 26112 -35910 -40011 -23029 -24577 -929 42646 30137 -28336 -58657 -23197 14174 13700
6119 13700 -9339 -45672 -23041 8625 35011 6294 14932 32680 54844 78236 53354 630
6107 630 -50345 -55632 -52749 -32712 -21819 -15340 -1190 2393 6996 1411 39659 49144 40196 -7850
6093 -7850 -24084 14004 16236 8963 47207 80916 37551 -8658 33552 34572 -7388 8914 29658
6080 29658 12933 -11569 -17618 -7199 -40800 -67460 -29012 -10666 5684 24545 647 -43440
6068 -43440 -27264 -11471 -61118 -88190 -88657 -52967 -29415 -13708 4285 49959 16357 -21806
6056 -21806 -57176 -88680 -69625 -53122 -44828 -72336 -102617 -90084 -70792 -61100 -71298 -85600
6044 -85600 -50091 -38113 -61981 -9673 17594 6414 301 -1901 -10415 -14795 -31933 402 2621
6031 2621 -16892 -50732 -56764 -43539 -46428 -18426 26090 15628 27114 159 -29557 -52079
6019 -52079 -28001 -9122 -43200 -66381 -46160 -39836 -26974 -25369 -9625 8518 30011 -1973
6007 -1973 -30543 -52352 -57075 -9654 24302 10143 28082 58382 35062 21942 52351 31905
5995 31905 -192 11114 29530 12957 -613 41918 37031 9127 6332 66927 119841 63547
5983 63547 15186 -7078 6057 -11113 -16006 -28017 1688 2392 -29275 -43183 -41539 -17701 -5838
5970 -5838 -13532 -27411 -21205 -28281 20166 -142 -7855 3567 42106 39312 37621 47753 73454
5957 73454 34989 5796 22877 11698 -28436 -22990 29397 11040 5636 1397 8229 20024 31567
5944 31567 22533 19051 -9262 -30270 -64243 -86967 -84609 -61131 -23448 -4527 26156 58628
5932 58628 61540 31070 8468 2613 -6018 -6747 36574 73362 62447 65452 16291 -3838 -34690
5919 -34690 -3396 54166 42798 32853 13409 -38523 -67654 -37361 -30026 14697 45829 10164
5907 10164 -3419 -29123 23209 61003 56918 5018 -2305 -11231 -19943 -16132 -17 35769 29958
5894 29958 -9897 -14528 -15474 -13372 -36613 -14547 -4049 13147 9114 16521 71052 70457 17988
5881 17988 -14768 -19584 -22690 -30100 -19091 9457 10983 -5313 -35272 -6066 1989 6088 22827
5868 22827 62162 88491 37421 -13318 -21208 -12061 -31080 -58923 -62980 -55679 -45726 -40386 -19425
5855 -19425 -31176 -24285 11874 7179 -38325 -32796 -33216 -24763 -14269 -15309 -38415 -41594 -77730
5842 -77730 -111234 -104331 -94694 -91398 -62153 -51147 -24621 1089 32882 9943 -19749 -18413 -26601
5829 -26601 -51189 -39066 -13115 -14504 -24872 -44433 -68524 -74650 -75041 -70505 -50736 -26165 -32393
5816 -32393 -39339 -34834 -22777 -35789 -66580 -15330 370 -18598 4134 31587 45141 51901
5804 51901 35368 -16415 3934 41271 60789 51323 18832 23103 -13641 -30131 -51507 -43484
5792 -43484 -43446 -58015 -71341 -55244 -65550 -58971 -42853 -21810 -42761 -50936 -13094 11513 976
5779 976 -24821 -35657 -32695 -4137 233 -7233 -4909 13774 38214 18324 13860 24050 39016
5766 39016 64528 25826 29498 44728 9293 -1580 -1210 -5441 32582 53914 69847 47646 22797
5753 22797 585 -61879 -85045 -107514 -118790 -69642 -33477 -36510 -40619 -15258 -10745 -47954
5741 -47954 -10242 34015 61146 78306 66675 14616 -52550 -90062 -95500 -67642 -82118 -80782
5729 -80782 -39959 -23061 -43959 -47046 -27779 -13209 44380 44772 8766 -14659 -3593 -7336 -19860
5716 -19860 -6121 13745 3850 -14580 -23044 -35897 -20505 -11625 -18562 -25403 -18672 -21979 -6326
5703 -6326 18510 30150 57152 21456 244 2959 5326 14933 9495 7514 -30882 -26073 -7791
5690 -7791 10206 -9858 -43145 -28194 -1879 16187 -17935 -39846 -13555 -4498 -34350 -82160
5678 -82160 -46028 -26368 -10751 -14603 -12031 8942 12858 -13890 -8868 5026 -8956 18650 22358
5665 22358 17722 12578 2503 21430 23940 -2482 -6584 -14504 -11455 2144 -162 12086 -14050
5652 -14050 -39129 -23270 -1017 -4369 14489 -1597 -6691 6786 -14298 -43383 -53480 -23931
5640 -23931 19007 -3966 -24136 -1452 30935 28509 44860 50756 58614 35692 -4717 -2286 -12427
5627 -12427 -48921 -84929 -87612 -60980 -61982 -91854 -47262 -9554 -9151 -9761 3956 23245 19004
5614 19004 35876 35070 39473 8375 3211 2593 -43756 2546 5878 -10360 6398 -13767 -73431
5601 -73431 -90284 -75852 -46935 -54831 -47317 9978 -1494 -63227 -78791 -67540 -64458 -16947
5589 -16947 -9019 49574 42513 19269 -3999 -18967 -26638 -43985 -64110 -45033 -26431 -309
5577 -309 -13110 -20440 -2787 16523 18922 -10648 -7517 -604 13625 9850 -17836 -21241 -21460 -11685
5563 -11685 16063 -27927 -86461 -92238 -34120 6657 47698 34402 -5277 -2466 19915 58920
5551 58920 54526 35333 42088 68752 39162 -5686 -13723 -13367 -23212 28843 26998 -3234 5235
5538 5235 28283 15176 -14127 -7972 -32739 -31718 -26795 -32260 -20412 -13752 -64060 -71265 -33304
5525 -33304 -11031 -19406 -7179 8847 3092 -31474 -72007 -81573 -57736 -46705 -64655 -77825
5513 -77825 -40135 -32353 -24659 6888 24392 -26804 -52760 -56891 -28922 -9764 10658 5753 9834
5500 9834 68456 59291 32871 -22327 -33549 14085 11225 -6403 -34255 -74883 -112312 -75125
5488 -75125 -52351 -33431 5539 -5468 -30084 -47757 -22511 -16649 7750 -10739 -57147 -24989
5476 -24989 -33248 23524 71559 69131 69624 53906 35026 31085 27278 23911 29023 -6537 -20963
5463 -20963 7113 9999 -24326 -19715 -21130 -16002 -20054 -3588 -10642 -15130 -16504 -18161 -20021 -4274
5449 -4274 -22095 -46565 -44397 -74397 -35399 11876 40935 48220 63798 27736 -36197 -20156
5437 -20156 6010 12955 7344 -25869 -54292 -62469 -58203 -53696 -45035 -41688 3914 17526 -20722
5424 -20722 -20450 -30846 -42936 -92479 -98669 -10166 46198 -10694 -33674 -52231 -60666 -34025 -16661
5411 -16661 -4502 -28254 -46663 -19599 11721 -581 -12235 -22517 -27458 -12816 -3575 14246
5399 14246 17612 1439 2026 -8721 4609 13935 18778 -9301 -81725 -112641 -99960 -34671 13677
5386 13677 62764 37333 -14504 -32557 -27134 -6101 15645 34398 28815 11436 36319 10302
5374 10302 21424 -26865 -43637 -9888 -227 6253 -40628 -36671 -26302 -40488 -51335 -64024
5362 -64024 -49193 -48108 -30496 -14480 -6542 3095 -1685 -32991 -58649 -42403 -44508 -58271 -32792
5349 -32792 -22683 -16119 -24025 -14687 -18940 -59737 -36479 -2179 -11375 -22735 -56233 -51403 -11713
5336 -11713 -452 -26662 -25833 -61852 -44571 6656 27716 52872 37923 19689 7087 -428
5324 -428 -8703 -30064 -45925 -56613 -2508 -14013 -61532 -53306 -11355 -16715 -40220 -28834 -4941
5311 -4941 3861 -5061 -14594 -1062 -3521 -6594 19156 13156 -7384 -13109 15510 -6543 12780
5298 12780 -8474 -61175 -43174 -8516 64516 64472 1164 -3970 37223 21441 5012 21298 7270
5285 7270 -5984 -3688 -9829 -28200 -44680 -55294 -48669 -29654 -16520 -39790 -76611 -86361 -70394
5272 -70394 -23205 -18547 -24302 -32430 -16864 -17735 -8089 5742 -17385 -33013 -35349 -17136 -24464
5259 -24464 -35879 -48814 -44038 -2558 47643 22224 -59155 -90215 -81902 -50423 -32792 -24138
5247 -24138 -19816 -40273 -51308 -66149 -44611 -19623 -4029 45967 49741 30572 -41972 -74967
5235 -74967 -74816 -80713 -75351 -45156 -19110 6262 12269 -1523 -30615 -33420 -40125 -64297 -48727
5222 -48727 -14881 -9013 -6101 -41237 -65605 -53037 -3173 15875 26855 35526 -8243 16258
5210 16258 49306 35243 24039 9152 12877 -8532 -26934 -41873 -34192 -8450 -10135 -29888
5198 -29888 -61907 -61023 -3336 -1415 28405 34485 26422 23916 23316 49473 36280 53446 57616 24611
5184 24611 2922 -3506 -35658 -100758 -90281 -92042 -65651 -54308 -53673 -63704 -85164 -70742 -46793
5171 -46793 -45971 -35838 -45937 -44488 -11979 -14348 15936 17704 -28637 -77651 -41336 -63918 -72677
5158 -72677 -33546 -22671 -22801 -9744 -9998 -8047 16491 57310 53935 34806 50950 65018 29002
5145 29002 -14334 16652 4667 16842 49516 42049 28546 35015 14551 32893 60280 101647
5133 101647 74096 35603 32100 6590 -78288 -98758 -95494 -96674 -81338 -52534 -27008 1761
5121 1761 -31024 -64912 -62034 -66857 -69173 -85580 -74122 -80659 -58382 -42533 -62551 -49212 -52047
5108 -52047 -28453 -24713 -58871 -86285 -56878 -36454 -49236 -37397 -56655 -18453 -5286 9563
5096 9563 22314 20448 39442 23165 -12850 -28913 -3987 -4833 -20258 -3602 8804 351 -32813
5083 -32813 -8304 17267 13788 -30649 -61445 -73674 -84989 -60492 -72088 -88433 -67739 -53262
5071 -53262 -59593 -9249 29572 12324 -31977 -26741 -14636 -64767 -97816 -77092 -85567 -63735
5059 -63735 -58206 -17711 -21364 -15225 39500 32359 40023 46179 7769 -2747 -12921 -60406 -69310
5046 -69310 -23097 -9781 -15054 19590 15738 10217 14892 24447 14016 17155 8588 15406 3023
5033 3023 -6077 -42976 -22998 13906 34070 24104 3344 23813 18369 25337 4829 10713 18738
5020 18738 13318 -23979 -56235 -40606 14310 49867 46005 13132 -18333 12747 29932 44107
5008 44107 46649 6054 -12587 -40961 -7957 8222 33504 12081 -282 7802 18769 3100
4996 3100 -47522 -73853 -44314 -14940 -26111 -28055 8156 32686 33076 37506 54735 6213 -34075
4983 -34075 13001 18262 5005 4992 -24156 -28728 -28980 -37636 -16582 -27430 847 73934 103220
4970 103220 60431 40784 42776 45825 24893 -32516 22 -10700 -27538 -3108 -4574 -17112
4958 -17112 -47567 -47785 -25073 394 7136 -7120 -40711 -37955 -62305 -21158 4202 -19858 -13333
4945 -13333 27671 26411 -21600 -34822 18407 19926 -5980 -44712 -86072 -91484 -88616 -130493 -141844
4932 -141844 -118561 -92527 -76780 -52899 -39730 -15834 -25252 -31651 -8178 3810 32718 92335
4920 92335 66967 36465 24416 23085 20914 20191 95899 88195 28309 324 41404 67276 70300
4907 70300 80907 51436 54246 72005 35562 1191 -53109 -41738 -1116 32791 -3460 -65549
4895 -65549 -76479 -44952 -18303 16724 8200 -8203 11474 38587 5476 -17658 -44350 -50510
4883 -50510 -50782 -19628 -11677 -11270 -6988 6359 -2909 -27365 -81412 -62504 -40974 -24649 2851
4870 2851 28301 27036 41201 32849 25824 33099 14511 -2501 7713 -13160 -5486 15491 5281
4857 5281 22873 41261 70235 47869 5187 -49682 -89400 -81732 -49841 -46187 -23901 -20875 -331
4844 -331 3128 1955 4533 28578 27617 10033 5763 -15846 -7869 10906 17272 9497 -14850 -14104
4830 -14104 -23200 -54900 -73718 -94906 -87061 -39265 -37665 -32316 -51228 -20441 10209 -264 4112
4817 4112 20485 -333 -24488 -44141 -40766 -19266 -7230 -24360 -14103 -15815 -8607 -1608 -10778
4804 -10778 -50146 -77654 -43727 -35383 -19724 16387 28889 26634 17903 -8424 -14956 -46580 -9927
4791 -9927 -30323 -80544 -115254 -77222 -59568 -52561 -55976 -82738 -84606 -88587 -53730 -1055 -20005
4778 -20005 -38989 -53113 -66143 -49540 -43034 -41795 -59822 -41648 -51050 -73408 -49086 -31468
4766 -31468 -46205 -50158 -19881 -10569 -37777 -44941 -31267 -2377 -19124 -36757 -36522 10915 679
4753 679 -161 -15709 -22140 -69536 -65797 6062 -5127 -40199 -36089 9223 -21468 -39845 -54585
4740 -54585 -96608 -106563 -61951 3610 14452 -1145 -1757 1846 29756 26878 33645 21485 29526
4727 29526 40770 54095 52987 13019 -22244 -34894 -58632 -62369 -64042 -70817 -58255 -14165 -24084
4714 -24084 -85996 -85007 -64379 -12140 -6551 -20140 -31240 -14817 -21577 -269 -33466 -18809 1475
4701 1475 -8553 -6705 11814 22270 19571 34999 58440 75647 72292 37954 -6838 5017 17668
4688 17668 43808 42398 42531 15194 13434 17259 23238 18666 19091 -16832 2676 76118 102503 75033
4674 75033 60941 49604 23386 41463 67547 52858 10782 -56673 -61293 -28277 -38515 -44465
4662 -44465 -27361 2081 15479 11083 9422 -2629 -5127 4111 -21315 -863 2024 21369 2986
4649 2986 -6036 7886 8747 29603 33851 35201 37266 16856 -784 -11984 -6836 22704 50881
4636 50881 83204 122772 108879 69244 14597 -3489 28645 33237 45469 27519 24277 -2129
4624 -2129 -32719 14819 -20645 -51476 -20943 -6181 -5673 -32821 -7390 -26132 -27528 -30851 -32608
4611 -32608 13531 38729 36649 16677 -12131 -14835 14680 -103 -38003 -61413 -61075 -46667 -37171
4598 -37171 -34057 -37196 -18999 3156 3664 23081 24883 -8600 -20191 -6237 -10424 -30619 -31562
4585 -31562 -19328 -15244 9532 -4759 -24315 -13365 11136 16025 -5760 -22773 -56480 -49589
4573 -49589 -53468 -21686 11371 26224 53803 59928 18225 -24506 -42357 -35525 -34787 -11886 17963
4560 17963 33619 4658 -29090 3518 63820 58289 23298 18502 19677 51929 24893 42666
4548 42666 43839 34094 122 -37014 -30429 2881 -19144 -5340 -9023 -33998 -42404 -4420 1328
4535 1328 13898 -17137 -57259 -84149 -52669 -23450 -6522 37358 49313 30583 -29860 -47829
4523 -47829 -3887 -9489 -11780 -42138 -73141 -57707 -29781 -39675 -31855 -40366 -88006 -88709 -46888
4510 -46888 -40425 -1429 17256 16238 -18041 -12985 -23855 -52174 -89234 -73545 -38526 -6160
4498 -6160 -10034 7178 22260 1083 2954 27380 30424 20295 1190 -10099 -13798 -3325 -23530
4485 -23530 -8992 -5446 13897 4253 14471 -10520 -35498 -37279 -2819 16860 5262 -5248
4473 -5248 -34401 -48070 -42367 -48944 -5512 17646 -3960 -27992 -29029 -60580 -31066 27029 30349
4460 30349 -4699 14047 31253 17111 10307 -30880 -47511 -43580 -11672 -16178 10470 10137 -28271
4447 -28271 -45132 -56602 -72759 -83042 -41053 -23527 2197 -23053 -15069 14830 22786 1023
4435 1023 -19074 -11844 -29629 -74337 -46267 -20768 -11394 22696 60293 48435 37891 20221
4423 20221 22350 70905 40057 -12543 -51381 -72686 -104897 -76137 -30520 8670 20960 7646
4411 7646 4747 394 -12232 8880 29666 27630 30031 30583 3906 7949 -13342 -30562 -10173
4398 -10173 -4820 -1726 23317 20994 4725 5249 5120 16393 24298 42230 66635 80995 43541
4385 43541 30772 7442 36935 43934 26711 29471 56993 23884 15025 51504 20225 -1449
4373 -1449 14011 35677 24892 726 -21476 -55705 -44738 -10742 -7044 15247 9333 -11901
4361 -11901 13218 -4282 -39800 -21467 11807 3039 -3296 26853 18558 -5818 -5075 5053 26054
4348 26054 52299 16653 23042 35419 33433 -9876 -25107 -7009 9027 45930 36397 41444 20894
4335 20894 20748 64011 62192 3840 2941 -15019 -15059 -23202 -22678 -32724 -23429 3272 -3798 2531 48550
4320 48550 40669 19257 8314 -26708 -34616 22158 10212 6419 26028 7823 -4304 -6562 6013
4307 6013 -8381 10032 13742 33662 42043 15586 30326 31682 52771 2027 -37374 -18905 18584
4294 18584 15664 -1117 6136 13773 46485 58804 38958 10509 8444 -9402 -23546 4214 8058
4281 8058 3504 -9459 -50375 -87945 -79465 -37820 236 35178 31743 16696 -3370 -23151 -16242
4268 -16242 -18941 -44951 -11996 -6427 -4518 6785 -17758 -10172 12778 888 -32393 -36177 -3551
4255 -3551 -15377 -13185 -19796 -31304 2641 27536 40267 -2349 -15540 -24495 -39406 -36662 -28437
4242 -28437 -21008 -40397 -23500 -35312 -12237 -10860 -11106 -26306 -45258 -58894 -59281 -64603 -41287
4229 -41287 -19900 -21752 -37596 -26397 -408 -5530 -18012 -16064 -15813 -25929 -26130 -65666 -86278
4216 -86278 -48696 -33271 -36435 -61650 -25233 35940 33326 33001 33110 9838 -23102 -6500 23776
4203 23776 -6132 -3491 35340 -21046 -17084 -2441 -16961 -24747 -22250 -19982 -2557 30340 37520
4190 37520 27398 -9601 27497 72135 67196 50385 15923 15295 -3249 -46153 -36176 -25906 -12246
4177 -12246 12124 -326 -27108 -24548 -27865 -21870 -26017 -28826 -5007 -25955 -39389 -60456 -48355
4164 -48355 14289 18828 13091 -29069 -18290 -5498 -666 -20001 -41419 -60182 -69875 -42462 -89306
4151 -89306 -48597 -18780 -64321 -34428 7435 30463 41351 -4288 -4067 14831 -18764 -82754
4139 -82754 -73760 -40480 -35702 -44900 -47084 -2559 5396 -10863 -12921 -30355 -43004 -7286 30932
4126 30932 35658 -17397 -47155 -53760 -10027 -9169 -13349 -15341 1007 34584 -677 -26588 -23990
4113 -23990 -38941 -26974 -31945 -6592 25484 38051 29319 31754 24603 11550 26407 8958 2960
4100 2960 -9111 -69183 -53557 -27160 -18218 -39368 -71817 -77215 -43833 26666 30714 15575 31440
4087 31440 31241 -11904 -17318 -7069 -858 -7801 26281 23096 9086 6486 -9751 -10034 2288 17528
4073 17528 61409 43549 -4141 -8517 -24539 -27228 -63053 -16700 -9715 4760 1210 -29013 -46544
4060 -46544 -8357 -26818 -62715 -86890 -40262 -16209 -51737 -76913 -30816 -10867 -21395 -45180
4048 -45180 -23729 -21789 -47645 -57816 -40042 -24074 -17707 -31379 -99 25840 -9274 -26115
4036 -26115 -9475 -26143 -45094 -18679 46504 45164 1729 -287 35121 3479 -7834 -31063
4024 -31063 -47446 -25464 -48792 -43042 -5450 6629 -2470 -3552 33960 24051 22847 24761 2574
4011 2574 -24990 -5795 22435 30093 10622 -26843 -8087 33300 28522 1238 7703 8170 -24625
3998 -24625 -11116 -3025 -28516 -18573 -30234 -30675 -11072 -25277 -8753 -38982 -71920 -87071 -97552
3985 -97552 -86041 -89104 -20047 1500 -27052 -45152 -55099 -56358 -56825 -39474 -12203 -4892 28478
3972 28478 42217 33537 38077 46935 11522 3800 -2588 17001 35864 24152 -7111 -8801 45109
3959 45109 30474 -8137 -9623 3125 -2441 -20559 -21647 6404 42447 26236 -16484 -55813
3947 -55813 -47230 -49752 -50864 -35352 -17127 -1278 3804 8288 14338 38455 67531 86291 93020
3934 93020 73756 28614 14148 66426 106963 97684 36032 22163 20494 29007 825 -11030
3922 -11030 16645 29441 30920 -9763 -11875 -3103 -19487 -12148 -17556 23117 -8186 30993 75139
3909 75139 86195 74769 71126 42405 57819 34728 -6644 -9604 5228 15410 30985 27326
3897 27326 20620 48487 82046 92058 42793 2565 14406 506 -40797 -27766 -15288 7153
3885 7153 22865 28469 6205 -38688 10925 34946 65380 78417 23415 -7860 -9565 961
3873 961 -259 -18757 6334 22605 8694 20774 53041 78294 55020 48888 103095 97624 85629
3860 85629 68775 88398 76920 56819 59343 30977 -13703 -53865 -58276 -87335 -87390 -40428 24303
3847 24303 87853 117836 81900 20037 7299 -27626 -32062 -65508 -53976 -32190 -14245 -17920
3835 -17920 -42510 -23408 -25214 -16835 6015 50942 7170 3147 7991 4916 -20671 -18376 -10096
3822 -10096 -36163 -50978 -22962 -22123 -34544 -17983 -9181 7565 18711 25429 22616 16044 -27489
3809 -27489 -31605 -28068 -11657 -8960 -15171 -21384 5275 64344 109037 143832 137028 76939 2291
3796 2291 -14117 29928 49598 13477 7511 -16252 -11953 4607 -11295 -54407 -58436 2725 48651
3783 48651 32801 -3899 6346 26619 23570 3254 8926 7242 15874 36850 59171 43459 38578
3770 38578 27151 14074 13151 -9663 6893 12018 -1495 7023 -18613 -43428 -50045 -57279 -71606
3757 -71606 -73040 -58889 -64840 -48648 -18518 -48752 -42539 -14508 -1886 25890 -8060 -29909
3745 -29909 -10963 -9027 8023 -21636 -54002 -41379 -29365 -22039 -17005 16321 14962 9401 -725
3732 -725 6220 -10446 -20324 -1859 -6958 -35610 -45472 -21190 -20821 -58104 -104124 -119799 -94298
3719 -94298 -30420 -22973 -25943 -6722 -14497 -1032 -50864 -82800 -71207 -112073 -94724 -51858
3707 -51858 -40872 -61909 -81640 -78799 -76692 -78974 -76500 11552 38637 23110 -32605 -53019 -57715
3694 -57715 -49744 -64458 -42916 -1657 -26909 -40237 30690 61185 28628 -18554 -18222 -425
3682 -425 10648 4263 44265 7586 -44986 -12628 22390 10520 -4055 -20879 -32441 -36953 -39520
3669 -39520 -35943 -49403 -44154 -36594 -38883 -38282 -30798 45358 72323 54838 43239 37315 17763
3656 17763 3231 18352 14130 48077 85386 62017 27133 22784 28178 38516 35956 16254 5914
3643 5914 -533 18837 52091 43552 59159 22822 17417 6200 -43322 7894 58984 65934 44043
3630 44043 4081 -28752 3143 11649 -734 -10952 4874 -23285 -42147 -24778 -1987 -27674
3618 -27674 -25100 -1227 8739 7212 -7367 -5070 7193 15573 35028 12251 -27269 4000 37043
3605 37043 30299 13716 -16000 -27819 -6426 -5592 9583 2454 30762 8644 6712 -9154 -14164
3592 -14164 -22788 -73731 -67447 -189 56536 41274 -16462 -27458 -49809 -59169 -11083 10938
3580 10938 38163 59178 30803 9367 17111 -7818 6246 -8594 -5883 5635 35563 44943
3568 44943 4559 -48346 -46212 -52262 -42888 -51707 -55516 -29323 2457 -4410 -28206 -44487 -56309
3555 -56309 -27258 -31760 -48169 -40916 -41428 -49972 -66999 -25212 -31563 -71437 -74324 -16214 -22627
3542 -22627 -12946 2847 -23376 -1714 4999 29720 24823 -18603 -3192 -11105 -12492 -1596 -10811
3529 -10811 4075 51524 41484 31791 19865 -1630 -8864 -20027 -26486 -40932 -2102 29742
3517 29742 -17252 -42735 -54812 -75356 -58785 -64048 -126244 -104713 -89506 -49382 -14858 -26421
3505 -26421 -55159 -5733 2057 5915 21588 -9465 -25809 -35697 -18372 -5358 14129 -12926
3493 -12926 -17047 -5092 1143 -12945 -8908 8190 8202 27707 38332 45410 22155 -21279 -25813
3480 -25813 -2555 -11637 -23041 -18556 -11477 32082 85806 101521 43502 18786 30365 33810 30945
3467 30945 -18171 -22244 -1934 -4312 -6821 7065 2960 -10419 -1633 1021 -24187 -45774 -30113
3454 -30113 -29571 12111 37173 14811 -17610 -15895 -35977 -56347 -40629 -18896 -23822 -9099 8228
3441 8228 -24564 -43253 -47055 -27964 6729 29263 8166 21247 41984 7027 6970 -9315 -29441
3428 -29441 -23797 -32972 -48327 -47645 -20932 23341 51480 55179 43113 55148 56299 52262 61643
3415 61643 32740 467 14525 7783 10233 6398 -41990 -63883 -42579 -23402 -55697 -88390
3403 -88390 -60779 -57846 -43513 -33526 10499 15322 7204 12666 -35140 -70504 -35520 -11461 -47942
3390 -47942 -43215 -4184 13045 17048 -54736 -63539 -22408 2055 -12012 6405 13654 20238 17232
3377 17232 -11205 -8208 -45026 -60602 -19252 -9946 -51569 -59912 -31167 -20721 6216 23152
3365 23152 31253 3659 -18881 -29744 1618 32464 44500 23565 30325 80494 96714 52574
3353 52574 58601 28946 -17406 -37616 -23613 -2979 -31 13365 -2785 -30819 -22953 -31492 -38439
3340 -38439 -58576 -12861 -3016 15821 4645 -39569 -28681 -12010 -42135 -30522 -19504 -24957
3328 -24957 1503 14124 14755 -43206 -74658 -61853 -27732 -3862 43709 62034 43552 143
3316 143 -27977 3956 24877 42503 -25815 -53705 -52120 -45886 -53717 -69916 -74590 -84285 -91097
3303 -91097 -57588 -26765 -25302 -44831 -29228 -28858 -26822 -17300 1784 -10995 -45176 -40788 -18678
3290 -18678 -9623 -42942 -24960 9000 9671 27494 -5190 -56222 -41991 -7923 -20085 -23242 -29196
3277 -29196 -33055 -49779 -32600 -57150 -39191 -53990 -87123 -100228 -65385 -2728 9942 1853
3265 1853 15123 53679 60313 71520 17350 -43308 -61794 -46514 -35419 -49604 -68570 -84567
3253 -84567 -73209 -62617 -56162 -13255 -10664 25507 32753 1713 -5041 29012 15758 -14390 -25747
3240 -25747 -46896 -33902 -14343 -24614 -17116 -9686 -24874 -21194 -24642 -57561 -64331 -64950 -54962
3227 -54962 -48230 -33832 -31745 -77348 -74039 -28715 -1505 37669 56745 31092 20379 7865
3215 7865 -795 14179 40930 4531 10330 -9073 3853 20310 24399 15016 16007 2639 -14070
3202 -14070 -13720 15425 16789 27722 34377 38029 -2580 -36500 -62264 -44698 8684 1434 -2033
3189 -2033 -1564 20820 4326 -39716 -55876 -53288 -46428 -29612 -23385 -10493 -26011 -37602 -35036
3176 -35036 -45025 -36456 -29791 -61887 -53710 -26428 -23527 -46522 -68045 -50446 -24922 5933 32970
3163 32970 59673 3661 -7645 5541 27483 30692 44995 69807 39255 36065 348 1975
3151 1975 28842 12338 9945 7273 54210 100037 88119 49223 42891 27157 6637 26432 70240
3138 70240 28186 -26463 -35126 -1217 -29901 -22555 -16190 -17333 1479 51418 66477 34006 10391
3125 10391 19214 64474 69740 44779 42216 30279 3505 -7533 -23796 -10769 -9376 -902 -10413
3112 -10413 -6552 29873 32011 -1438 -36844 -70062 -61431 -48111 -60036 -42458 38639 35708 -3497
3099 -3497 -42913 -38755 -36624 -35401 -29059 -23286 -23076 -11673 -9837 -5041 24958 38868 52844 27972
3085 27972 -3658 7766 39505 -17833 -53322 -61658 -54460 -29569 -12945 -21585 -39160 -46685 -33783
3072 -33783 29974 63740 107434 116645 72407 28275 -17868 -30440 7239 43564 52965 6972
3060 6972 36733 41422 7847 -3286 -2233 7402 8423 5344 -23570 13338 -7650 -12159 -20034
3047 -20034 -30936 -39666 -49228 -24666 9595 48252 22770 11325 19073 -24258 -43260 -15144
3035 -15144 -11665 10200 38175 35455 -2481 31266 28721 4688 -3404 -16490 -19348 -26715 -5602
3022 -5602 -11617 -9695 7909 67148 59571 13679 29387 21833 16636 34335 -2816 -15996 -29632
3009 -29632 -38720 -21032 -35468 -27528 -17794 4098 37609 20939 25398 -10734 19976 23339 20649
2996 20649 81761 113700 57325 -13041 -22902 15263 5763 -25581 -36630 -42070 -57579 -41338
2984 -41338 -36869 -20982 38649 103610 120826 78633 64260 62470 90624 87580 73869 42913
2972 42913 11344 5490 -21272 -51477 -27818 -13795 -16706 -17832 -17135 -10898 -15547 -11029 22734
2959 22734 37641 15399 49175 81000 53452 18138 52713 84333 95868 66156 61309 36474
2947 36474 31475 54668 86728 82448 42063 41661 39967 13747 7924 41895 70518 53374 19814
2934 19814 -35467 -40110 -36456 -72508 -51476 -35316 -44292 22471 52306 49075 25485 8917 -4492
2921 -4492 -33379 -27291 -16415 -55971 -57985 -47834 29481 56601 3156 8263 8274 10148 -9847
2908 -9847 -3661 -19921 15030 69658 49025 20939 19203 39363 63186 69047 48427 26955 53447
2895 53447 42499 17923 -7764 -8606 -52024 -88324 -57588 -22817 12532 -13939 -18905 -14339 -11898
2882 -11898 -17928 19173 -3219 -15005 -1820 -42151 -40032 -76 20828 -26685 -35404 -36508 -61032
2869 -61032 -38535 18739 21130 44819 63700 -2725 -30802 9627 35468 18476 -12134 -29112
2857 -29112 12186 6691 -7597 -39038 -28331 -17387 -16438 -6642 16234 33331 -5402 9162 7583
2844 7583 12834 15911 34224 37142 26599 30130 -5236 -28402 -16699 14932 39951 50089 63417
2831 63417 19935 -4038 -21399 -20013 -59258 -65224 -18551 -15601 1536 7336 -37546 -79082 -56496
2818 -56496 -7882 22085 6911 7088 11126 36 -8619 35358 48445 42891 72534 72890 43511
2805 43511 -5145 -60228 -53439 -26887 -7763 10380 18776 -8636 -18094 -57745 -57924 -50245 -43931
2792 -43931 -28570 -919 -10515 10434 11619 28219 36314 26754 -3568 -23158 -43521 -6183 18483
2779 18483 36039 54760 41810 33583 -4971 7358 5743 16300 26247 61150 67675 31476 2880
2766 2880 -8488 -4912 13042 14037 5518 -32205 -47453 -37724 -20797 -45001 -38650 -7999 -26393
2753 -26393 -11042 -23162 -24135 -13797 -18140 2113 -21542 -10754 22256 1639 12610 37298
2741 37298 34633 27616 1853 -7597 11477 8936 21020 17470 -9432 5502 9031 18898 43489
2728 43489 19879 47314 69559 61258 69934 50141 27333 10602 -193 -13800 -21594 -5806
2716 -5806 18626 19711 40454 39435 50123 12673 5201 12896 5471 6233 -4545 13110 40678
2703 40678 -10437 -61857 -84320 -110050 -92801 -64455 -27009 -24508 -77555 -66156 -46380 -1545
2691 -1545 11024 -34935 -61444 -17086 17894 37742 82916 79507 43881 33434 21754 14860
2679 14860 1305 -13163 -7372 34156 29618 25217 -1930 -52075 -64293 -44617 3002 -5897 -40953
2666 -40953 -49160 -50526 -56854 -13210 11136 -7611 -9218 -3873 18449 50181 98093 80282 52449
2653 52449 56788 36829 24853 5111 -33073 -23747 -31193 -49163 -25957 -49504 -42666 -18902 -1462
2640 -1462 -21245 -23436 -27486 -66818 -59572 -51867 15739 68601 46425 85218 72044 19910 35897
2627 35897 17332 13801 10796 -18696 -17151 -21006 -47844 -60299 -26820 21041 43860 27869 10733
2614 10733 7833 -27697 -13739 18078 -8638 -30905 2681 70232 88541 76824 44212 17788
2602 17788 23478 21482 4192 10032 22486 18251 2062 -1919 -30576 -29588 -45735 -53360 -47877 -12748
2588 -12748 41279 57424 35890 23578 16426 -2924 -4035 -22685 -49104 -88970 -95809 -68133
2576 -68133 -55410 -44059 -37281 -14967 15987 19032 6449 -401 3650 21362 -43888 -57264 -35365
2563 -35365 13912 26847 -5574 3760 26417 13660 7372 -45501 -70770 -80074 -59942 -25415
2551 -25415 -52578 -76379 -34297 -15002 -9832 -2675 44109 28384 -4613 -16807 -18924 -32632
2539 -32632 -27655 12113 -12214 -28868 -34570 -20032 -13326 -14419 -2871 20851 15321 33479 36551
2526 36551 19414 22747 -7553 -30051 -11627 -16028 -32022 -55219 -38406 -9526 27324 51420
2514 51420 46219 62935 56397 39102 38111 -26102 -26728 -7902 -47758 -62549 -93977 -107186 -63439
2501 -63439 -28376 -34566 -55011 -36858 4769 16934 -8673 -28550 -36611 -20822 18266 79216
2489 79216 82176 57966 55081 60385 44079 48155 31314 8829 5674 -24477 -43140 -46004 -60381
2476 -60381 -43936 -26068 -3944 -22972 -31025 604 -31618 -48440 -20480 164 -5079 -23854
2464 -23854 -11229 -6755 -752 29855 52451 27765 9322 6276 -4254 9975 39480 56639
2452 56639 47651 80131 96084 83364 103638 92931 79050 30576 -31000 -60345 -5109 48744
2440 48744 14737 -29190 -28237 4143 3131 11902 38445 27988 10342 10376 2930 3231 -1183 899
2426 899 -8934 5 20698 47492 14646 -30161 -54164 -43507 -43285 -59989 -62949 -22383 -15853
2413 -15853 -37619 -30772 -35793 -40493 -8228 46597 26930 -8744 162 9672 24528 61283 46424
2400 46424 22606 -49035 -71895 -19667 -6362 21028 3271 18578 13355 -293 -29403 -29748
2388 -29748 5004 5623 -33546 -80768 -92549 -66269 -83088 -109535 -83186 -80666 -65780 -47885
2376 -47885 -52319 -42138 -34248 -25995 -47796 -65995 -51840 -43355 -34852 -24383 -600 7482 26820
2363 26820 14641 -10049 13507 37105 25592 -3133 10495 20468 33651 20800 56545 112351
2351 112351 131045 97239 56761 49532 19646 -51629 -85785 -65833 -52458 -22504 -9546 -17122
2339 -17122 18210 43436 27303 -10257 14662 -903 17541 41182 53896 44943 16476 -20853
2327 -20853 -7280 -13103 -19659 -3870 15125 19105 16380 -6721 -11982 5313 456 -22077 -7135
2314 -7135 -4388 14548 42141 -6334 -34998 -10966 14645 43744 68431 81281 107907 97911
2302 97911 34065 2727 -26123 -23667 -4800 19978 54377 57098 23064 13436 5891 -8934 -7222
2289 -7222 -29183 -81780 -90591 -87822 -68864 -17090 29551 5405 -45050 -37467 20814 42958 31392
2276 31392 -3773 -8942 -4151 -1813 -14817 -12010 -27171 -48576 -34449 -32306 -21198 -13697 -39420
2263 -39420 -2228 41252 48217 42944 31696 30334 -4424 -22863 -2625 18433 7029 -34271
2251 -34271 -27045 -19542 -15956 -10994 -404 -31880 -63459 -55700 -47780 -14816 1099 -28495 -33569
2238 -33569 -31120 -19806 -42769 -30875 8930 4783 -10301 -20652 41610 62903 42141 35296
2226 35296 41299 16547 -25646 -30150 3066 24343 34064 13504 31800 22657 14792 -33631 -17776
2213 -17776 27148 34560 -9052 -49325 -43561 -20090 -18845 -34025 -43381 -43599 -21134 -19548 -6804
2200 -6804 -9586 -15996 -25885 -46897 -21946 -13490 -35717 -4724 -6855 27969 36518 14623 7077
2187 7077 3651 6731 28231 44383 78909 95445 62771 66996 27650 10290 38576 50862 32195
2174 32195 18546 -7653 -15816 793 21184 17792 -16051 -29380 -31714 -21807 -4573 -3483 -7648
2161 -7648 -3164 13078 10246 2629 28189 60834 48945 808 -19202 -13779 -936 17927 44642
2148 44642 37455 48759 62354 71653 53157 -13567 -16433 -11949 -7771 -17472 -28274 -58056 -64079
2135 -64079 -85048 -72772 -20491 -16150 -40887 -9554 6172 -13455 8145 -7251 4890 -13968
2123 -13968 -25280 -31156 2502 7925 -13659 -56352 -12115 7266 -12091 -35156 3 21605
2111 21605 29042 23027 33837 63568 27074 2615 29519 39915 28015 -26574 -6907 27437
2099 27437 -2369 -37357 -12735 -16700 2675 51439 76699 56980 31240 4767 -18083 14637
2087 14637 50153 54191 22399 1308 -12182 -27803 -9685 -2585 -15945 -14278 12972 27223
2075 27223 -6815 -10925 -4632 21153 23925 24565 21462 66934 50589 3731 -13127 -9659 4477
2062 4477 3578 -21706 -10601 16118 38703 733 -5850 33003 27898 -40201 -49350 -34328 586
2049 586 -27905 -63870 -61095 -47178 -44334 -55492 -51972 -61236 -49758 -18077 -24284 -21797 45090
2036 45090 82243 59078 18782 -27128 -61407 -29035 17556 -1238 -561 23558 16173 6687 14555
2023 14555 4430 10057 28053 22600 21852 19973 17210 2850 8071 24921 25562 24817 34592 67471
2009 67471 58926 45540 34122 45305 53579 52488 34017 40851 21961 17098 37270 27409 56244
1996 56244 19971 -6885 42175 79432 69170 47161 84966 93935 62537 43636 8424 8190
1984 8190 20335 15524 54744 101694 104958 111335 73434 34874 -4587 -671 -12040 24039 36611
1971 36611 17826 11664 1243 -1978 20786 34472 32373 15110 6996 -6651 -3902 11572 17555
1958 17555 -7535 1099 22498 -2842 -1556 2909 -19633 -5588 22536 -1784 3598 1687 13035
1945 13035 22905 11576 26342 -3584 -4892 31637 14442 -17755 -9954 6118 11414 53081 88625
1932 88625 78302 13631 43927 47195 34080 1923 -18288 1075 27963 -11869 -37699 -13197
1920 -13197 -419 -32168 -69302 -55028 -38474 -14262 -19179 -33526 32732 41158 6693 9396
1908 9396 26076 -11505 -16117 292 22619 41615 29140 18722 -13521 -33946 -27918 -8590
1896 -8590 28699 21716 -12396 -26282 -4509 23944 46736 50634 67780 29380 -28656 -8135
1884 -8135 -3597 4133 -2012 659 30501 21059 -11915 -16052 7050 19363 -7097 1662 35491
1871 35491 51617 51241 57154 48983 24608 7151 -36347 -31333 -32305 -49941 -29973 5937 20336
1858 20336 38844 17994 -12054 2657 14118 17325 25581 79848 52386 18989 15447 43412
1846 43412 33060 26354 27046 22009 23250 12938 9690 22970 28232 54381 42857 -6638 -9867
1833 -9867 -8119 -32693 -33749 -42101 -12086 -33248 -18897 -827 40645 43770 15687 14512 3439
1820 3439 -968 36851 46158 65757 65982 58981 17323 -19457 -5982 19935 34390 20843 -9346
1807 -9346 -18516 -17477 -20348 -5750 16761 -28923 -28590 25945 14254 9152 15396 36115 58403
1794 58403 17514 -8409 16429 25101 23065 -8278 -24086 11399 9719 1341 245 7839 -18790
1781 -18790 -6417 31615 35144 12690 -5273 -17828 -3094 15141 18305 6920 -12065 23219
1769 23219 21554 -11960 11944 43439 26297 8265 -15751 -7061 -5230 3921 -50985 -78852 -92375
1756 -92375 -58140 -10362 451 -4959 -1799 -5419 -26306 -12913 25876 53005 58154 -646 -10148
1743 -10148 14255 38169 56125 44954 -827 4950 35186 58532 94708 39041 3937 -10652
1731 -10652 5825 11822 11442 8559 19766 15606 24254 21220 19554 -22528 -56236 -57139 -41154 -36332
1717 -36332 -29022 -22802 6410 -12462 -36469 -33344 -49809 -90916 -62302 -9172 17273 20653 19930
1704 19930 25861 25123 -19369 -31506 -108 -13 -11184 -5056 38097 76761 61544 59161 73367
1691 73367 97848 93871 61038 30018 -18162 -12206 61596 52495 49812 33464 19911 54946 55168
1678 55168 27117 20528 35825 26389 -13488 -37925 -44326 -11770 7445 14994 3977 1247 20939
1665 20939 30138 36894 7982 -13131 -44952 -19859 -4932 -39093 -38664 -29841 -26344 -13967 5615
1652 5615 -267 534 62718 50064 8890 23494 36938 68035 56879 69180 55722 11517 11599
1639 11599 45526 68882 68507 15650 -18492 -66825 -77672 -7984 32368 14775 35994 37754
1627 37754 39639 79654 102080 80802 89941 69698 41454 62596 64298 16495 -1266 17071
1615 17071 -10134 -21378 3004 4965 -3702 -25118 -19836 -45379 -19644 27732 8396 3322 14765
1602 14765 35883 -5154 -7688 13738 57098 58223 26091 74 -10128 -48345 -3231 6808
1590 6808 -2540 -4912 28796 24080 9326 14068 63494 67284 54116 25861 15845 15726 38374
1577 38374 43714 88508 44306 11251 32716 107998 127846 123703 103672 98964 106365 66002 60313
1564 60313 60289 10770 -30902 -24213 -3501 -27523 -50345 -31948 15107 1508 -58294 -57959 -34132
1551 -34132 -19495 4652 41286 32438 10857 23358 17989 25111 21983 8430 29812 17690 -12987
1538 -12987 -18998 2796 -17830 14740 53762 31337 -5897 -5566 22280 15725 30964 7751 8905
1525 8905 50563 83623 81511 -8439 -31537 18213 16806 -8838 -26788 -46852 -19868 9416
1513 9416 58180 50574 23233 17615 27527 4531 -22481 2867 5478 -36273 -36774 -18328 14019
1500 14019 1440 -46745 -31309 -13302 16665 -18410 -25287 -55245 -32694 14426 -2884 -10347
1488 -10347 -3710 -35546 -19575 10745 44603 65869 61354 44603 45503 48004 36359 -43187 -54325
1475 -54325 -17777 15678 18710 39019 51410 57987 77903 47892 44126 70746 71461 88989 64799
$$ [...]
##END NTUPLES=NMR SPECTRUM
##END=
