##TITLE=Analysis number 307206
Compound Code cc 41410
Book Reference 393/176
Project Code adrs
Chemist Name roba
##JCAMPDX= 6.0         $$ Bruker NMR JCAMP-DX V2.0
##DATA TYPE= NMR SPECTRUM
##DATA CLASS= NTUPLES
##ORIGIN= Bruker BioSpin GmbH
##OWNER= NMR
$$ XWIN-NMR		Version 3.5
$$ Mon Apr 25 08:48:02 2005 GMT Daylight Time (UT+1h)  MAYBRIDGE\NMR@NMR_250MHZ
##.OBSERVE FREQUENCY= 250.131544655141
##.OBSERVE NUCLEUS= ^1H
##.ACQUISITION MODE= SIMULTANEOUS (DQD)
##.ACQUISITION SCHEME= undefined
##.AVERAGES= 16
##.DIGITISER RES= 18
##SPECTROMETER/DATA SYSTEM= dpx250
##.PULSE SEQUENCE= zg30
##.SOLVENT NAME= CDCl3
##.SHIFT REFERENCE= (INTERNAL, CDCl3, 0, 16.522)
##AUDIT TRAIL= $$ (NUMBER, WHEN, WHO, WHERE, WHAT)
$$ ##TITLE= Audit trail, XWIN-NMR		Version 3.5
$$ ##JCAMPDX= 5.01
$$ ##ORIGIN= Bruker BioSpin GmbH
$$ ##OWNER= NMR
$$ C:\u/data/dgb/nmr/ADRS/2090/pdata/1/auditp.txt
$$ ##AUDIT TRAIL=  $$ (NUMBER, WHEN, WHO, WHERE, WHAT)
(   1,<2005-04-25 08:47:39.57 +100>,<MAYBRIDGE\NMR>,<NMR_250MHZ>,
      <created by zg, POWCHK disabled, PULCHK disabled
       configuration hash MD5:
       62 19 C7 07 E1 42 D1 B7 37 6C 3D D0 77 39 F9 E6
       data hash MD5: 64K
       3D 03 36 05 1D A5 B6 BB E3 6D 2E 9A 35 FC 3B 85>)
(   2,<2005-04-25 08:47:52.37 +100>,<MAYBRIDGE\NMR>,<NMR_250MHZ>,
      <Start of raw data processing
       ef LB = 0.3 FT_mod = 6 PKNL = 1 SI = 32K 
       data hash MD5: 32K
       90 FE 67 0B 16 CA 30 09 23 DD 14 EB 69 40 9B 30>)
(   3,<2005-04-25 08:47:53.96 +100>,<MAYBRIDGE\NMR>,<NMR_250MHZ>,
      <apk 
       data hash MD5: 32K
       10 95 1F D5 21 C5 67 43 46 C6 58 43 BD 47 81 C2>)
(   4,<2005-04-25 08:47:54.62 +100>,<MAYBRIDGE\NMR>,<NMR_250MHZ>,
      <abs ABSG = 5 
       data hash MD5: 32K
       3F 9B 92 0D DA 10 15 98 BC D5 C6 28 ED C2 C2 5D>)
$$ ##END=
$$ 
$$ hash MD5
$$ 73 DB 0D 1B 0A AE C9 63 9A ED 67 EC 3D 7D 79 A3
##$RELAX= 
##$RELAX= 
##$RELAX= 
##$RELAX= 
##$RELAX= 
##$RELAX= 
##$RELAX= 
$$ Bruker specific parameters
$$ --------------------------
##$DU= <C:\u>
##$EXPNO= 2090
##$NAME= <ADRS>
##$PROCNO= 1
##$TYPE= <nmr>
##$USER= <dgb>
##$AMP= (0..31)
100 100 100 100 100 100 100 100 100 100 100 100 100 100 100 100 100 100 
100 100 100 100 100 100 100 100 100 100 100 100 100 100 
##$AQSEQ= 0
##$AQ_mod= 3
##$AUNM= <au_zg>
##$AUTOPOS= <3 >
##$BF1= 250.13
##$BF2= 250.13
##$BF3= 250.13
##$BF4= 250.13
##$BF5= 500.13
##$BF6= 500.13
##$BF7= 500.13
##$BF8= 500.13
##$BYTORDA= 1
##$CFDGTYP= 0
##$CFRGTYP= 5
##$CHEMSTR= <none>
##$CNST= (0..31)
1 1 145 1 1 1 1 1 1 1 1 1 1 1 1 1 1 1 1 1 1 1 1 1 1 1 1 1 1 1 1 1 
##$CPDPRG= <>
##$CPDPRG1= <>
##$CPDPRG2= <>
##$CPDPRG3= <>
##$CPDPRG4= <mlev>
##$CPDPRG5= <mlev>
##$CPDPRG6= <mlev>
##$CPDPRG7= <mlev>
##$CPDPRG8= <mlev>
##$CPDPRGB= <>
##$CPDPRGT= <>
##$D= (0..31)
0 1 0 0 0 0 0 0 0 0.06 0 0 0 0 0 0 0.0002 0 0 0 0 0 0 0 0 0 0 0 0 0 0 
0 
##$DATE= 1114415258
##$DBL= (0..7)
120 120 120 120 120 120 120 120 
##$DBP= (0..7)
150 150 150 150 150 150 150 150 
##$DBP07= 0
##$DBPNAM0= <>
##$DBPNAM1= <>
$$ [...]
##$SUBNAM7= <"">
##$SUBNAM8= <"">
##$SUBNAM9= <"">
##$SW= 20.6930455092707
##$SWIBOX= (0..15)
0 0 3 0 0 0 0 0 0 0 0 0 0 0 0 0 
##$SW_h= 5175.983436853
##$TD= 65536
##$TD0= 1
##$TE= 295.16
##$TE2= 300
##$TE3= 300
##$TEG= 300
##$TL= (0..7)
0 120 120 120 120 120 120 120 
##$TP= (0..7)
150 150 150 150 150 150 150 150 
##$TP07= 0
##$TPNAME0= <>
##$TPNAME1= <>
##$TPNAME2= <>
##$TPNAME3= <>
##$TPNAME4= <>
##$TPNAME5= <>
##$TPNAME6= <>
##$TPNAME7= <>
##$TPOAL= (0..7)
0.5 0.5 0.5 0.5 0.5 0.5 0.5 0.5 
##$TPOFFS= (0..7)
0 0 0 0 0 0 0 0 
##$TUNHIN= 0
##$TUNHOUT= 0
##$TUNXOUT= 0
##$USERA1= <user>
##$USERA2= <user>
##$USERA3= <user>
##$USERA4= <user>
##$USERA5= <user>
##$V9= 5
##$VALIST= <valist>
##$VCLIST= <CCCCCCCCCCCCCCC>
##$VD= 0
##$VDLIST= <DDDDDDDDDDDDDDD>
##$VPLIST= <PPPPPPPPPPPPPPP>
##$VTLIST= <TTTTTTTTTTTTTTT>
##$WBST= 1024
##$WBSW= 4
##$XGAIN= (0..3)
0 0 0 0 
##$XL= 0
##$YL= 0
##$YMAX_a= 400834
##$YMIN_a= -333703
##$ZGOPTNS= <>
##$ZL1= 120
##$ZL2= 120
##$ZL3= 120
##$ZL4= 120
##$ABSF1= 16.522
##$ABSF2= -4.171173
##$ABSG= 5
##$ABSL= 3
##$ALPHA= 0
##$AQORDER= 0
##$ASSFAC= 0
##$ASSFACI= 0
##$ASSFACX= 0
##$ASSWID= 0
##$AUNMP= <proc_1d>
##$AZFE= 0.1
##$AZFW= 0.1
##$BCFW= 0
##$BC_mod= 0
##$BYTORDP= 0
##$COROFFS= 0
##$CY= 12.5
##$DATMOD= 1
##$DC= 0
##$DFILT= <>
##$DTYPP= 0
##$F1P= 14.0000005364418
##$F2P= -0.99999901652339
##$FCOR= 0.5
##$FTSIZE= 32768
##$FT_mod= 6
##$GAMMA= 0
##$GB= 0
##$INTBC= 1
##$INTSCL= 1
##$ISEN= 128
##$LB= 0.3
##$LEV0= 0
##$LPBIN= 0
##$MAXI= 10000
##$MC2= 0
##$MEAN= 0
##$ME_mod= 0
##$MI= 0
##$NCOEF= 0
##$NC_proc= -2
##$NLEV= 6
##$NOISF1= 0
##$NOISF2= 0
##$NSP= 0
##$NTH_PI= 0
##$NZP= 0
##$OFFSET= 16.522
##$PC= 1
##$PHC0= -68.55248
##$PHC1= 6.250092
##$PH_mod= 1
##$PKNL= yes
##$PPARMOD= 0
##$PSCAL= 4
##$PSIGN= 0
##$REVERSE= no
##$SF= 250.13
##$SI= 32768
##$SIGF1= 0
##$SIGF2= 0
##$SINO= 400
##$SIOLD= 32768
##$SREGLST= <1H.CDCl3>
##$SSB= 0
##$STSI= 32768
##$STSR= 0
##$SW_p= 5175.98343685301
##$SYMM= 0
##$S_DEV= 0
##$TDeff= 65536
##$TDoff= 0
##$TI= <Analysis number 999999
Compound Code 99
Book Reference 9
Project Code 9>
##$TILT= no
##$TM1= 0
##$TM2= 0
##$TOPLEV= 0
##$USERP1= <user>
##$USERP2= <user>
##$USERP3= <user>
##$USERP4= <user>
##$USERP5= <user>
##$WDW= 1
##$XDIM= 32768
##$YMAX_p= 295666050
##$YMIN_p= -262965
$$ End of Bruker specific parameters
$$ ---------------------------------
##NTUPLES= NMR SPECTRUM
##VAR_NAME=  FREQUENCY,     SPECTRUM/REAL,   SPECTRUM/IMAG
##SYMBOL=    X,             R,               I
##VAR_TYPE=  INDEPENDENT,   DEPENDENT,       DEPENDENT
##VAR_FORM=  AFFN,          ASDF,            ASDF
##VAR_DIM=   32768,         32768,           32768
##UNITS=     HZ,            ARBITRARY UNITS, ARBITRARY UNITS
##FACTOR=    0.157963299565203, 1,           1
##FIRST=     4132.6476996994, 0,             0
##LAST=      -1043.33573715361, 0,           0
##MIN=       -1043.33573715361, -262965,     0
##MAX=       4132.6476996994, 295666050,     0
$$ Real data points
##PAGE= N=1
##DATA TABLE= (X++(R..R)), XYDATA
$$ [...]
18619B9504p157k4048O045J8046L869k987k06L855q402n505j2392j0515R963P575
18605G645m042j5364O902J0262J249q764K653J534l179q687J2467J3969L671k0194
18591A22k0619j5237J817J4467n123J2754K4868j1231k724J0551M498L748r467
18578H424K937J6439P107J942p436j3314j7569k3446o782J0399J7883m671J2256
18565D169q696k5783j1501O904J7511P121j6193q277N329O035Q893L0799O679
18552B2990j500R86p692k5472J286P033J1259L7967J8758Q707J8642L0906J0496
18539A34366K5688J5611j5655K219J9418p950m813q881l4802j3881n746M227K846
18526A12647n681j7631j8335k5334J3977o983j8446p862J2628l693j9028q357
$$ plain form
18619 29504 22347 -1701 4344 22390 26259 23272 23066 26921 18519 13014 622 -9893 70 7645
18605 7645 3603 -11761 -4859 5403 6652 -2112 541 2075 -1104 -9791 2676 16645 20316 122
18591 122 -20497 -35734 -33917 -19450 -24573 -11819 13049 1818 -906 9645 14143 17891 8424
18578 8424 11361 27800 34907 36849 29413 16099 -1470 -24916 -31698 -21299 -3416 -8087 4169
18565 4169 -4527 -30310 -41811 -34907 -17396 -10275 -26468 -34745 -29416 -23381 -14488 16311 22990
18552 22990 21490 22476 14784 -10688 -9402 -2369 8890 46857 65615 74322 92964 123870 134366
18539 134366 160054 175665 160010 162229 181647 173697 168884 160003 125201 111320 105574 109801 112647
18526 112647 106966 89335 71000 45666 59643 52660 34214 26352 38980 35287 16259 7902
18514G902m789M177n334m949R332M495L347J574j8246j8176N592K7016J0455P199
18500B9595M992n563n045r05j1577m473J7848K3599j6011l3676Q121J2688J8009
18487C7602L5559M0410L7466M5353O489J753j2326r551l329m295j3773m5749k0371
18474I5238j0275j939j1080L770r182k6215K713j5534j1716L36J5691K6207p903
18461E0111O337L8215k0062m0548j0968N882j4152j6704J7830P674J390N883L824
18448C4712j7182j3938M391r023n918J4467J8963K1763J0849j2757l2776k4726
18436a1175Q347K8636j0148M895J1936J4458J5170R130j5065q603j0692j1682
18424B5207J202N909j727K7466p305q728n98K512R838m942k10k051j252o272j2214
$$ plain form
18514 7902 3113 7290 1956 -2993 6339 10834 14181 15755 -2491 -20667 -15075 11941 22396 29595
18500 29595 34587 29024 23979 23074 11497 7024 24872 48471 32460 -1216 6905 19593 37602
18487 37602 73161 113571 151037 196390 202879 204632 192306 182755 179426 175131 161358 115609 95238
18474 95238 84963 83024 71944 75714 66532 40317 43030 27496 15780 16116 31807 58014 50111
18461 50111 56448 94663 74601 34053 23085 28967 14815 -1889 15941 23615 25005 30888 34712
18448 34712 17530 3592 7983 -1040 -6958 7509 26472 48235 59084 46327 13551 -11175
18436 -11175 -2828 25808 15660 20555 32491 46949 62119 71249 56184 47581 36889 25207
18424 25207 26409 32318 30591 58057 50752 42024 41426 43938 53776 48834 48624 46573 45321 39049 26835
18409B6835J0360J6715J6600K1403k4547k3377J0113N261k228k9141k6060L449
18397E383J4394Q901Q960P742Q689J3538r496j358N878j9153j1089N712P347J8320
18383F3768L528k6309j4432l17J6540K578M574n293J6262R116L81o046j2163k878
18369D9309L0980N1705N6521O6108L9531L9803L5619K9675j196j2329l2679m4613
18357C08434j5045J4691K7998K8005r125o731j239k7112k0194k874k9045l2787
18345B34976p71J0281R746K9546K7274L782j6693k3477l2797l0910k3470j9253
18333A68234k2134J668O133k7203k1733k697m039k2300j9460p086J3681J8154
18321H1218p236j8416J4137K343j294N073R85o920j7440n766N863q304j8850k3866
$$ plain form
18409 26835 37195 53910 70510 91913 67366 43989 54102 59363 57135 27994 1934 5383
18397 5383 19777 28678 37638 45380 54069 67607 58111 56753 62631 43478 32389 38101 45448 63768
18383 63768 67296 40987 26555 26238 42778 45356 49930 44637 60899 70015 70396 64350 52187 49309
18369 49309 80289 131994 188515 254623 294154 333957 369576 399251 398055 385726 353047 308434
18357 308434 293389 308080 336078 364083 354958 348227 346988 319876 299682 296808 267763 234976
18345 234976 234205 244486 254232 283778 311052 314834 298141 274664 241867 210957 187487 168234
18333 168234 146100 147768 153901 126698 104965 102268 98229 75929 56469 49383 63064 81218
18321 81218 73982 55566 69703 72046 70752 75825 76810 69890 52450 46684 52547 44243 25393 1527
18307A527o391P81R806J9948L5881J4953p649n977Q363J8001m654J3356J887j4913
18293H4919j0710o136j977K180K6092J0317j2328m708L448K3288j3595J988L469
18280A06247J4648p856k644J5521r035j2308N744P198P26N010j583k745o136J4398
18266A27185J9730k297l050k58K9392N445k4089q643R443J47J959n070J9120J9600
18252A88614k3891o101k17l717m864J8071J120k911J3632l443j381J2805K3007
18239B10724L4839N0158L9610j2860Q523n665m673j968j3144J6542N3378N0443
18227D25907L1035M1604O7857L3733M5401K2653M2879O3518O7846J10493J46409
18216A099335K24941L19888M46732O28788R79720J572647K406993L122577K919612
$$ plain form
18307 1527 -4864 -4083 5723 25671 61552 76505 68856 62879 71242 89243 84589 97945 99832 84919
18293 84919 74209 68073 66096 68276 94368 104685 92357 87649 91097 114385 100790 102778 106247
18280 106247 120895 113039 110395 125916 116881 104573 110317 117515 118241 123251 121668 118923 112787 127185
18266 127185 146915 144618 141568 141310 170702 176147 152058 143415 152858 153005 154964 149894 169014 188614
18252 188614 164723 158622 158405 154688 149824 167895 169015 166104 179736 176293 174912 187717 210724
18239 210724 245563 295721 335331 322471 330994 325329 320656 318688 305544 322086 375464 425907
18227 425907 456942 498546 566403 600136 645537 668190 711069 774587 842433 952926 1099335
18216 1099335 1324276 1644164 2090896 2719684 3699404 5272051 7679044 10801621 13721233
18207A3721233K103039Q62133j084842k123735k413221k190540j149129l2113
18199G692825R39456J869362K544672K317495J469888K50380j584314k531707
18191A2968057k740858k531346j713854r88785o16076m64989m05787l54805l18914
18182B832643k88954k33277j90858j59147j40050j46899j25247p2054o1549l3787
18172A380821p847K7408O1121L8151N1221K4438L5924R2096J22288J94941K91075
18161B311637L71098N58692Q17697J213904J881614K969953M509568N752038N349455
18152B5735656L831153J475189k065316l981750m482799l990142k066853L096
18144A4458234J844551L687939M929582M401425K803778M13085l061825m846810
$$ plain form
18207 13721233 15824272 16686405 15601563 13477828 11064607 8874067 7724938 7692825
18199 7692825 8632281 10501643 13046315 15363810 16833698 17084078 15499764 12968057
18191 12968057 10227199 7695853 5981999 4993214 4377138 3912149 3506362 3151557 2832643
18182 2832643 2543689 2310412 2119554 1960407 1820357 1673458 1548211 1476157 1414608 1380821
18172 1380821 1372974 1400382 1461503 1499654 1550875 1575313 1611237 1703333 1825621 2020562 2311637
18161 2311637 2682735 3241427 4059124 5273028 7154642 10124595 14634163 20386201 25735656
18152 25735656 29566809 31041998 28976682 24994932 20512133 16521991 14455138 14458234
18144 14458234 16302785 19990724 24920306 29321731 32125509 32538594 29476769 24629959
18136B4629959n375651m936169l277390j902075j176310q86894p36956o62889
18128E675625o38639n53541m55454l51561k78759k00144j38499j00290n5563L5649
18118B938824J63675L77375O34512J090009J861030L163154N332999Q158916Q890231
18109C2610725M034971k000534o517272r004552o443417l409927j812873j004899
18101F452222n75359m32338n56573n93406n64587n21443m26060l69742l35591
18092B077123k67357k19780j84864j74093j36448j07439j00541p0247o2245m4593
18082G09516l1652k3519l1786o0303l9381l1658j5841Q57j3109j3941k392k0887
18070D25904p718m076q24P594P642J3616K3556J4195K9587L5587L7432L4106J4335
$$ plain form
18136 24629959 19254308 14318139 11040749 9138674 7962364 7075470 6338514 5675625
18128 5675625 5036986 4483445 4027991 3676430 3397671 3197527 3059028 2958738 2903175 2938824
18118 2938824 3102499 3479874 4114386 5204395 7065425 10228579 15561578 23720494 32610725
18109 32610725 36645696 34645162 28127890 19123338 12679921 9269994 7457121 6452222
18101 6452222 5876863 5444525 4887952 4294546 3729959 3208516 2782456 2412714 2077123
18092 2077123 1809766 1589986 1405122 1231029 1094581 987142 886601 816354 754109 709516
18082 709516 677864 654345 622559 562256 522875 491217 475376 476233 463124 449183 446791 425904
18070 425904 418186 414110 413286 420880 428522 442138 465694 479889 509476 545063 582495 616601 630936
18057F30936J2093K6116J6610O948k878R482L5603L1656K0556O4559O9502N4922
18045I76105P1300J00920J13961J44980J56476J90896K13166K85836M05882N90352
18035C249874Q53585J295407J969286L002372M224285N062701M921676M205621
18027B8784807L768624L550008L038846J685810m35193k130277k773203l057037
18019C2432385l600207m279016m686656m237562l147198k163012j502401j140332
18011G676001r00362q01821p22277o28692n53520m74259m24440l70169k90742
18002B509719k68634k18036j69119j36740r8992p7832r4384q5296p3512k1992
17992A265182k4862L871n858N880J1925J1044K8256P8342Q5057J00067K02542
$$ plain form
18057 630936 643029 669145 685755 692703 689825 699307 734910 766566 787122 851681 921183 976105
18045 976105 1047405 1148325 1262286 1407266 1563742 1754638 1967804 2253640 2659522 3249874
18035 3249874 4103459 5398866 7368152 10370524 14594809 19657510 24579186 28784807
18027 28784807 32553431 36103439 39142285 40828095 40392902 38262625 35489422 32432385
18019 32432385 28832178 24553162 19866506 15628944 12481746 10318734 8816333 7676001
18011 7676001 6775639 5973818 5251541 4622849 4069329 3595070 3170630 2800461 2509719
18002 2509719 2241085 2023049 1853930 1717190 1618198 1540366 1445982 1360686 1287174 1265182
17992 1265182 1240320 1244191 1238333 1244213 1256138 1267182 1295438 1373780 1458837 1558904 1761446
17981A761446K74869M09654O62180J035140J570324K260284K690257K575312K205715
17972A5445181J978355J852946J606782R16700k34032j142095j513948j686266
17964A7223623j954403k310538k501036k272161j677700j121926p71124n88184
17956D026551m82488m45866l62921l33357l18893k67951k18145j83210j35287
17947A278433j18863j09034j06022r3192p1007o3484m4463n0263k5854j8783j7228
17936E60240k9654o4794n3872j7838j7701k0691l2445k7429l317p426m9483j4886
17924B20704J3232q899k0680l770k641l2498r461J2460K9688O767k5980j0834
17912A68088J0605L425Q901o985j6923n251j207N638M942L453m39n194k1177q785
$$ plain form
17981 1761446 2036315 2445969 3108149 4143289 5713613 7973897 10664154 13239466 15445181
17972 15445181 17423536 19276482 20883264 21799964 21565932 20423837 18909889 17223623
17964 17223623 15269220 12958682 10457646 8185485 6507785 5385859 4614735 4026551
17956 4026551 3544063 3098197 2735276 2401919 2083026 1815075 1596930 1413720 1278433
17947 1278433 1159570 1050536 944514 851322 780315 716831 672368 622105 596251 577468 560240
17936 560240 530586 465792 411920 394082 376381 355690 323245 295816 292499 285073 235590 220704
17924 220704 233936 225037 204357 200587 197946 165448 155987 168447 198135 204902 178922 168088
17912 168088 178693 182118 191019 184034 167111 161860 160653 166291 171233 174686 174247 169053 147876 139091
17898A39091M645J4233K001k293lL912j9833j239P554k0343J1857M361K018j0403
17884A35558k1364m064l04k4933m125J1373J2504p223p080O276n257j1566m011
17871G5784M064L98J0711k986N895K831J0375j9881L219K1352P931O303l789Q371
17857A30578Q860J0018k380K459M865P62l102o231K3978J5957j672K377J7410
17844B03879Q769o503k8617p295Q02K5493J2120J1740m047j9538n182Q131K0756
17831B20508N639L656j6447Q884J8492J8007J3498L4758j25Q834J3991N5980O5448
17818D51123N8834N6667R1896Q6487P7522O1573P6359P8024N2821L2346O5074
17807A188726N8911L1979L7441O4683J00904J56711K01293K74319M08432N49571
$$ plain form
17898 139091 143736 157969 159970 157677 157674 161586 141753 140514 148068 127725 139582 143943 145961 135558
17884 135558 114194 110130 109826 84893 80768 92141 104645 97422 90342 96618 91361 79795 75784
17871 75784 79848 80246 90957 87971 93866 96697 107072 87191 90410 111762 119693 125996 122207 130578
17857 130578 139438 149456 147076 149535 154400 155162 152060 145829 169807 185764 184092 186469 203879
17844 203879 212648 206145 177528 170233 171035 196528 208648 220388 216341 196803 191621 199752 220508
17831 220508 226147 229803 213356 222240 240732 258739 272237 306995 306870 315704 329695 385675 451123
17818 451123 509957 566624 658520 745007 822529 884102 960461 1038485 1091306 1123652 1188726
17807 1188726 1247637 1279616 1317057 1381740 1482644 1639355 1840648 2114967 2523399 3072970
17797C072970P73264J070141J564818K336384L441796M770135N940404O393128
17789B9363040N675022L648454O96994k302562m596006n634095n397591m338566
17781A7114690l025476j868592j068997n23767j04201L69039J032251K020046
17773A3944993L318172M772367N919276O115358N042605K631357m84506l435406
17765C7824216n480330o133348n612728m394358l105139k129250j507507j187828
17757H273728j030357r23830q09211p04776o20632n26470m30476l65675k98755
17748B563546k27293j65276j47382j49894j14332r8048j40232j61757j21506j12460
17738A125366j33938j29436j06392r1444p3238m6573m8151m7290k1486j5870l7263
$$ plain form
17797 3072970 3846234 4916375 6481193 8817577 12259373 17029508 22969912 29363040
17789 29363040 35038062 38686516 39383510 37080948 32484942 26850847 21453256 17114690
17781 17114690 14089214 12220622 11151625 10627858 10523657 10892696 11924947 13944993
17773 13944993 17263165 22035532 27954808 34070166 39112771 41744128 41259622 37824216
17765 37824216 32343886 26210538 20597810 16203452 13098313 10969063 9461556 8273728
17757 8273728 7243371 6319541 5510330 4805554 4184922 3658452 3227976 2862301 2563546
17748 2563546 2336253 2170977 2023595 1873701 1759369 1661321 1521089 1359332 1237826 1125366
17738 1125366 991428 861992 755600 664156 590918 544345 496194 448904 427418 411548 374285
17727C74285n2583j8196j6895k5615q326o8m3911l5284J724o249l407J0965K930
17714A79370j1766k2155j5138p248J3369l649n20k7192j4491P768q67M17q503
17701H9395p364o815K772n401L179n262k2553L1086O455o40J6070K5725N083j0721
17687A21009k4070J6931K1042J8107k4301r665N295j9628r391J7178M2541L4856
17675A89904J4279P971n155r062j7564M63L360j3628l005k2790n058L7119L9463
17662B16297J7023m330k1293j3341n2240m1656j274O292R826j8437K618Q052j6294
17649I1243k5262j0667r699q917J8721J0993M146o134r651j4095l055J4246O730
17636E8599L306k098L665o552p248q125j1459P404J4367J637N492r999J2455J2030
$$ plain form
17727 374285 321702 303506 286611 260996 252670 252602 208691 173407 175131 168882 165475 176440 179370
17714 179370 167604 145449 130311 123063 136432 132783 132263 105071 90580 98348 97481 97898 89395
17701 89395 82031 75216 77988 72587 75766 70504 47951 79037 85492 84852 100922 126647 131730 121009
17687 121009 96939 113870 134912 153019 128718 119053 124348 104720 95329 112507 155048 189904
17675 189904 204183 212154 206999 197937 180373 180836 184196 170568 167563 144773 139715 176834 216297
17662 216297 233320 228990 207697 194356 142116 100460 99186 105478 115304 96867 99485 107537 91243
17649 91243 65981 55314 45615 36698 55419 66412 70558 64424 54773 40678 37623 51869 58599
17636 58599 61905 59807 63472 56920 49672 41547 30088 37492 51859 53496 58988 48989 61444 73474
17622G3474J9447K4475j3403j3578J9061o95q068p258K6038J0341J082j9256k2372
17609H9288l645l117K3334L8664L470p328j4882k7402l2073p745Q284P324J6985
17596I1157M561j6278r635j9203j5917n754j4999K907n216J6355q416k4345J7519
17583A2736J1519k434m79N885k013m171j584n953k71O553p111K1430J6470J548
17569E2125p068k3290J264j654j4607p822o947K785M448L0879J8858L614P195
17556E9780r181k5703j4817J5051J4557R446j7059k7856q842L890L10M946O981
17543A1503J4269K808K289j0273J132n129q475N380m611k618j8890K3480J3996
17530B4861j670J27J5089Q284K782r254O25l142J8633M0260K2376r843K0929L4373
$$ plain form
17622 73474 92921 117396 103993 90415 109476 108781 100713 93455 119493 129834 130916 111660 89288
17609 89288 85643 82526 105860 144524 147994 140666 125784 98382 66309 58564 66848 74172 91157
17596 91157 95718 79440 69805 50602 34685 28931 13932 16839 11623 27978 19562 -4783 12736
17583 12736 24255 21821 21342 27227 25214 21043 19459 13506 13235 19788 12677 34107 50577 52125
17569 52125 45057 21767 23031 21377 6770 -1052 -7999 -5214 -766 30113 48971 52585 59780
17556 59780 50599 24896 10079 25130 39687 49133 32074 4218 -4624 -734 -424 4522 11503
17543 11503 25772 28580 30869 20596 21728 16599 8124 13504 8893 6275 -12615 10865 24861
17530 24861 23191 23318 38407 46691 49473 40219 40844 37702 56335 96595 118971 109128 130057 164430
17516A64430K6957J227q453q368j1346k2372l7856m1638k9719K227K507j3673
17504B3923j0556q359N146K5146P667L702J563k2248n505L396j580j3726k953
17491E616j0676J809j4443r673L905J9242J8692j1487M353Q286p815L014J3444
17478B4267K4480R345j5131L505j2838k7619j0975J7132K6199K7758J1550p562
17466G0111R137M796J6304M2693J0080j7053k2866J9563J6755j1235k4409j3659
17454A00217j0066k326k1646j206K1750J3351j869J6341M513L6926N7225J5375
17442B28585r062m2543m4799m4356k1359j3050P962L825O833j1279J6330Q466
17430H5553k0992n510o599q077J8195Q713k1702j3935J3073j4304j6119P308M1
$$ plain form
17516 164430 191387 192614 184161 175793 164447 142075 104219 62581 32862 35089 37596 23923
17504 23923 13367 5008 10154 35300 42967 46669 48232 25984 20479 23875 22295 8569 5616
17491 5616 -5060 -3251 -17694 -27367 -23462 -4220 14472 2985 7338 15624 7809 10823 24267
17478 24267 48747 58092 42961 46466 33628 6009 -4966 12166 38365 66123 77673 70111
17466 70111 79248 84044 100348 143041 153121 136068 113202 132765 149520 138285 113876 100217
17454 100217 90151 87825 66179 64973 86723 100074 98205 114546 119059 155985 213210 228585
17442 228585 219523 176980 132181 87825 66466 53416 61378 65203 72036 60757 77087 85553
17430 85553 64561 59051 52452 44375 62570 71283 49581 35646 48719 34415 18296 25604 25645
17417B5645j676P475P019R1k3335J241j306J6118K8804J620j4903J385j3792k785
17403C1601k854N871m050n448j7556J7883K0261r716j484J6529m506j1251k7455
17390G825K503J7740N11j7642j2123Q103m204N801K8246Q773q495Q084k1513j9008
17376D601l423j0486J2710J8165r513J5391n916k3794k6008J0732r648o670J5546
17363a8313J7602J9613j8503j8428J7943K1873p53J391j4886J554M4581J9944
17351G3618L398K5026L6416J6759K8231l872m951o763r445K808L808j2917j8700
17338A33416k2653j4043l537J8231j5104m662Q321K7222K4773J1046P203Q690
17326A78903L1048m175j5798n731q141N263j6930m8021k6882l525l357q188j3161
$$ plain form
17417 25645 23969 31444 38463 38554 15219 16460 15154 31272 60076 61696 46793 48178 34386 31601
17403 31601 28747 34618 30568 25120 7564 25447 45708 35992 34508 51037 46531 35280 7825
17390 7825 10328 28068 28579 10937 -1186 6917 2713 8514 36760 45533 37038 45122 23609 4601
17376 4601 1178 -9308 3402 21567 12054 27445 21529 -2265 -28273 -17541 -27189 -33859 -18313
17363 -18313 -711 18902 399 -18029 -86 21787 21034 22425 7539 9093 53674 73618
17351 73618 77016 102042 138458 155217 183448 179576 174625 167862 158417 161225 165033 152116 133416
17338 133416 110763 96720 93183 111414 96310 91648 99969 127191 151964 163010 170213 178903
17326 178903 209951 205776 189978 184247 176106 181369 164439 116418 89536 86011 82654 74466 61305
17313F1305k3445k6917o158o04j2772M587m806o35k110K974J5018O436k145j5908
17299e180q742Q137j3122L030K4597J2681m823M719k622l935j4239J6001J717
17286A8219J646R099j0793r38k6417j2014O095N372M615J3950J1459q215k0866
17273h788j3039q876Q880J3393m518k0145n093M752K5356O30K546j750N537j6542
17259a7657j6374R390O372j6628J4090J899J8389J500K536l327K010N712K356
17246A0268O846J0091J768p01j4391r135j0775M125m50k099j60K1712k170j4143
17232G86m029J457k764j4931m203k660O613k773j1756J3077n219o239o182J2803
17218b6020J5217M190L2927K8168J0596J9405M4442J1474J7322K3478L425n387
$$ plain form
17313 61305 37860 10943 4785 4181 -8591 -4004 -8810 -9445 -11555 -8581 6437 12873 10728 -5180
17299 -5180 -13922 -5785 -18907 -15877 8720 21401 16578 21297 18675 14740 501 16502 18219
17286 18219 19865 28964 18171 17233 -9184 -21198 -15103 -9731 -5116 8834 20293 12078 -8788
17273 -8788 -21827 -30703 -21823 -8430 -12948 -33093 -38186 -33434 -8078 -7448 -4902 -6652 -1115 -17657
17259 -17657 -34031 -24641 -18269 -34897 -20807 -18908 -519 981 3517 190 2200 7912 10268
17246 10268 17114 27205 28973 28272 13881 4746 -6029 -1904 -2354 -4453 -4613 17099 14929 786
17232 786 -3243 -1786 -4550 -19481 -23684 -26344 -19731 -22504 -34260 -21183 -26402 -32641 -38823 -26020
17218 -26020 -10803 -6613 26314 54482 65078 84483 128925 140399 157721 181199 184624 179237
17206A79237k601q384l3079l8148m1993j7014K070N016M823K1j6900J4342L3235
17193H0625M8051K6775O364M0427K8539K780j8738J24k5888l8962l0550k2314
17181I7233k3360l1293k0096k40L650J1278Q967q951m485K261q814j13P832j9736
17167A4133l453J7506M773p93p629j4561r502j0472R321k1492k541J9820o205
17154a1095J1895l722j3218j6224K523N788J5170R669j5544m406J2666j8023l1826
17141e6347k906L000J35N027l142K4886J2061k794R153l2447L658j4899L4J2632
17127d1949P804J2102j0402L1714J9221j6181o037q276K127J0619j4334k0154
17115c3746o524R068k65p221j2653r583Q460K9579R783O448M350k421J9267n131
$$ plain form
17206 179237 176636 168252 135173 97025 55032 38018 40088 45104 49927 49948 33048 47390 80625
17193 80625 128676 155451 161815 202242 230781 233561 214823 214947 189059 150097 119547 97233
17181 97233 73873 42580 22484 22244 25894 37172 46139 37188 32703 34964 26150 26037 33869 14133
17167 14133 10680 28186 32959 32166 24537 9976 474 -9998 -677 -22169 -24710 -4890 -11095
17154 -11095 800 -2922 -16140 -32364 -29841 -24053 -8883 786 -14758 -19164 -6498 -24521 -56347
17141 -56347 -59253 -56253 -56118 -51091 -54233 -29347 -17286 -20080 -10927 -43374 -39716 -54615 -54581 -41949
17127 -41949 -34145 -22043 -32445 -731 18490 2309 -3728 -12004 -9877 742 -13592 -33746
17115 -33746 -40270 -31202 -31467 -38688 -51341 -60924 -52464 -22885 -13102 -6654 -2304 -4725 14542 9411
17101I411k699p014M802r728J019m037K1501K895K1200J6520M97N423j4748j7296
17087B7746j3388K750O607K939K819o465l570p890n556R042M850M372Q689L814
17073C6759n019j8424n723o762Q472m432Q640J5548O130j2392O223J5407J7690
17060F2117L720J31r123m179J077j366j7894p570R982r579j4873J2374L3678N331
17046F3826j2333M561Q942q996k2953k6043j2952K0608K370n210L223J2110K353
17033B9506J054p887j3331K4932K0545q216j156l578k4550j5241J2177N127M715
17020B4097j3588m4894j1559L3326K5557Q337j5333n720J2747R038l604j831j4937
17007A636j3533J0868K3028J9452j3967k3590j7546J5679N513P840J742N784r729
$$ plain form
17101 9411 6712 -302 4500 -5228 -4209 -8246 13255 16150 37350 53870 54367 59790 45042 27746
17087 27746 14358 17108 23715 26654 29473 23008 19438 11548 5992 15034 19884 24256 32945 36759
17073 36759 31740 13316 7593 831 9303 4871 13511 29059 35189 22797 29020 44427 62117
17060 62117 65837 65968 56845 52666 53743 52377 34483 26913 36895 27316 12443 24817 58495 63826
17046 63826 51493 56054 64996 56000 33047 7004 -5948 14660 17030 11820 15043 27153 29506
17033 29506 30560 22673 9342 34274 54819 46603 45447 41869 17319 2078 14255 19382 24097
17020 24097 10509 -34385 -45944 -12618 12939 21276 5943 223 12970 22008 18404 16573 1636
17007 1636 -11897 -1029 21999 41451 27484 3894 -13652 2027 7540 15380 17122 22906 13177
16994A3177j3373N691K236J2512p659k1639q345j3133O537M0412N217k3566j3184
16981a5117M872P312L993J4594R672q426O527R609K4179m709j1085r264Q132j454
16967C8835j5435j8962o176J6870R827k1928r697J2892J0036J3391P985j9068
16955A8570J1705J4105N215q477k1041N407j4744j5570L807P054J1034J3443J3974
16942D4482K3006r076j6954p037J1666r021n178j121J806k4190M567J4022K4743
16929E1715l376Q39o439K546J3930p388j488K6650K2992j8342m6271k45J2677
16916D7800N871l173j0949Q220P578J2675j7567O33j9607J1265K0382J8328Q572
16903I0028q247k530m05j519j5783p143O321j0177J7780J6387k8755k8529N195
$$ plain form
16994 13177 -196 5495 7731 20243 12584 -9055 -17400 -30533 -23996 16416 21633 -1933 -15117
16981 -15117 -10245 -2933 1060 15654 25326 16900 23427 33036 57215 52506 41421 32157 40289 38835
16967 38835 23400 4438 -1738 15132 24959 3031 -6666 6226 16262 29653 37638 18570
16955 18570 30275 44380 49595 41118 20077 25484 10740 -4830 -1023 6031 17065 30508 44482
16942 44482 67488 58412 41458 34421 46087 37066 31888 30767 32573 8383 12950 26972 51715
16929 51715 48339 49178 42739 45285 59215 51827 50339 76989 99981 81639 35368 35123 47800
16916 47800 53671 50498 39549 47769 55347 68022 50455 51088 31481 42746 63128 81456 90028
16903 90028 81781 79251 78846 77327 61544 54401 60722 50545 68325 84712 55957 27428 32623
16890C2623K2574O615O21l841J2207j4964j8954r508N822L347J3023l362j0267
16877C5936O510O160J5904r75J281L438J832N107k171J2080K2622O32J469j216
16863A08609k2611N761n296j0983J3376Q793j0735J0681J4860j42O449N95P993
16850A27350l657J0720J8143J698J213j104N950R31j0986L779J6473J9620J8594
16837B08724K5889Q469l282k076K0192J7384J3182R963L5438J7849K6262M6729
16825D24723N6200O0190O2276N2930M3196O3048P6382R5503P0844O1942R1967
16814A159201R1133J25373J26105J44518J89364K36565K84468M26231N97627Q60141
16804D240726J271019J888526K911347M384922N801234N806941L738838J190389
$$ plain form
16890 32623 55197 61812 62433 58592 70799 55835 36881 27373 33195 36542 49565 46203 35936
16877 35936 42446 48606 64510 63535 64816 68254 70086 75193 73022 85102 107724 108356 109825 108609
16863 108609 85998 91759 86463 75480 88856 97649 86914 97595 112455 112313 118762 119357 127350
16850 127350 123693 134413 152556 154254 155467 154363 160313 161244 150258 154037 170510 190130 208724
16837 208724 234613 243082 239800 237724 257916 275300 288482 298445 333883 351732 377994 424723
16825 424723 480923 541113 603389 656319 699515 762563 838945 934448 1005292 1067234 1159201
16814 1159201 1250334 1375707 1501812 1646330 1835694 2072259 2356727 2782958 3380585 4240726
16804 4240726 5511745 7400271 10311618 14696540 20497774 26304715 30043553 31233942
16796C1233942l86454j78474J103757Q28237j372907l782102n177953m806184
16788A7461862l270096j864371q76540j25641N56360J320053K467107M002668
16780A9671402N173814M611866K307833P7738r28603j97429Q59080p0204k383961
16771B9121536m507977n407350m565714l093142j985690j334481r01306p33179
16763F592697p36664p21045o37363n32791m92504m15095l58959l20145k80363
16754B097768k15529j96886j70517j30629j17409j24947j14916r5192o2301n6423
16744H13019n6686n5458n5013o1750n7690m3027l3273l4616m7339l8978q591k5775
16732B94823k9173k9185k5064n176k0547k2872Q111J1731k7612k652R739Q781
$$ plain form
16796 31233942 30847488 30669014 31772771 32601008 31228101 27445999 22268046 17461862
16788 17461862 14191766 12327395 11450855 11325214 11881574 13201627 15668734 19671402
16780 19671402 24845216 29457082 31764915 31842653 30914050 30716621 31575701 31505497 29121536
16771 29121536 24613559 19206209 14640495 11547353 9561663 8227182 7325876 6592697
16763 6592697 5856033 5134988 4497625 3964834 3472330 3057235 2698276 2378131 2097768
16754 2097768 1882239 1685353 1514836 1384207 1266798 1141851 1026935 931743 869442 813019
16744 813019 756333 700875 645862 584112 526422 483395 450122 415506 368167 329189 320598 294823
16732 294823 265650 236465 211401 206225 185678 162806 170917 182648 155036 152384 162123 170904
16720A70904n190m215m920k17k8936l0764k100j6432k7391j0148J0933K6747j641
16707G6630k1700L929J2488K8233K653o060j0944j6916k70n085O070Q213k614
16694G4627L152r47l159J0129r976j8076P075o823o710n805l040K6049J0536O179
16680H3211j9284p636J865O444L692Q647l03q830L286r01k5566k0856Q537Q789
16666D1095k0095o438L8795k284p082M446J3639J1261j4770o590j4023P219J0972
16653E6145m621j5188L221K4296K272j1951n904n64m975O523K4256N724k6206
16640E3028j6635j7749n802k1735N594K116Q131J1392j359o070r770K036J739
16627D916J1095j627r877o867J4933L834j7634n782l807n18j4433o022K4551J8804
$$ plain form
16720 170904 165714 161499 156579 156362 127426 96662 94562 78130 50739 40591 51524 78271 76630
16707 76630 54930 58859 71347 99580 102233 96173 85229 68313 68043 62958 69028 77241 74627
16694 74627 77779 76832 73673 83802 73826 55750 62825 56002 49292 43487 40447 66496 77032 83211
16680 83211 63927 56291 58156 64600 68292 76939 76636 67806 71092 70191 44625 23769 32306 41095
16666 41095 21000 14562 53357 51073 43991 48437 62076 73337 58567 51977 37954 45173 56145
16653 56145 51524 36336 39557 63853 66125 54174 48270 47706 42731 49254 73510 79234 53028
16640 53028 36393 18644 12842 -8893 -3299 -1183 6948 18340 16981 10911 1141 3177 4916
16627 4916 16011 14384 4507 -2360 12573 16407 -1227 -7009 -10816 -11334 -25767 -31789 -7238 11566
16613A1566P142J3631j2413P85J2403j3085k6610J0194J7528K843n536Q414n768
16600B1094j4915l2349j8197J7346K4511J6512L589m127K270r137n621K1287K2559
16587D4822k603m630O017k986p498J2720j7208k4102M843j14J5756m09j2022L734
16573A6320R849o211Q685k541o584Q516J0901J7747l531r095l881j4852N645J0730
16559D1698N991J0272n510l4871j2368J3824J1982n876k0979j1484J247r071K0660
16546E515K6136L2807J2540k3940m9348j7495J8017J4359k6106j4387K8806J456
16534H360m484l796k04k9005k360L1778m56J561J3114J3868n044r707R591L8797
16520F2013J543q378K49j8091N437M653l4244j8472k2217J4436Q897j0500J4172
$$ plain form
16613 11566 18708 32339 19926 20711 33114 20029 -6581 3613 21141 23984 18448 26862 21094
16600 21094 6179 -26170 -44367 -27021 -2510 14002 17591 13464 15734 6597 976 22263 44822
16587 44822 42219 37589 43606 40620 33122 45842 28634 4532 9375 9261 25017 24608 12586 16320
16573 16320 26169 19958 28643 26102 19518 28034 38935 56682 53151 44056 40175 25323 30968 41698
16559 41698 47689 57961 52451 17580 5212 19036 31018 25142 4163 -7321 -6074 -15145 5515
16546 5515 31651 64458 76998 53058 3710 -13785 4232 18591 -7515 -21902 6904 8360
16534 8360 3876 80 -124 -29129 -31489 289 -167 1394 14508 28376 23332 13625 23216 62013
16520 62013 63556 55178 55427 37336 42773 47426 13182 -5290 -27507 -13071 -4174 -14674 -502
16507e02M697q794J5579n146l9222p032O784J1171J6787N849j8359J5696J3691
16494A1199N174j0576j3427J2555p703J1363p428j8856J4828M679j1089o551M125
16481a1707m562M220q166j751J6686J1165l524p951j4827k552K1722K584k9643
16468b8306l525J4551Q100p016k5197n153J5374J6887J5639k622O592J7591k80
16455B2635j4773j0128o805J2056R695j8790J993R442j9505P558K0955j2664j5401
16442a3732Q973J0368P498J7507L153k070K1384R078j5050o214k1946k1247j9230
16429b1528J134K7660J6483n891m957j0943n356j5504L088J3908J5365L042n252
16416A1249k0215q056J7457M918O238n904j2135J2567l944j4697J3459R717m681
$$ plain form
16507 -502 4195 -4599 10980 5834 -33388 -40420 -33636 -22465 -5678 171 -18188 -2492 11199
16494 11199 16373 5797 -7630 4925 -2778 8585 1157 -17699 -2871 1808 -9281 -15832 -11707
16481 -11707 -16269 -12049 -20215 -21966 -5280 5885 2361 -5590 -20417 -22969 -1247 1337 -28306
16468 -28306 -31831 -17280 -9180 -16196 -41393 -46546 -31172 -14285 1354 -1268 5324 22915 22635
16455 22635 7862 -2266 -9071 2985 12680 -6110 -4117 5325 -14180 -6622 14333 1669 -13732
16442 -13732 -4759 5609 13107 30614 33767 31697 53081 62159 47109 40895 18949 -2298 -21528
16429 -21528 -20394 7266 23749 17858 12901 1958 -3398 -18902 -15814 -1906 13459 16501 11249
16416 11249 -8966 -17022 435 5353 11591 5687 -6448 6119 2175 -12522 937 10654 5973
16403E973m184l359K0152O438k719L854k2394J792j3710J0093N534j8756J399
16390i887J0325q029O368p75O593j6003l531m592O372j0187J1428Q316N031P651
16376I080K1516P347j7411n495k4j3694j6877J5014r157j8114m263K0254R202
16363b622Q512Q061j1058j5477q874J2239j731k1974O439J465q978J2049J1219
16350a0730K390O016o776J3300j3137l1447k1969J2779K1892o850P406O426k602
16337b3302J491J6261K3623M077p912p564l3166R222K6628K7680n639k5107j5630
16324i338j6016r463L2122o651k3685J0975K1765m919J786J6437P546O777J1372
16311C8708n466j3179m268Q123j5044r829L589N221R8j0972K974k0427R410p372
$$ plain form
16403 5973 1789 -1570 18582 25020 22301 26155 3761 5553 -8157 1936 7470 -11286 -9887
16390 -9887 438 -7591 -1223 -1998 4595 -11408 -14939 -19531 -13159 -23346 -11918 -3602 1429 9080
16376 9080 30596 37943 20532 15037 15013 1319 -15558 -544 -9701 -27815 -32078 -11824 -2622
16363 -2622 5890 13951 2893 -12584 -21458 -9219 -10950 -32924 -26485 -25020 -33998 -21949 -10730
16350 -10730 -8340 -2324 -9100 4200 -8937 -40384 -62353 -49574 -27682 -34532 -27126 -20700 -23302
16337 -23302 -21811 -5550 18073 22150 14238 6674 -26492 -17270 9358 37038 31399 6292 -9338
16324 -9338 -25354 -34817 -2695 -9346 -33031 -22056 -291 -5210 -3424 13013 20559 27336 38708
16311 38708 33242 20063 15795 23918 8874 -955 2634 7855 7953 -3019 -45 -20472 -11062 -18434
16297a8434J7013J4092J0466M275j0826r195O446p016j1356j4281q026N693P154
16284a3995J254j4678P84L2481J4405J364j4318j1070Q820j2348M030M396j489
16271c64j0724M385O40k563n116j5948N53J6243j3047l869l413n485K2357J1916
16257d435M99k817o023J0041l41O117J8206J531j497Q379L5896K1265L3907K2848
16243A43576L6712K8374k0094k4392P219N541O490k4913l9137j8908k2322j2849
16231F5297J1136K5726n692l291J2563J7071N674O626J5107J8313N160j7997O136
16218A61829J3802j3484k3615j9260j9500J1534j9316k7137l4936r836L140K0075
16206D3296r536r555j8286j5073q692L702l867N117L6219K7292J997j5421l2286
$$ plain form
16297 -18434 -1421 12671 23137 27412 16586 7391 13837 6821 -4535 -18816 -26842 -21149 -13995
16284 -13995 -12741 -27419 -26635 5846 20251 21615 7297 -3773 5047 -7301 -3271 1125 -364
16271 -364 -11088 -6703 -6063 -8626 -13742 -29690 -29137 -12894 -25941 -29810 -33223 -38708 -16351 -4435
16257 -4435 -3936 -6753 -12776 -2735 -3076 3041 21247 22778 21281 29660 65556 86821 120728 143576
16243 143576 180288 208662 188568 164176 171395 176936 183426 158513 119376 100468 78146 65297
16231 65297 76433 102159 96467 93176 105739 122810 128484 135110 150217 168530 173690 155693 161829
16218 161829 175631 162147 138532 119272 99772 111306 91990 64853 29917 20081 23221 43296
16206 43296 33760 24205 5919 -9154 -17846 -14144 -18011 -12894 23325 50617 52614 37193 4907
16193D907k0470J697n070j0724L86J9462J1490j7489L728K329n020K1667O626
16180A3519k1982j5498m394N658M13J0628K017j8757L4484J9515k2008j2264j2676
16167b1345J8012P819l937L723L165P416q992k0289l653P966J7359N75n956l190
16153a327J0969J492o681q488o097N622P064J1030l91m843k7012j0311J7358o282
16139a7897K865J1731k2981j3859r108L2492J2699j7666P586K33N681J6114J3950
16126B1840p904j4000n119R551O880J769J049o431o453r486Q184J8505J7361K375
16112C8121j1376j3250J1301J007j4599j0369Q00j839o635R827l032q057p277
16099a5378r321K6050m147Q006R105k8389n185Q515J0125K168o042P256J390M568
$$ plain form
16193 4907 -15563 -13866 -18936 -29660 -29274 -9812 1678 -15811 -12083 -9754 -14774 6893 13519
16180 13519 -8463 -23961 -28355 -22697 -22284 -11656 -9639 -28396 6088 25603 3595 -8669 -21345
16167 -21345 -3333 4486 549 4272 7437 14853 5861 -14428 -18081 -10115 7244 7819 1863 -1327
16153 -1327 9642 11134 4453 -4035 -10132 -4510 2554 13584 13193 8350 -18662 -28973 -11615 -17897
16139 -17897 -15032 -3301 -26282 -40141 -49249 -16757 -4058 -21724 -14138 -13905 -8224 7890 21840
16126 21840 13936 -64 -5183 4368 11248 13017 14066 7635 1182 -8304 -120 18385 35746 38121
16112 38121 26745 13495 24796 25803 11204 835 1635 -204 -6839 2988 -44 -8101 -15378
16099 -15378 -24699 1351 -2796 5210 14315 -14074 -19259 -10744 -619 1549 -4493 2763 4153 8721
16085H721m29J6623j1950j4913M339n09P85l440J6110J2522j960j4370P516j3118
16071E927j0576J2683j4916o316Q307R539k0519r739R054P038L751N103K209J0318
16057A1863j4583N837J0688l174j5508k292j0333K3087M067q818j2810n655m759
16044b2390K847J1009J3150R330k498j7588l278P18J4968k160j0594R105P672
16031A0291k450k0494L702k0541l129O003k439j947j386J3403N632j866J6362
16018A141R427r869l014J57J7594N705o259j4240j0660o494J122J5021R20r814
16004i263N776J4780N579r417j5723M080p22J1827J6630k248j5613k6344r588
15991c0246O855J5251K862n132J0847m669R99p499P217K122J0079K0744l712j8389
$$ plain form
16085 8721 8292 24915 12965 -1948 2391 1882 2667 -773 15337 27859 25899 11529 19045 5927
16071 5927 -4649 8034 -6882 -13198 -4891 4648 -15871 -25610 -16556 -9518 -5767 -664 1545 11863
16057 11863 -2720 3117 13805 10631 -4877 -7169 -17502 5585 9652 834 -11976 -17631 -22390
16044 -22390 -19543 -8534 4616 13946 11448 -6140 -9418 -8700 6268 4108 -6486 2619 10291
16031 10291 7841 -12653 -8951 -29492 -32621 -26618 -29057 -31004 -32390 -18987 -13355 -15221 1141
16018 1141 10568 699 -2315 -2158 15436 21141 14882 642 -10018 -16512 -15390 -369 551 -9263
16004 -9263 -3487 11293 16872 7455 -8268 -4188 -4910 6917 23547 21299 5686 -20658 -30246
15991 -30246 -23391 -8140 -5278 -10410 437 -4232 -3233 -10732 -3515 -1393 8686 29430 25718 7329
15977G329P480j2457j3291R216j3526j0726r278K2285J5329M600L475j23O982
15964A7295J0470o391K011J0968j0690j2583l308J5608l747q241q327L706j047
15951E724J326P120N517N489j6934k0342o219K5082N964j8317o427r29k900J2972
15937b874Q962K0693k1117k1366j5323J9636J4884K93P21j4371J3387L230j8070
15924a1315J5728M364m357j6240J8086R324l019j8071j59Q406K3886l022n643
15911A7968J365k006o993p145l5540l0910J2421J0190K7105M392P90j0582M332
15898a4613J002j2603K1611R661r830k4683L427j5125M757L3653Q143O571q537
15885C434k5180R692J1446P27j1503j4130J087P746N909J6353M928R54l135M280
$$ plain form
15977 7329 14809 2352 -10939 -1723 -15249 -25975 -35253 -12968 2361 6961 10436 10313 17295
15964 17295 27765 21374 23385 34353 23663 11080 7772 23380 19633 11392 3065 6771 5724
15951 5724 7050 14170 19687 25176 8242 -12100 -18319 6763 12727 -5590 -12017 -12946 -15846 -2874
15937 -2874 6088 26781 5664 -15702 -31025 -11389 3495 3788 4509 -9862 3525 6755 -11315
15924 -11315 4413 8777 4420 -11820 6266 15590 12571 -5500 -5659 2747 26633 23611 17968
15911 17968 19333 17327 10334 3189 -32351 -63261 -50840 -40650 -13545 -9153 -8363 -18945 -14613
15898 -14613 -13611 -26214 -4603 5058 -4772 -29455 -26028 -41153 -36396 -2743 5400 11971 3434
15885 3434 -21746 -12054 -608 119 -11384 -25514 -24427 -16681 -10772 5581 10509 11463 8328 12608
15871A2608L80k001n80o882R991j7151K597n84j8676k0738L283J0138J8410J6403
15857G198k559j387J4294l295J198j0210q20j5872m300J6279K329j0919Q411J44
15843D91j0861J0849k1156j3500O700L1038K5636r829j486q963j3727o282k529
15830a3619J1783J4028J5591j585o372j3626J9290q259k133k5234j3494l545P561
15817a9614J1203n53k549K754J1688K3965R102j2166o822J350Q988j1634j1268
15804D444j6370N476o067K2489N108r027J0853k731O19q252k071K760L342N210
15790A5783m787k2323j703K690j730J026j0393K1695O185n151K277j0666j6530
15777b3627K2482K2946k0974j8190r686K4482J2260R867o869k8405K4364l632
$$ plain form
15871 12608 12988 10987 10407 3525 13516 -3635 -1038 -1622 -20298 -41036 -37753 -27615 -9205 7198
15857 7198 4639 3252 17546 14251 15449 5239 4419 -11453 -15753 526 2855 -8064 347 491
15843 491 -10370 479 -20677 -34177 -27477 3561 29197 19368 17882 8919 -4808 -11090 -13619
15830 -13619 -1836 12192 27783 26198 19826 6200 25490 17231 15098 -10136 -23630 -27175 -19614
15817 -19614 -8411 -8964 -11513 -8759 2929 26894 35996 23830 17008 18358 27346 15712 4444
15804 4444 -11926 -6450 -12517 9972 15080 6053 16906 14175 14794 6542 4471 7231 10573 15783
15790 15783 10996 -11327 -13030 -10340 -12070 -11044 -21437 258 6443 1292 3569 -7097 -23627
15777 -23627 -1145 21801 827 -17363 -27049 -2567 9693 19560 12691 -15714 8650 5018
15765E018N609J6613m46J5363r098j2397n164p95j7343J3833J2351O794j7797
15752A2541P117K5053j026M578k4493k3151O047J2779m978R458J8442J0192M689
15739E7248j0124j2238j2448p00r382j7242l494j1663j8399l093L3700m914K596
15726a0153j6502J5771N7683J5103k6992k0610j0781l209M215Q787j8509q074
15714a3271Q779j9261l518J0063K6341J4112L758m701j7149J343j1k3284J0677
15701f122K6190k0223k6895j0051K9753O797J6912j1414P859j829p69Q783O210
15688B5201M073k2201k8948k6388J2465M7526R098M469L526j4215k9269J3494
15676a169M040p792J2399q558j0492K865P876p93j0090p912j7743J4396K2270
$$ plain form
15765 5018 10627 27240 26794 42157 33059 20662 15498 14703 -2640 11193 23544 30338 12541
15752 12541 19658 44711 43685 48263 23770 619 6666 19445 14467 23925 42367 52559 57248
15739 57248 47124 34886 22438 21738 12356 -4886 -8380 -20043 -38442 -41535 -7835 -12749 -10153
15726 -10153 -26655 -10884 46799 61902 34910 14300 3519 310 4525 13312 -5197 -13271
15714 -13271 -4492 -23753 -27271 -17208 9133 23245 27003 22302 5153 6496 6485 -16799 -6122
15701 -6122 20068 -155 -27050 -37101 -7348 -551 16361 4947 12806 10977 10208 18991 25201
15688 25201 29274 7073 -21875 -48263 -35798 11728 20826 25295 28821 14606 -14663 -1169
15676 -1169 2871 -4921 7478 -1080 -11572 -8707 -831 -1624 -11714 -19626 -37369 -22973 -703
15663g03j5220L364K4015L056o66j9098K383J988J6407J443j941J4124k149J0366
15649C7369r983j3538O069J9697N459p619r454O966j3433k5042J5795j2991j1876
15636a2581L420J2107q417l0597k0836J4973o847J1641o167p589L0028J3764j075
15623h176j0872J0276N024j9665k028o705K129K3925J36j7060J4884J2230q280
15610d182l158j1654O005J4866j5787k4775n300J06K9742J2326j5976j115Q829
15597a0073q454J5524p167K2964J5484k8110o403N870J3369J3049p002j6247j1471
15584h667q50k487J862K453m051r773O547K307J2403j8967n068Q919P435J646
15570f291N04j0505k2070p498J1461J6329J4270j0568l266j5837J5271K4102P621
$$ plain form
15663 -703 -15923 -12559 11456 14512 13846 -5252 -2869 -881 15526 16969 15028 29152 27003 37369
15649 37369 27386 13848 19917 39614 45073 37454 28000 34966 21533 -3509 12286 -705 -12581
15636 -12581 -9161 2946 -5471 -36068 -56904 -41931 -48778 -37137 -43304 -50893 -20865 -7101 -8176
15623 -8176 -19048 -8772 -3748 -23413 -25441 -32146 -30017 -6092 -5956 -23016 -8132 4098 -4182
15610 -4182 -7340 -18994 -12989 1877 -13910 -38685 -43985 -43879 -14137 -1811 -17787 -18902 -10073
15597 -10073 -18527 -3003 -10170 12794 28278 168 -6235 -365 13004 26053 19051 2804 -8667
15584 -8667 -9517 -12004 -10142 -7689 -11740 -21513 -14966 -12659 -256 -19223 -24291 -15372 -7937 -6291
15570 -6291 -5787 -16292 -38362 -45860 -34399 -18070 -3800 -14368 -17634 -33471 -18200 5902 13523
15557A3523J0116J3044j2980k1601j8153Q981M246K15J5862k361n634Q661K0276
15544C4195P851j2962p804j8498n233j3947K434K2584p223P574M782P567K268
15531B3588n048p071j2586l978J735j3725j0334q295l025N649L8047N746j404
15518I299j4150j8653J6766K0088L522j2140n526n091l2526j2233K681K9336L7872
15505A9245J6471k2047j5719J426j7423k6785M118L581P862K0134J8430J912n480
15492E725k3618Q709N236M89N317L775J0214J798K237j3762l0987q598N581j1804
15478c9688q19J7298J1971L872R841M43q372r867m333J3863P590m825k089P564
15464B449J4993J1888m438m476k0379j2919N170O614J6294j0740k829q314j6250
$$ plain form
15557 13523 23639 36683 23703 2102 -16051 -7070 -2824 -2609 13253 10892 5258 13919 34195
15544 34195 42046 29084 21280 2782 -2451 -16398 -13964 8620 1397 8971 13753 21320 23588
15531 23588 18540 11469 -1117 -5095 -3360 -17085 -27419 -35714 -38739 -33090 4957 10703 9299
15518 9299 -4851 -23504 -6738 13350 16872 4732 -794 -5885 -38411 -50644 -47963 -18627 19245
15505 19245 35716 13669 -2050 -624 -18047 -44832 -40714 -37133 -29271 -9137 9293 11205 5725
15492 5725 -17893 -9184 -3948 -3459 1858 5633 15847 17645 19882 6120 -24867 -33465 -27884 -39688
15478 -39688 -40507 -23209 -11238 -7366 2475 2918 -5454 -15321 -19654 -5791 1799 -3026 -5115 2449
15464 2449 17442 29330 24892 20416 37 -12882 -7712 -1098 15196 4456 1627 -6687 -22937
15451b2937R1J833p203J7490K5484l333j2913j5804o225p479m788J166K4107J4128
15437C617J8428Q560r960Q468j815j2701m776j0175j4054L4581O774n398j1061
15424A0488n514j509O240l355j6352j0823M557L103P188N509R988o17r410k310
15410b817O950j708K369J7809l5824j4774o944J1955J8637J6726j311O975n228
15397A2815J571m817r892n600p144m600K1267j251N16K0903q940m488N496l409
15383A2427p108j398O020J2847J2087m122j586k7785n405N948j5199j3246J3821
15370a2699K1280P603O347n378j6833L32o802K624j5100J4873o16j329k1604j1049
15356c8351l693K0620K3561J8670o521R99k4105j1192r190K0304J0074l539j7354
$$ plain form
15451 -22937 -22846 -21013 -28216 -10726 14758 11425 -1488 -17292 -23517 -30996 -35784 -34618 -10511 3617
15437 3617 22045 30605 20645 29113 27298 14597 9821 -354 -14408 20173 26947 21549 10488
15424 10488 4974 3465 9705 6350 -10002 -20825 -16268 -13165 -5977 -468 9520 8903 -507 -2817
15410 -2817 4133 2425 4794 22603 -13221 -27995 -34939 -22984 -4347 12379 11068 18043 12815
15397 12815 14386 9569 -323 -5923 -13067 -17667 3600 2349 2865 23768 14828 10340 15836 12427
15383 12427 5319 3921 9941 22788 34875 30753 29167 1382 -4023 1925 -13274 -26520 -12699
15370 -12699 8581 16184 22531 17153 320 652 -6150 -3526 -18626 -3753 -4369 -5698 -27302 -38351
15356 -38351 -42044 -21424 2137 20807 14286 15285 -8820 -20012 -29202 -8898 1176 -2363 -19717
15343a9717l398q684O973Q740J8485j2557p677Q920P958l482q026J6500J3587
15330A7622j0907k3636J203R573m675O310M319p550n250m468K7208J3226k4462
15317a487r463J0587j5029J2013Q806J627R18q31Q209O912J79q061m318N878k8239
15302a2299j4566J3641K0267K134M312k219j3408K802j7254Q704J5942K252q073
15289B235P345J3757j2391J1835J8186j9388l0878J9955K4803k5339j0357J5941
15277A5704J9805j525j9615n988J778J547j9589j6461l432R773J2690J942K7901
15264B4530J2499j7181m0898m293l458m541j1610j610K2705L3024J8550O088j7012
15251A6793l6973j6327j587K4322J1786j053P797R975j1401n321j4527J7887J2328
$$ plain form
15343 -19717 -23115 -31799 -24826 -16086 2399 -10158 -17835 -8915 -957 -4439 -12465 4035 17622
15330 17622 6715 -16921 -15718 -6145 -10820 -4510 -191 -7741 -12991 -17459 9749 22975 -1487
15317 -1487 -10950 -363 -15392 -3379 5427 7054 7972 7141 15350 22262 22441 14380 10062 15940 -12299
15302 -12299 -26865 -13224 7043 9177 13489 11270 -2138 664 -16590 -7886 8056 10308 2235
15289 2235 9580 23337 10946 22781 40967 21579 -9299 10656 35459 10120 -237 15704
15277 15704 35509 33984 14369 8381 10159 11706 -7883 -24344 -27776 -18003 -5313 -3371 24530
15264 24530 37029 19848 -21050 -25343 -28801 -33342 -44952 -46562 -23857 9167 27717 33805 16793
15251 16793 -20180 -36507 -38094 -13772 -1986 -3039 4758 14733 3332 -1989 -16516 1371 13699
15238A3699o677m854L980q112j6670M595P471k520L065P764J0459M666j2971j8727
15224a4832n432N370j327j9987R482m83L099J0927j2309R99N989L5566J3686k551
15210B8197j524l684l1088r715q890k0164k725L2982L9040J1809l34m1j9809j5936
15196a882N639L419j3O204N492p707m936n075j704o036N255J2064J0824O334P320
15181C5198k100j8898j0101Q27j1213R89J0267j928l293k508J2274k0521o432
15168a7439q33l841K0595L896l507J2855J520q4J3403K1820r608k5582J5218J3772
15154D2185l984j7401j5883j6088j0282M428j6792j5347L142J0764J7488q989
15142b6759l014J2922L013J8526P648q247Q229J0319P561N408l1277n708M387
$$ plain form
15238 13699 7022 2168 6148 -1964 -18634 -14039 -6568 -9088 -6023 1741 12200 16866 3895 -14832
15224 -14832 -20264 -14894 -16221 -36208 -26726 -27209 -24110 -13183 -25492 -24493 -18504 17062 30748 28197
15210 28197 26673 22989 -8099 -17814 -26704 -46868 -49593 -16611 22429 34238 33904 33863 14054 -1882
15196 -1882 3757 7176 7163 13367 18859 11152 6216 1141 -563 -6599 -1344 10720 21544 27878 35198
15181 35198 33098 14200 4099 4926 -6287 -5298 4969 3041 -252 -2760 9514 -11007 -17439
15168 -17439 -18272 -22113 -1518 2378 -1129 11726 13246 13162 26565 48385 38777 13195 28413 42185
15154 42185 38201 20800 4917 -11171 -21453 -17025 -33817 -49164 -46022 -35258 -17770 -26759
15142 -26759 -29773 -16851 -13838 4688 12336 4089 12318 22637 30198 35606 4329 -1379 3008
15129C008K4320J7636k3408j0134j1204k3624J967J222p959K996R249j47j1884
15116b7962R977J6847K202N115M08m44J4459k354l227P995j2156k4684K5039J4795
15102B6010j458j3697j2605J7164L800P738r857r675n910p243J9810Q812k4194
15089a305o083o91k3068m680J9264R690J8890r830j5138n776j428J5026j119J3674
15075G426J7433l3446j1882n186l193Q67J2319J1918N7J1946j0110m437q315p580
15061b2183L917J7917j0691J6144M578o199o128J636r15K509K788j3115j736l244
15047a4722J602M409r681k628L6052K402l5425k2465J805O011J6248N536o658
15034a7514P2J0180j4O134M195K411K2124P504j1115q118j7598J2227J7954k1623
$$ plain form
15129 3008 27328 44964 21556 11422 218 -23406 -21439 -20217 -28176 -25180 -15931 -16078 -27962
15116 -27962 -17985 -1138 1064 6179 6587 6143 20602 18248 15021 23016 10860 -13824 11215 26010
15102 26010 24552 10855 -1750 15414 19214 26952 17095 7420 1510 -5733 14077 22889 -1305
15089 -1305 -7388 -8079 -31147 -35827 -16563 -6873 12017 2187 -12951 -18727 -20155 -5129 -6248 7426
15075 7426 24859 -8587 -20469 -25655 -28848 -27981 -15662 -3744 -3687 8259 -1851 -6288 -14603 -22183
15061 -22183 -18266 -349 -11040 5104 9682 3483 -2645 -1009 -1924 585 3373 -9742 -11478 -14722
15047 -14722 -13120 -8711 -18392 -21020 15032 17434 -17991 -40456 -38651 -32640 -16392 -10856 -17514
15034 -17514 -17442 -7262 -7276 -1142 3053 5464 27588 35092 23977 15859 -1739 10488 28442 6819
15020F819K337J4268k897k243n481q555J0060Q396j5363Q576j683K083l50q060
15006G907K3638R321o190j2518l3962K630K3227j875j7624J4939N273o163l611
14993D992j1193j4981n724j691J878J0577k093r127L514j5504r435R95R95N045
14979d1752J4669J3799J9534M084k5603j8837K2614K2976J1915j0465J849O739
14967B1522k559R336L836l564j8138R178J2143j5843j9287j2408p015J0426R30
14954a1443R37L2631J2797o798l409j5892k0650j8401j9693j453K7027J275j9215
14941d2287K628J2050P51n722K1910k330j0104O219l231N524J0737L667j1062
14928a1250r927O209J6983O722l922j9488q256J0932J7566m064r413R647n577
$$ plain form
15020 6819 9156 23424 20527 18284 12803 4248 14308 22704 7341 15917 14234 16317 15967 7907
15006 7907 31545 40866 34676 22158 -11804 -9174 14053 12178 -5446 9493 14766 8603 4992
14993 4992 -6201 -21182 -26906 -28597 -26719 -16142 -18235 -27362 -23848 -39352 -48787 -47792 -46797 -41752
14979 -41752 -27083 -13284 6250 10334 -15269 -34106 -11492 11484 23399 12934 14783 21522
14967 21522 18963 28299 32135 28571 10433 19611 31754 15911 -3376 -15784 -22799 -12373 -11443
14954 -11443 -10506 22125 34922 28124 24715 8823 -11827 -30228 -49921 -51374 -24347 -23072 -42287
14941 -42287 -39659 -27609 -26858 -32580 -10670 -13000 -23104 -16885 -20116 -14592 -3855 -188 -11250
14928 -11250 -21177 -14968 2015 8737 4815 -14673 -22929 -11997 5569 1505 -7908 1739 -3838
14915c838J1228K3452K897m630n662k2496o83k0139R787J6708J5271k144j1950
14902G801l4915r313L609M597N902Q361L380Q417L234J8698P137l3331Q438J439
14888C454j378O896l366r572n514K0178K7036l188l2992j3398K1817R331l127
14875A6177k062J45K2473j8024j7037N869Q162k535j5337J0828Q353N170o608
14862A5574j7759m864j2855p912J4770R053l994R516n547q222j0742N02o012K738
14848b5754K301J7635J2594N547r797L062J4762P000J1125j9851M728j4506p554
14835A292J5368m564k1907J4696J5002k2922k021J5974K0081j0352j9388k380
14823a121J2045N035P862l592q425o345J8691n07k159p951J429j1888k9616L951
$$ plain form
14915 -3838 7390 30842 33739 29109 23447 951 268 -19871 -10084 6624 21895 19751 7801
14902 7801 -27114 -36427 -32818 -28221 -22319 -13958 -10578 -2161 1073 19771 26908 -6423 2015 3454
14888 3454 2076 8972 5606 -3966 -9480 10698 37734 34546 1554 -11844 9973 19304 16177
14875 16177 14115 14260 36733 18709 1672 7541 15703 13168 -2169 8659 17012 22182 15574
14862 15574 -2185 -7049 -19904 -27816 -13046 -3993 -7987 1529 -4018 -12240 -22982 -22480 -28492 -25754
14848 -25754 -23453 -5818 6776 12323 2526 5588 20350 27350 38475 18624 23352 8846 1292
14835 1292 16660 12096 -9811 4885 19887 -3035 -5056 10918 30999 20647 1259 -1121
14823 -1121 10924 15959 23821 20229 11804 5459 24150 23643 21484 13533 14962 3074 -26542 -22591
14809b2591j43Q910J3806O382p059Q101Q92K1058M168J1492j5314j5372K219l417
14795A3132j2934M018K6547j0890j6008N821r002K90Q759N980l2385j0946J3503
14782a4115K1105R366j3705j1613K0090j3046j7808J0732R27p543j4475R737M510
14769a5838K2855J3430m528j3466k294j017k7641J5765K508P960K0635j9328r507
14756a0466k97J2654J9748r065O519r834j0881J8660M169o936k1321R13P862l806
14742b081j3580k4866l549R090o249J8438Q529P565r5n383K4446j2668r706p415
14728a7524m571R104J0803m170K7524J6931R802j8432l1315j7687K341K0342K1059
14715B4207K475k2700M006k379N239n437j0920J3475J1275j960j1166j7440J225
$$ plain form
14809 -22591 -22734 -13824 -18 6364 -695 7406 8298 29356 33524 45016 29702 14330 16549 13132
14795 13132 198 4216 30763 19873 3865 9686 684 974 9733 15713 -16672 -27618 -14115
14782 -14115 6990 16356 2651 -8962 11128 -1918 -19726 -8994 -8067 -15610 -30085 -20348 -15838
14769 -15838 7017 20447 15919 2453 159 -858 -28499 -12734 -10226 -2266 18369 -959 -10466
14756 -10466 -10763 1891 21639 12574 19093 9259 -1622 17038 21207 14271 -7050 -6137 1725 -2081
14742 -2081 -15661 -40527 -44076 -34986 -41235 -22797 -14268 -6703 -6798 -12181 12265 -403 -10109 -17524
14728 -17524 -22095 -12991 -2188 -6358 21166 38097 47899 29467 -1848 -19535 -17194 3148 24207
14715 24207 26682 3982 7988 5609 10848 5411 -5509 7966 19241 17281 6115 -11325 -10100
14702a0100k436N719J9838O065m107k027j960j0069j4209n084J5454R453L034
14689I571q44J1440J1501R380r915k5850j2845p869o871K770J6279J8631r941
14676E437j035J0573J010j9024l0992K646K6691L584j4055K993J9961r368k5169
14663b6748N952L3814K2480q43n052k2008p62J3752N307j7908j9747N256N299
14650a208L164P514P71J2616L757N390M716M420j109k1952j9214J1129j0041n006
14636e053j7546J416J6781L3006J1060k2038k2636k4693l840M342O751J2224J8784
14623H558N591J7391j0070k5210Q185P761N797k5595l263J6488n982j5581j4882
14610c0812O540P594K437Q13J9482O23J5696O926r674o485r544n036L986P248
$$ plain form
14702 -10100 -12536 -6817 13021 19086 14979 12952 10992 923 -13286 -18370 -2916 6537 9571
14689 9571 8727 20167 31668 41048 31133 5283 -7562 -15431 -22302 -19532 -3253 15378 5437
14676 5437 4402 14975 15985 -3039 -34031 -31385 -4694 -1110 -15165 -12172 7789 -1579 -26748
14663 -26748 -20796 13018 35498 34655 29603 7595 6833 20585 25892 7984 -11763 -6507 -1208
14650 -1208 1956 9470 10241 22857 26614 32004 36720 41140 40031 18079 -1135 9994 -47 -5053
14636 -5053 -22599 -21183 -4402 28604 39664 17626 -5010 -29703 -33543 -29201 -22450 -10226 8558
14623 8558 14149 31540 21470 -3740 4445 12206 18003 -7592 -10855 5633 -349 -15930 -30812
14610 -30812 -24272 -16678 -14241 -13428 6054 6677 22373 29299 19625 13140 3596 -1440 2546 9794
14596I794j8967o026K6439R566l7150l5364k1092k529J0864J3207l962k856J6145
14583d1931K6535N373P734K3301r754j0149j0179j0929P737j8745r296J8037K3062
14570G96O547J0743Q996o641N710R818q039j5894j5092o091J0415Q72K158o400
14556b102p990j906m187L015J2758K08j2408J2113j2465m160K5548r678m386j2430
14542a8070j1046K4079K2331l570k6394m085J2381P099P99l3088j2996L190p520
14529d6890r99P584J7521J7348j565k346J3650J7144m210j4221j8083Q006P881
14516H20J3736m364J2880N189J1583j510j4925j0644q155m737j65j0202p698l98
14502a8590J4136o971q809J8978P969J0716K2413j502k1984P450M080J817j7298
$$ plain form
14596 9794 -9173 -15199 11240 20806 -16344 -51708 -72800 -75329 -64465 -51258 -55220 -58076 -41931
14583 -41931 -15396 -10023 -2289 21012 11258 1109 -9070 -19999 -12262 -31007 -40303 -22266 796
14570 796 7343 18086 27082 20441 26151 35969 27930 12036 -3056 -9147 1268 2140 4298 -2102
14556 -2102 -10092 -11998 -16185 -13170 -412 -204 -12612 -499 -12964 -17124 8424 -1254 -5640 -18070
14542 -18070 -29116 -5037 17294 13724 -12670 -16755 -4374 2725 3524 -29564 -42560 -39370 -46890
14529 -46890 -47889 -40305 -22784 -5436 -7001 -9347 4303 21447 17237 3016 -15067 -7061 820
14516 820 14556 10192 23072 28261 39844 38334 23409 12765 4610 -127 -292 -10494 -18192 -18590
14502 -18590 -4454 -11425 -20234 -1256 6713 17429 39842 38340 16356 23806 27886 29703 12405
14489A2405j6002O175M991K4624j4890k2467J4256N198k598k5376n293J0299J8719
14476A0041j7842j4507j638l012J3659J961j0300j101r332J4798L2959o186J4210
14463B3710K958k8086j7449R141n497J8724K984j1777K949J4951m189P377M1J190
14449A7027J0136J3448k7736m410k6813K2383O192m4732O354K0374q378j0648
14437b6803K5855J0349M518j5252j5417k267O951l381L235J8337K1671n87l832
14424B3377p400j3951N369K540Q524R236J4720k1832k1914O757J3382P91o659
14411A2940p145N91M685J302J5440n919j5946k7006j3542n895M737K393k248l355
14397c8968J5297K1388J2303q725l857l91n802o765J0474O274J0973J4571l359
$$ plain form
14489 12405 -3597 2578 7569 32193 17303 -5164 9092 14290 11692 -13684 -18977 -8678 10041
14476 10041 -7801 -22308 -23946 -26958 -13299 -11338 -21638 -22739 -32071 -17273 15686 9500 23710
14463 23710 26668 -1418 -18867 -9726 -15223 3501 6485 -5292 -2343 12608 8419 15796 15837 17027
14449 17027 27163 40611 12875 8465 -18348 4035 10227 -34505 -28151 -7777 -16155 -26803
14437 -26803 -948 9401 13919 -1333 -16750 -19017 -12066 -15447 -12212 6125 27796 27209 23377
14424 23377 15977 2026 7395 9935 18459 27695 42415 20583 -1331 5426 18808 19599 12940
14411 12940 5795 6386 11071 12373 27813 21894 5948 -21058 -34600 -40495 -35758 -33365 -35613 -38968
14397 -38968 -23671 -2283 10020 1295 -2562 -2953 -8755 -15520 -5046 1228 12201 26772 23413
14384B3413j0532Q904J1894m446j2214j0570k1141J6177K779M913k088j6135l083
14371a2129K037k468J521N278J7143J3371j8810n044J0231P495k9671j1217M145
14358a8118M916J696j807j1586k30J399r65l94m021L348j8494J5426P402O376
14344a5052m98J1040n412k4869o062J2030K066m684j0859q408K0744J5354J4267
14331c43j4532J6013J4017K236l202j3837j0184o732j2353j619k1924j5500J5329
14318e2631K7061P718k289q347L392N189J2044j3024j1097O739K3097J4323j0846
14305A329o243q300M795l804J0324j8523j3383J4432Q294j0705J1405J4716J414
14292E751p142p942l84j4570J3877P341L354M602O461j5735N719n64O780M620
$$ plain form
14384 23413 12881 21785 33679 29233 17019 6449 -14692 1485 4264 9177 7089 -9046 -12129
14371 -12129 -10092 -12560 -11039 -5761 11382 24753 5943 899 11130 18625 -11046 -22263 -18118
14358 -18118 -13202 -11506 -13313 -24899 -25129 -23730 -24695 -25089 -29110 -25762 -44256 -28830 -21428 -15052
14344 -15052 -15550 -4510 -9922 -34791 -40853 -28823 -26757 -31441 -42300 -50708 -29964 -14610 -343
14331 -343 -14875 1138 15155 17391 14189 352 -9832 -16564 -28917 -30536 -52460 -67960 -52631
14318 -52631 -25570 -17852 -20141 -28488 -25096 -19907 -7863 -20887 -31984 -25245 -2148 12175 1329
14305 1329 -4914 -13214 -8419 -12223 -1899 -20422 -33805 -19373 -11079 -21784 -10379 4337 5751
14292 5751 -1391 -9333 -9717 -24287 -10410 -3069 285 4887 11348 -4387 1332 768 7548 12168
14278A2168m93p813K511j0010j8514Q361K2347L624L248J8518J1578r166l504
14265C2855K613n22j0077o903o701J3337l35r491n039q435O820K3970o57m747
14251B6688j1508l265J4658j0043j2529j383j640j5300J2458Q738J5498J6065
14239C8437q362K8854l485k1876k5909l008K732k1060k4454l837M232J2168J641
14226b3927M473k1354P27Q418J2961K1975J5935Q573L5427j9420p073N370j596
14213D0489r366j8373J3832j2098q746N00J0795P169n352k070l15j432q28m407
14199I798p016j6951m558j3762L479J5026P715N386Q538M338J2681q646j2000
14186D028P710j1276O731K5014j2019k3696k2231j8873j4568L021J2315J9138
$$ plain form
14278 12168 11675 3862 6373 -3637 -22151 -13790 8557 12181 15429 33947 45525 36359 32855
14265 32855 35468 34946 24869 17966 11265 24602 24267 14776 9737 1302 8122 32092 31435 26688
14251 26688 15180 11915 26573 16530 4001 2618 978 -14322 -1864 6874 22372 38437
14239 38437 30075 58929 55444 33568 7659 4651 7383 -13677 -38131 -41968 -37736 -25568 -23927
14226 -23927 -19454 -40808 -40081 -31663 -18702 3273 19208 27781 63208 43788 36715 42085 40489
14213 40489 31123 12750 26582 14484 5738 6238 17033 24202 18850 16780 16465 15033 14205 9798
14199 9798 2782 -14169 -18727 -32489 -29010 -13984 -6269 -883 7655 11993 24674 16028 4028
14186 4028 11738 462 7193 32207 20188 -3508 -25739 -44612 -59180 -56159 -43844 -24706
14174b4706K2928l128n501Q75J5516j671j0919o215L3159P111J05k171r445j016
14160A4922j3715J4394L2154Q406k2648j7343p844o351j369J4593J8732j344l2340
14147B47l691J8266j0140M214j62p884j522K0354k0325j0276l950k4045q069J1137
14133c5846j733L570qM534J5981J0166l768j9293O423r319j6797P303P006L168
14119b8613M605j7128J3418J5321R42o701J1059J4197M762n75r054K868J1827
14106A6928J4823j1640m762J0969k7871n080J5456M328j6319o482J5305o457P267
14093F465J8842N569r348m999p205M934N804N558J1372N933m955j8242l0089j9878
14079c0239o973q177J3129J1721K2409J7601m263k9109q792Q251j0948O822J1949
$$ plain form
14174 -24706 -1778 -4906 -10407 -9532 5984 4313 -6606 -12821 20338 27449 27554 25383 15938 14922
14160 14922 1207 15601 47755 56161 33513 16170 8326 1975 606 15199 33931 32587 247
14147 247 -3444 14822 4682 8896 8734 850 -672 19682 -643 -10919 -14869 -38914 -46983 -35846
14133 -35846 -37579 -34009 -34017 -29483 -13502 -3336 -7104 -26397 -19974 -29293 -46090 -38787 -31781 -28613
14119 -28613 -24008 -41136 -27718 -12397 -11455 -18156 -7097 7100 11862 11287 2233 5101 16928
14106 16928 31751 20111 15349 26318 -1553 -6633 8823 13151 -3168 -9650 5655 -802 6465
14093 6465 25307 30876 21528 16529 9324 14258 20062 25620 36992 42925 37970 19728 -10361 -30239
14079 -30239 -37212 -45389 -32260 -20539 1870 19471 15208 -13901 -22693 -14442 -25390 -18568 -6619
14066f619O070O66k190K551L382N992J6722j2492j4716J1842n486J7044O789j30
14052B9425r842q325n247J1120n59j868k379J0219j515n922l335j2092J3800J2106
14038B5586j8219n417j4020r180J396j723J048J491J445o06J3566J1328l0420
14025b3725l130J8935J8719o48P903L021j6319j0265j3175l544m76p870r349J8599
14011b1324J3624K313j871j1776j9325J0789J0550j221k025J979n083R486J1045
13998b839j3907n587K8319R914k1637j9693J3328J4122R910p402j838K034J3021
13985A7745k100j387o509J6847Q167j0744j1278o109o838j8083J363R752J1957
13972B783J62m247K983N494K322l587m794l0360J7745K0162k8442n624j5092m717
$$ plain form
14066 -6619 -549 117 -2073 478 3860 9852 26574 14082 -634 11208 5722 22766 29555 29425
14052 29425 19583 11258 6011 17131 16572 14704 12325 22544 21029 15107 11772 -320 13480 25586
14038 25586 7367 1950 -12070 -21250 -19854 -21577 -20529 -19038 -17593 -18199 -4633 6695 -23725
14025 -23725 -26855 -7920 10799 10151 18054 21075 4756 -5509 -18684 -22228 -22704 -30574 -39923 -21324
14011 -21324 -7700 -5387 -7258 -19034 -38359 -27570 -17020 -18241 -20266 -18287 -23370 -13884 -2839
13998 -2839 -16746 -22333 5986 15900 -5737 -25430 -12102 2020 11930 4528 2690 4724 17745
13985 17745 15645 14258 7749 24596 32763 22019 10741 4632 -2206 -20289 -18926 -9174 2783
13972 2783 2945 -1302 1681 7175 9497 5910 1116 -29244 -11499 8663 -19779 -25403 -40495 -45212
13958d5212J3551J4496r918R210J1575l793r956k61j7383j002K2356j4189J4916
13945a5610J9293r252R833J2904r817p241K230N281J957p292p915l074l333J4160
13931B124J5209J6075J823Q22k4377k5535J895J3296R739o545m078J934J502N693
13917I577r088j4299o111Q934j5522O548J7840K550j952L7r732P556o678J7143
13903F803p581j0840N473o160K3043l597j0924J1688m340r52M146j0274j4013
13890a7528J1651K5783R619k718j0613k191r365K627k035l108P444j679q810j4103
13876a5026j5670J2839J1972J1761j1299K90N234k669J4101P762j8957k1644n165
13863b6471R572J6254k144O539K2746m612j7636p498J5964p668J225l452M742
$$ plain form
13958 -45212 -31661 -17165 -27083 -17873 -6298 -10091 -20047 -20308 -37691 -38693 -16337 -30526 -15610
13945 -15610 3683 -5569 4264 17168 7351 110 2340 7621 9578 2286 -5629 -8703 -12036 2124
13931 2124 17333 33408 35231 36053 11676 -13859 -11964 1332 11071 4526 448 2382 3884 9577
13917 9577 489 -13810 -19921 -10987 -26509 -19961 -2121 429 -1523 -1486 -11218 -3662 -10340 6803
13903 6803 -778 -11618 -6145 -12305 10738 7141 -3783 7905 3565 2613 6759 -3515 -17528
13890 -17528 -5877 19906 29525 26807 16194 14003 4638 7265 5230 2122 9566 7887 -923 -15026
13876 -15026 -30696 -17857 -5885 5876 -5423 -5133 101 -2568 11533 19295 338 -21306 -26471
13863 -26471 -16899 -645 -2789 3750 26496 21884 4248 -3250 12714 5046 6271 2819 7561
13850G561J6907l0398l5309j921K5581J7578L9130J0815j6986l423J6006j840
13838D3701q643J0134k96j0905j2673j2138p454k6691j9002N134K6802N658L230
13825c143p137Q738J3108P756J149K92N42k4074j99O144m938R727J8506j1163
13811A5308l425J7660q779k651p207r156P828R080O344j2991q396K2691K1461
13798D7767j1114K416j952J806o508R81q494j1377P793j4110k2152J3251J7494
13785A5801k020q453J8047r987n770j7962N365M998j4975Q379J8357O909q928
13772I761k1564j303l349k771J4376K8269j874R49o74r178K395L151k7301P786
13758a327J8552J2473o641r695N065N404n934k148m206J9207J641j3548k6377
$$ plain form
13850 7561 24468 -5930 -41239 -43160 -17579 -1 39129 49944 32958 29535 45541 43701
13838 43701 35058 45192 44896 33991 21318 9180 1726 -24965 -43967 -38833 -12031 -6373 -3143
13825 -3143 -10280 -1542 11566 19322 20471 20763 21305 -2769 -2968 3176 -1762 7965 26471 15308
13811 15308 11883 29543 20764 18113 10906 1750 9578 18658 25002 12011 3615 26306 47767
13798 47767 36653 39069 37117 38923 32415 33396 24902 13525 21318 7208 -14944 -1693 15801
13785 15801 13781 5328 23375 13388 7618 -10344 -4979 19 -14956 -6577 11780 18689 9761
13772 9761 -11803 -13106 -16455 -19226 -4850 23419 21545 22494 21820 12642 15037 18188 -9113 -1327
13758 -1327 17225 29698 23057 13362 18427 23831 17897 15749 11543 30750 32391 18843 -7534
13745g534K134m713R302p716k1572j2882L6584N178j3074n761M716j479r201l739
13731b9757J2735k003j534K6260K2958j9850m4480J8945k828o283k951J9489J4433
13718E134O283m893o097j9583n90P900P621m488P574K2900o892O658k9j0757n194
13703E547j373K937N023j6490j8586R716O218J3409n198J6741K174n545k0295
13690e722j0020o823J0043K3144R946p164j7032k8557q240J3060J2385p319k8567
13677e0866j8211J0239K8713J5817J3889Q662m066p282R399m52l771j811k2347
13664b2087p917J2000q512K4300K3381L989L416j776p568K0925j533p147K590
13651C4061q741J6047R543j4991o94j2643J55p964P622J507n586j0473m253p750
$$ plain form
13745 -7534 -5400 -10113 -811 -8527 -30099 -42981 -6397 -1219 -14293 -20054 -15338 -16817 -26018 -29757
13731 -29757 -17022 -19025 -20559 5701 28659 8809 -35671 -16726 -19554 -25837 -28788 -9299 5134
13718 5134 11417 6524 427 -19156 -19746 -11846 -4225 -8713 -1139 21761 14869 21527 21498 10741 5547
13703 5547 4174 7111 12134 -4356 -22942 -13226 -7008 6401 1203 17944 20118 14573 -5722
13690 -5722 -15742 -22565 -12522 10622 20568 13404 -3628 -32185 -40425 -27365 -14980 -22299 -50866
13677 -50866 -69077 -58838 -30125 -14308 -419 8243 4177 -3105 6294 5842 2071 260 -22087
13664 -22087 -30004 -18004 -26516 -2216 21165 25154 28570 26794 19226 40151 38618 31471 34061
13651 34061 25320 41367 50910 35919 35225 22582 22737 14773 22395 23902 18316 7843 3590 -4160
13637d160j6784J2323K6634j6528p558l812k435k8P75J1255J7072j1497j4695
13624i438r116M669J8368L084J328j8537l441J1796P42l237p642l107j6632j4822
13610d5985K3834K5727p680j9801K5911o173m022K55j2404J121o615P987j986
13597a9831P573N088j3919n491O759J279J567N732m555q006K723N3r846K0755
13583a0119o126J0873K50J2359J6524r186j1417r997M02K6029K4561Q981r744
13570D3390j0379j5145r787K161K604j5992j0247Q132j9032j16J5587N632n8m442
13556g692K8750K4582k8001L141J765N294j4444k3513n702j7003k246K4562J7727
13543G220k8609j5036l289P721L0079J1059j0698k3678r165O778K331O640Q671
$$ plain form
13637 -4160 -20944 -8621 18013 1485 -6073 -9885 -12320 -12348 -11573 -318 16754 5257 -9438
13624 -9438 -18554 -13885 4483 7567 8895 -9642 -13083 -1287 -545 -3782 -11424 -14531 -31163 -45985
13610 -45985 -22151 3576 -4104 -23905 2006 -4167 -8189 -7934 -20338 -19217 -25832 -17845 -19831
13597 -19831 -12258 -7170 -21089 -26580 -19821 -18542 -16975 -11243 -15798 -23804 -21081 -21028 -30874 -10119
13583 -10119 -16245 -5372 -5122 7237 23761 14575 3158 -6839 -6437 19592 44153 53134 43390
13570 43390 33011 17866 8079 10240 12844 -3148 -13395 -5263 -24295 -24411 -8824 -3192 -3250 -7692
13556 -7692 21058 45640 17639 20780 22545 27839 13395 -10118 -15820 -32823 -35069 -10507 7220
13543 7220 -21389 -36425 -39714 -31993 -1914 9145 -1553 -25231 -34396 -27618 -25287 -18647 -9976
13530i976J5616K468j9122J2310J8704L150k4643j7741J0558N04j7216K718J9064
13517c606N246K504j443J0667J1832l370Q765k4666j7749n042j2481R413J5833
13504d097J3459J135q949m914p879J3779J3199p863j2941k804l443O075q91J0645
13490D511J5861j7442J796K924P341k076n245o577J1751n459l1422j61m167p27
13476b9092J7033K4894J8783j154j5321j394N255m208j349J0169p833j4940q101
13463g258r310J2386J2082J5035l604k7610M314L3662k2712J256J3512J5505j952
13450C5306j3313j221o295J675j1357k1266J0856J4759Q61j8984k235L618K146
13437e450K0156J1689l649R491J5661j4051j1179k1410j1245M671o475J1207J1561
$$ plain form
13530 -9976 5640 8108 -11014 1296 20000 23150 -1493 -19234 -8676 -8172 -25388 -22670 -3606
13517 -3606 1640 4144 2701 13368 25200 21830 30595 5929 -11820 -16862 -29343 -19930 -4097
13504 -4097 9362 10497 1548 -3366 -11245 2534 15733 7870 -5071 -7875 -11318 -5243 -6134 4511
13490 4511 20372 2930 4726 7650 14991 12915 7670 1093 12844 7385 -24037 -24198 -28365 -29092
13476 -29092 -12059 12835 31618 30464 15143 13749 19004 14796 13447 23616 15783 843 -7258
13463 -7258 -16568 -4182 7900 22935 19331 -8279 -3965 29697 6985 8241 21753 37258 35306
13450 35306 21993 20772 14477 16152 4795 -16471 -5615 9144 10005 -8979 -11214 -7596 -5450
13437 -5450 14706 26395 22746 32237 47898 33847 22668 1258 -9987 -5316 -11791 -584 10977
13424A0977j0891j1474N870Q067O411j4584L209m086j883J467j2312J7084J3311
13411A1166p392l08l07n670k0444j3787J5164M964Q357J1706J3039J4309p352
13398B3445j7669k589N22P148J6028N004k1773j706m114q906j4541R564J3593
13385D006m428q29J2680K1637K957j6097j3762j2687P265J50J0588m998j9806
13372a3324l462K498o395r777k2912p685J9296J7729N908M024j5914j1657k401
13359d4072K907P024J7883K4990Q196N019K0242j5601l1175p802N474o038K3369
13346A0416Q603q387o538k817j686j2718J0732J6407j4004J051j0093M122J3642
13333H730O319K752M922k2604n372p60O570J2086P448J0403q27P867m027N876
$$ plain form
13424 10977 86 -11388 -5518 2549 8960 -5624 -2415 -6501 -8384 -6917 -19229 -2145 11166
13411 11166 3774 3466 3159 -2511 -22955 -36742 -21578 -16614 -8257 3449 16488 30797 23445
13398 23445 5776 3187 3709 10857 26885 31889 10116 8410 4296 -4610 -19151 -9587 4006
13385 4006 -422 -1251 11429 33066 36023 19926 6164 -6523 742 892 11480 6482 -13324
13372 -13324 -16786 -14288 -20683 -30460 -53372 -61057 -41761 -24032 -18124 -14100 -30014 -41671 -44072
13359 -44072 -41165 -34141 -16258 8732 16928 21947 42189 26588 -4587 -12389 -6915 -12953 10416
13346 10416 19019 10632 4094 1277 -409 -13127 -2395 14012 8 1059 -9034 -4912 8730
13333 8730 15049 17801 22723 119 -5253 -6013 557 12643 20091 30494 29667 37534 33507 39383
13319C9383L495p284j6312j1575M722L0546o660J3939k2410q826p046k5761j1166
13306b4955j0769J187J9597J9365P054P725K2356o231m493K7191J2045o509m8701
13293A4862l6018J3131R814K421j3928Q521K047L757j334J794j7656P584K1100
13280A6095J7464J1292k2716j4685l209k4748o291J2910M398j408O35J7336q743
13267a670m61o109N669j2974J1435J6183O999j883L513p528J0378J5490j4248
13254B4794j5711j1126j1876J3087J7371l374k236o06q791q613K7042Q535j3128
13241A5368j8239j2151j1705n10K2108K4913l74J0351J3230q263j8379q004l0122
13228b1777l705J3312J5846p154q086K650K937O820Q758K2119K651n066N321j9147
$$ plain form
13319 39383 42878 35594 19282 7707 12429 42975 36315 50254 27844 19018 11972 -13789 -24955
13306 -24955 -35724 -34537 -14940 4425 11479 19204 41560 35329 30836 58027 70072 63563 14862
13293 14862 -21156 -8025 1789 4210 -9718 -1197 850 4607 3273 5067 -12589 -5005 16095
13280 16095 33559 44851 22135 7450 4241 -20507 -26798 -13888 -9490 -10898 -10263 7073 -1670
13267 -1670 -2131 -8240 -2571 -15545 -4110 12073 19072 17189 20702 13174 23552 39042 24794
13254 24794 9083 -2043 -13919 -832 16539 13165 10929 10323 1532 -7081 19961 28496 15368
13241 15368 -2871 -15022 -26727 -27237 -5129 19784 19410 29761 42991 34728 16349 8345 -21777
13228 -21777 -25482 -12170 3676 -3478 -11564 -8914 -5977 843 9601 31720 34371 29305 34626 15479
13214A5479K836r424k0684K209J91N108J7216j594l308N682k25j389m423j612
13200F062j3343j4184k900N194j4419M958J1965P646K204M492J4953N886J604
13187B0118n861j9435K624P992R720n531k8168j6120J2516J5750p005n803J3378
13174e825J9825R180J1049l009k1781o636j998R950j4934o396K8339J465p542
13161A1687k293K537n661j6231j0378J051k074j1385j2350P794J8386J6117K2469
13148A9669J4435K819K144n472J850J4279k2912j6308l2J5088j1667j805j6946
13135d858J2611M336Q140o815q486k3447K699M777j9489J097N438J1131K3534
13122A0668l147J7509n165J8068J382j3133j0743l72k434J3108l43k595J2340
$$ plain form
13214 15479 18315 8891 -11793 -9584 -9393 -4285 12931 11337 8029 13711 13486 12097 7674 6062
13200 6062 -7281 -21465 -24365 -19171 -33590 -28632 -16667 -9021 -6817 -2325 12628 18514 20118
13187 20118 14257 -5178 -2554 5438 15158 9627 -18541 -34661 -22145 -6395 -13400 -19203 -5825
13174 -5825 14000 23180 34229 31220 9439 2803 805 10755 -4179 -10575 17764 19229 11687
13161 11687 9394 11931 6270 -9961 -20339 -19288 -21362 -32747 -45097 -37303 -18917 -2800 19669
13148 19669 34104 36923 39067 33595 35445 49724 26812 10504 10472 25560 13893 12088 -4858
13135 -4858 7753 12089 20229 13414 4928 -18519 -15820 -11043 -30532 -29435 -23997 -12866 10668
13122 10668 7521 25030 19865 37933 39315 26182 15439 15067 12633 25741 25398 22803 35143
13109C5143j3418J185L431j8011k4274J8365m018q114j698p829J2490J7140K876
13096A3268Q405J7474K524j4037J0310j3403M924j1535n912j851N580j4348j292
13083A07J9791N84M116j0722K2538K383k545k7306J712o639K652n618j2886J7674
13069E841O108o64N242J3313l431j1754N680L321o225j2891Q071n668n325j979
13055c61J2083j9285n602L691K3487K837J881J0003J2282J1770J4850l5029m748
13042B7859O099K1887K6509K1743L0001L1715N0839Q3690J25276K27109L06538
13031I59265L00412K12566M1374j56961k86264l12750k27028j13920n6806n3698
13021C06190k8579l1640l9907j8345l7405j2531q873k9201m3218r117n589k0694
$$ plain form
13109 35143 21725 22910 26341 8330 -15944 2421 -1597 -9711 -11409 -19238 -6748 10392 13268
13096 13268 21673 39147 41671 27634 37944 24541 29465 17930 12018 10167 15747 1399 107
13083 107 19898 20482 24598 13876 36414 38797 36252 8946 10658 4019 6671 1053 -11833 5841
13069 5841 11949 11285 16527 29840 26409 14655 20335 23656 17431 4540 12611 6943 1618 -361
13055 -361 11722 -7563 -13165 -9474 14013 16850 18731 28734 41016 52786 67636 32607 27859
13042 27859 33958 55845 82354 104097 134098 165813 216652 300342 425618 652727 959265
13031 959265 1259677 1472243 1513617 1356656 1070392 757642 530614 416694 359888 306190
13021 306190 277611 245971 206064 187719 150314 137783 128910 99709 56491 47374 41785 21091
13009B1091k287K766n396N210K4200j0608k5091n897J3127K2506N969j4457j3118
12996A8015j1715m001p091j3096J9747L732l2191N309J8474J0695J2380q237j9453
12983g432N362R928k2472N708J0740p206R6J900J0637K0862j0837p679K8704j3365
12969B4946j9348m314l574n472J3347K1025J0359k3466j4846N068m3345l9150
12957g8770J5636J5990N794q330k4282m308L2323L4462K0262O292M832r584k9306
12944a8989o012p856l3588j7399P102J0344o879k1176j9312j4851j1755k9800
12932a70171m9351l6076p367N7215Q7402R5250Q3535O6159J1294j2991l1491r207
12920H4201L337K621j9814j2671Q427M591L809j4319J9937j7084k2527N151o593
$$ plain form
13009 21091 18804 21570 16174 21384 45584 34976 9885 3988 17115 39621 45590 31133 18015
12996 18015 6300 2299 -4792 -17888 1859 5591 -26600 -21291 -2817 7878 20258 12021 -7432
12983 -7432 -2070 7858 -14614 -8906 1834 -5372 -5276 -3376 7261 28123 17286 9607 38311 24946
12969 24946 5598 1284 -2290 -7762 5585 26610 36969 13503 -1343 3725 -39620 -78770
12957 -78770 -63134 -47144 -41350 -49680 -73962 -78270 -45947 -11485 8777 15069 19901 10317 -18989
12944 -18989 -25001 -32857 -66445 -83844 -76742 -66398 -73277 -94453 -113765 -128616 -140371 -170171
12932 -170171 -219522 -255598 -262965 -205750 -118348 -23098 60437 126596 137890 124899 93408 84201
12920 84201 87538 90159 70345 57674 66101 70692 74501 60182 80119 63035 40508 45659 39066
12907C9066L480R068K648M605n134L029J8616J563l3543q604j1879l624k817o726
12893I748m031n47l958K2357M037j3299J9889K9368j0702j8702m265L10O489j1541
12879B5153m809K3336J6464J2387M723l205J5962j6775q200N964M291K0690q421
12866H7560k4276j5773j127J8415J8922j1788L794o858o044j187J3817J5076L7809
12853A28340N7478L4105L9752N885k9255K090k7386k4412j0213k0423k8675j3873
12841A13413j9474k7768n409k970K761j42K083j586j4947j8793J1346K0391j1184
12828D7721N792j3963j6632j5204P101Q804q880j9648O636L3501K6459J1574r770
12815F3491J1981J5657j5934j5423k5530j0658j0190o251n887J863J1399N226
$$ plain form
12907 39066 42546 51614 54262 58867 53733 56762 75378 76941 43398 34794 22915 19291 16474 9748
12893 9748 5717 5170 1212 23569 27606 14307 34196 63564 52862 34160 29895 30205 36694 25153
12879 25153 20344 43680 60144 72531 77254 74049 90011 73236 65036 71000 75291 95981 87560
12866 87560 63284 47511 46384 64799 83721 71933 75727 68869 62825 61638 75455 90531 128340
12853 128340 185818 219923 259675 265560 236305 238395 211009 186597 176384 155961 127286 113413
12841 113413 93939 66171 60762 57792 60553 60411 62494 60908 45961 27168 38514 58905 47721
12828 47721 53513 39550 22918 7714 14815 23619 14739 -4909 1727 35228 61687 73261 63491
12815 63491 75472 91129 75195 59772 34242 23584 13394 7143 1256 3119 14518 19744
12803A9744j1259j3282K0443J0369L180N874J771r260q446O45J3493j5014k1974
12790c716j416j880N836n894P787K1240J6319R878j45l002K0579M3084J2935j0337
12776A11268l3335l2285j3052J045J3311o695k5781K644O220K4501j565j3669
12764C2607R72j1640L048O424Q664L8737P869j0270k000R932p665r703j1841j3158
12750D1976J100J3557L611L474J4039K5777O251J520K1573k1419q820J1606J6897
12737A31142J5590J0238P814N545k191l2825k1829M227N297R479M4683M4698M1062
12724B62930L4785K8278J4130n278J5100k1235j7177p522m8261l0119j0558k0881
12712A94192l9225M834J835k868M2386L2511r248k0802o746J1088N598J0723m743
$$ plain form
12803 19744 8485 -4797 15646 26015 29195 35069 36840 27580 19134 19779 33272 18258 -3716
12790 -3716 -5132 -7012 -1176 -7070 717 21957 38276 48154 48009 45007 65586 108670 121605 111268
12776 111268 77933 45648 32596 33641 46952 40257 14476 17120 23340 47841 46276 32607
12764 32607 33579 21939 24987 31411 40075 78812 86681 76411 74411 84343 76678 66975 55134 41976
12750 41976 43076 56633 60244 63718 77757 103534 109785 111305 132878 111459 102639 114245 131142
12737 131142 146732 156970 164784 170329 168138 135313 113484 117711 123008 132487 177170 221868 262930
12724 262930 297715 325993 340123 334845 349945 328710 311533 304011 255750 225631 215073 194192
12712 194192 154967 159801 161636 158768 201154 233665 224417 203615 196869 207957 213555 224278 219535
12699B19535J36J209j0737J4652J9451q866l067o970m065j3098q463k7615J2241
12686A84343K2491J8666q153J897J1154j7384j9319k8898l2810j1719N757J0340
12674A36365K7067K9473N549K5670L0070L4894M5283L7142J7470J5072m672L5
12662C99418j071O675l004K611K1445J3551M659J955R806K0551K254O950P794
12649D93594J1071K8344K2638L3315L7614J4941L8541L9273K3322n115J7932K1254
12637G76724R937L3237K6942K2166L0373L7322N6504N4769O4945P4266N7995P2411
12625A317591Q7800R0012R7926J33659J61794J83911K45250K78462L07143L35707
12615C239255L72596M08788M77243N95962P26757R25419J212022J600470K078380
$$ plain form
12699 219535 219671 220880 210143 224795 244246 235380 232313 225343 221278 208180 199717 172102 184343
12686 184343 206834 225500 217347 219244 230398 213014 193695 164797 131987 120268 126025 136365
12674 136365 163432 192905 198454 224124 254194 289088 334371 371513 388983 404055 399383 399418
12662 399418 398347 405022 402018 404629 426074 439625 444284 446239 456045 476596 478850 485800 493594
12649 493594 504665 533009 555647 588962 626576 641517 680058 719331 742653 737538 755470 776724
12637 776724 786661 819898 846840 869006 899379 936701 993205 1047974 1112919 1187185 1245180 1317591
12625 1317591 1405391 1495403 1593329 1726988 1888782 2072693 2317943 2596405 2903548 3239255
12615 3239255 3611851 4020639 4497882 5093844 5820601 6746020 7958042 9558512 11636892
12606A1636892K561470L091712L793796M988839P323801J1576948J8911370L0853779
12598I4738607M7400341O1528086N8734459L3264557o368802m2371404n8663060
12591A88262784n4295893l7416970k1306471j1635531o731843m914644m934735
12584D7026697n501727n672777n301456m662560l923386l227266k699095k215305
12576A3823125j814746j556072j308291j083733q92196p44980o41681n51312m94200
12567D735914m74016m45102m12496l72527l19983k79813k25480j70417j49845
12558A886235j57826j41022j17797j00311r6185j13450r4524p8611n6823q0737
12548H48949o4909l3856j9552j1175k1593k0282k2127j2672r504k4770m4606m2929
$$ plain form
12606 11636892 14198362 17290074 21083870 26072709 33396510 44973458 63884828 94738607
12598 94738607 142138948 203667034 262401493 295666050 289297248 246925844 188262784
12591 188262784 133966891 96549921 75243450 63607919 56876076 51961432 47026697
12584 47026697 41524970 35852193 30550737 25888177 21964791 18737525 16038430 13823125
12576 13823125 12008379 10452307 9144016 8060283 7168087 6423107 5781426 5230114 4735914
12567 4735914 4261898 3816796 3404300 3031773 2711790 2431977 2206497 2036080 1886235
12558 1886235 1728409 1587387 1469590 1369279 1273094 1159644 1065120 986509 929686 848949
12548 848949 784040 750184 730632 719457 697864 677582 655455 642783 633279 608509 563903 520974
12536E20974l2124l0122j2518j7892j7392j6290j4962o322j9523j4225l135j2533
12524C23936k1190j1760p983j0754J0251Q274J1960J2105J1051m075n372j7839
12512B98604j2832k5447r607J819j0681k0729M893K350M385R096k222r852J5400
12499B45177l1483j2698K2005L927K818k5691p415J4720R517J4083J2812p170
12487B40602k6112P669r246k6883l3155k7773J1072Q425l739J6538k774j0159
12475A44465K2975j319n09M4786M6218M0894K1849k6447k6217j8349k0271j5235
12463B12840k672k806l1891k4596j4955j0200l0731Q774l062r673J4840R063j0828
12450A04103M982q330Q17j7652k5043L623k300r580J0297K3702K2886J452k3438
$$ plain form
12536 520974 488850 458728 446210 428318 410926 394636 379674 373352 353829 339604 336469 323936
12524 323936 302746 290986 283003 272249 282500 290774 302734 314839 325890 321815 316443 298604
12512 298604 285772 260325 250718 252537 241856 221127 226020 228370 232755 241851 239629 229777 245177
12499 245177 213694 200996 223001 226928 229746 204055 196640 211360 220877 234960 247772 240602
12487 240602 214490 222159 212913 186030 152875 125102 136174 144599 140860 157398 154624 144465
12475 144465 167440 166121 165612 210398 256616 297510 319359 292912 266695 248346 228075 212840
12463 212840 210168 207362 175471 150875 135920 125720 94989 103763 100701 91028 105868 114931 104103
12450 104103 109085 100755 101572 83920 58877 62500 60200 50620 60917 84619 107505 108957 85519
12437H5519n758j0538o042O262r809O874O283O56j1220p626r146j5045J6866K1367
12423F8643o272k339j6778l20o714P569l006O043m888j9899p820M094m606J2440
12409B6147P402J9200P82R201k390K0124K9601O229K0789j5792l6840j4526l686
12396F6241n224l0234n023J2209J5971k68m882K2749R986j7902J5590n349K895
12383G6759J6608J2124J4705j8058k7217j5575j213j0131j1642k6081q853N405
12371F831L1555J4355K0951J2204M255j6316q478l1990l9913J5050K4717p605
12359B5616j3167j4389M611K392q15j6805r054Q243L822L3139J0255J3669J8466
12346F5983N853j6099j1397q013k1813k9201l199J3316J8601j549o405q004K0266
$$ plain form
12437 85519 79761 69223 63181 69443 59634 66508 72791 73447 62227 54601 45455 30410 47276 68643
12423 68643 62371 60032 43254 42934 36220 43789 40783 46826 41938 22039 14219 18313 13707 26147
12409 26147 33549 52749 53531 62732 60342 80466 110067 116296 137085 121293 84453 69927 66241
12396 66241 61017 30783 25760 37969 53940 53672 48790 71539 81525 63623 79213 73864 76759
12383 76759 93367 105491 120196 102138 74921 59346 58133 48002 36360 10279 1426 6831
12371 6831 38386 52741 73692 85896 90151 73835 65357 33367 -6546 8504 33221 25616
12359 25616 12449 -1940 2671 5063 4248 -12557 -21611 -13368 -9546 23593 33848 47517 65983
12346 65983 71836 55737 44340 36327 14514 -14687 -17886 -4570 14031 12482 6077 -1927 18339
12333A8339K0764j0232k6196q325J722P49K4174Q990J197q806j0038k0220j2149
12320b0031N524K365l1125m908K7140J8727j0258j1193k793J144n492j7833Q998
12307c9735M258j021j57J0662N303N400j0075J2433N677K0881R564j641Q946L517
12293C4012j7408j4937J5081k461j8296k0131N363L230Q669j1401M846P4J082
12280a2277J39L217k841j6585l1774j4067N54Q422K4030k0885k1724j7559j775
12267a03125n110J1J181l888O1046J17195J14036P9971L3580j3097k4293m5361
12255B12146k7620j3780k533j6274j7941n883j9977j6405O666J645m834m868j955
12242H8387J493j264m164o987o399n955l599O062r557m291l197j4418J0168M366
$$ plain form
12333 18339 39103 28871 2675 -5650 -3928 -3179 20995 29985 31182 22376 12338 -7882 -20031
12320 -20031 -14507 -12142 -43267 -48175 -21035 -2308 -12566 -23759 -26552 -25408 -30900 -48733 -39735
12307 -39735 -35477 -36498 -36655 -25993 -20690 -15290 -25365 -12932 -7255 13626 23190 21549 30495 34012
12293 34012 16604 1667 16748 14287 -4009 -24140 -18777 -15547 -6878 -18279 -13433 -13359 -12277
12280 -12277 -12138 -8921 -11762 -28347 -60121 -74188 -73634 -65212 -41182 -62067 -83791 -101350 -103125
12267 -103125 -108235 -108224 -107043 -110931 -49885 67310 181346 261317 294897 281800 257507 212146
12255 212146 184526 170746 168213 151939 133998 128115 108138 91733 98399 100044 95210 90342 88387
12242 88387 89880 88616 84452 77465 71066 65111 61512 67574 58017 53726 50529 36111 46279 50645
12228E0645k5991r120r567L844Q374J9907K728k2096k0002R277Q579K945J1755
12215C1278J5187J5147j3213j8276J6332K138j0258r621j0388j444K2377r52J6021
12202E4328O862l350M773j0665k0862j0092J3707J3100J2926k3117k716j504Q891
12189D2281n699n10o36o70O41P41j893J5961j0172O161N61o093R462K0676j0478
12174F0333j8059M935J0232k586j8115K445o579R280K0791L0589P765m2K4628
12161A25617M5579M8509R8170J21660J94496L03482L14269K27940O3034j47723
12151A395033k97709k99971k25834j43782o9725m2318k8484q625j8964k1375m7003
12140A91243l6015k5095k9582n219J933L477P45k0722j3974k2724j9513j5836
$$ plain form
12228 50645 24654 15534 5967 9811 18185 38092 40820 18724 -1278 7999 16578 19523 31278
12215 31278 46465 61612 48399 30123 46455 48593 38335 28714 18326 16882 39259 38307 54328
12202 54328 61190 57840 62613 51948 31086 20994 34701 47801 60727 37610 34894 33390 42281
12189 42281 36582 36072 35436 34766 35407 36148 34255 50216 40044 46205 46766 40673 50135 70811 60333
12174 60333 42274 47209 57441 54855 36740 39185 32606 41886 62677 93266 101031 100989 125617
12161 125617 171196 219705 317875 439535 634031 937513 1251782 1479722 1542756 1395033
12151 1395033 1097324 797353 571519 427737 358012 315694 287210 278585 259621 238246 191243
12140 191243 155228 130133 100551 95332 97265 100742 101487 80765 66791 44067 24554 8718
12128H718O612K2311P343j1387j7202m517J3317j555p483M101j3717j5218K493
12115f184l810j0807N836J3146M93J0668M895L548R954j2177K709k0213j058p073
12101a0073K5142J7341l1278k4636j4065J067K0256K0447q601Q028O693k3173
12089a2852q57K1423k0117M470M3841k902j1221j3190j9651o132q577M802R666
12076a1297J4584O532P928K044k275R311J4769m38m563o306R703N504j7226J6200
12062D4470J1617j7735j0858o245j0644k1129J7553K4994K509o861l824o420J6399
12049C3826P634M743j3368k6943j2769r940p48Q858L2340L3881J7238k2413j6559
12036C5780k012l037m248O245J647n347j9894k606n505j0670J611j1164n688l575
$$ plain form
12128 8718 15330 37641 44984 33597 16395 11878 25195 23640 16157 20258 6541 -8677 -6184
12115 -6184 -9994 -20801 -14965 -1819 -1326 9342 14237 17785 27739 15562 18271 -1942 -3000 -10073
12101 -10073 15069 32410 1132 -23504 -37569 -36502 -16246 4201 -4400 3628 10321 -12852
12089 -12852 -13709 7714 -12403 -7933 35908 33006 21785 8595 -11056 -17188 -25765 -20963 -11297
12076 -11297 3287 9819 17747 19791 17516 26827 41596 41158 36595 30289 39992 45496 28270 44470
12062 44470 56087 38352 27494 21249 10605 -10524 7029 32023 34532 27671 23847 17427 33826
12049 33826 41460 46203 32835 5892 -6877 -16817 -17565 -8707 23633 57514 74752 52339 35780
12036 35780 33768 30731 26483 32728 34375 29028 9134 6528 1023 -9647 -8036 -19200 -24888 -28463
12022b8463J1181J7865N135k896O307O478k0685q233n685k698K367J2910j9178
12009b5595O304n240M624J9465r239l937J3084j4695J0078J7183j4134o641P743
11996a000K0382N499j1461M604K66k3417p7J165R700Q195k783j1801q245m276
11982a3249M646J6158J5232J3937k498p456j6541r065K0064N431K86p504N64p735
11968A2270L233n216p027m795n072J7606L807j1117p111j3288j3758j7519Q992
11955c8995J1057K2829K4966q947n041L139R359m72j2424k5539l163K375j5388
11942c6244J3510J5213O871n445k0127Q336J0077n505n453l010N295Q182N202
11929c098j1264p250Q536J9950P177j1967Q259P124j4197l5674j1008N104N166
$$ plain form
12022 -28463 -17282 583 5718 2822 9129 15607 -5078 -13311 -18996 -21694 -19327 -6417 -25595
12009 -25595 -19291 -24531 -19907 -442 -9681 -13618 -534 -15229 -5151 12032 -2102 -8743 -1000
11996 -1000 19382 24881 13420 18024 18290 -5127 -5204 -4039 5661 13856 11073 -728 -8973 -13249
11982 -13249 -8603 7555 22787 36724 34226 26770 10229 1164 21228 26659 26945 19441 20005 12270
11968 12270 15503 10287 3260 -1535 -6607 10999 14806 3689 -3422 -16710 -30468 -47987 -38995
11955 -38995 -27938 -5109 19857 10910 5869 9008 18367 17895 5471 -20068 -23231 -20856 -36244
11942 -36244 -22734 -7521 -650 -6095 -26222 -17886 -7809 -13314 -18767 -21777 -16482 -8300 -3098
11929 -3098 -14362 -21612 -13076 6874 14051 2084 10343 17467 3270 -32404 -43412 -38308 -33142
11916c3142J8148J0697o570O591K2287M937K012l898K931j2793l8297j7325J1126
11903c3296j3021l122J5467J4208J2474K6846o385L199q542M754j14k5442J767
11890a1207J2776J2282j8762j5339n556j1175Q493r250p852N629O500L551r403
11877c9313K636K8073J4314P365q08R503j438k511k3881n778J3209M983J7276
11864B3630j149k6406l7657j2601J1500J5960N60J122K4726p902j9523J8228K0695
11851A1183K0176M263k5503p562p697P952l36k6632l031L47j0040L828l646j0133
11837d6831M316J4637K652L786K0438l747j1788l026R299J6552O578j4109N485
11824D242j49Q77M443Q33J8539L520j2300o606n491K019J755M878k3782j0066
$$ plain form
11916 -33142 -14994 -4297 -10867 -4276 18011 22948 24960 21062 23993 11200 -27097 -44422 -33296
11903 -33296 -46317 -49439 -33972 -19764 -7290 19556 13171 16370 7828 12582 12468 -12974 -11207
11890 -11207 1569 13851 -4911 -20250 -25806 -36981 -28488 -37738 -45590 -39961 -33461 -29910 -39313
11877 -39313 -36677 -8604 5710 13075 12267 21770 20332 17821 -6060 -11838 1371 6354 23630
11864 23630 22481 -3925 -41582 -54183 -42683 -26723 -26163 -25041 -315 -8217 -27740 -9512 11183
11851 11183 31359 35622 10119 2557 -5140 2812 2476 -24156 -27187 -26840 -36880 -33052 -36698 -46831
11837 -46831 -42515 -27878 -25226 -21440 -1002 -4749 -16537 -19563 -10264 6288 12866 -1243 4242
11824 4242 4093 4970 9413 10246 28785 32305 20005 13399 7908 9927 11682 16560 -7222 -17288
11810a7288l831j5195J5097J8866M656r368k278P610j1111K775K11p958m032J8133
11796c713N872l2611j2101R208j8815R034J1028l609m75O937K3729j3031j0036
11783b8583p026l069J3068q173L909j9108J639J5104K1291n327k741J7080J2173
11770A0237j4289j2640o38J7492K999L979J1938K810N863P19j9199j0512l450
11757d691j0127K0104K6083J1464k2214r18K353J4609j0704j4155n780j998J0229
11744A4255J4952M954j7361Q404J0323k669m74j9780p691j4224j7295q210j871
11731c6687N047n280p417K069J5207J0671K6697J0163j2161j174j190O825o994
11718E776K722j602J3402j2773j9770k612R259k0343j9052k51L0652K1823n800
$$ plain form
11810 -17288 -21119 -36314 -21217 -2351 2305 -7063 -9341 -1731 -12842 -10067 -9856 -17814 -21846 -3713
11796 -3713 2159 -30452 -42553 -33345 -52160 -43126 -32098 -35707 -36182 -29245 -5516 -18547 -28583
11783 -28583 -35609 -38678 -25610 -33783 -29874 -48982 -47343 -32239 -10948 -16275 -19016 -1936 10237
11770 10237 -4052 -16692 -17330 162 3161 7140 19078 21888 27751 28470 9271 -1241 -4691
11757 -4691 -14818 5286 31369 42833 20619 19701 22054 36663 25959 11804 6024 4026 14255
11744 14255 29207 34161 16800 25204 35527 32858 32384 12604 4913 -9311 -26606 -34816 -36687
11731 -36687 -31640 -36920 -44337 -42268 -27061 -16390 10307 20470 8309 7135 5945 12770 5776
11718 5776 8498 6896 20298 7525 -12245 -14857 -5598 -25941 -44993 -45244 -14592 7231 1431
11705A431J1582L359J1272m198o962p520j0394p763j4751N122J3590K1548k0269
11692c953k7650n357K0824j6297o593J913J5054j6794J060K7684J826K0620J5179
11679B7516j0841m392j2447m073J3843j2971k3445p138p442O950R978K1588n39
11666c413k494M037P669M594n533j905r016j4429j6316j8049R709K0322J2030
11653a2794k694O913J671K4331l293q225J6518j400j77J3241n920k3929k433r480
11639g671n701j1374P205J1659J1867j9208j0954J7142J6522P929M443l2579n139
11626a5859q303N639L9005j0401m863N828q218Q15K314P042p180P183J9814o145
11612B6671l0123m915j476j067K6563j107j5209L311r819L404L810k0169P045
$$ plain form
11705 1431 13013 16372 27644 23446 16484 8964 -1430 -9193 -23944 -18822 -5232 16316 -3953
11692 -3953 -31603 -36960 -16136 -32433 -39026 -37113 -22059 -38853 -37793 -10109 -8283 12337 27516
11679 27516 16675 12283 -164 -4237 9606 -3365 -26810 -33948 -41390 -34440 -24462 -2874 -3413
11666 -3413 -5907 -1870 5799 10393 4860 2955 -6061 -20490 -36806 -54855 -45146 -24824 -12794
11653 -12794 -15488 -8575 -6904 17427 14134 5909 22427 21027 20850 34091 28171 4242 1809 -7671
11639 -7671 -13372 -24746 -17541 -5882 5985 -13223 -24177 -7035 9487 17416 21859 -10720 -15859
11626 -15859 -24162 -18523 20482 10081 5218 11046 2828 3643 5957 12999 5819 13002 32816 26671
11612 26671 -3452 -8367 -9843 -10910 15653 14546 -663 2648 -7171 -3767 43 -20126 -13081
11599a3081J3026n094J62m082K890l844J9078n738p083k3254o99J9318n292r672
11585b3365P806M283J8946R964k8238K082J2125m610M861K922l027R388K4122
11572C7259J6369q246o899k8889R605m108R852P098l0620j3002J506n316M531
11559a0860R047Q814N914P557m532j1758j1072j3407M579K7390M427j9099J4937
11546A1937L3444J0903r271q494R781p462r557j5395j7310K8437J8494m252k0997
11533B0258K756L293r134k543J2039j0244L804j3502m1938j9186J2000K696J6909
11520b2792J6111P395J3219n009j942j850r70R086o647m326j755j8716J1971M350
11506a875j3054j6900J1169K1898K565r31k446J8421o637J6936J3913r218j3080
$$ plain form
11599 -13081 -55 -5149 -4987 -9069 -6179 -10023 9055 3317 -3766 -27020 -27719 -8401 -13693 -23365
11585 -23365 -15559 -11276 7670 17634 -10604 -8522 3603 -1007 3854 6776 3749 13137 37259
11572 37259 53628 45382 38483 9594 19199 15091 24943 32041 1421 -11581 -10075 -15391 -10860
11559 -10860 -1813 7001 12915 20472 15940 4182 -6890 -20297 -15718 11672 16099 -3000 11937
11546 11937 45381 56284 47013 38519 48300 40838 31281 15886 -1424 27013 45507 41255 20258
11533 20258 23014 26307 17173 14630 26669 16425 20229 6727 -35211 -54397 -42397 -39701 -22792
11520 -22792 -6681 714 13933 8924 6982 5132 4162 13248 6601 2275 520 -18196 -6225 -1875
11506 -1875 -14929 -31829 -20660 1238 3803 2872 426 18847 12210 29146 43059 33841 20761
11493B0761J3893J4871j3878j1803j0646K224j5883q764l19n057R465M365k614
11480c385k914K253k967R66J6391o732p084J1515P717n435m019R064Q88l2426
11466a6168k2561Q437K5721l825Q087q504j0592j170J903j733j1731J6578M276
11453a1282n503K5842O082l489n537M429O9q622n518P933J0686N411J5463j6963
11439A9001k0773R315j0393j9227o506J8774M848j5473j3604J7602O980J551M448
11426c457k0976j2355K2370J8372j2345M928p639p095K7419L495j1335N405K3092
11413B9879J9324J8005k9152l1444j3361J0604R743k539n332J4002Q080j0270
11401A7539j4205k191j5258j4752K1083J4258k1086j0077n947j3601K596J3845
$$ plain form
11493 20761 34654 49525 35647 23844 13198 15422 -461 -9225 -9544 -14601 -5136 -771 -3385
11480 -3385 -6299 -4046 -7013 -6047 10344 3612 -3472 8043 15760 10325 6306 15370 16258 -16168
11466 -16168 -38729 -30292 -4571 -8396 -309 -8813 -19405 -20575 -18672 -20405 -32136 -15558 -11282
11453 -11282 -16785 9057 15139 11650 6113 10542 10611 1989 -3529 4404 15090 20501 35964 19001
11439 19001 -1772 7543 -2850 -22077 -28583 -9809 -4961 -20434 -34038 -16436 -9456 -7905 -3457
11426 -3457 -24433 -36788 -14418 3954 -8391 -3463 -11102 -18197 9222 12717 1382 6787 29879
11413 29879 49203 67208 38056 6612 -6749 3855 13598 11059 5727 19729 27809 17539
11401 17539 3334 1143 -14115 -28867 -7784 6474 -14612 -24689 -30636 -44237 -41641 -27796
11389b7796J7403J3464K1310J1862j5374k0260J0223K408k2337j5764j2883J1561
11377b6183J5166J2963j9787N05J5137J0410l537l773J071j1204P403K0063J0458
11364B8692q560k1715m64j3609j1383L439m519K844R050P372K712j1180k1325
11351c8646k970L4622J3787R947l710l561o030J4211K9003m21k7809P04p086p509
11337D532m966J0294l138r5q713o61Q125J5518j2081N63J5985j401j2449k8586
11323a7073j3897r972K2327J0927p036j0879J5944Q287M376n253Q255q121q420
11310a0535k480N865R531p011q334n450j2378r941J5830K1138O225p070K776R48
11296h86j9017Q70n290J7499P806m648L048k966m104o727n71J760O898n52J6962
$$ plain form
11389 -27796 -10393 3071 24381 36243 20869 609 10832 13240 -9097 -24861 -37744 -26183
11377 -26183 -11017 1946 -17841 -17336 -2199 8211 4674 901 1972 -9232 -1829 18234 28692
11364 28692 20132 -1583 -2047 -15656 -27039 -23600 -28119 -25275 -16225 -8853 -6141 -17321 -38646
11351 -38646 -41616 -6994 6793 16740 13030 9469 3439 17650 46653 46232 18423 19127 12041 4532
11337 4532 -434 9860 6722 6627 -2086 -2747 5378 20896 8815 9378 25363 23962 11513 -17073
11323 -17073 -30970 -40942 -18615 -7688 -14724 -25603 -9659 -1372 3004 -2249 6006 -2115 -10535
11310 -10535 -13015 -7150 2381 -4630 -12964 -18414 -30792 -40733 -24903 -3765 2460 -4610 -1834 -886
11296 -886 -19903 -19033 -24323 -6824 982 -3666 -618 -3584 -7688 -14415 -14986 -13226 -6328 -6880 10082
11281A0082L749M03P7P322q990k2490j3897O296M924L206k3718j562J792R710
11267b3096L317M976J5970J894q759l853q849q933M290N557j6364O214P368J7546
11253b722j8833j0280J7387J9820j2820r678J6588J0408p279r182K7312m558j3350
11240B813j0343n275q59K4441R293p374j5012j1931k934K5742l918j6141j4850
11227b6348l89J3614r6k052k3793J1382O008j2548J5852J3594n445J991O271N933
11213C974R316o294l442j2297p177M376j4676J0902J8476n966j7513J2755o98
11200h264k773L033J6849Q571j5671j0786J083m863k6281J9439n527J4279J8217
11187G306J2603j7407k8062J8730J5148n331k6090j7738K2751K0984N876j9012
$$ plain form
11281 10082 13831 14234 14311 21633 12643 -9847 -23744 -17448 -12524 -9318 -33036 -34598 -32806 -23096
11267 -23096 -19779 -14803 1167 3061 -5698 -9551 -18400 -27333 -23043 -17486 -33850 -27636 -20268 -2722
11253 -2722 -21555 -31835 -14448 5372 -7448 -17126 -538 9870 2591 -6591 20721 16163 2813
11240 2813 -7530 -12805 -13664 10777 20070 12696 -2316 -14247 -17181 8561 4643 -11498 -26348
11227 -26348 -26737 -13123 -13219 -15271 -39064 -27682 -21674 -34222 -18370 -4776 -10221 -8230 -1959 3974
11213 3974 13290 6996 3554 -8743 -15920 -11544 -26220 -15318 3158 -2808 -20321 -7566 -8264
11200 -8264 -11037 -8004 8845 17416 1745 -9041 -7958 -12821 -39102 -19663 -25190 -10911 7306
11187 7306 19909 2502 -25560 -6830 8318 2987 -23103 -40841 -18090 2894 8770 -10242
11175a0242j826K2690p593n178J1035L00q570r576j5936r680l425J3081J6447
11162h473r626j0458j1405N906J7694J7870j7945j0524pJ873N12p365J2755J9780
11148E87J8746j3297j3838q810k8420j9691K087Q730o886J8287K0031Q492m182
11135a8164L861J4804N080N686k294l9249L971K1157k928n641K51q710p338L731
11121b5783k707J6176m183Q816k862j3644K32P101j9353r320J1169n337K2500
11108a7195j513K015j7492j5282q449K0710M629k2937j1855J1750J1169K0067
11096b4383J7598j8541j1122m229O830J9343j769l256K396L375M704J3385P830
11083A2161q598j046j1347q824L256Q594M802L638j2611k1053K1119N436K773
$$ plain form
11175 -10242 -12068 10622 3029 -2149 8886 9186 616 -8960 -24896 -34576 -38001 -24920 -8473
11162 -8473 -18099 -28557 -39962 -34056 -16362 1508 -16437 -26961 -26968 -25095 -24583 -31948 -19193 587
11148 587 19333 6036 -7802 -16612 -45032 -64723 -62636 -53906 -60792 -42505 -22474 -13982 -18164
11135 -18164 -14303 501 5581 11267 8973 -30276 -26305 -5148 -8076 -13717 -13466 -22176 -29514 -25783
11121 -25783 -28490 -12314 -16497 -7681 -10543 -24187 -23955 -16854 -36207 -45527 -34358 -39695 -17195
11108 -17195 -18708 -16693 -34185 -49467 -57916 -37206 -32577 -55514 -67369 -55619 -44450 -24383
11096 -24383 -6785 -25326 -36448 -40677 -33847 -14504 -16273 -19529 -17133 -13758 -9054 4331 12161
11083 12161 3563 2517 -8830 -17654 -14398 -5804 -1002 2636 -9975 -31028 -9909 -4473 -1700
11070a700Q354p492R304p955L53p208q536k377J5591Q077j0083m265j409j993
11056a1339J7208J4263j2506r751L730j2515M840J1680N466p021j5441q744o587
11043b6717j1576o945J2595K5911J4224k4950k4723j182Q105Q966j2524j2102
11031e0918J4016K6597m055P782J3710k0146j6107Q84J3652j385l18M615j3093
11018b4766k128J5817j4127q749J715K0327J41j360J5375m977j2978J381O260
11005h069J7056k068L885N079l312k0826j4959N809K395k275j1387m337O218j5173
10991d1964m220L5164J9839j2503j2773J0973R872q668p505l462J7935j414k2854
10978b1580j4951j8904m108K4048K7639L7109K769k9659k8047R118J4800n616
$$ plain form
11070 -1700 6654 -838 8466 511 864 -6344 -14880 -17257 -1666 6411 -3672 -7937 -9346 -11339
11056 -11339 5869 20132 7626 -2125 1605 -10910 -6070 5610 11076 4055 -11386 -20130 -26717
11043 -26717 -38293 -45238 -32643 -6732 7492 -17458 -42181 -43363 -35258 -26292 -38816 -50918
11031 -50918 -36902 -10305 -14360 -6578 7132 -13014 -29121 -28237 -14585 -15970 -16288 -11673 -24766
11018 -24766 -26894 -11077 -25204 -33953 -32238 -11911 -11770 -13130 2245 -2732 -15710 -14329 -8069
11005 -8069 8987 6919 10804 15883 12571 -8255 -23214 -17405 -15010 -17285 -28672 -33009 -26791 -41964
10991 -41964 -46184 -11020 8819 -3684 -16457 -5484 4388 -4280 -11785 -15247 2688 1274 -21580
10978 -21580 -36531 -55435 -59543 -35495 -7856 29253 32022 2363 -25684 -16566 -1766 -7382
10966g382o600l198K4990J3739k5903j548J0855J07L387J7770Q117k1941j8368
10953e975n896M764J9716o867l2693J7642o70j2260O396k009O035k084j1323j2515
10939c7739J5218N797J480j1885Q487O585j0524k494j3817Q146R139j580J4373
10926h814O460J5898n317Q849N10k2960m662j39j2977j318J8005J2465n678r370
10912i048r171P902m775J6804J0006Q630J847L96j7550K598J603m596J567J959
10898H172j4348r24R48Q186Q799P918N416O588j458j8603n475j4888J8296k4869
10884a6242K936M510j4909M711P869o690j7864k57J9924J4095j521j0611l55P478
10870f926p328J0263p406k0171j3186p031J1604J973j309Q575J270J4380j1001
$$ plain form
10966 -7382 -13982 -17180 7810 21549 -4354 -5902 4953 5060 8447 26217 34334 12393 -5975
10953 -5975 -11871 -7107 12609 5742 -26951 -9309 -9979 -22239 -15843 -17852 -11817 -13901 -25224 -37739
10939 -37739 -22521 -16724 -15244 -27129 -18642 -12057 -22581 -25075 -38892 -30746 -21607 -23187 -8814
10926 -8814 -2354 13544 8227 17076 17586 -5374 -10036 -10175 -23152 -24470 -6465 6000 322 -9048
10912 -9048 -18219 -10317 -15092 1712 11718 20348 22195 22591 5041 7639 9242 4646 6213 8172
10898 8172 -6176 -7100 -6152 2034 10833 18751 24167 30755 29297 10694 5219 -9669 8627 -16242
10884 -16242 -13306 -8796 -23705 -18994 -11125 -17815 -35679 -35936 -16012 -1917 -3438 -14049 -14404 -6926
10870 -6926 -14254 -3991 -11397 -31568 -44754 -51785 -40181 -38208 -39517 -30942 -29672 -15292 -26293
10857b6293L1745J8471M211K298j7699o707O434j8114j792J086R621J4436O40
10844A8337o070j1892J188J1338k1618L08m905O996j4166j4591J6099K6144J9355
10831B6523R679k0833l4111k5992O557K8438J1829J162R870k957j1087J6329M909
10818B0316P064k336J0447k5714l0120o291J904O23m858m046J175M063J7774J1336
10804A337O061N470l020J6255k64J711o929k8801k9738J1817J5588K3057J3670
10791B6214j07l779j1375j0169k4687l723L619R439J0387N488r168P382J9586
10778A9107J169j6537P075J3351l271n936m423n252J4219o115j4743j06j2643
10765a4105j394j0038k0588J8494J8577P482k456k5634j8645P904O829N974O50
$$ plain form
10857 -26293 5452 23923 28134 30432 12733 6026 12460 -5654 -7446 -6360 3261 17697 18337
10844 18337 12267 375 1563 12901 -8717 -8409 -13314 -6318 -20484 -35075 -18976 7168 26523
10831 26523 36202 15369 -18742 -44734 -38177 -9739 2090 3252 13122 10165 -922 15407 20316
10818 20316 27380 25044 35491 9777 -20343 -26634 -24730 -24107 -28965 -33011 -31836 -27773 -9999 1337
10804 1337 7398 12868 9848 26103 25839 27550 20621 -8180 -37918 -26101 -10513 12544 26214
10791 26214 26107 22328 10953 784 -23903 -27626 -24007 -14568 -4181 1307 -7861 -479 19107
10778 19107 20276 3739 10814 24165 20894 14958 10535 5283 19502 13387 -1356 -1462 -14105
10765 -14105 -15499 -25537 -46125 -27631 -9054 -1572 -4028 -29662 -48307 -40403 -33574 -27600 -26950
10752b6950Q891J1021K740j7517j1815m39M194p066j4752j1443N511J8917J2255
10739b6453j4426j5562K1070J9301J9825J3746p723J44O562o351j5419K234M068
10726A016K051M544K0524J029j3971n866l139l852k3689l769K0330L304j1318
10713a2806N579L2913J6083j053k2509l5219L075N712m73R799O75l613l824k7145
10699c2806j5304J6539J6893J2211J2592P936j1272r135K1389K842m2036k0180
10687d0331Q548J6331O655k3437J196r974J0615N515J0885q373m007j99J2971
10674a3605J6979M396j2634J6070J6125j7171r030j75N652J78j2246q502L709
10661a0254R154j1175J4349j3173J235J4553m140P843J2004M598p476j9225n368
$$ plain form
10752 -26950 -18059 -7038 -4298 -21815 -33630 -34069 -29875 -36941 -51693 -63136 -57625 -38708 -26453
10739 -26453 -40879 -56441 -35371 -16070 3755 17501 9778 9922 16484 10133 -5286 -3052 1016
10726 1016 3067 7611 28135 29164 15193 9327 6188 2336 -21353 -25122 -4792 -1488 -12806
10713 -12806 -7227 25686 41769 40716 18207 -17012 -13937 -8225 -8698 1101 1776 -1837 -5661 -32806
10699 -32806 -48110 -31571 -14678 -2467 10125 18061 6789 -2346 19043 21885 -20151 -40331
10687 -40331 -31783 -15452 -8797 -32234 -31038 -41012 -30397 -24882 -13997 -22370 -26377 -26576 -13605
10674 -13605 3374 7770 -4864 11206 27331 10160 1130 955 6607 6785 -5461 -13963 -10254
10661 -10254 -1100 -12275 2074 -11099 -9864 4689 549 8392 20396 24994 17518 -1707 -7075
10648g075J2350M217q358l752P110J383k3500N832j5164L705K7328m296M235k599
10634A416r066M71J6906j7346l581o218k1329q668J6282J8074J6831O944j7831
10621g115k9282K164J1284Q899R376Q21J0347J6955q923j4142j8940j1214j0248
10608d0018o618J0199P042R506P51J0693q277K566o541J3140J3268j9232J0049
10595c472K171n873j9627K141J177j4623M178R686Q552J0166m996Q628J4903p060
10581E951o706n429p585m159O283J2699j0080k8747p36J6791k781n420K7508r090
10567a1501q977M36J5794j0871j932K680j588j4745k2357o682J1916J0292J799
10554c5736j6304J213K2460J3954J0540l02J880j3112m571j083P709K4196J2077
$$ plain form
10648 -7075 5275 9492 1134 -2618 4492 5875 -17625 -11793 -26957 -23252 4076 -220 4015 1416
10634 1416 -7650 -7179 9727 -7619 -11200 -17418 -38747 -47415 -31133 -13059 3772 10716 -7115
10621 -7115 -36397 -34233 -22949 -14050 -4674 -3853 6494 23449 14526 384 -18556 -29770 -40018
10608 -40018 -46636 -36437 -29395 -19889 -19138 -8445 -16722 -14156 -20697 -7557 5711 -13521 -3472
10595 -3472 -1301 -7174 -26801 -24660 -23483 -38106 -33928 -24242 -15690 -5524 -10520 -1892 13011 5951
10581 5951 -755 -6184 -13769 -17928 -11645 1054 -9026 -37773 -38509 -21718 -24499 -29919 -2411 -11501
10567 -11501 -20478 -20042 -4248 -15119 -17051 -14371 -15959 -30704 -53061 -59743 -47827 -37535 -35736
10554 -35736 -52040 -50827 -28367 -14413 -3873 -4175 -2295 -15407 -19978 -21061 -13352 10844 22921
10541B2921k2306k9268J2540J5989n390K619q360j0053J2970J2585j372M893m496
10528C272J3425K395l131j684J293j712k577p818k2344J548J4135K3939j0523
10515A0218K935j37l6676m506n394j103K7378J3789p231j3543n054j668l464M397
10501b0059J6387N828q4J2506q03n96R327K994j8773P923q711K097M072J5067
10487B7175J0316j1980j5629K102N973j3132l184N674J8974k5197N45o87K6950
10474B7900q516k8373p622J2631J1616l718k637J3452j637j4662M815n48M1K0674
10460B3416l075r811J1332J543k03O244n418l195j1077L984j44o900j2108k8187
10446c3599o755j8232R800J7626J2315n10N055J1498N972j3593N145L888j4192
$$ plain form
10541 22921 615 -28653 -16113 -124 -5514 -2895 -11255 -21308 -8338 4247 2875 7768 3272
10528 3272 16697 19092 15961 14277 15570 13858 11281 3463 -18881 -17333 -3198 20741 10218
10515 10218 13153 13016 -23660 -28166 -33560 -34663 -7285 6504 -727 -14270 -19324 -20992 -24456 -20059
10501 -20059 -3672 2156 2072 14578 13775 13179 22506 25500 6727 14650 5939 8036 12108 27175
10487 27175 37491 25511 9882 11984 17957 4825 1641 7315 26289 1092 1637 950 27900
10474 27900 19384 -8989 -16611 -3980 7636 3918 1281 14733 13096 -1566 3249 2701 2742 23416
10460 23416 20341 10530 21862 23405 23202 29446 24028 20833 9756 13740 13596 6696 -5412 -33599
10446 -33599 -40354 -58586 -48786 -31160 -18845 -19355 -14300 -2802 3170 -10423 -5278 -1390 -15582
10433a5582J60J120j2099l719K1841j8093m347l068N366J4107J0449Q833j0252
10420e284j0356o021q303k378K6532R524K578q305j3592k917j5568O641p39K46
10406b7942J8057j2873j9J6414J3930N546K567J871j4933Q4J7220j9972j266j857
10392c173n938N46j1269J3829J2143N21q899n536l828R3p527r932J8484p031Q302
10377i215J3699j6671P051N568m310R544K1966J7380J722j1058O194n341j9479
10364A7050O905J1043J0007j071r866k4274k3664j1029p4Q561O167j0946r097
10351c0288j3726j5934K6156J4083J2497M660m843P536K0313K020k5618q793j8818
10338c0755r374J3499n227J3750J1480o774k362j1943M01J0635J8233M669j2846
$$ plain form
10433 -15582 -15422 -14302 -26401 -30120 -8279 -26372 -30719 -33787 -28421 -14314 -3865 4968 -5284
10420 -5284 -15640 -21661 -29964 -32342 -5810 3714 6292 -2013 -15605 -18522 -34090 -27449 -28188 -27942
10406 -27942 -9885 -22758 -22777 -6363 7567 13113 15680 17551 2618 2702 19922 -50 -1316 -3173
10392 -3173 -9111 -8565 -19834 -6005 6138 6659 -2240 -7776 -11604 -11511 -19038 -28970 -10486 -17517 -9215
10377 -9215 4484 -12187 -5136 432 -3878 5666 27632 45012 46734 35676 41870 36529 17050
10364 17050 23955 34998 45005 43934 34068 9794 -13870 -24899 -24973 -16412 -10245 -21191 -30288
10351 -30288 -44014 -59948 -33792 -19709 -7212 -2552 -7395 141 20454 22474 -3144 -11937 -30755
10338 -30755 -40129 -26630 -31857 -18107 -6627 -13401 -15763 -27706 -27305 -16670 1563 6232 -6614
10325f614R161p180J5067M316L092j6564j3364j4736J2698N016K409L031K687
10312i81k403L538J6582R001j6382o047p421j8859J071j6893j2098J2824K3284
10299a4784J3602j587k2160Q388J1233Q832J751K9468m984k6512m838J6163J1981
10286B6553O886j566j8107o562P368j2751p682R481p981P23K3491N198j329p608
10272A6114k3390j5888M633M168L0966o97r772o504J5872j7417j1165J2374J9272
10259A8566j3031j5222K575J3737Q133J560j5937l625O852N703Q547p541k1311
10246a0994j806k619R438j4458j3349q776m788j7410O503J1347K0835K7032j3395
10233a2440j7801J4434K6374J2512L903m922N50j3286j3135p497J1295M328r300
$$ plain form
10325 -6614 2547 -4633 10434 14750 17842 1278 -12086 -26822 -14124 -9108 -6699 -3668 -981
10312 -981 -3384 154 16736 25737 9355 3308 -4113 -22972 -21901 -38794 -50892 -38068 -14784
10299 -14784 -1182 -2769 -24929 -16541 -5308 3524 5275 34743 29759 3247 -1591 14572 26553
10286 26553 33439 31873 13766 7204 14572 1821 -5861 3620 -4361 -3638 19853 25051 23722 16114
10272 16114 -7276 -23164 -18531 -14363 16603 15906 6134 -370 15502 -1915 -13080 -706 18566
10259 18566 5535 -9687 -7112 6625 14758 16318 381 -3244 3608 9311 17858 10317 -10994
10246 -10994 -12800 -15419 -5981 -20439 -33788 -42564 -47352 -64762 -58259 -46912 -26077 955 -12440
10233 -12440 -30241 -15807 10567 23079 26982 22060 22610 9324 -3811 -11308 -13 4315 -4985
10220d985p623L630n042L3688K7064k933o695j5389r04j6104j6805p906Q401R613
10206a990M818j4363L89m412R178K1378L307K735j4677p583o925j9726j698K662
10192b6907L142O847M046j0953M610K8780K3937r763j7472K0731K0004r008k0140
10179A7854r75J7814N304k5206m123p706j1135j1564J1436K0621O418j0178J0018
10166A8578J919k7227j7033m060J3391J1118R897N384N094k516j4036k8857j4253
10153d2601K1654J9686j6566j4809J0369J0640p571N208j1151q059K0482j1030
10141b3748k8798Q664J8932k370l825j730R686R628k2322J057K083J5078L093
10128a4572p283p75m281J9666L885m077j193j4349L195Q868k1675l705J2438J0447
$$ plain form
10220 -4985 -12608 -8978 -14020 19668 46732 43799 37104 21715 20811 4707 -12098 -20004 -11603 -1990
10206 -1990 2828 -11535 -11146 -15558 -6380 14998 18305 21040 6363 -1220 -8145 -27871 -29569 -26907
10192 -26907 -23765 -16918 -12872 -23825 -19215 9565 33502 23739 6267 26998 47002 37994 17854
10179 17854 16879 34693 39997 14791 10668 2962 -8173 -19737 -8301 12320 18738 8560 18578
10166 18578 20497 -6730 -23763 -27823 -14432 -3314 6583 11967 17061 14545 509 -28348 -42601
10153 -42601 -20947 -1261 -17827 -32636 -22267 -11627 -19198 -13990 -25141 -33200 -12718 -23748
10141 -23748 -52546 -43882 -24950 -27320 -31145 -32875 -23189 -13561 -35883 -34826 -32743 -17665 -14572
10128 -14572 -21855 -22630 -26911 -7245 -3360 -7437 -8630 -22979 -19784 -10916 -32591 -36296 -23858 -13411
10114a3411p952j2176M807J1412o637P494L2427J5542k0100j3414j8046l93q644
10101b9091K3224J6821P969j9464k3268j6476L492J9216R411P86J8242P51q466
10088C147p69J5013j0104R176j79J3482j2605m035J390o899N551R982M07j8180
10074E377n483N171J000L837k1234p859L6290J5520j8006k1889Q725J3635j7827
10061b743j3659n435J1242N576J6100K0436j254j4012j495R770k2520j5713Q036
10048e671O396j7756k196j861j4028M600J5201J2226Q425q042m464j365n360r77
10034a4872K437p602j8239J847J5856J1487J3700J2720K640j1M619J0398k4276
10021A0704j6351j2747q758J8365J0560j1455O713M624j02k3903k2008L667R280
$$ plain form
10114 -13411 -21363 -33539 -28732 -17320 -23957 -16463 15964 31506 11406 -2008 -20054 -20447 -29091
10101 -29091 -5867 10954 18923 -541 -23809 -40285 -36793 -17577 -8166 -7380 10862 11613 3147
10088 3147 2378 17391 7287 16463 16284 29766 17161 13126 14516 7617 13168 23150 23557 5377
10074 5377 -106 5065 6065 9902 -11332 -19191 17099 32619 14613 -7276 1449 15084 -2743
10061 -2743 -16402 -21837 -10595 -5019 11081 31517 30263 16251 14756 24526 2006 -13707 -5671
10048 -5671 725 -17031 -19227 -21088 -35116 -30516 -15315 -3089 5336 -2706 -7170 -8535 -13895 -14872
10034 -14872 -12435 -20037 -38276 -36429 -20573 -9086 4614 17334 19974 19963 24582 34980 10704
10021 10704 -5647 -18394 -27152 -8787 1773 -9682 -2969 1655 1553 -22350 -44358 -40691 -31411
10008c1411k930l874J9371J6487k0084p497O324r73R078K368K951o302K592J2335
9994a565J1122k0819J3267N115j1514J6293j2854k0348n398J8193J3853j6936
9982a1591j3525R756J7189J1271K928M662J5404k1129j8784n921j044j1941N09
9969b2216M875J3136j495R090K183J0889n727q214p339O874J9022L05j2304j7438
9955h359j3850M025j6428j2657N104K3885K0799l517J789Q150L314j0644R470
9942A1081J9349j164J280O42k2817r580m154n526k012k176J0475R547J7453K152
9928B4550j7968o382j2769k7486q909L8301Q906O190N33J1990r580j6737j1130
9915b0491r628L276K226j981J4837Q029O577m019J0869J2086k5978l5530r155
$$ plain form
10008 -31411 -34341 -38215 -18844 -2357 -22441 -29938 -23614 -24587 -15509 -13141 -10190 -16492 -13900 -1565
9994 -1565 9557 -11262 2005 7120 -4394 11899 -955 -21303 -26701 -8508 5345 -11591
9982 -11591 -25116 -15360 1829 13100 16028 20690 36094 14965 -3819 -9740 -10784 -22725 -22216
9969 -22216 -17341 -4205 -5700 3390 5573 16462 10735 2521 -4818 2056 21078 21383 9079 -8359
9955 -8359 -22209 -18184 -34612 -47269 -42165 -18280 2519 -998 791 8941 12255 1611 11081
9942 11081 30430 29266 30546 31188 8371 -1209 -5363 -10889 -12901 -15077 -4602 4945 22398 24550
9928 24550 6582 200 -12569 -40055 -48964 -10663 -1757 4433 4966 16956 7376 -9361 -20491
9915 -20491 -30119 -26843 -24617 -26598 -11761 -3732 2845 -1174 9695 21781 -4197 -39727 -48882
9902d8882J849J7225K5790N516q073Q125O218L578J2904R942j5341k8850J1932
9889A933P118j8581j1166k403K2006K9329n030j3179K6501J2922j6001j7721r822
9876E906l421J5121j4970R861K374n774o639K3553J5315J4796L1172K6796N14
9863A14604k8733m0825j5217k2632k408K287J441J278j6939J7515j244k5071k083
9850a8027J124O550J15l0l906J2502O330l462L543j0586N347J4255j2755J0077
9836A1077J6755q847J666p025P968J915l355O268q285j349J5936k055j4234q614
9822G821j5176p875J6797J0670l130R270j807m541j4901J1572n625k145l147m269
9808f486j3155M155J1685J1059L815j3726j3813N616J0550m835n140p272R306
$$ plain form
9902 -48882 -47033 -29808 -4018 1498 -6575 1550 7768 11346 24250 34192 18851 -9999 1933
9889 1933 9051 -9530 -20696 -23099 -1093 28236 23206 10027 36528 49450 33449 15728 5906
9876 5906 2485 17606 2636 12497 14871 9097 2458 26011 41326 56122 87294 114090 114604
9863 114604 85871 45046 29829 7197 4789 7076 8517 9795 -7144 10371 9127 -15944 -18027
9850 -18027 -16903 -10353 -10238 -10268 -14174 -1672 4658 1196 4739 -5847 -500 13755 1000 11077
9836 11077 27832 18985 20651 13626 21594 23509 20154 26422 18137 16788 32724 30669 16435 7821
9822 7821 -7355 -15230 1567 12237 9107 18377 16570 12029 -2872 8700 3075 930 -2217 -6486
9808 -6486 -19641 -15486 -3801 7258 11073 -2653 -16466 -10850 -300 -5135 -10275 -17547 -8241
9795h241J7367J0578n628j3588r749j0039K3768K1308R958o168m371m303j2591
9782H301M169j3272m763J37j05n607P778J4565n54m058j1506J3529J7745n37m160
9767B1662j2394Q032n278J2036j0529j1558J6409K6633L441l3402k6029K31K4474
9754A3728P917j071q070J513p220n660j7205J0372O463o432J4227J7450p977r783
9740H252Q064L691j8954l308k2293q795J7625O538N327j2611k5540J3145Q071
9727b0788K1477k99J133J0615q491j1257j2919K3183J7055j4534k8620j2361M137
9714c1669O867Q838K3951O981p145j1780N179J826m975l411j9814J339K0604P883
9700D674n028J3056O712k1803o083J3848L775R445j4439j1000j1194m688N259
$$ plain form
9795 -8241 9126 19704 14076 488 -9261 -19300 4468 25776 35734 29566 25195 20892 8301
9782 8301 12470 -802 -5565 -5428 -5533 -11140 -3362 11203 10649 6591 -4915 8614 26359 25822 21662
9767 21662 9268 17300 12022 24058 13529 1971 18380 45013 48454 15052 -10977 -10746 13728
9754 13728 21645 20574 12504 14017 6797 1137 -16068 -5696 767 -5665 8562 26012 18035 8252
9740 8252 16316 20007 1053 -2255 -24548 -33343 -15718 -9180 -3853 -16464 -42004 -28859 -20788
9727 -20788 689 390 1523 12138 3647 -7610 -20529 2654 19709 5175 -23445 -35806 -31669
9714 -31669 -24802 -15964 7987 14968 7823 -3957 1222 3048 -1927 -5338 -25152 -23813 -3209 4674
9700 4674 -354 12702 19414 -2389 -8472 5376 9151 18596 4157 -6843 -18037 -22725 -17466
9687a7466k528p222j548J7587j05q505j0581K49l392J6591J3968k192M22J0167
9673E445J852P141o639j1004J2103J2860k294J228m690p022p39j1084q200K119
9659h924J4918P43M824J018J8605m703k0570K264p154j9361R721J0558k7883k741
9645b8685J2958J3626m723r65j5105k261L239j2177O375P676L390J3512j1208
9632a4348M533J3482j8806R249l32j2485P470L680R866k640K960j0039j5632j3174
9618c6216M266O656r694N903q63J7762J5109j1451q792l6Q261J2312j801j4651
9604a3235M279K1442n690k6111M30R24o100L180M419J2101J0410p988j3185J407
9590a3717L0179L4571k3562k2003k3369j7277M306J2203o063m258M701J0772L98
$$ plain form
9687 -17466 -19994 -27216 -28764 -11177 -11282 -19787 -30368 -30119 -33511 -16920 -2952 -5144 -4722 5445
9673 5445 7297 14438 7799 -3205 8898 21758 19464 20692 16002 8980 8241 -2843 -11043 -8924
9659 -8924 5994 6737 11561 12579 31184 26481 5911 8175 1021 -18340 -8619 1939 -25944 -28685
9645 -28685 -15727 -2101 -6824 -7789 -22894 -25155 -21916 -34093 -27718 -20042 -16652 -3140 -14348
9632 -14348 -9815 3667 -15139 -5890 -6222 -18707 -11237 -7557 2309 -331 2629 -7410 -23042 -36216
9618 -36216 -31950 -25294 -34988 -29085 -29948 -12186 2923 -8528 -17320 -17356 -9095 3217 1416 -13235
9604 -13235 -8956 12486 6796 -19315 -18885 -17961 -24061 -20881 -16462 -4361 6049 -1939 -15124 -13717
9590 -13717 16462 51033 27471 5468 -17901 -35178 -30872 -18669 -24732 -28990 -24289 -13517 -13119
9577a3119K0988N653q410k3231m32Q855L994J601n70J2725p264j8101R15P323
9563i073r318k0837J7842K9867J8724K825l70m154k9394P406J0190p542O23N460
9549A2249j1903j6315J162K060j3944l287N305J9552K40j241Q3j1682J4496K1303
9535A8078J6607r306j7487k7857j1984O205K5041Q387Q131o862l602K736J8192
9522B6279j0166j7133J8072Q967j7820q187j0012O429Q262r754j1903p146J370
9509b2742m42k536J31K6943K5912k0692k7598k087J1511J495J1579O405r614j0639
9495a2374m885j7362O629J3289j0084j120M909L246K3204p82j8597j1132R87l334
9481b7406J8882J7284K3706J955m152j4832j7101m761J1227o180j4642J1376J1652
$$ plain form
9577 -13119 7869 13522 5112 -18119 -18551 -9696 -5702 -4101 -4671 8054 790 -17311 -16396 -9073
9563 -9073 -18391 -39228 -21386 8481 27205 30030 29660 25506 -3888 3518 13708 6166 6789 12249
9549 12249 346 -15969 -14807 -12747 -26691 -29978 -24673 -5121 -4881 -6122 -6039 -17721 -3225 18078
9535 18078 34685 25379 7892 -19965 -31949 -25744 -703 7684 15815 8953 5351 8087 26279
9522 26279 16113 -1020 17052 26019 8199 12 -10000 -3571 4691 -5063 -16966 -24112 -22742
9509 -22742 -23184 -25720 -25589 1354 27266 6574 -21024 -23111 -11600 -10105 1474 7879 -1735 -12374
9495 -12374 -17259 -34621 -27992 -14703 -24787 -25907 -20998 -17752 5452 4670 -13927 -25059 -24072 -27406
9481 -27406 -8524 8760 32466 34421 30269 15437 -1664 -6425 4802 -1378 -16020 -4644 7008
9468G008k507M298J1618r95l6036Q885P080j5125q486j0644J0182J8685q507l691
9454a8235j09K2405K0909Q992M979j7325k8013j7102K0712K804p515J17j8193
9441b5574n463K9573J5174J3648o943k1405J043R41j0876k874O531j7224Q651
9428a4798J5865L182j555j1665L325M233K030n767j52J8353J5229l60j0619j9313
9414b012R75q447k3962J1473J1945Q321K2429N769k2089Q237p779j1397m319K5684
9400A4828n413l344j2072K6000r629j0419k869n463J6661K923K767k2758j0236
9387a9024N52N462K0199J0197j921J822k4442j8604J1472K3975J3745m451j7833
9374A149j511o291p47M960K857J8925J9305J7714j4038k1460k6693L028J5960
$$ plain form
9468 7008 4501 8799 20417 19422 -16614 -7729 -649 -15774 -24260 -34904 -24722 -6037 -14544 -18235
9454 -18235 -18344 4061 24970 33962 38941 21616 -6397 -23499 -2787 17 -7498 -7381 -25574
9441 -25574 -31037 -1464 13710 27358 20415 -990 53 994 -9882 -12756 -6225 -23449 -14798
9428 -14798 1067 4249 2694 -8971 -5646 -1413 617 -5150 -5302 13051 28280 27920 17301 -2012
9414 -2012 -1037 -9484 -33446 -21973 -10028 -1707 20722 26491 4402 12639 4860 -6537 -10856 14828
9400 14828 9415 6071 -6001 19999 10370 -49 -2918 -8381 8280 11203 13970 -8788 -19024
9387 -19024 -18472 -13010 7189 17386 15465 17287 -7155 -25759 -14287 9688 23433 18982 1149
9374 1149 -362 -6653 -7400 -2440 417 19342 38647 56361 42323 20863 -5830 -2802 13158
9361A3158o20p633j8085J3998O852j2790J5185L255j8098J2982J2357j5938o197
9348a574P240Q151j4021l3760j7380J7180K158k2884M225K0990K0817j26q306
9335a7290q991J3605J3811L470n539K601O22J8006K923j2739q818L0038P166k2005
9321A6860j8409J7279o613o095J9751P510m206j5434m224J885J2527m472m598
9308A1761O098R007P62n202j3808L538L625J4422R824k371k644j3359j1209J0727
9294B1171j7262q826j0926k284k333J103J9101L7798j3280j9571K80o313j3790
9281a5132j2332J0363L5594J5681j4444k202P942r352M402J004o726k0319m128
9268i649J638J5223J6500j960p325K810j2996J6518P808M875j5495r544P352J0673
$$ plain form
9361 13158 12538 4905 -13180 818 7670 -5120 10065 13320 -4778 8204 20561 4623 -1574
9348 -1574 5666 13817 -204 -33964 -51344 -34164 -32006 -54890 -50665 -29675 -8858 -8984 -17290
9335 -17290 -26281 -12676 1135 4605 -934 1667 2289 20295 23218 10479 1661 31699 38865 16860
9321 16860 -1549 15730 9117 3022 22773 30283 26077 10643 6419 8304 20831 16359 11761
9308 11761 17859 26866 27628 22426 8618 12156 15781 30203 40027 37656 35012 21653 10444 21171
9294 21171 3909 -4917 -15843 -18127 -20460 -19357 -256 37542 24262 4691 4971 -1342 -15132
9281 -15132 -27464 -17101 18493 34174 19730 17528 25470 16118 20520 21524 14798 -5521 -9649
9268 -9649 -8011 7212 23712 21752 14427 17237 4241 20759 28567 33442 17947 8403 15755 26428
9254B6428k486J634p515N692j4573P731J2547O670k412j9732M177n500J1710k631
9240B1740m251O362j546L081q089N191R47O114j6920k4113n433J6103n67J5245
9226A3864N713n783k245p090M382J3332o293L863k2583j4113K0438l738j1973
9213a2226O541j1277j2167M6146J6677r041L872j2156r886L631r598r7J7545j669
9199A6295J4839j6899m319o3j0570k465o38q78N907l363j6676k912r99O380J5741
9184f20p486p30Q012J1921j3602j7758P126O16J4884m693k6322n841J0929J8548
9170e016J2305O768J4589q312n283j2291j6854K3317j0932n081N918m261L4326
9157B9193J5922l976n534m927J3503K68k0872k5184j5993L298l053J3334l408
$$ plain form
9254 26428 23942 25576 18061 23753 9180 16911 29458 36128 33716 13984 18161 12661 24371 21740
9240 21740 17489 23851 22305 25386 17297 22488 23435 29549 12629 -11484 -16917 -814 -1381 13864
9226 13864 19577 13794 11549 4459 8841 22173 15880 19743 -2840 -16953 3485 -253 -12226
9213 -12226 -5685 -16962 -29129 17017 33694 24653 28525 16369 6483 10114 516 419 17964 16295
9199 16295 31134 14235 9916 9853 -717 -3182 -3820 -4698 1209 -2154 -18830 -21742 -22741 -16361 -620
9184 -620 -8106 -8836 -824 11097 -2505 -20263 -13137 -12521 2363 -2330 -28652 -34493 -23564 -5016
9170 -5016 7289 14057 28646 20334 15051 2760 -14094 9223 -1709 -6790 -872 -5133 29193
9157 29193 45115 41139 35605 30678 44181 44449 23577 -1607 -17600 -14302 -17355 -4021 -7429
9144g429l596j058J2029J4659j2940k462J0827q074O889J3837N906j323o693j7579
9130B993K243P728J9373K7385o444m0374k3364R018J3258J4553O684R310L995
9117D6358k075J1640j3586J4060o607o463n355l716n340L41o807j8325q580K1045
9103A6590L220R283o009k255M232Q973J4793l949K820j01k1605J0472J1621J4683
9089F2768J5166O377K599j2812j3400j0999r190p968j4773m568J8335M786K419
9076C8740L8254K8749j5000o061J6756K6987K4709K4279L5213K8931K3832P2651
9064C38040O8176Q8427R9806J38704J99966K93937N08656Q34133J340666K035093
9054E945604K396041J520003p2417j357380k211158j949354j174664o67951l85879
$$ plain form
9144 -7429 -11025 -12083 -54 14605 1665 -797 10030 1956 8845 22682 28588 27265 20572 2993
9130 2993 5236 12964 32337 59722 53278 12904 -10460 -1442 11816 26369 33053 42363 46358
9117 46358 44283 55923 42337 56397 49790 43327 37972 34256 28916 29257 22450 4125 -4455 16590
9103 16590 19810 29093 23084 20829 25061 34034 48827 44878 47698 47597 25992 36464 48085 62768
9089 62768 77934 84311 86910 74098 60698 49699 40509 32541 17768 13200 31535 36321 38740
9076 38740 76994 105743 90743 84682 101438 128425 153134 177413 212626 241557 265389 338040
9064 338040 406216 494643 594449 733153 933119 1227056 1735712 2569845 3910511 5945604
9054 5945604 8341645 9861648 9789231 8431851 6220693 4271339 3096675 2428724 2042845
9045B042845k38452j76853j55059j89031j75287j82882j45050j20300r2232n1587
9035E16112n7228q0328n5098m0811m8122l4450l2791p57o766k547L720k9479k632
9022A28823k0030j5217R56r245j9371k898j6034N868K5267J4844j0859j9116j1859
9009E1129q767M025L72j8163J1910m082r949m437J3641M808J0718k0905r775K788
8995B3313P90M017J5629k02r629L869p724o679R37K7323k8413p767N309J3550
8981C4323Q709k86m585j4975l466j6130K236K142L247J3359O105j139N942n892
8967B9590L712l218l4081o799m164j4334J4242J2066K1799Q827K619l638j6719
8954I902k0470r813j226M036J1784J1165K9126Q699k2599j3836j6530J1990K2727
$$ plain form
9045 2042845 1804393 1627540 1472481 1283450 1108163 925281 780231 659931 567699 516112
9035 516112 458884 378556 323458 282647 234525 200075 167284 166527 159761 157214 160934 131455 128823
9022 128823 108793 93576 94532 85287 65916 63018 46984 52852 78119 92963 82104 62988 51129
9009 51129 42362 46387 46759 28596 40506 36424 26475 22038 35679 40487 51205 30300 20525 23313
8995 23313 24103 28120 43749 43547 33918 37787 30063 23384 24321 51644 23231 15464 20773 34323
8981 34323 43032 42746 38161 23186 19720 3590 5826 7968 11215 24574 30679 29540 35482 29590
8967 29590 33302 30084 -3997 -10796 -14960 -29294 -15052 -2986 18813 27640 30259 26621 9902
8954 9902 -10568 -20381 -21607 -17571 -5787 5378 34504 43203 20604 6768 -9762 2228 24955
8941B4955k571j6199J976m562j7814M632n16n288Q014K932j5326J1417q70r822
8927a9042q619j8561K509K2475K1365P387r419J1861J24O332J8894P824J530p333
8913C7327k8279M460J2707k1499q814K142J4171J5392j4213l2521q646K8J8195
8900i550J7599j2301j8356K1756K2881L008j983K7831M657m2126j3467R374l047
8887F276j4929j0749J2441k725q815K4464n584q676P147J5995N725P49l721j1372
8873F226k5158o859N150n592M645N662m765J3242Qk2860o62P368Q939J8152K7399
8858C0895r220n654k813J3793Q452k2328J74l629J5394O439K361j2477p30J2082
8844C2739M22j0747o705J0620r933j0481M153j347n654j00k408Q142J0955K1320
$$ plain form
8941 24955 22384 6185 8161 3599 -14215 -9583 -10099 -15387 -7373 -4441 -19767 -8350 -9220 -19042
8927 -19042 -27661 -46222 -43713 -21238 127 7514 -1905 9956 10080 16412 35306 43130 44660 37327
8913 37327 9048 13508 26215 4716 -4098 -1956 12215 27607 13394 -19127 -27773 -27745 -9550
8900 -9550 8049 -4252 -22608 -852 22029 25037 23054 50885 55542 13416 -51 9323 6276
8887 6276 -8653 -19402 -6961 -9686 -18501 5963 379 -8297 -1150 14845 20570 21319 17598 6226
8873 6226 -18932 -25791 -20641 -26233 -21588 -15926 -20691 -7449 -7441 -30301 -30963 -23595 -14656 3496 30895
8858 30895 21675 16021 13208 27001 35453 13125 13299 9670 25064 31503 33864 21387 20657 32739
8844 32739 33161 22414 15709 26329 16396 5915 10068 8721 3067 2967 559 8701 19656 40976
8830D0976P213m126J2247m759o215l349j0014P049J5391j6414j7812j165k3312
8817d290J4213k1256j434R295q78R245N28R469K3952M240k161P519J1610J0894
8803G0946k624j0378k2866j9395k1639k2174j3694J8746n698J7307J411L377J2675
8790E994l33J0041r505j2690J647m119J1382j3890l474K6551j916n280J0778P527
8776B2713m044j5170Q937J3478l080R446M854j5071j851J182J5455J0250j9400
8763B7699M555P160j100q407j5234m810k735O632K0968L638n201m223o272L146
8749B5816j3667l022K3329p859k8030N712k1514L825L9319J9440P959o506j3916
8736C0886j6389K741M104P598j633k5924J1963L4414K1936k3174j8511q313J3641
$$ plain form
8830 40976 48189 44063 56310 51551 45336 41987 31973 39022 54413 37999 20187 19022 -4290
8817 -4290 9923 -11333 -12767 -3472 -4350 4895 5423 14892 38844 43084 40923 48442 60052 70946
8803 70946 68322 57944 35078 15683 -5956 -28130 -41824 -23078 -28776 -11469 -10058 -6681 5994
8790 5994 5661 15702 6197 -6493 -4846 -8965 2417 -11473 -14947 11604 9688 4408 15186 22713
8776 22713 18669 3499 12436 25914 22834 32280 37134 22063 20212 21394 36849 47099 27699
8763 27699 32254 39414 38314 29907 14673 9863 7128 13760 34728 38366 33165 28942 22670 25816
8749 25816 12149 9127 32456 24597 -3433 2279 -19235 -15410 23909 43349 51308 44802 30886
8736 30886 14497 17238 21342 28940 27307 1383 13346 47760 69696 46522 28011 19698 33339
8723C3339M638j3894n905K380L128Q454R738j0355l2783j5486O887J4396q594
8710d057o241K528M05J8522J9764J8725j9060o686J0080N154l588R633J8042r154
8696E4067j8113j1610K3347K257R915K2437N736j5049j6163r822R324R380n534
8683F0172k0475k0261M391k301J5157K1675o170r604k6907j1896n113L648J5722
8670A8038Q328J0902K1236J5499J8603l779j5896o91j556k3329Q331J2338j9930
8657D8094j223r17j4412j8041K660J2999K5165q955L609J8675P322q813J2258
8644G8421J8292o738k2946O106L2070O645k2488n750J4721p013P772K4106o83
8631A22515J010l388r151Q197j2700M405L8125K0040K6356K6820K9018L1358J2048
$$ plain form
8723 33339 37977 24083 18178 20558 23686 32140 41878 31523 -1260 -16746 -9859 4537 -4057
8710 -4057 -10298 -7770 -7365 11157 30921 49646 30586 23900 33980 39134 35546 45179 63221 54067
8696 54067 35954 24344 47691 49948 59863 82300 88036 72987 56824 47002 56326 65706 60172
8683 60172 39697 19436 23827 21526 36683 58358 52188 42584 15677 3781 -1332 2316 18038
8670 18038 26366 37268 58504 74003 92606 88827 72931 72240 70684 47355 55686 68024 48094
8657 48094 46871 45954 31542 13501 16161 29160 54325 45370 48979 67654 74976 66163 78421
8644 78421 96713 89975 67029 73135 105205 111850 89362 83612 98333 91320 99092 123198 122515
8631 122515 123525 120137 110986 119183 106483 110888 149013 169053 195409 222229 251247 282605 294653
8618B94653J3253K2638K682q076k1113j0622J633O080k5386k7643k7466j4973
8606B05660j1323j0951j5217k4096j2009r29o122Q671n646k4467k9607j0355J6942
8593H0551r50j2040j1020Q46r554j1282j0017j701M453J548K7931J2196j802k2118
8579D7041J746N122j1076K022l631L4441R990j6228p396O023K936P956j1160o333
8565F1453J797j2979P827l166k4630l133R409J0334J4124M464j4814m436j8649
8552B7601k908N769j98R135L624J0282p892J415o14j2715N178l288m716R662K8957
8537F9292j0064k2814P3m09r951j2498O991J3147q083O263k91j6171r94L245k0812
8522c076N967Q055o615J27j763K68J1450n586k760J4915K5737P771j0697j232
$$ plain form
8618 294653 307906 330544 333226 325150 304037 293415 295048 301128 275742 248099 220633 205660
8606 205660 194337 183386 168169 144073 132064 131135 125013 133684 128038 103571 73964 63609 80551
8593 80551 79601 67561 56541 57387 47833 36551 26534 24833 29286 30834 58765 70961 69159 47041
8579 47041 48787 53909 42833 44855 41224 75665 85655 69427 62031 68054 70990 78946 67786 61453
8565 61453 63250 50271 58098 54932 30302 27169 36578 46912 61036 65500 50686 46250 27601
8552 27601 24693 30462 30264 39399 43023 53305 45413 46828 46214 33499 38677 35389 30673 40335 69292
8537 69292 59228 36414 36487 36078 26127 13629 20620 33767 25684 31947 31656 15485 14491 17736 -3076
8522 -3076 2891 10946 4331 4458 2695 2963 14413 8827 6067 20982 46719 54490 43793 42561
8508D2561k864J252j1598j2056K320m506r775Q132j916k307J1653k578j1604R42
8494G656K2124P442m221r576j8112J0165j5368q989K135R046K026l033l945M324
8480A674J4920m817m35J0743J0537j46j4470j819o609p505Q672O78j2979j351
8466b907m021q670p0N560J1474J7117k125l1600j067L6442O580n202n141j6274
8452I6j6834k8201o842K5286M1702j2166j9841N584L0405J8393k0208r576O00
8439H398Q051l40k435N709q724Q30J0541J103K117k436q559j6741L734N102l578
8424B772m868m88K3520J4581j861j5377l561Q328K774k908p533K6k2409P244J0024
8409A0264J2769k5488j2995O827R767J2219O992Q35r096j6970Q931m195m108P353
$$ plain form
8508 42561 39697 40949 29351 17295 19615 15109 5334 13466 11550 9243 20896 18318 6714 7656
8494 7656 29780 37222 33001 23425 5313 15478 110 -8879 -6744 2302 4328 1295 -2650 1674
8480 1674 16594 11777 11342 22085 32622 32476 18006 16187 9578 2073 10745 11423 -1556 -2907
8466 -2907 -6928 -15598 -15668 -10108 1366 18483 16358 -15242 -16309 20133 26713 21511 16370 96
8452 96 -16738 -44939 -51781 -26495 15207 3041 -16800 -11216 19189 37582 17374 7798 8398
8439 8398 16449 16109 13674 19383 10659 11489 22030 23133 25250 22814 14255 -2486 1248 6350 2772
8424 2772 -2096 -2584 20936 35517 33656 18279 14718 23046 25820 22912 15379 15405 -7004 240 10264
8409 10264 23033 -2455 -15450 -8623 1144 13363 20355 21190 12094 -4876 4055 -140 -4248 3105
8395C105J338M739n846j759m235p266O88p162j262J3827J1892j1480j2728j708
8381a7857J2440J6349K814R816q712j8836j0309j3223K1777M373J1643P687j6932
8368A030J1928q377n151J9640Q086j3536j0096j5062L386K5185J2994j005n926
8355B3096r921P165M13P440R422m694j3614k6690k9308J2253J5320Q61Q058j3369
8341a3568j2748J696r592J4448J95n317L547P98j705J4595M415j3216K727J3555
8327a70N443N09j5438j9320K234Q332J2741J3344o097q479J6434Q087l592l2508
8313a8480K697L4806J3416N22O363r234j1713k1414m561J3319J0733K069j630
8300A6893K873k852j2335R212l851K48J0380P686k6361L517O340r139O566M859
$$ plain form
8395 3105 4443 9182 3336 1577 -2658 -9924 -9236 -16398 -17660 -3833 8059 -3421 -16149 -17857
8381 -17857 -5417 10932 13746 23562 14850 -3986 -14295 -27518 -5741 -1368 10275 17962 1030
8368 1030 12958 4581 -570 19070 27156 13620 3524 -11538 -8152 17033 30027 29022 23096
8355 23096 13175 20340 20753 28193 37615 32921 19307 -7383 -36691 -24438 -9118 -8257 -199 -13568
8341 -13568 -26316 -24620 -34212 -19764 -19569 -24886 -21339 -20541 -22246 -7651 -3236 -16452 -13725 -170
8327 -170 5273 5782 -9656 -28976 -26742 -18410 -5669 7675 1578 -6901 9533 17620 14028 -18480
8313 -18480 -15783 19023 32439 32961 39324 30090 18377 -3037 -7598 5721 16454 18523 16893
8300 16893 19766 16914 4579 13791 9940 10188 20568 28254 1893 5410 11750 2611 9177 14036
8286A4036J1244k451m969j0985l062k2857J3716K2256J475l332j2804q442P554
8273A379j4282J5803J218j0658J513k768K65m02M055p804k4913J5026K7954l877
8259B509m127K001J2058j0194q721M255P165q339k259L0913M982n100j4409r381
8245A353r109j1364Q839J4209p083J673L667M540n28n631J4758J6145j0954j2415
8231H100N8m354L260k007r375n241K004k0881K390K1286Q387k112j5771O261J2292
8216D297Q457l776k5212k4777J5667P022K9032J7390J5200j2459j5832l535l4607
8203b3133k4947q479K2464L638n224N092K7225O511j0657q412J5864J2053Q300
8190B0295j1411j1439K562O016J0766L239k6427P361L723m108l940K716M258J0674
$$ plain form
8286 14036 25280 22829 17860 6875 3813 -19044 -5328 16928 18403 15071 2267 -6175 1379
8273 1379 -12903 2900 4118 -6540 -5027 -7795 -7530 -7932 -3877 -11681 -36594 -21568 6386 2509
8259 2509 -1618 383 12441 2247 -6474 -2219 4946 -3393 -5652 25261 30243 25143 10734 1353
8245 1353 -7756 -19120 -10281 3928 -3155 -1482 2185 6725 6197 566 15324 31469 20515 8100
8231 8100 8158 3804 7064 5057 -4318 -9559 -7555 -28436 -26046 -4760 3627 1515 -14256 -7995 4297
8216 4297 12754 8978 -16234 -41011 -25344 -18322 10710 28100 43300 30841 15009 11474 -23133
8203 -23133 -48080 -56559 -34095 -30457 -35681 -30589 -3364 3147 -7510 -15922 -58 11995 20295
8190 20295 8884 -2555 7 6023 16789 20028 -6399 962 4685 577 -3363 -647 3611 14285
8176A4285Q188J2848o018k2594k8131J2500R319j28k0603K2081J6551m193p691
8163F414j617J4803K457o967j8923j7216J1867K6024l416j1343j553k755J0755
8150H530j2L477p359j6077j5322J0084L427J2294n075K0226O025K957J5298O810
8136D5283m314k9251J5609K3402m252Q172j4151k6216k998o028l299j2727o786
8123a7556J2458J2422O651J150R743k0640J7927r877j1790O089M310J6306k3157
8110D036l372J2031q001L963L495j3328K66j4228j0995n69J5554J5048l976J0755
8096A0679L126O109K1636j2179j8410J945o367j984j6097j1825R471L5279J4830
8083C6213q460j2295P420P539k4195j1723L795M251q497j1369O919J0874J7870
$$ plain form
8176 14285 22473 35321 29303 6709 -21422 -8922 397 269 -20334 1747 18298 14105 6414
8163 6414 4797 19600 22057 15090 -3833 -21049 -9182 16842 13426 2083 530 -2225 8530
8150 8530 8518 11995 4636 -11441 -26763 -16679 -13252 -958 -6033 14193 20218 23175 38473 45283
8136 45283 40969 11718 27327 50729 46477 54649 40498 14282 11284 5256 1957 -10770 -17556
8123 -17556 -5098 7324 13975 15125 24868 4228 22155 12278 488 6577 10887 27193 4036
8110 4036 664 12695 4694 8657 12152 -1176 -910 -15138 -26133 -26702 -11148 3900 -76 10679
8096 10679 13805 19914 41550 29371 10961 12906 6539 4555 -11542 -23367 -13896 21383 36213
8083 36213 27753 15458 22878 30417 6222 -5501 -1706 2545 -5952 -17321 -10402 472 18342
8070A8342l51q49k473J6155k423j2630M187l08j2255R264Q989m432J1854L161
8056C6231K54O841Q573j882P210K125j0469j3473j1795O581p487Q948J872j8193
8042A5336j1911N460J7049L0692J4884l908R830L783k691l518k987l544m532K1561
8028H5504K1417k79K218m998j7602k831M6J916N385j3853j6108m712K464Q835
8014F7402k1310j1592l21M964o143O569M990o949J1524k19J563j9478J7093k865
8000D5228m397n946k404J5428m84k744m85J3227O818j8469n40l664N703J2586
7986E9857K5202p288r585q02j3513n741J1022J0399o695p206P145O908O082j4758
7972F1027j285m218J2589k708o035K0322P333j1989j1440r648L347K115M947n919
$$ plain form
8070 18342 17991 17142 14669 30824 28401 15771 19958 19650 7395 16659 25648 21216 33070 36231
8056 36231 36485 43326 51899 50017 57227 59352 48883 35410 23615 30196 22709 31657 33529 15336
8042 15336 3425 8885 25934 56626 71510 67602 77432 81215 78524 75006 72019 68475 63943 85504
8028 85504 106921 106642 108860 103862 86260 83429 83475 85391 90776 76923 60815 56103 58567 67402
8014 67402 46092 34500 34179 39143 33000 39569 44559 37610 49134 48915 50478 31000 48093 45228
8000 45228 40831 34885 32481 47909 47425 44681 44196 57423 64241 45772 45232 41568 47271 59857
7986 59857 85059 77771 68186 67384 53871 48130 59152 69551 62856 55650 62795 69703 75785 61027
7972 61027 59742 55524 68113 65405 59370 79692 87025 75036 63596 53948 57295 59410 64357 58438
7958E8438r176O20L080Q610n293l200j2632j283l520N791l940M095J4932J5507
7944G2029j8269k033J5480J2251J488P411K25J4996q870j8022m302n515j3395
7931E3474p112O933O71j1133J0958K1220j0001j6936P051J2349N290n771j5136
7918E1857j2862j4051j3137J269Q652K0933J068N264J116j6635r334l3351r154
7905a8365P125K6959J3258O074q758j875J2907q965m2128j582J8962j5643P40
7892a1291J1275j02l057p632n717P245K1597M0443N435j7674m520r902j2820j8148
7878d868j5970k265J8699L771O860n43r515n928O590J0796j0520J1613j959L344
7864A0105P25J1201K5462n369j1218m520J529j1659k2503q107K5428J3139J696
$$ plain form
7958 58438 49262 49882 52962 61572 56279 53079 40447 39164 35644 41435 37495 41590 56522 72029
7944 72029 53760 51727 67207 79458 80946 88357 88582 103578 94708 76686 72384 66869 53474
7931 53474 46362 53295 53966 42833 53791 75011 65010 48074 55125 67474 72764 66993 51857
7918 51857 38995 24944 11807 13076 21728 42661 43729 48993 50109 33474 24140 -9211 -18365
7905 -18365 -11240 15719 28977 35051 26293 24418 37325 28360 -13768 -15350 3612 -12031 -11291
7892 -11291 -16 -118 -3175 -10807 -16524 -9279 12318 52761 58196 40522 36002 26100 13280 -4868
7878 -4868 -20838 -23103 -4404 -633 6227 5684 -3831 -9759 -3169 7627 -2893 8720 6761 10105
7864 10105 10830 22031 47493 42124 30906 26386 27915 16256 -6247 -14354 11074 24213 25909
7851B5909q787K834J3914O254R84m22Q245q943j5375J9354J0220o68j53j8015
7837C5351q038j4273j6768j5315J2060K0931j937q633r898J05N813n784l200Q766
7823h20L422J4905K64j2118N512J0111o466k9448q045O049J0772m098j0200j5628
7809c5788J996L3760J4423L340J1039n541j0343k2915J574J7879K0992L774l1443
7796B747k6305J2271j0322j096K5016J1233M819k4944p721K0156J3061k2871j0173
7783a4129P574j354M606j660k329K062K0623p656j3941k3467m221J6402M76j6397
7769c3411M959K3734Q57O532J5240l961r808n82j0974K1279J1361k7794k1480
7756b4048R281M61K2190M95k6484J0669r739N71n623K0332q384j8094Q794J1858
$$ plain form
7851 25909 17122 19956 33870 40124 41108 40686 48931 39988 24613 43967 54187 53519 53366 35351
7837 35351 27313 13040 -3728 -19043 -6983 13948 12011 3378 -6520 -6415 -602 -6386 -9586 -820
7823 -820 2602 17507 17771 5653 11165 21276 14810 -14638 -22683 -16634 -5862 -9960 -20160 -35788
7809 -35788 -33792 -32 14391 17731 28770 23229 12886 -10029 -8455 9424 30416 34190 2747
7796 2747 -23558 -11287 -21609 -22705 2311 13544 18363 -6581 -14302 5854 18915 -3956 -14129
7783 -14129 -6555 -7909 -3303 -4963 -7292 -5230 15393 7737 -6204 -29671 -33892 -17490 -17014 -33411
7769 -33411 -28452 -4718 -3861 2671 17911 13950 4142 3560 -7414 13865 25226 -2568 -24048
7756 -24048 -14767 -14306 7884 8379 -18105 -7436 -17175 -16604 -22227 -1895 -10279 -28373 -19579 -7721
7742g721l442j5025J3783k429j3605J8938J0621j1307j9580o823K629R695L626
7729b0640J2772J7271P072N217J785j5409Q496p010q015n759K941j5380j079M228
7715a3510J0096j0431p114j2468K428J4681K0793Q088j1044j3149N151L2052n909
7702A9664k2857l0331P40O001O277K934L948J8340J0568j3267j5579J317R372
7689b873O653l136P294q357n675K142L072K3398k0079k0042O529K3407l417n342
7675C574j1680j6296R829Q188P268l71j3058M189R055J8130K6532J23j5888j6800
7661A2795j5805q141J9967R388j5641o594J7748Q204j3186l061j0268O537L799
7648E742P505n176n299l091M695K5240p642j4272r713J585L6204J1750m152n013
$$ plain form
7742 -7721 -11163 -26188 -12405 -14834 -28439 -9501 1120 -10187 -29767 -36590 -33961 -24266 -20640
7729 -20640 -7868 9403 16475 21692 23477 8068 16564 9554 1539 -4220 -1279 -16659 -17738 -13510
7715 -13510 -3414 -13845 -20959 -33427 -30999 -16318 4475 12563 1519 -11630 -6479 25573 19664
7702 19664 -3193 -33524 -32784 -26783 -20506 -17572 -13624 4716 15284 2017 -13562 -12245 -2873
7689 -2873 3780 644 7938 -419 -6094 -3952 -880 22518 2439 -17603 -11074 12333 8916 3574
7675 3574 -8106 -24402 -14573 -6385 883 512 -12546 -8357 698 18828 45360 45483 29595 12795
7661 12795 -3010 -11151 8816 18204 2563 -4031 13717 21921 8735 5674 -4594 1943 5742
7648 5742 13247 8071 2772 -319 4376 29616 21974 7702 -2011 -426 35778 47528 43376 38363
7634C8363j0262J731j0964r28R545j7553J812J7099N889p101j6446q052p206L23
7620c750r901P601L4288j9966k4865R359K68J6228O18n936K508j10K6556J3511
7606D6409p949j1956O699M339j7109j7830K488r995J5928k6513M105n5j5803J0400
7592a6842K4175m334q682n285Q945j4233j385j088J019J598j309J876n562n741
7578b6848J8287R166L245j4080l342J1451N696k899R895R235R97j5455j4023j5715
7564b4390J0265K6295l827j4998k0685n970O314P624J012J932Q820k1274Q201
7551b0681J2341Q741j4618k963N492J1603J4655o326k857k0133j4587J5745K6217
7538A2629J0280j0911R80R189k0562j4066k4648J9074K9881j4496j5574j3815
$$ plain form
7634 38363 28101 29832 18868 17940 27485 9932 11744 28843 34732 27631 11185 3133 -4073 -3750
7620 -3750 -13651 -6050 28238 8272 -16593 -7234 -6966 9262 9880 3944 6452 6342 32898 46409
7606 46409 38460 26504 33203 37542 20433 2603 5091 -4904 11024 -15489 -11384 -11439 -27242 -16842
7592 -16842 7333 2999 -5683 -10968 -2023 -16256 -17641 -18729 -17710 -16112 -17421 -15545 -21107 -26848
7578 -26848 -8561 605 3850 -10230 -13572 -2121 3575 676 10571 19806 20803 5348 -8675 -24390
7564 -24390 -14125 12170 8343 -6655 -27340 -33310 -26996 -19372 -18360 -16428 -7608 -28882 -20681
7551 -20681 -8340 401 -14217 -17180 -11688 -85 14570 8244 5387 -14746 -29333 -13588 12629
7538 12629 22909 11998 12978 22167 1605 -12461 -37109 -18035 11846 -2650 -18224 -32039
7526c2039O121J3692K692j9408j1607L786O908J9424N514p892k223j554k1362
7513c7948J9834J3226P798o086q056j4934j345R48M671K896K0744J7016Q856m125
7499B3495k4668J425J9828K340l279k7895j2388p801J1632L5951j339j6310j4137
7486a3146J1387J2930k132p322j0884P932R101j3112j3959O85J3613j1106N433
7473a0580K1005l686l39p088k0039m790j123J3314l5j0910r684Q9M852J996O150
7458b0868J4054P917o334J0346L355q798j647J7888P06M881o416l045K296j5689
7444a354N471O163j1896Q908j5575j9047m162M863J8279k174j5492k1074J0719
7431c6371J4584j2038Q966K9408J9669M81l006N509j4966j684n14J5152R856P336
$$ plain form
7526 -32039 -25918 -12226 -9534 -28942 -40549 -36763 -29855 -10431 -4917 -12809 -15032 -16586 -37948
7513 -37948 -18114 -4888 2910 -3176 -11232 -26166 -27511 -26563 -21892 -18996 1748 18764 27620 23495
7499 23495 -1173 252 20080 22420 19141 -8754 -21142 -28943 -17311 18640 17301 991 -13146
7486 -13146 -1759 11171 9039 1717 -9167 -1235 7866 -5246 -19205 -18520 -4907 -16013 -10580
7473 -10580 10425 6739 6400 -688 -20727 -25517 -26640 -13326 -13361 -24271 -33955 -33866 -29014 -27018 -20868
7458 -20868 -6814 1103 -5231 5115 8470 -328 -1975 15913 16619 21500 15084 12039 14335 -1354
7444 -1354 4117 10280 -1616 7292 -8283 -27330 -31492 -26629 -8350 -10524 -26016 -47090 -36371
7431 -36371 -21787 -33825 -24859 4549 24218 24699 21693 27202 12236 10552 10038 25190 35046 42382
7417D2382Q523j5553j1485J1292L862j6940J956p303M586m943r591p319M401j217
7403B651r978j5902O911k6489P5J0945J0097N552L82P414J0508J2675J338n885
7389A0294m859L2591J0107k2915j6378r570j328q127o944K064Q558J2318k2064
7376a6253M570O299J1748L867o426P097k5902m064M421J0066K604L559J4923j4119
7362B390k8180j550m565J5088J2296P948L100r550k0798p833L166J2600J7695
7349A807P31R565j2209Q645K3661O012n792n914j3143j7679J6969m237j7569L0033
7335B0880J7834J9213m97l1794k3232l916l408j1954j0449K8950J8208J2171k0567
7322A1439k7789M110K787J0206q81j8605p058L02J7314J8688o538N406K115N196
$$ plain form
7417 42382 50905 35352 23867 35159 39021 22081 24037 16734 21320 16377 6786 -533 3868 2651
7403 2651 -7327 -23229 -16318 -42807 -42732 -31787 -21690 -16138 -15756 -8342 2166 14841 16179 10294
7389 10294 5435 38026 48133 25218 8840 -730 -2058 -10185 -17129 -15065 -6507 5811 -16253
7376 -16253 -11683 -5384 6364 10231 3805 10902 -15000 -19064 -14643 -4577 -1973 1586 16509 2390
7362 2390 -25790 -27340 -31905 -16817 -4521 3427 6527 -3023 -23821 -31654 -28488 -15888 1807
7349 1807 2538 12103 -106 8539 32200 38212 32420 26506 13363 -4316 12653 8416 -9153 20880
7335 20880 38714 57927 57430 25636 2404 -1512 -4920 -16874 -27323 1627 19835 32006 11439
7322 11439 -16350 -12240 -9453 753 -128 -18733 -25791 -25489 -8175 10513 3975 9381 11496 16692
7308A6692n810P199J279j8734j0775R615Q028k784k9N527l7022p435N1849J9371
7294C6971j5329j8272k0365o078o00k1488m714J6673l375L514j426r383j274J1369
7280c3777L757J0850K3978P976n244j7143j3275K4412j066j8746o076k698J1206
7267a5846J000m910K5670K3329r226j7180j5917Q056q155J7916p110k4289J6545
7254a0117K3923k31O695O366j0811m126n746m030J5197J0130n121J4897M158k2410
7240A8774j7060m332N808M399J0651j6496O361m32j4494q258q150J2779O49n324
7226a5125j5312J9793J4395n013j1738L733J6670j1669n83j0981J4535J2850j6632
7213e077j364n33N467J607L899L140j467p642j9601j0636Q114P834R341Q434j3615
$$ plain form
7308 16692 10882 18081 19360 626 -10149 -534 7494 4710 4681 10208 -26814 -34249 17600 36971
7294 36971 21642 3370 -16995 -23073 -23673 -45161 -49875 -33202 -36577 -33063 -34489 -43872 -45146 -33777
7280 -33777 -30020 -19170 4808 12784 7540 -9603 -22878 1534 468 -18278 -24354 -27052 -15846
7267 -15846 -14846 -19756 5914 29243 20017 2837 -13080 -5024 -13179 4737 -2373 -26662 -10117
7254 -10117 13806 13575 20270 26636 15825 11699 5953 1923 17120 27250 22129 37026 41184 18774
7240 18774 1714 -2618 3190 7589 18240 1744 8105 7673 -6821 -15079 -23229 -10450 -9801 -15125
7226 -15125 -30437 -10644 3751 -1262 -13000 -9267 7403 -4266 -4849 -15830 -1295 11555 -5077
7213 -5077 -6441 -6974 -1507 100 3999 7139 5672 -1970 -21571 -32207 -24093 -16259 -6918 1516 -12099
7198a2099K0980K656j8490m065J339J0012l375K87l350M209j1183P578K9123j3110
7184A0512k1341j2581N158L742j997p455o671q72K256K150r108l329L35J6638
7170b2563M152R996J4407J5814M424j1429l860r021j934N020j3054O299J1828
7157A0079j6693l024J938J3327R419r216k3758j3690q837K2391L419k2101M408
7144c2338J1381J3395j6183K489m152q336j1509r92J0604K9551l970j547Q4L062
7130h461n984n494N685L934K1950q917l0077j6669j9593J4729J6998J1333o548
7117b7114j1827l051R30J5330K5913j7642j314J4352N994r447J436R463K516m967
7103E72j296M682Q882n985r268j20N299J8619j1242k252p140J0245M935q490l4232
$$ plain form
7198 -12099 8881 11537 -6953 -11018 -9679 333 -3042 -2755 -6105 -1896 -13079 -5501 23622 10512
7184 10512 -10829 -23410 -18252 -14510 -16507 -23962 -30633 -31505 -29249 -27099 -36207 -39536 -39201 -22563
7170 -22563 -18411 -8415 5992 21806 26230 14801 10941 1920 -14 5006 -8048 -1749 10079
7157 10079 -6614 -9638 -7700 5627 15046 5830 -17928 -31618 -40455 -18064 -14645 -36746 -32338
7144 -32338 -20957 -7562 -23745 -21256 -25408 -33744 -45253 -46245 -35641 -6090 -10060 -11607 -11523 -8461
7130 -8461 -14445 -19939 -14254 -10320 11630 2713 -27364 -44033 -63626 -48897 -31899 -20566 -27114
7117 -27114 -38941 -41992 -41062 -25732 181 -17461 -18775 -4423 1571 -7876 -6440 3023 5539 572
7103 572 -724 3958 12840 6855 -2413 -2533 2766 21385 10143 7891 751 10996 15931 7441 -26791
7088b6791k1473J828J3362r28J5781K2524r700P78O180K13l150k527r262O69l218
7073a5714J399J7689l790q017l152K1336J3407J2824j4478k103R345o220j1708
7060A0818j7875L661J9744q835j3150r550O474M171p318J7245L6661J3281k7930
7047B7397j7142o029K837J2746O266q882q605K7159K5121M905j1252l7581k2911
7034e971j8398Q992K5248N253j6361j9495j321J434L2622K5434j4938l5814l583
7021a6898N789J9605n654j4679J1258K250j4855M820m161l765O0N852J0203J0208
7007A0033j9403k7397R31K6513M929P713N751q881k4250P850M428J7891J7147
6994B3255n033k0447O937J0204k0216R534J6590J7621q23J77j4190J066J2107
$$ plain form
7088 -26791 -48264 -46436 -33074 -34002 -18221 4303 -5397 -4619 1561 1774 -1376 -3903 -13165 -12496 -15714
7073 -15714 -14315 3374 -416 -8433 -11585 9751 23158 35982 21504 19401 28746 22526 10818
7060 10818 -7057 -3396 16348 7513 -5637 -15187 -8713 -4542 -11860 5385 42046 55327 27397
7047 27397 10255 4226 7063 19809 26075 17193 8588 35747 60868 65773 54521 16940 -5971
7034 -5971 -24369 -15377 9871 15124 -1237 -20732 -22053 -20619 12003 37437 22499 -13315 -16898
7021 -16898 -11109 8496 2842 -11837 -579 1671 -13184 -8364 -12525 -16290 -16230 -10378 -175 10033
7007 10033 -9370 -36767 -35836 -9323 -4394 3319 9070 189 -24061 -16211 -11783 6108 23255
6994 23255 18222 -2225 4712 14916 -5300 4234 20824 38445 37622 37799 23609 24675 36782
6981C6782j5292k850r605M719o344p578J7449N886r763j8298J442L704R787J2544
6967B2583j5779L907k154k974p424J088l488n446j0685j146R850K8495O607N130
6953B8564j2967j9583m952n219J2421n04j4259J2429J2892J5648p564j2895j8269
6940a4258j7368j152K1811M606O26q028l420O599j1651o218Q614J1182N880q677
6926a1454J4740Q044n271j595j6766Q83M91l810K1679K2478j7220r284K2408K2523
6912D7846k178j0437k5972j4317j5324M32J8062J3053p235P470n860p919J0777
6899H398J0889k2519j8372j745J5518J8080M395l320p769q292J3870J6193n541
6886A9785r837N464M437j3050k941L054k700j5663J0891R741J6292l362q272j5624
$$ plain form
6981 36782 21490 18640 9035 13754 7410 -168 17281 23167 13404 -4894 -3452 252 10039 22583
6967 22583 6804 10711 8557 5583 -1841 -753 -4241 -9687 -20372 -21518 -11668 16827 23434 28564
6953 28564 15597 -3986 -8938 -14157 -1736 -2240 -16499 -4070 8822 24470 16906 4011 -14258
6940 -14258 -31626 -32778 -10967 -6361 -5735 -13763 -17183 -10584 -22235 -28453 -19839 -8657 -2777 -11454
6926 -11454 3286 11330 6059 4464 -12302 -11419 -10928 -14738 6941 29419 12199 2915 25323 47846
6912 47846 45668 35231 9259 -5058 -20382 -19950 -1888 11165 3930 11400 5540 -2379 8398
6899 8398 19287 -3232 -21604 -23349 -7831 10249 14644 11324 3555 -4737 9133 25326 19785
6886 19785 9948 15412 19849 6799 3858 6912 4212 -11451 -560 9181 25473 22111 13839 -1785
6872a785k1144O775J1555J4944j4841m287O231Q778j1140K067P296K388j2607
6859e770j4537J4166j4359k6366j0295K4811P679J1292N2L983O425M286j0293
6846h926L582J2184J0323P592J0613k1732q788Q479K42n571m131O356m647J589
6832G165j001J8674R070o073j4001r039k568n224J3918O54j43R318p181r873O344
6817A0040j0006o926j2546J0071J1621J2136r245O25J4578p193j1966k3519m407
6804b6737K1897L369Q263J1594J6515p639p306k931R151l418m377j0246M281M228
6790A6644r213K944K778J1004K530m860n271k0507j5810j800N732J2976J1760
6777H907j2666P65O756m558r964n250K395J4563K542j0772j0172K0800J7375j5923
$$ plain form
6872 -1785 -22929 -16154 -4599 10345 -4496 -8783 -2552 6226 -4914 -2847 4449 6837 -5770
6859 -5770 -20307 -6141 -20500 -46866 -57161 -32350 -24671 -13379 -13327 -9344 -2919 1367 -8926
6846 -8926 -5344 6840 17163 24755 35368 13636 4848 13327 13569 7998 3867 10223 5576 7165
6832 7165 6164 24838 33908 27835 13834 4795 2227 -2997 10921 11575 11432 20750 13569 3696 10040
6817 10040 34 -6892 -19438 -9367 2254 14390 5145 5770 20348 13155 1189 -22330 -26737
6804 -26737 -4840 -1471 6792 18386 34901 27262 19956 17025 26176 22758 18381 8135 12416 16644
6790 16644 7431 10375 13153 24157 26687 21827 16556 -3951 -19761 -21561 -15829 -2853 8907
6777 8907 -3759 -2994 3762 -796 -10760 -16010 -13615 948 3490 -7282 -17454 3346 20721 4798
6763D798j2048k167j2584l221j5486J2025K3312K3866k017k0500J3749J2324k5230
6750c179k5600p301J1242N430J0316M923J2672m688m820J3683j21J1413o637j4965
6736B368j6147j2340J7221J0435J2904L002O868J968m1387j4772L629L248M241
6723a8762L160J3222J612J794O067j6025K5398j4259k3468q341p8O338K3097J5073
6709A4828k2919r309R557P926Q000Q51l073J9256J0940m858k5787j6947j1770
6696b3305j2694P42K582K0625K577k0369j9819L302N290K4248J2j0865r424K4075
6682a3023L1916N680P695j2894j4443j1387j5990l823q56k562J8360P347l709
6669g689O994M238j3625j3284J0941J1842j1932j2023l528K0616L206j0884p938
$$ plain form
6763 4798 -7250 -9417 -22001 -25222 -40708 -28683 -5371 18495 16478 -4022 9727 22051 -3179
6750 -3179 -28779 -36080 -24838 -19408 -9092 -4169 8503 3815 -1005 12678 12557 23970 17333 2368
6736 2368 -13779 -26119 -8898 1537 14441 17443 24311 26279 -15108 -29880 -26251 -23003 -18762
6723 -18762 -15602 -2380 -768 1026 7093 -8932 16466 2207 -21261 -29602 -29680 -23342 -245 14828
6709 14828 -8091 -17400 -7843 83 8083 8934 5861 25117 36057 31199 5412 -11535 -23305
6696 -23305 -35999 -35257 -32675 -12050 -9473 -29842 -49661 -46359 -41069 -16821 -16809 -27674 -37098 -13023
6682 -13023 18893 24573 32268 19374 4931 -6456 -22446 -26269 -27125 -29687 -11327 -3980 -7689
6669 -7689 -695 3543 -10082 -23366 -12425 -583 -12515 -24538 -28066 -7450 -4244 -15128 -23066
6656b3066q524k0774J1713J6082r715M314m215R86K564j394J1296O107J1611j2538
6642a5553q948R759l223j883M874J6721K183J5916L368j5834j0989J244P910R17
6628F462j254Q675P644n997j4503j3768K892j4500o49O039J3186P266J4877P837
6614B4207j2287j6952m253j0381j1598O193L0896K168k1785q585J7443J0938p66
6601E238J2478n76O030J2704J0301j6555m8960k0626P357J0077J5815K1774J6464
6588C1521j77j4599m013J2209o295p859r84J2119K78j2094N808K514j171R889
6574B7146j437j7645k3203J0939k018k478j1894j2643J4444P581N213R790M073
6561G868j3288J211j023K2929m553j4726k5704l866o195R468L3371K523r616q222
$$ plain form
6656 -23066 -31590 -52364 -40651 -24569 -34284 -29970 -34185 -33199 -30635 -32029 -20733 -14626 -3015 -15553
6642 -15553 -24501 -14742 -17965 -19848 -14974 1747 3930 19846 23214 7380 -3609 -2365 5545 6462
6628 6462 5208 13883 21527 15530 1027 -12741 -9849 -24349 -24998 -18959 -5773 1493 16370 24207
6614 24207 11920 -5032 -9285 -19666 -31264 -25071 5825 7993 -13792 -22377 -4934 6004 5238
6601 5238 17716 17140 23170 35874 46175 29620 -19340 -39966 -32609 -22532 -6717 15057 31521
6588 31521 31344 16745 12732 24941 18646 10787 9803 21922 22200 10106 15914 18428 17257 27146
6574 27146 25709 8064 -15139 -4200 -6218 -8696 -20590 -33233 -18789 -11208 -5995 3795 7868
6561 7868 -5420 -4209 -5232 17697 13144 -1582 -27286 -31152 -37347 -27879 5492 8015 -1601 -9823
6547i823P91k881n570J4037j108r350q207j9235P871J0368K2175n999l890k674
6533a3495k986l587k7662q042K4495J3197J6155K7684J3622j1944j4667J0150
6521B2920j1582R087p364j7636J5553N881n577j2318n053j1181o217Q92j2510
6508c5105O859J9210j371j081k2309j255N935J4772P564J1672K560j0186o418
6495i153Q98k398J8650K293j177m122j0908j0922P695n753j5014K16J2502K5048
6481G855o101j9369r848O066J7214j8548m771K6465o326j4241k403J507J3191
6468i309Q562q424R368m135P873K7034q39j6783L029J6139Q43k5742j1560o936
6454a0880J3350j6889k2769j0144J2622O930r214K479K1551J2792m328k339o149
$$ plain form
6547 -9823 -9032 -11913 -17483 -3446 -4554 -13904 -22111 -41346 -33475 -23107 -932 -6931 -10821 -13495
6533 -13495 -16481 -20068 -47730 -55772 -31277 -18080 -1925 25759 39381 27437 12770 22920
6521 22920 11338 20425 13061 -4575 10978 16859 11282 -1036 -6089 -17270 -23487 -22595 -35105
6508 -35105 -28246 -9036 -10407 -11488 -33797 -35052 -29117 -14345 -6781 4891 7451 -2735 -9153
6495 -9153 -8255 -10653 7997 10290 9113 4991 -5917 -16839 -9144 -14897 -29911 -29695 -17193 7855
6481 7855 1754 -17615 -27463 -21397 -4183 -22731 -27502 -1037 -7363 -21604 -24007 -22500 -9309
6468 -9309 -747 -9171 197 -3938 3935 30969 30130 13347 16376 32515 33358 7616 -3944 -10880
6454 -10880 2470 -14419 -37188 -47332 -34710 -27780 -36994 -34515 -12964 -172 -4500 -6839 -12988
6441a2988P215K655j7502p819k2792J591K1786N649q983o89K6283J1508J027p901
6427i60l984R560j046m575Q516J852J0357J704j7794J420L624L002N211K560N297
6412B4744M030j7403n741k7n004o369k654K504j1220K0375K594k2845l083J2170
6398g929l030j1209L603J6610j4002J6475O990m803n012N361J372m790j4223j3436
6384b8023O840L774k052l236J430N183J7213j6930k4250j0116J1456O294J7083
6371a5334K5181J1851K345j0936J1696k1940j0000j4211Q663P814p033j5333j6961
6358d4198j0702r165J4424J8437K521P878J1904j887N159r276r49Q101O274J4229
6344A2750N416r793j3666R77q812k851J5037p037j1506M941j3572M820J2636j4569
$$ plain form
6441 -12988 -5773 -3118 -20620 -28439 -51231 -49640 -27854 -22205 -31188 -31877 -5594 5914 6941 -960
6427 -960 -4944 4616 3570 -1005 7511 9363 19720 21424 3630 5050 8674 11676 16887 19447 24744
6412 24744 28774 11371 5630 5603 599 -5770 -8424 -5920 -17140 3235 5829 -17016 -20099 -7929
6398 -7929 -10959 -22168 -18565 -1955 -15957 518 7508 2705 -2307 3054 4426 -364 -14587 -28023
6384 -28023 -21183 -17409 -19461 -22697 -21267 -16084 1129 -15801 -40051 -50167 -38711 -32417 -15334
6371 -15334 9847 21698 24043 13107 24803 2863 -7137 -21348 -12685 -4871 -11904 -27237 -44198
6358 -44198 -54900 -64065 -49641 -31204 -28683 -20805 -8901 -10788 -5629 -14905 -15854 -7753 -1479 12750
6344 12750 18166 8373 -5293 -4316 -13128 -15979 -942 -7979 -19485 -14544 -28116 -23296 -10660 -25229
6330b5229K801K8981M918j9573M142Q672j2818J6065L0870k8135m094O33L613
6317A0846J628j613r969j0655J0045m066O607J5220J576m770O25j9954k2997L1407
6303C930L3507l000j3639l835k6837N422K0699j3094l4234J2733P652j0876O097
6290a5475K8793o821j8665p396l0324M81L3893J3026O782L089k0581l8367O762
6277d4803J9459J6613P66o362L843N20K2652J7347m222j9293j3474o940j6052
6264b9946j860O985O947M324l627j580O820N597K0179K913j7143P349k5222J0478
$$ plain form
6330 -25229 -22428 6553 11471 -8102 -3960 4712 -8106 7959 38829 10694 6600 7233 10846
6317 10846 12474 10861 892 -9763 282 -3784 2823 18043 19619 14849 15474 -4480 -27477 3930
6303 3930 37437 34437 20798 16963 -9874 -4452 16247 3153 -31081 -18348 -10696 -21572 -15475
6290 -15475 13318 6497 -12168 -19564 -49888 -49407 -15514 -2488 4294 7383 -13198 -51565 -44803
6277 -44803 -25344 -8731 -7965 -14327 -10484 -9964 12688 30035 25813 6520 -6954 -13894 -29946
6264 -29946 -31806 -24821 -17874 -13550 -17177 -18757 -11937 -6340 13839 16752 -391 6958 -18264 -7786
$$ [...]
##END NTUPLES=NMR SPECTRUM
##END=
