##TITLE=Analysis number 311373
Compound Code cc 41704
Book Reference 433/113/6
Project Code adrs
Chemist Name victoriam
##JCAMPDX= 6.0         $$ Bruker NMR JCAMP-DX V2.0
##DATA TYPE= NMR SPECTRUM
##DATA CLASS= NTUPLES
##ORIGIN= Bruker BioSpin GmbH
##OWNER= NMR
$$ XWIN-NMR		Version 3.5
$$ Thu Jul  7 12:21:14 2005 GMT Daylight Time (UT+1h)  MAYBRIDGE\NMR@NMR_250MHZ
##.OBSERVE FREQUENCY= 250.131544655141
##.OBSERVE NUCLEUS= ^1H
##.ACQUISITION MODE= SIMULTANEOUS (DQD)
##.ACQUISITION SCHEME= undefined
##.AVERAGES= 16
##.DIGITISER RES= 18
##SPECTROMETER/DATA SYSTEM= dpx250
##.PULSE SEQUENCE= zg30
##.SOLVENT NAME= CDCl3
##.SHIFT REFERENCE= (INTERNAL, CDCl3, 0, 16.522)
##AUDIT TRAIL= $$ (NUMBER, WHEN, WHO, WHERE, WHAT)
$$ ##TITLE= Audit trail, XWIN-NMR		Version 3.5
$$ ##JCAMPDX= 5.01
$$ ##ORIGIN= Bruker BioSpin GmbH
$$ ##OWNER= NMR
$$ C:\u/data/dgb/nmr/ADRS/5470/pdata/1/auditp.txt
$$ ##AUDIT TRAIL=  $$ (NUMBER, WHEN, WHO, WHERE, WHAT)
(   1,<2005-07-07 12:20:54.02 +100>,<MAYBRIDGE\NMR>,<NMR_250MHZ>,
      <created by zg, POWCHK disabled, PULCHK disabled
       configuration hash MD5:
       62 19 C7 07 E1 42 D1 B7 37 6C 3D D0 77 39 F9 E6
       data hash MD5: 64K
       AD 56 0A F1 73 D1 F3 AD 0C 55 DB 43 F0 28 29 47>)
(   2,<2005-07-07 12:21:04.99 +100>,<MAYBRIDGE\NMR>,<NMR_250MHZ>,
      <Start of raw data processing
       ef LB = 0.3 FT_mod = 6 PKNL = 1 SI = 32K 
       data hash MD5: 32K
       D1 43 47 0D 29 78 AA 26 C1 96 F9 24 4A 57 05 C5>)
(   3,<2005-07-07 12:21:06.94 +100>,<MAYBRIDGE\NMR>,<NMR_250MHZ>,
      <apk 
       data hash MD5: 32K
       FD 7C 36 C4 2D 5E 75 0D 35 1B 3F 7D 0D F9 80 2C>)
(   4,<2005-07-07 12:21:07.66 +100>,<MAYBRIDGE\NMR>,<NMR_250MHZ>,
      <abs ABSG = 5 
       data hash MD5: 32K
       C4 69 0B A5 CB 50 5F 06 98 CE 37 71 12 01 81 F0>)
$$ ##END=
$$ 
$$ hash MD5
$$ 29 C0 54 E8 BD A2 A1 CE FC 31 10 F1 7B 96 69 A1
##$RELAX= 
##$RELAX= 
##$RELAX= 
##$RELAX= 
##$RELAX= 
##$RELAX= 
##$RELAX= 
$$ Bruker specific parameters
$$ --------------------------
##$DU= <C:\u>
##$EXPNO= 5470
##$NAME= <ADRS>
##$PROCNO= 1
##$TYPE= <nmr>
##$USER= <dgb>
##$AMP= (0..31)
100 100 100 100 100 100 100 100 100 100 100 100 100 100 100 100 100 100 
100 100 100 100 100 100 100 100 100 100 100 100 100 100 
##$AQSEQ= 0
##$AQ_mod= 3
##$AUNM= <au_zg>
##$AUTOPOS= <24 >
##$BF1= 250.13
##$BF2= 250.13
##$BF3= 250.13
##$BF4= 250.13
##$BF5= 500.13
##$BF6= 500.13
##$BF7= 500.13
##$BF8= 500.13
##$BYTORDA= 1
##$CFDGTYP= 0
##$CFRGTYP= 5
##$CHEMSTR= <none>
##$CNST= (0..31)
1 1 145 1 1 1 1 1 1 1 1 1 1 1 1 1 1 1 1 1 1 1 1 1 1 1 1 1 1 1 1 1 
##$CPDPRG= <>
##$CPDPRG1= <>
##$CPDPRG2= <>
##$CPDPRG3= <>
##$CPDPRG4= <mlev>
##$CPDPRG5= <mlev>
##$CPDPRG6= <mlev>
##$CPDPRG7= <mlev>
##$CPDPRG8= <mlev>
##$CPDPRGB= <>
##$CPDPRGT= <>
##$D= (0..31)
0 1 0 0 0 0 0 0 0 0.06 0 0 0 0 0 0 0.0002 0 0 0 0 0 0 0 0 0 0 0 0 0 0 
0 
##$DATE= 1120735253
##$DBL= (0..7)
120 120 120 120 120 120 120 120 
##$DBP= (0..7)
150 150 150 150 150 150 150 150 
##$DBP07= 0
##$DBPNAM0= <>
##$DBPNAM1= <>
$$ [...]
##$SUBNAM7= <"">
##$SUBNAM8= <"">
##$SUBNAM9= <"">
##$SW= 20.6930455092707
##$SWIBOX= (0..15)
0 0 3 0 0 0 0 0 0 0 0 0 0 0 0 0 
##$SW_h= 5175.983436853
##$TD= 65536
##$TD0= 1
##$TE= 295.16
##$TE2= 300
##$TE3= 300
##$TEG= 300
##$TL= (0..7)
0 120 120 120 120 120 120 120 
##$TP= (0..7)
150 150 150 150 150 150 150 150 
##$TP07= 0
##$TPNAME0= <>
##$TPNAME1= <>
##$TPNAME2= <>
##$TPNAME3= <>
##$TPNAME4= <>
##$TPNAME5= <>
##$TPNAME6= <>
##$TPNAME7= <>
##$TPOAL= (0..7)
0.5 0.5 0.5 0.5 0.5 0.5 0.5 0.5 
##$TPOFFS= (0..7)
0 0 0 0 0 0 0 0 
##$TUNHIN= 0
##$TUNHOUT= 0
##$TUNXOUT= 0
##$USERA1= <user>
##$USERA2= <user>
##$USERA3= <user>
##$USERA4= <user>
##$USERA5= <user>
##$V9= 5
##$VALIST= <valist>
##$VCLIST= <CCCCCCCCCCCCCCC>
##$VD= 0
##$VDLIST= <DDDDDDDDDDDDDDD>
##$VPLIST= <PPPPPPPPPPPPPPP>
##$VTLIST= <TTTTTTTTTTTTTTT>
##$WBST= 1024
##$WBSW= 4
##$XGAIN= (0..3)
0 0 0 0 
##$XL= 0
##$YL= 0
##$YMAX_a= 495330
##$YMIN_a= -329168
##$ZGOPTNS= <>
##$ZL1= 120
##$ZL2= 120
##$ZL3= 120
##$ZL4= 120
##$ABSF1= 16.522
##$ABSF2= -4.171173
##$ABSG= 5
##$ABSL= 3
##$ALPHA= 0
##$AQORDER= 0
##$ASSFAC= 0
##$ASSFACI= 0
##$ASSFACX= 0
##$ASSWID= 0
##$AUNMP= <proc_1d>
##$AZFE= 0.1
##$AZFW= 0.1
##$BCFW= 0
##$BC_mod= 0
##$BYTORDP= 0
##$COROFFS= 0
##$CY= 12.5
##$DATMOD= 1
##$DC= 0
##$DFILT= <>
##$DTYPP= 0
##$F1P= 14.0000005364418
##$F2P= -0.99999901652339
##$FCOR= 0.5
##$FTSIZE= 32768
##$FT_mod= 6
##$GAMMA= 0
##$GB= 0
##$INTBC= 1
##$INTSCL= 1
##$ISEN= 128
##$LB= 0.3
##$LEV0= 0
##$LPBIN= 0
##$MAXI= 10000
##$MC2= 0
##$MEAN= 0
##$ME_mod= 0
##$MI= 0
##$NCOEF= 0
##$NC_proc= -4
##$NLEV= 6
##$NOISF1= 0
##$NOISF2= 0
##$NSP= 0
##$NTH_PI= 0
##$NZP= 0
##$OFFSET= 16.522
##$PC= 1
##$PHC0= -76.64515
##$PHC1= 8.359283
##$PH_mod= 1
##$PKNL= yes
##$PPARMOD= 0
##$PSCAL= 4
##$PSIGN= 0
##$REVERSE= no
##$SF= 250.13
##$SI= 32768
##$SIGF1= 0
##$SIGF2= 0
##$SINO= 400
##$SIOLD= 32768
##$SREGLST= <1H.CDCl3>
##$SSB= 0
##$STSI= 32768
##$STSR= 0
##$SW_p= 5175.98343685301
##$SYMM= 0
##$S_DEV= 0
##$TDeff= 65536
##$TDoff= 0
##$TI= <Analysis number 999999
Compound Code 99
Book Reference 9
Project Code 9>
##$TILT= no
##$TM1= 0
##$TM2= 0
##$TOPLEV= 0
##$USERP1= <user>
##$USERP2= <user>
##$USERP3= <user>
##$USERP4= <user>
##$USERP5= <user>
##$WDW= 1
##$XDIM= 32768
##$YMAX_p= 510031704
##$YMIN_p= -231094
$$ End of Bruker specific parameters
$$ ---------------------------------
##NTUPLES= NMR SPECTRUM
##VAR_NAME=  FREQUENCY,     SPECTRUM/REAL,   SPECTRUM/IMAG
##SYMBOL=    X,             R,               I
##VAR_TYPE=  INDEPENDENT,   DEPENDENT,       DEPENDENT
##VAR_FORM=  AFFN,          ASDF,            ASDF
##VAR_DIM=   32768,         32768,           32768
##UNITS=     HZ,            ARBITRARY UNITS, ARBITRARY UNITS
##FACTOR=    0.157963299565203, 1,           1
##FIRST=     4132.6476996994, 0,             0
##LAST=      -1043.33573715361, 0,           0
##MIN=       -1043.33573715361, -231094,     0
##MAX=       4132.6476996994, 510031704,     0
$$ Real data points
##PAGE= N=1
##DATA TABLE= (X++(R..R)), XYDATA
$$ [...]
$$ plain form
26499 1735 42191 36115 -18576 -85525 -82750 -72013 -79475 -72070 -54702 -59395 -24801 20207 -30762
26486 -30762 -59044 -40877 -87724 -66819 -58775 -66755 -28688 -26057 -13756 11729 12977 -29697
26474 -29697 -104062 -98334 -89478 -78041 -11562 35397 17622 34647 123750 74087 10367 -56698
26462 -56698 -67347 19345 42846 37239 -2849 -25860 -23836 -23889 -4287 27825 47789 38948 -53314
26449 -53314 -40496 -16313 -53838 -67210 -83076 -45347 -3789 10149 24114 4247 46834 64902
26437 64902 17526 -25183 9829 -31739 -54084 -12912 58046 114937 58215 18070 37976 84549
26425 84549 51434 8736 -49500 -42582 -25075 -91987 -118286 -69548 -45478 -39217 -81128 -66047
26413 -66047 -56943 -30954 2395 42901 59770 26699 16932 -23688 -13065 -54673 -32027 9534
$$ packed form
26499A735M0456o076n4691o6949K775J0737p462P405J7368m693L4594M5008n0969
26486c0762k8282J8167m6847K0905Q044p980L8067K631J2301K5485J248m2674
26474b9697p4365N728Q856J1437O6479M6959j7775J7025Q9103m9663o3720o7065
26462e6698j0649Q6692K3501n607m0088k3011K024n3J9602L2112J9964q841r2262
26449e3314J2818K4183l7525j3372j5866L7729M1558J3938J3965j9867M2587J8068
26437F4902m7376m2709L5012m1568k2345M1172P0958N6891n6722m0145J9906M6573
26425H4549l3115m2698n8236O918J7507o6912k6299M8738K4070O261m1911J5081
26413f6047R104K5989L3349M0506J6869l3071r767m0620J0623m1608K2646M1561
$$ plain form
26401 9534 -12233 -38607 -43821 -90105 -94772 -49104 33783 91743 39162 -18349 59927 62665
26389 62665 92137 122303 49092 74394 97469 48473 38012 96 -58509 -47829 26674 77420
26377 77420 55688 31053 23140 13445 -49375 -80202 -78363 -50891 -33196 -43664 -27835 -16168
26365 -16168 17948 27029 34172 -64587 -99087 -55164 -40090 18043 76936 67539 61737 -1044
26353 -1044 -27782 -26374 8913 12144 32984 -15729 -32479 3098 13024 -31794 -29619 -21288 -69743
26340 -69743 -104386 -76531 -29938 -42493 -19274 11396 39591 27810 75553 17102 -11331 -34263
26328 -34263 -14494 -65191 -139812 -105688 -54352 -4149 37816 6710 2690 -51984 -20209 33588
26316 33588 68917 79915 100092 52344 -3941 -5691 -18990 -24174 3815 20750 -15077 36048
$$ packed form
26401I534k1767k6374n214m6284m667M5668Q2887N7960n2581n7511P8276K738
26389F2665K9472L0166p3211K5302K3075m8996j0461l7916n8605J0680P4503N0746
26377G7420k1732k4635p913r695o2820l0827J839K7472J7695j0468J5829J1667
26365a6168L4116R081P143r8759l4500M3923J5074N8133N8893r397n802o2781
26353a044k6738J408L5287L231K0840m8713j6750L5577R926m4818K175Q331m8455
26340f9743l4643K7855M6593j2555K3219L0670K8195j1781M7743n8451k8433k2932
26328c4263J9769n0697p4621L4124N1336N0203M1965l1106m020n4674L1775N3797
26316C3588L5329J0998K0177m7748n6285j750j3299n184K7989J6935l5827N1125
$$ plain form
26304 36048 62345 36892 84511 39833 49882 59161 29171 -30999 -30280 -10168 -59626 -39701
26292 -39701 -31569 -43520 866 12265 -24965 -5389 -18919 -59432 -442 41703 36832 51660
26280 51660 79248 -8880 -2350 -8973 24983 42650 -32877 -69525 -56640 -43297 -78177 -4200
26268 -4200 56708 54681 11584 -934 84827 105721 63586 36980 15875 5801 17060 24678
26256 24678 39219 20795 -17780 -36941 -22861 31458 44551 99495 64480 -9258 -12793 -49677
26244 -49677 -70495 -11520 41285 79026 -29874 -77799 -87511 -99482 -39157 16136 22333 -28862
26232 -28862 -13611 34723 5239 61172 108837 76037 60045 79262 52485 34798 34382 22229
26220 22229 63069 91081 51040 33408 29329 -13682 -6490 -11637 -10429 -50541 -59634 -93564 -96735
$$ packed form
26304C6048K6297k5453M7619m4678J0049R279k9990o0170P19K0112m9458J9925
26292c9701Q132j1951M4386J1399l7230J9576j3530m0513N8990M2145m871J4828
26280E1660K7588q8128O530o623L3956J7667p5527l6648J2885J3343l4880P3977
26268d200O0908k027m3097j2518Q5761K0894m2135k6606k1105j0074J1259P618
26256B4678J4541j8424l8575j9161J4080N4319J3093N4944l5015p3738l535l6884
26244d9677k0818N8975N2805L7741j08900m7925r712j1971O0325N5293O197n1195
26232b8862J5251M8334k9484N5933M7665l2800j5992J9217k6777j7687m16j2153
26220B2229M0840K8012m0041j7632m079m3011P192n147J208m0112r093l3930l171
$$ plain form
26207 -96735 -61666 17143 -3801 -16343 15922 3396 3068 70311 58084 11597 -8805 -29109
26195 -29109 8509 27596 65709 80814 75186 37053 26780 26303 57097 41860 10493 18986
26183 18986 22244 -22579 11985 11202 -20420 -61084 -80588 -127618 -169096 -144773 -91373 -18154
26171 -18154 17084 41902 7872 20203 -16849 -34084 13077 30182 4921 3588 -5088 39395
26159 39395 -4215 -8632 45061 47426 31375 -7881 -26171 -94892 -115625 -53044 -40362 -8549
26147 -8549 13326 26107 5186 -75042 -117923 -113549 -100786 -76801 -67068 -92470 -55766 14194
26135 14194 38768 4022 -4452 34599 22315 3476 12111 94010 88184 -9903 29166 35904
26123 35904 -10089 -32634 -28138 49988 104488 42936 -54213 -62954 -277 -58020 -70148 -23054
$$ packed form
26207i6735L5069P8809k0944j2542L2265j2526l28O7243j2227m6487k0402k0304
26195b9109L7618J9087L8113J5105n628l8133j0273m77L0794j5237l1367Q493
26183A8986L258m4823L4564p83l1622m0664j9504m7030m1478K4323N3400P3219
26171a8154L5238K4818l4030J2331l7052j7235M7161J7105k5261j333q676M4483
26159C9395m3610m417N3693K365j6051l9256j8290o8721k0733O2581J2682L1813
26147h549K1875J2781k0921q0228m2881M374J2763K3985R733k5402L6704O9960
26135A4194K4574l4746q474L9051j2284j8839Q635Q1899n826r8087L9069O738
26123C5904m5993k2545M496P8126N4500o1552r7149q741O2677n7743j2128M7094
$$ plain form
26111 -23054 55999 38368 65190 26660 -27111 6050 36298 16928 17635 -30422 -29617 -718
26099 -718 -12441 -59680 -86225 -65031 -52119 9125 43205 14742 -47839 -118351 -120055 -74029
26087 -74029 -21197 10597 -8347 -22955 -9391 -37298 -24210 32899 -1118 -67533 -65306 -50895
26075 -50895 4674 29109 37206 29607 732 -20942 -25350 -327 18564 -57377 -24384 23231
26063 23231 28369 47504 52529 12689 34013 23173 53733 69141 21706 21173 23384 17673 -34559
26050 -34559 -26748 30157 33070 23799 -33695 -73267 -54570 -81887 -103623 -94277 -64024 -30707
26038 -30707 21743 -32550 -53288 -69435 -83001 -53986 -66111 -34880 14097 -28371 -55158 -32863
26026 -32863 -23481 -33867 -16473 -52460 -23357 -12394 -34048 -22053 -5653 -29735 -9000 -12969
$$ packed form
26111b3054P9053j7631K6822l8530n3771L3161L0248j9370P07m8057Q05K8899
26099g18j1723m7239k6545K1194J2912O1244L4080k8463o2581p0512j704M6026
26087g4029N2832L1794j8944j4608J3564k7907J3088N7109l4017o6415K227J4411
26075e0895N5569K4435Q097p599k8875k1674m408K5023J8891p5941L2993M7615
26063B3231N138J9135N025l9840K1324j0840L0560J5408m7435n33K211n711n2232
26050c4559P811N6905K913r271n7494l9572J8697k7317k1736R346L0253L3317
26038c0707N2450n4293k0738j6147j3566K9015j2125L1231M8977m2468k6787K2295
26026c2863R382j0386J7394l5987K9103J0963k1654J1995J6400k4082K0735l969
$$ plain form
26014 -12969 -79424 -98394 -93836 -107389 -49165 38628 59787 80409 96703 58228 63534 69061
26002 69061 57239 2948 -32464 -124154 -124742 -124091 -104980 -125487 -130238 -79194 -34067 -65781 -44121
25989 -44121 -107952 -136954 -119591 -89856 -58390 -42053 12093 45589 41922 10751 -43518 -59119
25977 -59119 -61630 -60728 -53212 -28179 -5070 1467 43169 4869 -5993 43026 59655 30479 -38399
25964 -38399 -101363 -146427 -123541 -161501 -134247 -41116 -9432 43667 7155 17294 70307 57308
25952 57308 63940 19554 -20910 -66193 -94207 -107430 -22850 58123 68135 98202 49921 58701
25940 58701 67062 69373 43609 25738 38316 240 15807 27495 90947 118781 41486 8285
25928 8285 -9167 -40783 -24206 3874 6550 -18651 -56372 -56256 -24967 36783 33138 -31786 -81836
$$ packed form
26014a2969o6455j8970M558j3553N8224Q7793K1159K0622J6294l8475N306N527
26002F9061j1822n4291l5412r1690n88O51J9111k0507m751N1044M5127l1714K1660
25989d4121o3831k9002J7363K9735L1466J6337N4146L3496l667l1171n4269j5601
25977e9119k511R02P516K5033K3109O537M1702l8300j0862M9019J6629k9176o8878
25964c8399o2964m5064K2886l7960K7254R3131L1684N3099l6512J0139N3013j2999
25952E7308O632m4386m0464m5283k8014j3223Q4580Q0973J0012L0067m8281Q780
25940E8701Q361K311k5764j7871J2578l8076J5567J1688O3452K7834p7295l3201
25928H285j7452l1616J6577K8080K676k5201l7721J16L1289O1750l645o4924n0050
$$ plain form
25915 -81836 -56750 -18877 38812 55633 99116 129822 121868 89576 55578 73983 65215 50348
25903 50348 17179 4646 4441 4315 -22086 32764 50118 44546 53190 61150 10189 -41023 10397
25890 10397 38582 -22475 -82659 -60410 -66691 -14036 -57954 -103724 -70291 -79895 -34531 -83055
25878 -83055 -97427 -68710 -40778 4799 -45979 -86727 -35134 5301 60092 60605 77855 62586
25866 62586 26547 25338 3497 -25553 -2733 42949 100441 40465 -50473 -128077 -88659 -53315
25854 -53315 -70576 -20271 -25744 -32807 -36680 -15619 -17751 4499 7876 -13950 -43763 -85092 -34643
25841 -34643 12495 31384 30988 70942 62266 59473 25122 -12126 -34966 -48170 -108909 -39529
25829 -39529 9866 -52047 -46792 -4179 -12792 -4231 -18116 -8703 -27765 -22669 3270 8341 -34957
$$ packed form
25915h1836K5086L7873N7689J6821M3483L0706p954l2292l3998J8405q768j4867
25903E0348l3169j2533k05j26k6401N4850J7354n572Q644P960n0961n1212N1420
25890A0397K8185o1057o0184K2249o281N2655m3918m5770L3433r604M5364m8524
25878h3055j4372K8717K7932M5577n0778m0748N1593M0435N4791N13J7250j5269
25866F2586l6039j209k1841k9050K2820M5682N7492n9976r0938p7604L9418L5344
25854e3315j7261N0305n473p063l873K1061k132K2250L377k1826k9813m1329N0449
25841c4643M7138J8889l96L9954q676k793l4351l7248k2840j3204o0739O9380
25829c9529M9395o1913N255M2613q613Q561j3885R413j9062N096K5939N071m3298
$$ plain form
25816 -34957 -25624 -5168 656 12607 -6095 -29888 -10703 -23430 -56913 -87039 -133732 -61835
25804 -61835 14470 -34757 -69326 -66231 6150 -25503 4333 24211 -49968 -56569 -941 -7571
25792 -7571 -24918 -73068 -51308 1318 24886 6023 10909 47682 79845 29406 34298 7673
25780 7673 13915 22545 29391 -1399 -20403 -90515 -70713 -63032 -44945 -92012 -124346 -124375 -44409
25767 -44409 7304 18579 -26456 -42969 -32090 -35893 -37841 -1703 23217 72190 76703 30122
25755 30122 -13711 16380 30390 971 -40233 -30235 10404 -14763 -19723 2114 43315 74487
25743 74487 81647 75428 -9796 -76761 -88859 -48759 -6989 -45179 -62411 -70430 -52503 683
25731 683 -18942 -5355 25841 42340 48636 112254 51799 8959 -28998 -44957 -62497 -100068
$$ packed form
25816c4957R333K0456N824J1951j8702k3793J9185j2727l3483l0126m6693P1897
25804f1835P6305m9227l4569L095P2381l1653K9836J9878p4179o601N5628o630
25792g571j7347m8150K1760N2626K3568j8863M886L6773L2163n0439M892k6625
25780G673O242Q630O846l0790j9004p0112J9802P681J8087m7067l2334k9P9966
25767d4409N1713J1275m5035j6513J0879l803j948L6138K4920M8973M513m6581
25755C0122m3833L0091J4010k9419m1204R998M0639k5167m960K1837M1201L1172
25743G4487P160o219q5224o6965j2098M0100M1770l8190j7232q019J7927N3186
25731F83j9625J3587L1196J6499O296O3618o0455m2840l7957j5959j7540l7571
$$ plain form
25719 -100068 -40163 19483 -847 3450 47686 108052 63189 31441 11453 23430 94846 80120
25707 80120 -8348 -51851 -32229 -16230 -39274 -46968 -63079 -73694 -75685 -36962 1675 -5052
25695 -5052 -18819 -16647 -4916 -10996 -34116 -91175 -78866 -66921 -147167 -127291 -73485 -29825
25683 -29825 -2159 50654 27718 66398 104618 101723 61825 42242 105187 112317 108797 60523
25671 60523 3764 -49217 -40881 -34001 -33049 -44357 6832 -17959 -21759 -34758 -24106 15543 -15660
25658 -15660 -28759 -28725 7778 6044 42169 -1941 -27590 -39737 -18829 -26729 7119 -1393 -14641
25645 -14641 -42950 -30404 30275 6457 566 13943 12782 -11903 -31857 -51168 -43751 -21438
25633 -21438 -32091 53 -59289 -96465 -56863 -61180 4154 74220 59562 -7933 -54498 -77609
$$ packed form
25719a00068N9905N9646k0330M297M4236O0366m4863l1748j9988J1977P1416j4726
25707H0120q8468m3503J9622J5999k3044p694j6111j0615j991L8723L8637o727
25695e052j3767K172J1731o080k3120n7059J2309J1945q0246J9876N3806M3660
25683b9825K7666N2813k2936L8680L8220k895l9898j9583O2945P130l520m8274
25671F0523n6759n2981Q336O880R52j1308N1189k4791l800j2999J0652L9649l1203
25658a5660j3099L4L6503j734L6125m4110k5649j2147K0908p900L3848q512j3248
25645a4641k8309J2546O0679k3818n891J3377j161k4685j9954j9311P417K2313
25633b1438j0653L2144n9342l7176L9602m317O5334P0066j4658o7495m6565k3111
$$ plain form
25621 -77609 -100347 -64169 -105007 -117774 -96121 -59562 -50764 -76603 -41602 -80790 -87480 -45618
25609 -45618 -26153 -43315 -76304 -81981 -45217 1596 16755 -22460 -60037 -35724 -8183 11916
25597 11916 26832 -43879 -77248 -50475 -56935 -45066 -58506 -55312 -53136 -21680 -66290 -85276
25585 -85276 -107635 -78477 -65553 -21274 2316 13299 -50693 -71478 8395 54878 61195 71743
25573 71743 71605 17866 -15812 -26458 -25065 -30531 15255 -5937 -27645 -15181 -38535 -52748
25561 -52748 -47316 9375 76526 62131 -25650 -25076 -814 -1229 -2099 -46386 -55479 -16561 -18847
25548 -18847 -45595 -73892 -80708 -73682 -46969 -37366 39576 31039 -35105 -91176 -101520 -67106
25536 -67106 -2086 49976 47053 -8819 -18462 7344 -3316 -6479 -33707 -38462 12188 95273
$$ packed form
25621g7609k2738L6178m0838j2767K1653L6559Q798k5839L5001l9188o690M1862
25609d5618J9465j7162l2989n677L6764M6813J5159l9215l7577K4313K7541K0099
25597A1916J4916p0711l3369K6773o460J1869j3440L194K176L1456m4610j8986
25585h5276k2359K9158J2924M4279K3590J0983o3992k0785P9873M6483O317J0548
25573G1743j38n3739l3678j0646J393n466M5786k1192k1708J2464k3354j4213
25561e2748N432N6691O7151j4395q7781N74K4262m15q70m4287r093L8918k286
25548a8847k6748k8297o816P026K6713R603P6942q537o6144n6071j0344L4414
25536f7106O5020N2062k923n5872r643K5806j0660l163k7228m755N0650Q3085
$$ plain form
25524 95273 82062 114333 82735 88322 52006 59147 52868 19122 6095 13293 62869 74262
25512 74262 12131 -21056 -10375 36492 31372 17927 -3029 -24189 -73735 -100617 -33490 -20979
25500 -20979 7146 44587 91688 92891 40180 5397 -51966 -89600 -37750 -29631 -33973 -52721
25488 -52721 -51492 -16875 522 52586 6229 -55439 -76775 -76777 -117506 -147372 -147242 -102108 -28795
25475 -28795 -41839 -10028 6824 33966 35288 35227 -4111 -14020 3908 5308 -1564 -30922 -487
25462 -487 29488 262 -39671 -50865 -98724 -98743 -66751 -62980 -25541 -9506 -44033 -57218 -47079
25449 -47079 -18443 -24440 13696 -19407 22185 -6293 -43703 -89131 -120242 -116975 -113282 -59689
25437 -59689 14372 33888 15857 33871 30951 -21021 -79544 -65603 -18559 43581 67454 37861
$$ packed form
25524I5273j3211L2271l1598N587l6316P141o279l3746j3027P198M9576J1393
25512G4262o2131l3187J0681M6867n120j3445k0956k1160m9546k6882O7127J2511
25500b0979K8125L7441M7101J203n2711l4783n7363l7634N1850Q119m342j8748
25488e2721J229L4617J7397N2064m6357o1668k1336km0729k9866J30M5134P3313
25475b8795j3044L1811J6852K7142J322o1l9338r909J7928J400o872k9358L0435
25462d87K9975k9226l9933j1194m7859j9L1992L771L7439J6035l4527j3185J0139
25449d7079K8636n997L8136l3103M1592k8478l7410m5428l1111L267L693N3593
25437e9689P4061J9516j8031J8014k920n1972n8523J3941M7044O2140K3873k9593
$$ plain form
25425 37861 -12871 -18910 5235 14352 7193 -27376 -1867 -26372 -58861 -78899 -32693 19477
25413 19477 37051 26471 33968 -629 -26445 8681 50406 -30499 -96893 -118425 -109140 -51212
25401 -51212 -27938 -24736 -15441 35960 45593 38569 -17508 9873 58173 51465 74267 50767 -10104
25388 -10104 5775 25152 50159 75510 71761 57513 20923 -18043 -41110 -46753 -92428 -106304
25376 -106304 -90820 -38273 12091 9497 -1169 17087 17420 16061 16389 21829 -20600 -8292 -27638
25363 -27638 -4100 2424 -42945 -6338 4995 23660 51865 20187 -25481 -71755 30149 61323
25351 61323 -36847 -56372 -52639 -54924 -94453 -64237 -77656 -141208 -163682 -109235 -57133 -38190
25339 -38190 -37979 -17989 28093 87935 161037 154837 84081 40706 -26693 -81307 22614 75414
$$ packed form
25425C7861n0732o039K4145R117p159l4569K5509k4505l2489k0038M6206N2170
25413A9477J7574j0580P497l4597k5816L5126M1725q0905o6394k1532R285N7928
25401e1212K3274L202R295N1401R633p024n6077K7381M8300o708K2802k3500o0871
25388a0104J5879J9377K5007K5351l749j4248l6590l8966k3067n643m5675j3876
25376a06304J5484N2547N0364k594j0666J8256L33j359L28N440m2429J2308j9346
25363b7638K3538O524m5369L6607J1333J8665K8205l1678m5668m6274J01904L1174
25351F1323r8170j9525L733k285l9529L0216j3419o3552k2474N4447N2102J8943
25339c8190K11J9990M6082N9842P3102o200p0756m3375o7399n4614J03921N2800
$$ plain form
25327 75414 31207 3240 32743 559 -58641 5331 40331 52983 73037 72016 40860 10374
25315 10374 28300 35050 64254 38695 69065 81956 2379 -34914 -52548 -53839 -38960 -37622
25303 -37622 -5963 -9469 -62518 -65562 -46483 -81283 -117139 -82210 -89461 -92761 -111789 -108840 -102219
25290 -102219 -34706 -23659 -5938 10295 -7419 -19839 -58427 -86714 -135694 -163380 -150129
25279 -150129 -90323 -37215 83348 113722 62650 -13002 -25081 9671 -15893 -69341 -48977
25268 -48977 -24529 -39641 -13580 32205 48405 49829 60324 54045 297 -22580 -50362 -13175
25256 -13175 20517 32460 38290 36402 59094 97054 102270 66920 50829 6697 -25378 -41266
25244 -41266 -42633 -45919 -39048 -10286 26197 -31655 -56001 -47805 -22322 21664 -13488 -740
$$ packed form
25327G5414m4207k7967K9503l2184n9200O3972L5000J2652K0054j021l1156l0486
25315A0374J7926O750K9204k5559L0370J2891p9577l7293j7634j291J4879J338
25303c7622L1659l506n3049l044J9079l4800l5856L4929p251l300j9028K949O621
25290a02219O7513J1047J7721J6233j7714j2420l8588k8287m8980k7686J3251
25279a50129N9806N3108J20563L0374n1072p5652j2079L4752k5564n3448K0364
25268d8977K4448j5112K6061M5785J6200J424J0495o279n3748k2877k7782L7187
25256a3175L3692J1943N830j888K2692L7960N216l5350j6091m4132l2075j5888
25244d1266j367l286O871K8762L6483n7852k4346Q196K5483M3986l5152J2748
$$ plain form
25232 -740 10588 25380 -21548 -23214 -39133 21628 -1162 -336 7918 -1422 40857 -7668 -70574
25219 -70574 -21996 -53046 -85917 -82996 -63066 -39207 -37440 -72695 -69586 -54500 -54090 12181 30137
25206 30137 73794 39096 27625 2700 8445 -38799 -40894 -38358 -19382 -29539 -39531 -10779
25194 -10779 -5981 -2156 -39361 -52734 -71524 -17122 -15839 -23530 10327 -10825 -24920 -57568
25182 -57568 -68577 -47722 -43063 -49782 -9432 33936 51243 35879 14413 15258 54133 47058 3744
25169 3744 -11456 -4703 28442 51038 58319 37983 46106 -14041 -79075 -113311 -125504 -97078
25157 -97078 -16429 -8378 -18768 -51777 -26380 14829 -1992 -59394 -95530 -41445 -1350 -11789
25145 -11789 -47369 -63150 -105191 -94412 -55111 -41619 -58239 -34502 -2720 -17878 -47888 -46185
$$ packed form
25232g40J1328J4792m6928j666j5919O0761k2790Q26Q254r340M2279m8525o2906
25219g0574M8578l1050l2871K921J9930K3859J767l5255L109J5086M10O6271J7956
25206C0137M3657l4698j1471k4925N745m7244k095K536J8976j0157r992K8752
25194a0779M798L825l7205j3373j8790N4402J283p691L3857k1152j4095l2648
25182e7568j1009K0855M659o719M0350M3368J7307j5364k1466Q45L8875p075m3314
25169C744j5200O753L3145K2596P281k0336Q123o0147o5034l4236j2193K8426
25157i7078Q0649Q051j0390l3009K5397M1209j6821n7402l6136N4085M0095j0439
25145a1789l5580j5781m2041J0779L9301J3492j6620K3737L1782j5158l0010J703
$$ plain form
25133 -46185 -46120 -63424 -81372 -69900 -47787 -17790 -37279 -66003 -70879 -51703 -21923 -10874
25121 -10874 20788 -2485 4050 44763 87194 90648 62829 -49837 -100467 -72789 -32402 -40970
25109 -40970 -55639 -15658 -33527 -44455 -50428 -30972 -40021 -30121 58047 61516 46448 -6633
25097 -6633 -107410 -137525 -54653 -26212 -44152 -4729 -2489 -51919 -101792 -20915 18968 -17663
25085 -17663 -27826 -38089 -44707 -24568 -37355 14707 65509 43862 -41383 -18478 26984 14247
25073 14247 13502 53852 56268 61095 20232 -59271 -79446 -90600 -3932 80704 135272 98900
25061 98900 48932 -9171 -40856 -71148 -69741 -74673 -24798 3550 48075 66443 14833 7268
25049 7268 36490 67395 66047 -13240 -61576 -10237 18663 37048 83591 88756 110945 89030
$$ packed form
25133d6185O5j7304j7948J1472K2113K9997j9489k8724m876J9176K9780J1049
25121a0874L1662k3273O535M0713M2431L454k7819j12666n0630K7678M0387q568
25109d0970j4669L9981j7869j0928n973J9456r049R900Q8168L469j5068n3081
25097f633j00777l0115Q2872K8441j7940L9423K240m9430m9873Q0877L9883l6631
25085a7663j0163j0263o618K0139j2787N2062N0802k1647q5245K2905M5462j2737
25073A4247p45M0350K416M827m0863p9503k0175j1154Q6668Q4636N4568l6372
25061I8900m9968n8103l1685l0292J407m932M9875K8348M4525J8368n1610p565
25049G268K9222L0905j348p9287m8336N1339K8900J8385M6543N165K2189k1915
$$ plain form
25037 89030 28528 -18259 -64421 -91812 -96575 -108637 -105449 -88702 -71413 -74502 -53481 -23578
25025 -23578 -48633 -66136 -74744 -77488 -69908 -67173 -6213 -20032 -27689 -29377 -746 41654 42460
25012 42460 33491 9007 -50086 -60055 -73695 -88131 -49897 -19646 -52584 -87945 -101324 -123124
25000 -123124 -168519 -125903 -48682 -82736 -89831 -62249 -14261 13810 8085 36655 23328 -18218
24988 -18218 -46297 -66684 -46871 -97904 -82311 7703 -3394 -8673 -25745 -37909 49012 80905
24976 80905 118917 67739 19234 -48823 -69279 -91662 -32951 -7997 -17304 -23175 -57404 -106909
24964 -106909 -115585 -66775 -64386 -50085 -5430 88668 61751 31499 -23156 -32043 -98500 -122387
24952 -122387 -109797 -24812 -3010 14294 -13469 -60006 -21898 50027 -16207 -25810 18766 54665
$$ packed form
25037H9030o0502m6787m6162k7391m763j2062L188J6747J7289l089K1021K9903
25025b3578k5055j7503q608k744P580K735O0960j3819p657j688K8631M2400Q06
25012D2460q969k4484n9093r969j3640j4436L8234L0251l2938l5361j3379k1800
25000a23124m5395M2616P7221l4054p095K7582M7988K8071n725K8570j3327m1546
24988a8218k8079k0387J9813n1033J5593R0014j1097n279j7072j2164Q6921L1893
24976H0905L8012n1178m8505o8057k0456k2383N8711K4954r307n871l4229m9505
24964a06909q676M8810K389J4301M4655R4098k6917l0252n4655q887o6457k3887
24952a22387J2590Q4985K1802J7304k7763m6537L8108P1925o6234r603M4576L5899
$$ plain form
24940 54665 48238 60350 17027 -54171 -73592 -79808 -42376 -11252 -2355 -32271 -93371 -77227
24928 -77227 -56722 -76760 -131222 -93457 -1452 -5712 7625 -60939 -72763 -36953 -19818 42689
24916 42689 76912 45624 52464 14650 32878 -35025 18549 71614 23724 -16081 -26958 -75966
24904 -75966 -74691 -36299 16665 -5473 -31106 -77035 -94372 -122639 -134163 -46390 19947 -4461
24892 -4461 -21392 -11936 14375 45410 57358 58611 42606 69879 21631 -28514 -39866 -43387
24880 -43387 -51451 -24101 55658 81668 65834 73244 63224 59773 107904 93770 11128 -20572
24868 -20572 -39514 -76425 -49484 680 41664 88660 114288 116580 65444 29202 8893 -32412
24856 -32412 -63781 -56162 9265 -11896 -29161 -56106 -79963 -16876 55682 30206 11168 11310
$$ packed form
24940E4665o427J2112m3323p1198j9421o216L7432L1124Q897k9916o1100J6144
24928g7227K0505k0038n4462L7765R2005m260J3337o8564j1824L5810J7135O2507
24916D2689L4223l1288O840l7814J8228o7903N3574N3065m7890l9805j0877m9008
24904g5966J275L8392N2964k2138k5633m5929j7337k8267j1524Q7773O6337k4408
24892d461j6931R456K6311L1035J1948J253j6005K7273m8248n0145j1352l521
24880d3387q064K7350P9759K6010j5834P410j0020l451M8131j4134q2642l1700
24868b0572j8942l6911K6941N0164M0984M6996K5628K292n1136l6242k0309m1305
24856c2412l1369P619O5427k1161j7265k6945k3857O3087P2558k5476j9038J42
$$ plain form
24844 11310 -42310 -2398 3495 44513 94175 88374 92205 73732 24378 38246 54948 17509
24832 17509 -12148 -59447 -81292 -83941 -87485 -52033 -341 5805 20349 2607 -1465 -39411
24820 -39411 -87682 -87571 -53710 -46698 -30386 -87 -101 21406 56510 59197 51460 23879 -18773
24807 -18773 23080 39623 22016 -35970 -18167 -6597 11867 21205 -42567 -76131 -111091 -109745
24795 -109745 -131652 -76169 -25985 -49093 -27330 -16862 -31797 -47923 -36257 -14080 -12134 -32181
24783 -32181 -10893 56178 48413 100229 83667 25849 8926 -35828 -36355 -53531 -67486 -40029
24771 -40029 -41616 -51006 -19819 34602 41783 38893 56157 41857 5235 4316 -14254 -71357 -61762
24758 -61762 -18038 14554 5754 46642 85983 13112 19362 31769 49821 32597 -31865 -61367
$$ packed form
24844A1310n3620L9912N893M1018M9662n801L831j8473m9354J3868J6702l7439
24832A7509k9657m7299k1845k649l544L5452N1692O146J4544j7742m072l7946
24820c9411m8271J11L3861P012J6312L0299j4K1507L5104K687p737k7581m2652
24807a8773M1853J6543j7607n7986J7803J1570J8464R338o3772l3564l4960J346
24795a09745k1907N5483N0184k3108K1763J0468j4935j6126J1666K2177J946k0047
24783c2181K1288O7071p765N1816j6562n7818j6923m4754n27j7176j3955K7457
24771d0029j587r390L1187N4421P181k890J7264j4300l6622r19j8570n7103R595
24758f1762M3724L2592q800M0888L9341p2871O250J2407J8052j7224o4462k9502
$$ plain form
24746 -61367 -10880 -10287 -17722 6019 41059 32625 58007 57186 13896 5427 62595 25658 150
24733 150 -18238 -126090 -90270 -34935 -26757 -75213 -82019 -43876 -30789 -48841 -46085 -35354
24721 -35354 -2006 62740 46762 -2111 -7475 -52624 -51236 -37914 -20131 33497 48076 24340
24709 24340 -20488 -7313 16550 26498 -7821 7069 18159 -18228 -28269 -21621 -52288 -107931
24697 -107931 -139903 -149455 -131021 -130594 -77813 -17922 15467 60953 73511 76319 27824 -37642
24685 -37642 -73318 -43683 -7182 -20235 -26746 5623 34014 56630 -16999 -89908 -104722 -60917
24673 -60917 -114070 -129851 -58397 -3619 -28957 -42951 -50502 -60229 -1586 -13566 -8873 27883
24661 27883 22363 28136 19976 37522 47778 5082 19440 -5441 18396 -17955 -66000 -23342
$$ packed form
24746f1367N0487N93p435K3741L5040q434K5382q21m3290q469N7168l6937k5508
24733A50j8388j07852L5820N5335Q178m8456o806L8143J3087j8052K756J0731
24721c5354L3348O4746j5978m8873n364m5149J388J3322J7783N3628J4579k3736
24709B4340m4828J3175K3863R948l4319J4890J1090l6387j0041O648l0667n5643
24697a07931l1972r552J8434M27N2781N9891L3389M5486J2558K808m8495o5466
24685c7642l5676K9635L6501j3053o511L2369K8391K2616p3629p2909j4814M3805
24673f0917n3153j5781P1454N4778k5338j3994p551r727N8643j1980M693L6756
24661B7883n520N773q160J7546J0256m2696J4358k4881K3837l6351m8045M2658
$$ plain form
24649 -23342 91447 82580 16357 1217 4033 -40868 -28002 -42488 -42162 -39079 -46283 -13343 -724
24636 -724 -38889 -15924 2534 -37960 -71292 -79560 -85903 -12684 46511 63667 55223 -2475 -49309
24623 -49309 -87952 -99958 -113749 -120204 -157871 -96486 -133726 -110980 -90075 -113833 -102621 -35661
24611 -35661 -10140 15042 52706 72366 118242 118273 88967 36160 19693 14662 61109 50411
24599 50411 11439 -9949 34256 32401 33427 41726 -13405 -39346 -7503 -73148 -88754 -110999
24587 -110999 -153812 -127456 -7899 4522 -29444 -59784 -48632 -43193 -28709 20506 25065 -16095
24575 -16095 -11766 -24259 -48171 -26958 6265 7780 37463 16100 23552 49036 42860 53956
24563 53956 34073 47175 39392 16850 -22241 -46466 -80035 -139283 -135390 -87168 -76909 -60926
$$ packed form
24649b3342J14789q867o6223j5140K816m4901J2866j4486L26L083p204L2940J2619
24636g24l8165K2965J8458m0494l3332q268o343P3219N9195J7156q444n7698m6834
24623d9309l8643j2006j3791o455l7667O1385l7240K2746K0905k3758J1212O6960
24611c5661K5521K5182L7664J9660M5876L1k9306n2807j6467n031M6447j0698
24599E0411l8972k1388M4205j855J026Q299n5131k5941L1843o5645j5606k2245
24587a10999m2813K6356J19557J2421l3966l0340J1152N439J4484M9215M559m1160
24575a6095M329j2493k3912K1213L3223J515K9683k1363P452K5484o176J1096
24563E3956j9883J3102p783k2542l9091k4225l3569n9248L893M8222J0259J5983
$$ plain form
24551 -60926 -61360 -11390 14472 -16077 -38121 -49398 -75573 -82552 -71851 -50383 -36826 -39165
24539 -39165 -49502 -72344 -66309 -83424 -48006 -35286 -62504 -119163 -103127 -37855 -70806 -36848
24527 -36848 10985 -9664 5059 43367 2536 -14962 26706 -6445 18937 36998 17046 66255
24515 66255 110388 62955 20535 -12259 -6407 -35767 -99042 -97613 -69181 8596 19904 3019
24503 3019 -18760 -73598 -51120 15488 -29706 -33982 -43557 -37745 -49457 -92148 -41606 27982
24491 27982 44597 83008 37796 63154 44005 10658 -17140 -40523 -111404 -105743 -29784 6146
24479 6146 6750 -16939 -104828 -96940 -76001 -62676 -23782 -60192 19235 30062 33485 49047 56923
24466 56923 38157 56223 42357 -3195 4196 30645 -2354 -68450 -73110 -50257 -391 43478
$$ packed form
24551f0926m34M9970K5862l0549k2044j1277k6175o979J0701K1468J3557k339
24539c9165j0337k2842O035j7115L5418J2720k7218n6659J6036O5272l2951L3958
24527c6848M7833k0649J4723L8308m0831j7498M1668l3151K5382J8061j9952M9209
24515F6255M4133m7433m2420l2794N852k9360o3275J429K8432P7777J1308j6885
24503C019k1779n4838K2478O6608m5194m276r575N812j1712m2691N0542O9588
24491B7982J6615L8411m5212K5358j9149l3347k7798k3383p0881N661P5959L5930
24479F146O04k3689q7889P888K0939J3325L8894l6410P9427J0827L423J5562P876
24466E6923j8766J8066j3866m5552P391K6449l2999o6096m660K2853M9866M3869
$$ plain form
24454 43478 48086 18803 -21243 -41814 -44666 -60132 -91644 -73259 -141731 -154995 -67443 2236
24442 2236 35164 32185 14942 -61392 -70172 -64528 -95036 -58127 -16150 -28203 -23548 -65449 -75781
24429 -75781 -31844 49799 43125 87233 81919 60421 33178 84483 56937 69812 79341 108527
24417 108527 40535 -34815 -52960 -53518 -18673 -44888 -33429 15133 -16532 -29526 6364 68361
24405 68361 72762 61355 78823 25953 27371 24124 21198 44665 21533 27602 84615 45100 3560
24392 3560 12180 34491 35646 24198 44357 70013 68515 80535 87891 95841 75580 33866 -31838
24379 -31838 -41030 -52481 -51577 10682 37887 70412 71363 99666 51647 -7090 -63461 -33239 -36670
24366 -36670 -70483 -38722 -15290 -11851 -74476 -75281 -52324 -22416 -29375 16527 40506 53385
$$ packed form
24454D3478M608k9283m0046k0571k852j5466l1512J8385o8472j3264Q7552O9679
24442B236L2928k979j7243p6334q780N644l0508L6909M1977j2053M655m1901j0332
24429g5781M3937Q1643o674M4108n314k1498k7243N1305k7546J2875R529K9186
24417A08527o7992p5350j8145n58L4845k6215J1459M8562l1665j2994L5890O1997
24405F8361M401j1407J7468n2870J418l247k926K3467k3132O069N7013l9515m1540
24392C560Q620K2311J155j1448K0159K5656j498J2020P356P950k0261m1714o5704
24379c1838r192j1451R04O2259K7205L2525R51K8303m8019n8737n6371L0222l431
24366c6670l3813L1761K3432L439o2625q05K2957K9908o959M5902K3979J2879
$$ plain form
24354 53385 -9750 -6348 14475 -5423 -37305 -85434 -53805 -19767 -12562 3044 32137 31946
24342 31946 -357 -19155 -57876 8019 70452 11494 26847 68815 28717 39219 41646 2618
24330 2618 -3599 40391 53384 18046 -75817 -46364 1632 33753 50937 34581 21904 24198
24318 24198 1878 -26210 -37504 -41327 -33500 -18271 -43115 -62872 -57936 -57503 -37040 -46035 -56678
24305 -56678 -86197 -54408 -65680 -18211 8601 -18731 52544 79946 73475 50763 26679 -29622
24293 -29622 -12102 -20836 -25524 17761 16204 -13995 -51819 -22476 12539 -33527 -34323 13010 14963
24280 14963 2239 -10275 -42052 -67632 -60602 8331 19311 11187 -1934 -7143 29770 64622
24268 64622 47506 -17196 -81538 -84654 -46831 -36463 -55909 -57940 -13589 -5182 -2615 -89543
$$ packed form
24354E3385o3135L402K0823j9898l1882m8129L1629L4038P205J5606K9093j91
24342C1946l2303j8798l8721O5895O2433n8958J5353M1968m0098J0502K427l9028
24330B618o217M3990J2993l5338r3863K9453M7996L2121J7184j6356j2677K294
24318B4198k2320k8088j1294l823P827J5229k4844j9757M936M33K0463q995j0643
24305e6678k9519L1789j1272M7469K6812k7332P1275K7402o471k2712k4084n6301
24293b9622J7520q734m688M3285j557l0199l7824K9343L5015m6066p96M7333J953
24280A4963j2724j2514l1777k5580P030O8933J0980q124j3121n209L6913L4852
24268F4622j7116o4702o4342l116L7823J0368j9446k031M4351Q407K567q6928
$$ plain form
24256 -89543 -95153 -15473 17652 -66743 -117930 -152792 -149842 -114647 -63797 -56475 -18231 -7680
24244 -7680 6454 -38928 -29119 -17405 -18962 -14894 -36344 -61634 -66335 -99777 -91069 -91104 -103778
24231 -103778 -73435 9539 95946 47754 -33357 -63506 -55084 -65107 -43086 -38672 13683 33309
24219 33309 -221 -6295 29807 66329 28313 -3472 -47394 -662 42147 13139 49176 70831
24207 70831 38210 39738 46470 66830 9066 -47153 -75886 -51480 -15191 13392 -26311 -75039
24195 -75039 -40740 -35652 -28573 -78492 -107042 -45738 23657 19328 19913 53690 67854 39506 25268
24182 25268 34093 20654 41960 40933 8322 21649 -13640 4313 29959 34796 4486 -41403
24170 -41403 9486 49890 -16398 -90632 -32113 34800 -17773 -10626 12389 24985 74530 131290
$$ packed form
24256h9543n610P9680L3125q4395n1187l4862K950L5195N0850P322L8244J0551
24244g680J4134m5382R809J1714j557M068k1450k5290m701l3442Q708l5j2674
24231a03778L0343Q2974Q6407m8192q1111l0149Q422j0023K2021M414N2355J9626
24219C3309l3530o074L6102L6522l8016l1785m3922M6732M2809k9008L6037K1655
24207G0831l2621J528O732K0360n7764n6219k8733K4406L6289K8583l9703m8728
24195g5039L4299N088P079m9919k8550O1304O9395m329N85L3777J4164k8348j4238
24182B5268Q825j3439K1306j027l2611J3327l5289J7953K5646M837l0310m5889
24170d1403N0889M0404o6288p4234N8519O6913n2573P147K3015J2596M9545N6760
$$ plain form
24158 131290 64077 27041 -704 12828 44471 34023 55222 40327 50137 60890 62664 111539
24146 111539 91492 2480 -74892 -116884 -109543 -110000 -69674 -20590 23078 70155 37051 13851
24134 13851 71886 83965 62587 22771 -65983 -85377 16503 66934 45217 28961 -24474
24123 -24474 -40873 48094 88877 57597 32457 61616 109864 79264 63603 -6222 -106762
24112 -106762 -116774 -51696 13739 33110 5101 54510 75173 53992 -2875 -5349 -69573 -71417
24100 -71417 -16683 13655 3535 -43277 -53173 16234 24190 19631 26015 2302 -28377 -58053
24088 -58053 -59247 26119 50838 50607 50839 22244 -52720 -117475 -112231 -11667 19561 48397 34458
24075 34458 49680 67373 78391 45053 -28227 22541 23143 -33035 11648 21295 28707 40434
$$ packed form
24158A31290o7213l7036k7745J3532L1643j0448K1199j4895R810J0753J774M8875
24146A11539k0047q9012p7372m1992P341m57M0326M9084M3668M7077l3104k3200
24134A3851N8035J2079k1378l9816q8754j9394J01880N0431k1717j6256n3435
24123b4474j6399Q8967M0783l1280k5140K9159M8248l0600j5661o9825j00540
24112a06762j0012O5078O5435J9371k8009M9409K0663k1181n6867k474o4224j844
24100g1417N4734L0338j0120m6812r896O9407P956m559O384k3713l0679k9676
24088e8053j194Q5366K4719k31K32k8595p4964o4755N244J00564L1228K8836j3939
24075C4458J5222J7693J1018l3338p3280N0768O02n6178M4683R647P412J1727
$$ plain form
24063 40434 60177 77466 121724 121300 62855 57696 68190 107676 95518 6243 -7678 -24898
24051 -24898 -68059 -46756 -14838 68694 92689 127526 82753 31379 -9288 -4627 73965 105721
24039 105721 44576 -4919 -12384 41306 23012 36536 19263 15933 25422 41705 13674 -8923
24027 -8923 -8944 34257 -3509 28767 29314 2796 -892 3456 8901 -51698 -59429 -52806 -63161 -47995
24013 -47995 6194 -58007 -50038 -43584 -61321 -74307 -38676 -6208 -24577 -12513 45583 83010
24001 83010 71069 6726 17904 -18493 -20813 -4482 43695 68250 58549 -49240 -24971 -3548
23989 -3548 19551 9357 -3747 -28164 23004 8694 -39107 -1263 12339 -2797 11927 -671
23977 -671 10346 50339 16097 1061 11929 7064 -7167 -26668 -4578 -10810 -128014 -143068
$$ packed form
24063D0434J9743J7289M4258m24n8445n159J0494L9486j2158q9275j3921j7220
24051b4898m3161K1303L1918Q3532K3995L4837m4773n1374m0667M661P8592L1756
24039A05721o1145m9495p465N3690j8294J3524j7273l330R489J6283k8031k2597
24027h923k1M3201l7766L2276N47k6518l688M348N445o0599p731O623j0355J5166
24013d7995N4189o4201P969O454j7737j2986L5631L2468j8369J2064N8096L7427
24001H3010j1941o4343J1178l6397k320J6331M8177K4555r701j07789K4269K1423
23989c548K3099j0194j3104k4417N1168j4310m7801L7844J3602j5136J4724j2598
23977f71J1017L9993l4242j5036J0868m865j4231j9501K2090o232j17204j5054
$$ plain form
23965 -143068 -85620 -1414 9615 -48994 -32458 -17945 -38913 -60453 -31138 -6800 16275
23954 16275 2608 -59415 -83394 -67662 -69324 -43091 -80368 -76777 -12635 23373 -12977 -86787
23942 -86787 -97403 -38604 6265 -47003 -76972 -55444 -57499 -38122 -12289 -41613 -82021 -83802
23930 -83802 -50602 -21961 39044 52163 45253 57742 58756 11352 2365 53472 80402 38529
23918 38529 -42347 -16028 32752 21974 -2381 -28161 -19509 21848 16799 49299 93825 54323
23906 54323 -14138 -74026 -45644 -13962 -23279 -35926 -53118 -49371 -17527 2496 14906 12320
23894 12320 -28820 -38399 -48771 -55415 -62562 -66175 -59938 -75954 -55774 5380 -51576 -26554 -6031
23881 -6031 -910 -13336 -14700 -24239 -25980 -52319 -43331 -44598 -25935 14295 27335 22608 73103
$$ packed form
23965a43068N7448Q4206J1029n8609J6536J4513k0968k1540K9315K4338K3075
23954A6275j3667o2023k3979J5732j662K6233l7277L591O4142L6008l6350p3810
23942h6787j0616N8799M4869n3268k9969K1528k055J9377K5833k9324m0408j781
23930h3802L3200K8641O1005J3119o910J2489J014m7404q987N1107K6930m1873
23918C8529q0876K6319M8780j0778k4355k5780Q652M1357n049L2500M4526l9502
23906E4323o8461n9888K8382L1682r317j2647j7192L747L1844K0023J2410k586
23894A2320m1140r579j0372o644p147l613O237j6016K0180O1154n6956K5022K0523
23881f031N121j2426j364r539j741k6339Q988j267J8663M0230J3040m727N0495
$$ plain form
23868 73103 88865 33343 -21191 -57219 -51369 28837 33694 -2700 -17741 -42654 -58480 -34926
23856 -34926 1995 8356 34659 41705 -20955 -37588 -6332 14814 41971 23516 2735 25018
23844 25018 15093 74958 69705 61347 24925 10478 27280 2604 63561 91379 24135 -36815
23832 -36815 -153 -6907 -12801 14457 42657 51309 -537 -13609 10238 25261 23240 -354
23820 -354 11426 18676 -35824 -72148 -44748 26505 19710 -8792 -50689 -32941 -30979 -70416 -114776
23807 -114776 -98199 -105364 -97931 -22110 43720 -4508 13250 30189 86461 148415 149937 57907
23795 57907 51748 47913 32406 39257 19915 7256 43136 30685 -20990 -85841 -52664 -75040
23783 -75040 -142235 -132450 -88725 -73652 -64522 -64790 -108444 -31733 -21758 -2154 49612 107998 121852
$$ packed form
23868G3103J5762n5522n4534l6028N850Q0206M857l6394j5041k4913j5826K3554
23856c4926L6921O361K6303P046o2660j6633L1256K1146K7157j8455k0781K2283
23844B5018r925N9865n253q358l6422j4447J6802k4676O0957K7818o7244o0950
23832c6815L6662o754n894K7258K8200Q652n1846j3072K3847J5023k021k3594
23820c54J1780P250n4500l6324K7400P1253o795k8502m1897J7748J962l9437m4360
23807a14776J6577p165P433P5821O5830m8228J7758J6939N6272O1954J522r2030
23795E7907o159l835j5507O851j9342j2659L5880j2451n1675o4851L3177k2376
23783g5040o7195R785M3725J5073R130k68m3654P6711R975J9604N1766N8386J3854
$$ plain form
23770 121852 76869 52786 44361 11262 32036 71472 94600 60063 33365 -2775 42336 49419
23758 49419 58174 33494 16984 -4636 -15462 30606 26829 6058 11209 17022 -8962 3227
23746 3227 -2222 31952 47042 -16308 -21105 7438 -53490 -100593 -82569 -33983 47032 50661
23734 50661 54375 26823 67152 126700 127118 53829 -16231 -858 -1394 -15230 17023 15746 35955
23721 35955 55300 38707 -21855 -74941 -84792 -67783 -67623 -37134 -8521 -76582 -55124 -31239
23709 -31239 -21219 -69433 -24772 19971 13095 -26116 -2846 1371 -37911 -62041 -754 82361
23697 82361 112241 84013 2710 -54633 -11485 -14253 -79552 -95028 -71152 -51136 920 22089
23685 22089 17226 21215 30250 -4088 -15284 -2871 17034 3355 -13149 -31696 27658 27676 -3361
$$ packed form
23770A21852m4983k4083q425l3099K0774L9436K3128l4537k6698l6140M5111P083
23758D9419Q755k4680j6510k1620j0826M6068l777k0771N151N813k5984J2189
23746C227n449L4174J5090o3350m797K8543o0928m7103J8024M8586Q1015L629
23734E0661L714k7552M0329N9548M18p3289p0060J5373n36j3836L2253j277K0209
23721C5955J9345j6593o0562n3086r851J7009J60L0489K8613o8061K1458K3885
23709c1239J0020m8214M4661M4743o876l9211K3270M217l9282k4130O1287Q3115
23697H2361K9880k8228q1303n7343M3148k768o5299j5476K3876K0016N2056K1169
23685B2089m863L989R035l4338j1196J2413J9905j3679j6504j8547N9354J8l1037
$$ plain form
23672 -3361 24073 61039 74137 11899 -23478 17314 51860 31567 -18516 -35365 -37447 -11051
23660 -11051 -14548 -72641 -45177 410 35456 62072 17655 21710 34106 38462 29805 -3168
23648 -3168 -43114 -37197 -31217 -25056 -84166 -78590 -89332 -46477 15964 32722 41146 6976 -40466
23635 -40466 -46588 -19038 -26292 -30413 -17780 -37686 -61649 -39377 -36988 -42302 -67569 -56643 13046
23622 13046 44896 -1354 -67974 -61828 -26417 -32496 -7883 27622 22643 5058 6590 15756 -16109
23609 -16109 -37695 8675 43168 38671 3180 -18673 24553 66879 8024 20665 -37780 -57107
23597 -57107 -21929 -12029 -20637 21136 34520 49064 34810 4163 -32954 -25673 -4262 12973
23585 12973 -21689 -5177 -21147 5781 89621 103288 78122 110992 49670 38708 -15455 -61846
$$ packed form
23672c361K7434L6966J3098o2238l5377M0792L4546k0293n0083j6849k082K6396
23660a1051l497n8093K7464M5587L5046K6616m4417M055J2396M356q657l2973
23648c168l9946N917N980O161n9110N576j0742M2855O2441J6758Q424l4170m7442
23635d0466o122K7550p254m121J2633j9906k3963K2272K389n314k5267J0926O9689
23622A3046L1850m6250o6620O146L5411o079K4613L5505m979j7585J532R166l1865
23609a6109k1586M6370L4493m497l5491k1853M3226M2326n8855J2641n8445j9327
23597e7107L5178R900q608M1773J3384J4544j4254l0647l7117P281K1411J7235
23585A2973l4662J6512j5970K6928Q3840J3667k5166L2870o1322j0962n4163m6391
$$ plain form
23573 -61846 -84875 -110916 -125317 -148804 -164082 -146623 -61505 -43002 13276 12595 21179 8792
23561 8792 8724 -1786 -53053 -74289 -15844 13836 -44600 -42413 -46743 -97040 -95246 -140451 -108225
23548 -108225 -78190 -23857 -2497 -67144 -119833 -132868 -105482 9527 28960 10686 -3667
23537 -3667 -8216 -9539 -21201 -24055 -49486 21447 70730 63049 80779 107235 116926 53611 29111
23524 29111 24092 48865 11706 7943 -5970 16064 36496 21212 -2938 -4818 29394 12877
23512 12877 -11695 2650 1308 13932 6675 -96905 -135572 -111027 -30417 -16698 -12113 -7623
23500 -7623 -23676 -7140 -38856 -46186 -15594 15927 -573 -42724 -18139 7294 -25119 -48284
23488 -48284 -23332 -21145 -9864 -14905 -33054 -57343 -39019 -20192 -46849 484 10794 -26136
$$ packed form
23573f1846k3029k6041j4401k3487j5278J7459Q5118J8503N6278o81Q584j2387
23561H792o8j0510n1267k1236N8445K9680n8436K187m330n0297J794m5205L2226
23548a08225L0035N4333K1360o4647n2689j3035K7386J15009J9433j8274j4353
23537c667m549j323j1662k854k5431P0933M9283p681J7730K6456R691o3315k4500
23524B9111n019K4773l7159l763j3913K2034K0432j5284k4150j880L4212j6517
23512A2877k4572J4345j342J2624p257j03580l8667K4545Q0610J3719M585M490
23500g623j6053J6536l1716p330L0592L1521j6500m2151K4585K5433l2413k3165
23488d8284K4952K187J1281n041j8149k4289J8324J8827k6657M7333J0310l6930
$$ plain form
23476 -26136 -21916 10420 -38630 -27321 -18588 27856 41065 9858 -26979 -32528 -17261 -4913
23464 -4913 -38973 -63237 -14539 -36301 3328 344 45959 85821 29527 47524 112385 117084
23452 117084 62724 51457 17387 -22374 20786 6743 -8451 -6340 -27923 -36994 -12609 -26926
23440 -26926 -29368 -6719 -12576 -52364 -48639 -83676 -74649 -18654 -26687 -77149 -123686 -64812 -36321
23427 -36321 -28362 -30074 -9966 -68527 -50152 -8873 25235 31125 50653 38119 20127 -18144
23415 -18144 -4303 65572 84426 123761 80617 44416 14243 20768 37825 22235 -14268 -63319
23403 -63319 -34905 20532 49303 -11610 -57679 -30342 -3132 82073 117439 98303 55863 -287
23391 -287 22723 55459 52849 22121 16463 84146 140117 136863 78509 -35612 2423 42705
$$ packed form
23476b6136M220L2336m9050J1309Q733M6444J3209l1207l6837n549J5267J2348
23464d913l4060k4264M8698k1762L9629k984M5615L9862n6294J7997O4861M699
23452A17084n4360j1267l4070l9761M3160j4043j5194K111k1583r071K4385j4317
23440b6926k442K2649n857l9788L725l5037R027N5995q033n0462m6537N8874K8491
23427c6321P959j712K0108n8561J8375M1279L4108N890J9528j2534j7992l8271
23415a8144J3841O9875J8854L9335m3144l6201l0173O525J7057j5590l6503m9051
23403f3319K8414N5437K8771o0913m6069K7337K7210Q5205L5366j9136m2440n6150
23391b87K3010L2736k610l0728n658O7683N5971l254n8354j14121L8035M0282
$$ plain form
23379 42705 41701 9936 5636 -6483 9079 -4810 -86263 -142235 -73790 -1053 69709 59538
23367 59538 35315 -14924 -11436 -35421 -49489 -17817 -14213 -25379 -4673 5864 1841 43865
23355 43865 65223 50066 70958 50037 18533 3089 8173 -53640 -40162 -5351 16242 -29883
23343 -29883 13448 47661 69254 109732 54276 -47827 -59538 -41749 3 -20406 -41508
23332 -41508 -16545 -25331 -22880 -6086 -31678 -11017 11883 45194 27004 -8545 -6111 51958
23320 51958 91929 66373 -27839 -85010 -94132 -83096 -53927 22237 4581 15950 32298 16272
23308 16272 -37397 -88699 -91512 -68913 -27546 8157 49967 82393 45651 -6460 -12628 71182
23296 71182 92980 59750 74832 60466 -594 5070 52261 55722 -41725 -53273 24324 40853
$$ packed form
23379D2705j004l1765m300j2119J5562j3889q1453n5972O8445P2737P0762j0171
23367E9538k4223n0239L488k3985j4068L1672L604j1166K0706J0537m023M2024
23355D3865K1358j5157K0892k0921l1504j5444N084o1813J3478L4811K1593m6125
23343b9883M3331L4213K1593M0478n5456j02103j1711J7789M1752k0409k1102
23332d1508K4963q786K451J6794k5592K0661K2900L3311j8190l5549K434N8069
23320E1958L9971k5556r4212n7171r122J1036K9169P6164j7656J1369J6348j6026
23308A6272n3669n1302k813K2599M1367L5703M1810L2426l6742n2111o168Q3810
23296G1182K1798l3230J5082j4366o1060N664M7191L461r7447j1548P7597J6529
$$ plain form
23284 40853 6826 1870 61411 30181 8902 71604 148125 109268 55855 53824 49385 31362
23272 31362 40140 30380 49761 44480 7641 15935 17999 16406 13383 -423 -58039 -76523 -38726
23259 -38726 7476 65897 91500 162094 103056 40165 31258 51666 107436 58438 3280 15171
23247 15171 -8497 -58143 -8943 55100 43502 38437 18092 -31777 9650 -2141 -13213 -27171
23235 -27171 13033 58716 92203 30164 -2949 37358 40085 1136 7783 37384 39683 -15889
23223 -15889 -28929 -4447 -33265 -64029 -61005 5474 33812 10944 13754 28037 88741 111393
23211 111393 63408 13289 -39978 -3964 59954 72156 85362 71510 97887 122888 62137
23200 62137 18090 76170 106749 117922 144424 127144 143175 132465 173495 164327 164416 158887 179842
$$ packed form
23284D0853l4027m956N9541l1230k1279O2702P6521l8857n3413k031m439j8023
23272C1362Q778r760J9381n281l6839Q294K064j593l023j3806n7616j8484L7797
23259c8726M6202N8421K5603P0594n9038o2891q907K0408N5770m8998n5158J1891
23247A5171k3668m9646M9200O4043j1598n065k0345m9869M1427j1791j1072j3958
23235b7171M0204M5683L3487o2039l3113M0307K727l8949O647K9601K299n5572
23223a5889j3040K4482k8818l0764L024O6479K8338k2868K810J4283O0704K2652
23211A11393m7985n0119n3267L6014O3918J2202J3206j3852K6377K5001o0751
23200F2137m4047N8080L0579J1173K6502j7280J6031j0710M1030r168Q9n529K0955
$$ plain form
23187 179842 284216 379140 443211 506285 556145 641663 823581 1067329 1272325 1450947
23177 1450947 1452208 1373885 1184427 1015644 795689 576516 435434 323229 245131 230641
23167 230641 272708 306115 264276 210597 187787 214899 158964 121702 144838 127960 165620
23156 165620 145106 88399 79001 46103 75137 121317 139871 133625 88451 60794 107763 142796
23144 142796 171401 173114 166246 127592 91252 50122 61772 44623 43398 90060 149589 194624
23132 194624 182023 129241 125205 81787 39713 -29937 -5800 19686 26664 17172 7677 3642
23120 3642 37486 77627 97066 152719 171995 126389 69134 48962 63159 41000 87082 120022
23108 120022 -2290 -45559 -80036 -85860 -82485 -13064 14134 10560 64001 48005 37489 -16508
$$ packed form
23187A79842J04374R4924O4071O3074M9860Q5518J81918K43748K04996J78622
23177A450947J261p8323j89458j68783k19955k19173j41082j12205p8098j4490
23167B30641M2067L3407m1839n3679k2810K7112n5935l7262K3136j6878L7660
23156A65620k0514n6707r398l2898K9034M6180J8554o246m5174k7657M6969L5033
23144A42796K8605J713o868l8654l6340m1130J1650j7149j225M6662N9529M5035
23132A94624j2601n2782m036m3418m2074o9650K4137K5486O978r492r495m035
23120C642L3844M0141J9439N5653J9276m5606n7255k0172J4197k2159M6082L2940
23108A20022j22312m3269l4477n824L375O9421K7198l574N3441j5996j0516n3997
$$ plain form
23096 -16508 51774 63283 4216 19350 17466 8373 46253 19938 17349 29960 -17215 27531
23084 27531 38683 45388 74953 58544 21485 -12726 10084 53543 62858 57036 32405 -61367
23072 -61367 -70669 -65528 -58706 -74686 -53317 6124 41572 16960 49133 28215 19547 32247
23060 32247 68538 43289 -6058 25311 77346 56796 73421 146110 102635 56402 68281 75112
23048 75112 -2183 -70 29765 42587 36263 41941 13184 -15129 -11607 2440 -43198 -35626 -16464
23035 -16464 44532 83133 92321 100184 115329 115209 28486 29876 -15165 -21460 29363 49593 50463
23022 50463 13652 8650 14424 -23763 -728 -57946 -17158 55954 63925 109911 94395 37464
23010 37464 35036 92803 91699 83742 83834 120822 82705 53482 49294 95783 105187 67219 54528
$$ packed form
23096a6508O8282J1509n9067J5134j884r093L7880k6315k589J2611m7175M4746
23084B7531J1152O705K9565j6409l7059l4211K2810M3459R315n822k4631r3772
23072f1367r302N141O822j5980K1369N9441L5448k4612L2173k0918q668J2700
23060C2247L6291k5249m9347L1369N2035k0550J6625P2689m3475m6233J1879O831
23048G5112p7295K113K9835J2822o324N678k8757k8313L522J4047m5638P572J9162
23035a6464O0996L8601R188P863J5145j20q6723J390m5041o295N0823K0230Q70
23022E0463l6811n002N774l8187K3035n7218M0788P3112P971M5986j5516n6931
23010C7464k428N7767j104p957R2L6988l8117k9223m188M6489R404l7968j2691
$$ plain form
22997 54528 75723 123612 135915 64673 85041 100035 57103 -7414 -8817 31728 51040 82153
22985 82153 147139 122605 75955 123459 170014 113861 86400 90010 101711 15179 -9884 -24443
22973 -24443 -6192 -38387 -23331 30561 53115 54008 138577 160098 128084 86624 72900 76510
22961 76510 121658 141206 170064 135105 109835 110914 164694 122767 64124 69147 27327 20095
22949 20095 58387 119076 176319 104380 99759 109569 87425 62466 13874 -37109 -38486 -51062
22937 -51062 3737 68074 67664 88536 62876 81413 87797 95565 104398 112971 112204 95210 61500
22924 61500 47956 9316 -6632 -40278 18234 97071 101647 93307 60945 75781 28225 6123
22912 6123 13664 14180 -1893 3899 31493 26205 71057 82626 42210 1748 -6385 -31987 27531
$$ packed form
22997E4528K1195M7889J2303p1242K0368J4994m2932o4517j403M0545J9312L1113
22985H2153O4986k4534m6650M7504M6555n6153k7461L610J1701q6532k5063j4559
22973b4443J8251l2195J5056N3892K2554Q93Q4569K1521l2014m1460j3724L610
22961G6510M5148J9548K8858l4959k5270J079N3780m1927n8643N023m1820p232
22949B0095L8292O0689N7243p1939m621R810k2144k4959m8592n0983j377j2576
22937e1062N4799O4337m10K0872k5660J8537O384P768Q833Q573p67j6994l3710
22924F1500j3544l8640j5948l3646N8512P8837M576q340l2362J4836m7556k2102
22912F123P541N16j6073N792K7594n288M4852J1569m0416m0462q133k5602N9518
$$ plain form
22899 27531 37300 47082 111511 56078 6927 43167 127792 147152 118878 108952 170376 155260
22887 155260 117946 156815 240923 369026 439969 382692 353456 338611 413863 460037 429110
22876 429110 378923 294570 287564 311324 262924 238263 186308 141667 103649 156030 192008 166740
22864 166740 121964 160482 220804 212491 206524 246786 227242 192971 170415 172332 116390 48066
22852 48066 42199 32657 50266 80274 94143 137500 148817 91286 50255 57891 84507 89021
22840 89021 134729 194859 194513 131348 54372 69763 50792 34693 70490 147041 151856 143434
22828 143434 176030 205872 211272 247395 212767 202784 183033 170108 227586 304333 303350 278044
22816 278044 229387 220388 292253 331326 306852 293157 297941 344100 345400 344003 295616 233855
$$ packed form
22899B7531R769R782O4429n5433m9151L6240Q4625J9360k8274r926O1424j5116
22887A55260l7314L8869Q4108J28103P0943n7277k9236j4845P5252M6174l0927
22876D29110n0187q4353p006K3760m8400k4661n1955m4641l8018N2381L5978k5268
22864A66740m4776L8518O0322q313n967M0262j9544l4271k2556J917n5942o8324
22852D8066n867r542J7609L0008J3869M3357J1317n7531m1031P636K6616M514
22840H9021M5708O0130l46o3165p6976J5391j8971j6099L5797P6551M815q422
22828A43434L2596K9842N400L6123l4628r983j9751j2925N7478P6747r83k5306
22816B78044m8657q999P1865L9073k4474j3695M784M6159J300j397m8387o1761
$$ plain form
22804 233855 225547 225270 198571 225706 244419 230604 248625 241613 246613 213027 186809 219203
22792 219203 250831 264528 259198 240932 269437 288351 312379 288007 285733 308888 409175 395002
22780 395002 275972 249347 233974 180025 132192 152209 178490 171133 194295 160310 138085
22769 138085 155093 144748 177362 227748 262410 263629 319586 326345 309367 324868 373784 378111
22757 378111 316210 329614 338838 312868 294210 367435 403769 410848 349762 295068 271127 233608
22745 233608 221186 239409 260364 230151 256878 273160 289322 335582 370698 394781 371890
22734 371890 294161 256248 319145 374724 333577 297008 304787 344241 424578 466703 450555 488889
22722 488889 524940 552187 551094 540132 595662 663079 741714 840080 884706 897411 922715 988694
$$ packed form
22804B33855q308k77k6699K7135J8713j3815J8021p012N000l3586k6218L2394
22792B19203L1628J3697n330j8266K8505J8914K4028k4372k274K3155J00287j4173
22780C95002j19030k6625j5373n3949m7833K0017K6281p357K3162l3985k2225
22769A38085J7008j0345L2614N0386L4662J219N5957O759j6978J5501M8916M327
22757C78111o1901J3404R224k5970j8658P3225L6334P079o1086n4694k3941l7519
22745B33608j2422J8223K0955l0213K6727J6282J6162M6260L5116K4083k2891
22734C71890p7729l7913O2897N5579m1147l6569P779L9454Q0337M2125j6148L8334
22722D88889L6051K7247j093j0962N5530O7417P8635R8366M4626J2705K5304O5979
$$ plain form
22710 988694 1098380 1248681 1357256 1463047 1556425 1745705 1992379 2177565 2340595 2426872
22700 2426872 2285079 2052219 1758702 1539727 1459279 1371596 1335193 1325022 1313433 1337460
22690 1337460 1369480 1469131 1543309 1582301 1571899 1579273 1586955 1579557 1666438 1819968 1884330 1865484
22678 1865484 1951001 2046623 2134049 2220221 2295349 2433982 2609940 2689317 2786907 2939342 3090358
22667 3090358 3274207 3485187 3734858 3998386 4324712 4655627 5003225 5334573 5639192
22658 5639192 6026465 6448590 6881018 7254040 7661199 8114068 8612789 9224616 9873246
22649 9873246 10578170 11329298 12136865 13061770 14158270 15397667 16834139 18424320 20269864
22640 20269864 22487451 25208316 28572857 32774314 37895292 43942539 51225343 60096024
$$ packed form
22710I88694J09686J50301J08575J05791R3378J89280K46674J85186J63030Q6277
22700B426872j41793k32860k93517k18975q0448q7683l6403j0171j1589K4027
22690A337460L2020R9651P4178L8992j0402P374P682p398Q6881J53530O4362j8846
22678A865484Q5517R5622Q7426Q6172P5128J38633J75958P9377R7590J52435J51016
22667C090358J83849K10980K49671K63528L26326L30915L47598L31348L04619
22658E639192L87273M22125M32428L73022M07159M52869M98721O11827O48630
22649I873246P04924P51128Q07567R24905J096500J239397J436472J590181J845544
22640B0269864K217587K720865L364541M201457N120978O047247P282804Q870681
$$ plain form
22632 60096024 71638727 87702842 110578939 141526168 179955388 222311732 260067640
22625 260067640 276659238 261544619 222731381 168839364 116786392 81766997 61605952
22618 61605952 49605169 41669174 35882381 31506017 28207837 25712667 23876363 22438907
22610 22438907 21281629 20389078 19645216 18928220 18246356 17523810 16848203 16271662 15832369
22601 15832369 15571962 15401206 15322714 15325281 15472813 15585622 15461162 15170166 14607488 13877329
22591 13877329 13075916 12280665 11495089 10810398 10179875 9564585 9105861 8566339 8019157
22582 8019157 7517668 7100326 6684128 6335346 5989106 5645806 5301597 4988973 4753851
22573 4753851 4564742 4321748 4142738 3924538 3761846 3657074 3530419 3382595 3219934
$$ packed form
22632F0096024J1542703J6064115K2876097L0947229L8429220M2356344L7755908
22625B60067640J6591598j5114619l8813238n3892017n2052972l5019395k0161045
22618F1605952j2000783p935995n786793m376364l298180k495170j836304j437456
22610B2438907j157278q92551p43862p16996o81864p22546o75607n76541m39293
22601A5832369k60407j70756p8492K567J47532J12809j24460k90996n62678p30159
22591A3877329q01413p95251p85576o84691o30523o15290m58724n39522n47182
22582H019157n01489m17342m16198l48782l46240l43300l44209l12624k35122
22573D753851j89109k42994j79010k18200j62692j04772j26655j47824j62661
$$ plain form
22564 3219934 3088447 2918339 2739103 2625245 2508679 2395078 2307341 2223736 2210532 2186875
22554 2186875 2093079 2066716 2098629 2108918 2214866 2426139 2589589 2598911 2429118 2213239
22544 2213239 1950205 1665084 1412259 1242068 1115944 1033768 971883 919298 888368 821003
22534 821003 754096 710041 669469 644373 625081 611695 611514 567283 527362 521301 579571 629305
22522 629305 557636 511657 464159 463094 519265 472383 418763 347530 274504 227051 279343 343513
22510 343513 343069 390595 407940 425158 452909 486227 500445 549278 562077 513825 519254 477235
22498 477235 411251 355176 346359 246684 240078 301719 306909 286845 211760 182116 132321 121031
22486 121031 119991 169465 202967 183540 184493 215747 273309 282874 215588 216100 151430 122442 133355
$$ packed form
22564C219934j31487j70108j79236j13858j16566j13601q7737q3605j3204k3657
22554B186875r3796k6363L1913J0289J05948K11273J63450R322j69793k15879
22544B213239k63034k85121k52825j70191j26124q2176o1885n2585l0930o7365
22534H21003o6907m4055m0572k5096j9292j3386j81m4231l9921o061N8270M9734
22522F29305p1669m5979m7498j065N6171m6882n3620p1233p3026m7453N2292O4170
22510C43513m44M7526J7345J7218K7751L3318J4218M8833J2799m8252N429m2019
22498D77235o5984n6075q817r9675o606O1641N190k0064p5085k9644m9795j1290
22486A21031j040M9474L3502j9427R53L1254N7562R565o7286N12o4670k8988J0913
$$ plain form
22473 133355 110745 117953 103093 59281 68717 55551 26379 9234 1802 26321 20417 39343
22461 39343 93547 87730 195092 223420 205438 222962 223127 214149 144976 131628 130804 165740 184027
22448 184027 207783 229541 174504 170822 154542 147702 149777 143822 94803 84978 49875 12329
22436 12329 4530 34779 92087 114273 157680 116295 35996 96492 124062 71585 102277 137067
22424 137067 121854 113280 145660 150044 201149 226689 208162 162138 128254 151495 147928 112127
22412 112127 30077 38391 91168 72240 50278 100581 99503 87692 76726 89720 46752 94302
22400 94302 108029 64104 22878 -1507 8720 82805 150158 159916 127717 25097 -34752 -5162
22388 -5162 4945 6623 -5554 -14483 25403 92157 115396 142272 83933 31812 32509 -24224 -23192
$$ packed form
22473A33355k2610P208j4860m3812R436j3166k9172j7145p432K4519n904J8926
22461C9343N4204n817J07362K8328j7982J7524J65q978o9173j3348q24L4936J8287
22448A84027K3756K1758n5037l682j6280o840K075n955m9019r825l5103l7546
22436A2329p799L0249N7308K2186M3407m1385q0299O0496K7570n2477L0692L4790
22424A37067j5213q574L2380M384N1105K5540j8527m6024l3884K3241l567l5801
22412A12127q2050Q314N2777j8928k1962N0303j078j1811j0966J2994m2968M7550
22400I4302J3727m3925m1226k4385J0227P4085O7353R758l2199j02620n9849K9590
22388e162J0107J678j2177q929L9886O6754K3239K6876n8339n2121O97n6733J032
$$ plain form
22375 -23192 23321 39699 24559 15043 15565 -2828 -32938 5071 -22923 45236 100050 157505
22363 157505 150380 113649 81966 42908 23683 9128 -59024 -81254 -70990 -46454 -20803 -42127
22351 -42127 -54333 -71984 -37880 -46240 -3947 80810 66863 9195 9781 35235 60242 62633
22339 62633 71663 89432 46138 1150 -17093 -6740 41925 22554 13464 -10759 -13523 42631
22327 42631 77737 52538 59367 116741 145167 73750 9126 42928 107066 123247 75431 50313
22315 50313 63285 94387 86703 91691 35018 -30822 -15986 35298 70726 66065 32328 39308
22303 39308 23288 53762 52188 23755 46899 105161 111077 109180 64623 45809 13093 29419
22291 29419 72071 69850 78655 90273 52640 66305 112095 90435 93580 114520 112825 107982 73891
$$ packed form
22375b3192M6513J6378j5140r516N22j8393l0110L8009k7994O8159N4814N7455
22363A57505p125l6731l1683l9058j9225j4555o8152k2230J0264K4536K5651k1324
22351d2127j2206j7651L4104q360M2293Q4757j3947n7668N86K5454K5007K391
22339F2633R030J7769m3294m4988j8243J0353M8665j9371r090k4223k764N6154
22327D2631L5106k5199O829N7374K8426p1417o4624L3802O4138J6181m7816k5118
22315E0313J2972L1102p684M988n6673o5840J4836N1284L5428m661l3737O980
22303C9308j6020L0474j574k8433K3144N8262N916j897m4557j8814l2716J6326
22291B9419M2652k221Q805J1618l7633J3665M5790k1660L145K0940j695m843l4091
$$ plain form
22278 73891 43497 98574 108171 82349 83693 62450 28289 21373 33855 88230 72362 58959
22266 58959 109004 60911 -6888 -20224 53834 47400 27184 17241 7851 3400 11077 8797 6177
22253 6177 -10040 -4180 -20844 -36752 67144 137642 87043 33885 8199 23409 17938 4066
22241 4066 -28102 -88814 -58879 -110417 -75803 -11434 33950 67977 71963 12720 -16511 -62384
22229 -62384 -62196 -79863 -29354 27281 57601 122076 121632 57067 18254 -4191 5666 -14084 -4254
22216 -4254 72556 57640 30516 88002 94997 74886 59611 44286 53060 85877 90218 105614
22204 105614 75206 -7854 -46422 -21162 17484 -4706 -3129 19269 8673 -30267 -4524 21248
22192 21248 33639 11318 40925 50518 58551 -1238 -1038 8306 -20089 6440 20814 -98315
$$ packed form
22278G3891l0394N5077R597k5822J344k1243l4161o916J2482N4375j5868j3403
22266E8959N0045m8093o7799j3336P4058o434k0216r943r390m451P677k280k620
22253F177j6217N860j6664j5908J03896P0498n0599n3158k5686J5210n471j3872
22241D066l2168o0712K9935n1538L4614O4369M5384L4027L986n9243k9231m5873
22229f2384J88j7667N0509N6635L0320O4475m44o4565l8813k2445R857j9750R830
22216d254P6810j4916k7124N7486O995k0111j5275j5325Q774L2817M341J5396
22204A05614l0408q3060l8568K5260L8646k2190J577K2398j0596l8940K5743K5772
22192B1248J2391k2321K9607R593Q033n9789K00R344k8395K6529J4374j19129
$$ plain form
22180 -98315 -109063 -91774 -53192 -42985 26094 25463 6482 66749 53693 43442 -10186 -44934
22168 -44934 -45552 -87763 -55059 -6178 24032 44635 105125 71470 62420 99273 80676 53565
22156 53565 62755 78498 70351 72963 69238 1084 -24019 -11719 -6194 4374 56635 134707 92012
22143 92012 96777 97518 82963 97516 76888 31772 -6883 -12992 32346 24935 -32886 -55265 -77616
22130 -77616 -75281 -22344 -10717 -16226 -33843 -29585 -4889 22038 6730 36265 30309 12764
22118 12764 -16894 22607 31922 74991 90664 76797 26188 -23748 -8008 17480 2300 5713
22106 5713 -5764 -4208 17143 -13108 -23745 -55433 -112418 -96762 -90911 -101433 -77629 -45880
22094 -45880 -25093 -54311 -82118 -16514 100093 157844 135463 81948 96774 106327 107353 133904
$$ packed form
22180i8315j0748J7289L8582J0207O9079o31j8981O0267j3056j0251n3628l4748
22168d4934o18m2211L2704M8881L0210K0603O0490l3655r050L6853j8597k7111
22156E3565R190J5743q147K612l725o8154k5103J2300N525J0568N2261P8072m2695
22143I2012M765P41j4555J4553k0628m5116l8655o109M5338p411n7821k2379k2351
22130g7616K335N2937J1627n509j7617M258K4696K6927j5308K9535n956j7545
22118A2764k9658L9501R315M3069J5673j3867n0609m9936J5740K5488j5180L413
22106E713j1477J556K1351l0251j0637l1688n6985J5656N851j0522K3804L1749
22094d5880K0787k9218k7807O5604J16607N7751k2381n3515J4826R553J026K6551
$$ plain form
22082 133904 149471 123852 116432 152498 169657 207256 301061 361595 365081 364493 389260 433242
22070 433242 506084 605089 738299 924826 1069015 1214426 1398504 1479532 1324922 1071510
22060 1071510 853217 653496 493607 326180 324393 311935 272955 266608 273250 262980 229759
22049 229759 267993 293582 221721 172044 108494 121593 163506 162529 121060 35644 64730 57716
22037 57716 75901 131736 112414 64902 131981 145158 174825 138660 118952 106476 71793 92480
22025 92480 80241 93553 49505 22731 96011 102585 66675 84905 74478 30756 8833 58446
22013 58446 28561 19750 22874 -3695 -24254 23922 88994 74711 82581 126236 125448 148805 122392
22000 122392 75383 69376 69288 101222 74944 105154 109224 61540 46118 32753 38343 55478 52030
$$ packed form
22082A33904J5567k5619p420L6066J7159L7599R3805O0534L486n88K4767M3982
22070D33242P2842R9005J33210J86527J44189J45411J84078Q1028j54610k53412
22060A071510k18293j99721j59889j67427j787j2458l8980o347O642j0270l3221
22049B29759L8234K5589p1861m9677o3550J3099M1913r77m1469q5416K9086p014
22037E7716J8185N5835j9322m7512O7079J3177K9667l6165j9708j2476l4683K0687
22025I2480j2239J3312m4048k6774P3280O574l5910J8230j0427m3722k1923M9613
22013E8446k9885q811L124k6569k0559M8176O5072j4283P870M3655p88K3357k6413
22000A22392m7009o007q8L1934k6278L0210M070m7684j5422j3365N590J7135l448
$$ plain form
21987 52030 44010 22086 26524 63680 101216 84565 15400 6190 24804 56243 52334 59521 39655
21974 39655 9264 26657 74428 40534 2162 1403 39327 41356 29943 52966 52970 -23643 -39162
21961 -39162 -1150 34331 19395 18456 16788 39956 35617 22454 33743 48100 62766 111828
21949 111828 108684 86379 92468 98845 56421 38097 109703 108404 82766 50884 60967 80138
21937 80138 107564 148414 236623 221052 187212 153162 179610 204662 283762 287770 178512 173494
21925 173494 261516 329425 404699 482457 565898 656534 790459 945914 1062198 1111698 1001705
21914 1001705 864668 719485 636042 526536 422119 377951 331808 317161 296132 255989
21904 255989 245390 241362 255692 267414 238506 188875 182142 192898 174468 144224 85607 61461
$$ packed form
21987E2030q020k1924M438L7156L7536j6651o9165r210J8614L1439l909P187j9866
21974C9655l0391J7393M7771l3894l8372p59L7924K029j1413K3023Mp6613j5519
21961c9162L8012L5481j4936r39j668K3168m339j3163J1289J4357J4666M9062
21949A11828l144k2305O089O377m2424j8324P1606j299k5638l1882J0083J9171
21937H0138K7426M0850Q8209j5571l3840l4050K6448K5052P9100M008j09258n018
21925A73494Q8022O7909P5274P7758Q3441R0636J33925J55455J16284M9500j09993
21914A001705j37037j45183q3443j09506j04417m4168m6143j4647k1029m0143
21904B55989j0599m028J4330J1722k8908m9631o733J0756j8430l0244n8617k4146
$$ plain form
21892 61461 27253 -2588 44681 61058 50511 85689 89158 102409 84779 80920 55931 118380
21880 118380 98731 58721 61215 9132 18501 17633 51501 71475 102401 100613 48521 -2669
21868 -2669 1313 60787 68887 74825 144573 156438 172548 171750 152809 153365 168738 141580 71261
21855 71261 -1445 -37173 -38399 42461 108948 103984 93423 111152 136507 81397 3731 30670
21843 30670 55933 90867 103066 57387 -9631 -1991 -24177 3379 41967 128051 103664 78290
21831 78290 129497 155519 84955 42263 99371 124745 116172 169966 178792 134581 106404 67271
21819 67271 47047 9342 -26395 -18848 -4678 23387 -25146 -47135 -29151 46017 85897 17901
21807 17901 34082 67160 105892 98034 92688 69794 92856 84013 70535 47328 27879 7147
$$ packed form
21892F1461l4208k9841M7269J6377j0547L5178L469J3251j7630l859k4989O2449
21880A18380j9649m0010K494n2083R369q68L3868J9974L0926j788n2092n1190
21868b669L982N9474Q100N938O9748J1865J6110p98j8941N56J5373k7158p0319
21855G1261p2706l5728j226Q0860O6487m964j0561J7729K5355n5110p7666K6939
21843C0670K5263L4934J2199m5679o7018P640k2186K7556L8588Q6084k4387k5374
21831G8290N1207K6022p0564m2692N7108K5374q573N3794Q826m4211k8177l9133
21819F7271k0224l7705l5737P547J4170K8065m8533k1989J7984P5168L9880o7996
21807A7901J6181L3078L8732p858n346k2894K3062q843j3478k3207j9449k0732
$$ plain form
21795 7147 -4376 -29009 -863 8950 -14470 52430 115518 116486 54150 77164 82966 65879 32499
21782 32499 55014 68554 90408 103800 85757 91846 70899 37490 91902 145461 141138 96804
21770 96804 81779 -2539 53991 143021 99446 65061 113957 80749 89546 69557 49608 69129
21758 69129 66679 86710 91975 80891 66737 107911 109865 69273 12866 -14224 69821 124929
21746 124929 64601 53651 20929 -37673 -25769 -48807 -46244 -23046 -23997 -50592 36203 75079
21734 75079 94759 92564 137810 110299 79647 64626 105756 113988 131509 95987 39344 81314
21722 81314 164753 154851 142127 109098 32009 45258 96891 90678 123344 121591 99046 63332
21710 63332 44807 44806 42166 39593 26134 44601 42234 71513 125999 103260 83670 83954 122856
$$ packed form
21795G147j1523k4633K8146R813k3420O6900O3088R68o2336K3014N802j7087l3380
21782C2499K2515J3540K1854J3392j8043O089k0947l3409N4412N3559m323m4334
21770I6804j5025q4318N6530Q9030m3575l4385M8896l3208Q797j9989j9949J9521
21758F9129k450K0031N265j1084j4154M1174J954m0592n6407k7090Q4045N5108
21746A24929o0328j0950l2722n8602J1904k3038K563K3198r51k6595Q6795L8876
21734G5079J9680k195M5246k7511l0652j5021M1130Q232J7521l5522n6643M1970
21722H1314Q3439r902j2724l3029p7089J3249N1633o213L2666j753k2545l5714
21710F3332j8525jk640k573j3459J8467k367K9279N4486k2739j9590K84L8902
$$ plain form
21697 122856 135886 116129 141985 107573 102074 75275 100798 121907 168787 180793 101181 72781
21685 72781 79188 83469 49112 20589 67757 90274 129935 118986 110520 77621 97226 77204
21673 77204 67469 61064 52649 56809 -9760 65605 92949 78397 98403 98530 72287 40299 12579
21660 12579 44197 78212 90331 99000 121981 134838 111804 131396 69791 77584 53884 64190
21648 64190 63191 69154 32304 -15164 4734 8238 47103 56656 30090 89786 138385 148828 124161
21635 124161 125056 62316 32197 46117 92291 57842 -35511 -25570 -110 32838 55279 33161
21623 33161 -7462 -32883 -7495 13490 -22945 -20634 59450 45058 50944 92312 101690 80995
21611 80995 102391 67862 62813 98732 74959 44563 55850 86130 125337 92989 65502 40767
$$ packed form
21697A22856J3030j9757K5856l4412n499k6799K5523K1109M6880J2006p9612k8400
21685G2781O407M281l4357k8523M7168K2517L9661j0949q466l2899J9605k0022
21673G7204r735o405q415M160o6569P5365K7344j4552K0006J27k6243l1988k7720
21660A2579L1618L4015J2119Q669K2981J2857k3034J9592o1605P793k3700J0306
21648F4190r99N963l6850m7468J9898L504L8865R553k6566N9696M8599J0443k4667
21635A24161Q95o2740l0119J3920M6174l4449r3353R941K5460L2948K2441k2118
21623C3161m0623k5421K5388K0985l6435K311Q0084j4392N886M1368R378k0695
21611H0995K1396l4529n049L5919k3773l0396J1287L0280L9207l2348k7487k4735
$$ plain form
21599 40767 78516 136437 197254 212934 195827 141983 160846 147372 163186 92211 63192 45788
21587 45788 23044 54946 109172 141410 86665 -4833 -31585 32871 19353 -33224 -31352 -38896
21575 -38896 18690 83922 115947 131453 205796 131586 99890 146039 107815 33140 20213 39848
21563 39848 36357 78718 96085 83682 86968 105200 98795 74219 91445 98137 136021 147059
21551 147059 101432 94507 155704 174371 193584 183242 166200 125456 80891 69281 100709 92566
21539 92566 146340 158878 196220 210740 274685 253851 250303 285562 325872 274667 213659 163058
21527 163058 215254 281362 289219 334788 307220 318324 318750 315119 318962 280851 246985 266432
21515 266432 241976 227509 256075 281719 295287 254789 207161 216137 214502 203182 176680 167109
$$ packed form
21599D0767L7749N7921O0817J5680j7107n3844J8863j3474J5814p0975k9019j7404
21587D5788k2744L1902N4226L2238n4745r1498k6752O4456j3518n2577J872p544
21575c8896N7586O5232L2025J5506P4343p4210l1696M6149l8224p4675j2927J9635
21563C9848l491M2361J7367j2403L286J8232o405k4576J7226O692L7884J1038
21551A47059m5627o925O1197J8667J9213j0342j7042m0744m4565j1610L1428q143
21539I2566N3774J2538L7342J4520O3945k0834l548L5259M0310n1205o1008n0601
21527A63058N2196O6108P857M5569k7568J1104M26l631L843l8111l3866J9447
21515B66432k4456j4467K8566K5644J3568m0498m7628Q976j635j1320k6502r571
$$ plain form
21503 167109 158517 161953 174906 160295 190240 190404 138614 189277 251040 345047 336021 236016
21491 236016 133412 73165 50151 42064 96563 168789 191512 215687 187871 195299 227025 291916
21479 291916 318616 275449 238956 220747 261394 320781 315079 346896 422839 404349 350866 304025
21467 304025 329924 404239 462795 427995 365293 333571 359338 392564 415031 462165 500407
21456 500407 494548 488143 542312 605728 679169 716378 725464 802739 942081 1117389 1348320
21445 1348320 1560416 1758575 1801847 1695947 1563889 1366139 1125060 982103 923982 911615
21435 911615 843839 802352 808210 919795 987481 1039140 1166168 1309156 1476499 1668065 1835574
21424 1835574 1937445 1929241 1785653 1539618 1274299 1090104 932185 805964 738220 651485
$$ packed form
21503A67109q592L436J2953j4611K9945J64n1790N0663O1763R4007r026j00005
21491B36016j02604o0247k3014q087N4499P2226K2723K4175k7816P428L1726O4891
21479B91916K6700m3167l6493j8209M0647N9387n702L1817P5943j8490n3483m6841
21467C04025K5899P4315N8556l4800o2702l1722K5767L3226K2467M7134L8242
21456E00407n859o405N4169O3416P3441L7209R086P7275J39342J75308K30931
21445A348320K12096J98159M3272j05900j32058j97750k41079j42957n8121j2367
21435I11615o7776m1487N858J11585O7686N1659J27028J42988J67343J91566J67509
21424A835574J01871q204j43588k46035k65319j84195j57919j26221o7744q6735
$$ plain form
21414 651485 629856 653391 625823 581858 673785 716908 669607 660870 676095 686526 691774 716748
21402 716748 708889 740650 768983 817953 845448 864896 890859 962020 1037972 1073818 1060488 1028104
21390 1028104 1049438 961167 860663 812419 782798 775341 758316 744679 732562 745276 697044
21379 697044 621599 567549 614670 667358 672724 673790 665835 663790 688634 695656 632253 664537
21367 664537 754757 763638 798579 929741 947216 974867 962423 993264 1029673 1022472 1022312 1033595
21355 1033595 1039745 1117823 1183858 1194824 1221184 1220829 1263014 1293903 1303677 1288958 1350737 1409731
21343 1409731 1383891 1376971 1445752 1504965 1604099 1633656 1658736 1692826 1747104 1819347 1861014
21332 1861014 1890128 1968498 2114456 2247830 2360422 2404658 2439299 2555421 2686430 2841003
$$ packed form
21414F51485k1629K3535k7568m3965R1927M3123m7301q737J5225J0431N248K4974
21402G16748p859L1761K8333M8970K7495J9448K5963P1161P5952L5846j3330l2384
21390A028104K1334q8271j00504m8244k9621p457j7025j3637j2117J2714m8232
21379F97044p5445n4050M7121N2688N366J066p955k045K4844P022o3403L2284
21367F64537R0220Q881L4941J31162J7475K7651j2444L0841L6409p201j60J1283
21355A033595O150P8078O6035J0966K6360l55M2185L0889R774j4719O1779N8994
21343A409731k5840o920O8781N9213R9134K9557K5080L4090N4278P2243M1667
21332A861014K9114P8370J45958J33374J12592M4236L4641J16122J31009J54573
$$ plain form
21322 2841003 2990340 3202160 3384604 3589672 3880653 4106639 4401479 4663800 4887499
21313 4887499 4990847 5146398 5353001 5574778 5878744 6199692 6626465 7107689 7566362
21304 7566362 8104159 8743658 9410034 10070902 10665329 11215666 11647493 12040359 12394081
21295 12394081 12810073 13347166 14070081 14979023 16034607 17208005 18568010 20091674 21822714
21286 21822714 23898614 26329136 29247641 32754366 36957040 41948538 47837581 54880391
21278 54880391 63412518 74012322 87307581 103923885 123973251 146482754 168857260
21271 168857260 187050957 195829260 190960927 172301190 145154842 117058979 93240862
21264 93240862 75109370 61837096 52099528 44779276 39285875 35016675 31602501 28824691
$$ packed form
21322B841003J49337K11820J82444K05068K90981K25986K94840K62321K23699
21313D887499J03348J55551K06603K21777L03966L20948M26773M81224M58673
21304G566362N37797O39499O66376O60868N94427N50337M31827L92866L53722
21295A2394081M15992N37093P22915R08942J055584J173398J360005J523664J731040
21286B1822714K075900K430522K918505L506725M202674M991498N889043P042810
21278E4880391Q532127J0599804J3295259J6616304K0049366K2509503K2374506
21271A68857260J8193697Q778303m868333j8659737k7146348k8095863k3818117
21264I3240862j8131492j3272274r737568p320252n493401m269200l414174k777810
$$ plain form
21256 28824691 26659081 24869911 23312080 21993622 20939458 20072426 19350333 18680869
21248 18680869 18125933 17768212 17523562 17403207 17440932 17526208 17597907 17602613 17417818 16962247
21238 16962247 16254444 15435413 14565585 13651828 12854274 12109281 11399518 10763026 10175810
21229 10175810 9735577 9307801 8925395 8611743 8308118 7999913 7628062 7311081 6938195
21220 6938195 6418696 5985219 5630165 5269991 4975522 4772257 4568585 4344925 4144423
21211 4144423 3990603 3828137 3652371 3475862 3387422 3261158 3113129 2970329 2849095 2757075
21201 2757075 2635489 2503403 2339125 2203619 2096839 1978806 1996395 2025419 1929906 1779162
21191 1779162 1634240 1505143 1464027 1467564 1434323 1370249 1342424 1281392 1208307 1164300 1163177
$$ packed form
21256B8824691k165610j789170j557831j318458j054164q67032p22093o69464
21248A8680869n54936l57721k44650j20355L7725Q5276P1699M706j84795m55571
21238A6962247p07803q19031q69828r13757p97554p44993p09763o36492n87216
21229A0175810m40233m27776l82406l13652l03625l08205l71851l16981l72886
21220F938195n19499m33477l55054l60174k94469k03265k03672k23660k00502
21211D144423j53820j62466j75766j76509q8440j26264j48029j42800j21234r2020
21201B757075j21586j32086j64278j35506j06780j18033J7589K9024r5513j50744
21191A779162j44922j29097m1116L537l3241o4074k7825o1032p3085m4007j123
$$ plain form
21180 1163177 1171535 1118894 1023350 993671 996992 961873 910867 878948 812998 759080 702173 729473
21168 729473 752589 711495 688765 708900 637844 554276 540257 574915 631024 670674 640271
21157 640271 628362 581895 504944 480905 549581 549843 548019 595457 656527 683027 738185 664426
21145 664426 584630 637559 638777 614571 605168 611376 572763 576084 512058 467607 470009 507449
21133 507449 528249 483931 504870 538491 539433 600651 632373 636558 642935 685421 734421 784449
21121 784449 870213 915280 922408 927550 877334 909648 926886 867557 720393 635239 602251 584765
21109 584765 556031 509941 461007 454944 419355 411321 421441 465432 445729 390120 413832 380723
21097 380723 373965 355937 449220 474136 447927 443911 413156 397348 375440 377575 369764 324289
$$ packed form
21180A163177Q358n2641r5544k9679L321l5119n1006l1919o5950n3918n6907K7300
21168G29473K3116m1094k2730K0135p1056q3568j4019L4658N6109L9650l0403
21157F40271j1909m6467p6951k4039O8676K62j824M7438O1070K6500N5158p3759
21145F64426p9796N2929J218k4206r403O208l8613L321o4026m4451K402L7440
21133E07449K0800m4318K0939L3621R42O1218L1722M185O377M2486M9000N0028
21121G84449Q5764M5067P128N142n0216L2314J7238n9329j47164q5154l2988j7486
21109E84765k8734m6090m8934o063l5589q034J0120M3991j9703n5609K3712l3109
21097C80723o758j8028R3283K4916k6209m016l0755j5808k1908K135p811m5475
$$ plain form
21085 324289 323854 270297 257609 332180 345880 376138 374931 343212 309119 346613 361545 378373
21073 378373 440571 413152 365338 358302 365643 382647 410786 444999 439274 479153 527107 500335
21061 500335 534184 572236 586679 623582 708860 787066 797500 715989 692672 617583 595945
21050 595945 632672 638274 659297 578127 557063 549719 544606 573783 603665 594979 596251 613424
21038 613424 625504 633336 608605 558383 545835 563153 541429 579121 622406 573956 591190 623100
21026 623100 593522 640550 768677 814443 817354 741059 671421 631077 535336 421703 380673
21015 380673 373298 403926 402817 470654 509976 456652 445168 485955 502538 474080 484966 501997
21003 501997 512685 510602 532392 531311 538338 585467 636621 663339 647402 667250 653451 638516
$$ packed form
21085C24289m35n3557j2688P4571J3700L0258j207l1719l4093L7494J4932J6828
21073C78373O2198k7419m7814p036P341J7004K8139L4213n725L9879M7954k6772
21061E00335L3849L8052J4443L6903Q5278P8206J0434q1511k3317p5089k1638
21050E95945L6727N602K1023q1170k1064p344n113K9177K9882q686J272J7173
21038F13424J2080P832k4731n0222j2548J7318k1724L7692M3285m8450J7234L1910
21026F23100k9578M7028J28127M5766K911p6295o9638m0344r5741j13633m1030
21015C80673p375L0628j109O7837L9322n3324j1484M0787J6583k8458J0886J7031
21003E01997J0688k083K1790j081P027M7129N1154K6718j5937J9848j3799j4935
$$ plain form
20991 638516 729448 798707 837896 797060 734923 626199 508441 368037 389740 444154 497279
20980 497279 611158 658663 696113 706906 625658 649362 701138 690810 692863 729108 743039
20969 743039 806678 855136 833457 831764 854866 886281 912950 981915 1036812 1053284 1101699 1165948
20957 1165948 1220433 1255252 1361996 1435522 1408484 1419820 1471373 1569895 1631812 1716017 1796114
20946 1796114 1805928 1859569 1942109 1967346 1983168 1994514 1999383 2069857 2119253 2164506 2235223 2321919
20934 2321919 2388322 2387807 2439843 2536392 2642503 2716216 2797407 2890469 3024854 3124144 3200061
20923 3200061 3343385 3539910 3637471 3766802 3942758 4152757 4367426 4523812 4696157 4964142
20913 4964142 5217319 5565770 5922680 6241337 6616757 6994436 7394545 7826792 8299942
$$ packed form
20991F38516R0932O9259L9189m0836o2137j08724j17758j40404K1703N4414N3125
20980D97279J13879M7505L7450J0793q1248K3704N1776j0328K053L6245J3931
20969G43039O3639M8458k1679j693K3102L1415K6669O8965N4897J6472M8415O4249
20957A165948N4485L4819J06744P3526k7038J1336N1553R8522O1917Q4205Q0097
20946A796114R814N3641Q2540K5237J5822J1346M869P0474M9396M5253P0717Q6696
20934B321919O6403n15N2036R6549J06111P3713Q1191R3062J34385R9290P5917
20923C200061J43324J96525R7561J29331J75956K09999K14669J56386J72345K67985
20913D964142K53177L48451L56910L18657L75420L77679M00109M32247M73150
$$ plain form
20904 8299942 8886195 9569938 10293875 11160153 12147250 13179035 14323075 15469770 16404171
20895 16404171 17202151 17805435 18463149 19355538 20523532 21911266 23487784 25262401 27068590
20886 27068590 28816628 30622438 32734013 35107722 37533754 40072715 43112286 46977350
20878 46977350 51846561 57986911 65618836 74885827 86048455 99465901 115539764 135412712
20870 135412712 161789732 198670860 249754130 314925433 388680193 460041363 510031704
20863 510031704 508093128 438259668 330478246 234558169 170888384 132024323 107565802
20856 107565802 90903466 78679303 69443032 62444915 57129450 52991029 49460575 46214200
20848 46214200 43475229 41408084 39914483 38877720 38207570 37663642 37037114 36274683 35347031
$$ packed form
20904H299942N86253O83743P23937Q66278R87097J031785J144040J146695R34401
20895A6404171P97980O03284O57714Q92389J167994J387734J576518J774617J806189
20886B7068590J748038J805810K111575K373709K426032K538961L039571L865064
20878D6977350M869211O140350P631925R266991J1162628J3417446J6073863J9872948
20870A35412712K6377020L6881128N1083270O5171303P3754760P1361170M9990341
20863E10031704j938576o9833460j07781422r5920077o3669785l8864061k4458521
20856A07565802j6662336j2224163r236271o998117n315465m138421l530454l246375
20848D6214200k738971k067145j493601j036763o70150n43928o26528p62431r27652
$$ plain form
20839 35347031 34525219 33870926 33525109 33409175 33435437 33416698 33024228 32155147 30934554
20830 30934554 29427605 27526137 25553227 23730707 22089528 20660909 19373461 18240555
20822 18240555 17246473 16320396 15519833 14786030 14037734 13277757 12539122 11830075 11198684
20813 11198684 10637040 10159324 9669779 9165586 8648483 8164885 7807835 7524486 7226159
20804 7226159 6880479 6508598 6129194 5825629 5548822 5313866 5033257 4711305 4489481
20795 4489481 4271214 4027962 3849335 3676223 3471778 3312666 3108594 2967415 2817513
20786 2817513 2764850 2724131 2551252 2410579 2337640 2278678 2212438 2121610 1989006 1941788 1854224
20775 1854224 1768877 1719419 1665640 1588939 1487513 1427691 1397865 1378264 1314797 1248458 1193977
$$ packed form
20839C5347031q21812o54293l45817j15934K6262j8739l92470q69081j220593
20830C0934554j506949j901468j972910j822520j641179j428619j287448j132906
20822A8240555r94082r26077q00563p33803p48296p59977p38635p09047o31391
20813A1198684n61644m77716m89545n04193n17103m83598l57050k83349k98327
20804G226159l45680l71881l79404l03565k76807k34956k80609l21952k21824
20795D489481k18267k43252j78627j73112k04445j59112k04072j41179j49902
20786B817513n2663m0719j72879j40673p2939n8962o6240r0828j32604m7218q7564
20775A854224q5347m9458n3779p6701j01426n9822k9826j9601o3467o6339n4481
$$ plain form
20764 1193977 1132195 1076933 1005225 998735 948944 877240 894431 900950 852920 799053 780356 757278
20752 757278 741518 702770 683023 732004 744574 779437 860297 926826 993672 1034586 1112456
20741 1112456 1098277 1076652 1025150 950400 883466 790776 732016 721021 645359 569379 599747
20730 599747 627995 597238 537199 503745 485164 441692 492626 550760 560066 565278 502022 492134
20718 492134 483717 471125 404676 435231 473894 477872 452326 435604 430024 385163 264238 124209
20706 124209 63374 78352 65999 178550 275530 333929 404894 422863 406309 301185 307781
20695 307781 319497 339284 388455 397251 393687 395698 407078 353460 385240 421840 449836 429376
20683 429376 395528 363088 373927 377674 350874 322494 315869 271836 236643 219468 247873 251385
$$ packed form
20764A193977o1782n5262p1708o490m9791p1704J7191O519m8030n3867j8697k3078
20752G57278j5760l8748j9747M8981J2570L4863Q0860O6529O6846M0914P7870
20741A112456j4179k1625n1502p4750o6934r2690n8760j0995p5662p5980L0368
20730E99747K8248l0757o0039l3454j8581m3472N0934N8134R306N212o3256r888
20718D92134q417j2592o6449L0555L8663L978k5546j6722n580m4861j20925j40029
20706A24209o0835J4978j2353J12551R6980N8399P0965J7969j6554j05124O596
20695C07781J1716J9787M9171Q796l564K011J1380n3618L1780L6600K7996k0460
20683D29376l3848l2440J0839L747k6800k8380o625m4033l5193j7175K8405L512
$$ plain form
20671 251385 198273 229091 330409 352774 339307 306505 350877 399976 359051 349508 351051 361081
20659 361081 355753 331315 338901 315541 268351 294610 329463 314293 308540 275429 239962 248899
20647 248899 260582 273759 328199 307057 341479 334353 301016 311687 269189 189073 196525 196238
20635 196238 236577 250320 205001 217906 269323 262755 288949 366162 404289 418980 537566
20624 537566 632243 629130 705107 822519 949501 1072562 1187523 1158897 1120352 1062423 984358
20613 984358 858305 743361 650867 510111 426850 362134 327424 279221 235131 179659 142881
20602 142881 151547 117195 139495 147935 133322 116983 101483 116305 122177 67087 20768 14585
20590 14585 70435 82241 99878 111171 95375 95589 135677 117492 152244 127743 161089 110314
$$ packed form
20671B51385n3112L0818J01318K2365j3467l2802M4372M9099m0925r543J543J0030
20659C61081n328k4438P586k3360m7190K6259L4853j5170n753l3111l5467Q937
20647B48899J1683J3177N4440k1142L4422p126l3337J0671m2498q0116P452k87
20635A96238M0339J3743m5319J2905N1417o568K6194P7213L8127J4691J18586
20624E37566R4677l113P5977J17412J26982J23061J14961k8626l8545n7929p8065
20613I84358j26053j14944r2494j40756q3261o4716l4710m8203m4090n5472l6778
20602A42881Q666l4352K2300Q440j4613j6339j5500J4822N872n5090m6319o183
20590A4585N5850J1806J7637J1293j5796K14M0088j8185L4752k4501L3346n0775
$$ plain form
20578 110314 98404 106808 75853 114812 178413 192963 209264 133641 100463 102553 112445 177207
20566 177207 224825 208819 226127 278529 313425 339035 324684 295962 277675 310470 288467
20555 288467 250616 310364 253279 226748 121666 70758 100880 148677 126783 107144 99396
20544 99396 105578 87114 87012 98854 103125 136976 168418 159973 100940 90819 40499 42055 71913
20531 71913 50974 3821 29788 66943 60686 26266 39495 46613 61785 108696 68154 69739
20519 69739 71974 94597 176900 149672 64027 68385 50841 55418 31596 56688 82605 92864
20507 92864 43718 1653 43869 57324 95319 108349 62521 101542 108185 56955 -20394 -12172
20495 -12172 26166 -16729 -11754 -7043 -10252 52923 89388 47355 55804 65093 89478 65251 -32459
$$ packed form
20578A10314j1910Q404l0955L8959O3601J4550J6301p5623l3178K090R892O4762
20566A77207M7618j6006J7308N2402L4896K5610j4351k8722j8287L2795k2003
20555B88467l7851N9748n7085k6531j05082n0908L0122M7797k1894j9639p748
20544I9396O182j8464j02J1842M271L3851L1442q445n9033j0121n0320J556K9858
20531G1913k0939m7153K5967L7155o257l4420J3229P118J5172M6911m0542J585
20519F9739K235K2623Q2303k7228q5645M358j7544M577k3822K5092K5917J0259
20507I2864m9146m2065M2216J3455L7995J3030m5828L9021O643n1230p7349Q222
20495a2172L8338m2895M975M711l209O3175L6465m2033Q449R289K4385k4227r7710
$$ plain form
20482 -32459 -35026 21826 25724 -7480 229 27348 13832 74305 66839 64573 54438 52666 28089
20469 28089 68637 74947 21876 11116 -27942 -29331 -24437 -31049 -47203 -18848 52600 97006
20457 97006 91751 2505 6436 51894 51990 60345 89104 107886 102314 25327 11837 19552 48254
20444 48254 54659 18895 39251 45875 52714 72985 78713 47738 40979 54723 19841 -46535 -91343
20431 -91343 -52432 -26219 3343 48413 63642 10791 -28665 -35158 -60683 -128787 -131647 -98130
20419 -98130 -67835 -21913 36835 32523 3226 -67978 -77984 -58069 -63545 -78239 -38599 25356
20407 25356 49132 -3930 -3667 -22411 -51502 -39606 -11493 -80930 -109381 -33415 27146 55802
20395 55802 54456 30592 34593 -48303 -118806 -56615 -35396 -83058 -23766 18340 26421 30259
$$ packed form
20482c2459k567N6852L898l3204P709K7119j3516O0473p466k266j0135j772k4577
20469B8089M0548O310n3071j0760l9058j389M894o612j6154K8355P1448M4406
20457I7006n255q9246L931M5458R6Q355K8759J8782n572p6987j3490P715K8702
20444D8254O405l5764K0356O624O839K0271N728l0975o759J3744l4882o6376m4808
20431i1343L8911K6213K9562M5070J5229n2851l9456o493k5525o8104k860L3517
20419i8130L0295M5922N8748m312k9297p1204j0006J9915n476j4694L9640O3955
20407B5356K3776n3062K63j8744k9091J1896K8113o9437k8451P5966O0561K8656
20395E5802j346k3864M001q2896p0503O2191K1219m7662N9292M2106Q081L838
$$ plain form
20383 30259 22846 -8124 -58751 6393 60913 62215 9383 4977 36273 75691 64083 27346
20371 27346 23638 762 -5081 -7928 -29058 16732 -20025 -85643 -67674 -50301 -36337 -67565
20359 -67565 -76308 428 29718 56229 40894 8341 10162 12860 23042 28256 -41502 -58700
20347 -58700 58292 68556 78108 73319 86676 21389 -9317 17856 31647 -18613 -17898 -25103
20335 -25103 -9359 27813 92769 23174 -905 19424 35078 35101 77144 90520 50827 48363
20323 48363 55924 58985 30107 41813 95307 169675 148413 69140 88440 102145 126070 123745
20311 123745 166237 238579 228570 191502 208992 238055 324613 388811 481399 651947 759874
20300 759874 939307 1122526 1319889 1494796 1512011 1383950 1226206 969689 730107 580376
$$ packed form
20383C0259p413l0970n0627O5144N4520J302n2832m406L1296L9418j1608l6737
20371B7346l708k2876n843k847k1130M5790l6757o5618J7969J7373J3964l1228
20359f7565q743P6736K9290K6511j5335l2553J821K698J0182N214o9758j7198
20347e8700J16992J0264R552m789J3357o5287l0706K7173J3791n0260P15p205
20335b5103J5744L7172O4956o9595k4079K0329J5654K3M2043J3376l9693k464
20323D8363P561L061k8878J1706N3494P4368k1262p9273J9300J3705K3925k325
20311A23745M2492P2342j0009l7068J7490K9063Q6558O4198R2588J70548J07927
20300G59874J79433J83219J97363J74907J7215j28061j57744k56517k39582j49731
$$ plain form
20290 580376 479758 495140 519410 448308 461770 455707 470264 554732 710451 834287 1005475
20279 1005475 1171819 1290845 1400523 1368018 1176094 940673 762983 640493 525400 469648
20269 469648 423028 383373 351406 313288 320917 275728 216113 175665 171873 214966 229675 229468
20257 229468 195416 198881 203999 212911 210626 162246 103491 147283 182417 217316 212682 174399
20245 174399 149684 130285 171919 151675 116126 144993 166084 135816 65946 55847 101407
20234 101407 103179 90533 95552 33785 -19568 1863 15456 -22386 -30553 -48131 -36727 -24503
20222 -24503 -9928 39642 120842 84690 8225 35106 46678 -7534 -23065 -36648 -5630 60268
20210 60268 51087 -37448 -7530 11482 9837 -27800 -27783 -16817 -9164 49276 68939 64384 77949
$$ packed form
20290E80376j00618J5382K4270p1102J3462o063J4557Q4468J55719J23836J71188
20279A005475J66344J19026J09678l2505j91924k35421j77690j22490j15093n5752
20269D69648m6620l9655l1967l8118P629m5189n9615m0448l792M3093J4709k07
20257B29468l4052L465N118Q912k285m8380n8755M3792L5134L4899m634l8283
20245A74399k4715j9399M1634k0244l5549K8867K1091l0268o9870j0099M5560
20234A01407J772j2646N019o1767n3353K1431J3593l7842q167j7578J1404J2224
20222b4503J4575M9570Q1200l6152p6465K6881J1572n4212j5531j3583L1018O5898
20210F0268r181q8535K9918J9012j645l7637J7J0966P653N8440J9663m555J3565
$$ plain form
20197 77949 31567 -6550 5106 -10904 -24078 8994 18922 37268 70720 34618 8694 26575
20185 26575 -29357 -44262 -14917 -20249 -8935 44967 -16541 19786 52962 36639 -4749 -1010
20173 -1010 34179 -16220 -104233 -79364 -19306 37584 69814 156316 117923 61610 13173 35236
20161 35236 67487 109522 68278 -16050 -83651 -16203 19522 -14244 -46451 -84593 -38565 6766
20149 6766 64635 144111 134595 95120 41831 41820 37493 32509 24474 -5540 48741 41788 6107
20136 6107 21299 23394 32222 40777 91319 108994 27017 -52466 -94601 -49289 -64740 -42698
20124 -42698 -38553 42665 46483 18992 42636 98722 130086 104022 125284 85781 49065 358
20112 358 -42422 -19586 22887 62167 32429 27540 8677 61494 41202 12938 56047 27214
$$ packed form
20197G7949m6382l8117J1656j6010j3174L3072R928J8346L3452l6102k5924J7881
20185B6575n5932j4905K9345n332J1314N3902o1508L6327L3176j6323m1388L739
20173a010L5189n0399q8013K4869O0058N6890L2230Q6502l8393n6313m8437K2063
20161C5236L2251M2035m1244q4328o7601O7448L5725l3766l2207l8142M6028M5331
20149F766N7869P9476r516l9475n3289j1m327m984q035l0014N4281o953l5681
20136F107J5192K095Q828Q555N0542J7675q1977p9483m2135M5312j5451K2042
20124d2698M145Q1218L818k7491K3644N6086L1364k6064K1262l9503l6716m8707
20112C58m2780K2836M2473L9280k9738m889j8863N2817k0292k8264M3109k8833
$$ plain form
20100 27214 7624 44166 46659 -14191 -34443 4480 52673 3372 -27784 -23814 18749 58871
20088 58871 25186 147 10799 -6447 -13639 56490 -9816 -57526 -14041 52648 32966 21357
20076 21357 -12258 -45427 1471 48111 22809 13587 65456 66473 68422 72498 68830 114864 94054
20063 94054 90607 74799 36421 54133 -9404 -8786 -2495 15558 -20786 -30317 -14604 9408 54643
20050 54643 95707 137658 102067 53998 -44635 -57934 -42211 -6537 -17379 -22834 -40341 -9023
20038 -9023 17012 -21335 -72608 -75129 -72904 -11026 28118 46605 24099 -13548 9090 24266
20026 24266 9751 -12119 6335 19188 82065 116484 88143 128664 175669 196838 157812 91718
20014 91718 73449 52960 15016 6177 9135 -22315 -123936 -91585 -7860 -3385 -55071 -92850
$$ packed form
20100B7214j9590L6542K493o0850k0252L8923M8193m9301l1156L970M2563M0122
20088E8871l3685k5039J0652j7246p192P0129o6306m7710M3485O6689j9682j1609
20076B1357l3615l3169M6898M6640k5302r222N1869J017J949M076l668M6034k0810
20063I4054l447j5808l8378J7712o3537O18O291J8053l6344r531J5713K4012M5235
20050E4643M1064M1951l5591m8069r8633j3299J5723L5674j0842n455j7507L1318
20038i023K6035l8347n1273k521K225O1878L9144J8487k2506l7647K2638J5176
20026B4266j4515k1870J8454J2853O2877L4419k8341M0521M7005K1169l9026o6094
20014I1718j8269k0489l7944q839K958l1450j01621L2351Q3725M475n1686l7779
$$ plain form
20002 -92850 12044 101834 98143 47137 22605 71292 115925 78838 107472 74120 77277 71486
19990 71486 39769 3162 -13651 52869 88442 145225 108619 105357 183839 189077 104665 32493
19978 32493 36800 103499 172265 168022 169331 199270 228060 225262 248030 198523 190540 230341 233060
19965 233060 300722 375940 409306 434457 531045 566803 549492 553672 528985 505982 444077 496539
19953 496539 529054 618071 660706 735234 771876 833592 833402 762155 716963 640865 557820 544469
19941 544469 535808 462795 441420 431740 444200 406738 385684 336730 277104 243432 215090 225437
19929 225437 215832 177264 97680 49551 73444 137319 151668 134337 127234 117307 93695 85577
19917 85577 80912 70229 79155 101015 114051 86950 47336 80037 171291 214576 158444 88735
$$ packed form
20002i2850J04894Q9790l691n1006k4532M8687M4633l7087K8634l3352L157n791
19990G1486l1717l6607j6813O6520L5573N6783l6606l262P8482N238q4412p2172
19978C2493M307O6699O8766m243J309K9939K8790k798K2768m9507p983L9801K719
19965B33060O7662P5218L3366K5151R6588L5758j7311M180k4687k3003o1905N2462
19953D96539L2515Q9017M2635P4528L6642O1716j90p1247m5192p6098q3045j3351
19941E44469q661p3013k1375r680J2460l7462k1054m8954n9626l3672k8342J0347
19929B25437r605l8568p9584m8129K3893O3875J4349j7331p103r927k3612q118
19917H5577m665j0683Q926K1860J3036k7101l9614L2701R1254M3285n6132o9709
$$ plain form
19905 88735 60323 44270 20506 11598 69104 113606 164139 174794 152868 107223 51007 24442
19893 24442 46322 57369 26916 32023 102660 160829 110420 104159 85157 12522 -10257 25272
19881 25272 50046 64993 78776 69545 50258 54656 79749 124715 140497 120213 123395 152466
19869 152466 123433 87500 102401 63276 91595 71659 55828 76833 121713 117418 69903 100522
19857 100522 87582 63580 125664 110252 103870 88419 73959 72849 168999 179738 179865 167505
19845 167505 185809 161608 129695 101500 98787 88726 112184 150436 84179 74958 88530 118682
19833 118682 122916 101589 79065 65225 76667 110048 103936 82810 87631 80981 87319 137531
19821 137531 101449 53812 54992 71824 103590 109984 75978 68798 79803 104895 123119 125289
$$ packed form
19905H8735k8412j6053k3764q908N7506M4502N0533J0655k1926m5645n6216k6565
19893B4442K1880J1047l0453N107P0637N8169n0409o261j9002p2635k2779L5529
19881B5272K4774J4947J3783r231j9287M398K5093M4966J5782k0284L182K9071
19869A52466k9033l5933J4901l9125K8319j9936j5831K1005M4880m295m7515L0619
19857A00522j2940k4002O2084j5412o382j5451j4460j110R6150J0739J27j2360
19845A67505J8304k4201l1913k8195k713j0061K3458L8252o6257r221J3572L0152
19833A18682M234k1327k2524j3840J1442L3381o112k1126M821o650O338N0212
19821A37531l6082m7637J180J6832L1766O394l4006p180J1005K5092J8224K170
$$ plain form
19809 125289 139222 85316 83850 109402 80094 94760 155836 158447 171126 243921 305188 317480
19797 317480 285415 257178 266371 291987 326046 308534 332036 355537 368030 359950 391500 462019
19785 462019 457004 398984 337495 330741 320613 310276 370095 419402 425687 401744 327844 286187
19773 286187 259725 215251 224591 199260 169793 111630 125101 160363 202593 189657 229663 251418
19761 251418 238134 205302 131831 136442 160969 167887 188714 209591 201506 225731 244842 298547
19749 298547 330478 337988 322482 306865 331481 324480 312539 364958 449229 494777 571885 584590
19737 584590 519350 471698 425717 440531 450383 392884 406420 409758 466517 460943 385935 354009
19725 354009 306393 293650 238698 159496 142205 183262 241386 329828 248243 201033 192888 204479
$$ packed form
19809A25289J3933n3906j466K5552k9308J4666O1076K611J2679P2795O1267J2292
19797C17480l2065k8237R193K5616L4059j7512K3502K3501J2493q080L1550P0519
19785D62019n015n8020o1489o754j0128j0337N9819M9307O285k3943p3900m1657
19773B86187k6462m4474R340k5331k9467n8163J3471L5262M2230j2936M0006K1755
19761B51418j3284l2832p3471M611K4527O918K0827K0877q085K4225J9111N3705
19749B98547L1931P510j5506j5617K4616p001j1941N2419Q4271M5548P7108J2705
19737E84590o5240m7652m5981J4814R852n7499J3536L338N6759n574p5008l1926
19725C54009m7616j2743n4952p9202j7291M1057N8124Q8442q1585m7210q145J1591
$$ plain form
19713 204479 201430 182572 174436 222622 205370 123517 155015 231909 311719 336122 293409 318735
19701 318735 321165 324786 342803 355957 335736 296460 327094 352919 280668 289848 296872 263766
19689 263766 228796 228498 246866 241377 276026 283690 317213 316593 292792 309746 308098 287636 174944
19676 174944 86225 168623 201817 185952 217414 186304 134614 179851 161452 148449 188307
19665 188307 242423 191906 167492 156811 184728 211224 177438 140775 161315 178471 210288
19654 210288 203599 186032 196904 247766 238577 245190 255581 269634 244703 239547 230597 217995
19642 217995 217950 219350 220250 258347 294782 351769 362241 286420 224698 245206 217183 246119 300770
19629 300770 281926 251820 313569 343362 344328 383342 412685 375304 329451 315689 391455 418202
$$ packed form
19713B04479l049j8858q136M8186j7252q1853L1498P6894P9810K4403m2713K5326
19701C18735K430L621J8017J3154k0221l9276L0634K5825p2251R180P024l3106
19689B63766l4970k98J8368n489L4649P664L3523o20k3801J6954j648k0462j12692
19676A74944q8719Q2398L3194j5865L1462l1110n1690M5237j8399j3003L9858
19665A88307N4116n0517k4414j0681K7917K6496l3786l6663K0540J7156L1817
19654B10288o689j7567J0872N0862r189O613J0391J4053k4931n156q950j2602
19642B17995m5J400R00L8097L6435N6987J0472p5821o1722K0508k8023K8936N4651
19629C00770j8844l0106O1749K9793R66L9014K9343l7381m5853j3762P5766K6747
$$ plain form
19617 418202 367846 302693 275423 294920 239747 254414 307425 314695 330445 377455 431310 485880
19605 485880 455604 396656 300934 364836 368108 315818 325093 299676 342160 387484 401562 416101
19593 416101 403999 392188 438427 529388 540476 541048 547996 534343 569174 558336 551949 568355
19581 568355 621400 719525 711451 676660 667550 669367 667147 674240 651646 575063 560173 620701
19569 620701 654159 642811 618374 638443 600242 508782 472085 476027 464505 500345 538783 513402
19557 513402 473786 490366 474807 481362 482882 509593 497565 547400 608467 600481 640837 614489
19545 614489 594562 635178 689776 772038 841994 889546 929307 938963 911427 936677 1019379 1084740
19533 1084740 1106896 1109740 1158509 1189389 1197979 1216309 1303953 1340339 1318888 1346454 1345551 1337233
$$ packed form
19617D18202n0356o5153k7270J9497n5173J4667N3011P270J5750M7010N3855N4570
19605D85880l0276n8948r5722O3902L272n2290R275k5417M2484M5324J4078J4539
19593D16101j2102j1811M6239R0961J1088N72O948j3653L4831j0838o387J6406
19581E68355N3045R8125q074l4791r110J817k220P093k2594p6583j4890O0528
19569F20701L3458j1348k4437K0069l8201r1460l6697L942j1522L5840L8438k5381
19557E13402l9616J6580j5559O555J520K6711j2028M9835O1067p986M0356k6348
19545F14489j9927M0616N4598Q2262O9956M7552L9761R656k7536K5250Q2702O5361
19533A084740K2156K844M8769L0880Q590J8330Q7644L6386k1451K7566r03q318
$$ plain form
19521 1337233 1357905 1415384 1462963 1491371 1478126 1437773 1449077 1487052 1577416 1615662 1653894
19510 1653894 1731454 1797697 1829711 1843267 1910576 1968463 2059565 2162849 2226821 2334211 2451982
19499 2451982 2555054 2725559 2819483 2854232 2909267 3034068 3120056 3189511 3334116 3508931
19489 3508931 3734156 4001803 4273591 4480474 4586747 4781393 5058098 5298973 5590130
19480 5590130 6034974 6520385 7007769 7459405 8025282 8619358 9213095 9821798 10491296
19471 10491296 11352128 12294817 13362856 14564555 15990109 17675197 19589420 21836894
19463 21836894 24602764 28120357 32814163 38880379 46246230 54678843 63589009 71172958
19455 71172958 74919045 75868110 77154831 78351397 77711420 77525677 81523110 90279938
$$ packed form
19521A337233K0672N7479M7579K8408j3245m0353J1304L7975R0364L8246L8232
19510A653894P7560O6243L2014J3556O7309N7887R1102J03284O3972J07390J17771
19499B451982J03072J70505R3924L4749N5035J24801Q5988O9455J44605J74815
19489C508931K25225K67647K71788K06883J06273J94646K76705K40875K91157
19480E590130M44844M85411M87384M51636N65877N94076N93737O08703O69498
19471A0491296Q60832R42689J068039J201699J425554J685088J914223K247474
19463B1836894K765870L517593M693806O066216P365851Q432613Q910166P583949
19455G1172958L746087R49065J286721J196566o39977j85743L997433Q756828
$$ plain form
19447 90279938 102081531 114026965 122051192 125648543 125172256 119552884 110013743 99286120
19439 99286120 88925550 80062978 75705085 76312651 79899645 83657448 83613970 78816865
19431 78816865 73211487 67729397 59382291 48300806 38667249 32148587 27983490 25300683
19423 25300683 23374517 21877687 20653893 19624683 18783261 18104866 17499751 16879623 16334910
19414 16334910 15918815 15434998 14849651 14275176 13724874 13132587 12526240 11964031 11461819
19405 11461819 11022759 10679704 10300710 9873843 9442682 8983783 8547468 8094856 7652219
19396 7652219 7329358 7031106 6665284 6320889 5976370 5683238 5427934 5097736 4827461
19387 4827461 4626789 4399434 4136692 3935246 3836883 3663599 3492993 3334117 3163105 3017432
$$ packed form
19447I0279938J1801593J1945434Q024227L597351m76287n619372r539141j0727623
19439I9286120j0360570q862572m357893O07566L586994L757803m3478m797105
19431G8816865n605378n482090q347106j1081485r633557o518662m165097k682807
19423B5300683j926166j496830j223794j029210q41422o78395o05115o20128n44713
19414A6334910m16095m83817n85347n74475n50302n92287o06347n62209n02212
19405A1461819m39060l43055l78994m26867m31161m58899m36315m52612m42637
19396G652219l22861k98252l65822l44395l44519k93132k55304l30198k70275
19387D827461k00672k27355k62742k01446r8363j73284j70606j58876j71012j45673
$$ plain form
19377 3017432 2892141 2825119 2734987 2648746 2574243 2455524 2353611 2212642 2154202 2152570 2115187
19366 2115187 2047701 1970674 1976058 2022441 2016672 1993567 1992976 1974013 1948385 1892587 1852433 1712293
19354 1712293 1629578 1556891 1529823 1524786 1497657 1471495 1454229 1401245 1367080 1405779 1375000
19343 1375000 1365487 1357194 1356353 1386866 1385780 1369634 1340162 1345517 1403241 1437801 1505574 1509744 1566217
19330 1566217 1647039 1697568 1776991 1798882 1819150 1882920 1905981 1970915 2059136 2175294 2287774
19319 2287774 2423731 2533364 2683111 2892673 3084714 3291642 3504477 3662432 3768923
19310 3768923 3921264 4158789 4318306 4471294 4670241 4925597 5117009 5410034 5768916
19301 5768916 6139160 6617811 7044828 7533920 8072153 8665363 9486124 10498419 11668662
$$ packed form
19377C017432j25291o7022r0132q6241p4503j18719j01913j40969n8440j632l7383
19366B115187o7486p7027N384M6383n769k3105n91j8963k5628n5798m0154j40140
19354A712293q2715p2687k7068n037k7129k6162j7266n2984l4165L8699l0779
19343A375000r513q293q41L0513j086j6146k9472N355N7724L4560O7773M170N6473
19330A566217Q0822N0529P9423K1891K0268O3770K3061O4934Q8221J16158J12480
19319B287774J35957J09633J49747K09562J92041K06928K12835J57955J06491
19310C768923J52341K37525J59517J52988J98947K55356J91412K93025L58882
19301E768916L70244M78651M27017M89092N38233N93210Q20761J012295J170243
$$ plain form
19292 11668662 13011307 14578809 16565310 19329105 23178902 28179202 34010126 40085180
19284 40085180 45193787 47508114 45579250 42299086 41674163 44728930 50641551 58170267
19276 58170267 65680328 70072527 68268059 61273821 51945133 43655620 39109900 38184472
19268 38184472 39483733 41693364 43450923 42735021 37650520 30295404 24409092 20813812
19260 20813812 18757778 17513914 16667060 16054428 15683916 15541718 15604142 15756012 16028219
19251 16028219 16303671 16621412 17065243 17684135 18443271 19414901 20635353 22134343 23922450
19242 23922450 26281174 29635169 34395246 40442863 47375869 54414786 60071492 61923812
19234 61923812 58808543 55033259 54923602 59242372 66827251 76086652 84588219 88500708
$$ packed form
19292A1668662J342645J567502J986501K763795L849797N000300N830924O075054
19284D0085180N108607K314327j928864l280164o24923L054767N912621P528716
19276E8170267P510061M392199j804468o994238r328688q289513m545720r25428
19268C8184472J299261K209631J757559p15902n084501p355116n886312l595280
19260B0813812k056034j243864q46854o12632l70512j42198O2424J51870K72207
19251A6028219K75452L17741M43831O18892P59136R71630J220452J498990J788107
19242B3922450K358724L353995M760077O047617O933006P038917N656706J852320
19234F1923812l115269l775284j09657M318770P584879R259401Q501567L912489
$$ plain form
19226 88500708 84875848 75278185 63345880 53496917 48578428 47839350 49551037 52114012
19218 52114012 53566393 51102321 43270279 33675981 26358169 21769284 18927730 16984828
19210 16984828 15608924 14570162 13689994 13014568 12447564 12030349 11618694 11226898 10891664
19201 10891664 10532671 10229345 9939641 9629113 9387007 9092471 8713344 8403134 8034803
19192 8034803 7653303 7315550 7026816 6779374 6520778 6223924 5982905 5697899 5396898
19183 5396898 5126215 4869114 4644484 4378082 4158496 4023031 3847501 3691357 3540501
19174 3540501 3398767 3267661 3169602 3120030 3017930 2905645 2791070 2726845 2662377 2570419
19164 2570419 2461884 2454132 2434205 2412862 2364418 2366104 2357458 2330107 2301725 2208456 2184192 2111403
$$ packed form
19226H8500708l624860r597663j1932305r848963m918489p39078J711687K562975
19218E2114012J452381k464072p832042r594298p317812m588885k841554j942902
19210A6984828j375904j038762q80168o75426n67004m17215m11655l91796l35234
19201A0891664l58993l03326k89704l10528k42106k94536l79127l10210l68331
19192H034803l81500l37753k88734k47442k58596k96854k41019k85006l01001
19183E396898k70683k57101k24630k66402k19586j35465j75530j56144j50856
19174C540501j41734j31106r8059m9572j02100j12285j14575o4225o4468r1958
19164B570419j08535p752j9927k1343m8444J686q646k7351k8382r3269k4264p2789
$$ plain form
19152 2111403 2048780 1985141 1950105 1934747 1870401 1829100 1817033 1826378 1808014 1848952 1781970
19141 1781970 1736309 1737141 1731558 1754189 1781222 1854611 1857669 1766952 1747316 1755729 1827967 1895669
19129 1895669 1944060 1943562 1884301 1929843 2074607 2217438 2246877 2306164 2347539 2480412 2626883
19118 2626883 2763741 2965629 3145031 3369395 3608984 3819649 3964905 4140937 4363473
19109 4363473 4531448 4736251 5033817 5429105 5882908 6293162 6602483 6952229 7353233
19100 7353233 7821404 8323977 8955101 9693110 10633595 11878000 13433160 15375039 18108424
19091 18108424 21832765 26454874 31561733 36520310 40287747 40713280 37308518 34196958
19083 34196958 34065723 36614289 40767588 45828435 50564638 52572105 50422362 47814691
$$ packed form
19152B111403o2623o3639l5036j5358o4346m1301j2067R345j8364M0938o6982
19141A781970m5661Q32n583K2631K7033P3389L058r0717j9636Q413P2238O7702
19129A895669M8391m98n9261M5542J44764J42831K9439N9287M1375J32873J46471
19118B626883J36858K01888J79402K24364K39589K10665J45256J76032K22536
19109D363473J67975K04803K97566L95288M53803M10254L09321L49746M01004
19100G353233M68171N02573O31124P38009R40485J244405J555160J941879K733385
19091A8108424L724341M622109N106859M958577L767437M25533l404762l111560
19083C4196958j31235K548566M153299N060847M736203K007467k149743k607671
$$ plain form
19075 47814691 46583231 44680011 39922656 34753587 32324080 32609979 34514882 37079268
19067 37079268 39046584 38585309 33695114 26934225 21997660 19063118 17345663 16302896
19059 16302896 15645131 15299913 15181909 15195965 15353454 15620897 15971707 16435306 17103778
19050 17103778 17933714 18917928 20101683 21483145 23249193 25459060 28558006 32983729
19042 32983729 39032048 46468907 54698481 62681288 68478030 68537663 62088371 56008899
19034 56008899 54632790 57453383 63018986 69995403 76859688 80317288 78735471 76486297
19026 76486297 75439639 72191980 63434585 53709654 48412120 47524771 49313090 52099770
19018 52099770 54120423 52715862 45211374 35158564 27568779 22787262 19746072 17661477
$$ packed form
19075D7814691j231460j903220m757355n169069k429507K85899J904903K564386
19067C7079268J967316m61275m890195o760889m936565k934542j717455j042767
19059A6302896o57765l45218j18004J4056J57489K67443L50810M63599O68472
19050A7103778Q29936R84214J183755J381462J766048K209867L098946M425723
19042C2983729O048319P436859Q229574P982807N796742N9633o449292o079472
19034E6008899j376109K820593N565603O976417O864285L457600j581817k249174
19026G6486297j046658l247659q757395r724931n297534q87349J788319K786680
19018E2099770K020653j404561p504488j0052810p589785m781517l041190k084595
$$ plain form
19010 17661477 16274943 15279827 14521064 13897919 13325222 12709165 12082673 11523854 11119837
19001 11119837 10711001 10282956 9996523 9730056 9476450 9162712 8836541 8590643 8312149
18992 8312149 7974676 7643684 7313341 7013664 6742531 6515973 6218964 5937284 5662608
18983 5662608 5380879 5047194 4712371 4419810 4258211 4077562 3922545 3806995 3649175
18974 3649175 3512231 3400036 3219366 3036202 2913624 2793312 2721385 2647801 2536593 2400118
18964 2400118 2348371 2281753 2226277 2177730 2151203 2121238 2017844 1937548 1894294 1843418 1825046
18953 1825046 1749715 1720019 1699261 1680325 1680713 1712690 1735071 1799254 1848108 1900767 1844285 1816446
18941 1816446 1849535 1839493 1845817 1827650 1880135 1946779 1988050 2023808 2095616 2112141 2100087
$$ packed form
19010A7661477j386534r95116p58763o23145n72697o16057o26492n58819m04017
19001A1119837m08836m28045k86433k66467k53606l13738l26171k45898k78494
18992H312149l37473l30992l30343k99677k71133k26558k97009k81680k74676
18983E662608k81729l33685l34823k92561j61599j80649j55017j15550j57820
18974C649175j36944j12195j80670j83164j22578j20312p1927p3584j11208j36475
18964B400118n1747o6618n5476m8547k6527k9965j03394q0296m3254n0876j8372
18953A825046p5331k9696k0758j8936L88L1977K2381O4183M8854N2659n6482k7839
18941A816446L3089j0042O324j8167N2485O6644M1271L5758P1808J6525j2054
$$ plain form
18930 2100087 2117609 2077999 2038841 2091229 2187778 2208887 2310338 2388898 2440562 2496310 2577104
18919 2577104 2653881 2725753 2845202 2963574 3123351 3268304 3428694 3586821 3800557 4081215
18909 4081215 4405021 4704520 4996754 5253955 5543153 5796343 6051790 6334070 6609304
18900 6609304 6986033 7417902 7949221 8587523 9439431 10494153 11829953 13491388 15439785
18891 15439785 17823401 20890196 24930839 30230732 37071564 45539988 55256438 65058888
18883 65058888 72496030 76138667 76645649 73300980 66508567 57426416 47494929 36981848
18875 36981848 28045534 22146935 18440357 16030004 14364702 13227895 12460391 11985268
18867 11985268 11633495 11418692 11301681 11254143 11259973 11419432 11673439 11971446 12311391 12686005
$$ packed form
18930B100087J7522l9610l9158N2388R6549K1109J01451P8560N1664N5748Q0794
18919B577104P6777P1872J19449J18372J59777J44953J60390J58127K13736K80658
18909D081215L23806K99499K92234K57201K89198K53190K55447K82280K75234
18900F609304L76729M31869N31319O38302Q51908J054722J335800J661435J948397
18891A5439785K383616L066795M040643N299893O840832Q468424R716450R802450
18883F5058888P437142L642637N06982l344669o792413r082151r931487j0513081
18875C6981848q936314n898599l706578k410353j665302j136807p67504m75123
18867A1985268l51773k14803j17011m7538N830J59459K54007K98007L39945L74614
$$ plain form
18857 12686005 12988215 13219512 13431624 13675991 13974796 14361778 14751905 15251140 15986178
18848 15986178 16849807 17930840 19360107 21262984 23618354 26453665 30197588 35185373
18840 35185373 41815331 50521207 61451191 74179150 87454459 98521136 105180522
18833 105180522 107117312 104099542 95857859 83925139 70174925 55773967 42562301
18826 42562301 32700769 26273947 22102601 19351818 17431601 15920204 14709896 13817083
18818 13817083 13166707 12689173 12324966 12052238 11908676 11853217 11822857 11812801 11871818 11927977
18808 11927977 11918426 11876666 11775251 11668997 11626406 11557121 11480079 11437484 11444789 11564324 11777790
18797 11777790 12121571 12666487 13394479 14394057 15822224 17811914 20493340 23941691 28237279
$$ packed form
18857A2686005L02210K31297K12112K44367K98805L86982L90127M99235P35038
18848A5986178Q63629J081033J429267J902877K355370K835311L743923M987785
18840C5185373O629958Q705876J0929984J2727959J3275309J1066677O659386
18833A05180522J936790l017770q241683j1932720j3750214j4400958j3211666
18826D2562301r861532o426822m171346k750783j920217j511397j210308q92813
18818A3817083o50376m77534l64207k72728j43562n5459l0360j0056N9017N6159
18808A1927977r551m1760j01415j06254m2591o9285p7042m2595P305J19535K13466
18797A1777790L43781N44916P27992R99578J428167J989690K681426L448351M295588
$$ plain form
18788 28237279 33126025 37958593 41241362 42544713 42256267 39822078 35607466 30491265
18780 30491265 25069534 19428529 14948850 12067762 10148663 8834914 7939129 7233190
18772 7233190 6650214 6268456 5984159 5716579 5539920 5400485 5405139 5366696 5263801 5167979
18762 5167979 4994297 4819282 4713701 4591666 4480505 4337409 4229008 4129855 3998424 3943388
18752 3943388 3907142 3804941 3668227 3488053 3292451 3099211 2887318 2738528 2623367 2548641
18742 2548641 2490326 2432390 2372741 2329614 2278797 2213391 2134097 2054928 1958123 1935283 1921419
18731 1921419 1868852 1724610 1541177 1408004 1367039 1294418 1185875 1055857 1001391 972420
18721 972420 955984 951006 954172 963448 950037 969106 952467 944612 902553 928246 980620 942772
$$ packed form
18788B8237279M888746M832568L282769J303351k88446k434189m214612n116201
18780C0491265n421731n641005m479679k881088j919099j313749q95785p05939
18772G233190n82976l81758k84297k67580j76659j39435M654l8443j02895r5822
18762E167979j73682j75015j05581j22035j11161j43096j08401r9153j31431n5036
18752C943388l6246j02201j36714j80174j95602j93240k11893j48790j15161p4726
18742B548641n8315n7936n9649m3127n0817o5406p9294p9169r6805k2840j3864
18731A921419n2567j44242j83433j33173m0965p2621j08543j30018n4466k8971
18721I72420j6436m978L166R276j3411J9069j6639p855m2059K5693N2374l7848
$$ plain form
18709 942772 910788 892324 850808 778806 706787 666923 670389 654725 571999 558136 598191 563817
18697 563817 524837 535755 554378 565261 596595 543960 497371 479201 445615 434896 446272
18686 446272 518253 588125 621588 589594 578170 521343 485970 481630 374059 319202 321468 306931
18674 306931 267632 279390 323308 313866 344107 345308 324925 342877 308618 337166 353937 394465
18662 394465 432052 438767 385600 283631 268260 317878 312548 299917 274904 254642 259553 276788
18650 276788 196787 177255 193167 194364 210315 180078 196563 165042 165611 179085 200295 187509
18638 187509 159476 126966 178991 234622 254782 273139 265596 307433 300594 264208 257026 263016
18626 263016 244980 247790 285010 274368 219368 206639 192305 178102 196658 279689 241256 182944
$$ packed form
18709I42772l1984j8464m1516p2002p2019l9864L466j5664q2726j3863M0055l4374
18697E63817l8980J0918J8623J0883L1334n2635m6589j8170l3586j0719J1376
18686D46272P1981O9872L3463l1994j1424n6827l5373m340j07571n4857K266j4537
18674C06931l9299J1758M3918r442L0241J201k0383J7952l4259K8548J6771M0528
18662C94465L7587O715n3167j01969j5371M9618n330j2631k5013k0262M911J7235
18650B76788q0001j9532J5912J197J5951l0237J6485l1521N69J3474K1210j2786
18638A87509k8033l2510N2025N5631K0160J8357p543M1837o839l6386p182N990
18626B63016j8036K810L7220j0642n5000j2729j4334j4203J8556Q3031l8433n8312
$$ plain form
18614 182944 198888 212229 223484 158150 109160 148747 123824 149297 167721 162490 163692 189408
18602 189408 197328 172570 157523 145562 190987 167185 102757 162903 172704 154536 165482 183605
18590 183605 215496 199477 207402 221272 253546 279542 267751 215233 259523 306359 302932 297947
18578 297947 298349 283151 269597 334586 383354 386735 386572 374308 363936 330615 324308 406989 496637
18565 496637 507932 518413 525753 534905 493800 442319 380643 285980 293181 329384 382757 371798
18553 371798 334304 266679 281785 245519 213670 135318 117959 154534 186083 134005 130787 138596
18541 138596 191767 200051 223559 250132 238203 211126 200305 198145 170274 118976 144842 227779
18529 227779 231070 244687 278941 376464 370889 335432 327124 343777 334946 263804 277152 322157
$$ packed form
18614A82944J5944J3341J1255o5334m8990L9587k4923K5473J8424n231J202K5716
18602A89408P920k4758j5047j1961M5425k3802o4428O0146R801j8168J0946J8123
18590A83605L1891j6019P925J3870L2274K5996j1791n2518M4290M6836l427m985
18578B97947M02j5198j3554O4989M8768L381j63j2264j0372l3321o307Q2681Q9648
18565D96637J1295J0481P340R152m1105n1481o1676r4663P201L6203N3373j0959
18553C71798l7494o7625J5106l6266l1849p8352j7359L6575L1549n2078l218P809
18541A38596N3171Q284K3508K6573j1929k7077j0821k160k7871n1298K5866Q2937
18529B27779L291J3617L4254R7523n575l5457q308J6653q831p1142J3348M5005
$$ plain form
18517 322157 344930 340518 314931 322596 343589 355778 376946 389595 353338 286762 202403 168469
18505 168469 183641 191363 186947 198312 192025 199341 188705 110943 93682 79336 100353 121814
18493 121814 189038 227822 146452 118276 132051 149814 136493 64713 71529 158814 202516 180347
18481 180347 184079 175002 164792 144736 104590 101001 94927 82921 100119 67513 71138 107740
18469 107740 151224 174872 126773 122316 124916 111536 88279 59876 102491 76600 131304 141262
18457 141262 116565 173400 156598 59026 62257 145153 179749 146411 139430 92011 45034 12036
18445 12036 -29852 -16157 -15548 50143 85500 31969 14357 31623 71893 68564 25359 49327
18433 49327 76579 88583 82246 81702 43714 64104 87886 80054 37959 -18514 39578 57440
$$ packed form
18517C22157K2773m412k5587P665K0993J2189K1168J2649l6257o6576q4359l3934
18505A68469J5172P722m416J1365o287P316j0636p7762j7261j4346K1017K1461
18493A21814O7224L8784q1370k8176J3775J7763j3321p1780O816Q7285M3702k2169
18481A80347L732r077j0210k0056m0146l589o074j2006J7198l2606L625L6602
18469A07740M3484K3648m8099m457K600j3380k3257k8403M2615k5891N4704R958
18457A41262k4697N6835j6802r7572L231Q2896L4596l3338o981m7419m6977l2998
18445A2036m1888J3695O09O5691L5357n3531j7612J7266M0270l329m3205K3968
18433D9327K7252J2004o337n44l7988K0390K3782p832m2095n6473N8092J7862
$$ plain form
18421 57440 28974 -10122 11131 10148 -25040 -77298 -47791 41370 101687 81977 48296 88066
18409 88066 110773 65178 -1462 35780 67953 88551 72701 48510 93169 125330 124984 126760
18397 126760 120329 142570 94688 17400 -8961 28480 33490 51995 106236 109029 111409 103851
18385 103851 95195 157859 180453 190638 175225 145544 129486 81871 111847 81092 69480 30850
18373 30850 10315 49116 120149 180130 210861 276608 349121 402198 396692 396413 441158 445999
18361 445999 407793 368061 282239 270701 243055 207414 196164 153891 165575 213261 214541 223391
18349 223391 132458 132052 169990 210851 181282 125899 123365 125373 127084 88547 65943 60801 89995
18336 89995 122469 91168 90059 132273 168180 198149 163347 126108 124117 132449 118460 140626
$$ packed form
18421E7440k8466l9096K1253r83l5188n2258K9507Q9161O0317j9710l3681L9770
18409H8066K2707m5595o6640L7242L2173K0598j5850k4191M4659L2161l46J776
18397A26760o431K2241m7882p7288k6361L7441N010J8505N4241K793K380p558
18385A03851q656O2664K2594J0185j5413k9681j6058m7615K9976l0755j1612l8630
18373C0850k0535L8801P1033N9981L0731O5747P2513N3077n506k79M4745M841
18361D45999l8206l9732q5822j1538k7646l5641j1250m2273J1684M7686J280Q850
18349B23391r0933m06L7938M0861k9569n5383k534K008J711l8537k2604n142K9194
18336H9995L2474l1301j109M2214L5907K9969l4802l7239j991Q332j3989K2166
$$ plain form
18324 140626 138374 245263 377722 423742 423332 426350 513803 580061 650751 668350 648049 583040
18312 583040 442463 333709 311113 275247 165228 108533 161530 201605 249392 250727 246887
18301 246887 230943 289698 321457 259166 239520 281279 260475 240513 226438 153214 161777 157758
18289 157758 138973 200212 254993 232471 188894 195352 118175 120533 100955 84941 190418 252689
18277 252689 273303 239792 239537 210826 188206 216997 258459 305145 303152 301967 307728 357361
18265 357361 469589 471814 373629 292049 231207 149975 95321 112728 119674 145887 139131 127718
18253 127718 80863 93230 98708 101344 131451 161513 179083 166241 128741 118247 133509 136919
18241 136919 140296 86768 91889 99646 100767 122843 133059 80481 130581 120525 110952 92027
$$ packed form
18324A40626k252J06889J32459M6020m10L018Q7453O6258P0690J7599k0301o5009
18312E83040j40577j08754k2596l5866j10019n6695N2997M0075M7787J335l840
18301B46887j5944N8755L1759o2291j9646M1759k0804j9962j4075p3224Q563m019
18289A57758j8785O1239N4781k2522m3577O458p7177K358j9578j6014J05477O2271
18277B52689K0614l3511k55k8711k2620K8791M1462M6686j993j185N761M9633
18265C57361J12228K225r8185q1580o0842q1232n4654J7407O946K6213o756j1413
18253A27718m6855J2367N478K636L0107L0062J7570j2842l7500j0494J5262L410
18241A36919L377n3528N121P757J121K2076J0216n2578N0100j0056r573j8925
$$ plain form
18229 92027 106269 96453 72208 144805 172541 126352 106650 121077 161509 130900 119550 84977
18217 84977 114901 160231 145929 128066 92660 115305 111988 60699 82966 156416 157693 91185
18205 91185 51182 57556 125537 161999 134239 117863 116372 138529 136461 142465 166910 195381
18193 195381 183201 156983 122866 215632 288865 265051 213109 215935 186837 162364 177197 207479
18181 207479 296250 313041 318307 281030 274190 311313 318835 330354 319874 289612 284910 284649 320647
18168 320647 289519 294287 295380 321493 331441 348485 384757 376691 362693 433265 471390 439519
18156 439519 499539 545827 545255 596606 637524 663341 682108 676404 766692 875387 895580 981012
18144 981012 1114545 1247104 1339384 1397282 1429004 1501027 1575693 1688117 1832379 1983330
$$ packed form
18229I2027J4242r816k4245P2597K7736m6189j9702J4427M0432l0609j1350l4573
18217H4977K9924M5330j4302j7863l5406K2645l317n1289K2267P3450J277o6508
18205I1185m0003O374O7981L6462k7760j6376j491K2157k068O004K4445K8471
18193A95381j2180k6218l4117R2766P3233k3814n1942K826k9098k4473J4833L0282
18181B07479Q8771J6791N266l7277o840L7123P522J1519j0480l0262m702k61L5998
18168C20647l1128M768J093K6113R948J7044L6272q066j3998P0572L8125l1871
18156D39519O0020M6288n72N1351M0918K5817J8767n704R0288J08695K0193Q5432
18144I81012J33533J32559R2280N7898L1722P2023P4666J12424J44262J50951
$$ plain form
18134 1983330 2079288 2184934 2334469 2465853 2622240 2807524 2991031 3251943 3513178 3752271
18124 3752271 4081732 4443904 4926120 5497819 6112169 6969141 8039866 9242545 10741106
18115 10741106 12506752 14546037 17158314 21029719 27165884 36289525 47720131 60353906
18107 60353906 72044327 79556983 72266509 49318940 30764628 20728681 15387687
18100 15387687 12371698 10390761 8989978 7894251 7120384 6612930 6164090 5779668 5423052
18091 5423052 5165781 4913797 4679199 4512796 4418233 4308550 4188192 4108723 4063977 4001944
18081 4001944 3964813 3975880 3965459 3980932 4068021 4101320 3942180 3742041 3497833 3293120
18071 3293120 3131658 3010322 2896246 2747879 2569213 2441572 2319477 2196190 2100823 2015910
$$ packed form
18134A983330R5958J05646J49535J31384J56387J85284J83507K60912K61235K39093
18124C752271L29461L62172M82216N71699O14350Q56972J070725J202679J498561
18115A0741106J765646K039285K612277L871405O136165R123641J1430606J2633775
18107F0353906J1690421P512656p290474k2947569j8554312j0035947n340994
18100A5387687l015989j980937j400783j095727p73867n07454m48840l84422l56616
18091E423052k57271k51984k34598j66403r4563j09683j20358p9469m4746o2033
18081D001944l7131J1067j0421J5473Q7089L3299j59140k00139k44208k04713
18071C293120j61462j21336j14076j48367j78666j27641j22095j23287r5367q4913
$$ plain form
18061 2015910 1951251 1835381 1789798 1762343 1656733 1610514 1587800 1564382 1517375 1482608 1505657
18050 1505657 1537666 1559706 1459737 1405590 1457848 1428870 1332426 1225013 1179796 1133673 1133261
18039 1133261 1091018 1039010 932628 858612 776230 798542 804117 782651 707584 686220 692332
18028 692332 650798 629927 603544 616543 662961 641732 624868 557150 547647 569844 545881 506509
18016 506509 463426 441694 453636 469504 494175 452856 372675 302650 261512 238741 246148 250652
18004 250652 184739 237418 264796 263453 235377 254995 283760 260928 261033 305636 268363 283866
17992 283866 292791 275791 277156 304550 297311 306975 303871 298365 268310 233258 230370 252593 270336
17979 270336 303677 246902 179326 144408 206753 311480 305520 192275 118123 74936 106615
$$ packed form
18061B015910o4659j15870m5583k7455j05610m6219k2714k3418m7007l4767K3049
18050A505657L2009K2040r9969n4147N2258k8978r6444j07413m5217m6123m12
18039A133261m2243n2008j06382p4016q2382K2312N575k1466p5067k1364O112
18028F92332m1534k0871k6383J2999M6418k1229j6864o7718r503K2197k3963l9372
18016E06509m3083k1732J1942J5868K4671m1319q0181p0025m1138k2771P407M504
18004B50652o5913N2679K7378j343k8076J9618K8765k2832J05M4603l7273J5503
17992B83866Q925j7000J365K7394p239R664l104n506l0055l5052k888K2223J7743
17979B70336L3341n6775o7576l4918O2345J04727n960j13245p4152m3187L1679
$$ plain form
17968 106615 165348 198031 212444 206005 184917 182155 217636 271721 275128 257259 194393 149913
17956 149913 138105 103197 157166 154882 90781 55491 44438 65954 90033 74115 79920 143585
17944 143585 185755 119866 116540 104457 118307 107736 145171 135126 148794 155521 127078 161643
17932 161643 151547 155964 203023 231402 208045 161845 133109 65920 88675 133079 149219 187446
17920 187446 184337 118867 94376 96812 141275 161445 104234 152450 197882 161536 127004 109616
17908 109616 96287 103993 96611 48737 21439 24695 42611 46964 57728 120338 117235 77997
17896 77997 100954 162312 163432 107847 101566 92069 56603 28849 36701 29036 28810 86779 125206
17883 125206 149472 79760 -4810 -25085 41470 56557 90532 124229 95886 77940 40308
$$ packed form
17968A06615N8733L2683J4413o439k1088k762L5481N4085L407j7869o2866m4480
17956A49913j1808l4908N3969k284o4101l5290j1053K1516K4079j5918N805O3665
17944A43585M2170o5889l326j2083J3850j0571L7435j0045J3668O727k8443L4565
17932A61643j0096M417M7059K8379k3357m6200k8736o7189K2755M4404J6140L8227
17920A87446l109o5470k4491K436M4463K0170n7211M8216M5432l6346l4532j7388
17908A09616j3329P706p382m7874k7298L256J7916M353J0764O2610l103l9238
17896G7997K2957O1358J120n5585o281r497l5466k7754P852p665k26N7969L8427
17883A25206K4266o9712q4570k0275O6555J5087L3975L3697k8343j7946l7632
$$ plain form
17872 40308 53900 52275 22650 27063 56822 80962 98528 92314 136236 159750 167658 170962 136004
17859 136004 96043 118145 87251 81348 45884 23683 45043 47178 -13364 -45766 -55338 -49265
17847 -49265 -12059 58039 74670 109358 103649 107851 129896 130872 173422 176182 124397 184250 221721
17834 221721 216949 221960 185153 158468 141095 132724 154982 177434 190969 225377 229257 186925
17822 186925 106335 101646 94449 114049 156780 142787 156857 114583 84975 112871 146351 130215
17810 130215 178621 216691 191678 178420 241730 241968 194840 186970 170936 163036 206398 245680
17798 245680 220914 136712 145771 193644 192198 197819 216301 262632 346516 351631 344948 308530
17786 308530 232161 184739 110677 116328 153849 198017 200760 199413 208103 209225 233533 223730 216641
$$ packed form
17872D0308J3592j625k9625M413K9759K4140J7566o214M3922K3514P908L304l4958
17859A36004l9961K2102l0894n903l5464k2201K1360K135o0542l2402r572O073
17847d9265L7206P0098J6631L4688n709M202K2045R76M2550K760n1785N9853L7471
17834B21721m772N011l6807k6685j7373q371K2258K2452J3535L4408L880m2332
17822A86925q0590m689p197J9600M2731j3993J4070m2274k9608K7896L3480j6136
17810A30215M8406L8070k5013j3258O3310K38m7128p870j6034p900M3362L9282
17798B45680k4766q4202R059M7873j446N621J8482M6331Q3884N115o683l6418
17786C08530p6369m7422p4062N651L7521M4168K743j347Q690J122K4308r803p089
$$ plain form
17773 216641 230698 219165 170033 158904 162995 112107 40338 7942 81963 101407 76799 85097
17761 85097 97677 135096 116087 133113 124389 98635 97267 88902 66681 60680 71036 57979
17749 57979 49793 58307 31250 96311 184426 243105 251320 210719 199990 204647 178688 174661 140153
17736 140153 63421 47219 34579 52222 42289 29714 21156 36445 91688 101768 68890 -3805
17724 -3805 -55901 -2496 35190 54240 40560 -29071 -4563 71512 44681 45954 15232 11804
17712 11804 24448 48790 87478 66218 41106 32321 -13381 -46027 -57487 -60284 -21174 10372
17700 10372 13467 18834 30973 -25750 -69970 -70379 -22774 -50918 -50036 -17647 61601 40331 -8693
17687 -8693 57188 86079 130776 133540 148085 149265 113957 85367 46924 8551 -42543 -115990
$$ packed form
17773B16641J4057j1533m9132j1129M091n0888p1769l2396P4021J9444k4608Q298
17761H5097J2580L7419j9009J7026q724k5754j368q365k2221o001J0356j3057
17749E7979q186Q514k7057O5061Q8115N8679Q215m0601j0729M657k5959m027l4508
17736A40153p6732j6202j2640J7643r933j2575q558J5289N5243J0080l2878p2695
17724c805n2096N3405L7686J9050j3680o9631K4508P6075k6831J273l0722l428
17712A1804J2644K4342L8688k1260k5112q785m5702l2646j1460k797L9110L1546
17700A0372L095N367J2139n6723m4220m09M7605k8144Q82L2389P9248k1270m9024
17687h693O5881K8891M4697K764J4545J180l5308k8590l8443l8373n1094p3447
$$ plain form
17675 -115990 -103215 -55854 -57206 -126410 -110525 -27476 21165 -6262 -113457 -162007 -140114
17664 -140114 -144675 -79575 -24052 -17069 -47820 -64063 -67031 -8708 5022 -65337 -7071 -4583
17652 -4583 -11883 -27966 -6071 5472 -12261 7405 13109 20744 -32016 -67629 -96469 -114613
17640 -114613 -91654 -70427 -91327 -99552 -87558 -44513 -54287 -68819 -33692 17303 49337 62226
17628 62226 13110 -38156 -68379 -98113 -96729 3610 17492 4678 17095 -7167 -44741 -54547
17616 -54547 -8221 -7216 12674 11355 -72129 -36200 -9111 -12247 7328 17334 -20620 23195
17604 23195 58055 -5226 11684 45202 69954 74819 109704 125669 66391 -8881 12686 6005
17592 6005 -41027 -106606 -114673 -84846 -48296 -81019 -68747 -67390 -64680 3694 8301 7573 30444
$$ packed form
17675a15990J2775M7361j352o9204J5885Q3049M8641k7427j07195m8550K1893
17664a40114m561O5100N5523O983l0751j6243k968N8323J3730p0359N8266K488
17652d583p300j6083K1895J1543j7733J9666N704P635n2760l5613k8840j8144
17640a14613K2959K1227k0900q225J1994M3045r774j4532L5127N0995L2034J2889
17628F2226m9116n1266l0223k9734J384J00339J3882j2814J2417k4262l7574r806
17616e4547M6326J005J9890j319q3484L5929K7089l136J9575J0006l7954M3815
17604B3195L4860o3281J6910L3518K4752M865L4885J5965n9278p5272K1567o681
17592F005m7032o5579q067K9827L6550l2723J2272J357K710O8374M607p28K2871
$$ plain form
17579 30444 78110 114907 106335 61244 16893 25026 65543 -743 -15591 -23336 8037 -35562
17567 -35562 -63960 -50378 -13147 13039 -16438 -30947 -10954 -22197 -42068 -70619 -122026 -96082
17555 -96082 -50519 32384 78285 20390 19837 9228 49193 70218 41395 -49138 -111892 -53123
17543 -53123 -40929 -25700 -58888 -118651 -115589 -80476 -66390 -15337 7178 -31011 45747 45598
17531 45598 -31622 -78242 -73573 -45579 44099 46342 -3036 -23833 -46693 -99205 -88358 -71137
17519 -71137 -75307 -77902 -62334 -52736 -90283 -116979 -90004 -23851 10829 -64307 -108298 -126336
17507 -126336 -127034 -129471 -123497 -101480 -67759 -87462 -74834 -34155 -72712 -83272 -60794 17626
17495 17626 27515 34828 22955 22170 -8769 -17596 9743 10582 -4485 -14386 9836 22661 -25808
$$ packed form
17579C0444M7666L6797q572m5091m4351Q133M0517o6286j4848p745L1373m3599
17567c5562k8398J3582L7231K6186k9477j4509J9993j1243j9871k8551n1407K5944
17555i6082M5563Q2903M5901n7895n53j0609L9965K1025k8823r0533o2754N8769
17543e3123J2194J5229l3188n9763L062L5113J4086N1053K2515l8189P6758j49
17531D5598p7220m6620M669K7994Q9678K243m9378k0797k2860n2512J0847J7221
17519g1137m170k595J5568R598l7547k6696K6975O6153L4680p5136m3991j8038
17507a26336o98k437N974K2017L3721j9703J2628M0679l8557j0560K2478P8420
17495A7626R889P313j1873p85l0939q827K7339Q39j5067r901K4222J2825m8469
$$ plain form
17482 -25808 -85338 -86644 -56821 -79571 -89367 -60263 -79315 -35561 -4452 -29920 4391 -1950
17470 -1950 14610 44737 -11723 45120 50851 8177 -33428 -27912 -95277 -96477 -115054 -19611
17458 -19611 44181 74353 76486 59775 36200 -10171 -21447 -46828 -83091 -67199 7897 56593
17446 56593 76498 39122 51846 138445 246237 403318 362585 328765 276563 166208 95622
17435 95622 92630 101421 116167 90585 29392 15618 10864 11368 20798 -34742 -45342 -34930 -13848
17422 -13848 41339 78455 66094 59517 70926 39686 71097 62312 23370 5876 -19256 -27643
17410 -27643 -10370 -5636 8268 -4412 5204 4542 75173 62322 64036 23174 22574 39742 25741
17397 25741 -11667 478 10141 -32196 -68096 -20303 14353 33038 -13661 -14356 -10342 -31365
$$ packed form
17482b5808n9530j306K9823k2750r796K9104j9052M3754L1109k5468L4311o341
17470a950J6560L0127n6460N6843N731m2674m1605N516o7365j200j8577R5443
17458a9611O3792L0172K133j6711k3575m6371j1276k5381l6263J5892P5096M8696
17446E6593J9905l7376J2724Q6599J07792J57081m0733l3820n2202j10355p0586
17435I5622k992Q791J4746k5582o1193j3774m754N04R430n5540j0600J0412K1082
17422a3848N5187L7116j2361o577J1409l1240L1411q785l8942j7494k5132q387
17410b7643J7273M734J3904j2680R616o62P0631j2851J714m0862o00J7168j4001
17397B5741l7408J2145R663m2337l5900M7793L4656J8685m6699o95M014k1023
$$ plain form
17385 -31365 -77931 -98809 -21898 45038 49737 18579 -44054 5465 44848 -44173 -83602 -52125
17373 -52125 165 -6999 7928 8271 -9790 -47925 -29210 -8836 -24525 -40913 -17221 -43720
17361 -43720 -66884 -44314 -56896 -63428 -62365 -5660 20296 -9188 -17364 15999 30885 28355
17349 28355 3247 -19838 -8851 -47731 -66675 -64339 -57776 24384 66359 59565 71723 97220
17337 97220 69250 26299 45370 -15378 -40312 2689 75077 43821 25188 18476 -20102 -14332
17325 -14332 40119 116606 120439 56597 44309 39580 72928 12520 -68805 -81652 -44984 -41884
17313 -41884 -79117 -62315 -59985 -95791 -83587 -56218 -60890 -57517 -65393 -61731 -24067 -1668 21562
17300 21562 41045 2574 -13810 -638 -72745 -90984 19466 89306 105350 29834 9616
$$ packed form
17385c1365m6566k0878P6911O6936M699l1158o2633M9519L9383q9021l9429L1477
17373e2125N2290p164J4927L43j8061l8135J8715K0374j5689j6388K3692k6499
17361d3720k3164K2570j2582o532J063N6705K5956k9484q176L3363J4886k530
17349B8355k5108k3085J0987l8880j8944K336O563Q2160M1975o794J2158K5497
17337I7220k7970m2951J9071o0748k4934M3001P2388l1256j8633o712l8578N770
17325a4332N4451P6487L833o3842j2288m729L3348o0408q1325j2847L6668L100
17313d1884l7233J6802K330l5806J2204K7369m672L373p876L662L7664K2399K3230
17300B1562J9483l8471j6384J3172p2107j8239J10450O9840J6044p5516k0218
$$ plain form
17289 9616 -21007 -61723 -54658 16116 30032 26875 90495 112664 105778 92528 54268 81603
17277 81603 28936 57805 81112 47490 201 -44395 28165 31235 46330 87710 49305 63951
17265 63951 100112 102750 143981 169093 183964 141382 139294 169843 237365 219706 152725 86288
17253 86288 45089 59872 142518 136251 83516 73135 85401 87757 83687 116327 70795 26400
17241 26400 64626 100361 138720 162920 92070 104657 167103 175055 150003 131841 186816 260444
17229 260444 210723 115843 119350 174629 196770 182185 180593 184427 137833 113064 80572 45269
17217 45269 42306 62063 62830 127417 200033 170052 186009 163694 120374 142505 203656 253184
17205 253184 190154 146396 102714 72511 68740 95770 112517 124882 118971 61748 50785 116255
$$ packed form
17289I616l0623m0716P065P0774J3916l157O3620K2169o886j3250l8260K7335
17277H1603n2667K8869K3307l3622m7289m4596P2560L070J5095M1380l8405J4646
17265F3951L6161K638M1231K5112J4871m2582k088L0549O7522j7659o6981o6437
17253H6288m1199J4783Q2646o267n2735j0381J2266K356m070L2640m5532m4395
17241B6400L8226L5735L8359K4200p0850J2587O2446P952k5052j8162N4975P3628
17229B60444m9721r4880L507N5279K2141j4585j592L834m6594k4769l2492l5303
17217D5269k963J9757P67O4587P2616k9981J5957k2315m3320K2131O1151M9528
17205B53184o3030m3758m3682l0203l771K7030J6747J2365n911n7223j0963O5470
$$ plain form
17193 116255 146051 172553 164207 158336 232005 267979 209804 208152 216273 184792 133440 111506
17181 111506 123624 143102 82136 42583 44109 62474 138888 120706 92024 84937 60128 47004
17169 47004 69578 26343 49186 107298 61854 -10919 -26621 1969 8598 -9652 28579 -4920
17157 -4920 -44085 -60440 -47712 -53121 -35223 -12891 -6465 -33640 -41842 -47711 -5298 53378 38829
17144 38829 -8848 9163 17154 69972 39036 34032 35009 -28594 18418 45065 55489 -35001
17132 -35001 -78843 -20697 -18035 -18191 7207 -73246 -138979 -117383 -104074 -78746 -79753 -24953
17120 -24953 9189 37002 69238 60343 -8120 -26026 -34224 -89713 -136300 -139803 -69612 -32040
17108 -32040 -95172 -113621 -88147 -34128 1663 19143 35195 47844 36534 3019 -53253 -40208
$$ packed form
17193A16255K9796K6502q346n871P3669L5974n8175j652Q121l1481n1352k1934
17181A11506J2118J9478o0966l9553J526J8365P6414j8182k8682p087k4809j3124
17169D7004K2574m3235K2843N8112m5444p2773j5702K8590O629j8250L8231l3499
17157d920l9165j6355J2728n409J7898K2332O426k7175q202n869M2413N8676j4549
17144C8829m7677J8011P991N2818l0936n004R77o3603M7012K6647J0424r0490
17132c5001m3842N8146K662j56K5398q0453o5733K1596J3309K5328j007N4800
17120b4953L4142K7813L2236q895o8463j7906q198n5489m6587l503P0191L7572
17108c2040o3132j8449K5474N4019L5791J7480J6052J2649j1310l3515n6272J3045
$$ plain form
17096 -40208 -40620 -255 13029 34138 -6077 -8946 70035 92714 53562 84294 51261 12573
17084 12573 36123 21085 8170 -2521 -61436 -88654 -73023 -28452 6090 22324 -58801 -71479
17072 -71479 -71423 -82086 -54130 -53483 -109036 -86081 -57934 -99149 -70245 -58791 -50955 -63337 -96295
17059 -96295 -131026 -164087 -106086 -37774 -45230 -88745 -82977 -106060 -85108 -63886 -28145 -8709
17047 -8709 -94747 -88610 -56061 -14703 18191 -6679 -38488 -22743 10128 3073 -33093 -48043
17035 -48043 -14890 -1596 -36399 -61013 -68339 -44222 -8048 -65112 -87130 -102248 -55898 -47134
17023 -47134 -61 4543 -35277 -67764 -113224 -134674 -102342 -81459 -22613 59316 12716 -18847
17011 -18847 -25104 -15272 4497 -29229 -31786 106473 108356 -2126 -39444 -24549 -11433 -15535
$$ packed form
17096d0208m12M0365J3284K1109m0215k869P8981K2679l9152L0732l3033l8688
17084A2573K3550j5038j2915j0691n8915k7218J5631M4571L4542J6234q1125j2678
17072g1479N6j0663K7956O47n5553K2955K8147m1215K8904J1454P836j2382l2958
17059i6295l4731l3061N8001O8312p456m3515N768k3083K0952K1222L5741J9436
17047h709q6038O137L2549M1358L2894k4870l1809J5745L2871p055l6166j4950
17035d8043L3153J3294l4803k4614p326K4117L6174n7064k2018j5118M6350Q764
17023d7134M7073M604l9820l2487m5460k1450L2332K0883N8846Q1929m6600l1563
17011a8847o257R832J9769l3726k557J38259J883j10482l7318J4895J3116m102
$$ plain form
16999 -15535 -61356 -56949 -22926 32987 52701 31508 6872 -9371 -49914 -35894 -51482 -58749
16987 -58749 -9983 9966 24524 -15311 -70871 -158082 -143098 -154412 -119620 -64788 -54926 -62058
16975 -62058 -72529 -57179 -96246 -136393 -158064 -91754 -87914 -109257 -112382 -40244 -4125 -52933
16963 -52933 -87931 -86590 -76964 -49430 -71922 -73813 -57785 -25434 34190 36536 20527 -18558
16951 -18558 -88857 -112692 -96559 -83412 -32907 -11430 -39009 16425 30493 24252 10485 -23481
16939 -23481 -35961 17834 7674 -12086 -19365 -34256 -19463 6168 58859 60850 6295 -13305
16927 -13305 14960 -46905 -22845 -49461 -75459 -113870 -127340 -123397 -105048 -113063 -90673 -42988
16915 -42988 -8809 -88362 -127553 -106855 -50010 -26112 1977 -29942 -23941 -27637 -24989 -20787
$$ packed form
16999a5535m5821M407L4023N5913J9714k1193k4636j6243m0543J4020j5588p267
16987e8749M8766J9949J4558l9835n5560q7211J4984j1314L4792N4832R862p132
16975f2058j0471J5350l9067m0147k1671O6310L840k1343l125P2138L6119m8808
16963e2933l4998J341R626K7534k2492j891J6028L2351N9624K346j6009l9085
16951a8558p0299k3835J6133J3147N0505K1477k7579N5434J4068o241j3767l3966
16939b3481j2480N3795j0160j9760p279j4891J4793K5631N2691J991n4555j9600
16927a3305K8265o1865K4060k6616k5998l8411j3470L943J8349q015K2390M7685
16915d2988L4179p9553l9191K0698N6845K3898K8089l1919O001l696K648M202
$$ plain form
16903 -20787 -50890 -64285 -29032 -69919 -71509 -36891 -61059 -60128 27607 54297 -34339 -72251
16891 -72251 -61936 -27596 -92607 -147156 -134474 -29228 65279 36659 -24725 -70980 -79535 -20618
16879 -20618 3285 -48338 -25602 -13294 5439 2959 -53204 -59757 -51094 -53370 -73860 -71515 -44891
16866 -44891 -52451 -54621 785 15516 -48533 -78345 -125872 -127309 -84766 -73201 -94357 -30526
16854 -30526 -3085 18813 40048 31697 -53148 -25363 23086 -41520 -31545 -62999 -30335 -32956
16842 -32956 -92111 -77607 -19557 -39590 -122406 -188868 -153091 -133941 -89962 -53787 -48120 -83398
16830 -83398 -47584 -29950 -95666 -118664 -82812 -79883 -9242 5857 -65942 -73659 -26770 -43278
16818 -43278 -38323 -5165 30583 2587 -59974 -64043 -55045 -79494 -112181 -86183 -38550 -27441
$$ packed form
16903b0787l0103j3395L5253m0887j590L4618k4168R31Q7735K6690q8636l7912
16891g2251J0315L4340o5011n4549J2682J05246R4507k8620o1384m6255q555N8917
16879b0618K3903n1623K2736J2308J8733k480n6163o553Q663k276k0490K345K6624
16866d4891p560k170N5406J4731o4049k9812m7527j437M2543J1565k1156O3831
16854c0526K7441K1898K1235q351q4845K7785M8449o4606R975l1454L2664k621
16842c2956n9155J4504N8050k0033q2816o6462L5777J9150M3979L6175N667l5278
16830h3398L5814J7634o5716k2998L5852K929P0641J5099p1799p717M6889j6508
16818d3278M955L3158L5748k7996o2561m069Q998k4449l2687K5998M7633J1109
$$ plain form
16806 -27441 15537 2437 4217 1208 -4731 -18003 -37014 -47496 -69479 -104716 -75875 -3364
16794 -3364 8889 -19004 -102125 -114740 -26364 -12427 15287 -20890 -75664 -50135 -71446 -92568
16782 -92568 -52843 -86024 -73039 -41040 -20137 -23580 -61798 -80295 -81701 -73312 -31219 -28407
16770 -28407 -45418 -86570 -49863 8439 51264 64175 13736 7422 -19697 -62371 -52851 -14837
16758 -14837 16046 -35696 -73064 -38825 34377 27093 23220 -27413 -80200 -84862 -102267 -67464
16746 -67464 -40076 -19199 -43361 -5902 -8732 -61941 -40803 -5369 -2126 12737 52707 57290
16734 57290 13810 38349 30081 329 34040 14732 -33552 -19353 23080 57542 109845 73056
16722 73056 7597 -23243 -85635 -150300 -121089 -96826 -27022 41776 56121 16119 -44705 -77407
$$ packed form
16806b7441M2978j3100J780l009n939j3272j9011j0482k1983l5237K8841P2511
16794c364J2253k7893q3121j2615Q8376J3937K7714l6177n4774K5529k1311k1122
16782i2568L9725l3181J2985L1999K0903l443l8218j8497j406Q389M2093K812
16770b8407j7011m1152L6707N8302M2825J2911n0439o314k7119m2674R520L8014
16758a4837L0883n1742l7368L4239P3202p284l873n0633n2787m662j7405L4803
16746f7464K7388K0877k4162L7459k830n3209K1138L5434L243J4863L9970M583
16734E7290m3480K4539q268k9752L3711j9308m8284J4199M2433L4462N2303l6789
16722G3056o5459l0840o2392o4665K9211K4263O9804O8798J4345m0002o0824l2702
$$ plain form
16710 -77407 -79454 -125156 -81799 -68582 -109952 -61054 -13911 16810 18327 -6510 7756 -8437
16698 -8437 22626 7934 -22521 10496 1921 -18732 -109814 -127761 -103927 -91838 -94586 -134299
16686 -134299 -73203 -67463 -92559 -94405 -53600 -20066 -16961 -20963 18136 61234 43600 10500
16674 10500 -38589 4890 22298 62326 69543 42681 -439 -69848 -53917 -65060 -103306 -64941
16662 -64941 -63881 -47870 -109029 -135437 -70965 992 -27404 -41198 -59650 -78924 -82014 26177
16650 26177 7816 -31392 -89329 -51307 -28331 -61914 -75098 27820 85363 18736 -26876
16639 -26876 -8523 -31636 -30528 -45602 -1123 -41811 -59853 -60716 -48508 -52920 -59944 -29691 -38956
16626 -38956 20663 30833 32682 4026 -38134 -66056 -49529 6928 -17273 17094 4191 -70670
$$ packed form
16710g7407k047m5702M3357J3217m1370M8898M7143L0721J517k4837J4266j6193
16698h437L1063j4692l0455L3017q575k0653r1082j7947K3834J2089k748l9713
16686a34299O1096N740k5096j846M0805L3534L105m002L9099M3098j7634l3100
16674A0500m9089M3479J7408M0028P217k6862m3120o9409J5931j1143l8246L8365
16662f4941J060J6011o1159k6408O4472P1957k8396j3794j8452j9274l090J08191
16650B6177j8361l9208n7937L8022K2976l3583j3184J02918N7543o6627m5612
16639b6876J8353k3113J108j5074M4479m0688j8042q63J2208m412p024L0253r265
16626c8956N9619J0170J849k8656m2160k7922J6527N6457k4201L4367j2903p4861
$$ plain form
16614 -70670 -85583 -34785 -58502 -67496 49394 27936 -6045 541 46264 134454 78885 42357
16602 42357 30429 -28617 -24177 -11774 -42760 -30094 -56297 -55255 -44317 -45286 -12233 23799
16590 23799 13623 -12280 30089 27222 -876 984 -10074 35833 17841 -19404 7038 -29144
16578 -29144 -52903 -65726 -81058 -107595 -41311 -5817 -35641 -56903 -65584 -43655 -25581 -3957
16566 -3957 -920 -75588 -105104 -97667 16057 63401 2868 -40854 -76754 -88611 -30401 31072
16554 31072 41160 20131 -11775 -3746 26174 28792 23604 -26965 -29278 -23369 -56157 -75582 -69052
16541 -69052 -46085 -84343 -86291 -71210 -61325 -31420 -41513 -11880 66284 85093 84709 50244
16529 50244 -17943 -64126 -71611 -30301 -28450 -50033 -59152 1362 -12356 5144 -25734 -93820
$$ packed form
16614g0670j4913N0798k3717q994J16890k1458l3981O586M5723Q8190n5569l6528
16602D2357j1928n9046M440J2403l0986J2666k6203J042J0938r69L3053L6032
16590B3799j0176k5903M2369k867k8098J860j1058M5907j7992l7245K6442l6182
16578b9144k3759j2823j5332k6537O6284L5494k9824k1262q681K1929J8074K1624
16566c957L037p4668k9516P437J13724M7344o0533m3722l5900j1857N8210O1473
16554C1072J0088k1029l1906Q029K9920K618n188n0569k313N909l2788j9425O530
16541f9052K2967l8258j948J5081R885K9905j0093K9633P8164J8809l84l4465
16529E0244o8187m6183p485M1310J851k1583r119O0514j3718J7500l0878o8086
$$ plain form
16517 -93820 -90751 -52653 -54520 -73816 -94282 -152463 -154318 -138319 -40310 32647 22781 -15756
16505 -15756 -35770 -48327 -51191 -91193 -105150 -96876 -82714 -65351 -31530 4583 22283 29561
16493 29561 14944 -22515 -14342 22154 -43149 -66145 -71533 -57599 -66087 -74665 -88888 -61092
16481 -61092 -26192 -63162 -68571 -21812 12658 13280 38490 19832 -54124 -59986 -50629 -41063 -19350
16468 -19350 14508 20298 2027 -15812 -60739 -96072 -125492 -125294 -74841 -69292 -72431 -104196 -128181
16455 -128181 -28913 9329 -58874 -56308 -7374 -15590 -88810 -81137 -111559 -115136 -122166 -63181
16443 -63181 -69752 -73012 -41352 -100134 -107472 -95114 -51661 1039 6788 -731 -4069 -31628 -37150
16430 -37150 -49283 -100642 -98754 -70652 -60781 -66362 -85160 -79310 -20475 58086 31966 -23499
$$ packed form
16517i3820L069L8098j867j9296k0466n8181j855J5999R8009P2957r866l8537
16505a5756k0014j2557k864m0002j3957Q274J4162J7363L3821L6113J7700P278
16493B9561j4617l7459Q173L6496o5303k2996n388J3934q488q578j4223K7796
16481f1092L4900l6970n409M6759L4470O22K5210j8658p3956n862R357R566K1713
16468a9350L3858N790j8271j7839m4927l5333k9420J98N0453N549l139l1765k3985
16455a28181R9268L8242o8203K566M8934q216p3220P673l0422l577p030N8985
16443f3181o571l260L1660n8782p338J2358M3453N2700N749p519l338k7559n522
16430c7150j2133n1359J888K8102R871n581j8798N850N8835P8561k6120n5465
$$ plain form
16418 -23499 -46737 -98986 -118263 -99301 -85720 -57681 -53544 -21287 32947 -41741 -120150 -110539
16406 -110539 -100051 -75637 -113629 -75076 -55121 -118344 -82436 -114639 -99968 -31875 -45899
16395 -45899 -64706 -34501 -16620 -15474 -60862 -95141 -119974 -143901 -120610 -65430 -12679 20289
16383 20289 17234 30008 3206 -29053 -52209 -64869 -50102 -47429 -34823 -27477 -37204 -27370 -73847
16370 -73847 -95368 -51372 -27387 -39859 -73036 -79694 -88272 -75401 -124971 -135825 -99437 -67983
16358 -67983 -27253 -8238 -58970 -62318 -70343 -66011 -13862 -1047 -18029 -37613 -40013 -18674
16346 -18674 54152 135836 104269 29466 -32379 -33802 -42616 -30138 -31339 -45981 22121 78005
16334 78005 38240 48765 9414 -53313 -48421 12757 29597 11068 34811 -9686 -53276 -39853
$$ packed form
16418b3499k3238n2249j9277J8962J3581K8039M137L2257N4234p4688p8409R611
16406a10539J0488K4414l7992L8553J9955o3223L5908l2203J4671O8093j4024
16395d5899j8807L0205J7881J146m5388l4279k4833k3927K3291N5180N2751L2968
16383B0289l055J2774k6802l2259k3156j2660J4767K673J2606P346r727R834m6477
16370g3847k1521M3996K3985j2472l3177o658q578J2871m9570j0854L6388L1454
16358f7983M0730J9015n0732l348q025M332N2149J2815j6982j9584k400K1339
16346a8674P2826Q1684l1567p4803o1845j423q814J2478j201j4642O8102N5884
16334G8005l9765J0525l9351o2727M892O1178J6840j8529K3743m4497m3590J3423
$$ plain form
16322 -39853 33302 27953 27817 50744 106742 128705 116703 99483 59144 -6434 -5522 -12841 -67
16309 -67 13921 53602 33759 28159 35609 -1235 3036 33026 51441 -16264 -35059 16470 60182
16296 60182 27646 -60761 -72365 -45496 26750 52168 50181 15074 -28669 -81619 -157795 -131928
16284 -131928 -43845 43098 61305 13458 -9686 -12860 14792 20380 54203 75723 27007 31183
16272 31183 30542 5037 3110 -21156 13639 46819 27301 -39965 -45719 16556 69592 40340
16260 40340 45146 119755 94798 -24744 -53918 10644 16584 -17754 -45528 -10912 5291 -35696
16248 -35696 -54233 -41218 -39623 -67284 -55502 -51437 -64280 -76784 -40732 2188 -12132 -30329
16236 -30329 29539 75879 36122 31262 -7551 10313 23424 -36994 -82042 -57086 3215 23728
$$ packed form
16322c9853P3155n349j36K2927N5998K1963j2002j7220m0339o5578R12p319J2774
16309f7J3988L9681j9843n600P450l6844M271K9990J8415o7705j8795N1529M3712
16296F0182l2536q8407j1604K6869P2246K5418j987l5107m3743n2950p6176K5867
16284a31928Q8083Q6943J8207m7847k3144l174K7652N588L3823K1520m8716M176
16272C1183o41k5505j927k4266L4795L3180j9518o7266n754O2275N3036k9252
16260D0340M806P4609k4957j19542k9174O4562N940l4338k7774L4616J6203m0987
16248c5696j8537J3015J595k7661J1782M065j2843j2504L6052M2920j4320j8197
16236c0329N9868M6340l9757m860l8813J7864J3111o0418m5048K4956O0301K0513
$$ plain form
16224 23728 -27540 -96044 -97190 -84113 -62391 -103959 -96655 -87211 -20446 -58608 -66219 -15066
16212 -15066 -20214 -40090 -28024 -4024 -15374 -40513 -60144 -31090 -7202 20237 -9967 -39559
16200 -39559 -21998 -41032 -21818 -8079 52540 88731 51409 45150 22334 -32573 -52945 -95842
16188 -95842 -95433 -95143 -13749 9926 3103 -21334 -13231 4654 23400 7469 26341 14679 11773
16175 11773 9580 9472 -25069 -2189 39787 66697 11878 -649 -20143 -43362 -54010 -46731
16163 -46731 -66521 -73713 -16010 58936 16402 -25657 -10558 7751 -14975 -2187 -12594 -47455
16151 -47455 -71307 -47870 15725 31306 35041 40198 58286 12577 20572 4424 2767 -60612
16139 -60612 -96333 -64946 -87736 -72481 -26534 53028 70893 58331 50239 25919 -33168 -18382
$$ packed form
16224B3728n1268o8504j146J3077K1722m1568P304R444O6765l8162p611N1153
16212a5066n148j9876J2066K4000j1350k5139j9631K9054K3888K7439l0204k9592
16200c9559J7561j9034J9214J3739O0619L6191l7322o259k2816n4907k0372m2897
16188i5842M09K90Q1394K3675o823k4437Q103J7885J8746j5931J8872j1662k906
16175A1773k193j08l4541K2880M1976K6910n4819j2527j9494k3219j0648P279
16163d6731j9790p192N7703P4946m2534m2059J5099J8309k2726J2788j0407l4861
16151d7455k3852K3437O3595J5581L735N157J8088m5709P995j6148j657o3379
16139f0612l5721L1387k2790J5255M5947P9562J7865j2562q092k4320n9087J4786
$$ plain form
16127 -18382 -4056 13243 3372 33548 23813 22345 15194 10159 38249 53749 48785 10150 -18704
16114 -18704 4659 -10816 68154 82890 34428 19271 44382 22311 3780 -40534 -19243 18794
16102 18794 13700 34346 8005 8187 39239 68851 39917 -9785 -8241 12316 63604 82903
16090 82903 49688 -47788 -88674 -61102 -15926 -52857 -34761 -7469 23483 7539 5307 15611
16078 15611 -23483 13458 6883 14709 10488 6876 5213 -23188 -87916 -120516 -134925 -96359 -52698
16065 -52698 -38546 -62595 -64898 -24712 -33925 -39503 -34373 -20898 16500 39206 31316 48195 94787
16052 94787 57598 -13235 -46693 -47245 -46199 -105633 -58695 20588 33048 14201 -18030 32124
16040 32124 31547 -27679 -12664 11174 37310 50014 74846 44603 26109 -19127 -74144 -42183
$$ packed form
16127a8382J4326J7299r871L0176r735j468p151n035K8090J5500m964l8635k8854
16114a8704K3363j5475P8970J4736m8462j5157K5111k2071j8531m4314K1291L8037
16102A8794n094K0646k6341J82L1052K9612k8934m9702J544K0557N1288J9299
16090H2903l3215r7476m0886K7572M5176l6931J8096K7292L0952j5944k232J0304
16078A5611l9094L6941o575P826m221l612j663k8401o4728l2600j4409L8566M3661
16065e2698J4152k4049k303M0186r213n578N130J3475L7398K2706p890J6879M6592
16052I4787l7189p0833l3458n52J046n9434M6938P9283J2460j8847l2231N0154
16040C2124n77n9226J5015K3838K6136J2704K4832l0243j8494m5236n5017L1961
$$ plain form
16028 -42183 -2093 18590 13105 -29343 -26023 -44063 -62303 -26376 -70515 -120784 -162946 -149256
16016 -149256 -85873 -66466 -73410 -57052 -46150 -29187 -49106 -86867 -101839 -77126 -39165 -41430
16004 -41430 -23635 -45995 -78791 -48712 -11553 -32354 2863 20914 53616 6036 -42776 -57126
15992 -57126 25725 40321 33520 -13803 -4689 -20533 20051 3154 17467 48991 -2621 -23158
15980 -23158 -36734 -14165 7403 7282 17810 55967 45539 -12474 -57066 -25879 33854 40262
15968 40262 178 -295 40399 94193 56158 755 12317 46338 32032 1663 -30374 17380
15956 17380 85803 57982 28290 16403 27314 -1457 1990 38130 -1086 -7856 -5590 38115
15944 38115 4251 -25601 -40675 -38142 -26579 -13794 6126 11102 34540 25626 -11634 -71250
$$ packed form
16028d2183M0090K0683n485m2448L320j8040j8240L5927m4139n0269m2162J3690
16016a49256O3383J9407o944J6358J0902J6963j9919l7761j4972K4713L7961k265
16004d1430J7795k2360l2796L0079L7159k0801L5217J8051L2702m7580m8812j4350
15992e7126Q2851J4596o801m7323R114j5844M0584j6897J4313L1524n1612k0537
15980b3158j3576K2569K1568j21J0528L8157j0428n8013m4592L1187N9733O408
15968D0262m0084m73M0694N3794l8035n5403J1562L4021j4306l0369l2037M7754
15956A7380O8423k7821k9692j1887J0911k8771L447L6140l9216o770K266M3705
15944C8115l3864k9852j5074K533J1563J2785J9920M976K3438q914l7260n9616
$$ plain form
15932 -71250 -54653 -8458 -28953 -34336 -39522 -54675 -88315 -85592 -66447 -38319 22546 6830
15920 6830 -28691 -71044 -130293 -70392 -28787 -23139 -57264 -56127 -71082 -45656 -26189 -59105
15908 -59105 -127851 -114510 -65373 -52043 -22112 -6247 -25548 -29122 -9562 -28704 -74903 -75092
15896 -75092 -61859 -77766 -102340 -109332 -71818 -108500 -85922 -133959 -108505 -29534 -32963 -38588
15884 -38588 28968 105745 114623 64366 -7407 -88367 -46694 -12527 -85335 -37474 -32083 -43304
15872 -43304 -55151 -46293 11013 3598 -17604 -60848 -29127 14214 -35971 -28896 28973 66983
15860 66983 46838 57158 82018 75343 126814 100632 58492 25810 -61618 -105628 -119845 -96687
15848 -96687 -73568 -23947 42761 50310 49021 54614 51225 9772 -25405 53077 78346 56368
$$ packed form
15932g1250J6597M6195k0495n383n186j5153l3640K723J9145K8128O0865j5716
15920F830l5521m2353n9249N9901M1605N648l4125J137j4955K5426J9467l2916
15908e9105o8746J3341M9137J3330K9931J5865j9301l574J9560j9142m6199j89
15896g5092J3233j5907k4574o992L7514l6682K2578m8037K5454P8971l429n625
15884c8588O7556P6777Q878n0257p1773q0960M1673L4167p2808M7861N391j1221
15872d3304j1847Q858N7306p415k1202m3244L1721M3341n0185P075N7869L8010
15860F6983k0145J0320K4860o675N1471k6182m2140l2682q7428m4010j4217K3158
15848i6687K3119M9621O6708P549j289N593l389m1453l5177P8482K5269k1978
$$ plain form
15836 56368 29144 -24820 -36671 -41983 -63442 -90165 -141248 -132035 -62777 9551 16381 -26133
15824 -26133 -30326 -59626 -68536 34375 71573 72043 15938 -33266 -58417 -34976 -30263 -27586 -26438
15811 -26438 -12345 8592 -31671 -52983 -17582 -19347 -61417 -64294 -72754 -35941 51286 84675
15799 84675 82581 37726 15346 19747 13691 -37292 -88796 -55388 13364 -22109 -7553 48992
15787 48992 87311 69450 -5875 -59912 -46990 -80776 -30112 22402 46533 35570 69479 60274
15775 60274 23354 -1037 -17884 9362 33395 88645 72592 -47017 -83618 -116385 -112808 -67338
15763 -67338 12599 13343 -22545 13919 50575 20422 10795 45602 132900 136564 96390 63522
15751 63522 88427 94703 81797 27996 32970 39361 44371 55942 37778 -10435 2572 -11272
$$ packed form
15836E6368k7224n3964j1851n312k1459k6723n1083R213O9258P2328O830m2514
15824b6133m193k9300q910J02911L7198M70n6105m9204k5151K3441M713K677J148
15811b6438J4093K0937m0263k1312L5401j765m2070k877q460L6813Q7227L3389
15799H4675k094m4855k2380M401o056n0983n1504L3408O8752l5473J4556N6545
15787D8992L8319j7861p5325n4037J2922l3786N0664N2514K4131j0963L3909r205
15775F0274l6920k4391j6847K7246K4033N5250j6053j19609l6601l2767L577M5470
15763f7338P9937P44l5888L6464L6656l0153r627L4807Q7298L664m0174l2868
15751F3522K4905O276j2906n3801M974O391N010J1571j8164m8213J3007j3844
$$ plain form
15739 -11272 -57423 -134307 -121705 -143506 -48715 67545 111275 105328 77742 11766 17865 53942
15727 53942 100030 96675 86205 37578 33318 39793 34732 42331 44041 34412 31518 -13886 -49789
15714 -49789 -62059 -29919 -53944 -127818 -118094 -76214 -55789 -75326 -17547 563 -14244 30352
15702 30352 58622 66434 14937 -43014 -5826 7336 -26351 -59977 -104688 -76418 2297 52285
15690 52285 8471 22954 44980 60251 28869 39994 28028 25011 -14641 -3289 21968 -29484
15678 -29484 -89366 -47563 -5419 -3361 23644 8264 29866 50715 70041 128250 116176 7250
15666 7250 -58471 -59405 -82068 -66099 -80996 -141794 -75095 -36474 -70479 -81029 -89190 -64631
15654 -64631 -91862 -114826 -70884 -118686 -160044 -143689 -52031 38439 72564 -21696 -62329 -25153
$$ packed form
15739a1272m6151p6884J2602k1801R4791J16260M3730n947k7586o5976O099L6077
15727E3942M6088l355j0470m8627m260O475n061P599J710r629k894m5404l5903
15714d9789j2270L2140k4025p3874R724M1880K0425j9537N7779J8110j4807M4596
15702C0352K8270P812n1497n7951L7188J3162l3687l3626m4711K8270P8715M9988
15690E2285m3814J4483K2026J5271l1382J1125j1966l017l9652J1352K5257n1452
15678b9484n9882M1803M2144K058K7005j5380K1602K0849J9326N8209j2074j08926
15666G250o5721r34k2663J5969j4897o0798O6699L8621l4005j0550q161K4559
15654f4631k7231k2964M3942m7802m1358J6355R1658R0470L4125r4260m0633L7176
$$ plain form
15642 -25153 11708 19617 5817 9785 -73031 -141377 -161413 -133323 -93965 -38479 -9567 -25546
15630 -25546 -87281 -66701 8389 58055 85209 59242 -9665 -30571 -10196 7178 19126 42533
15618 42533 50391 21215 6092 -29982 -53434 -46930 -15402 -13529 -1653 47850 71804 -16470
15606 -16470 -92798 -76034 -37029 -39491 -23268 26718 16480 -21851 -84096 -69841 -65853 -15030
15594 -15030 6413 -38733 -87260 -102259 -84421 -356 57733 42591 -4067 -37855 604 38510
15582 38510 34171 -5238 -28183 -55749 -47087 -64972 -52600 -94895 -90625 -91575 -55650 -52785 -124893
15569 -124893 -105340 -83039 -20140 -13014 -749 -30695 -21948 5597 636 11577 -7900 -48817
15557 -48817 -91312 -107704 -78045 -35997 -26820 -60093 -139876 -102796 -64321 28193 71031 78506
$$ packed form
15642b5153L6861P909j3800L968q2816o8346k0036K8090L9358N5486K8912j5979
15630b5546o1735K0580P5090M9666K7154k5967o8907k0906K0375J7374J1948K3407
15618D2533P858k9176j5123l6074k3452O504L1528J873J1876M9503K3954q8274
15606a6470p6328J6764L9005k462J6223M9986j0238l8331o2245J4255L988N0823
15594a5030K1443m5146m8527j4999J7838Q4065N8089j5142m6658l3788L8459L7906
15582C8510m339l9409k2945k7566Q662j7885J2372m2295M270r50L5925K865p2108
15569a24893J9553K2301O2899P126J2265k9946Q747K7545m961J0941j9477m0917
15557d8817m2495j6392K9659M2048R177l3273p9783L7080L8475R2514M2838P475
$$ plain form
15545 78506 -25994 -4589 28301 25204 409 -17918 -15841 6830 2498 7444 -31627 -39691
15533 -39691 -80332 -126525 -118142 -66064 -53233 -78280 -60079 -34988 -41506 -27320 -18954 -6822
15521 -6822 -54295 -63937 -41331 39794 79630 20342 601 20281 10443 46140 47245 13342
15509 13342 -35260 -47635 -26834 613 -26741 -79057 -74864 -75402 -81978 -95400 -52662 7175
15497 7175 58404 69252 -1507 -62190 -139378 -130819 -68084 9972 59755 34215 39879 -44923
15485 -44923 -98904 -124814 -108040 -102451 -56928 -46818 -62690 -20585 27102 -135 23280 12185
15473 12185 -67403 -44928 -19113 -25190 -19340 -47659 -75695 1647 28542 -12820 -29663 -86925
15461 -86925 -73837 -12305 11480 -20483 -32938 -36928 6365 17792 7321 36263 37125 50035
$$ packed form
15545G8506j04500K1405L2890l097k4795j8327K077K2671m332M946l9071q064
15533c9691m0641m6193Q383N2078J2831k5047J8201K5091o518J4186Q366J2132
15521f822m7473r642K2606Q1125L9836n9288j9741J9680r838L5697J105l3903
15509A3342m8602j2375K0801K7447k7354n2316M193n38o576j3422M2738N9837
15497G175N1229J0848p0759o0683p7188Q559O2735P8056M9783k5540N664q4802
15485d4923n3981k5910J6774N589M5523J0110j5872M2105M7687k7237K3415j1095
15473A2185p9588K2475K5815o077N850k8319k8036P7342K6895m1362j6843n7262
15461h6925J3088O1532K3785l1963j2455l990M3293J1427j0471K8942Q62J2910
$$ plain form
15449 50035 14982 -34459 28595 45908 100774 149095 84767 34335 15129 14635 31426 82784
15437 82784 52407 12552 -25241 -71877 -98306 -92605 -53623 3622 -24690 -12315 25778 13013
15425 13013 25291 34100 69009 88433 18885 28758 8812 6609 -17674 -18452 -19416 -15963 33767
15412 33767 21447 14735 9290 -13966 -56593 -42845 -46695 -123004 -128582 -71260 -21577 3739
$$ packed form
15449E0035l5053m9441O3054J7313N4866M8321o4328n0432j9206m94J6791N1358
15437H2784l0377l9855l7793m6636k6429N701L8982N7245k8312J2375L8093j2765
15425A3013J2278Q809L4909J9424o9548R873j9946k203k4283p78r64L453M9730
15412C3767j2320o712n445k3256m2627J3748l850p6309n578N7322M9683K5316
$$ [...]
##END NTUPLES=NMR SPECTRUM
##END=
