##TITLE=Analysis number 312001
Compound Code cc 41909
Book Reference 437/24
Project Code adrs
Chemist Name wendyb
##JCAMPDX= 6.0         $$ Bruker NMR JCAMP-DX V2.0
##DATA TYPE= NMR SPECTRUM
##DATA CLASS= NTUPLES
##ORIGIN= Bruker BioSpin GmbH
##OWNER= NMR
$$ XWIN-NMR		Version 3.5
$$ Thu Jul 21 12:28:36 2005 GMT Daylight Time (UT+1h)  MAYBRIDGE\NMR@NMR_250MHZ
##.OBSERVE FREQUENCY= 250.131544655141
##.OBSERVE NUCLEUS= ^1H
##.ACQUISITION MODE= SIMULTANEOUS (DQD)
##.ACQUISITION SCHEME= undefined
##.AVERAGES= 16
##.DIGITISER RES= 18
##SPECTROMETER/DATA SYSTEM= dpx250
##.PULSE SEQUENCE= zg30
##.SOLVENT NAME= CDCl3
##.SHIFT REFERENCE= (INTERNAL, CDCl3, 0, 16.522)
##AUDIT TRAIL= $$ (NUMBER, WHEN, WHO, WHERE, WHAT)
$$ ##TITLE= Audit trail, XWIN-NMR		Version 3.5
$$ ##JCAMPDX= 5.01
$$ ##ORIGIN= Bruker BioSpin GmbH
$$ ##OWNER= NMR
$$ C:\u/data/dgb/nmr/ADRS/6270/pdata/1/auditp.txt
$$ ##AUDIT TRAIL=  $$ (NUMBER, WHEN, WHO, WHERE, WHAT)
(   1,<2005-07-21 12:28:16.86 +100>,<MAYBRIDGE\NMR>,<NMR_250MHZ>,
      <created by zg, POWCHK disabled, PULCHK disabled
       configuration hash MD5:
       62 19 C7 07 E1 42 D1 B7 37 6C 3D D0 77 39 F9 E6
       data hash MD5: 64K
       AD 87 EB 6C 84 0A F2 9B 56 24 8C B2 59 A4 32 F2>)
(   2,<2005-07-21 12:28:27.91 +100>,<MAYBRIDGE\NMR>,<NMR_250MHZ>,
      <Start of raw data processing
       ef LB = 0.3 FT_mod = 6 PKNL = 1 SI = 32K 
       data hash MD5: 32K
       DA E7 88 C3 2D DF FC AA 0A 64 11 4D B3 19 69 B6>)
(   3,<2005-07-21 12:28:29.72 +100>,<MAYBRIDGE\NMR>,<NMR_250MHZ>,
      <apk 
       data hash MD5: 32K
       87 18 FD 45 07 21 92 35 FE B7 F1 3E FC C4 3B 31>)
(   4,<2005-07-21 12:28:30.52 +100>,<MAYBRIDGE\NMR>,<NMR_250MHZ>,
      <abs ABSG = 5 
       data hash MD5: 32K
       55 87 70 93 36 77 25 E9 25 55 E9 EA 3D E8 29 4B>)
$$ ##END=
$$ 
$$ hash MD5
$$ 88 F8 16 B0 B5 08 2F 62 4A 9D EC FE 9F 8D E3 C9
##$RELAX= 
##$RELAX= 
##$RELAX= 
##$RELAX= 
##$RELAX= 
##$RELAX= 
##$RELAX= 
$$ Bruker specific parameters
$$ --------------------------
##$DU= <C:\u>
##$EXPNO= 6270
##$NAME= <ADRS>
##$PROCNO= 1
##$TYPE= <nmr>
##$USER= <dgb>
##$AMP= (0..31)
100 100 100 100 100 100 100 100 100 100 100 100 100 100 100 100 100 100 
100 100 100 100 100 100 100 100 100 100 100 100 100 100 
##$AQSEQ= 0
##$AQ_mod= 3
##$AUNM= <au_zg>
##$AUTOPOS= <23 >
##$BF1= 250.13
##$BF2= 250.13
##$BF3= 250.13
##$BF4= 250.13
##$BF5= 500.13
##$BF6= 500.13
##$BF7= 500.13
##$BF8= 500.13
##$BYTORDA= 1
##$CFDGTYP= 0
##$CFRGTYP= 5
##$CHEMSTR= <none>
##$CNST= (0..31)
1 1 145 1 1 1 1 1 1 1 1 1 1 1 1 1 1 1 1 1 1 1 1 1 1 1 1 1 1 1 1 1 
##$CPDPRG= <>
##$CPDPRG1= <>
##$CPDPRG2= <>
##$CPDPRG3= <>
##$CPDPRG4= <mlev>
##$CPDPRG5= <mlev>
##$CPDPRG6= <mlev>
##$CPDPRG7= <mlev>
##$CPDPRG8= <mlev>
##$CPDPRGB= <>
##$CPDPRGT= <>
##$D= (0..31)
0 1 0 0 0 0 0 0 0 0.06 0 0 0 0 0 0 0.0002 0 0 0 0 0 0 0 0 0 0 0 0 0 0 
0 
##$DATE= 1121945296
##$DBL= (0..7)
120 120 120 120 120 120 120 120 
##$DBP= (0..7)
150 150 150 150 150 150 150 150 
##$DBP07= 0
##$DBPNAM0= <>
##$DBPNAM1= <>
$$ [...]
##$SUBNAM7= <"">
##$SUBNAM8= <"">
##$SUBNAM9= <"">
##$SW= 20.6930455092707
##$SWIBOX= (0..15)
0 0 3 0 0 0 0 0 0 0 0 0 0 0 0 0 
##$SW_h= 5175.983436853
##$TD= 65536
##$TD0= 1
##$TE= 295.16
##$TE2= 300
##$TE3= 300
##$TEG= 300
##$TL= (0..7)
0 120 120 120 120 120 120 120 
##$TP= (0..7)
150 150 150 150 150 150 150 150 
##$TP07= 0
##$TPNAME0= <>
##$TPNAME1= <>
##$TPNAME2= <>
##$TPNAME3= <>
##$TPNAME4= <>
##$TPNAME5= <>
##$TPNAME6= <>
##$TPNAME7= <>
##$TPOAL= (0..7)
0.5 0.5 0.5 0.5 0.5 0.5 0.5 0.5 
##$TPOFFS= (0..7)
0 0 0 0 0 0 0 0 
##$TUNHIN= 0
##$TUNHOUT= 0
##$TUNXOUT= 0
##$USERA1= <user>
##$USERA2= <user>
##$USERA3= <user>
##$USERA4= <user>
##$USERA5= <user>
##$V9= 5
##$VALIST= <valist>
##$VCLIST= <CCCCCCCCCCCCCCC>
##$VD= 0
##$VDLIST= <DDDDDDDDDDDDDDD>
##$VPLIST= <PPPPPPPPPPPPPPP>
##$VTLIST= <TTTTTTTTTTTTTTT>
##$WBST= 1024
##$WBSW= 4
##$XGAIN= (0..3)
0 0 0 0 
##$XL= 0
##$YL= 0
##$YMAX_a= 258330
##$YMIN_a= -479674
##$ZGOPTNS= <>
##$ZL1= 120
##$ZL2= 120
##$ZL3= 120
##$ZL4= 120
##$ABSF1= 16.522
##$ABSF2= -4.171173
##$ABSG= 5
##$ABSL= 3
##$ALPHA= 0
##$AQORDER= 0
##$ASSFAC= 0
##$ASSFACI= 0
##$ASSFACX= 0
##$ASSWID= 0
##$AUNMP= <proc_1d>
##$AZFE= 0.1
##$AZFW= 0.1
##$BCFW= 0
##$BC_mod= 0
##$BYTORDP= 0
##$COROFFS= 0
##$CY= 12.5
##$DATMOD= 1
##$DC= 0
##$DFILT= <>
##$DTYPP= 0
##$F1P= 14.0000005364418
##$F2P= -0.99999901652339
##$FCOR= 0.5
##$FTSIZE= 32768
##$FT_mod= 6
##$GAMMA= 0
##$GB= 0
##$INTBC= 1
##$INTSCL= 1
##$ISEN= 128
##$LB= 0.3
##$LEV0= 0
##$LPBIN= 0
##$MAXI= 10000
##$MC2= 0
##$MEAN= 0
##$ME_mod= 0
##$MI= 0
##$NCOEF= 0
##$NC_proc= -5
##$NLEV= 6
##$NOISF1= 0
##$NOISF2= 0
##$NSP= 0
##$NTH_PI= 0
##$NZP= 0
##$OFFSET= 16.522
##$PC= 1
##$PHC0= -79.01599
##$PHC1= 6.249279
##$PH_mod= 1
##$PKNL= yes
##$PPARMOD= 0
##$PSCAL= 4
##$PSIGN= 0
##$REVERSE= no
##$SF= 250.13
##$SI= 32768
##$SIGF1= 0
##$SIGF2= 0
##$SINO= 400
##$SIOLD= 32768
##$SREGLST= <1H.CDCl3>
##$SSB= 0
##$STSI= 32768
##$STSR= 0
##$SW_p= 5175.98343685301
##$SYMM= 0
##$S_DEV= 0
##$TDeff= 65536
##$TDoff= 0
##$TI= <Analysis number 999999
Compound Code 99
Book Reference 9
Project Code 9>
##$TILT= no
##$TM1= 0
##$TM2= 0
##$TOPLEV= 0
##$USERP1= <user>
##$USERP2= <user>
##$USERP3= <user>
##$USERP4= <user>
##$USERP5= <user>
##$WDW= 1
##$XDIM= 32768
##$YMAX_p= 285235850
##$YMIN_p= -475856
$$ End of Bruker specific parameters
$$ ---------------------------------
##NTUPLES= NMR SPECTRUM
##VAR_NAME=  FREQUENCY,     SPECTRUM/REAL,   SPECTRUM/IMAG
##SYMBOL=    X,             R,               I
##VAR_TYPE=  INDEPENDENT,   DEPENDENT,       DEPENDENT
##VAR_FORM=  AFFN,          ASDF,            ASDF
##VAR_DIM=   32768,         32768,           32768
##UNITS=     HZ,            ARBITRARY UNITS, ARBITRARY UNITS
##FACTOR=    0.157963299565203, 1,           1
##FIRST=     4132.6476996994, 0,             0
##LAST=      -1043.33573715361, 0,           0
##MIN=       -1043.33573715361, -475856,     0
##MAX=       4132.6476996994, 285235850,     0
$$ Real data points
##PAGE= N=1
##DATA TABLE= (X++(R..R)), XYDATA
$$ [...]
$$ plain form
17660 28837527 38140227 46548390 50769873 50438097 48329127 47900964 51215159 57905952
17652 57905952 64366538 64928519 58299101 47578609 36466034 27225092 20409797 15688356
17644 15688356 12561948 10452763 8974788 8092650 7501354 7147391 7030335 7078607 7133645
17635 7133645 7178130 7161749 7121130 7325455 7596316 7965378 8362750 8853755 9193811 9770033
17625 9770033 10423114 11033475 11971839 13356481 15090899 17246310 19810388 23342560 28135606
17616 28135606 34432643 43171300 55147240 70171205 86880601 103001191 118412540
17609 118412540 136241887 159007965 185277894 208670912 221340810 219648934 206273304
17602 206273304 185548492 161216013 136276746 112712646 91786274 74195178 60250504
$$ packed form
17660B8837527R302700Q408163M221483l31776k108970m28163L314195O690793
17652E7905952O460586N61981o629418j0720492j1112575r240942o815295m721441
17644A5688356l126408k109185j477975q82138n91296l53963j17056M8272N5038
17635G133645M4485j6381m0619K04325K70861L69062L97372M91005L40056N76222
17625I770033O53081O10361R38364J384642J734418K155411K564078L532172M793046
17616B8135606O297037Q738657J1975940J5023965J6709396J6120590J5411349
17609A18412540J7829347K2766078K6269929K3393018J2669898j691876j3375630
17602B06273304k0724812k4332479k4939267k3564100k0926372j7591096j3944674
$$ plain form
17595 60250504 49398525 40610888 33334447 27558931 22947340 19207486 16591079 14730579
17587 14730579 13478806 12756899 12462424 12384196 12163925 11703792 11036422 10270391 9750707
17578 9750707 9403329 9409904 9650633 9807401 10345936 11217787 12248139 13474228 15163897
17569 15163897 17667562 21160546 26161107 32293509 38115734 42052634 44775824 48397510
17561 48397510 55201260 66788368 82530173 98680803 110207144 115420766 115748423 112865570
17553 112865570 107689636 100939170 93419311 85587567 77690301 69817217 61880438 53801223
17545 53801223 45458004 37310926 29812801 23397981 18361564 14559699 11742777 9588686
17537 9588686 8188074 7289750 6527748 5834751 5216813 4659494 4213213 3783242 3528787
$$ packed form
17595F0250504j0851979q787637p276441n775516m611591l739854k616407j860500
17587A4730579j251773p21907k94475p8228k20271m60133o67370p66031n19684
17578I750707l47378O575K40729J56768N38535Q71851J030352J226089J689669
17569A5163897K503665L492984N000561O132402N822225L936900K723190L621686
17561D8397510O803750J1587108J5741805J6150630J1526341N213622L27657k882853
17553A12865570n175934o750466p519859p831744p897266p873084p936779q079215
17545E3801223q343219q147078p498125o414820n036417l801865k816922k154091
17537I588686j400612q98324p62002o92997o17938n57319m46281m29971k54455
$$ plain form
17528 3528787 3201984 2778159 2706751 2796017 2748791 2741338 2890600 2989513 3115655 3251743
17518 3251743 3262384 3335226 3428190 3410965 3357505 3308754 3230846 3062210 2963210 2763205 2329765
17507 2329765 2058127 1597561 1223386 1151836 1089568 900816 824489 886424 732645 535329
17497 535329 613369 733293 728595 701733 759782 609944 643117 731854 715351 642320 766416
17486 766416 1010391 1300147 1643647 2035137 2130552 2038029 1750605 1565101 1489904 1420331
17476 1420331 1594090 1714997 1759166 1676062 1533226 1476470 1558306 1693734 1741258 1709877
17466 1709877 1687998 1638189 1611273 1739525 1735520 1618510 1480250 1437935 1294123 1099276
17456 1099276 806358 478909 303217 167603 17998 9403 60188 179796 248228 414970
$$ packed form
17528C528787l26803m23825p1408Q9266m7226p453J49262R8913J26142J36088
17518C251743J0641P2842R2964j7225n3460m8751p7908j68636r9000k00005m33440
17507B329765k71638m60566l74175p1550o2268j88752p6327O1935j53779j97316
17497E35329P8040J19924m698k6862N8049j49838L3173Q8737j6503p3031J24096
17486G66416K43975K89756L43500L91490R5415r2523k87424j85504p5197o9573
17476A420331J73759J20907M4169q3104j42836n6756Q1836J35428M7524l1381
17466A709877k1879m9809k6916J28252m005j17010j38260m2315j43812j94847
17456A099276k92918l27449j75692j35614j49605q595N0785J19608O8432J66742
$$ plain form
17446 414970 668843 748285 951076 1291382 1803745 2038458 2078734 2119661 2228390 2541586
17436 2541586 2650050 2556411 2404091 2196556 1983030 1853061 1790041 1882392 1901931 1708851
17426 1708851 1408586 1142445 1015368 917874 711042 538854 408912 283713 345408 361568
17416 361568 292229 125344 44005 12823 -22570 -11901 134441 87878 -31651 -147208 -215505
17405 -215505 -165810 -72802 -100328 -220386 -241139 -194105 -40070 -34088 -90705 39146 85661
17394 85661 177437 286077 372202 359303 519305 806937 860412 780259 682384 593002 730239
17383 730239 778506 806522 704384 696833 719688 618767 363512 300888 230411 194479 265719
17372 265719 249559 175545 194729 159035 265357 200231 139814 243598 228252 227883 278872
$$ packed form
17446D14970K53873P9442K02791L40306N12363K34713M0276M0927J08729L13196
17436B541586J08464r3639j52320k07535k13526j29969o3020R2351J9539j93080
17426A708851l00265k66141j27077r7494k06832j72188j29942j25199O1695J6160
17416C61568o9339j66885q1339l1182l5393J0669J46342m6563j19529j15557o8297
17405b15505M9695R3008k7526j20058k0753M7034J54035N982n6617J29851M6515
17394H5661R1776J08640Q6125j2899J60002K87632N3475q0153r7875q9382J37237
17383G30239M8267K8016j02138p551K2855j00921k55255o2624p0477l5932P1240
17372B65719j6160p4014J9184l5694J06322o5126o0417J03784j5346l69N0989
$$ plain form
17361 278872 263002 164009 133998 176516 219371 106585 79922 38363 56343 58842 46803
17350 46803 37552 150949 183387 189851 175916 61426 51207 116771 170723 322398 271865
17339 271865 170341 100731 146006 133226 121735 107808 115162 78388 10140 -98723 12094
17328 12094 127324 175048 202991 174008 140631 65014 35947 57172 -22578 -75296 78007
17317 78007 105072 116080 171700 98895 107363 57124 40536 67481 -45317 -12230 146613
17306 146613 209361 157617 149047 45373 -69671 -44425 -100737 -142596 -244968 -211053 -138952
17295 -138952 24359 14033 22164 157943 -4581 -168634 -99529 25673 83606 169839 27715
17284 27715 1872 12570 37513 -5674 -82541 -154511 -143634 -208322 -64170 36641 -59121
$$ packed form
17361B78872j5870r8993l0011M2518M2855j12786k6663m1559J7980K499j2039
17350D6803r251J13397L2438O464j3935j14490j0219O5564N3952J51675n0533
17339B71865j01524o9610M5275j2780j1491j3927P354l6774o8248j08863J10817
17328A2094J15230M7724K7943k8983l3377p5617k9067K1225p9750n2718J53303
17317G8007K7065J1008N5620p2805Q468n0239j6588K6945j12798L3087J58843
17306A46613O2748n1744q570j03674j15044K5246n6312m1859j02372L3915P2101
17295a38952J63311j0326Q131J35779j62524j64053O9105J25202N7933Q6233j42124
17284B7715k5843J0698K4943m3187p6867p1970J0877o4688J44152J00811r5762
$$ plain form
17273 -59121 -41519 29042 39496 89825 17319 -28008 -105504 -58376 -98721 -143566 -179072 -87918
17261 -87918 93578 88625 5674 -135948 -184097 -85969 -55596 -73847 124542 182356 -16581
17250 -16581 -73013 -24942 1287 -4324 117358 91255 -9532 3521 41384 57211 -62025
17239 -62025 -48044 -68712 -167001 -132292 -110545 -82875 10675 41259 31525 -67094 -170620 -187868
17227 -187868 -198306 -241800 -171287 -126342 -13101 -39375 -68269 -74981 -17400 29737 -18626
17216 -18626 -25709 -25763 -11358 -55184 -65161 -29855 -35103 19611 37025 -140385 -152829 -142123 -187520
17203 -187520 -144121 -83176 -22717 -9887 14042 -80097 -66157 109149 131699 28544 111497
17192 111497 187181 178258 138244 124578 -24780 -96784 -143507 -122759 -72433 -39351 45955
$$ packed form
17273e9121J7602P0561J0454N0329p2506m5327p7496M7128m0345m4845l5506R1154
17261h7918J81496m953q2951j41622m8149R8128L0373j8251J98389N7814j98937
17250a6581n6432M8071K6229n611J21682k6103j00787J3053L7863J5827j19236
17239f2025J3981k0668r8289L4709K1747K7670R3550L0584r734r8619j03526j7248
17227a87868j0438m3494P0513M4945J13241k6274k8894o712N7581M7137m8363
17216a8626p083n4J4405m3826r977L5306n248N4714J7414j77410j2444J0706m5397
17203a87520M3399O0945O0459J2830K3929r4139J3940J75306K2550j03155Q2953
17192A11497P5684q923m0014j3666j49358p2004m6723K0748N0326L3082Q5306
$$ plain form
17181 45955 121000 53414 -42350 -114555 -169905 -179964 -193823 -234565 -133336 79589 98624
17170 98624 -108574 -203373 -111106 7211 -512 29193 22499 -28305 -95740 -223060 -271262
17159 -271262 -249896 -123539 -14862 3442 -38595 12284 -36823 -30095 50216 180415 208562
17148 208562 238439 276861 277915 229913 134270 159680 147108 156021 173635 9276 -35930 -94944
17136 -94944 -118771 -17285 45607 23551 -722 -106194 -64387 -20591 -77898 -175633 -81607
17125 -81607 -47915 -31435 -83983 -47661 -43066 -17130 -12973 -82465 -29935 79366 71143 -54653
17113 -54653 19697 17483 66855 77940 127666 302588 378295 525173 610396 551271 496910
17102 496910 592145 821654 902190 865801 816791 638154 618315 532950 563622 554757 480052
$$ packed form
17181D5955P5045o7586r5764p2205n5350j0059j3859m0742J01229K12925J9035
17170I8624k07198r4799R2267J18317p723K9705o694n0804o7435j27320m8202
17159b71262K1366J26357J08677J8304m2037N0879m9107O728Q0311J30199K8147
17148B08562K9877L8422J054m8002r5643K5410j2572Q913J7614j64359m5206n9014
17136i4944k3827J01486O2892k2056k4273j05472M1807M3796n7307r7735R4026
17125h1607L3692J6480n2548L6322M595K5936M157o9492N2530J09301q223j25796
17113e4653P4350k214M9372J1085M9726J74922P5707J46878Q5223n9125n4361
17102D96910R5235K29509Q0536l6389m9010j78637j9839q5365L0672q865p4705
$$ plain form
17091 480052 422950 412815 371668 349592 228063 164219 131402 39822 -25219 84239 152633
17080 152633 18754 -6459 -50716 -35227 40689 38590 80562 137907 40643 -57488 -8963
17069 -8963 76573 137516 174105 165099 66614 154569 231198 255184 379256 432833 449450 419766
17057 419766 427996 523202 635009 665551 617417 598748 597777 557735 497648 406407 353251 411175
17045 411175 431866 434070 212928 76786 47063 151135 164620 -46211 -134106 -94650 25100
17034 25100 47292 35876 54524 60148 -9185 -64953 -17514 14267 -59041 -6898 25136 62831
17022 62831 164016 60504 25025 54108 118238 199144 91272 -57681 -62214 -27965 97569
17011 97569 143671 113835 81427 56936 -29836 -26941 -5246 -509 33784 -3295 3752 -79540
$$ packed form
17091D80052n7102j0135m1147k2076j21529o3844l2817r1580o5041J09458O8394
17080A52633j33879k5213m4257J5489P5916k099M1972N7345r7264r8131M8525
17069h963Q5536O0943L6589r006r8485Q7955P6629K3986J24072N3577J6617k9684
17057D19766Q230R5206J11807L0542m8134j8669r71m0042o0087r1241n3156N7924
17045D11175K0691K204k21142j36142k9723J04072J3485k10831q7895L9456J19750
17034B5100K2192j1416J8648N624o9333n5768M7439L1781p3308N2143L2034L7695
17022F2831J01185j03512l5479K9083O4130Q0906j07872j48953m533L4249J25534
17011I7569M6102k9836l2408k4491q6772K895K1695M737L4293l7079P047q3292
$$ plain form
16999 -79540 -97746 -150038 -111409 -124611 22550 150230 72025 17687 34865 101897 62113
16988 62113 -27217 -88250 -93954 -9252 86857 133989 105366 36433 51672 -34724 -78870 -45431
16976 -45431 -63016 -49763 23878 71594 -37538 -91151 -34309 45318 152124 319461 428503
16965 428503 332458 143052 -38010 -65862 -3353 -79463 -170030 -188304 -180087 -157453 -84581
16954 -84581 -43914 48500 -14292 -56865 -103468 -15623 -52218 -86221 -137891 -126212 -48946 -213506
16942 -213506 -320809 -228296 -53996 -26658 -112660 -43254 -182 46706 80460 30396 107500
16931 107500 76371 129597 41415 -100193 -78062 -157539 -75155 -101303 -76004 -39042 -125340
16920 -125340 -62095 44455 22554 21604 38863 -144498 -284476 -190135 -114476 -104257 -127576
$$ packed form
16999g9540j8206n2292L8629j3202J47161J27680p8205n4338J7178O7032l9784
16988F2113q9330o1033n704Q4702R6109M7132k8623o8933J5239q6396m4146L3439
16976d5431j7585J3253P3641M7716j09132n3613N6842P9627J06806J67337J09042
16965D28503r6045j89406j81062k7852O2509p6110r0567j8274Q217K2634P2872
16954h4581M0667R2414o2792m2573m6603Q7845l6595l4003n1670J1679P7266j64560
16942b13506j07303R2513J74300K7338q6002O9406M3072M6888L3754n0064P7104
16931A07500l1129N3226q8182j41608K2131p9477Q2384k6148K5299L6962q6298
16920a25340O3245J06550k1901r50J7259j83361j39978R4341P5659J0219k3319
$$ plain form
16909 -127576 -243067 -114454 -7372 -7514 78143 130352 103029 -6269 -82814 -104038 57253
16898 57253 193168 119942 33116 79620 157649 264118 203747 60068 -108106 -170813 -129654
16887 -129654 -175326 -293574 -192788 47065 138481 16723 -34618 5873 -65282 -53434 -146141
16876 -146141 -241885 -145690 -127309 -191892 -224091 -77400 9059 8314 -5216 -20843 -77035 -25030
16864 -25030 30317 -17629 -160296 -175089 -154801 -167463 -168599 -59598 47244 -37263 -129426
16853 -129426 -187814 -177628 -87251 -7717 64294 87883 -35329 1510 22905 51159 104805
16842 104805 53441 -14654 -59392 -167925 -65906 36989 44372 9049 -40129 -88729 -62707
16831 -62707 -6851 -88555 -94601 -58674 -41050 4600 -34988 2692 -59864 -47972 -42436 -6661
$$ packed form
16909a27576j15491J28613J07082j42Q5657N2209k7323j09298p6545k1224J61291
16898E7253J35915p3226q6826M6504P8029J06469o0371j43679j68174o2707M1159
16887a29654m5672j18248J00786K39853R1416j21758n1341M0491p1155J1848r2707
16876a46141r5744R6195J8381o4583l2199J46691Q6459p45j3530j5627n6192N2005
16864b5030N5347m7946j42667j4793K0288j2662j136J09001J06842q4507r2163
16853a29426n8388J0186R0377P9534P2011K3589j23212L6839K1395K8254N3646
16842A04805n1364o8095m4738j08533J02019J02895P383l5323m9178m8600K6022
16831f2707N5856q1704o046L5927J7624M5650l9588L7680o2556J1892N536L5775
$$ plain form
16819 -6661 73641 15499 -68982 -31873 -102709 -193735 -269813 -218532 -177982 -71832 -9688 27468
16807 27468 80801 14714 -121458 -60455 -82604 -30200 -88324 -169808 -165873 -80841 -92484 -7426
16795 -7426 656 -109245 -75176 -47380 -68588 -58481 -97232 -141226 -92587 -42486 29639 129032
16783 129032 90644 81773 -32797 -155382 -185188 -100860 -36511 -42929 -36221 2543 -60134 -64193
16771 -64193 -51864 -95399 41275 77935 2483 -45906 -67325 -122745 -144850 -53085 -39012
16760 -39012 -82775 -110000 -172648 -55174 86741 60083 -73410 -34107 -24213 -41362 -155211
16749 -155211 -132372 20283 215372 288741 126439 14020 -113158 -121616 -83997 40159
16739 40159 128264 194416 121908 38707 111112 99207 156292 103055 75812 19559 -95053
$$ packed form
16819f661Q0302n8142q4481L7109p0836r1026p6078N1281M0550J06150O2144L7156
16807B7468N3333o6087j36172O1003k2149N2404n8124q1484L935Q5032j1643Q5058
16795g426Q082j09901L4069K7796k1208J0107l8751m3994M8639N0101P2125R9393
16783A29032l8388q871j14570j22585k9806Q4328O4349o418O708L8764o2677m059
16771f4193J2329m3535J36674L6660p5452m8389k1419n5420k2105R1765J4073
16760c9012m3763k7225o2648J17474J41915k6658j33493L9303R894j7149j13849
16749a55211K2839J52655J95089P3369j62302j12419j27178q458L7619J24156
16739D0159Q8105O6152p2508q3201P2405j1905N7085n3237k7243n6253j14612
$$ plain form
16728 -95053 -93443 -103151 -48558 130350 61146 -48193 -52133 -45654 -38336 -18293 18611 89303
16716 89303 -16677 -98699 -141294 -230605 -173675 -108148 -46334 -61668 -33480 -61863 11446
16705 11446 -58219 -70474 -33840 -9190 -36060 -57527 -16976 1675 -36564 -89555 -186412 -210539
16693 -210539 -223160 -260274 -208115 -189474 -248261 -308627 -281329 -242674 -275049 -314618 -252924
16682 -252924 -214144 -96876 -89641 -70410 -109370 -69917 -101142 -85956 -70907 -68710 3111 80952
16670 80952 140357 -39574 -168886 -131779 -57456 49165 111238 -120995 -134660 -174417 -261913
16659 -261913 -228923 -187670 -131351 -39881 68766 22924 -95175 -164125 -124546 -42915 -648
16648 -648 -99624 -167595 -151296 -82527 -37376 -55246 -52749 -153785 -137330 63535 -36366 -84692
$$ packed form
16728i5053J610r708N4593J78908o9204j09339l940O479P318K0043L6904P0692
16716H9303j05980q2022m2595q9311N6930O5527O1814j5334K8188k8383P3309
16705A1446o9665j2255L6634K4650k6870k1467M0551J8651l8239n2991r6857k4127
16693b10539j2621l7114N2159J8641n8787o0366K7298L8655l2375l9569O1694
16682b52924L8780J17268P235J9231l8960L9453l1225J5186J5049K197P1821P7841
16670H0952N9405j79931j29312L7107P4323J06621O2073k32233j3665l9757q7496
16659b61913L2990M1253N6319R1470J08647m5842j18099o8950L9579Q1631M2267
16648f48r8976o7971J6299O8769M5151j7870K497j01036J6455K00865r9901m8326
$$ plain form
16636 -84692 -106997 -60121 -202299 -260866 -246659 -155502 -88594 -96048 -155221 -16623 48634
16625 48634 111059 100491 120135 84214 -32677 -142627 -209871 -185593 -62841 21452 10233
16614 10233 43360 9250 8017 57357 65221 -24230 -129605 -47913 -26950 91307 96320 55126
16602 55126 80080 107037 -8188 9862 97666 121118 155837 36510 -122717 -349481 -393996
16591 -393996 -345732 -149950 -68951 -58669 -109033 -88934 -60008 -215803 -198154 -122518 -37172
16580 -37172 72621 94668 84757 12972 -20318 -49582 31741 -17946 -84736 -163551 -183299 -104088
16568 -104088 -98889 -87680 -91965 -226523 -207833 -92828 -102735 -147060 -92009 -4498 14834 -11987
16556 -11987 -55440 -82608 -110108 -334167 -366581 -197004 -177923 -205590 -203751 -78579 332
$$ packed form
16636h4692k2305M6876j42178n8567J4207R1157O6908p454n9173J38598O5257
16625D8634O2425j0568J9644l5921j16891j09950o7244K4278J22752Q4293j1219
16614A0233L3127l4110j233M9340P864q9451j05375Q1692K0963J18257N013m1194
16602E5126K4954K6957j15225J8050Q7804K3452L4719j19327j59227k26764m4515
16591c93996M8264J95782Q0999J0282n0364K0099K8926j55795J7649P5636Q5346
16580c7172J09793K2047r911p1785l3290k9264Q1323m9687o6790p8815j9748P9211
16568a04088N199J1209m285j34558J8690J15005r907m4325N5051Q7511J9332k6821
16556a1987m3453k7168k7500k24059l2414J69577J9081k7667J839J25172P8911
$$ plain form
16545 332 54489 27552 48858 14419 -779 -66806 -156214 -137446 -159694 -255123 -224762 -124366
16533 -124366 -30479 -13055 -86395 -164152 -204924 -267100 -244681 -142551 -113572 -188629 -187070
16522 -187070 -96948 -92186 -72104 -39612 -90324 -112286 -285868 -339243 -262190 -188991 -117056
16511 -117056 27982 113351 109746 12881 -76006 -125380 -37336 -27655 -28124 -78069 28679 24416
16499 24416 -171266 -166946 -145186 35203 83095 -13842 -60932 -93382 -111049 -139174 -134556 -186243
16487 -186243 -122936 -86856 -75476 -35184 -127658 -124441 -130676 -205640 -133141 -99210 -128933 -124482
16475 -124482 -54323 -70517 -209537 -269266 -217665 -116721 40510 -62334 -160317 -180999 -137285
16464 -137285 -109295 -182196 -270264 -268184 -182963 -134188 -200671 -242646 -211790 -133343 -108731 -195459
$$ packed form
16545C32N4157k6937K1306l4439j5198o6027q9408J8768k2248r5429L0361J00396
16533a24366R3887J7424p3340p7757m0772o2176K2419J02130K8979p5057J559
16522a87070R0122M762K0082L2492n0712k1962j73582n3375P7053P3199P1935
16511a17056J45038Q5369l605r6865q8887m9374Q8044R681m69m9945J06748m263
16499B4416j95682M320K1760J80389M7892r6937m7090l2450j7667k8125M618n1687
16487a86243O3307L6080J1380M0292r2474L217o235p4964P2499L3931k9723M451
16475a24482P0159j6194j39020n9729N1601J00944J57231j02844r7983k0682M3714
16464a37285K7990p2901q8068K080Q5221M8775o6483m1975L0856P8447K4612q6728
$$ plain form
16452 -195459 -249111 -174987 -77233 5931 -11182 39253 59517 -21250 -65161 -82641 -8249
16441 -8249 75634 -29522 -214062 -168077 -42860 -88958 -68676 -105567 -62129 -59356 -67069 -92714
16429 -92714 -110776 -129745 -267032 -228997 -58450 13730 38817 74560 72946 -42175 -58056
16418 -58056 -67814 -112101 -69202 -74544 -24794 -10381 -76377 -81138 2413 -64956 21267 21150 -23697
16405 -23697 45672 -28783 -186452 -195084 -112155 -31040 -2306 14736 -33746 -32678 6858 -44496
16393 -44496 -59734 -79425 -16583 147764 131848 97330 42596 -81516 -151074 -250380 -256043
16382 -256043 -177577 -55004 -131306 -113403 -54443 -66858 -59222 9740 19207 149566 47453
16371 47453 -36802 -89252 -148776 -108423 -128888 -63124 -119080 -168207 -91323 -30521 -25007 -47436
$$ packed form
16452a95459n3652P4124R7754Q3164j7113N0435K0264q0767m3911j7480P4392
16441h249Q3883j05156j84540M5985J25217m6098K0282l6891M3438K773p713k5645
16429i2714j8062j8969j37287L8035J70547P2180K5087L5743j614j15121j5881
16418e8056r758m4287M2899n342M9750J4413o5996m761Q3551o7369Q6223j17m4847
16405b3697O9369p4455j57669q632Q2929Q1115K8734J7042m8482J068L9536n1354
16393d4496j5238j9691O2842J64347j5916l4518n4734j24112o9558r9306n663
16382b56043P8466J22573p6302J7903N8960j2415P636O8962R467J30359j02113
16371D7453q4255n2450n9524M0353k0465O5764n5956m9127P6884O0802N514k2429
$$ plain form
16359 -47436 -82624 -26849 40331 11876 34032 -46716 -120509 -142020 -218787 -180142 -107644 -45682
16347 -45682 -43536 -70685 -84519 -49910 -30393 -149711 -152098 -169375 -188113 -113777 -112551 -122086
16335 -122086 -145157 -120389 -89584 -37319 -49823 -47704 -8827 3867 1190 21705 38206 -44968
16323 -44968 -97046 -101012 -49803 -171891 -179489 -130170 -199276 -44986 -4271 -18881 46179 -9470
16311 -9470 -76485 -95296 -74730 -53792 -160842 -117984 -82535 -43563 15700 75858 -15074 -63151
16299 -63151 -42168 44548 65605 -31986 -159492 -93020 -92242 -108852 -52932 39631 -35126 -170562
16287 -170562 -198512 -181539 -143003 -257415 -294165 -305688 -233584 -118109 -97618 35929 70641
16276 70641 -25096 -163798 -174634 -51877 67348 133220 81779 8911 -86295 -11948 80624
$$ packed form
16359d7436l5188N5775O7180k8455K2156q0748p3793k1511p6767L8645P2498O1962
16347d5682K146k7149j3834L4609J9517j19318k387j7277j8738P4336J226r535
16335a22086k3071K4768L0805N2265j2504K119L8877J2694k677K0515J6501q3174
16323d4968n2078l966N1209j22088p598M9319o9106J54290M0715j4610O5060n5649
16311i470o7015j8811K0566K0938j07050M2858L5449L8972N9263O0158r0932m8077
16299f3151K0983Q6716K1057r7591j27506O6472P78j6610N5920R2563p4757j35436
16287a70562k7950J6973L8536j14412l6750j1523P2104J15475K0491J33547L4712
16276G0641r5737j38702j0836J22757J19225O5872n1441p2868r5206P4347R2572
$$ plain form
16265 80624 82774 70700 83526 -13184 -103505 -120739 -180095 -31042 234705 189067 63372
16254 63372 -13666 13186 107094 -1118 -162191 -230656 -224406 -75028 5461 67927 -35431
16243 -35431 -75170 -108381 -24963 56139 -39615 -78565 -185125 -147065 -2306 92426 120656
16232 120656 91967 109097 127046 64743 -10861 -4788 -50296 -121518 -81046 -104040 -80087 8714
16220 8714 53987 10197 -47868 -47934 -52329 312 111532 115595 40404 -14376 -25272 -77232 -74904
16207 -74904 -77634 -178179 -251762 -221692 -107125 20102 81715 55240 -11957 42451 161663
16196 161663 99740 88206 -84722 -43670 -105802 -184296 -164261 -32781 8185 -20983 108988
16185 108988 107832 13263 6677 55491 -8383 -39049 -176049 -399645 -305855 -188957 -49567
$$ packed form
16265H0624K150j2074J2826r6710r0321j7234n9356J49053K65747m5638j25695
16254F3372p7038K6852R3908j08212j61073o8465O250J49378Q0489O2466j03358
16243c5431l9739l3211Q3418Q1102r5754l8950j06560L8060J44759R4732K8230
16232A20656k8689J7130J7949o2303p5604O073m5508p1222M0472k2994K3953Q8801
16220H714M5273m3790n8065o6m395N2641J11220M063p5191n4780j0896n1960K328
16207g4904k730j00545p3583L0070J14567J27227O1613k6475o7197N4408J19212
16196A61663o1923j1534j72928M1052o2132p8494K0035J31480M0966k9168J29971
16185A08988j156r4569o586M8814o3874l0666j37000k23596R3790J16898J39390
$$ plain form
16174 -49567 -83128 -146334 -154966 -116706 17527 174853 125099 12690 -72600 -106015 -155441
16163 -155441 -177091 -141375 -74020 -54159 -105433 -103075 -70661 -56075 -58004 -15044 -66325 -21898
16151 -21898 117954 78658 -45533 -219812 -335428 -338313 -254536 -174564 -71548 -73085 -96967
16140 -96967 28078 61993 18092 10113 -19788 -32374 16566 -23531 -94294 -52634 7197 -6129
16128 -6129 -29681 9112 -45431 -108473 -216387 -281394 -270097 -185074 -171546 -148272 -157874 -125826
16116 -125826 -92400 -173652 -258138 -164665 -84377 -53401 -20693 -103898 -124126 -126049 -17684
16105 -17684 -46493 -84539 -74948 -120183 -14097 143792 162299 54164 -49958 -52794 -3866
16094 -3866 108647 132175 70475 24466 34216 -106809 -134301 -36036 -2034 7787 -26255 -53755
$$ packed form
16174d9567l3561o3206q632L8260J34233J57326m9754j12409q5290l3415m9426
16163a55441k1650L5716O7355J9861n1274K358L2414J4586j929M2960n1281M4427
16151b1898J39852l9296j24191j74279j15616k885Q3777P9972J03016j537k3882
16140i6967J25045L3915m3901p979k9901j2586M8940m0097p0763M1660N9831j3326
16128f129k3552L8793n4543o3042j07914o5007J1297Q5023J3528K3274r602L2048
16116a25826L3426q1252q4486R3473Q0288L0976L2708q3205k0228j923J08365
16105a7684k8809l8046R591m5235J06086J57889J8507j08135j04122k836M8928
16094c866J12513K3528o1700m6009R750j41025k7492R8265L4002R821l4042k7500
$$ plain form
16082 -53755 -20899 -120704 -153108 -114026 -67812 -135644 -181860 -190690 -198740 -148202 16060 -6667
16070 -6667 -16998 -68319 -134303 -16888 -22350 12805 18066 -49705 -128427 -79722 -61423 -152684
16058 -152684 -233488 -185349 -44385 -70568 -142009 -139777 -109590 -60927 -75607 -99954 -119361
16047 -119361 2368 95250 86415 29784 -8114 -7281 4706 -170654 -93291 141869 259766
16036 259766 252554 273624 191760 25127 -75577 -227312 -360206 -321033 -214341 -283099 -184710
16025 -184710 -65989 -102420 4941 56044 117040 77535 -64893 -129351 -218956 -223683 -194643
16014 -194643 -125845 -38587 -43132 28391 110043 25020 -56258 -78305 -155103 -60714 68530
16003 68530 105689 90693 84775 23619 -98462 -178847 -154619 -112719 -208599 -165917 -25164
$$ packed form
16082e3755L2856r9805l2404L9082M6214o7832m6216q830q050N0538J64262k2727
16070f667j0331n1321o5984J17415n462L5155N261o7771p8722M8705J8299r1261
16058a52684q0804M8139J40964k6183p1441K232L0187M8663j4680k4347j9407
16047a19361J21729R2882q835n6631l7898Q33J1987j75360P7363K35160J17897
16036B59766p212K1070q1864j66633j00704j51735j32894L9173J06692o8758R8389
16025a84710J18721l6431J07361N1103O0996l9505j42428o4458q9605m727K9040
16014a94643O8798Q7258m545P1523Q1652q5023q1278k2047p6798R4389J29244
16003F8530L7159j4996n918o1156j22081q0385K4228M1900r5880M2682J40753
$$ plain form
15992 -25164 -10387 -66377 -20210 -24445 106531 94193 83787 176713 171406 19093 -59396 -92680
15980 -92680 52444 127643 225343 361617 379201 254250 261225 194374 131334 63739 -27640
15969 -27640 -54827 -61587 34636 -5141 -222163 -168800 -117199 -81945 -200521 -132340 -76034
15958 -76034 -48712 -44556 -92985 -38784 -55698 -85804 -124496 -77569 -93015 -132816 -98470 -103545
15946 -103545 -46671 26223 89030 85846 47116 107831 121163 98660 108593 96770 85018 129136
15934 129136 122961 99543 99548 69967 12463 2641 11992 87589 -42894 -89132 -76377 -62053 -81199
15921 -81199 -91476 -83231 8407 -54727 -103359 -78444 23135 121309 39348 -11619 42125 41594
15909 41594 70102 49533 3902 -114213 -240232 -194817 -6736 151764 146091 -68378 -116061
$$ packed form
15992b5164J4777n5990M6167m235J30976j2338j0406R2926n307j52313p8489l3284
15980i2680J45124P5199R7700J36274J7584j24951O975o6851o3040o7595r1379
15969b7640k7187o760R6223l9777k17022N3363N1601L5254j18576O8181N6306
15958g6034K7322M156m8429N4201j6914l0106l8692M6927j5446l9801L4346n075
15946a03545N6874P2894O2807l184l8730O0715J3332k2503R933j1823j1752M4118
15934A29136o175k3418Nk9581n7504r822R351P5597j30483m6238J2755J4324j9146
15921h1199j0277Q245R1638o3134m8632K4915J01579R8174q1961n0967N3744n31
15909D1594K8508k0569m5631j18115j26019M5415J88081J58500n673k14469m7683
$$ plain form
15898 -116061 -126612 -114304 -1324 -66168 -172054 -162037 -177009 -192643 -82306 -89082 -96257
15887 -96257 -38384 8806 -99004 -116981 15277 58371 11574 29628 -8016 -59936 -110308
15876 -110308 -95368 -63956 -8625 102509 105335 55136 -25884 58409 95794 50235 10444
15865 10444 -53419 -83157 -73742 20346 60595 101651 86276 88511 167092 227064 226767 260831
15853 260831 214878 172346 121767 80079 53377 3770 108433 133963 120750 83435 95387
15842 95387 129652 118556 22944 -123204 -101559 -91644 -85853 -186919 -187530 -196018 -196728 -71926
15830 -71926 -70035 -64845 38162 49264 94584 -35674 -79840 -60541 -127373 -157410 -133320 -171594
15818 -171594 -219099 -126957 -45475 -37695 -56221 -84656 -176591 -324766 -228213 -166913 -163937 -64334
$$ packed form
15898a16061j0551J2308J12980o4844j05886J0017j4972j5634J10337o776p175
15887i6257N7873M7190j07810j7977J32258M3094m6797J8054l7644n1920n0372
15876a10308J4940L1412N5331J11134K826n0199q1020Q4293L7385m5559l9791
15865A0444o3863k9738R415R4088M0249M1056j5375K235P8581N9972k97L4064
15853B60831m5953m2532n0579m1688k6702m9607J04663K5530j3213l7315J1952
15842I5387L4265j1096r5612j46148K1645R915N791j01066o11q488p10J24802
15830g1926J891N190J03007J1102M5320j30258m4166J9299o6832l0037K4090l8274
15818a71594m7505R2142Q1482P780j8526k8435r1935j48175R6553O1300K976R9603
$$ plain form
15806 -64334 -51009 -44315 -80721 36676 -32998 -85348 -38688 80145 79393 155209 175105 172759
15794 172759 96351 98933 105111 134539 90051 -2823 -84195 -15041 43860 41935 -14014 -25070
15782 -25070 18944 91598 118912 97157 -24284 -50641 -118352 -188668 -213873 -142188 -112559
15771 -112559 -42516 -79059 -116643 -86877 -181101 -198174 -265315 -293499 -259475 -235853 -230056 -272576
15759 -272576 -101201 3560 116160 233478 151612 70624 -49176 -38922 57398 219152
15749 219152 166258 52752 66136 131840 221314 175023 95716 63461 5453 -786 119251
15738 119251 170451 68449 3179 52007 -3163 -163076 -139482 -18184 -12869 30594 124499
15727 124499 50258 56227 -34646 -80738 -43949 -140894 -205168 -140191 8832 12927 9272 68632
$$ packed form
15806f4334J3325O694l6406J17397o9674n2350M6660J18833p52P5816J9896k346
15794A72759p6408K582O178K9428m4488r2874q1372O9154N8901j925n5949j1056
15782b5070M4014P2654K7314k1755j21441k6357o7711p0316k5205P1685K9629
15771a12559P0043l6543l7584K9766r4224j7073o7141k8184L4024K3622N797m2520
15759b72576J71375J04761J12600J17318q1866q0988j19800J0254R6320J61754
15749B19152n2894j13506J3384O5704Q9474m6291p9307l2255n8008o239J20037
15738A19251N1200j02002o5270M8828n5170j59913K3594J21298N315M3463R3905
15727A24499p4241N969r0873m6092L6789r6945o4274O4977J49023M095l655N9360
$$ plain form
15715 68632 91661 46514 83554 121799 92867 85943 61090 156348 147204 125095 103841 75866
15703 75866 -8875 -118876 -168212 -192017 -106913 -14907 69386 -101139 -132922 -133278 -106325 -58159
15691 -58159 -58485 -10244 67522 82144 -38364 -111580 -110721 -65390 -29831 -28610 -11244 -24269
15679 -24269 -146450 -226819 -290055 -200249 -194257 -249562 -148613 -165510 -130164 -68101 -21782
15668 -21782 7495 -63372 -176355 -33181 58679 52890 38811 -34858 -88937 -89481 8973 -58146
15656 -58146 -17360 -21379 -19965 80335 89431 109124 105416 48910 -108544 -274123 -241449 -103727
15644 -103727 -136094 -156420 -97927 -57870 73485 144110 25895 -81391 -156540 -61356 38771
15633 38771 39019 -3735 -58341 -51138 -180365 -110144 44870 125282 102105 76892 45277 98575
$$ packed form
15715F8632K3029m5147L7040L8245k8932o924k4853R5258r144k2109k1254k7975
15703G5866q4741j10001m9336k3805Q5104R2006Q4293j70525l1783l56K6953M8166
15691e8159l26M8241P7766J4622j20508p3216Q59M5331L5559J221J7366j3025
15679b4269j22181q0369o3236Q9806N992n5305J00949j6897L5346O2063M6319
15668b1782K9277p0867j12983J43174R1860n789j4079p3669n4079n44R8454o7119
15656e8146M0786m019J414J00300R096J9693l708n6506j57454j65579L2674J37722
15644a03727l2367k0326N8493M0057J31355P0625j18215j07286p5149R5184J00127
15633C8771K48m2754n4606P203j29227P0221J55014Q0412k3177k5213l1615N3298
$$ plain form
15621 98575 23025 -22806 -76381 -11146 -25157 -72659 -106190 -77209 -80045 -56250 -122169 -143693
15609 -143693 10745 81143 62800 136664 272955 256806 227167 247278 79287 -49953 -11843
15598 -11843 26281 15615 115736 155268 161641 177021 74017 -43276 -32545 -76903 -102380
15587 -102380 -7615 -38988 -180206 -204917 -127816 -211857 -313258 -362844 -286530 -83177 -184288
15576 -184288 -177794 -63380 -88024 -114345 -43421 -40153 47681 133035 63978 70406 40617 16061
15564 16061 -165686 -185281 -67301 34333 39754 -47513 -91934 -102107 -183356 -165228 19688
15553 19688 90229 20857 -8649 -34029 10875 117573 121809 128379 83127 -4279 -102899 -100981
15541 -100981 -95086 -90564 -142233 -23573 -76741 -82601 -27210 2967 52094 115072 87227 -13054
$$ packed form
15621I8575p5550m5831n3575O5235j4011m7502l3531K8981k836K3795o5919k1524
15609a43693J54438P0398j8343P3864J36291j6149k9639K0111j67991j29240L8110
15598a1843L8124j0666J00121L9532O373J5380j03004j17293J0731m4358k5477
15587a02380R4765l1373j41218k4711P7101q4041j01401m9586P6314K03353j01111
15576a84288O494J14414k4644k6321P0924L268Q7834Q5354o9057O428k9789k4556
15564A6061j81747j9595J17980J01634N421q7267m4421j0173q1249J8128J84916
15553A9688P0541o9372k9506k5380M4904J06698M236O570m5252q7406r8620J918
15541a00981N895M522n1669J18660n3168n860N5391L0177M9127O2978k7845j00281
$$ plain form
15529 -13054 -2453 -962 -67167 -90074 1433 21147 -147148 -198668 -153682 -134120 -114690 -109755
15517 -109755 -153237 -163722 -138912 -225138 -161193 1668 139814 159801 -36156 -105905 -70417
15506 -70417 -68071 -52493 -64222 -87313 -79018 30818 12287 -22197 -28675 -59473 -58256 -158255
15494 -158255 -159042 -87791 105342 196953 218092 205752 157393 125047 120194 177065 84627 -32223
15482 -32223 22681 -7891 -30408 -53705 -63448 78234 129789 126946 187443 238235 158953 76155
15470 76155 68894 104528 46390 -3746 9877 -77301 -89474 -79809 -138265 -78045 6191 -27552
15458 -27552 27722 31897 -2037 -89433 -20392 -83389 -134432 -43445 12050 172422 172033 143108
15446 143108 101770 58206 25138 -33360 -38153 -115425 -133406 -122923 -80546 -59404 -40588 -18179
$$ packed form
15529a3054J0601J491o6205k2907R1507J9714j68295n1520M4986J9562J9430M935
15517a09755m3482j0485K4810q6226O3945J62861J38146J9987j95957o9749L5488
15506g0417K346J5578j1729k3091Q295J09836j8531l4484o478l0798J217r9999
15494a58255p87P1251J93133R1611K1139j2340m8359l2346m853N6871r2438j16850
15482c2223N4904l0572k2517k3297r743J41682N1555k843O0497N0792p9282q2798
15470G6155p261L5634n8138n0136J3623q7178j2173R665n8456O0220Q4236l3743
15458b7552N5274M175l3934q7396O9041o2997n1043R0987N5495J60372l89k8925
15446A43108m1338m3564l3068n8498m793p7272j7981J0483M2377K1142J8816K2409
$$ plain form
15434 -18179 5391 -30608 -86128 -67298 -45254 12476 40082 -6585 -52881 -100190 -68992 -4710
15422 -4710 2851 -51251 -5436 -112061 -162233 -125038 -162659 -185383 -196345 -204239 -130387 -16302
15410 -16302 73821 -12204 40281 22301 -40263 -131378 -164518 -72869 -7989 6698 13886 119556
15398 119556 53298 -26629 -190683 -219630 -70424 48561 87779 17785 86449 34205 48333
15387 48333 67961 -141220 -48586 2048 114716 194787 91441 -29835 -39683 155163 226219
15376 226219 176603 88961 154018 123752 28913 35027 73002 199520 6148 -89789 -116110
15365 -116110 -131710 -81063 -113513 -151949 -169093 -140614 -85817 24394 105817 95388 150504
15354 150504 146921 25649 17995 74535 80069 -5204 12232 -14750 74304 32026 -36037 67832
$$ packed form
15434a8179K3570l5999n5520J8830K2044N7730K7606m6667m6296m7309L1198O4282
15422d710P561n4102M5815j06625n0172L7195l7621k2724j0962p894P3852J14085
15410a6302R0123q6025N2485j7980o2564r1115l3140R1649O4880J4687P188J05670
15398A19556o6258p9927j64054k8947J49206J18985L9218o9994O8664n2244J4128
15387D8333J9628k09181R2634N0634J12668Q0071j03346j21276r848J94846P1056
15376B26219m9616q7642O5057l0266r4839O114L7975J26518j93372r5937k6321
15365a16110j5600N0647l2450l8436j7144K8479N4797J10211Q1423j0429N5116
15354A50504l583j21272p654N6540N534q5273J7436k6982Q9054m2278o8063J03869
$$ plain form
15342 67832 82713 47292 -41176 -157267 -132325 -24674 101440 219944 169236 88913 110353
15331 110353 75504 60634 153942 71014 -86930 -141871 -78146 34870 5199 -83970 -125102
15320 -125102 84993 139505 -20959 -23370 26190 -25507 64808 107938 -688 -140277 -182148
15309 -182148 -71874 75611 81359 21133 -13432 30290 -53113 73997 60100 51478 -8482
15298 -8482 -42530 87807 60879 22019 -46085 -93532 -144363 -149612 -91626 57977 88982 128079
15286 128079 -14292 -90987 -32454 -153388 -133358 9664 96101 119132 84771 29688 18691
15275 18691 -87054 -185962 -97296 20749 7920 -59795 -64766 -62006 -85497 -62244 4897 -25465
15263 -25465 -127095 -280208 -242004 -41059 23542 133183 193034 120216 81819 149388 83967
$$ packed form
15342F7832J4881l5421q8468j16091K4942J07651J26114J18504n0708q0323K1440
15331A10353l4849j4870R3308q2928j57944n4941O3725J13016k9671q9169m1132
15320a25102K10095N4512j60464k411M9560n1697R0315M3130j08626j39589m1871
15309a82148J10274J47485N748o0226l4565M3722q3403J27110j3897q622n9960
15298h482l4048J30337k6928l8860o8104m7447n0831n249N7986J49603L1005L9097
15286A28079j42371p6695N8533j20934K0030J43022Q6437K3031l4361n5083j0997
15275A8691j05745r8908Q8666J18045j2829o7715m971K760k3491K3253O7141l0362
15263b5465j01630j53113L8204K00945O4601J09641N9851p2818l8397O7569o5421
$$ plain form
15252 83967 142395 68284 129438 78992 81974 50398 -79644 -102962 -21378 95400 141998
15241 141998 115802 210251 283972 84053 -70174 -15931 32231 -103644 -176922 -149583 -86275
15230 -86275 -87121 -166114 -179154 -183880 -168011 -103520 -32674 -81335 -94937 28963 -15354 16048
15218 16048 -2717 -32207 -33274 -187842 -265510 -232578 -155428 -81817 -101981 -79527 6316 22493
15206 22493 -24455 -65048 -65371 -102517 -47719 -15977 -123662 -82516 -151628 -141509 -37210 63884
15194 63884 56378 57566 4893 94674 147276 53927 -47568 -89863 -102623 47434 49554 -136811
15182 -136811 -241418 -245441 -151165 56822 80802 68522 -33645 -89134 -84472 -67541 -101066
15171 -101066 -21673 94179 40284 65436 -12295 -54145 87704 164542 149410 134938 33368
$$ packed form
15252H3967N8428p4111O1154n0446K982l1576j30042k3318Q1584J16778M6598
15241A41998k6196R4449P3721j99919j54227N4243M8162j35875p3278K7339O3308
15230h6275q46p8993j3040m726J5869O4491P0846m8661j3602J23900m4317L1402
15218A6048j8765k9490j067j54568p7668L2932P7150P3611k0164K2454Q5843J6177
15206B2493m6948m0593l23l7146N4798L1742j07685M1146o9112J0119J04299J01094
15194F3884p506J188n2673Q9781N2602r3349j01495m2295j2760J50057K120j86365
15182a36811j04607m023R4276K07987K3980j2280j02167n5489M662J6931l3525
15171a01066P9393J15852n3895K5152p7731m1850J41849P6838j5132j4472j01570
$$ plain form
15160 33368 -92474 -106656 -58451 -78586 -137027 -144898 -138406 -170853 -6557 95008 186255
15149 186255 128287 47213 66895 113700 71047 93987 240105 383574 374021 222989 77135
15138 77135 30860 103052 80695 155482 138184 44673 34345 -7258 -52087 -65523 -124696 -98613
15126 -98613 -47515 9757 -1887 -14375 6482 -108236 -25725 127088 175097 156548 193190
15115 193190 231601 290654 325642 202954 105300 42608 16008 98977 69677 119716 144833
15104 144833 100197 130611 71338 97465 105039 77151 87690 150426 143719 80195 -28666 -30997
15092 -30997 84043 139326 172600 190200 214032 155452 96305 110227 117888 38862 -114619
15081 -114619 -92379 17294 101251 2163 -91890 -98138 20493 126923 198183 106642 32897
$$ packed form
15160C3368j25842j4182M8205k0135n8441p871O492l2447J64296J01565R1247
15149A86255n7968q1074J9682M6805m2653K2940J46118J43469r553j51032j45854
15138G7135m6275P2192k2357P4787j7298r3511j0328m1603m4829j3436n9173K6083
15126i8613N1098N7272j1644j2488K0857j14718Q2511J52813M8009j8549L6642
15115A93190L8411N9053L4988j22688r7654o2692k6600Q2969k9300N0039K5117
15104A44833m4636L0414n9273K6127P574k7888J0539O2736o707o3524j08861k331
15092c0997J15040N5283L3274J7600K3832n8580n9147J3922P661p9026j53481
15081a14619K2240J09673Q3957r9088r4053o248J18631J06430P1260r1541p3745
$$ plain form
15070 32897 125289 42916 23527 121735 203274 211426 39810 48839 46419 7926 -8721 -79418
15058 -79418 -70673 -115469 -110517 -99106 -50675 129036 198137 206569 291687 233443 125698 53102
15046 53102 111218 216391 249542 218525 180422 228234 195919 261914 198027 54719 -5876
15035 -5876 -5895 55906 80560 85583 18494 39213 93814 10732 87391 91852 76627 50628 93193
15022 93193 156803 151950 154700 112163 130297 221821 172420 77510 74365 112476 131150 248444
15010 248444 376104 340471 194158 148809 125329 170466 146336 118850 148103 191004 216346
14999 216346 231438 225108 223125 44917 26284 94491 58087 57530 119783 202289 207972 206838
14987 206838 229208 316944 413434 316059 174122 167265 135563 178303 313939 248499 173584
$$ packed form
15070C2897R2392q2373j9389R8208Q1539Q152j71616R029k420l8493j6647p0697
15058g9418Q745m4796M952J1411M8431J79711O9101Q432Q5118n8244j07745p2596
15046E3102N8116J05173L3151l1017l8103M7812l2315O5995o3887j43308o0595
15035e876j9O1801K4654N023o7089K0719N4601q3082P6659M461j5225k5999M2565
15022I3193O3610m853K750m2537J8134R1524m9401r4910l145L8111J8674J17294
15010B48444J27660l5633j46313m5349k3480M5137k4130k7486K9253M2901K5342
14999B16346J5092o330j983j78208j8633O8207l6404n57O2253Q2506N683j134
14987B06838K2370Q7736R6490r7375j41937o857l1702M2740J35636o5440p4915
$$ plain form
14976 173584 236486 253272 155443 113400 132677 122036 154359 240710 229553 212145 198194
14965 198194 176840 157410 262554 277228 296544 329062 248896 372129 321055 211088 81287
14954 81287 181401 127578 172734 310929 398263 446400 411496 316965 183330 212069 271192
14943 271192 368487 371396 395275 338307 347894 390992 504374 458241 402847 409194 321595 303331
14931 303331 260226 239530 404671 495809 421093 356257 334632 463643 507314 519314 545236
14920 545236 477976 449690 470010 366782 396599 438090 414129 297733 346543 386078 380484
14909 380484 353393 369511 411936 425668 424656 340882 313812 317183 248996 195028 206179 165321
14897 165321 202070 204273 275213 376233 469712 564428 666166 580013 511705 384674 372786
$$ packed form
14976A73584O2902J6786r7829m2043J9277j0641L2323Q6351j1157j7408j3951
14965A98194k1354j9430J05144J4674J9316L2518q0166J23233n1074j09967j29801
14954H1287J00114n3823M5156J38195Q7334M8137l4904r4531j33635K8739N9123
14943B71192R7295K909K3879n6968R587M3098J13382m6133n5394O347q7599j8264
14931C03331m3105k0696J65141R1138p4716o4836k1625J29011M3671J2000K5922
14920E45236o7260k8286K0320j03228K9817M1491k3961j16396M8810L9535n594
14909C80484k7091J6118M2425J3732j012q3774k7070L371o8187n3968J1151m0858
14897A65321L6749K203P0940J01020R3479R4716J01738q6153o8308j27031j1888
$$ plain form
14886 372786 357812 423951 403692 419778 452563 436182 337532 358568 484346 459874 451057
14875 451057 391102 346867 376774 437991 572836 707887 762424 737271 652930 701502 674398
14864 674398 680070 669697 678946 612450 603878 582148 526962 696724 705850 620660 610307 654205
14852 654205 729238 644684 597740 614807 602677 641091 714711 589503 529998 680704 729367
14841 729367 776805 819443 851290 872435 895301 909522 939078 924780 1003614 1096356 1172511
14830 1172511 1103397 1113355 1170252 1124056 1057595 935076 931512 1026512 1193301 1201982 1080759
14819 1080759 1021274 1103717 1206349 1152270 1072729 1132032 1261216 1236615 1181864 1223123 1324774
14808 1324774 1392559 1356454 1271381 1409043 1584476 1493773 1453682 1411347 1341837 1308340 1262458
$$ packed form
14886C72786j4974O6139k0259J6086L2785j6381r8650K1036J25778k4472q817
14875D51057n9955m4235K9907O1217J34845J35051N4537k5153q4341M8572k7104
14864F74398N672j0373R249o6496q572k1730n5186J69762R126q5190j0353M3898
14852F54205P5033q4554m6944J7067j2130L8414P3620j25208n9505J50706M8663
14841G29367M7438M2638L1847K1145K2866J4221K9556j4298P8834R2742P6155
14830A172511o9114R958N6897m6196o6461j22519l564R5000J66789Q681j21223
14819A080759n9485Q2443J02632n4079p9541N9303J29184k4601n4751M1259J01651
14808A324774O7785l6105q5073J37662J75433r0703m0091m2335o9510l3497m5882
$$ plain form
14797 1262458 1298445 1273088 1426286 1534026 1602919 1618324 1537091 1564226 1671715 1646455 1708563
14786 1708563 1795157 1862166 1943728 1924948 1939854 1914083 1914267 2060905 2172721 2145422 2170485
14775 2170485 2117322 2192871 2301775 2381523 2354029 2248551 2258152 2419837 2526623 2566297 2560441
14764 2560441 2602087 2696847 2747693 2819095 2834201 2921772 2980525 3019437 3033308 3187758 3382920
14753 3382920 3399985 3489893 3642243 3757216 3790625 3939009 4047076 4179295 4333912 4401550
14743 4401550 4511492 4633811 4740371 4820387 4925963 5118550 5301780 5465530 5593302 5687313
14733 5687313 5800902 6046770 6249742 6582543 6798480 6950289 7156564 7281236 7455328
14724 7455328 7827557 8138332 8487665 8698884 8909057 9203563 9638776 10027351 10276574
$$ packed form
14797A262458L5987k5357J53198J07740O8893J5405q1233K7135J07489k5260O2108
14786A708563Q6594O7009Q1562j8780J4906k5771J84J46638J11816k7299K5063
14775B170485n3163P5549J08904P9748k7494j05478R601J61685J06786L9674n856
14764B560441M1646R4760N0846P1402J5106Q7571N8753L8912J3871J54450J95162
14753C382920J7065Q9908J52350J14973L3409J48384J08067J32219J54617O7638
14743D401550J09942J22319J06560Q0016J05576J92587J83230J63750J27772R4011
14733E687313J13589K45868K02972L32801K15937J51809K06275J24672J74092
14724G455328L72229L10775L49333K11219K10173K94506M35213L88575K49223
$$ plain form
14715 10276574 10656607 11014119 11453961 11981758 12317986 12696104 13298366 13715914 14240087
14706 14240087 14805504 15326919 15920733 16519400 17179436 17871881 18573711 19399412 20282086
14697 20282086 21080571 21886469 22719686 23569776 24434108 25277596 26155473 27220269 28161187
14688 28161187 29106242 30192908 31333513 32244808 33196522 34187501 35094794 35965891 36856218
14679 36856218 37679424 38362043 38959256 39405429 39907182 40110329 40270559 40426641 40359874
14670 40359874 40259931 40100601 39835255 39359775 38744243 37956639 37239910 36469641 35671657
14661 35671657 34854243 33884589 32998009 32166739 31140893 30166509 29110856 28087923 27135624
14652 27135624 26240517 25318318 24300941 23343576 22503676 21757039 21000854 20184313 19365918
$$ packed form
14715A0276574L80033L57512M39842N27797L36228L78118O02262M17548N24173
14706A4240087N65417N21415N93814N98667O60036O92445P01830Q25701Q82674
14697B0282086P98485Q05898Q33217Q50090Q64332Q43488Q77877J064796R40918
14688B8161187R45055J086666J140605R11295R51714R90979R07293Q71097Q90327
14679C6856218Q23206O82619N97213M46173N01753K03147J60230J56082o6767
14670D0359874r9943j59330k65346m75480o15532p87604p16729p70269p97984
14661C5671657q17414r69654q86580q31270j025846r74384j055653j022933r52299
14652B7135624q95107r22199j017377r57365q39900p46637p56185q16541q18395
$$ plain form
14643 19365918 18721995 18064950 17333588 16723797 16012278 15377519 14777846 14286116 13854176
14634 13854176 13461723 12960163 12410650 11938189 11521277 11133393 10851112 10518815 10141244
14625 10141244 9703622 9374183 9054075 8816940 8652738 8455722 8147607 7856465 7609093
14616 7609093 7332669 7102196 6915126 6471555 6251686 6303785 6255228 6036358 5842093 5750030
14606 5750030 5613055 5429654 5296628 5231844 5112739 4976596 4854238 4664096 4478739 4355961
14596 4355961 4210694 4123645 3986193 3834185 3646993 3505374 3468188 3486749 3445590 3412187
14586 3412187 3415199 3458779 3368833 3198633 3079865 2982866 2921289 2867113 2834741 2828098 2830858
14575 2830858 2716210 2626975 2616642 2553396 2500175 2431172 2337890 2399832 2280877 2263594 2190979
$$ packed form
14643A9365918o43923o57045p31362o09791p11519o34759n99673m91730m31940
14634A3854176l92453n01560n49513m72461m16912l87884k82281l32297l77571
14625A0141244m37622l29439l20108k37135j64202j97016l08115k91142k47372
14616G609093k76424k30473j87070m43571k19869N2099m8557k18870j94265r2063
14606E750030j36975j83401j33026o4784j19105j36143j22358j90142j85357j22778
14596D355961j45267q7049j37452j52008j87192j41619l7186J8561m1159l3403
14586C412187L012M3580q9946j70200j18768r6999o1577n4176l2372o643K760
14575B830858j14648q9235j0333o3246n3221o9003r3282O1942j18955j7283p2615
$$ plain form
14564 2190979 2257037 2168486 2034871 1975231 1944763 1873799 1790647 1736541 1800537 1714089 1696877
14553 1696877 1687592 1625739 1672707 1738417 1611744 1659438 1665207 1557890 1611362 1548448 1422674
14542 1422674 1454742 1537367 1529527 1473922 1380591 1358455 1322010 1324089 1230673 1167264 1278895
14531 1278895 1289365 1267597 1206822 1125694 1151133 1115494 1158122 1164257 1128803 1144242 1097921
14520 1097921 1002594 904949 870834 762833 790506 716070 706526 701545 712262 791372 848949
14509 848949 806599 791176 787675 890369 981043 901742 954303 941272 935060 893174 760655
14498 760655 590048 718121 804759 813121 821288 700335 674700 744602 790342 795322 746920
14487 746920 667622 581343 609800 651523 693652 725441 675653 703963 699488 654698 640148 686646
$$ packed form
14564B190979O6058q8551j33615n9640l0468p0964q3152n4106O3996q6448j7212
14553A696877r285o1853M6968O5710j26673M7694N769j07317N3472o2914j25774
14542A422674L2068Q2625p840n5605r3331k2136l6445K079r3416o3409J11631
14531A278895J0470k1768o0775q1128K5439l5639M2628O135l5454J5439m6321
14520A097921r5327r7645l4115j08001K7673p4436r544m981J0717P9110N7577
14509H48949m2350j5423l501J02694R0674p9301N2561j3031o212m1886j32519
14498G60655j70607J28073Q6638Q362Q167j20953k5635O9902M5740M980m8402
14487G46920p9298q6279K8457M1723M2129L1789m9788K8310m475m4790j4550M6498
$$ plain form
14475 686646 723603 677122 820217 834677 854338 782718 615557 518834 510237 571454 617936
14464 617936 667225 690385 701973 666423 573439 458776 448035 430483 443955 491559 548670
14453 548670 546119 478563 502591 484118 510769 537820 546161 569964 593261 573460 481418 498945
14441 498945 460383 437369 414508 403996 531283 608025 703698 596120 482984 445889 425267
14430 425267 343304 163543 198806 328288 346526 343246 382385 388882 369061 396092 393336 403208
14418 403208 404908 282841 160633 268736 330747 374621 373558 389070 342850 276967 230286
14407 230286 209327 257047 371284 434064 406197 282832 312858 429306 470877 539834 574623
14396 574623 525800 559986 583521 764032 830728 883418 919566 854200 851747 952057 1030422
$$ packed form
14475F86646L6957m6481J43095J4460J9661p1620j67161r6723q597O1217M6482
14464F17936M9289K3160J1588l5550r2984j14663j0741j7552J3472M7604N7111
14453E48670k551o7556K4028j8473K6651K7051Q341K3803K3297j9801r2042J7527
14441D98945l8562k3014k2861j0512J27287P6742R5673j07578j13136l7095k0622
14430D25267q1963j79761L5263J29482J8238l280L9139O497j9821K7031k756R872
14418D03208J700j22067j22208J08103O2011M3874j063J5512m6220o5883m6681
14407B30286k0959M7720J14237O2780k7867j23365L0026J16448M1571O8957L4789
14396E74623m8823L4186K3535J80511O6696N2690L6148o5366k453J00310P8365
$$ plain form
14385 1030422 1048416 1179711 1249738 1198873 1245209 1356020 1493434 1525765 1629779 1744210
14375 1744210 1767142 1777086 1581538 1556543 1553436 1367926 1239481 1120118 1152073 1121369 991535
14364 991535 821659 668386 747705 785850 677417 548828 531360 584172 598948 626697 655686
14353 655686 537419 544505 536391 488430 579222 670508 599915 552672 480018 376499 263483
14342 263483 289458 411336 449281 409688 330047 286683 274644 343674 455617 513011 451772
14331 451772 449377 430834 433656 403180 295630 340266 366923 283584 251786 354639 424570
14320 424570 447766 430542 463318 454577 367995 243924 123532 150884 258687 258311 248498 354359
14308 354359 336603 192037 94639 202563 358278 339620 443878 436256 357394 341512 360729
$$ packed form
14385A030422J7994J31295P0027n0865M6336J10811J37414L2331J04014J14431
14375A744210K2932R944j95548k4995l107j85510j28445j19363L1955l0704j29834
14364I91535j69876j53273P9319L8145j08433j28589j7468N2812J4776K7749K8989
14353F55686j18267P086q114m7961R0792R1286p0593m7243p2654j03519j13016
14342B63483K5975J21878L7945l9593p9641m3364j2039O9030J11943N7394o1239
14331D51772k395j8543K822l0476j07550M4636K6657q3339l1798J02853O9931
14320D24570K3196j7224L2776q741q6582j24071j20392K7352J07803l76r813J05861
14308C54359j7756j44566r7398J07924J55715j8658J04258p622p8862j5882J9217
$$ plain form
14297 360729 316175 299332 416269 416426 313746 212850 274288 350673 393507 389052 482784
14286 482784 577692 667119 601654 573284 619961 670341 751879 790413 814682 822324 912641 1083908
14274 1083908 1301375 1416833 1538111 1707642 1812610 2017127 2257812 2713832 3257244
14265 3257244 3729131 4239482 4800429 5193877 5562636 5920136 6196301 6335529 6336449 6083106
14255 6083106 5571518 5055471 4615234 4135469 3639418 3176746 2784923 2360618 2072024
14246 2072024 1849307 1554737 1444312 1300163 1133396 885685 834997 793062 715134 587307
14236 587307 707734 758423 745663 790933 841652 813547 596332 548360 437470 385246 502560
14225 502560 592055 506299 343284 268577 240835 281001 241651 156038 194317 191833 104514
$$ packed form
14297C60729m4554j6843J16937J57j02680j00896O1438P6385M2834m455R3732
14286D82784R4908Q9427o5465k8370M6677N0380Q1538L8534K4269P642R0317J71267
14274A083908K17467J15458J21278J69531J04968K04517K40685M56020N43412
14265C257244M71887N10351N60947L93448L68759L57500K76165J39228R20k53343
14255F083106n11588n16047m40237m79765m96051m62672l91823m24305k88594
14246B072024k22717k94570j10425j44149j66767k47711n0688m1935p7928j27827
14236E87307J20427N0689j2760M5270N0719k8105k17215m7972j10890n2224J17314
14225E02560Q9495q5756j63015p4707k7742M0166l9350q5613L8279k484q7319
$$ plain form
14214 104514 183854 218244 246967 230870 274266 329938 329233 338078 321919 316215 307023 281634
14202 281634 328399 392133 340521 261513 266769 263900 279959 255550 200400 233473 287925 454676
14190 454676 427485 361694 371388 306493 333288 419637 413401 420516 391585 424112 514845 598420
14178 598420 560564 581566 450254 387962 380911 377038 405165 377726 394233 422690 409243 295724
14166 295724 341153 411026 436313 423805 434134 476959 500389 482955 360399 294399 300348
14155 300348 329180 247107 245076 241040 210757 273820 339449 257450 154349 49317 136912
14144 136912 242454 205234 222141 257259 176669 247470 289405 211153 260935 366808 218810
14133 218810 276920 274461 275268 225039 222867 239450 286925 329634 344114 272967 210843 236870
$$ packed form
14214A04514P9340L4390K8723j6097M3396N5672p05Q845j6159n704r192k5389
14202B81634M6765O3734n1612p9008N256k869J6059k4409n5150L3073N4452J66751
14190D54676k7191o5791R694o4895K6795Q6349o236P115k8931L2527R0733Q3575
14178E98420l7856K1002j31312o2292p051l873K8127k7439J6507K8457j3447j13519
14166B95724M5429O9873K5287j2508J0329M2825K3430j7434j22556o6000N949
14155C00348K8832q2073k031m036l0283O3063O5629q1999j03101j05032Q7595
14144A36912J05542l7220J6907L5118q0590P0801M1935p8252M9782J05873j47998
14133B18810N8110k459Q07n0229k172J6583M7475M2709J4480p1147o2124K6027
$$ plain form
14121 236870 344062 362351 310758 255885 131409 135179 214746 306750 424543 458117 444819
14110 444819 350212 251588 169994 159840 213551 159518 120041 231057 234167 251508 278775
14099 278775 294332 309036 400071 545592 541528 466561 405495 530699 687618 674912 609488
14088 609488 561821 636245 760360 920623 932882 1012299 1111827 1127040 1205803 1414142 1430764
14077 1430764 1378949 1348437 1242174 1175885 1129117 1117830 1040180 1020380 1162887 1275774 1289326
14066 1289326 1230153 1130376 1064898 1062126 1007854 1104937 1173908 1333364 1405357 1323228 1199618
14055 1199618 1320981 1433198 1465907 1384743 1329749 1434598 1349807 1287004 1345105 1456257
14045 1456257 1474079 1453440 1389002 1298928 1300674 1356714 1281170 1223632 1171521 1219844 1167876
$$ packed form
14121B36870J07192J8289n1593n4873j24476L770P9567R2004J17793L3574j3298
14110D44819r4607r8624q1594j0154N3711n4033l9477J11016L110J7341K7267
14099B78775J5557J4704R1035J45521m064p4967o1066J25204J56919j2706o5424
14088F09488m7667P4424J24115J60263J2259P9417R9528J5213P8763K08339J6622
14077A430764n1815l0512j06263o6289m6768j1287p7650j9800J42507J12887J3552
14066A289326n9173r9777o5478k772n4272R7083O8971J59456P1993q2129j23610
14055A199618J21363J12217L2709q1164n4994J04849q4791o2803N8101J11152
14045A456257J7822k0639o4438r0074J746N6040p5544n7538n2111M8323n1968
$$ plain form
14034 1167876 1155070 1363031 1419403 1273180 1232295 1318360 1267050 1274849 1335676 1537527 1558937
14023 1558937 1500639 1621509 1556816 1534071 1692072 1646212 1562180 1740840 1776642 1766105 1755115
14012 1755115 1819432 1827625 1795218 1929608 2122838 2253207 2301974 2346285 2393839 2470063 2515348
14001 2515348 2563344 2703889 2816032 2902376 2978173 2948529 2937781 3084019 3168956 3098353 3145449
13990 3145449 3371293 3689874 3727783 3785318 3825282 4048926 4146256 4227836 4336394 4636484
13980 4636484 4813638 4821647 4962526 5241836 5550300 5941118 6248188 6480635 6665689 6863079
13970 6863079 7110872 7340055 7773414 8322030 8717831 9215209 9866819 10507158 11125145
13961 11125145 11855426 12528403 13296900 14139384 15135184 16114408 17211722 18438759 19929597
$$ packed form
14034A167876j2806K07961N6372j46223m0885Q6065n1310P799O0827K01851K1410
14023A558937n8298J20870o4693k2745J58001m5860q4032J78660L5802j0537j0990
14012A755115O4317Q193l2407J34390J93230J30369M8767M4311M7554P6224M5285
14001B515348M7996J40545J12143Q6344P5797k9644j0748J46238Q4937p0603M7096
13990C145449K25844L18581L7909N7535L9964K23644R7330Q1580J08558L00090
13980D636484J77154Q009J40879K79310L08464L90818L07070K32447J85054J97390
13970F863079K47793K29183M33359N48616L95801M97378O51610O40339O17987
13961A1125145P30281O72977P68497Q42484R95800R79224J097314J227037J490838
$$ plain form
13952 19929597 21550558 23297942 25273249 27495773 30095414 33052658 36389173 40252616
13944 40252616 44639634 49497237 54983071 61334738 68705290 77089015 87015956 98743586
13936 98743586 112256811 128246962 146895533 167996080 191165064 215296076 238899965
13929 238899965 259656931 275449184 284320785 285235850 277650065 262819809 242434289
13922 242434289 218741626 193871168 169789663 147597348 127711974 110434321 95774701
13915 95774701 83417236 73016550 64197988 56687344 50284641 44797654 39895716 35678871
13907 35678871 32013093 28898305 26241687 23863519 21707978 19838800 18178643 16643711
13899 16643711 15147520 13814797 12775956 12024314 11183630 10405755 9841571 9266662 8629709
$$ packed form
13952A9929597J620961J747384J975307K222524K599641K957244L336515L863443
13944D0252616M387018M857603N485834O351667P370552Q383725R926941J1727630
13936I8743586J3513225J5990151J8648571K1100547K3168984K4131012K3603889
13929B38899965K0756966J5792253Q871601R15065p585785j4830256k0385520
13922B42434289k3692663k4870458k4081505k2192315j9885374j7277653j4659620
13915I5774701j2357465j0400686q818562p510644o402703n486987m901938m216845
13907C5678871l665778l114788k656618k378168k155541j869178j660157j534932
13899A6643711j496191j332723j038841p51642q40684p77875n64184n74909o36953
$$ plain form
13890 8629709 8106087 7818466 7434755 6791213 6363565 6082874 5765829 5441499 5202146
13881 5202146 5048916 4788278 4525859 4461174 4363741 4236372 4058621 3872115 3638312 3394641
13871 3394641 3332197 3213964 3068497 2849022 2676638 2444647 2379660 2421746 2355161 2249596
13861 2249596 2132838 2002284 1816102 1678528 1649177 1636459 1630384 1548477 1484664 1460154 1380270
13850 1380270 1438211 1390785 1454780 1425582 1315595 1258266 1183213 1162912 1089003 1004109 992072
13839 992072 945936 867146 848657 952239 1004546 949875 817420 692512 797947 800071 791236
13828 791236 807863 837521 808803 744627 677974 742360 753738 702448 661773 668974 649465 566996
13816 566996 525015 528182 524837 544031 511304 551862 594190 663364 682661 740227 844277 865836
$$ packed form
13890H629709n23622k87621l83711o43542m27648k80691l17045l24330k39353
13881E202146j53230k60638k62419o4685r7433j27369j77751j86506k33803k43671
13871C394641o2444j18233j45467k19475j72384k31991o4987M2086o6585j05565
13861B249596j16758j30554j86182j37574k9351j2718o075q1907o3813k4510p9884
13850A380270N7941m7426O3995k9198j09987n7329p5053k0301p3909q4894j2037
13839I92072m6136p8790j8489J03582N2307n4671j32455j24908J05435K124q835
13828G91236J6627K9658k8718o4176o6653O4386J1378n1290m0675P201j9509q2469
13816E66996m1981L167l345J9194l2727M0558M2328O9174J9297N7566J04050K1559
$$ plain form
13804 865836 809144 763698 636800 569274 622777 525169 483160 466480 382868 397596 384078
13793 384078 316896 305629 316602 395345 330633 296036 232540 188653 171282 158587 188171
13782 188171 68486 20809 81385 94482 147572 198621 77516 -67189 -143076 -181396 -170172
13771 -170172 -242960 -143320 79069 287263 499329 608603 656203 650278 597479 608140 619153
13760 619153 531439 497605 525908 598741 575598 554034 499422 339071 423846 509689 526107
13749 526107 561849 532709 585422 592510 631887 516780 459892 568857 698488 749971 863613
13738 863613 959049 990544 856817 947211 1022045 1043843 1043635 956216 854686 859733 807626 657629
13726 657629 468917 410589 346274 386915 514804 485661 382802 267832 244885 365171
$$ packed form
13804H65836n6692m5446j26898o7526N3503r7608m2009j6680q3612J4728j3518
13793C84078o7182j1267J0973P8743o4712l4597o3496m3887j7371j2695K9584
13782A88171j19685m7677O0576J3097N3090N1049j21105j44705p5887l8320J1224
13771a70172p2788R9640K22389K08194K12066J09274M7600n925n2799J0661J1013
13760F19153q7714l3834K8303P2833k3143k1564n4612j60351Q4775Q5843J6418
13749E26107L5742k9140N2713P088L9377j15107n6888J08965J29631N1483J13642
13738H63613R5436L1495j33727R0394P4834K1798k08q7419j01530N047n2107j49997
13726F57629j88712n8328o4315M0641J27889k9143j02859j14970k2947J20286
$$ plain form
13716 365171 471301 470225 503315 588585 633987 700129 669167 620201 531864 524187 691187
13705 691187 794420 766905 777756 865467 996889 909806 784130 770639 617142 419821
13695 419821 367185 179021 242515 381391 350925 291851 276164 265377 340711 452696 408561
13684 408561 323994 286180 335812 315492 282844 342159 333786 273931 330724 246828 204830 156381
13672 156381 140244 106045 202653 174342 85577 -42677 -67509 7353 119122 89594 123166
13661 123166 170515 220223 68422 -63062 -98937 -60039 49426 72984 93801 149315 175996
13650 175996 153329 207979 257725 215171 98532 99039 45103 40750 81912 77881 86250 -52575
13638 -52575 -66383 13927 -42327 -98417 65607 148088 60673 123480 59871 -63008 -37626
$$ packed form
13716C65171J06130j076L3090Q5270M5402O6142l0962m8966q8337p677J67000
13705F91187J03233k7515J0851Q7711J31422q7083j25676j3491j53497j97321
13695D19821n2636j88164O3494J38876l0466n9074j5687j0787P5334J11985m4135
13684D08561q4567l7814M9632k0320l2648N9315q373n9855N6793q3896m1998m8449
13672A56381j6137l4199R6608k8311q8765j28254k4832P4862J11769k9528L3572
13661A23166M7349M9708j51801j31484l5875L8898J09465K3558K0817N5514K6681
13650A75996k2667N4650M9746m2554j16639N07n3936m353M1162m031Q369j38825
13638e2575j3808Q0310n6254n6090J64024Q2481q7415O2807o3609j22879K5382
$$ plain form
13627 -37626 140198 190136 106937 82156 119763 95630 -46476 -24845 -9926 80501 14084
13616 14084 5875 79481 134450 34386 -62667 -89044 11209 64200 77900 98782 55137
13605 55137 41643 61814 -5305 82500 78479 150859 148450 90539 121772 242223 276031 116414
13593 116414 91840 155663 244382 319637 318224 234565 190821 177030 265179 365728 285928
13582 285928 292481 341591 250916 155200 73561 35337 170819 223173 80359 74393 70071 56148
13570 56148 124433 188300 257167 260568 222036 120307 -17303 6689 125355 75933 -46717
13559 -46717 -105475 -35376 30478 108880 72798 -26971 82621 107264 70804 59229 28039
13548 28039 -14074 -63523 3793 -11796 -21404 -38515 73643 79559 72462 190475 285633 281331
$$ packed form
13627c7626J77824M9938q3199k4781L7607k4133j42106K1631J4919R0427o6417
13616A4084q209P3606N4969j00064r7053k6377J00253N2991J3700K0882m3645
13605E5137j3494K0171o7119Q7805m021P2380k409n7911L1233J20451L3808j59617
13593A16414k4574O3823Q8719P5255j413q3659m3744j3791Q8149J00549p9800
13582B85928O553M9110r0675r5716q1639l8224J35482N2354j42814n966m322j3923
13570E6148O8285O3867O8867L401l8532j01729j37610K3992J18666m9422j22650
13559d6717n8758P0099O5854P8402l6082r9769J09592K4643l6460j1575l1190
13548B8039m2113m9449O7316j5589r608j7111J12158N916p097J18013R5158m302
$$ plain form
13536 281331 279100 219798 112673 76964 58114 35192 63412 199141 212081 152315 207972
13525 207972 193168 128343 127974 150341 88509 25929 159457 225874 109206 39866 18444
13514 18444 129677 182738 133867 117735 133585 89435 -42053 -89661 -68600 -77255 1261
13503 1261 120917 169359 78820 106485 186141 269010 463555 491825 351500 216202 204420
13492 204420 374184 453045 392211 343586 380104 349736 255739 199177 267287 482678 726865
13481 726865 774622 810941 774093 853640 1006010 1130475 1238954 1335520 1553611 1802077
13471 1802077 1973436 2005813 1864034 1625565 1426689 1236629 1060203 944555 758448 673106
13461 673106 704909 635733 621429 528766 519065 559670 644624 718992 738223 665994 533761
$$ packed form
13536B81331k231n9302j07125l5709j8850k2922K8220J35729J2940n9766N5657
13525B07972j4804o4825l69K2367o1832o2580J33528O6417j16668o9340k1422
13514A8444J11233N3061m8871j6132J5850m4150j31488m7608K1061q655P8516
13503A261J19656M8442r0539K7665P9656Q2869J94545K8270j40325j35298j1782
13492B04420J69764P8861o0834m8625L6518l0368r3997n6562O8110K15391K44187
13481G26865M7757L6319l6848P9547J52370J24465J08479R6566K18091K48466
13471A802077J71359L2377j41779k38469j98876j90060j76426j15648j86107q5342
13461F73106L1803o9176j4304r2663r701M0605Q4954P4368J9231p2229j32233
$$ plain form
13450 533761 519965 553487 603467 623436 703562 678983 657062 767519 931943 1070157 1207131
13439 1207131 1276772 1325536 1170685 914980 901981 892325 970392 912680 798385 781155 784319
13428 784319 774306 698754 662328 662856 715471 744083 790556 793443 752626 702518 711051 773861
13416 773861 896607 920550 763040 715450 769806 846325 931340 900512 915308 1028620 1056564
13405 1056564 955896 1002670 1047877 953501 795434 666364 556397 649969 770069 660827
13395 660827 606999 707188 852695 918810 1007959 923536 822149 714648 758648 882579
13385 882579 969049 997622 928804 941160 985492 1081900 1111420 1223545 1232801 1203610 1136489
13374 1136489 1086745 1155692 1186470 1245230 1110511 1056610 957545 1007995 1068910 1225522 1393092
$$ packed form
13450E33761j3796L3522M9980J9969Q0126k4579k1921J10457J64424J38214J36974
13439A207131O9641M8764j54851k55705j2999r656P8067n7712j14295j7230L164
13428G84319j0013p5552l6426N28N2615K8612M6473K887m0817n0108Q533O2810
13416G73861J22746K3943j57510m7590N4356P6519Q5015l0828J4796J13312K7944
13405A056564j00668M6774M5207r4376j58067j29070j09967R3572J20100j09242
13395F60827n3828J00189J45507O6115Q9149q4423j01387j07501M4000J23931
13385H82579Q6470K8573o8818J2356M4332R6408K9520J12125R256k9191o7121
13374A136489m9744O8947L0778N8760j34719n3901r9065N0450O0915J56612J67570
$$ plain form
13363 1393092 1401440 1286108 1384010 1482887 1456978 1519465 1593013 1662448 1630640 1620854 1729194
13352 1729194 1878550 1984578 2134827 2160206 2329673 2547533 2807599 2808755 2780790 2854247
13342 2854247 3016042 3306224 3587094 3840034 4040701 4400260 4710717 5083916 5647272
13333 5647272 6142000 6887699 7868595 8796081 9848214 11115092 12675879 14637793 17213837
13324 17213837 20509939 24599255 29767982 36620995 46209013 59861852 78535466 100885924
13316 100885924 121984244 134199650 133028513 120399336 101787675 82727615 66511397
13309 66511397 54250821 45867873 40659513 38079122 37481425 37785414 37804172 36469370
13301 36469370 34168894 31659703 29818395 29031474 29421848 30976679 33653377 37622380
$$ packed form
13363A393092Q348j15332R7902R8877k5909O2487P3548O9435l1808r786J08340
13352A729194J49356J06028J50249K5379J69467K17860K60066J156k7965P3457
13342B854247J61795K90182K80870K52940K00667L59559L10457L73199N63356
13333E647272M94728P45699R80896R27486J052133J266878J560787J961914K576044
13324A7213837L296102M089316N168727O853013R588018J3652839J8673614K2350458
13316A00885924K1098320J2215406j171137j2629177j8611661j9060060j6216218
13309F6511397j2260576q382948n208360k580391n97697L03989J8758j334802
13301C6469370k300476k509191j841308p86921L90374J554831K676698L969003
$$ plain form
13293 37622380 43856322 53007390 65608417 81253713 97442719 110985609 121374948
13286 121374948 130864749 141824492 153046085 160154989 159834681 151909919 139955850 128795231
13278 128795231 120553948 113977324 105486954 93350671 78859092 64542360 52391168
13271 52391168 43036877 36391658 31962408 29302904 28008468 27872991 29167755 31682443
13263 31682443 34998391 37859238 39570652 39984079 40255336 41241425 43949225 49156766
13255 49156766 57766372 70788882 89141504 111167169 131421916 141775511 137771081
13248 137771081 121816550 100217544 78551655 60096479 46116791 35917869 28459417
13241 28459417 22998624 18755525 15459129 12855148 10812971 9313011 7971943 6956634
$$ packed form
13293C7622380O233942R151068J2601027J5645296J6189006J3542890J0389339
13286A21374948R489801J0959743J1221593P108904l20308p924762j1954069j1160619
13278A28795231q241283o576624q490370j2136283j4491579j4316732j2151192
13271E2391168r354291o645219m429250k659504j294436j35477J294764K514688
13263C1682443L315948K860847J711414M13427K71257R86089K707800N207541
13255D9156766Q609606J3022510J8352622K2025665K0254747J0353595m004430
13248A37771081j5954531k1599006k1665889j8455176j3979688j0198922p458452
13241B8459417n460793m243099l296396k603981k042177j499960j341068j015309
$$ plain form
13233 6956634 6094660 5285861 4773871 4352004 3929152 3631199 3256255 2975789 2749052
13224 2749052 2614477 2403047 2117773 1904110 1882177 1781721 1683095 1582688 1513487 1485617
13214 1485617 1424940 1422303 1454287 1297767 1180691 1067790 972429 993483 929421 922007 926111
13203 926111 915248 951769 827495 746285 757790 696418 650285 554272 510971 518611 668051
13192 668051 662657 706759 733965 733208 743761 739090 728786 694334 716450 713470 746817 703799
13180 703799 574775 490281 387708 365917 371340 398612 466443 421906 341059 333849 376969
13169 376969 408869 292418 309781 369781 214095 85443 146855 145184 177319 191277 203010
13158 203010 164650 145522 195116 282405 298105 227996 223924 284875 276241 370747 377194 290935
$$ packed form
13233F956634q61974q08799n11990m21867m22852k97953l74944k80466k26737
13224B749052j34575k11430k85274k13663k1933j00456r8626j00407o9201k7870
13214A485617o0677k637L1984j56520j17076j12901r5361K1054o4062p414M104
13203I26111j0863L6521j24274q1210J1505o1372m6133r6013m3301P640J49440
13192F68051n394M4102K7206p57J0553m671j0304l4452K2116k980L3347m3018
13180G03799j29024q4494j02573k1791N423K7272O7831m4537q0847p210M3120
13169C76969L1900j16451J7363O0000j55686j28652O1412j671L2135J3958J1733
13158B03010l8360j9128M9594Q7289J5700p0109m072O0951q634R4506O447q6259
$$ plain form
13146 290935 184501 199682 229757 152386 30401 61708 125520 183073 170303 179613 106012
13135 106012 68839 55515 188864 196421 126422 121087 136272 302503 460413 505493 514078
13124 514078 486379 501560 557420 494387 384030 256447 323393 238733 187306 157234 142736
13113 142736 146889 316895 239845 257993 297892 286959 272976 335380 289987 231866 237611 248887
13101 248887 292874 375408 214820 79616 27542 -106952 -97654 34128 159625 230805 379730
13090 379730 305771 120094 178267 236756 185999 222647 200210 160955 91066 44805 109791
13079 109791 195182 223600 187284 151191 153246 225330 258739 221834 164140 14073 18393 180605
13067 180605 185451 230680 266792 288710 186295 131524 138137 99852 96337 -2772 127595 278859
$$ packed form
13146B90935j06434J5181L0075p7371j21985L1307O3812N7553j2770R310p3601
13135A06012l7173j3324J33349P557o9999n335J5185J66231J57910M5080Q585
13124E14078k7699J5181N5860o3033j10357j27583O6946q4660n1427l0072j4498
13113A42736M153J70006p7050J8148L9899j0933j3983O2404m5393n8121N745J1276
13101B48887M3987Q2534j60588j35204n2074j34494R298J31782J25497P1180J48925
13090C79730p3959j85677N8173N8489n0757L6648k2437l9255o9889m6261O4986
13079A09791Q5391K8418l6316l6093K055P2084L3409l6905n7694j50067M320J62212
13067A80605M846M5229L6112K1918j02415n4771O613l8285l515r9109J30367J51264
$$ plain form
13055 278859 313037 295297 244818 224138 158674 162343 144606 108294 87632 115891 185779 138278
13043 138278 116639 222935 239158 166774 182608 99493 45059 156664 171583 76791 28812
13032 28812 31727 -10329 -33149 -65568 -99822 -30568 61525 96397 48062 11989 152945 198778
13020 198778 225303 189080 49404 -96627 -107269 6633 125550 95662 2727 -19792 -66118
13009 -66118 41168 8882 106701 112172 -42149 -69196 -154857 -176835 -37000 50308 124830
12998 124830 173211 128023 -5955 -196532 -166333 -43092 102768 178756 90348 121645 158175
12987 158175 203199 427004 505651 504384 398798 470732 635413 742918 945548 1116466
12977 1116466 1279221 1286080 1242220 1128699 935806 887467 776354 685799 644896 545954 469496
$$ packed form
13055B78859L4178j7740n0479k0680o5464L669j7737l6312k0662K8259O9888m7501
13043A38278k1639J06296J6223p2384J5834q3115n4434J11605J4919r4792m7979
13032B8812K915m2056k2820l2419l4254O9254R2093L4872m8335l6073J40956M5833
13020A98778K6525l6223j39676j46031j0642J13902J18917k9888r2935k2519m6326
13009f6118J07286l2286R7819N471j54321k7047q5661k1978J39835Q7308P4522
12998A24830M8381m5188j33978j90577L0199J23241J45860P5988q8408L1297L6530
12987A58175M5024K23805P8647j267j05586P1934J64681J07505K02630J70918
12977A116466J62755O859m3860j13521j92893m8339j11113r0555m0903r8942p6458
$$ plain form
12966 469496 501964 536696 506443 461165 484446 583269 723172 898542 974542 898988 1028332
12955 1028332 1219587 1332497 1249701 1275184 1451664 1428259 1484149 1549996 1646202 1530992
12945 1530992 1478695 1301749 1238526 1098473 976864 1017289 1016730 984104 888571 796847 790010
12934 790010 772895 815926 800814 831543 889552 790979 695514 567899 705847 899412 835014
12923 835014 881022 957864 1032439 1014115 1013528 1148442 1243459 1188717 1087023 1010054 996579
12912 996579 869345 687721 595621 603528 491541 298199 205345 220601 136651 126532 168813
12901 168813 167216 158510 129658 144329 262423 251870 169742 271447 369533 369298 300758 267317
12889 267317 218833 254860 253799 220752 149382 233040 312680 187837 107897 97968 145116 106990
$$ packed form
12966D69496L2468L4732l0253m5278K3281R8823J39903J75370P6000p5554J29344
12955A028332J91255J12910q2796K5483J76480k3405N5890O5847R6206j15210
12945A530992n2297j76946o3223j40053j21609M0425n59l2626r5533r1724o837
12934G90010j7115M3031j5112L0729N8009r8573r5465j27615J37948J93565o4398
12923H35014M6008P6842P4575j8324n87J34914R5017n4742j01694p6969j3475
12912I96579j27234j81624r2100P907j11987j93342r2854J5256q3950j0119M2281
12901A68813j597q706k8852J4671J18094j0553q2128J01705R8086k35o8540l3441
12889B67317m8484L6027j061l3047p1370Q3658P9640j24843p9940r929M7148l8126
$$ plain form
12877 106990 29836 47382 -8797 16038 96859 128960 -122359 -218419 -215134 -129416 -78031
12866 -78031 -92538 73592 189149 285204 381881 476893 436602 418511 543665 563862 534798
12855 534798 603226 551256 550295 457877 391670 216448 50457 173851 226271 228660 224750 289711
12843 289711 372325 309776 305189 560668 521143 420902 372616 366956 291591 149516 230088
12832 230088 409175 552594 633054 745708 810488 829533 852671 746881 789892 830040 889259
12821 889259 814611 718830 558488 490563 490198 473829 398521 343976 366604 393401 319605 311763
12809 311763 380563 400530 298935 290139 361568 393044 386557 252917 224187 306376 267206
12798 267206 359592 461597 474909 494593 573064 779848 878300 981345 1023252 985200 862039
$$ packed form
12877A06990p7154J7546n6179K4835Q0821L2101k51319r6060L285Q5718N1385
12866g8031j4507J66130J15557R6055R6677R5012m0291j8091J25154K0197k9064
12855E34798O8428n1970r61r2418o6207j75222j65991J23394N2420K389l910O4961
12843B89711Q2614o2549m587K55479l9525j00241m8286n660p5365j42075Q0572
12832B30088J79087J43419Q0460J12654O4780J9045K3138j05790M3011M0148N9219
12821H89259p4648r5781j60342o7925l65j6369p5308n4545K2628K6797p3796p842
12809C11763O8800J9967j01595q796P1429L1476o487j33640k8730Q2189l9170
12798B67206R2386J02005J3312J9684P8471K06784R8452J03045M1907l8052j23161
$$ plain form
12787 862039 632218 438632 313714 260616 380436 494073 444180 352836 350449 463923
12777 463923 500644 479454 558367 499557 437092 398793 319465 273092 301806 281870 326254
12766 326254 358139 347904 379035 387145 297005 398260 439400 365893 349437 398637 363324
12755 363324 389626 445789 406615 385846 345652 381154 517557 592289 708715 663590 601866
12744 601866 587882 589574 632413 622930 534664 528841 560972 499294 450922 339776 289801 296891
12732 296891 339087 400176 478847 404934 342172 246102 194565 282138 369272 422600 484680
12721 484680 569699 613516 650360 558266 400811 332491 277474 363971 475605 449923 345113
12710 345113 223734 189311 174451 207011 262778 378670 424013 350351 240414 186722 334334
$$ packed form
12787H62039k29821j93586j24918n3098J19820J13637m9893r1344k387J13474
12777D63923L6721k1190P8913n8810o2465l8299p9328m6373K8714j9936M4384
12766C26254L1885j0235L1131Q110r0140J01255M1140p3507j6456M9200l5313
12755C63324K6302N6163l9174k0769m0194L5502J36403P4732J16426m5125o1724
12744F01866j3984J692M2839r483q8266n823L2131o1678m8372j11146m9975P090
12732B96891M2196O1089P8671p3913o2762r6070n1537Q7573Q7134N3328O2080
12721D84680Q5019M3817L6844r2094j57455o8320n5017Q6497J11634k5682j04810
12710C45113j21379l4423j4860L2560N5767J15892M5343p3662j09937n3692J47612
$$ plain form
12699 334334 377290 420504 437147 371311 317500 256803 108728 154603 283236 432866 456513
12688 456513 365188 346994 386389 463090 621137 669716 658493 790401 804423 883454 986873
12677 986873 939833 731602 644858 655008 691920 709905 660013 668817 772840 789817 734348
12666 734348 787898 727608 750092 706409 614243 711588 982203 1175833 1138219 1205746 1230421
12655 1230421 1219104 1331571 1431433 1422905 1458590 1469888 1559916 1637076 1540683 1435443 1528069
12644 1528069 1567838 1431510 1499145 1479335 1503582 1667903 1636211 1440936 1493908 1479796 1432972
12633 1432972 1432575 1411784 1391877 1365437 1408965 1542696 1568559 1596786 1675554 1755085 1915215
12622 1915215 2069033 2140690 2244498 2306486 2260573 2075554 1897997 1811691 1740894 1710083
$$ packed form
12699C34334M2956M3214J6643o5836n3811o0697j48075M5875J28633J49630K3647
12688D56513r1325j8194L9395P6701J58047M8579j1223J31908J4022P9031J03419
12677I86873m7040k08231q6744J0150L6912J7985m9892Q804J04023J6977n5469
12666G34348N3550o0290K2484m3683r2166R7345K70615J93630l7614O7527K4675
12655A230421j1317J12467R9862q528L5685J1298R0028P7160r6393j05240R2626
12644A528069L9769j36328O7635j9810K4247J64321l1692j95275N2972j4112m6824
12633A432972l97k0791j9907k6440M3528J33731K5863K8227P8768P9531J60130
12622A915215J53818P1657J03808O1988m5913j85019j77557q6306p0797l0811
$$ plain form
12612 1710083 1732051 1800446 1956657 1875733 1891812 1739635 1754201 1839411 1849907 1834995 1803480
12601 1803480 1794798 1775412 1833301 2021448 1963875 2016538 2100558 2143023 2175819 2182755 2254533
12590 2254533 2197330 2147592 2152586 2201477 2245882 2273928 2306191 2350901 2413834 2490428 2485441 2459277
12578 2459277 2483329 2563688 2602889 2706528 2798005 2995158 3100598 3191293 3388757 3617402
12568 3617402 3698282 3677868 3849039 4028492 4115106 4363287 4612630 4795897 5047149 5347311
12558 5347311 5695146 5932722 6267084 6482346 6896269 7322591 7730995 8144792 8636992
12549 8636992 9351493 10216842 11117553 12062871 13279093 14729033 16337539 18051939 20191577
12540 20191577 22592588 25313269 28532901 32401533 37321330 43593794 51538059 61537310
$$ packed form
12612A710083K1968O8395J56211q0924J6079j52177J4566Q5210J0496j4912l1515
12601A803480q682j9386N7889J88147n7573N2663Q4020M2465L2796O936P1778
12590B254533n7203m9738M994M8891M4405K8046L2263M4710O2933P6594m987k6164
12578B459277K4052Q0359L9201J03639R1477J97153J05440R0695J97464K28645
12568C617402Q0880k0414J71171J79453Q6614K48181K49343J83267K51252L00162
12558E347311L47835K37576L34362K15262M13923M26322M08404M13797M92200
12549H636992P14501Q65349R00711R45318J216222J449940J608506J714400K139638
12540B0191577K401011K720681L219632L868632M919797O272464P944265R999251
$$ plain form
12532 61537310 74418089 90980207 111979386 138191030 168791627 200054790 224542284
12525 224542284 235003674 229088198 210446643 185072052 158769065 135450727 116589694
12518 116589694 102216414 92048389 85416944 81546629 80160308 81019965 83711751 88234177
12510 88234177 94548986 102537823 112171492 123396274 136005585 149826230 164541874
12503 164541874 179824731 195311835 210320179 224205999 236387596 246204517 253065287
12496 253065287 256599053 256950607 253733258 247352943 238232415 226944348 214019249 199789543
12488 199789543 185164630 170492350 156116965 142503030 130059699 118815598 109161549
12481 109161549 100914999 94208671 89090496 85712268 84146497 84418711 86947643 91767171
$$ packed form
12532F1537310J2880779J6562118K0999179K6211644L0600597L1263163K4487494
12525B24542284J0461390n915476j8641555k5374591k6302987k3318338j8861033
12518A16589694j4373280j0168025o631445l870315j386321Q59657K691786M522426
12510H8234177O314809P988837R633669J1224782J2609311J3820645J4715644
12503A64541874J5282857J5487104J5008344J3885820J2181597R816921O860770
12496B53065287L533766L51554l217349o380315r120528j1288067j2925099j4229706
12488A99789543j4624913j4672280j4375385j3613935j2443331j1244101r654049
12481A09161549q246550o706328n118175l378228j565771K72214K528932M819528
$$ plain form
12473 91767171 99463603 110503038 125629156 145397963 169425836 196025363 220446668
12466 220446668 235963337 236984579 222705704 197452207 167512695 137922790 111774856
12459 111774856 90153739 72941463 59477591 49075755 40987485 34590480 29545881
12452 29545881 25571862 22453054 19879186 17748087 15971183 14440053 13115075 11960603
12444 11960603 10836893 9795401 8805903 8048860 7545599 7068404 6458288 6013627 5666740
12435 5666740 5427406 5175708 4832172 4537805 4378423 4209655 3972491 3813104 3576388
12426 3576388 3364307 3219170 3032168 2862859 2778969 2696524 2656305 2634196 2521188 2526989
12416 2526989 2443051 2319083 2354640 2324604 2259550 2115112 2032421 1938561 1853067 1810307 1680675
$$ packed form
12473I1767171P696432J1039435J5126118J9768807K4027873K6599527K4421305
12466B20446668J5516669J021242j4278875k5253497k9939512k9589905k6147934
12459A11774856k1621117j7212276j3463872j0401836q088270o397005n044599
12452B9545881l974019l118808k573868k131099j776904j531130j324978j154472
12444A1960603j123710j041492r89498p57043n03261m77195o10116m44661l46887
12435E666740k39334k51698l43536k94367j59382j68768k37164j59387k36716
12426C576388k12081j45137j87002j69309q3890q2445m0219k2109j13008N801
12416B526989q3938j23968L5557l0036o5054j44438q2691r3860q5494m2760j29632
$$ plain form
12405 1680675 1564508 1505141 1506746 1555754 1608751 1681561 1732896 1651853 1524180 1535309 1595747
12394 1595747 1608953 1554191 1501251 1567128 1654182 1577841 1557022 1508811 1572071 1545696 1464787
12383 1464787 1423596 1458356 1480100 1326217 1312192 1286258 1362506 1278236 1240849 1104919 1005420
12372 1005420 974730 917826 900637 1010955 1277207 1405733 1551812 1551260 1543682 1459642 1469973
12361 1469973 1674479 1732838 1726818 1702258 1669155 1557593 1537698 1605045 1585836 1498861 1458292
12350 1458292 1382584 1395647 1436996 1524898 1341214 1177194 1196592 1208544 1191736 1068313 1036801
12339 1036801 1081345 1183029 1180264 1148506 1121703 1023638 1002981 1132696 1173970 1174453 1140707
12328 1140707 1120219 1000596 971655 1150503 1239402 1130772 1024713 889505 951995 978826
$$ packed form
12405A680675j16167n9367J605M9008N2997P2810N1335q1043j27673J1129O0438
12394A595747J3206n4762n2940O5877Q7054p6341k0819m8211O3260k6375q0909
12383A464787m1191L4760K1744j53883j4025k5934P6248q4270l7387j35930r9499
12372A005420l0690n6904j7189J10318K66252J28526J46079n52p578q4040J0331
12361A469973K04506N8359o020k4560l3103j11562j9895O7347j9209q6975m0569
12350A458292p5708J3063M1349Q7902j83684j64020J9398J1952j6808j23423l1512
12339A036801M4544J01684k765l1758k6803r8065k0657J29715M1274M83l3746
12328A140707k0488j19623k8941J78848Q8899j08630j06059j35208O2490K6831
$$ plain form
12318 978826 937822 838448 831296 701785 743166 694452 622827 652979 610866 636815 724479
12307 724479 855205 833082 858552 824459 787704 917112 902261 800646 699384 579054
12297 579054 567263 631937 466693 356743 406552 454160 361954 359256 454866 532319 438118
12286 438118 379703 352709 443474 385945 410674 463981 450742 384633 353855 414585 344678
12275 344678 335422 437412 360612 216579 274023 291960 297315 410577 408625 439136 330057
12264 330057 319262 312050 390814 321137 245256 148119 34580 26877 77367 122842 99902 112173
12252 112173 110735 76614 97677 171270 168850 318324 300604 305530 202097 198367 223718 308270
12240 308270 223872 46463 155855 260600 357669 312728 250434 41377 96705 197944
$$ packed form
12318I78826m1004r9374p152j29511M1381m8714p1625L0152m2113K5949Q7664
12307G24479J30726k2123K5470l4093l6755J29408j4851j01615j01262j20330
12297E79054j1791O4674j65244j09950M9809M7608r2206k698R5610P7453r4201
12286D38118n8415k6994R0765n7529K4729N3307j3239o6109l0778O0730o9907
12275C44678r256J01990p6800j44033N7444J7937N355J13262j952L0511j09079
12264C30057j0795p212P8764o9677p5881r7137j13539p703N0490M5475k2940J2271
12252A12173j438l4121K1063P3593k420J49474j7720M926j03433l730K5351Q4552
12240C08270q4398j77409J09392J04745R7069m4941o2294k09057N5328J01239
$$ plain form
12230 197944 151157 136450 182817 129580 115822 173463 155244 39629 42289 19246 48070
12219 48070 43778 60584 33065 -149121 -97239 -74077 -180931 -127374 37026 104664 117234
12208 117234 136231 165830 218767 182050 141867 227623 282003 307260 344136 251672 220209
12197 220209 241266 119293 -73833 -110005 -94220 -135405 -14414 179652 197440 25510
12187 25510 80232 85668 125968 116750 104250 160905 26871 63923 144449 97616 33160 88677
12175 88677 204058 239494 198766 111196 63393 -53301 62070 12426 -24936 17704 84049
12164 84049 137791 238574 164646 95653 90649 112781 99400 73647 151253 111599 62418 167085
12152 167085 161964 41950 3181 96441 124870 109780 54275 114850 153319 172793 220547
$$ packed form
12230A97944m6787j4707M6367n3237j3758N7641j8219j15615K660k3043K8824
12219D8070m292J6806k7519j82186N1882K3162j06854N3557J64400O7638J2570
12208A17234J8997K9599N2937l6717m0183Q5756N4380K5257L6876r2464l1463
12197B20209K1057j21973j93126l6172J5785m1185J20991J94066J7788j71930
12187B5510N4722N436M0300r218j2500N6655j34034L7052Q0526m6833o4456N5517
12175H8677J15381L5436m0728q7570m7803j16694J15371m9644l7362M2640O6345
12164H4049N3742J00783p3928o8993n004K2132j3381k5753P7606l9654m9181J04667
12152A67085n121j20014l8769R3260K8429j5090n5505O0575L8469J9474M7754
$$ plain form
12141 220547 209475 112416 140907 132461 57295 -49064 42999 32929 32417 55430 32814 161724
12129 161724 246084 138139 66945 92473 65179 115348 117377 180369 131176 137486 115954 55771
12117 55771 -5787 -158225 -162229 -20522 45462 73163 59111 102760 122567 64457 54639 15944
12105 15944 47263 153978 149548 148770 61111 -25194 -9604 43422 3699 -6263 113895 34562
12093 34562 42429 -10226 -112889 -119235 -28683 5724 142878 184561 149033 183773 83895 33217
12081 33217 32120 10426 138948 66397 16888 162069 153728 264785 395555 431379 562870
12070 562870 702366 824632 937290 934007 843458 746298 742079 775034 815524 737960 676122
12059 676122 631001 500335 431751 379303 371073 477196 443683 415450 517822 645381 887444
$$ packed form
12141B20547j1072r7059K8491q446p5166j06359R2063j0070n12K3013k2616J28910
12129A61724Q4360j07945p1194K5528k7294N0169K029O2992m9193O310k1532o0183
12117E5771o1558j52438m004J41707O5984K7701j4052M3649J9807n8110r818l8695
12105A5944L1319J06715m430p78q7659q6305J5590N3026l9723r962J20158p9333
12093C4562P867n2655j02663o346R0552L4407J37154M1683l5528L4740r9878n0678
12081C3217j097k1694J28522p2551m9509J45181q341J11057J30770L5824J31491
12070E62870J39496J22266J12658l283r0549r7160m219L2955M0490p7564o1838
12059F76122m5121j30666o8584n2448q230J06123l3513k8233J02372J27559K42063
$$ plain form
12048 887444 920070 977241 966581 1029248 907150 802612 797712 830409 937068 961952 916392
12037 916392 1007077 1209602 1197568 1130698 962571 875182 945443 966017 865081 887137 788604
12026 788604 743975 768443 579943 449275 613331 662696 644579 505425 468175 535406 667953
12015 667953 667180 552651 490773 573707 855883 1146685 1274713 1187840 1057657 984308 951705
12004 951705 812595 729181 692400 535689 503960 501315 382927 352385 519487 638944 657922
11993 657922 557160 365872 340494 249677 203876 281299 242300 262128 297812 317607 374701
11982 374701 380391 378379 289976 280021 296778 253287 206653 217827 197569 173494 189004 178563
11970 178563 181638 67504 55617 30032 14121 95327 57129 80302 176894 235630 127795
$$ packed form
12048H87444L2626N7171j0660O2667j22098j04538m900L2697J06659K4884m5560
12037I16392R0685K02525j2034o6870j68127q7389P0261K0574j00936K2056r8533
12026G88604m4629K4468j88500j30668J64056M9365j8117j39154l7250O7231J32547
12015F67953p73j14529o1878Q2934K82176K90802J28028q6873j30183p3349l2603
12004I51705j39110q3414l6781j56711l1729k645j18388l0542J67102J19457J8978
11993F57922j00762j91288k5378r0817m5801P7423l8999J9828L5684J9795N7094
11982C74701N690k012q8403r955J6757m3491m6634J1174k0258k4075J5510j0441
11970A78563L075j14134j1887k5585j5911Q1206l8198K3173R6592N8736j07835
$$ plain form
11959 127795 18490 -3288 -71334 -73539 -35490 195611 241366 152077 -14187 -30237 30776
11948 30776 78285 46467 -6518 -104892 -152150 -160174 -131494 -38164 113245 112808 61397 6380
11936 6380 18167 92010 77147 -4830 -102717 -125555 -121870 -14574 16298 27091 85423 39610
11924 39610 127008 189413 96334 107020 166505 152913 80808 96131 111129 137400 217141 154985
11912 154985 111248 77864 22766 31381 121230 161289 21676 -59674 -95376 -34005 84463
11901 84463 169675 256103 275416 178522 109578 31508 -7898 46685 -3514 -56202 -78234 -2944
11889 -2944 28997 51030 22541 102577 120315 149798 173697 145906 17360 -97985 -84429
11878 -84429 86100 314634 259866 148776 151299 183087 123958 -27693 37329 -13311 -26067
$$ packed form
11959A27795j09305k1778o8046k205L8049K31101M5755q9289j66264j6050O1013
11948C0776M7509l1818n2985r8374m7258q024K8680R3330J51409m37n1411n5017
11936F380J1787P3843j4863q1977r7887k2838L685J07296L0872J0793N8332m5813
11924C9610Q7398O2405r3079J0686N9485j3592p2105J5323J4998K6271P9741o2156
11912A54985m3737l3384n5098Q615Q9849M0059j39613q1350l5702O1371J18468
11901H4463Q5212Q6428J9313r6894o8944p8070l9406N4583n0199n2688k2032P5290
11889b944L1941K2033k8489Q0036J7738K9483K3899k7791j28546j15345J3556
11878h4429J70529K28534n4768j11090K523L1788n9129j51651O5022n0640j2756
$$ plain form
11867 -26067 -183942 -199287 4866 31603 16388 31398 96995 123125 50999 -49022 -53366
11856 -53366 -160165 -103818 -6033 59134 50051 -42930 -44014 -51913 -26341 -83698 -58351 7107
11844 7107 57676 108779 77163 118357 91586 41364 70512 47086 -4930 -5732 -71834 -36170
11832 -36170 121248 33237 -54951 -39311 -17247 49388 126845 175885 234242 255425 211872
11821 211872 160203 79522 67820 86259 -1456 -36684 26927 95897 73016 -132436 -107514
11810 -107514 -46156 -49230 39399 130180 -1631 -144221 -226337 -219450 -109251 69299 33203
11799 33203 5770 -14707 -50850 -95476 -129158 -130889 -11439 33073 106764 104938 112694 -15556
11787 -15556 -183710 -87107 15805 -656 75287 205461 32413 -89407 -58148 2133 44975
$$ packed form
11867b6067j57875j5345K04153K6737j5215J5010O5597K6130p2126j00021m344
11856e3366j06799N6347R7785O5167r083r2981j084p899K5572n7357K5347O5458
11844G107N0569N1103l1616M1194k6771n0222K9148k3426n2016q02o6102L5664
11832c6170J57418q8011q8188J5640K2064O6635P7457M9040N8357K1183m3553
11821B11872n1669q0681j1702J8439q7715l5228O3611O8970k2881k05452K4922
11810a07514O1358l074Q8629R0781j31811j42590q2116O887J10199J78550l6096
11799C3203k7433k0477l6143m4626l3682j731J19450M4512P3691j826P756j28250
11787a5556j68154R6603J02912j6461P5943J30174j73048j21820L1259O0281M2842
$$ plain form
11776 44975 74520 -51814 -143225 -200756 -65141 88943 113444 127023 182012 92480 60526
11765 60526 55879 47276 65651 142677 204853 202523 133642 63432 48624 -47835 1263 142832
11753 142832 103822 142170 179032 41690 -5500 77731 150302 114921 161839 204687 57388
11742 57388 34782 -116953 -3010 73488 125888 151222 104534 118826 31932 -42529 -112785
11731 -112785 -184381 -138378 -103463 -73663 68372 74454 107860 160447 102048 63837 -92578
11720 -92578 -137214 -93716 -49078 -4350 -1026 32905 163898 177020 125082 27303 42937 1277
11708 1277 -2099 34589 39016 -11377 7910 32171 66195 213126 238201 111350 73091 22073
11696 22073 94407 36627 7797 48731 -69101 -75045 -150151 -60233 30547 -41951 -37781 -6327
$$ packed form
11776D4975K9545j26334r1411n7531J35615J54084K4501J3579N4989q9532l1954
11765F0526m647q603J8375P7026O2176k330o8881p0210j4808r6459M9098J41569
11753A42832l9010L8348L6862j37342m7190Q3231P2571l5381M6918M2848j47299
11742E7388k2606j51735J13943P6498N2400K5334m6688J4292q6894p4461p0256
11731a12785p1596M6003L4915K9800J42035O082L3406N2587n8399l8211j56415
11720i2578m4636M3498M4638M4728L324L3931J30993J3122n1938r7779J5634m1660
11708A277l376L6688M427n0393J9287K4261L4024J46931K5075j26851l8259n1018
11696B2073P2334n7780k8830M0934j17832n944p5106Q9918R0780p2498M170L1454
$$ plain form
11684 -6327 -21464 -50697 -125188 -179814 -267899 -260006 -131051 60255 136448 46431 -8968 -26159
11672 -26159 -96624 -75836 -52236 -158221 -209130 -110739 41504 71791 -19197 -44259 44332
11661 44332 77553 -57476 -92780 -25205 60516 179507 176252 110456 161801 214553 263472
11650 263472 95391 -14496 -142622 -98061 -4225 64195 90470 49118 -34531 27484 62885
11639 62885 -101990 -161920 -44298 -3701 27457 57318 62268 11201 -68018 -120014 -34279
11628 -34279 -105986 -202034 -175895 -141836 -69231 -130758 -101648 -85638 -123049 -181911 -153846 -24193
11616 -24193 8513 -42628 -115718 -224302 -179612 -10353 207616 303980 294203 267011 160034
11605 160034 121784 51345 -65761 -179706 -24842 -15799 -134673 -55548 116181 138342 91360
$$ packed form
11684f327j5137k9233p4491n4626q8085P893J28955J91306P6193r0017n5399j7191
11672b6159p0465K0788K3600j05985n0909R8391J52243L0287r0988k5062Q8591
11661D4332L3221j35029l5304O7575Q5721J18991l255o5796N1345N2752M8919
11650B63472j68081j09887j28126M4561R3836O8420K6275m1352q3649O2015L5401
11639F2885j64875n9930J17622M0597L1158K9861M950n1067p9219n1996Q5735
11628c4279p1707r6048K6139L4059P2605o1527K9110J6010l7411n8862K8065J29653
11616b4193L2706n1141p3090j08584M4690J69259K17969R6364r777k7192j06977
11605A60034l8250p0439j17106j13945J54864R043j18874P9125J71729K2161m6982
$$ plain form
11594 91360 32313 -74505 -143211 -153215 -109119 -2410 158081 124002 62330 85661 32812
11583 32812 53357 -23490 -46295 33741 104131 63380 32847 -2044 -74754 -138053 -55132 -36066
11571 -36066 -51411 41908 13401 -7657 134381 178414 176323 209146 149168 120890 114413 -5271
11559 -5271 42389 82987 -10176 64123 56526 37908 37083 -3620 38188 70889 94642 80755
11547 80755 54209 -3319 -40460 -36041 -58586 -203138 -166798 12580 155233 107537 -43518
11536 -43518 -98117 34384 101546 185624 121828 98291 123888 114935 -45404 -63027 63551
11525 63551 77518 127013 147519 61313 47137 -39678 -103443 16276 25764 -34314 -10112 25170
11513 25170 47586 36162 54373 22999 48630 123353 136024 25739 12232 84809 114760
$$ packed form
11594I1360n9047j06818o8706j0004M4096J06709J60491l4079o1672K3331n2849
11583C2812K0545p6847k2805Q0036P0390m0751l0533l4891p2710o3299Q2921J9066
11571c6066j5345R3319k8507k1058J42038M4033k091L2823n9978k8278o477j19684
11559e271M7660M0598r3163P4299p597j8618q25m0703M1808L2701K3753j3887
11547H0755k6546n7528l7141M419k2545j44552L6340J79378J42653m7696j51055
11536d3518n4599J32501O7162Q4078o3796k3537K5597q953j60339j7623J26578
11525F3551J3967M9495K0506q6206j4176q6815o3765J19719R488o0078K4202L5282
11513B5170K2416j1424J8211l1374K5631P4723J2671j10285j3507P2577K9951
$$ plain form
11502 114760 156183 92472 -17342 27838 24192 -13705 -55378 9503 144822 269958 334966
11491 334966 219596 245854 229781 119560 64983 50039 36259 -16056 -17934 -86094 -91541
11480 -91541 -71666 -10911 -7794 -29733 -76332 -23396 116941 106026 102954 134083 89921 75807
11468 75807 135701 140628 115329 182172 226741 40867 -90666 -24383 83676 135326 303996
11457 303996 374113 278223 141283 -26580 -148344 -92324 58712 -68635 -172069 -48429
11447 -48429 -51426 -45803 5641 -47809 55939 55108 -5011 171370 217969 109061 47659 -55090
11435 -55090 -756 17829 -41143 31889 -15044 -49084 -34266 -7827 84523 126535 106788 478
11423 478 -109453 -110495 -170844 -158565 -47800 -10418 80173 124693 190789 244841 247665 219202
$$ packed form
11502A14760M1423o3711j09814M5180l646l7897m1673O4881J35319J25136O5008
11491C34966j15370K6258j6073j10221n4577j4944j3780n2315j878o8160n447
11480i1541J9875O0755L117k1939m6599N2936J40337j0915l072L1129m4162j4114
11468G5807N9894M927k5299O6843M4569j85874j31533O6283J08059N1650J68670
11457C03996P0117r5890j36940j67863j21764N6020J51036j27347j03434J23640
11447d8429k997N623N1444n3450J03748q31o0119J76381M6599j08908o1402j02749
11435e5090N4334J8585n8972P3032m6933l4040J4818K6439R2350M2012j9747j06310
11423D78j09931j042o0349J2279J10765L7382R0591M4520O6096N4052K824k8463
$$ plain form
11411 219202 259489 264991 202307 102063 31917 112619 86524 20005 39183 79267 63544
11400 63544 191254 244097 191592 218605 124717 83351 95473 117628 46626 12073 1175
11389 1175 46433 92286 76733 -46620 32586 72280 137579 121495 153938 217652 280294 320776
11377 320776 424037 443036 405597 406794 463139 482579 539337 694041 782326 825112 826837
11366 826837 812405 848577 791752 652382 381304 387355 413221 416214 531408 443387 361288
11355 361288 349879 334952 228390 226507 297864 326227 374505 413141 483261 647396 659195
11344 659195 638194 670178 691965 770468 793257 858104 923573 964994 987993 1097364 1204052
11333 1204052 1283752 1236775 1219987 1195427 1219266 1093317 859013 728836 577051 516349
$$ packed form
11411B19202M0287N502o2684j00244p0146Q0702k6095o6519J9178M0084j5723
11400F3544J27710N2843n2505K7013r3888m1366J2122K2155p1002l4553j0898
11389A175M5258M5853j5553j23353P9206L9694O5299j6084L2443O3714O2642M0482
11377C20776J03261J8999l7439J197N6345J9440N6758J54704Q8285M2786J725
11366H26837j4432L6172n6825j39370k71078O051K5866K993J15194q8021q2099
11355C61288j1409j4927j06562j883P1357K8363M8278L8636P0120J64135J1799
11344F59195k1001L1984K1787P8503K2789O4847O5469M1421K2999J09371J06688
11333A204052P9700m6977j6788k4560K3839j25949k34304j30177j51785o0702
$$ plain form
11323 516349 509275 409754 384584 421651 413213 517101 578119 576526 579914 419604 388763 476794
11311 476794 455876 448675 467148 475227 507338 696766 636130 558047 694763 748466 871977
11300 871977 997789 865091 689796 598222 403117 370451 474641 406522 356205 433365
11290 433365 444384 381300 341038 311896 263625 330708 442166 349946 313269 286581 283332
11279 283332 287758 296710 281879 299616 304971 295489 371906 313459 319443 320487 202298 195767 174896
11266 174896 127947 -537 63305 233340 326353 431521 517791 429173 384942 364330 369977
11255 369977 477017 660893 571459 420534 315348 344908 380566 365512 242107 223204
11245 223204 220653 114496 77691 3631 48813 162881 254190 265943 427447 426957 370578
$$ packed form
11323E16349p074r9521k5170L7067q438J03888O1018j593L388j60310l0841Q8031
11311D76794k0918p201J8473Q079L2111J89428o0636p8083J36716N3703J23511
11300H71977J25812j32698j75295r1574j95105l2666J04190o8119n0317P7160
11290D33365J1019o3084m0262k9142m8271O7083J11458r2220l6677k6688l249
11279B83332M426Q952j4831J7737N355r482P6417n8447N984J044j18189o531k0871
11266A74896m6949j28484O3842J70035R3013J05168Q6270q8618m4231k0612N647
11255C69977J07040J83876q9434j50925j05186K9560L5658j5054j23405j8903
11245B23204k551j06157l6805p4060M5182J14068R1309J1753J61504m90n6379
$$ plain form
11234 370578 277562 325638 333499 250510 292810 391077 440542 482503 544738 555928 459662 419477
11222 419477 457776 507441 546100 662859 654910 584359 605831 500435 512777 413269 365481
11211 365481 381302 287202 277719 428687 586600 438540 290972 290605 365542 382891 421433
11200 421433 456382 437306 400843 373050 319768 354523 373108 457447 556104 531193 539923 594430
11188 594430 573065 557166 515654 436305 455653 470423 396414 334968 284984 194090 314191
11177 314191 406304 404695 438901 468017 411584 402381 387614 421151 468931 471911 408564 371473
11165 371473 351426 301729 304689 352155 359298 294218 257606 189288 230551 396851 549016
11154 549016 503902 429698 282865 207981 314587 314627 230140 209203 201954 187627 247606 336061
$$ packed form
11234C70578r3016M8076P861q2989M2300R8267M9465M1961O2235J1190r6266m0185
11222D19477L8299M9665L8659J16759p949p0551K1472j05396J2342r9508m7788
11211C65481J5821r4100r483J50968J57913j48060j47568l67P4937J7349L8542
11200D21433L4949j9076l6463k7793n3282L4755J8585Q4339R8657k4911Q730N4507
11188E94430k1365j5899m1512p9349J9348J4770p4009o1446m9984r0894J20101
11177C14191R2113j609L4206K9116n6433r203j4767L3537M7780K980o3347l7091
11165C71473k0047m9697K960M7466P143o5080l6612o8318M1263J66300J52165
11154E49016m5114p4204j46833p4884J06606M0q4487k0937p249j4327N9979Q8455
$$ plain form
11142 336061 248716 235961 284429 417394 514994 667984 536943 407740 369497 356125 289662
11131 289662 251709 190781 81828 40926 37030 93977 185242 259007 211590 217021 197294 153690
11119 153690 212278 268110 319614 205867 214894 194650 62767 7386 44286 108524 110003
11108 110003 125343 279495 466330 551306 448809 401382 390930 492715 549267 517354 489600
11097 489600 463219 490623 469759 441301 492761 506061 499356 527374 382788 355719 473941
11086 473941 605910 629955 621942 512332 476491 627422 690083 760968 1008344 1144203 1094221
11075 1094221 1058113 1227315 1473121 1626240 1436345 1201086 1152738 1105287 1018201 1032519
11065 1032519 951759 870721 870273 897349 878460 897648 945149 1088496 1100966 854341 844656
$$ packed form
11142C36061q7345j2755M8468J32965R7600J52990j31041j29203l8243j3372o6463
11131B89662l7953o0928j08953m0902l896N6947R1265P3765m7417N431j9727m3604
11119A53690N8588N5832N1504j13747R027k0244j31883n5381L6900O4238J479
11108A10003J5340J54152J86835Q4976j02497m7427j0452J01785N6552l1913k7754
11097D89600k6381K7404k0864k8458N1460J3300o705K8018j44586k7069J18222
11086D73941J31969K4045q013j09610l5841J50931O2661P0885K47376J35859m9982
11075A094221l6108J69202K45806J53119j89895k35259m8348m7451q7086J4318
11065A032519q0760q1038m48K7076j8889J9188M7501J43347J2470k46625r685
$$ plain form
11054 844656 960493 1045276 1028276 944825 973876 1053747 1056164 1087123 1238756 1184661 1255782
11043 1255782 1381674 1343213 1401169 1510425 1587334 1711966 1665583 1663341 1685542 1753423 1789164
11032 1789164 1815057 1811906 1781911 1762005 1751395 1655644 1760929 1876943 1872918 1849183 1726264
11021 1726264 1782709 1828107 1760555 1746485 1896006 2028907 2142102 2222968 2238203 2315300 2442826
11010 2442826 2401173 2302850 2207826 2122647 2159640 2268144 2447677 2449249 2462986 2478514 2504935
10999 2504935 2531491 2543000 2666869 2674333 2678226 2733452 2786321 2723363 2710568 2711614 2750877 2824198
10987 2824198 2827074 2942594 2952226 2931424 2952362 3039781 3325711 3655941 3824493 3965974 4098624
10976 4098624 4195116 4365117 4472557 4747345 5153368 5661564 6108515 6447460 6992638 7727944
$$ packed form
11054H44656J15837Q4783j7000q3451K9051P9871K417L0959J51633n4095P1121
11043A255782J25892l8461N7956J09256P6909J24632m6383k242K2201O7881L5741
11032A789164K5893l151k9995j9906j0610r5751J05285J16014m025k3735j22919
11021A726264N6445M5398o7552j4070J49521J32901J13195Q0866J5235P7097J27526
11010B442826m1653r8323r5024q5179L6993J08504J79533J572J3737J5528K6421
10999B504935K6556J1509J23869P464L893N5226N2869o2958j2795J046L9263P3321
10987B824198K876J15520R632k0802K0938Q7419K85930L30230J68552J41481J32650
10976D098624R6492J70001J07440K74788M06023N08196M46951L38945N45178P35306
$$ plain form
10966 7727944 8427830 9443842 10770197 11937046 13248466 14703144 16474364 18665921
10958 18665921 21696275 25699588 30999364 38150022 48060661 62272072 82202936 107527378
10950 107527378 132642710 147050220 144063230 127522311 105664619 84559334 67263948
10943 67263948 54879565 46621852 41758476 39775411 40083380 41169480 41114399 39243344
10935 39243344 36280618 33436991 31364063 30427326 30792092 32361670 35151278 39483228
10927 39483228 45794760 55326335 68993352 85244515 99706384 108530315 113418177 119506339
10919 119506339 130069711 144307458 156977571 162031035 157592309 147110025 136374958
10912 136374958 128155947 119917565 107577085 91519810 75033921 60600685 49236546
$$ packed form
10966G727944O99886J016012J326355J166849J311420J454678J771220K191557
10958A8665921L030354M003313N299776P150658R910639J4211411J9930864K5324442
10950A07527378K5115332J4407510k986990j6540919k1857692k1105285j7295386
10943F7263948j2384383q257713m863376j983065L07969J086100n5081j871055
10935C9243344k962726k843627k072928r36737L64766J569578K789608M331950
10927C9483228O311532R531575J3667017J6251163J4461869Q823931M887862O088162
10919A19506339J0563372J4237747J2670113N053464m438726j0482284j0735067
10912A36374958q219011q238382j2340480j6057275j6485889j4433236j1364139
$$ plain form
10905 49236546 41039021 35562259 32025399 29834157 29032660 29550613 31380635 34413256
10897 34413256 37793250 39784566 39689586 38444217 37639177 38171949 40704612 45630798 53847985
10888 53847985 66337501 84163434 106544513 127941530 138671712 133140678 115455734
10881 115455734 93263266 72106352 54856573 41971776 32762137 26176009 21347675
10874 21347675 17785089 15139968 13099020 11452263 10077471 9022906 7954565 7082761
10866 7082761 6405821 5805811 5286753 4980340 4679299 4375814 4003784 3656063 3475593
10857 3475593 3300917 3053647 2860147 2745579 2653275 2504294 2410620 2352065 2308222 2140244
10847 2140244 2019296 1917068 1892439 1869109 1813687 1733124 1641251 1632696 1675517 1683421 1621598
$$ packed form
10905D9236546q197525n476762l536860k191242q01497N17953J830022L032621
10897C4413256L379994J991316r4980j245369q05040N32772K532663M926186Q217187
10888E3847985J2489516J7825933K2381079K1397017J0730182n531034j7684944
10881A15455734k2192468k1156914j7249779j2884797r209639o586128m828334
10874B1347675l562586k645121k040948j646757j374792j054565j068341q71804
10866G082761o76940o00010n19058l06413l01041l03485l72030l47721j80470
10857C475593j74676k47270j93500j14568r2304j48981r3674n8555m3843j67978
10847B140244j20948j02228k4629k3330n5422q0563r1873q555M2821P904o1823
$$ plain form
10836 1621598 1522337 1484700 1448200 1463180 1480411 1445959 1519424 1604056 1670427 1779414 1685802
10825 1685802 1424461 1164241 1167434 1158030 1204898 1292003 1365201 1299983 1225206 1209890 1279036
10814 1279036 1248455 1225826 1327074 1260527 1206355 1164389 1132295 1115491 1225231 1169603 1096775
10803 1096775 1104251 989320 951405 948547 960707 986943 891875 877031 882783 846187 754117 838037
10791 838037 903600 1073689 1172355 1104021 1062723 1089581 1195385 1201036 1090386 1012280 1051794
10780 1051794 1000669 910144 954082 989560 973542 987482 1037610 1009466 1061931 1243666 1306695
10769 1306695 1249022 1315297 1320162 1185439 1186150 1361404 1523378 1660457 1639435 1624786 1555202
10758 1555202 1449179 1486030 1529080 1587509 1541660 1585547 1688873 1875477 1924085 2005609 2252353
$$ packed form
10836A621598r9261l7637l6500J4980J7231l4452P3465Q4632O6371J08987r3612
10825A685802k61341k60220L193r404M6868Q7105P3198o5218p4777j5316O9146
10814A279036l0581k2629J01248o6547n4172m1966l2094j6804J09740n5628p2828
10803A096775P476j14931l7915k858J2160K6236r5068j4844N752l6596r2070Q3920
10791H38037O5563J70089R8666o8334m1298K6858J05804N651j10650p8106L9514
10780A051794n1125r0525M3938L5478j6018J3940N0128k8144N2465J81735O3029
10769A306695n7673O6275M865j34723P11J75254J61974J37079k1022j4649o9584
10758A555202j06023L6851M3050N8429m5849M3887J03326J86604M8608Q1524K46744
$$ plain form
10747 2252353 2332591 2353677 2367256 2293238 2212390 2192763 2220572 2221976 2194745 2202106 2332450
10736 2332450 2462026 2314317 2144253 2257314 2363716 2455659 2521467 2560113 2570492 2582398
10726 2582398 2628185 2683245 2692615 2691662 2747433 2794240 2770854 2766716 2847718 2885539 2784939 2727110
10714 2727110 2852097 2938476 2976510 2962754 2993565 3030585 3011902 2976237 3118484 3246472 3252639
10703 3252639 3261243 3286145 3241658 3366901 3441708 3556033 3568695 3527231 3568788 3580699 3607575
10692 3607575 3588232 3537577 3613929 3786945 3984945 4115040 4163303 4217504 4249650 4170464 4300009
10681 4300009 4471468 4690565 4959040 5339782 5949091 6389114 6548950 6507448 6284689 6066686
10671 6066686 5940134 5755063 5576847 5605234 5725980 5867545 5908006 5985439 6037321 6172562
$$ packed form
10747B252353Q0238K1086J3579p4018q0848j9627K7809J404k7231P361J30344
10736B332450J29576j47709j70064J13061J06402R1943O5808L8646J0379J1906
10726B582398M5787N5060R370r53N5771M6807k3386m138Q1002L7821j00600n7829
10714B727110J24987Q6379L8034j3756L0811L7020j8683l5665J42247J27988O167
10703C252639Q604K4902m4487J25243P4807J14325J2662m1464M1557J1911K6876
10692C607575j9343n0655P6352J73016J98000J30095M8263N4201L2146p9186J29545
10681D300009J71459K19097K68475L80742O09309M40023J59836m1502k22759k18003
10671F066686j26552j85071j78216K8387J20746J41565M0461P7433N1882J35241
$$ plain form
10661 6172562 6400005 6626908 6852238 7047372 7277173 7502029 7708270 7929119 8145278
10652 8145278 8439028 8885751 9316447 9794502 10410247 11096205 11644351 12158052 12693668
10643 12693668 13437703 14394511 15203342 15670786 16197127 16883078 17470272 18180840 18874295
10634 18874295 19672747 20807781 22130588 23595647 25222939 27179504 29309913 31638095
10626 31638095 34459183 37545942 40902242 44679377 49098637 54281259 60175926 66700030
10618 66700030 74164724 82669529 91806837 101725026 112235496 122822844 132840795 141736672
10610 141736672 148671134 153075857 154699710 153429977 149683298 144336628 138361144 132395598
10602 132395598 127182560 122913335 119951090 118552029 118631919 119773974 122126098 125147060
$$ packed form
10661F172562K27443K26903K25330J95134K29801K24856K06241K20849K16159
10652H145278K93750M46723M30696M78055O15745O85958N48146N13701N35616
10643A2693668P44035R56808Q08831M67444N26341O85951N87194P10568O93455
10634A8874295P98452J135034J322807J465059J627292J956565K130409K328182
10626C1638095K821088L086759L356300L777135M419260N182622N894667O524104
10618F6700030P464694Q504805R137308R918189J0510470J0587348J0017951Q895877
10610A41736672O934462M404723J623853j269733l746679n346670n975484n965546
10602A32395598n213038m269225k962245j399061P9890J142055K352124L020962
$$ plain form
10594 125147060 128666173 132257125 135616307 138631332 141528353 144530901 147863449 151712802
10586 151712802 156387632 161777512 167724438 173784855 179353111 183823993 186750521 187803923
10578 187803923 186454921 182971113 178038082 171887598 165233530 158734769 152594889 147270931
10570 147270931 142733333 139004721 135869846 132781384 129616784 126291628 122797786 119364168
10562 119364168 116270261 113757376 112264111 111907076 112633710 114341999 116818724 120106177
10554 120106177 123701462 127188295 130111094 132050448 132518716 130993870 127587329 122338220
10546 122338220 115620482 107780259 99187985 90505698 82183379 74432170 67335117 60980695
10538 60980695 55237909 49988328 45284174 41129392 37460247 34242678 31431251 28970890
$$ packed form
10594A25147060L519113L590952L359182L015025K897021L002548L332548L849353
10586A51712802M674830N389880N946926O060417N568256M470882K926528J053402
10578A87803923j349002l483808m933031o150484o654068o498761o139880n323958
10570A47270931m537598l728612l134875l088462l164600l325156l493842l433618
10562A19364168l093907k512885j493265l57035P26634J708289K476725L287453
10554A20106177L595285L486833K922799J939354M68268j524846l406541n249109
10546A22338220o717738p840223q592274q682287q322319p751209p097053o354422
10538F0980695n742786n249581m704154m154782l669145l217569k811427k460361
$$ plain form
10530 28970890 26776309 24838708 23291184 21969844 20631562 19414407 18116260 16881542
10522 16881542 15901908 14962156 14018507 13181740 12471806 11850245 11224236 10697281 10248377
10513 10248377 9786166 9411422 8910118 8432674 8120895 7906892 7614645 7386636 7211521
10504 7211521 6842091 6724428 6662784 6519290 6332091 6247583 6102473 5863559 5651723 5582976
10494 5582976 5539371 5404411 5249910 5034361 4962466 4823767 4712831 4595725 4308923 4146938
10484 4146938 4001794 3796121 3741110 3728166 3532624 3354991 3301005 3269125 3179914 3100206
10474 3100206 2965133 2929433 2993980 3034336 2968646 2892659 2924546 2770078 2639175 2654181 2674858
10463 2674858 2716422 2770876 2668582 2657459 2745009 2593333 2320069 2185395 2092451 2001553
$$ packed form
10530B8970890k194581j937601j547524j321340j338282j217155j298147j234718
10522A6881542r79634r39752r43649q36767p09934o21561o26009n26955m48904
10513A0248377m62211l74744n01304m77444l11779k14003k92247k28009j75115
10504G211521l69430j17663o1644j43494j87199q4508j45110k38914k11836o8747
10494E582976m3605j34960j54501k15549p1895j38699j10936j17106k86802j61985
10484D146938j45144k05673n5011j2944j95542j77633n3986l1880q9211p9708
10474C100206j35073l5700O4547M0356o5690p5987L1887j54468j30903J5006K0677
10463B674858M1564N4454j02294j1123Q7550j51676k73264j34674r2944r0898
$$ plain form
10453 2001553 2099865 2175439 2125630 2025649 1987070 2038826 2196278 2151339 2119925 2179516 2108429
10442 2108429 2080305 2050002 1922671 1810091 1689332 1719945 1663342 1579902 1655315 1589871 1554787
10431 1554787 1536525 1509213 1523953 1447827 1357738 1322737 1255092 1199336 1247094 1112412 1045006
10420 1045006 1142547 1161589 1106220 1014654 1052557 1160586 1205724 1157797 1180964 1122281 1017669
10409 1017669 1012558 1001751 1001760 1151013 1184021 1040023 997818 960428 922898 881486 825477 888657
10397 888657 788750 700833 694043 711718 709399 711418 685153 782402 811827 839990 858183 959857
10385 959857 1008690 995872 963614 850347 779811 841051 864437 833882 868574 857385 815927
10374 815927 758223 763907 880499 866095 881788 840894 758764 700715 672602 679403 739216 721773
$$ packed form
10453B001553R8312P5574m9809r9981l8579N1756J57452m4939l1414N9591p1087
10442B108429k8124l0303j27331j12580j20759L0613n6603q3440P5413o5444l5084
10431A554787j8262k7312J4740p6126r0089l5001o7645n5756M7758j34682o7406
10420A045006R7541J9042n5369r1566L7903J08029M5138m7927K3167n8683j04612
10409A017669n111j0807RJ49253L3008j43998m2205l7390l7530m1412n6009O3180
10397H88657r9907q7917o790J7675k319K019k6265R7249K9425K8163J8193J01674
10385I59857M8833j2818l2258j13267p0536O1240K3386l0555L4692j1189m1458
10374H15927n7704N684J16592j4404J5693m0894q2130n8049k8113O801N9813j7443
$$ plain form
10362 721773 740149 781442 809018 818701 730880 732483 731104 706057 626032 501768 504415 532949
10350 532949 677692 686627 578821 478584 428987 483500 500000 577194 560582 533864 463821
10339 463821 500960 640616 702453 653028 727102 768713 729549 754418 722423 613511 588742
10328 588742 661316 594816 596032 735631 666901 577976 547289 509292 395541 369311 376264
10317 376264 379766 317023 184576 120968 209145 347333 477614 481515 419664 374237 372022
10306 372022 306694 307080 366485 466926 417249 393130 340175 449555 509828 497614 532554
10295 532554 569389 598022 571046 552060 469605 451075 495267 474569 415313 305598 307527
10284 307527 368747 501119 419903 294754 328378 405406 352610 373276 466285 367626 376499
$$ packed form
10362G21773J8376M1293K7576R683q7821J603j379k5047q0025j24264K647K8534
10350E32949J44743Q935j07806j00237m9597N4513J6500P7194j6612k6718p0043
10339D63821L7139J39656O1837m9425P4074M1611l9164K4869l1995j08912k4769
10328E88742P2574o6500J216J39599o8730q8925l0687l7997j13751k6230O953
10317C76264L502o2743j32447o3608Q8177J38188J30281L901o1851m5427k215
10306C72022o5328L86N9405J00441m9677k4119n2955J09380O0273j2214L4940
10295E32554L6835K8633k6976j8986q2455j8530M4192k0698n9256j09715J929
10284C07527O1220J32372q1216j25149L3624P7028n2796K0666R3009r8659Q873
$$ plain form
10273 376499 478670 485490 491640 447815 337181 282274 335598 457346 447424 334338 235054
10262 235054 385714 472633 436653 323158 326478 375973 342155 213419 227258 178686 239495
10251 239495 319686 306798 337112 360043 367067 285935 271356 305043 349646 321837 278065 308262
10239 308262 343068 290260 303717 270531 174627 198910 281717 296650 258049 165628 215541
10228 215541 303646 379131 282382 243762 238020 285223 386890 362312 314992 340612 378048
10217 378048 381757 323577 307808 222679 249721 270018 385875 479956 424348 365457 276404
10206 276404 163486 192380 418280 662087 741621 791643 741311 626878 519930 403797
10196 403797 376434 430611 586329 694931 752552 763803 723032 706161 801501 947663 1049709
$$ packed form
10273C76499J02171O820O150m3825j10634n4907N3324J21748r922j13086r9284
10262B35054J50660Q6919l5980j13495L320M9495l3818j28736J3839m8572O0809
10251B39495Q0191j2888L0314K2931P024q1132j4579L3687M4603k7809m3772L0197
10239C08262L4806n2808J3457l3186r5904K4283Q2807J4933l8601r2421M9913
10228B15541Q8105P5485r6749l8620n742M7203J01667k4578m7320K5620L7436
10217C78048L709n8180j5769q5129K7042K0297J15857R4081n5608n8891q9053
10206B76404j12918K8894K25900K43807P9534N0022n0332j14433j06948j16133
10196D03797k7363N4177J55718J08602N7621J1251m0771j6871R5340J46162J02046
$$ plain form
10185 1049709 1017807 950827 944129 968647 907707 1057582 1117956 1052780 936825 948775 1002705
10174 1002705 851613 762775 719150 765626 797268 906939 851094 788211 789318 857764 915788
10163 915788 986124 1058968 1062478 1017737 1042339 1049448 1014274 981315 1055030 1089119 1090366 1184744
10151 1184744 1196418 1173877 1079128 970185 952051 860514 714487 593691 639060 688860 791686
10140 791686 878411 894708 926213 821523 657896 679312 672087 670380 664517 716210 796936 722552
10128 722552 670974 727978 746084 728965 624271 612438 783390 847013 784271 734365 760300
10117 760300 802659 715477 618629 559638 613605 539135 552333 485543 493228 481010 552017 572594
10105 572594 398282 321330 401505 481196 429601 374679 419780 523484 500108 492329 512653
$$ packed form
10185A049709l1902o6980o698K4518o0940J49875O0374o5176j15955J1950N3930
10174A002705j51092q8838m3625M6476L1642J09671n5845o2883J107O8446N8024
10163I15788P0336P2844L510m4741K4602P109l5174l2959P3715L4089J247R4378
10151A184744J1674k2541r4749j08943j8134r1537j46027j20796M5369M9800J02826
10140G91686Q6725J6297L1505j04690j63627K1416p225j707n863N1693Q0726p4384
10128G22552n1578N7004J8106j7119j04694j1833J70952O3623o2742m9906K5935
10117G60300M2359q7182r6848n8991N3967p4470J3198o6790P685j2218P1007K0577
10105E72594j74312p6952Q0175P9691n1595n4922M5101J03704k3376p779K0324
$$ plain form
10094 512653 503801 465461 449309 510607 561865 459407 353654 354785 437004 515753 502817
10083 502817 506829 638296 642163 733798 757048 769471 894457 910884 913883 904988 901465 1026491
10071 1026491 1014387 1159906 1304590 1481838 1840007 2138964 2378842 2527264 2706792 2919923
10061 2919923 3145497 3543261 4036322 4611136 5345916 6372745 7704928 9499929 12067806
10052 12067806 15761116 21863977 33421171 53800822 81179157 94717058 82548864
10045 82548864 62671568 44366213 29431961 19588890 13616414 9942267 7625739 5927231
10037 5927231 4663362 3774695 3069383 2516616 2142898 1977350 1788597 1543974 1625454
10028 1625454 1713302 1627472 1282509 1064799 979300 843330 755999 537405 395401 430472
$$ packed form
10094E12653q852l8340j6152O1298N1258j02458j05753J131Q2219P8749j2936
10083E02817M012J31467L867R1635K3250J2423J24986J6427K999q895l523J25026
10071A026491j2104J45519J44684J77248L58169K98957K39878J48422J79528K13131
10061B919923K25574L97764M93061N74814P34780J026829J332183J795001K567877
10052A2067806L693310O102861J1557194K0379651K7378335J3537901j2168194
10045H2548864j9877296j8305355j4934252r843071n972476l674147k316528j698508
10037E927231j263869q88667p05312n52767l73718j65548j88753k44623Q1480
10028A625454Q7848q5830l44963k17710q5499j35970q7331k18594j42004L5071
$$ plain form
10018 430472 467445 489760 547781 657760 563501 557559 598095 519567 348949 349186 401678 309417
10006 309417 289703 347128 481611 424344 396890 316914 270273 234432 185599 159422 148529
9995 148529 156376 100819 108865 96822 106871 175742 203502 98106 92890 115844 105807 173141
9983 173141 318287 331207 410403 388729 281516 307164 208700 109469 88517 133415 210620
9972 210620 259190 201460 47124 74347 154522 245269 290951 298058 289058 214342 74577 118097
9960 118097 91029 53034 98148 234330 296499 335834 328199 320788 320773 280277 297574 381141
9948 381141 304120 200231 145235 221261 225161 278854 327056 259078 216938 260931 139127
9937 139127 157998 189200 165935 175895 124958 149381 186796 246519 132091 106822 105564 96744
$$ packed form
10018D30472L6973K2315N8021J09979r4259n942M0536p8528j70618K37N2492r2261
10006C09417j9714N7425J34483n7267k7454p9976m6641l5841m8833k6177j0893
9995A48529P847n5557Q046j2043J0049O8871K7760j05396n216K2954j0037O7334
9983A73141J45146J2920P9196k1674j07213K5648r8464r9231k0952M4898P7205
9972B10620M8570n7730j54336K7223Q0175R0747M5682P107r000p4716j39765M3520
9960A18097k7068l7995M5114J36182O2169L9335p635p411j5m0496J7297Q3567
9948C81141p7021j03889n4996P6026L900N3693M8202o7978m2140M3993j21804
9937A39127J8871L1202k3265R960n0937K4423L7415N9723j14428k5269j258q820
$$ plain form
9925 96744 172221 142537 95065 88011 53144 -27935 -123453 -39490 42087 -484 -60606 -6334
9913 -6334 70033 21629 20492 -30755 69266 191463 240246 114581 79685 34010 87404 144722
9901 144722 83562 56374 96510 56892 -10984 45056 34833 -7719 -78787 -96639 -92542 -46426
9889 -46426 33338 83001 118948 138638 211787 248771 254389 116434 131080 174341 285668 204967
9877 204967 117905 142381 106254 152706 259521 274154 210066 81966 129747 128522 19860
9866 19860 57028 111279 66430 -66033 2539 95220 136998 67657 49464 109451 230394
9855 230394 231377 169866 155790 266050 257655 305150 307966 170115 115306 80977 156355 163306
9843 163306 154604 157185 81196 106508 223497 180249 77854 155319 175447 4629 27396
$$ packed form
9925I6744P5477k9684m7472p054l4867q1079r5518Q3963Q1577m2571o0122N4272
9913f334P6367m8404j137n1247J00021J22197M8783j25665l4896m5675N3394N7318
9901A44722o1160k7188M0136l9618o7876N6040j0223m2552p1068j7852M097M6116
9889d6426P9764M9663L5947J9690P3149L6984N618j37955J4646M3261J11327q0701
9877B04967q7062K4476l6127M6452J06815J4633o4088j28100M7781j225j08662
9866A9860L7168N4251m4849j32463O8572R2681M1778o9341j8193N9987J20943
9855B30394R83o1511j4076J10260q395M7495K816j37851n4809l4329P5378O951
9843A63306q702K581p5989K5312J16989m3248j02395P7465K0128j70818K2767
$$ plain form
9832 27396 200769 316285 396245 441078 461074 430452 374389 328597 291594 368533 312745
9821 312745 324981 316005 183876 101626 35840 1372 35368 -7200 -60026 -22353 -13187 43938
9809 43938 162759 225036 253448 206920 87827 23267 -43067 -33076 18656 148689 88761
9798 88761 -36347 -36611 14346 -19752 -21798 -23699 -67583 -16346 -4932 50935 73594 147240
9786 147240 156474 112620 145437 165077 88214 -31039 -4227 51977 32891 25103 70238 95793
9774 95793 16329 -1208 89245 99801 64702 45129 67272 117279 173219 267630 218268 21923
9762 21923 15315 101837 82497 51744 35872 85215 122693 211583 242825 258748 179428 56539
9750 56539 4579 47226 106896 181021 185350 266814 278267 203664 99246 13396 147931 232295
$$ packed form
9832B7396J73373J15516P9960M4833J9996l0622n6063m5792l7003P6939n5788
9821C12745J2236q976j32129q2250o5786l4468L3996m2568n2826L7673R166N7125
9809D3938J18821O2277K8412m6528j19093o4560o6334R991N1732J30033n9928
9798H8761j25108k64N0957l4098k046j901m3884N1237J1414N5867K2659P3646
9786A47240R234m3854L2817J9640p6863j19253K6812N6204j9086p788M5135K5555
9774I5793p9464j7537R0453J0556l5099j9573K2143N0007N5940R4411m9362j96345
9762B1923o608Q6522j9340l0753j5872M9343L7478Q8890L1242J5923p9320j22889
9750E6539n1960M2647N9670P4125M329Q1464J1453p4603j04418q5850J34535Q4364
$$ plain form
9738 232295 152490 54077 -75937 -134720 -44820 -10342 56117 94133 25607 103163 114768
9727 114768 62691 11364 93441 93580 136299 71955 40615 71660 79009 124143 117515 64610
9715 64610 130131 163334 197052 193652 143167 118334 120686 134669 119995 79504 -21914 -4838
9703 -4838 149594 170979 104561 229814 203477 193799 229982 296096 243335 161374 171138 189582
9691 189582 203444 144145 58639 95593 87189 219776 121808 87493 17410 8610 146035 94488
9679 94488 -6615 5517 -38857 -33062 -38612 65961 146290 145855 140014 286389 280539 159526
9667 159526 140995 204375 152089 103949 189962 240455 237184 175711 68795 27689 144307
9656 144307 216454 192288 65427 90860 188462 200847 234428 177207 175298 361397 357722 340419
$$ packed form
9738B32295p9805r8413j30014n8783Q9900L4478O6459L8016o8526P7556J1605
9727A14768n2077n1327Q2077J39M2719o4344l1340L1045P349M5134o628n2905
9715F4610O5521L3203L3718l400n0485k4833K352J3983j4674m0491j01418J7076
9703d838J54432K1385o6418J25253k6337r678L6183O6114n2761q1961R764J8444
9691A89582J3862n9299q5506L6954q404J32587r7968l4315p0083q800J37425n1547
9679I4488j01103J2132m4374N795n550J04573Q0329m35n841J46375n850j21013
9667A59526j8531O3380n2286m8140Q6013N0493l271o1473j06916m1106J16618
9656A44307P2147k4166j26861K5433R7602J2385L3581n7221j909J86099l675j7303
$$ plain form
9644 340419 407196 380244 406182 485961 537455 437729 231486 109403 72483 44644 52704
9633 52704 124266 89499 177598 312658 303040 349065 352218 348327 371790 313253 242494 238315
9621 238315 189269 153481 116874 171241 219035 235832 354204 270347 141130 128564 74763
9610 74763 108664 179058 295910 186969 214369 244386 247640 143815 121979 126124 117425 78767
9598 78767 92572 242370 371861 450532 336155 191700 5756 -33735 -2730 73032 273319
9587 273319 350275 300398 274887 257329 153009 28676 -1223 -6279 117042 169957 141454
9576 141454 83458 142067 196975 147309 218137 234001 164429 93351 149342 247413 301941 252867
9564 252867 257771 299139 267133 190311 161983 151062 132810 158802 191793 173611 209021 224417
$$ packed form
9644C40419O6777k6952K5938P9779N1494r9726k06243j22083l6920k7839Q060
9633E2704P1562l4767Q8099J35060r618M6025L153l891K3463n8537p0759m179
9621B38315m9046l5788l6607N4367M7794J6797J18372q3857j29217j2566n3801
9610G4763L3901P0394J16852j08941K7400L0017L254j03825k1836M145q699l8658
9598G8767J3805J49798J29491P8671j14377j44455j85944l9491L1005P5762K00287
9587B73319P6956m9877k5511j7558j04320j24333k9899n056J23321N2915k8503
9576A41454n7996N8609N4908m9666P0828J5864o9572p1078N5991R8071N4528m9074
9564B52867M904M1368l2006p6822k8328j0921j8252K5992L2991j8182L5410J5396
$$ plain form
9552 224417 207354 258339 157345 106727 201730 245178 218430 198023 142551 157810 185263
9541 185263 198453 213166 237961 299353 239810 70705 9473 48960 137733 192348 206125
9530 206125 195852 52031 78365 215325 261299 207321 281715 371778 309345 221490 229721
9519 229721 214899 214007 174577 133496 70604 57440 86034 176028 183736 98650 209697 252592
9507 252592 294300 260793 275013 174128 185102 195481 169707 262419 358155 324378 317208 240525
9495 240525 148022 199629 318705 352489 429263 539153 447399 386442 324970 244877 183078
9484 183078 315888 383301 440340 441163 359592 378749 388732 493156 570278 402793 248299
9473 248299 160855 199345 244100 296041 321693 296412 353433 383655 247921 202865 349894
$$ packed form
9552B24417j7063N0985j00994n0618R5003M3448k6748k0407n5472J5259K7453
9541A85263J3190J4713K4795O1392n9543j69105o1232L9487Q8773N4615J3777
9530B06125j0273j43821K6334J36960M5974n3978P4394R0063o2433q7855Q231
9519B29721j4822q92l9430m1081o2892j3164K8594Q9994P708q5086J11047M2895
9507B52592M1708l3507J4220j00885J0974J0379k5774R2712R5736l3777p170p6683
9495B40525r2503N1607J19076L3784P6774J09890r1754o0957o1472q0093o1799
9484A83078J32810O7413N7039Q23q1571J9157R983J04424P7122j67485j54494
9473B48299q7444L8490M4755N1941K5652k5281N7021L0222j35734m5056J47029
$$ plain form
9462 349894 465588 576190 538250 375728 366212 334962 406827 522098 518655 417281 346528
9451 346528 365921 471902 372309 365855 388788 462944 491205 452593 444568 541296 529088 374055
9439 374055 317393 289193 375571 458078 457012 540060 524551 567250 666420 638967 615720 610026
9427 610026 490443 444577 565061 650666 791798 888457 787875 745227 781897 859396 929138
9416 929138 806559 602219 614463 666701 714663 805840 827384 856877 776708 718681 821850
9405 821850 857008 965544 969182 885679 825390 833436 896423 928513 1012036 1031367 928826 974853
9393 974853 975458 977076 1020678 1080628 1063916 1171283 1120042 1174839 1264457 1249937 1265113 1294977
9381 1294977 1269021 1202579 1233808 1344005 1428453 1370121 1316444 1255721 1315632 1335158 1321630
$$ packed form
9462C49894J15694J10602l7940j62522r516l1250P1865J15271l443j01374p0753
9451C46528J9393J05981r9593o454K2933P4156K8261l8612q025R6728j2208j55033
9439C74055n6662k8200Q6378Q2507j066Q3048j5509M2699R9170k7453k3247n694
9427F10026j19583m5866J20484Q5605J41132R6659j00582m2648L6670P7499O9742
9416I29138j22579k04340J2244N2238M7962R1177K1544K9493q0169n8027J03169
9405H21850L5158J08536L638q3503o0289Q046O2987L2090Q3523J9331j02541M6027
9393I74853O05J618M3602N9950j6712J07367n1241N4797Q9618j4520J5176K9864
9381A294977k5956o6442L1229J10197Q4448n8332n3677o0723N9911J9526j3528
$$ plain form
9370 1321630 1289276 1392994 1467455 1530380 1628421 1607374 1521049 1559925 1680737 1779104 1941130
9359 1941130 1949211 1750736 1669680 1692331 1649118 1770879 1791843 1826761 1933446 2009963 2039155
9348 2039155 1912187 1893638 2036292 2158184 2359780 2457990 2511063 2514243 2486913 2565776 2650898
9337 2650898 2610346 2493679 2431106 2590812 2711643 2776167 2889276 2985213 3140145 3280885
9327 3280885 3339349 3397671 3446063 3500051 3619204 3698566 3863117 3887724 3931874 4195152 4527535
9316 4527535 4647103 4851206 5058413 5316107 5610716 5754591 5785480 5858759 5968081 6022799
9306 6022799 6153570 6287976 6508830 6682402 6805094 7071510 7338093 7635978 7942139 8294462
9296 8294462 8614363 9005152 9365831 9697114 10053324 10427789 10824231 11187801 11628969 12082507
$$ packed form
9370A321630l2354J03718P4461O2925R8041k1047q6325L8876J20812R8367J62026
9359A941130Q081j98475q1056K2651m3213J21761K0964L4918J06685P6517K9192
9348B039155j26968j8549J42654J21892K01596R8210N3073L180k7330P8863Q5122
9337B650898m0552j16667o2573J59706J20831O4524J13109R5937J54932J40740
9327C280885N8464N8322M8392N3988J19153P9362J64551K4607M4150K63278L32383
9316D527535J19568K04103K07207K57694K94609J43875L0889P3279J09322N4718
9306F022799J30771J34406K20854J73572J22692K66416K66583K97885L06161L52323
9296H294462L19901L90789L60679L31283L56210L74465L96442L63570M41168M53538
$$ plain form
9286 12082507 12422071 12765011 13230240 13631304 14035252 14595828 15243010 15713163 16345268
9277 16345268 17045409 17581233 18138761 18570078 18845444 19246609 19454885 19578918 19703862
9268 19703862 19866131 20048987 20095230 20156718 20260136 20313134 20284093 20142528 20108564 19900589
9258 19900589 19556774 19227441 18947515 18572592 18238370 17700484 17218861 16700699 16232909
9249 16232909 15811209 15203439 14692860 14199271 13615865 13136625 12685352 12293696 11968374
9240 11968374 11704985 11268666 10800444 10464129 10106882 9856864 9559113 9142983 8780600
9231 8780600 8376545 8039237 7640618 7333720 7212904 6921242 6582361 6286047 6003648 5755492
9221 5755492 5461127 5337816 5245297 5209427 5045731 4777877 4635660 4492823 4355072 4321464
$$ packed form
9286A2082507L39564L42940M65229M01064M03948N60576O47182M70153O32105
9277A6345268P00141N35824N57528M31317K75366M01165K08276J24033J24944
9268A9703862J62269J82856M6243O1488J03418N2998k9041j41565l3964k07975
9258A9900589l43815l29333k79926l74923l34222n37886m81623n18162m67790
9249A6232909m21700o07770n10579m93589n83406m79240m51273l91656l25322
9240A1968374k63389m36319m68222l36315l57247k50018k97751m16130l62383
9231H780600m04055l37308l98619l06898j20816k91662l38881k96314k82399k48156
9221E755492k94365j23311r2519l5870j63696k67854j42217j42837j37751l3608
$$ plain form
9211 4321464 4208064 4025024 3891919 3666189 3472248 3351530 3437292 3372305 3172075 3041088
9201 3041088 2918406 2905335 2933855 2852202 2743339 2703417 2657454 2638339 2505605 2406698 2452997
9190 2452997 2409970 2293475 2163248 2217596 2194868 2167714 2117542 2012594 1968033 1964693 1839521
9179 1839521 1737344 1769929 1852812 1856640 1818030 1695900 1694345 1622825 1486061 1396563 1258803
9168 1258803 1204483 1249266 1340616 1305153 1319202 1312459 1249175 1237690 1246757 1334317 1197284 1031051
9156 1031051 1074379 1042052 857060 753807 776238 769982 775720 689474 702358 796968 837467
9145 837467 757995 727793 804777 922245 879986 869032 832883 853043 778891 894658 953566
9134 953566 870758 786484 752572 717953 865554 938524 867559 740975 712108 764694 791013
$$ packed form
9211D321464j13400j83040j33105k25730j93941j20718Q5762o4987k00230j30987
9201C041088j22682j3071K8520q1653j08863l9922m5963j9115j32734r8907M6299
9190B452997m3027j16495j30227N4348k2728k7154n0172j04948m4561l340j25172
9179A839521j02177L2585Q2883L828l8610j22130j555p1520j36764q9498j37760
9168A258803n4320M4783R1350l5463J4049o743o3284j1485R067Q7560j37033j66233
9156A031051M3328l2327j84992j03253K2431o256N738q6246J2884R4610M0499
9145H37467p9472l0202P6984J17468m2259j0954l6149K0160p4152J15767N8908
9134I53566q2808q4274l3912l4619J47601P2970p0965j26584k8867N2586K6319
$$ plain form
9123 791013 755664 704531 674300 471503 402034 357078 385632 398494 460897 395171 402947 583389
9111 583389 654174 575293 421711 406543 419255 512949 478115 468235 508103 585636 571868 477754
9099 477754 480939 443152 350212 308297 313576 324479 382859 402646 319567 369664 386516 271689
9087 271689 265518 377156 368929 352331 438182 401843 430082 388132 411901 425154 345827 192621
9075 192621 98723 240439 334454 339151 298213 334095 314703 329185 383841 410590 346858 254627
9063 254627 210520 232345 267651 320085 278536 317507 363127 237414 210754 161528 269642
9052 269642 300022 224791 295328 345794 465193 385590 253320 235376 296231 399910 290355
9041 290355 187352 172726 219390 279862 156180 137397 -645 -21112 -1347 -20002 34964
$$ packed form
9123G91013l5349n1133l0231k02797o9469m4956K8554J2862O2403o5726P776J80442
9111E83389P0785p8881j53582j5168J2712R3694l4834r880L9868P7533j3768r4114
9099D77754L185l7787r2940m1915N279J0903N8380J9787q3079N0097J6852j14827
9087B71689o171J11638q227j6598Q5851l6339K8239m1950K3769J3253p9327j53206
9075A92621r3898J41716R4015M697m0938L5882j9392J4482N4656K6749o3732r2231
9063B54627m4107K1825L5306N2434m1549L8971M5620j25713k6660m9226J08114
9052B69642L0380p5231P0537N0466J19399p9603j32270j7944O0855J03679j09555
9041B90355j03003j4626M6664O0472j23682j8783j38042k0467J9765j8655N4966
$$ plain form
9030 34964 78507 225684 149143 12845 76273 150298 153861 136686 193116 296512 322883
9019 322883 273867 261035 177503 70229 195533 259061 287627 296219 302093 393570 428605 408459
9007 408459 302765 180389 95260 35456 34979 70075 131164 52843 -13828 -63762 -59485 -48567
8995 -48567 -10500 57922 73213 -817 -53291 54458 126674 156430 78398 71394 224884 245890
8983 245890 196864 139337 105392 85935 37979 55757 78039 109184 144021 213224 345016
8972 345016 355397 346752 318338 343252 217340 88869 143410 205064 233037 222624 26001
8961 26001 -47067 91406 171191 105370 183841 176232 92118 94282 30914 -60266 60285 249300
8949 249300 252787 111568 -9855 -54148 -60477 -52158 37437 70658 154352 126152 97037 177066
$$ packed form
9030C4964M3543J47177p6541j36298O3428P4025L563j7175N6430J03396K6371
9019C22883m9016j2832q3532j07274J25304O3528K8566Q592N874R1477L5035k0146
9007D08459j05694j22376q5129n9804m77L5096O1089p8321o6671m9934M277J0918
8995d8567L8067O8422J5291p4030n2474J07749P2216K9756p8032p004J53490K1006
8983B45890m9026n7527l3945j9457m7956J7778K2282L1145L4837O9203J31792
8972C45016J0381q645k8414K4914j25912j28471N4541O1654K7973j0413j96623
8961B6001p3068J38473P9785o5821P8471p609q4114K164o3368r1180J20551J89015
8949B49300L487j41219j21423m4293o329Q319Q9595L3221Q3694k8200k9115Q0029
$$ plain form
8937 177066 153401 80454 158026 121773 172211 264544 363018 274868 182822 155802 146722 192544
8925 192544 150666 198010 249297 135513 92846 146054 100975 36429 -890 94828 96987 24043
8913 24043 94696 124204 173429 147617 52106 18849 106464 142574 86464 217793 278699 236048
8901 236048 198141 184792 190291 178377 78256 -41488 -109433 -63395 -121707 -155711 -153048 -99723
8889 -99723 -8530 2835 87994 136173 160611 184143 172568 162925 228266 289678 309254 160745
8877 160745 92696 176007 118576 132059 133840 197712 125278 75854 6457 -43085 35647 103506
8865 103506 108132 16733 -41160 1605 58338 -30059 -81238 -78827 -2333 63106 -39422 -175124
8853 -175124 -179334 -129712 -149296 -99095 -32248 72415 105412 -12160 -43015 -34972 66247
$$ packed form
8937A77066k3665p2947P7572l6253N0438R2333R8474q8150r2046k7020r080M5822
8925A92544m1878M7344N1287j13784m2667N3208m5079o4546l7319R5718K159p2944
8913B4043P0653K9508M9225k5812r5511l3257Q7615L6110n6110J31329O0906m2651
8901B36048l7907j3349N499j1914j00121j19744o7945M6038n8312l4004K663N3325
8889i9723R1193J1365Q5159M8179K4438K3532j1575r643O5341O1412J9576j48509
8877A60745o8049Q3311n7431J3483J781O3872p2434m9424o9397m9542P8732O7859
8865A03506M626r1399n7893M2765N6733q8397n1179K411P6494O5439j02528j35702
8853a75124m210M9622j9584N0201O6847J04663L2997j17572l0855Q043J01219
$$ plain form
8842 66247 202883 183130 127679 150079 184218 100905 69915 -29988 -35373 -44287 -118276 -116757
8830 -116757 -170206 -140406 -160540 -93981 -22335 6619 184780 223295 200380 124047 102721
8819 102721 23734 130984 266260 255623 302049 217081 134314 211260 162959 61328 -858
8808 -858 4686 -96998 -151256 -116031 -72551 -117740 -208354 -144204 -57993 141912 251071 151801
8796 151801 71825 186129 270854 266862 203121 5447 -79982 -81566 -32606 -9526 -34308 -45311
8784 -45311 100399 9099 -12667 643 -4355 8289 94039 168055 203085 120509 91327 135211
8772 135211 149987 -11516 -21663 20462 -37802 -16332 15439 35330 103708 147423 124260
8761 124260 45301 -10689 -90717 -121257 -98889 -125943 -164156 -90070 -33473 -59205 66212
$$ packed form
8842F6247J36636j9753n5451K2400L4139q3313l0990r9903n385q914p3989J519
8830a16757n3449K9800k0134O6559P1646K8954J78161L8515k2915p6333k1326
8819A02721p8987J07250J35276j0637M6426q4968q2767P6946m8301j01631o2186
8808h58N544j01684n4258L5225M3480m5189r0614O4150Q6211J99905J09159r9270
8796A51801p9976J14304Q4725l992o3741j97674q5429j584M8960K3080k4782j1003
8784d5311J45710r1300k1766J3310m998J2644Q5750P4016L5030q2576k9182M3884
8772A35211J4776j61503j0147M2125n8264K1470L1771J9891O8378M3715k3163
8761A24260p8959n5990q0028l0540K2368k7054l8213P4086N6597k5732J25417
$$ plain form
8750 66212 166877 243847 157446 180808 181029 123066 56041 -17211 36302 9107 -6134 -5713
8738 -5713 -5966 30591 51206 13599 56169 78584 23598 -41670 -51406 -28891 -57927 41586 155268
8725 155268 207529 100011 -13697 -54831 -173941 -154301 40035 90097 -9093 -78293 -37333
8714 -37333 19054 32303 -37171 17637 64892 123565 106712 43467 -57176 5024 50073 148298
8702 148298 152636 120040 22507 -67603 -51018 -86735 -67440 -97756 -141238 -119743 -17736 -15682
8690 -15682 -42463 38658 63544 29327 2610 8797 50033 -48629 -171340 -150167 -112455 -21209
8678 -21209 -49052 -21243 -44007 -100569 -68669 -94875 43256 114305 67124 18076 56069 16284
8666 16284 1292 -78440 -78795 105873 96585 50194 -40630 -128776 -158324 -138795 -20898 147836
$$ packed form
8750F6212J00665P6970q6401K3362K21n7963o7025p3252N3513k7195j5241M21
8738e713k53L6557K0615l7607M2570K2415n4986o5268r736K2515k9036R9513J13682
8725A55268N2261j07518j13708m1134j19110J9640J94336N0062r9190o9200M0960
8714c7333N6387J3249o9474N4808M7255N8673j6853o3245j00643O2200M5049R8225
8702A48298M338l2596r7533r0110J6585l5717J9295l0316m3482K1495J02007K054
8690a5682k6781Q1121K4886l4217k6717O187M1236r8662j22711K1173L7712R1246
8678b1209k7843K7809k2764n6562L1900k6206J38131P1049m7181m9048L7993l9785
8666A6284j4992p9732l55J84668r288m6391r0824q8146k9548J9529J17897J68734
$$ plain form
8654 147836 223717 221005 172882 111929 -6278 -30942 17427 104069 168185 101965 123856 168791
8642 168791 82882 84547 63414 87509 60320 156080 170875 187624 149660 85695 176498 193797
8630 193797 165818 103220 61620 27331 96691 188868 183682 156804 126280 172734 152760 71206
8618 71206 101003 119961 182915 119899 -113590 -236916 -110281 -122497 -105523 32481 35202
8607 35202 50663 4419 -48334 -69125 18170 81857 169731 135161 63473 7803 -58637 -49038
8595 -49038 -54240 -86417 65879 111855 102095 73043 116722 156617 165958 181624 231101 158349
8583 158349 32437 -23788 -55366 79403 104522 97819 167511 207262 45852 -59787 -64295
8572 -64295 -18678 40469 89521 14638 37283 47711 57351 -3163 -34738 21259 -81817 -89617
$$ packed form
8654A47836P5881k712m8123o0953j18207k4664M8369Q6642O4116o6220K1891M4935
8642A68791q5909J665k1133K4095k7189R5760J4795J6749l7964o3965R0803J7299
8630A93797k7979o2598m1600l4289O9360R2177n186k6878l0524M6454j9974q1554
8618G1206K9797J8958O2954o3016k33489j23326J26635j2216J6974J38004K721
8607C5202J5461m6244n2753k0791Q7295O3687Q7874l4570p1688n5670o6440R599
8595d9038n202l2177J52296M5976r760k9052M3679L9895R341J5666M9477p2752
8583A58349j25912n6225l1578J34769K5119o703O9692L9751j61410j05639m508
8572f4295M5617N9147M9052p4883K2645J0428R640o0514l1575N5997j03076p800
$$ plain form
8560 -89617 69174 63439 57437 105768 168679 110716 73504 42908 -18382 -43976 62124 46774
8548 46774 -64227 2106 29431 49746 68096 103607 5586 -138611 -204244 -229702 -157502
8537 -157502 -117257 42819 100387 108918 98255 26175 -56965 -147731 -60858 -77579 -44969 2459
8525 2459 -29621 95826 123216 85661 51493 122361 48791 36571 62234 -8200 -59917 -127758
8513 -127758 -136838 -83198 -86836 -178532 -174857 -145217 -16727 34872 32588 -63668 -53435 40388
8501 40388 56294 95668 124625 106801 119590 158472 130645 57089 -59207 -34301 28918 97065
8489 97065 211453 129784 41273 -6218 -20846 -142573 -148246 -93462 -155583 -181615 -119481 -124255
8477 -124255 -128169 -92002 -43518 -69939 12913 89136 176193 123931 42674 52822 -75309 463
$$ packed form
8560h9617J58791n735o002M8331O2911n7963l7212l0596o1290k5594J06100j5350
8548D6774j11001O6333K7325K0315J8350L5511r8021j44197o5633k5458P2200
8537a57502M0245J60076N7568Q531j0663p2080q3140r0766Q6873j6721L2610M7428
8525B459l2080J25447K7390l7555l4168P0868p3570j2220K5663p0434n1717o7841
8513a27758r080N3640l638r1696L675K9640J28490N1599k284r6256J0233R3823
8501D0388J5906L9374K8957j7824J2789L8882k7827p3556j16296K4906O3219O8147
8489I7065J14388q1669q8511m7491j4628j21727n673N4784o2121k6032O2134m774
8477a24255l914L6167M8484k6421Q2852P6223Q7057n2262q1257J0148j28131P5772
$$ plain form
8465 463 13026 55327 132148 81771 105661 66676 -67946 -126334 51748 118284 185252 142020
8453 142020 74855 70830 147664 41470 -10382 -48352 -107648 -45737 65848 40083 -42631
8442 -42631 10535 19331 22563 -33024 16757 -64994 -20023 -63991 -198690 -175868 -94009 -130265
8430 -130265 -134583 -131197 5392 66070 99841 110398 158437 185681 134720 46209 76731 59093
8418 59093 140776 111750 -34991 -103070 -64641 -38468 -30744 1842 46267 14864 76055 76172
8406 76172 -28599 -60603 103259 33338 45869 32712 -35550 -30164 -38534 -30275 33291 109317
8394 109317 299135 490245 528129 499653 472054 395956 210536 261256 180775 146745 132107
8383 132107 60919 61108 51022 40597 -52941 19112 85486 51019 16794 -9806 27993 82548
$$ packed form
8465D63J2563M2301P6821n0377K3890l8985j34622n8388J78082O6536O6968m3232
8453A42020o7165m025P6834j06194n1852l7970n9296O1911J11585k5765q2714
8442d2631N3166Q796L232n5587M9781q1751M4971m3968j34699K2822Q1859l6256
8430a30265m318L386J36589O0678L3771J0557M8039K7244n0961q8511L0522j7638
8418E9093Q1683k9026j46741o8079L8429K6173P724L2586M4425l1403O1191J17
8406G6172j04771l2004J63862o9921J2531j3157o8262N386q370Q259O3566P6026
8394A09317J89818J91110L7884k8476k7599p6098j85420N0720q0481l4030j4638
8383A32107p1188J89j0086j0425r3538P2053O6374l4467l4225k6600L7799N4555
$$ plain form
8371 82548 -2401 27084 96733 142201 102579 47003 36485 47661 125453 195392 188292 376618
8359 376618 558645 553373 392452 390144 415441 420524 259189 149140 68683 63881 -19095 -12191
8347 -12191 203678 276305 216815 143612 150195 67860 -24731 -116689 -75060 -151266 -113385 -34575
8335 -34575 -82537 -156190 -305087 -268323 -257307 -189668 -153438 -253664 -328940 -131508 -10136
8324 -10136 41778 54110 40838 63499 42319 45086 -42564 -54337 53757 -14073 -86133 -131435
8312 -131435 -88225 -29656 -11138 -81802 24122 12134 24257 41630 103151 -78711 -114437
8301 -114437 24412 104645 63615 -11615 -32297 52506 137714 35292 -36605 -136210 -121348
8290 -121348 -48988 -3374 -93126 -102756 65368 153790 159446 140530 128114 86617 -69278 -78312
$$ packed form
8371H2548q4949K9485O9649M5468l9622n5576j0518J1176P7792O9939p100J88326
8359C76618J82027n272j60921k308K5297N083j61335j10049q0457m802q2976O904
8347a2191K15869P2627n9490p3203O583q2335r2591r1958M1629p6206L7881P8810
8335c4575m7962p3653j48897L6764J1016O7639L6230j00226p5276J97432J21372
8324a0136N1914J2332j3272K2661k1180K767q7650j1773J08094o7830p2060m5302
8312a31435M3210N8569J8518p0664J05924j1988J2123J7373O1521j81862l5726
8301a14437J38849Q0233m1030p5230k0682Q4803Q5208j02422p1897r9605J4862
8290a21348P2360M5614q9752r630J68124Q8422N656j8916j2416m1497j55895r034
$$ plain form
8278 -78312 -60474 -66101 -120381 -131556 -50402 5682 -45451 -37171 -31729 -112710 -156030 -184545
8266 -184545 -153867 -150840 -126764 -53434 -10041 95260 117046 42442 69307 100379 -39199
8255 -39199 -80677 -183044 -286078 -253077 -189302 -84254 -88835 -61516 15079 -24011 -135263
8244 -135263 -161736 -102407 -80743 -123680 -209076 -203357 -164865 -121125 -169820 -341565 -297013 -118655
8232 -118655 -101591 -166245 -162847 -218982 -210285 -156660 -174617 -295900 -345706 -281575 -300442 -244153
8220 -244153 -190487 -91966 -169914 -163360 -70274 -86349 -69976 -76269 -21135 119820 170233 50705
8208 50705 77359 184608 215685 331161 295399 191879 107502 146879 95879 60277 -23664
8197 -23664 3736 -98720 -218768 -213942 -73930 -98956 -145367 -127702 -94357 -48442 -19068
$$ packed form
8278g8312J7838n627n4280j1175Q1154N6084n1133Q280N442q0981m3320k8515
8266a84545L0678L027K4076P3330M3393J05301K1786p4604K6865L1072j39578
8255c9199m1478j02367j03034L3001O3775J05048m581K7319P6595l9090j11252
8244a35263k6473N9329K1664m2937q5396N719L8492M3740m8695j71745M4552J78358
8232a18655J7064o4654L398n6135Q697N3625j7957j21283m9806O4131j8867N6289
8220b44153N3666R8521p7948O554R3086j6075J6373o293N5134J40955N0413j19528
8208E0705K6654J07249L1077J15476l5762j03520q4377L9377n1000l5602q3941
8197b3664K7400j02456j20048M826J40012k5026m6411J7665L3345M5915K9374
$$ plain form
8186 -19068 -13782 46 109366 119335 79397 143353 122125 249133 252072 56947 -106558 -158321
8174 -158321 -46688 -28586 9131 99903 109337 -14609 -22024 63650 7686 -66960 -106226 69886
8162 69886 199665 37860 -34208 -73772 11950 88476 185818 211829 152486 16420 -64108
8151 -64108 -26242 -55405 -54576 -9882 55980 142331 189678 89329 5008 -98243 -93737 -46272
8139 -46272 -14169 -64210 -29141 -10341 -54007 136 -14698 -7768 -6955 51037 12194 -50570
8127 -50570 -44012 -5818 21090 118791 244537 296590 254901 312161 246887 116232 -6555
8116 -6555 -28469 23367 76797 87301 91593 108125 221092 229205 142524 201937 190136 61268
8104 61268 133221 76004 -90495 -206288 -146635 -72754 -4277 34385 136854 61948 -58618
$$ packed form
8186a9068N286J3828J09320R969l9938O3956k1228J27008K939j95125j63505n1763
8174a58321J11633J8102L7717R0772R434j23946p415Q5674n5964p4646l9266J76112
8162F9886J29779j61805p2068l9564Q5722P6526R7342K6011n9343j36066q0528
8151f4108L7866k9163Q29M4694O5862Q6351M7347j00349q4321j03251M506M7465
8139d6272L2103n0041L5069J8800m3666N4143j4834O930Q13N7992l8843o2764
8127e0570O558L8194K6908R7701J25746N2053m1689N7260o5274j30655j22787
8116f555k1914N1836N3430J0504M292J6532J12967Q113q6681N9413j1801j28868
8104F1268P1953n7217j66499j15793N9653P3881O8477L8662J02469p4906j20566
$$ plain form
8093 -58618 15950 45824 26655 25256 21275 46602 -4545 -96903 -87028 675 62775 97098
8081 97098 80564 18734 100968 105563 60551 189548 224514 239431 220638 169606 -92875 -200169
8069 -200169 34327 214968 242318 143209 266822 478082 785067 1145507 1735897 2213208
8059 2213208 2355156 1924951 1408258 874083 601219 386278 309965 367306 216823 152117
8049 152117 151995 54096 4364 -79448 15046 120768 52030 -16793 63028 163694 168344 165856
8037 165856 314515 388003 233989 93255 86915 141431 263697 324741 287697 454609 456677
8026 456677 514541 671766 700487 842808 1012050 1379754 1946948 2873150 4064246 5317832
8016 5317832 6780616 7709049 7544741 6265560 4683294 3249884 2328068 1632723 1048723
$$ packed form
8093e8618P4568K9874j9169j399l981K5327n1147r2358R875Q7703O2100L4323
8081I7098j6534o1830Q2234M595m5012J28997L4966J4917j8793n1032k62481j07294
8069b00169K34496J80641K7350r9109J23613K11260L06985L60440N90390M77311
8059B213208J41948m30205n16693n34175k72864k14941p6313N7341j50483o4706
8049A52117j22r7899m9732q3812R4494J05722o8738o8823P9821J00666M650k488
8037A65856J48659P3488j54014j40734o340N4516J22266O1044l7044J66912K068
8026D56677N7864J57225K8721J42321J69242L67704N67194R26202J191096J253586
8016E317832J462784R28433j64308j279181j582266j433410r21816o95345n84000
$$ plain form
8007 1048723 519245 396020 450332 466870 490459 487710 448362 399210 370861 183096 46849
7996 46849 23871 -72354 -16988 18854 -14950 23523 72002 133920 110509 204150 294956 133848
7984 133848 88674 51029 -11022 -6047 90865 107846 3360 50402 47565 135799 139516 114795
7972 114795 112063 150713 158770 114968 93063 93394 -23654 -25755 -64814 -68912 -32416 89064
7960 89064 102348 2672 5003 49735 177744 168284 25450 -36898 23373 17251 41738 90163
7948 90163 111141 6683 -20352 23214 99634 -61428 -21950 108771 86597 -48838 -167695
7937 -167695 -121787 13856 124154 109825 26316 5879 45850 16985 40221 59279 52015
7926 52015 168726 170547 91768 100956 111169 195246 140243 29810 61117 169620 154420 48901
$$ packed form
8007A048723n29478j23225N4312J6538K3589k749l9348m9152k8349j87765j36247
7996D6849k2978r6225N5366L5842l3804L8473M8479O1918k3411R3641R0806j61108
7984A33848m5174l7645o2051M975R6912J6981j04486M7042k837Q8234L717k4721
7972A14795k732L8650Q057m3802k1905L31j17048k101l9059m098L6496J21480
7960H9064J3284r9676K331M4732J28009r460j42834o2348O0271o122K4487M8425
7948I0163K0978j04458k7035M3566P6420j61062L9478J30721k2174j35435j18857
7937a67695M5908J35643J10298j4329q3509k0437L9971k8865K3236J9058p264
7926E2015J16711J821p8779R188J0213Q4077n5003j10433L1307J08503j5200j05519
$$ plain form
7914 48901 36068 25754 19912 6461 2113 -79550 -135157 -98168 -8333 -52407 -40233 -36459
7902 -36459 -63667 -78347 -76310 -1463 97579 88720 -16071 -28106 45480 -121 -70888 -58954
7890 -58954 82712 185737 149221 118936 29489 45379 -45708 -135717 -224514 -142023 -54600
7879 -54600 21751 -12895 -144040 -218706 -90031 -4370 108213 195450 141552 -5233 24829
7868 24829 66569 132203 153092 -11600 -84528 -93208 -162342 -165032 -3769 -22643 -50329 -99893
7856 -99893 -122340 -80834 -155210 -154514 -107333 -146891 -25108 54180 94794 85540 72034 118624
7844 118624 174679 147230 11855 -33241 -105973 31754 115530 107188 18584 38393 164086
7833 164086 149921 177876 102498 154219 92765 -9372 86152 65353 27440 65043 -13133
$$ packed form
7914D8901j2833j0314n842j3451m348q1663n5607L6989Q9835m4074J2174L774
7902c6459k7208j4680K037P4847R9042q859j04791j2035P3586m5601p0767J1934
7890e8954J41666J03025l6516l0285q9447J5890r1087r0009q8797Q2491Q7423
7879e4600P6351l4646j31145p4666J28675Q5661J12583Q7237n3898j46785L0062
7868B4829M1740O5634K0889j64692p2928q680o9134k690J61263j8874k7686m9564
7856i9893k2447M1506p4376O96M7181l9558J21783P9288M0614r254j3506M6590
7844A18624N6055k7449j35375m5096p2732J37727Q3776q342q8604J9809J25693
7833A64086j4165K7955p5378N1721o1454j02137R5524k0799l7913L7603p8176
$$ plain form
7822 -13133 -44032 -9059 51447 47984 108916 139093 205578 204477 197748 165351 37834 34188
7810 34188 46656 35473 47599 2598 -29985 -10123 -97393 -83782 -45498 14919 105928 157150
7798 157150 106959 1606 45566 19466 89681 48564 -5856 72154 50184 181130 135272
7787 135272 122751 110914 -27799 -127002 -69304 6539 124697 190083 171390 -23003 -122851
7776 -122851 -85395 -173156 -222735 -116944 -40344 21823 -94102 -292893 -303017 -304134 -135465
7765 -135465 -128786 -183167 -159894 45772 -98253 -178452 -160820 -48413 22911 43815 40971
7754 40971 87495 241387 281943 254501 162594 184797 273271 202714 198567 136291 -63724 -142196
7742 -142196 -195785 -237300 -198345 -298939 -257688 -234079 -96775 39686 51147 56422 33147
$$ packed form
7822a3133l0899L4973O0506l463O0932L0177O6485j101o729l2397j27517l646
7810C4188J2468j1183J2126m5001l2583J9862q7270J3611L8284O0417R1009N1222
7798A57150n0191j05353M3960k6100P0215m1117n4420P8010k1970J30946m5858
7787A35272j2521j1837j38713r9203N7698P5843J18158O5386j8693j94393r9848
7776a22851L7456q7761m9579J05791P6600O2167j15925j98791j0124j117J68669
7765a35465O679n4381K3273K05666j44025q0199J7632J12407P1324K0904k844
7754D0971M6524J53892M0556k7442r1907K2203Q8474p0557m147o2276k00015p8472
7742a42196n3589m1515L8955j00594M1251K3609J37304J36461J1461N275k3275
$$ plain form
7731 33147 -46080 -126691 -140098 -6790 102628 67371 -38581 -56875 -33900 -14832 -88005
7720 -88005 -64501 -125057 -146042 -19183 -9392 -136878 -107950 -65825 -40712 -39108 -159270 -178853
7708 -178853 -204551 -219984 -267075 -232473 -203011 -222821 -164811 -171643 -179045 -74760 -34322 49301
7696 49301 16363 -4309 -10809 14012 -116724 -178161 -98070 7909 130564 157895 231300
7685 231300 238570 234966 96203 81532 113516 57505 -23748 -18371 117608 130301 133554 29682
7673 29682 -39728 46619 109885 173760 113600 85063 120298 108487 36162 121703 168262 68210
7661 68210 27856 -14963 -41086 33086 9571 -1072 -49137 -52484 -114753 -159971 -135120 10378
7649 10378 19100 -36443 -23330 -31579 -10456 77560 136931 71821 11085 -47592 -97271 -7914
$$ packed form
7731C3147p9227q0611j3407J33308J09418l5257j05952j8294K2975J9068p3173
7720h8005K3504o0556k0985J26859R791j27486K8928M2125K5113J604j20162j9583
7708a78853k5698j5433m7091L4602K9462j9810N8010o832p402J04285M0438Q3623
7696D9301l2938k0672o500K4821j30736o1437Q0091J05979J22655K7331P3405
7685B31300P270l604j38763j4671L1984n6011q1253N377J35979J2693L253j03872
7673B9682o9410Q6347O3266O3875o0160k8537L5235j1811p2325Q5541M6559j00052
7661F8210m0354m2819k6123P4172k3515j0643m8065l347o2269m5218K4851J45498
7649A0378Q722n5543J3113q249K1123Q8016N9371o5110o0736n8677m9679Q9357
$$ plain form
7637 -7914 -4160 -18845 -2955 45611 -52591 -36156 -149673 -256759 -268779 -162043 62953
7626 62953 112893 39389 -22498 8054 175898 268183 155124 103484 103252 122334 -61640 -53299
7614 -53299 -6283 68220 37530 62917 107646 136867 104357 90349 12217 53240 -3301 41560
7602 41560 44945 124593 47309 43724 -9605 -136617 -158037 -130259 -114040 -20943 53321 88613
7590 88613 41408 -38589 -90753 -87756 -89959 -155889 -160314 -125172 -10880 66314 99658 113352
7578 113352 107966 100780 108149 26516 -66131 -114156 -88989 -88251 -109954 -152752 -158461 -97605 -38467
7565 -38467 -34877 -15350 13494 16163 -73072 -118797 -56254 -15855 -72144 -114317 -22541 91479
7553 91479 142721 53491 36762 -83752 14567 104909 64229 140198 212200 190022 240251 304388
$$ packed form
7637g914L754j4685J5890M8566r8202J6435j13517j07086j2020J06736K24996
7626F2953M9940p3504o1887L0552J67844R2285j13059n1640k32J9082j83974Q341
7614e3299M7016P4503l0690K5387M4729K9221l2510j4008p8132M1023n6541M4861
7602D1560L385P9648p7284l585n3329j27012k1420K7778J6219R3097P4264L5292
7590H8613m7205p9997n2164K997k203o5930m425L5142J14292P7194L3344J3694
7578A13352n386p186P369q1633r2647m8025K5167P38k1703m2798n709O0856N9138
7565c8467L590J9527K8844K669q9235m5725O2543M0399n6289m2173R1776J14020
7553I1479N1242q9230j6729j20514R8319R0342m0680P5969P2002k2178N0229O4137
$$ plain form
7541 304388 216315 56207 1445 44079 16100 49299 102566 75302 2943 88 -150707
7530 -150707 -187913 -133711 -126025 -121764 -58599 -33199 -13677 -89253 -68477 13943 33284 99465
7518 99465 166169 15017 12797 -15085 -20635 51955 26705 35714 -60541 -50706 -3425 58634
7506 58634 68227 -26690 -173998 -127382 -232 76459 -18489 -215660 -161966 -76212 -10775
7495 -10775 41649 76690 103603 -6180 -33673 -57533 -24150 -70837 -104237 -23802 -4619 -37912
7483 -37912 -81868 -40342 -75588 -108050 -59321 -67602 -183880 -187077 -171540 -194282 5416 238257
7471 238257 268950 180035 107457 10879 -32785 -112728 -192676 -140381 -136813 -25657 70371 45880
7459 45880 51646 -34674 -57552 -72048 -61695 -48932 -190749 -267415 -349004 -227046 -192142 -89751
$$ packed form
7541C04388q8073j60108n4762M2634k7979L3199N3267k7264p2359k855j50795
7530a50707l7206N4202P686M261O3165K5400J9522p5576K0776Q2420J9341O6181
7518I9465O6704j51152k220k7882n550P2590k5250R009r6255R835M7281O2059
7506E8634R593r4917j47308M6616J27150P6691r4948j97171N3694Q5754O5437
7495a0775N2424L5041K6913j09783k7493k3860L3383m6687l3400Q0435J9183l3293
7483c7912m3956M1526l5246l2462M8729q281j16278l197J5537k2742J99698K32841
7471B38257L0693q8915p2578r6578m3664p9943p9948N2295L568J11156R6028k4491
7459D5880N766q6320k2878j4496J0353J2763j41817p6666q1589J21958L4904J02391
$$ plain form
7447 -89751 18040 37668 5427 67919 92389 -78430 -6032 82443 186191 264070 238282
7436 238282 82970 102182 137651 52232 -33993 -27764 -80592 -83835 -1363 -7848 -128006 -151455
7424 -151455 -137853 -184507 -121078 19157 104889 55056 -44230 -98619 -171289 -197559 -88511
7413 -88511 29651 -20635 -57779 -188213 -203036 -150819 -93346 -147382 -134824 -90251 -121728
7402 -121728 -145583 -99636 -84412 -138956 -25448 -83968 -145941 -91710 -34909 -47103 -72573
7391 -72573 -12518 121109 160768 78654 14815 50302 205641 251769 210290 94859 36789
7380 36789 -24280 -81777 49494 151404 116916 -4433 -126717 -110672 -21716 -1353 -40584
7369 -40584 15650 128926 179404 80645 41907 35020 -106379 -152221 -124476 -121924 -32116 -28440
$$ packed form
7447h9751J07791J9628l2241O2492K4470j70819P2398Q8475J03748P7879k5788
7436B38282j55312J9212L5469q5419q6225O229n2828l243Q2472o485j20158k3449
7424a51455J3602m6654O3429J40235Q5732m9833r9286n4389p2670k6270J09048
7413h8511J18162n0286l7144j30434j4823N2217N7473n4036J2558M4573l1477
7402a21728k3855M5947J5224n4544J13508n8520o1973N4231N6801j2194k5470
7391g2573O0055J33627L9659q2114o3839L5487J55339M6128m1479j15431n8070
7380C6789o1069n7497J31271J01910l4488j21349j22284J6045Q8956K0363l9231
7369d0584N6234J13276N0478r8759l8738o887j41399m5842K7745K552Q9808L676
$$ plain form
7357 -28440 -103564 -116114 -59373 -74968 -147033 -59782 46918 -55870 -141617 -51850 -118525
7346 -118525 -128512 -68546 -106232 -131399 -109347 -118063 -91441 66411 41101 -50491 -79963 -105594
7334 -105594 -111595 -147374 -227361 -288442 -247341 -227308 -88137 -58559 -69740 85576 284891
7323 284891 250346 58511 24805 99907 91081 -14832 -11094 -44954 -7997 65520 186892
7312 186892 167839 48342 -23221 60024 29698 -68873 -180763 -220290 -343196 -275357 -205813
7301 -205813 -196031 -270127 -229136 -208101 -246914 -261270 -221892 -145203 -142256 -119534 -72778 -62768
7289 -62768 -118119 -78206 -35606 -21625 -4013 -54335 -144816 -253468 -262777 -190533 -144209 -23219
7277 -23219 121418 78777 42772 -11353 -60619 -17791 -47221 36759 19414 -72847 -24036 -7749
$$ packed form
7357b8440p5124j2550N6741j5595p2065Q7251J06700j02788q5747Q9767o6675
7346a18525r987N9966l7686k5167K2052q716K6622J57852k5310r1592k9472k5631
7334a05594o001l5779p9987o1081M1101K0033J39171K9578j1181J55316J99315
7323B84891l4545j91835l3706P5102q826j05913L738l3860L6957P3517J21372
7312A86892j9053j19497p1563Q3245l0326r8571j11890l9527j22906O7839O9544
7301b05813R782p4096M0991K1035l8813j4356L9378P6689K947K2722M6756J0010
7289f2768n5351L9913M2600J3981J7612n0322r0481j08652r309P2244M6324J20990
7277b3219J44637m2641l6005n4125m9266M2828k9430Q3980j7345r2261M8811J6287
$$ plain form
7265 -7749 126570 160678 74982 -76917 -72210 -77174 -83245 -16338 -30862 -29367 -107301 -131513
7253 -131513 -125143 -26770 -4546 -146549 -194851 -243891 -309394 -252081 -183408 -138524 -163863 -39633
7241 -39633 67654 76157 11799 -90299 -154592 -37669 -5252 -149765 -179353 -146615 -122327
7230 -122327 8700 54089 7885 -48010 -15516 55297 56437 2182 25590 -108705 -169173
$$ packed form
7265g749J34319L4108q5696j51899M707m964o071O6907j4524J495p7934k4212
7253a31513O370R8373K2224j42003m8302m9040o5503N7313O8673M4884k5339J24230
7241c9633J07287Q503o4358j02098o4293J16923L2417j44513k9588L2738K4288
7230a22327J31027M5389m6204n5895L2494P0813J140n4255K3408j34295o0468
$$ [...]
##END NTUPLES=NMR SPECTRUM
##END=
