##TITLE=Analysis number 312221
Compound Code cc 41910
Book Reference 437/28
Project Code adrs
Chemist Name wendyb
##JCAMPDX= 6.0         $$ Bruker NMR JCAMP-DX V2.0
##DATA TYPE= NMR SPECTRUM
##DATA CLASS= NTUPLES
##ORIGIN= Bruker BioSpin GmbH
##OWNER= NMR
$$ XWIN-NMR		Version 3.5
$$ Thu Jul 28 15:32:54 2005 GMT Daylight Time (UT+1h)  MAYBRIDGE\NMR@NMR_250MHZ
##.OBSERVE FREQUENCY= 250.131544655141
##.OBSERVE NUCLEUS= ^1H
##.ACQUISITION MODE= SIMULTANEOUS (DQD)
##.ACQUISITION SCHEME= undefined
##.AVERAGES= 16
##.DIGITISER RES= 18
##SPECTROMETER/DATA SYSTEM= dpx250
##.PULSE SEQUENCE= zg30
##.SOLVENT NAME= CDCl3
##.SHIFT REFERENCE= (INTERNAL, CDCl3, 0, 16.522)
##AUDIT TRAIL= $$ (NUMBER, WHEN, WHO, WHERE, WHAT)
$$ ##TITLE= Audit trail, XWIN-NMR		Version 3.5
$$ ##JCAMPDX= 5.01
$$ ##ORIGIN= Bruker BioSpin GmbH
$$ ##OWNER= NMR
$$ C:\u/data/dgb/nmr/ADRS/6790/pdata/1/auditp.txt
$$ ##AUDIT TRAIL=  $$ (NUMBER, WHEN, WHO, WHERE, WHAT)
(   1,<2005-07-28 15:32:36.79 +100>,<MAYBRIDGE\NMR>,<NMR_250MHZ>,
      <created by zg, POWCHK disabled, PULCHK disabled
       configuration hash MD5:
       62 19 C7 07 E1 42 D1 B7 37 6C 3D D0 77 39 F9 E6
       data hash MD5: 64K
       08 F7 FC 83 8C 17 EB 72 87 2C 4E 4B 51 A3 9F CD>)
(   2,<2005-07-28 15:32:47.48 +100>,<MAYBRIDGE\NMR>,<NMR_250MHZ>,
      <Start of raw data processing
       ef LB = 0.3 FT_mod = 6 PKNL = 1 SI = 32K 
       data hash MD5: 32K
       8A 0B ED 76 0C 49 4B 35 F1 C8 D8 48 68 42 9C 91>)
(   3,<2005-07-28 15:32:49.29 +100>,<MAYBRIDGE\NMR>,<NMR_250MHZ>,
      <apk 
       data hash MD5: 32K
       FC B8 50 E7 9F 46 59 53 F5 D6 06 08 5B 81 B2 6F>)
(   4,<2005-07-28 15:32:50.01 +100>,<MAYBRIDGE\NMR>,<NMR_250MHZ>,
      <abs ABSG = 5 
       data hash MD5: 32K
       6B 6B A1 F1 49 50 6E 4E 27 46 4A 08 C4 2C E1 CB>)
$$ ##END=
$$ 
$$ hash MD5
$$ 68 FF 57 A9 F6 16 B6 BC 7A 08 A4 F2 EB FA 4D 4F
##$RELAX= 
##$RELAX= 
##$RELAX= 
##$RELAX= 
##$RELAX= 
##$RELAX= 
##$RELAX= 
$$ Bruker specific parameters
$$ --------------------------
##$DU= <C:\u>
##$EXPNO= 6790
##$NAME= <ADRS>
##$PROCNO= 1
##$TYPE= <nmr>
##$USER= <dgb>
##$AMP= (0..31)
100 100 100 100 100 100 100 100 100 100 100 100 100 100 100 100 100 100 
100 100 100 100 100 100 100 100 100 100 100 100 100 100 
##$AQSEQ= 0
##$AQ_mod= 3
##$AUNM= <au_zg>
##$AUTOPOS= <13 >
##$BF1= 250.13
##$BF2= 250.13
##$BF3= 250.13
##$BF4= 250.13
##$BF5= 500.13
##$BF6= 500.13
##$BF7= 500.13
##$BF8= 500.13
##$BYTORDA= 1
##$CFDGTYP= 0
##$CFRGTYP= 5
##$CHEMSTR= <none>
##$CNST= (0..31)
1 1 145 1 1 1 1 1 1 1 1 1 1 1 1 1 1 1 1 1 1 1 1 1 1 1 1 1 1 1 1 1 
##$CPDPRG= <>
##$CPDPRG1= <>
##$CPDPRG2= <>
##$CPDPRG3= <>
##$CPDPRG4= <mlev>
##$CPDPRG5= <mlev>
##$CPDPRG6= <mlev>
##$CPDPRG7= <mlev>
##$CPDPRG8= <mlev>
##$CPDPRGB= <>
##$CPDPRGT= <>
##$D= (0..31)
0 1 0 0 0 0 0 0 0 0.06 0 0 0 0 0 0 0.0002 0 0 0 0 0 0 0 0 0 0 0 0 0 0 
0 
##$DATE= 1122561155
##$DBL= (0..7)
120 120 120 120 120 120 120 120 
##$DBP= (0..7)
150 150 150 150 150 150 150 150 
##$DBP07= 0
##$DBPNAM0= <>
##$DBPNAM1= <>
$$ [...]
##$SUBNAM7= <"">
##$SUBNAM8= <"">
##$SUBNAM9= <"">
##$SW= 20.6930455092707
##$SWIBOX= (0..15)
0 0 3 0 0 0 0 0 0 0 0 0 0 0 0 0 
##$SW_h= 5175.983436853
##$TD= 65536
##$TD0= 1
##$TE= 295.16
##$TE2= 300
##$TE3= 300
##$TEG= 300
##$TL= (0..7)
0 120 120 120 120 120 120 120 
##$TP= (0..7)
150 150 150 150 150 150 150 150 
##$TP07= 0
##$TPNAME0= <>
##$TPNAME1= <>
##$TPNAME2= <>
##$TPNAME3= <>
##$TPNAME4= <>
##$TPNAME5= <>
##$TPNAME6= <>
##$TPNAME7= <>
##$TPOAL= (0..7)
0.5 0.5 0.5 0.5 0.5 0.5 0.5 0.5 
##$TPOFFS= (0..7)
0 0 0 0 0 0 0 0 
##$TUNHIN= 0
##$TUNHOUT= 0
##$TUNXOUT= 0
##$USERA1= <user>
##$USERA2= <user>
##$USERA3= <user>
##$USERA4= <user>
##$USERA5= <user>
##$V9= 5
##$VALIST= <valist>
##$VCLIST= <CCCCCCCCCCCCCCC>
##$VD= 0
##$VDLIST= <DDDDDDDDDDDDDDD>
##$VPLIST= <PPPPPPPPPPPPPPP>
##$VTLIST= <TTTTTTTTTTTTTTT>
##$WBST= 1024
##$WBSW= 4
##$XGAIN= (0..3)
0 0 0 0 
##$XL= 0
##$YL= 0
##$YMAX_a= 432063
##$YMIN_a= -655584
##$ZGOPTNS= <>
##$ZL1= 120
##$ZL2= 120
##$ZL3= 120
##$ZL4= 120
##$ABSF1= 16.522
##$ABSF2= -4.171173
##$ABSG= 5
##$ABSL= 3
##$ALPHA= 0
##$AQORDER= 0
##$ASSFAC= 0
##$ASSFACI= 0
##$ASSFACX= 0
##$ASSWID= 0
##$AUNMP= <proc_1d>
##$AZFE= 0.1
##$AZFW= 0.1
##$BCFW= 0
##$BC_mod= 0
##$BYTORDP= 0
##$COROFFS= 0
##$CY= 12.5
##$DATMOD= 1
##$DC= 0
##$DFILT= <>
##$DTYPP= 0
##$F1P= 14.0000005364418
##$F2P= -0.99999901652339
##$FCOR= 0.5
##$FTSIZE= 32768
##$FT_mod= 6
##$GAMMA= 0
##$GB= 0
##$INTBC= 1
##$INTSCL= 1
##$ISEN= 128
##$LB= 0.3
##$LEV0= 0
##$LPBIN= 0
##$MAXI= 10000
##$MC2= 0
##$MEAN= 0
##$ME_mod= 0
##$MI= 0
##$NCOEF= 0
##$NC_proc= -5
##$NLEV= 6
##$NOISF1= 0
##$NOISF2= 0
##$NSP= 0
##$NTH_PI= 0
##$NZP= 0
##$OFFSET= 16.522
##$PC= 1
##$PHC0= -81.0167
##$PHC1= 5.726907
##$PH_mod= 1
##$PKNL= yes
##$PPARMOD= 0
##$PSCAL= 4
##$PSIGN= 0
##$REVERSE= no
##$SF= 250.13
##$SI= 32768
##$SIGF1= 0
##$SIGF2= 0
##$SINO= 400
##$SIOLD= 32768
##$SREGLST= <1H.CDCl3>
##$SSB= 0
##$STSI= 32768
##$STSR= 0
##$SW_p= 5175.98343685301
##$SYMM= 0
##$S_DEV= 0
##$TDeff= 65536
##$TDoff= 0
##$TI= <Analysis number 999999
Compound Code 99
Book Reference 9
Project Code 9>
##$TILT= no
##$TM1= 0
##$TM2= 0
##$TOPLEV= 0
##$USERP1= <user>
##$USERP2= <user>
##$USERP3= <user>
##$USERP4= <user>
##$USERP5= <user>
##$WDW= 1
##$XDIM= 32768
##$YMAX_p= 460029775
##$YMIN_p= -223874
$$ End of Bruker specific parameters
$$ ---------------------------------
##NTUPLES= NMR SPECTRUM
##VAR_NAME=  FREQUENCY,     SPECTRUM/REAL,   SPECTRUM/IMAG
##SYMBOL=    X,             R,               I
##VAR_TYPE=  INDEPENDENT,   DEPENDENT,       DEPENDENT
##VAR_FORM=  AFFN,          ASDF,            ASDF
##VAR_DIM=   32768,         32768,           32768
##UNITS=     HZ,            ARBITRARY UNITS, ARBITRARY UNITS
##FACTOR=    0.157963299565203, 1,           1
##FIRST=     4132.6476996994, 0,             0
##LAST=      -1043.33573715361, 0,           0
##MIN=       -1043.33573715361, -223874,     0
##MAX=       4132.6476996994, 460029775,     0
$$ Real data points
##PAGE= N=1
##DATA TABLE= (X++(R..R)), XYDATA
$$ [...]
17929H51640p0779j61906j20136j03788j12677j7958L570L3834J3688l0848o5963
17918B18677k2973K4947l7915N230o01L4792M8350M823r438j4299n3700P055l600
17905B01348k1068j4308l6737k1711Q530M2088K6151L5290K9376P405j326N4297
17893C09335L7009k9641l1253m0737j8782k5220k2098L4747J4375p044m563j8386
17881A97742K4887L690l0274m8710l7272J3757K1658K8059L0908p490p4567m2022
17869H0366M4357R762l2067J6537K7537N4631Q1477N764m5501n2400l5423m7839
17857A07201o3581k6003O029M3168Q2459k7487k1717r230l571j0994k1167J6794
17845G1901K4554o420o0245L0667N3250n0738m7221n2503L7926Q9029M3972K3145
$$ plain form
17929 851640 780861 618955 498819 395031 282354 264396 267966 301800 315488 284640 218677
17918 218677 195704 220651 182736 187966 187365 222157 270507 275330 265892 251593 197893 204948 201348
17905 201348 180280 165972 129235 107524 116054 158142 184293 219583 248959 256364 255038 309335
17893 309335 346344 316703 285450 244713 225931 200711 178613 213360 227735 220691 216128 197742
17881 197742 222629 226319 196045 147335 110063 123820 145478 173537 204445 196955 122388 80366
17869 80366 124723 134485 102418 118955 146492 201123 282600 288364 242863 190463 155040 107201
17857 107201 43620 17617 23646 66814 149273 121786 100069 90839 87268 76274 55107 71901
17845 71901 96455 90035 29790 60457 113707 62969 15748 -36755 1171 90200 134172 157317
17833A57317L8821o998k7319k8140l2539J8919J2729N3857m2291r094J6520k7777
17821A24005K5361N298j4695p5055l8421K4124P6074l0812L5527L2906l9949l8489
17809H5874J6509K0773j2268L787J4517J8648N37J6466k1083J660R995k9177m779
17796A21459L2189J8130j4840k0854r161k5555K0135K0362K5563k3206L013k9239
17784A17996m5128O3571P5817J9701l5441k3933o1622m7889L5854L8772J4904
17773A52602p978j6477M2726J3514L3201l096q9351m7840J1402K1551j9044q044
17761H3166O5676J3826k2821l3095k1123M8951M2043J6349m12J3813R083K1356
17749B36812J8861l6562j168N4549J1524l0936j8562P630j5040l7553K0327k700
$$ plain form
17833 157317 196138 189140 161821 133681 101142 120061 132790 186647 144356 135262 151782 124005
17821 124005 149366 154664 139969 64914 26493 50617 126691 95879 131406 164312 124363 85874
17809 85874 102383 123156 110888 114675 129192 147840 148377 164843 143760 145420 155415 126238 121459
17796 121459 153648 171778 156938 136084 126923 101368 121503 141865 167428 144222 147235 117996
17784 117996 72868 136439 212256 231957 196516 172583 110961 63072 98926 137698 152602
17773 152602 144624 128147 170873 184387 217588 214492 125141 77301 88703 110254 91210 83166
17761 83166 148842 162668 139847 106752 85629 134580 176623 192972 192560 206373 215456 236812
17749 236812 255673 219111 217943 272492 284016 253080 234518 242148 227108 189555 209882 207182
17737B07182N471K3092L9737N5119m1388n2841P129J9192P426M657O204P977k6326
17724B62631J5365K2139k3621o1722n5169L2823J3018J1070M4986n0564k0863
17713A90093K5561o4136j8485M7261N493J0269L1730j9361l9726j656o453R340
17701A69930P0384K1353L9215k321m3687j4229L4608N0492k1629L3505J316l1521
17689C07416k4565K6607j3584J8796R9614O7020L3087J0361O713K0806L9676M9473
17677F41420K1326J3393M4250L0548n1308N769P3314M5096J7935n23p8709r347
17665G53164n1403q1085Q867m0484q987P8375N07N165j1656k2605K5924j277k4706
17652F29799p254m2171M6176R2999K9076n3945k9937N202N0039r51l0640l5161
$$ plain form
17737 207182 212653 235745 275482 330601 289213 236372 243501 262693 270119 274776 280980 288957 262631
17724 262631 277996 300135 276514 214792 159623 192446 205464 216534 261520 210956 190093
17713 190093 215654 151518 133033 180294 185787 196056 227786 208425 168699 167043 160590 169930
17701 169930 240314 261667 300882 298561 254874 240645 275253 325745 304116 337621 338937 307416
17689 307416 282851 309458 295874 314670 414284 481304 514391 524752 531465 552271 591947 641420
17677 641420 662746 676139 720389 750937 699629 705398 778712 823808 841743 841220 762511 753164
17665 753164 701761 620676 629543 589059 580072 658447 658954 664119 652463 629858 655782 654505 629799
17652 629799 622545 580374 626550 719549 748625 694680 664743 669945 719984 719033 688393 653232
17640F53232L886l0757l6116J0427l5469j7205L6408K7700O0535P734j8827J2950
17628F74498L3676j2308L1150P2699O9463K8704M9491K9891R992O3314N9206K0956
17616A130732m926o0164k8175n980L2065Q6762P9542m2210K2008Q0955N4986M5934
17604A391529P5529O8583k4044j7501p5225n1668n7903m518K4782M6511N617J1376
17592A393068l459M5613k1794o1895L6056J30102J10010J72822J70578J20173
17582B091274J11974P0502R4767Q3734J42080K30702K93152M00949N03673N86384
17572D609191N33844L16116J48706P1235N4627K37758L70025N21487N87965N34606
17562G985560N69511O07470N54161O80610R29010J252401J644109K167948L092496
$$ plain form
17640 653232 657118 626361 590245 600672 565203 547998 584406 612106 672641 680375 661548 674498
17628 674498 708174 695866 727016 799715 869178 897882 947373 977264 987256 1050570 1109776 1130732
17616 1130732 1125806 1065642 1037467 1031487 1063552 1150314 1229856 1187646 1209654 1290609 1345595 1391529
17604 1391529 1467058 1535641 1511597 1494096 1418871 1367203 1309300 1304782 1329564 1376075 1381692 1393068
17592 1393068 1389609 1435222 1413428 1351533 1387589 1517691 1627701 1800523 1971101 2091274
17582 2091274 2203248 2273750 2368517 2452251 2594331 2825033 3118185 3519134 4022807 4609191
17572 4609191 5143035 5459151 5607857 5679092 5733719 5971477 6341502 6862989 7450954 7985560
17562 7985560 8555071 9162541 9716702 10397312 11326322 12578723 14222832 16390780 19483276
17553A9483276M401771O564858R777653J3806062J7690280J9825979J8321445
17546A09871324J3219063N677248j237553m982790m112041Q00498P554490J2743742
17538A39533981J2807660P396771k131453j2147214j9533455k2759180k2106436
17531H1060674j8843499j4663989j0781887p624819n423265l790256k664474j809495
17523A5458990j297057q71143o23504m68570m89879m38091k79685j33279k8869
17514A0828913Q3550K45531K89389K88065K86525K91385K73860L88586N32510
17505A3508314P21887J043216J494807K256552L385375N046379P602036J0938431
17497D5996997J4724145J7528819J7481555J3963264P374134M20299m467016n417056
$$ plain form
17553 19483276 23885047 30449905 40227558 54033620 71723900 91549879 109871324
17546 109871324 123090387 128767635 127530082 122547292 118435251 119235749 126790239 139533981
17538 139533981 152341641 159738412 157606959 145459745 125926290 103167110 81060674
17531 81060674 62217175 47553186 36771299 29146480 23723215 19932959 17268485 15458990
17523 15458990 14161933 13290790 12667286 12198716 11708837 11270746 10991061 10857782 10828913
17514 10828913 10912463 11157994 11447383 11735448 12021973 12313358 12587218 12975804 13508314
17505 13508314 14230201 15273417 16768224 19024776 22410151 27456530 35058566 45996997
17497 45996997 60721142 78249961 95731516 109694780 117068914 117489213 113022197 107605141
17489A07605141k404066L349537R362582J2264800J0613712N213445q04408l604422
17481A41596321j266059K207031j652441r315970j5438303j7911085j6873086
17474H1346408j2301736n076008L121602Q825393O486055r84581p743512j1745490
17466F1928131j2887365j1431801q501459n729830l941526k787524j958719j447397
17458A3242510j101507p71641o80535o50545n21491l42882k73108k05409j38490
17449H556902m3249J25232K84225M96253Q18804J049408J204275J258085J474709
17440A5224644J983206K589767L590948N316535Q359628J3348191K0179473K4143991
17432I4736383K1046812J6813536J0168669p05753r752392j2946010j0092171
$$ plain form
17489 107605141 105201075 108550612 117913194 130177994 140791706 146005151 145200743 141596321
17481 141596321 140330262 142537293 140884852 131568882 116130579 98219494 81346408
17474 81346408 69044672 63968664 67090266 75915659 82401714 81417133 73673621 61928131
17466 61928131 49040766 37608965 29107506 23377676 19436150 16648626 14689907 13242510
17458 13242510 12141003 11369362 10688827 10038282 9516791 9173909 8900801 8695392 8556902
17449 8556902 8513653 8638885 8923110 9419363 10238167 11287575 12491850 13749935 15224644
17440 15224644 17207850 19797617 23388565 28705100 37064728 50412919 70592392 94736383
17432 94736383 115783195 132596731 142765400 142059647 132307255 119361245 109269074
17425A09269074l251009L823688N882239N559511K461047n776373j3849756j8140165
17417H5978256j8385826j6500618j3007887r190785o303982m429170l184131k236463
17409A2739394j621109j272142r29470o66478n08468l59241k83004k08067j48568
17400F742847j54744q4511R9285K15204K73534L59147M22380M42909N63527P87432
17390I667010J103589J666322K648193L963649O359037J0388578J5077513J4447345
17382F5321236O610491j480718p058256r068443p917158l586793K358600Q045568
17374E3224527R005253L214602l722048q793542j0993039j0702625q523191n986325
17366A6723612l950142k697736j958174j420500j063211p52391n66479n10452
$$ plain form
17425 109269074 106018065 109841753 115723992 121283503 123744550 117968177 104118421 85978256
17417 85978256 67592430 51091812 38083925 28893140 22589158 18159988 14975857 12739394
17409 12739394 11118285 9846143 8916673 8250195 7741727 7382486 7099482 6891415 6742847
17400 6742847 6588103 6503592 6602877 6818081 7091615 7450762 7873142 8316051 8879578 9667010
17390 9667010 10770599 12436921 15085114 19048763 25407800 35796378 50873891 65321236
17382 65321236 71931727 70451009 63392753 54324310 46407152 42820359 45178959 53224527
17374 53224527 62229780 65444382 61722334 52928792 41935753 31233128 22709937 16723612
17366 16723612 12773470 10075734 8117560 6697060 5633849 4881458 4314979 3804527
17358C804527m45217k84190j64641k23566k78322j71048j50107j32957m9681k1716
17348A883082O7428L9742n9556j51823j15190m6800o918K9823J22193O1598j2769
17337A810810j09531j27287j45094j19738n5168j6831j2651K7715o4016j16242
17327A071967j42759r0969j1343j6482L3729J43494K16299K94158J78303J21607
17317A798004J06756o4730j46976k07136k35497k53266k01772j54004j14599k6054
17307E00726O518k4787o5142k2581j2348k3629N936K1029L0287L7010k9846J9088
17295D42261k3587l8960m0779l7515l6960L019L6807K4100O4067O9448M5591Q968
17283E16460L8649o9699j18243r597o0470o6824L8234M2381K467m2911r8584j8192
$$ plain form
17358 3804527 3359310 3075120 2910479 2686913 2408591 2237543 2087436 1954479 1904798 1883082
17348 1883082 1950510 1990252 1930696 1778873 1663683 1616883 1609965 1639788 1761981 1823579 1810810
17337 1810810 1701279 1573992 1428898 1309160 1253992 1237161 1224510 1252225 1188209 1071967
17327 1071967 929208 838239 826896 810414 844143 987637 1203936 1498094 1676397 1798004
17317 1798004 1904760 1840030 1693054 1485918 1250421 997155 795383 641379 526780 500726
17307 500726 507244 482457 417315 394734 382386 358757 364693 385722 416009 453019 423173 442261
17295 442261 418674 379714 338935 301420 264460 267479 304286 328386 392453 461901 507492 516460
17283 516460 555109 485410 367167 357570 297100 230276 268510 310891 313358 270447 171863 153671
17271A53671J2414m1727j4090m233j6125K5854O7031J3205j9489n955J5876l1826
17259A54606m7212l0322J2722j0903q536k477N9591j8658m94l5375k0710j6855
17247C5377K1141M4387r581K844m4649q3344M961K4673l9303l6013M4275N3398
17235A8166K5337n611m1036m6189J5879J9855L2292O786l4834r520L6876N5571
17223G3572J2988K1101L8492M5699l7544n9613j7003l2735j8459J6496N4014j0432
17211H6576l3655n0786J4604N7224L5420n9925l0319O7605M22m7389M6227l393
17199H2611o9585k0676k8715j1913K2415J6917L7788l0048n830L1468O5818J1448
17187A01698o7936r7885j0967K2719J1413J5508K3940K434k7787L0265K1141l1886
$$ plain form
17271 153671 166085 124358 110268 106035 89910 115764 182795 196000 176511 170556 186432 154606
17259 154606 107394 77072 89794 78891 70355 67878 127469 108811 108317 72942 52232 35377
17247 35377 56518 100905 91324 94168 49519 -33825 -28864 -4191 -43494 -79507 -35232 18166
17235 18166 43503 37892 -3144 -49333 -33454 -13599 18693 25479 -9355 -18875 18001 73572
17223 73572 86560 107661 146153 191852 154308 94695 77692 44957 26498 42994 97008 86576
17211 86576 52921 2135 16739 73963 109383 49458 19139 86744 87166 39777 86004 82611
17199 82611 13026 -7650 -36365 -48278 -25863 -8946 28842 -1206 -7036 24432 90250 101698
17187 101698 33762 -64123 -75090 -52371 -40958 -25450 -1510 924 -26863 3402 24543 -7343
17175g343j8283J6608K0962m5673l4208J1512M9245K2476K5446j5051j2983n231
17163G477R530L234j1759L4522j426K5685l305J8154o375j0368o4388j7339J5820
17150e38Q807J3197J6660N1438j0660j1245m617o0739M39j9230m5231L0009N6296
17137B4586J9922n0624m6306o681l1341J0922L0484l206J0317j7283O571J3921
17125c8718j8767k1176M1819R8251K7947o5721m2021n761J6094J7209J3102J8656
17113D0914l515K5568j4174k1424j9368j1653N9058K7226l103k0554k6535l6770
17101d330m5184m8563L3674K6694O3276j2689K8801K0062n1658m2593O369N9314
17089C3173N3541r0963n5890J6820J5809J1305K1169k6669K0037L9712k284m263
$$ plain form
17175 -7343 -25626 -9018 11944 -33729 -67937 -56425 -7180 15296 40742 25691 12708 7477
17163 7477 17007 20241 8482 43004 41578 67263 63958 82112 75737 65369 981 -16358 -538
17150 -538 8269 21466 38126 89564 78904 67659 63042 2303 2742 -16488 -61719 -31710 24586
17137 24586 44508 -6116 -52422 -59103 -90444 -79522 -49038 -52244 -41927 -59210 -52639 -38718
17125 -38718 -57485 -78661 -36842 61409 89356 23635 -18386 -24147 -8053 9156 22258 40914
17113 40914 37399 62967 48793 27369 8001 -3652 55406 82632 79529 58975 32440 -4330
17101 -4330 -49514 -98077 -64403 -37709 25567 12878 41679 61741 10083 -32510 -26141 33173
17089 33173 86714 -4249 -60139 -43319 -27510 -16205 4964 -21705 -1668 38044 35760 31497
17077C1497M7866L5094m3976l1183L3530m2549m2324j2641k2958n895K4809M3047
17065A4317K4286k9950l3092J9223P4435Q409m1891k018k481M9662J3539k9306
17053F5133m3313l23L1226J1794J533J704P2094N3360L4247j4655M1525O2656
17041C16981J27090J11415L7081N2850R8144l7697m8909R291q130m3047L9790
17030F54859J3940J2211N428q8319j12601j06957j46934k6517m5872j8322k1462
17019A19454o7999k8939r127L2868P6887m596m662J9463L4665m4957n0112o5286
17007G659Q657K7154J3128L4910l7686n8963J0245M2199K4221M479R849j5982
16995F9870j2138K5479L2362K6744M1123J13191J12331O6862O0923M4884j0615
$$ plain form
17077 31497 79363 114457 70481 39298 72828 30279 -12045 -24686 -47644 -53539 -28730 14317
17065 14317 38603 8653 -24439 -5216 69219 77628 35737 33719 31238 80900 94439 65133
17053 65133 21820 21497 52723 64517 66050 67754 139848 193208 227455 212800 254325 316981
17041 316981 444071 555486 592567 645417 743561 705864 656955 666246 658116 615069 654859
17030 654859 668799 681010 686438 598119 485518 378561 231627 205110 159238 140916 119454
17019 119454 51455 22516 13389 46257 123144 118548 113886 133349 168014 123057 72945 7659
17007 7659 16316 43470 56598 91508 53822 -5141 5104 47303 71524 76003 85852 69870
16995 69870 57732 83211 115573 142317 183440 296631 408962 475824 536747 581631 571016
16984E71016L8367L6026n5426k8359L4220K0678o341q667l2619j25059n5237o1354
16972C27245p1334j26405k7597k4441m0121J0543j4747K0158O3740N0896J5147
16961A83084J43396P6753M832j1605j3624j4154m8136n783N0136K0329L0304j4643
16949D00889k8922o0137p1550p785l432p1085n9058k3289l6512K1687J3105p5389
16937a478j0886J1927N7573L205k648K410K7310j1725L338m1430k6790N6711K7605
16924I5122J2182l8982l3187K6894K1917j4026K3355L167M7238J22029R9616R8147
16912D63472P1131O3600P720M3377M7008k6418j27035r1007k7015J9470R6068
16901E40371L5612q2761p4178r5537o3310l1883o0709k0485L0540j6056j01700
$$ plain form
16984 571016 609383 645409 589983 561624 595844 616522 610181 601514 568895 443836 388599 327245
16972 327245 255911 129506 101909 77468 37347 47890 33143 53301 117041 167937 183084
16961 183084 326480 403233 408065 396460 382836 368682 320546 314763 364899 385228 415532 400889
16949 400889 371967 311830 240280 232495 229063 157978 98920 75631 39119 60806 73911 -1478
16937 -1478 -12364 -437 57136 60341 57693 60103 87413 75688 79026 37596 10806 67517 95122
16924 95122 107304 68322 35135 62029 83946 69920 93275 96442 143680 265709 365325 463472
16912 463472 534603 598203 605923 649300 696308 669890 542855 451848 424833 444303 540371
16901 540371 575983 493222 419044 323507 260197 228314 167605 147120 177660 161604 59904
16890E9904p0033L3053k024k3361j8364l503k0937j766J1514k5922k5394j0355
16878i7188K626R0790R4836j4686j1056k7503j3413M5510M6907m1043K185N107
16866H3072M5220M5973P8395J6361k4052j3924r353k4867l5534K8274M3985O1168
16854B94718K542m9745k8044k5935n7273k8762O537m5601l7279q555l2003J0837
16842A437K3846J0924o5945l5015N7229j175n400k5215k8195L4472j596M437R172
16829b1024k8103Q1289j473j877J5911k3042k7654l3244k3830P766O5264M038
16817A4021J5179K0422K4656L437k7362m0567j9659k9381o7375m0823k1539J196
16805a67795m862J4231P745k7003K1607K6879L3315M6012J1635L9476j3326k0908
$$ plain form
16890 59904 -10129 22924 20900 -2461 -20825 -24328 -45265 -47031 -35517 -61439 -86833 -97188
16878 -97188 -94562 -3772 91064 76378 65322 37819 24406 69916 116823 75780 77965 83072
16866 83072 128292 174265 252660 269021 244969 231045 221692 196825 161291 189565 233550 294718
16854 294718 297260 247515 219471 193536 136263 107501 114038 68437 31158 22603 -9400 1437
16842 1437 25283 36207 -29738 -64753 -7524 -8699 -14099 -39314 -67509 -33037 -34633 -30196 -21024
16829 -21024 -49127 32162 30689 28812 44723 21681 -5973 -39217 -63047 -55281 9983 14021
16817 14021 29200 49622 74278 77715 50353 9786 -9873 -39254 -106629 -147452 -168991 -167795
16805 -167795 -172657 -158426 -150681 -177684 -156077 -129198 -95883 -49871 -38236 1240 -12086 -32994
16793c2994L1047K3121L649J8440m750J4414J3768j6598j1759K7648q562n8703
16781a279m9645l6545j6465l9947l2933N1590K7916K0179L8139r983j3214j5516
16769g7703M5675K0630K7589k9334j7889k1204o608L9046M3518n4401K4557J4340
16757H216m2598o5121k2695J2780L11m2979K7882L4333j9649J5003J6971L6185
16745d1361K5485l5116r221J9964r785N27j2884J2174m3905o972J1233M6010M2521
16732a330k9611n4260q4062j794N5557J333o511L1042O546M757M0480o39k1247
16719e9739l0071K4796J0613m3580M0094r796K1480n980m0848Q371K2817n804
16707f7647Q972J3945p305M9677J1300l6291l8488p774n7042k3229K2779K2775
$$ plain form
16793 -32994 -1947 21174 24823 43263 38513 52927 66695 50097 38338 65986 57424 -1279
16781 -1279 -50924 -87469 -103934 -143881 -176814 -125224 -97308 -77129 -38990 -48973 -62187 -77703
16769 -77703 -32028 -11398 16191 -13143 -31032 -52236 -58844 -19798 23720 -30681 -6124 8216
16757 8216 -34382 -99503 -122198 -109418 -109107 -152086 -124204 -89871 -109520 -94517 -77546 -41361
16745 -41361 -15876 -50992 -60213 -40249 -50034 -49507 -62391 -50217 -94122 -101094 -89861 -43851 -1330
16732 -1330 -30941 -85201 -169263 -171057 -115500 -114167 -120678 -89636 -83090 -78333 -37853 -38492 -59739
16719 -59739 -89810 -65014 -54401 -97981 -57887 -67683 -46203 -52183 -93031 -84660 -61843 -67647
16707 -67647 -58675 -44730 -52035 -2358 8942 -27349 -65837 -73611 -130653 -153882 -131103 -108328
16695a08328O0127L9445j0053J3055k0514K4074j2389m3573J7148N4446l489m3121
16683c3172k8507j3041R474O6620J1883n0524m3377K2780k1124j8770L1394K25
16671f6139j5206k166P205N4783J8677m4228n7566K5718P8020l0419q478j8873
16659e8672k6115k2519k0753P232N7235M2524J127K2976n2194l4461K3697J2199
16647d7724o951j8686l694K3312j3462l2583k257k5113Q894M7011O1760K0104
16635A0611o6607l0058q32N805j8111k1953K3609R115j5781J4359N3386K2984
16623a3473N722M820p8498m030O138M6861j5379n3578K346J1147N5707M5849j8410
16610d778l6094M9090M9138k7535k2326j7136J1044r877n421j5330J2944P8l6715
$$ plain form
16695 -108328 -48201 -8756 -18809 -5754 -26268 -2194 -14583 -58156 -41008 13438 9949 -33172
16683 -33172 -61679 -74720 -65246 1374 13257 -37267 -80644 -57864 -78988 -97758 -66364 -66139
16671 -66139 -81345 -83511 -76306 -21523 -2846 -47074 -104640 -78922 -902 -31321 -39799 -58672
16659 -58672 -84787 -107306 -128059 -120827 -63592 -21068 -19941 3035 -49159 -83620 -59923 -47724
16647 -47724 -54675 -73361 -77055 -53743 -67205 -99788 -102045 -127158 -118264 -71253 -9493 10611
16635 10611 -55996 -86054 -86886 -81081 -99192 -121145 -97536 -88421 -104202 -89843 -36457 -13473
16623 -13473 -7751 -2931 -81429 -85459 -79321 -32460 -47839 -101417 -99071 -87924 -32217 13632 -4778
16610 -4778 -40872 8218 57356 29821 7495 -9641 1403 -8474 -13895 -29225 -16281 -16203 -52918
16597e2918m5517n45l7184L8943K8249K8221j2698O886r9l9780q184L1752r86
16584f3860J4473L8458L0153m2600o708j0216j9219O8241N0483k4383m5712J159
16572i731K6125n0031j8525j3497l4834J4831J8608J0653n2419k9771J1236m191
16560a31546K355K8410K0104M3402k3266j8308J7539r228J2501k1846K6783L1960
16548b1140k2619l0544K8260M3432L0053r421o2969j8580L1406j4836j7502J6879
16536d7581J9839k0640K2607k172J3710r025M464L2145o1488m8333l4725J5708
16524a15491k4755p400N5851O3783J2865O6639L4824n9020p2426k661J0475Q657
16512b8659j6375l0754K9065J9566k0755j5822k6284M9503K2787j707n8154m4769
$$ plain form
16597 -52918 -98435 -98980 -136164 -97221 -68972 -40751 -53449 -46563 -46662 -86442 -94626 -62874 -63860
16584 -63860 -49387 -10929 19224 -23376 -30084 -40300 -59519 8722 59205 34822 -10890 -9731
16572 -9731 16394 -33637 -52162 -65659 -100493 -85662 -67054 -56401 -108820 -138591 -127355 -131546
16560 -131546 -129191 -100781 -80677 -37275 -60541 -78849 -61310 -70538 -58037 -79883 -53100 -21140
16548 -21140 -43759 -74303 -46043 -2611 27442 18021 -44948 -63528 -32122 -46958 -64460 -47581
16536 -47581 -27742 -48382 -25775 -27947 -14237 -23262 -18798 13347 -48141 -96474 -131199 -115491
16524 -115491 -140246 -147646 -91795 -28012 -15147 51492 86316 27296 -45130 -47791 -37316 -28659
16512 -28659 -45034 -75788 -46723 -27157 -47912 -63734 -90018 -40515 -17728 -19435 -77589 -122358
16500a22358j4530K5244P612J3697K2433l3465J4793p038K5439R91k0101k7177
16488a14460O4487L9504J8310l5171k0144k3148K4829l0613M0542L2358o2493
16477f5999j6855M6839N1890P969j2483L4452n0391k0023n3598m7267p326L410
16465a29382M5148L3625P690N9501j2158l5476N26M6842j3662o7274m8838j8862
16453a32320l115K8796L4006M7207k6383m6929J6121M9229K1695j907L5265L054
16441B4719k9678k0065l3650L613J502k0996J1058p23l8945k6675j2889P1739
16429g0990P4574N506l4295k7002J4932l6203k7067P018M9672l7965n2188J8432
16417a15576N5852K896L2365J5345m4997M9425L3171j9771j8125L025m5867L1473
$$ plain form
16500 -122358 -136888 -111644 -104032 -90335 -67902 -101367 -86574 -93612 -68173 -67182 -87283 -114460
16488 -114460 -49973 -10469 7841 -27330 -47474 -70622 -45793 -76406 -35864 -3506 -65999
16477 -65999 -82854 -36015 15875 23844 11361 45813 -4578 -24601 -78199 -125466 -132792 -129382
16465 -129382 -84234 -50609 -42919 16582 4424 -31052 -30526 16316 2654 -64620 -113458 -132320
16453 -132320 -135435 -106639 -72633 -25426 -51809 -98738 -82617 -33388 -11693 -13600 21665 24719
16441 24719 -4959 -25024 -58674 -55061 -53559 -74555 -63497 -64220 -103165 -129840 -142729 -70990
16429 -70990 3584 9090 -25205 -52207 -37275 -73478 -100545 -93527 -43855 -81820 -134008 -115576
16417 -115576 -59724 -56828 -24463 -9118 -54115 -4690 28481 8710 -9415 -6390 -52257 -20784
16405b0784L6187o136Q810N9080p3083k0671K8989K0919k1309m1208J9704M066
16393e436J8177J0189K7350r967n0492k1934k3783k5638J3494J0563K6416L221
16381b7840J5659o421j5613M773j0972q407K3246n223j9493L2297N4976j5830
16369B1152M0872M353j2453J5821N6356m0069r3109n0216J9414N8185M4487j5688
16357D9105p8629l9724L2623j6010m1506J2428N2748K4715j3113m2507J1436r600
16345e8034j5203K3494r661L0399j0601K0192N704l7627p0306K5294K5726l3023
16333a03646k6881k8378Q985L6204j1544J7704N1387J0679k227R154o3802m657
16321a07022O6559K7945J1902k6815J2839L9450m4640j65l662J3269L3396J4022
$$ plain form
16405 -20784 15403 9267 18077 77157 4074 -16597 12392 33311 12002 -29206 -9502 -5436
16393 -5436 12741 22930 50280 40313 -10179 -32113 -55896 -81534 -68040 -57477 -31061 -27840
16381 -27840 -12181 -18602 -34215 -29442 -40414 -48821 -25575 -30798 -50291 -17994 36982 21152
16369 21152 62024 66377 53924 69745 126101 86032 -7077 -57293 -37879 20306 64793 49105
16357 49105 -29524 -69248 -36625 -52635 -94141 -81713 -28965 -4250 -17363 -59870 -48434 -58034
16345 -58034 -73237 -49743 -59404 -29005 -39606 -19414 -13710 -51337 -121643 -96349 -70623 -103646
16333 -103646 -130527 -158905 -149920 -113716 -125260 -107556 -56169 -45490 -47717 -38563 -102365 -107022
16321 -107022 -40463 -12518 -616 -27431 -14592 24858 -19782 -19947 -23609 -10340 23056 37078
16309C7078j4159l1348O628M534r874L6213K4103L0478o6824n9912k3524L9321
16297b7286K3486j2205k536J0457l7824O8895k3070n9647l4052J4072J0443J4115
16285e5152K0055N4541L5028q233q7034n1691N1443K9133K4246o4382n4574J0850
16273i5770J1222j4896R646O2748n352m1802K6936M447l3898l7598P1463N3251
16261A0397k5575n2837l3346j6025j142Q0807J6177q325j0771L2075L6664l5482
16249g383p587L9237j3315l0850o3590j0390K9279j1387l0481L14J8886M7720
16237c9547K4839K1671k7202o931L0647J69j6066m3418M471k6438j0855j5900
16225a04560j0845O50M4533K4989L7830R897j451m0372l1385p257n1503J9108
$$ plain form
16309 37078 22919 -8429 -1801 2733 -7141 29072 53175 83653 16829 -43083 -66607 -27286
16297 -27286 -3800 -16005 -18541 -8084 -45908 22987 -83 -59730 -93782 -79710 -69267 -55152
16285 -55152 -35097 19444 54472 46239 -40795 -92486 -41043 -11910 12336 -52046 -106620 -95770
16273 -95770 -84548 -99444 -89798 -27050 -32402 -74204 -47268 -42821 -76719 -114317 -42854 10397
16261 10397 -15178 -68015 -101361 -117386 -118528 -37721 -21544 -29869 -40640 -8565 28099 -7383
16249 -7383 -14970 24267 10952 -19898 -83488 -93878 -64599 -75986 -106467 -106153 -87267 -39547
16237 -39547 -14708 6963 -20239 -27170 3477 3646 -12420 -55838 -51367 -77805 -88660 -104560
16225 -104560 -115405 -114755 -70222 -45233 -7403 2494 1043 -39329 -70714 -77971 -129474 -110366
16213a10366P1751k0650K4238L4331l7505j1974N9048J82q3634k5094L648Q0058
16201a5967O870J255J0095K2131l6444l9388n293M784L0984J7052k0620k6342
16189e0883L65K3699l6486j6078O587L9023J3370n025L7810R598L2234l8899m6241
16176c0926M423r62J9044l74k5944k4633J7801l1899j5406J4990k7615j8396m7645
16163a67542P5738N1361O125N961m6398k5513L6847P6025N4378J1885k8028m3018
16151G821j1673m4550k0871P049O5334L0624p187N4961m3262q4412P197m6087
16139h5056J0495J0107j5390l0007l958M8967k006L9243K3521l2113n7290K4273
16127f9214L7761K7510j0381J969J0474j3477k1927q59l0563J3900L2421N3781
$$ plain form
16213 -110366 -38615 -59265 -35027 -696 -38201 -50175 8873 9055 -74579 -99673 -96025 -15967
16201 -15967 -9097 -7842 2253 24384 -12060 -51448 -56741 -51957 -20973 -3921 -24541 -50883
16189 -50883 -50518 -26819 -63305 -79383 -72796 -33773 -20403 -25428 12382 21980 54214 15315 -30926
16176 -30926 -26503 -27465 -8421 -8795 -34739 -59372 -41571 -73470 -88876 -73886 -101501 -119897 -167542
16163 -167542 -91804 -40443 -34318 -28357 -74755 -100268 -63421 12604 66982 78867 50839 7821
16151 7821 -3852 -48402 -69273 -62224 3110 33734 26547 81508 38246 -46166 -38969 -85056
16139 -85056 -74561 -64454 -79844 -109851 -113809 -64842 -66848 -27605 -4084 -36197 -93487 -69214
16127 -69214 -31453 -3943 -14324 -12355 -1881 -15358 -37285 -38144 -68707 -54807 -22386 31395
16115C1395j766o4861j1694P1558M9225m2231l7477k2675k1774M0139O5386m8915
16103F310n7790N4415L5014j5397k2403K1097p671l3547k4417J9019l6091n9701
16091a21162L448K0590L0383K6250j2143J3882J02854L1154o3n3978l682l8628
16079a095j9361j9128l1044J5117J2338l4474k3890k1132O3372j0047R809l9773
16067i9308L7608l581J9407K1384O152L6997o4133K0629J4827M4356O3386k3867
16055G3857m2408k1364k3984r442K4431J03K7171j1559n1338j5030p65l2174p3511
16042a56013o7861K3203J2322L4026J08189L0517L6169M3505k0049j3181k3708
16031G119k9980l432r379L8057K4760K0202K852m0965K106n7207j15869L2242
$$ plain form
16115 31395 29629 -35232 -46926 24632 73857 31626 -5851 -28526 -50300 -10161 55225 6310
16103 6310 -51480 2935 37949 22552 149 21246 13575 -19972 -44389 -25370 -61461 -121162
16091 -121162 -117714 -97124 -66741 -40491 -52634 -38752 64102 95256 95193 41215 37533 -1095
16079 -1095 -20456 -39584 -70628 -55511 -43173 -77647 -101537 -122669 -59297 -69344 -59535 -99308
16067 -99308 -61700 -65281 -45874 -24490 -18338 18659 -45474 -24845 -10018 34338 97724 73857
16055 73857 31449 10085 -13899 -23341 1090 1193 28364 16805 -34533 -49563 -50328 -82502 -156013
16042 -156013 -223874 -200671 -188349 -154323 -46134 -15617 20552 64057 44008 30827 7119
16031 7119 -22861 -26293 -35672 2385 27145 47347 50199 9234 11340 -45867 -161736 -129494
16019a29494N6390J9557O429M1868l0766k9119n2296j9838M6056l7053j5368K7758
16007a15876l1620l266l876K8917O8578L2519k699J2556K6019J5351n3988L0641
15995C256l8603l4130j0653L2734M4744m4008k6421l3133O5358J7248p483M793
15983b6298J7489J7730j185L5004m168r171K6252J1867k9308K21n100n0058K1784
15970E059k7371j8970P630L2633K0213K832J4306j7864k8200K8522K1973L1078
15958G1841M2558l2650m7570j5043K0494M0245l2437m6972k9816l2347k1606l2689
15946a15992K5735K8911O7609R682p016M4128k0666m3060J7403J7235j1555l0041
15934a7627o683K48K0838P277k17K483j658m3140k6914L5210L7200J0504J1025
$$ plain form
16019 -129494 -73104 -53547 -47118 -5250 -36016 -65135 -117431 -137269 -91213 -128266 -143634 -115876
16007 -115876 -147496 -150762 -154638 -125721 -57143 -24624 -27323 -14767 11252 26603 -27385 3256
15995 3256 -35347 -69477 -80130 -47396 -2652 -46660 -73081 -106214 -40856 -23608 -31091 -26298
15983 -26298 -8809 8921 7736 42740 38572 29401 55653 67520 38212 38433 33333 -16725 5059
15970 5059 -22312 -41282 -33652 -1019 19194 22026 36332 18468 -9732 18790 40763 71841
15958 71841 114399 81749 34179 19136 39630 79875 47438 466 -29350 -61697 -83303 -115992
15946 -115992 -90257 -61346 6263 15945 8929 53057 32391 -10669 6734 23969 12414 -17627
15934 -17627 -24310 -24062 -3224 4053 3836 6319 4661 -38479 -65393 -30183 7017 17521 28546
15921B8546n868l9107j9301N360l9283o2953O8064L8011N022k3940m7023L3946
15909e8526M5897n2010L7438L0623K6342j2794L783j7225m8529L1138K239K383
15897i241o5134l3487J4469L4654L2351N6310M2966O790m14J5306K0038j8896
15885I5712m6543n5012M4831r715k9205K5280J7849R75j7582K1392m4794k1013
15873a7825K8049J522k9332Q595j610m4431o288K4073L0493j1069K1519k702J1049
15860A2043M6486N296m2117J4134k1627m6379L1620J7439k4296n0487j9602j808
15848g9298K6063K5707K7411o318l4743n030M0944p339k864p971j3413k990K0738
15835a9103J9149o2887k0365L0592O8871o024j8841L5964m97j2032j5427j7450
$$ plain form
15921 28546 22678 -16429 -35730 -30370 -69653 -132606 -64542 -26531 -21509 -45449 -92472 -58526
15909 -58526 -12629 -64639 -27201 3422 29764 16970 20753 3528 -45001 -13863 -11624 -9241
15897 -9241 -74375 -107862 -93393 -58739 -26388 29922 72888 79678 79264 94570 114608 95712
15885 95712 49169 -5843 38988 29273 68 25348 43197 44172 26590 47982 3188 -17825
15873 -17825 10224 11746 -17586 -8991 -10601 -55032 -61320 -37247 -6754 -17823 3696 994 12043
15860 12043 58529 63825 21708 35842 14215 -32164 -544 16895 -7401 -57888 -77490 -79298
15848 -79298 -53235 -27528 -117 -6435 -41178 -46208 -5264 -12603 -15467 -23438 -36851 -39841 -19103
15835 -19103 46 -62841 -83206 -52614 16257 10233 -8608 27356 26859 14827 -600 -18050
15823a8050j5347k6059J1074K9877M0424P0732n9693k3200O116l7352n0678M8820
15811b3336Q3538l8636j06254l2021l5402Q9782L2016m787R953k0569Q3140L655
15799D1079j9929n6660m732M1979r388m041J549K236P1419K7314k1096l4787o9528
15786c4585o6699l751L7263M4120K2684M4606l0336j7374N44j8862j9585M1305
15774f70K6977k4609J1252M823M2797l4959j15K7567R055j1061O536K280j9993
15761C9880k0213o4235M877N1285q834l4243K5432O224n4716M1162N492k0089
15749b7978K0885N2410J5160m3930p5426M8309O5144j634j3067K5418N026p139
15737F3178k6515l3559l2703J5958j58l6211j7440j7568j2399L5839r682M7610
$$ plain form
15823 -18050 -33397 -59456 -48382 -18505 21919 92651 32958 9758 15874 -21478 -72156 -23336
15811 -23336 60202 21566 -84688 -116709 -152111 -62329 -30313 -35100 -25147 -45716 37424 41079
15799 41079 21150 -35510 -40242 1737 -7651 -11692 -10143 -7907 63512 90826 69730 34943 -34585
15786 -34585 -101284 -105035 -67772 -23652 -968 43638 13302 -4072 -3528 -22390 -41975 -670
15774 -670 26307 1698 12950 17773 60570 25611 25496 53063 62118 51057 57593 59873 39880
15761 39880 19667 -44568 -39691 11594 2760 -31483 -6051 173 -54543 -13381 -7889 -27978
15749 -27978 -7093 45317 60477 16547 -58879 -10570 54574 52940 39873 65291 70317 63178
15737 63178 36663 3104 -29599 -13641 -13799 -50010 -67450 -85018 -97417 -61578 -71260 -23650
15725b3650N6748l0994J8821k1422k5494j6784M2416J4715j1035k0471j6805K7398
15713f557K1001j7032l3697k7163L1173Q0918k7955l6295l6785o3399o016L0838
15701i0969N0016P757l2102j0125Q7432M2161n9635k7362j4899m233L163J2901
15689c5895j4069j6641o725Q1495L0083j7735k4693J6026L3468K856P554O365
15677F2089m8699l2070k7718n9873J7463K9883J1292P226l2302k870K0504L9797
15665a5278K854K2649k5936j5763J9747m936r298q2002M206L0770m4008L5569
15653h1426M9387J5786m7955l9386p334O3901K6588j2240j5407k4965k8665P880
15641i3836k477j4554J4369P5236M5731o3419m0958K7975J3419K6666P8110J2241
$$ plain form
15725 -23650 33098 2104 20925 -497 -25991 -42775 -359 14356 3321 -17150 -33955 -6557
15713 -6557 14444 -2588 -36285 -63448 -32275 48643 20688 -15607 -52392 -115791 -121807 -90969
15701 -90969 -40953 -33196 -65298 -75423 12009 54170 -5465 -32827 -47726 -51959 -48796 -35895
15689 -35895 -49964 -66605 -73330 8165 38248 20513 -4180 11846 45314 48170 55724 62089
15677 62089 13390 -18680 -46398 -106271 -88808 -58925 -47633 -40407 -72709 -75579 -55075 -15278
15665 -15278 -12424 10225 -15711 -31474 -11727 -16663 -25961 -107963 -103757 -72987 -116995 -81426
15653 -81426 -32039 -16253 -64208 -103594 -110928 -47027 -20439 -32679 -48086 -73051 -101716 -93836
15641 -93836 -96313 -110867 -96498 -21262 24469 -38950 -79908 -51933 -38514 -11848 66262 78503
15629G8503m9938l5369m8119q495M0118L9982M5160k2603n9803J755j0457L2070
15617B804j0488l5540P420K4114K6300O238l7604J356K0339l6554J831J8701M151
15604f932j7240l4234k6801K3959j3264Q363R5308j6561j3249R360j5237K6250
15592A9722j3899o85M3657l3011k5237L1351L5541q0558J9396L9544J8541l219
15580E1143n8661l9379j1611M9404K2143r802J9881M2692n5997m7071n6778O8166
15568b5870L2939m204m702j5773p451K2076j6346J4632K1437p470K5359M820k407
15555C7040J681L3051k0996n8763n830o090J4304K43j9479j3535l4322k0374j5874
15542a08944k896J4873j462J4667J07922k3691l8347R51j2395j0452j0291k623
$$ plain form
15629 78503 28565 -6804 -54923 -63418 -23300 16682 61842 39239 -20564 -18809 -29266 2804
15617 2804 -7684 -43224 -35804 -11690 14610 20848 -16756 -15400 4939 -31615 -29784 -11083 -6932
15604 -6932 -24172 -58406 -85207 -61248 -74512 -66149 29159 12598 -651 8709 -6528 19722
15592 19722 5823 5138 48795 15784 -9453 21898 57439 -23119 -3723 35821 54362 51143
15580 51143 -7518 -46897 -58508 -9104 13039 3237 23118 65810 9813 -37258 -94036 -25870
15568 -25870 7069 2865 -1837 -17610 -25061 -2985 -19331 -4699 16738 9268 34627 39447 37040
15555 37040 38721 71772 50776 -7987 -13817 -19907 -5603 -5360 -24839 -38374 -72696 -93070 -108944
15542 -108944 -111840 -96967 -98429 -83762 24160 469 -37878 -36927 -49322 -59774 -70065 -72688
15530g2688k4741k5177J6361n3230m976P7154K1484M86M7244N697n5373o804P612
15517f6951j2621J4797J2803M2355L253k8361k4156K883M1861J5932k6762p1851
15505i6818j3184K9970j3910R377J9584L5839k860l8120J5811L0157q455l7525
15493g0134J9204k9412Q527M328L851j8890K3049J194l7069K8622N2357n5451
15481f9824L020P8502J2985j5837m4815j2879P5427J7499k4561J9379o630k7556
15469D710n3642k3099q743J0942K1250L157L7643N150k9192k5938j403n9775k6578
15456a45518N8903m490q161N0886O6101k3902k7979k4874K1498k3584k510M7161
15444a6469l0771k3815l6119L5726J4667O059M2823L7439l0912j6072J8923L3169
$$ plain form
15530 -72688 -97429 -122606 -106245 -159475 -164451 -87297 -65813 -65327 -18083 -12386 -67759 -74563 -66951
15517 -66951 -79572 -64775 -51972 -9617 -6364 -34725 -58881 -55998 -14137 1795 -24967 -96818
15505 -96818 -110002 -80032 -93942 -84565 -64981 -29142 -32002 -70122 -54311 -24154 -32609 -70134
15493 -70134 -50930 -80342 -71815 -67487 -63636 -82526 -59477 -58283 -95352 -66730 -14373 -69824
15481 -69824 -66804 11698 24683 8846 -35969 -48848 26579 44078 19517 38896 32266 4710
15469 4710 -48932 -72031 -80774 -69832 -48582 -45425 -7782 -2632 -31824 -57762 -59165 -118940 -145518
15456 -145518 -86615 -91105 -99266 -48380 17721 -6181 -34160 -59034 -37536 -61120 -63630 -16469
15444 -16469 -47240 -71055 -107174 -71448 -56781 -50722 -7899 29540 -1372 -17444 1479 34648
15432C4648N911l7253o745o119j6173q20k4523k3143J0403L3404l2281O71L4675
15419b7345J9836N8115r38p7633j5658k7915N496l075k2809r355K8704m335k9253
15406a06165q207K858K5283K9998n86J4353L5142P508n8003p490J9010j3077l8249
15393i7625k8374K9308M0324l21O1408j0629l8029R328k5582Q79l395L4061P3296
15380D4649J5847K4877K3210m5350N428L563L2842j1714m2808j7643J3736l6044
15368A0593p2625M7563j6506l1496k6364K2418J1901N929L4531J4834k5249l7228
15356f1699k6385L2615L5157K8663J9442J218j9745k1323J6769L7466p169j2444
15344B2565n5038K5244j797L055n221k8041M824K5069K2960L0253J9099k0235
$$ plain form
15432 34648 40559 3306 -3439 -9558 -25731 -26551 -51074 -74217 -63814 -30410 -62691 -62020 -27345
15419 -27345 -7509 50606 49668 -27965 -43623 -71538 -66042 -69117 -91926 -101281 -72577 -76912 -106165
15406 -106165 -114372 -111514 -86231 -56233 -56819 -42466 -7324 184 -57819 -65309 -46299 -59376 -97625
15393 -97625 -125999 -96691 -56367 -56688 4720 -5909 -43938 -34610 -60192 -59313 -62708 -28647 44649
15380 44649 60496 85373 108583 63233 68661 72224 105066 93352 50544 32901 46637 10593
15368 10593 -62032 -14469 -30975 -62471 -88835 -66417 -54516 -48587 -14056 778 -24471 -61699
15356 -61699 -88084 -55469 -20312 8351 27793 29011 9266 -12057 4712 42178 35009 22565
15344 22565 -32473 -7229 -9026 -5971 -11192 -39233 -34409 -9340 13620 43873 62972 42737
15332D2737k9133K8658J3730o6208r1075m139Q986K4728O985p9831J1860J3134
15320a19568N0473j8234J0752J3173J5655q103L646K9368J2344K1045j8226p527
15308a5202p2832l2822L5856M7852j6010M288o008L7350O389n0326L2197P2396
15296D3128N0953K5153n1341m5270j662M070J7806l2609J3471j5817l0147L4906
15284A2641K8139l318l9871l730M7697O1143p1191k7726J1500j965r223l1007
15272b6911j6500R500J1168J4390J359j2329J7518L2947r549l50O204N064k539
15259B9972r7136m2730N4993L2964r338j1900l9807j4436J6866N4820L8265Q805
15247B1338J3302l9229m9081k108J6812k7935J6810J3305L71J1368j5153J1435
$$ plain form
15332 42737 13604 42262 55992 -10216 -101291 -105430 -96444 -71716 -64731 -144562 -132702 -119568
15320 -119568 -69095 -87329 -76577 -63404 -47749 -55852 -52206 -22838 -10494 10551 -7675 -15202
15308 -15202 -88034 -120856 -85000 -37148 -53158 -48870 -54878 -17528 -11139 -61465 -29268 43128
15296 43128 94081 119234 67893 22623 20961 25031 42837 10228 23699 7882 -22265 12641
15284 12641 40780 37462 -2409 -6139 41558 102701 31510 3784 15284 13319 4096 -26911
15272 -26911 -43411 -33911 -22743 -8353 -6994 -19323 -1805 31142 21593 21243 27447 32511 29972
15259 29972 -67164 -109894 -54901 -21937 -31275 -43175 -82982 -97418 -80552 -25732 12533 21338
15247 21338 34640 -4589 -53670 -55778 -38966 -66901 -50091 -36786 -36415 -25047 -40200 -28765
15235b8765K0591Q375j7462k9788L1842L9885n2027K5817j8880j218q159K9347
15223d42N2245p4469n5493L653P3767k3217l0796K6079m241L4883L9599k5029
15211A6539m4871k1425k155N1205L7264k6863L1488m5060j4783J8872o839m327
15199a0955K1050l253N7220M4699m8380o1180M0410M624o701j3839p036J9516
15187C6175j6599j0721q352K2111K8950l85K2485k2223j765k895r305j1296l6227
15174a0047M103k6846j3222j0001L3705J8892j969p942m665q246l5364r447l0209
15161a01258j5593k5094K2158L0436K9252J8812k9921k7092o464J3802J5001K1896
15149e4065J2709K5554k058l2643m5898j1237J4625K1340J7646M5915Q694n9198
$$ plain form
15235 -28765 -8174 201 -17261 -47049 -15207 24678 -27349 -1532 -20412 -21630 -29789 -442
15223 -442 51803 -22666 -78159 -74506 -739 -23956 -54752 -28673 -32914 1969 41568 16539
15211 16539 -28332 -49757 -51912 -707 36557 9694 41182 -3878 -18661 211 -6628 -10955
15199 -10955 10095 6842 64062 108761 60381 -799 39611 44235 37534 23695 16659 36175
15187 36175 19576 8855 503 22614 51564 51179 73664 51441 49676 46781 37476 26180 -10047
15174 -10047 -5944 -32790 -46012 -56013 -22308 -3416 -5385 -13327 -17992 -26238 -61602 -71049 -101258
15161 -101258 -116851 -141945 -119787 -89351 -60099 -41287 -71208 -98300 -104764 -90962 -75961 -54065
15149 -54065 -41356 -15802 -17860 -50503 -96401 -107638 -93013 -71673 -54027 -8112 582 -58616
15137e8616J4702O3180m239k3449M4791K2410L9021j0425m7248l7500l1146N9099
15125C0580N4193n985l9212K4476o951l8113k6715j9020j3735K7121K582K3367
15113A2588Q712O253j6712j4284k5302N1153K071p3190l2117M6601l8687q915
15101h1829R902k8074k3165J4526K7356j2416O6005L1990K201j911k2350k4784
15089d2549K3653R98k0744k6160M046L4861Q3844K5946m3941K264j858j5334J4416
15076C9442k7413n8571j9849j727k7325j0924J4087N6069M924N620m9212j7423
15064i2302L8910J6222j2398J884j4279L6253L1784Q782n9878j7531L9527R930
15052a3096k2424j0102K1884P3051j9645r0150q840M1366j683J2867K1593K4134
$$ plain form
15137 -58616 -43914 19266 15027 -8422 36369 58779 97800 87375 40127 2627 -28519 30580
15125 30580 84773 78788 39576 64052 57101 18988 -7727 -26747 -40482 -13361 -10779 12588
15113 12588 21300 27553 10841 -3443 -28745 22408 24479 -48711 -80828 -34227 -72914 -81829
15101 -81829 -71927 -100001 -123166 -108640 -81284 -93700 -27695 4295 6496 4585 -17765 -42549
15089 -42549 -18896 -17898 -38642 -64802 -60756 -25895 57949 83895 39954 42218 40360 25026 39442
15076 39442 12029 -46542 -66391 -68118 -95443 -106367 -92280 -36211 -31287 -25667 -74879 -92302
15064 -92302 -53392 -37170 -49568 -47684 -61963 -25710 6074 14856 -45022 -62553 -23026 -13096
15052 -13096 -35520 -45622 -23738 49313 29668 -60482 -69322 -27956 -29639 -16772 4821 28955
15040B8955l283k1858q718K1509l9952n2780Q744N2434O9146J092r847k1442r812
15027A4188l4676R913q210K7705k6879P794N228K0067L2370K0129K3695o1561
15015B9763l6878k2313p789l3438l7424J697J9149O7370P340K903L4761o5656
15003d0515q6882k7118L9383L0694L1889N9922J2967j9091o0789M8329K4630l6591
14991b3172l3578J9995j7079k8968o973o608P9615m4523l9664M5099J7968j0461
14979d8349j0760K9500L9819K8270j3376J447k7298J2466j2873k9154K5354j428
14967f382k0313K12m361P107P1836J5k3872P800l0966k5825k5111M3246J9457
14954A2843m2214m933o760k1482k419L9276J9371J0264K2273k9016j6845n499
$$ plain form
15040 28955 25672 3814 -4904 16605 -23347 -76127 -67383 -14949 54197 55289 45442 24000 14188
15027 14188 -20488 -10575 -18785 8920 -17959 -10165 -4937 15130 47500 67629 91324 29763
15015 29763 -7115 -29428 -37217 -70655 -108079 -106382 -87233 -19863 -12523 -9620 25141 -40515
15003 -40515 -127397 -154515 -115132 -84438 -52549 7373 20340 1249 -59540 -11211 13419 -23172
14991 -23172 -56750 -36755 -53834 -82802 -89775 -96383 -16768 -61291 -100955 -55856 -37888 -48349
14979 -48349 -59109 -29609 10210 38480 25104 26551 -747 11719 -1154 -30308 -4954 -6382
14967 -6382 -26695 -26483 -30844 -23737 48099 48114 24242 32042 1076 -24749 -49860 -6614 12843
14954 12843 -29371 -34304 -41064 -62546 -64965 -25689 -6318 3946 26219 -2797 -19642 -25141
14942b5141l549m9364m1643O29m941K3513K3507M0098r137q63K1660J474K8060
14929D303j299l2371K9822K2812J07861M6293l2084k8129k0714l0094o1245j4171
14917i016K0567n506L0080p2895l5704J9854j8131K1574r426o27J9088k523M1083
14904a582M3754J585j6791M618m4529k2908L506J9713Q882J0659J2838J1589N872
14891C7206n9554R719J8979J9414j7374M193n018J4441o0020l270j2539J8458
14879c5365R693j9288r312J226q873N1917L5420j0710m5925j1598n397p614K9364
14866b6462J2968k0712M4359M5614p0159j2211q1464L5682Q5664K4451k5958m4489
14854c2717J4255j4817J4483K465m4010O036L9926k0347l6738j1982p574k1556
$$ plain form
14942 -25141 -28690 -78054 -119697 -119068 -124009 -100496 -76989 -36891 -46028 -46891 -25231 -23757 4303
14929 4303 3004 -29367 455 23267 131128 177421 145337 117208 96494 66400 5155 -9016
14917 -9016 11551 6045 36125 -36770 -72474 -52620 -70751 -49177 -58603 -59230 -40142 -42665 -1582
14904 -1582 42172 43757 26966 31584 -12945 -35853 -32347 -12634 -3752 6907 19745 31334 37206
14891 37206 -22348 -12629 6350 25764 8390 12583 7565 22006 -38014 -41284 -53823 -35365
14879 -35365 -25672 -44960 -54272 -53046 -61919 -10002 25418 14708 -31217 -42815 -48212 -55826 -26462
14866 -26462 -13494 -34206 10153 55767 -14392 -26603 -108067 -72385 13279 37730 11772 -32717
14854 -32717 -18462 -33279 -18796 -16331 -60341 -54305 -14379 -34726 -71464 -83446 -91020 -112576
14842a12576K9015J9622K9537J6333L8753L8208m859o5953k9783J703L7163k0284
14830b3121J9973J2628m389m0558K385L2137M1039N845K9801P920p4801k4323
14818a5464L4292j9680K6125K4045J6116K0686l111k7405l7357k7272j6815m551
14806c0391m73n7767r936L5045L7063M503j6355M226O8497l2460m133l5362N7274
14793A9731N8646n313m0222l268R521J7778j2745J3700q169j2692m459M8839O480
14780H7827l1258l0599j9480O001k1165K7389j7300j0953l6852O199L5207j8559
14768b3543J3698p787l4947m4060J0064K3904p098p980O706J931K1683k1577m2771
14755a11777Q813Q607J1710M810L5034O7309p749o7373m2243J4498Q2612Q5916
$$ plain form
14842 -112576 -83561 -63939 -34402 -18069 20684 58892 54033 -11920 -41703 -40000 -2837 -23121
14830 -23121 -3148 9480 5091 -35467 -33082 -945 40094 45939 75740 83660 8859 -15464
14818 -15464 18828 -852 25273 49318 65434 86120 83009 55604 18247 -9025 -25840 -30391
14806 -30391 -30864 -88631 -98567 -63522 -26459 -21956 -38311 -34085 34412 1952 -2181 -37543 19731
14793 19731 78377 73064 32842 29574 39095 56873 44128 57828 49659 36967 32508 81347 87827
14780 87827 56569 25970 6490 12491 -8674 18715 1415 -9538 -46390 -40191 -4984 -23543
14768 -23543 -9845 -17632 -52579 -96639 -86575 -62671 -69769 -77749 -71043 -69112 -47429 -69006 -111777
14755 -111777 -102964 -94357 -82647 -77837 -42803 24506 16757 -50616 -92859 -78361 4251 90167
14743I0167j6604m4207l9096N979j0545L929J4257J7238L9686p165J621O3024
14731A18284J5065o121l5990n0724L8210J7487o8246m5749J6882J4576J3030m6343
14719a9639K8537j678j639M9684n592R320k1947o2888m9673o852J270L4200j7807
14706f4704K1871K2381R801J2947n9458l7904M9837N4032L2340q387J9779L7075
14694H9610k5736J7710J3287m6283l0989N333K3604l7728k8026N9371k4097J7413
14682C3469L563l5669m9768M580M758M8710J6306j0100n0004k3440L3779L7261
14670A3445l3839l6963m2740L8999Q3819J5955J506j7771O8091L0392q2609l8021
14658B64j8090L7888O6961K2392n1967p524j3385m6813k889l5264k0830Q1414
$$ plain form
14743 90167 73563 29356 -9740 -3761 -14306 -10377 3880 21118 60804 53639 55260 118284
14731 118284 133349 127228 91238 40514 78724 96211 27965 -17784 -902 13674 26704 -19639
14719 -19639 8898 7220 5581 55265 49673 58993 37046 -25842 -75515 -82367 -81097 -46897 -64704
14706 -64704 -42833 -20452 -10651 2296 -57162 -95066 -45229 8803 41143 32756 52535 89610
14694 89610 63874 81584 94871 48588 17599 22932 46536 8808 -19218 40153 16056 33469
14682 33469 37032 1363 -48405 -43825 -39067 9643 25949 15849 -34155 -57595 -23816 13445
14670 13445 -20394 -57357 -100097 -61098 22721 38676 40182 22411 90502 120894 38285 264
14658 264 -17826 20062 87023 109415 57448 49924 36539 -10274 -13163 -48427 -69257 12157
14646A2157J8399p108j8987m40j2477o505r651K6771k898K4758j9890J7960L3749
14633E5838l1999k4306l6906l7603n551k5517K7490P483j2668J03245N899o3471
14621c8066o5860n3912J9969N1313N7495K428p541o7298j8955O5806M0123n653
14609b0151N945K0819K8771R594k8029Q830l928k3531o440k8146o333J7932N9651
14596C4984Q078k6146k5436j7553k4482k0301l6562J2409R1809j0172l3689k9723
14584g6784N4272p447L206P6715p1507n3548K4956J8297j222L8059J6229M518
14572B5744L4348m269P301J0776m4919m7684J371N3942r679k7968N652m8969r796
14559e4150L3391J43J2546m173m3757N357k5842M2603K2530l3519L3092m291k5400
$$ plain form
14646 12157 30556 23448 4461 4021 -8456 -14961 -24612 2159 -739 24019 4129 22089 55838
14633 55838 23839 -467 -37373 -74976 -80527 -106044 -78554 -71071 -83739 19506 25405 -38066
14621 -38066 -103926 -157838 -137869 -86556 -29061 -26633 -34174 -101472 -120427 -54621 -14498 -20151
14609 -20151 -14206 6613 35384 44978 16949 25779 21851 -1680 -8120 -36266 -42599 -24667 34984
14596 34984 43062 16916 -8520 -26073 -50555 -70856 -107418 -95009 -3200 -13372 -47061 -76784
14584 -76784 -22512 -29959 -26753 49962 -21545 -75093 -50137 -31840 -33062 4997 21226 25744
14572 25744 60092 55823 63124 73900 28981 -18703 -17332 36610 26931 -1037 4615 -44354 -54150
14559 -54150 -20759 -20616 -8070 -12243 -56000 -50643 -76485 -33882 -11352 -44871 -11779 -16070 -41470
14546d1470k5279n480N5908L4748K3521L4483N0882l1049k6302K5068J1581k8485
14534G8126k4307M333k8780K170k0918m1666K2867r485n152k463Q524L0573o987
14521F835r310r524M2431l6496j1401p763j3430J4895K0893j9751K0594K446r983
14508i564P502J6989Q482m801L0026J5992K9161J0037j7281o6917k6882K1886
14496A4630O1642J0609l6888m6557j9611J0255J6185J0767J2876r1002k7576Q228
14484g6442l4200R743J5551K1827K5738L9324K0954l3199J3468p728K5386M3165
14472F3587k0762J204m0438J9265k3838p6621J4440K2186j2242K5671m285K2294
14460i539L9855N162j3994M2093k5677p7810K5719L1678k017k820k9921R567O476
$$ plain form
14546 -41470 -66749 -72229 -16321 18427 41948 76431 127313 96264 69962 95030 106611 78126
14534 78126 53819 58152 29372 31542 10624 -31042 -8175 -17660 -22812 -25275 -16751 13822 6835
14521 6835 -2475 -11999 30432 -6064 -17465 -25228 -38658 -23763 -2870 -22621 -2027 419 -9564
14508 -9564 -2062 14927 23409 18608 48634 64626 93787 103824 86543 19626 -7256 14630
14496 14630 76272 86881 49993 3436 -16175 -5920 10265 21032 33908 -57094 -84670 -76442
14484 -76442 -110642 -100899 -85348 -63521 -37783 1541 22495 -10704 2764 -4964 20422 63587
14472 63587 42825 44029 3591 22856 -982 -77603 -63163 -40977 -53219 -27548 -31833 -9539
14460 -9539 30316 35478 21484 63577 37900 -39910 -14191 17487 15470 12650 -17271 -7704 -1228
14447a228L7065k6459k1028R5714M0308K9631m6646p7274o1035J0479J0552J4917
14435D996l0732Q583j0746j8070N2489L6939J3742l0166o837j1076l2545k1384
14423d4807R225j4478k4998J1129p381K3560K1050j0324J1687K7198n340J9673
14411A6194j1355o7300P9668K2315l6879j9093P3437K0419l1691k740J995k9511
14399A5459O90j6695K7274k2288n0925K4989j411j6214o2492J9315N7460j0891
14387c5729J405l722q297J5907n4558m9920J6642J3555L7107R216L6987n754L7200
14374A0039K0480k1748l9236M2305O0754N0650k4238m185O451m7553j6861M3914
14362H0772n996k9656J8915J373l1069m9894R048L2464j7091L682j4335M9099
$$ plain form
14447 -1228 35837 9378 -11650 84064 124372 154003 107357 30083 -30952 -20473 -9921 4996
14435 4996 -25736 -17153 -27899 -45969 6520 43459 57201 27035 20198 9122 -23423 -44807
14423 -44807 -35582 -50060 -75058 -63929 -71310 -47750 -26700 -37024 -25337 1861 -3479 16194
14411 16194 4839 -62461 17207 39522 2643 -16450 56987 77406 45715 42975 44970 15459
14399 15459 16149 -546 26728 4440 -46485 -21496 -22907 -39121 -101613 -82298 -24838 -35729
14387 -35729 -34324 -38046 -46343 -30436 -84994 -134914 -118272 -104717 -67610 -58394 -21407 -27161 10039
14374 10039 30519 8771 -30465 11840 72594 123244 99006 94821 101272 53719 36858 80772
14362 80772 74776 45120 64035 65408 34339 -15555 -6507 25957 8866 12548 -1787 47312
14350D7312K5438n0101q2822j4526k4880L1727Q1100M3304n1553m8193j6614J9491
14338d0317L6841L17Q314k4205J4595j5765J8136J0285J3343n9960L0J6401J7538
14325d447K3004O3469j7540j7972K4312J3494o33r831l1520l0762o566p338k8240
14312c0570j0267k033k6891K6748K533J6701K6460l047j5279N566q4618k7070
14300a21767Q291L5339O4483M4002l9019p0826o384K7042M2074r555k4643l9830
14288i0793M5204K6034J7575M0950j3368K749m636p139M579k7269j6707O770j3941
14275b9992L8775R897k4152m1040j3311l9049k2900J1355O8037J8390L7301M0928
14263E4239l0083J3220k6011j8412j0548P469Q46o37K4512m3306k1541o837l3354
$$ plain form
14350 47312 72750 22649 -60173 -74699 -99579 -67852 13248 56552 4999 -43194 -59808 -40317
14338 -40317 -3476 -3159 5155 -19050 -4455 -20220 -2084 8201 21544 -38416 -38386 -21985 -4447
14325 -4447 18557 82026 64486 46514 70826 84320 83687 73856 42336 11574 5008 -2330 -30570
14312 -30570 -40837 -42870 -69761 -43013 -40480 -23779 2681 -366 -15645 -10079 -94697 -121767
14300 -121767 -113476 -78137 -13654 30348 -8671 -79497 -85881 -58839 -16765 -26320 -50963 -90793
14288 -90793 -45589 -19555 -1980 38970 25602 28351 23715 16576 21155 -6114 -22821 -16051 -29992
14275 -29992 8783 18680 -5472 -46512 -59823 -98872 -121772 -110417 -42380 -23990 13311 54239
14263 54239 24156 37376 11365 -7047 -17595 -10126 -9280 -9917 14595 -28711 -50252 -57089 -90443
14250i0443J9018L1286m1698K3132M7685j413M0283M1861L7302p935r6536K4156
14238B6698L3572K516K5000l5238k2565N3376N869n122J0592Q1381n332j0989
14226A59758k4322m6479m8417j1689M477j1509L4426m61k8353J2917k4568l7066
14214b1286L6015N5584K7664l4504m3745q0187J578k3536J6614O2601M4495J477
14202D2770L0450K1694O888o2442q282m557o6451k3003r100k953l7027L9675O7884
14189d454J4715j1543l6322p887J0947k0748J3557J178j1604m043L516o563J7067
14176d2184K656K677L189O856N6195o284L2187J6882p6251j133l5241L3933K3034
14163A6516l3727J251m8m3554m4330K529M2572J795K663l3182N2690Q2679k7383
$$ plain form
14250 -90443 -71425 -40139 -81837 -58705 -11020 -12433 27850 69711 107013 99078 2542 26698
14238 26698 60270 62786 87786 52548 29983 83359 89228 84106 94698 176079 170747 159758
14226 159758 135436 88957 40540 28851 33328 21819 56245 55784 27431 40348 15780 -21286
14214 -21286 14729 70313 97977 63473 19728 -60459 -58881 -82417 -65803 -3202 41293 42770
14202 42770 73220 94914 101802 39360 31078 26521 -39930 -62933 -72033 -74986 -112013 -72338 -4454
14189 -4454 10261 -1282 -37604 -45491 -34544 -55292 -41735 -40557 -52161 -56204 -52688 -59251 -42184
14176 -42184 -39528 -36851 -33662 -26806 29389 23105 55292 72174 -4077 -5210 -40451 -6518 16516
14163 16516 -17211 -15960 -16008 -59562 -103892 -101363 -58791 -56996 -54333 -87515 -34825 47854 20471
14150B0471J6804L5576J5665m3859n6906K9951M948l7212j8636J8431L0954j2719
14138C468K0540L5201m8753m2210m4428K2810K7423M4449K3039J0319j3971l5049
14126B838k9534L104J8379j1212m071n810m7705K3445N8045P8515N985o8728k7492
14113d241l7120M6453M4j4179M5839L060L1998k1429J024l175Q864l1707l8460
14100a3029K8549J1748L6765k2919l9130k9708M2404M1614j1738l3789j6990L2261
14088B6038M2406J8794K8529J5737R553m317j5285J229J1864O278l5203l4351
14076G1272k6430J6459n351o7266k3882J1632L3999L3267j3435j1961O298J0537
14064C5139n0569q3L8070p709O921J4098M4633L8596k8259m9934k9996n8357M375
$$ plain form
14150 20471 37275 72851 88516 44657 -12249 17702 22650 -14562 -33198 -14767 16187 3468
14138 3468 24008 59209 10456 -31754 -76182 -53372 -25949 18500 41539 51858 37887 2838
14126 2838 -26696 -23592 -5213 -16425 -20496 -26306 -74011 -50566 7479 85994 91979 23251 -4241
14113 -4241 -41361 5092 5136 -9043 36796 39856 71854 50425 51449 48274 57138 25431 -13029
14100 -13029 15520 27268 64033 41114 1984 -27724 14680 56294 44556 10767 -6223 26038
14088 26038 68444 87238 115767 131504 141057 136740 121455 122684 134548 140826 105623 71272
14076 71272 44842 61301 55950 -11316 -35198 -23566 10433 43700 30265 18304 24602 35139
14064 35139 -15430 -15513 22557 14848 21769 35867 80500 119096 90837 40903 10907 -47450 -43075
14051d3075k1338O299K0323Q4192L8924k4565o5342J549M6020K0913o482n9214
14039a796p1118r187N0731M4909K1457k5796O9357K2634k0402M53O064m088K4071
14026A07289j1675l5655j8426j1437K4373J0455r807R71L730J0017L2483O333
14014A08651j7990N0181o9744m443P6770J9251j4274p0712o9389k1468K2073K3435
14002C2341o886K1157L1175J9819J1134o8446n3823L9335K3337j1723K7408K1655
13990H6483l3504m2221k6926k1473j0924J3753P6262J9194J0863N2399j6844p7669
13978B9393o1939J6876Q3799j0963J9707m6878r7357J5310L6994P2853O1846J8742
13966A38383k3087o7325o2156m424L0025M3488L0047N2980L4024k0679k4443k7918
$$ plain form
14051 -43075 -64413 -58114 -37791 46401 85325 60760 -4582 -3033 42987 63900 57418 -1796
14039 -1796 -72914 -82101 -31370 13539 34996 9200 78557 101191 80789 81242 87306 83218 107289
14026 107289 95614 59959 41533 30096 54469 64924 55117 56088 59818 69835 102318 108651
14014 108651 90661 140842 71098 66655 143425 162676 148402 77690 8301 -13167 8906 32341
14002 32341 25455 46612 77787 97606 108740 40294 -13529 25806 49143 37420 64828 86483
13990 86483 52979 10758 -16168 -37641 -48565 -34812 41450 60644 71507 123906 107062 29393
13978 29393 -32546 -15670 68129 57166 76873 29995 -67362 -52052 -15058 57795 119641 138383
13966 138383 115296 47971 -14185 -18609 11416 54904 84951 137931 171955 151276 126833 98915
13954I8915j4892R928K1412l7893p8390M3784J2798p874L4111j0689o112p9585
13942a4487m3460Q298j3728r303J510n851N9469O7584L009L1385K1807R570O268
13929A22071L1459l0693k3944k1009n897M5865M3054j432J143l1931j7252p894
13917A03540Q053l5591n2284L983J6607k5551q562O25K5604J6810R790J6106J4226
13904I3356L4095j0912j503J4186n3297o740J0563M9002q040p7296j7J1722n3092
13891B027J2654P5362J7001l2253j9105n3229n3491K191j0840k933M5122N3623
13879C6129O7418K3031j8386l8646m7351J4469r729J2352k127l4250M565K9965
13867C7440K1003J2870p5737l3864j3232p19Q5131K0287P767j3055k7977Q2021
$$ plain form
13954 98915 84023 93951 115363 77470 -920 42864 55662 47788 81899 71210 65098 -14487
13942 -14487 -57947 -49649 -63377 -72680 -71170 -77021 -17552 50032 53041 84426 106233 115803 122071
13929 122071 153530 122837 98893 77884 71987 117852 160906 159474 160617 128686 111434 103540
13917 103540 111593 76002 23718 27701 44308 18757 10195 10820 36424 53234 63024 79130 93356
13904 93356 127451 116539 115036 129222 75925 69185 79748 128750 120710 43414 43397 55119 2027
13891 2027 14681 90043 107044 74791 55686 2457 -51034 -48843 -59683 -62616 -17494 36129
13879 36129 103547 126578 108192 69546 22195 36664 26935 39287 37160 2910 7475 37440
13867 37440 58443 71313 -4424 -38288 -51520 -52239 32892 53179 60946 47891 19914 101935
13855A01935O11k1515j1424k4374m0030j268j7033j0721J4779k5550K2887O8026
13843E6323L008l7778r029n0694r032K6856M7435M3824R878J4530j4369j2958
13831F7994K5311M7523l6669q3059k0221K7298k930k7886n2356l2670L0455K9460
13819b7750M0645K5807O7715p374J8292j6276p45n3769L966J6148M662m3261j2881
13806A5179J0560k1496l0075P6645M6235l3135j6438l3314p50M2854J6498J7116
13794H9879K836K2176k7699j7040k0869m8762j0496N2321M0311o8718l1764J159
13782a6666l731J3420j5687J1425N5904O0552k3007l734p85m7036k2670M1416
13770D9401N121j873R441j7971J0534m168k9026J5618J3919Q704J2548M7822J8542
$$ plain form
13855 101935 102546 81031 69607 45233 5203 3935 -13098 -23819 -9040 -34590 -11703 56323
13843 56323 59331 21553 12524 -38170 -47202 -20346 27089 70913 80791 95321 80952 67994
13831 67994 93305 140828 104159 21100 879 28177 25247 -2639 -54995 -87665 -57210 -27750
13819 -27750 12895 38702 106417 99043 117335 101059 100314 46545 50511 66659 71321 28060 15179
13806 15179 25739 4243 -25832 50813 97048 63913 47475 14161 13411 56265 72763 89879
13794 89879 92715 114891 87192 70152 49283 521 -9975 42346 82657 13939 -17825 -16666
13782 -16666 -20397 -6977 -22664 -11239 44665 105217 82210 78476 77691 30655 7985 49401
13770 49401 54522 52649 62090 44119 54653 50485 21459 37077 50996 59700 72248 120070 138612
13757A38612j1518k1030p75l4418l0249M096K1049J0839r725p976L725M6261J4590
13744A23481m362j152K9096l807K6520n6145o6535J1428K9304k1246K0476Q342
13732I5400J4667l24n2624j9981K1730k505j2414J9142L3981P492N052m1746l8440
13719B9430J5984r174o4107n912p404N1604L4797N5565J7751M4949m249r4481
13707F4753p587M1883K306K0384O2690J3998N009J0158J8615N1949J08463P2037
13695D64658K0536P4135J66559J44048R3109J08349Q2666o9693j26173j03936
13685H54258o9055r4675r4152p3917q7313r5109p7945k5547K413o303o8111o559
13673A57985j4495n0628M991M8584L8659M1091Q6764O0480J0010L191k8230N5918
$$ plain form
13757 138612 127094 106064 105289 70871 40622 44718 65767 76606 66881 58905 62630 108891 123481
13744 123481 119119 117967 147063 143256 169776 113631 47096 58524 87828 66582 87058 95400
13732 95400 110067 109743 57119 37138 58868 56363 43949 63091 97072 104564 109616 67870 29430
13719 29430 45414 36240 -27867 -33779 -41183 10421 45218 100783 118534 163483 159234 64753
13707 64753 57166 99049 101355 121739 184429 198427 203436 213594 232209 284158 392621 464658
13695 464658 485194 559329 725888 869936 963045 1071394 1154060 1084367 958194 854258
13685 854258 785203 690528 596376 522459 435146 340037 262092 236545 238958 232655 164544 157985
13673 157985 143490 92862 97853 146437 185096 226187 312951 373431 383441 386632 358402 414320
13661D14320J25478J32061K15357J99158K59012L00612L55457K40946K3345j43182
13651B122564k21408k75775k87459k94955k36294j29376j36286j13975n9486n8808
13641C08742j3636J8933j4153l4630l4570n1882l3533Q681J4786L3515O1759N59
13629B64571k0286M1178O3346N2736N2901L9676K5178J69968J68551J54553J46695
13618A159067Q3415L4388r4993j42824j97131j66547j20137n6534r3492j03399
13608C01813p5506n048O241l0414p6354o683J3760K3424k0064l8918K567k3199
13596G1619l784k6383k2071O0897K8304J345l93l453K546N8081P203k1272l8640
13583A13999l7996l3743L7335Q1415k9984m5643K3551L5459L3080l8253n7182
$$ plain form
13661 414320 539798 671859 887216 1086374 1345386 1645998 2001455 2242401 2265746 2122564
13651 2122564 1901156 1625381 1337922 1042967 806673 677297 541011 427036 367550 308742
13641 308742 295106 314039 299886 265256 230686 178804 145271 153952 168738 202253 264012 264571
13629 264571 244285 285463 348809 401545 454446 494122 519300 689268 857819 1012372 1159067
13618 1159067 1242482 1276870 1181877 1039053 841922 675375 555238 498704 405212 301813
13608 301813 226307 221259 227500 197086 120732 114049 127809 151233 131169 92251 94818 71619
13596 71619 67835 41452 19381 80278 108582 109927 109534 106081 108627 166708 173911 152639 113999
13583 113999 76003 42260 79595 161010 131026 85383 108934 144393 177473 139220 82038
13572H2038j6171q2714Q303K8216N7345K1112K8921K6235J6565M098K2680j179
13560A95449m8599J979P074l4896l0097l2504J7380O0307o646P368j8617j4702
13548A03496K8008l3722j6514J8342n9462K1847N3439n006j1667q4820l4880J7314
13536c625j2408l614N7953K4000j678O025K8822Q0423N8951K4154q603k9261J9152
13523B40291L253n4433k9970L771j5273J4067j2531R189r341j2660P051k6579
13511A16835m2334K6709O2057O178K953J1772K6519o7747Q912r407N8963M2056
13499B43466M0494k5712M2088O546L3312k7883r878k24l6849j5269P521K4908
13487B82520k4740n7593J5975J5892L8406R619l945o3830M2438M0176K792j0847
$$ plain form
13572 82038 65867 -16847 -8544 19672 77017 98129 127050 153285 169850 173948 196628 195449
13560 195449 146850 148829 155903 121007 90910 58406 75786 136093 129447 136815 118198 103496
13548 103496 131504 97782 81268 99610 40148 61995 115434 110428 98761 13941 -20939 -3625
13536 -3625 -16033 -19647 38306 62306 60628 66653 95475 175898 234849 259003 250400 221139 240291
13523 240291 243544 189111 159141 162912 147639 161706 149175 158364 149023 136363 143414 116835
13511 116835 74501 101210 163267 169445 172398 184170 210689 142942 151854 142447 201410 243466
13499 243466 283960 258248 300336 306882 340194 312311 302433 302209 265360 250091 257612 282520
13487 282520 257780 200187 216162 232054 270460 280079 276134 212304 254742 294918 297710 286863
13475B86863q5158j9984P5819K7702K0919M4847k4719q5573l0200J8391Q2800
13464C11707N1932q54P397O8521J5088j9057n4148r4589j4954n388L5173N3450
13452C54278j8328l3377L7172M1825K9128l6888n7209m6547m7426l4916M9588
13441B37300N0219K3231P756N2787K1778m0854l8663k1236k1728K8679P993j3168
13429B94094O5978Q0586N8722L807j1357J8513m2201o1644j8178n7806j805R9243
13417D27952J8349j4356j7809m400k1525j7686j6428J3444J9514R430k5374k9123
13405C41988j1764n7924r82L5543j4159l0730J6020O9815J2467o5092K0820N5450
13393C71452N5524j596N8484J4653j0581K7051L6785O595k0119q799L2114K189
$$ plain form
13475 286863 201705 181721 257540 285242 306161 351008 326289 240716 210516 228907 311707
13464 311707 363639 362785 370182 438703 453791 434734 380586 285997 271043 265655 300828 354278
13452 354278 335950 302573 339745 381570 410698 373810 316601 270054 222628 187712 237300
13441 237300 287519 310750 318506 371293 393071 352217 313554 292318 270590 299269 307262 294094
13429 294094 360072 440658 499380 503187 491830 510343 468142 406498 388320 330514 328709 427952
13417 427952 446301 431945 414136 409736 388211 370525 354097 367541 387055 396485 371111 341988
13405 341988 330224 272300 271318 306861 292702 261972 277992 347807 360274 295182 316002 371452
13393 371452 426976 425380 483864 498517 487936 514987 551772 558367 538248 529449 561563 563752
13381E63752j2958l7051j6572m9726j3686L2709O7147M9179Q4804N8400M0678
13370G66676L5730j0312m9228j4137J2811m321j4172r515L0493M5237M9529L2223
13358H71014L7348j1601r1968r0516J6443L1987m497n064K2177L3648K0910l6171
13346G93710k6046N6719k039J2064Q1595R9994J0792N1996Q1597R3306J16447
13335A370135J12686K3165L1722m6348p6038m2427q5533k7655O2004P0398K9233
13324A421342m0202q4009q4628o9123m9799m0040j02467j9462O217m3241l6022
13313H58566J6507J5963Q0188N3764K1165L8930O2987L9156P9561J10535N2788
13302A430110K9109K4176L0339K9465L3206j4463J5718N1044O423M2594O164j4014
$$ plain form
13381 563752 550794 513743 497171 447445 433759 466468 533615 582794 667598 725998 766676
13370 766676 802406 792094 742866 728729 741540 737219 723047 713532 744025 789262 838791 871014
13358 871014 908362 896761 804793 714277 730720 762707 758210 753146 775323 808971 829881 793710
13346 793710 767664 824383 822344 834408 916003 1015997 1026789 1078785 1160382 1253688 1370135
13335 1370135 1482821 1505986 1537708 1491360 1415322 1372895 1287362 1259707 1321711 1392109 1421342
13324 1421342 1381140 1297131 1212503 1143380 1093581 1053541 951074 931612 937829 894588 858566
13313 858566 875073 891036 971224 1024988 1046153 1085083 1148070 1187226 1266787 1377322 1430110
13302 1430110 1459219 1483395 1513734 1543199 1576405 1561942 1577660 1628704 1635127 1677721 1683885 1669871
13290A669871K7360O0358M1780J8737M3693O7689k4216l5024M6123M6766M2338
13279B005475O7992L8673J14353J27943P7443R8006J44384J78467J48493J54946
13269C156175J27102J72469K71465K84483K91400K49190K94735L44207L98129
13260E589355M27224N22275O12413O53651P16670Q83867J148786J360094J561149
13251A3475484J936163K386107K938935L597381M512334N728057P651497J0688444
13243E2914402J5497222K2349242L0199607L5137614L2877447K2292113N529891
13236B16797538j1837513k4514407l0197872k9688733k5286561j9523164j4105960
13229F1643328r911269o932782m915488l657632k887404k326406j867234j370538
$$ plain form
13290 1669871 1697231 1757589 1799369 1818106 1861799 1929488 1905272 1870248 1916371 1963137 2005475
13279 2005475 2073467 2112140 2226493 2354436 2431879 2529885 2674269 2852736 3001229 3156175
13269 3156175 3283277 3455746 3727211 4011694 4303094 4552284 4847019 5191226 5589355
13260 5589355 6016579 6538854 7151267 7804918 8521588 9405455 10554241 11914335 13475484
13251 13475484 15411647 17797754 20736689 24334070 28846404 34574461 42225958 52914402
13243 52914402 68411624 90760866 120960473 156098087 188975534 211267647 216797538
13236 216797538 204960025 180445618 150247746 120559013 95272452 75749288 61643328
13229 61643328 51732059 44799277 39883789 36226157 33338753 31012347 29145113 27774575
13221B7774575p48903o1133N32475J249077J847325K586928L511766M492155N729322
13212D6913587P355322R456685J2393718J6955230K4327368L5567326N0950215
13205B03919451O6030332P1822627O1975838L5661614L922l4152015n7094697
13198C48167072o5520745o1950838n1579978l9349297k8631395k0593287j4946116
13191F5595416j1007613q193339o153562m617649l395073k462307j683210r70237
13183B7112426l18600L42044R93706J574033K127655K701887L121724L558528
13175D1213403M521651O197415Q960622J3333626J9730511K7908606L4879400
13168A56745234L5776064K8032984J2322881o965622k3208448l2417021l4222621
$$ plain form
13221 27774575 27025672 26964539 27497014 28746091 30593416 33180344 36692110 41184265 46913587
13212 46913587 54268909 63725594 76119312 93074542 117401910 152969236 203919451
13205 203919451 269949783 341772410 403748248 439409862 439413784 405261769 348167072
13198 348167072 282646327 220695489 169115511 129766214 101134819 80541532 65595416
13191 65595416 54587803 46394464 40240902 35623253 32228180 29765873 28082663 27112426
13183 27112426 26793826 27135870 28129576 29703609 31831264 34533151 37654875 41213403
13175 41213403 45735054 51932469 60893091 74226717 93957228 121865834 156745234
13168 156745234 192521298 220554282 232877163 225911541 202703093 170286072 136063451
13161A36063451l0692445k4692351j8509499j3434973r848203p307373n546942
13154B6031665m191199l270769k481217j901139j523203j221015j008016q41378
13146I593729p55976o51249o16590o23453n99457m86781m39777m08909k76455
13137D735082k38788k26880j25170r4201p3643j01246j41861j41638j70581j87021
13127C234053k17633j68800j30480j27423p8396k8364n3799p5503o6181J9728
13117B307202J30569J54825J57690K10906J11554Q490n8212j44613k09727k49870
13107B418814k72929j99533j40262j68420q1869o3647p1108n8559m8917j1859
13097A301711r1719j01157p968j2753K2094K2483J2078K2286J7490j3651K0776
$$ plain form
13161 136063451 105371006 80678655 62169156 48734183 38885980 31578607 26031665
13154 26031665 21840466 18569697 16088480 14187341 12664138 11443123 10435107 9593729
13146 9593729 8837753 8186504 7569914 6946461 6347004 5860223 5420446 5011537 4735082
13137 4735082 4496294 4269414 4144244 4050043 3976400 3875154 3733293 3591655 3421074 3234053
13127 3234053 3016420 2847620 2717140 2589717 2511321 2482957 2429158 2353655 2287474 2307202
13117 2307202 2437771 2592596 2750286 2961192 3072746 3081236 3023024 2878411 2668684 2418814
13107 2418814 2145885 1946352 1806090 1637670 1555801 1492154 1421046 1362487 1313570 1301711
13097 1301711 1209992 1108835 1100867 1088114 1110208 1132691 1144769 1167055 1184545 1170894 1191670
13086A191670J8420N2171N1727J00347J58690K19374J95210J80159R7178K4419
13076B289365j28412k32866k31375j55330j58098k04638j45451j23573q1087k9125
13066G99410n4956p2556k7329M495K2749L4421l7966j6068k8826L7280J03573
13055G64227P4714j8548L0417K9057l3813O611K5378P4127J53751K42917K76518
13044A625356L25368K71890J04732q4073k31161l16997k67951j86228j80779j69308
13034H90849j22124p7675n0775o3107r7045J7352k664j4884K9569k5982L5915
13023E19429n1925K6271j773q4415L5467Q4337m620M2794Q257Q96j0444K1882
13011E86156J30544J54694K06051K16613J52239O1636l9137j27297j37911j11198
$$ plain form
13086 1191670 1210090 1262261 1313988 1414335 1573025 1792399 1987609 2167768 2264946 2289365
13076 2289365 2160953 1928087 1696712 1541382 1383284 1178646 1033195 909622 828535 799410
13066 799410 744454 671898 644569 649064 671813 706234 668268 652200 623374 660654 764227
13055 764227 838941 820393 850810 879867 846054 852665 878043 952170 1105921 1348838 1625356
13044 1625356 1950724 2222614 2327346 2243273 2012112 1695115 1427164 1240936 1060157 890849
13034 890849 768725 691050 640275 577168 480123 497475 494811 479927 509496 483514 519429
13023 519429 467504 493775 492002 407587 443054 527391 522771 565565 573822 574718 564274 586156
13011 586156 716700 871394 1077445 1294058 1446297 1507933 1468796 1341499 1203588 1092390
13001A092390n9261o4217o1772o2061R446N5753R4976Q9252J12107K59975K87445
12990A754033K39287K35311J41276O0581p8988j03324k47298k33284k22545k01173
12980A343876j58005k9310k3121k3397j1066k81P0719J16659J49475J82274J02308
12969A720131K2059N6102Q1282L6676K730L3589J48556J44338J14455O2990L5134
12958B458042m6352m1703n8922K9452m8481j17040j10299r0162k7334j04027j33952
12947A709222m5750n6378j06636m8902k8347m7260m3093L0434m162o6967J7923
12936A310084N6154N9982P6595Q4416K39032K55716J72452J37862N4511q6355
12926B360449j17358k03171k25400k17013j87672j73387j14235j08568m9342o1028
$$ plain form
13001 1092390 1033129 968912 907140 845079 854525 910278 1005254 1094506 1206613 1466588 1754033
12990 1754033 1993320 2228631 2369907 2430488 2351500 2248176 2000878 1767594 1545049 1343876
12980 1343876 1185871 1156561 1133440 1110043 1098977 1098696 1169415 1286074 1435549 1617823 1720131
12969 1720131 1742190 1798292 1879574 1916250 1918980 1952569 2101125 2245463 2359918 2422908 2458042
12958 2458042 2411690 2369987 2311065 2340517 2292036 2174996 2064697 1974535 1947201 1843174 1709222
12947 1709222 1663472 1607094 1500458 1451556 1423209 1375949 1332856 1363290 1359128 1292161 1310084
12936 1310084 1366238 1426220 1502815 1587231 1826263 2081979 2254431 2392293 2446804 2360449
12926 2360449 2243091 2039920 1814520 1597507 1409835 1236448 1122213 1013645 964303 903275
12916I03275l3371l6356o9722o9888m7801j0549k5089p3052k4273k2753l3830
12905D56591m2833j4409Q9433N0573L069p2841k4011K0415k9884l4954k6753l8098
12893C36298K6270K0394l2906K3077J3707K6177k4568N587q1118p1348M655O0084
12881C06309l6798n2347q126P661K9934l5037m0322O8521L2201p666j1127J2834
12869B66037N3653O4061k45L8875L7383n8369k0569l0165j8657J4606K8012k5681
12857C48941j9849L8189l5845l8723n0650j2518j4295j3115O6196M2577n093M8544
12845C54359K5779k9320O3116N5083J1138k9622L9542l1585j5941j8744J3127
12834D36932j069n1185Q620r437N36r102l8613K2530r41n887k1525m1498K6069
$$ plain form
12916 903275 869904 833548 763826 693938 646137 635588 610499 537447 513174 490421 456591
12905 456591 413758 399349 488782 539355 542424 469583 445572 465987 436103 401149 374396 336298
12893 336298 362568 382962 350056 373133 386840 413017 388449 394036 312918 241570 246225 306309
12881 306309 269511 217164 209038 216699 246633 211596 171274 239795 271996 264330 253203 266037
12869 266037 319690 383751 383506 422381 459764 401395 380826 350661 332004 346610 374622 348941
12857 348941 329092 367281 331436 292713 242063 229545 215250 202135 268331 310908 305815 354359
12845 354359 380138 350818 413934 469017 480155 450533 490075 458490 442549 423805 436932
12834 436932 435863 384678 393298 383861 384397 375295 336682 359212 358271 352384 330859 289361 315430
12821C15430k751L0685J8748L4718L9550m0060K4980K1177n7759N351M7371K4622
12809D62062k6329l2062m1074K0439L7632J4593o949k4079Q4858Q8753K9012L3297
12797F40153nK1162q518m7211q4688j4234M2176n610j3250L2945P6542R6009P8250
12784H13721J25025J02340J31511P0885J16344J74392Q3296j6292l0622o6608
12774A503992j02813m4119j23832j21186m1164m7427k435k2105o2841n4605L06
12763H81771l273m1061o5955J1314k726M5152L147j5507O8206R9492N3949L7698
12751A072207L4909J10119R6493P9034J46323K68845L45792K71669K43836J43563
12741B812790O461j67184k95598l37468k37673k02609j77796j56617j53431n6780
$$ plain form
12821 315430 312679 343364 362112 396830 436380 396320 421300 442477 384718 390069 437440 462062
12809 462062 435733 403671 362597 383036 420668 435261 428312 404233 489091 577844 606856 640153
12797 640153 640148 661310 652792 605581 520893 506659 548835 543225 529975 562920 639462 735471 813721
12784 813721 938746 1041086 1172597 1243482 1359826 1534218 1617514 1601222 1570600 1503992
12774 1503992 1401179 1357060 1233228 1112042 1070878 1023451 1021016 998911 936070 881465 881771
12763 881771 878498 837437 771482 782796 780070 825222 828369 812862 881068 980560 1034509 1072207
12751 1072207 1107116 1217235 1313728 1392762 1539085 1807930 2153722 2425391 2669227 2812790
12741 2812790 2819251 2652067 2356469 2019001 1781328 1578719 1400923 1244306 1090875 1034095
12731A034095m3837j04291m894J58m4657k857n4439N2606K6761Q852J5534k0686
12719H62345m8459k853L5121K1878N8845j9453L4345J08486J59986J53820J79492
12708A543553K05700J40463R404o3209r1622j81700j85048j07227p9481l6962
12698A153871q7551m9963l7271J3858K0655J4459j2288k5810K9131n448j7473
12687I96170K1865Q535m907L6739M2319K7376p109P247P3780L3350P1494N8814
12675A365673O3227Q8383P9964J07841R5268J0734K6689J01111O0634j6966o419
12664A976139M065N2923Q3965J3019K4833K9375k7207K9611L0100K0664Q0232
12653B317719J8581J403J9367K9333K4659l7644m87L4903N7696N4158J3134k8293
$$ plain form
12731 1034095 990258 885967 881073 881231 836574 833717 779278 831884 858645 867497 883031 862345
12719 862345 813886 811033 846154 868032 926877 907424 941769 1050255 1210241 1364061 1543553
12708 1543553 1749253 1889716 1899120 1835911 1744289 1562589 1377541 1270314 1190833 1153871
12698 1153871 1066320 1016357 979086 992944 1013599 1028058 1015770 989960 1019091 1013643 996170
12687 996170 1018035 1026570 1021663 1058402 1100721 1128097 1120988 1128235 1202015 1235365 1306859 1365673
12675 1365673 1428900 1517283 1597247 1705088 1800356 1811090 1837779 1938890 1999524 1982558 1976139
12664 1976139 1980204 2033127 2117092 2130111 2154944 2184319 2157112 2186723 2216823 2237487 2317719
12653 2317719 2336300 2337703 2357070 2386403 2411062 2373418 2372931 2407834 2465530 2519688 2532822 2504529
12641B504529J3155K385K9227j2291k6082m800J9944l0985k1207l5355m0632k6227
12629B371661k7914n542m5174J9204M6464n3432J1705L3047O8603M4371J9121
12618B482114Q3763K9780K7603L0646N3376N0986L5487K4187j3204P3817N5888
12607B934443L0259J477N7177P242N6244M5995O34j2646P8685N9790J08631Q6017
12595C453948L4814P6675J38773J61878J92726K14273K58940J04734P5806N5208
12585D767775N5600K6779O8482Q6039J08466J10562K67469K72392K84932L04278
12575F352774L03674L79201M02906L68206L93066M56670N48156O12418P01246
12566A0518317P88569Q27006Q85096R40854J153247J283335J412643J623977J879033
$$ plain form
12641 2504529 2517684 2520069 2549296 2537005 2510923 2506123 2526067 2495082 2473875 2438520 2397888 2371661
12629 2371661 2343747 2338205 2293031 2312235 2358699 2305267 2316972 2350019 2418622 2462993 2482114
12618 2482114 2565877 2595657 2623260 2653906 2707282 2758268 2793755 2817942 2804738 2878555 2934443
12607 2934443 2964702 2966179 3023356 3030598 3086842 3132837 3133471 3120825 3199510 3259300 3367931 3453948
12595 3453948 3488762 3565437 3704210 3866088 4058814 4273087 4532027 4636761 4712567 4767775
12585 4767775 4823375 4850154 4918636 5004675 5113141 5223703 5491172 5763564 6048496 6352774
12575 6352774 6656448 7035649 7438555 7806761 8199827 8656497 9204653 9817071 10518317
12566 10518317 11306886 12133892 13018988 13959842 15113089 16396424 17809067 19433044 21312077
12557B1312077K143896K502101K839874L335960L862903M447878N362788O594040
12549E2401517Q353430J0723007J4023954J8537141K4985680L3574611M3846200
12542B06445540N3566132N7269431M9118666K8685825K406784k1767006l8281225
12535C37444147m5284111m3850543l7199923k8651584k0272803j2772021o254179
12528A43158983o06762M405089Q820105J2674993J5525308J6972129J7114764
12521B18064609J6328079J5285814J4474723J4321849J5028665J6468198J7980452
12514C27952389J9220818J9374817J7997081J4625690R261375K682087m208638
12507D06905619j0315823j4955750j7756412j8781574j8303151j6935449j5160215
$$ plain form
12557 21312077 23455973 25958074 28797948 32133908 35996811 40444689 45807477 52401517
12549 52401517 60754947 71477954 85501908 104039049 129024729 162599340 206445540
12542 206445540 260011672 317281103 366399769 395085594 397492378 375725372 337444147
12535 337444147 292160036 248309493 211109570 182457986 162185183 149413162 143158983
12528 143158983 142552221 146957310 155777415 168452408 183977716 200949845 218064609
12521 218064609 234392688 249678502 264153225 278475074 293503739 309971937 327952389
12514 327952389 347173207 366548024 384545105 399170795 408432170 411114257 406905619
12507 406905619 396589796 381634046 363877634 345096060 326792909 309857460 294697245
12500B94697245j3643469j2522131j2066860j2351890j3065760j3646166j3749297
12493B03651672j3240107j1864505r623946o609145k814338J726400P279407J4268536
12485A82773974K3065897L3114093M3092366M9623946M7744710L3718807R578453
12478D22712246j7005037l8462656n0860140n3821969m9636542m1870809l3422542
12471A37632551k5684397j9494957j4548170j0619201p553551n257104l666549
12464E0808622k834762k822512l161462l579187l868181l895044l661416l236959
12456B3749099k759278k305810j923688j601508j301712j071889q34088o68362
12448A1282764o06884n86022m84533m38837l72121m42351l77041l29512l08071
$$ plain form
12500 294697245 281053776 268531645 256464785 244112895 231047135 217400969 203651672
12493 203651672 190411565 178547060 168923114 162313969 159499631 161226031 168505438 182773974
12485 182773974 205839871 238953964 282046330 331670276 379414986 413133793 422712246
12478 422712246 405707209 367244553 316384413 262562444 212925902 171055093 137632551
12471 137632551 111948154 92453197 77905027 67285826 59732275 54475171 50808622
12464 50808622 47973860 45151348 41989886 38410699 34542518 30647474 26986058 23749099
12456 23749099 20989821 18684011 16760323 15158815 13857103 12785214 11951126 11282764
12448 11282764 10675880 10089858 9605325 9166488 8794367 8352016 7974975 7645463 7337392
12439G337392k84745l21825l09397k29422k06046j76033k10786k77696k40854
12430E080588j29307q4742j38591j36223j79028j80513j90471j69780j0237l2665
12420C829031k2289q0578p3593j04523r8134q7305j67409j09819p2463m0610l6708
12409B935600k4735l8848n1713p4911k0290m0638J0572N7455L81r3133o2581n7342
12397B539817o7989p4565n6840k3489n0277n4598m2519j5768M2037k5299r1799
12386B078711o1478k5426k5348Q653J8351L1808L2113L8422J3669L2438M1523
12375B183436L6225l9619l3376L3641L9057J70N0316L4242N9192M032l583P122
12363B370855m6803j37696l8945m2078j03422q0098o3371j11272l8672K0696q016
$$ plain form
12439 7337392 7052647 6730822 6421425 6192003 5985957 5809924 5599138 5321442 5080588
12430 5080588 4951281 4866539 4727948 4591725 4412697 4232184 4041713 3871933 3861696 3829031
12420 3829031 3806742 3726164 3652571 3548048 3449914 3362609 3195200 3085381 3012918 2972308 2935600
12409 2935600 2910865 2872017 2820304 2745393 2725103 2684465 2695037 2752492 2752873 2659740 2597159 2539817
12397 2539817 2471828 2397263 2340423 2316934 2266657 2212059 2169540 2153772 2195809 2170510 2078711
12386 2078711 2017233 1991807 1966459 1975112 1993463 2025271 2057384 2095806 2109475 2141913 2183436
12375 2183436 2219661 2180042 2146666 2180307 2219364 2219534 2269850 2304092 2363284 2367316 2363733 2370855
12363 2370855 2324052 2186356 2147411 2105333 2001911 1921813 1858442 1747170 1708498 1729194 1721178
12352A721178j9146l2801r3498l5051K7526l3542k3691N0114L2757M1539L9415
12341A674800J5596m1797k574Q7250N7618L0375N2952J0244M0139Q2373J80035
12330B187011K07491K33749N06646Q79452J280499J370989J036784K90248n01527
12321G491342j026278j175721j119129q89568o53119m05994k89513k31692j42183
12312A558145m8604l7088k9615J337n188K0593o4583p1545m9222N230j2779m4412
12300A222269L1655r75m2512N4502J03573J01126Q8710Q5429Q1423Q7862P2669
12289A885731Q9244K08795L09271N13358Q17707J391981K128984K748125K297984
12280A2391180J106004k2528j061380j811252k103218j958369j614771j219718
$$ plain form
12352 1721178 1702032 1669231 1575733 1540682 1568208 1534666 1510975 1561089 1593846 1635385 1674800
12341 1674800 1690396 1648599 1646025 1733275 1790893 1821268 1874220 1884464 1924603 2006976 2187011
12330 2187011 2394502 2628251 3134897 4014349 5294848 6665837 7702621 7992869 7491342
12321 7491342 6465064 5289343 4170214 3280646 2627527 2221533 1932020 1700328 1558145
12312 1558145 1509541 1472453 1442838 1444175 1438987 1459580 1394997 1323452 1274230 1279460 1266681 1222269
12300 1222269 1253924 1252949 1210437 1264939 1368512 1469638 1558348 1643777 1725200 1813062 1885731
12289 1885731 1974975 2183770 2493041 3006399 3824106 5216087 7345071 10093196 12391180
12280 12391180 13497184 13474656 12413276 10602024 8498806 6540437 4925666 3705948
12272C705948q67213o06062m05941k49475j70640j14177k7883q2458m3974o4516
12262A073609r0616n5819j31808p7859n8404M202L9125k7036m7483k0651Q5501
12251F92761M9228K9783O9247P0481M9461R5815R4675J61825K31092L04915M50345
12240B299628P26872J208621J658974J535693P71135j71988r00592j368747j401567
12231D358029j099406q24219o22310m13920l03164k30699j94207j09286l6034
12222E24784n3437l8178J6513K1426k4685o6686n0081k3678l7522q784m21j3550
12210B45701N7989M6152j9049k1065l9198l9245P2374R00j18m2587k6159j4873
12198B20822j0371J7734K0315J3751l3507l7081L6901p33o9137k4239n87J8394
$$ plain form
12272 3705948 2838735 2232673 1826732 1577257 1406617 1292440 1264557 1182099 1138125 1073609
12262 1073609 982993 927174 795366 717507 659103 663305 702430 675394 627911 607260 692761
12251 692761 741989 771772 841019 911500 960961 1056776 1151451 1313276 1544368 1849283 2299628
12240 2299628 3026500 4235121 5894095 7429788 8200923 8028935 7128343 5759596 4358029
12231 4358029 3258623 2434404 1812094 1398174 1095010 864311 670104 560818 524784
12222 524784 471347 433169 449682 471108 446423 379737 329656 305978 268456 259672 259251 245701
12210 245701 303690 349842 330793 309728 270530 231285 303659 304559 304441 261854 235695 220822
12198 220822 210451 228185 248500 262251 228744 191663 228564 227831 158694 134455 133868 152262
12186A52262j0485j3612M482n2108o457N2140N332M9061J7150J1186J4665J3905
12174B37521m2594l0764O4465K5771K3739m8471p6960j874m994J0440p682J8728
12162A67325K9101J9335K2473m1910n7305J2479K7744j4485L704j7224r095j5894
12150A26248K9954J6395k4946l1856L214j4537j0451J5991O045R402Q146J5837
12138A49442J997P7502K3002l7664n4463r657j5088j9012j3150J1604J6536m0654
12126I0395K4727j0206k4503M8714o879J570J7719l8179N827M9905q850K5182
12114A75422O5044L246k4490l6074l6975p624p865J7814K6644J8222N7203k1213
12102B29354L1103L2502N5337r110q886K971j9762J8134P1786M2686J18768J23843
$$ plain form
12186 152262 141777 128165 132647 80539 74082 126222 131554 180615 197765 208951 223616 237521
12174 237521 194927 164163 228628 254399 278138 229667 152707 150833 145839 156279 148597 167325
12162 167325 196426 215761 238234 196324 139019 151498 179242 164757 168461 151237 142142 126248
12150 126248 156202 172597 147651 115795 119009 104472 94021 110012 116057 125459 133605 149442
12138 149442 151439 228941 251943 214279 159816 150159 135071 116059 102909 114513 131049 90395
12126 90395 115122 104916 80413 129127 122248 123818 141537 103358 109185 159090 150240 175422
12114 175422 240466 243712 219222 183148 146173 138549 130684 148498 175142 193364 250567 229354
12102 229354 260457 292959 348296 339186 330300 333271 313509 331643 403429 446115 564883 688726
12090F88726O1687J07108J96746K64751K41504K06194J34018R6219J023j18042
12080A879934j78134j22318j42766j43370j39885o9920p4418q4217l1500K4012
12070I17418O8978N5507R6886J03165R4125K6055O9797Q5836J12419R2428L6708
12059A759322O8771J00464N3151Q2003O3659j015L3733l2146k7640M0268p5831
12048B064739j41079p3118m8983j31962j02084l2196m1708m3575j03966j12500
12038A233568p1077q5403q6048q0873m0780K3871L1569O7034Q3326J02892K04786
12027A382865K36149K07957J83217J83865L0799o9999j82022k29412k49521k49003
12017A244895k05842j59137j24230r6332p4799m9411k7510m5781o2772o2133J5573
$$ plain form
12090 688726 750413 857521 1054267 1319018 1560522 1766716 1900734 1996953 1997976 1879934
12080 1879934 1701800 1579482 1436716 1293346 1153461 1083541 1009123 924906 893406 917418
12070 917418 986396 1041903 1138789 1241954 1336079 1362134 1431931 1517767 1630186 1722614 1759322
12059 1759322 1828093 1928557 1981708 2063711 2127370 2126355 2160088 2127942 2100302 2140570 2064739
12048 2064739 1923660 1850542 1801559 1669597 1567513 1535317 1493609 1450034 1346068 1233568
12038 1233568 1162491 1077088 991040 910167 869387 893258 924827 991861 1075187 1178079 1382865
12027 1382865 1619014 1826971 2010188 2194053 2224852 2154853 1972831 1743419 1493898 1244895
12017 1244895 1039053 879916 755686 659354 584555 535144 507634 461853 399081 336948 352521
12006C52521k1912K1807j1356n3059k3583k7080j5447j3165m221l1388k9879j3250
11994A29988N182J8552J0000m292n406K2955K0083m4350J5363r282k5693l2835
11982A00265J9885k7897o888M3470J2289l8010o1593L4107M6965K8929M056R260
11970A64838m8022J2255n468m945O662n976n508M1688o055r357o946K853l6501
11957I9518q2485m4035O5407K9151M1347M6475l490m0007J3624J5209M8536m2775
11945A46475k4854j9709J2654K9249L0461k9396J774J00R157P213n4307j9559
11933H9258j3218k1784J2760L6209K1268m1713m9393K0146L9462j2976K0535J6869
11921A17423o6276n9376j5157K6128m79q123K9004L2121m36l771J180p671K4981
$$ plain form
12006 352521 330609 352416 341060 288001 264418 237338 221891 208726 204505 173117 143238 129988
11994 129988 135170 153722 163722 159430 154024 176979 197062 152712 168075 158793 133100 100265
11982 100265 120150 92253 85365 128835 141124 103114 41521 75628 122593 151522 155578 164838
11970 164838 116816 129071 123603 118658 125320 119344 113836 155524 149469 140112 133166 136019 99518
11957 99518 17033 -27002 38405 67556 108903 155378 151888 111881 125505 140714 189250 146475
11945 146475 121621 101912 114566 143815 174276 144880 146654 146754 155911 163124 108817 89258
11933 89258 76040 54256 67016 103225 124493 82780 33387 53533 92995 80019 100554 117423
11921 117423 51147 -8229 -23386 2742 2263 -5860 23144 55265 54829 51058 52238 44567 69548
11908F9548m9732o6908l4686L0924N4241M9082N8341N1520r147k3656p617o2893
11896E9017n7992N587j5271k9635L8066M9123p815L5321k4226J0799K5930J651
11884I0555M0125k0936l7833j7766k4023J4817q263K0263L2340k2127j4954P264
11872E9462L0044k0392J2837k4618q196L393m220P0102k1530m531p164l4918r683
11859D0586r918m969L9381k8837O871L3486k1883k9383R201N0012P4029l6186
11847A22390R620M1998Q5856p309m3430k6239m95k4822k8606l5967k3250J1437
11835H1183L2491q8793m5294J3203M4435L3955J782j399K2271P892J1907j602
11823A12031o642j372k2587K4403J6688J9166J0423M489p873n6312p9178o0628
$$ plain form
11908 69548 19816 -47092 -81778 -50854 3387 52469 110810 162330 153183 129527 121910 59017
11896 59017 1025 6612 -8659 -38294 -228 48895 41080 76401 52175 62974 88904 90555
11884 90555 130680 109744 71911 54145 30122 44939 36676 56939 89279 67152 52198 59462
11872 59462 89506 69114 81951 57333 49137 52530 48310 118412 96882 92351 85187 50269 40586
11859 40586 30668 25699 65080 36243 43114 76600 54717 25334 34535 84547 158576 122390
11847 122390 132010 174008 259864 252555 209125 182886 182391 157569 128963 92996 69746 81183
11835 81183 113674 24881 -20413 -7210 37225 71180 72962 71563 93834 101726 113633 112031
11823 112031 105389 104017 81430 105833 122521 141687 152110 156599 148726 92414 13236 -47392
11811d7392N3173J0878M0623K3105l9091L1255O5827L5291j3587R279L3363P442
11799B10166m4108p651J7843k8264l1364o1476l9511N996M2073m7607L704M8711
11787F8512J1922N375P3776l2908m4275k0912m9713l9842N7353P002K5808J519
11775F3617J8992m0308K2225N8969J7889Q442M388j6096n4223J7064j5831j2733
11763G2395N493M7998K1770n423j865n1893j6804J5041J9123R207K7720P115R383
11750A59260M8954o2676j2582m0590m4669k4374P044K3698J2575K0909k411n4828
11738C0310L372P724L1817O6205k2427m7896M1392Q1992r50n8236j2544Q222J220
11725A30201p7481M2137k3938K072j2322k8575k0N9591L1167k6156l3649q9160
$$ plain form
11811 -47392 5781 16659 57282 80387 41296 72551 138378 173669 160082 169361 202724 210166
11799 210166 166058 158407 176250 147986 116622 55146 15635 21631 63704 16097 19801 68512
11787 68512 80434 85809 159585 126677 82402 61490 11777 -28065 29288 36290 62098 63617
11775 63617 82609 42301 64526 123495 141384 149826 154214 138118 83895 100959 85128 72395
11763 72395 77888 125886 147656 142233 140368 88475 71671 86712 105835 115042 142762 149877 159260
11750 159260 208214 145538 132956 92366 47697 23323 30367 54065 66640 87549 85138 30310
11738 30310 33682 41406 73223 139428 117001 69105 110497 192489 191539 133303 120759 128981 130201
11725 130201 52720 94857 70919 72991 60669 32094 32074 91665 122832 96676 63027 -26133
11713b6133K2147M9196M2223r870J1690l8672k5380M4811O6528o386r4392n9156
11701b3394l8409K6280j690M0960P453P2985j0659R887K6074o800m1627n141l1208
11688B4711m098K2284K2388p586l540n5956K5866O0547L3257J9897J0360n1097
11676I7033m6452J9875k4133L8516K5428L7324l3997j5711L5918k18l117J3382
11664A43848L209N2544J216R983k5550p9499N079k4881k7885J355r641J3714J2355
11651G5847L5537l7881k1900K2914J2631o8085n2970L2263N5216L9592J9562N09
11639A13235R8384K9388r856l6173l4138J8276p2719l3668k1268K3799K0484L2047
11627A27791J1507N4397m4940K2282J5706m787j4238k8776j1613k9027p170K583
$$ plain form
11713 -26133 -3986 45210 87433 77563 89253 50581 25201 70012 136540 130154 35762 -23394
11701 -23394 -61803 -35523 -37213 3747 11200 84185 73526 83413 109487 102687 61060 55919 24711
11688 24711 20613 42897 65285 57699 54159 -1797 24069 84616 117873 137770 148130 97033
11676 97033 50581 70456 46323 84839 110267 147591 113594 97883 133801 133583 130466 143848
11664 143848 147057 199601 200817 210800 185250 105751 110830 85949 58064 59419 49778 63492 75847
11651 75847 111384 73503 51603 74517 87148 19063 -33907 -1644 53572 93164 112726 113235
11639 113235 211619 241007 231151 194978 160840 179116 106397 72729 51461 75260 95744 127791
11627 127791 139298 193695 148755 171037 186743 181956 167718 138942 127329 98302 91132 93715
11615I3715k4558l0384P2994M409j1409l0673J1542O0917P3461L113j8516q934
11603A95677M9794M6423P9230J16720J28518J65486J62315J81953J32732J00852
11593A359700M5365j27504j73553j41067j91172k21446j10739l4585j1582k7039
11583C66378o4698m9930m6066n258L9809L1737k0323L3355P665J3478j3811k5448
11571B66888L0086J03640O6531K9231O4817L4519R6083J85056K89047L24857L93194
11560A883949M05287J74051j914j79975k76851l35628l60842l25533k03976j51883
11550F26685n3173m8321p8647n4195n2814m8408k7084P814O149j0861j0264L5973
11538B92854r073m5007k3339K5538J8827M6473K5016M1126L0082N1506M8816R2057
$$ plain form
11615 93715 69157 38773 111767 116176 104767 74094 85636 146553 220014 223127 204611 195677
11603 195677 245471 291894 371124 487844 616362 781848 944163 1126116 1258848 1359700
11593 1359700 1405065 1277561 1104008 962941 771769 550323 439584 404999 393417 366378
11583 366378 301680 251750 205684 200426 240235 271972 251649 285004 292669 306147 292336 266888
11571 266888 296974 400614 467145 496376 561193 595712 691795 876851 1165898 1490755 1883949
11560 1883949 2289236 2463287 2461373 2281398 2004547 1668919 1308077 982544 778568 626685
11550 626685 573512 525191 446544 392349 339535 291127 264043 271857 278006 267145 256881 292854
11538 292854 283781 238774 215435 240973 259800 306273 331289 372415 402497 454003 502819 594876
11526E94876J59051J90476J90089J54913j4514j24455j78930j82312j51741j25903
11516E11550j08994o6185k7020k9684n8185K577K5481O2694J9978m1372o6468
11505B24372j2552l8875l5426K3220L1156Q2066r250j9269K1194j7736n9957Q159
11493A97102k6679l5269L4035R494N409l0494m924J0722K1866K5240J02272M7111
11481C55885j753m3895j28317j4524O320L8204L4221K82k4297L0659J5385n787
11469B62383j8635j273n4846l3966Q064k366J5116K8771J5027n7933J2397L8447
11457B11186L8557l647K8399m204l5551l4852k7960j4919M3747L0265j2776J3529
11445B31774L5346J4137L8341M3353n1800m4450K82L7327M6551K2192n235j3427
$$ plain form
11526 594876 753927 944403 1134492 1289405 1274891 1150436 971506 789194 637453 511550
11516 511550 402556 336371 309351 279667 221482 224059 249540 312234 332212 290840 224372
11505 224372 211820 172945 137519 160739 191895 273961 264711 245442 266636 248900 188943 197102
11493 197102 170423 135154 169189 178683 184092 153598 148674 159396 181262 206502 308774 355885
11481 355885 354132 310237 181920 167396 173716 211920 246141 246423 222126 252785 268170 262383
11469 262383 243748 242475 187629 153663 161727 159361 174477 203248 218275 160342 172739 211186
11457 211186 249743 246096 274495 270291 234740 199888 171928 157009 200756 231021 218245 231774
11445 231774 267120 281257 319598 362951 311151 266701 266983 304310 350861 373053 367818 354391
11433C54391n2810p9796J6908L330L0881O618K0528J839L6376j6045l8954j5315
11421B67951N3725L0239p170M4059m2808K6852M1512J0036M1385n5203j02070
11410C08508m1902q620k007M3496M7240K9411P0054P2691j1734L3146m0456l4284
11398D65543q769p1394m4803K2389l2065k1091m681l7776L5395J3720K5516L4403
11386C76387K4173m5566l6074J8944K9248O461o6216j1267N3250Q1263N8520o1766
11374D27357k8925M580J1412l7837L2846N6864O7454O3914Q0458l8218r1709l0287
11362E17909J2597p547J6683k4486L0333j1353o5297j5518K1323R409l4567p1323
11350C78163j5045j8160J0610n705O752M1138L9740P082l9004k1362K8666L3621
$$ plain form
11433 354391 301581 221785 238693 242023 272904 279522 300050 301889 338265 322220 283266 267951
11421 267951 321676 351915 344745 388804 345996 372848 414360 424396 465781 410578 308508
11410 308508 266606 257986 255979 299475 346715 376126 446180 518871 507137 540283 499827 465543
11398 465543 456774 385380 340577 362966 330901 309810 305129 267353 302748 316468 341984 376387
11386 376387 400560 354994 318920 337864 367112 373573 307357 296090 349340 430603 489123 427357
11374 427357 398432 403012 414424 376587 409433 466297 533751 597665 678123 639905 548196 517909
11362 517909 530506 522959 539642 515156 545489 534136 468839 453321 474644 484053 449486 378163
11350 378163 363118 344958 355568 349863 356615 397753 437493 444575 405571 384209 412875 446496
11338D46496P399o2996l804L5468Q1567N1869L6182N3828o647k5809k9973L2925
11326F16505K2602m4527L482P419J7478J2676o6675r520J2594O0225Q0038L6264
11314G48561K7476N3472P8504P2852L0096j2828m6372J9649Q905r1240o8503L948
11302H24520O2409J4806N0961M6933q263o2530q3487o1407k5164J4633M3479J9814
11290H36704K8374M7599O490o497K8669N679j3597m2871O3671M4826M1925Q0251
11278A121223J47463J29874N7829Q2990P0196K3787J2275K7489l5425n2253k5675
11267A559773L1946J2957M280K9032l5737n7318q4707o9887l4719l3896m3464
11256A278260l2212l6804K8779L6038J4119O1842P4899J18039L1104J30816J88964
$$ plain form
11338 446496 453895 390899 387095 422563 504130 555999 592181 646009 639362 613553 583580 616505
11326 616505 639107 594580 598062 605481 622959 635635 568960 559440 572034 632259 712297 748561
11314 748561 776037 829509 908013 980865 1010961 998133 951761 971410 980315 889075 820572 824520
11302 824520 886929 901735 952696 999629 991366 928836 845349 783942 758778 773411 816890 836704
11290 836704 865078 912677 919167 912670 941339 947018 933421 890550 954221 999047 1040972 1121223
11278 1121223 1268686 1398560 1456389 1539379 1609575 1633362 1645637 1673126 1637701 1585448 1559773
11267 1559773 1591719 1604676 1608956 1637988 1602251 1544933 1460226 1390339 1355620 1321724 1278260
11256 1278260 1246048 1209244 1238023 1274061 1288180 1350022 1424921 1542960 1574064 1704880 1893844
11245A893844J84415K24726K17647K31571K10486K09405K30956J40788N6585j07066
11235C493357j41766o5194m8970r3443o1371K404l3489j9124L5863J16048J45178
11224C329493J54897J34745J54752J76299J04788M6714l0125m4758Q2752R7595
11214D207152J24059J43373J94687K88703K36900L19999K93523K14986K20246
11205F243628K65240K68785L14408L49758L55389M70022N31888O56196Q62256
11196A0317570J046606J200022J467296J593217J705846J875727K195411K575498
11188B3977193L179674L944430N079224O806714R527653J3869690K0718609L0325140
11180A17428327M0608986M3879013L2635976J0210441j2820872k9181677l6461371
$$ plain form
11245 1893844 2078259 2302985 2520632 2752203 2962689 3172094 3403050 3543838 3600423 3493357
11235 3493357 3351591 3286397 3237427 3143984 3082613 3085017 3051528 3032404 3068267 3184315 3329493
11224 3329493 3484390 3619135 3773887 3950186 4054974 4101688 4071563 4026805 4109557 4207152
11214 4207152 4331211 4474584 4669271 4957974 5194874 5514873 5808396 6023382 6243628
11205 6243628 6508868 6777653 7092061 7441819 7797208 8267230 8799118 9455314 10317570
11196 10317570 11364176 12564198 14031494 15624711 17330557 19206284 21401695 23977193
11188 23977193 27156867 31101297 36180521 42987235 52514888 66384578 87103187 117428327
11180 117428327 158037313 201916326 234552302 244762743 231941871 202760194 166298823
11173A66298823l5519964k9283884k1735670j5256299j0432397o941779m660842
11166D2467988l413857k610811k082469j624234j101022n23822J37447Q31837
11158C2081057J487864J912231K282041K720424L355679M256487N534320P268984
11150F0899087R891226J3881843K0256891L0602497M6424418O6496807Q1645826
11143C30098595P7914150M8545374L471656l7872119o4052261p2572148o6943061
11136B18590186n3640307l9432707k7992536j9763590j3849631r736695o875308
11129D7299412m827874l395613k571269k058070j676344j316400q21018k01570
11121C0431254M45857J004019J412932J554188J769083K197976L045128M471958
$$ plain form
11173 166298823 130778859 101494975 79759305 64503006 54070609 47128830 42467988
11166 42467988 39054131 36443320 34360851 32736617 31635595 31111773 31249220 32081057
11158 32081057 33568921 35481152 37763193 40483617 43839296 48095783 53630103 60899087
11150 60899087 70790313 84672156 104929047 135531544 181955962 248452769 330098595
11143 330098595 408012745 456558119 460029775 422157656 358105395 285533247 218590186
11136 218590186 164949879 125517172 97524636 77761046 63911415 54174720 47299412
11129 47299412 42471538 39075925 36504656 34446586 32770242 31453842 30632824 30431254
11121 30431254 30877111 31881130 33294062 34848250 36617333 38815309 41860437 46332395
11113D6332395O771634J0336175J5578642K3366551L2814003L9284668L4567550
11106B09051618J6970160n277130k3380531l3378260l5161431l0821171k3906484
11099G4096771j7429497j2410643q878962o314330m559635l352626k497941j898823
11091A6754314j592575j423474j312479j256483j190593j003141q40421p21491
11083G413657m92252l47051k68268j54345j31450j76136k82390l19463l67380
11074D874922l52969l03871k87914j86859j58186j17245j11124j09130r3954p2258
11064C081412q1179j12584j22098r3901K7232K0809m9171p8426l6802J2414J1594
11053B579300J9467P5258J49363J54201J96490J38057L9274R896Q6988M7423O250
$$ plain form
11113 46332395 53104029 63440204 79018846 102385397 135199400 174484068 209051618
11106 209051618 226021778 220744648 197364117 163985857 128824426 98003255 74096771
11099 74096771 56667274 44256631 35377669 29063339 24503704 21151078 18653137 16754314
11091 16754314 15161739 13738265 12425786 11169303 9978710 8975569 8135148 7413657
11083 7413657 6921405 6574354 6306086 6151741 6020291 5844155 5561765 5242302 4874922
11074 4874922 4521953 4218082 3930168 3743309 3585123 3467878 3356754 3247624 3153670 3081412
11064 3081412 3000233 2887649 2765551 2671650 2698882 2719691 2670520 2592094 2555292 2567706 2579300
11053 2579300 2598767 2674025 2823388 2977589 3174079 3312136 3351410 3361306 3448294 3495717 3501967
11042C501967o6818j62507k92099k77985k17580j72341k13446j23189r0665j9090
11032A866247j1767P188l6436J4971M4492k8757q995k6719M0098M6890k1615M2933
11020A928530j0467R0469P4349J44124J94639L28352L68393L07577J32481q2735
11010C475712k67359k44054k22826k05769j48700q1740j27316j59483j40249j24862
11000A753354o4948m7876m0011K972m2357l5741L8467P0253K0338m1349o1902
10989A551200k6861n6566l0017N1019o323j0755J13588J14990O4180R3510J71145
10978B029110K17637K27975J34116L471j64418j92477j92335j38429m6927l9729
10968A837994m8684Q6995P5573M5442N0395J18137L6270O3486J83438K07006J74555
$$ plain form
11042 3501967 3435149 3272642 2980543 2702558 2484978 2312637 2099191 1976002 1885337 1866247
11032 1866247 1854480 1861668 1825232 1840203 1884695 1855938 1846943 1820224 1860322 1907212 1885597 1928530
11020 1928530 1918063 2008532 2082881 2227005 2421644 2749996 3118389 3425966 3558447 3475712
11010 3475712 3208353 2964299 2741473 2535704 2387004 2305264 2177948 2018465 1878216 1753354
11000 1753354 1688406 1640530 1600519 1603491 1561134 1525393 1563860 1634113 1654451 1613102 1551200
10989 1551200 1524339 1467773 1437756 1488775 1482452 1471697 1585285 1700275 1764455 1857965 2029110
10978 2029110 2246747 2474722 2608838 2612309 2447891 2255414 2063079 1924650 1877723 1837994
10968 1837994 1789310 1876305 1951878 1997320 2047715 2165852 2202122 2265608 2449046 2656052 2830607
10957B830607K64858N10753P83901J107262J551465J692725J285979L56988n85392
10948I799146j119403j261024j248425r19456n93733l98669k54121j69598j06853
10939C727864m986M4834N2122J2939J8666M7563q077m6599l0633j00551n4654
10928C658488R302R185Q1297J31741J27399J31354J01265R2748J1524j7535M1658
10917D378426P6826J37315K82411M30581O71037J019930J401398J787176K072600
10908A2257700K232028J676852L06427r94982j910097k236641k107392j633068
10900G590827j094189o86580m77201k97430j74985p007P853k0099l5787p6193
10890D729209r1932j24006n2440p689m5970m6092K6847N7381R7365N6503N0401
$$ plain form
10957 2830607 3095465 3606218 4390119 5497381 7048846 8741571 10027550 10384538 9799146
10948 9799146 8679743 7418719 6170294 5250838 4657105 4258436 4004315 3834717 3727864
10939 3727864 3722878 3767712 3819834 3832773 3851439 3899002 3890925 3844326 3813693 3713142 3658488
10928 3658488 3667790 3676975 3758272 3890013 4017412 4148766 4250031 4342779 4354303 4336768 4378426
10917 4378426 4455252 4592567 4874978 5305559 5976596 6996526 8397924 10185100 12257700
10908 12257700 14489728 16166580 16473007 15478025 13567928 11331287 9223895 7590827
10900 7590827 6496638 5810058 5332857 5035427 4860442 4853435 4861288 4841189 4805402 4729209
10890 4729209 4637277 4513271 4460831 4453142 4407172 4361080 4387927 4445308 4542673 4599176 4649577
10879D649577P1819J11098J46308J22053J39926R8887K11254K64005K76834L07432
10869F399193M15032N66889Q74317J304128J644200J445566Q16650R878n91321
10860A2884532r04052q89967n85223l53423j44040M7611K38602L49395L90785
10851A1034220N09983O18400O59089P27420Q23723R07353R60407J111839J273782
10842A8626216J393673J604793J807614K088476K381140K815036L176481L590254
10834C7483683M142237M863850N737117O800153Q237583J0075075J2517665J5684585
10826A05541948J9576455K4547760L0347791L6205024M0261439L9770800L2809314
10819C29060531J9786512L654458j1694972k3375578k9788747l1203355k8678706
$$ plain form
10879 4649577 4721396 4832494 4978802 5100855 5240781 5339668 5550922 5814927 6091761 6399193
10869 6399193 6814225 7381114 8255431 9559559 11203759 12649325 13465975 13475853 12884532
10860 12884532 11980480 11090513 10505290 10151867 10007827 10055438 10294040 10643435 11034220
10851 11034220 11544203 12162603 12821692 13549112 14372835 15280188 16240595 17352434 18626216
10842 18626216 20019889 21624682 23432296 25520772 27901912 30716948 33893429 37483683
10834 37483683 41625920 46489770 52226887 59027040 67264623 77339698 89857363 105541948
10826 105541948 125118403 149666163 180013954 216218978 256480417 296251217 329060531
10819 329060531 348847043 352501501 340806529 317430951 287642204 256438849 227760143
10812B27760143k4034896j8391953j2588614o917988j440458L773434Q459639
10805A76619307J2384739J4990668J5711599J4216297J0812008O472468K548067
10798B53755153M05429Q67703M048827R129603J5154421K0923536K4771996K4971288
10790C54027956K0333856J1412511J15380j0924407j9209576k3454945k3501595
10783C08799180k0265807j4969755r487609n272861l430150m049964o510205r930335
10775B34882494j2956742j4754865j4883532j3462481j0776252p256444l143279
10768A57648899J360898O106097J1124802J6386926K1496688K5593145K7496137
10761B67213592K5317544J8032954O351532p243856j9580955k8182409l2425420
$$ plain form
10812 227760143 203725247 185333294 172744680 165826692 164386234 168159668 176619307
10805 176619307 189004046 203994714 219706313 233922610 244734618 251207086 253755153
10798 253755153 254160582 255028285 259077112 268206715 283361136 304284672 329056668 354027956
10790 354027956 374361812 385774323 385889703 374965296 355755720 332300775 308799180
10783 308799180 288533373 273563618 264076009 258803148 255372998 251323034 244812829 234882494
10775 234882494 221925752 207170887 192287355 178824874 168048622 160792178 157648899
10768 157648899 159009797 165115894 176240696 192627622 214124310 239717455 267213592
10761 267213592 292531136 310564090 316915622 309671766 290090811 261908402 229482982
10754B29482982l2612160l0136290k6235438k2035452j8177770j4802922j1947601
10747G3535349r674144p876273o437532n347636m501092l816798l296147k915056
10739B9670671k519467k240231j968078j721404j462709j289938j100732r25360
10731A6442752q18397p92381o60235o13120n75694n25500m48422k97136k44747
10722A1467120q0358M1680P0094k3788j74582l64175m51970n58580o24176o00450
10712H700815n76121m86588l77900k91886k88266k31365j64884j50819j18483
10703F014503q0868m770n8921k5465m9788j3435J2216N7557K8766L8294R3433
10692F011522J05814K7505n1667j6541m2158m4329j0346j8728m2621l0929j19901
$$ plain form
10754 229482982 196870822 166734532 140499094 118463642 100285872 85482950 73535349
10747 73535349 63861205 55984932 49547400 44199764 39698672 35881874 32585727 29670671
10739 29670671 27151204 24910973 22942895 21221491 19758782 18468844 17368112 16442752
10731 16442752 15624355 14831974 14171739 13558619 12982925 12457425 12009003 11711867 11467120
10722 11467120 11386762 11428442 11498536 11474748 11300166 10935991 10484021 9925441 9301265 8700815
10712 8700815 8124694 7638106 7260206 6968320 6680054 6448689 6283805 6132986 6014503
10703 6014503 5933635 5928865 5869944 5844479 5794691 5781256 5793472 5851029 5879795 5918089 6011522
10692 6011522 6117336 6144841 6093174 6076633 6034475 5990146 5979800 5961072 5918451 5887522 5767621
10681E767621j96491k55723k60741j85100j51199j17858o1347k9044k1379n5543
10671D433196n6340o7139Q540n960J3810J03579K62677M07808M62419L26089P0638
10660E959317j48850k81250l06650l86701l33809k41433k12752j77201p1547p7013
10650C722111n2352n4643r1817m9486N402N269q7381K614O4883o373p8011p5668
10638C304548k6057n883R0495J79880K04986J82101J28762J64113J41004J37378
10628D501327N7329o2209j59488j53220j84221k61536k65260k04557j81264j11270
10618B975631J4955O2092J57285K52020K78542L08887L74182N10451O78717R47668
10608F560430J135133J350909J500056J428025R84571L77088j09154n94181r21988
$$ plain form
10681 5767621 5571130 5315407 5054666 4869566 4718367 4600509 4539162 4510118 4488739 4433196
10671 4433196 4376856 4309717 4318257 4312297 4326107 4429686 4692363 5100171 5562590 5888679 5959317
10660 5959317 5810467 5529217 5222567 4835866 4502057 4260624 4047872 3870671 3799124 3722111
10650 3722111 3669759 3615116 3523299 3473813 3479215 3484484 3397103 3399717 3464600 3458227 3380216 3304548
10638 3304548 3278491 3272608 3363103 3542983 3747969 3930070 4058832 4222945 4363949 4501327
10628 4501327 4558656 4496447 4336959 4183739 3999518 3737982 3472722 3268165 3086901 2975631
10618 2975631 2990586 3052678 3209963 3461983 3740525 4049412 4423594 4934045 5612762 6560430
10608 6560430 7695563 9046472 10546528 11974553 12959124 13336212 13227058 12632877 11710889
10599A1710889j068556r74075p81278m68739j84873j01120n2142l6765O1856K75940
10589H381137L45244L93005M24121K90996P1781m4410j01907n3172R8301K53828
10579A0058924N22960O34655Q10747R67697R00121O66426K33094k03010o09493
10570A3982121q57399q71256q79219o53172m66853l05164j25782j74058j71970
10561I477248k87620m14587n28281n30814n32929l74739k85669j90629l5191J21092
10551F417881K62508M48843P22479R38699J033938J028991P87792L93738q2217
10542A1952652n41757q83864j058891j160570j163815j013277q91659p34817n73517
10533C930485m40549l43824k95415k78218k12053j78755j83798r4189j51694j14830
$$ plain form
10599 11710889 10642333 9668258 8886980 8418241 8233368 8132248 8080106 8043341 8105197 8381137
10589 8381137 8726381 9119386 9543507 9834503 9906284 9861874 9759967 9706795 9805096 10058924
10579 10058924 10581884 11216539 12027286 12994983 13895104 14561530 14794624 14591614 13982121
10570 13982121 13124722 12253466 11374247 10721075 10254222 9949058 9823276 9649218 9477248
10561 9477248 9189628 8775041 8246760 7715946 7183017 6808278 6522609 6331980 6296789 6417881
10551 6417881 6680389 7129232 7851711 8790410 9824348 10853339 11641131 12034869 11952652
10542 11952652 11410895 10527031 9468140 8307570 7143755 6130478 5238819 4504002 3930485
10533 3930485 3489936 3146112 2850697 2572479 2360426 2181671 1997873 1903684 1751990 1637160
10523A637160n1274n1940p4207q9201k7053m5495p4029p1732m0090k2343o3967
10512A025829j03146n6096l8184L6111L807P693k5322m1569n6141j2244N672m0919
10500G05491j7039K3463j0558o7017n2123p3629P1631L3969m938m0712l2177J8079
10488E54440j5354m3015o383j5342M2443o945l256k9934L6146O9021j1746M642
10476E74717j2044j5410l5918l3683p2566o2069N5774j5856m7176K9782Q293o9987
10464C03857m5196k582J0223J0749M8431M9620o203j5999k4132R824L0841m4628
10452C24805j6288m9649K9463M8455j858L3060l8503j0234L9005j195k0438j2645
10440C23978l8998j7948l2970K9558L6552J7891j0328j4128j191M2530l2585o1377
$$ plain form
10523 1637160 1585886 1533946 1459739 1370538 1343485 1297990 1223961 1152229 1112139 1089796 1025829
10512 1025829 922683 866587 828403 864514 868321 876014 850692 809123 752982 740738 746410 705491
10500 705491 688452 711915 701357 634340 582217 508588 580219 614188 609250 568538 536361 554440
10488 554440 539086 496071 489688 474346 516789 509844 506588 476654 512800 581821 570075 574717
10476 574717 562673 547263 511345 477662 405096 343027 398801 382945 335769 365551 373844 303857
10464 303857 258661 256079 266302 277051 325482 375102 368899 352900 328768 338592 369433 324805
10452 324805 308517 258868 288331 336786 334928 367988 329485 319251 358256 357061 336623 323978
10440 323978 284980 267032 234062 263620 300172 318063 307735 293607 292416 334946 302361 240984
10428B40984L7012M3398J5703l178p564K2752J3197j6443j515q565O28N2459Q1697
10415D70565K2133j069k3233k9374j3574l5901R173J0055P8498J8682O9551P1951
10403F47457O0343P5419P4000R9153J75020J99011J33207J03215J47813J45326
10393A859964O1113o98m0809j08486j37327j63640j18740j14110o5155m5829m723
10382A121560L3856J0615L6297L7444O4238Q5933Q7067O2933M2714K807l7915
10371A547549N133M7245N3834P9677J13014R0866Q1685L4801J7645J6079q9593
10360A997935j23847j08446n8272p2864l6169k4442J1811J3277j8134j47785q8563
10349A344501n3092m1657q3999q2210q1582J3409J1040k2184K8155Q1497P6800
$$ plain form
10428 240984 277996 321394 337097 333919 326355 349107 362304 345861 344346 335781 336409 388868 470565
10415 470565 492698 491629 468396 439022 425448 389547 398720 408775 487273 505955 575506 647457
10403 647457 707800 783219 857219 956372 1131392 1330403 1463610 1566825 1714638 1859964
10393 1859964 1921077 1920379 1879570 1771084 1633757 1470117 1351377 1237267 1172112 1126283 1121560
10382 1121560 1155416 1166031 1202328 1239772 1304010 1389943 1477010 1539943 1582657 1585464 1547549
10371 1547549 1552682 1599927 1653761 1733438 1846452 1937318 2019003 2053804 2071449 2087528 1997935
10360 1997935 1874088 1765642 1707370 1634506 1598337 1573895 1585706 1598983 1580849 1433064 1344501
10349 1344501 1291409 1249752 1165753 1083543 1001961 1015370 1026410 1004226 1032381 1113878 1190678
10338A190678R9449J52810J75545J20253O2557J0642p3619j48899j16119j46971
10328A326326j73601j35545j31377j33688r5888k4030m1855q870p8094j48345
10318C55033o9020n852O2728o6223l4179k1248p68j1033j2243M6690j4136j50220
10306G9529l2748O7905N3975K3073k7560n1557M2759N4302M183P996l7099q0753
10294A04005J953K1086p394q286J2657n8279k2844K9262L8093j435l6081l4823
10282C7914J7044K8376j1452n758l6860L0934L8161m09O95r49J1285L6573k1445
10269A24109l2430k5415J8771o754q997R8725K3097k1483K5368j8491p6802o146
10257I3552k200k6334J388j5479m632J028J5506K4442L5736J818m7117k440J6727
$$ plain form
10338 1190678 1290127 1442937 1618482 1738735 1801292 1811934 1738315 1589416 1473297 1326326
10328 1326326 1152725 1017180 885803 752115 656227 632197 590342 581472 503378 355033
10318 355033 286013 280161 342889 276666 242487 221239 220471 209438 197195 243885 229749 79529
10306 79529 46781 114686 168661 191734 164174 112617 155376 209678 213861 221857 184758 104005
10294 104005 105958 127044 119650 111364 124021 65742 42898 72160 110253 108818 72737 37914
10282 37914 54958 83334 71882 66124 29264 60198 98359 97950 98645 97696 108981 145554 124109
10269 124109 91679 66264 85035 78281 69284 168009 191106 169623 194991 176500 99698 93552
10257 93552 91352 65018 66406 50927 46295 47323 62829 87271 123007 124825 77708 75268 91995
10244I1995M8904j7446L2983R15r946l9100k8437K1394N0681J3349j9635k0991
10232A24666O0315r822m1247K1192O563k37m5967j9175N4991J3646o312o4057
10220I4556Q151J8130P4292q783n6394j1849j3608j0389k3856J6849K9959K4520
10208A41578O274M459p04k299M198k7487j2648k5019L154J3349J7477K7144J1676
10195A61152J4687j0310k5216q7002K354K4861p3451j8528j0009Q124L6531L9883
10183F3076P5963J4059p3241K938M2891k9721P783j9718K7932J9315R97m9287
10171H2987k5430l0118k9049L2172Q6188K8125R198j2975j741l2639J660j789
10159A06589j9186K1233Q317J1694J2321Q742P751M20P591k2921m7246m4351l5000
$$ plain form
10244 91995 140899 123453 156436 157351 147405 108305 79868 101262 151943 165292 145657 124666
10232 124666 184981 175159 133912 155104 161667 161430 115463 96288 151279 164925 158613 94556
10220 94556 102707 120837 195129 186346 129952 118103 104495 94106 70250 87099 117058 141578
10208 141578 147852 152311 151607 149308 153506 126019 113371 88352 91506 104855 122332 149476 161152
10195 161152 175839 165529 140313 53311 55665 80526 7075 -11453 -21462 -13338 23193 63076
10183 63076 139039 153098 79857 82795 125686 95965 103748 84030 111962 131277 132274 82987
10171 82987 57557 27439 -1610 30562 116750 144875 154073 141098 139357 106718 108378 106589
10159 106589 87403 108636 116953 128647 140968 149710 157461 157881 165472 142551 95305 50954 15954
10146A5954K6510O7412L9459o7861o0095O576K7640K839l6357n1L3373L647k2561
10133C6485m292O5149K2725o1122J4016k3160n732L5391N9430j1781k8458R142
10121A07793J4479j9499l1350M4619L5997l3855k4056N1225L1199n7474o3289
10110E5789m2663k9292j9559r205p3146L817J12831M9929M7787J6195K015o684
10098A07814k4563M8321L0050l83j8741p4393J8485J4657p3389q315l2700M6500
10086C3343J3747k8293L1089K7550O7611J5224j1665k228j016l5022l4147k3459
10074E2734k381l0533j3882J7259l6670j9712P977M8102L1113k2185J9822J9355
10062G0999p7492k3968J9596L4753n1391J3936J4648J6061j4948L4747l3735k8462
$$ plain form
10146 15954 42464 109876 149335 81474 21379 27955 55595 58434 22077 22026 55399 59046 36485
10133 36485 32193 97342 120067 58945 72961 49801 44069 79460 138890 127109 98651 107793
10121 107793 122272 102773 71423 116042 152039 118184 94128 145353 176552 119078 55789
10110 55789 13126 -16166 -35725 -44930 -118076 -114259 -1428 48501 96288 112483 114498 107814
10098 107814 83251 131572 161622 161239 142498 68105 86590 101247 27858 19543 -13157 33343
10086 33343 47090 18797 49886 77436 145047 160271 148606 146378 145362 110340 76193 52734
10074 52734 50353 19820 5938 23197 -13473 -33185 -25208 22894 54007 31822 51644 70999
10062 70999 -6493 -30461 -10865 23888 -27503 -13567 1081 17142 2194 36941 3206 -25256
10050b5256J0749j1015r34l5559K9473L2318k0588k4883K4244L0241N0774P226
10038F6790O930m14q4551j334N795L371O189j2377K334j3855K3146M5089k3024
10025B4089j3274K7771M1563K772l137J505j8660l3539J7254k8064J9260L7784
10013G5324l1704l9829l9789n3307J9863N5693j6844j6519m098l148N2395J5106
10001A3143p5290L2472L4480j6512M6150q645n8424K829K9231J9675j8457m78
9989A74M5740J4609m239J653p003o876o442k0050J2513j862J8486J2265k6194
9976C2774l9112L1806M9462L8792N096Q214k9068j7920o1254p4626J7986M5446
9964G596L6586k4216k5053q847J6308L4288K5087N3491K0104m5523n8975j1495
$$ plain form
10050 -25256 -14507 -25522 -26456 -62015 -32542 -224 -20812 -45695 -21451 8790 59564 66790
10038 66790 73720 73306 -11245 -12579 -6784 -3413 2776 -9601 -7267 -21122 2024 47113 24089
10025 24089 10815 38586 80149 82921 79784 81289 62629 29090 46344 18280 37540 75324
10013 75324 43620 3791 -35998 -89305 -69442 -13749 -30593 -47112 -51210 -54358 -1963 13143
10001 13143 -62147 -29675 4805 -11707 34443 25798 -32626 -29797 -566 19109 652 174
9989 174 45914 60523 56284 57937 50934 44058 37616 17566 30079 28217 46703 58968 32774
9976 32774 -6338 25468 74930 113722 118818 127032 97964 80044 18790 -55836 -37850 7596
9964 7596 44182 19966 -5087 -13934 2374 36662 61749 115240 135344 89821 30846 19351
9952A9351J8163l6699l648L8517k0764j519k522K4428K4155M3905j8449l6005
9940D8913J3500K2125L568j2993L0800K8573n6093j5786m2571n2768j4054j1285
9928e8071J7681J9614j4002L6391R797j4268l242L7148M511l5245J5871j1629
9916D556P151M4967L1440k1730o2932K226O4956j3700Q517m3238p3233J3678Q5468
9903D8126N1680J5316q569j2250m5350k119l5836K5544K4612R243R019N984m2551
9890D2849M748n747j2210j9399L275n102m395L3350O4433J0847j0037j3111Q717
9877I8218L918l9678l3448k5919r936J9370j3660M5367M5294k6299l8261J1260
9865C6226K2971j9667L8102M2493j9568k6995K6352K5055k4329J0798m0473N015
$$ plain form
9952 19351 37514 815 -2833 35684 14920 13401 10879 35307 59462 103367 84918 48913
9940 48913 62413 84538 88106 75113 105913 134486 78393 62607 20036 -32732 -46786 -58071
9928 -58071 -40390 -20776 -34778 1613 11410 -2858 -6100 31048 35559 314 16185 4556
9916 4556 11707 56674 88114 66384 3452 5678 70634 56934 65451 22213 -51020 -37342 48126
9903 48126 99806 115122 106553 94303 48953 46834 10998 36542 61154 70397 79416 85400 42849
9890 42849 47597 41850 29640 10241 13516 8414 4019 37369 101802 112649 102612 89501 98218
9877 98218 102136 62458 29010 3091 -6845 12525 -1135 44232 89526 63227 24966 36226
9865 36226 59197 39530 77632 120125 100557 73562 99914 124969 100640 111438 70965 75980
9853G5980N32j3524m4792L1777J2238p560J3624M8858J2119L905L2868j0473j7171
9840A38381k8797R443P5634J5914K0873q643l1495q3460K3330L7077M1213n792
9828B03678j8841M0564N0027L8054m2441j1158m915k4075K0512M4225K4658n896
9816C14392j9075m7000o949l2081l9331L292Q3474M0685m2554k8748J7967N7765
9804C01837J0775J5864o372q894Q9851P6030J1056j7368k5424l1603p131J5336
9792D23957J6878J1634J33896J52252J14393J07598J28005J21300k9867k5078
9782A154968N1538P5077J30410J25886J66437L10318M00501N56936Q73527J442452
9772E288050K500665M489127O584676N163128J193537k164910m155772m783730
$$ plain form
9853 75980 76512 62988 18196 49973 62211 54651 68275 117133 129252 133157 166025 155552 138381
9840 138381 109584 119027 194661 210575 231448 222805 191310 107850 131180 168257 209470 203678
9828 203678 184837 225401 275428 313482 271041 259883 254968 230893 251405 295630 320288 314392
9816 314392 295317 248317 241368 209287 169956 173248 256722 297407 254853 226105 244072 301837
9804 301837 312612 328476 322104 313210 403061 479091 490147 472779 447355 415752 408621 423957
9792 423957 440835 452469 586365 738617 853010 960608 1088613 1209913 1180046 1154968
9782 1154968 1206506 1281583 1411993 1537879 1704316 2014634 2415135 2972071 3845598 5288050
9772 5288050 7788715 12277842 18862518 24025646 25219183 23054273 18898501 14114771
9764A4114771m297267l065191j901664j246775q50298n94503m01044l05073k26596
9755A226360j33234q9126o5139m0440L1558J9115n4145n0039p4015k5003M850
9744G50742L1718O0027k077K0049J9257O6151M3257O2952M5911K5876L5854p959
9732A151758q821J7164N6363N9597M1406O6385N1869R1895M2238N0406J16779
9721A737039J22563J59771J76660J85581J54877K16293K23886K50477K90481L04537
9711C822165L04848M35628N62892N66000O71450P98838R05782J069028J277235
9702A0413866J516800J838740K231638K676996L166359L618149M044272M236329
9694C3743149L780769K794789J341351l56741j949253l172472l912127m082046
$$ plain form
9764 14114771 9817504 6752313 4850649 3603874 2753576 2159073 1758029 1452956 1226360
9755 1226360 1093126 1004000 938861 898421 929979 949094 894949 844910 770895 745892 750742
9744 750742 782460 842487 840410 860459 879716 945867 989124 1052076 1097987 1123863 1159717 1151758
9732 1151758 1142937 1160101 1216464 1276061 1317467 1383852 1435721 1527616 1569854 1620260 1737039
9721 1737039 1859602 2019373 2196033 2381614 2536491 2752784 2976670 3227147 3517628 3822165
9711 3822165 4127013 4562641 5125533 5691533 6362983 7161821 8067603 9136631 10413866
9702 10413866 11930666 13769406 16001044 18678040 21844399 25462548 29506820 33743149
9694 33743149 37523918 40318707 41660058 41303317 39354064 36181592 32269465 28187419
9686B8187419l816563l462776l067625k596513k162760j795292j496338j281732
9678H507820j042367q43161p09227o54700n62515m48723l22371l51761k78253
9669C294742l13308k72849k26289k27984j54113j28181j12249j15366p4872n7981
9659A611550j33342o5893o7072r0349o9084p3304n9025p5935p0766L7585J890
9648I46255l4213n2080o3571p2605q0064n6215l0096K3784N2463j4159m2626l3488
9636E43385o9436p5338k1086l1434O9775L8388l9248K3213k5876l3100j1714N186
9624C72715k187j09950l5553P5688k3569j1773k0614l0086N827J6301O2056O369
9612C05224j9211j823K6297j7012l4600q338k6297k1514P4507O4761j0239r1109
$$ plain form
9686 28187419 24370856 20908080 17840455 15243942 13081182 11285890 9789552 8507820
9678 8507820 7465453 6622292 5913065 5258365 4695850 4247127 3924756 3572995 3294742
9669 3294742 2981434 2708585 2482296 2254312 2100199 1972018 1859769 1744403 1669531 1611550
9659 1611550 1478208 1412315 1345243 1254894 1185810 1112506 1053481 977546 906780 944365 946255
9648 946255 912042 859962 796391 723786 643722 587507 557411 581195 633658 619499 576873 543385
9636 543385 473949 398611 377525 346091 415866 454254 415006 438219 412343 379243 367529 372715
9624 372715 370528 260578 225025 300713 277144 265371 244757 214671 220498 236799 298855 305224
9612 305224 286013 284190 310487 293475 258875 250537 224240 202726 277233 341994 331755 240646
9600B40646r448k4398K1772k1631l7269p39j7230k5285K040K8887j4035j2907
9588A30403j6573k159K12p151j7766N3094L0427j3627m8493P5011K2214m731l4712
9575A66149o8515k3295J6715L6165l476r629j473m5949R765k7447m0133N201N8667
9562G2745L2022l1978k3786n812P499N6135m0766p916K4242P591m561l8508j5727
9549C1180J8047m9578R785N3408k7090m9442K575L9008N8240M7182r0572m4587
9537a844J8727L4887m7654k1857L0375K0911J3397k3403L1953K1130Q708K843
9525H8173q1410o8766R563M024M0162l6284p596K2270L974J4386Q750j3170j0463
9512b6387j389j2341m719O489P8581M0009n0551n1452n847k425L2375K7930m098
$$ plain form
9600 240646 231198 206800 228572 206941 169672 168933 151703 126418 128458 157345 143310 130403
9588 130403 113830 111671 111883 104732 86966 140060 170487 156860 108367 183378 205592 200861 166149
9575 166149 97634 74339 91054 127219 123743 114114 112641 66692 76457 49010 8877 14078 72745
9562 72745 104767 72789 49003 43191 50690 106825 66059 58143 82385 89976 85415 46907 31180
9549 31180 49227 -351 9434 62842 35752 -13690 -11115 27893 86133 133315 42743 -1844
9537 -1844 16883 51770 4116 -17741 12634 33545 46942 23539 55492 76622 85330 88173
9525 88173 6763 -62003 -52440 -48416 -8254 -44538 -52134 -29864 -25890 -11504 -2754 -15924 -26387
9512 -26387 -27776 -40117 -44836 -38347 40234 80243 29692 -21760 -27607 -30032 2343 30273 26175
9499B6175l9655m1127L4547M3006k1932o0485M981L9298n9599j16112M09P5919
9487a14575O0375J8336K4023Q339j0914r733J8103K588k1493K5255L5393J8534
9475E4231J7151j4310n3664m5814k1796j0737K9331J5132J0448j3413k5771L5824
9463b3388J1862j4151j7493J7363N6794J4244k1379L0588M7463L2964n9837o4128
9451A0902L3436J7927J3331M297O588J0916k3278q858K831o1064l7662J4144J9475
9438B985J8302l4059j4635k830l5209J6618R982K1462l5447K0114j1118j3723
9426e7558M1543N6572k2838N4M1159J0042l8173n070m2295L8078Q161j4136l6991
9413b1452K1240J0563l2166m840q719l7564L1203O5938M4998k6530R325J460N773
$$ plain form
9499 26175 -13480 -54607 -20060 22946 1014 -59471 -54490 -15192 -74791 -190903 -190494 -114575
9487 -114575 -54200 -35864 -11841 -3502 -14416 -24149 -6046 -3458 -24951 304 35697 54231
9475 54231 71382 57072 3408 -42406 -64202 -74939 -45608 -30476 -20028 -33441 -59212 -23388
9463 -23388 -11526 -25677 -43170 -25807 30987 45231 23852 54440 101903 134867 75030 10902
9451 10902 44338 62265 75596 79893 86481 97397 74119 65261 68092 7028 -30634 -16490 2985
9438 2985 21287 -12772 -27407 -30237 -65446 -48828 -38846 -17384 -52831 -32717 -43835 -57558
9426 -57558 -16015 40557 17719 17773 58932 68974 30801 25731 -16564 21514 29675 15539 -21452
9413 -21452 -212 10351 -21815 -26655 -35374 -72938 -41735 24203 69201 42671 51996 53456 59229
9400E9229J6511K268l5572j375J1632r455j0554k5160j2668j7307o946O4675J9495
9387E4773K907k3158L5147K7276L795k0229O155L5627n8992m2341n397K0301M1033
9374G6897j0187l7438l6925K5811M101J7506k8656k1926k5793J2634R298Q581
9362f097j9307j3105m5484K8434K7547l0770k916J8783N632J9855k1056n751l760
9349d7995N2617M6315l0464k0855k684k2217L3349N7674L2348R059p319k397J9788
9336A17219J4104O84J8049r74p7315n9751l9001l9020J4038K5340N6413r192j7511
9323C083K2998J2332l5397k0006N1212K622k0021n622l3076L1505P36n765L4448
9310C9049m9957r516k712K6762J1420J2318K5787o0097o200O5513K2401k1360
$$ plain form
9400 59229 75740 78008 42436 41061 52693 43238 32684 7524 -5144 -22451 -29397 35278 54773
9387 54773 57680 34522 69669 96945 100740 80511 86666 122293 63301 20960 15563 35864 76897
9374 76897 66710 29272 -7653 18158 22259 39765 11109 -10817 -36610 -23976 -14678 -6097
9362 -6097 -25404 -38509 -83993 -55559 -28012 -58782 -61698 -42915 -37283 -17428 -38484 -44235 -47995
9349 -47995 4622 50937 20473 -382 -3066 -25283 8066 65740 98088 107147 99828 97431 117219
9336 117219 131323 132007 150056 149082 71767 12016 -26985 -66005 -51967 -26627 29786 20594 3083
9323 3083 26081 38413 3016 -16990 34222 36844 16823 11201 -21875 9630 10366 4601 39049
9310 39049 -10908 -20424 -23136 3626 15046 27364 53151 -6946 -13146 52367 74768 53408
9298E3408J594k2630r167J6833k0871j390j5089P9k103k508K9813N43K61p788
9284B0985k9672J5323K0861K2482k0430k0069j9252m6729j8450o748P943O0928
9272a2828M0084k4831k4140M875M430j2760m063M8134j5863K0654m8628o061M7405
9259A6408M539l7297o1157J5800N9411P4930J5359j9075m9594K7571K967p2393
9247b2531p6547m930M165n609J5811j6011J0537k7460K4600M1646j7852m7961
9235a22142L1655K3151j2791j6455L8523K0553K437K9611K1047m242k4068m253
9223a6974o498j9876k4758j5300j354Q262K8784K8918k761m1247P349j623J995
9210e5083N1896J6200m3696j8920K7772O4458j4727J6777J831n323j7761m992
$$ plain form
9298 53408 55002 32372 23205 40038 19167 17777 2688 2767 664 -1844 27969 28512 28773 20985
9284 20985 -8687 6636 27497 49979 29549 9480 -9772 -56501 -74951 -81699 -73756 -12828
9272 -12828 27256 2425 -21715 -16840 -12410 -25170 -29233 18901 3038 23692 -24936 -30997 16408
9259 16408 20947 -16350 -77507 -61707 -2296 72634 87993 68918 19324 46895 49862 -22531
9247 -22531 -99078 -104008 -99843 -105452 -89641 -105652 -95115 -122575 -97975 -56329 -74181 -122142
9235 -122142 -90487 -67336 -80127 -96582 -58059 -37506 -35069 -5458 15589 11347 -12721 -16974
9223 -16974 -23472 -43348 -68106 -83406 -84760 -76498 -47714 -18796 -21557 -62804 -55455 -57078 -55083
9210 -55083 -3187 13013 -30683 -49603 -21831 42627 27900 44677 46508 41185 23424 18432
9198A8432k6886J0687N9086q462o2988m0865j0830J288J9999L2057r12L3819R687
9185C4112l594n5430n3488k3417L5858m3277R495M7662p48K5880M2877p916n9293
9172e1279N2530K0038j6512K4187K4893o157j3184m9605j1103J4206M0888M5009
9160G3911Q722j7351j4606J5063k7783m5276J7l9900j7848J0873M0473R100N225
9147F20o8832j1949K0008P9074M1264P365n107m0695m1080l6068j1149O7227r498
9134h820K7239j9188m3188J7098M3180j914K1217k9666n6253l9489P690J5262
9122f6832M5834Q251k6243J3007K0993j3253j5641J7252K9055k360k3614j9599
9110c3150K1850m3127R323N9827P214K1837p576j7346K7694K5938L7056m359l1756
$$ plain form
9198 18432 -8454 2233 61319 52857 -10131 -50996 -61826 -60538 -40539 -8482 -9394 24425 34112
9185 34112 30518 -24912 -78400 -101817 -65959 -109236 -99741 -52079 -52827 -26947 15930 8014 -51279
9172 -51279 1251 21289 4777 28964 53857 47700 34516 -15089 -26192 -11986 28902 73911
9160 73911 82633 65282 50676 65739 37956 -7320 -7303 -47203 -65051 -54178 -13705 -4605 620
9147 620 -68212 -80161 -60153 18921 60185 67550 62443 21748 -19332 -55400 -66549 678 -8820
9134 -8820 18419 -769 -43957 -26859 16321 14407 35624 5958 -50295 -89784 -82094 -66832
9122 -66832 -20998 -12747 -38990 -25983 -4990 -18243 -33884 -16632 12423 10063 -13551 -33150
9110 -33150 -11300 -54427 -45104 14723 21937 43774 36198 18852 46546 72484 109540 105181 73425
9097G3425m3057L310K5611J7335k6154n5358k3589L1975K3181K7311l1215p69
9085B2006L9133Q688N3097J183l7752j176p1650p2716n1569j2986M575N8571k0974
9072h1570n397N1829J5957k288L3143K3256n9323k9941p258j9354M8987N1757
9060A9798p603L8834J8272J6320l8459q4944L3953j5899j9618j3950J2351N418
9048c5527j019j1968L1905L3636K9165K2445N8994r507o7359m5184k5672k8974
9036d9065L5025l141k2180J224n6885J1175P4978J284J6631m5646k7232J1366
9024e2466n709K4873K169m6689k1067l1643M9179n905k2073O6818M2722k1877
9012b1668J4488M5215n0135p4068Q1409M6840K7546j3901q496o7312m1889Q877
$$ plain form
9097 73425 30368 33678 59289 76624 50470 -4888 -28477 3498 26679 53990 22775 22006
9085 22006 61139 69827 122924 124107 86355 85179 13529 -59187 -110756 -123742 -119167 -60596 -81570
9072 -81570 -86967 -35138 -19181 -21469 11674 34930 -24393 -54334 -61592 -80946 -31959 19798
9060 19798 12195 51029 69301 85621 47162 -37782 -3829 -19728 -39346 -53296 -40945 -35527
9048 -35527 -36546 -48514 -16609 17027 46192 68637 127631 118124 50765 5581 -20091 -49065
9036 -49065 -14040 -17181 -39361 -38137 -95022 -83847 -8869 -7585 9046 -36600 -63832 -52466
9024 -52466 -58175 -33302 -31133 -77822 -98889 -130532 -81353 -87258 -109331 -42513 209 -21668
9012 -21668 -7180 38035 -12100 -86168 -4759 42081 69627 55726 47230 -20082 -61971 -53094
9000e3094j1775m173j8668J3840K666N8211L0416m0928K9087j231L3289O953j3713
8987C0880K5063M496q143k3363l8190k8634L8922O5235L571m6995m1042M9131
8975C0931j4567l3132k1274K1412K6479L0844q232k8905j3087l3535J3935L1181
8963B050j4838l9471m6471j1427L6044r787n569K0323l0593L1805P4117k2440
8951a6257j3467K7367M7211J0912R174K971m4345j5510r751K884m140L4029J4097
8938D5175J4005J4360j8664n3253J697k5052k2612L5986M0157K0592Q815k7012
8926C4194j2036L7475k0172n360M1597l83n9042k3105m8936K1171M450k1437M9078
8913b506o3798j3398K7716J8341J9236r42k6904K2861k3285j121M6282Q805J2264
$$ plain form
9000 -53094 -64869 -69042 -87710 -73870 -71204 -12993 17423 -23505 5582 4351 37640 44593 30880
8987 30880 55943 60439 52296 28933 -9257 -37891 1031 66266 69837 22842 -18200 30931
8975 30931 16364 -16768 -38042 -16630 9849 40693 32461 3556 -9531 -43066 -29131 2050
8963 2050 -12788 -52259 -98730 -110157 -74113 -83900 -89469 -69146 -99739 -67934 6183 -16257
8951 -16257 -29724 -2357 44854 55766 64940 67911 23566 8056 -1695 1189 -2951 31078 45175
8938 45175 59180 73540 54876 1623 3320 -21732 -44344 -8358 31799 52391 61206 34194
8926 34194 22158 59633 39461 34101 75698 75315 16273 -6832 -55768 -34597 -30147 -51584 -2506
8913 -2506 -66304 -79702 -51986 -33645 -14409 -15351 -42255 -19394 -42679 -43800 2482 11287 23551
8900B3551L9362L3226k4193n7065l2321R270J4459j0016K1454K4335O921j2388
8888C6595L1805J9468n8508k1305l3219n8764L3178L7988j1624J7482m2968k7955
8876g7827K0609J4294N2036J8330L4756J4893n350M6463N1012J0052J7169k0003
8864A76434l8391l7547n2141j5841m4059J6818K3742J36L774o6969o1976o8342
8852a64362l5221N1862N5924K806l9529l0902M54J1953K5367J3772M6516K5379
8840c5981k807P0081l393p5639j8494P9129M7373p2680l4325K4814p91l6607j797
8827f1117l8117n1315n1898M712N9075J5981M1528K4756K7677j1945M4497j058
8815B776m8689L314O7325M47n0711J9169L8543m1970j6015j00j0190J4245K5625
$$ plain form
8900 23551 62913 96139 71946 14881 -17440 -8170 6289 -3727 17727 42062 48983 36595
8888 36595 68400 87868 29360 8055 -25164 -83928 -50750 -12762 -24386 -6904 -49872 -77827
8876 -77827 -57218 -42924 9112 27442 62198 77091 71741 118204 169216 179268 196437 176434
8864 176434 138043 100496 48355 32514 -11545 5273 29015 29151 32925 -34044 -96020 -164362
8852 -164362 -199583 -147721 -91797 -88991 -128520 -159422 -158968 -147015 -121648 -107876 -61360 -35981
8840 -35981 -38788 31293 27900 -47739 -66233 12896 60269 -12411 -46736 -21922 -22713 -59320 -61117
8827 -61117 -99234 -150549 -202447 -197735 -138660 -122679 -81151 -56395 -28718 -40663 3834 2776
8815 2776 -45913 -42599 24726 25173 -25538 -6369 32174 -9796 -25811 -25911 -36101 -21856 3769
8802C769J7027k6164R459K0439r357L487p131m8390j4383J1981n512k3070j8196
8789h6041o8029j0310M8961N1681Q478k6655J3943O0305K6331K9911m643L7158
8777H1090K3106l2922r3368j7348J7778l5690j6328N1913l14k4283p99M1285m859
8764a0739k7642J9413L1589K7101k637o3479j0558k5083m2465L8675O8353L6226
8752C8754J6158l0971m5105M376M5316m2289L466L8592r435N595m2764p541K1660
8739d188j1871O1741K5391k5619m1352K2215J9689o6736k9085M798N1809l024
8727C768K565L9675R853l2362l5644J2852L5695k9198p6479l4387j3178k9002
8715a45842M3354J5257K0400P2378N7553p076j512K47J3971l8537n6925J3082
$$ plain form
8802 3769 20796 -5368 4091 24530 15173 18660 11529 -36861 -51244 -39263 -44775 -67845 -86041
8789 -86041 -154070 -164380 -115419 -63738 -55260 -81915 -67972 -7667 18664 48575 43932 81090
8777 81090 104196 71274 -22094 -39442 -21664 -57354 -73682 -21769 -22083 -46366 -47165 -5880 -10739
8764 -10739 -38381 -18968 12621 39722 37085 -26394 -36952 -62035 -104500 -65825 2528 38754
8752 38754 54912 23941 -21164 -16788 28528 -13761 -10295 28297 18862 24457 -18307 -25848 -4188
8739 -4188 -16059 45682 71073 45454 4102 26317 46006 -20730 -49815 -45017 6792 3768
8727 3768 6333 46008 55861 23499 -12145 707 36402 7204 -69275 -103662 -116840 -145842
8715 -145842 -102488 -87231 -66831 5547 63100 56024 54512 54759 68730 30193 -26732 -13650
8703a3650Q733J2243M5182K9777L3015n6122l3073k8805N683j0199J5887K0707
8691B9378K5222M2398J0625k4257n0655j2082M3695j1099r283K9321J2053m8270
8679C7046j0233q80l1528j8307k7248M3970N5335J2472Q080o6190l973L0040L3093
8666F1677K3142O8146J4742m6286m4837J6484J2863k022O606m3878J2082N3482
8654A32201J9768q148K7393m1331K225L3632J3576m685J1968k8779k6361m349
8642A27110k6988M108j1987k4162j4816K015P768m4007M4962k1768O120K4451
8630G2806K8824o413M001m7299l5549r188M5280k3809k5280K8947k5286N9189
8618F6223l069n3734N102q656K6396J0083P1271K2687J708k5065n363K770J9959
$$ plain form
8703 -13650 -4917 7326 52508 82285 115300 59178 26105 -2700 2983 -7216 8671 29378
8691 29378 54600 96998 107623 83366 32711 20629 64324 53225 43942 73263 85316 37046
8679 37046 26813 25933 -5595 -23902 -51150 -7180 48155 60627 68707 2517 -1456 28584 61677
8666 61677 84819 152965 167707 121421 76584 93068 105931 103909 110515 66637 78719 132201
8654 132201 151969 143821 171214 129883 132108 165740 179316 174631 186599 157820 131459 127110
8642 127110 100122 104230 92243 68081 53265 55280 63048 19041 64003 42235 48355 72806
8630 72806 101630 95217 99218 51919 16370 7182 52462 28653 3373 32320 7034 66223
8618 66223 63154 9420 14522 5866 32262 42345 113616 136303 138011 112946 107583 110353 130312
8605A30312K4991L7947k3699j8486O580K8926M6406M3607k3991l7419J4055K2197
8593B51426k4835K7567P4057J9034J9367j4275M4067O1919l4292n4674K613Q413
8581C80387l6723o5961m4704m6024l1553O563j173n9505J0166O324L3712J2686
8569A64195p8706q1572j8676n383N075J6470J5534J0187K7321J0707J2084p3883
8557C353p4158K0886O1381l068k1323L7315j2678k188o097p441L3847M3032j67
8544G2694l0690L2602L6285O472l1141m0673j6694L8980P109J1711l313j5758
8532F7584p4364l3232K0722Q656m9752L599Q519K9301L3076Q842k2996p3l1771
8519c1889l4919k9313K9176L7940J3355M1408k2022j9698l5131J7713K5641n0095
$$ plain form
8605 130312 155303 193250 169551 151065 157645 186571 232977 276584 252593 215174 229229 251426
8593 251426 226591 254158 328215 347249 366616 352341 396408 458327 424035 369361 371974 380387
8581 380387 343664 277703 232999 186975 155422 161985 160812 101307 111473 117797 151509 164195
8569 164195 85489 3917 -14759 -20142 -15067 1403 16937 27124 54445 65152 77236 3353
8557 3353 -70805 -49919 11462 8394 -12929 24386 11708 9520 3423 -4018 29829 72861 72694
8544 72694 42004 74606 110891 117363 86222 45549 28855 67835 74944 86655 83342 67584
8532 67584 -6780 -40012 -19290 -10634 -60386 -56787 -48268 -18967 14109 22951 -45 -118 -31889
8519 -31889 -66808 -96121 -66945 -29005 -15650 25758 3736 -15962 -51093 -33380 -7739 -57834
8507e7834K1452N1436J0217K3575n565N5202J750j7295j826l2203l9423K64J5052
8494B4802l5380m5777o4246j1028N9124M8975J1667N686R213O022k935n2683J7548
8481b9012O0971j8837j752L3685O885m9878m3202P063j4316j3231k5821q230l1991
8468a27666L074K4978P4206L5821J8181K7737q348n3487j4667O0907J794n5248
8456a2718M2416L0380l2892J7561J5727k0341j6642K018J8401l4706J8683K7629
8444E5516l3986k8551j4598j2901j3397Q212m360K328L401m7366j0836L6506N7557
8431b475L0269L0745m6241n2146L2548L0874K1197k7032q485j2531m3481l3580
8419h0338q528M727O2249J9634o2688K7531L1381O375m2312p3668J7842L3304
$$ plain form
8507 -57834 -36382 15054 25271 48846 43281 98483 100233 82938 81112 48909 9486 9750 24802
8494 24802 -10578 -56355 -120601 -131629 -72505 -23530 -11863 -6177 3036 9058 6123 -46560 -29012
8481 -29012 31959 13122 11370 45055 51940 2062 -41140 -34077 -48393 -61624 -87445 -95675 -127666
8468 -127666 -124592 -99614 -25408 10413 28594 56331 47983 -5504 -20171 40736 42530 -12718
8456 -12718 29698 60078 27186 44747 60474 40133 23491 25509 43910 9204 27887 55516
8444 55516 21530 -7021 -21619 -34520 -47917 -39705 -44065 -41737 -38336 -85702 -96538 -60032 -2475
8431 -2475 27794 58539 12298 -39848 -7300 23574 44771 17739 9254 -3277 -46758 -80338
8419 -80338 -88866 -84139 -21890 -2256 -64944 -37413 -6032 343 -41969 -115637 -97795 -64491
8407f4491N3444L0241R123J7325M495k1969j9958n4872L3706L4665m434n6336
8395c9061J4214J7813j2137k4825L4329N6264N0640p1817n5619K268J928l6655
8383f2658k2101l5255n198P1578L415K1976O4938P885j6354o3232l9532J4120
8371f0418M0665J5568M321l0006K198j7345j8290M478l3652N657k7670N596K4365
8358h4533M503K1376K1515r677O4787k6723p2729k7708O9461L8373L304M07n4718
8345e2362m4235n9178N2456P4219L1979K6788K3164N1485m253j4083m3561o743
8333C5676K6388l2121N579m406n2161R223k1010P720k4874j0008L6116J1678n3196
8320f5396j2880o488l4790K7478P8947J01485l3627L1166K8894l2900j8341j1654
$$ plain form
8407 -64491 -11047 19194 28317 45642 50137 28168 8210 -46662 -12956 21709 17275 -39061
8395 -39061 -24847 -7034 -19171 -43996 -9667 46597 97237 25420 -30199 -27931 -26003 -62658
8383 -62658 -84759 -120014 -125212 -53634 -50219 -28243 36695 44580 28226 -35006 -74538 -60418
8371 -60418 -19753 -4185 136 -29870 -27672 -45017 -63307 -58829 -92481 -86824 -114494 -108898 -84533
8358 -84533 -80030 -58654 -37139 -46816 17971 -8752 -81481 -109189 -39728 -1355 1949 2356 -52362
8345 -52362 -96597 -155775 -103319 -29100 2879 29667 52831 104316 100063 85980 42419 35676
8333 35676 62064 29943 35522 31116 -21045 -11822 -32832 -25112 -49986 -59994 -23878 -12200 -65396
8320 -65396 -78276 -84764 -119554 -92076 -13129 88356 54729 85895 114789 81889 63548 51894
8308E1894m6039r339j8331j3646k8011j0162O6747K6767j7611P860j7600r491
8296a6962k7042K7317m923n3214M7697L3734J6702M6190n330l8209r666J8509
8284C4803n1894K1847L3133l7596M0081J689o5173l5275K3413N161J6196k3182
8272c6797j6336J00J5809J8783j3536K3131L242K4951P70j067J9573j967j7372
8259A9284o917r704N2769L3610k7746j5375j8657o031J0318l511l8768k3949O304
8246b8373L284m7532K4877M1489R247N394J7967l4245j440j8445j4854K4873o989
8233b4747m7986J3233q03K739j012k6528K4693L0939k8493L7333K4565J3479n7191
8220c9779Q2609J06355k4957o3813j8384K894k4856N01n442j1559n6330J8606
$$ plain form
8308 51894 5855 -3484 -21815 -35461 -63472 -73634 -6887 19880 2269 10129 -7471 -16962
8296 -16962 -44004 -16687 -21610 -74824 -27127 6607 23309 69499 64169 25960 16294 34803
8284 34803 -17091 4756 37889 293 40374 42063 -23110 -58385 -34972 -29811 -13615 -36797
8272 -36797 -53133 -53033 -37224 -18441 -31977 -8846 -5604 19347 20117 19050 38623 36656 19284
8259 19284 12367 2663 55432 89042 61296 45921 27264 21233 31551 28040 -10728 -34677 -28373
8246 -28373 -25089 -72621 -47744 -6255 2992 8386 26353 -7892 -9332 -27777 -42631 -17758 -24747
8233 -24747 -72733 -59500 -60303 -57564 -58576 -85104 -60411 -29472 -57965 -20632 3933 17412 -39779
8220 -39779 42830 149185 124228 60415 42031 44925 20069 20570 15128 3569 -52761 -34155
8208c4155L4753o268r078j2003L0353k7250j3122L6607L085l0888j5124K9966
8196a3124J5510j3435J6524n883l5711k9279M4039Q840l4165P435l123o02k1154
8183f4128J1689M7107J8501l6514l9328N324k2657J8425J1050l6172K6807K1497
8171c8399K7374J4748j5981L1431k874k6307j4977l9177l2010K0962o08M2051
8159c3767K513j2329p2859K1879L4700l5416j3297N3403N2054N4504L0948K0961
8147A03294M1433J6397k1123j3748q688j2706j3674J4220m3539o6479l6910m5074
8135h6597M5447N9042K2840M941n4280N561j5980m5361l201p1221J4981Q2043
8123d1785P3332N9705J3742p3028n7597l2822r963L970O6521M9133m951K1756
$$ plain form
8208 -34155 598 -5670 -14748 -26751 3602 -23648 -36770 -163 2922 -27966 -43090 -13124
8196 -13124 2386 -11049 5475 -408 -36119 -65398 -21359 -12519 -46684 -39249 -42372 -42974 -64128
8183 -64128 -52439 -5332 13169 -23345 -62673 -57349 -80006 -61581 -50531 -86703 -59896 -38399
8171 -38399 -11025 3723 -12258 19173 16299 -10008 -24985 -64162 -96172 -75210 -75818 -33767
8159 -33767 -31254 -43583 -116442 -94563 -59863 -95279 -108576 -55173 -3119 51385 82333 103294
8147 103294 144727 161124 140001 126253 117565 104859 91185 105405 61866 -4613 -41523 -86597
8135 -86597 -41150 17892 40732 45673 -8607 -3046 -19026 -64387 -67588 -138809 -123828 -41785
8123 -41785 31547 91252 104994 31966 -25631 -58453 -68416 -64446 2075 51208 46257 68013
8111F8013n9010r0671l5505M1985N4060K4059j5650J0191K3783j2589r055j1988
8099a2377k6748j5569k5586l1528J04030L093o6428J4495J2675j0262k0860J6159
8087e8906j6899J3680N8774L4872j7549m1692J6037P124j51K8389n700K4311J0968
8074E3258j6842q199m5811n6537k4951J9178L8624K9326M7082j7097j4468N048
8062H611n2202L1191K1937L5542O45L2182k4890j6348j7101R603L2531K1441o127
8049G7015O51r360j5143k6529J4605K1227m664J1392j6853k3282k9493J7965j7382
8036A49J9591K0505N4963k021l6n6658k2774j3007j3349p855J7126M892K3947
8023B5473J2158K1999L4183J1211n3008m5347j6151K64L1571M0974K6928J4184
$$ plain form
8111 68013 9003 -81668 -117173 -75188 -21128 2931 -12719 -2528 21255 8666 -389 -12377
8099 -12377 -39125 -54694 -80280 -111808 -7778 -4685 -71113 -56618 -43943 -54205 -75065 -58906
8087 -58906 -75805 -62125 -3351 31521 13972 -27720 -11683 -4559 -4710 23679 17979 42290 53258
8074 53258 36416 28217 -17594 -74131 -99082 -79904 -41280 -11954 35128 18031 3563 8611
8062 8611 -43591 -12400 9537 45079 45724 77906 53016 36668 19567 29170 61701 83142 77015
8049 77015 77666 68306 53163 26634 41239 62466 57802 69194 52341 29059 -434 17531 149
8036 149 19740 40245 95208 93187 93151 36493 13719 712 -12637 -20492 -3366 1526 25473
8023 25473 37631 59630 93813 105024 52016 6669 -9482 -9218 22353 63327 90255 104439
8011A04439k7782l9127m0029k3337J8025P6880L9448J6277j6876l5384l3595o2079
7999b3140m8422N1968M1939J7873L2667L304Q991j5806m7163M61K3437l1369J8212
7986C2952N9493m1027m0875J1635o461K3785j8637n464L0789P9987J0970n5269
7974H1878m3682J0129J2376q65K4898P389k0086P888l2493j6533k6261m983L2451
7961C2106P506K0477l5153l4761l33N0566K9351k6286n0007M5093L2181O985K3557
7948A01282j558j3735m1536K5657p909o874k7829L854k173O328L1523R444m3724
7935C2750K4697L9929j7875p4310j3680N0828L6601m7256p1601k5338Q2247M95
7923A7487j1921K4985J8532n4941O2421R3969L5446m0851l4573l244k6287m3471
$$ plain form
8011 104439 76657 37530 -2499 -25836 -7811 69069 108517 124794 107918 72534 38939 -23140
7999 -23140 -71562 -19594 22345 40218 72885 76189 85180 69374 22211 22672 46109 14740 32952
7986 32952 92445 51418 10543 22178 15717 39502 20865 15401 46190 126177 137147 81878
7974 81878 38196 48325 60701 59836 84734 92123 72037 79925 47432 30899 4638 -345 32106
7961 32106 39612 60089 24936 -9825 -10158 40408 69759 43473 -6534 38559 70740 77725 101282
7948 101282 99724 85989 44453 70110 62201 55327 27498 31352 29179 35507 67030 76474 32750
7935 32750 57447 97376 79501 5191 -8489 42339 78940 31684 -39917 -65255 16992 17487
7923 17487 5566 30551 49083 -5858 56563 150532 185978 145127 110554 107310 81023 37552
7911C7552j6059K9364J2691m0494J7179j5289j586k0578k1401O9440R365l1525
7899B8659K7747P102j1822j460P841J6830J7049P4890j5092j0065J9431m2259
7887A18851p0587l8691m6649P138j0920L4639N7505M113L1237j1425n8333k9513
7875a2635K632n726j2787j7203M8650L5334J2056j7555k2530K8046j6877q409
7863A2996L459L291m3048o916J8662L0110m2217k4185k7698l1495l056K6296J1780
7850g2021K4485K0463K5958K1107k05M4401l200l8756r413j9922k1586o4329l1417
7837a24435m4137O1939Q426k8711J2594p081L3772N3392N553K536p7077n4107
7825a57336k146j1277J9302J17766K5490j7953n0115o755Q1848L3346j4133n1767
$$ plain form
7911 37552 21493 50857 63548 23054 40233 24944 23358 2780 -18621 50819 60184 28659
7899 28659 56406 63508 51686 50226 58067 74897 91946 166836 151744 141679 161110 118851
7887 118851 48264 9573 -37076 -29938 -40858 -6219 51286 55399 86636 75211 16878 -12635
7875 -12635 -10003 -15729 -28516 -45719 2931 38265 50321 32766 10236 38282 21405 12996
7863 12996 16455 19746 -23302 -30218 -11556 18554 -23663 -47848 -75546 -107041 -110097 -83801 -72021
7850 -72021 -47536 -27073 -1115 19992 19787 64188 60988 22232 12819 -7103 -28689 -93018 -124435
7837 -124435 -168572 -106633 -98207 -126918 -114324 -121405 -87633 -34241 -28688 -26152 -103229 -157336
7825 -157336 -159482 -170759 -151457 -33691 -8201 -26154 -76269 -83024 -1176 32170 18037 -33730
7813c3730l9071k1847O662K9914L7123L8352m6527k7040K0047N2731J875k5284
7801f795M5273l1467o3680k3280K0311M2438J5106j602K826o631K9872O726N976
7788C5073k0187p2283J5393P5969L8496m042n0928k3011K07K7640l2875k5929
7776c6477M488N9895j7874j7251J6092l6704j7971L1828N5883l7120l3515J1028
7764a7698n736J9141j2970l3671q47J4737K8304j5852R713K5041Q681k5648k0456
7751b7261j1588M831M8056K91k3971o275m903N5350p415p8054l9462l675J2835
7738h1241J091K0648O2971K3737q16J6055j3068l8044L376n671K820J1398K3882
7725B7138M3960J7809m3231l5509J346J5246j9723m1737k1842K7919K5157K9990
$$ plain form
7813 -33730 -72801 -94648 -87986 -58072 -20949 17403 -29124 -56164 -36117 16614 18489 -6795
7801 -6795 38478 7011 -56669 -79949 -59638 -17200 -2094 -3696 -870 -7501 22371 29097 35073
7788 35073 14886 -57397 -42004 33965 72461 68419 17491 -5520 -5313 22327 -10548 -36477
7776 -36477 -31989 27906 10032 -7219 8873 -27831 -45802 -13974 41909 4789 -28726 -17698
7764 -17698 -23434 -4293 -17263 -50934 -51781 -37044 -8740 -24592 -14879 10162 18843 -6805 -27261
7751 -27261 -38849 -34018 14038 14329 -9642 -15917 -20820 34530 27115 -50939 -90401 -94076 -81241
7738 -81241 -80150 -59502 3469 27206 26390 42445 29377 -8667 -5291 -10962 -8142 3256 27138
7725 27138 71098 88907 45676 10167 11513 26759 7036 -34701 -56543 -28624 -3467 26523
7713B6523o1011m7708L9746j7147J6105Q073J8801k3821q352K2811l182J255n669
7700c3576p809l5380k4900K8121K4955J220j7675L7580J7627o520o670J2179N8637
7687D7789q62j5525j8138j4325M7876J7761k3705l2423o2841P407p182K364L8617
7674a3187l0752L1139M0730k3595N6664K8415k0932J7192l102n6064j7975O163
7662A4696p602o7233J6533j1425K4074K4075q596q049J1805o907J6572M692J7412
7649B0047k8604k8697m5724k455j3243k1987Q3142K9869N6499O4625M6251o276
7637A53447p4894n6975L980j7038k9915k1451j4779J8635K4705J3698m8435k4352
7625g3374N9020k8294k9997L3681k292Q473k0506K4055M1186k7548l1058k8248
$$ plain form
7713 26523 -34488 -82196 -42450 -59597 -43492 -35419 -16618 -40439 -48791 -25980 -29162 -27907 -33576
7700 -33576 -41385 -76765 -101665 -73544 -48589 -47369 -65044 -27464 -9837 -16357 -23027 -10848 47789
7687 47789 46927 31402 13264 -1061 46815 64576 40871 8448 -54393 -46986 -54168 -51804 -13187
7674 -13187 -43939 -12800 27930 4335 60999 89414 68482 85674 82572 26508 8533 14696
7662 14696 7094 -60139 -43606 -55031 -30957 -6882 -15478 -23527 -11722 -18629 -2057 2635 20047
7649 20047 -8557 -37254 -82978 -85433 -98676 -120663 -37521 -7652 48847 113472 159723 153447
7637 153447 78553 21578 25558 8520 -21395 -42846 -57625 -38990 -14285 -587 -49022 -73374
7625 -73374 -14354 -42648 -72645 -38964 -41256 -32783 -53289 -29234 11952 -15596 -46654 -74902
7613g4902k8760J2264O5027N5313L0877n5501o7236L2778Q814j9847n9194M4913
7601e5454Q9277J4216m7652l9913L9270L4340J9725n4245k8884j2657K4143L879
7589a3955J792k7238k5049K4087J1236J6709m993o041J0403J6141l7498j5422
7577d9828j4589L6500K4772L6104o1392m258k074j1000O0263N3594j4787L3685
7565H6990j85k8557l590M105K0690l1355P337L452k1011p461n0340k3955K2374
7552b1506l373j8777P397J5332o187K226K1908L666j1498J4143J6727k7419q7418
7539i4779M2691N9385j8833j9067j4335L001J2778k7735k183M5870L6814J340
7527B4947J5531L159k9633k1516l8451k1809q586K4729L6931m223j8946m0377
$$ plain form
7613 -74902 -103662 -91398 -26371 28942 59819 4318 -62918 -30140 -21326 -41173 -100367 -55454
7601 -55454 33823 48039 387 -39526 -256 34084 53809 -436 -29320 -41977 -17834 -13955
7589 -13955 -12163 -39401 -64450 -40363 -29127 -12418 -17411 -23452 -13049 3092 -34406 -49828
7577 -49828 -64417 -27917 -3145 32959 -28433 -32691 -34765 -45765 14498 68092 53305 86990
7565 86990 86805 58248 54658 58763 79453 48098 55435 58887 37876 30415 -19925 -43880 -21506
7552 -21506 -24879 -43656 -36259 -20927 -27114 -24888 -2980 686 -10812 3331 20058 -7361 -94779
7539 -94779 -52088 7297 -11536 -30603 -44938 -41937 -29159 -56894 -59077 -13207 23607 24947
7527 24947 40478 43637 14004 -7512 -45963 -67772 -76358 -51629 -14698 -18921 -37867 -78244
7515g8244l0244k1061o083M820M4056L7969m5611j959K0734j8119O1259J7934
7503a4549m1140q6353o512N8559O1268k4107P61n4740l9243N4703O6339O562Q809
7490i643M7250J6313j9231j1949m554k1180q831j7402n095l8285J1011L2800k1256
7477e0052p998Q510K2639L5305m4345l3532p830j6896j3818L698j8482M3264L2744
7464d6793J4227J5472N877l9389o5946k8177J0890P4604M9413k1764j642J5455
7452a7773P336o169l0267M6702R1024J7354o5l4835l038l0464l6485q461J4162
7439I021J1575K0059j3257J2688L1888o5598k2994L6011l852l9779n9424J8584
7427f5078L1618l0481m6958J2320M4644K815J8533r690L9556M4661M1078k3329
$$ plain form
7515 -78244 -108488 -129549 -135632 -130812 -86756 -48787 -94398 -96357 -75623 -93742 -32483 -14549
7503 -14549 -55689 -142042 -148554 -89995 -28727 -52834 -52073 -106813 -146056 -91353 -25014 -18452 -9643
7490 -9643 37607 53920 34689 22740 18186 -2994 -11825 -29227 -34322 -72607 -61596 -28796 -50052
7477 -50052 -58050 -49540 -26901 8404 -35941 -69473 -77303 -94199 -108017 -104319 -122801 -79537 -46793
7464 -46793 -32566 -17094 -11217 -50606 -116552 -144729 -133839 -59235 -9822 -31586 -33228 -17773
7452 -17773 -10437 -16606 -46873 -171 90853 108207 108142 73307 70269 39805 3320 -5141 9021
7439 9021 20596 40655 27398 40086 71974 6376 -16618 19393 15541 -24238 -83662 -65078
7427 -65078 -33460 -63941 -110899 -98579 -53935 -51120 -32587 -42277 -2721 41940 83018 59689
7415E9689k3172k9814l9179K6296j3658J7989M3644L4230r368J6469q4110n8064
7403e9048k4388o936J0631P9260K6556J9400l6391n0392n7714Q226L8046k9856
7391h2606q9453K0713P9147M3584j0552N12j6463n7941L2667M4023K6001J6403
7379F035m9998k5501j1370M530J4353k1083L9509N8886M412J4780O896L3690O225
7366H1364N5063o1748m4731J8268L4311j7336l4886m7205l9265J1239n571M811
7354d5686P1555K3490o964j0332m448k0243k1969k7955j9627L4017J44k189k308
7341c2515k7881J3727K1446K2040M590Q552j1648l1107j2131J2866M8741L6690
7329E3370p6705k8606m7831o659o458L3194P8855M4905L7347j6915j7139n1892
$$ plain form
7415 59689 36517 6703 -32476 -6180 -19838 -1849 41795 76025 66657 83126 -984 -59048
7403 -59048 -83436 -90372 -79741 -481 26075 45475 9084 -41308 -99022 -90796 -52750 -82606
7391 -82606 -172059 -151346 -72199 -28615 -39167 -38655 -55118 -113059 -80392 -36369 -10368 6035
7379 6035 -43963 -69464 -80834 -76304 -61951 -83034 -43525 15361 19773 34553 41449 75139 81364
7366 81364 136427 74679 29948 48216 82527 65191 30305 -16900 -56165 -44926 -50497 -45686
7354 -45686 25869 49359 42395 32063 27615 7372 -14597 -42552 -62179 -28162 -28018 -30207 -32515
7341 -32515 -60396 -46669 -25223 -3183 1407 9959 -1689 -32796 -44927 -32061 16680 53370
7329 53370 -23335 -51941 -99772 -106431 -112889 -79695 -840 44065 81412 64497 47358 -4534
7317d534J5945r732J9760j702j3829k2343L692j5719O584l918N102J0181K3503
7304A2990j9044L8998l3421n6616o135K2739j2411m75K6094m33j6505p6677k5792
7291a46688P2777N9796o0423j0181K2262k23l2042J6034J6868O391L5030J4619
7279e780O2827K8409l9243r3113l2734M0542P1367j0722k7313p323q2574O139
7267h9518K6357j4164K2294J4786k2030j6732r24L6180m9064k4034O9845Q0540
7255C3536J832n2282L317J0470j1341m314M9223j224n3016k5841L9969L5108j9004
7242F433O400k9690J9970M5753J0750l1932l0237l0396J4233j6806K0702k0186
7230c5006o9299N653Q475j9066j4444M6927j206m85n800k5818n0477R214M7989
$$ plain form
7317 -4534 11411 1679 21439 19737 5908 -16435 -12743 -28462 -21878 -25796 -20694 -10513 12990
7304 12990 -6054 32944 -477 -57093 -63228 -40489 -52900 -53375 -27281 -27714 -44219 -120896 -146688
7291 -146688 -73911 -14115 -74538 -84719 -62457 -62680 -94722 -78688 -61820 -55429 -20399 -5780
7279 -5780 57047 85456 46213 -46900 -79634 -39092 32275 21553 -5760 -13083 -95657 -89518
7267 -89518 -63161 -77325 -55031 -40245 -62275 -79007 -79931 -43751 -92815 -116849 -47004 33536
7255 33536 35368 -16914 -13597 -3127 -14468 -18782 30441 29217 -23799 -49640 -9671 25437 6433
7242 6433 12833 -16857 3113 48866 59616 27684 -2553 -32949 -18716 -35522 -14820 -35006
7230 -35006 -104305 -98652 -90177 -109243 -123687 -76760 -77966 -78451 -84251 -110069 -160546 -151332 -103343
7217a03343P3493M8182p32L4982K0748m63j7669k8457l4444K4486j2018P198K8699
7204D0662M8471o5580q4889N241N412n50j3721j5135J3208N7655J0922k9536K2985
7191d855K4383p591k3674K1611l0391p2212M9474L2596k0571L1618n9645L1321
7179b7936L2214J7233l0491m8602M1774n7774m9766k211M024K0013O5698q871
7167d4695K0087N2212L2029N1097M355p3560m9549k5422j838k8113J795N2541
7155i061N2422J4948l8249J7555K3056m1439m5269m9914K4448N233M706n4422
7143i5986m2798M2219K1676J2704P943j943R659K789R436j4163m1055o931P082
7130h9368K1689R474M889o187k0498n4719K2752N5406N7961J527k7924m014l205
$$ plain form
7217 -103343 -29850 18332 17600 52582 73330 72867 55198 26741 -7703 16783 4765 11963 40662
7204 40662 89133 23553 -61336 -56095 -50683 -51233 -64954 -80089 -66881 -9226 1696 -27840 -4855
7191 -4855 19528 11937 -11737 9874 -20517 -92729 -43255 -10659 -31230 388 -59257 -27936
7179 -27936 4278 21511 -8980 -57582 -15808 -73582 -123348 -125559 -121535 -101522 -35824 -44695
7167 -44695 -24608 27604 59633 110730 115085 41525 -8024 -33446 -35284 -63397 -61602 -9061
7155 -9061 43361 58309 20060 37615 60671 19232 -26037 -75951 -51503 -46270 -41564 -95986
7143 -95986 -138784 -96565 -74889 -62185 -54242 -56185 -46526 -43737 -34301 -48464 -89519 -96450 -89368
7130 -89368 -67679 -58205 -53316 -59503 -80001 -134720 -111968 -56562 1399 2926 -24998 -29012 -32217
7117c2217J5804r326K1891L0320k2513l7618R847K2538o8045K4128Q2682K0546
7105E8037j3776j8109q705K3799n414O004l4792l9173n7500j639M9323K4882M057
7092a3006m1876L957K3793N3390L74R364K7598m0740q800K2284R380n740l5753
7079D225o9618j3820M9385n698L5949p240K9988j577l2606j6437n1607O419L9942
7066c2695J9566L7045M033o3806k4244K0987k9504m2875k8645P5731P8714n4021
7054c9714p227m1253k3850L8549R449n1223j4794L1474P1680O1052O223n0226
7042i860j7489k8294k9917M8380L0196j7489J6314L0618K3113M2617m0106k7443
7030B0640q006j619J349o3219J7807O976k8309J7071L9690j4395l7977l4472j1123
$$ plain form
7117 -32217 -16413 -25739 -3848 26472 3959 -33659 -23812 -1274 -69319 -45191 37491 58037
7105 58037 44261 26152 17447 41246 35832 41836 7044 -32129 -89629 -91268 -41945 -17063 -13006
7092 -13006 -54882 -50925 -27132 26258 26632 35996 63594 22854 14054 36338 45718 39978 4225
7079 4225 -65393 -79213 -29828 -35526 423 -6817 23171 21594 -11012 -27449 -79056 -72637 -32695
7066 -32695 -13129 23916 27949 -35857 -60101 -39114 -68618 -111493 -140138 -64407 14307 -39714
7054 -39714 -46941 -88194 -112044 -73495 -64046 -115269 -130063 -98589 -26909 34143 40366 -9860
7042 -9860 -27349 -55643 -85560 -37180 -6984 -24473 -8159 22459 45572 88189 48083 20640
7030 20640 12634 11015 12364 -50855 -33048 -26072 -54381 -37310 2380 -12015 -49992 -84464 -95587
$$ [...]
##END NTUPLES=NMR SPECTRUM
##END=
