##TITLE=Analysis number 307390
Compound Code cc 42010
Book Reference 437/1
Project Code adrs
Chemist Name wendyb
##JCAMPDX= 6.0         $$ Bruker NMR JCAMP-DX V2.0
##DATA TYPE= NMR SPECTRUM
##DATA CLASS= NTUPLES
##ORIGIN= Bruker BioSpin GmbH
##OWNER= NMR
$$ XWIN-NMR		Version 3.5
$$ Fri Apr 29 11:07:01 2005 GMT Daylight Time (UT+1h)  MAYBRIDGE\NMR@NMR_250MHZ
##.OBSERVE FREQUENCY= 250.131544655141
##.OBSERVE NUCLEUS= ^1H
##.ACQUISITION MODE= SIMULTANEOUS (DQD)
##.ACQUISITION SCHEME= undefined
##.AVERAGES= 16
##.DIGITISER RES= 18
##SPECTROMETER/DATA SYSTEM= dpx250
##.PULSE SEQUENCE= zg30
##.SOLVENT NAME= CDCl3
##.SHIFT REFERENCE= (INTERNAL, CDCl3, 0, 16.522)
##AUDIT TRAIL= $$ (NUMBER, WHEN, WHO, WHERE, WHAT)
$$ ##TITLE= Audit trail, XWIN-NMR		Version 3.5
$$ ##JCAMPDX= 5.01
$$ ##ORIGIN= Bruker BioSpin GmbH
$$ ##OWNER= NMR
$$ C:\u/data/dgb/nmr/ADRS/2540/pdata/1/auditp.txt
$$ ##AUDIT TRAIL=  $$ (NUMBER, WHEN, WHO, WHERE, WHAT)
(   1,<2005-04-29 11:06:43.93 +100>,<MAYBRIDGE\NMR>,<NMR_250MHZ>,
      <created by zg, POWCHK disabled, PULCHK disabled
       configuration hash MD5:
       62 19 C7 07 E1 42 D1 B7 37 6C 3D D0 77 39 F9 E6
       data hash MD5: 64K
       BB C2 64 DF CC 13 71 BD 17 83 AC 87 FE 12 A0 CE>)
(   2,<2005-04-29 11:06:54.13 +100>,<MAYBRIDGE\NMR>,<NMR_250MHZ>,
      <Start of raw data processing
       ef LB = 0.3 FT_mod = 6 PKNL = 1 SI = 32K 
       data hash MD5: 32K
       00 2E 07 77 DA FC B4 D5 20 74 E8 4A 15 EF C8 EB>)
(   3,<2005-04-29 11:06:56.13 +100>,<MAYBRIDGE\NMR>,<NMR_250MHZ>,
      <apk 
       data hash MD5: 32K
       95 8E D0 06 DF F9 74 17 2C F0 CC 91 C8 43 64 46>)
(   4,<2005-04-29 11:06:56.88 +100>,<MAYBRIDGE\NMR>,<NMR_250MHZ>,
      <abs ABSG = 5 
       data hash MD5: 32K
       E4 EF A5 F5 A9 35 2B CA A9 83 4B 47 AD F4 5C 86>)
$$ ##END=
$$ 
$$ hash MD5
$$ 80 38 62 D2 38 40 4E 24 60 15 17 F2 C9 F0 C7 72
##$RELAX= 
##$RELAX= 
##$RELAX= 
##$RELAX= 
##$RELAX= 
##$RELAX= 
##$RELAX= 
$$ Bruker specific parameters
$$ --------------------------
##$DU= <C:\u>
##$EXPNO= 2540
##$NAME= <ADRS>
##$PROCNO= 1
##$TYPE= <nmr>
##$USER= <dgb>
##$AMP= (0..31)
100 100 100 100 100 100 100 100 100 100 100 100 100 100 100 100 100 100 
100 100 100 100 100 100 100 100 100 100 100 100 100 100 
##$AQSEQ= 0
##$AQ_mod= 3
##$AUNM= <au_zg>
##$AUTOPOS= <17 >
##$BF1= 250.13
##$BF2= 250.13
##$BF3= 250.13
##$BF4= 250.13
##$BF5= 500.13
##$BF6= 500.13
##$BF7= 500.13
##$BF8= 500.13
##$BYTORDA= 1
##$CFDGTYP= 0
##$CFRGTYP= 5
##$CHEMSTR= <none>
##$CNST= (0..31)
1 1 145 1 1 1 1 1 1 1 1 1 1 1 1 1 1 1 1 1 1 1 1 1 1 1 1 1 1 1 1 1 
##$CPDPRG= <>
##$CPDPRG1= <>
##$CPDPRG2= <>
##$CPDPRG3= <>
##$CPDPRG4= <mlev>
##$CPDPRG5= <mlev>
##$CPDPRG6= <mlev>
##$CPDPRG7= <mlev>
##$CPDPRG8= <mlev>
##$CPDPRGB= <>
##$CPDPRGT= <>
##$D= (0..31)
0 1 0 0 0 0 0 0 0 0.06 0 0 0 0 0 0 0.0002 0 0 0 0 0 0 0 0 0 0 0 0 0 0 
0 
##$DATE= 1114769202
##$DBL= (0..7)
120 120 120 120 120 120 120 120 
##$DBP= (0..7)
150 150 150 150 150 150 150 150 
##$DBP07= 0
##$DBPNAM0= <>
##$DBPNAM1= <>
$$ [...]
##$SUBNAM7= <"">
##$SUBNAM8= <"">
##$SUBNAM9= <"">
##$SW= 20.6930455092707
##$SWIBOX= (0..15)
0 0 3 0 0 0 0 0 0 0 0 0 0 0 0 0 
##$SW_h= 5175.983436853
##$TD= 65536
##$TD0= 1
##$TE= 295.16
##$TE2= 300
##$TE3= 300
##$TEG= 300
##$TL= (0..7)
0 120 120 120 120 120 120 120 
##$TP= (0..7)
150 150 150 150 150 150 150 150 
##$TP07= 0
##$TPNAME0= <>
##$TPNAME1= <>
##$TPNAME2= <>
##$TPNAME3= <>
##$TPNAME4= <>
##$TPNAME5= <>
##$TPNAME6= <>
##$TPNAME7= <>
##$TPOAL= (0..7)
0.5 0.5 0.5 0.5 0.5 0.5 0.5 0.5 
##$TPOFFS= (0..7)
0 0 0 0 0 0 0 0 
##$TUNHIN= 0
##$TUNHOUT= 0
##$TUNXOUT= 0
##$USERA1= <user>
##$USERA2= <user>
##$USERA3= <user>
##$USERA4= <user>
##$USERA5= <user>
##$V9= 5
##$VALIST= <valist>
##$VCLIST= <CCCCCCCCCCCCCCC>
##$VD= 0
##$VDLIST= <DDDDDDDDDDDDDDD>
##$VPLIST= <PPPPPPPPPPPPPPP>
##$VTLIST= <TTTTTTTTTTTTTTT>
##$WBST= 1024
##$WBSW= 4
##$XGAIN= (0..3)
0 0 0 0 
##$XL= 0
##$YL= 0
##$YMAX_a= 405204
##$YMIN_a= -566900
##$ZGOPTNS= <>
##$ZL1= 120
##$ZL2= 120
##$ZL3= 120
##$ZL4= 120
##$ABSF1= 16.522
##$ABSF2= -4.171173
##$ABSG= 5
##$ABSL= 3
##$ALPHA= 0
##$AQORDER= 0
##$ASSFAC= 0
##$ASSFACI= 0
##$ASSFACX= 0
##$ASSWID= 0
##$AUNMP= <proc_1d>
##$AZFE= 0.1
##$AZFW= 0.1
##$BCFW= 0
##$BC_mod= 0
##$BYTORDP= 0
##$COROFFS= 0
##$CY= 12.5
##$DATMOD= 1
##$DC= 0
##$DFILT= <>
##$DTYPP= 0
##$F1P= 14.0000005364418
##$F2P= -0.99999901652339
##$FCOR= 0.5
##$FTSIZE= 32768
##$FT_mod= 6
##$GAMMA= 0
##$GB= 0
##$INTBC= 1
##$INTSCL= 1
##$ISEN= 128
##$LB= 0.3
##$LEV0= 0
##$LPBIN= 0
##$MAXI= 10000
##$MC2= 0
##$MEAN= 0
##$ME_mod= 0
##$MI= 0
##$NCOEF= 0
##$NC_proc= -5
##$NLEV= 6
##$NOISF1= 0
##$NOISF2= 0
##$NSP= 0
##$NTH_PI= 0
##$NZP= 0
##$OFFSET= 16.522
##$PC= 1
##$PHC0= -74.28439
##$PHC1= 7.949956
##$PH_mod= 1
##$PKNL= yes
##$PPARMOD= 0
##$PSCAL= 4
##$PSIGN= 0
##$REVERSE= no
##$SF= 250.13
##$SI= 32768
##$SIGF1= 0
##$SIGF2= 0
##$SINO= 400
##$SIOLD= 32768
##$SREGLST= <1H.CDCl3>
##$SSB= 0
##$STSI= 32768
##$STSR= 0
##$SW_p= 5175.98343685301
##$SYMM= 0
##$S_DEV= 0
##$TDeff= 65536
##$TDoff= 0
##$TI= <Analysis number 999999
Compound Code 99
Book Reference 9
Project Code 9>
##$TILT= no
##$TM1= 0
##$TM2= 0
##$TOPLEV= 0
##$USERP1= <user>
##$USERP2= <user>
##$USERP3= <user>
##$USERP4= <user>
##$USERP5= <user>
##$WDW= 1
##$XDIM= 32768
##$YMAX_p= 325047264
##$YMIN_p= -333172
$$ End of Bruker specific parameters
$$ ---------------------------------
##NTUPLES= NMR SPECTRUM
##VAR_NAME=  FREQUENCY,     SPECTRUM/REAL,   SPECTRUM/IMAG
##SYMBOL=    X,             R,               I
##VAR_TYPE=  INDEPENDENT,   DEPENDENT,       DEPENDENT
##VAR_FORM=  AFFN,          ASDF,            ASDF
##VAR_DIM=   32768,         32768,           32768
##UNITS=     HZ,            ARBITRARY UNITS, ARBITRARY UNITS
##FACTOR=    0.157963299565203, 1,           1
##FIRST=     4132.6476996994, 0,             0
##LAST=      -1043.33573715361, 0,           0
##MIN=       -1043.33573715361, -333172,     0
##MAX=       4132.6476996994, 325047264,     0
$$ Real data points
##PAGE= N=1
##DATA TABLE= (X++(R..R)), XYDATA
$$ [...]
17904I9667263J4427983J3220799R314536r336234l1454742k7147658j6048546
17897E2643401r314967n591087l417687k073867j119330k65397J82032J85511
17889C1228609l13052j010576j305775r77869q42148r06442r54838r75119q44904
17880B3097886n46934l57947k00395L2368K27971N04016R45154J466277K092437
17871B7260833K557248K564602J909095N31935j095658j135359j12968Q63720
17863C3343448J562527K275115K954727M020261N941944R052330J3864017K1090369
17855I4104738K9139113L2273534K4603642O85915l4980950l7107413k1781640
17848H6936939j0991325m558337Q8348L997739P250486Q439796O476349k45065
$$ y = [99667263, 114095246, 127316045, 136630581, 127294347, 95839605, 68691947, 52643401, 43328434, 37737347, 34319660, 32245793, 31126463, 30861066, 31043098, 31228609, 30915557, 29904981, 28599206, 27621337, 26779189, 25872747, 24917909, 23942790, 23097886, 22550952, 22193005, 21992610, 22024978, 22252949, 22756965, 23702119, 25168396, 27260833, 29818081, 32382683, 34291778, 34823713, 33728055, 32592696, 32479728, 33343448, 34905975, 37181090, 40135817, 44156078, 50098022, 59150352, 73014369, 94104738, 123243851, 155517385, 180121027, 180806942, 145825992, 108718579, 86936939, 75945614, 71387277, 71475625, 75473364, 82723850, 91163646, 97639995, 97394930]
17840I7394930p437931n619194m87083M437838R247671J4836302K1129051K5156808
17832A58658392K1888052O682827j5869928k8510958k2482155j1125440k037087
17825A07203703N569733J2271193J6039272J3527588K208842j7528921k3209055
17818A16082355j4652244o119385M12302O010538J1031464J4296632J3676039
17811A40737701O525735o731771j6522483j5422113r144262l029323K178952P135227
17803A05727663J2361041J6886964J8169122J3807171M117877k191118O15171
17796A69493891L443226j808838j3531443j8325111j1248007j306381M918197
17789A31635534O369368K025398J275033N864548M686940m924801j5804450j5827314
$$ y = [97394930, 89956999, 84337805, 83850722, 88288560, 97536231, 112372533, 133501584, 158658392, 180546444, 187229271, 171359343, 142848385, 120366230, 109240790, 107203703, 112773436, 125044629, 141083901, 154611489, 156820331, 139291410, 116082355, 101430111, 95310726, 95723028, 101733566, 112765030, 127061662, 140737701, 147263436, 140531665, 124009182, 108587069, 99442807, 96413484, 98592436, 105727663, 118088704, 134975668, 153144790, 166951961, 171069838, 168878720, 169493891, 172937117, 171128279, 157596836, 139271725, 128023718, 126717337, 131635534, 138004902, 140030300, 141305333, 147169881, 151856821, 146932020, 131127570, 115300256]
17781A15300256q326094k732307k858349r472484j5051965j3482772r150041n897106
17773D8329138l951880k860054k088365j541175j531612j960836k724056k798209
17765B8872951k497013k157775j773330j704191j842555j793428j572239j372118
17757A4160302j229194j101000j043052r72027q66320p46126o59297o93427o99221
17748F150638o16060m31782l51847k84615k94467l27577k61503l01402l43986
17739B937399l06833k53902k37435j35170n8247n5705K2992P5806N8709P7660
17729B125274j369j07653k08560k39420j95485j37960p7882q3286p5143j01362
17719H97154o2950n2887K2473k3272q1733n3151l1927q1275R289N8249N5778P7173
$$ y = [115300256, 106974162, 104241855, 101383506, 91911022, 76859057, 63376285, 54226244, 48329138, 44377258, 41517204, 39428839, 37887664, 36356052, 34395216, 31671160, 28872951, 26375938, 24218163, 22444833, 20740642, 18898087, 17104659, 15532420, 14160302, 12931108, 11830108, 10787056, 9815029, 8948709, 8202583, 7543286, 6849859, 6150638, 5534578, 5102796, 4750949, 4466334, 4171867, 3844290, 3582787, 3281385, 2937399, 2630566, 2376664, 2139229, 2004059, 1945812, 1890107, 1913099, 1988905, 2047614, 2125274, 2123905, 2016252, 1807692, 1568272, 1372787, 1234827, 1156945, 1073659, 998516, 897154, 834204, 781317, 803790, 780518, 698785, 645634, 613707, 532432, 541721, 599970, 655748, 732921]
17707G32921k0941q9040k3045n46K7622o8103j06434J3422K1706J9652L6056K3975
17695E67245m0008j6776L566n6817l8287L2920l7928l7910L6200J2519J4690M9821
17683D89235K1942J2626J11209R4873P8226J42345K4676r2766n1092q7032o4590
17672F79652j9396m2483K7928L2176m8555P5159J36213M8437M2923k7061j65030
17661G39963j06512m5479N989j6931j3166P350m9973l2729N2535M3418k6915N9459
17649F17009j260o7257n8060j1858l3471l043Q933n2395m5211k622l8514K6181
17637C38432K8221k889M3981J9148J6752o0669Q87K3236N7256L2351O4094J03896
17625F64696J02493q498j13639j23105l9819n881m1513l6931J5680L6361m3775
$$ y = [732921, 711980, 622940, 599895, 599349, 626971, 558868, 452434, 465856, 487562, 507214, 543270, 567245, 527237, 510461, 514027, 457210, 418923, 451843, 413915, 376005, 412205, 424724, 439414, 489235, 511177, 523803, 635012, 729885, 808111, 950456, 975132, 882366, 831274, 744242, 679652, 660256, 617773, 645701, 677877, 629322, 704481, 840694, 889131, 932054, 904993, 739963, 633451, 587972, 593961, 577030, 563864, 571214, 521241, 488512, 541047, 584465, 557550, 617009, 615749, 548492, 490432, 478574, 445103, 442060, 450993, 398598, 353387, 350765, 312251, 338432, 366653, 363764, 407745, 426893, 443645, 382976, 383863, 407099, 464355, 496706, 560800, 664696, 767189, 758691, 645052, 521947, 482128, 476247, 434734, 397803, 413483, 449844, 406069]
17614D06069N8092Q0076Q0423Q3313K5117j7499l144l7096l6832L5912j3557m3274
17602F17600o1902l9847l9528P787J8403M0247k7683p1110n8799m7393M3580M2336
17590D23691k6734p9843j1307N1816k5150K3802r66M0555M7557O0660M9822j4396
17578E39507k7820N3762n633r176J34169J23975P6454k2856p4746r2230J063R0230
17566G86699P6188P7372J00207j0993n2888L0906P6723n888n1728p8091j07935
17555H40572o6499K5910N4080K3574j6941m3484l0798j438R108N8260M0780n0599
17543H42525n8268K0126N220l726K5334L5125P0406N1385K9570J32620K22589
17532A372906K31015K62243L60745L30310Q4560j44830j92516o7986j4722j55940
$$ y = [406069, 464161, 544237, 624660, 707973, 733090, 715591, 712447, 675351, 638519, 674431, 660874, 617600, 555698, 515851, 476323, 484110, 502513, 542760, 515077, 443967, 385168, 337775, 381355, 423691, 396957, 317114, 305807, 357623, 332473, 356275, 355309, 395864, 443421, 504081, 553903, 539507, 511687, 565449, 559816, 550640, 684809, 808784, 885238, 862382, 787636, 695406, 696469, 786699, 862887, 940259, 1040466, 1029473, 976585, 1007491, 1084214, 1078326, 1026598, 948507, 840572, 774073, 799983, 854063, 877637, 860696, 817212, 786414, 784976, 794084, 852344, 893124, 842525, 784257, 804383, 809603, 805877, 831211, 866336, 936742, 988127, 1017697, 1150317, 1372906, 1603921, 1866164, 2226909, 2557219, 2641779, 2496949, 2304433, 2236447, 2221725, 2065785]
17522B065785k31228j99264r5930l3463J0855Q7475J12500J17563N0108L8590
17512A922991M5393M9449N9248k9146k9356L317p6772r3765p945Q6614J29774
17501B059802J43590J00262Q4544O5309R3888J51888K80675L26428L29970L06976
17491C943332L29329L11755K22173K92911L83591M55242M55731M46703N06539
17482G347306N70270O17578O56925O99023P98922R58207J200974J353636J521950
17473A5724791J739147K070386K817348M029884N893702Q316628J0346097J0433070
17465F1371053O881645j064551q451796q752338m857577q35878K791319O237380
17457E3319257Q864604R425895O678741M47352m150521k113542K121275L479824
$$ y = [2065785, 1834557, 1635293, 1539363, 1505900, 1516755, 1604230, 1716730, 1834293, 1884401, 1922991, 1968384, 2017833, 2077081, 2047935, 2018579, 2021896, 1945124, 1851359, 1843414, 1930028, 2059802, 2203392, 2303654, 2388198, 2453507, 2547395, 2699283, 2979958, 3306386, 3636356, 3943332, 4272661, 4584416, 4806589, 5099500, 5483091, 5938333, 6394064, 6840767, 7347306, 7917576, 8535154, 9192079, 9891102, 10690024, 11648231, 12849205, 14202841, 15724791, 17463938, 19534324, 22351672, 26381556, 32275258, 40591886, 50937983, 61371053, 68252698, 67188147, 58736351, 49984013, 45126436, 44290558, 47081877, 53319257, 62183861, 71609756, 78288497, 78735849, 74585328, 72471786, 74593061, 78072885]
17449G8072885J36490o548827j0154442p977472l785422K50371L654193O050040
17441E9697816O217212K835066m006085r874709r834832o892694m383926k755697
17433C1002151j851139j428281j104770q15050n28479k68320j1021K37325M64507
17424B5696923O99231R88370J486568K453908M183521O412531Q196391Q044705
17416E8162148M479687k740402q377895p782171m257714q64535K065561M701214
17408D5385893O631543O905751M554439l87608l947409k206677J747330L731031
17400F2414293J881665l949682r124622q231642m511418j120111J815141M253831
17392D3427455N379743M108216m64365o827849r320772p288327m721254l044365
$$ y = [78072885, 78209375, 71660548, 61506106, 53528634, 49743212, 49993583, 53647776, 59697816, 65915028, 68750094, 64744009, 54869300, 45034468, 38141774, 33757848, 31002151, 29151012, 27722731, 26617961, 25802911, 25274432, 25006112, 24995091, 25232416, 25696923, 26396154, 27384524, 28871092, 31325000, 35508521, 41921052, 50117443, 58162148, 62641835, 59901433, 51523538, 43741367, 39483653, 38619118, 40684679, 45385893, 52017436, 58923187, 63477626, 63090018, 59142609, 56935932, 58683262, 62414293, 64295958, 60346276, 51221654, 42990012, 38478594, 37358483, 39173624, 43427455, 48807198, 52915414, 52451049, 45623200, 36302428, 29014101, 24292847, 21248482]
17384B1248482k054433j606865j420082j332971j230628j076829q45814n91786
17376A1089074n21318m35964m50478n73694n62128o04160n84929n87433o51794
17367F117176o51430n45749n27606m89629l95624l61614k94702k64800k65600
17358B320422k68662k59767j68279j47697j00823j65236j57107j04130K6345k2440
17348I52626j04817n4213N3367L8308K6926L7119L8032m1218r2226j02428j22477
17337F28999j00941n7679k1367l6515k9753j6839j5906j6637j6623L8298j5393
17326C39644m8284j6015K6338K7126N1958P9039M8167K8327N4335Q9325Q2084
17315G62044j9620j27180n9347l0260J7149J07209L1765n2652m5269M3955k715
$$ y = [21248482, 19194049, 17587184, 16167102, 14834131, 13603503, 12526674, 11680860, 11089074, 10567756, 10131792, 9681314, 9107620, 8545492, 7941332, 7356403, 6768970, 6117176, 5465746, 4919997, 4392391, 3902762, 3507138, 3145524, 2850822, 2586022, 2320422, 2051760, 1791993, 1623714, 1476017, 1375194, 1209958, 1052851, 948721, 975066, 952626, 847809, 793596, 846963, 885271, 912197, 949316, 987348, 946130, 853904, 751476, 628999, 528058, 470379, 449012, 412497, 382744, 365905, 349999, 333362, 316739, 355037, 339644, 291360, 275345, 301683, 328809, 380767, 459806, 507973, 536300, 590635, 679960, 762044, 742424, 615244, 555897, 525637, 542786, 649995, 681760, 629108, 583839, 627794, 625079]
17304F25079n8419L0346P571K5293M395k5315o4942j4158L1379N9062l0911k514
17292E86866M7750L9814L9868k274J3883M3907K7512r28l8793q2466m4692l2557
17280E97890q6711J4373J31796R4824N7274R1808J1061J1839j7241m0985o4423
17269H01505l9767k1950n3131p7815m5865q808O2845P7428Q4173L9227l019m5346
17257G69477o4623p7375K7881Q551q9183l8730l3360l4404J0607j1819n2337k5999
17245C88686O605n7820p1691k2218l5234n8962K915m9295j4125k4807P630R793
17233H1477J3851n411k1491j5500o0486K7237M2031n1380o4812l9780K6002j0851
17221g9113l2908K4895L115J5043j3760k9908l5702K3806J598Q300L0010N0499
$$ y = [625079, 566660, 597006, 604577, 629870, 634265, 608950, 544008, 529850, 561229, 620291, 589380, 586866, 634616, 674430, 714298, 712024, 725907, 769814, 797326, 796398, 757605, 675139, 630447, 597890, 511179, 525552, 657348, 752172, 809446, 901254, 912315, 924154, 906913, 865928, 801505, 761738, 739788, 686657, 608842, 562977, 554169, 617014, 694442, 778615, 817842, 814823, 769477, 704854, 627479, 655360, 663911, 574728, 535998, 502638, 468234, 478841, 467022, 414685, 388686, 395291, 337471, 265780, 243562, 208328, 149366, 152281, 102986, 88861, 64054, 71684, 81477, 95328, 89917, 68426, 52926, -7560, 19677, 61708, 10328, -54484, -94264, -68262, -79113, -112021, -87126, -84011, -68968, -82728, -112636, -148338, -124532, -122934, -114634, -84624, -34125]
17209c4125m086n9763j8841k8973K4753N5493K4761l5487j7361K6325K2131R605
17197c5568k6560m1238k1786j8158N19J7843O9257J5346l3223m8858n2085M9555
17185a24956M3868M6k7940k9068j7846k8659L782L3016K8296j3739l66j448l8704
17172a73718k1096k3742J4492j7334N2625L9420q737K148L4077q9353J3519K727
17160a74972N7040K3009m3043j415P944L302J2347O220J3865o6382m9816o941
17148b18842R996J5242j1398l3318K5029J0292M7255l0870j7355K8351k4856J344
17136a99130K0217N1544J9569k6400k7929o3618p7932l374K1333J5044l7624R607
17124b98693l3884J4463N6260k1342k3134q351O1433L8544N6073p8538r3755O854
$$ y = [-34125, -38211, -97974, -116815, -145788, -121035, -65542, -40781, -76268, -93629, -67304, -45173, -35568, -62128, -103366, -125152, -143310, -142791, -124948, -55691, -40345, -73568, -122426, -174511, -124956, -81088, -81042, -108982, -138050, -155896, -184555, -180773, -147757, -119461, -133200, -133566, -135014, -173718, -194814, -218556, -204064, -221398, -168773, -129353, -138090, -135942, -101865, -191218, -177699, -174972, -117932, -94923, -137966, -139381, -131437, -128135, -115788, -109568, -95703, -162085, -211901, -218842, -208846, -193604, -205002, -238320, -213291, -202999, -155744, -186614, -203969, -175618, -200474, -199130, -178913, -127369, -107800, -134200, -162129, -225747, -303679, -307053, -285720, -270676, -308300, -298693, -332577, -318114, -261854, -283196, -306330, -314681, -253248, -214704, -158631, -237169, -330924, -324070]
17112c24070J06595L6436M3754P911L9573j0902l8875j5882o0049Q592O7227N7202
17100h2488O4150O734p6653o2221M942J8591n1954N513N2940M4892k5047o0916
17088a61517j3592o403j1736N0376K8010o8030n8020r29P848K6238L3358N7906
17076a16491M5733l8103n2143o9866K3913K3368J7063L9225K9901l2314l7530
17065a67244j7061K0231K2488n0117l0075N4092N1451M5281M9563m1885K3597
17054c9679L7103K3594j7415p6754o6213j565J4268j2449j2487P407J9960K7343
17042i6887K7066k0436o3517K0633P6660L5208J2759j5642j5023J2319J1839J9205
17030D184l2267k6721n0248n3938K0166K1904j4269k2657K9497K3894l7963Q49
$$ y = [-324070, -217475, -181039, -137285, -129374, -89801, -100703, -139578, -155460, -215509, -206917, -139690, -82488, -18338, -11604, -88257, -150478, -145536, -126945, -178899, -173386, -120446, -75554, -100601, -161517, -175109, -181512, -193248, -142872, -114862, -182892, -240912, -241841, -233993, -207755, -174397, -116491, -70758, -108861, -161004, -230870, -206957, -183589, -166526, -127301, -97400, -129714, -167244, -184305, -164074, -141586, -191703, -221778, -167686, -116235, -70954, -21391, -63276, -39679, -2576, 21018, 3603, -73151, -139364, -140929, -126661, -139110, -151597, -144190, -124230, -96887, -69821, -90257, -153774, -133141, -56481, -21273, -8514, -24156, -39179, -26860, -15021, 4184, -28083, -54804, -105052, -158990, -138824, -116920, -131189, -153846, -124349, -100455, -138418, -137569]
17018a37569k0036K8575O531K6773l0184J491L4852M4451Q4256N5359n9876j12157
17006g7534k9352Q6385M2119K1889j4919q4325n0732J7077O47m3394j4998R469
16994a37668l097l2791O4038Q5558L8114p637o095j7703o579L322q84l5928k9077
16981h6427M1395K0684j3867m1004K2714J8589r648k1044O602J8950j4340l9774
16969i7170R449J7951Q4656m5215l6390j0479l401M0169L1408L8699L8409j5609
16957E2477j3404l768M0194O9324M4809J2598k9332j1161l9033J9675Q4236L3825
16945B60440n0813k92L4844Q892p1813j2759J9388k6566k0299L868J3680j9582
16933A38988M6095M1643M3997J5008k2077l7511n5599j9475j0845K3935q706n170
$$ y = [-137569, -157605, -129030, -122499, -95726, -125910, -124419, -89567, -45116, 39140, 94499, 34623, -77534, -106886, -20501, 21618, 43507, 28588, -55737, -106469, -89392, -88745, -132139, -147137, -137668, -140765, -173556, -109518, -23960, 14154, 6517, 422, -17281, -23860, -20538, -21422, -57350, -86427, -45032, -24348, -38215, -79219, -56505, -37916, -47564, -68608, -62006, -43056, -57396, -97170, -87721, -69770, 14886, -30329, -66719, -77198, -80599, -40430, -9022, 29677, 68086, 52477, 39073, 35305, 75499, 144823, 189632, 202230, 172898, 161737, 122704, 142379, 226615, 260440, 209627, 209335, 244179, 253071, 181258, 168499, 187887, 161321, 141022, 144890, 158570, 138988, 185083, 226726, 270723, 285731, 263654, 226143, 170544, 151069, 140224, 164159, 155453, 150283]
16921A50283j923l9448o1709K7124K3489j2837k2224l1704j3536k8151N780p694
16909a2550J0762K3381P0435Q0424O2927k2348j1190n5m0473J9665J9207j3201
16897A86984n3606j647J9355O8769K064r1058O500N6353L4319K1205j6113J5423
16885B48548m8861k1031n999k6875k4935J5637L8088L6614n242k6886p516k2578
16873A48964q8915m572l8257n3226M1680L5856l3975l2736j4032O3083K9554q9263
16861c5839j742K1663k0598l2053Q430M2165O606l3340r633m240Q289m2351m1272
16848a33915J8475J444L6609l7883L0300N5432J325R246m6407J6025N2993j1149
16836g505k9786j1025l9305M783P768j1257l986j2778K2522k1737m6100l4312
$$ y = [150283, 148360, 108912, 47203, 74327, 97816, 84979, 62755, 31051, 17515, -10636, -4856, -12550, -1788, 21593, 92028, 172452, 235379, 213031, 201841, 201786, 161313, 180978, 200185, 186984, 133378, 131731, 151086, 219855, 221919, 130861, 137361, 193714, 228033, 249238, 233125, 248548, 199687, 178656, 172657, 145782, 120847, 136484, 174572, 211186, 205944, 179058, 171542, 148964, 60049, 55477, 17220, -36006, 5674, 41530, 7555, -25181, -39213, 23870, 53424, -35839, -37581, -15918, -36516, -68569, -60139, -17974, -11368, -44708, -54341, -58581, -50292, -92643, -133915, -115440, -113996, -77387, -115270, -84970, -29538, -28213, -18967, -65374, -49349, 3644, -7505, -37291, -48316, -87621, -82838, -75070, -86327, -90313, -103091, -80569, -102306, -148406, -182718]
16824a82718J0672n073P007K4165n261N6189M9883m3657l9069Q080K0179K1948
16812g7655K0226O24m731L784j5139l895K8992J0976L2892k0417l5353k6923o936
16799i3555K3687m4134K1062L582P604L7677p7509J5605J2267n2049M3653O5698
16787c6412l8137j0767L4956K1711J195j4706J3515J4962k1130j4528k7189k8820
16775a05350l2069j4904J7029O43J3798L2112O5029N6085o9918K4094j5234k210
16763c0895L8330j4121j3028M1459l4090l2829J3839k2865m3916o249K2496m0645
16751a22514j479N176k5566L0627n374j9877N393P5349j4589j6684m041K6253
16739f7326Q806k4998k0989K1912J1834k0701P5872K600l3508j5340l450k589
$$ y = [-182718, -172046, -177119, -170112, -145947, -151208, -95019, -45136, -88793, -127862, -119782, -99603, -77655, -57429, -56805, -61536, -57752, -72891, -76786, -47794, -36818, -3926, -24343, -59696, -86619, -93555, -69868, -114002, -92940, -89358, -81754, -44077, -121586, -105981, -93714, -145763, -102110, -36412, -74549, -85316, -50360, -28649, -27454, -42160, -28645, -13683, -34813, -49341, -76530, -105350, -137419, -152323, -135294, -134651, -120853, -88741, -23712, 32373, -37545, -13451, -28685, -30895, 7435, -6686, -19714, 21745, -12345, -45174, -31335, -54200, -98116, -104365, -81869, -122514, -123993, -118817, -144383, -113756, -119130, -139007, -133614, -58265, -72854, -89538, -93579, -67326, -58520, -83518, -104507, -82595, -70761, -91462, -15590, -12990, -46498, -61838, -65288, -67877]
16727f7877l1461K2097j4869m8080N065L8865M5062k2576N7800k040o7513n8472
16715a43999k6738K8576L1377J3628N050K1371L3811K1898Q638N900K8469j9703
16703H278p6353R183j5342N300J9947Q261n9503j62M4591M303N634j3091o0083
16690a19037L6094N2016J363m6940K2179J1145l1446l2557j723M4729k864J4007
16678e3034J5938m0299l2167O2150J9714j1551N8681m9651m8865K4291j2081l6106
16666a02980L838J8881J4753K9252n7873l5659N0502K4428J0162L4333L0929R41
16654B1507o5745j694J2522l471j4939J7905j4621k1373l2818O461M5815Q3732
16642C3281J8843j5868O828n629l8226o5195J1496M8800L401k7827L3558n0770
$$ y = [-67877, -99338, -77241, -92110, -140190, -135125, -96260, -51198, -73774, -15974, -18014, -85527, -143999, -170737, -142161, -110784, -97156, -92106, -70735, -36924, -15026, -6388, -488, 27981, 8278, -68075, -58892, -74234, -68934, -48987, -40726, -100229, -100391, -55800, -51497, -45863, -58954, -119037, -82943, -30927, -29564, -76504, -54325, -43180, -74626, -107183, -108906, -64177, -67041, -53034, -37096, -77395, -109562, -47412, -27698, -39249, 19432, -30219, -79084, -54793, -66874, -102980, -99142, -80261, -65508, -36256, -94129, -129788, -79286, -54858, -44696, -10363, 20566, 21507, -44238, -45932, -33410, -36881, -51820, -33915, -48536, -69909, -102727, -96266, -50451, 33281, 52124, 36256, 43084, 37455, -771, -65966, -54470, -5670, -2269, -30096, 3462, -47308]
16630d7308l5443n126m4688n1860J1945l81K6886L6969K912j9760k022p091L5910
16617i9057O5823N1632l9757j21485m1387j3074j3335N4175O7397M5497K2826
16606b0745M2095n9882m9955n8340l7914K9369M7688K4818M1804J7775K810k2668
16594d3145r432m1634p1961M973O7062M6684K7756l0798l8164J4052l2956J8705
16582h8858J9539R9541P4885q1925m8528p283k9544L9202L6108k2435n1429m4132
16570a04859L3971N1088L0945J8231j3961j3046n1913k8237J2632L0244N4205
16559A9300J4214r271q2377k2118J5118J3115q2020J6532M8491J8883j2687k054
16547f4874j7509J6872J2689j6025J4374m273l10p733j2619l3474n2534l2887
$$ y = [-47308, -82751, -87877, -132565, -184425, -172480, -172861, -145975, -109006, -106094, -125854, -127876, -134967, -99057, -33234, 18398, -21359, -142844, -184231, -197305, -210640, -156465, -89068, -43571, -20745, 21350, -38532, -88487, -146827, -184741, -155372, -107684, -82866, -41062, -23287, -20477, -43145, -52577, -94211, -166172, -161199, -94137, -47453, -19697, -50495, -88659, -74607, -107563, -88858, -69319, 30222, 105107, 23182, -25346, -32629, -62173, -22971, 13137, -9298, -60727, -104859, -70888, -19800, 11145, 29376, 15415, 2369, -49544, -77781, -65149, -34905, 19300, 33514, 24243, -58134, -80252, -65134, -52019, -134039, -117507, -69016, -50133, -62820, -64874, -82383, -65511, -52822, -68847, -54473, -58746, -59056, -66789, -79408, -112882, -165416, -198303]
16535a98303O288k6842J3202O1410k2858k7062O8135L3705n1751j5599j1634j4638
16523a85947p230Q9641N9406j3479k2737l1722m8015J4014K1643K0013q777j6985
16511a30175M42J2634n8095L677N46M045J8544N6618K9297k1543J5654L4524l0550
16498f4382n6258k0126M5436o833J6316L5332K9504j5845J0834J7380J0848n2753
16486e0547n1349l4205L1334l8457p649L8328N6442j9767k7306j694O923o977
16474a04924P813M0527L9899n509j3255n5697m236P069M0935j0374l3732J5105
16462g6379l0525k304N7020J3500n5447j4244k7991o3256L5894J1414L7465N4185
16450f0668J4725j3245J49j3428k0963n939Q9763l7671n4445R288k8240l0129
$$ y = [-198303, -192015, -218857, -205655, -144245, -167103, -194165, -126030, -92325, -144076, -159675, -171309, -185947, -193177, -103536, -44130, -57609, -80346, -112068, -160083, -146069, -124426, -104413, -113190, -130175, -129733, -117099, -175194, -171517, -170971, -166926, -148382, -91764, -62467, -84010, -68356, -33832, -64382, -120640, -140766, -95330, -102163, -85847, -50515, -21011, -36856, -26022, -8642, 2206, -50547, -101896, -136101, -104767, -143224, -150873, -112545, -56103, -75870, -103176, -104870, -97947, -104924, -97111, -56584, -16685, -22194, -35449, -91146, -95382, -88313, -47378, -57752, -91484, -76379, -106904, -109208, -52188, -38688, -94135, -108379, -136370, -199626, -163732, -152318, -114853, -60668, -45943, -59188, -59039, -72467, -93430, -99369, -9606, -47277, -101722, -92434, -120674, -150803]
16438a50803N897N5738J2848j6260j9265k4854n057L6979K15j0743L6824P5160
16426c321p175k5900L3839j2366p5464m501L9625K7735m7415l9773k845M4144
16414g3417J9189l3368l1909j6855R764J5462l6629J3003j0667q282K5944J6481
16402a11284J4700k0021n244K168K103k273N9563N8816p8323L5025l2019j9205
16390i5994K5562k8933M72j8204L0292j772K5409O188J7486O2o6606M4782l8155
16377i9411K1322L0108M6043q810m0040q953j6656J8026K0205q064K2101r965
16365c4094j6992L9802j8736l0515m9250j5469L0677j618j8147j7298M6920j303
16353h6023m3832p792N3486j3038l1718j8562p113L9727k3693L2999K7329K6029
$$ y = [-150803, -144906, -89168, -76320, -92580, -111845, -136699, -141756, -104777, -104562, -115305, -78481, -3321, -10496, -36396, -2557, -14923, -90387, -94888, -55263, -27528, -74943, -114716, -117561, -73417, -54228, -87596, -119505, -136360, -126596, -111134, -147763, -134760, -145427, -153709, -127765, -111284, -96584, -116605, -121849, -119681, -117578, -119851, -60288, -1472, -79795, -44770, -76789, -95994, -70432, -99365, -98893, -117097, -86805, -88577, -63168, -56980, -39494, -39432, -106038, -61256, -99411, -78089, -47981, -1938, -10748, -50788, -59741, -76397, -58371, -38166, -46230, -24129, -34094, -51086, -11284, -30020, -60535, -109785, -125254, -94577, -96195, -114342, -131640, -84720, -86023, -129855, -137647, -84161, -97199, -128917, -147479, -154592, -114865, -138558, -105559, -78230, -52201]
16341e2201O838L2797J9466k2695k6095j3680j795j3835k6766L3857j0299n0810
16329a25218l1221M7399M1291L6980O067R782L381m7818p040k1084n4674r662
16317a51817N184K7943M0047K7102J3613l5172j563J3052K1003j2905j9608l5969
16305a09090l031K5728L1296L2132p409n5680O2K6828p042L414N730J2234j5587
16292f0415J4353o442K3940j1351j0957M722o5111o5985K5583M7098q421J4246
16280i8740L2146K7254k0118J4491l519M7894J297l1390m7335J2901L8751J0974
16268a5394n301m6542k4447O087K7491M0342J5234J946k6924n2343K812L3179
16256d3860l1155k1608l2081j710P4779N9709k2690j4524k124k4283k9894J0667
$$ y = [-52201, -45363, -12566, 6900, -15795, -41890, -55570, -57365, -71200, -97966, -64109, -74408, -125218, -156439, -109040, -67749, -30769, -24702, -14920, -11539, -59357, -66397, -87481, -142155, -151817, -146633, -118690, -78643, -51541, -37928, -73100, -74663, -61611, -40608, -53513, -73121, -109090, -112121, -86393, -55097, -22965, -30374, -86054, -85992, -59164, -66206, -62792, -57062, -44828, -60415, -46062, -52504, -28564, -39915, -50872, -46150, -111261, -177246, -151663, -104565, -112986, -98740, -66594, -39340, -59458, -44967, -48486, -592, 705, -30685, -78020, -65119, -26368, -15394, -20695, -67237, -91684, -85597, -58106, -17764, -2530, -584, -27508, -79851, -77039, -43860, -75015, -96623, -128704, -130414, -55635, 4074, -18616, -33140, -35264, -59547, -89441, -78774]
16244g8774n424m989R79J2015L8306l7704m5805p728J2778K2913J5339j097K815
16231g6376l0081k432o473P4620l057n8410j3085K9151k1003j5477K3783K1791
16219g7049L9260j3120k8832o163K9366J2822p341l786J8436J5735r0320L759
16207a07233L9591N4959J8800l4764o7723m7640N6542K1378o794j4997j1003L5715
16195f3169J3922L1284m5645l769R74K8764j5687k5890M959l216K6898N0413M3530
16182D3368m421J5810k2702n9887k4110K0011n6225O956M7011N2991M0185K057
16170F1044k4465m0868j9359j1222j1885m3138Q069K2810N0103Q246j1631J1297
16158i99J167M656L298k2309j1190k3890l6448K559m6570K3797N7429l6331m4230
$$ y = [-78774, -84198, -89187, -88208, -76193, -37887, -75591, -121396, -129124, -116346, -93433, -78094, -79191, -76376, -106457, -108889, -115362, -40742, -43799, -102209, -115294, -86143, -107146, -122623, -98840, -77049, -37789, -50909, -79741, -85904, -56538, -43716, -51057, -54843, -36407, -20672, -110992, -107233, -67642, -12683, 6117, -28647, -96370, -144010, -87468, -66090, -72884, -87881, -98884, -63169, -49247, -17963, -63608, -67377, -66403, -37639, -53326, -79216, -74257, -77473, -50575, -162, 43368, 38947, 54757, 32055, -27832, -51942, -31931, -88156, -81200, -34189, 18802, 58987, 61044, 36579, -4289, -23648, -34870, -46755, -89893, -81824, -59014, -8911, -665, -12296, -999, 168, 4824, 8122, -14187, -25377, -49267, -85715, -83156, -129726, -105929, -48500, -84831, -129061]
16145a29061l0915k435O9138N3600O5473J814o131l7313j6434p106j9435L9821
16133a8984P662J0942L1030l778j623l1987o4390r081N3224L0919m5954O267k4014
16120e9767p8966n0814K8640Q1546L8407M642j6994L8591k016n6995Q511K5594
16108c9621M7878k0096l380K263K0084m614L083j2129l3700R461j2725Q828K1073
16095a3595l5595J9500L511N9257l0204m985p431L05m1747l0922l6616k3614M754
16082a37382N211J9609J9535O604O3966K2398l5139k6816j3566J4587K3184Q819
16070b8990P89M378L307j5635j01956N349K2209l409K7184L0975M1143p955J9675
16057b936J9254m240l0000k8880l529m198O630J9373L4310p552q2228k7365k9732
$$ y = [-129061, -159976, -162411, -93273, -39673, 25800, 27614, 21483, -15830, -32264, -39370, -58805, -18984, -11322, -380, 30650, 26872, 25249, -6738, -71128, -80209, -26985, 3934, -42020, -35753, -59767, -138733, -189547, -160907, -79361, -40954, -36312, -53306, -14715, -16731, -73726, -65215, -39621, 8257, -11839, -15219, -12956, 7128, 2514, 5597, -6532, -40232, -30771, -43496, -34668, -13595, -49190, -29690, -26179, 33078, 2874, -2111, -9542, -9237, -50984, -81906, -118522, -142136, -137382, -132171, -112562, -93027, -86423, -22457, -59, -35198, -62014, -75580, -60993, -37809, -28990, -28201, -23823, -20516, -36151, -138107, -132758, -110549, -113958, -86774, -55799, -14656, -22611, -2936, 16318, 12078, -17922, -46802, -50331, -54529, -47899, -28526, 5784, -1768, -83996, -111361, -141093]
16044a41093M4002J7134O365L7055j800O3236M3278P119o2791l7193m5546k5954
16032i6188J1507L1957K0548k7066o465l598q453j2602k915M5502M8987m0855
16020c9641q610J4192O44J46M1111k9014j9674R435O1871n018n5945k4639K5591
16007b9551m2305k4591p471N1262j5331P95k3714J7277K7853N2636L818j5447
15995d769J4163l9592J8309r353j5481l1544Q3228M9472J3478L8429j3776J04
15983A02668P174l7242j02589j9007M2668Q63p573l2597K9753l693m6072J4839
15971e0808j0635J7198L5328J974n2226J015K5991k675R535k5680l6305L3688
15959e3600L2263J8538k0874Q819M511l5933k0533m94J7953N8254L122m0372m4607
$$ y = [-141093, -97091, -79957, -73592, -36537, -38337, 24899, 68177, 75296, 12505, -24688, -70234, -96188, -84681, -52724, -32176, -59242, -65707, -69305, -77758, -90360, -93275, -47773, 1214, -39641, -48251, -34059, -33415, -33269, 7842, -21172, -40846, -31411, 30460, 25442, -30503, -55142, -29551, -71856, -96447, -103918, -52656, -67987, -67192, -90906, -73629, -45776, 6860, 10678, -4769, 9394, -30198, -11889, -21242, -36723, -68267, 14961, 64433, 77911, 116340, 102564, 102668, 109842, 72600, -29989, -48996, -6328, -5465, -13038, -45635, -15882, -19575, -65647, -50808, -61443, -44245, -8917, -6943, -59169, -58154, -32163, -34838, -25303, -50983, -87288, -53600, -21337, -2799, -23673, -14854, -10343, -46276, -66809, -67303, -49350, 8904, 12026, -28346, -72953]
15946g2953k5309J2456K403m686n902K6916J6097P0139Q691n3549k8774O543l1708
15933g9636J6681K3333q933k9626L737M5229q211M2086j5715k4629p5843l2183
15921a43710L4861K4196k2353j5246K7943L0522j4561l7908m5009l1289P0030
15910a22524j6205L9261P0153M453j6314Q534P59q984M6366k8798l2202j5815
15898g1316k731R778M7320K5854J12m7185N2608k0970j8861J1526m3674k223K9087
15885c0675R0237L2359l4962o0337p4408Q326j1341L108K8473M17J0710j6735
15873e4828l8352O634L6885m5438m6419N2531J2787J6194L0058R174l2870K8667
15861b4977n044k7971j4920j7564J1236K8052K8726J279l2099m7409j1517P8778
$$ y = [-72953, -98262, -85806, -83403, -88089, -93991, -67075, -50978, 19161, 27852, -25697, -54471, -47928, -79636, -62955, -39622, -48555, -78181, -74444, -29215, -37426, 4660, -11055, -35684, -111527, -143710, -108849, -84653, -107006, -122252, -94309, -63787, -78348, -116256, -161265, -192554, -122524, -138729, -99468, -29315, -24862, -41176, -32642, -31883, -40867, 5499, -23299, -55501, -71316, -74047, -64269, -16949, 8905, 9017, -38168, 14440, -6530, -25391, -13865, -57539, -59762, -30675, 59562, 91921, 56959, -3378, -77786, -69460, -80801, -77693, -49220, -48803, -38093, -54828, -93180, -86546, -49661, -95099, -141518, -88987, -76200, -60006, -29948, -20774, -53644, -24977, -30021, -57992, -72912, -90476, -79240, -51188, -22462, -21183, -53282, -100691, -112208, -33430]
15849c3430p292j8876m0884m0151N54L8796K3665P3240J6118o5633m8047R714
15837i2226L8317K6297n327n0581k3158K37N0231m890j2847k1743M8018l0359
15825g8031l9623J2542l5429m5848j0082M8216N4347K4348K4922K0601l0524L46
15813e4215q070k6293J5770L5450m0281k486L5981J7636k956L7443k0183j2750
15801b4954Q463J4830k1499K5020p587o3511m4821L5209O5851J6526j6947l1939
15789d5359q615L1623j5590n1266J9133K9787O3400K5149N235l2073j2769m9004
15777d0349m9911M829M2375M3526l2922k4289k2852n731O3155k7719l4742k9024
15765a13654L3349k9716R926P940K8124M431l4760n964l1824n6226p458j9354
$$ y = [-33430, -40722, -59598, -100482, -140633, -140079, -101283, -77618, -4378, 11740, -53893, -101940, -92226, -53909, -27612, -32939, -83520, -106678, -106441, -56210, -61100, -73947, -95690, -47672, -78031, -117654, -105112, -140541, -186389, -196471, -148255, -93908, -69560, -44638, -24037, -54561, -54215, -62285, -88578, -72808, -37358, -77639, -80125, -44144, -26508, -29464, 7979, -12204, -24954, -16491, -1661, -23160, 1860, -5727, -69238, -114059, -78850, -12999, 3527, -13420, -45359, -53974, -22351, -37941, -89207, -70074, -40287, 23113, 48262, 53497, 21424, 8655, -40349, -90260, -85431, -43056, 470, -32452, -56741, -79593, -85324, -22169, -49888, -84630, -113654, -80305, -110021, -100095, -92155, -64031, -59600, -94360, -100324, -132148, -188374, -195832, -215186]
15753b15186L9969K3405M3537Q5384n191L196M3780l9683j7097k52K4182m421
15741a8377J0644m6348l9299M3631L288K6904K9048l8222q606j2411O74J4389
15729c4685j458Q578j1438K4934l6648n8312j9136J034k3442k327L4229R298M0948
15716f8425J4839O0983N2267j8299q645L743k913q9637o1874K4657L3300J11367
15704E1363O5004J1541q9346k5696K871m8473j2942m5877K0132K6376L3577M6037
15692C4567L458j8408k9355l4382j6122j8273L1808N8394L2370p998j7665N1587
15680F9981M5256M173j7257m3796m9184M680L4249k6136p203l7027l6748j3547
15668g2559M2251J2954L5183k3199o8867j5875k1528l4185J6881j6972p895O1378
$$ y = [-215186, -175217, -151812, -108275, -22891, -28082, -24886, 18894, -20789, -37886, -38138, -13956, -18377, -7733, -54081, -93380, -49749, -46461, -19557, 9491, -28731, -37337, -49748, -49074, -34685, -36143, -27565, -39003, -14069, -50717, -109029, -128165, -127131, -150573, -152900, -118671, -109373, -68425, -53586, 7397, 59664, 41365, 32720, 36463, 33550, -56087, -117961, -93304, -60004, 51363, 116367, 127908, 38562, 12866, 15737, -32736, -45678, -91555, -71423, -45047, -11470, 34567, 38025, 19617, -9738, -44120, -60242, -78515, -46707, 11687, 44057, 36059, 18394, 69981, 115237, 119410, 102153, 58357, 9173, 13853, 48102, 21966, 14763, -22264, -59012, -72559, -30308, -17354, 17829, -5370, -74237, -90112, -111640, -145825, -128944, -145916, -153811, -92433]
15656i2433N5942j5595j8369K944K4549n944n4572j9168K9379M2192k9818k4659
15644a05552l987L3635j4129J7197O0097N094k9714m6617o8411L6081M1971M4651
15632b9684l7221o6686L012L068N5074K256j4672J1390j0756J660N2346P303p719
15619c0629o0868l0079K0911J8233J4945l7273q048K8111N2048N0154l8232m3817
15607f4544J6821M5824J5257m2117L4494m167j0054k0282j9675N673K7825K6084
15595A1139J6200l0953m3504m4473J9825K6263M0475o5435j3685O3053L1454k2077
15583a1718k9052O4636K4994l5828J8782L071Q053n1276p6843n1271L6931Q2964
15571a6557p833O65j9932L5325n8708j02601L4684O5960K5857J8484K067k366
$$ y = [-92433, -36491, -52086, -70455, -67511, -42962, -48906, -103478, -122646, -93267, -51075, -80893, -105552, -109539, -75904, -90033, -72836, -12739, -7645, -37359, -83976, -152387, -116306, -74335, -29684, -66905, -133591, -130579, -127511, -72437, -70181, -84853, -73463, -84219, -82559, -30213, -22910, -30629, -91497, -121576, -100665, -82432, -67487, -104760, -112808, -84697, -32649, 17505, -20727, -64544, -47723, -1899, 13358, -28759, 5735, 1568, -8486, -28768, -48443, -42770, -14945, 11139, 27339, -3614, -47118, -91591, -71766, -45503, -5028, -70463, -84148, -21095, 10359, -11718, -40770, 23866, 48860, 13032, 31814, 34885, 42938, -8338, -85181, -136452, -99521, -16557, -24390, -23725, -43657, -8332, -67040, -169641, -134957, -68997, -43140, -24656, -22589, -24955]
15559b4955Q148K00K8319N009m8178n675P679l717l4378q176M5835J0634m1134
15546f0389j7120L5778K2313L8078P9883j3420p8579m2587J7227J0953j1418M408
15534a4873L7202M3279J0805o3786r123p508P320R682k3512l3685m291j3498k8096
15521i0084j7622N8339J1290j9611k8299l9501M0143M5566o824r48l782J0247
15509d1086l438J9712M3508L9726O286j7418m3373k6396n556k1047K0699O0377
15497C1994l6474p220n323m7294n0020k0175n952J767L8901L0289j6787J1342
15485g4952K3589n533l3482j1335N6680J9063Q866J7481l7447r35o285l6609l3574
15472a14473K1075k3363O058L7636M7910L3922K3019l6925m1862j8604M3571N096
$$ y = [-24955, -16807, -16607, 11712, 16721, -31457, -37132, -29453, -33170, -67548, -75724, -29889, -19255, -60389, -77509, -41731, -19418, 18660, 98543, 85123, 6544, -36043, -18816, -7863, -19281, -14873, 22329, 65608, 76413, 12627, 3504, -4004, 3316, 12998, -10514, -44199, -48490, -61988, -90084, -107706, -49367, -38077, -57688, -85987, -125488, -85345, -39779, -46603, -47551, -51333, -41086, -44524, -24812, 18696, 58422, 64708, 47290, 3917, -22479, -28035, -49082, -28383, 31994, -4480, -11700, -17023, -64317, -114337, -134512, -140464, -138697, -99796, -69507, -86294, -74952, -51363, -56896, -90378, -101713, -45033, -25970, -17104, 377, -37070, -38005, -44290, -80899, -114473, -93398, -116761, -110703, -73067, -25157, 8765, 31784, -5141, -47003, -65607, -22036, -16940]
15460a6940k594J01n7704m4501K5120P7709L478J2141k9461n6200K2459M0863
15448b5529N7295J5953n0194j1246M7092l62m0368J1056l2204n702K1366r173
15436b2016j4763j3088n2863O650L0623L8960K048j5306o6016P029J4328j1142
15424i5556p478P677J4760O5453K1109j0595k476j6479m7950j6867R547J5361
15412f3494K4302J2216k5488Q916K6680N025J2704L9596j7581m0870m014m1441
15400f3449K0645l4910J0751J4938k9556k1099L5264K2806L1076R227P195l308
15388d20Q940m1182l2649K8601K3642k789l0336L6614j7822J1308l0444l6155
15376h2692O0001J9335k309r872k86j0687l3511L8998P4460n2536o8542o579j6298
$$ y = [-16940, -19534, -19433, -77137, -121638, -96518, -18809, -15331, -3190, -32651, -88851, -66392, -25529, 31766, 47719, -2475, -13721, 33371, 33009, -7359, 3697, -28507, -34209, -12843, -22016, -36779, -49867, -102730, -96080, -65457, -26497, -24449, -39755, -105771, -98742, -84414, -95556, -103034, -95357, -80597, -15144, 5965, -4630, -7106, -23585, -71535, -88402, -78855, -63494, -39192, -26976, -52464, -43548, -16868, -11843, 861, 40457, 22876, -17994, -22008, -63449, -42804, -77714, -66963, -52025, -81581, -102680, -67416, -44610, -13534, -4307, 2888, -420, 8520, -32662, -65311, -36710, -13068, -15857, -46193, -9579, -27401, -16093, -46537, -82692, -22691, -3356, -5665, -15537, -15823, -26510, -60021, -21023, 53437, 901, -67641, -74220, -90518]
15363i0518N2545L0692j5569k5662N0361L4574m4232n0549K694k5290J3659M8668
15351a8627j0160l340R224o1881k0033J5852j8863m296j8261L7842L0333K1650
15339d0560K7095j0278l0527l4373P2884L6895j3279p681L2343l0432r6617n4906
15327a49436j169L3072K1340K8629j5131p1490J3638Q0904M1733K0208l9354o979
15315d4035M3612N8581N973l0138J6958O87n0939l3976L4988q788l9459Q704L7641
15302a91m3411J5256j1454n5327j1381P1413K7442q713J6055o625k392K53m691
15289a3766J1012j9803J2829n6010j0529j9712n629P617P7613n997l5540l5199
15277i3114k5193j5967r407K8414J00384J1112l0428O664j6582M557p196L844
$$ y = [-90518, -37973, -7281, -22850, -48512, 1849, 36423, -7809, -58358, -55664, -80954, -67295, -18627, -28787, -32127, -22903, -84784, -104817, -88965, -107828, -112124, -130385, -92543, -62210, -40560, -13465, -23743, -54270, -88643, -15759, 21136, 7857, 176, 32519, 2087, -94530, -149436, -150605, -117533, -96193, -67564, -82695, -154185, -140547, -59643, -17910, 2298, -37056, -44035, -423, 58158, 64131, 33993, 50951, 51638, 699, -33277, 1711, -7077, -46536, -37832, -191, -43602, -28346, -39800, -95127, -106508, -35095, -7653, -16366, -311, -6936, -9328, -9075, -13766, -2754, -22557, -9728, -65738, -76267, -95979, -101608, -93991, -16378, -22375, -57915, -93114, -118307, -134274, -143681, -115267, -14883, -3771, -34199, -27535, -44117, -39560, -46756, -42912]
15265d2912m3160p13K2778K2776m1823L6655j3755p8994Q0871O3071N5619k0801
15253C9612m9445k3313M9064J1508j9791J9347Q858n6936o401O0618o35n1431
15241a8945m3719k4070L1042K9246L0554M845M5395K2931P831k1368m5829n9048
15229d1135r250K7484o301O415P481k2192R2P433n9058J0620K086k0902m2944
15216a40171P2001M3818k1716P8607K6651n9111j6146j1463N90l1730J0479J5281
15204c2910k9091o1800l8334L7657K4879J5432k4040J7185P7043O2238n5451J3707
15192F515K1482k1201J6934M661k0592R320n9079O208K9374k5182k0384Q824k7186
15179g0306J0759K2864l4636l4627l5026J619K2367M7650N5972L9764K3111r561
$$ y = [-42912, -86072, -86785, -64007, -41231, -83054, -46399, -60154, -139148, -58277, 4794, 60413, 39612, -9833, -33146, 15918, 27426, 7635, 26982, 35840, -21096, -27497, 33121, 32486, -18945, -62664, -86734, -55692, -26446, 4108, 8953, 54348, 77279, 85110, 63742, 17913, -41135, -50385, -22901, -29202, -22787, -15306, -37498, -37406, -29973, -89031, -78411, -76325, -97227, -140171, -68170, -24352, -46068, 32539, 59190, 79, -16067, -27530, -26940, -58670, -48191, -32910, -62001, -123801, -162135, -124478, -99599, -84167, -108207, -91022, -13979, 48259, -7192, 6515, 27997, 6796, 23730, 28391, 7799, 17119, -41960, -35752, -6378, -31560, -51944, -43120, -70306, -59547, -36683, -71319, -105946, -140972, -139353, -116986, -69336, -13364, 26400, 49511, 39950]
15167C9950K5677j0007m0612l9348n6990L9958J06557P169l7914O101L3562L9793
15155A13896P198q232o7056j5455j6218l2947k935O698K7747J858m330o851j4176
15142a0803K9807l0139K0866M064j1131O643m2573P15L4309k9650L4768P237n900
15129H213K4292L3512o960o7314k5742P061K7785o25n0555K7396K7723K875L2817
15116D0478k0744o0350q612p590J02k6482K2703k020k0080J2097M4930K0665J229
15103c674m600L9668o0580j2207j7475L3263J7213K3797O7287m9132k4647k0564
15091a1651j1731k8419J4640K1145o623l8150R5923P0491j1275m446k8889l5665
15079B5350N1821J4074l6054l1131K8983M4177J0992p2365N74K7131m6398n4511
$$ y = [39950, 65627, 55620, 15008, -24340, -81330, -41372, 65185, 72354, 34440, 40541, 74103, 113896, 121094, 112862, 45806, 30351, 14133, -18814, -21749, -15051, 12696, 14554, 10224, 3373, -10803, 19004, -11135, 9731, 13795, 2664, 9307, -33266, -32551, 1758, -27892, 6876, 14113, 8213, 32505, 66017, 59057, -8257, -33999, -26938, 847, 222, -50333, -22937, 4786, 7661, 40478, 19734, -40616, -49228, -56818, -56716, -83198, -60495, -62515, -82595, -70498, -25568, -4903, -3674, -8274, 31394, -29186, -41393, -58868, -25605, -8392, 15405, 82692, 33560, 8913, -11651, -23382, -51801, -37161, -16016, -22639, -60789, 35134, 105625, 94350, 89904, 61015, 25350, 77171, 91245, 55191, 24060, 53043, 97220, 108212, 35847, 36421, 63552, 17154, -37357]
15067c7357J3444M3058j547o2723m1626o1712k0003N3677L4479N185N239N5098
15055a4788N736j7230j758q133l6149R56K0945k1237J0384K0906P473K3744L794
15042e357N1131J3912j8048k1679j3099l730O108l3809k8606j5387K165J5659
15030e0740K7391L6234O6222K914m7219l4935k7099R059K8974o793K6062r0242
15018f0172q2603K4574R9551O9875n6164q5462j8207O8594J6461J0522l2662q902
15006e4595M078M0244J3551L832L0048K2631n2123p5584K5326N2209M3301k7297
14994B5621k6673j4390j950P801N3744Q841l8089k9434k876k3111j3251M3645
14982a0122M2848P033k870j5256o2208L3435K2668j9637K0016K3723J5619o841
$$ y = [-37357, -23913, 19145, 17598, -45125, -86751, -148463, -168466, -114789, -80310, -75125, -69886, -14788, -9052, -26282, -28040, -36173, -72322, -71366, -50421, -71658, -61274, -40368, -32895, -9151, -5357, 45774, 59686, 41638, 19959, 6860, 3130, 9238, -24571, -53177, -68564, -66399, -50740, -23349, 12885, 79107, 82021, 34802, -133, -27232, -18173, 10801, 4008, 30070, -60172, -142775, -118201, -18650, 51225, -4939, -90401, -108608, -40014, -23553, -13031, -45693, -54595, -50517, -10273, 3278, 7110, 37158, 59789, 7666, -67918, -42592, 9617, 52918, 25621, -1052, -15442, -17392, -9591, 44153, 52994, 14905, -14529, -17405, -40516, -53767, -10122, 32726, 39759, 36889, 21633, -40575, -7140, 15528, -4109, 15907, 39630, 55249, 48408]
14970D8408P609N0815l3405k1587K4942q785p651j7791m0188j3746k8254p2113
14958a11746M9037L2900m8201m5264J6762O453N268K8268L8930J876n220L1180
14946B43k5571J5891K8114J8480o634J8681K2737J9495m1797o3082o0358N9471
14934a4330L2762K3740l1691m9627k0275j2106K1112k573k8728l1293L644Q0653
14922b8712P1761M4028L4345k5944q878l070j809m8000P179j231q1609K0505M1263
14909A9828j7262j4754R943j8138p458M1120K5482j8018q975Q456K2886O883K3104
14896G3097p969n9565l980j5328m4175j6853P2418O7779M132n1054k4344K0780
14884A4938K7570j9612k4728r317O518K1835l1966J4419l031Q29l2942l4174K4773
$$ y = [48408, 56017, 106832, 73427, 51840, 76782, 67997, 60346, 42555, 2367, -11379, -39633, -111746, -62709, -29809, -78010, -123274, -106512, -100059, -94791, -66523, -27593, -25717, -30937, 243, -25328, -9437, 18677, 37157, 30523, 49204, 71941, 91436, 49639, -13443, -73801, -14330, 18432, 42172, 10481, -39146, -59421, -71527, -50415, -52988, -81716, -113009, -109365, -28712, 43049, 87077, 121422, 95478, 86600, 83530, 81721, 33721, 40900, 39669, -41940, -21435, 19828, 2566, -12188, -2245, -20383, -27841, 13279, 38761, 20743, 11768, 20224, 43110, 49993, 73097, 65128, 5563, 1583, -13745, -57920, -74773, -2355, 65424, 69556, 18502, -5842, 14938, 42508, 22896, -1832, -11149, -4631, 17204, -14762, -343, -3374, -2545, -35487, -69661, -44888]
14871d4888L2688j2733J8808K3760L75N3893n469k2870R070k0435n1508L768P73
14858a4768L8651k4573j8868o2434m123R5360J1567k4055q921N1256k9328o4284
14846e4520n3637O4392M3510M9004L2735k5134o8566J1638L5896K2228k0616r481
14834B7449m7176j0453K0086J4223k2596j408L7157L2523q7261m7097J765P1947
14822a0841j5259J4009J5989k1035j4069K2285J0860l3460m0111K0577P2409K5679
14810D7033l8667R782J8914L403m5695k6183j4670j3487R849k3377J9884L5025
14798a8189p0594j3836N0710m285M2228J0443j6502L2946J3830m4679n8571j7217
14786i3716K7450N5311l6054J3640j8503K6174L5735l9060k1830k7606j5060M7527
$$ y = [-44888, -12200, -24933, -6125, 17635, 18010, 71903, 66434, 43564, 52634, 32199, -19309, -15541, -14768, 23883, -690, -19558, -81992, -86115, 9245, 20812, -3243, -12164, 39092, 9764, -54520, -108157, -43765, -255, 48749, 81484, 56350, -12216, -578, 35318, 57546, 36930, 27449, -19727, -30180, -10094, 4129, -18467, -19875, 17282, 49805, -37456, -84553, -82788, -10841, -26100, -12091, 3898, -17137, -31206, -8921, 1939, -31521, -71632, -51055, 21354, 47033, 8366, 18148, 37062, 40465, -5230, -31413, -46083, -59570, -49721, -73098, -53214, -18189, -88783, -102619, -51909, -56194, -13966, -3523, -20025, 12921, 26751, -17928, -76499, -93716, -66266, -10955, -47009, -33369, -51872, -25698, 10037, -29023, -50853, -78459, -93519, -45992]
14774d5992k2811M409j7102J7238J9058K3953J0410L1093K7278P779k8717o765
14762A9831M1487k60k5825K7305N652m3141l0981J8930p694p809J0221L103n711
14749E108L6325J0921k2199j3831o2945k4746K1822L8868R161n122L5374J12010
14737A40746N4322l8508o4079o1994m136m700k9967l3201L9696J238j3227K94
14725a3516L6204K6575J7896k2472l2042K955m2766Q938R036o222j9117n292j6488
14712e6311o0915r880L3267j8524j1362M849N3572J9015K7654j0179k2221l732
14700e4767M4798j1171l3671K2655R8K7511M6921k3652q30l7350k3714N1122K623
14687A0573n2650j9195n888L0418k366k3766J8595L6457o029L2757q328l4648
$$ y = [-45992, -68803, -64394, -81496, -64258, -45200, -21247, -10837, 20256, 47534, 55313, 26596, 19831, 61318, 61058, 35233, 62538, 68190, 25049, -5932, 12998, 5304, -2505, 7716, 10819, 5108, 41433, 52354, 30155, 16324, -46621, -71367, -49545, -10677, -1516, -6638, 28736, 140746, 195068, 156560, 92481, 30487, 26351, 21651, -8316, -41517, -1821, -583, -13810, -13516, 22688, 49263, 67159, 44687, 12645, 15600, -27166, -18228, -9192, -15414, -34531, -39823, -56311, -117226, -127106, -93839, -112363, -123725, -118876, -65304, -46289, -18635, -28814, -51035, -54767, -9969, -21140, -54811, -32156, -32058, -4547, 42374, 18722, 17892, -19458, -43172, 7950, 10573, -42077, -61272, -67160, -36742, -39108, -62874, -44279, -7822, -13851, 18906, 10578, -24070]
14675b4070j0519N7106Q289l5413K4071K0444j4642l163l8431J8398K466J6577
14663B1113r435n6819j2202M544K7345K6613k4564k6787L7253J3881K1843l8513
14651a5728q509j5615L8626K2334k5395J2561J4842K7983l616m4775m0523M0433
14639B618M5377O527k1196J7496L8157k0230l6666L9534k027n318q8708n6468
14627h0904j6986J700K9864J9645Q3958n5616o6659K6517O4528J6797l8704J3255
14615b605J7238q55l8603O9894L7436m3799J1043N8740o0557n6778k0939K7243
14603b542j9015m789M2641R632p497l8384J7899j3853K8521M8293k3447j0953
14591B6506k4248J2539m019J2578j6393P840j3931l4349l2052K3521J7198K6457
$$ y = [-24070, -34589, 22517, 30806, -4607, 19464, 39908, 25266, 22103, -16328, 2070, 4536, 21113, 11678, -45141, -57343, -52799, -25454, 1159, -23405, -50192, -12939, 942, 22785, -15728, -24237, -39852, -1226, 21108, -4287, 8274, 23116, 51099, 47483, 2708, -37815, 2618, 47995, 54522, 33326, 50822, 88979, 68749, 32083, 71617, 69590, 64272, -24436, -80904, -97890, -96190, -66326, -46681, 37277, -18339, -84998, -58481, 6047, 22844, -15860, -2605, 14633, 13778, -24825, 45069, 82505, 38706, 49749, 108489, 47932, -8846, -29785, -2542, -21557, -26346, 16295, 25927, 18430, -19954, -2055, -15908, 12613, 60906, 37459, 26506, 2258, 14797, 10778, 23356, 6963, 14803, 872, -33477, -65529, -42008, -24810, 1647]
14579A647k6655J261L7472j2923k0848J5837m424o8254J7162O5713J6506j4528
14567G966N5023L6855k1286k3342m849o110p8280o1610L1746M2468K8907L5156
14555D2644K5115n4667J1941j4798L3504J9267l1211n8675j703J1419o442J2082
14543a1524J355l6131n0255K566L0943Q4573L4864J9571N9279n0034j6068j8754
14531E0385Q015j67L9915K6510m7480k1010J3681k2287L269q378r731M2939L8255
14518A13916p4147o7509K6343K4564p93J0639N6039r183k865p924p3633m7737
14506e2290K9246N8772K922L673l2943n5600J1631Q1409N1299Q509p96l9629q9262
14493b3059j9863N0386p717J5157n883o816M5182M9593J3485J1522J1738l0016
$$ y = [1647, -25008, -23747, 13725, 802, -20046, -4209, -8633, -76887, -59725, 5988, 22494, 7966, 62989, 99844, 78558, 55216, 50367, 44257, -34023, -95633, -63887, -21419, 7488, 42644, 67759, 13092, 25033, 10235, 43739, 63006, 31795, -26880, -28583, -17164, -23606, -11524, -10169, -46300, -96555, -93989, -63046, 21527, 56391, 75962, 135241, 85207, 69139, 50385, 58400, 58233, 98148, 124658, 77178, 56168, 69849, 47562, 50831, 42453, 32722, 75661, 113916, 39769, -27740, -1397, 23167, 22374, 33013, 89052, 79869, 77004, 69080, -4553, -52290, -23044, 35728, 38650, 42323, 9380, -46220, -34589, 46820, 98119, 106628, 105832, 66203, -23059, -42922, 7464, -253, 14904, 9021, 2205, 47387, 96980, 110465, 121987, 133725, 103709]
14481A03709J418j8865p5744j315M5180j3981j4523L9914J1583m0275n2181j6790
14469c1870J8882l1975K327K0251O2466O316J8945K0506j3503J7269n4765m3652
14457h803j281K3186M0442m103p3449o5582M5885J02578J3778l5309j684j9366
14445A6292j5073K0725Q379l0700l127K761l7801l1698J0926P2587O2384M3599
14433A19254k8488j5869m3605l8075j3321J5598k4524j8237M3157J2652J3003
14422B1545n9048l6652N0608N0553N5591j5706l7394k7598Q378O635k2655N046
14410f97m925k3629P01J3179j9682k4031N7682L9886J1008l2749J1898Q143o920
14397B9864L2964m3648n2116j783K9679l7366j8667M0260O8528J07346k0760p9354
$$ y = [103709, 105127, 86262, 10518, 9203, 54383, 40402, 25879, 65793, 77376, 37101, -15080, -31870, -12988, -44963, -42636, -22385, 40081, 46397, 65342, 85848, 72345, 89614, 34849, -8803, -10084, 13102, 53544, 49441, -24008, -89590, -43705, 58873, 72651, 37342, 35658, 16292, 1219, 21944, 30323, -377, -3504, -743, -38544, -70242, -59316, 13271, 75655, 119254, 90766, 74897, 31292, -6783, -20104, -4506, -29030, -47267, -4110, 8542, 21545, -37503, -74155, -23547, 27006, 82597, 66891, 29497, 1899, 10277, 16912, -5743, -697, -5622, -29251, -28550, -15371, -35053, -59084, -1402, 38484, 49492, 16743, 28641, 36784, 29864, 62828, 19180, -32936, -34719, -5040, -42406, -61073, -20813, 47715, 155061, 134301, 54947]
14385E4947o45j9273p922m2922K6191M5061J1957k9059j1761k8426q832J7374
14373F690K0977L2342n061J3494l5296m8619k2745L0450K0409J6395l6924k4861
14361c2749j551L8383Q098J7354K5559M9396L0805j8439j7090j6027n6402j0178
14349A7159K053K069L7957K6612k7611o605l5621o9774m2674R216j3303L5874
14337f4648L1489J4336K1448N1530O0191J6897k4384k312n3439l0253m4127J8275
14325d997k1722K0449J3190M3572M3567L7834k0754l5272m5433j7549k9134l4484
14313e0733J8334R5993M1215K7826P729n1330J4241M624n2107l7503n0101L772
14301b8040K9466m075l0173L1142M0450J3696j9236l1130j5683J3887J1088j0752
$$ y = [54947, 54302, 35029, 27107, -15815, 10376, 55437, 67394, 38335, 26574, -1852, -10684, 6690, 27667, 60009, 54948, 68442, 33146, -15473, -38218, -7768, 12641, 29036, -7888, -32749, -34300, 4083, 12181, 29535, 55094, 104490, 135295, 116856, 99766, 83739, 27337, 17159, 19212, 21281, 59238, 85850, 58239, 51634, 16013, -53761, -96435, -87219, -100522, -64648, -33159, -18823, 2625, 54155, 114346, 131243, 106859, 104547, 51108, 20855, -23272, -4997, -26719, -6270, 6920, 50492, 94059, 131893, 111139, 75867, 30434, 12885, -16249, -50733, -32399, 63594, 104809, 132635, 140364, 89034, 103275, 107899, 55792, 18289, -31812, -28040, 1426, -2649, -32822, -1680, 38770, 52466, 33230, 2100, -13583, 304, 11392, 640]
14289F40M0349O2939m0213l918j1233j3000o29p097l0143M552L7885J6597M287
14276F1016M372n6610j3067M2743P092l8496L490J7604K0963n3226l4697M7832
14264I016L1646k2847l2739L3993K1792r615j0881j2814Q31n213M4883J0054K160
14251F0266k982M1812K7606n3467o5487p182r181N9843O6701j5966r067l6454
14239E6442K479K3372j038K9903k9838k9081r729j3013m2211J9930L3004r434
14227C0786n929K9778k058k3378l8399n8784L0982J2236K0088K8290K6023n673
14215D3962k747k6913J1554N6n4614J1174r85k3846k5737K6016N5950J5357k8946
14202B81k9997L8234M031j3877J873L1388k3125l5469K0872k804j3743k784O8839
$$ y = [640, 40989, 103928, 63715, 59797, 48564, 35564, 34935, 27838, -2305, 2247, 40132, 56729, 61016, 65388, 8778, -4289, 38454, 45546, 7050, 10540, 28144, 49107, -4119, -38816, 9016, 40662, 17815, -14924, 19069, 40861, 31246, 20365, 7551, 8382, 3169, 48052, 58106, 60266, 57284, 99096, 126702, 73235, 7748, 566, -8615, 51228, 117929, 101963, 92896, 56442, 58921, 82293, 81255, 111158, 81320, 52239, 42510, 29497, -12714, 7216, 40220, 30786, 24857, 54635, 52577, 29199, -9200, -67984, -37002, -24766, -4678, 23612, 49635, 43962, 41215, 14302, 25856, 25912, -28702, -17528, -18513, -42359, -68096, -42080, 13870, 29227, 281, -29716, 8518, 12549, -1328, 545, 31933, 8808, -26661, -5789, -8593, -22336, -25120, 43719]
14189D3719P8396k0049j12561l7011J4203L7682P110J5291M7112R615o3859K2338
14177D1986K0011J7761P21j0924j9291j4433j6003N7150O4862l4577q044J6449
14165A15668k7464N376L7j0635L6060M6972l0343p8443m4998P765K8117N2707
14153A00819k1873J45m7524k9272m0326k4740R7978N0780N5570P187k8482l3328
14141H6934l2561r33o7743m0729M7814j3827j0907J5178N1518M2098m1655K596
14129C7783m1866k0351J8499M3920Q678K5395j2878j1592J9445J2021L2091n372
14117A05773L6494o051J6973L61r634m4482l0231m8467o7523J1559L4778J9022
14105A8572M2634O5311j0422j9869L0674O19P152k3509q317K6184K7110j0279
$$ y = [43719, 122115, 102066, -10495, -47506, -33303, 4379, 11489, 26780, 73892, 83507, 19648, 41986, 61997, 79758, 80479, 69555, 50264, 35831, 19828, 76978, 141840, 107263, 99219, 115668, 88204, 93580, 93617, 82982, 119042, 166014, 135671, 57228, 12230, 19995, 48112, 100819, 78946, 79091, 31567, 2295, -38031, -62771, 35207, 85987, 141557, 148744, 120262, 86934, 54373, 53440, -14303, -55032, -7218, -21045, -31952, -16774, 34744, 76842, 35187, 37783, -4083, -24434, -5935, 37985, 46663, 72058, 59180, 47588, 67033, 79054, 111145, 105773, 142267, 136216, 153189, 153550, 143916, 99434, 69203, 20736, -46787, -35228, -450, 18572, 61206, 126517, 116095, 96226, 126900, 127519, 134671, 111162, 102845, 129029, 156139, 145860]
14093A45860m3151K6964m080n3198J3675l1750K540M1247r621K2943J1752o5304
14081E7877m8323L9304K7176j3209m150m226k3515L26L5796J5585j1255j0242
14069F1144R095M3234j8681K3735j2998j6471k7365l9326l6286j1163m119j462
14057c0663M9988M2503L6575R664k9182m9602L2950K5435N1248k8381q8745j1907
14045I883J7235j8729j4642J0950K8280J3293k2110l507J6951l18K8595q748k1957
14032C5176M4136m2155l4630M1217L0373j8176J2452J6552j2666M4467l823o870
14020A06053L7692k2381m7829l4769l3989j5612j3209N8123k0519j7879n506K7887
14008A8062P3764Q954K3202l385j0592j7233N858l553o0110l5435L1914N9734
$$ y = [145860, 102709, 129673, 125593, 72395, 86070, 54320, 56860, 98107, 88486, 111429, 123181, 57877, 9554, 48858, 76034, 62825, 58675, 54449, 30934, 31260, 67056, 82641, 71386, 61144, 70239, 113473, 94792, 118527, 105529, 89058, 61693, 22367, -13919, -25082, -29201, -30663, 19325, 61828, 98403, 108067, 78885, 29283, 62233, 87668, 138916, 110535, 21790, 9883, 27118, 8389, -6253, 4697, 32977, 46270, 24160, 20653, 37604, 37286, 65881, 57133, 35176, 79312, 37157, 2527, 43744, 74117, 55941, 68393, 84945, 72279, 116746, 112923, 106053, 143745, 121364, 73535, 38766, 4777, -10835, -24044, 34079, 13560, -4319, -9825, 18062, 91826, 100780, 123982, 120597, 110005, 92772, 98630, 95077, 34967, -468, 31446, 91180]
13996I1180l2036j640J9933j6719o2852j3273n311N1863J0440K1127L837P826
13984G4375O293J6924Q2908J4907j7046q8953m5723n6505O890m3976K8208N2666
13972C0968J5136Q951p492n7142k9355O5723k962L0492K5816J7419j0331o1791
13960B5432n7626j4258k7894k255M6610M3176J7178j6328m4712P6418J1462j081
13948E6122N2156K2706m5471l6566j8360o110o55l2925m7724l5167L3199L9368
13936a9427L9893J9705L3427j8991p223O143n809q1794k4916L2158O0306L5048
13924F8520K1939J0409K0371j4686k4463l0417j5818j7669K5053j8788p3805O814
13912d2540J6998j4709P7295M2379J5262k2100m0201o8646l1246O4552Q5638K6177
$$ y = [91180, 59144, 57504, 77437, 60718, -2134, -15407, -20718, 31145, 41585, 62712, 66549, 74375, 80668, 97592, 180500, 195407, 178361, 89408, 43685, -12820, -5930, -49906, -21698, 30968, 46104, 55055, 47563, -9579, -38934, 26789, 23827, 54319, 80135, 97554, 87223, 25432, -32194, -46452, -74346, -76601, -29991, 13185, 30363, 14035, -30677, 45741, 57203, 56122, 108278, 130984, 85513, 48947, 30587, 24477, 23822, -9103, -56827, -91994, -58795, -19427, 20466, 40171, 73598, 54607, 47384, 53527, 47718, -34076, -58992, -26834, 33472, 68520, 90459, 100868, 121239, 106553, 82090, 51673, 35855, 18186, 43239, 24451, -49354, -42540, -25542, -40251, 37044, 79423, 94685, 72585, 32384, -36262, -67508, -2956, 82682, 108859]
13900A08859J696k5368J8947j4456l4809o763J9141k6299J7948J0491K3479l3942
13888E8924l9911m730J0148O9326N7764l543p0928P333n6123l9792j3609L2106
13876F965Q9895M795l4163k9904L8605L6385k4459m8274L8774q521R503P575J0763
13863I7939n6280j1078o2782l0824J0786K0682O2302K6832j3731Q0070L1636k4119
13851A31433q0788o4458j2313K791o464J7676l5131J9043J04540N2039J7134J4190
13839A59692L6512q1544j3617j7694n9696k2360m5809J3362K1934l1360K710K8543
13827i327n258K7534L8565j5254j6794J9750J4989j7263N855K8805Q915L785J2291
13814I6593J9867J4312r523k8918k9878k1789j1071O640O91m6648m052l3060J4288
$$ y = [108859, 110555, 85187, 104134, 89678, 54869, 48106, 67247, 40948, 58896, 69387, 92866, 58924, 19013, 14283, 24431, 93757, 151521, 147978, 77050, 84383, 28260, -11532, -25141, 6965, 96860, 101655, 67492, 37588, 76193, 112578, 88119, 39845, 78619, 70098, 79601, 87176, 97939, 41659, 30581, -32201, -63025, -52239, -31557, 30745, 57577, 43846, 123916, 155552, 131433, 50645, -13813, -26126, -23335, -29799, -12123, -47254, -28211, 76329, 128368, 145502, 159692, 196204, 114660, 101043, 83349, 23653, 1293, -44516, -31154, -9220, -40580, -37870, -9327, -14585, 12949, 51514, 36260, 19466, 39216, 54205, 36942, 42797, 71602, 80517, 84302, 96593, 116460, 130772, 121249, 92331, 62453, 40664, 29593, 36233, 36924, -9724, -13776, -46836, -32548]
13801c2548k0552l455n732N2160j9599K4872K8420O1176M9117L5103q030n8286
13789A02646K3106k6706Q077M583Q705q321R371j3179j0633k2325O555M3545L7130
13776A62554k0525k8688j4864n751J4923j4575k8391M0787O5872J1133k7704l2734
13764A22037j3679O5981J6466l2101j6376K1069m982n3763p375M2570M1398l4573
13752A46672o3138J4259k0088j053M8380m109j9308k0507j4381l7354M5599K8397
13740A03369M1978k1521l9243m4001l2413M3311K7422J4688k48l3428J0407N7333
13728A27654J5592j2216J1734N915K900L7723k6228o3539j226k0692l3547L4722
13716G8792q118n9268m255M1068J7165M366K8025J6798K515l2580K6052K1978
$$ y = [-32548, -53100, -56555, -62287, -10127, -29726, -4854, 23566, 84742, 133859, 168962, 160932, 102646, 125752, 99046, 107123, 111706, 120411, 112090, 121461, 108282, 97649, 75324, 81879, 125424, 162554, 142029, 113341, 98477, 92726, 107649, 93074, 64683, 105470, 171342, 182475, 154771, 122037, 108358, 174339, 190805, 158704, 142328, 163397, 158415, 104652, 97277, 139847, 181245, 146672, 83534, 97793, 77705, 76652, 125032, 120923, 101615, 81108, 66727, 29373, 74972, 103369, 145347, 123826, 84583, 40582, 8169, 51480, 78902, 93590, 93342, 59914, 70321, 127654, 143246, 131030, 142764, 148679, 151579, 189302, 163074, 99535, 98309, 77617, 44070, 78792, 70674, 11406, 7151, 48219, 65384, 69750, 97775, 114573, 117088, 84508, 110560, 132538]
13704A32538l0756K131L1528L338m1873J141Q764J9578j1672L477M3176K7741
13692A89111j5170l2123k2420k0842n6364Q938J7434K3560M507j6071l3749J1182
13680E7993J1316N407N7186j1360m0116R358J934L6748J9441K9181R812l5676
13668A51224l2871Q644q0132p7191L491Q3395P6129N693M2670J6951m7315J1927
13656A62615o2106r876k5608k4673J2104K0788J7562M8706L2675q5862k3503r181
13644E3641l203R658J1592j2044M5920L5260J2668p5049m0031L1272J6540o609
13632G9615K0250j276l8239m0609p8007L5706K6398J5037Q0701R778j1568K9208
13620A26994J3773p08K5901J9368J1481n417r743j0916j7521M91K5703o590K8122
$$ y = [132538, 101782, 103913, 135441, 138779, 96906, 98047, 106811, 126389, 114717, 118194, 161370, 189111, 173941, 141818, 119398, 98556, 42192, 51130, 68564, 92124, 96631, 80560, 46811, 57993, 69309, 74716, 131902, 120542, 80426, 89784, 91718, 128466, 147907, 177088, 186900, 151224, 118353, 126997, 46865, -30326, -26835, 56560, 132689, 138382, 181052, 198003, 150688, 162615, 100509, 90633, 65025, 40352, 52456, 73244, 90806, 139512, 172187, 86325, 62822, 53641, 50438, 60096, 71688, 59644, 105564, 140824, 153492, 78443, 38412, 69684, 86224, 79615, 99865, 98589, 60350, 19741, -58266, -22560, 3838, 18875, 99576, 109354, 97786, 126994, 140767, 140059, 165960, 185328, 196809, 191392, 181649, 170733, 153212, 153703, 179406, 172816, 200938]
13607B00938j5201k6330j5006n976k5201L1241j2061m0909L6723k2894L1619K428
13595A39371J8366j0117m1373k8032j8693O6830N3414N0087J4372k3743n5973
13584A64509j1143P857p830k3749O643L5121J5089J9115L0918K6443J4537k8979
13572B48531j5797P446j6966J4426O2866k5289j0386L6271P1190L7341N6228J01998
13560E67859O0390P967O2672J15524O6813j936n8361j15878n4523q2865r9908
13549D67754j6359J9058P788l3800l2969K9202J6715q534K2775k2465k5562R1695
13537E15298L6378m6867j4119m1354Q197Q2056J2905p299M3720Q3073M2674J04130
13525H18792J85974J38567J33881J79645J50945O4714o5237j23075k26126k12012
$$ y = [200938, 185737, 159407, 144401, 138425, 113224, 144465, 132404, 91495, 128218, 105324, 136943, 139371, 157737, 147620, 106247, 78215, 59522, 126352, 179766, 229853, 244225, 220482, 164509, 153366, 161223, 153393, 129644, 136287, 171408, 186497, 205612, 236530, 262973, 277510, 248531, 232734, 240180, 223214, 237640, 300506, 275217, 264831, 301102, 372292, 409633, 465861, 567859, 628249, 636216, 698888, 814412, 881225, 879289, 820928, 705050, 650527, 567662, 467754, 451395, 470453, 478241, 444441, 411472, 440674, 457389, 448855, 471630, 449165, 423603, 515298, 551676, 504809, 490690, 449336, 457533, 539589, 552494, 545195, 588915, 671988, 714662, 818792, 1004766, 1143333, 1277214, 1456859, 1607804, 1672518, 1607281, 1484206, 1258080, 1046068]
13515A046068j93515r3321o6417j01483n5126Q150j9886k3781m201J1873k0416
13504D87945j8622q475j8796O2226L0987l4006m5103n093J7284O086K8637k7783
13492D75287k7439L3939P6361O0393M3651R3818N6963R0542P7721o990p7222j36319
13480G60705j31412p8395o1776n1146r3070m3840k4354K2850n586L2497J6314
13469C42787J2022j2867p668N442j2411J37n5076p2279k1867N3350M5535m6266
13457B30839j3462Q495M4990l7844n1512L799K7620N434J3734j2332M22J1801
13445B31984m217p51M7050P2367M7691N2836q926r9895m6692k2764j5698q461
13433B44524M1850J8692j0885k6844l3043k3803l6495L5224K6899n2065N031L619
$$ y = [1046068, 852553, 759232, 692815, 591332, 536206, 544356, 524470, 500689, 496488, 508361, 487945, 469323, 460848, 442052, 504278, 535265, 501259, 456156, 451063, 468347, 474433, 503070, 475287, 447848, 481787, 558148, 618541, 662192, 756010, 812973, 903515, 981236, 974246, 897024, 760705, 629293, 550898, 489122, 437976, 344906, 301066, 276712, 299562, 293976, 326473, 342787, 354809, 341942, 334274, 339716, 327305, 327442, 272366, 200087, 178220, 231570, 277105, 230839, 217377, 225872, 270862, 233018, 181506, 185305, 212925, 218359, 232093, 219761, 220183, 231984, 227767, 227016, 274066, 346433, 394124, 446960, 438034, 338139, 291447, 268683, 252985, 244524, 286374, 305066, 294181, 267337, 234294, 210491, 173996, 209220, 236119, 184054, 189085, 192704]
13421A92704L9780K1159m34L6871Q8992N584o6000n6877n1373q793k1365K9727
13409B09975R6796P8508P2208J43631J49667K5396m8029j23296q6626l2905O877
13398D92202l979k1638R322j2371M348J2909J5249j9905N114M7222l6669n4154
13386D37650l4353O780J013k9330M5084k4620n7136O1909L5880J361J1540j2360
13374D43418q340K286M2171O6954J08471O7714P915j1764M3966l9934J6463K4052
13362G63372J2272Q690L3315O5487P5645J04184J05306J56755K03642J83924R5947
13351A808539Q268j58527k17022j93000q1684j00883q8719j5387P559m6464l3781
13340H88899l9431l5916J834j073L2662L4608M6575J0498m6233r183L2329L1818
$$ y = [192704, 232484, 253643, 253209, 290080, 379072, 384656, 318656, 261779, 210406, 201613, 180248, 209975, 306771, 385279, 457487, 601118, 750785, 776181, 728152, 604856, 518230, 485325, 492202, 488223, 466585, 475907, 463536, 467884, 480793, 496042, 476137, 481251, 528473, 491804, 437650, 403297, 410077, 411090, 381760, 426844, 402224, 345088, 406997, 442877, 444238, 455778, 443418, 435078, 437364, 479535, 546489, 654960, 722674, 730589, 718825, 762791, 722857, 739320, 763372, 775644, 784334, 817649, 883136, 958781, 1062965, 1168271, 1325026, 1528668, 1712592, 1808539, 1816807, 1658280, 1441258, 1248258, 1166574, 1065691, 976972, 961585, 969144, 922680, 888899, 849468, 813552, 815386, 814313, 846975, 881583, 928158, 938656, 892423, 883240, 915569, 947387]
13328I47387N7029J21578J0375l7764M6716K6770M9380M5716N8918J61196K84621
13317A771922L15603L52532L74699L17806l3424l39383m88304l96753l41057j44716
13307A388925r8851o3454q9884n9290p938j4266m6285k8339O3171K4429l0136
13296A038082l4326K8179n09K4554J4588n3273J3419J1393J980l4028M7489j980
13284A055568m0402l9369N1889Q1087J29883J76992K33896J55863O5709p5186
13274A795930k14350j83563j60998j75818j49164j03261q8297K7594J14919P1814
13264I34806r090J9349j1511j5362j6183j0610j1883l3706l3450M543J5985r51
13252H31937l5926n8830R002K9252j7236j9016M4432l363n5018n4843K3926M2002
$$ y = [947387, 1004416, 1125994, 1136369, 1098605, 1145321, 1172091, 1221471, 1267187, 1326105, 1487301, 1771922, 2087525, 2440057, 2814756, 3132562, 3099138, 2759755, 2271451, 1874698, 1533641, 1388925, 1290074, 1226620, 1136736, 1077446, 1069508, 1055242, 1008957, 980618, 1043789, 1068218, 1038082, 1003756, 1031935, 1031426, 1055980, 1070568, 1017295, 1030714, 1042107, 1044087, 1010059, 1057548, 1055568, 1015166, 975797, 1027686, 1108773, 1238656, 1415648, 1649544, 1805407, 1871116, 1795930, 1581580, 1398017, 1237019, 1061201, 912037, 808776, 720479, 748073, 862992, 934806, 925716, 945065, 933554, 918192, 902009, 891399, 879516, 845810, 812360, 816903, 832888, 831937, 796011, 737181, 746183, 775435, 758199, 739183, 783615, 780252, 725234, 670391, 694317, 736319]
13240G36319m37j1847P8678P1804R049l9395o3760j4160L5900k2354K7450O4186
13228H71433M5519K3181K3937L5532N70K3658j09M7354O7690P208p2l3809j6067
13215A096025L9089j5188J9003J04550M9173L8003O4434P3640L4808R4145J11962
13204A709644Q1092N8915K0080j05675j49524r022m549k7147l7603j7960j257
13193A516994k686l0390j3904m5032k8080J2412O003L8937N6560M8918L392P7682
13181A640806O5632K2676k510N7400Q8481Q4322J09075J78405J17984J72238K44036
13170B778545K01361K03920O3588j887o2183j30035j17112j25697q3782L0035
13160B756753K8836K5854O0356J07403J17430R4079J04106P1243P687m6469J2251
$$ y = [736319, 735882, 724035, 802713, 874517, 883566, 844171, 780411, 766251, 802151, 779797, 807247, 871433, 916952, 940133, 964070, 999602, 1000172, 1023830, 1023721, 1071075, 1138765, 1145973, 1145901, 1112092, 1096025, 1135114, 1119926, 1138929, 1243479, 1292652, 1330655, 1395089, 1468729, 1503537, 1597682, 1709644, 1790736, 1849651, 1869731, 1764056, 1614532, 1605510, 1600961, 1573814, 1536211, 1518251, 1516994, 1514308, 1483918, 1470014, 1424982, 1396902, 1409314, 1415317, 1454254, 1510814, 1559732, 1563124, 1640806, 1706438, 1729114, 1726604, 1784004, 1872485, 1956807, 2065882, 2244287, 2362271, 2534509, 2778545, 2979906, 3183826, 3247414, 3245527, 3183344, 3053309, 2936197, 2810500, 2726718, 2756753, 2785589, 2811443, 2871799, 2979202, 3096632, 3190711, 3294817, 3366060, 3373747, 3327278, 3339529]
13149C339529L3996R5496J11291J56349K08685K18895K50964K64544K87817L52873
13139E320439L65029M09976M73046N61164N52037N84205O62513O28213O49047
13130A0205669O10332N42720O46235P79290P54946Q36550R18249J065227J201054
13121A7560272J465192J711912K037497K314129K630324K963871L404618M026561
13113C8114376N015309O584372R189037J3038558J7725360K1905434K2957440
13106A34529886J7639523M734609j1426778k2120705k3052846j8228373j2695367
13099F9379949q349597n354389l431867j968892r15677j99579L37919O23529O61107
13090E0782503N72137M50823M44692M97182N88602R88932J533165K227409L021346
$$ y = [3339529, 3373525, 3469021, 3580312, 3736661, 3945346, 4164241, 4415205, 4679749, 4967566, 5320439, 5685468, 6095444, 6568490, 7129654, 7681691, 8265896, 8928409, 9556622, 10205669, 10816001, 11358721, 12004956, 12784246, 13539192, 14375742, 15293991, 16359218, 17560272, 19025464, 20737376, 22774873, 25089002, 27719326, 30683197, 34087815, 38114376, 43129685, 49714057, 58903094, 71941652, 89667012, 111572446, 134529886, 152169409, 156904018, 145477240, 123356535, 100303689, 82075316, 69379949, 61030352, 55675963, 52244096, 50275204, 49359527, 49159948, 49497867, 50121396, 50782503, 51354640, 51805463, 52250155, 52747337, 53335939, 54324871, 55858036, 58085445, 61106791]
13081F1106791L889757M854299N983974P380474R501554J2920626J8339773K6304884
13073A50282132L6087196M4515861M5747542L3450722O035477k6321414m7472854
13066B42324662n0415784m0950048k8770233j9204084j2876083q892705o234544
13059G4981181m409965l132987k083882j260635o34188j95761k13603n95094j138805
13050F1316261j418256j233885q87637n06413j70768m3169L12361J176653K300133
13041F0845280L609600N530419Q522929J2606285J7583810K1703918K1999174
13034A52401415J5329213P27652j6272871k6666789k6625392k0856620j4716479
13027F3320129j0140643p126924n118691l832601k957438k282347j664026j243174
$$ y = [61106791, 64996548, 69850847, 75834821, 83215295, 92716849, 105637475, 123977248, 150282132, 186369328, 230885189, 276632731, 310083453, 316118930, 289797516, 242324662, 191908878, 150958830, 122188597, 102984513, 90108430, 81215725, 74981181, 70571216, 67438229, 65354347, 64093712, 63459524, 63263763, 63050160, 62455066, 61316261, 59898005, 58664120, 57776483, 57270070, 57099302, 57056133, 57368494, 58545147, 60845280, 64454880, 69985299, 78508228, 91114513, 108698323, 130402241, 152401415, 167730628, 168458280, 152185409, 125518620, 98893228, 78036608, 63320129, 53179486, 46052562, 40933871, 37101270, 34143832, 31861485, 30197459, 28954285]
13019B8954285q42786o82060p98134j144050j465647j645581j685253j683829
13011A9006945j531859j376310j258822j109527j041510r68778q32259p82654
13003A0105226p26219o24650o30945o02330n82159n38533m45658l92467l36109
12994E226156j95681j64682k42125l39083k99711l12374l44666l31686j97415
12985B798733j59372j27180n3162l3523m5171l2198k4704n8520l9315j887M4039
12974B267740L8428J0987k7592J0601J11996O5405K9307J0445l5329m2564k6759
12963B412665n973k3976L2613o7824k8045j8129m3954o0231k5702o1327j06787
12952B003330k3079j6606n7238q1117J5678p814k4565J1856q452o0162n2746p5793
$$ y = [28954285, 28111499, 27429439, 26631305, 25487255, 24021608, 22376027, 20690774, 19006945, 17475086, 16098776, 14839954, 13730427, 12688917, 11720139, 10887880, 10105226, 9379007, 8754357, 8123412, 7521082, 6938923, 6400390, 5954732, 5562265, 5226156, 5030475, 4865793, 4623668, 4284585, 3984874, 3672500, 3327834, 2996148, 2798733, 2639361, 2512181, 2459019, 2425496, 2380325, 2348127, 2323423, 2264903, 2225588, 2223701, 2267740, 2306168, 2317155, 2289563, 2300164, 2412160, 2477565, 2506872, 2517317, 2481988, 2439424, 2412665, 2406692, 2382716, 2415329, 2347505, 2319460, 2301331, 2257377, 2197146, 2171444, 2110117, 2003330, 1980251, 1963645, 1906407, 1825290, 1840968, 1833154, 1808589, 1820445, 1811993, 1751831, 1699085, 1623292]
12940A623292J7909L0919K9234R0281J00863J27108Q9087L3230K2694r4694j70833
12929A899090j19257j56010j95280p1940m6030j00678p4033r4334o3874j8358
12919I59296o6227m8730m401j5686j2039L8232L7466l7375L7220K6981j11912
12908H02825n8691l5418k5734m7652L127q900n3214k4156j4322r720o1177n8341
12896D08627o049m9200J9489j5247k4260q866O51Q842j0727k0516n8782o7028
12884A76934N30J07589M0227M0941L6639R5201J08127M0846j0638n0978j3538
12873E71880n5193j7670l1816j6476J1013M1480O367l3809k1343l2900M7629M232
12861D73394P9839M1395m1453j9206n9020j1339L2523L9141J7890L598P5402L5092
$$ y = [1623292, 1641201, 1672120, 1701354, 1791635, 1892498, 2019606, 2108693, 2141923, 2164617, 2069923, 1899090, 1779833, 1623823, 1428543, 1356603, 1310573, 1209895, 1135862, 1041528, 977654, 959296, 893069, 844339, 839938, 824252, 812213, 850445, 887911, 850536, 887756, 914737, 802825, 744134, 708716, 682982, 635330, 638457, 629557, 576343, 552187, 537865, 528145, 466968, 408627, 402578, 353378, 372867, 357620, 333360, 324494, 325145, 333987, 323260, 302744, 243962, 176934, 177464, 285053, 325280, 366221, 402860, 498061, 606188, 647034, 636396, 585418, 571880, 516687, 499017, 467201, 450725, 461738, 503218, 509585, 475776, 454433, 421533, 469162, 473394, 553233, 594628, 553175, 533969, 474949, 463610, 496133, 535274, 553164, 556762, 632164, 667256]
12849F67256m2001l6147J9489K5369k6553K5001P284J0713L3232L5973p411K9562
12837G41767l4405n1946j2260K6675L0691Q604j2806j9898M9893N558m1483j5260
12825F75130k113k8468J5543J4617P7726R4056O0327J02231m787p4998J1124l6202
12813I04186l5097m4896k0420k5097O303p5223j3860m348O1991L4283O275J3941
12801H08038k7908j6731N4842J2205N3998J4179m7666m8270m4244n4362R378l5733
12789F77726o3696j3246M6279N1582k0401M513l7314j6949Q910N9218p24j2774
12777F83124j7139j3128R743k5451p1284k884J4842L7224N9313O1087L6298M6016
12765H17761K6891q0871l9049O1259L9633l3138L996m0705p796K1219k748m6134
$$ y = [667256, 625255, 589108, 608597, 633966, 607413, 632414, 639698, 650411, 683643, 719616, 712205, 741767, 707362, 655416, 643156, 669831, 700522, 709126, 696320, 676422, 726315, 731873, 690390, 675130, 673017, 644549, 660092, 674709, 752435, 846491, 906818, 1009049, 1004262, 929264, 940388, 904186, 869089, 824193, 803773, 778676, 784979, 709756, 695896, 691548, 753539, 787822, 794097, 808038, 780130, 763399, 818241, 830446, 884444, 898623, 850957, 802687, 758443, 704081, 713459, 677726, 614030, 600784, 647063, 698645, 678244, 682757, 645443, 628494, 637404, 696622, 695898, 683124, 665985, 652857, 662600, 637149, 565865, 562981, 577823, 615047, 674360, 735447, 771745, 817761, 844652, 763781, 724732, 785991, 825624, 792486, 796482, 755777, 747981, 769200, 766452, 720318]
12753G20318l2360K5739L2901m1900K5163k330o6634m073M8321K3156p8617q715
12741F40969n405o0431n3494K9864L1535p147N533L9847O3530J8054J0797K7861
12729G41513Q753K2167j0596l0121O135L2984l8525K8186K8890p807j0708J8576
12717G89447M3853K689m2782m6254k3317N3856R0591K167l9614n0435j7939r1139
12705F71123n6042Q9006p169q066l5791K5090L0820O0268M2771P3363P4905J8664
12693I78942O2860l1950R869J2984J8986o5357j5963l1527N6387K3372J1642N9886
12681A090131L3525M8935K9266O4280N0133Q8278R5674R4217L0012r15l0893L889
12669A596532O1382K0634K750R87O5324O0769J8200m664L5238O9322J06895k8339
$$ y = [720318, 687958, 713697, 746598, 704698, 729861, 727531, 660897, 656824, 705145, 728301, 649684, 640969, 635564, 575133, 521639, 551503, 583038, 575891, 581424, 621271, 684801, 702855, 713652, 741513, 750266, 772433, 761837, 731716, 737851, 770835, 732310, 760496, 789386, 781579, 770871, 789447, 833300, 835989, 793207, 746953, 723636, 777492, 868083, 870250, 830636, 780201, 762262, 671123, 615081, 704087, 696918, 688852, 653061, 678151, 708971, 769239, 812010, 885373, 960278, 978942, 1041802, 1009852, 1019721, 1032705, 1051691, 986334, 970371, 938844, 995231, 1018603, 1030245, 1090131, 1123656, 1172591, 1201857, 1266137, 1316270, 1404548, 1500222, 1594439, 1624451, 1623536, 1592643, 1596532, 1657914, 1678548, 1681298, 1682285, 1747609, 1808378, 1826578, 1821914, 1857152, 1926474, 2033369, 2005030]
12657B005030o766P8816J03589J25441R6853M3190P7551J29309J01341J36595
12647B890949O3255l4345q0311n3910m9686l5806r467l57n836l4339r572j1486
12635B629089k197O9099p153O872L0212L6527J921M3636K6757N2955K6342P2077
12623B986137N9431M8264Q5277P2993J35561J11573O9522J34009K65026L00588
12613D268381K27289K04789O9540k3507j16312j68257j28735j30423k0521O8057
12603D250301R0566K1348L5565Q3048J16044L3132J36425J61263J38087K09765
12593E275544J49391Q1902J49451K07949K49775K38494K20092K57978L39266L80099
12583G549941M12763M80137N73608O16021P18995P08142P52119P76379Q44925
$$ y = [2005030, 1998264, 2077080, 2180669, 2306110, 2402963, 2446153, 2523704, 2653013, 2754354, 2890949, 2954204, 2919859, 2839548, 2785638, 2735952, 2700146, 2690679, 2690322, 2684486, 2650147, 2640575, 2629089, 2626892, 2695991, 2688838, 2695710, 2725922, 2762449, 2764370, 2808006, 2834763, 2887718, 2914060, 2986137, 3045568, 3093832, 3179109, 3252102, 3387663, 3499236, 3568758, 3702767, 3967793, 4268381, 4495670, 4700459, 4769999, 4746492, 4630180, 4461923, 4333188, 4202765, 4182244, 4250301, 4340867, 4362215, 4397780, 4480828, 4596872, 4630004, 4766429, 4927692, 5065779, 5275544, 5424935, 5506837, 5656288, 5864237, 6114012, 6352506, 6572598, 6830576, 7169842, 7549941, 7962704, 8442841, 9016449, 9632470, 10351465, 11059607, 11811726, 12588105, 13433030]
12574A3433030R30512R38659R13962J088947J279449J298742J383150J537234
12566B2803685J599296J719868J894010K065254K253624K462275K738417L091180
12558D0627609L393930L788368M342031N007483N926949O999551Q305777J0150936
12550H8542634J2661770J6223614K0996461K6730073L2463470L5699768L3107307
12543B66425097K2028037L192023j6565871k8374325l0130048k5656115j9162902
12536A71755896j2924370p730592l617704k73421K440265M837914P188262R371752
12528A71048002J1190977J2431638J2727389J2058059J0902662R706635R094198
12521B49159560R208267R658841J0315763J0815813J0835761J0042407Q171163
$$ y = [13433030, 14363542, 15302201, 16216163, 17305110, 18584559, 19883301, 21266451, 22803685, 24402981, 26122849, 28016859, 30082113, 32335737, 34798012, 37536429, 40627609, 44021539, 47809907, 52151938, 57159421, 63086370, 70085921, 78391698, 88542634, 101204404, 117428018, 138424479, 165154552, 197618022, 233317790, 266425097, 288453134, 291645157, 275079286, 246704961, 216574913, 190918798, 171755896, 158831526, 151100934, 147483230, 147209809, 149650074, 154487988, 161676250, 171048002, 182238979, 194670617, 207398006, 219456065, 230358727, 240065362, 249159560, 258367827, 268026668, 278342431, 289158244, 299994005, 310036412, 318207575]
12514C18207575N286737J552952k491015o019132q705766j0163935j0584729j0326842
12506B76755845r610983q758806q090087p673156p679598p864034q273951q583284
12498B10221946q503768p926343o806986n324054l478466j414619R79918L818890
12490A81566518P365118J1963399J7442258K3171168K7428988K7513842K0705661
12483C17156952O125423j3119723l0378528l8612692l7268672l1232141k4612449
12476A48058170j8811845j4342237j0958683q495345o611189n132981l933815
12469G9772075l090732k546302k424308k798990l514819m305568m717875m608804
12461E1764677m231504l858135l373507k863415k544961k253241j979371j794534
$$ y = [318207575, 323494312, 325047264, 322556249, 316537117, 307831351, 297667416, 287082687, 276755845, 267144862, 258386056, 250295969, 242622813, 234943215, 227079181, 218805230, 210221946, 201718178, 193791835, 186984849, 181660795, 178182329, 176767710, 177747628, 181566518, 188931636, 200895035, 218337293, 241508461, 268937449, 296451291, 317156952, 323282375, 310162652, 279784124, 241171432, 203902760, 172670619, 148058170, 129246325, 114904088, 103945405, 95450060, 88838871, 83705890, 79772075, 76681343, 74135041, 71710733, 68911743, 65396924, 61091356, 56373481, 51764677, 47533173, 43675038, 40301531, 37438116, 34893155, 32639914, 30660543, 28866009]
12453B8866009j740050j763800j759959j790457j767436j682873j570912j330306
12445A5460216j171964r70664p74384o31601n87790n91037p26350p12193o76936
12436H617297o72682n91824m40572l57117l40090l65993k98195j76902o4188j43075
12426E166659j42653j23024j12148j32137j27361j29544j54462q5179o7440j07733
12416C984978r1562j41202j22781p3079p0255o4548m827m7572p4376m7168L5452
12405C283060K2692O8348L6507J4545J7J039Q7878M3717L1073M2879j6395l2953
12393C582407l9956k1237O387j5246N553p442o1203n3821j01161n0683p911j501
12381C234186o2263k7723m1720q22q538K8493n26k7228M5804M7896R243p823j0871
$$ y = [28866009, 27125959, 25362159, 23602200, 21811743, 20044307, 18361434, 16790522, 15460216, 14288252, 13317588, 12543204, 11911603, 11323813, 10732776, 10006426, 9294233, 8617297, 7944615, 7352791, 6912219, 6555102, 6215012, 5849019, 5550824, 5373922, 5309734, 5166659, 5024006, 4900982, 4788834, 4656697, 4529336, 4399792, 4245330, 4160151, 4092711, 3984978, 3893416, 3752214, 3629433, 3556354, 3486099, 3421551, 3416724, 3369152, 3294776, 3247608, 3283060, 3305752, 3374100, 3410607, 3425152, 3425169, 3426208, 3514086, 3557803, 3588876, 3631755, 3615360, 3582407, 3542451, 3521214, 3527601, 3512355, 3517908, 3510466, 3449263, 3395442, 3294281, 3243598, 3235687, 3234186, 3171923, 3144200, 3102480, 3101658, 3093120, 3121613, 3121087, 3093859, 3139663, 3187559, 3196802, 3188979, 3178108]
12368C178108M0572J10408M3551m1370R302l8731j08211q4676q0644l6679j39802
12357B851828j13936j32629j50395j63587j15899l0951o2977l3975J5710o4279
12347A998910p2355q9245n6926o5130m1518q4026k8063Q904j4890k2806R683j6748
12335A525790K4154M1528O2046Q2940J21268K14389M21891N60935N23120L46294
12325C924355j91566n97296o38815m60046k79973k15591j55526j09564j04537
12316A171441j4802l3390n6223l3848n666R7610M9183m8592p2590j3747m8587
12305I90789n5340j099J483o1112L916J2179j8253N0364M3121O4117J15196L0210
12293A175571J7229N1125J25048J51250J77839K81484M90025P15694R69534J056287
$$ y = [3178108, 3218680, 3329088, 3372639, 3331269, 3340571, 3301840, 3193629, 3108953, 3028309, 2991630, 2851828, 2737892, 2605263, 2454868, 2291281, 2175382, 2144431, 2081454, 2047479, 2063189, 1998910, 1926555, 1837310, 1780384, 1715254, 1673736, 1589710, 1561647, 1570551, 1555661, 1532855, 1542538, 1525790, 1549944, 1591472, 1653518, 1736458, 1857726, 2072115, 2494006, 3054941, 3578061, 3924355, 3732789, 3135493, 2496678, 2036632, 1756659, 1541068, 1385542, 1275978, 1171441, 1156639, 1123249, 1067026, 1033178, 1027512, 1125122, 1174305, 1125713, 1053123, 1039376, 990789, 935449, 934350, 935833, 874721, 878637, 890816, 872563, 922927, 966048, 1030165, 1145361, 1175571, 1192800, 1243925, 1368973, 1520223, 1698062, 1979546, 2469571, 3185265, 4154799, 5211086]
12283E211086Q48823J01243p48023q36690q46998q53849o54741l98854k49587
12274A572410j88777j33345m5537N08J4593o610r324K82q37k6565o8197r0908
12262A017693n2401o5392J710l1013j04255m8895J0324k699k5359L6851Q910k333
12250G43141J1150L6294Q6356O2278P2717O5848J03617K08386M49205O28590O11808
12239C079390M95277O5986m40103q41038p06234m27505k74539j80718j44147q0943
12229E45426j7646K3851q6587k0200N635n9565l2680m7020l0220m2906n8805j0651
12217A68632J7717l3288r5283p0539j6246l3833q2750p3053r0477k4052K16O8498
12205b64458J12490O0609N5255L6873R930J9972j6476n3010k3381l8846l4301
$$ y = [5211086, 6059909, 6161152, 5413129, 4576439, 3729441, 2875592, 2220851, 1821997, 1572410, 1383633, 1250288, 1204751, 1205259, 1219852, 1213242, 1203918, 1204200, 1203363, 1176798, 1108601, 1017693, 965292, 899900, 901610, 870597, 766342, 717447, 727771, 725072, 699713, 736564, 745474, 743141, 754291, 790585, 876941, 939219, 1011936, 1077784, 1181401, 1389787, 1838992, 2467582, 3079390, 3574667, 3640653, 3200550, 2359512, 1653278, 1225773, 951234, 770516, 626369, 545426, 527780, 551631, 465044, 444844, 450479, 390914, 358234, 311214, 280994, 238088, 179283, 168632, 186349, 153061, 57778, -12761, -29007, -62840, -145590, -218643, -309120, -333172, -332956, -264458, -151968, -91359, -36104, 769, 10699, 30671, 14195, -38815, -62196, -101042, -135343]
12194a35343k0332m3750l9213K1929J0248j6689k3092J3498j8299K2449P369k6457
12182b47682n942Q849K8761l7625J8481L6596k5716q031L7486k054K3853R6046
12170g6978N0383L8375N767p314K3574K9676n5066n164K8564P3171J7813m3069
12158G9732n6654L361k505M527L7963m1717j3619J2685k0613p734P0736O7290
12146A33452R8331J37215R9130j3267j3051L6141L0674Q842K1432Q2072L6999
12135F57970N4137N3105J4706L0218M8671O1960R8407L0522J53470J85395J75467
12124A564028J68812J41614K18105K61027J25606L8927l3338n1885j13688j18901
12114B200307p3479r4959j16513r2372l892K1758l3905j8908o661M1433K6029
$$ y = [-135343, -155675, -199425, -238638, -216709, -206461, -223150, -246242, -232744, -251043, -228594, -221225, -247682, -253624, -244775, -216014, -253639, -235158, -198562, -224278, -232309, -194823, -196877, -173024, -76978, -26595, 11780, 17547, 10233, 33807, 63483, 8417, 3253, 31817, 104988, 122801, 79732, 23078, 26439, 23934, 28461, 66424, 24707, 11088, 23773, 3160, -4574, 66162, 133452, 231783, 368998, 468128, 454861, 441810, 477951, 508625, 517467, 538899, 620971, 657970, 712107, 765212, 779918, 810136, 858807, 920767, 1019174, 1049696, 1203166, 1388561, 1564028, 1732840, 1874454, 2092559, 2353586, 2479192, 2518119, 2484781, 2432896, 2319208, 2200307, 2126828, 2031869, 1915356, 1822984, 1819092, 1840850, 1806945, 1788037, 1781376, 1822809, 1848838]
12103A848838K3408K4919N5545L3804J00440J53469R9635R1743O9809P7255K05940
12092B784805K03418K04853L15062L01800J94226J36378R5560r8418k48921k78084
12082C610679k94194j93158k16293k43526j62236j39444q7956m5256J0535j463
12072B237688N7484R8356M4050R7125M7403M5115N6685O9154O4704P6171J33890
12061C027825J19017O8149Q0108M5814K5299J044j46728k55435k35756k21240
12051B508097j26059j02118r1540j01342q5248p8457m7016m4402q4114q9781n8509
12040A599511o0021m7059p5564k5625k5190m8867k2018J6776J08312J35999Q4158
12029A640412J6999Q6065P5419m2067j07675j46035k07193k32562j50218j26104
$$ y = [1848838, 1872246, 1897165, 1952710, 1986514, 2086954, 2240423, 2340058, 2431801, 2501610, 2578865, 2784805, 2988223, 3193076, 3508138, 3809938, 4004164, 4140542, 4236102, 4137684, 3888763, 3610679, 3316485, 3123327, 2907034, 2663508, 2501272, 2361828, 2273872, 2228616, 2239151, 2237688, 2295172, 2393528, 2437578, 2534703, 2582106, 2627221, 2683906, 2753060, 2817764, 2893935, 3027825, 3146842, 3214991, 3295099, 3340913, 3366212, 3367256, 3220528, 2965093, 2729337, 2508097, 2382038, 2279920, 2188380, 2087038, 2001790, 1923333, 1876317, 1831915, 1747801, 1658020, 1599511, 1539490, 1492431, 1416867, 1391242, 1366052, 1317185, 1295167, 1311943, 1420255, 1556254, 1640412, 1657411, 1743476, 1818895, 1776828, 1669153, 1523118, 1315925, 1083363, 933145, 807041]
12019H07041m7506l4130n0578j8321p2979n5711k7981j6481l8893J1051j3875
12008D41637m6509k9609l4862o1117o4065O1578l477l2323j4680l2857o5898l5257
11996H2561K5044M8954Q036k1246o7027p6747J5674O8424O6928l8082k5377J5286
11984A02428K4010m705M9609M1625o363q8376O448O4323K5882l6722k3660J3885
11972A68384L820m2335K051k1295L3948J2163o6311o2743j8383k9674M0657N414
11960B5696K6634j6057p7511j2425R1773M7301k662N6563N695K9020L860m3074
11948A34813j4018J1098R520k3903l4845l4322q2426m5330M308P5413O9367l0332
11936C9343L2617J9360m8537J7335l5111J7459p084p4339R033N1230L7394l9579
$$ y = [807041, 759535, 725405, 674827, 656506, 583527, 527816, 499835, 483354, 444461, 455512, 441637, 395128, 365519, 330657, 269540, 205475, 267053, 263576, 231253, 216573, 183716, 117818, 82561, 107605, 156559, 164595, 143349, 76322, -425, 15249, 83673, 150601, 112519, 87142, 102428, 126438, 121733, 171342, 212967, 206604, 118228, 124676, 188999, 214881, 178159, 154499, 168384, 172204, 129869, 131920, 110625, 144573, 156736, 90425, 27682, 9299, -20375, 20282, 25696, 52330, 36273, -41238, -53663, 38110, 85411, 82749, 139312, 145007, 174027, 177887, 134813, 120795, 131893, 141413, 117510, 82665, 48343, -34083, -79413, -75105, 308, 69675, 39343, 71960, 91320, 42783, 60118, 25007, 42466, 35382, -38957, -29924, 21306, 58700, 19121]
11924A9121k1382M398J1383O6092K4200l1934J0042J3516l1871m6812m4098m5217
11912g2562K4117K5047R3379J6053O520j8687k0000j1690L362p842j0284R495
11900C6908L522j4846k183J5884Q029K2160L0050n9600K847K437n2912J8348K0073
11887C0717o779k988k3413J4388L7020k1131j829k1232k8242M7976J8412J20J3075
11874E6094M645O0088K057l1979o1459m1308j5100l2130j5521j757Q8351N0545
11862F2526j8014M1953J7066n2242L1453Q443R79L7042m3165j1545j7035j5891
11850D1570o5067k5945J7958R642L833K0205K3415r410l853K0845p9736n0174
11838i6717O2201K4443q01k2029J6773l277l2761O4364M186j2695J6216M839k2296
$$ y = [19121, -2261, 2137, 13520, 79612, 103812, 71878, 81920, 95436, 63565, 16753, -27345, -72562, -48445, -23398, 69981, 86034, 92554, 73867, 53867, 42177, 45539, 37697, 27413, 36908, 40430, 25584, 23401, 39285, 47314, 69474, 99524, 39924, 42771, 45208, -7704, 10644, 30717, 23938, 20950, -2463, 11925, 48945, 27814, 25985, 4753, -23489, 24487, 42899, 43019, 56094, 60739, 120827, 122884, 90905, 29446, -11862, -26962, -59092, -74613, -76370, 11981, 62526, 44512, 86465, 103531, 51289, 82742, 91185, 92164, 129206, 86041, 74496, 57461, 41570, -23497, -49442, -31484, -21842, -18009, 2196, 25611, 16201, 12348, 33193, -46543, -96717, -34516, -10073, -10874, -32903, -16130, -19407, -52168, 12196, 16382, 3687, 19903, 24742, 2446]
11825B446l4966M696J4360L2995k1977n905l0625K4231j0387M9308N9010N2205
11813A35391j2846O471O110o193J0738q204J9600n2827l9299j1844R923l233M3016
11800I6803P564k2294j1849j5485k2648j1136o847l9802P70j3553n528J8587K0411
11787e007m8415l7968j8377K9268O0434M0268N0553P258O25L1711L0520n4607
11775H6263l655P1832k0106n9528k0145j4367p841L6243J6791N5865K488n0894
11763I2946m3929p43j833k3441n7687l9585M5715J5828N9265l4370r092J4777
11751A7851J5416N798J8814k357O755l5930j0215K7443M688l9591o783K3201M069
11738B9159L5420J1288O116O2810N40l4660k8141m0081j1232K4892Q1168Q179
$$ y = [2446, -32520, -27824, -13464, 19531, -2446, -8351, -38976, -14745, -25132, 24176, 83186, 135391, 122545, 129016, 135126, 128933, 139671, 131467, 151067, 98240, 58941, 47097, 57020, 53787, 96803, 104367, 82073, 70224, 54739, 32091, 20955, 14108, -25694, -24924, -38477, -44005, -25418, -5007, -53422, -91390, -109767, -80499, -20065, 20203, 70756, 78014, 78639, 110350, 140870, 86263, 82608, 154440, 134334, 74806, 54661, 40294, 32453, 68696, 85487, 141352, 143840, 92946, 49017, 48274, 46441, 23000, -34687, -74272, -28557, -12729, 46536, 12166, 3074, 17851, 33267, 39065, 57879, 55522, 62277, 26347, 16132, 43575, 48263, 8672, 1889, 25090, 29159, 64579, 75867, 81983, 144793, 145333, 110673, 82532, 42451, 31219, 56111, 137279, 145458]
11726A45458j0163k953n2871k0202n553l5294n9207l9855O6557P3258K4004k5052
11714E8127j3573l1590k7517L8178L6621O823l0785k0106r278J06434J9194n6481
11702G6047p6113Q952j2769o0064k5505K2010K4642K3293l6924o21j7842L6041
11690c8853Q2745J9754n091o6231L4738R163o891K2327j574M4783L3226k6292
11678A01804j8450q4507M2769K1631r86R073K929M6827K059l9636m1096k720K6745
11665F6442j5502l4775M610J712N3089K5708n9884k3883K6678L8855j985J050
11653H2115L6401n2318k7488M688Q090M3217q102q121m122J7182m331m372k5866
11640E6973L2920J3099L5561n465k4812j8430q856N3167j3544m2330l3117n4538
$$ y = [145458, 135295, 132342, 79471, 59269, 53716, 18422, -40785, -80640, -14083, 59175, 83179, 58127, 44554, 12964, -14553, 23625, 60246, 67069, 36284, 16178, 6900, 113334, 132528, 76047, -66, 8886, -3883, -63947, -89452, -67442, -42800, -19507, -56431, -57052, -74894, -38853, 43892, 63646, 58555, -7676, 27062, 36225, 29334, 51661, 50087, 94870, 128096, 101804, 83354, -1153, 41616, 63247, 62261, 71334, 74263, 121090, 123149, 83513, 42417, 39697, 66442, 50940, 16165, 20775, 22487, 75576, 101284, 41400, 17517, 44195, 83050, 81065, 82115, 118516, 66198, 38710, 43398, 51488, 94705, 86603, 78482, 74360, 91542, 87211, 82839, 56973, 89893, 102992, 138553, 133088, 108276, 89846, 80990, 134157, 120613, 78283, 45166, -9372]
11628i372M8932M9485P86j3511j1751j937M1870l1069l1591K3117O0164L07n3373
11615G2057J119K5132o3812n3689J1303J06578K3557k636L187L7013Q244k8955
11603A39098o160J8332l1741J4506k8482p713m829j0067j9295o456K829k6856
11591C3166p065l5777J8369J7298k4610q519M1505R5763J5665k3215k0786j8441
11579H3353J7298M1589k0979l8058k3634J0378M9303L8099j5812l7075L9522j8881
11567A25103K689k5582j8155Q428n553J9525M5275k3831J802N1230n3928l8171
11555H8832L2549J1410l7845o1990J4072J833L6923J6666J6209P7340P821j313
11543B02507Q862k5282p7781m5765J3413L0260p204J8696Q211N0177N290p9067
$$ y = [-9372, 39560, 89045, 89831, 76320, 64569, 62632, 104502, 73433, 41842, 64959, 125123, 125430, 72057, 73176, 98308, 34496, -19193, -7890, 98688, 122245, 119609, 122796, 159809, 168053, 139098, 132938, 151270, 119529, 134035, 105553, 97840, 93011, 82944, 63649, 57193, 60022, 33166, 26101, -9676, 8693, 25991, 1381, -7138, 34367, 130130, 145795, 122580, 101794, 83353, 100651, 142240, 121261, 83203, 59569, 69947, 119250, 157349, 141537, 104462, 143984, 125103, 127792, 102210, 84055, 92483, 86930, 106455, 151730, 127899, 129701, 180931, 127003, 88832, 121381, 132791, 94946, 32956, 47028, 48861, 85784, 102450, 118659, 195999, 203820, 202507, 211369, 186087, 108306, 62541, 75954, 106214, 99010, 117706, 125917, 176094, 181384, 102317]
11531A02317L594P7836J1679K0769m0125j9688K997n9980m5782K0667K1881L3225
11519A29390j7412n345k6571q11O7924O1993J686r988j5739j8866j9994M6537
11507A92804J0053m0529o81k5462k8703P1910R071p0522J0488k2139j0768L7132
11495A32654m072L0589N6939O6097J1442n55J3556j1223k8075J1917r114K9861
11483C00016M0209k4024n9897J4206Q3990Q4520O7964K9134J45825J16730J04978
11472I03651P4176O850j22160j20808m5454q1668r2543n0983k0522m6618l3197
11461C70724R511P0q346M6983k3479j4132K7834p012J52K1294J0555K2956jl5653
11447D21456P0031j8001L3155R8323N3699J31742J11733J55974K22431J72133
$$ y = [102317, 105911, 183747, 195426, 216195, 176070, 156382, 159379, 99399, 53617, 74284, 96165, 129390, 111978, 106633, 80062, 79251, 147175, 209168, 210854, 200866, 185127, 166261, 146267, 192804, 202857, 162328, 161647, 136185, 107482, 179392, 188463, 117941, 128429, 106290, 95522, 132654, 128582, 159171, 216110, 282207, 293649, 293094, 306650, 295427, 267352, 279269, 270155, 300016, 340225, 316201, 256304, 270510, 354500, 439020, 506984, 536118, 681943, 798673, 903651, 977827, 984677, 862517, 741709, 696255, 614587, 522044, 471061, 450539, 403921, 370724, 380235, 380305, 371959, 418942, 395463, 381331, 409165, 402153, 402305, 423599, 434154, 457110, 457109, 421456, 491487, 473486, 506641, 604964, 658663, 790405, 902138, 1058112, 1280543, 1452676]
11437A452676J63649J03985p006j69856j93249k58744j97862j38598p5291o1983
11427F17721o0082J0486L6883K5403O880q4129p4149o781k5474N49P582L307m429
11414D53767n450k4027J0973k4635j3103N1578K7562l3499k50J7321Q6210J02466
11402F48913J19147Q9665K483j2594r8926j37647j17964j0164l1176L2887O7983
11391E52607k0686j2845j9488p6145k2639k4918l4643L0995k6069j3335j3541
11380C19293K4376J7393l4104n9318l0679K5127j2541n2667K6025J5623K1426
11369B59954N3998q942o9610o4232M5202L734P4151K131j0165k7572K9581K3686
11357C11916O2166R5282M2727L4271N1831k6862k9535r538L921L020Q133l0009
$$ y = [1452676, 1616325, 1720310, 1713304, 1543448, 1350199, 1091455, 893593, 754995, 679704, 617721, 557639, 568125, 605008, 630411, 637291, 553162, 479013, 472232, 446758, 447307, 454889, 458196, 453767, 448317, 424290, 435263, 410628, 397525, 449103, 476665, 443166, 442916, 460237, 546447, 648913, 768060, 857725, 860208, 847614, 748688, 611041, 493077, 482913, 451737, 484624, 552607, 531921, 519076, 499588, 423443, 400804, 375886, 341243, 372238, 346169, 332834, 319293, 343669, 361062, 326958, 267640, 236961, 262088, 249547, 196880, 222905, 238528, 259954, 313952, 305010, 235400, 171168, 216370, 220104, 294255, 296386, 286221, 258649, 288230, 311916, 374082, 469364, 512091, 546362, 598193, 571331, 541796, 532258, 536179, 539199, 547332, 517323]
11345E17323n3417n0900o6218k9880K6451M0373L6677J8694J7060J5684R774k6690
11333D54931q759l5609m6872J7590P0278m44k7549m678l62L0648K9351l910k9889
11320D44726N6812K2790o421M1693j3851l5976m3560n81l9788m522m961J2949
11308D29310j4650q019q388j6640J8477l9901K4488j4764Q980m0996r496M1072
11296C69473L2621J8700k0463N1639M4084o4216m220L9849j7426k00l2491j8399
11284C98951J3048M8382O9288J9825k5693n8616K8789N8307M1290J3064q0488
11273E26147J7624R5342J8640o5620p8056l9453p9196j8660K5182J6157K9274
11262D47381L7007P806k2556m3298J1888J2077K9601K4108r420J7339J9783r905
$$ y = [517323, 463906, 413006, 346788, 316908, 343359, 383732, 420409, 439103, 456163, 471847, 481621, 454931, 446172, 410563, 363691, 381281, 451559, 451115, 423566, 418888, 418526, 449174, 478525, 474615, 444726, 501538, 524328, 517907, 559600, 545749, 509773, 466213, 465632, 425844, 421322, 416361, 429310, 414660, 406641, 398253, 381613, 400090, 360189, 384677, 369913, 378893, 337897, 328401, 369473, 402094, 420794, 400331, 451970, 496054, 431838, 427618, 467467, 450041, 449841, 417350, 398951, 411999, 460381, 529669, 549494, 523801, 465185, 493974, 552281, 593571, 606635, 526147, 543771, 639113, 657753, 592133, 514077, 474624, 395428, 376768, 401950, 418107, 447381, 484388, 492194, 469638, 426340, 438228, 450305, 479906, 504014, 494594, 511933, 531716, 521811]
11250E21811L2113K599j8250l7924M5448K1892j7813n3279l7152N255J2966k3463
11238D54203P03m173Q385J09503L1649n1726r953L7515N1791O43l8526k3409j2906
11225E53699k5614J581j0988l1018j976Q000p360P31l9303m9713O9660M3344K0696
11212E31739l1625m506M4233L0798L1664J5241m6366j2050L0638L1640m5814L287
11200E78879K0661j1968J6752M017M2646R1168R360K2490j041j0945j6488J3333
11188G58864m798J694L4359P0773M7098l1488m403J6476J3839o0342k1165J8026
11176H38933N6367Q467K7031M4833N5113M2918J05453R1313R1585J40068J75174
11165A677255P5665N9836j5453n5792j10418j27604o2998j4096n7195k4967Q411
$$ y = [521811, 553924, 556523, 538273, 500349, 545797, 567689, 549876, 496597, 459445, 464700, 477666, 454203, 454906, 450733, 459118, 568621, 600270, 548544, 538591, 576106, 627897, 628540, 590014, 566605, 553699, 528085, 529666, 518678, 487660, 485684, 493684, 486324, 487055, 447752, 398039, 467699, 511043, 531739, 500114, 495608, 539841, 570639, 602303, 617544, 571178, 559128, 589766, 621406, 575592, 578879, 599540, 587572, 604324, 608341, 650987, 742155, 751515, 774005, 772964, 762019, 745531, 758864, 754066, 755760, 790119, 860892, 907990, 876502, 872099, 888575, 902414, 842072, 820907, 838933, 895300, 903767, 930798, 975631, 1030744, 1073662, 1179115, 1270428, 1362013, 1502081, 1677255, 1752920, 1812756, 1797303, 1741511, 1631093, 1503489, 1440491, 1426395, 1369200, 1344233, 1352644]
11154A352644O7479O2126M9165M7279L1538R1280O5556M1336j7502m4324p0758
11143A675819m2631O146Q015J1188L2696K1772R3548O3242J37872R8675J85648
11132B291990K62889K43189K98232K24708P6758p8648j17846j24000j10137m4659
11122B922476J0039J1630P5769J70364J51033M8675L2911K8566P014r514L1636
11111C480599N4844o3760n1395J9854M5336O0785O4387J02126J10152J46965J11695
11100D081588M2134J58278K18706K95764L49302L54902L74586L43633K63261K65325
11090F747479K37244L11235L84274M08468N33933N99108N70707N05996N13807
11081A0812251N49672O06424O93282O98038P49516R08209R78587J023146J158928
$$ y = [1352644, 1420123, 1482249, 1531414, 1578693, 1610231, 1701511, 1767067, 1808403, 1790901, 1746577, 1675819, 1633188, 1639334, 1647349, 1658537, 1691233, 1713005, 1806553, 1869795, 2007667, 2106342, 2291990, 2554879, 2798068, 3096300, 3321008, 3397766, 3319118, 3201272, 3077272, 2967135, 2922476, 2932515, 2944145, 3019914, 3190278, 3341311, 3389986, 3422897, 3451463, 3458477, 3448963, 3480599, 3535443, 3471683, 3420288, 3440142, 3485478, 3546263, 3610650, 3712776, 3822928, 3969893, 4081588, 4123722, 4282000, 4500706, 4796470, 5145772, 5500674, 5875260, 6218893, 6482154, 6747479, 6984723, 7295958, 7680232, 8088700, 8622633, 9221741, 9792448, 10298444, 10812251, 11361923, 11968347, 12661629, 13359667, 14109183, 15017392, 15995979, 17019125, 18178053]
11072A8178053J282763J496182J625422J832988J991492K191664K564172L130658
11064C4293394L702003M498775N808457Q079435J1509079J6251626K1734229K5827585
11056A31704583K4613751J4766331l654313k2002157k7874305k3137589j6091197
11049G8325104j0581084o861706m358819k580146j261586k62918L51992O71566
11041E3442403O13451M93683N35427N65035N43225N46219Q83733J299593J660810
11032F0583579K012566K567455L383494M411563N763017P499573J0214469J4796984
11024A11232700K1887942L1692658M2269236M8803304M4056318K1983389j2697205
11017C09228342m4223327n5587036m6666709l2730937k1883493j4740357r905448
$$ y = [18178053, 19460816, 20956998, 22582420, 24415408, 26406900, 28598564, 31162736, 34293394, 37995397, 42494172, 48302629, 56382064, 67891143, 84142769, 105876998, 131704583, 156318334, 171084665, 167430352, 145428195, 117553890, 94416301, 78325104, 67744020, 60882314, 56523495, 53943349, 52681763, 52418845, 52770837, 53442403, 54055854, 54549537, 55084964, 55649999, 56193224, 56739443, 57623176, 58922769, 60583579, 62596145, 65163600, 68547094, 72958657, 78721674, 86221247, 96435716, 111232700, 133120642, 164813300, 207082536, 255885840, 299942158, 321925547, 309228342, 265005015, 209417979, 162751270, 130020333, 108136840, 93396483, 83491035]
11010H3491035o695784m607016k964857j794081r48060k98088K8659j06024o49880
11001F5455904j390325j729501j637294j345190j096190r30908r44655o31848
10993E5749993J45462J129775K262320L734687O027779R396612J3803005J8665860
10985A10915493K1784148J9800853R778287p669498k3654179k7773779k2646079
10978H0535246j6076844j1053630p593739n321692l785491k730211j901024j368694
10970C0703921j065859p70754n76578o26617r77332j373177j660480j716392j714551
10961B0222181j545542j268164j088024r13585p01218l71338j40992k39179o40466
10952A3313673j113213j354201j236804j114384q98600p62362o72434m85947m30106
$$ y = [83491035, 76795251, 72188235, 69223378, 67429297, 66481237, 66183149, 66211808, 66105784, 65455904, 64065579, 62336078, 60698784, 59353594, 58257404, 57326496, 56381841, 55749993, 55895455, 57025230, 59287550, 63022237, 69050016, 78446628, 92249633, 110915493, 132699641, 152500494, 162278781, 154609283, 130955104, 103181325, 80535246, 64458402, 53404772, 45811033, 40489341, 36703850, 33973639, 32072615, 30703921, 29638062, 28867308, 28290730, 27664113, 26686781, 25313604, 23653124, 21936732, 20222181, 18676639, 17408475, 16320451, 15406866, 14705648, 14334310, 14193318, 13954139, 13313673, 12200460, 10846259, 9609455, 8495071, 7596471, 6834109, 6161675, 5675728, 5245622]
10943E245622m13148k82238k37965k19104j84042j40085j61840j54766j19649
10934C332785j30173j31483j09556m4992J9249n2021m5957M4459M782K6827o1955
10923B851965n4847l9011j9057N7560Q7315J69034K01866K09408L43520N27736
10913D335489P54909Q59732P68655N29689J17897n55239j216564j163953o76765
10904C753850m58922l09419k41950r2039m9045k2222K3858Q9864J19414Q6800
10894B900189p3079j26172j29715r8389r4378j08938n5402p0885j41043k5764
10884A976424L7296O6594k6589l0765l4154l4921J8480P0732P3240N6386J5648
10873B188371K0787R1707J94810K93644M40634N03536M66969K83012j71944n03498
$$ y = [5245622, 4832474, 4550236, 4312271, 4093167, 3909125, 3769040, 3607200, 3452434, 3332785, 3202612, 3071129, 2961573, 2916581, 2935830, 2883809, 2837852, 2882311, 2887093, 2913920, 2851965, 2797118, 2758107, 2739050, 2796610, 2883925, 3052959, 3254825, 3464233, 3807753, 4335489, 5090398, 5950130, 6718785, 7248474, 7366371, 6811132, 5594568, 4430615, 3753850, 3294928, 2985509, 2743559, 2651520, 2602475, 2580253, 2604111, 2693975, 2813389, 2900189, 2827110, 2700938, 2571223, 2472834, 2378456, 2269518, 2214116, 2143231, 2002188, 1976424, 2013720, 2080314, 2053725, 2022960, 1988806, 1953885, 1972365, 2043097, 2116337, 2172723, 2188371, 2209158, 2300865, 2495675, 2789319, 3229953, 3733489, 4200458, 4483470, 4311526, 3808028]
10863C808028n74303m68764l15140j43236o3013r1189r6353k6424j6478j2190
10853B000938l3118L522N8198K4844j03272l196j3802o8927p0077m7204K8994
10842A776900k9970K0895P7937K7002P1174J400k071K6212K3570K4764J12285
10831B130098N3531Q2774J07027J33280K02029K86187K99959K53352J2839j00317
10821C460759j08671j65395j01478k5570L1245Q1955O0632L6865j2621M3779N9615
10810C361115P1008R7498Q8359O5930L1257L2538J26544J68128J92521J88068
10800D422966J53144Q9801n984k7679j2994m1520n221j553P4733J46558K67712
10789E059963M12552M01874M49961L76807J14911k90832l90283k97051j73422
$$ y = [3808028, 3233725, 2764961, 2449821, 2306585, 2243572, 2152383, 2056030, 2029606, 2013128, 2000938, 1967820, 1971342, 2029540, 2054384, 1951112, 1947916, 1934114, 1865187, 1795110, 1747906, 1776900, 1746930, 1767825, 1845762, 1872764, 1943938, 1945338, 1943267, 1969479, 1993049, 2017813, 2130098, 2183629, 2266403, 2373430, 2506710, 2708739, 2994926, 3294885, 3548237, 3561076, 3460759, 3352088, 3186693, 3085215, 3059645, 3090890, 3172845, 3233477, 3270342, 3257721, 3301500, 3361115, 3432123, 3529621, 3617980, 3683910, 3715167, 3747705, 3874249, 4042377, 4234898, 4422966, 4576110, 4665911, 4659927, 4632248, 4619254, 4577734, 4572513, 4570960, 4645693, 4792251, 5059963, 5472515, 5874389, 6324350, 6701157, 6816068, 6525236, 6134953, 5837902, 5664480]
10780E664480j29936r1300m1151l905J7919N0929P4534J14545J22401J69045J51731
10769F099292P5207L9856o490l5776L449J1051L8368K2153P0290J37909K04769
10758F660078J06729Q2001J20275Q3245J52968K42387K95555L76077L58388L80674
10748H858377L10824K48107J12885J00718J61558K57123L47239M22933M89690
10739A1309454M65324M39529M68472N32024O10871O62798P59850Q55511J015154
10730A7118987J051066J101550J234354J309656J428538J645972J718897J812900
10722B8421920J920936J988602K081723K311250K616770K880006L146199L541190
10714D8908596L891718M388608N044428N790244O600908P671779R063458J0736688
$$ y = [5664480, 5534544, 5443244, 5402093, 5398188, 5416107, 5467036, 5541570, 5656115, 5778516, 5947561, 6099292, 6174499, 6214355, 6207865, 6172089, 6175538, 6186589, 6224957, 6247110, 6317400, 6455309, 6660078, 6766807, 6848808, 6969083, 7052328, 7205296, 7447683, 7743238, 8119315, 8477703, 8858377, 9169201, 9417308, 9530193, 9630911, 9792469, 10049592, 10396831, 10819764, 11309454, 11774778, 12214307, 12682779, 13214803, 13825674, 14488472, 15248322, 16103833, 17118987, 18170053, 19271603, 20505957, 21815613, 23244151, 24890123, 26609020, 28421920, 30342856, 32331458, 34413181, 36724431, 39341201, 42221207, 45367406, 48908596, 52800314, 57188922, 62233350, 68023594, 74624502, 82296281, 91359739, 102096427]
10706A02096427J2808333J5270923J8101048K0946794K3023839K3138174K0109814
10699B35495352J3378939L915216n717693j2850954j6209836j6263238j4143375
10692A87604411j0984199p627637m359853j266586J716852M377973O849969Q913272
10684A85224202J0342767J0538562R540722P336787M351711J614912O9620K79567
10676B29298850K178250N159147Q555587J1597450J3677648J3907089J1684304
10669B96058325O886910M39568o315028j1586132j4172917j4033202j1966006
10662B45311518q917269n724631l076011j494302j511402k999709n220773p275881
10654B09091540q547201q724630p944215o485127m604027k421034j50544K282744
$$ y = [102096427, 114904760, 130175683, 148276731, 169223525, 192247364, 215385538, 235495352, 248874291, 252789507, 247071814, 234220860, 218011024, 201747786, 187604411, 176620212, 168992575, 164632722, 163366136, 165082988, 169460961, 176310930, 185224202, 195566969, 206105531, 215646253, 222983040, 227334751, 228949663, 229019283, 229298850, 231477100, 236636247, 245191834, 256789284, 270466932, 284374021, 296058325, 302945235, 303384803, 297069775, 285483643, 271310726, 257277524, 245311518, 236394249, 230669618, 227593607, 226099305, 224587903, 221588194, 216367421, 209091540, 200544339, 191819709, 183875494, 177390367, 172786340, 170365306, 170214762, 172497506]
10646A72497506M833793P477029R888795J1859574J2747460J1803677Q207816
10639B39315650K058845n724070j3302972j8535320k0736593k0190233j8086339
10632A44798968j5521433j3143020j0986270q998138p429578o172784n147771
10625G7399974m380504l871891l552484l333204l237778l224968l144201k984570
10617D9670374k802630k665218k427437k062761j724965j353836j000078n79044
10609C5054405l54028k83098m57079r79777j693635k297840k454613k332069j905156
10600B2297110j544466j200268r14111o71905m83338n43652n87450m28331l29244
10591A5594345k39917j15843k03311k76607k64208k38462j74583J9694P4177J64751
$$ y = [172497506, 177331299, 184808328, 194697123, 206556697, 219304157, 231107834, 239315650, 241374495, 235650425, 222347453, 203812133, 183075540, 162885307, 144798968, 129277535, 116134515, 105148245, 96150107, 88720529, 82547745, 77399974, 73019470, 69147579, 65595095, 62261891, 59024113, 55799145, 52654944, 49670374, 46867744, 44202526, 41775089, 39712328, 37987363, 36633527, 35633449, 35054405, 34700377, 34417279, 33960200, 32980423, 31286788, 28988948, 26534335, 24202266, 22297110, 20752644, 19552376, 18638265, 17966360, 17483022, 16939370, 16351920, 15923589, 15594345, 15354428, 15238585, 15035274, 14758667, 14494459, 14255997, 14081414, 14101108, 14175285, 14340036]
10581A4340036K78761L85131L72484K34724J2160k11158m89071o01322o61113
10572A3660632o89906n17744l81336k49589p0251r2608o0783l6347j00826j89111
10562A1272131j31013j67012j75084j91818k62815j72235p0173K1681O0688K16381
10552A0400731L84509M27503L61876L79599K07587p661k93031o18054p39609p33166
10542I770284o99463o38008n04310l95529l66131k87404k67333k25381j96903
10533F189822j73023j81559j13473n0518p3557r6515p7494o8237n0328l9419k9513
10522E236186p8177j21173j35014j10808j61543k64101k15713j64923j52274k24457
10512C608003k35034j36189j16389j97307j80852j46270j12587p0841n6835j4980
$$ y = [14340036, 14618797, 15003928, 15376412, 15611136, 15623296, 15412138, 14923067, 14321745, 13660632, 12970726, 12452982, 12071646, 11822057, 11751806, 11659198, 11598415, 11562068, 11461242, 11272131, 11141118, 10974106, 10799022, 10607204, 10344389, 10172154, 10101981, 10123662, 10184350, 10400731, 10785240, 11212743, 11574619, 11954218, 12161805, 12154144, 11861113, 11243059, 10503450, 9770284, 9070821, 8432813, 7928503, 7532974, 7166843, 6879439, 6612106, 6386725, 6189822, 6016799, 5835240, 5721767, 5671249, 5597692, 5501177, 5423683, 5355446, 5305118, 5265699, 5236186, 5158009, 5036836, 4901822, 4791014, 4629471, 4365370, 4149657, 3984734, 3832460, 3608003, 3372969, 3236780, 3120391, 2923084, 2742232, 2595962, 2483375, 2412534, 2355699, 2340719]
10502B340719o8153q8868o8189q8014l5479r8226p3905k2987j8962q4265p9268
10491A614403k3505n0033j21125o4516k2858k1950m1101k5372n8403M1373P193
10480A234106n9174n8289j6512l3678n8784K625l6631k0821L0605p3448o7303
10469H42696k5748l3035l7445r655J3238l641j13820k5096M6561J2760l294p3982
10457E89539l28p205J4388n2481l527J2266p320k4498J7628j8727o5315k2016
10445D32404k0325K4055J4145l6474q842n999n0204J0596L4212j6095M4617J6644
10433D38734j309J553m6384o1976l7073k5469j4188P579m455j6861J3709Q839
10421B62699N479M2325L588l1127j1277K8277K9338k3763j2389m3583J8762J5963
$$ y = [2340719, 2272566, 2183698, 2115509, 2027495, 1992016, 1893790, 1819885, 1796898, 1777936, 1693671, 1614403, 1590898, 1540865, 1419740, 1355224, 1332366, 1310416, 1269315, 1243943, 1185540, 1226913, 1234106, 1174932, 1116643, 1100131, 1066453, 1007669, 1010294, 973663, 952842, 983447, 909999, 842696, 816948, 783913, 746468, 736813, 750051, 746410, 632590, 607494, 654055, 666815, 663521, 589539, 589211, 582006, 596394, 543913, 540386, 552652, 545332, 520834, 538462, 519735, 454420, 432404, 412079, 436134, 450279, 413805, 404963, 398964, 348760, 359356, 393568, 377473, 422090, 438734, 437425, 438978, 392594, 330618, 293545, 268076, 253888, 261467, 257012, 240151, 253860, 262699, 268178, 310503, 314091, 282964, 271687, 299964, 329302, 305539, 293150, 249567, 268329, 284292]
10409B84292k0537J359j3617l4935m0705L8252J4694K332k1l3027K9149J4883
10397B42119n0891j4564q49l0793P5673K2195L2702j2530n8814j9448j0808j621
10385A72371L5805n0002K7971K9266j6247j3966n3672q6701j7223J0315O0993
10374I8910J2596l6052j04990r1966J5946J0487p348n693l9116j6646K7952J1854
10362a24066L3937L3751k747J5659R754m3322K3794O377K8101L39r406L5879j8641
10349a0591q7542J1163J4837j3805m6241k3899k2558J4508P8140j4394o3653P066
10337a56969j7010l2472l4058J5232N6269Q1177Q0767N291q669j280j2044J7543
10325f223L5655k9732L3270Q627J5352M6714O3855N1675N4141J8872q3842r2836
$$ y = [284292, 263755, 265114, 251497, 216562, 175857, 214109, 228803, 231135, 231114, 198087, 227236, 242119, 191228, 176664, 175815, 145022, 220695, 242890, 275592, 263062, 204248, 184800, 173992, 172371, 208176, 158174, 186145, 215411, 199164, 185198, 131526, 44825, 27602, 37917, 98910, 111506, 75454, -29536, -121502, -105556, -95069, -102417, -108110, -147226, -163872, -135920, -124066, -90129, -56378, -59125, -43466, -33712, -77034, -53240, -46863, -18762, -18423, -27829, 8050, -10591, -98133, -86970, -72133, -85938, -132179, -156078, -178636, -164128, -85988, -100382, -164035, -156969, -173979, -206451, -240509, -225277, -169008, -87831, -7064, -1773, -10442, -11722, -23766, -6223, 29432, -300, 32970, 41597, 56949, 103663, 167518, 219193, 273334, 292206, 208364, 115528]
10313A15528m262K0211K3579J7929o5315K3144L0042n751j3291k7205L7771K5038
10301A77418M0431O2088J05325L9453j9768p190K4645L1229R951q492L3082k3345
10289D64827O347O8507O8079j1113k3549Q2301J06061Q4652N7920M2235M0488
10278I86755Q4352J58495J36284R1631K5824q495J6151j0964r7354o0411j4940
10267A307328l0061o3194p3194M1265L1105j0758J3365P0797P5247J08893j8375
10256A452418m645L4783n127k5745J938L3739L1338L1138L015O8763P5916R1314
10244A788845j3591m8433L14n0069j18125q4657o5394N626L3874L0360j3562k5119
10232A440069j366m9346q4297o6060q541q4953J1906n981J6451r977j0885k1357
$$ y = [115528, 111266, 131477, 155056, 172985, 107670, 130814, 160856, 155105, 141814, 114609, 152380, 177418, 217849, 279937, 385262, 424715, 404947, 397757, 422402, 453631, 463582, 455090, 488172, 464827, 471174, 539681, 607760, 596647, 573098, 655399, 761460, 846112, 904032, 946267, 986755, 1071107, 1229602, 1365886, 1457517, 1483341, 1474846, 1490997, 1480033, 1382679, 1322268, 1307328, 1277267, 1214073, 1140879, 1182144, 1213249, 1202491, 1215856, 1286653, 1361900, 1470793, 1452418, 1447773, 1482556, 1477429, 1451684, 1453622, 1487361, 1518699, 1549837, 1552852, 1621615, 1697531, 1788845, 1775254, 1726821, 1727135, 1677066, 1558941, 1474284, 1408890, 1414516, 1448390, 1478750, 1465188, 1440069, 1438703, 1389357, 1305060, 1239000, 1230459, 1145506, 1157412, 1151431, 1167882, 1157905, 1147020, 1125663]
10220A125663J3843M1690Q9724O7015K9064n894k6132n0007k7570p8668j08304
10209A070424o1740j34237r8402n9346q9829J3186j0367n2469n7524J665j376
10198E19985J878o9812o393M6250J044J9480j08500j00100J8198R129k6252M780
10186C09687K3299J630M7576P31k2539q485k0491K0309L2632m0814o4355L503
10174B82683K4544R357k6501l4417Q329K3507k8145l9638K7923N9M0546l0823
10162B57424k0736L7113L971l5406l1518L2394p308k645J8014q55J9656L8353
10150C08457Q063k0371l8921k0866l4554j8652k8585j7624p412j4314q1716L9031
10138G2536K9469K1518K4707O0446M5361m0804l3829L8229k0630r414J8714k424
$$ y = [1125663, 1139506, 1181196, 1270920, 1337935, 1366999, 1361105, 1334973, 1284966, 1257396, 1178728, 1070424, 1008684, 874447, 776045, 716699, 626870, 640056, 629689, 577220, 519696, 521361, 519985, 521863, 452051, 445658, 491908, 492952, 512432, 403932, 303832, 322030, 331159, 304907, 309687, 332986, 334616, 382192, 382923, 360384, 351899, 331408, 351717, 384349, 343535, 279180, 282683, 307227, 316584, 290083, 255666, 263995, 287502, 259357, 219719, 247642, 247701, 288247, 257424, 236688, 273801, 277772, 242366, 210848, 243242, 235934, 233289, 251303, 250448, 270104, 308457, 316520, 296149, 257228, 236362, 201808, 183156, 154571, 136947, 129535, 115221, 33505, 72536, 102005, 123523, 148230, 208676, 254037, 213233, 179404, 217633, 197003, 187589, 206303, 203879]
10126B03879l3082o3231J5663M0821N3442N2323k9330m307k4746k3369j2721n8278
10114A17064J5327M3345M5710L2070k0929m7281K7324L2210N0770K9672k6034
10103B99248m2522J5016o3170l3380M726N712M1978M5206k325j2456j3585k302
10091B42146m1110q580K6K7040p39L537j677o7433m2420O2596R914k9082j0167
10078A44051K1759O5770l4185m8433R593Q7683L0416k4637J0110K6218J3039M650
10066C06034M6420M0136Q367k0411l497k3263m2199p811K5345N2764N4999M8780
10054D85664k9602j7883L5081J0853L9525J4139N3865M4443K1559L7212N0033
10043G44889J32437K15176K47181M82661P40841P96562M16616n32861j146768
$$ y = [203879, 170797, 107566, 123229, 164050, 217492, 269815, 240485, 236178, 211432, 188063, 175342, 117064, 132391, 175736, 221446, 253516, 232587, 185306, 212630, 244840, 295610, 325282, 299248, 256726, 271742, 208572, 175192, 179918, 185630, 227608, 272814, 270489, 258033, 244448, 242146, 201036, 192456, 192482, 219522, 218783, 222320, 220643, 153210, 110790, 173386, 183300, 154218, 144051, 165810, 231580, 197395, 148962, 158555, 246238, 276654, 252017, 262127, 288345, 301384, 306034, 352454, 392590, 400957, 380546, 377049, 353786, 311587, 303776, 329121, 381885, 436884, 485664, 456062, 438179, 473260, 484113, 523638, 537777, 591642, 636085, 657644, 694856, 744889, 877326, 1092502, 1339683, 1822344, 2563185, 3359747, 3776363, 3243502, 2096734]
10034B096734o70189l26119j75860q2803l4726p3315q5734m8422l705k8478l124
10023E64259J1988j109K5153L1917j073J7005n9221j18132o1724j8827l3897R470
10011C65809J1875j5463J442k5001j0010L5674M4376k8602j2939l4983k714j0108
9999C19356l0938j8930k5760P0937N8632n7631o1787K9282L2341J6832L8021l1022
9987C39333o8946m340J7132N4469L8660q248n9438n8511K140K3684j5842K6810
9975B86903M3730l0920k7196j1719j2031J1373K0576M9935m943K1919J7245m1779
9963C23093K541q095l1127M0064M0632j1075k6316m8553J8546J8658L0883l0155
9951C19096r011J1578P5868q190o3238l5002M9223M7218N0728l3891k2108j5719
$$ y = [2096734, 1426545, 1100426, 924566, 841763, 807037, 733722, 647988, 599566, 595861, 567383, 564259, 576247, 575138, 600291, 632208, 631135, 648140, 588919, 470787, 409063, 390236, 356339, 365809, 377684, 362221, 363663, 338662, 328652, 364326, 408702, 380100, 367161, 332178, 329464, 319356, 288418, 269488, 243728, 314665, 373297, 315666, 253879, 283161, 315502, 332334, 370355, 339333, 270387, 266047, 283179, 337648, 376308, 368060, 308622, 250111, 252251, 275935, 260093, 286903, 330633, 299713, 272517, 260798, 248767, 260140, 280716, 330651, 325708, 347627, 364872, 323093, 325634, 317539, 286412, 326476, 367108, 356033, 329717, 281164, 299710, 318368, 349251, 319096, 310085, 321663, 397531, 389341, 326103, 291101, 340324, 387542, 438270, 404379, 382271, 366552]
9939C66552l7857J4903O1674m6612J2751K8086R899j6258K191P878j8023P5613
9927D60797K7285k4738j6371k5298R879O244K4221J4509J7080J2979J9355L3605
9915E59547M7200m0800k7685k2087l9419j7670j7832J4852J3270L2833L5748l6400
9903E01557p640J6278L8418J5323j1323J619K8358m964J4494N5625M0196O5136
9891G53077j1890r9253m5018O4529N5471J9179Q645N6954J20719P7409K5593k7700
9879I97715q3066o8961l643R704m9507P820n8045l6565m4055j5284J0147o609
9867F59651O062l8836J4329L2809K5699R931J4509M2090j6801N357j6107J3364
9855G52057J5057K3163j3882K4979M933j7114r101j0747R981K2746k0248k9612
$$ y = [366552, 328695, 343598, 405272, 358660, 371411, 399497, 409396, 393138, 395329, 403207, 385184, 460797, 488082, 463344, 446973, 421675, 431554, 437798, 462019, 476528, 493608, 506587, 525942, 559547, 606747, 565947, 538262, 516175, 476756, 459086, 441254, 456106, 469376, 502209, 537957, 501557, 493917, 510195, 548613, 563936, 552613, 554232, 582590, 577626, 592120, 647745, 687941, 753077, 741187, 641934, 596916, 661445, 716916, 736095, 744740, 801694, 922413, 999822, 1025415, 997715, 914649, 845688, 842045, 851749, 802242, 810062, 752017, 715452, 671397, 656113, 666260, 659651, 665713, 626877, 641206, 674015, 699714, 709645, 724154, 766244, 749443, 754800, 738693, 752057, 767114, 790277, 776395, 801374, 806307, 789193, 780092, 769345, 779326, 802072, 781824, 752212]
9843G52212K1413J249r457K5399J7381K2942k3599n2518j6785p897K0306P9813
9831H30459J2305M9715N677J7250Q754k8605k771k2385j7546K2844N6105j0668
9819I21134O8678J6223J1969M0163J053r852J2717M8944K2511j3558j48k1591
9807A098243k709N399l3289K3892k592k9615J6892Q7342L7263m2039n5614K0834
9795A124007M6990j4481k8650k5826M1453Q1581K9345k846m280J3514K4970j056
9783A284721m711K4206l57l3300l7892k6373K2672M6823O025J4726J9447L9432
9771A355419o6287j8730L5933k0976l358j8640l8101j5775k509M1892M9302j9182
9759A278988l839l8396L6966J546L6526J3415k1231j3414j6326K543j6595J6053
$$ y = [752212, 773625, 774874, 765417, 790816, 808197, 831139, 807540, 755022, 738237, 730340, 750646, 830459, 842764, 892479, 898156, 915406, 924160, 895555, 892784, 870399, 852853, 875697, 931802, 921134, 989812, 1006035, 1018004, 1058167, 1059220, 1049368, 1062085, 1111029, 1133540, 1119982, 1119834, 1098243, 1095534, 1100933, 1067644, 1091536, 1088944, 1059329, 1076221, 1163563, 1200826, 1158787, 1103173, 1124007, 1170997, 1156516, 1127866, 1102040, 1143493, 1225074, 1254419, 1251573, 1247293, 1260807, 1285777, 1284721, 1280010, 1304216, 1303859, 1270559, 1232667, 1206294, 1228966, 1275789, 1281814, 1296540, 1315987, 1355419, 1289132, 1270402, 1306335, 1285359, 1282001, 1263361, 1225260, 1209485, 1206976, 1248868, 1298170, 1278988, 1275149, 1236753, 1273719, 1275265, 1311791, 1325206, 1303975, 1290561, 1274235, 1276778, 1260183, 1276236]
9747A276236K2974j4473k7094K5227j6714J2287N5601M6512j5851n1347k8967
9736A284391o721K3157j8858n9752L2238L7977K4381K4848K1665l2647l2420j4432
9724A283827o6503j4546J8712J6729q022J0679M3696J7949J3906K4618k7878j3292
9712A299875m7934k3225j6659K6269M7903n3712l1169j9317l9764p0148J4534
9701A086653P0954M2345j0404j1273l3379J9296K821l5849n668L2638j5879l3268
9689A108987k6672Q711K5821N2437K2602m1432l1599j9523m197l2436J1025J7163
9677A090887o1421L5494K9725m422L0347m9238n7692j7602l065L4538M6148l8556
9665A035143m4528n094O6962m65n1054m5612k1912k7407K0893K4913j4647J6205
$$ y = [1276236, 1299210, 1284737, 1257643, 1282870, 1266156, 1278443, 1334044, 1380556, 1364705, 1313358, 1284391, 1277670, 1300827, 1281969, 1222217, 1254455, 1292432, 1316813, 1341661, 1363326, 1330679, 1298259, 1283827, 1217324, 1202778, 1221490, 1238219, 1230197, 1240876, 1284572, 1302521, 1316427, 1341045, 1313167, 1299875, 1251941, 1228716, 1212057, 1238326, 1286229, 1232517, 1201348, 1182031, 1142267, 1072119, 1086653, 1157607, 1199952, 1189548, 1178275, 1144896, 1164192, 1167013, 1131164, 1125496, 1158134, 1142255, 1108987, 1082315, 1091026, 1116847, 1169284, 1191886, 1150454, 1118855, 1099332, 1095135, 1062699, 1073724, 1090887, 1029466, 1064960, 1094685, 1090263, 1120610, 1071372, 1013680, 996078, 993013, 1027551, 1073699, 1035143, 990615, 985521, 1052483, 1052018, 1000964, 955352, 933440, 906033, 926926, 951839, 937192, 953397]
9653I53397j1028J9005m4533o4229j6088N586K1105j9333m9507j5696K8968K9360
9641H37007K8671M228J8131j6013j1783l5419p5473m7141K4083q401q043K1257
9629G31104N3715L980J3752n977p9801j3681l745M105K2719n5119j3126l2299
9617F25627K7266l5775M5012K2467k819j3680J9714j9916k4426k0450Q077L7963
9605F69060m9914n8574j5838J6283q334J9229N5506o1003n8640J331L3479j3047
9593E29538m2709J7867M5034k2417o2153L4151P201J7459l5067k8806Q876M3024
9581E11998O584l6812k6385k1389l5201K562K5803n6351k2583P9554l1196l5342
9569C61242l8067l0734l5630K2283K5491M6024J6106J8086Q398k8960N162J6962
$$ y = [953397, 942369, 961374, 916841, 852612, 836524, 842110, 863215, 843882, 794375, 778679, 807647, 837007, 865678, 869906, 888037, 872024, 860241, 824822, 749349, 702208, 726291, 717890, 709847, 731104, 784819, 788799, 802551, 796574, 716773, 703092, 699347, 703452, 726171, 671052, 657926, 625627, 652893, 617118, 662130, 684597, 681778, 668098, 687812, 667896, 643470, 623020, 631097, 669060, 619146, 560572, 544734, 561017, 552683, 571912, 627418, 566415, 507775, 509106, 542585, 529538, 486829, 504696, 549730, 527313, 465160, 499311, 506512, 523971, 488904, 460098, 468974, 511998, 518582, 481770, 455385, 433996, 398795, 401357, 427160, 370809, 348226, 427780, 396584, 361242, 323175, 292441, 256811, 279094, 304585, 350609, 366715, 384801, 393199, 364239, 369401, 386363]
9557C86363j6845k3009L5752j9909J2207j9035n3016j726N9233O2332n1225o1275
9545C09847M7293P3010k9053k4822K2419O5901O953k2883n5175o118R07k5383
9533C62896r910J6837n9703L478J1502m643l0232j8552M698J0707K4291l3449
9521B77920O130K5867J5458m2785k4085M5305N8067j6437o1911k8108M9439j6694
9509B88166k8859J8760L8036L4033k0801j0531p399J720j4581m6648l7577P022
9497B21341j571j5011J192j3428j9805o950J488J9921P0072N1734j9807Q843J2979
9484C10998l6402l5789K7342R932m7338k2946O3534L1060K215k5930k4559j0384
9472B41733k5249R785R463l7524L7230k8763J2261K6811J8867l8855k6092L3052
$$ y = [386363, 369518, 346509, 382261, 362352, 374559, 355524, 302508, 300782, 360015, 422347, 371122, 309847, 357140, 430150, 401097, 376275, 398694, 464595, 471548, 448665, 393490, 387372, 388279, 362896, 352986, 369823, 310120, 313598, 325100, 320457, 290225, 271673, 276371, 287078, 311369, 277920, 284050, 309917, 325375, 282590, 258505, 303810, 361877, 345440, 283529, 255421, 304860, 288166, 259307, 278067, 316103, 350136, 329335, 318804, 311405, 313125, 298544, 251896, 214319, 221341, 219770, 204759, 205951, 192523, 172718, 165768, 167256, 187177, 257249, 308983, 289176, 298019, 310998, 274596, 238807, 266149, 276081, 228743, 205797, 269331, 300391, 302606, 276676, 252117, 241733, 216484, 226269, 235732, 198208, 235438, 206675, 218936, 245747, 264614, 225759, 199667, 232719]
9460B32719M2837q818o3193L4360N4201k8030q8468Q851N3674k6265l6687m6040
9448A29141j192m3605k272J2982K8655r019P3314N2471j2537n6038r146j0256
9436A52498p551O654j1531O744M5586M8810j3931r714m7006P969M7302n701p1402
9423A48727l9575J3037K4155m1900m5100J381l1930J7736M3474J8187J1159j7220
9411A02131k7678O806L580m8724K5649O0479L4653M278o451j0497j6414p6809
9399E1003k8936L8866K4832J6883K4584L7844J6644q871l099j020N835l5458j8631
9386A20476L5751J2960l5884m985M836j5756p363K4283l425l5524R835J9189N0753
9373A75146R996l4840m3099j6053l8366M799m423j6991l9415L2760J4244o3184
$$ y = [232719, 275556, 266738, 203545, 237905, 292106, 264076, 175608, 184459, 238133, 211868, 175181, 129141, 127949, 84344, 82072, 95054, 123709, 114690, 188004, 240475, 227938, 171900, 162754, 152498, 144947, 151601, 140070, 146814, 192400, 241210, 227279, 217565, 170559, 178528, 225830, 220129, 148727, 109152, 122189, 146344, 104444, 59344, 60725, 28795, 46531, 90005, 108192, 119351, 102131, 74453, 81259, 84839, 36115, 61764, 122243, 156896, 161174, 154723, 144226, 127812, 51003, 22067, 60933, 85765, 102648, 127232, 165076, 181720, 172849, 169750, 168730, 174565, 139107, 120476, 156227, 169187, 133303, 128318, 133154, 117398, 110035, 134318, 130893, 95369, 105204, 124393, 175146, 185142, 150302, 107203, 91150, 52784, 57583, 53160, 36169, -3246, 29514, 43758, -19426]
9361a9426p205K3823N7088L0137k7154j9142K270k559j0842M682m2407j778L0393
9348A7880L5291l4330o654O2348N020q397J9472M3067K4020j1833J3806j0349
9336A49341q738j3330J4811J9112l5489R432J3751m6676m8836k4882M3090J7153
9324H8739l607k6597J4517M0200J5245L5709j1841n9899J0868k859k0719K1090
9312A00846Q561J3025J186N907n746m4564K0082N3352k3346o1181J1346N429k2149
9299F2748n5311k7562J7982O9655O1061K3223m709l9035r8351k2726L4431J0957
9287C2363M106N6692N7992J690l2661r667m3001L4998p367K7810k1796n9036L9148
9274H1271o8L1562J0763l0881k8460k0259j4083j6415n0338J0949P4462L9138
$$ y = [-19426, -26631, -2808, 54280, 84417, 57263, 38121, 40391, 37832, 26990, 31672, -10735, -12513, 17880, 53171, 18841, 12187, 74535, 79555, 71158, 90630, 133697, 157717, 145884, 159690, 149341, 140603, 127273, 142084, 161196, 125707, 135139, 148890, 102214, 53378, 28496, 71586, 88739, 85132, 58535, 73052, 113252, 128497, 164206, 152365, 92466, 103334, 100475, 79756, 100846, 109407, 122432, 123618, 129525, 123779, 79215, 99297, 152649, 129303, 68122, 79468, 84897, 62748, 7437, -20125, -2143, 67512, 128573, 151796, 147087, 108052, 9701, -13025, 21406, 32363, 36469, 93161, 151153, 152843, 120182, 110515, 67514, 102512, 95145, 122955, 101159, 42123, 81271, 81203, 112765, 123528, 92647, 64187, 43928, 29845, 13430, -36908, -25959, 48503, 87641]
9262H7641N2589J2011k4156l0862k4826K2853K1026k0955k7963k352l4526K3887
9250E4367N4888j2333k7188j7809K3643j3063k7126k6400M6265K5970K7954j7026
9238I2142K9322j2266q1739m0712L048L7145J8691K6789m625q329J9141p2683
9226E924m2161O2843K0816J7371l4617l0720j6322L4105k7600l1274L8966O0069
9214E7400j8803n3915K0379k4364Q3691P5339n5967p7445k6827j480J13051J6960
9202A08019l5763m6433M3423J5734k2340P4649R742p0567m2245L6844j1814q1917
9190b2668l0289Q9989K5596k1451L0628J0680j2332J4709m988K497M631J3618
9178A00620l3009m0084M133L2433J5244J522j0210j8191M7887N4732l0787p1383
$$ y = [87641, 140230, 152241, 128085, 97223, 72397, 95250, 116276, 95321, 67358, 65006, 30480, 54367, 109255, 96922, 69734, 51925, 75568, 62505, 35379, 8979, 55244, 81214, 109168, 92142, 121464, 109198, 27459, -13253, -10205, 26940, 45631, 72420, 67795, 59466, 78607, 5924, -36237, 26606, 47422, 64793, 30176, -544, -16866, 17239, -10361, -41635, -2669, 57400, 38597, -15318, 5061, -19303, 64388, 139727, 83760, 6315, -20512, -21992, 91059, 108019, 72256, 25823, 69246, 84980, 62640, 137289, 147031, 76464, 34219, 71063, 59249, -22668, -52957, 37032, 62628, 41177, 71805, 82485, 70153, 84862, 79874, 82371, 87002, 100620, 67611, 27527, 31660, 64093, 79337, 80859, 70649, 52458, 100345, 155077, 124290, 52907]
9166E2907l6093K2021N055J6402p993j8421l254N056r867K7886J1217N672r50
9153F9638l5965p149k8564J7271N6478N736j3166p739m3273j7271J8658K8129
9141D2783J824l2508l7819j2811l4339p902J9047J4816M6456J00796m2916n1741
9129E686j4756M0483j248J5170k5534j0616N504j9656k7082M7699O335k1715m1564
9116d1294K3782N4043l111k8441r641L720n2827k9042J1137J5974l3424L7083
9104e2041m148j7610L2227L105j8494j7384l2978K6114M7580M6959J9082p528
9092B4884L825M1317l94p6855o575K79K4956l1648L0339r729M3063K0473J3711
9079G7646k5939k0468k9206m5012M2612L526J1954M8217L3338j6171M3460K0575
$$ y = [52907, 16814, 38835, 43890, 60292, 52299, 33878, 30624, 35680, 25813, 53699, 64916, 70588, 69638, 33673, 26524, -2040, 15231, 71709, 77445, 64279, 56540, 13267, -4004, 14654, 42783, 44607, 12099, -25720, -38531, -72870, -80772, -61725, -46909, -453, 100343, 57427, 5686, -9070, 31413, 30165, 45335, 19801, 9185, 14689, -4967, -32049, 15650, 21985, 270, -41294, -17512, 36531, 33420, 4979, -4662, -942, -53769, -82811, -71674, -55700, -89124, -52041, -56189, -73799, -41572, -38467, -56961, -74345, -107323, -81209, -33629, 13330, 32412, 24884, 28709, 70026, 69632, -7223, -13798, -13519, 11437, -20211, 10128, 399, 43462, 63935, 77646, 51707, 31239, 2033, -42979, -367, 3159, 15113, 63330, 96668, 80497, 123957, 144532]
9067A44532n0513k4191m1404o4415L475J2379O5810j909l5511m9745K1416K8492
9055H416l9702K4654M3973j6706j8379k6012k9360j3674m0233M0250L3977N8429
9043B5633j9629l1270k1741j4597O6106N0017J8398N3738n8692p6447j8105n294
9031c1883l4583J8371L8654k870J9296K2609J9555l6984k1742k3744J339j3495
9019d5477J1242M4110j084l4220J8379L4965l0125j9462J0539m726k1639O6009
9007B8511K5319m3212L0364O26j3977j2795n1647L2155L0925n5693K4307P7437
8995G2320J9711K2392n3855l2366m0955k444P987k478L7744j9709k2483k5505
8983c9641l691j9161L6371o747L245K104K4806l3791Q35M7872M3113k1718p2550
$$ y = [144532, 94019, 69828, 28424, -35991, -32516, -20137, 45673, 43764, 8253, -41492, -20076, 8416, -31286, -6632, 37341, 20635, 2256, -23756, -53116, -66790, -107023, -66773, -32796, 25633, 6004, -25266, -47007, -61604, 4502, 54519, 72917, 126655, 67963, -8484, -26589, -31883, -66466, -48095, -9441, -12311, 6985, 29594, 49149, 12165, -9577, -33321, -31982, -45477, -34235, 9875, 8791, -25429, -7050, 27915, -2210, -21672, -11133, -15859, -37498, 28511, 53830, 10618, 40982, 41608, 27631, 14836, -36811, -4656, 26269, -29424, -5117, 72320, 92031, 114423, 60568, 28202, -12753, -15197, -7210, -9688, 28056, 8347, -14136, -39641, -43332, -62493, -26122, -32869, -29624, -27520, -2714, -36505, -35670, 12202, 55315, 33597, -38953]
8970c8953p243L9730o703j232L134l053l3059l4077J903k9369J9216K0750L6628
8957c2328L8218M9861p478L865J0824m223k5756J1405p298m6230n746J5755L7944
8944C8813N7833j178q6069l7863m7321M394O2962M8003k8508j8143M0868L0187
8932F3978l4694J1454K3256Q441j7124l0484K4897K6923m5352l7476K8498K4020
8920D6337J3974P76N8800r6355n7590j3984K7578L9634L9767j6439n180J8367
8908E5685n7241k2369L2016j0666k8228j9554J8063J640J3083J7096j9916k6188
8896d6579J2854L653j4842K5511L1186j6712l976K5284K9682j9455l839j0993
8884A1774K91M684k8292L3198j9499L4405K9237m1830N1991J3435K3612m9070
$$ y = [-38953, -46196, -6466, -13169, -14401, -11267, -14320, -47379, -81456, -79553, -108922, -89706, -68956, -32328, 5890, 55751, 48273, 52138, 62962, 58739, 32983, 44388, 37090, -9140, -14886, 869, 38813, 96646, 95468, 9399, -28464, -75785, -71391, -8429, 39574, 11066, -7077, 33791, 63978, 29284, 40738, 63994, 72435, 55311, 24827, 49724, 76647, 31295, -6181, 22317, 46337, 60311, 61087, 119887, 23532, -34058, -48042, -20464, 19170, 58937, 42498, 37318, 55685, -1556, -23925, 8091, -2575, -30803, -50357, -32294, -30654, -17571, -475, -20391, -46579, -33725, -30072, -44914, -19403, 11783, -4929, -8905, 16379, 46061, 26606, 22767, 11774, 12065, 16749, -11543, 21655, 2156, 36561, 65798, 23968, 75959, 89394, 113006, 63936]
8872F3936l4900j5020j5413k3702M2116O042J216k6296M6774k9318o9072P919
8860d5718L1955J3238M8793K8195j8568r575N849M5013m7569l2605L8771j9315
8848C8464l1671K4421l646O0010J4121J059r374J0970j8264k9066k8399l6142
8836g517m9782N899J2905L4536L0678k0408k410M13m5345M180O816O2346L8086
8823G0397k0042n7422J5634J6152j2508k6362N8453m823p7818l9933K2477P7833
8811B2038M307J7643l5136J0094K7477q79q4707m5459J3526K1308J8949L3115
8799B276l1825M9123K8441K3165k5447l2209m5665k1945l58J8336K5270n92J2697
8786A267L8058k6254n8489N3336J746j7751O399N535n6195n9395M5419M3115L4136
$$ y = [63936, 29036, 14016, -1397, -25099, 17017, 23059, 24275, -2021, 44753, 15435, -53637, -45718, -13763, -525, 48268, 76463, 57895, 48320, 54169, 99182, 51613, 19008, 57779, 38464, 6793, 31214, 27568, 87578, 101699, 102758, 93384, 104354, 86090, 57024, 28625, -7517, -57299, -51400, -38495, -3959, 26719, 6311, 3901, 4314, -41031, -36851, -30035, 32311, 70397, 50355, -7067, 8567, 24719, 12211, -14151, 44302, 39479, -38339, -78272, -55795, 22038, 26345, 43988, 8852, 18946, 46423, 45544, -39163, -84622, -71096, -49788, -30839, 2276, -29549, 19574, 48015, 71180, 45733, 13524, -32141, -54086, -54444, -36108, -10838, -11430, 1267, 39325, 13071, -45418, 7918, 9664, -8087, -1688, 3847, -52348, -111743, -66324, -23209, 10927]
8773A0927L910k2084l0205o696K2656J6153Q366o3580n2455k6738J7248O101j5955
8760a32352M1933M3670K8103j8616j1225m217k042M9887l9569J1680K7894q864
8748a3718j16p258J0178j7507k7285o600L238L8497O2384m0250l3604N8110P7698
8735A03767n568l2965k8980O4351k3820r3549P009j0332L2842L4328J5908k0068
8723D2923l9802m655N7800J7625R658l3921r776J8708p317N598j4057o4436k0235
8710d1887K5373l0651n4369m5066O0383L6893O35J432J9411O799K8267K3254L8381
8697F8855j8530l0738L4339K0928k6182K830L6205m4566P040N0124k2065k1726
8685E6514R912l2531M6750M543l7750k8757k8863K1869Q727l893J4235j4234J0996
$$ y = [10927, 14837, -7247, -37452, -44148, -21492, -5339, 3027, -60553, -113008, -139746, -122498, -116397, -132352, -90419, -46749, -18646, -37262, -48487, -52704, -54746, -4859, -44428, -32748, -4854, -13718, -13834, -21092, -10914, -28421, -55706, -62306, -59068, -20571, 41813, 1563, -32041, 26069, 103767, 98199, 65234, 36254, 100605, 76785, -16764, -9755, -20087, 12755, 47083, 62991, 42923, 3121, -1534, 56266, 73891, 83549, 49628, 39852, 58560, 51243, 56841, 42784, -21652, -41887, -16514, -47165, -101534, -146600, -86217, -49324, -48689, -47257, -27846, -21047, 7220, 30474, 68855, 50325, 19587, 53926, 74854, 48672, 51502, 87707, 43141, 50181, 100305, 78240, 56514, 66426, 33895, 80645, 85188, 47438, 18681, -10182, 11687, 20414, 16521, 30756, 16522, 27518]
8672B7518l1656L5086K9168k598L987o452J2386n5275J3836M2097l8176K0466
8660E0387J154l6950J6345l6347l1062k1274K0171O3204J19504N5276j8512j9559
8648A62337m9592o7897Q787j302l0138K243k8218N091J4550m831O8168L878M0845
8635A23921p263k045m6382j2261l4738M252J1064k0798J8797m1002k0764J4540
8623a2679l8372k5071j4474K1977M2952J3808l4927P942M0168L1780K8233j1124
8611E0213P2907K1395m5390q026M8263j4240n3960j9911l8477l8932K9321m10
8599B753P3058P4596L4387K0701m3506n3367O673M4444q166m3712l811K7224O0207
8586A91481J9319l0025q8260n4569k1368O0760M2037r828o1587k5612L0118L4377
$$ y = [27518, -4138, 30948, 60116, 57518, 61505, 55053, 67439, 12164, 26000, 68097, 29921, 50387, 51541, 14591, 30936, -5411, -36473, -57747, -37576, 25628, 145132, 200408, 181896, 162337, 112745, 44848, 53635, 52333, 22195, 24438, -3780, 1311, 15861, 11030, 79198, 83076, 123921, 116658, 114613, 68231, 55970, 21232, 25484, 36548, 15750, 34547, -6455, -27219, -12679, -51051, -76122, -90596, -68619, -25667, -11859, -46786, -38844, 1324, 33104, 61337, 50213, 123120, 144515, 99125, 91099, 139362, 125122, 71162, 51251, 12774, -26158, 3163, 2753, 75811, 150407, 184794, 205495, 161989, 108622, 115295, 159739, 151573, 107861, 104050, 131274, 191481, 210800, 180775, 92515, 37946, 16578, 77338, 119375, 109547, 47960, 22348, 52466, 86843]
8574H6843J2989n906K4116j5062p329q117M96l6797j4739n7132J7767L4326o215
8561B5240l5671J3775l680L2265K3521N104P60l8251k8919J5430j3485N9256L9419
8548I4764J4102J8581p7134p0427K8726K9823J9151m1523J0460j9468j7591K5154
8536A4618L105K310O412K6117L7084L6568j0572k766n4614m7284M6278O8617n7455
8523F8418n2985P040k655j3970r531r796l5238L0518L655J7530L8526o266K0133
8510E5379j5468l2409k4549o007l246n458p543J00881N9449n2790Q481o648k238
8497F7834k8766n8938m11k2858J619r16q233K8723O2985j0298m1830j2802J9208
8484d683N634M68k4927N9754L019k315n7536l1943R8R534K0953n7897M4364M7474
$$ y = [86843, 99832, 93926, 118042, 102980, 95651, 87534, 88030, 51233, 36494, -20638, -2871, 31455, 25240, -10431, 3344, -336, 31929, 55450, 60554, 61314, 23063, -5856, 9574, -3911, 55345, 94764, 108866, 127447, 50313, -20114, 8612, 38435, 57586, 16063, 26523, 7055, -10536, 14618, 17723, 20033, 26445, 52562, 89646, 126214, 115642, 112876, 58262, 10978, 57256, 125873, 68418, 15433, 22473, 19818, 5848, -3683, -13479, -48717, -18199, -14544, 2986, 41512, 35246, 55379, 39911, 7502, -17047, -23054, -26300, -31758, -39301, 61580, 121029, 68239, 76720, 70072, 67834, 39068, -19870, -20281, -43139, -41520, -42436, -50669, -21946, 41039, 30741, -11089, -23891, -4683, 951, 1419, -23508, 36246, 39265, 36950, -20586, -52529, -52431, -42897, -21944, -79841, -35477, 11997]
8470A1997j3203k4477J186J7293K6291m6537R770r092l1279M9729N0576n1138
8458h884k1756L9737M1563N7647j5849o3486m4440J6407K0818o5980k7502L1707
8446d0018k6766q860J7903L6997N2511M0584R596j6666k8893n2611j6626K8085
8434d764M2116N2573k6100p4587m0920N783K7884j9264K7175L405k260K6864M2556
8421F0461o3030m8052L3064m5205n9126l273O4032k7299J5489J4213o890K2932
8409d2684M830L0580K2802n819m060j2748K9922m6983j4939J360M4069L425K4319
8396C4074m8381J1801N6400l7284r4511l0958k1208J5228M1547L6623M0289J0320
8384A3940J6240P972l4794l9471l6981M7695M6345J7824j8611j5207K2704O545
$$ y = [11997, -1206, -25683, -24497, -7204, 19087, -27450, -17680, -26772, -58051, -8322, 42254, -8884, -30640, 9097, 50660, 108307, 92458, 28972, -15468, 939, 21757, -44223, -71725, -40018, -66784, -75644, -57741, -20744, 31767, 72351, 81947, 65281, 36388, -16223, -32849, -4764, 37352, 89925, 63825, -10762, -51682, -45899, -18015, -37279, -10104, -6699, -8959, 17905, 60461, -2569, -50621, -17557, -62762, -121888, -125161, -61129, -88428, -72939, -58726, -65616, -42684, -37854, -7274, 15528, 9709, 5649, -7099, 22823, -24160, -39099, -37739, 6330, 9755, 34074, -14307, -2506, 53894, 16610, -77901, -108859, -130067, -114839, -73292, -36669, 3620, 13940, 30180, 38152, 3358, -36113, -73094, -25399, 20946, 38770, 20159, 4952, 27656, 34201]
8372C4201n019l4859J5152k7451m5230J966O8519K3406J4834J2942j3660l4720
8360A0081m0448L2851R5418q272j3281o6038R975k5618P792M3779m6711m418m089
8347h979N380K6688J2929M913M7929k1413m552l7740n8314p6545N053J0251k0853
8334a15253j5207J1747K6244K3529j6710n6076O387J6707L3618j9184K3628k4137
8322a04707j6485J1252Q258O1751L2775j6155J2756O492K30m8401j820N1283N453
8309B682P511k5132n0341k5082J9623L0787N097J240M837J24O122k747j6762l881
8295d5922k0998k8654o347J8246N9785k4809K4905L0365l3215n6531O535O204
8283g0436J330M4053N1819J474n6262m6233n2303K9762Q2413J07592K527k9258
$$ y = [34201, 29182, -5677, 9475, -17976, -63206, -61240, 7279, 30685, 45519, 58461, 44801, 10081, -30367, 2484, 97902, 89630, 76349, 10311, 20286, -5332, 2460, 46239, -472, -4890, -8979, -3599, 23089, 36018, 40931, 88860, 67447, 62895, 25155, -33159, -109704, -104651, -94400, -115253, -130460, -118713, -92469, -68940, -85650, -141726, -135339, -118632, -85014, -104198, -80570, -104707, -121192, -109940, -101682, -39931, -7156, -23311, -10555, -4063, -3833, -52234, -54054, -2771, 2682, 10193, -14939, -65280, -90362, -70739, -39952, -34855, -33615, -28778, -28654, -22532, -25279, -42041, -45922, -66920, -95574, -101921, -83675, -23890, -48699, -23794, 6571, -26644, -83175, -76640, -70436, -69106, -25053, 26766, 28240, -28022, -74255, -126558, -96796, -14383, 93209, 95736, 66478]
8271F6478n524q858j6350l6059L1820j3035m2261K5720O229o1372M0771l2960
8259d5401n6180P7205O0116J4631k2535Q024O9022J8829n7694m2095p078n4911
8247c8067k4972L1285J9896o91J5421L44J9116K2280m4075o172J8418O045o08
8234A8220L6602L5886k2306m8362n0367k2231Q542L5187p061j8360L2025l6423
8222c8648j5095N312M0321j6423K6956J1956l0847K054o5839L9250N1628o1477
8210e0852k867N7840K2702k1173k8897o195K3285q924r805M336L0987k4674K2552
8197H315J09292Q7962m3544l0896k3150m7587k842J7559j0886m5674P462J331
8185B7342k6186L6356O699k7808M4202J926J4898l4077j9298j6831L5424N8486
$$ y = [66478, 60954, 52096, 35746, -313, 31507, 18472, -23789, 1931, 8160, -53212, -12441, -45401, -101581, -24376, 35740, 50371, 27836, 35860, 104882, 123711, 66017, 23922, 16844, -38067, -63039, -31754, -11858, -12549, 2872, 3216, 22332, 44612, 537, -5635, 12783, 18828, 18220, 54822, 90708, 68402, 20040, -30327, -52558, -44016, -8829, -15890, -34250, -2225, -38648, -53743, -48431, -8110, -24533, 2423, 14379, -16468, -14414, -80253, -41003, 10625, -50852, -53719, 4121, 26823, 5650, -23247, -29442, -6157, -15081, -24886, -20550, 10437, -14237, 8315, 117607, 205569, 162025, 131129, 107979, 60392, 57550, 75109, 64223, 18549, 26011, 27342, 1156, 37512, 44211, 16403, 60605, 62531, 77429, 43352, 24054, 7223, 42647, 101133]
8173A01133L501l0775l2424o7457J6074k3466m5634k0905K9641L6463L5273J4753
8161A6177M8647L8866k6267m8754O981J5862j9838J8363N2585M3287j1255P64
8149A35418l1623p6205O80J0786j6492N0018N5192l7029o955l7791J7506J0017
8137G3522j8857j3286q862l4570j6914k3033J9586M4309P673l7374m6210J8903
8125c5113k5078m0152k7035r653O1613O698m7590K8911P1311P111o882k4504n7590
8112i7953K3555K1842N7107M7903J9917l5982m6156o654j4495K1729j5628K2939
8100a876m8412k765J7924J592L218L3441J6601K6475N304n408m3583p5563j2084
8087h5136j781N0129K4743j0713J5666J0826k1326M7006L3799n8288J100O1417
$$ y = [101133, 104634, 73859, 41435, -26022, -9948, -33414, -79048, -99953, -70312, -33849, 1424, 16177, 64824, 103690, 77423, 28669, 35650, 51512, 31674, 50037, 102622, 145909, 134654, 135418, 103795, 27590, 28270, 39056, 22564, 72582, 127774, 90745, 83790, 45999, 63505, 73522, 54665, 41379, 32517, -2053, -18967, -42000, -22414, 21895, 29568, -7806, -54016, -35113, -60191, -100343, -127378, -137031, -75418, -68720, -116310, -87399, -16088, -8977, -15859, -40363, -97953, -74398, -52556, 4551, 52454, 72371, 36389, -9767, -16421, -30916, -9187, -24815, -1876, -50288, -53053, -35129, -33537, -30319, 3122, 19723, 46198, 51502, 46094, 2511, -73052, -85136, -86917, -36788, -12045, -22758, -7092, 3734, -17592, 29414, 63213, 4925, 6025, 67442]
8075F7442L6739q466k5197k1984J8441N356m8035j3044j6616J5358n3646k905
8063d6557L5454k1432J1632J1114k9883k9730o354P0782N1729K5567J5683j7907
8051G0098K4235k5349k1965k5338N84k2809j0309K7407j3891P5002K2226n5938
8039D3953K1314L4401J3849n5877o1761n8264j5429L5625L8271j3304m103M392
8027a6933R666K2881L2276l6088k9387j3325M6712K1892l940m7749O5671O5686
8015A17362L685m7517l4975n3076l1786L5583j805n0299j6892J4470M4558j7648
8003c8340l9502m5454k7261M4122M8323L2314M1609R509J6564J9387J0851P630
7991G9752J1180R678r404K4901l438j0371n6355p5579j3614K5160q84K2279j927
$$ y = [67442, 104181, 95715, 70518, 48534, 66975, 72331, 24296, 11252, -5364, 9994, -43652, -46557, -11103, -32535, -20903, -9789, -39672, -69402, -75756, -4974, 46755, 72322, 88005, 70098, 94333, 68984, 47019, 21681, 22265, -544, -10853, 16554, 2663, 77665, 99891, 43953, 65267, 99668, 113517, 57640, -4121, -62385, -77814, -42189, -3918, -17222, -21325, -16933, -7267, 15614, 47890, 11802, -17585, -30910, 15802, 37694, 33754, -13995, 51676, 117362, 121047, 73530, 38555, -14521, -46307, -10724, -12529, -62828, -79720, -65250, -20692, -38340, -77842, -123296, -150557, -106435, -58112, -25798, 15811, 25320, 41884, 61271, 72122, 79752, 90932, 100610, 91206, 116107, 112669, 102298, 45943, -29636, -43250, -18090, -18974, 3305, 1378]
7978A378l8137P14O343j8009L935j6381K1801K2950j81l5189j8510L7418L8118
7965F250J7551k9506k1007l2259L5183L1784J5868k6690J2693m9333l710R8899
7953E5723J3887J4937k2966n5473J0221N9931l7882M0174Q345p628n3451j8513
7941G305Q229k2656J4360K7395m417j3778J7039l1895l8146p434K0188l3092P3154
7928A6252M2765k6691l5335n7206J7985M5934l935m7219j1169O3198j3689o0436
7916f9546O734N9004n7050J6051N8886n067J5348P2782M4289m7315j9671K799
7904G7244k993p964K3931j1395K4780O916n5118K0001j329k8496k8428K4296L3576
7891G5021q2252n6406J8773M3825K3225k239l4689l8479k2636j2658P862M4889
$$ y = [1378, -36759, -36045, -29702, -47711, -43776, -60157, -38356, -15406, -15587, -50776, -69286, -31868, 6250, 23801, -5705, -26712, -58971, -23788, 7996, 23864, -2826, 9867, -39466, -43176, 55723, 69610, 84547, 61581, 6108, 16329, 76260, 38378, 78552, 86897, 79269, 25818, 7305, 15534, -7122, 7238, 34633, 30216, 16438, 33477, 1582, -36564, -43998, -23810, -56902, 16252, 59017, 32326, -3009, -60215, -42230, 3704, -231, -47450, -58619, 4579, -9110, -69546, -62812, -3808, -60858, -44807, 14079, 9012, 24360, 97142, 141431, 94116, 74445, 77244, 74251, 66287, 90218, 78823, 103603, 110519, 55401, 75402, 74073, 45577, 17149, 41445, 75021, -7231, -63637, -44864, -1039, 22186, 19947, -14742, -53221, -75857, -88515, -80653, -35764]
7879c5764K0935M154K9444j2056m701q970k37j7919K5359K2452J5275J361n7811
7866a8478N471j3796k2982M5699j338L9179J3568Q78k0849l9728j9411K2470N1721
7853D2404k4182J3554L2261n1698p1523L1785n556J8348j2725m7382P358M4499
7841b2857L9929j439m1946n320r462N6583R2588k9619q5133J1107L5913J2884
7829E3228k2315n6037n0014l5410M4325N2935P609l840J8367K0455m0173n6500
7817f7370J6656O9668K1221K404k9982k2223k6601J5331M2152l524J3442K9126
7805F0300j8452j8653q46M365J9573k5036J4910k5602n152k9192M474L1335R485
7792B1509j1557q86J2426R517k0080j898k0065j1141P803J5200M440o334m4358
$$ y = [-35764, -14829, -10675, 18769, 6713, 2012, -6958, -7195, -25114, 245, 22697, 37972, 39333, -18478, -13007, -26803, -49785, -4086, -5424, 33755, 47323, 48201, 27352, -12376, -31787, -9317, 42404, 18222, 31776, 64037, 12339, -59184, -27399, -32955, -14607, -27332, -74714, -67356, -22857, 17072, 15633, -26313, -31633, -41095, 15488, 108076, 78457, -6676, 4431, 40344, 53228, 30913, -25124, -75138, -110548, -66223, -13288, -5679, -9519, 8848, 29303, -10870, -67370, -50714, 18954, 40175, 42579, 12597, -9626, -36227, -20896, 21256, 17732, 31174, 60300, 41848, 23195, 22349, 26714, 46287, 21251, 36161, 10559, 5407, -23785, -19311, 12024, 21509, 9952, 9066, 21492, 31009, 10929, 9031, -11034, -22175, -14372, 828, 5268, -1066, -45424]
7779d5424m550o941n15K820L2161j101K501m9141n2797K367M522O1938K7582M358
7765b2220j9265m4055P232K9951M6038L4925J6121j3698J1404K7837O8956m4281
7753I8945p9578n0712O018M5142L0403m5576l4406n308l8020M8396L5491k594
7741H201j6343j2258Q268L0605l0289o0652j3036L6438O2451L446j4004K5980
7729B8807l7325J4393J2578M751n4231o061k8766N0022j3194k9428J9640L0070
7717h744K1350k3032n1314n1318J3118R370R5351M0792l5795K08L8187L1382J4150
7704I3705J2934j1969m8275k1329L657n7726o9836k9106O9366k7697N655R172
7692g1449n213J9300O3541M7870p7864n8616J2200K9882R117q9889j9425J8546
$$ y = [-45424, -49974, -56915, -57430, -54610, -22449, -23550, -21049, -70190, -122987, -120620, -116098, -54160, -26578, -22220, -41485, -85540, -78308, -48357, -2319, 32606, 48727, 35029, 46433, 74270, 143226, 98945, 19367, -31345, -25327, 19815, 50218, 4642, -29764, -35072, -73092, -24696, 10795, 8201, -8142, -20400, -12132, 18473, -11816, -72468, -85504, -49066, 13385, 16831, 2827, 28807, -8518, 5875, 18453, 23204, -31027, -37088, -65854, -15832, -29026, -58454, -38814, -8744, 12606, -10426, -61740, -113058, -99940, -90570, 4781, 45573, 9778, 9986, 48173, 79555, 93705, 106639, 94670, 46395, 25066, 28723, -29003, -98839, -127945, -58579, -86276, -80621, -71449, -76662, -57362, 6179, 54049, -23815, -82431, -70231, -40349, -31232, -121121, -140546, -122000]
7680a22000M7185k1074K0814N1342M7548J0213J4695r4051k0406j3076J2073J3972
7668e2765k4773Q697M2590J8103k0651J0579j6169J7812j6619m0573O281L3687
7656c3801K6230l3371K0649K7173J7048n49o0413o5487L3344q541j160J142J9768
7643e7968J1424k0160j7998K608O6460M894r823l1898n142k1798k108j138M2029
7630d0618P274n8976k8949K8133J5641J3753o6456j978n106N3210J5192r166O7518
7617a0528L6607L2187j3102p4900l3754P3891P68L6779k0631q2661l8795L547
7605i0592J86L7508K9793q08j6766j8863r608K0172J849K4641L4381J0516o042
7592A6367m0723K6918L1880m8024l1322j9L3743M385j6764O8323J9916n0103k8064
$$ y = [-122000, -74815, -95889, -75075, -23733, 23815, 34028, 48723, -45328, -65734, -78810, -66737, -52765, -77538, -68841, -26251, -8148, -28799, -18220, -34389, -16577, -33196, -73769, -67488, -33801, -7571, -40942, -20293, 6880, 23928, 23379, -37034, -102521, -69177, -77718, -78878, -77736, -57968, -46544, -66704, -84702, -82094, -15634, -10740, -20563, -52461, -57603, -79401, -81509, -82647, -40618, -33344, -92320, -121269, -93136, -77495, -63742, -130198, -132176, -137282, -84072, -68880, -78046, -10528, 26079, 58266, 45164, -29736, -63490, 10401, 11169, 47948, 27317, -55344, -94139, -90592, -90406, -52898, -23105, -23913, -40679, -59542, -69150, -48978, -47129, -22488, 11893, 22409, 16367, -24356, 2562, 34442, -13582, -44904, -44923, -11180, -6795, -23559, 44764, 64680, 14577, -13487]
7579a3487K992p190l898L6262K059k1917j2867N143L2480K1777l1023j1399M0888
7566C9820K690k312M58m0021J4405k845K910K4847n931K478k3509k7622j019J732
7552a3919l0343J2162K7189j1099k6414M9N2147K4294L8171n732n1793p4013j3684
7539g2985q662k9116L8118M0107J3779L2743l0256l0419m9156M223J0224q22K5051
7526e7171N5353k1K0385r375L668N2942K9938n7177k7650k6015N1291N5406n3364
7513C8210p0992j4531o129J9272j0700j9216j4029K7856M8898k4568J3059j2791
7501b5661J3594K0839p87k0725M8722o997p4698r483j0515j1919K6620M9716o553
7488g847J410m573J7435j2009m187l3664q446L089k0169L3056J0409J7666q342
$$ y = [-13487, -10495, -17685, -21583, 14679, 16738, -5179, -18046, -12903, 19577, 41354, 10331, -1068, 39820, 42510, 40198, 40656, 635, 15040, 12195, 15105, 39952, 34021, 36499, 12990, -14632, -15651, -13919, -44262, -32100, -4911, -16010, -42424, -42375, 9772, 34066, 72237, 66505, 14712, -59301, -72985, -81647, -110763, -72645, -32538, -18759, 13984, -16272, -46691, -95847, -91624, -81400, -82222, -57171, -1818, -1839, 18546, 9171, 12839, 65781, 95719, 38542, 10892, -15123, 36168, 91574, 38210, -32782, -47313, -53442, -34170, -44870, -64086, -78115, -50259, -1361, -25929, -12870, -25661, -12067, 8772, 7985, -12740, 35982, 28985, -45713, -55196, -65711, -77630, -51010, -1294, -7847, -6437, -11010, 6425, -5584, -9771, -43435, -51881, -48792, -68961, -35905, -25496, -7830, -16172]
7475a6172n1892l5198J0780K6049k1921K3970K1014l5101m0432j1468L0299N1743
7463d8329j5503K2248M9335N8484M1530L24p6575j0750l1247P967j3670L9701
7451B3515j1015J5096K4403l6687k3292J753P9669j7432n9480N1019N4801l8712
7439F3638n9931k1502R617O328p475L0700J6822k0426l5342k6458R872K6256J9452
7426A1551j1990J6905l8929p279J8211K8354N292o9374O443r015O549J8632J277
7413b3373K6754R69k131m7808J5304J3374k353j265j146q539k1215K2162o604
7400c5871l5167m2145R76J4309L7260L2469L4836L6572J6345p258j7531p426L6260
7387F3629n3714p7162K6527o289K208j8042q2228O951N2643N9089M7494m6411
$$ y = [-16172, -68064, -103262, -92482, -66433, -88354, -64384, -43370, -78471, -118903, -130371, -100072, -48329, -63832, -41584, 7751, 66235, 107765, 108089, 31514, 20764, -10483, -2516, -16186, 23515, 12500, 27596, 51999, 15312, -7980, -6227, 73442, 56010, -3470, 47549, 102350, 63638, 3707, -17795, -8178, -1850, -9325, 21375, 38197, 17771, -17571, -44029, -34157, -7901, 11551, -439, 16466, -22463, -29742, -11531, 16823, 22115, -47259, -40816, -49831, -43282, -24650, -23373, 3381, 4350, 2219, -45589, -30285, -16911, -19264, -20529, -21675, -30214, -51429, -29267, -35871, -71038, -113183, -112207, -97898, -60638, -28169, 6667, 43239, 59584, 52326, 34795, 27369, 63629, 9915, -67247, -40720, -47009, -44801, -62843, -145071, -138120, -85477, -26388, 21106, -25305]
7375b5305p9680l2837R7579O1670K733M87l7576L9219P871o7471j7144J9164p684
7362c8974J2343j2363n5902j8787K7243O0772N9541j3919j7832K2802l092m3494
7350b1662j1191N6669J0418l3957j1582Q318N7022l6916q555J2005j4755l2002
7338b6188l807k6132P5690J7831n1055L160L8415J6693J3236j4374m4909k9981
7326c1421Q27r756j906J2043m8664l5485K7090N1747m1930k6670J0967M4181K4022
7313b4955K01K281K7762L7620k1653m7380m318p934l4473M596Q7760O1554n0304
7300C0757j1053r275j1049K7018j930l2040J0733m6084K3537Q1612N520m7750
7288A9996J7966K241L6426j0022J9098K9063M4293o3335n4226n8535m4533Q721
$$ y = [-25305, -104985, -137822, -40243, 21427, 24160, 24647, -12929, 26290, 34161, -33310, -50454, -31290, -38974, -26631, -38994, -94896, -113683, -86440, -25668, 33873, 19954, 2122, 24924, 21832, -21662, -32853, 23816, 34234, 277, -11305, -2987, 54035, 17119, 8564, 20569, 5814, -26188, -29995, -56127, 19563, 37394, -13661, -10501, 27914, 44607, 57843, 43469, -1440, -31421, -30594, -40350, -42256, -30213, -78877, -114362, -87272, -35525, -77455, -104125, -93158, -48977, -24955, -24754, -22473, 5289, 42909, 21256, -26124, -30442, -38376, -72849, -68253, 19507, 81061, 30757, 19704, 10429, -620, 26398, 24468, -7572, 3161, -42923, -19386, 62226, 67746, 19996, 37962, 40203, 76629, 66607, 85705, 114768, 159061, 95726, 41500, -17035, -61568, -52847]
7276e2847J3294r716k0005l31O9294J852J4904J2181K0072l6206k1879q904M2180
7263B3889P028o749k2032N594J8300m221J5052K5409j9724k5416k5948L2536K9421
7250E3139m7251M4400J4523l7110j4977J3654k0081L7908m5915m4542L0521M4434
7238B8703K0835k6135o1063p2041K3297N1773J1650j6137J7986j1802k5383L5360
7226b2957K5064m9905J680J7660j6078L4690L2464k1867K164j6119j9016J9120
7214a3100M2880L5582p183m8238j00572m8915M2425J2709M0519J3073j4166j0750
7202e5736j4076p0055k6884O6833P3897N5260L1488L5435l2053r562j0211j0283
7190C4053k0942k9113m8590J5686r876k0498j0034J0800K3296j8454N822J2369
$$ y = [-52847, -39553, -49269, -69274, -69605, -311, 1541, 16445, 28626, 48698, 12492, -9387, -18291, 23889, 30917, 24168, 2136, 7730, 26030, 21809, 36861, 62270, 42546, 17130, -8818, 23718, 53139, 5888, 50288, 64811, 27701, 12724, 26378, 6297, 44205, -1710, -46252, -15731, 28703, 49538, 23403, -37660, -109701, -86404, -34631, -22981, -39118, -21132, -32934, -58317, -22957, 2107, -47798, -46118, -28458, -44536, -9846, 22618, 751, 2915, -13204, -32220, -13100, 29780, 65362, 58179, 9941, -90631, -139546, -97121, -84412, -43893, -30820, -44986, -55736, -69812, -139867, -166751, -99918, -26021, 29239, 60727, 96162, 64109, 54547, 44336, 34053, 13111, -16002, -64592, -48906, -58782, -79280, -89314, -78514, -55218, -73672, -67850, -55481]
7178e5481L6759k692j8812P264K6546o672j2916o0046L4669L8104m990o050o4071
7165h8388N6382N209J7188K4609J788l9014n444k502K184M5982L8059j9406m4272
7152g625q8138l8242j489L9959r020k586J6999J4560o266L1666L3118P471O111
7139c482l6211M976l7067p018L6899M0998K5693j7562L0703N155l1656o9572J0830
7126d7314M5141J3061J1756m7926r884N5531J0784p242k9981P0105K3630o6089
7114B1572l3622j9308J2617K3257L6719k0335j896l0820l2384K821O8409L9048
7102F6078k2109k3655R58l972m813n372R331j0350J2902M7200l777n092m1852
7089A5477l0720l8457K1266O019n863J751R850M0818L0795Q770k1609n659j915
$$ y = [-55481, -18722, -21414, -40226, -32962, -6416, -13088, -26004, -86050, -51381, -13277, -18267, -24317, -88388, -32006, -26797, -9609, 15000, 16788, -22226, -27670, -30172, -27988, 17994, 56053, 36647, -7625, -95763, -134005, -135494, -95535, -104555, -107141, -90142, -75582, -81848, -50182, -17064, -9593, -3482, -39693, -34717, -71784, -78802, -41903, -905, 24788, 7226, 37929, 43084, 11428, -58144, -47314, -2173, 10888, 22644, -25282, -35166, 20365, 31149, 23907, -6074, 64031, 87661, 21572, -12050, -31358, -18741, 4516, 41235, 20900, 19004, -11816, -44200, -41379, 27030, 66078, 43969, 20314, 21272, 17300, 12487, 7115, 16446, 6096, 18998, 66198, 62421, 57329, 15477, -15243, -53700, -32434, -26415, -32278, -30527, -20677, 20141, 50936, 59706, 38097, 32438, 30523]
7076C0523M2997k3931m7682J9457J6278p0636n7842k4429L9019L1367M749j8220
$$ y = [30523, 73520, 49589, 1907, 21364, 37642, -32994, -90836, -115265, -76246, -44879, -40130, -58350]
$$ [...]
##END NTUPLES=NMR SPECTRUM
##END=
