##TITLE=Analysis number 307381
Compound Code cc 42146
Book Reference 345/198
Project Code qc-cat
Chemist Name wendyb
##JCAMPDX= 6.0         $$ Bruker NMR JCAMP-DX V2.0
##DATA TYPE= NMR SPECTRUM
##DATA CLASS= NTUPLES
##ORIGIN= Bruker BioSpin GmbH
##OWNER= NMR
$$ XWIN-NMR		Version 3.5
$$ Thu Apr 28 15:01:44 2005 GMT Daylight Time (UT+1h)  MAYBRIDGE\NMR@NMR_250MHZ
##.OBSERVE FREQUENCY= 250.131544655141
##.OBSERVE NUCLEUS= ^1H
##.ACQUISITION MODE= SIMULTANEOUS (DQD)
##.ACQUISITION SCHEME= undefined
##.AVERAGES= 16
##.DIGITISER RES= 18
##SPECTROMETER/DATA SYSTEM= dpx250
##.PULSE SEQUENCE= zg30
##.SOLVENT NAME= CDCl3
##.SHIFT REFERENCE= (INTERNAL, CDCl3, 0, 16.522)
##AUDIT TRAIL= $$ (NUMBER, WHEN, WHO, WHERE, WHAT)
$$ ##TITLE= Audit trail, XWIN-NMR		Version 3.5
$$ ##JCAMPDX= 5.01
$$ ##ORIGIN= Bruker BioSpin GmbH
$$ ##OWNER= NMR
$$ C:\u/data/dgb/nmr/ADRS/2520/pdata/1/auditp.txt
$$ ##AUDIT TRAIL=  $$ (NUMBER, WHEN, WHO, WHERE, WHAT)
(   1,<2005-04-28 15:01:26.40 +100>,<MAYBRIDGE\NMR>,<NMR_250MHZ>,
      <created by zg, POWCHK disabled, PULCHK disabled
       configuration hash MD5:
       62 19 C7 07 E1 42 D1 B7 37 6C 3D D0 77 39 F9 E6
       data hash MD5: 64K
       FE EF AB 5C C4 B6 CD C0 5C 8F 17 CF 44 15 63 1E>)
(   2,<2005-04-28 15:01:36.96 +100>,<MAYBRIDGE\NMR>,<NMR_250MHZ>,
      <Start of raw data processing
       ef LB = 0.3 FT_mod = 6 PKNL = 1 SI = 32K 
       data hash MD5: 32K
       80 2D B0 60 05 3D 86 9F E2 F2 F4 FA 3D C8 03 C1>)
(   3,<2005-04-28 15:01:38.74 +100>,<MAYBRIDGE\NMR>,<NMR_250MHZ>,
      <apk 
       data hash MD5: 32K
       8F E2 C9 E1 DB BD 93 AE 91 66 91 6E F5 53 1D 5A>)
(   4,<2005-04-28 15:01:39.43 +100>,<MAYBRIDGE\NMR>,<NMR_250MHZ>,
      <abs ABSG = 5 
       data hash MD5: 32K
       3C 68 6A 81 99 33 28 BC 7A F2 01 DD 37 7D 5F C2>)
$$ ##END=
$$ 
$$ hash MD5
$$ A5 75 D5 F4 B7 C7 D4 5F E0 D6 51 C0 A7 50 5F 6D
##$RELAX= 
##$RELAX= 
##$RELAX= 
##$RELAX= 
##$RELAX= 
##$RELAX= 
##$RELAX= 
$$ Bruker specific parameters
$$ --------------------------
##$DU= <C:\u>
##$EXPNO= 2520
##$NAME= <ADRS>
##$PROCNO= 1
##$TYPE= <nmr>
##$USER= <dgb>
##$AMP= (0..31)
100 100 100 100 100 100 100 100 100 100 100 100 100 100 100 100 100 100 
100 100 100 100 100 100 100 100 100 100 100 100 100 100 
##$AQSEQ= 0
##$AQ_mod= 3
##$AUNM= <au_zg>
##$AUTOPOS= <47 >
##$BF1= 250.13
##$BF2= 250.13
##$BF3= 250.13
##$BF4= 250.13
##$BF5= 500.13
##$BF6= 500.13
##$BF7= 500.13
##$BF8= 500.13
##$BYTORDA= 1
##$CFDGTYP= 0
##$CFRGTYP= 5
##$CHEMSTR= <none>
##$CNST= (0..31)
1 1 145 1 1 1 1 1 1 1 1 1 1 1 1 1 1 1 1 1 1 1 1 1 1 1 1 1 1 1 1 1 
##$CPDPRG= <>
##$CPDPRG1= <>
##$CPDPRG2= <>
##$CPDPRG3= <>
##$CPDPRG4= <mlev>
##$CPDPRG5= <mlev>
##$CPDPRG6= <mlev>
##$CPDPRG7= <mlev>
##$CPDPRG8= <mlev>
##$CPDPRGB= <>
##$CPDPRGT= <>
##$D= (0..31)
0 1 0 0 0 0 0 0 0 0.06 0 0 0 0 0 0 0.0002 0 0 0 0 0 0 0 0 0 0 0 0 0 0 
0 
##$DATE= 1114696885
##$DBL= (0..7)
120 120 120 120 120 120 120 120 
##$DBP= (0..7)
150 150 150 150 150 150 150 150 
##$DBP07= 0
##$DBPNAM0= <>
##$DBPNAM1= <>
$$ [...]
##$SUBNAM7= <"">
##$SUBNAM8= <"">
##$SUBNAM9= <"">
##$SW= 20.6930455092707
##$SWIBOX= (0..15)
0 0 3 0 0 0 0 0 0 0 0 0 0 0 0 0 
##$SW_h= 5175.983436853
##$TD= 65536
##$TD0= 1
##$TE= 295.16
##$TE2= 300
##$TE3= 300
##$TEG= 300
##$TL= (0..7)
0 120 120 120 120 120 120 120 
##$TP= (0..7)
150 150 150 150 150 150 150 150 
##$TP07= 0
##$TPNAME0= <>
##$TPNAME1= <>
##$TPNAME2= <>
##$TPNAME3= <>
##$TPNAME4= <>
##$TPNAME5= <>
##$TPNAME6= <>
##$TPNAME7= <>
##$TPOAL= (0..7)
0.5 0.5 0.5 0.5 0.5 0.5 0.5 0.5 
##$TPOFFS= (0..7)
0 0 0 0 0 0 0 0 
##$TUNHIN= 0
##$TUNHOUT= 0
##$TUNXOUT= 0
##$USERA1= <user>
##$USERA2= <user>
##$USERA3= <user>
##$USERA4= <user>
##$USERA5= <user>
##$V9= 5
##$VALIST= <valist>
##$VCLIST= <CCCCCCCCCCCCCCC>
##$VD= 0
##$VDLIST= <DDDDDDDDDDDDDDD>
##$VPLIST= <PPPPPPPPPPPPPPP>
##$VTLIST= <TTTTTTTTTTTTTTT>
##$WBST= 1024
##$WBSW= 4
##$XGAIN= (0..3)
0 0 0 0 
##$XL= 0
##$YL= 0
##$YMAX_a= 525637
##$YMIN_a= -858310
##$ZGOPTNS= <>
##$ZL1= 120
##$ZL2= 120
##$ZL3= 120
##$ZL4= 120
##$ABSF1= 16.522
##$ABSF2= -4.171173
##$ABSG= 5
##$ABSL= 3
##$ALPHA= 0
##$AQORDER= 0
##$ASSFAC= 0
##$ASSFACI= 0
##$ASSFACX= 0
##$ASSWID= 0
##$AUNMP= <proc_1d>
##$AZFE= 0.1
##$AZFW= 0.1
##$BCFW= 0
##$BC_mod= 0
##$BYTORDP= 0
##$COROFFS= 0
##$CY= 12.5
##$DATMOD= 1
##$DC= 0
##$DFILT= <>
##$DTYPP= 0
##$F1P= 14.0000005364418
##$F2P= -0.99999901652339
##$FCOR= 0.5
##$FTSIZE= 32768
##$FT_mod= 6
##$GAMMA= 0
##$GB= 0
##$INTBC= 1
##$INTSCL= 1
##$ISEN= 128
##$LB= 0.3
##$LEV0= 0
##$LPBIN= 0
##$MAXI= 10000
##$MC2= 0
##$MEAN= 0
##$ME_mod= 0
##$MI= 0
##$NCOEF= 0
##$NC_proc= -3
##$NLEV= 6
##$NOISF1= 0
##$NOISF2= 0
##$NSP= 0
##$NTH_PI= 0
##$NZP= 0
##$OFFSET= 16.522
##$PC= 1
##$PHC0= -75.42455
##$PHC1= 5.519849
##$PH_mod= 1
##$PKNL= yes
##$PPARMOD= 0
##$PSCAL= 4
##$PSIGN= 0
##$REVERSE= no
##$SF= 250.13
##$SI= 32768
##$SIGF1= 0
##$SIGF2= 0
##$SINO= 400
##$SIOLD= 32768
##$SREGLST= <1H.CDCl3>
##$SSB= 0
##$STSI= 32768
##$STSR= 0
##$SW_p= 5175.98343685301
##$SYMM= 0
##$S_DEV= 0
##$TDeff= 65536
##$TDoff= 0
##$TI= <Analysis number 999999
Compound Code 99
Book Reference 9
Project Code 9>
##$TILT= no
##$TM1= 0
##$TM2= 0
##$TOPLEV= 0
##$USERP1= <user>
##$USERP2= <user>
##$USERP3= <user>
##$USERP4= <user>
##$USERP5= <user>
##$WDW= 1
##$XDIM= 32768
##$YMAX_p= 304076525
##$YMIN_p= -113437
$$ End of Bruker specific parameters
$$ ---------------------------------
##NTUPLES= NMR SPECTRUM
##VAR_NAME=  FREQUENCY,     SPECTRUM/REAL,   SPECTRUM/IMAG
##SYMBOL=    X,             R,               I
##VAR_TYPE=  INDEPENDENT,   DEPENDENT,       DEPENDENT
##VAR_FORM=  AFFN,          ASDF,            ASDF
##VAR_DIM=   32768,         32768,           32768
##UNITS=     HZ,            ARBITRARY UNITS, ARBITRARY UNITS
##FACTOR=    0.157963299565203, 1,           1
##FIRST=     4132.6476996994, 0,             0
##LAST=      -1043.33573715361, 0,           0
##MIN=       -1043.33573715361, -113437,     0
##MAX=       4132.6476996994, 304076525,     0
$$ Real data points
##PAGE= N=1
##DATA TABLE= (X++(R..R)), XYDATA
$$ [...]
$$ plain form
16265 -19962 -25324 -27099 -26278 -21941 -23251 -12255 -16520 -20442 -29909 -39148 -49531 -41437 -24609 -19127
16251 -19127 -24203 -19534 -15598 -30142 -32119 -18400 -21926 -20721 -10243 -11456 -19318 -20057 -6490 -4182
16237 -4182 -12043 -27406 -26741 -26541 -26703 -14098 144 10820 18345 21625 5713 -176 -109 -5769 -10235
16222 -10235 -5530 3274 1144 -15473 -30454 -27319 -27746 -14102 -5709 -16639 -19960 -9364 -2073
16209 -2073 6966 8468 36 -17236 -15031 296 -6481 -21174 -26799 -25692 -19257 -20789 -26877 -19803
16195 -19803 -18413 -16686 -19072 -19430 -28574 -29622 -35123 -29994 -10169 -2526 4892 9344 4657 -9420
16181 -9420 -11805 -5623 -7295 -22825 -27974 -22079 -9778 -12363 -15805 -18053 -8107 602 -2736 -11994
16167 -11994 -5563 7223 -14287 -26058 -34165 -30527 -23584 -22398 -24346 -34506 -23753 -24507 -10512
$$ packed form
16265a9962n362j775Q21M337j310J0996m265l922r467r239j0383Q094J6828N482
16251a9127n076M669L936j4544j977J3719l526J205J0478j213p862p39J3567K308
16237d182p861j5363O65K00j62J2605J4242J0676P525L280j5912n889O7n660m466
16222a0235M705Q804k130j6617j4981L135m27J3644Q393j0930l321J0596P291
16209b073R039J502q432j7272K205J5327o777j4693n625J107O435j532o088P074
16195a9803J390J727k386l58r144j048n501N129J9825P643P418M452m687j4077
16181i420k385O182j672j5530n149N895J2301k585l442k248R946Q709l338r258
16167a1994O431J2786k1510j1771q107L638O943J186j948j0160J0753p54J3995
$$ plain form
16154 -10512 -21947 -25379 -28177 -23472 -25038 -35377 -36382 -28805 -13807 -12554 -20896 -27913 -22878 -28317
16140 -28317 -18447 -14797 -32519 -30438 -13682 -12898 -9779 -13649 -23946 -27307 -28880 -32748 -27234 -28690
16126 -28690 -19882 -7755 -4103 3426 2890 1460 2596 -8620 -23113 -27317 -25834 -12579 -5468 -10447
16112 -10447 -4525 -10030 -10842 -21861 -41340 -44665 -47754 -35030 -29495 -36875 -28793 -30269 -33358 -21730
16098 -21730 -26297 -34096 -39903 -18490 -4828 -6434 -6181 -21379 -35734 -45533 -43639 -33002 -16050
16085 -16050 -14381 -31609 -22964 -15967 -19290 -32274 -30554 -16462 -14636 -34153 -40157 -29666 -25644
16072 -25644 -11568 -6375 -13281 -11539 -11080 -14107 -18778 -12794 -8401 -10788 -6072 -6886 -8688 -12908 -19254
16057 -19254 -19658 -7105 -4756 -3446 2360 -621 -9364 -13674 -13059 -15556 -20907 -16159 -23514 -13297
$$ packed form
16154a0512j1435l432k798M705j566j0339j005P577J4998J253q342p017N035n439
16140b8317R870L650j7722K081J6756P84L119l870j0297l361j573l868N514j456
16126b8690Q808J2127L652P529n36j430J136j1216j4493m204J483J3255P111m979
16112a0447N922n505q12j1019j9479l325l089J2724N535p380Q082j476l089J1628
16098b1730m567p799n807K1413J3662j606K53j5198j4355r799J894J0637J6952
16085a6050J669j7228Q645O997l323j2984J720J4092J826j9517o004J0491M022
16072b5644J4076N193o906J742M59l027m671N984M393k387M716q14j802m220o346
16057a9254m04J2553K349J310N806k981q743m310O15k497n351M748p355J0217
$$ plain form
16043 -13297 -15954 -10732 -8976 -4537 -6364 -19893 -14111 1350 -6617 -15524 -12417 -9837 -2656 9443
16029 9443 15619 -3324 -11508 -2963 -12434 -19396 -11393 -6205 -7278 -1224 -1194 -2427 -7272 824 -3291
16014 -3291 -2659 -15485 -23329 -24759 -26620 -23075 -13857 -18143 -28094 -29356 -12952 -2773 2150 4305
16000 4305 -769 217 -7252 -7580 -14996 -19069 -19085 -21252 -25478 -26535 -19821 -18768 -25372 -19876 -14034 -17688
15984 -17688 -12828 -9591 -8687 -12630 -13191 -10941 -10166 -13674 -12446 -5698 -4487 -7366 -11218 -16687 -16571
15969 -16571 -23071 -28335 -28167 -27279 -26198 -24405 -12433 -13403 -22404 -13501 3705 10061 6762 -983 1058
15954 1058 -4427 -5596 1011 12747 6220 532 -10976 -4211 -1917 -4784 -3291 -7405 -16847 -15107
15940 -15107 -14944 -10074 -2561 -17307 -17022 -1891 4339 -486 -11824 -14053 -14246 -11077 -7759 -7647 4226
$$ packed form
16043a3297k657N222J756M439j827j3529N782J5461p967q907L107K580P181J2099
16029I443O176j8943q184Q545r471o962Q003N188j073O054L0j233m845Q096m115
16014c291O32j2826p844j430j861L545R218m286r951j262J6404J0179M923K155
16000D305n074R86p469l28p416m073j6k167m226j057O714J053o604N496N842l654
15984a7688M860L237R04l943n61K250P75l508J228O748J211k879l852n469J16
15969a6571o500n264J68Q88J081J793J1972r70r001Q903J7206O356l299p745K041
15954A058n485j169O607J1736o527n688j1508O765K294k867J493m114r442J740
15940a5107J63M870P513j4746K85J5131O230m825j1338k229j93L169L318J12J1873
$$ plain form
15925 4226 12432 5126 10295 -3012 -22296 -25829 -23846 -21214 -12074 6235 9424 664 -16680 -12956
15911 -12956 -16256 -14718 -1507 6373 -3812 -17729 -16183 -12747 -10822 -10630 -4058 -14325 -16777 -22258
15897 -22258 -22996 -7363 -2662 -15827 -28127 -21769 -15172 -9104 -4632 -7669 -11351 -4815 -6891 -2797
15883 -2797 6323 4665 -10123 -3545 -408 -6541 -12429 -18624 -19917 -14959 -2070 -13968 -17986 -14136
15869 -14136 -9486 -4197 -2123 -9763 -819 -22 -17926 -14784 -17232 -15058 -27202 -22361 -12643 -12407
15855 -12407 -20073 -34141 -34667 -32565 -26883 -21233 -19599 -6992 6254 -5528 -17652 -25256 -25249 -19982
15841 -19982 -19481 -2866 -3274 -4789 -9749 -18552 -16056 -8978 -20937 -17030 -13151 -17397 -13558 -16687
15827 -16687 -34625 -33296 -24210 -20502 -8842 -16634 -27281 -21416 -21207 -20605 -18565 -13722 567 3070
$$ packed form
15925D226Q206p306N169j3307j9284l533J983K632R140J8309L189q760j7344L724
15911a2956l300J538J3211P880j0185j3917J546L436J925J92O572j0267k452n481
15897b2258p38J5633M701j3165j2300O358O597O068M472l037l682O536k076M094
15883b797R120j658j4788O578L137o133n888o195j293M958J2889j1898m018L850
15869a4136M650N289K074p640Q944P97j7904L142k448K174j2144M841R718K36
15855a2407p666j4068n26K102N682N650J634J2607J3246j1782j2124p604PN267
15841a9982N01J6615m08j515m960q803K496P078j1959L907L879m246L839l129
15827a6687j7938J329R086L708J1660p792j0647N865K09O02K040M843J4289K503
$$ plain form
15813 3070 -10874 -13579 -2928 -10350 -16256 -14483 -9298 -9576 -16887 -17785 -17775 -14577 -14137 -22701 -22321 -19094
15797 -19094 -12537 1960 -797 -4689 -13326 -21691 -23999 -25722 -35171 -22867 -12648 -10879 -21031
15784 -21031 -19642 -2860 -2147 -4447 -1268 1178 987 -186 -17925 -32889 -22136 -13029 -7527 8211
15770 8211 16879 17478 13600 4392 16158 16954 20745 21697 9757 -9455 -13094 -6584 5400 9386
15756 9386 18887 25824 16745 -4360 -5514 -7174 -2593 -7485 -10307 -9428 -14580 -10986 -4962 -15433
15742 -15433 -35822 -25309 -10798 748 -8140 -15652 -29927 -37335 -27264 -6989 -15258 -16312 -1381
15729 -1381 -7777 -9448 -10652 -7924 -10942 -22090 -18744 2339 13900 7624 -1543 -12192 -7436 -2488
15715 -2488 -7516 -2259 -6685 -19393 -23539 -19652 -21412 -9238 -5274 911 -4248 -10604 -11672 -12820
$$ packed form
15813C070j3944k705J0651p422n906J773N185k78p311q98J0L198M40q564L80L227
15797a9094O557J4497k757l892q637q365k308j723r449J2304J0219J769j0152
15784b1031J389J6782P13k300L179K446j91j173j7739j4964J0753R107N502J5738
15770H211Q668N99l878r208J1766P96L791R52j1940j9212l639O510J1984L986
15756I386R501O937r079k1105j154j660M581m892k822Q79n152L594O024j0471
15742a5433k0389J0513J4511J1546q888p512j4275p408J0071K0275q269j054J4931
15729a381o396j671j204K728l018j1148L346K1083J1561o276r167j0649M756M948
15715b488n028N257m426j2708m146L887j760J2174L964O185n159o356j068j148
$$ plain form
15701 -12820 -13759 -11440 -22594 -26421 -23130 -21100 -28788 -14152 -12086 -13159 -28327 -25005 -17670 -13547
15687 -13547 -18221 -12815 -15015 -12218 -11112 -14087 -16471 -14171 -10293 -21651 -26183 -16879 -22563 -24816
15673 -24816 -15007 -4686 -6948 -4139 4347 12433 12594 8138 5956 4212 7623 7977 3560 -3099 -2883
15658 -2883 -17931 -23720 -17282 -18717 -16620 -20065 -29449 -45065 -37577 -20737 -18623 -9398 -3302 -6593
15644 -6593 -13818 -14734 -19659 -20353 -15195 -13820 -12651 -8297 -335 -918 -15073 -8880 -3342 -13984 -18881
15629 -18881 -32989 -32156 -14744 -4651 4211 -4946 -12122 10199 858 -1513 -10953 -20733 -10852 -13336
15615 -13336 -18572 -19309 -15693 -13978 -7470 4140 7051 -751 -9293 -12900 5148 14935 8516 4747
15601 4747 9899 4527 -9474 -10991 -4316 -10469 -13984 -4984 2921 7424 450 -12782 -23452 -32169
$$ packed form
15701a2820r39K319j1154l827L291K030p688J4636K066j073j5168L322P335M123
15687a3547m674N406k200K797J106k975k384K300L878j1358m532R304n684k253
15673b4816R809J0321k262K809Q486Q086J61m456k182j744L411L54m417o659K16
15658b883j5048n789O438j435K097l445r384j5616P488J6840K114R225O096l291
15644f593p225r16m925o94N158J375J169M354P962n83j4155O193N538j0642m897
15629a8881j4108Q33J7412J0093Q862r157p176K2321r341k371r440r780R881k484
15615a3336n236p37L616J715O508J1610K911p802q542l607J8048R787o419l769
15601D747N152n372j4001j517O675o153l515R000P905M503o974j3232j0670q717
$$ plain form
15587 -32169 -30135 -31980 -23007 -8538 -639 -5777 -24145 -26671 -21929 -11327 -7057 2315 -1796 -11405
15573 -11405 -10125 -7672 -5144 -18265 -30950 -25021 -19994 -24418 -23188 -8568 3084 7919 9345
15560 9345 -1126 -2067 -4986 -20191 -13401 -14338 -15362 -15592 -13238 -3705 -9427 -10523 -14784 -1184 13451
15545 13451 8509 -9380 -22595 -19360 -18270 -16568 -4918 3552 2565 -11428 -14855 -14095 -15664 -19367
15531 -19367 -11050 1391 7644 21965 15167 9596 9260 14306 12459 6411 994 -421 4460 11510
15517 11510 16479 3921 622 -790 3782 5706 -5656 -11745 1244 7809 7211 381 -6107 -4063
15503 -4063 -6505 -1325 -3753 -6143 -8094 33 -6947 -11482 -1694 -8696 -724 5791 3835 7655 13023
15488 13023 21017 20666 1936 -10839 -12847 -15914 -17495 -20852 -20278 -19882 -18924 -21360 -15486 -7928 -12945
$$ packed form
15587c2169K034j845Q973J4469P899n138j8368k526M742J0602M270R372m111r609
15573a1405J280K453K528j3121j2685N929N027m424J230J4620J1652M835J426
15560I345j0471r41k919j5205O790r37j024k30K354R533n722j096m261J3600J4635
15545A3451m942j7889j3215L235J090J702J1650Q470r87j3993l427P60j569l703
15531a9367Q317J2441O253J4321o798n571l36N046j847o048n417j415M881P050
15517A1510M969j2558l299j412M572J924j1362o089J2989O565n98o830o488K044
15503d063k442N180k428k390j951Q127o980m535R788p002P972O515j956L820N368
15488A3023P994l51j8730j2775k008l067j581l357N74L96R58k436N874P558n017
$$ plain form
15473 -12945 -11365 -10165 -9227 -8813 -9295 -3344 -1088 -2216 -123 6860 7606 -3165 4412 14035 6750
15458 6750 14961 17055 17419 4045 -4536 -12180 -12796 -89 2296 -11674 -8157 8108 1493 4701
15444 4701 15832 10038 -6646 1180 4635 -5456 -10704 -4988 1589 994 -13380 -9637 -9242 -15584
15430 -15584 -15736 -19699 -13667 -7370 -1530 -5020 -11988 -10730 6605 5562 -1868 1453 8958 13763
15416 13763 4189 8837 7131 -5126 -5236 -8868 3993 8687 8205 21307 19472 10627 5656 5327
15402 5327 9256 13497 13451 10793 2566 4640 8720 -1823 -3798 8754 12974 -2394 -7401 -4180
15388 -4180 -7562 11559 9234 6012 13394 12513 708 7135 12407 7583 7068 -1388 -2453 4754 -4793
15373 -4793 2373 11389 11967 4952 -3222 -11552 -16747 -17063 -5243 -1361 -11742 -4381 -8032 -21184
$$ packed form
15473a2945J580J200R38M14m82N951K256j128K093O983P46j0771P577R623p285
15458F750Q211K094L64j3374q581p644o16J2707K385j3970L517J6265o615L208
15444D701J1131n794j6684P826L455j0091n248N716O577n95j4374L743L95o342
15430a5584j52l963O032O297N840l490o968J258J7335j043p430L321P505M805
15416A3763r574M648j706j2257j10l632J2861M694m82J3102j835q845m971l29
15402E327L929M241m6k658q227K074M080j0543j975J2552M220j5368n007L221
15388d180l382J9121k325l222P382q81j1805O427N272m824n15q456j065P207r547
15373d793P166R016N78p015q174q330n195l16J1820L882j0381P361l651j3152
$$ plain form
15359 -21184 -20609 -12717 -16204 -12052 -7732 987 7270 2201 1362 10703 21959 15434 15529 18660 9010
15344 9010 3058 7875 17043 18346 24702 19414 6037 -551 -1560 3307 3614 -1207 -6736 -4270 3358
15329 3358 13556 17327 26624 18461 9559 11107 8137 3577 873 -147 -1863 8233 8391 2394
15315 2394 -1383 -4280 -2571 3116 15226 25945 25926 19293 13059 3096 -4294 1455 7958 18688
15301 18688 11316 -5333 3517 11231 14973 10934 1726 -2403 12960 15761 15837 1912 -798 1546
15287 1546 2046 -8533 3909 -6516 -11764 -282 -2797 -8160 -7203 -13645 -6171 9090 11725 6437
15273 6437 6431 5525 -1555 -3231 -5186 -7444 -9566 -5870 -4398 -1022 3284 6474 17138 11128 7390
15258 7390 3152 1415 -3243 -10238 718 8770 -6102 -13623 -19317 -12827 7426 18004 9380 7498
$$ packed form
15359b1184N75P892l487M152M320Q719O283n069q39R341J1256o525R5L131r650
15344I010n952M817R168J303O356n288j3377o588j009M867L07m821n529K466P628
15329C358J0198L771R297q163q902J548k970m560k704j020j716J0096J58n997
15315B394l777k897J709N687J2110J0719j9o633o234r963p390N749O503J0730
15301A8688p372j6649Q850P714L742m039r208m129J5363K801P6j3925k710K344
15287A546N00j0579J2442j0425n248J1482k515n363R57o442P474J5261K635n288
15273F437or06p080j676j955k258k122L696J472L376M306L190J0664o010l738
15258G390m238j737m658o995J0956Q052j4872p521n694O490K0253J0578q624j882
$$ plain form
15244 7498 3999 740 890 11015 21218 25145 10899 7520 10324 8023 -3166 -11669 -4801 3932
15230 3932 -15870 -20435 -6948 -6405 -3297 1039 -5588 306 1403 -1966 -2970 2334 -2582 -3493 -2420
15215 -2420 -13559 -10560 -6078 -19286 -18392 -10897 -5956 -2773 -5495 2083 2978 4444 11730 15947 25336
15200 25336 9504 -7659 -8855 -10998 -21850 -24579 -23698 -35201 -27138 -18007 -17872 -17602 -8261 -13954
15186 -13954 -13525 10431 23158 23811 22438 9604 3314 10727 12508 89 -199 2041 9141 2423
15172 2423 -7735 -20847 -29265 -7170 -3269 1177 17670 31222 28936 11168 -8473 -14000 -4797
15159 -4797 5946 11782 9307 3098 5998 6293 6205 -460 -649 13908 4974 -9280 3499 10625 4523
15144 4523 -9930 11723 28877 24831 10163 11552 6763 7052 3086 -7837 -7082 10288 25035
$$ packed form
15244G498l499l259J50J0125J0203L927j4246l379K804k301j1189q503O868Q733
15230C932j9802m565J3487N43L108M336o627N894J097l369j004N304m916r11J073
15215b420j1139K999M482j3208Q94P495M941L183k722P578Q95J466P286M217R389
15200B5336j5832j7163j196k143j0852k729Q81j1503Q063R131J35K70R341n693
15186a3954M29K3956J2727O53j373j2834o290P413J781j2419k88K240P100o718
15172B423j0158j3112q418K2095L901M446J6493J3552k286j7768j9641n527R203
15159d797J0743N836k475o209K900K95q8o665j89J4557q934j4254J2779P126o102
15144D523j4453K1653J7154m046j4668J389m789K89l966j0923P55J7370J4747
$$ plain form
15131 25035 19990 6502 -5053 5396 24064 6203 -8172 -10423 -10608 -14615 -9342 -2944 -7498
15118 -7498 4586 11231 -6888 -15455 -15808 -13264 -14503 -17832 -19624 -8213 -7343 -10329 -10902 -5277 9243
15103 9243 17427 7926 2553 5341 9295 11858 5466 238 4203 3949 -832 -17151 -8746 -2482 378
15088 378 817 2895 16222 20676 11906 5455 2731 -2681 -13357 -13006 -13744 -4319 -6131 -18462 -16752
15073 -16752 -24326 -27910 -26160 -34575 -42368 -39117 -22350 -12515 -6055 -11899 -11276 -19090 -22678 -6915
15059 -6915 11046 -1873 -12091 -3539 -1166 1428 11718 9689 -143 7579 5973 -9203 -6984
15046 -6984 14297 10604 16600 5835 -7846 -14612 -7498 -4712 6904 9128 6292 -344 1005 478
15032 478 -3022 -6480 3367 11836 15077 13530 2933 -2966 -7992 -4605 4526 14231 14069 20594 20859
$$ packed form
15131B5035n045j3488j1555J0449J8668j7861j4375k251j85m007N273O398m554
15118g498J2084O645j8119q567l53K544j239l329j792J1411Q70k986n73N625J4520
15103I243Q184r501n373K788L954K563o392n228L965k54m781j6319Q405O264K860
15088C78M39K078J3327M454q770o451k724n412j0676L51p38R425j812j2331J710
15073a6752p574l584J750q415p793L251J6767R835O460n844O23p814l588J5763
15059f915J7961j2919j0218Q552K373K594J0290k029r832P722j606j5176K219
15046f984K1281l693N996j0765j3681o766P114K786J1616K224k836o636J349n27
15032D78l500l458R847Q469L241j547j0597n899n026L387R131R705j62O525K65
$$ plain form
15017 20859 14404 5059 -10305 -5486 4359 4639 -491 -4121 8419 10573 4814 6802 5112 1989
15003 1989 -2839 -765 8001 4148 -5107 -4482 -2243 -17321 -23306 1944 8164 2587 8970 16786
14989 16786 8147 10980 7353 1624 -3602 -20240 -31881 -27051 -13024 -5304 -6882 -943 -7431 2540
14975 2540 8795 8518 4216 -1328 -7982 -8925 -5507 -14141 -11797 -12439 -22307 -13930 -1286 -2376 -4887
14960 -4887 -4319 2280 -1539 -12477 -5202 -6752 -9176 -14940 -23726 -15410 5502 9553 9030 4428 2491
14945 2491 2687 3463 1680 7664 -84 -9793 -3195 2247 -4116 -5999 -8629 2741 3680 -4879 1525
14930 1525 7571 -608 1266 4516 5750 1001 -4040 -11631 -10500 -13300 -7558 1970 6522 -3153 -3908
14915 -3908 122 -2636 -7890 405 28729 23131 8099 -903 -1769 -6336 -8691 -14982 -11802 -5859
$$ packed form
15017B0859o455r345j5364M819R845K80n130l630J2540K154n759J988j690l123
15003A989m828K074Q766l853r255O25K239j5078n985K5250O220n577O383P816
14989A6786q639K833l627n729n226j6638j1641M830J4027P720j578N939o488R971
14975B540O255k77m302n544o654r43L418q634K344o42r868Q377J2644j090k511
14960d887N68O599l819j0938P275j550k424n764q786Q316K0912M051n23m602j937
14945B491J96P76j783N984p748r709O598N442o363j883k630J1370R39q559O404
14930A525O046q179J874L250J234m749n041p591J131k800N742R528M552r675p55
14915c908M030k758n254Q295K8324n598j5032r002q66m567k355o291L180N943
$$ plain form
14901 -5859 -7454 264 5805 2338 -4865 7076 13107 25005 15738 20055 13467 13604 18408 8663
14887 8663 485 5065 4005 5108 4918 -1036 -8269 -11410 -5196 5430 11705 -695 -5280 5942
14873 5942 17389 22242 25984 11452 8647 -2811 552 -919 -3570 -5150 2842 14265 3638
14860 3638 -989 -8918 -19993 -28429 -13307 7903 14941 14705 2192 9479 18475 14697 -752 -2173
14846 -2173 2814 6788 -9078 -17094 -16007 -11109 -4055 13264 12565 18475 15046 7168 5015 -7419
14832 -7419 1303 4778 8535 11908 12823 14989 12588 19231 27799 16111 1036 3974 -7953 -4458
14818 -4458 15162 19861 12747 3120 5635 -3548 -16007 -33018 -19373 -6448 -19093 -2702 15418
14805 15418 16442 1416 1334 4946 8247 12207 12491 4786 -3371 -10225 -8647 1818 5111 -6491
$$ packed form
14901e859j595P718N541l467p203J1941O031J1898r267M317o588J37M804r745
14887H663q178M580j060J103j90n954p233l141O214J0626O275j2400m585J1222
14873E942J1447M853L742j4532k805j1458L363j471k651j580P992J1423j0627
14860C638m627p929j1075q436J5122K1210P038k36j2513P287Q996l778j5449j421
14846b173M987L974j5866q016J087M898P054J7319o99N910l429p878k153j2434
14832g419Q722L475L757L373R15K166k401O643Q568j1688j5075K938j1927L495
14818d458J9620M699p114r627K515r183j2459j7011J3645J2925j2645J6391J8120
14805A5418J024j5026q2L612L301L960K84p705q157o854J578J0465L293j1602
$$ plain form
14791 -6491 -8594 -5342 -3429 9572 4442 -10981 -15749 -14382 -17458 -12741 -898 10794 -2181
14778 -2181 -6236 6689 18914 14753 9886 15855 16843 11262 14608 16511 6989 7493 22298 16364
14764 16364 14367 14375 2160 -7797 -19943 -6206 -2748 -12659 -13047 -11280 -295 -15045 -16136 -9678
14750 -9678 -20553 -13744 -8584 -6315 1724 399 -6037 -3693 -2194 1508 6674 9832 15186 11514
14736 11514 14836 24629 32153 26619 4680 -9249 -16664 -6073 -4063 792 14650 9949 999
14723 999 4288 -7796 -16306 -15200 -8005 6001 6329 10330 13250 10424 36641 31880 30363 13200
14709 13200 -2645 -24291 -22211 -22890 -16724 -9724 -5501 -1754 -2002 1143 1402 5005 5907 -2058 -5185
14694 -5185 -5558 -11308 5077 14786 21650 23623 17007 11489 8037 15822 2733 -1171 1704 5893
$$ packed form
14791f491k103L252J913J3001n130j5423m768J367l076M717J1843J1692j2975
14778b181m055J2925J2225m161m867N969R88n581L346J903r522N04J4805n934
14764A6364j997Qj2215r957j2146J3737L458r911l88J767J0985j4750j091O458
14750i678j0875O809N160K269Q039j325o436K344J499L702N166L158N354l672
14736A1514L322R793P524n534k1939j3929p415J0591K010M855J3858m701q950
14723I99L289j2084q510J106P195J4006L28M001K920k826K6217m761j517j7163
14709A3200j5845k1646K080o79O166P000M223L747k48L145K59L603R02p965l127
14694e185l73n750J6385R709O864J973o616n518l452P785j3089l904K875M189
$$ plain form
14680 5893 -1853 -5318 -8109 8709 15581 17777 21784 8472 6268 17635 15072 9076 13608 35134
14666 35134 37166 30733 27720 22918 19686 11583 11454 14394 27777 17565 22240 26167 26386 7723
14652 7723 -2499 2896 15572 22331 28670 36151 29071 17219 24807 28770 28738 21569 15791 10650
14638 10650 7566 10931 16800 12955 14629 16243 6399 8730 4954 -4355 5856 12641 5513 -9174
14624 -9174 -5509 11518 12136 1700 1417 8551 5233 -1482 4273 6681 11181 9087 7089 13188 15098
14609 15098 19148 16815 11655 18112 10222 6723 13064 10127 10344 12072 17390 24300 19240 5909
14595 5909 7890 2983 11839 19684 11725 16180 7795 8982 13631 24090 22442 12389 12287 18262
14581 18262 16573 16747 18809 17984 13034 1197 -12389 -5252 -242 -1794 -6378 -2841 9006 24488
$$ packed form
14680E893p746l465k791J6818O872K196M007j3312k204J1367k563n996M532K1526
14666C5134K032o433l013m802l232q103j29K940J3383j0212M675L927K19j8663
14652G723j0222N395J2676O759O339P481p080j1852P588L963l2p169n778n141
14638A0650l084L365N869l845J674J614r844K331l776r309J0211O785p128j4687
14624i174L665J7027O18j0436k83P134l318o715N755K408M500k094j998O099J910
14609A5098M050k333n160O457p890l499O341k937K17J728N318O910n060j3331
14595E909J981m907Q856P845p959M455q385J187M649J0459j648j0053j02N975
14581A8262j689J74K062q25m950j1837j3586P137N010j552m584L537J1847J5482
$$ plain form
14567 24488 25470 14074 15522 19586 18043 2431 -5453 -3762 -13649 -10802 -6074 -3658 12816 27212
14553 27212 32609 32435 41180 32287 16612 3509 -3766 -8232 -6128 13067 13808 8321 5570 8327
14539 8327 -8221 -15946 -5166 1346 1442 10408 -8085 -5739 15576 30553 28939 10178 5880 10771
14525 10771 14805 9171 3847 11501 18160 21298 16513 10815 4200 -177 -1516 3122 -401 4674
14511 4674 -10054 -12625 -1794 2853 9428 5496 -2986 11058 13647 21688 19256 9246 5520 4849
14497 4849 11014 9497 -10449 -12633 -12414 -19465 -16050 -14708 -10993 -3324 1191 14146 22886 19458
14483 19458 10667 23691 30548 26019 14240 4493 -4376 9733 7398 6985 3807 12418 14394 19095
14469 19095 21181 27195 20312 17687 13400 16643 10662 18403 22002 22749 21774 18214 19606 17320 4171
$$ packed form
14567B4488R82j1396J448M064j543j5612p884J691r887K847M728K416J6474J4396
14553B7212N397j74Q745q893j5675j3103p275m466K104J9195P41n487k751K757
14539H327j6548p725J0780O512R6Q966j8493K346K1315J4977j614j8761m298M891
14525A0771M034n634n324P654O659L138m785n698o615m377j339M638l523N075
14511D674j4728k571J0831M647O575l932q482J4044K589Q041k432j0010l726o71
14497D849O165j517j9946k184K19p051L415J342L715P669M515J2955Q740l428
14483A9458q791J3024O857m529j1779r747q869J4109k335m13l178Q611J976M701
14469A9095K086O014o883k625m287L243n981P741L599P47r75l560J392k286j3149
$$ plain form
14454 4171 7245 21196 25360 21034 33068 24705 19184 19892 17250 15027 15397 20712 14938 -4895
14440 -4895 -15060 -5947 4842 15635 25216 30341 16003 5678 2924 9028 13421 24401 21890
14427 21890 10195 1074 -3031 -3995 4859 6783 8804 4081 9882 9332 18908 27041 25275 19352 14238
14412 14238 -5277 1927 18369 20401 12220 15550 18958 11121 -1582 -2250 -920 -4436 -2048 2556
14398 2556 4691 8487 14123 1861 5912 9066 -160 -9253 5500 9019 7995 10777 12342 16625
14384 16625 22449 28234 31766 25204 17083 14520 9125 23688 36593 33271 40001 40897 39208 34853
14370 34853 16751 21955 28587 33000 23132 16236 23498 12519 7982 10533 10380 27615 18174 -2823
14356 -2823 -12141 -5457 3706 15159 29038 35793 22690 21186 20567 18238 29113 27455 15607 8137
$$ packed form
14454D171L074J3951M164m326J2034q363n521P08k642k223L70N315n774j9833
14440d895j0165R113J0789J0793R581N125j4338j0325k754O104M393J0980k511
14427B1890j1695r121m105r64Q854J924K021m723N801n50R576Q133j766n923n114
14412A4238j9515P204J6442K032q181L330L408p837j2703o68J330l516K388M604
14398B556K135L796N636j2262M051L154r226r093J4753L519j024K782J565M283
14384A6625N824N785L532o562q121k563n395J4563J2905l322O730Q96j689m355
14370C4853j8102N204O632M413r868o896P262j0979m537K551j53J7235r441k0997
14356b823r318O684R163J1453J3879O755j3103j504o19k329J0875j658j1848p470
$$ plain form
14342 8137 9422 7722 1294 10104 13198 17192 14748 -4194 -8007 1385 14639 18495 2825 -746
14328 -746 12058 24250 32526 43638 33028 17882 26558 25849 15659 24685 24217 30708 32879 30429
14314 30429 20930 17426 24136 11694 3809 11346 18975 32706 38200 53755 44038 26030 16681
14301 16681 11965 5951 -6461 15354 25517 27970 5963 4358 8269 -453 -5913 -6671 -9685 -6746
14287 -6746 3863 16605 13498 4661 1789 -10824 -9142 -5781 -4305 -2763 2268 10052 26606 24307
14273 24307 18600 26341 40807 33429 16471 15030 18936 20771 15363 12978 17242 21702 18094 26896
14259 26896 29698 22255 11267 12325 27391 29777 21202 17832 14535 11942 19164 24370 26884 21457
14245 21457 7657 3999 9208 9081 10907 17369 14966 14275 3178 -12183 -11649 -14234 -28067 -18517
$$ packed form
14342H137J285j700o428Q810L094L994k444j8942l813R392J3254L856j5670l571
14328g46J2804J2192Q276J1112j0610j5146Q676p09j0190R026m68O491K171k450
14314C0429r499l504O710j2442p885P537P629J3731N494J5555r717j8008r349
14301A6681m716o014j2412K1815J0163K453k2007j605L911q722n460p58l014K939
14287f746J0609J2742l107q837k872j2613J682L361J476J542N031P784J6554k299
14273B4307n707P741J4466p378j6958j441L906J835n408k385M264M460l608Q802
14259B6896K802p443j0988J058J5066K386q575l370l297k593P222N206K514n427
14245B1457j3800l658N209j27J826O462k403o91j1097j5361N34k585j3833R550
$$ plain form
14231 -18517 -9264 2361 5312 10750 14285 10849 1022 398 9344 5256 1263 -672 -1521 -1007 6440
14216 6440 29682 28621 27167 28567 28674 22522 18769 14567 17137 26530 26410 3635 -8180 15104
14202 15104 27602 19223 20646 37113 37475 23032 13063 14485 20356 41490 50898 33837 5775
14189 5775 -3788 2116 14928 10179 4764 10055 16340 18189 17946 14537 15374 8045 11320 23234 10765
14174 10765 4058 -3418 3277 136 6545 11952 31371 45883 40559 30469 18230 12488 13770
14161 13770 13521 5714 11532 25664 38088 31101 33532 34689 45825 49305 37378 19079 16263
14148 16263 4440 7940 12332 16817 21944 24752 20435 13702 5698 6107 16665 19311 13314 17653
14134 17653 13931 516 -6985 3538 13495 22754 16221 22725 38557 38985 40813 41675 41267 31631
$$ packed form
14231a8517R253J1625K951N438L535l436r827o24Q946m088l993j935q49N14P447
14216F440K3242j061j454J400J07o152l753m202K570R393j20k2775j1815K3284
14202A5104J2498q379J423J6467L62j4443r969J422N871K1134R408j7061k8062
14189E775r563N904J2812m749n415N291O285J849k43l409Q37p329L275J1914j2469
14174A0765o707p476O695l141O409N407J9419J4512n324j0090j2239n742J282
14161A3770k49p807N818J4132J2424o987K431J157J1136L480j1927j8299k816
14148A6263j1823L500M392M485N127K808m317o733q004M09J0558K646n997M339
14134A7653l722j3415p501J0523R957R259o533O504J5832M28J828Q62m08r636
$$ plain form
14120 31631 26250 32820 24554 20288 13798 17288 17570 9827 17509 16280 7505 10578 18151 15614 10220
14105 10220 20346 19961 19064 28271 35021 35650 34326 27996 31556 26219 26308 15206 9971 29586 27058
14090 27058 25764 28194 37762 44963 37028 24478 20889 15401 15241 21960 31858 22693 15441 12388
14076 12388 12097 -3009 -7441 -7743 7087 17650 8152 13455 12665 27556 39557 40464 32042 36973
14062 36973 33320 22346 15333 15361 18186 32743 25526 41344 41764 41331 39035 38077 35756 21058 16478
14047 16478 28302 32234 31357 44802 46323 31280 27101 30446 26638 17690 8510 17041 22760 18192
14033 18192 29290 30849 26832 19756 17117 24236 20355 14171 10622 23371 25449 25198 25047 35716
14019 35716 38943 36204 13044 1694 2696 21866 24065 29002 31116 23815 14163 11324 17611 21012
$$ packed form
14120C1631n381O570q266m266o490L490K82p743P682j229q775L073P573k537n394
14105A0220J0126l85q97R207O750O29j324o330L560n337Q9j1102n235J9615k528
14090B7058j294K430R568P201p935j2550l589n488j60O719R898r165p252l053
14076A2388k91j5106m432l02J4830J0563r498N303p90J4891J2001R07q422M931
14062C6973l653j0974p013K8K825J4557p217J5818M20m33k296r58k321j4698m580
14047A6478J1824L932q77J3445J521j5043m179L345l808q948r180Q531N719m568
14033A8192J1098J559m017p076k639P119l881o184l549J2749K078k51j51J0669
14019C5716L227k739k3160j1350J002J9170K199M937K114p301r652k839O287L401
$$ plain form
14005 21012 18679 7959 8210 14993 19136 31330 30812 25928 28150 43122 40758 29818 15682 -3297
13991 -3297 5585 13863 1400 9792 29590 37536 40073 43124 44530 47135 46000 32488 20275 18265
13977 18265 37960 37189 20397 12078 11553 18455 17046 22083 20383 18628 9666 19335 33589 25637
13963 25637 20563 22105 23312 28023 41119 51879 38459 38137 39955 42088 37850 49353 43968 36826
13949 36826 22613 31614 30443 36270 40050 25225 23928 22281 25045 33037 44483 46088 38634 44115
13935 44115 47594 52257 39505 29260 30746 28671 37064 48581 51266 47322 44374 41069 39776 54866
13921 54866 60190 64445 74702 70744 57762 33818 29793 36192 35796 48329 57642 46385 42988
13908 42988 46535 45709 42026 33801 36781 47005 49346 45625 34695 26748 24660 27055 22917 33201
$$ packed form
14005B1012k333j0720K51O783M143J2194n18m884K222J4972k364j0940j4136j8979
13991c297Q882Q278j2463Q392J9798P946K537L051J406K605j135j3512j2213k010
13977A8265J9695p71j6792q319n25O902j409N037j700j755q962R669J4254p952
13963B5637n074J542J207M711J3096J0760j3420l22J818K133m238J1503n385p142
13949C6826j4213R001j171N827L780j4825j297j647K764P992J1446J605p454N481
13935D4115L479M663j2752j0245J486k075Q393J1517K685l944k948l305j293J5090
13921E4866N324M255J0257l958j2982k3944m025O399l96J2533R313j1257l397
13908D2988L547q26l683q225K980J0224K341l721j0930p947k088K395m138J0284
$$ plain form
13894 33201 35821 32727 20869 16979 15578 25095 31617 35942 43756 33899 36284 44569 43598 34731
13880 34731 36399 38654 48167 59811 50967 46961 46976 49283 50416 48587 30845 35184 52311 52857
13866 52857 46919 54381 51452 43375 57133 83809 99282 109291 136473 144217 136833 143235 143069
13853 143069 133736 121065 122520 123379 114105 96916 78754 71442 67585 75475 75794 68504 74558 60868
13839 60868 35971 29710 34091 38658 37865 40608 45308 43750 39480 30096 37231 50586 61218 54501
13825 54501 54847 60387 57855 49252 38542 46195 47871 36194 36832 37551 36224 25156 28899 38825
13811 38825 49335 46851 48850 56781 63999 67295 66949 49640 41768 55025 51324 35172 27546 35910
13797 35910 32376 40356 32383 29745 39913 30623 32268 43393 46204 48663 59966 57607 51611 52719
$$ packed form
13894C3201K620l094j1858l890j401R517O522M325P814r857K385Q285r71q867
13880C4731J668K255R513J1644q844m006J5K307J133j829j7742M339J7127N46
13866E2857n938P462k929q077J3758K6676J5473J0009K7182P744p384O402j66
13853A43069r333j2671J455Q59r274j7189j8162p312l857P890L19p290O054j3690
13839F0868k4897o261M381M567p93K743M700j558m270r384P135J3355J0632o717
13825E4501L46N540k532q603j0710P653J676j1677O38P19j327j1068L743R926
13811C8825J0510k484J999P931P218L296l46j7309p872J3257l701j6152p626Q364
13797C5910l534P980p973k638J0168r290J645J1125K811K459J1303k359n996J108
$$ plain form
13783 52719 43052 31960 33925 36156 37056 41301 41280 40507 37487 43840 52188 55679 61484 67008 60219
13768 60219 60544 58665 46672 51017 50945 42711 36623 25637 26907 35989 42660 44884 48819 56548 58229
13753 58229 52377 59919 70631 69847 62000 54979 42048 48588 52398 47450 54773 52299 43479 42280
13739 42280 59360 54659 37372 32656 39007 52381 62055 56477 43106 46626 51972 55315 59120
13726 59120 69340 70595 76218 62997 52135 47088 43525 34942 31584 35034 21878 20744 37548
13713 37548 42571 47970 47491 47442 34963 29805 39636 32294 30979 22094 32823 48825 65395 56135
13699 56135 52107 57829 53771 54507 54851 58992 62864 75841 74898 82885 83780 82977 79953 72705 62880
13684 62880 64588 58663 46317 43366 36439 26624 22615 31711 53426 66122 64867 60478 70648
$$ packed form
13783E2719r667j1092J965K231R00M245k1p73l020O353Q348L491N805N524o789
13768F0219L25j879j1993M345p2q234o088j0986J270R082O671K224L935P729J681
13753E8229n852P542J0712p84p847p021j2931O540L810m948P323k474q820j199
13739D2280J7080m701j7287m716O351J3374R674n578j3371L520N346L343L805
13726E9120J0220J255N623j3221j0862n047l563q583l358L450j3156j134J6804
13713C7548N023N399m79m9j2479n158R831p342j315q885J0729J6002J6570r260
13699E6135m028N722m058P36L44M141L872J2977r43P987Q95q03l024p248r825
13684F2880J708n925j2346k951o927r815m009R096K1715J2696j255m389J0170
$$ plain form
13671 70648 83346 79283 70388 66024 67041 64785 55014 63901 68315 64227 77909 73619 68606 70556
13657 70556 67853 66397 67872 69358 70126 78986 87746 81595 65696 64382 73797 73708 55220 58727 68387
13642 68387 74327 73303 65706 64567 71124 76412 78622 77474 81120 83073 77862 75611 70088 73562
13628 73562 71093 80659 86311 83951 76174 70194 65747 81672 94818 92002 89422 75442 86248
13615 86248 89404 92802 92385 89262 79681 81961 90764 93073 83679 65146 51218 63471 83958 86691
13601 86691 81384 82338 81661 84799 94141 86613 81312 84672 96960 93872 81726 92981 96764 101492
13587 101492 115015 108921 104226 102177 110979 114050 121366 117797 117688 125905 153563 167647 176717 213110
13573 213110 241034 266971 288721 294733 297723 285470 273583 255202 241586 222927 207474 184228
$$ packed form
13671G0648J2698m063q895m364J017k256r771Q887M414m088J3682m290n013J950
13657G0556k703j456J475J486P68Q860Q760o151j5899j314R415q9j8488L507R660
13642F8387N940j024p597j139O557N288K210j148L646J953n211k251n523L474
13628G3562k469R566N652k360p777n980m447J5925J3146k816k580j3980J0806
13615H6248L156L398m17l123r581K280Q803K309r394j8533j3928J2253K0487K733
13601H6691n307R54o77L138R342p528n301L360J2288l088j2146J1255L783M728
13587A01492J3523o094m695k049Q802L071P316l569j09Q217K7658J4084R070L6393
13573B13110K7924K5937K1750O012K990j2253j1887j8381j3616j8659j5453k3246
$$ plain form
13561 184228 171425 180326 181229 186356 187683 176631 168466 168299 160059 149004 132928 138273 140887 149399
13547 149399 157849 156624 172122 189919 200193 209060 235957 262088 290197 323865 385418 453289
13535 453289 496411 515520 534275 519495 477943 432729 366319 304487 269558 239281 220809
13524 220809 220124 220630 216757 205214 187155 177547 170535 175191 170580 154453 159099 162020 155831 145916
13510 145916 140892 156597 159878 157074 165545 171209 177039 191877 193880 225179 264019 283371 288168
13497 288168 290418 289388 272645 255410 232480 199940 177951 167644 162437 172006 166929 145526
13485 145526 141754 139379 131840 121341 112642 118795 113581 100015 94626 93983 112233 111898 96783 95127
13471 95127 104193 96566 91468 88216 85543 90872 95351 86815 77911 77794 91184 98480 84635 81077
$$ packed form
13561A84228j2803Q901R03N127J327j1052q165j67q240j1055j6076N345K614Q512
13547A49399Q450j225J5498J7797J0274Q867K6897K6131K8109L3668O1553O7871
13535D53289M3122J9109J8755j4780m1552m5214o6410o1832l4929l0277j8472
13524B20809o85N06l873j1543j8059r608p012M656m611j6127M646K921o189r915
13510A45916n024J5705L281k804Q471N664N830J4838K003L1299L8840J9352M797
13497B88168K250j030j6743j7235k2930l2540k1989j0307n207R569n077k1403
13485A45526l772k375p539j0499q699O153n214j3566n389o43J8250l35j5115j656
13471I5127R066p627n098l252k673N329M479q536q904j17J3390P296j3845l558
$$ plain form
13457 81077 89440 82618 83725 88676 85600 87475 79910 78370 76634 70349 83107 85889 83305 76627
13443 76627 84924 84819 88289 87511 94115 98542 108708 105514 111034 120001 127407 144276 154991 149302
13429 149302 136024 131634 134266 139642 146802 143513 127050 115634 111751 116434 123434 125272 131086
13416 131086 133183 126278 118279 113927 121982 123956 131561 120879 109400 103549 100346 98567 101805 109046
13402 109046 110525 96593 102549 115120 126867 147601 155672 152175 167845 177935 175146 160250
13390 160250 142705 127021 127550 134723 135414 146742 159730 164143 148897 150873 168100 173206 156864
13377 156864 155427 160456 157021 156113 155754 155891 156193 148012 140055 130214 131688 136264 139936 142903 143934
13362 143934 139905 140221 143747 158136 165501 170621 177179 169898 159504 151719 152145 145347 138777 150045
$$ packed form
13457H1077Q363o822J107M951l076J875p565j540j736o285J2758K782k584o678
13443G6627Q297j05L470p78O604M427J0166l194N520Q967P406J6869J0715n689
13429A49302j3278m390K632N376P160l289j6463j1416l883M683P000J838N814
13416A31086K097o905p999m352Q055J974P605j0682j1479n851l203j779L238P241
13402A09046J479j3932N956J2571J1747K0734Q071l497J5670J0090k789j4896
13390A60250j7545j5684N29P173O91J1328J2988M413j5246J976J7227N106j6342
13377A56864j437N029l435r08l59J37L02q181p957r841J474M576L672K967J031
13362A43934m029L16L526J4389P365N120O558p281j0394p785M26o798o570J1268
$$ plain form
13348 150045 163397 167466 174582 167371 175684 188263 202899 208605 216015 225154 232941 218797 208138
13335 208138 193209 187965 196102 205528 200170 197531 197413 195962 189256 187769 179134 172125 174981 169821
13321 169821 162036 168377 157281 148061 166412 187321 185298 186636 194900 190417 184014 191704 188278
13308 188278 189002 198072 198230 201655 210416 209674 216827 217935 218215 205433 204393 211810 206854 203944 201181
13293 201181 198986 204712 195738 182568 179191 187891 188944 176140 170193 177273 189295 202731 197076
13280 197076 200468 210186 210780 213473 223938 227399 225090 228368 219343 210502 210198 198160 189445 183513
13266 183513 181326 180287 184804 192656 203319 217049 211415 212398 206851 198192 210595 223553 230520
13253 230520 231333 233123 237044 246113 261596 274706 279305 284159 280499 265235 252363 246050 236539
$$ packed form
13348A50045J3352M069P116p211Q313J2579J4636N706P410R139P787j4144j0659
13335B08138j4929n244Q137R426n358k639j18j451o706j487q635p009K856n160
13321A69821p785O341j1096r220J8351K0909k023J338Q264m483o403P690l426
13308A88278P24R070J58L425Q761p42P153J108K80j2782j040P417m956k910k763
13293B01181k195N726q974j3170l377Q700J053j2804n947P080J2022J3436n655
13280A97076L392R718N94K693J0465L461k309L278r025q841l04j2038q715n932
13266A83513k187j039M517P852J0663J3730n634R83n547q659J2403J2958O967
13253B30520Q13J790L921R069J5483J3110M599M854l660j5264j2872o313r511
$$ plain form
13240 236539 240027 243511 263367 284371 291946 285132 272247 261512 269774 272368 270690 274295 282014
13227 282014 292147 291446 283080 280703 285867 302994 315443 325586 346814 353247 347712 351711 360812
13214 360812 373049 387731 406018 418190 416387 408808 392825 370708 348040 341803 351003 344971
13202 344971 353909 370182 362927 357451 361589 369756 375538 389132 382725 394673 417317 426543 439876
13189 439876 451181 470165 474539 483053 487867 503932 504551 504827 513006 526532 536227 556079 580248
13176 580248 593873 610130 612290 619443 618600 615568 617422 629534 636988 656416 675296 689418 703647
13163 703647 704334 717194 735739 763272 790649 815768 852147 897086 921719 958464 1003965 1045089
13151 1045089 1104231 1154542 1218899 1288570 1356321 1439874 1539096 1636164 1729391 1836663 1975873
$$ packed form
13240B36539L488L484J9856K1004P575o814j2885j0735Q262K594j678L605P719
13227B82014J0133p01q366k377N164J7127J2449J0143K1228O433n535L999R101
13214C60812J2237J4682J8287J2172j803p579j5983k2117k2668o237R200o032
13202C44971Q938J6273p255n476M138Q167N782J3594o407J1948K2644R226J3333
13189D39876J1305J8984M374Q514M814J6065O19K76Q179J3526R695J9852K4169
13176E80248J3625J6257K160P153q43l032J854J2112P454J9428J8880J4122J4229
13163G03647O87J2860J8545K7533K7377K5119L6379M4939K4633L6745M5501M1124
13151A045089N9142N0311O4357O9671O7751Q3553R9222R7068R3227J07272J39210
$$ plain form
13140 1975873 2141727 2336786 2568998 2849097 3188038 3614992 4159500 4845063 5703411
13131 5703411 6801529 8190577 9999749 12359289 15476740 19635889 25009205 31358752
13123 31358752 37691993 42456524 44547479 43833012 40618523 35569038 29874764 24731715
13115 24731715 20770260 17954325 16014735 14632240 13551555 12622130 11795693 11078638
13107 11078638 10457008 9906228 9426584 9039959 8759668 8574605 8553090 8754386 9176479
13098 9176479 9840988 10793305 12107552 13883179 16218002 19304803 23383793 28863601
13090 28863601 36251215 46118846 58569710 72359433 84459166 91681654 92657729 87726031
13082 87726031 77995452 65528193 53135816 42972805 35650082 30674863 27245071 24648914
$$ packed form
13140A975873J65854J95059K32212K80099L38941M26954N44508O85563Q58348
13131E703411J098118J389048J809172K359540L117451M159149N373316O349547
13123C1358752O333241M764531K090955p14467l214489n049485n694274n143049
13115B4731715l961455k815935j939590j382495j080685r29425q26437p17055
13107A1078638o21630n50780m79644l86625k80291j85063k1515K01296M22093
13098I176479O64509R52317J314247J775627K334823L086801M078990N479808
13090B8863601P387614R867631J2450864J3789723J2099733P222488R76075m931698
13082H7726031r730579j2467259j2392377j0163011p322723m975219l429792k596157
$$ plain form
13074 24648914 22369353 20216574 18181799 16318886 14677140 13302712 12171318 11264034
13066 11264034 10552749 10060525 9737365 9522145 9427213 9483776 9708075 10157806 10916367 12066229
13056 12066229 13710194 16010029 19173045 23453114 29012335 35530662 41872969 46400087
13048 46400087 47997925 46565181 42518532 36632531 30195450 24492679 20136532 17041137
13040 17041137 14871267 13251829 11910061 10664557 9493453 8394506 7388280 6496400
13032 6496400 5718838 5051732 4465053 3970882 3543143 3160438 2829087 2547773 2291795
13023 2291795 2072752 1886379 1718740 1560340 1416021 1281665 1170252 1072694 984279 914769
13013 914769 849732 799079 753172 707691 668901 637161 603119 572201 544743 527629 506469
$$ packed form
13074B4648914k279561k152779k034775j862913j641746j374428j131394r07284
13066A1264034p11285m92224l23160k15220r4932N6563K24299M49731P58561J149862
13056A2066229J643965K299835L163016M280069N559221O518327O342307M527118
13048D6400087J597838j432744m046649n886001o437081n702771m356147l095395
13040A7041137k169870j619438j341768j245504j171104j098947j006226q91880
13032F496400p77562o67106n86679m94171m27739l82705l31351k81314k55978
13023B291795k19043j86373j67639j58400j44319j34356j11413r7558q8415o9510
13013I14769o5037n0653m5907m5481l8790l1740l4042l0918k7458j7114k1160
$$ plain form
13002 506469 490656 480587 475257 450717 429215 415931 389153 380593 375305 366306 350840 337670
12990 337670 345849 357307 380985 413560 437725 468805 491559 539899 592107 637992 669985 687921
12978 687921 684905 670176 634127 595723 546651 500875 470142 446018 438705 449082 453809 455734
12966 455734 461309 468454 490602 511047 516758 514397 507463 504802 506818 520707 538500 551542 564403
12953 564403 588590 611546 621385 622446 629723 641640 648646 635527 617144 593479 576144 580908
12941 580908 574977 567629 538282 513335 491507 459474 439031 429263 400564 387610 399553 411027
12929 411027 402576 385152 396751 427007 453247 490649 521023 540011 561234 579472 578992 568024
12917 568024 545541 510038 454095 386117 335049 314288 297923 279947 268898 251185 229251
$$ packed form
13002E06469j5813j0069n330k4540k1502j3284k6778q560n288q999j5466j3170
12990C37670Q179J1458K3678L2575K4165L1080K2754M8340N2208M5885L1993J7936
12978F87921l016j4729l6049l8404m9072m5776l0733k4124p313J0377M727J925
12966D55734N575P145K2148K0445N711k361o934k661K016J3889J7793J3042J2861
12953E64403K4187K2956R839J061P277J1917P006j3119j8383k3665j7335M764
12941E80908n931p348k9347k4947k1828l2033k0443r768k8699j2954J1943J1474
12929D11027q451j7424J1599L0256K6240L7402L0374J8988K1223J8238m80j0968
12917E68024k2483l5503n5943o7978n1068k0761j6365j7976j1049j7713k1934
$$ plain form
12906 229251 218400 210570 198161 178272 171965 172792 172485 143185 131376 129879 131000 137723 142812
12893 142812 161927 153719 146385 142046 143816 139964 149424 147439 146521 141391 133950 124893 125963 129257
12879 129257 138558 126845 125952 137326 156635 154432 149220 155906 146568 150014 149181 145231 138206 132597
12865 132597 135795 126867 125609 140918 153355 143980 127545 123113 140754 132819 121233 125358 135468
12852 135468 137445 136669 143677 161554 172032 174930 179438 203104 231192 255158 271463 285628 327018
12839 327018 363308 400812 460723 525700 596945 678325 762132 822949 860889 887073 893037 870879
12827 870879 826558 765298 697083 618025 538898 469379 433612 404762 377320 357151 348576 354393
12815 354393 330729 298016 295540 306073 301515 281299 266307 263643 264348 269374 261554 259506 271394
$$ packed form
12906B29251j0851p830j2409j9889o307Q27l07k9300j1809j497J121O723N089
12893A42812J9115q208p334m339J770l852R460j985r18n130p441r057J070L294
12879A29257R301j1713q93J1374J9309k203n212O686r338L446q33l950p025n609
12865A32597L198q928j258J5309J2437r375j6435m432J7641p935j1586M125J0110
12852A35468J977p76P008J7877J0478K898M508K3666K8088K3966J6305J4165M1390
12839C27018L6290L7504N9911O4977P1245Q1380Q3807O0817L7940K6184N964k2158
12827H70879m4321o1260o8215p9058p9127o9519l5767k8850k7442k0169q575N817
12815C54393k3664l2713k476J0533m558k0216j4992k664P05N026p820k048J1888
$$ plain form
12802 271394 277980 274684 266048 246384 233205 220745 220506 233053 231858 222040 208331 200709 210852
12789 210852 223361 232642 238388 246164 252373 261877 271115 271597 270403 260133 247777 246187 229078
12776 229078 217873 218154 224763 225461 236459 252381 248360 268589 276999 281948 288853 279687 272360 277754
12762 277754 298362 311858 309105 298190 313145 323228 324217 325150 336681 337656 349792 358453 351384
12749 351384 339419 335787 339794 335653 314694 300834 274151 253516 249501 251378 267477 284246
12737 284246 298213 304951 306786 308889 307091 311969 305141 309972 315746 329843 347187 346920 360403
12724 360403 384744 425918 450479 454423 451437 445612 448882 437568 429005 426269 426547 423196 393943
12711 393943 381109 376743 376848 379418 374350 365633 364015 356099 358676 362345 365637 364721 366881 378322
$$ packed form
12802B71394O586l296q636j9664j3179j2460k39J2547j195r818j3709p622J0143
12789B10852J2509R281N746P776O209R504R238M82j194j0270j2356j590j7109
12776B29078j1205K81O609O98J0998J5922m021K0229Q410M949O905r166p327N394
12762B77754K0608J3496k753j0915J4955J0083R89R33J1531R75J2136Q661p069
12749C51384j1965l632M007m141k0959j3860k6683k0635m015J877J6099J6769
12737B84246J3967O738J835K103j798M878o828M831N774J4097J7344k67J3483
12724C60403K4341M1174K4561L944k986n825L270j1314q563k736K78l351k9253
12711C93943j2834m366J05K570n068q717j618p916K577L669L292r16K160J1441
$$ plain form
12697 378322 389258 385526 379992 374027 397652 400059 394350 388416 392428 411778 420524 402679 383520
12684 383520 388308 393503 406954 418666 424259 425767 423856 436841 452646 466685 481511 500805
12672 500805 510332 537896 570002 592413 626144 683699 734223 755342 777912 803519 805264 792537
12660 792537 773570 747698 731676 731612 710325 680911 666819 656681 659130 666762 664684 664061 671398
12647 671398 690225 703880 711928 717073 726152 724632 731389 744540 756693 769818 796688 832169
12635 832169 867857 896621 923209 979475 1041625 1099700 1153692 1201625 1208405 1197119 1161948 1102090
12623 1102090 1063724 1030405 996819 967247 950048 929538 910583 901932 883441 868351 873911 883986
12611 883986 886634 895009 903491 905828 914710 914419 934247 959768 991184 1014767 1045831 1067914 1091781
$$ packed form
12697C78322J0936l732n534n965K3625K407n709n934M012J9350Q746j7845j9159
12684C83520M788N195J3451J1712N593J508j911J2985J5805J4039J4826J9294
12672E00805R527K7564L2106K2411L3731N7555N0524K1119K2570K5607J745j2727
12660G92537j8967k5872j6022o4k1287k9414j4092j0138K449P632k078o23P337
12647F71398J8827J3655Q048N145R079j520O757J3151J2153J3125K6870L5481
12635H32169L5688K8764K6588N6266O2150N8075N3992M7933O780j1286l5171n9858
12623A102090l8366l3319l3586k9572j7199k0510j8955q651j8491j5090N560J0075
12611H83986K648Q375Q482K337Q882k91J9828K5521L1416K3583L1064K2083K3867
$$ plain form
12598 1091781 1118643 1166235 1193425 1216792 1251714 1265642 1274301 1276201 1277214 1276960 1275206 1280146 1282929
12585 1282929 1274918 1268388 1267083 1274689 1283135 1310546 1348349 1379894 1392784 1417748 1455102 1493618
12573 1493618 1534491 1580661 1635894 1689926 1744141 1804928 1854042 1918380 1992263 2075786 2153054
12562 2153054 2242975 2339744 2434421 2549823 2666979 2797915 2959680 3147691 3375032 3626424
12552 3626424 3917683 4243349 4621153 5049626 5540752 6111322 6776322 7555392 8479386
12543 8479386 9609603 11023974 12810548 15051487 17905935 21600849 26380501 32516368
12535 32516368 40270199 49728647 60440067 71062242 79488351 84081519 84363013 80624002
12527 80624002 73722238 65284334 57103145 50360698 45439264 42208642 40363381 39527253
$$ packed form
12598A091781K6862M7592K7190K3367L4922J3928Q659J900J013k54j754M940K783
12585A282929q011o530j305P606Q446K7411L7803L1545J2890K4964L7354L8516
12573A493618M0873M6170N5233N4032N4215O0787M9114O4338P3883Q3523P7268
12562B153054Q9921R6769R4677J15402J17156J30936J61765J88011K27341K51392
12552C626424K91259L25666L77804M28473M91126N70570O65000P79070R23994
12543H479386J130217J414371J786574K240939K854448L694914M779652O135867
12535C2516368P753831R458448J0711420J0622175Q426109M593168K81494l739011
12527H0624002o901764q437904q181189o742447m921434l230622j845261q36128
$$ plain form
12519 39527253 39434266 39983876 41158955 42939118 45266952 48057744 51223619 54626629
12511 54626629 58190872 61874937 65672888 69571430 73605846 77736590 81865780 85810078
12503 85810078 89294451 92025791 93766157 94365632 93800883 92195359 89779218 86823603
12495 86823603 83608397 80320073 77060850 73878954 70722584 67512564 64202031 60765710
12487 60765710 57253157 53763429 50422295 47404510 44871232 42967019 41821473 41567783
12479 41567783 42352726 44384273 47893186 53057778 59995563 68449519 77540881 85681885
12471 85681885 90920622 91934981 88597258 81592834 72092596 61742878 52158807 44231146
12463 44231146 38054653 33328122 29645800 26621218 24003988 21645028 19528461 17618461
$$ packed form
12519C9527253r2987N49610J175079J780163K327834K790792L165875L403010
12511E4626629L564243L684065L797951L898542M034416M130744M129190L944298
12503H5810078L484373K731340J740366N99475n64749j605524k416141k955615
12495H6823603l215206l288324l259223l181896l156370l210020l310533l436321
12487F0765710l512553l489728l341134l017785k533278j904213j145546k53690
12479D1567783P84943K031547L508913N164592O937785Q453956R091362Q141004
12471H5681885N238737J014359l337723p004424r500238j0349718r584071p927661
12463D4231146o176493m726531l682322l024582k617230k358960k116567j910000
$$ plain form
12455 17618461 15885721 14353674 13007202 11815153 10759420 9839598 9041610 8353537
12447 8353537 7778459 7278192 6867227 6543071 6270245 6045931 5878392 5790210 5761114 5810615
12437 5810615 5942756 6159804 6461071 6830650 7282049 7812728 8414777 9137065 9983724
12428 9983724 10951643 12092247 13425422 14998794 16897937 19299554 22431295 26624960
12420 26624960 32357040 40179853 50555728 63571296 78821919 95489518 112400117
12413 112400117 127901535 140103648 147466680 149266945 145488266 136683092 123982024
12406 123982024 109069870 93720295 79351946 66841629 56592486 48603069 42534235
12399 42534235 37840304 34003049 30660019 27594630 24731612 22036210 19522869 17225286
$$ packed form
12455A7618461j732740j532047j346472j192049j055733r19822p97988o88073
12447H353537n75078n00267m10965l24156k72826k24314j67539q8182k9096M9501
12437E810615J32141K17048L01267L69579M51399N30679O02049P22288Q46659
12428I983724R67919J140604J333175J573372J899143K401617L131741M193665
12420B6624960N732080P822813J0375875J3015568J5250623J6667599J6910599
12413A12400117J5501418J2202113P363032J800265l778679q805174j2701068
12406A23982024j4912154j5349575j4368349j2510317j0249143p989417o068834
12399D2534235m693931l837255l343030l065389k863018k695402k513341k297583
$$ plain form
12391 17225286 15159516 13339902 11768855 10399022 9205934 8186641 7297048 6524710
12383 6524710 5837036 5230752 4703735 4220771 3792443 3420330 3085402 2810128 2557062
12374 2557062 2332796 2143060 1977490 1849394 1739814 1631380 1538175 1455169 1393334 1341087
12364 1341087 1292726 1243214 1198231 1165709 1133727 1110123 1094249 1078679 1036721 1008796 970627
12353 970627 932454 903977 877057 856383 838618 798819 763865 739278 695824 648219 621070
12342 621070 600943 575845 556383 521411 493379 466489 457237 440339 419199 396401 373764 346455
12330 346455 319023 292906 280882 286825 294666 279656 259114 248930 226805 210288 189141 174694
12318 174694 153363 136816 126734 121939 131454 137834 138491 132178 116287 96641 97026 105035 121158
$$ packed form
12391A7225286k065770j819614j571047j369833j193088j019293q89593p72338
12383F524710o87674o06284n27017m82964m28328l72113l34928k75274k53066
12374B557062k24266j89736j65570j28096j09580j08434r3205q3006o1835n2247
12364A341087m8361m9512m4983l2522l1982k3604j5874j5570m1958k7925l8169
12353I70627l8173k8477k6920k0674j7765l9799l4954k4587m3454m7605k7149
12342F21070k0127k5098j9462l4972k8032k6890r252j6898k1140k2798k2637k7309
12330C46455k7432k6117j2024N943P841j5010k0542j0184k2125j6517k1147j4447
12318A74694k1331j6547j0082m795R515O380O57o313j5891j9646L85Q009J6123
$$ plain form
12305 121158 129778 141035 147100 147160 143302 137756 139156 137103 133037 134600 148322 149998 149418 148478 144115
12290 144115 145013 137394 132510 118232 112867 101014 77561 67812 64323 50196 49422 36237 35311 44491
12276 44491 54186 73038 88589 81258 70926 59154 53135 49269 56895 56939 60205 47970 53255 52808
12262 52808 39275 31132 34566 38667 41256 34498 20619 30581 32647 35820 25577 7032 10522
12249 10522 10773 11471 6116 -10174 -6753 -11369 -16899 -16301 -25826 -44839 -59668 -51282 -40311 -31371
12235 -31371 -23450 -21918 -24400 -31086 -29479 -30892 -34608 -45466 -56596 -57587 -60969 -63417 -71384 -86012
12221 -86012 -96593 -88883 -84316 -71383 -56927 -55064 -50689 -39310 -37928 -44759 -52208 -50256 -52457
12208 -52457 -64259 -62132 -46440 -36653 -36682 -19395 -22031 -47592 -69789 -70699 -61378 -67277 -68765 -78038
$$ packed form
12305A21158Q620J1257O065O0l858n546J400k053m066J563J3722J676n80r40m363
12290A44115Q98p619m884j4278n365j1853k3453r749l489j4127p74j3185r26R180
12276D4491R695J8852J5551p331j0332j1772o019l866P626M4L266j2235N285m47
12262E2808j3533q143L434M101K589o758j3879R962K066L173j0243j8545L490
12249A0522K51O98n355j6290L421m616n530N98r525j9013j4829Q386J0971Q940
12235c1371P921J532k482o686J607j413l716j0858j1130r91l382k448p967j4628
12221h6012j0581P710M567J2933J4456J863M375J1379J382o831p449J952k201
12208e2457j1802K127J5692R787k9J7287k636k5561k2197r10R321n899j488r273
$$ plain form
12194 -78038 -77702 -72584 -61273 -58642 -57031 -50115 -50022 -45111 -36491 -31318 -30228 -27056 -24662 -20571 -20526
12179 -20526 -12932 -8576 -4626 91 -3776 -8470 -24662 -31172 -33006 -31851 -37989 -49917 -47937 -46792
12165 -46792 -51682 -57588 -49584 -44298 -54932 -59911 -56270 -55466 -58135 -49797 -25417 -9046 -13860 -11303
12151 -11303 4282 5512 10582 16798 19655 14232 12756 11790 9726 719 -3231 627 11917 17591
12137 17591 27090 18036 22844 22786 -4648 -30701 -28109 -32184 -51695 -43679 -24665 -17739 -19743 -23082
12123 -23082 2138 22816 7668 -10977 -6080 -15245 -11290 -9021 6426 19896 11897 2811 -5822
12110 -5822 -3762 -11458 -10041 13266 16507 16483 31826 58267 70955 62867 60726 68544 76001 89877
12096 89877 120142 144419 152948 176398 198107 200173 202509 205910 190685 174351 168348 161597 177504
$$ packed form
12194g8038L36N118J1311K631J611O916R3M911Q620N173J090L172K394M091M5
12179b0526P594M356L950M717l867m694j6192o510j834J155o138j1928J980J145
12165d6792m890n906Q004N286j0634m979L641Q04k669Q338K4380J6371m814K557
12151a1303J5585J230N070O216K857n423j476r66k064r007l950L858J1290N674
12137A7591R499r054M808n8k7434k6053K592m075j9511Q016J9014O926k004l339
12123b3082K5220K0678j5148j8645M897r165L955K269J5447J3470p999r086q633
12110e822K060p696J417K3307L241k4J5343K6441J2688q088k141P818P457J3876
12096H9877L0265K4277Q529K3450K1709K066K336L401j5225j6334o003o751J5907
$$ plain form
12083 177504 186490 205949 239563 275553 290987 318371 354114 388730 430723 451106 431009 395551
12071 395551 349197 309536 280926 254408 215959 196694 188767 203142 213223 223229 229493 232890
12059 232890 252286 264985 293795 313456 327558 364310 393996 410082 421717 423642 442146 474922
12047 474922 499125 526106 545503 552533 549306 551741 555356 559105 560947 554611 548259 543067 566515
12034 566515 582187 617715 647448 672486 713025 775927 841797 899937 955227 1003346 1036341
12023 1036341 1049724 1052294 1032119 1010055 977544 950557 919029 890856 864955 815292 757129
12012 757129 696092 624043 549203 483607 425253 365526 336153 298473 263787 263033 257593 236154
12000 236154 223173 213900 212035 227839 247499 274094 294171 320704 368827 424724 499971 573203
$$ packed form
12083A77504Q986J9459L3614L5990J5434K7384L5743L4616M1993K0383k0097l5458
12071C95551m6354l9661k8610k6518l8449j9265p927J4375J0081J0006O264L397
12059B32890J9396J2699K8810J9661J4102L6752K9686J6086J1635J925J8504L2776
12047D74922K4203K6981J9397P030l227K435L615L749J842o336o352n192K3448
12034E66515J5672L5528K9733K5038M0539O2902O5870N8140N5290M8119L2995
12023A036341J3383K570k0175k2064l2511k6987l1528k8173k5901m9663n8163
12012G57129o1037p2049p4840o5596n8354n9727k9373l7680l4686p54n440k1439
12000B36154j2981r273j865J5804J9660K6595K0077K6533M8123N5897P5247P3232
$$ plain form
11988 573203 641600 702099 756625 778064 750609 720044 675197 627129 567714 492966 422167
11977 422167 368536 313236 274215 252733 222056 190243 170580 153644 146430 134518 110080 103666
11965 103666 116156 115957 95093 83625 93745 99589 75776 55930 40424 33127 33329 29017 31018
11952 31018 32018 28242 23679 19799 29081 36389 40057 41180 52431 54605 37394 21333 21780 26159
11938 26159 18053 25091 30380 32913 27434 29725 49209 60054 63863 64648 67519 60456 49510 60801
11924 60801 76373 76436 52852 51931 65037 63371 57712 54778 68328 86508 108464 114951 117710 129618
11910 129618 156410 184143 218247 248689 274729 288815 330623 368239 408360 474022 544435
11899 544435 616400 723081 872031 1059990 1314550 1644180 2028097 2454117 2876468 3251859
$$ packed form
11988E73203O8397O0499N4526K1439k7455l0565m4847m8068n9415p4748p0799
11977D22167n3631n5300l9021k1482l0677l1813j9663j6936p214j1912k4438o414
11965A03666J2490j99k0864j1468J0120N844k3813j9846j5506p297K02m312K001
11952C1018J000l776m563l880R282P308L668J123J1251K174j7211j6061M47M379
11938B6159q106P038N289K533n479K291J9484J0845L809P85K871p063j0946J1291
11924F0801J5572O3k3584r21J3106j666n659k934J3550J8180K1956O487K759J1908
11910A29618K6792K7733L4104L0442K6040J4086M1808L7616M0121O5662P0413
11899E44435P1965J06681J48950J87959K54560L29630L83917M26020M22351L75391
$$ plain form
11889 3251859 3550617 3737635 3778923 3708409 3533002 3254217 2899409 2512664 2149805 1841341
11879 1841341 1565596 1346547 1176960 1036911 940617 851693 768652 686673 605286 553548
11869 553548 487784 421657 375313 350076 318242 277074 241393 215852 207721 195048 163758 136280
11857 136280 112012 105750 102456 98460 92777 79334 59829 60430 56291 54841 57303 57316 38890 36037
11843 36037 39492 29286 18657 32699 32248 20387 11248 12239 3338 -5132 2180 11296 12002 21170
11829 21170 19807 16329 4475 2550 9434 18000 27758 31576 23520 16058 25548 31062 31005 24239 23493
11814 23493 29626 25755 16544 16958 14804 17344 11696 16799 24950 17629 19114 32632 34464 35145 40199
11799 40199 38329 32121 28252 26717 25479 24967 34451 36358 38457 34296 37863 26217 15051 29864
$$ packed form
11889C251859K98758J87018M1288p0514j75407k78785l54808l86745l62859l08464
11879A841341k75745k19049j69587j40049r6294q8924q3041q1979q1387n1738
11869E53548o5764o6127m6344k5237l1834m1168l5681k5541q131j2673l1290k7478
11857A36280k4268o262l294l996n683j3443j9505O01m139j450K462J3j8426k853
11843C6037L455j0206j0629J4042m51j1861r139R91q901q470P312R116P06R168
11829B1170j363l478j1854j925O884Q566R758L818q056p462R490N514n7o766p46
11814B3493O133l871r211M14k154K540n648N103Q151p321J485J3518J832O81N054
11799D0199j870o208l869j535j238n12R484J907K099m161L567j1646j1166J4813
$$ plain form
11785 29864 29090 23167 28027 32524 24782 25921 21791 15603 16458 16070 22562 23088 22283 23719 26486 26060
11769 26060 36549 37891 35537 31896 33662 32291 40296 44320 40064 33081 24175 34587 30064 26612
11755 26612 32865 35087 27975 37005 43379 51644 47713 30791 21589 18135 22054 23490 29695 23314
11741 23314 27576 29372 6711 -1866 6987 16054 18896 18039 29658 35648 32321 16401 31352 40720
11727 40720 34622 34018 22511 24699 35628 31413 33241 40707 34437 27272 35802 32635 17889 2459
11713 2459 -10111 2043 -1540 -387 6283 14445 11556 21398 40019 27994 23162 31711 28575 26878
11699 26878 20591 11774 11369 22636 32782 25890 23286 16694 23507 30530 36204 36786 41830 61732
11685 61732 46637 18370 11676 26775 42994 31710 15625 23514 22982 37078 31532 20900 12475
$$ packed form
11785B9864p74n923M860M497p742J139m130o188Q55l88O492N26q05J436K767m26
11769B6060J0489J342k354l641J766j371Q005M024m256o983q906J0412m523l452
11755B6612O253K222p112R030O374Q265l931j6922r202l454L919J436O205o381
11741B3314M262J796k2661q577Q853R067K842q57J1619N990l327j5920J4951R368
11727D0720o098o04j1507K188J0929m215J828P466o270p165Q530l167j4746j5430
11713B459j2570J2154l583J153O670Q162k889R842J8621j2025m832Q549l136j697
11699B6878o287q817m05J1267J0146o892k604o592O813P023N674N82N044J9902
11685F1732j5095k8267o694J5099J6219j1284j6085P889n32J4096n546j0632q425
$$ plain form
11672 12475 9913 11403 14454 22805 26695 38907 29435 36555 51902 51107 43157 29296 32931 31250
11658 31250 27485 25303 23207 25986 16724 -4006 -4040 15735 27803 23205 25588 30621 30462 44861
11644 44861 60452 51187 37735 29086 25896 20896 8491 -2985 9362 14669 26648 35934 31738
11631 31738 19544 25252 29560 40289 38280 26571 14302 15842 21091 23785 25778 32190 30903
11618 30903 32549 37904 33401 34960 40987 37281 41841 39970 37366 33206 32878 30737 43424 48908
11604 48908 53378 51435 47743 44888 32585 25910 25108 26979 24601 20016 27992 30298 26650 26391 29264
11589 29264 24074 24168 38021 56742 57193 62412 54455 44197 48077 52019 48770 41692 49825 34736
11575 34736 33937 47432 66046 73373 58141 49331 56546 67003 56595 55438 56390 56375 65366 50721
$$ packed form
11672A2475k562J490L051Q351L890J2212r472P120J5347p95p950j3861L635j681
11658C1250l765k182k096K779r262k0730l4J9775J2068m598K383N033j59J4399
11644D4861J5591r265j3452q649l190n000j2405j1476J2347N307J1979R286m196
11631C1738j2194N708M308J0729k009j1709j2269J540N249K694J993O412j287
11618C0903J646N355m503J559O027l706M560j871k604m160l28k141J2687N484
11604D8908M470j943l692k855j2303o675q02J871k378m585P976K306l648k59K873
11589B9264n190R4J3853J8721M51N219p957j0258L880L942l249p078Q133j5089
11575C4736p99J3495J8614P327j5232q810P215J0457j0408j157R52j5Q991j4645
$$ plain form
11561 50721 45741 51981 49321 45466 39177 52014 55028 63261 57275 44437 54453 68334 79833
11548 79833 82648 70854 70904 69035 76892 76154 67676 63100 64828 62778 54015 57358 64680 70256 71669
11533 71669 74179 74374 85874 94963 97156 96963 80251 79213 76313 67127 69851 76757 66669 44819
11519 44819 48574 63900 68555 69783 59682 65922 60963 54769 63528 57484 57696 63409 70311 71400
11505 71400 66664 62759 74335 75579 80732 77847 78448 87495 90865 80688 69742 59293 71718
11492 71718 77309 65986 58361 56792 82530 93662 106830 105319 94254 91790 110279 128773 138668
11479 138668 140596 137917 134764 142577 165922 193681 230057 265507 286035 302322 317789 321160
11467 321160 313913 299354 271690 248103 223920 194891 186096 179374 165052 150402 141306 134507
$$ packed form
11561E0721m980O240k660l855o289J2837L014Q233n986j2838J0016J3881J1499
11548G9833K815j1794N0j869P857p38q478m576J728k050q763L343P322N576J413
11533G1669K510J95J1500R089K193j93j6712j038k900r186K724O906j0088k1850
11519D4819L755J5326M655J228j0101O240m959o194Q759o044K12N713O902J089
11505G1400m736l905J1576J244N153k885O01R047L370j0177j0946j0449J2425
11492G1718N591j1323p625j569K5738J1132J3168j511j1065k464J8489J8494R895
11479A38668J928k679l153P813K3345K7759L6376L5450K0528J6287J5467L371
11467C21160p247j4559k7664k3587k4183k9029q795o722j4322j4650r096o799
$$ plain form
11455 134507 129973 129945 133280 120900 135547 144256 131894 116141 107317 112275 135869 160072 175092
11442 175092 165585 167891 193953 219057 251019 293796 364194 440338 500424 534289 543503 525822
11430 525822 467558 402033 352146 289953 253903 240736 223450 207026 201643 191477 172804 172571
11418 172571 167088 148216 138179 120782 121460 137138 140798 147025 143456 141234 145046 139861 134986
11405 134986 128557 139333 159814 186269 212238 236294 272017 310979 339615 340237 325732 299759
11393 299759 267581 236883 190860 170128 161614 155407 156416 163314 160415 156022 137319 139519 143301
11380 143301 144442 135320 103860 79055 90744 97935 78357 87862 95253 93566 98351 113223 119602
11367 119602 118411 111647 122465 142452 149593 140603 140824 143161 150180 146534 135838 129692 130011 119068
$$ packed form
11455A34507m534k8L335j2380J4647Q709j2362j5753q824M958K3594K4203J5020
11442A75092r507K306K6062K5104L1962M2777P0398P6144O0086L3865R214j7681
11430E25822n8264o5525m9887o2193l6050j3167j7286j6424n383j0166j8673k33
11418A72571n483j8872j0037j7397O78J5678L660O227l569k222L812n185m875
11405A34986o429J0776K0481K6455K5969K4056L5723L8962K8636O22j4505k5973
11393B99759l2178l0698m6023k0732q514o207J009O898k899m393j8703K200L782
11380A43301J141r122l1460k4805J1689P191j9578R505P391j687M785J4872O379
11367A19602j191o764J0818J9987P141q990K21K337P019l646j0696o146L19j0943
$$ plain form
11353 119068 117151 115880 120651 119416 116753 120979 130647 134776 136579 130814 117422 105611 106261 113389
11339 113389 106532 99072 83258 86085 91107 97690 106656 114707 124583 135523 137098 146904 162506
11326 162506 176344 187035 195207 195980 186696 167556 164552 169900 175494 168352 157360 168232 188658
11313 188658 188032 183760 173836 181680 175616 167589 172710 190734 194004 183102 174495 182163 170084 169151
11299 169151 168863 162200 147202 157286 169568 169187 167619 174625 177451 189753 188281 190765 180049
11286 180049 173198 158102 148504 150212 168595 177687 188233 185869 187438 189267 197928 196782 201663
11273 201663 210139 213595 227004 224584 227651 234610 232283 230656 232544 217314 200959 188655 181836
11260 181836 173541 171053 168526 166417 184893 202557 197165 187392 181611 180795 186397 183056 188126 187328
$$ packed form
11353A19068j917j271M771j235k663M226R668M129J803n765j3392j1811O50P128
11339A13389o857p460j5814K827N022O583Q966Q051R876J0940J575R806J5602
11326A62506J3838J0691Q172P73r284j9140l004N348N594p142j0992J0872K0426
11313A88658o26m272r924P844o064q027N121J8024L270j0902q607P668j2079r33
11299A69151k88o663j4998J0084J2282l81j568P006K826J2302j472K484j0716
11286A80049o851j5096r598J708J8383R092J0546k364J569J829Q661j146M881
11273B01663Q476L456J3409k420L067O959k327j627J888j5230j6355j2304o819
11260A81836q295k488k527k109J8476J7664n392r773n781q16N602l341N070p98
$$ plain form
11246 187328 203993 212004 221869 220548 216861 217877 223127 227492 228855 223261 223794 228474 233303 226784
11232 226784 217952 225935 228889 235249 228602 227928 231494 242064 232379 238657 244782 229333 232249 246308
11218 246308 242644 216365 207111 229036 230834 219636 231106 232211 228877 234556 236191 237035 232664
11205 232664 222268 224188 225918 229300 233023 246271 245491 244384 238630 240807 238107 241287 238219 248208
11191 248208 262771 277179 289693 294223 303946 321163 338754 364872 384948 415394 429804 441877
11179 441877 452684 440086 419094 412169 380211 357008 360239 381008 399549 394983 401598 414718
11167 414718 406940 400866 397185 398758 386164 380977 393516 399650 389031 392009 403218 409764 405355
11154 405355 415460 433095 448733 450991 458460 466192 477756 495800 529022 571856 606674 628897
$$ packed form
11246A87328J6665Q011R865j321l687J016N250M365J363n594N33M680M829o519
11232B26784q832P983K954O360o647o74L566J0570r685O278O125j5449K916J4059
11218B46308l664k6279r254K1925J798j1198J1470J105l334N679J635Q44m371
11205B32664j0396J920J730L382L723J3248p80j107n754K177k700L180l068R989
11191B48208J4563J4408J2514M530R723J7217J7591K6118K0076L0446J4410J2073
11179D41877J0807j2598k0992o925l1958k3203L231K0769J8541m566O615J3120
11167D14718p778o074l681J573j2594n187J2539O134j0619K978J1209O546m409
11154D05355J0105J7635J5638K258P469P732J1564J8044L3222M2834L4818K2223
$$ plain form
11142 628897 652465 679337 690391 684038 674896 654613 645846 629336 618224 608152 602455 589100
11130 589100 597076 601627 594657 600272 619208 661580 699332 737164 769275 793394 835140 874740
11118 874740 890718 916928 970460 988198 983386 998873 997504 1005958 1006320 999522 986118 978846 975712
11105 975712 979865 978403 982807 997359 1019809 1046079 1089148 1138669 1162503 1196659 1229222 1230512
11093 1230512 1231350 1245056 1277885 1322857 1382180 1430264 1462435 1510217 1559910 1604047 1650353 1700114
11081 1700114 1730910 1769813 1835815 1913617 2009959 2128827 2260315 2405589 2558955 2736069
11071 2736069 2951487 3231071 3549093 3912668 4335218 4822891 5426150 6177821 7130242
11062 7130242 8351925 9930674 12042257 14897534 18743003 23845002 30323810 37625669
$$ packed form
11142F28897K3568K6872J1054o353r142k0283q767j6510j1112j0072n697j3355
11130E89100P976M551o970N615J8936M2372L7752L7832L2111K4119M1746L9600
11118H74740J5978K6210N3532J7738m812J5487j369Q454L62o798j3404p272l134
11105I75712M153j462M404J4552K2450K6270M3069M9521K3834L4156L2563J290
11093A230512Q38J3706L2829M4972N9323M8084L2171M7782M9693M4137M6306M9761
11081A700114L0796L8903O6002P7802R6342J18868J31488J45274J53366J77114
11071B736069K15418K79584L18022L63575M22550M87673O03259P51671R52421
11062G130242J221683J578749K111583K855277L845469N101999O478808P301859
$$ plain form
11054 37625669 44117649 47883606 48359138 45972578 41097919 34699688 28414768 23423376
11046 23423376 19888579 17503810 15918528 14806388 13934002 13169571 12509188 11910989 11347281
11037 11347281 10804974 10342737 9958974 9717984 9670027 9804687 10098392 10577914 11282237
11028 11282237 12241209 13538995 15304579 17703685 21023564 25592991 31943229 40725964
11020 40725964 52454624 66618617 80584615 90375868 93616355 90611079 82262426 69938602
11012 69938602 56613948 45283468 37044066 31461516 27735438 25115548 23035984 21151019
11004 21151019 19353197 17669143 16133289 14754413 13546068 12498235 11639069 10989762
10996 10989762 10510686 10155598 9912504 9808536 9819916 9985013 10382889 11114687 12285228
$$ packed form
11054C7625669O491980L765957M75532k386560m874659o398231o284920m991392
11046B3423376l534797k384769j585282j112140q72386p64431o60383n98199n63708
11037A1347281n42307m62237l83763k40990m7957J34660K93705M79522P04323
11028A1282237R58972J297786J765584K399106L319879M569427O350238Q782735
11020D0725964J1728660J4163993J3965998R791253L240487l005276q348653j2323824
11012F9938602j3324654j1330480q239402n582550l726078k619890k079564j884965
11004B1151019j797822j684054j535854j378876j208345j047833q59166o49307
10996A0989762m79076l55088k43094j03968J1380J65097L97876P31798J170541
$$ plain form
10987 12285228 13990910 16415138 19782309 24328157 30100337 36508687 42011675 44890129
10979 44890129 44714056 41933039 36942954 30680879 24693130 19959037 16605656 14320057
10971 14320057 12721390 11531921 10514507 9541318 8615774 7754292 6951610 6205542 5516050
10962 5516050 4885857 4331000 3853380 3430896 3066684 2774503 2535847 2331278 2141580
10953 2141580 1978116 1825189 1685151 1562673 1451370 1365373 1276316 1199348 1125045 1049089
10943 1049089 982974 929652 876076 839320 812874 786002 752938 722582 714794 711681 697014 687327
10931 687327 688171 681714 664964 649433 635674 616229 585575 566791 563999 563190 556734 557550 557354 548708
10917 548708 541125 534985 536446 532300 505907 491717 482149 491535 505910 521931 522250 518555 506494
$$ packed form
10987A2285228J705682K424228L367171M545848N772180O408350N502988K878454
10979D4890129j76073k781017m990085o262075n987749m734093l353381k285599
10971A4320057j598667j189469j017414r73189r25544q61482q02682p46068o89492
10962E516050o30193n54857m77620m22484l64212k92181k38656k04569j89698
10953B141580j63464j52927j40038j22478j11303q5997q9057p6968p4303p5956
10943A049089o6115n3322n3576l6756k6446k6872l3064l0356p788l113j4667r687
10931F87327Q44o457j6750j5531j3759j9445l0654j8784k792q09o456Q16j96q646
10917E48708p583o140J461m146k6393j4190r568R386J4375J6021L19l695j2061
$$ plain form
10904 506494 493913 487865 478565 481787 493193 503042 508910 515823 522497 534014 539362 532802 524321
10891 524321 511369 497483 476123 460538 470660 468513 464697 468057 488311 495886 501956 504961 523119
10878 523119 546955 568294 606551 651126 720020 807988 922531 1068745 1266176 1543664 1821604
10867 1821604 1995021 2033840 1977012 1814253 1570516 1311167 1109046 978277 898250 835434
10857 835434 803421 769933 725043 694069 664762 644094 625726 599723 584524 565363 551226
10846 551226 548718 523950 521033 523814 519140 514110 503075 504839 514965 515418 504808 494417 494915
10833 494915 507625 537704 550650 569477 570262 583843 598270 597460 600889 621330 631333 638122 652432
10820 652432 668960 684602 707016 722506 742959 761883 787697 822003 844689 845821 831559 823387
$$ packed form
10904E06494j2581o048r300L222J1406R849N868O913O674J1517N348o560q481
10891E24321j2952j3886k1360j5585J0122k147l816L360K0254P575O070L005J8158
10878E23119K3836K1339L8257M4575O8894Q7968J14543J46214J97431K77488K77940
10867A821604J73417L8819n6828j62759k43737k59349k02121j30769q0027o2816
10857H35434l2013l3488m4890l0974k9307k0668j8368k6003j5199j9161j4137
10846E51226k508k4768k917K781m674n030j1035J764J0126M53j0610j0391M98
10833D94915J2710L0079J2946J8827P85J3581J4427q10L429K0441J0003O789J4310
10820F52432J6528J5642K2414J5490K0453J8924K5814L4306K2686J132j4262q172
$$ plain form
10808 823387 824706 826272 835870 846130 833015 818252 817704 805781 793531 803322 836924 867420 894120
10795 894120 908832 932878 955588 978333 986154 965117 936481 920394 904128 883743 890732 909870
10783 909870 923895 931018 939160 953991 965883 992071 1013097 1010224 994677 999330 1032585 1061329
10771 1061329 1079286 1081346 1096577 1118731 1150277 1177877 1206222 1246143 1281450 1334030 1403112
10760 1403112 1454494 1490934 1528037 1553876 1563872 1580067 1602602 1615595 1627734 1659417 1695635
10749 1695635 1726970 1769794 1817694 1865194 1900388 1939348 1995933 2057449 2131721 2194093 2271503
10738 2271503 2350964 2436879 2516227 2591567 2686538 2798115 2912309 3023773 3152849 3296177
10728 3296177 3457426 3638459 3837647 4059687 4292974 4542835 4831681 5147219 5530903
$$ packed form
10808H23387J319J566R598J0260j3115j4763n48j1923j2250R791L3602L0496K6700
10795H94120J4712K4046K2710K2745P821k1037k8636j6087j6266k0385O989J9138
10783I09870J4025P123Q142J4831J1892K6188K1026k873j5547M653L3255K8744
10771A061329J7957K060J5231K2154L1546K7600K8345L9921L5307N2580O9082
10760A403112N1382L6440L7103K5839R996J6195K2535J2993J2139L1683L6218
10749A695635L1335M2824M7900M7500L5194L8960N6585O1516P4272O2372P7410
10738B271503P9461Q5915P9348P5340R4971J11577J14194J11464J29076J43328
10728C296177J61249J81033J99188K22040K33287K49861K88846L15538L83684
$$ plain form
10719 5530903 5971454 6457535 6999214 7617365 8351875 9209406 10203319 11357391 12709994
10710 12709994 14333807 16316136 18715269 21646144 25193704 29467863 34551179 40502185
10702 40502185 47241560 54453650 61498422 67536714 71730356 73599272 73039241 70354019
10694 70354019 66202329 61381482 56669388 52610455 49484904 47350216 46184979 45909282
10686 45909282 46427425 47680300 49538704 51824140 54265768 56581395 58505199 59877917
10678 59877917 60756323 61363786 62059237 63215888 65167948 68046333 71818329 76163845
10670 76163845 80535513 84242002 86657168 87367062 86268710 83632912 80006907 76038387
10662 76038387 72332193 69326697 67182697 65788122 64804511 63833810 62528740 60670290
$$ packed form
10719E530903M40551M86081N41679O18151P34510Q57531R93913J154072J352603
10710A2709994J623813J982329K399133K930875L547560M274159N083316N951006
10702D0502185O739375P212090P044772O038292M193642J868916n60031k685222
10694G0354019m151690m820847m712094m058933l125551k134688j165237k75697
10686D5909282N18143J252875J858404K285436K441628K315627J923804J372718
10678E9877917Q78406O07463O95451J156651J952060K878385L771996M345516
10670G6163845M371668L706489K415166P09894j098352k635798l626005l968520
10662G6038387l706194l005496k144000j394575r83611r70701j305070j858450
$$ plain form
10654 60670290 58227185 55350398 52324281 49478783 47090554 45374329 44468305 44429271
10646 44429271 45281719 47026597 49644426 53018524 56976977 61141494 64961916 67802179
10638 67802179 69044639 68330968 65670925 61404089 56090330 50360966 44787708 39724840
10630 39724840 35309322 31519724 28266079 25450171 22960413 20736765 18751594 16958587
10622 16958587 15337674 13885136 12586132 11435445 10385509 9464531 8640766 7888561
10614 7888561 7226091 6648363 6112618 5631748 5208865 4832329 4469852 4156504 3875806
10605 3875806 3637465 3438494 3259609 3087990 2957064 2851757 2755971 2693127 2639317 2595016
10595 2595016 2581537 2561547 2480528 2393293 2325926 2236636 2143694 2077151 2030608 2038373 2062953
$$ packed form
10654F0670290k443105k876787l026117k845498k388229j716225r06024l9034
10646D4429271Q52448J744878K617829L374098L958453M164517L820422K840263
10638F7802179J242460p13671k660043m266836n313759n729364n573258n062868
10630C9724840m415518l789598l253645k815908k489758k223648j985171j793007
10622A6958587j620913j452538j299004j150687j049936r20978q23765p52205
10614G888561o62470n77728n35745m80870m22883l76536l62477l13348k80698
10605C875806k38341j98971j78885j71619j30926j05307r5786o2844n3810m4301
10595B595016j3479j9990q1019q7235o7367q9290r2942o6543m6543P765K4580
$$ plain form
10584 2062953 2116199 2212301 2374847 2618154 2962082 3322573 3520677 3536221 3449437 3243934
10574 3243934 2914159 2585001 2314101 2085326 1902486 1761616 1690214 1659493 1651333 1637817
10564 1637817 1627250 1631270 1653551 1691324 1729425 1792964 1871618 1925132 1972452 2003336 2019484
10553 2019484 2008898 1982768 1923053 1849072 1790868 1732163 1667919 1628907 1617209 1610168 1602246 1585583
10541 1585583 1570264 1568112 1574440 1554845 1542978 1545149 1538140 1553244 1560196 1570716 1612657 1645268
10529 1645268 1670355 1717367 1759820 1795999 1840842 1861580 1880758 1890314 1885857 1866400 1850966 1825038
10517 1825038 1790008 1768254 1745272 1732700 1727154 1710388 1706829 1701897 1694287 1690719 1686807 1677332 1677795
10504 1677795 1697856 1706159 1721346 1752682 1800505 1868964 1961541 2066123 2193840 2297437 2372272
$$ packed form
10584B062953N3246R6102J62546K43307L43928L60491J98104J5544q6784k05503
10574C243934l29775l29158k70900k28775j82840j40870p1402l0721q160j3516
10564A637817j0567M020K2281L7773L8101O3539P8654N3514M7320L0884J6148
10553B019484j0586k6130n9715p3981n8204n8705o4244l9012j1698p041p922j6663
10541A585583j5319k152O328j9595j1867K171p009J5104O952J0520M1941L2611
10529A645268K5087M7012M2453L6179M4843K0738J9178R556m457j9457j5434k5928
10517A825038l5030k1754k2982j2572n546j6766l559m932p610l568l912r475M63
10504A677795K0061Q303J5187L1336M7823O8459R2577J04582J27717J03597P4835
$$ plain form
10493 2372272 2429627 2456442 2472769 2503103 2532987 2562245 2623358 2692291 2773257 2859315 2969047
10482 2969047 3102197 3223598 3364040 3530512 3707864 3892771 4091340 4336082 4635646
10473 4635646 5006212 5480335 6045252 6722838 7505690 8391689 9359112 10332888 11360029
10464 11360029 12556013 13986810 15746566 18037115 21125586 25269508 30773723 38105360
10456 38105360 48027176 61642355 80617968 107519600 145639263 196737533 253549251
10449 253549251 293839971 304076525 293871223 266504658 219872636 167937240 126939963
10442 126939963 99867547 83000534 72513785 65634848 59987634 54070382 47978285
10435 47978285 42260447 37127953 32665247 28828628 25477138 22483035 19825289 17447044
$$ packed form
10493B372272N7355K6815J6327L0334K9884K9258O1113O8933Q0966Q6058J09732
10482B969047J33150J21401J40442J66472J77352J84907J98569K44742K99564
10473D635646L70566M74123N64917O77586P82852Q85999R67423R73776J027141
10464A1360029J195984J430797J759756K290549L088471M143922N504215P331637
10456C8105360R921816J3615179J8975613K6901632L8119663N1098270N6811718
10449B53549251M0290720J0236554j0205302k7366565m6632022n1935396m0997277
10442A26939963k7072416j6867013j0486749o878937n647214n917252o092097
10435D7978285n717838n132494m462706l836619l351490k994103k657746k378245
$$ plain form
10427 17447044 15335341 13506261 11906590 10540832 9363014 8348194 7432134 6608669
10419 6608669 5878001 5212916 4645564 4169092 3759490 3380492 3065050 2794461 2542283
10410 2542283 2314970 2122497 1962297 1838377 1719907 1616314 1524401 1446723 1359562 1289051
10400 1289051 1239854 1208971 1166603 1124912 1083847 1032501 1000482 965428 911168 864387 824426
10389 824426 785555 741869 730409 727543 713781 687585 669323 642713 599845 571695 554678 536440
10377 536440 530191 526686 512878 500643 479244 453560 431080 400551 361639 341195 312767 290248
10365 290248 275026 270869 266478 247960 224963 207138 177054 156171 128041 98757 83937 79863
10353 79863 101308 114391 116492 112043 102123 111753 117942 122004 122168 132656 140396 148903 155231 147974
$$ packed form
10427A7447044k111703j829080j599671j365758j177818j014820r16060q23465
10419F608669p30668o65085n67352m76472m09602l78998l15442k70589k52178
10410B542283k27313j92473j60200j23920j18470j03593r1913p7678q7161p0511
10400A289051m9197l0883m2368m1691m1065n1346l2019l5054n4260m6781l9961
10389H24426l8871m3686j1460k866j3762k6196j8262k6610m2868k8150j7017j8238
10377E36440o249l505j3808j2235k1399k5684k2480l0529l8912k0444k8428k2519
10365B90248j5222m157m391j8518k2997j7825l0084k0883k8130k9284j4820m074
10353G9863K1445J3083K101m449r920R630O189M062J64J0488P740Q507O328p257
$$ plain form
10339 147974 151863 151199 157716 145501 152620 176961 185837 177975 191670 205149 236888 256222 265233
10326 265233 266185 262573 214203 156258 113324 78763 58711 49354 65381 86776 114120 133064
10314 133064 138301 141997 136232 109151 102440 104105 106501 123148 147449 156630 169288 157488 133431
10301 133431 114073 100023 106323 110590 106811 109790 114235 127103 141260 156402 168498 166121 155449
10288 155449 147433 149850 140994 133602 144308 159395 193826 213442 221481 244165 271974 287736
10276 287736 313673 342626 369520 403276 419054 418537 404600 390612 370953 349408 328676 312699
10264 312699 288992 263536 253973 247200 240543 252241 263472 274014 286162 293547 299893 317402
10252 317402 341589 357900 373602 373165 381333 395239 412333 432954 454313 465353 477162 481844
$$ packed form
10339A47974L889o64O517j2215P119K4341Q876p862J3695J3479L1739J9334R011
10326B65233R52l612m8370n7945m2934l4561k0052r357J6027K1395K7344J8944
10314A33064N237L696n765k7081o711J665K396J6647K4301R181J2658j1800k4057
10301A33431j9358j4050O300M267l779K979M445J2868J4157J5142J2096k377j0672
10288A55449q016K417q856p392J0706J5087L4431J9616Q039K2684K7809J5762
10276B87736K5937K8953K6894L3756J5778n17j3937j3988j9659k1545k0732j5977
10264C12699k3707k5456r563o773o657J1698J1231J0542J2148P385O346J7509
10252C17402K4187J6311J5702m37Q168J3906J7094K0621K1359J1040J1809M682
$$ plain form
10240 481844 469499 445617 424043 400662 383949 375969 368806 371936 387501 396139 377349 347820
10228 347820 319277 294494 280805 278432 276560 262063 260155 265612 275067 289775 308094 318597
10216 318597 323475 341732 364436 376327 360258 344944 326956 291884 255816 225890 200625 188154
10204 188154 165997 149605 160458 159834 148220 145241 133754 113658 94475 92007 78228 71162
10192 71162 77819 89933 77592 56744 56559 42326 20472 15795 15683 14250 10045 5463 9532 8724
10178 8724 15886 23919 14328 10308 2016 12743 17435 11076 5877 1761 16075 6095 2109 8044
10164 8044 8200 5351 13758 12054 3022 2496 -1537 -1676 5530 6361 10785 -4697 -24844 -29697 -21327
10149 -21327 -21934 -21096 -29766 -41602 -49277 -75100 -76762 -68878 -85475 -104176 -113437 -109628 -83214 -44692
$$ packed form
10240D81844j2345k3882k1574k3381j6713p980p163L130J5565Q638j8790k9529
10228C47820k8543k4783j3689k373j872j4497j908N457R455J4708J8319J0503
10216C18597M878J8257K2704J1891j6069j5314j7988l5072l6068k9926k5265j2471
10204A88154k2157j6392J0853o24j1614k979j1487k0096j9183k468j3779p066
10192G1162O657J2114j2341k0848j85j4233k1854m677j12j433m205m582M069q08
10178H724P162Q033r591m020q292J0727M692o359n199m116J4314r980l986N935
10164H044J56k849Q407j704r032n26m033j39P206Q31M424j5482k0147m853Q370
10149b1327o07Q38q670j1836p675k5823j662P884j6597j8701r261L809K6414L8522
$$ plain form
10135 -44692 -7447 41986 85231 114722 133864 153536 161256 178106 190914 198091 206962 214969
10123 214969 237508 260573 266856 286984 315530 343692 381731 433367 494400 565414 629874 695556
10111 695556 778515 864655 956942 1076974 1246155 1482742 1805411 2237937 2821089 3614793
10101 3614793 4713829 6192634 8110431 10397122 12633771 14133521 14568278 14007526
10093 14007526 12602787 10583810 8457391 6675895 5386541 4516336 3934135 3519643
10085 3519643 3163242 2838546 2546836 2254811 1991161 1765308 1559251 1381505 1237299
10076 1237299 1115021 982126 858442 749292 662950 598572 532637 480991 434249 389785
10066 389785 344708 297938 273634 253979 236129 222617 206277 190812 171816 165553 145016 133082
$$ packed form
10135d4692L7245M9433M3245K9491J9142J9672P720J6850J2808P177Q871Q007
10123B14969K2539K3065O283K0128K8546K8162L8039N1636O1033P1014O4460O5682
10111F95556Q2959Q6140R2287J20032J69181K36587L22669M32526N83152P93704
10101C614793J099036J478805J917797K286691K236649J499750M34757n60752
10093A4007526j404739k018977k126419j781496j289354q70205n82201m14492
10085C519643l56401l24696k91710k92025k63650k25853k06057j77746j44206
10076A237299j22278j32895j23684j09150q6342o4378o5935n1646m6742m4464
10066C89785m5077m6770k4304j9655j7850j3512j6340j5465j8996o263k0537j1934
$$ plain form
10054 133082 132029 103354 75344 63737 69419 56674 50904 60819 77966 93613 98243 89856 77462
10041 77462 74713 83244 86299 88287 82050 105842 131114 164662 194643 242259 304548 384109 508101
10028 508101 688270 917047 1191613 1449993 1592441 1586072 1479744 1301244 1054573 810345
10018 810345 634360 515571 449813 395842 358403 317202 281398 246870 220316 202946 177483
10007 177483 142026 121603 98839 87034 63426 38192 38512 50683 53647 39480 27609 29174
9995 29174 18842 9421 -1549 -11694 -15121 -10575 3638 -918 -17887 -13929 -5720 -960 -7795
9982 -7795 -13015 -9937 -8231 -12441 -6674 -17886 -14893 -342 12351 23308 30707 31526 32120 36149
9968 36149 56518 74581 75431 92334 121997 156730 208333 252572 308379 396611 516869 671759
$$ packed form
10054A33082j053k8675k8010j1607N682j2745n770R915J7147J5647M630q387j2394
10041G7462k749Q531L055J988o237K3792K5272L3548K9981M7616O2289P9561J23992
10028E08101J80169K28777K74566K58380J42448o369j06328j78500k46671k44228
10018H10345j75985j18789o5758n3971l7439m1201l5804l4528k6554j7370k5463
10007A77483l5457k0423k2764j1805k3608k5234L20J2171K964j4167j1871J565
9995B9174j0332r421j0970j0145l427M546J4213m556j6969L958Q209M760o835
9982g795n220L078J706m210N767j1212K993J4551J2693J0957P399Q19N94M029
9968C6149K0369J8063Q50J6903K9663L4733N1603M4239N5807Q8232J20258J54890
$$ plain form
9956 671759 862528 1082050 1302262 1456787 1517758 1486651 1371005 1194707 977494 768650
9946 768650 603066 491466 424974 373632 327683 277021 249486 214963 181074 152498 124846
9935 124846 103558 75033 57141 42413 34715 33052 20038 3943 3045 -5642 -8777 -3986 -10218
9922 -10218 -10665 -19233 -27607 -17715 -13497 -7784 -26401 -33935 -34018 -37463 -44874 -51331 -52326 -56119 -42011
9907 -42011 -21040 -20791 -16208 -12155 -19352 -27922 -27867 -33048 -31909 -33664 -36207 -29286 -27914 -21823 -13659
9892 -13659 -17455 -17941 -22974 -26840 -18373 -21055 -26536 -23851 -29202 -22510 -17991 -14947 -14148 -30015 -33734
9877 -33734 -40025 -44709 -49952 -51515 -48280 -47966 -35932 -25187 -23373 -32126 -32026 -37417 -37310 -34640 -36542
9862 -36542 -37254 -41485 -34665 -34555 -29488 -23061 -30871 -25313 -27799 -28605 -32361 -30622 -25789 -15058 1
$$ packed form
9956F71759J90769K19522K20212J54525O0971l1107j15646j76298k17213k08844
9946G68650j65584j11600o6492n1342m5949n0662k7535l4523l3889k8576k7652
9935A24846k1288k8525j7892j4728p698j663j3014j6095q98q687l135M791o232
9922a0218m47q568q374R892M218N713j8617p534q3l445p411o457r95l793J4108
9907d2011K0971K49M583M053p197q570N5n181J139j755k543O921J372O091Q164
9892a3659l796m86n033l866Q467k682n481K685n351O692M519L044P99j5867l719
9877c3734o291m684n243j563L235L14J2034J0745J814q753J00n391J07K670j902
9862c6542p12m231O820J10N067O427p810N558k486q06l756J739M833J0731J5059
$$ plain form
9847 1 -4599 -8445 -192 -4473 -14043 -26022 -35611 -27519 -31539 -28415 -25906 -33199 -33299 -36889 -44391 -48578
9831 -48578 -41178 -29959 -10855 -6376 -4971 -6255 -20572 -39455 -63370 -65174 -61168 -59504 -61411
9818 -61411 -57639 -52905 -42068 -43298 -31915 -28973 -33233 -25215 -32321 -40573 -43061 -41665 -41797 -47897
9804 -47897 -36260 -34613 -36309 -19744 -22450 -32566 -47245 -50808 -63783 -59793 -49660 -38202 -33867
9791 -33867 -39409 -57645 -61511 -55187 -58791 -56219 -37553 -38862 -52793 -58333 -61276 -55025 -50189 -58712
9777 -58712 -59097 -46572 -21228 -18434 -26445 -24833 -24732 -22881 -21809 -42472 -61948 -62057 -56305 -56705 -66376
9762 -66376 -65803 -62560 -57474 -52674 -47516 -48868 -44433 -52754 -49601 -26832 -23652 -26875 -10936 -27662
9748 -27662 -31588 -18245 -15136 -18205 -21971 -26106 -18926 -11524 -18691 -32013 -31720 -30727 -37930 -33121 -32735
$$ packed form
9847Am600l846Q253m281r570j1979r589Q092m020L124K509p293j00l590p502m187
9831d8578P400J1219J9104M479J405j284j4317j8883k3915j804M006J664j907
9818f1411L772M734J0837j230J1383K942m260Q018p106q252k488J396j32o100
9804d7897J1637J647j696J6565k706j0116j4679l563j2975L990J0133J1458M335
9791c3867n542j8236l866O324l604K572J8666j309j3931n540k943O251M836q523
9777e8712l85J2525K5344K794q011J612J01J851J072k0663j9476j09N752m00r671
9762f6376N73L243N086M800N158j352M435q321L153K2769L180l223J5939j6726
9748b7662l926J3343L109l069l766m135P180P402p167j3322K93R93p203M809L86
$$ plain form
9733 -32735 -29271 -34742 -47671 -50619 -50080 -45349 -34241 -22454 -17412 -27396 -25501 -34288 -37677 -17265
9719 -17265 1314 323 -3452 -15240 -16864 -21234 -20731 -16347 -13328 -16863 -17678 -12244 -14303 -19886 -6739
9704 -6739 8450 22913 42367 42350 30253 39690 52776 31505 23050 9218 -9213 -22670 -24211
9691 -24211 -23295 -22235 -11065 -18849 -33596 -34692 -34285 -26182 -18367 -9879 3710 2397 -1425 -5459
9677 -5459 -3022 2462 13623 21499 30008 38068 33112 6988 4044 13228 23097 13663 9457 -3067
9663 -3067 -12423 -8000 585 -5872 -3889 2087 -15134 -26623 -34988 -29367 -22622 -25582 -43348 -41385
9649 -41385 -29205 -27670 -24560 -35437 -43880 -42018 -45479 -55184 -57548 -41499 -35706 -15016 -15274 -27907
9635 -27907 -27195 -18794 -8401 -15008 -18460 -29887 -39520 -32857 -20265 -14430 -2469 -10484 -24547 -27717
$$ packed form
9733c2735L464n471j2929k948N39M731J1108J1787N042r984J895q787l389K0412
9719a7265J8579r91l775j1788j624m370N03M384L019l535q15N434k059n583J3147
9704f739J5189J4463J9454j7j2097R437J3086k1271q455j3832j8431j3457j541
9691b4211R16J060J1170p784j4747j096M07Q103P815Q488J3589j313l822m034
9677e459K437N484J1161P876Q509Q060m956k6124k944R184R869r434m206j2524
9663c067r356M423Q585o457J983N976j7221j1489q365N621O745k960j7766J963
9649d1385J2180J535L110j0877q443J862l461r705k364J6049N793K0690k58j2633
9635b7907P12Q401J0393o607l452j1427r633O663J2592N835J1961q015j4063l170
$$ plain form
9621 -27717 -24288 -15105 -21134 -25256 -32495 -56076 -62075 -50792 -36092 -24881 -16732 -7632 -8155 -10083
9607 -10083 -10387 -19463 -16496 -12287 -4664 -12613 -23661 -25510 -10906 -12995 -8110 -14045 -19230 -31303
9593 -31303 -41523 -42353 -31196 -15232 -11641 -29796 -42907 -44643 -31644 -30869 -47467 -59554 -58138
9580 -58138 -41703 -38809 -38864 -52410 -47535 -37753 -31404 -28610 -15588 -11455 -7677 -2285 -15320 -12890
9566 -12890 -4484 -12974 -10784 -15611 -14776 -21919 -27571 -30813 -29420 -24826 -26650 -33368 -43688 -47360 -31666
9551 -31666 -29642 -29004 -23087 -26966 -34631 -23577 -11570 -20233 -22128 -19959 -16502 -37694 -44744 -54004
9537 -54004 -55575 -48675 -37031 -28087 -39997 -32274 -29683 -8864 -4420 -20043 -32728 -33743 -28796
9524 -28796 -15901 -10784 -20964 -38130 -42951 -39566 -36966 -39661 -33671 -26265 -30536 -29355 -32936 -35457
$$ packed form
9621b7717L429R183o029m122p239k3581n999J1283J4700J1211Q149R100n23j928
9607a0083l04r076K967M209P623p949j1048j849J4604k089M885n935n185j2073
9593c1303j0220q30J1157J5964L591j8155j3111j736J2999P75j6598j2087J416
9580e8138J6435K894n5j3546M875R782O349K794J3022M133L778N392j3035K430
9566a2890Q406q490K190m827Q35p143n652l242J393M594j824o718j0320l672J5694
9551c1666K024O38N917l879p665J1054J2007q663j895K169L457k1192p050r260
9537e4004j571O900J1644Q944j1910P723K591K0819M444j5623j2685j015M947
9524b8796J2895N117j0180j7166m821L385K600k695N990P406m271J181l581k521
$$ plain form
9510 -35457 -35890 -36797 -45712 -41065 -38867 -31013 -27919 -27442 -20661 -10016 -13628 -10457 -12208 -20278 -13428
9495 -13428 -11540 -25749 -30594 -19189 -11046 -16657 -26961 -32186 -36868 -40667 -35743 -21385 -13750 -16669
9481 -16669 -4711 -4293 296 5806 1137 -6364 7541 15036 10675 -637 -1382 482 4798 9936
9467 9936 15974 7373 945 -1111 -2897 -4340 4511 8692 -4091 -7978 -8141 -11776 -8708 -9427 -5770
9452 -5770 -18681 -20803 -8871 12003 17999 12851 5999 -4684 -10464 -12929 -12017 -9593 -5103 -11901
9438 -11901 -7466 -529 5496 19040 14195 14664 10825 8248 -6086 -17145 -18159 -29521 -35769 -3977
9424 -3977 2798 937 4305 590 6631 -3009 -9019 -3170 -4054 -11594 -14573 -5719 -2274 -8587 -31308
9409 -31308 -38585 -47913 -43601 -26874 -29407 -28820 -16426 -13529 -2372 -2135 -9082 -10132 -17114 -15923
$$ packed form
9510c5457m33r07q915M647K198P854L094M77O781J0645l612L171j751q070O850
9495a3428J888j4209m845J1405Q143n611j0304n225m682l799M924J4358P635k919
9481a6669J1958M18M589N510m669p501J3905P495m361j1312p45J864M316N138
9467I936O038q601o428k056j786j443Q851M181j2783l887j63l635L068p19L657
9452e770j2911k122J1932K0874N996n148o852j0683n780k465R12K424M490o798
9438a1901M435O937O025J3544m845M69l839k577j4334j1059j014j1362o248L1792
9424c977O775j861L368l715O041r640o010N849q84p540k979Q854L445o313k2721
9409c1308p277r328M312J6727k533N87J2394K897J1157K37o947j050o982J191
$$ plain form
9395 -15923 -21035 -24937 -15753 -15455 -9144 -11463 -6106 1975 3537 4948 7876 12759 18573 4871 -2356
9380 -2356 -4038 -529 4152 6821 20299 7819 4864 8563 7707 -419 -10589 -9834 -6656 -9732 -14268
9365 -14268 -5394 4906 2098 8299 13270 12722 -2156 -9834 -8452 -4519 3331 11567 4845 1399
9351 1399 10370 -299 -4004 8481 26348 32381 24198 14885 24100 25590 32034 40671 42768 39110
9337 39110 29247 16937 27230 32434 18888 13729 -299 -2433 7037 18924 18313 11601 3721 4620
9323 4620 14247 22464 20303 11494 5127 -3207 4296 15434 9822 10007 10916 8899 8537 15113 12354
9308 12354 -4194 -17979 -13339 -617 -1901 7837 10759 2357 3164 6094 12494 15760 7232 5512
9294 5512 208 1566 5998 3809 7478 15076 26967 30688 24049 31096 26589 23764 17261 14963 16301
$$ packed form
9395a5923n112l902R184K98O311k319N357Q081J562J411K928M883N814j3702p227
9380b356j682L509M681K669J3478j2480k955L699q56q126j0170P55L178l076m536
9365a4268Q874J0300k808O201M971n48j4878p678J382L933P850Q236o722l446
9351A399Q971j0669l705J2485J7867O033q183r313R215J490O444Q637K097l658
9337C9110r863j2310J0293N204j3546n159j4028k134R470J1887o11o712p880Q99
9323D620R627Q217k161q809o367q334P503J1138n612J85R09k017l62O576k759
9308A2354j6548j3785M640J2722j284R738K922q402Q07K930O400L266q528j720
9294E512n304J358M432k189L669P598J1891L721o639P047m507k825o503k298J338
$$ plain form
9279 16301 14046 -311 -6365 -3721 -3073 -709 5844 23577 27270 17774 12700 14149 15705 14791 12665
9264 12665 22877 36731 34955 21804 24373 27263 23622 14529 20378 23708 41096 42804 35163 27120
9250 27120 16497 18891 31844 36284 32886 23749 22912 25953 21418 25635 20016 14683 21072 17105
9236 17105 17820 18701 10995 22579 34958 42960 31895 38667 37772 31880 37617 28681 24185 20090 20235
9221 20235 30892 32594 29907 31616 30815 26197 31954 37070 40938 48472 54295 40458 26876 18642
9207 18642 14667 8571 10216 18016 24450 26992 17357 15780 20988 15568 3702 -5337 -7761 -4296
9193 -4296 2778 -1305 -3576 3353 24262 32650 22365 25410 26600 11131 19527 14899 6410 -1504
9179 -1504 5182 9338 25099 26066 16856 7706 1589 11286 11580 -4299 -10960 -9482 -1059 6074 18434
$$ packed form
9279A6301k255j4357o054K644O48K364O553J7733L693r496n074J449J556r14k126
9264A2665J0212J3854j776j3151K569K890l641r093N849L330J7388J708p641q043
9250B7120j0623K394J2953M440l398r137q37L041m535M217n619n333O389l967
9236A7105P15Q81p706J1584J2379Q002j1065O772q95n892N737q936m496m095J45
9221B0235J0657J702k687J709q01m618N757N116L868P534N823j3837j3582q234
9207A8642l975o096J645P800O434K542r635j577N208n420j1866r039k424L465
9193d296P074m083k271O929K0909Q388j0285L045J190j5469Q396m628q489p914
9179a504O686M156J5761R67r210r150o117R697K94j5879o661J478Q423P133J2360
$$ plain form
9164 18434 28932 20311 19179 13420 6956 4301 2148 -4177 9762 18712 20485 39373 36771 16695
9150 16695 16357 16572 24154 36940 44424 44635 32057 24563 28358 35629 31492 29944 22160 14561 15843
9135 15843 4938 7956 13019 13620 21984 16280 14146 14071 16617 20627 19335 20897 24131 24469 15108
9120 15108 33846 36916 38986 41295 41318 31378 30377 44821 64343 71500 71737 74987 65101 52914
9106 52914 44700 35256 41858 42917 33444 19632 22177 21817 16836 12404 23884 20017 33125 40035
9092 40035 39838 49222 47870 39232 26295 14992 20141 25172 38746 41746 34082 30787 31214 38383
9078 38383 48569 56214 49402 54610 54460 51382 60006 56058 55760 64776 56844 62668 61407 53779 38672
9063 38672 26541 25263 24692 38182 39067 35281 37531 40126 33019 21272 18103 23682 14930 16689
$$ packed form
9164A8434J0498q621j132n759o464k655k153o325J3939Q950J773J8888k602k0076
9150A6695l38K15P582J2786P484K11j2578p494L795P271m137j548p784p599J282
9135A5843j0905L018N063O01Q364n704k134p5K546M010j292J562L234L38r361
9120A5108J8738L070K070K309K3r940j001J4444J9522P157K37L250r886j2187
9106E2914q214r444O602J059r473j3812K545l60m981m432J1480l867J3108O910
9092D0035j97R384j352q638j2937j1303N149N031J3574L000p664l295M27P169
9078C8383J0186P645o812N208j50l078Q624l948k98R016p932N824j261p628j5107
9063C8672j2131j278n71J3490Q85l786K250K595p107j1747l169N579q752J759
$$ plain form
9049 16689 17883 15362 11625 8839 27664 32430 22893 18791 29772 43900 48772 30573 14051
9036 14051 12516 17520 23260 24069 22242 32032 44051 50400 52527 41297 33450 36503 41528 42175 44702
9021 44702 58963 54209 42818 32585 34989 30469 31176 34404 38794 30117 22063 25866 26536 28626
9007 28626 27343 29058 19604 11131 -69 -1862 8795 24917 23575 3363 -12803 10383 29544
8994 29544 40879 48382 44142 35720 34632 37069 37297 34782 27992 29776 22431 20222 28571 27247 25237
8979 25237 28430 21168 28016 33033 41717 53091 65393 58852 44607 39344 29025 45161 51450
8966 51450 57006 62732 59149 46017 53515 70282 58387 54054 55140 53945 41320 36037 49581
8953 49581 56073 49022 43576 38072 53254 59805 57514 47330 41256 39832 37796 39920 39595 48337
$$ packed form
9049A6689J194k521l737k786J8825M766r537m102J0981J4128M872j8199j6522
9036A4051j535N004N740Q09j827R790J2019O349K127j1230p847L053N025O47K527
9021D4702J4261m754j1391j0233K404m520P07L228M390q677q054L803O70K090
9007B8626j283J715r454q473j1200j793J0657J6122j342k0212j6166K3186J9161
8994B9544J1335P503m240q422j088K437K28k515o790J784p345k209Q349j324k010
8979B5237L193p262O848N017Q684J1374J2302o541j4245n263j0319J6136O289
8966E1450N556N726l583j3132P498J6767j1895m333J086j195j2625n283J3544
8953D9581O492p051n446n504J5182O551k291j0184o074j424k036K124l25Q742
$$ plain form
8939 48337 68632 72299 66135 67275 67742 72358 66895 64997 56964 57621 66325 71283 59617 57932 56942
8924 56942 57650 62900 66250 65668 65599 72224 81534 77197 68290 56713 56717 66939 71170 78265 63287 60385
8908 60385 70200 83998 82894 87114 90975 90400 95544 93040 102423 100030 93573 104355 108978 105621
8894 105621 91976 81446 92519 106631 96514 102856 109829 111080 116011 122175 120386 108767 98794
8881 98794 90109 95506 104255 103007 96539 99031 100380 97323 99140 113141 117530 105492 109085 110253
8867 110253 121706 127087 135089 133070 122618 103555 100851 108127 108117 103554 112002 129115 145463 143655
8853 143655 146246 162865 165070 164005 167914 174218 174025 174450 173020 167458 165160 168068 175664 167074 160669
8838 160669 163031 167329 171652 178710 170499 175151 170938 177242 170512 176736 182596 186151 173139 165038
$$ packed form
8939D8337K0295L667o164J140M67M616n463j898q033O57Q704M958j1666j685r90
8924E6942P08N250L350n82o9O625R310m337q907j1577MJ0222M231P095j4978k902
8908F0385R815J3798j104M220L861n75N144k504R383k393o457J0782M623l357
8894A05621j3645j0530J1073J4112j0117O342O973J251M931O164j789j1619r973
8881I8794q685N397Q749j248o468K492J349l057J817J4001M389j2038L593J168
8867A10253J1453N381Q002k019j0452j9063k704P276j0m563Q448J7113J6348j808
8853A43655K591J6619K205j065L909O304j93M25j430n562k298K908P596q590o405
8838A60669K362M298M323P058q211M652m213O304o730O224N860L555j3012q101
$$ plain form
8824 165038 168393 181506 174865 162504 176718 173619 162666 158450 168550 177176 178355 185895 197923
8811 197923 193208 204114 215179 206491 194305 193872 195676 192484 190891 195980 195273 213211 215868 213205
8797 213205 218224 211959 201854 210052 220161 222507 236587 242657 257353 258782 245686 239613 232963
8784 232963 231850 239870 251547 258584 243247 235247 227918 234358 244014 246926 245543 252664 244220 230588
8770 230588 240531 261171 268099 264247 263454 274555 270494 286501 291560 299027 294590 288678 299049 301069
8756 301069 304356 321919 325639 328029 321146 305913 301403 297686 306892 314428 325703 335772 346959
8743 346959 354890 363649 361428 366857 376818 387013 391717 402382 417021 427069 430027 440898 440809 434806
8729 434806 443201 435824 429616 441642 457888 490604 499855 498718 494184 504043 522041 517097 513350
$$ packed form
8824A65038L355J3113o641j2361J4214l099j0953m216J0100Q626J179P540J2028
8811A97923m715J0906J1065q688j2186m33J804l192j593N089p07J7938K657k663
8797B13205N019o265j0105Q198J0109K346J4080O070J4696J429j3096o073o650
8784B32963j113Q020J1677P037j5337q000p329O440R656K912j383P121q444j3632
8770B30588R943K0640O928l852p93J1101m061J6007N059P467m437n912J0371K020
8756C01069L287J7563L720K390o883j5233m510l717R206P536J1275J0069J1187
8743C46959P931Q759k221N429R961J0195M704J0665J4639J0048K958J0871q9o003
8729D34806Q395p377o208J2026J6246L2716R251j137m534R859J7998m944l747
$$ plain form
8716 513350 530502 558444 575208 578282 583310 595533 599825 589043 590134 608723 623485 631913 631690
8703 631690 644414 672594 685909 688970 700980 714185 719630 731104 739223 749969 762585 770478
8691 770478 768804 788311 808009 827287 855717 877661 888929 913447 921106 929265 944994 966204
8679 966204 983298 998151 1014002 1027380 1047402 1062264 1089295 1101802 1120200 1152691 1191208 1214998
8667 1214998 1247277 1281915 1300489 1319742 1346242 1370390 1385633 1410144 1441969 1484455 1528582
8656 1528582 1578389 1618300 1668855 1709673 1730188 1759950 1801773 1855789 1928501 2001766 2053449
8645 2053449 2098470 2151501 2213192 2278195 2340579 2412691 2489525 2561266 2644157 2742221 2844953
8634 2844953 2953508 3059867 3164149 3277124 3383478 3495302 3617468 3761361 3912160 4064247
$$ packed form
8716E13350J7152K7942J6764L074N028J2223M292j0782J091J8589J4762Q428k23
8703F31690J2724K8180J3315L061J2010J3205N445J1474Q119J0746J2616P893
8691G70478j674J9507J9698J9278K8430K1944J1268K4518P659Q159J5729K1210
8679I66204J7094J4853J5851J3378K0022J4862K7031J2507J8398L2491L8517K3790
8667A214998L2279L4638J8574J9253K6500K4148J5243K4511L1825M2486M4127
8656A528582M9807L9911N0555M0818K0515K9762M1823N4016P2712P3265N1683
8645B053449M5021N3031O1691O5003O2384P2112P6834P1741Q2891R8064J02732
8634B844953J08555J06359J04282J12975J06354J11824J22166J43893J50799J52087
$$ plain form
8624 4064247 4205651 4367202 4554417 4750488 4934836 5144117 5378013 5616936 5868610 6118472
8614 6118472 6394579 6684814 6990770 7323831 7681199 8054094 8452178 8872080 9315487 9787271
8604 9787271 10280303 10797325 11345209 11923545 12516195 13116974 13744661 14410223 15083695 15767969
8594 15767969 16453914 17117681 17784092 18438063 19043956 19593640 20098873 20550900 20929020
8585 20929020 21231478 21440383 21545227 21563334 21501551 21328361 21078728 20758188 20358385 19891767
8575 19891767 19378743 18827580 18231387 17603897 16972665 16325342 15682409 15044353 14411289
8566 14411289 13798141 13179507 12583480 12011926 11468850 10944210 10441372 9955546 9483319
8557 9483319 9045727 8636704 8237396 7853387 7495141 7149826 6830816 6541219 6244817 5962278
$$ packed form
8624D064247J41404J61551J87215J96071J84348K09281K33896K38923K51674K49862
8614F118472K76107K90235L05956L33061L57368L72895L98084M19902M43407M71784
8604I787271M93032N17022N47884N78336N92650O00779O27687O65562O73472O84274
8594A5767969O85945O63767O66411O53971O05893N49684N05233M52027L78120
8585B0929020L02458K08905J04844J8107o1783j73190k49633l20540l99803m66618
8575A9891767n13024n51163n96193o27490o31232o47323o42933o38056o33064
8566A4411289o13148o18634n96027n71554n43076n24640n02838m85826m72227
8557I483319m37592m09023l99308l84009l58246l45315l19010k89597k96402k82539
$$ plain form
8547 5962278 5697062 5442428 5204961 4995510 4786757 4596093 4417730 4251544 4091773 3926364
8537 3926364 3768874 3614130 3484350 3367525 3252565 3137560 3034795 2928121 2818093 2716124
8527 2716124 2627382 2538918 2453888 2382280 2306475 2226681 2162103 2098684 2044225 1993356 1940549
8516 1940549 1882201 1815822 1775870 1733366 1677973 1619117 1559998 1512806 1480530 1449307 1410939
8505 1410939 1371376 1331673 1288376 1254638 1240276 1214148 1172424 1156605 1128465 1109686 1089058
8494 1089058 1053832 1027279 1013393 996378 982353 971031 955962 935311 904959 873784 854510
8483 854510 845556 827268 817328 798056 782718 756329 731118 725539 716981 715597 713329 704607 687206
8470 687206 674123 672213 662514 648170 612742 593095 579437 574591 560785 543077 542627 537692 526790
$$ packed form
8547E962278k65216k54634k37467k09451k08753j90664j78363j66186j59771j65409
8537C926364j57490j54744j29780j16825j14960j15005j02765j06674j10028j01969
8527B716124q8742q8464q5030p1608p5805p9794o4578o3419n4459n0869n2807
8516A940549n8348o6379l9952m2504n5393n8856n9119m7192l2276l1223l8368
8505A410939l9563l9703m3297l3738j4362k6128m1724j5819k8140j8779k0628
8494A089058l5226k6553j3886j7015j4025j1322j5069k0651l0352l1175j9274
8483H54510q954j8288r940j9272j5338k6389k5211n579q558j384k268q722j7401
8470F87206j3083j910r699j4344l5428j9647j3658m846j3806j7708m50m935j0902
$$ plain form
8457 526790 530283 532106 538430 525287 493875 483468 486980 475872 468132 444307 419505 410853 411440
8444 411440 429121 434293 425099 410879 399255 396281 411076 413614 414957 393772 381777 364998 349713
8431 349713 343902 336004 338862 331683 325782 325592 326704 320418 326936 327551 318395 311105 307498 311383 324684
8416 324684 314394 302554 289670 294130 294616 275912 274619 277900 267727 260599 264679 276029 267557
8403 267557 247492 240077 246302 248892 252756 235306 225284 216039 217962 212433 203654 190403 179728
8390 179728 172085 194622 217568 219979 229056 229162 218064 203794 189768 183309 195287 202759 207224
8377 207224 188782 176030 168169 159344 171667 178632 178595 179590 195079 205351 205492 208510 199406 180364
8363 180364 170682 163939 156164 137362 130294 117215 135060 159458 165979 159600 151454 147286 145628
$$ packed form
8457E26790L493J823O324j3143l1412j0407L512j1108p740k3825k4802q652N87
8444D11440J7681N172r194j4220j1624k974J4795K538J343k1185j1995j6779j5285
8431C49713n811p898K858p179n901j90J112o286O518O15r156p290l607L885J3301
8416C24684j0290j1840j2884M460M86j8704j293L281j0173p128M080J1350q472
8403B67557k0065p415O225K590L864j7450j0022r245J923n529q779j3251j0675
8390A79728p643K2537K2946K411R077J06j1098j4270j4026o459J1978P472M465
8377B07224j8442j2752p861q825J2323O965l7R95J5489J0272J41L018r104j9042
8363A80364r682o743p775j8802p068j3079J7845K4398O521o379q146m168j658
$$ plain form
8350 145628 151259 159938 167486 165891 166345 162616 161930 157772 143573 133426 135201 121432 114228 122888
8336 122888 129823 132750 115553 113178 115485 121349 120068 126694 120740 114192 129029 139533 119854
8323 119854 111952 114221 108469 107587 108458 104478 97740 100590 114180 108854 103548 109262 116294 116228 122511
8308 122511 119210 123127 117914 122960 128406 120403 111518 106729 110799 133577 135990 129212 132480 155366
8294 155366 173938 187330 204316 217542 229108 251307 294911 351010 413252 481593 582052
8283 582052 756570 981070 1260480 1556688 1757437 1807848 1744354 1572537 1314354 1049211
8273 1049211 824832 662010 571598 523058 490378 454924 415965 391732 362612 319995 286398
8262 286398 266509 255531 233965 219780 207878 205431 192413 193742 203794 204077 204213 216596 226229
$$ packed form
8350A45628N631Q679P548j595M54l729o86m158j4199j0147J775j3769p204Q660
8336A22888O935K927j7197k375K307N864j281O626n954o548J4837J0504j9679
8323A19854p902K269n752q82Q71l980o738K850J3590n326n306N714P032o6O283
8308A22511l301L917n213N046N446q003q885m789M070K2778K413o778L268K2886
8294A55366J8572J3392J6986J3226J1566K2199M3604N6099O2242O8341J00459
8283E82052J74518K24500K79410K96208K00749N0411o3494j71817k58183k65143
8273A049211k24379j62822r0412m8540l2680l5454l8959k4233k9120m2617l3597
8262B86398j9889j0978k1566j4185j1902k447j3018J329J0052K83J36J2383R633
$$ plain form
8249 226229 242870 266403 288783 322555 369846 428526 506421 631724 809432 1039807 1331607
8238 1331607 1596010 1731805 1726727 1628702 1425857 1159456 916338 737714 615577 525562
8228 525562 459257 431758 413126 379533 336723 296556 272955 261282 248188 220526 194210 170668
8216 170668 151126 143027 129857 132199 131412 108450 85362 60536 58618 66141 75114 85369 71998
8203 71998 73441 73148 58883 62756 72183 78911 76613 62727 55748 60991 60632 60724 51923 33052 28762
8188 28762 41329 51062 47904 46611 44245 34209 21751 25423 23268 16703 11363 21603 32121
8175 32121 44621 35101 30172 30293 31943 24414 12101 -1407 20020 16895 31233 37845 41946 39102
8161 39102 36030 26533 27342 31459 34782 29906 18101 13761 18111 31738 35563 39574 33035 32289 29421
$$ packed form
8249B26229J6641K3533K2380L3772M7291N8680P7895J25303J77708K30375K91800
8238A331607K64403J35795n078r8025k02845k66401k43118j78624j22137r0015
8228E25562o6305k7499j8632l3593m2810m0167k3601j1673j3094k7662k6316k3542
8216A70668j9542q099j3170K342p87k2962k3088k4826j918P523Q973J0255j3371
8203G1998J443k93j4265L873R427O728k298j3886o979N243l59R2q801j8871m290
8188B8762J2567R733l158j293k366j0036j2458L672k155o565n340J0240J0518
8175C2121J2500r520m929J21J650p529j2313j3508K1427l125J4338O612M101k844
8161C9102l072r497Q09M117L323m876j1805m340M350J3627L825M011o539p46k868
$$ plain form
8146 29421 31388 39514 39551 36723 38618 38464 35081 32595 34747 20943 34147 43739 46243 39843 35838
8131 35838 22863 32227 39606 37753 32000 32856 40918 36487 39868 49095 43840 38828 43884 40208 30864
8116 30864 44273 51663 48836 38861 21035 23669 28491 29648 39024 28924 24322 26767 18921 7397
8102 7397 15516 22643 18929 28470 22994 7879 15109 22568 23139 16791 28580 36047 37357 33901 41769
8087 41769 47665 49125 37965 33850 35049 24990 17517 10061 2709 11257 38345 40530 40900 25089
8073 25089 17446 17852 9498 6117 16392 22358 29810 30345 24565 21627 14591 6605 9055 4619 7734
8058 7734 22249 19527 7560 -7368 -8680 -6117 -2975 -1771 -6415 -8392 82 9019 12552 10772
8044 10772 2668 9115 14622 23645 26105 27604 22312 23555 25231 24222 25119 25857 15791 4872 11393
$$ packed form
8146B9421J967Q126L7k828J895j54l383k486K152j3804J3204R592K504o400m005
8131C5838j2975R364P379j853n753Q56Q062m431L381R227n255n012N056l676r344
8116C0864J3409P390k827r975j7826K634M822J157R376j0100m602K445p846j1524
8102G397Q119P127l714R541n476j5115P230P459N71o348J1789P467J310l456P868
8087D1769N896J460j1160m115J199j0059p473p456p352Q548K7088K185L70j5811
8073B5089p643M06q354l381J0275N966P452N35n780k938p036p986K450m436L115
8058G734J4515k722j1967j4928j312K563L142J204m644j977Q474Q937L533j780
8044A0772q104O447N507R023K460J499n292J243J676j009Q97P38j0066j0919O521
$$ plain form
8029 11393 25180 29795 24487 17293 28167 38622 46868 56328 42921 34800 29142 24218 24069 28514
8015 28514 22948 22131 25094 22640 30549 20938 6131 7006 -2551 3802 3743 2995 6164 22107 32086
8000 32086 38613 53571 59402 48078 41470 47995 39158 33109 24111 1307 -1617 10609 17804 23206
7986 23206 25710 30770 27427 28601 17611 21846 22540 17415 28610 35670 40451 40696 32330 30731 20539
7971 20539 24185 36106 21311 17723 17184 17363 16644 11718 24708 15597 21481 18524 30197 24548
7957 24548 8038 7981 18716 22990 16861 16299 8375 6451 12068 16376 19275 30720 33616 51034
7943 51034 53749 52267 40310 23890 13429 8675 26771 33806 38803 24313 19425 28528 42106
7930 42106 27335 17100 15612 14366 16755 8893 -1043 2150 12504 13019 -4876 -6653 7192 4544
$$ packed form
8029A1393J3787M615n308p194J0874J0455Q246R460j3407q121n658m924j49M445
8015B8514n566q17K963k454P909r611j4807Q75r557O353n9p48L169J5943R979
8000C2086O527J4958N831j1324o608O525q837o049q998k2804k924J2226P195N402
7986B3206K504N060l343J174j0990M235O94n125J1195P060M781K45q366j599j0192
7971B0539L646J1921j4795l588n39J79p19m926J2990r111N884k957J1673n649
7957B4548j6510n7J0735M274o129n62p924j924N617M308K899J1445K896J7418
7943E1034K715j482j1957j6420j0461m754J8096P035M997j4490m888R103J3578
7930D2106j4771j0235j488j246K389p862r936L193J0354N15j7895j777J3845k648
$$ plain form
7916 4544 4047 18980 18429 7507 2019 2632 696 -991 573 -9982 -10201 -13031 -11012 -11002 5157
7901 5157 4947 -561 9698 16476 21924 25717 14015 8124 11277 24711 36882 41426 41381 41651 35231
7886 35231 23456 32933 32581 22244 10266 -3016 -3439 641 5682 15049 20809 22378 17503 13711
7872 13711 191 2968 9219 7903 -162 -374 -1155 9540 12502 15511 16513 9112 -673 -7539 -10235
7857 -10235 -5643 -9347 -6559 -5643 6456 8506 14228 14322 7556 784 -1196 -8197 -4575 -4055 -3507 3376
7841 3376 289 -1535 6334 11140 2163 -1503 13518 16330 11265 24634 22165 1848 -20894 -25272
7827 -25272 -10643 -5468 7463 -8311 -3107 16622 28414 10331 -5370 -5509 -17969 -10641 1632
7814 1632 7575 10707 5308 4079 8418 5432 1787 -4238 -18634 -18116 -9010 5814 5245 8457 1501
$$ packed form
7916D544m97J4933n51j0922n488O13j936j687J564j0555k19k830K019J0J6159
7901E157k10n508J0259O778N448L793j1702n891L153J3434J2171M544m5K70o420
7886C5231j1775R477l52j0337j1978j3282m23M080N041R367N760J569m875l792
7872A3711j3520K777O251j316q065k12p81J0695K962L009J002p401r785o866k696
7857a0235M592l704K788R16J2099K050N722R4o766o772j980p001L622N20N48O883
7841C376l087j824P869M806q977l666J5021K812n065J3369k469k0317k2742m378
7827b5272J4629N175J2931j5774N204J9729J1792j8083j5701j39j2460P328J2273
7814A632N943L132n399j229M339k986l645o025j4396N18R106J4824n69L212o956
$$ plain form
7799 1501 -18421 -28912 -29496 -25012 -20457 -5396 3031 -299 -13442 -24438 -20634 -12339 -15933 -16003
7785 -16003 -13902 -18600 -21489 -34744 -32543 -32748 -17708 -3127 776 671 -4138 -4947 -11011 -20728 -21177
7770 -21177 -26250 -29572 -22218 -13015 -13409 -820 2458 4576 6417 2242 -8065 -10279 -5743 -3767
7756 -3767 -6123 -13256 -7260 4144 1279 -2652 -8737 -10770 -3 2991 9353 5061 1641 -5295
7742 -5295 -24596 -13228 -3788 -4764 3159 3429 1586 4495 9632 18880 6682 -5765 -3425 -7130
7728 -7130 -19873 -28177 -21656 -23577 -23609 -26110 -32024 -28337 -14730 -7695 -10690 -5910 -25 4392 8395
7713 8395 8845 -64 1000 11093 7492 -9118 -17413 -11708 -807 5626 -13725 -13147 -20179 -32058
7699 -32058 -33515 -27069 -24282 -27696 -25460 -26108 -14954 -17021 -26809 -29484 -30717 -31046 -18359 -13009 -4089
$$ packed form
7799A501j9922j0491n84M484M555J5061Q427l330j3143j0996L804Q295l594p0
7785a6003K101m698k889j3255K201k05J5040J4581L903j05m809q09o064r717m49
7770b1177n073l322P354R203l94J2589L278K118J841m175j0307k214M536J976
7756c767k356p133N996J1404k865l931o085k033J0767K994O362m292l420o936
7742e295j9301J1368R440r76P923K70j843K909N137R248j2198j2447K340l705
7728g130j2743q304O521j921l2k501n914L687J3607P035k995M780N885M417M003
7713H395M50q909J064J0093l601j6610q295N705J0901O433j9351N78p032j1879
7699c2058j457O446K787l414K236o48J1154k067r788k675j233l29J2687N350Q920
$$ plain form
7684 -4089 -4625 -7917 -4056 7081 5282 -5811 -7402 -2884 -3078 -14393 -25971 -29574 -26667 -22964
7670 -22964 -23621 -23999 -22058 -6037 7088 5429 5392 8497 1916 4308 2325 -17142 -30911 -19983
7656 -19983 -7993 -14345 -4735 -5310 -7631 -4524 -4409 10565 18581 26393 10915 2843 -6076 -11563
7642 -11563 -12478 -13484 -7552 -4674 -17718 -29349 -30844 -19813 -4484 4261 5029 2552 -12097 -15761
7628 -15761 -15945 -27404 -19717 -652 -5148 -15326 -20246 -29348 -18371 -18283 -24153 -23087 -28394 -24875
7614 -24875 -24865 -18227 -13583 -19580 -20691 -23208 -23912 -26601 -16223 -11245 -32586 -40686 -32511 -18266 -12336
7599 -12336 -19317 -23348 -20294 -21136 -12465 -16118 -26308 -13790 -2102 -2811 1422 10922 -3415 -12664
7585 -12664 -11603 -9964 -3863 -3784 -10603 -11570 -19018 -17480 -13477 -18804 -20888 -24396 -23526 -27411 -20970 -15925
$$ packed form
7684d089n36l292L861J1137j799j1093j591M518j94j1315j1578l603K907L703
7670b2964o57l78J941J6021J3125j659l7L105o581K392j983j9467j3769J0928
7656a9983J1990o352R610n75k321L107J15J4974Q016P812j5478q072q919n487
7642a1563r15j006N932K878j3044j1631j495J1031J5329Q745P68k477j4649l664
7628a5761j84j1459P687J9065m496j0178m920r102J0977Q8n870J066n307L519
7614b4875J0O638M644n997j111k517p04k689J0378M978k1341q100Q175J4245N930
7599a2336o981m031L054q42Q671l653j0190J2518J1688p09M233R500j4337r249
7585a2664J061J639O101P9o819r67p448J538M003n327k084l508Q70l885O441N045
$$ plain form
7569 -15925 -10146 -6794 -13524 -22554 -14482 -6581 -10901 -9841 2 4050 2788 0 900 -16897 -21590
7554 -21590 -15947 -16581 -10596 -3465 2235 3266 -921 8067 1026 -6842 -16208 -19030 -20253 -22713 -8603
7539 -8603 4068 1294 592 -1089 -2431 1347 2261 -7017 -7472 -8590 -5001 -664 -1540 3134 -9314
7524 -9314 -6253 -5296 -19506 -21751 -27981 -32479 -18329 -7834 1809 10350 5774 -724 3428 -5531
7510 -5531 -12273 -22162 -16612 -22437 -29465 -25494 -16517 -15353 -16499 -22522 -18598 -16315 -19913 -27709 -38265
7495 -38265 -33735 -35679 -37774 -28924 -9335 -14914 -33370 -29433 -30708 -36501 -43310 -30451 -28627 -32545
7481 -32545 -27190 -19743 -27505 -19369 -19024 -23079 -15568 -8275 -13507 -8728 -7142 -20621 -13104 -5453 -8167
7466 -8167 -16702 -17743 -32672 -36036 -21488 -13335 -4171 6944 1758 -5376 -10621 -23747 -18205 -17852
$$ packed form
7569a5925N779L352o730r030Q072P901m320J060R843M048j262k788R00j7797m693
7554b1590N643o34N985P131N700J031m187Q988p041p868r366k822j223k460J4110
7539h603J2671k774p02j681j342L778R14r278m55j118L589M337q76M674j2448
7524i314L061R57j4210k245o230m498J4150J0495R643Q541m576o498M152q959
7510e531o742r889N550n825p028L971Q977J164j146o023L924K283l598p796j0556
7495c8265M530j944k095Q850J9589n579j8456L937j275n793o809J2859J824l918
7481c2545N355P447p762Q136L45m055P511P293n232M779J586j3479P517P651k714
7466h167q535j041j4929l364J4548Q153R164J1115n186p134n245j3126N542L53
$$ plain form
7452 -17852 -17400 -9449 -13207 -8423 -8293 -15970 -25695 -25723 -10269 -7001 -5855 -9178 -485 -6532 -15870
7437 -15870 -20338 -27022 -33098 -27163 -29289 -34631 -30343 -22990 -27189 -25787 -29540 -31291 -35214 -33263 -20357
7422 -20357 -17858 -19767 -34169 -41837 -28116 -14137 -19955 -16840 -11805 -23697 -25955 -25841 -26649 -24727
7408 -24727 -17745 -13800 -9472 -12621 -10813 -6353 -9447 -9475 -11247 -10872 -10796 -25160 -15843 -28952 -33317
7393 -33317 -30687 -32730 -39918 -41356 -35748 -22443 -15856 1717 7059 -7932 1470 -2607 -14718 -8186
7379 -8186 -5564 -5824 -6700 -10218 -11686 -15375 -21252 -24523 -17956 -15157 -29703 -27568 -31566 -35116 -39686
7364 -39686 -35271 -25544 -14034 -14054 -11183 -6528 -11371 -8831 -8241 -9385 -22359 -24924 -20224 -12295 -14772
7349 -14772 -22632 -29317 -21596 -8449 -5543 -10503 -18190 -22071 -15944 -16395 -18724 -38309 -44871 -40080
$$ packed form
7452a7852M52P951l758M784J30p677r725k8J5454L268J146l323Q693o047r338
7437a5870m468o684o076N935k126n342M288P353m199J402l753j751l923J951J2906
7422b0357K499j909j4402p668J3721J3979n818L115N035j1892k258J14q08J922
7408b4727O982L945M328l149J808M460l094k8j772L75P6j4364R317j3109m365
7393c3317K630k043p188j438N608J3305O587J7573N342j4991R402m077j2111O532
7379h186K622k60q76l518j468l689n877l271O567K799j4546K135l998l550m570
7364c9686M415R727J1510k0K871M655m843K540N90j144j2974k565M700P929k477
7349a4772p860o685P721J3147K906m960p687l881O127m51k329j9585o562M791
$$ plain form
7335 -40080 -30004 -17376 -9045 362 -8434 -22343 -25030 -26322 -28415 -43534 -32368 -9737 -5062
7322 -5062 1373 1036 -13360 -21160 -16113 -20211 -29351 -25014 -36426 -39665 -43410 -37947 -32432 -27650 -25916
7307 -25916 -27634 -19264 -10700 -16716 -20062 -30635 -37252 -28995 -25305 -16296 -7521 6297 4322 -1104
7293 -1104 -10348 -11532 -11754 -21305 -13577 -12974 -26386 -43251 -33700 -26051 -32309 -31220 -18236 -17714 -18315
7278 -18315 -25925 -20692 -5987 -3237 -12198 -6693 -11740 -11348 -10090 -13501 -21086 -14075 -15818 -23087 -29745
7263 -29745 -32112 -34273 -35618 -28434 -27234 -38812 -32019 -26395 -28848 -19433 -13401 -15554 -10894 -3713
7249 -3713 1433 -720 2110 4135 1085 -4136 -9581 -14050 -11887 -8138 -12353 -19098 -16374 -31547 -37143
7234 -37143 -29578 -12857 -5343 -10096 -23402 -33659 -32188 -29200 -23892 -7644 -5152 -3174 -3948 -10178
$$ packed form
7335d0080J0076J2628Q331R407q796j3909k687j292k093j5119J1166K2631M675
7322e062O435l37j4396p800N047m098r140M337j1412l239l745N463N515M782J734
7307b5916j718Q370Q564o016l346j0573o617Q257L690R009Q775J3818j975n426
7293a104r244j184k22r551P728O03j3412j6865R551P649o258J089J2984N22o01
7278a8315p610N233J4705K750q961N505n047L92J258l411p585P011j743p269o658
7263b9745k367k161j345P184J200j1578O793N624k453R415O032k153M660P181
7249c713N146k153K830K025l050n221n445m469K163L749m215o745K724j5173n596
7234c7143P565J6721P514m753j3306j0257J471K988N308J6248K492J978p74o230
$$ plain form
7220 -10178 -22417 -27645 -17638 -3140 -2366 -11058 -15201 -19953 -16082 -10871 1857 4128 -448 2339
7206 2339 6550 -10261 -17332 -19917 -18751 -14256 -15375 -17951 -11794 -14405 -25997 -29522 -26326 -21437
7192 -21437 -23055 -32790 -24839 -14854 -18000 -10353 -3186 -20180 -31803 -44872 -34814 -30531 -27415 -26545
7178 -26545 -28808 -32311 -31617 -35816 -17258 -18067 -30427 -29728 -22019 -9617 -3942 3532 -1653 -7299 -18943
7163 -18943 -6761 -8231 -8535 -3263 -1215 2111 -794 -7807 -15703 -10201 -10075 -4822 -9453 -13655 -20034
7148 -20034 -4964 17127 20888 13374 1464 -7389 1013 5631 1870 2995 5219 -4662 -15074 -13608
7134 -13608 -11844 -11845 282 9050 6501 6160 2787 -22432 -23328 -14906 -17299 -15539 -12419 -11738 -7942 -6438
7118 -6438 -17191 -15556 -8339 -5681 -12794 -26053 -23922 -23326 -28946 -34523 -24141 -25555 -29717 -24132
$$ packed form
7220a0178j2239n228J0007J4498P74q692m143m752L871N211J2728K271m576K787
7206B339M211j6811p071k585J166M495j119k576O157k611j1592l525L196M889
7192b1437j618r735P951R985l146P647P167j6994j1623j3069J0058M283L116Q70
7178b6545k263l503O94m199J8558q09j2360O99P709J2402N675P474n185n646j1644
7163a8943J2182j470l04N272K048L326k905p013p896N502J26N253m631m202o379
7148b0034J5070K2091L761p514j1910q853Q402M618l761J125K224r881j0412J466
7134a3608J764jJ2127Q768k549l41l373k5219q96Q422k393J760L120O81L796J504
7118f438j0753J635P217K658p113j3259K131N96n620n577J0382j414m162N585
$$ plain form
7104 -24132 -28611 -21463 -19285 -7517 -12333 -11173 -16867 -24586 -27040 -35987 -33335 -37859 -37190 -26661
7090 -26661 -32288 -22372 -12221 -12215 -18559 -15354 -11012 -8582 -8398 -6516 -24684 -29703 -18059 -15053 -9190
7075 -9190 -20809 -16401 -12183 -17055 -16439 -16313 -17213 -20008 -13796 -21177 -38154 -45121 -42376 -37923 -30137
7060 -30137 -15410 -24751 -34817 -37971 -21228 -7256 -14332 -16630 -23224 -14283 -5150 -2268 -7861 -4615
7046 -4615 -5772 -6544 -9733 -19157 -25755 -31372 -37346 -29525 -13823 -2636 -15342 -22934 -16432 -8066
7032 -8066 -5628 -8999 -70 2479 -2601 2329 -7437 -14266 1848 6635 3492 -7882 -11201 -25193
7018 -25193 -21822 -20653 -22089 -26943 -24340 -15594 -7452 -16480 -24745 -18010 -17445 -20553 -25463 -32482 -37866
7003 -37866 -28850 -28421 -12722 -10965 -31654 -32836 -26137 -31506 -35727 -46418 -51720 -38553 -27010 -14750
$$ packed form
7104b4132m479P148K178J1768m816J160n694p719k454q947K652m524O69J0529
7090b6661n627R916J0151Oo344L205M342K430J84J882j8168n019J1644L006N863
7075i190j1619M408M218m872O16J26r00k795O212p381j6977o967K745M453P786
7060c0137J4727r341j0066l154J6743J3972p076k298o594Q941R133K882n593L246
7046d615j157p72l189r424o598n617n974P821J5702J1187j2706p592O502Q366
7032h066K438l371Q929K549n080M930r766o829J6114M787l143j1374l319j3992
7018b5193L371J169j436m854K603Q746Q142r028q265O735N65l108m910p019n384
7003c7866R016M29J5699J757k0689j182O699n369m221j0691n302J3167J1543J2260
$$ plain form
6989 -14750 -16376 -23606 -38612 -31369 -15200 -23169 -25284 -39345 -41382 -27936 -25802 -30994 -31970 -21962
6975 -21962 -19517 -8312 -2827 -21311 -28620 -36708 -33269 -40474 -28523 -16691 -23269 -25452 -19038 -25645
6961 -25645 -22811 -17886 -16235 -1578 2248 -149 -4774 -6022 -16519 -26834 -37322 -30000 -27607 -13823
6947 -13823 -1665 6102 8999 1756 -4900 -12467 -19208 -15975 -16460 -11041 -4694 -14865 -13071 5390
6933 5390 6608 610 9588 2863 -14534 -17876 -19690 -15970 -20295 -16722 -15587 -11291 -10036 1296
6919 1296 6690 1651 958 -5698 -22181 -23393 -12422 -6318 -16736 -20049 1415 3768 -14818 -29878
6905 -29878 -30300 -30031 -25882 -30594 -26985 -10696 6886 7839 2568 -7494 -6517 1032 -10811 -11180 -13035
6890 -13035 -15718 -4606 -2812 -15500 -13506 -15257 -23320 -34508 -24020 -14056 -17452 -14993 -7004 -10914
$$ packed form
6989a4750j626p230j5006P243J6169p969k115j4061k037J3446K134n192r76J0008
6975b1962K445J1205N485j8484p309q088L439p205J1951J1832o578k183O414o607
6961b5645K834M925J651J4657L826k397m625j248j0497j0315j0488P322K393J3784
6947a3823J2158P767K897p243o656p567o741L233m85N419O347j0171J794J8461
6933E390J218n998Q978o725j7397l342j814L720m325L573J135M296J255J1332
6919A296N394n039o93o656j6483j212J0971O104j0418l313K1464K353j8586j5060
6905b9878m22K69M149m712L609J6289J7582R53n271j0062R77P549j1843l69j855
6890a3035k683J1112J794j2688J994j751q063j1188J0488R964l396K459P989l910
$$ plain form
6876 -10914 -14419 -27242 -20005 -15179 -25100 -15041 -4730 -5900 -5259 -10727 -18211 -10862 -11355 -8691
6862 -8691 -10580 -3221 -10310 -4092 -627 -15088 -23239 -19281 -27230 -25241 -18789 -7789 -3169 -8230
6848 -8230 -878 1094 3496 -5212 -24322 -27248 -20320 -10250 -1449 649 193 2748 167 -2260 -787
6833 -787 -7098 -3451 -391 -108 -11339 -6188 -1007 -7924 -3450 -17408 -22500 -21466 -32208 -24629 -22918
6818 -22918 -26071 -18982 -2543 379 -5754 -14194 -5641 -1947 -7674 1948 13481 20082 1207 -17767
6804 -17767 -21582 -14765 -24698 -21940 -10520 -6962 -7062 -16145 -23959 -23707 -15736 -18321 -11367 -6138 -13755
6789 -13755 -17724 -11959 -12460 -16450 -22717 -34410 -32499 -15512 4292 9513 377 -6405 -9372 -8029
6775 -8029 -2623 -4970 -8350 -8304 -931 199 -8238 -19102 -22716 -13374 4830 -1066 -5014 5216 10590
$$ packed form
6876a0914l505j2823P237M826r921J0059J0311j170O41n468p484P349m93K664
6862h691j889P359p089O218L465j4461q151L958p949J989O452J1000M620n061
6848h230P352J972K402q708j9110k926O928J0070Q801K098m56K555k581k427J473
6833g87o311L647L060K83j1231N151N181o917M474j3958n092J034j0742P579J711
6818b2918l153P089J6439K922o133q440Q553L694n727R622J1533O601j8875j8974
6804a7767l815O817r933K758J1420L558j00r083p814K52P971k585O954N229p617
6789a3755l969N765n01l990o267j1693J911J6987J9804N221r136o782k967J343
6775h029N406k347l380M6P373J130q437j0864l614R342J8204n896l948J0230N374
$$ plain form
6760 10590 -452 -10654 -13576 -14443 -12350 -8279 -8346 -17202 -28186 -24273 -11350 -5852 -2632 -5730
6746 -5730 -4860 5452 -8800 -22737 -19959 -19426 -24620 -15836 -20000 -24832 -22970 -14389 -23389 -28214 -16412
6731 -16412 -5071 -2405 1441 5438 3725 -2558 6862 20607 20150 11591 1545 3213 -3566 -2799
6717 -2799 -11403 -26698 -10346 -11620 -31312 -31961 -31197 -28151 -20900 -8577 4859 -6762 -6367 -6657
6703 -6657 -10677 -11910 -14524 -3139 -6712 -15940 -16894 -5456 23317 23053 14968 8602 -2914 -10349
6689 -10349 -12525 -6192 -4422 -5601 5649 13204 -3581 -9085 -2546 -18449 -26553 -30304 -18454 -1331
6675 -1331 -1244 -4598 -362 -1163 -8688 -12001 -9535 1291 16498 15761 -1027 -11993 -19013 -41721 -51912
6660 -51912 -33534 -21216 -17960 -12772 -10631 -18981 -17531 -16209 -18513 -13709 -23786 -29784 -32501 -20634
$$ packed form
6760A0590j1042j0202k922q67K093M071o7q856j0984L913J2923N498L220l098
6746e730Q70J0312j4252j3937K778N33n194Q784m164m832J862Q581r000m825J1802
6731a6412J1341K666L846L997j713o283R420J3745m57q559j0046J668o779P67
6717b799q604j5295J6352j274j9692o49P64L046P251J2323J3436j1621L95k90
6703f657m020j233k614J1385l573r228r54J1438K8773k64q085o366j1516p435
6689a0349k176O333J770j179J1250P555j6785n504O539j5903q104l751J1850J7123
6675a331Q7l354M236q01p525l313K466J0826J5207p37j6788j0966p020k2708j0191
6660e1912J8378J2318L256N188K141q350J450J322k304M804j0077n998k717J1867
$$ plain form
6646 -20634 -20625 -27843 -19414 -22864 -25734 -24150 -33378 -25493 -18308 -16847 -22134 -23811 -28516 -27359 -28387
6631 -28387 -32334 -22347 -11867 -4974 -16666 -18619 -10574 -23928 -22712 -11433 388 142 321 -6838
6617 -6838 -17083 -5459 2830 -2366 -7695 9247 16940 1350 -3298 3043 6709 -8436 -13085 -3776
6603 -3776 2018 4734 -1691 -8104 -9878 -12792 -14218 -17506 -15564 -16109 -18293 -16689 -15261 -22057 -30942
6588 -30942 -24852 -14083 -6308 -3682 -14984 -35761 -30452 -9757 -9353 -4497 -7540 -11727 -7621 -9285
6574 -9285 -8704 -6105 4528 6197 16383 14248 9978 5408 -15524 -14315 -10998 -5904 -9068 -10107
6560 -10107 563 5020 4320 -1292 -7824 -18778 -21996 -18784 -17337 -13474 -13140 -11954 -13759 -20380 -17877
6545 -17877 -14764 -9713 -2893 457 -2291 -4214 23 1752 -7353 -11230 -22094 -17132 -17286 -18444 -18489
$$ packed form
6646b0634Rp218Q429l450k870J584r228P885P185J461n287j677m705J157j028
6631b8387l947R987J0480O893j1692j953Q045j3354J216J1279J1821k46J79p159
6617f838j0245J1624Q289n196n329J6942P693j5590m648O341L666j5145m649R309
6603c776N794K716o425o413j774k914j426l288J942n45k184J604J428o796q885
6588c0942O090J0769P775K626j1302k0777N309K0695M04M856l043m187M106j664
6574i285N81K599J0633J669J0186k135m270m570k0932J209L317N094l164j039
6560a0107J0670M457p00n612o532j0954l218L212J447L863L34J186j805o621K503
6545a7877L113N051O820L350k748j923M237J729r105l877j0864M962j54j158m5
$$ plain form
6530 -18489 -7770 -6037 -9271 -17803 -21997 -16815 -16842 -28295 -19371 -11012 -820 -4489 -19678 -15716
6516 -15716 -5734 -9088 -21579 -9017 2802 -7751 -19134 -14021 8047 17380 14944 846 -11793
6503 -11793 -8027 -4940 -11616 -22567 -15556 7187 4892 3819 622 -11782 -22083 -30658 -27906 -17817
6489 -17817 -10684 -3403 12314 11734 4035 -703 -448 -5713 -6061 -1797 2626 7756 12322 7857 8628
6474 8628 5616 -1185 -6859 -4964 -9947 -14960 -13483 -12230 -17528 -17974 -27292 -23912 -25747 -34352 -54559
6459 -54559 -40096 -17841 -14231 -17362 -6798 -5819 -7666 -9655 -10274 -2428 -3781 -1584 -19111 -41376
6445 -41376 -37004 -32489 -24170 -30763 -19716 -22983 -34775 -20144 -8630 -10136 -18466 -15913 -18511 -22467
6431 -22467 -27965 -29318 -19167 -11229 -13384 -7129 1449 2449 -2705 -12038 5198 12896 -981 -10037
$$ packed form
6530a8489J0719J733l234q532m194N182k7j1453Q924Q359J0192l669j5189L962
6516a5716R982l354j2491J2562J1819j0553j1383N113K2068R333k436j4098j2639
6503a1793L766L087o676j0951P011K2743k295j073l197j2404j0301q575K752J0089
6489a7817P133P281J5717n80p699m738K55n265l48M264M423N130M566m465P71
6474H628l012o801n674J895m983n013J477J253n298m46r318L380j835q605k0207
6459e4559J4463K2255L610l131J0564R79j847j989o19P846j353K197j7527k2265
6445d1376M372M515Q319o593J1047l267j1792J4631J1514j506q330K553k598l956
6431b2467n498j353J0151P938k155O255Q578J000n154r333J7236P698j3877r056
$$ plain form
6417 -10037 1087 16436 11338 11400 6641 -321 -3091 2482 -198 2179 -11407 -11976 -6280 -17912
6403 -17912 -19609 -22029 -30131 -30834 -29388 -18150 -14845 -17259 -10919 -3547 -2819 11941 20402 13541 6658
6388 6658 -2729 -17119 -24302 -9354 -9131 201 4231 17553 28139 29101 15195 21066 4110 -6887
6374 -6887 -2776 253 5067 124 -6114 -2871 -8435 -3912 -3360 -2507 -9472 -12011 -11114 -21494 -16697
6359 -16697 -8613 -18827 -26606 -27981 -21477 -13940 -1014 6173 -2818 -175 3529 -2559 -10670 -14934
6345 -14934 -13093 -14295 -12871 -18126 -19113 -13925 -19960 -14748 -10958 -17780 -22838 -9764 235 -7111 -3826
6330 -3826 4629 4663 -38 -14729 -21253 -17688 -17246 -15665 -18269 -24545 -25815 -20848 -13838 -3391 -16257
6315 -16257 -26741 -19583 -9763 -14278 -17450 1674 12550 13436 7122 10240 16370 15523 17272 1216
$$ packed form
6417a0037J1124J5349n098O2m759o962k770N573k680K377j3586n69N696j1632
6403a7912j697k420q102p03J446J1238L305k414O340P372P28J4760Q461o861o883
6388F658r387j4390p183J4948K23R332M030J3322J0586R62j3906N871j6956j0997
6374f887M111L029M814m943o238L243n564M523N52Q53o965k539Q97j0380M797
6359a6697Q084j0214p779j375O504P537J2926P187q991K643L704o088q111m264
6345a4934J841j202J424n255r87N188o035N212L790o822n058J3074R999p346L285
6330c826Q455L4m701j4691o524L565M42J581k604o276j270M967P010J0447j2866
6315a6257j0484P158R820m515l172J9124J0876Q86o314L118O130q47J749j6056
$$ plain form
6301 1216 -6910 -12301 -12082 -22662 -28968 -23811 -23478 -18977 -14219 -17836 -16087 -9147 -7482 -8484 -11788
6286 -11788 -8372 -216 -1583 -10414 -20681 -29222 -22007 -5643 -11089 -8119 -8129 1959 392 -2424
6272 -2424 7216 16379 11714 7495 9870 6393 2626 -2057 4609 9448 13435 6487 -8391 -9839 -9503
6257 -9503 -23622 -12343 -962 48 -12086 -16923 -6397 -11357 -12773 -3111 10845 8211 6738
6244 6738 3152 -2447 -15716 -16405 -17490 303 2260 -3387 -1620 -5066 -6032 -19917 -16407 -17190 -18975
6229 -18975 -18573 -15632 -14373 -12524 -11134 -9185 -6074 -15140 -15601 -5158 -2546 -1348 1532 10702 19888
6214 19888 20473 13367 10181 15028 9671 5648 -6068 -1540 796 5482 3351 652 -5749 -10995 -18259
6199 -18259 -30324 -20600 -14180 -4725 1126 8340 9406 -8651 -17758 -13070 -10084 -1082 -7184 -25251
$$ packed form
6301A216q126n391K19j0580o306N157L33M501M758l617J749O940J665j002l304
6286a1788L416Q156j367q831j0267q541P215J6364n446K970j0J0088j567k816
6272b424R640R163m665m219K375l477l767m683O666M839L987o948j4878j448L36
6257i503j4119J1279J1381J010j2134m837J0526m960j416R662J3956k634j473
6244F738l586n599j3269o89j085J7793J957n647J767l446r66j3885L510p83j785
6229a8975M02K941J259J849J390J949L111r066m61J0443K612J198K880R170R186
6214A9888N85p106l186M847n357m023j1716M528K336M686k131k699o401n246p264
6199a8259j2065R724O420R455N851P214J066j8057r107M688K986R002o102j8067
$$ plain form
6185 -25251 -21931 -4515 -2563 -17528 -12024 6942 -5420 -21007 -15823 -15203 -10975 -13496 -4442 5673
6171 5673 14389 10623 -2923 3545 7183 8350 -3608 150 2762 -6584 -6849 -11592 -24225 -33876
6157 -33876 -27505 -26241 -7671 -308 -3534 853 8315 -3496 -12434 -8115 -17033 -19337 -21251 -16680
6143 -16680 -4679 -5539 -2426 10966 12323 12401 7190 5158 17788 15428 -690 -1017 3187 -2155 -12715
6128 -12715 -10617 -2858 837 7917 13197 19689 15694 -5123 -6285 -2237 -11947 -11078 -12175 -1525
6114 -1525 6064 -1916 -5813 -4623 -6298 -3802 -6424 -3264 -1275 -9627 -9897 -13782 -10259 -6996 -8590
6099 -8590 -19458 -24542 -10352 3993 -11202 -12584 -9552 -2538 2070 6968 13272 6496 13084 2132
6085 2132 752 6971 -651 -4867 -9616 -2340 -2166 -7345 -24140 -23006 -15630 -18798 -17167 -22744 -25901
$$ packed form
6185b5251L320J7416J952j4965N504J8966j2362j5587N184O20M228k521R054J0115
6171E673Q716l766j3546O468L638J167j1958L758K612r346k65m743j2633r651
6157c3876O371J264J8570P363l226M387P462j1811q938M319q918k304j914M571
6143a6680J2001q60L113J3392J357P8n211k032J2630k360j6118l27M204n342j0560
6128a2715K098P759L695P080N280O492l995k0817j162M048r710Q69j097J0650
6114a525P589p980l897J190j675K496k622L160J989q352k70l885L523L263j594
6099h590j0868n084J4190J4345j5195j382L032P014M608M898O304o776O588j0952
6085B132j380O219p622m216m749P276J74n179j6795J134P376l168J631n577l157
$$ plain form
6070 -25901 -21178 -24775 -23117 -20273 -27666 -13637 -8357 -22115 -24174 -16466 -2100 -10050 -13523 -2104
6056 -2104 10800 2172 -2766 -6121 -11329 -18762 -23210 -22122 -18855 -11489 6078 3633 3128 5904 11245
6041 11245 12851 11970 4902 5468 -506 -4061 -8221 -11873 -241 4537 1568 2683 -2401 1373 -1655
6026 -1655 -6894 -1410 1431 2869 12366 13415 12527 12360 8635 5660 -3580 -2804 -3275 -1335 3283 7882
6010 7882 4043 -6466 -10928 -9417 -9313 -14680 -12297 -9469 -24468 -30997 -26020 -27719 -31329 -32214 -29911
5995 -29911 -32372 -20594 -10633 -10310 -12347 -29473 -25569 -21466 -13772 1413 8301 -1284 4214 13061
5981 13061 8250 3196 -5874 -3029 1003 4677 -11829 -21412 -16573 -11102 -12000 -3596 777 14141
5967 14141 11432 7700 -621 -14808 -13161 3938 -5480 -4760 -7215 -14490 -16248 -22348 -20262 -10681
$$ packed form
6070b5901M723l597J658K844p393J4029N280j3758k059P708J4366p950l473J1419
6056b104J2904q628m938l355n208p433m448J088L267P366J7567k445n05K776N341
6041A1245J606q81p068N66n974l555m160l652J1632M778k969J115n084L774l028
6026a655n239N484K841J438R497J049q88j67l725k975r240P76m71J940M618M599
6010G882l839j0509m462J511J04n367K383K828j4999o529M977j699l610q85K303
5995b9911k461J1778R961L23k037j7126L904M103P694J5185O888r585N498Q847
5981A3061m811n054r070K845M032L674j6506r583M839N471q98Q404M373J3364
5967A4141k709l732q321j4187J647J7099r418P20k455p275j758o100K086R581
$$ plain form
5953 -10681 2753 3885 -8657 -14166 -11126 -6822 -12592 -2472 -4749 -11514 -10561 -7315 6156 585
5939 585 -3990 -14152 -29118 -22433 -19499 -29648 -22000 -14570 -15132 -28213 -29547 -23048 -19165 -15458
5925 -15458 -14110 -29411 -33988 -22262 -19804 -12955 -7178 -9201 -12162 -13983 -15460 -3786 -5810 -17247
5911 -17247 -17624 -7686 -12143 -8979 -8113 6114 -1626 -7977 -8486 -10194 -13318 -11081 -13090 -3012 -1986
5896 -1986 -5735 -11217 -8516 -7646 -14365 -238 -4354 -14647 -25065 -14728 -2737 -5983 -2318 -6681
5882 -6681 -13025 -6311 -13959 -24209 -28732 -26853 -28301 -25296 -7837 -7818 -20569 -11550 -1615 3190 5943
5867 5943 4097 3113 5120 2022 7957 26513 24222 11448 4747 -4370 -20752 -28479 -13989 -11258
5853 -11258 -21693 -19798 -20324 -12587 -1806 -2704 -6478 12719 -2386 -21381 -23570 -15266 -10558 -9405
$$ packed form
5953a0681J3434J132j2542n509L040M304n770J0120k277o765R53L246J3471n571
5939E85m575j0162j4966O685K934j0149P648P430n62j3081j334O499L883L707
5925a5458J348j5301m577J1726K458O849N777k023k961j821j477J1674k024j1437
5911a7247l77R938m457L164Q66J4227p740o351n09j708l124K237k009J0078J026
5896a986l749n482K701Q70o719J4127m116j0293j0418J0337J1991l246L665m363
5882f681o344O714p648j0250m523J879j448L005J7459J9j2751R019R935M805K753
5867E943j846r84K007l098N935J8556k291j2774o701r117j6382p727J4490K731
5853a1258j0435J895n26P737J0781q98l774J9197j5105j8995k189Q304M708J153
$$ plain form
5839 -9405 -11109 -9769 -17673 -7563 -4926 -8606 -7569 -1130 6488 -14082 -8060 -4359 -3120 -14700
5825 -14700 -10944 -9882 -14028 -15087 -23495 -2615 3402 -233 4907 13451 9058 -4775 -9093 -10748
5811 -10748 -11288 -10752 -14039 -3570 6041 10157 13928 -57 -25576 -18536 -9358 -4889 -6029 -2527
5797 -2527 -8689 -9780 -5439 -5283 -5476 -2414 -1117 -6119 -16484 -11738 -14891 -23998 -21779 -17793 -243
5782 -243 -1120 -5517 -9590 -13501 -9168 -10623 -22249 -17511 -28 396 5999 7139 -912 -1898 4660
5767 4660 -2336 -2 4317 7611 17323 14578 13024 9275 -6520 9247 21757 16822 5665 -6491
5753 -6491 1076 13471 6055 13511 10595 -3211 -17772 -26253 -20326 -18714 -9808 -14626 -4434 3801
5739 3801 2642 -2113 10133 4762 -766 -4437 -1551 1159 3556 4358 5397 12213 6957 -3680 7373
$$ packed form
5839i405j704J340p904J0110K637l680J037O439P618k0570O022L701J239j1580
5825a4700L756J062m146j059q408K0880O017l635N140Q544m393j3833m318j655
5811a0748n40N36l287J0469R611M116L771j3985k5519P040R178M469j140L502
5797b527o162j091M341J56j93L062J297n002j0365M746l153r107K219L986J7550
5782b43q77m397m073l911M333j455j1626M738J7483M24N603J140q051r86O558
5767D660o996K334M319L294R712k745j554l749j5795J5767J2510m935j1157j2156
5753f491P567J2395p416P456k916j3806j4561q481N927J612Q906m818J0192Q235
5739C801j159m755J2246n371n528l671K886K710K397Q02J039O816n256j0637J1053
$$ plain form
5724 7373 292 -13229 -19619 -10976 -10929 -1414 10301 3957 -1216 -2655 -5699 -14762 -10792 -1826 -11713
5709 -11713 -7725 347 -10209 -15513 -6444 -12119 -16216 -7793 -14424 -779 -4397 -6187 -14314 -15444
5695 -15444 -21539 -18735 -11915 -14497 -15524 -13050 -10973 -5253 -7608 -12268 -15766 2236 26381 27783
5681 27783 12581 -484 3929 14949 3400 -4947 -37 -4374 -19559 -22111 -23351 -15325 -7309
5668 -7309 -9633 -1581 -15185 -10180 476 -3960 -7840 -16882 -22234 -20304 -14907 -15128 -2464 -8469
5654 -8469 733 12006 9101 12543 12716 4980 -7953 -1557 157 8565 3386 -3737 1104 -975 -12649
5639 -12649 -16652 -26976 -26783 -12239 -4821 -12286 -9362 -4385 -2292 -8648 -17244 -16441 -5457 -2555
5625 -2555 2579 9211 11333 4357 -6191 -2317 1908 10642 -4857 -17418 -13387 -915 -621 -6424
$$ packed form
5724G373p081j3521o390Q643M7R515J1715o344n173j439l044r063L970Q966r887
5709a1713L988Q072j0556n304R069n675m097Q423o631J3645l618j790q127j130
5695a5444o095K804O820k582j027K474K077N720k355m660l498J8002K4145J402
5681B7783j5202j3065M413J1020j1549q347M910m337j5185k552j240Q026Q016
5668g309k324Q052j3604N005J0656m436l880r042n352J930N397k21J2664o005
5654h469R202J1273k905L442J73p736j2933O396J714Q408n179p123M841k079j1674
5639a2649m003j0324J93J4544P418p465K924M977K093o356q596Q03J0984K902
5625b555N134O632K122o976j0548L874M225Q734j5499j2561M031J2472K94n803
$$ plain form
5611 -6424 -8716 -4059 46 2871 -3065 4011 6801 -3170 -8212 210 12547 11660 2447 -13046 -21341
5596 -21341 -12143 -339 -12764 -11721 -18485 -30136 -23007 -4302 -10753 -18757 -21331 -16112 -15223 -33327
5582 -33327 -24697 -1970 -3696 -14488 -14049 -9488 -3459 -312 -8039 -4286 -5025 -11524 -5975 -3914 -5829
5567 -5829 -9169 -11871 -9639 -4334 3751 4867 6591 3298 -768 3607 -3201 -1256 6573 10870 1018
5552 1018 -7756 -7667 13257 17092 18359 18983 11275 26456 30717 15389 9069 8168 1670 3467 11175
5537 11175 7596 5264 4009 -2216 -20353 -14154 -11185 -8739 -5024 -4070 -6303 -4849 -6263 -11015 -6837
5522 -6837 -5943 -23288 -20863 -5292 3819 -15600 -23953 -11127 2675 837 -9509 -9215 -3785 -1516
5508 -1516 -3820 -7274 2346 -1089 -5984 -429 -2557 2703 21905 24176 3165 9517 16355 21702
$$ packed form
5611f424k292M657M105K825n936P076K790r971n042Q422J2337q87r213j5493q295
5596b1341R198J1804j2425J043o764j1651P129J8705o451q004k574N219Q89j8104
5582c3327Q630K2727j726j0792M39M561O029L147p727L753p39o499N549K061j915
5567e829l340k702K232N305Q085J116J724l293m066M375o808J945P829M297r852
5552A018q774Q9K0924L835J267O24p708J5181M261j5328o320r01o498J797P708
5537A1175l579k332j255o225j8137O199K969K446L715R54k233J454j414m752M178
5522f837Q94j7345K425J5571R111j9419q353J2826J3802j838j0346K94N430K269
5508a516k304l454R620l435m895N555k128N260J9202K271k1011O352O838N347
$$ plain form
5494 21702 3673 -5314 -11622 -6919 -13573 -11520 5399 9134 13925 -392 2902 906 -6274 10466
5480 10466 20432 10474 5178 10316 12324 12725 8165 13792 20388 19736 8922 3670 9993 12719 13945
5465 13945 2300 -4891 -4731 -1628 1883 4699 75 -15161 -21569 -17354 -20322 -25732 -24376 -24316 -19369
5450 -19369 -14930 -11975 -19909 -26695 -33040 -28788 -21463 -14110 -13486 -16624 -21821 -32017 -40560 -23103
5436 -23103 -897 5401 2133 39 900 -4099 -6476 2676 3797 4713 -1740 5170 4107 2539 11990
5421 11990 20850 20952 6566 -2873 -17453 -19866 -10191 -9490 -5411 -2813 -9401 -12047 -8754 -12358 -14235
5406 -14235 -4264 -5707 -9275 -10506 -8372 -1833 -110 -6511 -4647 4942 1591 8138 1815 558 11605
5391 11605 11007 979 -3781 624 12290 14543 -6042 -16662 -4502 -14221 -17915 -14158 -9367 -14263
$$ packed form
5494B1702j8029q987o308M703o654K053J6919L735M791j4317L294j996p180J6740
5480A0466R966r958n296N138K008M01m560N627O596o52j0814n252O323K726J226
5465A3945j1645p191J60L103L511K816m624j5236o408M215k968n410J356O0M947
5450a9369M439K955p934o786o345M252P325P353O24l138n197j0196q543J7457
5436b3103K2206O298l268k094Q61m999k377R152J121R16o453O910j063j568R451
5421A1990Q860J02j4386r439j4580k413R675P01M079K598o588k646L293l604j877
5406a4235R971j443l568j231K134O539J723o401J864R589l351O547o323j257J1047
5391A1605n98j0028m760M405J1666K253k0585j0620J2160r719l694L757M791m896
$$ plain form
5377 -14263 -7871 -5435 -13433 -16424 -9219 -4299 -3065 -1764 10631 3883 -2896 -8009 -575 9220
5363 9220 21108 15732 10524 6741 10085 10071 -1426 -9431 -7322 -3878 -6464 -11895 -14246 -7632 -16317
5348 -16317 -22092 -1545 -20749 -27889 -23313 -19069 -15448 -20951 -29465 -24357 -15118 -4733 -8472 -3986
5334 -3986 6319 3053 -6975 -13182 -18810 -6523 3018 -3119 -12483 -7493 -5874 -7115 -9643 -11846
5320 -11846 -11374 -12234 -10357 -14640 -10403 -17550 -18483 -7550 -2755 -1041 -8025 -18556 -20148 -10323 -17453
5305 -17453 -17797 -10188 -19424 -17277 -17814 -20973 -14691 1235 2681 1003 4275 -4191 -9934 -12661 2562
5290 2562 12722 18268 6554 -5462 -9026 -14295 -21368 -23232 -15083 -2297 -17150 -20850 -16354 -24951
5276 -24951 -27306 -20327 -5559 -7829 1236 5734 7003 12052 14132 6087 3041 1117 -3641 -3920 5627
$$ packed form
5377a4263O392K436p998k991P205M920J234J301J2395o748o779n113P434R795
5363I220J1888n376n208l783L344j4j1497q005K109L444k586n431k351O614q685
5348a6317n775K0547j9204p140M576M244L621n503q514N108R239J0385l739M486
5334c986J0305l266j0028o207n628J2287R541o137r364M990J619j241k528k203
5320a1846M72q60J877m283M237p147r33J0933M795J714o984j0531j592R825p130
5305a7453l44P609r236K147n37l159O282J5926J446j678L272q466n743k727J5223
5290B562J0160N546j1714j2016l564n269p073j864Q149J2786j4853l700M496q597
5276b4951k355O979J4768k270R065M498J269N049K080q045l046j924m758k79R547
$$ plain form
5261 5627 -6160 -10490 -6974 -4913 4579 -1597 -3020 9955 9827 15524 12745 4520 -8090 6804
5247 6804 28727 32720 33382 26689 -1907 -15727 6683 8412 -10434 -20626 -13274 441 2549
5234 2549 -711 -9479 -7832 -9182 -19313 -4312 -1728 -11806 -8837 -15471 -24452 -26019 -30485 -18831
5220 -18831 -4847 1309 5692 741 -9053 2827 -4937 -10124 -1509 938 -20283 -15815 -18789 -18331
5206 -18331 -11649 -9256 -10859 -14428 -10785 -6755 -2146 5193 3206 3660 -11543 -2706 -6824 -13614 -1337
5191 -1337 7058 3197 -1990 -4941 1207 -13161 -9120 -8094 5439 14778 11282 -5609 -673 -8115
5177 -8115 -14801 -15694 -16554 -7544 -6086 -12034 -14610 -3302 -3116 -4533 8876 12594 14073 -316 -8402
5162 -8402 -5088 58 3096 13195 -383 -1386 1595 9264 11951 5899 11440 10240 8482 4075
$$ packed form
5261E627j1787m330L516K061R492o176j423J2975j28N697k779q225j2610J4894
5247F804K1923L993O62o693k8596j3820K2410J729j8846j0192P352J3715K108
5234B549l260q768J647j350j0131J5001K584j0078K969o634q981j567m466J1654
5220a8831J3984O156M383m951r794J1880p764n187Q615K447k1221M468k974M58
5206a8331O682K393j603l569L643M030M609P339j987M54j5203Q837m118o790J2277
5191a337Q395l861n187k951O148j4368M041J026J3533R339l496j6891M936p442
5177h115o686q93q60R010J458n948k576J1308J86j417J3409L718J479j4389q086
5162h402L314N146L038J0099j3578j003K981P669K687o052N541j200j758m407
$$ plain form
5148 4075 2459 -5886 807 654 -3133 7046 4143 441 9329 964 498 5772 3127 16574 10497
5133 10497 7612 3496 12924 8739 4952 2327 10535 9982 3465 -1750 -12041 -13320 -9212 4747
5119 4747 15036 14469 13900 12300 5876 -54 -18587 -25883 -12180 -1971 4831 16511 9062 1319
5105 1319 -5440 -9642 -3936 293 -6071 648 8023 6796 -1785 7747 6581 10723 12553 11707 -4263
5090 -4263 -1340 5055 2661 -11289 -11706 -14558 -23269 -14143 -1389 -260 7044 993 -3435 -6372 -18004
5075 -18004 -28005 -22218 -8277 -4261 -20269 -26543 -22706 -17326 -32797 -27623 -11229 -6635 -3058
5062 -3058 2633 -10854 -12600 -13711 -15874 -15490 -21758 -9184 -15241 -10219 8562 -322 -21124 -10488
5048 -10488 5616 10258 4719 9818 12067 -3108 -2593 -13825 -17827 -16085 -13274 -532 -3769 -4898
$$ packed form
5148D075j616q345O693j53l787J0179k903l702Q888q365m66N274k645J3447o077
5133A0497k885m116R428m185l787k625Q208n53o517n215j0291j279M108J3959
5119D747J0289n67n69j600o424n930j8533p296J3703J0209O802J1680p449p743
5105A319o759m202N706M229o364O719P375j227q581R532j166M142J830q46j5970
5090d263K923O395k394j3950m17k852q711R126J2754J129P304o051m428k937j1632
5075a8004j0001N787J3941M016j6008o274L837N380j5471N174J6394M594L577
5062c058N691j3487j746j111k163L84o268J2574o057N022J8781q884k0802J0636
5048a0488J6104M642n539N099K249j5175N15j1232m002J742K811J2742l237j129
$$ plain form
5034 -4898 -4166 3315 17737 20033 14629 5103 -2190 5025 -4734 -14131 -2037 -2282 -18740 -23921 -22496
5019 -22496 -12281 -13349 -8107 -2377 3544 11178 20270 6850 2290 -1318 -1075 345 13717 11244
5005 11244 -5477 -11084 -1466 -922 9663 17521 13308 5108 1082 10598 14982 9419 -2171 -2665
4991 -2665 3174 15558 13115 7009 10657 5653 -5036 -12397 -4318 9692 24792 20320 11772 16569
4977 16569 15944 12718 6454 -1163 -6376 -2301 -6252 -5112 1377 -4390 -5387 1611 -4332 -6765 -7342
4962 -7342 -2475 -3177 3045 2096 4478 -4194 -2731 -1095 1850 10190 5473 5382 6412 20066 26764 21990
4946 21990 12672 15801 22160 21698 15515 8812 4358 11739 32657 21956 2254 2977 14221 2813
4932 2813 637 -3203 6485 21039 19882 13227 17185 23722 24554 11756 7659 11658 18713 9046 3554
$$ packed form
5034d898P32P481J4422K296n404r526p293P215r759r397J2094k45j6458n181J425
5019b2496J0215j068N242N730N921P634R092j3420m560l608K43J420J3372k473
5005A1244j6721n607R618N44J0585P858m213q200m026R516M384n563j1590m94
4991b665N839J2384k443o106L648n004j0689p361Q079J4010J5100m472q548M797
4977A6569o25l226o264p617n213M075l951J140O489n767r97O998n943k433n77
4962g342M867p02O222r49K382q672J463J636K945Q340m717r1J030J3654O698m774
4946B1990r318L129O359m62o183o703m454P381K0918j0701j9702P23J1244j1408
4932B813k176l840R688J4554j157o655L958O537Q32j2798m097L999P055r667n492
$$ plain form
4917 3554 9245 -904 -7403 -5582 -5845 -7605 -13288 -20074 -25272 -6365 5636 10248 21165 17457
4903 17457 2262 3914 3499 2167 7426 446 -7408 -3692 -2498 -16706 -14423 -18092 -21248 -996
4889 -996 15226 -981 -13651 -11806 -11025 -2844 -1131 2962 6235 3016 -219 -9862 -16426 -12869 -9542
4874 -9542 -10153 -10755 -2869 3833 408 -6673 -11785 -10361 -15334 -1809 -3417 4175 -44 -6127 -8566
4859 -8566 -6865 -5419 -5007 -2275 -1813 4887 4928 12167 19101 22488 17950 9355 -1947 -1457 -2852 -11489
4843 -11489 -2957 -798 -825 -5517 -15951 -20867 -25125 -8658 -8614 -128 3921 15141 14262 6473 -12796
4828 -12796 -9345 11299 425 7543 17342 29952 26166 5396 3117 9872 -2776 -6139 -6009 -3875
4814 -3875 -3283 -4757 -9161 -1214 4100 -13055 -22078 -15979 -15963 -7952 8150 6289 7334 6115 -3835
$$ packed form
4917C554N691j0149o499J821k63j760n683o786n198J8907J2001M612J0917l708
4903A7457j5195J652m15j332N259o980p854L716J194j4208K283l669l156K0252
4889i96J6222j6207j2670J845P81Q181J713M093L273l219l235r643o564L557L327
4874i542o11o02P886O702l425p081n112J424m973J3525j608P592m219o083k439
4859h566J701J446M12K732M62O700M1P239O934L387m538q595j1302M90j395q637
4843a1489Q532K159k7m692j0434m916m258J6467M4Q486M049J1220q79p789j9269
4828a2796L451K0644j0874P118R799J2610l786k0770k279O755j2648l363J30K134
4814c875N92j474m404P947N314j7155r023O099J6Q011J6102j861J045j219r950
$$ plain form
4799 -3835 1222 11587 7563 11061 9437 3805 9625 12858 16229 9704 11269 8567 1037 -1562 -5125
4784 -5125 -6142 -5214 -13759 -16604 -18214 -17752 -7354 -5990 -10203 -2501 4415 8587 -1265 -4879 -15813
4769 -15813 -18805 -16640 -15701 -12172 -9739 -15000 -7287 -9246 6293 5453 3666 1336 -4088 2595 -7370
4754 -7370 -13476 -8938 -1771 -9311 -15377 -5951 1068 5364 7518 6131 1990 1139 -1269 1896 7155
4739 7155 -6348 -10036 1750 -3341 6968 1836 10622 12547 910 2493 12007 10221 17349 9800
4725 9800 -3312 -3292 -14870 -7996 -3493 2179 1149 694 9947 -323 -2708 3727 16501 9595 -14541
4710 -14541 -24603 -19580 -13532 -19390 -6746 1378 -8014 -29622 -26246 -12015 -1677 -233 3117
4697 3117 -6959 -18565 -20678 -3608 -533 5415 10458 -729 -10988 -18796 -19753 -11343 -10481 -16265
$$ packed form
4799c835N057J0365m024L498j624n632N820L233L371o525J565k702p530k599l563
4784e125j017R28q545k845j610M62J0398J364m213P702O916M172r852l614j0934
4769a5813k992K165R39L529K433n261P713j959J5539q40j787k330n424O683r965
4754g370o106M538P167p540o066R426P019M296K154j387m141q51k408L165N259
4739G155j3503l688J1786n091J0309n132Q786J925j1637J583R514j786P128p549
4725I800j3112K0j1578O874M503N672j030m55R253j0270k385O435J2774o906k4136
4710a4541j0062N023O048n858J2644Q124r392k1608L376J4231J0338J444L350
4697C117j0076j1606k113J7070L075N948N043j1187j0259p808r57Q410Q62n784
$$ plain form
4683 -16265 -18900 -20812 -231 10878 15753 12675 9524 -3735 -7729 3099 660 2870 3476 -8297
4669 -8297 -3191 17056 18276 13508 10025 1803 13214 27692 22955 13348 5071 -8031 -8958 -11596
4655 -11596 -12183 -1531 1720 1240 -7974 -17515 -6025 -1506 2191 -5643 -17040 -13355 -2248 3489
4641 3489 167 2021 -4719 3447 13415 4439 7015 10868 14191 14713 -4733 -10976 4248 13883 4252
4626 4252 -2295 1126 253 -15760 -9126 372 -8076 -4169 2563 -7343 -1080 9799 3026 10760 1552
4611 1552 -7337 5411 8610 -3864 9988 14242 17200 13632 14773 18420 12837 11206 2879 531
4597 531 7148 14193 6121 7350 -440 -1121 -20299 -27317 -13022 -53 2814 13542 21421 33127
4583 33127 29127 13706 18431 15100 8836 9402 4127 4679 -12791 -26511 -33093 -29506 -17145 -8565
$$ packed form
4683a6265k635j912K0581J1109M875l078l151j3259l994J0828k439K210O06j1773
4669h297N106K0247J220m768l483q222J1411J4478m737r607q277j3102r27k638
4655a1596n87J0652L251m80r214r541J1490M519L697p834j1397L685J1107N737
4641C489l322J854o740Q166R968q976K576L853L323N22j9446o243J5224R635r631
4626D252o547L421q73j6013O634R498q448L907O732r906O263J0879o773P734r208
4611A552q889J2748L199j2474J3852M254K958l568J141L647n583j631q327k348
4597E31O617P045q072J229p790o81j9178p018J4295J2969K867J0728P879J1706
4583C3127m000j5421M725l331o264N66n275N52j7470j3720o582L587J2361Q580
$$ plain form
4569 -8565 -1211 3315 -2650 -2081 -626 -6954 -9970 -18789 -21387 -11475 -458 6431 8889 8208 9039
4554 9039 22222 19739 7678 13356 8930 5029 4051 2701 1624 9387 -4230 -3261 10791 9147
4540 9147 3609 9095 6352 -6949 -15190 -14898 -6106 -4703 -5288 -1176 -1020 -14156 -14869 8814 19873
4525 19873 3776 8470 23947 22100 16481 12306 1889 1430 3509 -2925 2984 -3745 -7957 -1317
4511 -1317 2698 13289 12665 8438 10604 12369 20180 22023 17284 11632 -722 2018 7040 15605 22506
4496 22506 28433 28865 27556 12626 8784 2058 9716 18051 14235 4704 -2379 -4230 9420 13145
4482 13145 17719 18630 12808 17575 22172 8954 5756 8866 23301 21896 2189 5800 10597 14341
4468 14341 22404 27509 17933 18729 18873 11010 12064 7765 11036 28039 17752 10356 8741 -11077
$$ packed form
4569h565P354M526n965N69J455o328l016q819k598R912J1017O889K458o81Q31
4554I039J3183k483j2061N678m426l901r78j350j077P763j3617R69J4052j644
4540I147n538N486k743j3301q241K92Q792J403n85M112J56j3136p13K3683J1059
4525A9873j6097M694J5477j847n619m175j0417m59K079o434N909o729m212O640
4511a317M015J0591o24m227K166J765P811J843m739n652j2354K740N022Q565O901
4496B2506N927M32j309j4930l842o726P658Q335l816r531p083j851J3650L725
4482A3145M574R11n822M767M597j3218l198L110J4435j405j9707L611M797L744
4468A4341Q063N105r576P96J44p863J054m299L271J7003j0287p396j615j9818
$$ plain form
4454 -11077 -21223 -17512 -12945 -5674 -3844 5450 11565 10198 -9281 -5249 2456 -3181 7936 9435
4440 9435 2882 6059 9189 17766 26286 25659 10419 -313 -3700 1766 9297 12576 12717 6635 1672
4425 1672 -2898 -4046 -5507 5883 15174 17758 27282 13290 4580 6285 3310 8157 16251 15835 4937
4410 4937 -7169 -19652 -31086 -31108 -21620 -6375 -2886 -794 -1885 -3762 -23257 -13130 8370 51
4396 51 -1610 2877 3069 3313 4117 1721 9097 13431 448 1016 6212 7894 14781 7896 -8147 -5715
4380 -5715 -11493 -21631 -17853 -16795 -19307 -14414 -6172 6869 641 -126 5317 8155 3987 5681 -7593
4365 -7593 -6553 -1280 1821 -1443 -11971 -3789 355 -7710 -2782 -2209 421 17053 20531 10686 -2291
4350 -2291 -4025 -727 9347 8888 -366 -14 -1956 -6814 -4655 -5513 12895 31362 29846 15243 12281
$$ packed form
4454a1077j0146L711M567P271J830R294O115j367j9479M032P705n637J1117J499
4440I435o553L177L130Q577Q520o27j5240j0732l387N466P531L279J41o082m963
4425A672m570j148j461J1390R291K584R524j3992q710J705k975M847Q094m16j0898
4410D937j2106j2483j1434k2R488J5245L489K092j091j877j9495J0127K1500q319
4396E1j661M487J92K44Q04k396P376M334j2983N68N196J682O887o885j6043K432
4380e715n778j0138L778J058k512M893Q242J3041o228p67N443K838m168J694j3274
4365g593J040N273L101l264j0528Q182M144q065M928N73K630J6632L478r845j2977
4350b291j734L298J0074m59r254L52j942m858K159q58J8408J8467j516j4603k962
$$ plain form
4335 12281 -4421 -5230 226 49 2355 13257 7189 -761 -3384 -14227 -15821 -19988 -15195 1116
4321 1116 4709 11313 33808 36299 30472 28615 18701 15150 20050 10093 19023 9756 5841 -1506 -7114
4306 -7114 257 4080 3472 5919 8682 10744 3003 -6659 -13306 -17929 -7872 4658 5024 2396 -2965
4291 -2965 -1424 4359 9458 5211 9496 18702 21889 19303 17628 20051 13905 17924 23961 23619 12698
4276 12698 2282 -3343 2743 3091 -6420 -12224 -25735 -17434 4776 23096 14981 19547 19381 15888
4262 15888 15293 16739 4371 -13665 -15098 7917 8265 7724 9280 -3528 7178 3785 -3380 -921
4248 -921 -5213 -8841 -7058 4536 21774 15211 5107 -13802 -10490 -73 3541 4527 2893 6830
4234 6830 14369 1590 3894 6982 -1867 -7518 -1934 3777 3224 6193 14424 30064 36048 15571
$$ packed form
4335A2281j6702q09N456j77K306J0902o068p950k623j0843j594m167M793J6311
4321A116L593O604K2495K491n827j857r914l551M900r957Q930r267l915p347n608
4306g114P371L823o08K447K763K062p741r662o647m623J0057J2530L66k628n361
4291b965J541N783N099m247M285R206L187k586j675K423o146M019O037l42j0921
4276A2698j0416n625O086L48r511n804j3511Q301K2210J8320q115M566j66l493
4262A5888n95J446j2368j8036j433K3015L48n41J556j2808J0706l393p165K459
4248i21m292l628J783J1594J7238o563j0104j8909L312J0417L614R86j634L937
4234F830P539j2779K304L088q849n651N584N711n53K969Q231J5640N984k0477
$$ plain form
4220 15571 -8109 -11789 -12652 -10388 -14485 -16177 -12679 -16659 -10725 -7623 6676 6032 6345 10116 1943
4205 1943 -8297 -10541 -3732 7681 18845 17230 28149 13096 4611 10350 17329 24091 13882
4192 13882 4926 -287 -8325 -8470 1098 9645 -1995 -14260 -19591 -18809 -11407 -958 4527 2528
4178 2528 6974 13612 8430 -1978 1493 10265 14052 12495 6928 -9078 -6154 1226 -3620 -533
4164 -533 10271 22130 24329 18962 9424 -1854 -2900 12435 29849 11536 -9748 -13349 2564
4151 2564 14667 5223 -1612 5039 8753 3487 -3655 -16645 -10571 -6137 -8280 -1529 -6377 -5680 -6660
4136 -6660 4482 11372 -2080 -11846 4716 21952 22849 12640 -15026 -22296 -11585 -4280 2763
4123 2763 -2116 8118 78 -19640 -17646 -3723 8277 4879 6292 10986 10467 12867 25493 8302
$$ packed form
4220A5571k3680l680q63K264m097j692L498l980N934L102J4299o44L13L771q173
4205A943j0240k244O809J1413J1164j615J0919j5053q485N739O979O762j0209
4192A3882q956n213q038j45R568Q547j1640j2265n331P82P402J0449N485j999
4178B528M446O638n182j0408L471Q772L787j557n567j6006K924P380m846L087
4164e33J0804J1859K199n367r538j1278j046J5335J7414j8313k1284l601J5913
4151B564J2103r444o835O651L714n266p142j2990O074M434k143O751m848O97r80
4136f660J1142O890j3452r766J6562J7236Q97j0209k7666p270J0711P305P043
4123B763m879J0234q040j9718J994J3923J2000l398J413M694n19K400J2626j7191
$$ plain form
4109 8302 9839 14964 10376 1595 8097 17021 14964 -5945 -15290 -6183 577 1457 6378 -2173 -242
4094 -242 8627 6288 -4206 -15253 -15708 -19288 -14066 -15847 -13571 -9330 -7113 2146 557 -4722 548
4079 548 18519 12022 5238 11806 7239 -13900 -18983 -7998 5803 7953 -4389 -13519 -11120 -3469
4065 -3469 8303 15372 19068 11687 1303 3178 -404 -3221 -16159 -16308 -10893 -5767 625 -3260
$$ packed form
4109H302J537N125m588q781O502Q924k057k0909r345R107O760Q80M921q551J931
4094b42Q869k339j0494j1047m55l580N222j781K276M241K217R259j589n279N270
4079E48J7971o497o784O568m567k1139n083J0985J3801K150j2342r130K399P651
4065c469J1772P069L696p381j0384J875l582k817j2938j49N415N126O392l885
$$ [...]
##END NTUPLES=NMR SPECTRUM
##END=
