##TITLE=Analysis number 307385
Compound Code cc 43501
Book Reference 423/24/1
Project Code qc-cat
Chemist Name bruced
##JCAMPDX= 6.0         $$ Bruker NMR JCAMP-DX V2.0
##DATA TYPE= NMR SPECTRUM
##DATA CLASS= NTUPLES
##ORIGIN= Bruker BioSpin GmbH
##OWNER= NMR
$$ XWIN-NMR		Version 3.5
$$ Thu Apr 28 16:17:00 2005 GMT Daylight Time (UT+1h)  MAYBRIDGE\NMR@NMR_250MHZ
##.OBSERVE FREQUENCY= 250.131544655141
##.OBSERVE NUCLEUS= ^1H
##.ACQUISITION MODE= SIMULTANEOUS (DQD)
##.ACQUISITION SCHEME= undefined
##.AVERAGES= 16
##.DIGITISER RES= 18
##SPECTROMETER/DATA SYSTEM= dpx250
##.PULSE SEQUENCE= zg30
##.SOLVENT NAME= DMSO
##.SHIFT REFERENCE= (INTERNAL, DMSO, 0, 16.522)
##AUDIT TRAIL= $$ (NUMBER, WHEN, WHO, WHERE, WHAT)
$$ ##TITLE= Audit trail, XWIN-NMR		Version 3.5
$$ ##JCAMPDX= 5.01
$$ ##ORIGIN= Bruker BioSpin GmbH
$$ ##OWNER= NMR
$$ C:\u/data/dgb/nmr/ADRS/2530/pdata/1/auditp.txt
$$ ##AUDIT TRAIL=  $$ (NUMBER, WHEN, WHO, WHERE, WHAT)
(   1,<2005-04-28 16:16:41.63 +100>,<MAYBRIDGE\NMR>,<NMR_250MHZ>,
      <created by zg, POWCHK disabled, PULCHK disabled
       configuration hash MD5:
       62 19 C7 07 E1 42 D1 B7 37 6C 3D D0 77 39 F9 E6
       data hash MD5: 64K
       9C 51 C9 4A D0 89 E8 BF A3 DF 60 F8 13 10 C6 9E>)
(   2,<2005-04-28 16:16:52.88 +100>,<MAYBRIDGE\NMR>,<NMR_250MHZ>,
      <Start of raw data processing
       ef LB = 0.3 FT_mod = 6 PKNL = 1 SI = 32K 
       data hash MD5: 32K
       DF 9B A8 23 63 76 CE B7 EC 14 0F B2 0D 1D B7 7B>)
(   3,<2005-04-28 16:16:54.73 +100>,<MAYBRIDGE\NMR>,<NMR_250MHZ>,
      <apk 
       data hash MD5: 32K
       37 8C 45 87 FC E3 2E B1 12 F3 AA EE 4F 02 B4 9B>)
(   4,<2005-04-28 16:16:55.42 +100>,<MAYBRIDGE\NMR>,<NMR_250MHZ>,
      <abs ABSG = 5 
       data hash MD5: 32K
       17 3F 64 2A D7 43 F0 FD E0 2E 4A 06 EE 32 9E 81>)
$$ ##END=
$$ 
$$ hash MD5
$$ D1 6B FD BE 96 1F 43 09 3F 96 DA B8 18 89 69 24
##$RELAX= 
##$RELAX= 
##$RELAX= 
##$RELAX= 
##$RELAX= 
##$RELAX= 
##$RELAX= 
$$ Bruker specific parameters
$$ --------------------------
##$DU= <C:\u>
##$EXPNO= 2530
##$NAME= <ADRS>
##$PROCNO= 1
##$TYPE= <nmr>
##$USER= <dgb>
##$AMP= (0..31)
100 100 100 100 100 100 100 100 100 100 100 100 100 100 100 100 100 100 
100 100 100 100 100 100 100 100 100 100 100 100 100 100 
##$AQSEQ= 0
##$AQ_mod= 3
##$AUNM= <au_zg>
##$AUTOPOS= <56 >
##$BF1= 250.13
##$BF2= 250.13
##$BF3= 250.13
##$BF4= 250.13
##$BF5= 500.13
##$BF6= 500.13
##$BF7= 500.13
##$BF8= 500.13
##$BYTORDA= 1
##$CFDGTYP= 0
##$CFRGTYP= 5
##$CHEMSTR= <none>
##$CNST= (0..31)
1 1 145 1 1 1 1 1 1 1 1 1 1 1 1 1 1 1 1 1 1 1 1 1 1 1 1 1 1 1 1 1 
##$CPDPRG= <>
##$CPDPRG1= <>
##$CPDPRG2= <>
##$CPDPRG3= <>
##$CPDPRG4= <mlev>
##$CPDPRG5= <mlev>
##$CPDPRG6= <mlev>
##$CPDPRG7= <mlev>
##$CPDPRG8= <mlev>
##$CPDPRGB= <>
##$CPDPRGT= <>
##$D= (0..31)
0 1 0 0 0 0 0 0 0 0.06 0 0 0 0 0 0 0.0002 0 0 0 0 0 0 0 0 0 0 0 0 0 0 
0 
##$DATE= 1114701400
##$DBL= (0..7)
120 120 120 120 120 120 120 120 
##$DBP= (0..7)
150 150 150 150 150 150 150 150 
##$DBP07= 0
##$DBPNAM0= <>
##$DBPNAM1= <>
$$ [...]
##$SUBNAM7= <"">
##$SUBNAM8= <"">
##$SUBNAM9= <"">
##$SW= 20.6930455092707
##$SWIBOX= (0..15)
0 0 3 0 0 0 0 0 0 0 0 0 0 0 0 0 
##$SW_h= 5175.983436853
##$TD= 65536
##$TD0= 1
##$TE= 296.16
##$TE2= 300
##$TE3= 300
##$TEG= 300
##$TL= (0..7)
0 120 120 120 120 120 120 120 
##$TP= (0..7)
150 150 150 150 150 150 150 150 
##$TP07= 0
##$TPNAME0= <>
##$TPNAME1= <>
##$TPNAME2= <>
##$TPNAME3= <>
##$TPNAME4= <>
##$TPNAME5= <>
##$TPNAME6= <>
##$TPNAME7= <>
##$TPOAL= (0..7)
0.5 0.5 0.5 0.5 0.5 0.5 0.5 0.5 
##$TPOFFS= (0..7)
0 0 0 0 0 0 0 0 
##$TUNHIN= 0
##$TUNHOUT= 0
##$TUNXOUT= 0
##$USERA1= <user>
##$USERA2= <user>
##$USERA3= <user>
##$USERA4= <user>
##$USERA5= <user>
##$V9= 5
##$VALIST= <valist>
##$VCLIST= <CCCCCCCCCCCCCCC>
##$VD= 0
##$VDLIST= <DDDDDDDDDDDDDDD>
##$VPLIST= <PPPPPPPPPPPPPPP>
##$VTLIST= <TTTTTTTTTTTTTTT>
##$WBST= 1024
##$WBSW= 4
##$XGAIN= (0..3)
0 0 0 0 
##$XL= 0
##$YL= 0
##$YMAX_a= 408501
##$YMIN_a= -352444
##$ZGOPTNS= <>
##$ZL1= 120
##$ZL2= 120
##$ZL3= 120
##$ZL4= 120
##$ABSF1= 16.522
##$ABSF2= -4.171173
##$ABSG= 5
##$ABSL= 3
##$ALPHA= 0
##$AQORDER= 0
##$ASSFAC= 0
##$ASSFACI= 0
##$ASSFACX= 0
##$ASSWID= 0
##$AUNMP= <proc_1d>
##$AZFE= 0.1
##$AZFW= 0.1
##$BCFW= 0
##$BC_mod= 0
##$BYTORDP= 0
##$COROFFS= 0
##$CY= 12.5
##$DATMOD= 1
##$DC= 0
##$DFILT= <>
##$DTYPP= 0
##$F1P= 14.0000005364418
##$F2P= -0.99999901652339
##$FCOR= 0.5
##$FTSIZE= 32768
##$FT_mod= 6
##$GAMMA= 0
##$GB= 0
##$INTBC= 1
##$INTSCL= 1
##$ISEN= 128
##$LB= 0.3
##$LEV0= 0
##$LPBIN= 0
##$MAXI= 10000
##$MC2= 0
##$MEAN= 0
##$ME_mod= 0
##$MI= 0
##$NCOEF= 0
##$NC_proc= -4
##$NLEV= 6
##$NOISF1= 0
##$NOISF2= 0
##$NSP= 0
##$NTH_PI= 0
##$NZP= 0
##$OFFSET= 16.522
##$PC= 1
##$PHC0= -91.34332
##$PHC1= 16.72326
##$PH_mod= 1
##$PKNL= yes
##$PPARMOD= 0
##$PSCAL= 4
##$PSIGN= 0
##$REVERSE= no
##$SF= 250.13
##$SI= 32768
##$SIGF1= 0
##$SIGF2= 0
##$SINO= 400
##$SIOLD= 32768
##$SREGLST= <1H.DMSO>
##$SSB= 0
##$STSI= 32768
##$STSR= 0
##$SW_p= 5175.98343685301
##$SYMM= 0
##$S_DEV= 0
##$TDeff= 65536
##$TDoff= 0
##$TI= <Analysis number 999999
Compound Code 99
Book Reference 9
Project Code 9>
##$TILT= no
##$TM1= 0
##$TM2= 0
##$TOPLEV= 0
##$USERP1= <user>
##$USERP2= <user>
##$USERP3= <user>
##$USERP4= <user>
##$USERP5= <user>
##$WDW= 1
##$XDIM= 32768
##$YMAX_p= 391912481
##$YMIN_p= -195200
$$ End of Bruker specific parameters
$$ ---------------------------------
##NTUPLES= NMR SPECTRUM
##VAR_NAME=  FREQUENCY,     SPECTRUM/REAL,   SPECTRUM/IMAG
##SYMBOL=    X,             R,               I
##VAR_TYPE=  INDEPENDENT,   DEPENDENT,       DEPENDENT
##VAR_FORM=  AFFN,          ASDF,            ASDF
##VAR_DIM=   32768,         32768,           32768
##UNITS=     HZ,            ARBITRARY UNITS, ARBITRARY UNITS
##FACTOR=    0.157963299565203, 1,           1
##FIRST=     4132.6476996994, 0,             0
##LAST=      -1043.33573715361, 0,           0
##MIN=       -1043.33573715361, -195200,     0
##MAX=       4132.6476996994, 391912481,     0
$$ Real data points
##PAGE= N=1
##DATA TABLE= (X++(R..R)), XYDATA
$$ [...]
23616c4829J1816K560M7486m029o1952k9454j432J2726j8341j4179J0862j8407
23604i7173J2753M6481j1767J9588o690l6274j3131J1726N636p099q06J8619L0039
23591b8098R391K546p52j9140j4985p584j0559j4516K0188J2058K2723M7705j0511
23578H466m2991l5462q699J1635J5694J2427K4079K6377j0115k2970J4265J6237
23566H943l457K432R886R551j5811j1854j0987K2246m215j9927k6232J2542M8306
23553B1423L886J64j2253P620J3489m256M363l3630m0773k277j0188L050J6228
23540c3154j9513L0418J9249j0169L768p484k3908K2112K5005k191j6410J9016
23528F739R641k0198p764m780J7596j7243J1080J4356J0360l863j8226p752j7611
$$ y = [-34829, -23013, -20453, 27033, 23004, -38948, -68402, -69834, -57108, -75449, -89628, -78766, -97173, -84420, -37939, -49706, -30118, -36808, -73082, -86213, -74487, -68851, -75950, -76756, -58137, -28098, -18707, -16161, -16913, -36053, -51038, -58622, -69181, -83697, -63509, -51451, -28728, 18977, 8466, -34525, -69987, -78686, -67051, -51357, -38930, -14851, 11526, 1411, -21559, -7294, 8943, 5486, 7918, 17804, 27355, 11544, -310, -11297, 10949, 6734, -13193, -39425, -26883, 21423, 25309, 25473, 13220, 20840, 34329, 30073, 34436, 806, -39967, -42244, -52432, -49382, -33154, -52667, -22249, -3000, -13169, -9401, -16885, -40793, -18681, 6324, 4133, -12277, 6739, 16380, -3818, -11582, -16362, 1234, -16009, -4929, 9427, 19787, 15924, -2302, -10054, -27665]
23515b7665q450J8642N3600L536j3677l4479J875j1201k7341K9128J5867r575
23503i740N065J0827j744j1177M297M360K533J3989o671l1642k6995j7646P562
23490e6982M9130J5602N390J9403K4273m9690k9866k1735J5456j1617j0896j5369
23478f6901J499K7835L3911M744r388l5353J4864J8121J6250O013O091L2444n031
23465D5099j2016O472J520P640K4606k0811p1422p808r354j0159O621l777k5465
23452f8854J3204K8915O812j1530K5957J8946j8735J6071j4605q814j8430j7762
23440d8825J069L7371R482J3320L5702j5767l4662l9377O723K2821l777k2370
23428c8290J431J0231N563j9444L4652l937P92J1047J6282k605j9808k793j3444
$$ y = [-27665, -36115, -17473, 36127, 39663, 25986, -8493, -6618, -17819, -45160, -16032, -165, -9740, -4675, 6152, 4408, -6769, -2472, 1888, 4421, 18410, 11739, -19903, -46898, -64544, -56982, -7852, 7750, 13140, 32543, 56816, 7126, -22740, -44475, -29019, -40636, -51532, -66901, -65402, -37567, -3656, 1088, -8300, -43653, -28789, -10668, 5582, 11595, 17686, 50130, 45099, 33083, 39555, 41075, 48715, 73321, 52510, -18912, -26720, -36074, -46233, -39612, -43389, -68854, -55650, -26735, -19923, -31453, -5496, 13450, -5285, 10786, -3819, -12633, -31063, -48825, -47756, -10385, -903, 12417, 48119, 32352, -2310, -41687, -34964, -12143, -15920, -38290, -36859, -26628, -21065, -40509, -5857, -9794, -9002, 2045, 18327, 15722, -4086, -6879, -20323]
23415b0323j1386K5450N1820R427j2106q2282o0276n08M5984K3240n566Q311j7871
23402d6086M047L9214L0138j5949m3187m6972J1110K313k2128J8696L2915J7783
23390a8106J2552P287Q059K4902J4811l697O860l2894q376J9206L156j1333j3221
23377I206Q135J5646J6608j0392k4763l7810j0294K4007m942r470L2473k8345
23365a9941J9469P356j5817k6893j6009j2215L0754K3387j0230K7012J6058o724
23353A6207j8520n4057k5847K4395L2038R572J1258m535R797l7636j234m057J4444
23340b8175L039M6249K0177k1103k6378n934P172J5725j924L6303O578o1480r399
23327a9150Q024R34L0293Q915j229l464n4301k5973L9841J4437l4865j5903L1594
$$ y = [-20323, -31709, -6259, 45561, 54988, 42882, -39400, -99676, -100184, -54200, -30960, -36526, -28215, -46086, -42039, -2825, 27313, 11364, -31823, -78795, -67685, -65372, -87500, -68804, -35889, -18106, -5554, 1733, 9792, 34694, 49505, 45808, 52668, 19774, 11398, 30604, 33760, 22427, 9206, 17341, 32987, 49595, 39203, 14440, -23370, -33664, -9657, -14599, -24069, 8404, -19941, -472, 6884, -8933, -35826, -51835, -64050, -33296, -9909, -20139, 6873, 22931, 16207, -2313, -56370, -82217, -57822, -25784, -16212, -4954, -9489, 308, -37328, -38562, -42619, -28175, -25136, 21113, 41290, 20187, -6191, -12125, -4953, 10772, 8848, 45151, 51729, -9751, -19150, -11126, -10192, 20101, 29016, 27787, 24323, -29978, -55951, -16110, -1673, -36538, -52441, -20847]
23314b0847L5038O227k0146j6062L2159L5088o873k484J031j5958n6599m5992
23302g5418J571L5495L1085k0126r713P521o108n133M550l4770L7260J6346j719
23289a9159L248K9653J4650r00j4329j9486r370J392m016J7049K3885k5113k7992
23276c0488p591K9581N341k2589m3172k2873l53J1640J6439j6779J2317L5710
23264c2817K923K4178L7630P325j4436j5174j5112l1139l3984k1120K1461N6110
23252a4155m606r970M1430O394J5375j2125k5809J4606M3829J9880l0682l9184
23240D983q632O744J8002l670K3884j6559m6535j5910L9062l918O497L297l2684
23227b5439l6349P898Q160J1251q590k4324K7687n534J1119N1141M395m9872J473
$$ y = [-20847, 14191, 20418, 272, -15790, 16369, 51457, 44584, 42100, 43131, 27173, -29426, -75418, -73847, -38352, -7267, -27393, -37106, -29585, -35693, -40826, -36276, -71046, -33786, -17440, -19159, -15911, 13742, 28392, 27492, 13163, -6323, -15693, -14301, -18317, -1268, 22617, -2496, -30488, -38079, -8498, -3157, -25746, -68918, -91791, -92144, -80504, -64065, -80844, -68527, -32817, -29894, -5716, 31914, 39239, 24803, 9629, -5483, -36622, -70606, -91726, -70265, -14155, -18761, -28731, 12699, 19093, 34468, 22343, -3466, 11140, 54969, 74849, 44167, 4983, -3649, 3095, 21097, 17427, 41311, 24752, -21783, -37693, 1369, -2549, 3948, 7245, -25439, -61788, -53890, -45730, -34479, -43069, -67393, -39706, -45240, -34121, 17020, 21415, -28457, -26984]
23214b6984O879L558J3727J7157K408J2475J4344k5179k3306j0847j0260j4458
23202d0486j6939j3545N812j2599L3688J7852J6870q993n432N525k6201O370K1150
23189a6928k7130q108L680n311j7600L2149L7818J0642j9397p084K6158L6932
23177D5821J564k4134j7932o308j0788J5304R224J2675J0856J8801l6517k9845
23165a1279l1016l0612J9739K9002J7557n708m0469K4655N3933J7527o1384k2921
23153d0976l0550k761M3061N1531k8448j4090J866K9197Q3J5060L9976j9763n2119
23140g933j0539j5084j1895J5646J3854O346j3150L189K785M445M363j7780n66
23127b6319P763l1361J9773L3889p68k6235j8457K541p950p405j5030M330K6056
$$ y = [-26984, -20105, -16547, -2820, 14337, 16745, 29220, 43564, 18385, -4921, -15768, -26028, -40486, -57425, -70970, -65158, -77757, -44069, -26217, -9347, -18340, -23772, -18247, -44448, -38078, -16928, -44058, -52166, -48486, -53797, -71397, -39248, -1430, 9212, -10185, -17269, 8889, 45821, 47385, 23251, 5319, -989, -11777, 3527, 12751, 25426, 36282, 55083, 18566, -11279, -42295, -72907, -53168, -24166, -6609, -12317, -52786, -28131, 25802, 43329, -18055, -40976, -71526, -74287, -31226, 20305, -8143, -22233, -20367, 8830, 8913, 23973, 63949, 44186, -7933, -18472, -33556, -45451, -29805, -15951, -9605, -22755, -19566, -16781, -12336, -7973, -25753, -26319, -18556, -49917, -30144, 3745, 2977, -23258, -41715, -39174, -47124, -54529, -69559, -65229, -39173]
23114c9173K8228m436j9114j9527N82M8319R212l4361p116J3893L9221j5620p266
23101g158K4681q857N700P561l4246P514r139q852l381k278K657J3943j487m267
23087a7609j0376K991L0816K7871N270k4714k2034k0446j2618L1194R380O145
23075E870j9387p348K8868o6j2387K8593r757j3929K3371L1805k6004j3783r856
23062E990m667k3862l8354N2073K713r008r202k5520J7039L5518q443o507J2134
23049i6l374r966j2528J2290L9579J8256j2883j0990L54l746K8968J3518j7015
23036D2367p704L1684j8886k6477l872K5815J6839j9216o8900k7083j3936K2704
23024d6665L1749K2572j13j3907N381M54j0637j4001k955L3942l899o131j2980
$$ y = [-39173, -10945, -15381, -34495, -54022, -53440, -5121, 4091, -30270, -37386, -23493, 15728, 108, -7158, 17523, 8666, 14366, 21927, -12319, -4805, -13944, -22796, -26177, -28455, -25798, -11855, -13342, -17609, -27985, -24994, 5822, 33693, 38963, 14249, -7785, -28231, -40849, -9655, -275, 5870, -13517, -20865, 8003, 7937, -4450, 24143, 14386, 457, 23828, 55633, 29629, 15846, 5990, 1323, -22539, -60893, -8820, -6107, -15115, -24317, -49837, -32798, 2720, -5723, -12230, -96, -3470, -13436, -25964, -13674, 25905, 44161, 31278, 20288, 20642, 16896, 45864, 59382, 42367, 34663, 66347, 47461, 20984, 17112, 42927, 59766, 40550, -28350, -55433, -69369, -46665, -14916, 7656, 7543, -6364, -983, -529, -11166, -25167, -28122, 5820, 1921, -4210, -17190]
23011a7190J5721p983r231n961m304L948l8910k8599K0609P8247q394R014J9208
22998B6175J065q172q689k7682j3685q149J1549L9054J6610m1397J0105M8112
22986D4896J9833j878n8127k562Q347j0842J0041l0840k6480l565K6006k2117
22974d7288k5923J2981j5473J968O2589K1498j5104K524J6104R037k736K2395
22962D2572r615j1390k4988k236J2721j913m440J0175M1322m438J7224k9833l56
22949C4805m7285k611j44P086k174q985j1685J5073K2647J8501K267J3082j1166
22936B9411k7473J0969R476k8046J3378o364L679L3849K0110P323o024l1043J4881
22923D4126j9087O345o021j2661J7877O836n565p367J0022r914k2263K685K344
$$ y = [-17190, -1469, -9452, -18683, -24644, -28948, -25000, -63910, -92509, -71900, 6347, -2047, 6967, 26175, 27240, 19068, 10379, -17303, -30988, -39137, -27588, 11466, 28076, -13321, -3216, 44896, 64729, 62851, 4724, 2162, 10509, -333, 9708, -21132, -47612, -51177, -25171, -47288, -73211, -60230, -75703, -73735, -11146, 10352, -4752, -2228, 13876, 22913, 20177, 42572, 32957, 21567, -3421, -5657, 7064, 5151, 711, 10886, 52208, 47770, 64994, 35161, 34805, -12480, -15091, -15235, -8149, -10323, -19308, -30993, -15920, 6727, 25228, 27495, 40577, 29411, 1938, 12907, 22383, -5663, 7715, 1351, 5030, 38879, 58989, 66312, 60288, 29245, 44126, 25039, 31384, 25363, 12702, 30579, 37415, 31850, 24483, 34505, 24591, 2328, 5013, 7357]
22910G357K0273k3476m3070J1436L870Q315K3107K5350N059j470K0046m1813R071
22897B4055L8491J9995m4143k8533j1365j9825r910P015L625K1663j0887n8293
22885f8112k3659J6477L1413J312l83J7141j736L914L7348K3427m6692n159J7135
22872B426m117J8257j0090k411k898j0775p85R576j8353k9344L501L0389j0403
22859b5027J799K5495m377J0286k3908k7924j6006L1966j3640k0486N2431J0570
22847A179J7010J4405k647j7094q663k5638j0962R920l423n479j7613K6696J4048
22834h261J4409K4374j6100m5397k415K9153l562l303k1360m643K796J614M9372
22821A6677M4332l9071j8085p912l38q207L0746j4822m3311l552J2215J7196J4315
$$ y = [7357, 27630, 4154, -38916, -27480, -23610, -15295, 7812, 33162, 38221, 36751, 56797, 14984, 24055, 62546, 82541, 38398, 9865, -1500, -21325, -31235, -24220, -20595, 1068, -9819, -68112, -91771, -75294, -43881, -42569, -42952, -25811, -27547, -23633, 13715, 37142, -9550, -14709, 2426, -1691, 16566, 6476, 4065, 1167, -9608, -10393, -817, -19170, -48514, -45013, -14624, -25027, -23228, 2267, -2110, 8176, -15732, -43656, -59662, -27696, -41336, -61822, -9391, 1179, 18189, 32594, 29947, 12853, 4190, -21448, -32410, -22490, -25913, -31392, -49005, -22309, -8261, 6148, 30522, 14422, -30975, -33390, -4237, -7799, -11102, -32462, -37105, -34309, -32695, 16677, 61009, 21938, 3853, -4059, -4397, -12604, 18142, 3320, -39991, -43543, -31328, -14132, 183]
22808A83P662R908n541j274L294J8821P90j9326j6113k8200J6252J7389j064k8332
22794b5551k1510j3016l526l5362J4203M9864L6622L9161j1447M32o735J2681
22782C5816k3258l524J9246k762J4279k7217l1268K931J2584j506k509L955J340
22769a893J213k0638o647J0618l21N6028N3258j5580n0543m2615N950J2552q323
22756f941m3308j8365J9717K6994q480L5325k372O891o290p354K1795j7404q02
22743e94J4322M9939O346l3069j4760K2980l4064q277j513j8883J5041K37j4007
22730a6302l9995l0263K8785J8992j423Q540J0678R779r73j2334L0720J8631j0998
22717A3837k0380L8088p542k7522j9981l0037j6653Q507j8386k0028L5716M1772
$$ y = [183, 7845, 17753, 12212, 10938, 14232, 33053, 33843, 14517, -1596, -29796, -13544, 3845, 2781, -25551, -47061, -60077, -63603, -98965, -84762, -34898, 1724, 40885, 29438, 29870, 23135, 35816, 12558, 9034, 28280, 25518, 39797, 12580, -18688, -15757, -3173, -4679, -7188, -3233, -1893, -680, -21318, -27965, -17347, -17668, 38360, 91618, 76038, 25495, -17120, -11170, 1382, -6941, -50249, -68614, -48897, -21903, -30383, 4942, 2570, 9461, 3171, -4183, 17612, 208, -594, 13728, 63667, 70013, 36944, 22184, 45164, 11100, 2823, 1310, -17573, -2532, -2295, -16302, -56297, -86560, -57775, -38783, -40206, -31666, -20988, -11209, -12182, -24516, 6204, 24835, 13837, -6543, 31545, 24003, -3519, -23500, -53537, -70190, -61683, -80069, -100097, -64381, -22609]
22705b2609L8458l877L080k8632p887j8422k7695R797M3230k6L535J9774L428
22692A2154j2184p150j1469k5837k6040p169K0553j529R186J5768j7251m4241
22680i5209K59K9589O440L6260N607l688J583j074R705l2846n148N3263L1460
22667C6201j8476J076k0869Q272K5695K301O072n029k5800K1689k9212k0467L679
22654a4868o318J399J0916o420P444M8659o302j4760j3382L24j5229j3081j8217
22641c9835K434O6689M8655n795k1975k176n8653j186K6898j1774J6681J2323
22629C2286P943j6448r100m588j6364n292L0078K5393J1226l9096j9868K3247
22617A9417p405K981K1899P369k3092l6367O838O785j4948Q12K70o582J5866k0891
$$ y = [-22609, 15849, 11972, 15052, -13580, -21467, -39889, -67584, -57787, -14557, -14583, -11048, 8726, 12154, -30, -7180, -18649, -44486, -70526, -77695, -57142, -58671, -49485, -33717, -50968, -95209, -94950, -65361, -58921, -22661, -17054, -20742, -19159, -20233, -10528, -43374, -48522, 4741, 36201, 17725, 18801, -2068, 6204, 31899, 34200, 40272, 35243, 9443, 31132, 1920, -18547, -14868, -21186, -19787, -8871, -15291, -7847, 40812, 34510, 19750, 6368, 6692, -8537, -21618, -39835, -37401, 29288, 77943, 72148, 50173, 47997, -10656, -11842, 15056, 3282, 19963, 32286, 40229, 23781, 14681, 10093, -6271, -11563, 18515, 43908, 55134, 16038, -3830, 19417, 12012, 14993, 36892, 44261, 21169, -15198, -8360, -1575, -16523, -15711, -15441, -22023, -6157, -27048]
22603b7048n01J7555L4171J1592j3306k9891l1832j6333j5914O708K5009L3669
22591f121M0854l1494l1734J5033Q38K2227M891j0598j7416p505j2899N3816L1037
22578E0929k6019l9201r476L71j5386K9138J9244J1217l8947j0260K1892p96m781
22565a2075M489k3680k5748k04J3927K822L929J1022p490j3930M315K4633j4526
22552c2516j5070K8433M2018K688j2170j0814M066j909K4040m964Q710J5240l2696
22539A5056n3991n563j9578l004M3163O74P311j2295l3020J9737J3611J9061J2428
22526C590l5389l0404m711L4184J8744K4753J3387P07k0554J1836m022m4899l5225
22513f8003j185N5653J6656r402J4017j8047l0325J5398p188K3270J3746J6060
$$ y = [-27048, -27549, -9994, 24177, 35769, 22463, -7428, -39260, -55593, -71507, -64799, -39790, -6121, 34733, 3239, -28495, -13462, -12624, 9603, 14494, 3896, -13520, -21025, -33924, 19892, 50929, 24910, -14291, -23767, -23396, -38782, -9644, 9600, 20817, -18130, -28390, -6498, -7294, -12075, -7586, -31266, -57014, -57218, -43291, -40469, -36540, -25518, -33008, -46938, -42623, -17990, -32516, -47586, -19153, 22865, 25553, 13383, 2569, 6635, 4726, 28766, 23802, 32512, 47752, 15056, -38935, -44498, -64076, -67080, -23917, -23243, -15932, -28227, -61247, -41510, -27899, -8838, 3590, -31799, -62203, -66914, -32730, -13986, 10767, 24154, 24861, 4307, 16143, 12121, -32778, -68003, -69188, -13535, 3121, -6281, 7736, -10311, -40636, -25238, -32426, -9156, 4590, 20650]
22501B0650J1752q820k6602n850n3173P218L0811P792J2318R70L9100K5513m4687
22488A6992j9958l8180p834j4213q704K8613K4160M1006K8822M984R51n2523j6478
22475a2362q539K5892p532J1481K6853j9384n5475K5846K8083q932k1294j3862
22463b9225p654J8451J648J3916m938M216J4911K2846j1272k9900J1022k2830
22451a8809J411K6550J7583K2989j9114m011J7700n608R644j359l5422k7153Q195
22438g404R148j9830L5217L3493m6022k5386M034J7356j1440j6342L455M5279
22426B1558Q101j9342j1085l597k3416n32K5712L8525j0801j8158r572j0546r218
22413b2371R036j9200j8778K7215K8692j1057K5583j2633l9843k1664p702K6840
$$ y = [20650, 32402, 23582, -3020, -8870, -62043, -54825, -24014, -16222, -3904, -2934, 36166, 61679, 16992, -2966, -41146, -48980, -63193, -71897, -43284, -19124, 21882, 50704, 55688, 56639, 4116, -12362, -20901, 4991, -2541, 8940, 35793, 16409, -39066, -13220, 14863, 5931, -15363, -29225, -36879, -18428, -16780, -2864, -7802, -3586, 11325, 34171, 22899, -7001, 4021, -18809, -17398, 9152, 26735, 49724, 30610, 26599, 44299, 38691, 48335, 46976, 11554, -15599, -7404, 1744, -18086, 17131, 50624, 4602, -20784, -16750, 606, -10834, -27176, -23721, 21558, 29659, 10317, -768, -4365, -27781, -28313, -2601, 35924, 25123, 6965, -2607, -13153, -22371, -13335, -32535, -51313, -24098, 4594, -6463, 19120, 6487, -33356, -55020, -62722, -35882]
22401c5882J7749M7648J2524r028j6972J1846j0839j5996P642P416Q833N249j7566
22388A2624J2787m679m408j0773J2967k310o1313K6349K4543Q71n042k4029k6644
22375d9057R154J7853K16o353Q075q883k36P547K6099Q322j7404m3673j1839M2353
22361a7826Q850J672N06k195J0403J6958J8844M62m539m4195p047K7586J0271
22348A9750k1107Q748M2098J0382m5183l3474j0173N326J2j4155K953K4188J8118
22335G483k576j4451l0869n5428m105k4825L6229M8887J84j4747J437J3883K4206
22322a4692L2296Q630r52J5782J4193j5286o7224m9362O688L5795R081K2531j3143
22309a5663j4496j2793J8238J2773o958M84J596K5479M4903n67k8045k7091r070
$$ y = [-35882, -18133, 29515, 42039, 33011, 16039, 27885, 17046, 1050, 8692, 16108, 24941, 30190, 12624, 25411, 20732, 16324, 5551, 18518, 16208, -45105, -18756, 5787, 6658, 1616, -22413, -49057, -39903, -22050, -21834, -28187, -20112, -28995, -29231, -21684, 4415, 12737, -4667, -48340, -60179, -17826, -8976, -7304, -6798, -8993, 1410, 18368, 37212, 37674, 33135, -11060, -18107, 9479, 19750, -1357, 7391, 49489, 59871, 14688, -18786, -28959, -23633, -23621, -37776, -34823, -10635, 7483, 4907, -9544, -40413, -95841, -99946, -124771, -88542, -39655, -39471, -54218, -52781, -38898, -14692, 17604, 26234, 25282, 41064, 55257, 39971, -27253, -76615, -69927, -34132, -25051, -2520, -15663, -30159, -42952, -24714, -11941, -18899, -18415, -16819, 8660, 53563, 52996, 24951, -2140, -11210]
22296a1210M0390K0715k7493m318l0972j2424j1359M3841K4989n119l7294k1038
22284c1292L2132j3292l647K333j5745j5504O80J8898J4241P429k1090O243M683
22271a3931p717O013K1289l922l4704J276J6231j0167J1743K257N146j5636R003
22258a3119K6946n015k2462r92j3063j0310K1137J7074k8863j2706N490j6156
22246e2039J6727P74o371N1417L1246m2430j4037J196n712k2865P826K9094J1035
22233E861k080j5992K3707K5270r889j2068Q568l2424l3247J2984m794M711L7788
22220H395O680m62P376j9122k2042J4899J2092l1094j5874p818L5409J5755J0471
22207A4665l5410j8137J966r066K4599N993K5920K4435j6481j9912q643j9668
$$ y = [-11210, 29180, 49895, 22402, 18084, -12888, -25312, -36671, 7170, 32159, 27040, -10254, -31292, 840, -12452, -16099, -13766, -29511, -45015, -44335, -25437, -11196, -3767, -24857, -18614, -13931, -21648, -15635, 5654, 1732, -32972, -31696, -15465, -25632, -13889, -11632, -6486, -22122, -13119, 13827, 8812, -13650, -14642, -27705, -38015, -16878, 196, -28667, -41373, -35883, -52039, -35312, -34538, -40909, 10508, 41754, -676, -14713, -13517, -19229, -42094, -34268, -5174, 5861, 3781, -12211, 11496, 36766, 26877, 14809, 23377, -9047, -42294, -29310, -34104, -29393, 8395, 15075, 14613, 21989, 2867, -19175, -4276, 7816, -23278, -39152, -46970, -11561, 4194, 14665, -20745, -38882, -36916, -45982, -21383, -15390, 10530, 34965, 18484, -1428, -10071, -29739]
22195b9739J0506J7956K3984j543k3810j4141k8272M0908K1134k2236K812R741
22183G300l2993L0196K4116Q659m8823k7707j2355j4932r206M124j5248J1841
22171g5028Q491r252K6152L6578L9230P720n083l2562m623O966P793j4080l9272
22158d6970k8728J1265J9038M9472J4046q920l2187J521J5976j7018l0625j4230
22146f7360J4724O420N941K3593o859j9366J0695L1816o814L315K0683l5573k0226
22133c9011K9118N5612j7874j5745j1158k2379k0868J3088J3325m572l9095r48
22121f0507K9870K4444j6029j8397K494j9386o387N3852L3854k4995l6168L3722
22109c633K5575l1176j3337J4838O744o022M054o827k4563j5822J2031J9648k1243
$$ y = [-29739, -19233, -1277, 22707, 21164, -2646, -16787, -45059, -4151, 16983, -5253, -2441, 7300, -25693, 4503, 28619, 37278, -11545, -39252, -51607, -66539, -75745, -71621, -86869, -75028, -66537, -75789, -49637, -13059, 26171, 33891, 28808, -3754, -8377, -1411, 6382, -7698, -46970, -75698, -64433, -45395, 4077, 18123, 9203, -22984, -21463, -5487, -22505, -53130, -67360, -52636, -46216, -40275, -16682, -23541, -42907, -32212, -396, -7210, -3895, 16788, -18785, -39011, -9893, 45719, 27845, 12100, 942, -21437, -42305, -29217, -15892, -20464, -59559, -60507, -30637, -6193, -22222, -40619, -38125, -57511, -63898, -10046, 23808, -1187, -37355, -3633, 21942, -9234, -22571, -7733, -989, -7011, -2957, -9784, -34347, -50169, -38138, -18490, -39733]
22096c9733r694N936m078L3776L5006j1548L0614J6322k418l1087l7759N945J5515
22083F797j8456L150K461J1758L0127P000K48k888n2152j2355J1499l2076n201
22070e0088L627R752P771J6320Q405J3829J1837m0486J4785M3186l7368j1066
22058i496j1053J1070K5438M4517q733k5088k6550r869O659R23L964k06K5312
22045B6888k0701K6245K6726j8189l0745l5751l513K1445j7054r15L6407l3917
22033b3074k3943J9748j1868k3655o30K5893J3675q599N217k1684l4623j2046
22021i5589K9493L2150Q78j4535l8369J2523K8872O629L0873q479n942O149L2571
22008A7224L4580k9033q765K7944p99k1594k8477j9673L3011j7234j4785K0103
$$ y = [-39733, -49427, -43491, -47569, -13793, 21213, 9665, 40279, 56601, 54183, 23096, -14663, -8718, 6797, -11659, -8509, -6048, 5710, 35837, 42837, 43085, 40197, -11955, -24310, -12811, -44887, -50088, -46461, -36709, -28938, -12618, -4213, 9616, 21453, -19033, -4248, 38938, 1570, -9496, -20549, -9479, 15959, 60476, 51743, 26655, 105, -9764, -3105, -2182, 1782, 1576, 26888, 6187, 32432, 59158, 40969, 10224, -25527, -29040, -7595, -24649, -25564, 10843, -23074, -47017, -27269, -39137, -62792, -63422, -37529, -23854, -32453, -27236, -48920, -83543, -95589, -66096, -33946, -33068, -47603, -85972, -73449, -44577, -37948, -7075, -15554, -21496, -15347, 17224, 51804, 22771, 14006, 41950, 41151, 19557, -8920, -28593, 4418, -12816, -27601, -7498]
21996g498K9121J7000k1095K095J5484j1972j1558K6212j575J0554l2342j2812
21984A614j7495p779j0025o785J7618J4675J3768j3626P970r209L0743J1228j8662
21971A4035J1142K6486j5557n837k1174k3948j1883l8861N7732J3545j2043j454
21959g817j8245l1271l1326R077K3160M3124r610n108j5940m6296J9379j7695
21947h8568L8461J3528j4234M5j579M920K1037K3336m1729l8656N73O340K4335
21934e2191K4680J4332M991J124O644L7745j2674k6919K4299K2661j4127m3708
21922a3143n446K8424L2176L0167l5299n4188n011m18J102L4418K1250j4449k6378
21909f795Q563Q980N978j3686k4942K1537J5552p835J502o450M991K374k2934
$$ y = [-7498, 21623, 38623, 17528, 19623, 35107, 23135, 11577, 37789, 36214, 46768, 14426, 1614, -15881, -23660, -33685, -40470, -22852, -8177, 5591, -8035, -65, -9274, 21469, 32697, 14035, 25177, 51663, 36106, 30269, 9095, -14853, -26736, -65597, -7865, 5680, -6363, -7817, -26062, -57333, -88659, -79582, -56422, -13298, -22908, -28016, -43956, -90252, -70873, -88568, -50107, -36579, -50813, -50768, -52347, -47427, -26390, -3054, -44783, -83439, -82866, -76526, -52191, -27511, -13179, -8188, -7064, -420, 37325, 24651, -2268, 22031, 44692, 30565, -13143, -18589, 9835, 42011, 72178, 36879, -17309, -22320, -22738, -21636, 12782, 34032, 19583, -6795, 1768, 10748, 16726, 3040, -21902, -365, 15187, 7352, 8854, 2404, 7395, 9769, -13165]
21896a3165k4717M0906l70j758M675j5616j3161Q01L1371m9937l2812L4676M2776
21883C669K3549l2335K8469K5334n0103m2180k6147k8276q054L6508M9581K4884
21871D899L6985K6076j209R990L5513j9982m9296q944J4517k1546K5518l928j2902
21858C5691m6598n925M8278J1247k8816m0218R141K3611j5322l1305J3661K4780
21846a775j4866J393R668K4182n481J1570K180M122j930j2216j2051N40L4754
21833D0090J2476k8471J2819Q776l9460n6380m594L0111K4309K7461j2439n1747
21821c7049j9429M470M176P542J726J5821L1809O971k9689M238R394P84J0928
21808A1692K0677K1387J7522m0302j9662p650J5179J1619L6142r69l9339k042
$$ y = [-13165, -37882, 3024, 2654, 896, 5571, -10045, -23206, -22405, 8966, -40971, -73783, -39107, 3669, 27218, -5117, 23352, 48686, -1417, -43597, -69744, -98020, -106074, -69566, -19985, 4899, 41884, 67960, 66751, 76741, 112254, 92272, 42976, 34032, 48549, 27003, 52521, 48593, 35691, -10907, -16832, 31446, 42693, 13877, -26341, -17200, 6411, -8911, -40216, -26555, -1775, -16641, -15248, -5580, 18602, 13121, 24691, 26871, 30993, 29063, 16847, 4796, 5336, 40090, 52566, 24095, 36914, 45690, 6230, -50150, -54744, -24633, -324, 27137, 14698, -37049, -56478, -52008, -47832, -40290, -38564, -22743, 9066, 16037, -13652, -9414, -20, 764, 11692, 32369, 53756, 71278, 30976, 11314, 3664, 18843, 30462, 66604, 65635, 26296, 24254]
21796B4254K262j557K735j8633j5833K1076L1782k4696j5022l0548j5186P05m063
21783d2724l347j4506j3010J6826M3566M5496j2549l3904k743j0034l8068p636
21771g2633O932Q799L6583L8843J435J4500o355k6256k2443J2534J2951l8257
21759c3367k8203Q822K821j1986J8317N0801j8716k1239R248k0565L293L7174
21747c600L7045N944k4491J8857n192l8163j6786K4289j9801n60J4569M893j9509
21734b2505j7881M9367L3074j5538J7361l3647R56J8294j6900m054m1286l1826
21722f4585J691L4123K314r236K6223n1838K142M4720N1364p253O125j3323p989
21709A4478M426M347m8985m2558j7457J5201J8114J4170K6383L236J9593R700
$$ y = [24254, 26516, 24959, 27694, 9061, -6772, 14304, 46086, 21390, 6368, -24180, -39366, -38661, -42724, -46071, -60577, -73587, -56761, -13195, 32301, 19752, -14152, -16895, -26929, -64997, -72633, -65701, -56902, -20319, 18524, 19959, 34459, 28104, 1848, -20595, -8061, 4890, -33367, -61570, -52748, -49927, -61913, -43596, 7205, -11511, -32750, -23502, -44067, -40774, -3600, 33445, 39389, 14898, 33755, 28563, -9600, -26386, -2097, -21898, -22458, -7889, -2996, -22505, -40386, 8981, 42055, 26517, 43878, 10231, 11187, 29481, 12581, 8527, -32759, -64585, -62894, -28771, -26457, -35693, -9470, -61308, -59166, -14446, 36918, 29665, 35790, 22467, 14478, 18904, 23251, -25734, -68292, -85749, -70548, -52434, -38264, -11881, -8645, 10948, 20648]
21697B0648l6832J2859K2683j5194n951p721m9360o05j032j0895K8183K0266j4846
21684c7797k6938J5893k1046m09o321J4405J2415j4882j6904M7772K2747J840
21672i225M819J4432K3545P618k102l8918K7825M0035J0180l8158o336j9605l1269
21659a7159n5899r54L007J0742j044K6775L6612K5932k5036M38K9056o80j5353
21646A6437j9520J602K8675r443j5769K126O259j0920r583m338r202Q647j2691
21633b7720N833P106L3396j6212k8528m504p295O692q56j7409L2149J9154j2299
21620a0493J4084J2278l8759m8146L0437M5712K2592j1572K6502J8713k133m9211
21608A0004j0632k60k0448r527O3545L2326j9128j4291m9760o0738l082L7129
$$ y = [20648, -16184, -3325, 19358, 4164, -1787, -9508, -58868, -59473, -60505, -71400, -43217, -22951, -37797, -64735, -48842, -69888, -70297, -76618, -62213, -49798, -64680, -81584, -33812, -11065, -9225, -4406, 10026, 33571, 41189, 39087, 169, 27994, 68029, 78209, 40051, 33715, 14110, -17159, -73058, -74012, -71005, -60263, -61307, -34532, 2080, 28012, 2976, 3414, 32470, 31790, 16437, -3083, -1481, 27194, 17751, 1982, 4108, 10367, -553, -10136, -14474, -23676, -15029, -27720, -21887, -14781, 18615, 2403, -26125, -30629, -37924, -31232, -32088, -49497, -17348, 1806, -10493, 3591, 15869, -22890, -71036, -40599, 5113, 27705, 16133, 42635, 61348, 59215, 10004, -628, -888, -21336, -30863, 32682, 65008, 45880, 31589, -18171, -78909, -81991, -44862]
21596d4862j5647j191j8628K794K5282O7456M1415l1991j4099n718j8114j2116
21584b5419q514k6869R876J4389M224J8488J9668k221j0613j7650N390K8114R873
21571A8736l4179k8771J6691K8067r579r224n485M714K6030M259q473J5491P299
21558B5576K3966K4193j6256j7819J6471k0554q241j5447k8168j9579J418L2164
21546b276j8524j6147R134M2981L0226J7502P458l246l1156l3268J1200L8755
21534E2639J379k8231m5714J0415K1270N2232K2912m3570k1435L434J2011k8235
21522I107n2280j8623J0784L9942M2141R515n346j7507j6929Q761L9579N818L590
21509E8552j1886l7752Q903j570m4633j9969m7453J1796J9656J5887L342P994
$$ y = [-44862, -60509, -61700, -80328, -77534, -52252, 15204, 56619, 24628, 10529, 4811, -13303, -25419, -33933, -60802, -50926, -36537, -32313, -13825, 5843, 3622, -6991, -24641, -19251, 8863, 18736, -15443, -44214, -27523, 544, -9035, -18259, -23744, -19030, 7000, 11259, 2786, 18277, 25576, 49542, 73735, 57479, 39660, 56131, 35577, 27336, 11889, -16279, -35858, -34440, -2276, -20800, -36947, -27813, 15168, 45394, 62896, 70354, 67108, 35952, 2684, 13884, 52639, 54018, 25787, -19927, -9512, 11758, 63990, 86902, 43332, 21897, 25331, 37342, 9107, -43173, -61796, -51012, -11070, 31071, 40586, 35240, 17733, 804, 9565, 49144, 54962, 58552, 46666, 8914, 17817, 16247, -28386, -48355, -95808, -84012, -64356, -48469, -45127, -37133]
21497c7133O201q360l0000J34M9376K5997N990K1803l2155l8571OL882K487K4070
21483f273o057l8244J7053L3294m196k1105l4039l599L0562R357j5098M266P764
21470b6315m719J2774j0756L8983L3102m9191m4203J643K9642m87o056J253J0041
21457a4289k3495k9303P437k8690O654K0419P563M3961J7457j3525k7536L0112
21445c235N1815O341p234k9420l4980J9877K8686J7901k7313m44j5465o973j4463
21432a4907n019j9080J535M581J6386o8693m828L2968J2558j3372j2241K6194
21420d3918K7316k3753l816J7238l4412j5199L9760J5323k3811r52J0035J4975
21408b1214J7936J1671P512J6272q274n672j4392R805K3585j5087q193R775K1838
$$ y = [-37133, -30932, -39292, -69292, -69158, -19782, 6215, 12205, 34008, 1853, -36718, -36712, -32830, -30343, -6273, -12330, -50574, -33521, -227, -4423, -25528, -59567, -63166, -32604, -23247, -38345, -34079, -26315, -31034, -18260, -29016, 9967, 43069, -6122, -50325, -48682, -19040, -19527, -25583, -24330, -14289, -37784, -67087, -59650, -88340, -81686, -61267, -53704, -9743, 7714, -5811, -33347, -3235, 48580, 54921, 47687, 18267, -16713, 3164, 31850, 49751, 22438, 21994, 6529, -444, -14907, -19926, -39006, -37471, -32890, -16504, -85197, -90025, -57057, -44499, -57871, -70112, -43918, -16602, -40355, -44171, -26933, -61345, -76544, -36784, -21461, -45272, -46224, -36189, -21214, -3278, 8393, 15905, 32177, 23903, 18231, 3839, 13644, 37229, 22142, 13949, 23724, 45562]
21395D5562O124l8358k1454p466L1183L1030l0397j5518Q546J1450q560l3736
21383b1594n2948J2797M0819P073o723M1917k654k2230Q060J8749m2046k2713
21371d1493J4254M303j348q986K5655m254l0386q146n970N1611K5956j7351j4457
21358a0612l533j8552k1277o315K8745O9908L1955k2464m8119k6040j8945j603
21346d6852K3247l733n986M514R746K382l322L0178K4358R640j056J0796l4290
21333A9622l5085l674O644L8727j7870n666J2759j9693j8309J8731K2900k9425
21321a0339j3555k6889j5695K8393j2089q324M8600l3457O893K5058M1626J1725
21309D1947r536j9121k3833K5188N9346q686k4277l9422n728K5704J096r462K7308
$$ y = [45562, 51686, 13328, -8126, -15592, 15591, 46621, 16224, 706, 9252, 20702, 12142, -21594, -74542, -61745, -20926, -13853, -20576, 21341, 18687, -3543, 4517, 23266, -18780, -41493, -27239, -22936, -24284, -33270, -7615, -11869, -42255, -50401, -56371, -4760, 21196, 3845, -10612, -14145, -32697, -53974, -60289, -31544, 38364, 70319, 47855, -264, -26304, -45249, -46852, -23605, -27338, -33324, -28810, -19064, -16682, -20004, 10174, 34532, 44172, 43116, 53912, 19622, -15463, -19137, -12493, 26234, 8364, 2698, 15457, -4236, -22545, -3814, 19086, -10339, -23894, -50783, -66478, -38085, -50174, -58498, -9898, -43355, -36462, -11404, 30222, 41947, 32411, 13290, -10543, 14645, 73991, 65305, 41028, 1606, -4122, 21582, 22678, 13216, 40524]
21296D0524l66P562o27j9393j3771J8273l1166L472r35l2924J8629j507j9922
21283c2151l4739M590M2832n604n405m623k6544J3838L78m142j3752l306J5295
21270e3333M931Q35J2021P041J3612J4654J6693L841p143J0783J2180k1891j7625
21257c401K8446m269o23J6507L537R952j126j032k1129l1257O33p644q733j0141
21243c0280J835K3090L0792L1608k0295l6388j4670M548l249K4417j6697K390
21231b899p898j3929j4560M451K1842l562O885Q811k1881R500K0671L8679m3430
21218B680M893J2643j5116o940k2890r27J0350p253K3886O6292q99k9433k5020
21205A2266j5127k0641L2242n942l7414j3908J9566K3074j4075r480n994j0464
$$ y = [40524, 40158, 47720, 47093, 27700, 13929, 32202, 1036, 4508, 3573, -29351, -10722, -12229, -32151, -66890, -62300, -19468, -25072, -30477, -35100, -61644, -47806, -47428, -51570, -65322, -68628, -53333, -48402, -47567, -35546, -28505, -14893, -239, 16454, 20295, 13152, 23935, 36115, 14224, -3401, 25045, 20776, 20153, 36660, 40197, 50149, 49023, 47991, 26862, -4395, -3762, -11406, -20139, -30280, -28445, -5355, 25437, 57045, 36750, 362, -14308, -9760, -13009, 11408, -5289, -2899, -10797, -24726, -39286, -34835, -12993, -16555, -9670, -859, -22740, -13240, 7431, 46110, 2680, 7573, 20216, 5100, -1840, -24730, -25657, -15307, -22560, 1326, 67618, 66719, 37286, 12266, -2861, -23502, 8740, 2798, -34616, -48524, -28958, -5884, -19959, -29439, -35433, -45897]
21193d5897j6864L237J0617j0314r594J7573M9769K294k2754r039J9262K5287
21181A3577q958N004k7415j4297m9119J4449J5830k5562L638J7103m011J3413
21169d6348j7492r327K9572M3782K2805J8039J929k3694m9221k1140L0779j0079
21157c0395J0385k258L2705J4264k4870O152l0884j4893K2995K2170P066o23J8614
21144C0428K1372l4456O717K9158j1202k5608J2536p128k6395k9433J4956N4355
21132C5300j9984o975J3426L4618J1976M739K6057J7959n9210l6578l839L1409
21120D8898L099l1481p4330k4139K5411K4669J6290j22J7575k9427j9528O961
21108c6124L5189K6745J0978j8846m4160j5402J8401R765J5041K7250l4582J1273
$$ y = [-45897, -62761, -59524, -48907, -59221, -68815, -51242, -1473, 821, -21933, -30972, -11710, 13577, 4619, 9623, -17792, -32089, -81208, -66759, -50929, -76491, -72853, -55750, -59761, -46348, -63840, -73167, -43595, 187, 22992, 41031, 42960, 19266, -29955, -51095, -20316, -30395, -20010, -22268, 10437, 24701, -169, 5983, -24901, -39794, -16799, 5371, 12437, 11814, 30428, 51800, 17344, 24061, 53219, 42017, 16409, 28945, 21817, -4578, -34011, -19055, 35300, 15316, 8341, 21767, 56385, 68361, 73100, 99157, 117116, 57906, 21328, 17489, 48898, 51997, 20516, -53814, -77953, -52542, -27873, -11583, -11705, 5870, -23557, -43085, -36124, -935, 25810, 36788, 17942, -26218, -41620, -23219, -13454, 1587, 28837, -5745, 5528]
21096E528l102j0623K8682M2998J3611N826l1955l5799l784J369o025J4535K0923
21083D2184k2910p879O660J1855K873m3336l5004j6365K5753J3722J7432Q080
21071C065J9358o619o32K8319q704L095L5988j7821j0536L896J5706K1964R21
21058H8000l480n0273m1645o268K5093k241K399M181P987l9060q896K808N370
21045a6025j3531K0772J4161Q615j1366r292k5809J2786r697K533J3005P930L4507
21032B8589R209k2624m5377P645N9637J3676n1388p4767l0490L4337M6387J3441
21020a1725J4508J6506k4727q753k8575k2103J7649J3890J1296k0211j7573J3918
21008d5900P797j4734J1222J9099l361k8288q535K7780K3215m878K173J2449J7757
$$ y = [5528, 2426, -8197, 20485, 63483, 77094, 82920, 50965, 15166, 11382, 12751, 6726, 21261, 42184, 19274, 11395, 18055, 29910, 32783, -10553, -45557, -61922, -36169, -22447, -5015, 3065, 22423, 15804, 15172, 43491, 34787, 37882, 73870, 56049, 45513, 49409, 65115, 87079, 88000, 84520, 34247, -7398, -13666, 11427, 9186, 11585, 15766, 23753, -15307, -24203, -21395, -16025, -29556, -8784, 5377, 13992, 2626, -6666, -32475, -19689, -29386, -26853, -13848, -5918, 28589, 37798, 15174, -30203, -22558, 37079, 50755, -633, -75400, -105890, -71553, -25166, -11725, 2783, 19289, -5438, -14191, -42766, -64869, -47220, -33330, -22034, -42245, -59818, -45900, -38103, -52837, -41615, -22516, -25877, -54165, -62700, -34920, -11705, -16583, -14410, -1961, 15796]
20995A5796J7573m2174l3610K453K2035j349M320l4361L2708M7674J6696L968
20983E1729K2774l6809l2395k3880j0781J3960J8158q337J1463j9745l0840K3027
20971b1676K3064j6082j0039j2996r436P848K2512K1214j865m1324j2684L8456
20959a3008L620k2046j9368j5290K3755K2979k3462q131J0636j5371J9284J8953
20947a7449j0701Q553J3428J3875J9179j5357L6635k2333l2378J2444J4767m6682
20935b6019r893K5175k0903j131K9219J2780K8449J8308j9099n5628l1655J3804
20923c6593K4870Q349j1702l3645L4073P155J4675K408K3983q833k7776k1246
20911b4282k8798p078J9370P9080K0147Q114O121n7279l9014K407j6821j772K4219
$$ y = [15796, 33369, -8805, -42415, -39962, -17927, -19276, -14956, -49317, -16609, 31065, 47761, 51729, 74503, 37694, 5299, -18581, -29362, -15402, 2756, -5581, 5882, -13863, -44703, -21676, 1388, -14694, -24733, -37729, -47165, -39317, -16805, 4409, 2544, -38780, -51464, -13008, -9388, -31434, -50802, -66092, -42337, -19358, -42820, -50951, -40315, -55686, -36402, -17449, -28150, -19597, -6169, 7706, 26885, 11528, 48163, 25830, -6548, 5896, 20663, -26019, -35912, -10737, -31640, -32771, -3552, 9228, 37677, 55985, 36886, -18742, -50397, -36593, -11723, -3374, -15076, -48721, -14648, -7493, 7182, 9590, 33573, 24740, -3036, -24282, -53080, -60158, -40788, 38292, 58439, 66553, 72674, 15395, -23619, -21212, -38033, -39805, -15586]
20898a5586j9750j751J8676J8618J4445l488j0723N572K393q831p29K1096j8096
20885A846J0139j5861j4151J0742j9212p56K070l034j8689P714q480q142N4604
20872a210j337K0147M782j8948L3455j2245J5858p124m2307k9655K8548p248j5470
20859c2754K7039r515m2146L7877J8562l5016j2689M9512M0992J8598K302j7869
20847D4893p532k144m836k9785l2872q790L4664J3232j7977J8539j187j0193p934
20834a1922q781N267K2802L3267k2937R073J8437j6377j6624j595J9062n267m4060
20821a9655m0843J2124K1834K8953Q283n714k783J8977K6219j4635k2927j3753
20809c920o031K286J5899k9360K6201P382J8173o712j4738J1193k5300j0122J2146
$$ y = [-15586, -35336, -37087, -18411, 207, 14652, 11164, 441, 6013, 8406, -425, -1154, 19942, 1846, 11985, -3876, -18027, -7285, -26497, -27253, -25183, -28217, -46906, -39192, -47672, -55814, -1210, -2547, 17600, 22382, 3434, 36889, 24644, 40502, 33378, -8929, -38584, -10036, -17284, -32754, -5715, -15230, -57376, -19499, -937, -35953, -48642, 870, 41862, 60460, 62762, 44893, 37361, 35217, 30381, 596, -32276, -41066, -6402, 6830, -11147, 7392, 6205, -3988, -11922, -20703, -15436, 7366, 40633, 17696, 26769, 45206, 28829, 12205, 10610, 29672, 24405, -19655, -60498, -48374, -26540, 2413, 10696, 4982, 2199, 21176, 47395, 32760, 9833, -3920, -9951, -7665, 8234, -21126, 5075, 12457, 30630, 23918, 9180, 20373, -4927, -15049, -2903]
20796b903k793J1365J8521J8520o1947k4681N340K6631J5484M9506J538K0794
20784G5375K2265l9296o3573j4620j0578k0776J4270K296K7425P493r734m134
20772a3587M0006R879p687L508j0374J5803o299j0684J0870K4847r366o1158l216
20759a7458K9885J1580J6479p809K3165o427k8436M643Q017R909j8526j292j7925
20746E805l1789j2690k0713J6241L4505m206j4752r96L3572O116j5188l1209J9016
20733a6288J8900k369J2878j4301m9357j5580L8809K6422k0039J7275Q357L6192
20721D0899o752k4137m1973M268L1406K044m1763K5636L5518K6889k6584l1861
20709f410j8349J6871p745k4916k3873k1272j9781L1008K9363j0500l9491R083
$$ y = [-2903, -5696, 5669, 24190, 42710, -19237, -43918, -38578, -11947, 3537, 53043, 54581, 75375, 97640, 58344, -5229, -19849, -30427, -51203, -36933, -34637, -7212, 281, -9453, -13587, 26419, 36298, 28611, 32119, 21745, 37548, 31249, 20565, 31435, 56282, 46916, -14242, -17458, 12427, 24007, 40486, 32677, 55842, 49415, 20979, 25622, 33639, 43548, 25022, 23730, 5805, -25984, -38674, -59387, -43146, -8641, -12847, -27599, -28595, 4977, 11093, -4095, -35304, -16288, 2612, 243, 13121, -1180, -50537, -66117, -27308, -886, -20925, -3650, 4707, 40899, 34147, 10010, -31963, -27695, 3711, 5755, -36008, -10372, 25146, 52035, 25451, -6410, -24759, -7888, -15633, -40549, -64422, -85694, -105475, -74467, -45104, -55604, -95095, -86012]
20697h6012K3327M819k1395K2666N637J729l578L3987J2807j2804p177o613k4302
20684e6909P340n740R795K6725M891j5191O300N499j7067k2522J3229J8551J6103
20671h996M6021k2539K958k1907k3549K38j3600J329L1423J676j5352j1099Q015
20658b5382R466J1268O010N963k9677k5993K3061K56m7421j9193K1803J1123r71
20645e9687K2686j201r863K807o413l1403R569O8645O611j0802j6875o7p171j4121
20631d7285M646M090N426L431N4294n732m8848n885j290J3359Q893O683K2551
20618A4333Q306J6224j961j3689K6525J5830j2132j8146l3394K8834R847m1703
20606a126j1919j2022L9319K3267l7026J6242j3397j7079j1783j8504M746M6537
$$ y = [-86012, -62685, -57866, -79261, -56595, -50958, -49229, -52807, -18820, -6013, -18817, -25994, -32607, -56909, -49569, -55309, -45514, -18789, -13898, -29089, -22789, -17290, -34357, -56879, -43650, -25099, -8996, 37025, 14486, 17444, -4463, -28012, -27774, -41374, -40045, -8622, -6946, -22298, -33397, -25382, -15916, -4648, 1362, 7325, -22352, -48345, -25284, -25028, -72449, -91642, -69839, -58716, -59687, -37001, -38202, -48065, -45258, -51671, -83074, -73505, -4860, 1751, -9051, -25926, -25993, -33164, -47285, -42639, -38549, -33123, -29692, 24602, 18870, -29978, -35863, -37153, -23794, -14901, -8218, 14333, 22639, 38863, 36902, 23213, 49738, 65568, 53436, 35290, 1896, 30730, 40577, -1126, -13045, -25067, 14252, 37519, 493, 16735, 3338, -13741, -25524, -44028, -39282, 7255]
20594G255N798k8439L779K6258j6708l773k5351l3482Q101r263M4971K7105L189
20581I440m187J9711j3523J3079K2842l3933k4496j8744O224K2539l293j0575
20569a4916J3489N936P262j2852j8648J3401o75K6345k2348j8547R102J8606L4297
20556D0452j5525n856j2026J3931j6976l6361r391j7455M274M4633Lj5273K4748
20543h22M5296J0839k2710m556n672j1220K4481j557r010L6824j0620l4958R383
20530B5698j6671k3497K403l306K7594K3601r869j3201n655l69J4908M818l9848
20517a3394m644K19L3105K2845l0955n442M4316j3765k8438m224j6019k2906M1391
20504B089q660J5448J8366J0839q771K3784O189J0436k4112l7470q712J7088j5338
$$ y = [7255, 13053, -15386, -11607, 14651, -2057, -5830, -31181, -64663, -56562, -65825, -20854, 6251, 9440, 5253, 24964, 11441, 24520, 47362, 13429, -11067, -29811, -23587, -1048, -4341, -14916, -1427, 4509, 11771, -1081, -19729, -6328, -7003, 19342, -3006, -21553, -12451, 6155, 40452, 24927, 19071, 7045, 20976, 4000, -32361, -41752, -59207, -54933, -10300, -10297, -25570, -822, 44474, 55313, 32603, 28047, 22375, 11155, 35636, 34079, 25069, 61893, 51273, 16315, 25698, 9027, -14470, -12067, -15373, 12221, 35822, 25953, 12752, 7097, 6728, 21636, 26454, -13394, -18038, -17819, 15286, 38131, 7176, 1734, 46050, 32285, 3847, -377, -16396, -39302, 2089, -6571, 8877, 27243, 38082, 29311, 53095, 59284, 69720, 45608, 8138, -574, 16514, 1176]
20491A176l5202m8877M41L4064M5684K3836q169p486R478l099k1922j2462j37
20478b2675J1764J7326M329k5940K0448M0157J0633j8571J729k331j4751j600
20466B0518m500j763M375J0839K1324m4132N043K7407L392l0331l9161K0080L1286
20453B4377K6350l2333m8809J7436P579K1664k28o532j2506m6589O115J846L7153
20440d477n136K7101L4584Q939q840j9750j8477l3577k0755l3435m724K3254M350
20427e0943J0924J4896J6534k567P228j1259r854j1520l0J1176K7225J3019j3234
20414A595k6469n1535K111J3421L1760L1035P954M37K7591J6819J1635l4033j5909
20401A6412j8007m731j1304k6238L009r448K5187M3253K2086j4818m7044P900
$$ y = [1176, -34026, -82903, -82462, -48398, -2714, 21122, 12953, 5467, 14945, 11846, -10076, -22538, -22675, -10911, 6415, 10744, -15196, 5252, 45409, 56042, 37471, 39200, 36869, 22118, 20518, 16018, 14255, 18630, 29469, 50793, 6661, 11704, 39111, 42503, 12172, -26989, -6909, 24377, 50727, 18394, -30415, -12979, -5400, 16264, 16036, 9504, -3002, -49591, -43476, -41630, -4477, -9613, 17488, 52072, 61011, 52171, 32421, 13944, -19633, -40388, -73823, -78547, -55293, -50943, -40019, -25123, -8589, -11156, -3928, -15187, -25041, -36561, -36591, -25415, 1810, 14829, 1595, -24874, -76409, -74298, -60877, -29117, 1918, 9872, 10309, 37900, 54719, 66354, 32321, 16412, -1595, -6326, -17630, -43868, -40859, -50307, -25120, 18133, 40219, 25401, -21643, -13743]
20389a3743K3811j6583j5525J5151L1211J013O727J0619o633n697R548q812l9789
20376h702j2987Q433m392J3926M2791j0036k3967j699K8172p330l4294j8119K8743
20363E39L7804J661k6534j0375O895K7543P717J7614k3213j6141n0648K791K8377
20350D030Q195j8687j7940K0325L204k448k1868K3567j5436O355K1574k0225j2314
20337b1668Q656q18j6749m279M438K7823K987J2828m766m073m213j7211k1650
20324c8695J8588l320k661k0829J310J0892P465M804m936m569j180l366o833R63
20310d2367k0627o433J0308J7484L0885M255M640J1863K4797q025j3535k6480
20298a3235r085j0411l211k9821k6604K7440N8080J3970k1527J0828J9995m275
$$ y = [-13743, 10068, -6515, -22040, -6889, 24322, 25335, 32062, 42681, 36048, 30351, 39899, 31087, -8702, -21689, -13256, -17648, -3722, 39069, 29033, 5066, 3367, 31539, 24209, -10085, -28204, 539, 38343, 40004, 13470, 3095, 9990, 37533, 45250, 62864, 39651, 23510, -27138, -24347, 4030, 12225, -6462, -24402, -4077, -873, -3321, -25189, -1622, -17058, -10703, 10871, -9354, -21668, -13012, -13830, -30579, -34858, -30420, -2597, 390, 13218, 8452, 4379, 166, -17045, -38695, -20107, -23427, -26088, -46917, -45607, -34715, -27250, -22446, -27382, -31951, -33131, -36497, -43330, -42367, -62994, -69427, -59119, -41635, -10750, -6495, -1855, 10008, 34805, 26780, 13245, -13235, -22320, -32731, -35942, -65763, -92367, -64927, -6847, 7123, -14404, -3576, 16419, 12144]
20286A2144O930K4163Q985j5927l1508k3634K2143J4209j9413j6728j3710P878
20274b4468j5608L3777q451J4575J4209q621J9717k6768j1271K8786k3041o0121
20262f7285Q193j0910K8992O558p439L2388k94j0719O578K7768K7862p316n816
20249B8560j9916k1893j0417l475K3300J3152q256K0907j0013K6761L3297o202
20237F5805k3119m4473j8015L7173K1582O665j7003k1974J2059m4432k3625j1364
20225f0721R859M7224j2237J9658J8328J3685Q031k9336j1028j4242K332J4287
20213E840J0404K2384O20m5375m6272J3671Q99R859R60M3428L2975L392j0341
20200D2444m7592j9264O789j3043l1479L6827J0959R051J7002K8687Q143m4379
$$ y = [12144, 19074, 43237, 52222, 36295, 4787, -18847, 3296, 17505, -1908, -18636, -32346, -24468, -40076, -6299, -14750, -175, 14034, 5413, 25130, -1638, -12909, 15877, -7164, -67285, -59092, -70002, -41010, -34452, -41891, -9503, -9797, -20516, -13938, 13830, 41692, 34376, 28560, 8644, -13249, -23666, -27141, -3841, 9311, 1055, 21962, 11949, 38710, 72007, 65805, 42686, -1787, -19802, 17371, 38953, 45618, 28615, 6641, 18700, -25732, -49357, -60721, -50862, -3638, -15875, 3783, 22111, 35796, 43827, 14491, 3463, -10779, -8447, 5840, 16244, 38628, 39248, -6127, -52399, -38728, -37829, -27970, -27010, 16418, 49393, 52785, 42444, -5148, -24412, -17623, -30666, -62145, -25318, -14359, -5308, 11694, 40381, 48524, 4145]
20188D145L290j8381N534J7499K1525r100l5079j8270K1152J1231J8739j0648
20176A1637J1544K155Q82m1504P833L0030k364j1077j2384M883K1679N167l9887
20163a1406l251J3604J2686k313j6332k2363K1995K6833J8341l7254j4507J2842
20151a125N3423k405k436K325j3784j6628k3176J6310K6587K2458L312J4973m9435
20138C0399l1470k4869m235L0723J763j6748K1613r09L959j2777k7138L2847J9081
20125B2239l2750m486K0488J4207q098J5692J2474l4933j8949J1787p361j1266
20113b0956O308J7040L7480j4501l0751j5839k15m0395k700P629J2763J7533K3564
20100c040J1557K3479K1482j523j3505n377k3956r717P887j8393m0750Q196M553
$$ y = [4145, 7435, -10946, -5412, 12087, 33612, 24512, -10567, -28837, -7685, 3546, 22285, 11637, 23181, 25336, 26218, -15286, -7453, 22577, 20213, 9136, -3248, 1635, 23314, 28481, -11406, -14657, -1053, 11633, 9320, -7012, -29375, -7380, 19453, 37794, 540, -13967, -1125, 52298, 49893, 47457, 49782, 35998, 19370, -3806, 12504, 39091, 61549, 64861, 79834, 30399, -1071, -25940, -30175, 548, 2311, -14437, 7176, 6267, 10226, -2551, -29689, 3158, 22239, -10511, -14997, 5491, 19698, 11600, 27292, 39766, 4833, -14116, -2329, -9690, -20956, -14648, 2392, 39872, 25371, -5380, -21219, -21434, -61829, -64529, -56900, -44137, -26604, -3040, 8517, 31996, 53478, 51955, 38450, 33073, 9117, -600, 7287, -11106, -51856, -43660, -39107]
20087c9107K5942j2650q452N622R924j0459O60L9719K0424L4022K1803j3857m0841
20074C2750j6126M9673K623m3507M986m456J1371p110l3580j8493j4109Q009N8523
20061C0554j0580l9798K1181l2077j4257J1027P787j785m288K1105K3748m71k5067
20048a2921j755J8140K8901q621N718N209k3486N161J2570l2656K8153q78J2617
20035C6152j2362j5284k2257j0679j65L3547L8601r004k9349k2698k6204L214
20023c6488L7844L9626J7521k0934j9810K045j4562Q886J798k9304R111r446m7909
20010f1622K5221K810k4888L3771K2232k9550j9193K1053M7683K1528M263m1057
19998B251m4982J5016Q181L6857p253p494K3774j6218j6168J8878Q972J4763k3557
$$ y = [-39107, -13165, -25815, -34267, -28645, -18721, -29180, -28520, 11199, 31623, 65645, 87448, 73591, 32750, 16624, 66297, 68920, 25413, 30399, 25943, 37314, 30204, -3376, -21869, -35978, -27969, 30554, 19974, -19824, 1357, -30720, -44977, -33950, -26163, -27948, -32236, -11131, 12617, 12146, -12921, -14676, 3464, 32365, 23744, 29462, 34671, 11185, 16346, 28916, -3740, 24413, 23535, 36152, 23790, 8506, -13751, -24430, -24595, 8952, 47553, 38549, 9200, -13498, -39702, -36488, 1356, 40982, 58503, 37569, 17759, 19804, 5242, 14128, 15926, -13378, -4267, -13713, -61622, -36401, -33591, -58479, -24708, -2476, -32026, -51219, -30166, 17517, 39045, 43308, 2251, -42731, -27715, -19534, 17323, 10070, 2576, 26350, 10132, -6036, 12842, 21814, 36577, 13020]
19985A3020N805j5329j0281N744J4373j8983P422J2352k112Q450q356j9149k0743
19972b7787j4027J8873R512q584J3601K2830J0232L1575l3439l6799o437J8134
19960b316r297p986q034N5317j1274l0294j6798K1283M4413K6243k358J0634l5857
19947C3676q034N021j2430k5666K2122l4556m0148l778N891M9305N6566J1006
19935E8975k4251Q3J3154j0600O417J9715j9000k0132j6977P359M60K4314K2033
19922F1550k457m347j7685m1002j477j6207K447J1781J3566J0416l4590L1300
19910A3295L687k511P867J3753K6524M718m5943o5712j1640N590k436m046J0519
19897d6335k936L0278Q998M442l0992j7187K0205j0680k7489K1534M0669K1590
$$ y = [13020, 18825, 3496, -6785, -1041, 13332, -5651, 1771, 14123, 12011, 20461, 12105, -7044, -27787, -41814, -22941, -13429, -22013, -8412, 14418, 24650, 56225, 22786, -14013, -20450, -2316, -11613, -19599, -27633, 27684, 16410, -13884, -30682, -9399, 35014, 61257, 58899, 69533, 33676, 25642, 30663, 18233, -7433, 14689, -19867, -60015, -63793, -57902, -8597, 47969, 58975, 34724, 34807, 47961, 37361, 43778, 63493, 44493, 24361, 7384, 14743, 15203, 39517, 61550, 59093, 54746, 37061, -3941, -5418, -21625, -19178, -7397, 6169, 16585, -18005, 13295, 16982, 14471, 22338, 36091, 62615, 67333, 21390, -44322, -55962, -50372, -52808, -56854, -46335, -49271, -18993, -9995, -5553, -36545, -53732, -33527, -44207, -71696, -50162, -9493, 12097]
19885A2097M814M1200j4108l0895k3660K4792L2069j1455k2183k9078L8446J4673
19873C6712j305M586r002q814j1320j2343K5073J962L6840l5242l1538L669k5121
19860b5843O224N544K8861K7944J6800l1437p6493k2791R380L1786l649L2166
19848a508M0508j710r189J8586j0994J2633n84n0630p0448q192K343J7065J6423
19835d5697J9141l128K8030M311k2801R97J8070K9948L2067k181m1741l6899j3293
19822c3176L3234L2731M2634k768l1099k6547j5949O603r48j2405j8937J8223
19810h404K4800j391R942j3639K3103q821k4968p646j1722k032J7352p688K9294
19797A8180M0384n239k3443l5459k0020J3255J6450l342R061l1093j1975l4388
$$ y = [12097, 16911, 58111, 44003, 13108, -10552, 14240, 46309, 34854, 12671, -16407, 22039, 36712, 35407, 39993, 30991, 22177, 10857, -1486, 23587, 25549, 62389, 27147, -4391, -722, -25843, -19619, -14075, 14786, 42730, 59530, 28093, -48400, -71191, -61811, -30025, -33674, -1508, 39000, 37290, 28101, 46687, 35693, 48326, 47742, -2888, -73336, -81528, -79185, -62120, -45697, -26556, -29684, -1654, 2657, -20144, -19147, -1077, 28871, 60938, 58757, 17016, -19883, -33176, 58, 32789, 75423, 72655, 41556, 15009, -940, 5663, 4715, -7690, -26627, -8404, 16396, 15005, 24947, 11308, 34411, 25590, 622, -7024, -18746, -20778, -3426, -11114, 18180, 58564, 53325, 29882, -5577, -25597, -12342, 4108, 766, 9827, -21266, -33241, -67629]
19785f7629j1957M9167K9045K9210j9582m3683P78m3277l6442O824L6784K4238
19773d6524L851k9867K8068MK6986J4144K4294m057Q698j63j0468L801Q704k1382
19759F089k664J9232j4248J5110N419k8227k0123j3668j2149J3810K2284K0753
19747A1618n693L4071J2114q649J6419r635n884J2647l0921K435J0851J5066L351
19734E7790m4977k0783L4632K8944J7939j0702K1387l000l7269p450k870r080
19722B4561j5807J305m086L712J6115R274j1131k697J4533k167m779p017J5492
19709C7308M4433N173J1645j9283o5160j9415J8660j4439l4980L1368J5867Q631
19697A9808o033k788J3020j5901Q847L4002J9877k8215k5036Q976k7057l1145
$$ y = [-67629, -79586, -30419, -1374, 27836, 8254, -35429, -34651, -77928, -114370, -107546, -70762, -46524, -42673, -72540, -44472, -44468, -17482, -3338, 20956, 16899, 25597, 25434, 14966, 18767, 27471, 6089, 3425, 22657, 8409, 23519, 28938, 711, -19412, -33080, -45229, -31419, -9135, 11618, 5925, 39996, 52110, 43461, 59880, 50245, 44361, 57008, 26087, 28522, 39373, 54439, 57790, 12813, -7970, 26662, 55606, 73545, 62843, 84230, 81230, 43961, 36511, 33641, 24561, 8754, 10059, 5973, 9685, 25800, 35074, 23943, 21246, 35779, 33612, 28833, 21816, 37308, 81741, 86914, 98559, 79276, 14116, -5299, 13361, -1078, -36058, -4690, 11177, 19808, 13775, 10987, 24007, 8106, 16953, 50955, 70832, 42617, 17581, 26557, -500, -31645]
19685c1645J3988J4735L0202Q7J2507L7466J2518k8152p489k0461J6154j3481
19673C6429j8599J797R353k8450J867L2901M553l6747l7784K6001L6772O848N749
19660D0690N315k4334j1559J1462m0201K3303J4837k0485J8893R548j6552K1278
19648C2195j2075P80J7179m290l458K8788j19j6214k863j3514L2603J8115k2370
19635E4757l3650k7227n842k2132j4859L9390J2615J4239J5922J4757K9067p82
19623G6255k2295k3732j6896j7388J884r828J2400L4371R912j042n3250P745J269
19610e95j8904J6273O1842j8517j6177N228l373j8022p200J141M000M0411K3916
19597G0023p975R982p45n919m2843k2387j8538m0003J3296N5349M495o593l2722
$$ y = [-31645, -17657, -2922, 27280, 27367, 39874, 77340, 89858, 61706, 54217, 33756, 49910, 36429, 17830, 19627, 28980, 530, 2397, 35298, 39851, 3104, -34680, -8679, 28093, 34941, 40690, 46005, 21671, 10112, 21574, -18627, 4676, 19513, -972, 17921, 27469, 10917, 32195, 20120, 20900, 38079, 33789, 30331, 59119, 59000, 42786, 39923, 26409, 59012, 77127, 54757, 21107, -6120, -11962, -34094, -48953, -9563, 3052, 17291, 33213, 47970, 77037, 76255, 53960, 30228, 13332, -4056, -2172, -12000, 400, 34771, 44683, 43641, -9609, -1864, -595, -19499, -3226, 58616, 40099, 23922, 29150, 25777, 7755, 555, 1696, 5696, 46107, 70023, 62048, 72030, 71285, 65366, 22523, 136, -18402, -58405, -45109, 10240, 14735, 8142, -24580]
19584b4580K748J6411K5693j1505k5157n729J9976J949j9645l2396K2530N2641
19572B2936k7613l8603N755M3484L7871j3105m349m769P858J2521o270j5270j9615
19559H31M295M958K8128R543p528k8815K0473J2391k5464K8790j1795j4327O194
19546B7674o033K343j9086n466K9158J0177k2026m0458K2586K2085M974J7630
19534D3558j2659k0104J1588J229n231K4581J0366J2874r623k9386l1829K2375
19522A7739J2690j7242l0698J1571J0933j1279j1062M626j1356l8840K3601N2039
19510A2722k0053j6327J4396M2213K5448P068l3916j7109J4462m168m403N966
19498B6299m985j1302k6001L7669K6165J294o300k7681k0610R442N6588L154k9502
$$ y = [-24580, -21832, -5421, 20272, 8767, -16390, -22119, -2143, -194, -19839, -52235, -29705, 22936, -4677, -43280, -37525, 5959, 43830, 30725, 26376, 21607, 29465, 41986, 35716, 20446, 831, 5126, 10084, 38212, 47755, 40227, 11412, 31885, 44276, 18812, 47602, 35807, 21480, 27674, 21641, 23984, 4898, -568, 28590, 38767, 16741, -23717, -1131, 20954, 25928, 43558, 30899, 10795, 22383, 23612, 18381, 42962, 53328, 66202, 56579, 27193, -4636, 17739, 30429, 13187, -17511, -5940, 4993, -6286, -17348, -12722, -24078, -62918, -39317, 12722, -7331, -23658, -9262, 32951, 58399, 65467, 31551, 14442, 28904, 24736, 20333, 26299, 21314, 10012, -15989, 21680, 47845, 49139, 42839, 15158, -5452, 3990, 60578, 63732, 34230]
19485C4230M409K1863K1025J6768J036l8801k6146K1226K3090j787k270j0313
19473F4330j7998j6800M549j7583k3625J3885P588L4083n477k2399R956k2537
19461G972j1390J2761r077J142J1401L505J8384Q878m053J8755J2151k5914N868
19448E0383M411n48J5570J609j2751j0773k6148J6162k0503J0557L2877k1965
19436C8881k0224J525N597J4639o753K0700N5544l6691l3011l6880k615M5152
19424D5864K777J4630K3302n932l6492J1639j7702j713k1483l2811K8394O212
19412A6685l9263k9102K1268P1344K058j5065j1083N444K3372O071L8722J8721
19400A09172n0862l6842m382n5j2815N763L0685L096K7059Q331j168N492m2828
$$ y = [34230, 38639, 60502, 81527, 98295, 99331, 60530, 34384, 55610, 78700, 76913, 74643, 64330, 46332, 29532, 34081, 16498, -7127, 6758, 14346, 48429, 42952, 20553, 30509, 7972, -3418, 9343, 266, 1408, 12809, 16314, 34698, 43576, 39523, 58278, 70429, 44515, 50383, 54794, 54246, 69816, 71425, 58674, 47901, 21753, 37915, 17412, 27969, 60846, 38881, 18657, 20182, 25779, 40418, 33665, 54365, 109909, 73218, 40207, 3327, 712, 45864, 48641, 63271, 86573, 80641, 44149, 55788, 38086, 36373, 14890, -17921, 10473, 16685, -22578, -51680, -30412, 40932, 42990, 27925, 16842, 22286, 45658, 51729, 90451, 109172, 58310, 21468, 17086, 17031, 4216, 9979, 40664, 43760, 70819, 79150, 77982, 83474, 40646]
19387D0646n2922L265K1631J0191m2967j932M3427L7252J8165l855L264j1629
19375F4536J469j0607k9198m6142O115P929K908q887R947L703k317K8293J7061
19362D4810j1585M716J0230Q127j3130j7001r64M9429L2192j1476l4214k1587
19350C9547K6807J1938j0663j0293J462j811J1270L817l8571l9534k272j3663
19338b1966L043k4130K2901L0584N558M551J209L1038Q840J5631K7759O64m1819
19325F3863m86J3035O005J7499L0963k7936k8798r243k051P677L9015Q516j8353
19312I9706l4182o757j3767o046N912P482L5887L2919J5188m3304m1060k2272
19300B9706L4777J3799k4309j6817p329n272L2969K4878K52J4190l716l7175j5791
$$ y = [40646, -12276, -9011, 12620, 22811, -20156, -22088, 21339, 58591, 76756, 72901, 76165, 64536, 66005, 55398, 26200, -19942, -13827, -5898, -2990, -11877, -1930, 1773, -544, 27749, 44810, 33225, 37941, 48171, 56298, 43168, 26167, 25203, 74632, 106824, 95348, 61134, 39547, 66354, 78292, 67629, 57336, 58798, 56987, 68257, 72074, 33503, -6031, -8303, -21966, -18923, -43053, -20152, 10432, 15990, 20541, 21750, 52788, 61628, 77259, 105018, 105682, 63863, 63377, 76412, 82417, 99916, 130879, 102943, 74145, 64902, 62851, 70528, 109543, 118059, 99706, 65524, 58767, 45000, 38954, 44866, 52348, 88235, 121154, 136342, 93038, 51978, 29706, 64483, 78282, 53973, 37156, 29827, 24555, 57524, 82402, 82654, 96844, 93128, 55953, 40162]
19287D0162J6479K7371j6586q762J3605P936k8786j8708R254p295J8565J9420
19275G2655L4045J4240l2822m732k0281K8860p363k5647K4138m448K6171m402
19263A00414m2189k5011J4638M0466q484j3192j3393j3681m310K736j5278l774
19251A8942K3797O486j307J3090j108J2578J7500M550m3179J227k478l882K8536
19238G4752q731j2517j6201k4119j2634N747j6412k0440L1797N3377N2623M0146
19226A47388J2342j5710j4794K616j914p515L592pj7353J5238J0907l1037j2787
19213I0966K184J1114O686j1171k825Q84k478K883J0514m1163j7562K0197K0381
19200I0610K7364n82N265J1449j8147m5468K859k2894k7942J2206K3754l650J3866
$$ y = [40162, 56641, 84012, 67426, 58664, 72269, 80205, 51419, 32711, 41965, 34670, 53235, 72655, 106700, 120940, 88118, 83386, 63105, 91965, 84602, 58955, 83093, 78645, 104816, 100414, 58225, 33214, 47852, 88318, 79834, 66642, 53249, 39568, 35258, 37994, 22716, 18942, 42739, 49225, 47918, 61008, 59900, 72478, 89978, 94528, 51349, 52576, 50098, 46216, 74752, 66021, 53504, 37303, 13184, 550, 6297, -10115, -30555, 1242, 54619, 107242, 147388, 159730, 144020, 129226, 131842, 129928, 122413, 126005, 125998, 108645, 123883, 134790, 103753, 90966, 93150, 104264, 110950, 99779, 96954, 97838, 95360, 98243, 108757, 67594, 50032, 70229, 90610, 117974, 117392, 122657, 134106, 115959, 70491, 73350, 50456, 22514, 34720, 58474, 54824, 68690]
19187F8690K7297K1962L650k7478j6946j6382J443K0811M4821L1769N3481R705
19175B22823R476L952j6728l4088M060L6626J0945M5282N1098J31503K02482K35764
19163I03195K52181J92640J11414p582q3642j05192o1198M6151J33613J69569
19153A551149Q6001n9321j43834j59177j19433k4464M3173J19479J34261K30787
19143A658621J87766M7182q7882j60559j01557o5554R3896J59019J48929l845
19133A876016j49069k64717k69717k19210j37216o6084p0410p8352j9563n8508
19123E43170l6243j6837k6411r655j8974l8916m1094k4713L9825J6140r388R234
19111C86138j0544J1621O582R972M5791N8829N6118L1883K2810M2045N4801k1331
$$ y = [68690, 95987, 117949, 121599, 94121, 77175, 60793, 62236, 83047, 127868, 159637, 213118, 222823, 232299, 236251, 219523, 185435, 189495, 226121, 237066, 282348, 333446, 464949, 667431, 903195, 1155376, 1348016, 1459430, 1451848, 1368206, 1263014, 1201816, 1247967, 1381580, 1551149, 1637150, 1577829, 1433995, 1274818, 1155385, 1130921, 1174094, 1293573, 1427834, 1658621, 1846387, 1893569, 1805687, 1645128, 1543571, 1478017, 1571913, 1730932, 1879861, 1876016, 1726947, 1462230, 1192513, 973303, 836087, 770003, 699593, 621241, 601678, 543170, 506927, 490090, 463679, 454024, 435050, 396134, 355040, 330327, 370152, 386292, 376904, 386138, 375594, 387215, 393797, 403769, 449560, 508389, 564507, 596390, 619200, 661245, 716046, 694715]
19099F94715k5757l5480L5508l0941m9964m9415o3969m4844k9693k0984k6511
19088C52665l042j2344K0023J3744K574M465J5747M5640j1542J5920J8655O458
19076D68963R169J7394O2131M1968K9657L662M7055R102j2610j7881j416m4225
19064F12969k8644j1541J9252l0321p5168n1828J7575l734j5028m471k0554l5868
19052C72639l7115O548K8694m953J7346N7005L4829R4371J4766K1159M2862K974
19040F51125N755N260l320j938Q1970M6639j7320m3125m2006n0831j4033m9090
19028E69086m2561k9540j7738J5749P285M3776K1158Q6822P7952K5683K3106k5929
19016G54849j2755j0897K4648Q114K874j0124l1676p1101p1080r2136m8286p823
$$ y = [694715, 668958, 633478, 668986, 638045, 588081, 538666, 474697, 429853, 400160, 379176, 352665, 349623, 337279, 357302, 371046, 373620, 378085, 393832, 439472, 427930, 443850, 462505, 468963, 478132, 495526, 557657, 599625, 629282, 632944, 679999, 689101, 676491, 658610, 657194, 612969, 584325, 572784, 592036, 561715, 486547, 434719, 452294, 448560, 433532, 429061, 408507, 372639, 335524, 342072, 370766, 365813, 383159, 440164, 474993, 569364, 584130, 605289, 648151, 651125, 656880, 662140, 658820, 656882, 738852, 785491, 768171, 725046, 683040, 632209, 618176, 569086, 526525, 496985, 479247, 494996, 502281, 546057, 567215, 654037, 731989, 757672, 780778, 754849, 742094, 731197, 755845, 763959, 766833, 756709, 725033, 653932, 582852, 490716, 442430, 434607]
19004D34607n7017m3237k0237m4633k3239k2149K6838L2694k729j1089p696j5928
18992B46185k2321k568l1682o099k8l5151K887L5915L8109k9466k6920J1001j7149
18979A62713p1423n8202K0186N0253K9646K3547j3142q399l138l0763l470J8257
18967A16065o411J6373M610J888K9771J1497L592j2748l4842O631j2212k2161
18955A02053j5065j7176l928P018J2040K167n382K9073O718J2020J3700J4918
18943A58156m972K1232J778k0270l3668L661K6111J7429j299k2949k1742k6549
18931I6918J1010O5196J6557l7232l6561o708N407K502p991K7351J4844l0343
18919A20950r531K7248R439R75k4637M427K3811Q41Q719O166k5878o2570J1763
$$ y = [434607, 377590, 334353, 314116, 269483, 246244, 224095, 250933, 283627, 280898, 269809, 262113, 246185, 223864, 221296, 189614, 183515, 183487, 148336, 151223, 187138, 225247, 195781, 168861, 179862, 162713, 91290, 33088, 53274, 103527, 133173, 156720, 143578, 135179, 132041, 101278, 97808, 116065, 109654, 126027, 130637, 132525, 162296, 173793, 177385, 164637, 129795, 136426, 124214, 102053, 86988, 69812, 65884, 72902, 84942, 87109, 81727, 110800, 117518, 129538, 143238, 158156, 153184, 174416, 176194, 155924, 122256, 125917, 152028, 169457, 168158, 145209, 123467, 96918, 107928, 173124, 189681, 152449, 115888, 109180, 114587, 117089, 109098, 136449, 151293, 120950, 111419, 138667, 148106, 149081, 124444, 128871, 152682, 153523, 162242, 168408, 142530, 79960, 91723]
18906I1723J3385J9266j229j8110M1319O645l1264p689L7487m006j7740L9352
18894A69139J2657n46L4699k5695J7526N890r378o970K171k5124J8888K0835j1453
18881B02639n8903j576K3626l527o586K5547j960n955J2439L3406M5574k2610
18869B42114j6734L0542Q840J6371l9194j3874J8172J2649J3252K9198N3175K7005
18857C81516m844o3499o0491m5981j9408L0664k5358j15K1275j5585P713r90r492
18844A95405L090j623J7365J7957j3965K2453K4706M198J3873K1996m1119l1588
18832B32748J405k9338J4006J6153L9010J1295k1499l9280k9248k9061l3188k0434
18820A12569J7680l6885J0223J9319M0760L3964J0730o4319K3691L0817J6165
$$ y = [91723, 105108, 124374, 123145, 105035, 146354, 152999, 121735, 114046, 151533, 147527, 129787, 169139, 181796, 181250, 215949, 190254, 207780, 213670, 204292, 197322, 199493, 174369, 193257, 214092, 202639, 143736, 142160, 165786, 162259, 155673, 181220, 179260, 173305, 185744, 219150, 264724, 242114, 225380, 255922, 264762, 281133, 241939, 228065, 246237, 258886, 272138, 301336, 354511, 381516, 376672, 313173, 252682, 206701, 187293, 217957, 192599, 192484, 213759, 198174, 205887, 204897, 195405, 198495, 196872, 214237, 232194, 218229, 240682, 265388, 269586, 283459, 305455, 264336, 232748, 234153, 204815, 218821, 234974, 273984, 285279, 263780, 224500, 195252, 166191, 133003, 112569, 130249, 93364, 103587, 122906, 163666, 197630, 208360, 144041, 167732, 198549, 214714]
18809B14714K1421n48r978l4486m7037n723L6828L3280J3582k7716l5896j6495
18797A41946p299K0138J5467O876l2287j3765j062j1926m454L1292L3425N5333
18785B33684K54j7653n721K6292J6771l2642j1390J0944M6424O080K7271q443
18773B91871K2352l624K9584k704j9226K0385N8344l663N513K5444R841M406k320
18760D36203J7815K1440r82j6249j9729k4990J1034l757l7024m3887K3119M4328
18748D07321J6609q053J9426O4657J3394L8185K8630N6530R0766Q0089J56986
18737I64540J87374J77713J18560p81j20839j97047j58959j24882p8522j3069
18727G54088j0448j9258l8578r994N394L6586R8464J36355J49272J42953R2325
$$ y = [214714, 236135, 235587, 225609, 191123, 144086, 138363, 175191, 208471, 222053, 194337, 158441, 141946, 134647, 154785, 170252, 177128, 144841, 131076, 130014, 118088, 113634, 144926, 178351, 233684, 233938, 216285, 210564, 236856, 253627, 220985, 209595, 220539, 266963, 273043, 300314, 291871, 314223, 310599, 340183, 337479, 318253, 338638, 396982, 393319, 398832, 424276, 434117, 438523, 436203, 454018, 475458, 474476, 458227, 438498, 413508, 424542, 420785, 383761, 339874, 362993, 407321, 423930, 415877, 435303, 499960, 513354, 551539, 580169, 636699, 727465, 807554, 964540, 1151914, 1329627, 1448187, 1447406, 1326567, 1129520, 970561, 845679, 767157, 754088, 743640, 724382, 685804, 675810, 681204, 717790, 816254, 952609, 1101881, 1244834, 1337159]
18716A337159J3585j03319j14159j13211j00769j4560L6818M6492P1018J62963
18706A222017K12494L05563L27209J01488j07447k43757l33846k66008j62679
18697A055034q4514j9722j5710q163K7763p197J2850N3000J36290K06099K67374
18686A623104L29862K08138r739k16278l70999k75458j56202j31407j20472m7518
18676H33031J9452m6265m7836J4416Q820k3830j0844k4038j0979k2183m1665j8597
18664F29482J2217j3860n4932n9344o826o477M3709M5215N0801M4738K0993k5767
18652F79949l5114O306J3522L1567N2772k5763k9883l8088M794L7858L4369J7124
18640G49413J8049K1002L4688M4134K2997r166P751m9072l9810R161J7502J7096
$$ y = [1337159, 1350744, 1247425, 1133266, 1020055, 919286, 904726, 941544, 988036, 1059054, 1222017, 1434511, 1740074, 2067283, 2168771, 2061324, 1817567, 1483721, 1217713, 1055034, 970520, 950798, 935088, 926925, 954688, 947491, 960341, 1013341, 1149631, 1355730, 1623104, 1952966, 2161104, 2151365, 1935087, 1564088, 1288630, 1132428, 1001021, 880549, 833031, 852483, 806218, 758382, 772798, 781618, 757788, 746944, 722906, 711927, 689744, 648079, 629482, 641699, 627839, 572907, 513563, 506737, 500260, 543969, 589184, 639985, 684723, 705716, 679949, 644835, 651141, 664663, 696230, 749002, 723239, 693356, 655268, 660062, 697920, 732289, 749413, 767462, 788464, 823152, 867286, 890283, 881117, 888868, 839796, 799986, 809147, 826649, 843745]
18628H43745K3901O8021K1398q786N0592N8324M2137R1548O1702R4969P2244J16902
18616A536697J78524K16316K91392M06930L82362J22892j51282j83564j41623
18607B658644j0056J26945K38165J98667L8311j98138l30431l16326k33582j09761
18597B062438q0459n7398j3702l9835j1636Q368M2965J9040R207L2592L9513N3764
18585B064857N2609R9703J54438J58486J85085J44318L743n5776r5028j11467
18575B600968M7660J06464J44337J54982M6161r3298j72071j31255r1704m2106
18565B570138L9189L7615R699O6447P0359n435M9449O9896Q8023R2389R5225R0533
18553C273527J07834J62887K11302K43670K25575K69632K32721K53404K61581
$$ y = [843745, 867646, 935667, 957065, 948279, 998871, 1057195, 1099332, 1190880, 1252582, 1347551, 1419795, 1536697, 1715221, 1931537, 2222929, 2629859, 3012221, 3135113, 2983831, 2800267, 2658644, 2648588, 2775533, 3013698, 3212365, 3250676, 3052538, 2722107, 2405781, 2172199, 2062438, 1981979, 1924581, 1910879, 1871044, 1859408, 1867776, 1910741, 1929781, 1938988, 1971580, 2011093, 2064857, 2117466, 2217169, 2371607, 2530093, 2715178, 2859496, 2863239, 2807463, 2712435, 2600968, 2648628, 2755092, 2899429, 3054411, 3100572, 3007274, 2835203, 2703948, 2612244, 2570138, 2609327, 2646942, 2656641, 2723088, 2793447, 2788012, 2837461, 2907357, 2995380, 3087769, 3182994, 3273527, 3381361, 3544248, 3755550, 3999220, 4224795, 4494427, 4727148, 4980552, 5242133]
18544E242133L00017L39365L39932L27898L17470L48142L54985M28309M58612
18535H456863M86219N45081O21920P34456Q79116J109448J362495J561602J622040
18526A7379240J658033J700895J909089K339980K904757L691772M857517O473630
18518D2914913Q517864J1105414J4488136J9126816K5983289L6244304N0271254
18511B08651990O5152351O9579252M7431054J097834m4496509o7313515o3163057
18504B16939400m6149461l0014280j8938645j2137910p889290m748935j804569
18497I5256310J260435M602992Q045938J0744551J0957125P718795L421655J823417
18489A43831218N472729J3878550K4665292L2395847K8011147J0868217p422099
$$ y = [5242133, 5542150, 5881515, 6221447, 6549345, 6866815, 7214957, 7569942, 7998251, 8456863, 8943082, 9488163, 10110083, 10844539, 11723655, 12833103, 14195598, 15757200, 17379240, 19037273, 20738168, 22647257, 24987237, 27891994, 31583766, 36441283, 42914913, 51432777, 62538191, 77026327, 96153143, 122136432, 158380736, 208651990, 273804341, 343383593, 390814647, 391912481, 347415972, 280102457, 216939400, 170789939, 140775659, 121837014, 109699104, 101809814, 97060879, 95256310, 96516745, 101119737, 109165675, 119910226, 130867351, 138586146, 142007801, 143831218, 149303947, 163182497, 187847789, 220243636, 248254783, 259123000, 251700901]
18482B51700901j5144776r379574J131968N130642j902474j4773861k4533660
18475A92229166k5949902k0488758j3131081p576912n692973p170947r808917
18468A02409676j1238999j0518622q617613o635189n315767m687463m394151m123550
18460D6878322l807752l510956l218068k986955k796526k596731k384776k153538
18452B3423020j975398j836061j716273j613300j485812j374350j201309j066407
18444A1154110r75357q26253p02768o48623n93997n76359m94294m17901l70215
18435E548343l41689k90116k31887j87254j37941j40747r0972p081j6159n14M7037
18424D151020L3296O0086R900m3513j32869j91256k34521k51921k39710j85751
$$ y = [251700901, 236556125, 227176551, 228308519, 233439161, 231536687, 216762826, 192229166, 166279264, 145790506, 132659425, 125082513, 119389540, 112218593, 102409676, 91170677, 80652055, 72034442, 65399253, 60083486, 55396023, 51001872, 46878322, 43070570, 39559614, 36341546, 33354591, 30558065, 27961334, 25576558, 23423020, 21447622, 19611561, 17895288, 16281988, 14796176, 13421826, 12220517, 11154110, 10178753, 9352500, 8649732, 8001109, 7407112, 6830753, 6336459, 5918558, 5548343, 5206654, 4916538, 4684651, 4497397, 4359456, 4218709, 4127737, 4120656, 4104497, 4103983, 4151020, 4184316, 4244402, 4254302, 4210789, 4077920, 3886664, 3652143, 3400222, 3160512, 2974761]
18414B974761j74619j43204j20588j09612q7552j13142p9601o5081o3314j1342
18404B006706k974J8341n843O975j133k6817q0869j07465p0427l9913m1323k7621
18392A627637j5052k0550m3448J852R745o100l0785o2846l8223k2695o8662j12360
18380A218513n1138k3253k4386P50j3122o096k4519k2754J0481K1627L7552p742
18368A115913m467m624k4703l6771k4465r173Q260K5980M1363o053o0204k3077
18356I97979k7743j6035j6061m46r391p4846j11227n7429l9520n87r013k1258
18344F14423o2586l8601l0206L9823p654q914j6170L124k9612m597L7962J7118
18332E14110l2419K0199r455l6033j7924N3997L3766l9569m5195q626J1644Q776
$$ y = [2974761, 2800142, 2656938, 2536350, 2426738, 2339186, 2226044, 2146443, 2081362, 2018048, 2006706, 2003732, 2022073, 2016230, 2023205, 2022072, 1995255, 1914386, 1806921, 1736494, 1696581, 1655258, 1627637, 1612585, 1592035, 1548587, 1550439, 1560184, 1554084, 1523299, 1460453, 1422230, 1399535, 1330873, 1218513, 1167375, 1144122, 1119736, 1120486, 1107364, 1101268, 1076749, 1053995, 1064476, 1086103, 1123655, 1115913, 1111446, 1106822, 1082119, 1045348, 1020883, 1011710, 1019970, 1045950, 1087313, 1081260, 1021056, 997979, 970236, 954201, 938140, 937694, 928303, 853457, 742230, 684801, 645281, 644694, 635681, 614423, 551837, 513236, 483030, 522853, 515199, 506285, 490115, 493239, 463627, 459030, 496992, 514110, 481691, 501890, 492435, 456402, 438478, 492475, 526241, 486672, 441477, 432851, 444495, 453271]
18320D53271k7335p232K2326J9327J4861k9954m7725j7937k8469n2489j9928K935
18308B81651L699p386L4507J2784k4096J1180j6000j1217j7637l615J6584P812
18296B88266M7542J1757m8850l7303o823j3046j3577p185l925M2327K8445j1121
18284B76507n057j7293k2092k2192J9774N1949J4648r203k2784j6390P634J4533
18272B70034k0246k8920m009J9209J3686l766k0598j709Q687m2527l000O0947
18260B47788K1958k6320k832J3783q961l8522j0069K1692K7555M540r128k542
18248B38942o925M5887M7547n5624l4483J8569M480K175R998l584R266l4639l412
18235B38197j4534k1332J2737p190O434K7920k7431r078N1570M5967K0672k0015
$$ y = [453271, 425936, 418704, 441030, 460357, 475218, 445264, 397539, 379602, 351133, 298644, 278716, 281651, 285350, 277964, 312471, 325255, 301159, 312339, 296339, 285122, 267485, 263870, 280454, 288266, 335808, 347565, 298715, 261412, 254589, 241543, 227966, 220781, 216856, 259183, 287628, 276507, 271450, 254157, 232065, 209873, 229647, 281596, 296244, 287041, 264257, 247867, 255501, 270034, 249788, 220868, 216859, 236068, 249754, 245988, 225390, 223681, 232368, 189841, 186841, 247788, 269746, 243426, 240594, 254377, 245416, 206894, 196825, 218517, 246072, 250612, 241484, 238942, 232017, 277904, 325451, 269827, 235344, 253913, 258393, 260568, 270566, 266982, 276248, 241609, 238197, 223663, 202331, 215068, 207878, 214312, 242232, 214801, 205723, 257293, 303260, 323932, 303917]
18223C03917k8338k8803j0701J7910p166J513K2851P410j1281K9405l2010l1734
18211B32973K7324J7962J4929K2586L3568K0634k85j5451k3057o508l1337j5033
18199B78305J8596j7718j5656J2052P628k0545k9240o027l533P191J5445l8523
18187B07975Q16k2825k3515k7822j712J8067r615J1441L7793n606m5914L866J1642
18174A54591j9905k603L4417L3856L3263r930k3858o676k4577k5597l02j183q271
18161A33225l9083m6868r163P976N250K8911K4498j1334K3245K7820j7666j3415
18149A13396L4246M1101P702j765L2982j6101L1323J2465L322j6641j7320Q303
18137B33013l1688l0406j8159j8759m925K3270O200j7506K8066M5756L3948J5481
$$ y = [303917, 275579, 246776, 236075, 253985, 246819, 248332, 271183, 278593, 267312, 296717, 264707, 232973, 260297, 278259, 293188, 315774, 349342, 369976, 369691, 354240, 331183, 324675, 293338, 278305, 296901, 279183, 263527, 275579, 283207, 262662, 233422, 227395, 223862, 231053, 246498, 207975, 208791, 185966, 162451, 134629, 132917, 150984, 141369, 152810, 190603, 184997, 139083, 142949, 154591, 134686, 132083, 166500, 200356, 233619, 223689, 199831, 193155, 168578, 142981, 142679, 141496, 133225, 94142, 47274, 38111, 46087, 51337, 80248, 104746, 93412, 116657, 144477, 126811, 113396, 147642, 188743, 196445, 194680, 227662, 211561, 242884, 255349, 258671, 242030, 224710, 233013, 201325, 170919, 152760, 134001, 129076, 152346, 158546, 141040, 169106, 214862, 248810, 264291]
18125B64291j7647n785L7232K4127k1931K2590J8861m703J6939J3314M582j3020
18113C38850K0852j2050j5328N337K3650n990O816O915j2327l1572p251J0634
18101C28536l759n1025J3161M1519J7806L429j671K412j4853j3635k4427K1213
18089C18706M1940k3201l1130K539L4680K231j9725k9976k4541k3869m5481J3397
18077B15570J2708J5077M2139Q280j1936L631o024n198j939L3425r612m6009r793
18064B40319J3132L7470j4761j7583K696O6026r485m464j7871J0533K8113j6322
18052C17803J6288L0596L4553j9937m3396m0649M149J6952J1745p205J4475N010
18040C40384L8978N9548K1084N800M631j9817k555K418o514m80L2119K889r990
$$ y = [264291, 246644, 240859, 278091, 302218, 280287, 302877, 321738, 317035, 333974, 347288, 351870, 338850, 359702, 347652, 332324, 337661, 361311, 355321, 362137, 369052, 356725, 325153, 317902, 328536, 324777, 273752, 286913, 328432, 346238, 349667, 347996, 350408, 335555, 321920, 297493, 318706, 360646, 337445, 306315, 308854, 343534, 345765, 326040, 296064, 271523, 247654, 202173, 215570, 228278, 243355, 285494, 293774, 281838, 285469, 279445, 274247, 272308, 305733, 296121, 250112, 240319, 253451, 290921, 276160, 258577, 261273, 327299, 317814, 313350, 295479, 306012, 334125, 317803, 334091, 364687, 399240, 379303, 335907, 295258, 299407, 316359, 328104, 320899, 335374, 340384, 379362, 438910, 459994, 465794, 470425, 450608, 448053, 450471, 443957, 443477, 475596, 478485, 468495]
18027D68495L1317K1481j8415k4809J2530J4199l095K8190r744J7050J5529J3634
18015E66362L2342k0445j5774p131K1466k6192k1378L7279K8935L4978O067K5390
18003F61899M5983O2550M7830M55j397J5755K4552R694N597J2717J401L6288L2121
17990I55445K1485K5259J9372L8851N7060R5744Q3071M9287M7804K7601N6091
17979A477070J9740R194j916J9662N2368L6980N1215j1441j1669R453J4162P084
17967A671902P630K1055J3501P2539L2012N5223Q3302P6228P9579O1660O6339
17956B240970Q6982J6195j8508J7500L079L2180M0115j0554n0397k7178m0932
17945B289452k7527O243p45j4789j9948J8032N4376K8081M9563O2384K5768M0854
$$ y = [468495, 499812, 521293, 502878, 478069, 490599, 504798, 501703, 529893, 520149, 537199, 552728, 566362, 598704, 578259, 562485, 555354, 576820, 550628, 529250, 566529, 595464, 630442, 636509, 661899, 707882, 770432, 818262, 818717, 817320, 833075, 857627, 867321, 872918, 885635, 887036, 923324, 955445, 976930, 1002189, 1021561, 1060412, 1117472, 1213216, 1296287, 1345574, 1393378, 1420979, 1477070, 1496810, 1506004, 1504088, 1523750, 1576118, 1613098, 1664313, 1652872, 1641203, 1650656, 1664818, 1671902, 1679532, 1700587, 1714088, 1786627, 1818639, 1873862, 1957164, 2033392, 2112971, 2174631, 2240970, 2327952, 2344147, 2325639, 2343139, 2346218, 2378398, 2418513, 2407959, 2357562, 2330384, 2289452, 2261925, 2268168, 2267423, 2252634, 2232686, 2250718, 2305094, 2333175, 2382738, 2445122, 2470890, 2511744]
17933B511744J01600J38745J64090J87477J85738K30881K36498K01006R4987J7708
17923D070474M6082J15355J84173K73359L07904L04550K91796L14280L39139L87045
17913F634157M61367N19185N58675O36376P15576Q84686J149315J484306J923924
17904A4967567K505176L302285M436204O085373Q739272J2710277J8138405K3866312
17896I4750871K4142312J2456860n451976j9498108k2998677j8166466j1850869
17889E3383947p155971m177049k317833j022501P6344R88841J950939L074491
17881D4801208M212158N020104N329699N157184N231457O624391R928106J4951243
17873A01255550K0109152K1450004J5091267M432112l299228l301478L424719
$$ y = [2511744, 2613344, 2752089, 2916179, 3103656, 3289394, 3520275, 3756773, 3957779, 4052766, 4070474, 4116556, 4231911, 4416084, 4689443, 4997347, 5301897, 5593693, 5907973, 6247112, 6634157, 7095524, 7614709, 8173384, 8809760, 9525336, 10410022, 11559337, 13043643, 14967567, 17472743, 20775028, 25211232, 31296605, 40035877, 52746154, 70884559, 94750871, 118893183, 131350043, 125898067, 106399959, 83401282, 65234816, 53383947, 46227976, 42050927, 39733094, 38710593, 38786937, 39775778, 41726717, 44801208, 49013366, 54033470, 59363169, 64520353, 69751810, 76376201, 86304307, 101255550, 121364702, 142814706, 157905973, 162338085, 159038857, 155737379, 159162098]
17866A59162098J1315012J4610737J1653978O727922N411879J0630114K0617192
17859B40128932L0677846L5866679L1460330J5620288o974829k7446535l8827929
17852B80504782m0176118l5021136k7656494k0707115j4824476r809309n178539
17845A27131595n19234M685308J0586873J5596135J3991073J938428j3308848
17838A60101330k3374083k4026685j8968643j3706879j0051566p745067o250105
17831E5978302n245339m389662l669329l101292k677650k445056k498176k608930
17823B9342868k514752k289775k115325j931011j741140j599384j410373j257136
17815A4483972j115646r45021q72849p84576o98363n98039n66755o30499o32426
$$ y = [159162098, 170477110, 185087847, 196741825, 203469747, 208881626, 219511740, 240128932, 270806778, 306673457, 338133787, 353754075, 346779246, 319332711, 280504782, 240328664, 205307528, 177651034, 156943919, 142119443, 132310134, 127131595, 126612361, 131297669, 141884542, 157480677, 171471750, 173410178, 160101330, 136727247, 112700562, 93731919, 80025040, 69973474, 62228407, 55978302, 50732963, 46343301, 42673972, 39572680, 36895030, 34449974, 31951798, 29342868, 26828116, 24538341, 22423016, 20492005, 18750865, 17151481, 15741108, 14483972, 13368326, 12423305, 11550456, 10765880, 10067517, 9469478, 8902723, 8272224, 7639798]
17806G639798n84703n66516n01337m02095k80532k64007l00962k89557j79490
17797D270599j58922k20019j78235j69284j37280j29647j00134r0945j24980p5355
17787B885798o8513o8123j06350j00707q0432o0273o9010o6887q6769o3754m6273
17776B068707m0357m3814k7592o2297p4716k3864k642r6185j02822R514q272p373
17764A588287M069n0112p1451m9723l8867l0868n769l7884n9858m0793k8601j4329
17752A164101o451j0555k343J3735J5909Q36O4832J9261Q86m1780p7466R984N7996
17739A208945l2709o5197k8974k0569m2101L760L3745K1010j9562k4004k2126
17728A012218k3930k2571l3619k7809m3656k2650j7704j5940m114L4529Q705m4739
$$ y = [7639798, 7055095, 6488579, 5987242, 5585147, 5304615, 5040608, 4739646, 4450089, 4270599, 4111677, 3891658, 3713423, 3544139, 3406859, 3277212, 3177078, 3086133, 2961153, 2885798, 2817285, 2749162, 2642812, 2542105, 2461673, 2401400, 2332390, 2265503, 2178734, 2114980, 2068707, 2028350, 1984536, 1956944, 1894647, 1819931, 1796067, 1793425, 1697240, 1594418, 1603932, 1595660, 1588287, 1592356, 1542244, 1470793, 1421070, 1382203, 1351335, 1345566, 1307682, 1247824, 1207031, 1178430, 1164101, 1157650, 1147095, 1144752, 1158487, 1174396, 1175232, 1240064, 1259325, 1260211, 1218431, 1140965, 1150949, 1208945, 1176236, 1111039, 1082065, 1061496, 1019395, 1023155, 1056900, 1077910, 1058348, 1034344, 1012218, 988288, 965717, 932098, 904289, 860633, 837983, 820279, 804339, 800225, 834754, 843459, 798720]
17716G98720l423O0922O050l2149j6261k0759J4755p582k8086j7437l172j8532
17704G33046M220j9766L280j1711k4380k2165K390k2442l7863k1889q936J3136
17692E86920l3578j8471O275m5191m0544j015k5670j1547K8849M232k7638l0953
17680C91669r840k225r555j5675j9279K8725J4496K453j529m1211j1668J919J9092
17667C47372m9443l2766K3386k677J3327K2931q121l699R426J7894j1084j7393
17655C09153J1902j4824J4035J5287m8806l3236O30O478k0183M3206J9829o3240
17643B40231J7463L7579l292N691j3228j5463l8529j228K2603r810L0482K1549
17631B94048j8354k0737k981L831L938o739n609k8807r228n470K9963J0126l976
$$ y = [798720, 795297, 856219, 862269, 830120, 813859, 793100, 807855, 800273, 772187, 754750, 751578, 733046, 737266, 717500, 720780, 709069, 684689, 662524, 664914, 642472, 604609, 582720, 573784, 586920, 553342, 534871, 541146, 495955, 455411, 454396, 428726, 417179, 446028, 450260, 422622, 391669, 381829, 379604, 370049, 354374, 335095, 363820, 378316, 380769, 379240, 338029, 326361, 328280, 347372, 297929, 265163, 288549, 285872, 299199, 322130, 314009, 310310, 319736, 337630, 326546, 309153, 321055, 306231, 320266, 335553, 286747, 253511, 254141, 260619, 240436, 283642, 303471, 240231, 257694, 295273, 291981, 297672, 284444, 268981, 230452, 229224, 251827, 242017, 272499, 294048, 275694, 254957, 251976, 255807, 259745, 253006, 247397, 218590, 209362, 203892, 233855, 243981, 240005]
17618B40005K0349j038l7526j2947l6163l725k9922L5053L9498J7719k8040j5030
17606A88233J8318n588q911p372k2594r493K6844R638K0827p237j7408l3136j5916
17593A36205N970K0122j9269J2940n057J2608L2908L3039q190o973k2586k8921
17581A62796J1307M4046l1941l6173n041n309l6606j0652M839K8761M8191J933
17569A76151k5632k1381K8530L89J1069J2455j8833m9184L0748K240L227N18j2979
17556A37318J488K5814r507l3091K4625M0083N411l5927k2806L0j2190r832N669
17543A17085L5655j1421J4817J5565O488k8693n8389k3717J7585K684k1060r07
17531F5692M246j3280J0811K5829k2846J9674K466K9369O713l3118j7269J7641
$$ y = [240005, 260354, 259316, 221790, 208843, 172680, 168955, 139033, 174086, 213584, 231303, 203263, 188233, 206551, 200963, 192052, 184680, 162086, 152593, 179437, 189075, 209902, 202665, 185257, 152121, 136205, 142175, 162297, 143028, 155968, 150911, 163519, 196427, 229466, 221276, 214303, 191717, 162796, 174103, 218149, 186208, 150035, 144994, 139685, 103079, 92427, 97266, 126027, 174218, 176151, 150519, 129138, 157668, 158057, 169126, 181581, 162748, 113564, 144312, 146552, 149779, 150297, 137318, 138806, 164620, 155113, 122022, 146647, 186730, 192141, 156214, 133408, 133438, 121248, 111416, 117085, 152740, 141319, 156136, 171701, 178189, 149496, 91107, 67390, 84975, 87659, 66599, 65692, 69938, 56658, 67469, 93298, 70452, 90126, 92592, 121961, 128674, 95556, 78287, 95928]
17519I5928J319j2296j1415k2627q763J2014j819l3011k7787k0388l7215l4767
17507a00827l7204j2285K6758M1036K6966J0676K3703L9230k0471R967N888J4049
17495B7486Q285j3959k3488J871R90k2132M377p43L3317L8050l4151n375j3957
17482E71j7840L2850K0666J5551l2754n7742j917J53N2267N526L7645j649j1610
17469D1717R731q101l067L5013J1174j4485m1437j5480N560L32k6895K7361K3774
17456D5197N0190j5070n8735k809K5503N892L854k489n383k1480J1192J5972L3922
17443H5756K5660n215k5969p683K5275J177k0439m2944J2223J5724L286K2153
17431H9004K163j9739k1593j2178M880R091L3295K1683k5796o947M398K574l2300
$$ y = [95928, 97247, 84951, 73536, 50909, 42146, 54160, 52341, 19330, -8457, -28845, -66060, -100827, -138031, -150316, -123558, -82522, -55556, -44880, -21177, 18053, -2418, 7549, 13437, 27486, 35771, 21812, -1676, 195, 1185, -20947, -16570, -17313, 16004, 54054, 19903, 14528, 571, -17269, 15581, 36247, 51798, 19044, -38698, -40615, -40462, 11805, 17331, 54976, 53327, 41717, 51448, 43347, 40280, 75293, 86467, 71982, 30545, 15065, 20625, 20957, -5938, 21423, 45197, 95387, 80317, 21582, 18773, 44276, 50168, 54022, 51533, 46150, 24670, 35862, 51834, 85756, 111416, 106201, 80232, 72549, 97824, 99001, 78562, 35618, 47841, 63565, 66851, 89004, 91167, 71428, 49835, 37657, 42537, 51628, 84923, 106606, 80810, 73863, 78261, 80835, 48535]
17418D8535k2130L1755j2472m886Q631L7873L4751j8432K1520j4185l4364j4965
17406F1631o205k7742P879P108k2101k327J7527J3942k089j7387J6755j3223j2775
17393B0993Q566Q766K8469L2706J877J4385r978k0157j0847j1774O386j4266k927
17380E2199J7111k6288l640L840O894r135K850L3673O8023j499N521n411l5J4068
17366A58171K3563J2834N2574N7969P6689Q3524J0822K0219L6346m7541q5393
17355C99777o7606m9149k7513L09N579j3653R950K7077r599l8226j8913N8544
17343B76577M0180J1150Q877K6254N4106N3876M5733O6251K3303L0143k599O455
17331F40306K4750l2565o6741n5305k1928k8337m1963J2864P35j9695m7105k5287
$$ y = [48535, 26405, 58160, 45688, 40802, 49433, 87306, 122057, 103625, 125145, 110960, 76596, 61631, 55426, 27684, 35563, 42671, 20570, 18243, 35770, 49712, 47623, 30236, 46991, 33768, 20993, 29559, 38325, 66794, 99500, 101377, 115762, 105784, 85627, 74780, 63006, 69392, 55126, 52199, 69310, 43022, 39382, 43222, 50116, 40981, 43831, 77504, 145527, 144028, 149549, 144138, 144103, 158171, 181734, 194568, 247142, 305111, 381800, 465324, 476146, 496365, 532711, 485170, 399777, 332171, 283022, 255509, 255818, 261397, 247744, 257694, 284771, 275172, 236946, 218033, 276577, 316757, 327907, 336784, 363038, 417144, 471020, 516753, 583004, 606307, 636450, 633851, 640306, 665056, 632491, 565750, 510445, 488517, 460180, 418217, 431081, 431816, 412121, 365016, 339729]
17319C39729q798Q770k6911P767M2227l631j5544M33O87L6153N6106P0400P6147
17306E83535N7512K5181m5979m5631l8316l4315k4125k0391k8643m4953j0129
17295C73746O3824J01477O4190O2181P2662R2762J24933Q5776P0436Q5296K6889
17284A224172L5183k1979q1189o7324r8458n9170o3210r2868j13421p3968m1512
17273E46256k3017m9559p2879m0200k3741l4547k1548o7J3823n5713n7620j3661
17261A67527k6830m6435p654J2025j1932K2831P367k2193k2223R799K6875L400
17249A12557n616j8288p522K2581P274K1920K28P668k0292q488J5467r373j8415
17236I9701k0383J3105K0923k6911M656p629k6187M7809K5286K210n0827m2712
$$ y = [339729, 330931, 339701, 312790, 320557, 362784, 359153, 343609, 344042, 344729, 380882, 436988, 507388, 583535, 641047, 666228, 620249, 574618, 536302, 501987, 477862, 457471, 428828, 383875, 373746, 437570, 539047, 603237, 665418, 738080, 830842, 955775, 1041551, 1111987, 1197283, 1224172, 1259355, 1237376, 1156187, 1088863, 990405, 931235, 868025, 775157, 661736, 587768, 546256, 523239, 473680, 400801, 360601, 336860, 302313, 280765, 280698, 294521, 238808, 181188, 167527, 140697, 94262, 86608, 98633, 86701, 109532, 116899, 94706, 72483, 82282, 109157, 112557, 106941, 88653, 81131, 103712, 110986, 132906, 133134, 140802, 120510, 112022, 127489, 118116, 99701, 79318, 92423, 113346, 86435, 91091, 83462, 57275, 105084, 130370, 132580, 81753, 39041]
17224C9041q727n364l7666k5678K8723L9227J7803r908k0690K5123J1943k4729
17212B9098j3107j7763k2870r160j5709J5195K9678L5078L6068j8779m6101K4655
17200B6283j5296k6454j1563m44L113n215l837K2557K3364K3596J1748q642M0446
17187G9656L19o0999l6256J4319O5935k5526l8606L0689J4595m9766m0725o049
17175e2414K3600R792J1347k1107Q104k3353L8496o529m03M0542K2995J1382J6869
17162G9321j7313j1972k4437j5943O807o778K2618o153l510M6487j0381l1527
17150B7219l5558J9416L8707j79k0980P126K5605L667k3551k9616j7970Q520K6308
17137B8714j1601P565k1417j5298K50j5390J738j6396k7558J327R584L2493Q26
$$ y = [39041, 30314, 24950, -12716, -38394, -9671, 29556, 47359, 37451, 16761, 41884, 53827, 29098, 15991, -1772, -24642, -33802, -49511, -34316, -4638, 30440, 66508, 47729, 1628, 26283, 10987, -15467, -27030, -27474, -24361, -29576, -33413, -10856, 12508, 36104, 47852, 39210, 79656, 79975, 18976, -17280, -2961, 62974, 37448, -1158, 29531, 44126, -5640, -46365, -52414, -28814, -19022, -7675, -28782, -20678, -44031, -5535, -12064, -12467, 28075, 51070, 62452, 79321, 62008, 50036, 25599, 9656, 16463, 9685, 32303, 26150, 22640, 69127, 58746, 27219, -8339, 11077, 49784, 49605, 28625, 35751, 61356, 65023, 41472, 11856, -6114, 2406, 28714, 17113, 24678, 3261, -12037, -11787, -27177, -25439, -41835, -69393, -68066, -58482, -25989, -25163]
17124b5163J6913l705m4271j8624L1911P663L3997l198j0592J5376j1729J6530
17112E108K549l85P832j8693j5961M0478K8762l8324j0321n963J074l2746o665
17099d3255K217m816k0206j6239k9305K1826L1562L3198K1030Q04R228Q42r711
17086b825P410J1629j9512j5660J1417L177L5554O1331j6990l1161j3176q908
17074B2286L209j1275l0110l8045N752K5814l342L766K7262J1538k5030M169R840
17061E834K0925r921q590j7692M3267J9661M160n446r315J193k1984K7672p722
17048D2042m7912L399n987l6976j0330P460o674L2527J3663L28M615R616J935
17035G706K0106l1254k9261k7979K9905j9768j8906J7302L708J8386o685q502
$$ y = [-25163, -8250, -11955, -56226, -74850, -42939, -35276, -1279, -4477, -15069, 307, -11422, 5108, 7657, 7272, 15104, -3589, -19550, 20928, 49690, 11366, 1045, -4918, -3844, -36590, -43255, -41038, -45854, -66060, -82299, -111604, -89778, -58216, -25018, -3988, -3184, 6044, 6886, -2825, 4585, 16214, -3298, -18958, -7541, -4364, 31190, 92521, 75531, 44370, 31194, 22286, 25495, 14220, -15890, -53935, -48183, -22369, -25711, -21945, 5317, 16855, -8175, -4006, 5834, 26759, 16838, 8248, -9444, 33823, 53484, 57644, 52198, 42883, 44076, 22092, 49764, 42042, -5870, -2471, -8458, -45434, -55764, -48304, -54978, -22451, -8788, -8460, -3845, 5771, 7706, 27812, -3442, -32703, -60682, -30777, -50545, -69451, -52149, -48441, -30055, -36740, -45242]
17023d5242L8054N341q408l820k6745j5193J6788L0495k1888l1317N631L4692
17011b1612M7066M0823J4950k7271l4209p821R647M432j0047k6486j3818q249
16999c2595k0165N3178L9482l1835n6110k9399L961j7840O6044M3028j0309K908
16987A0348k0051l0356r364L5343l595K5198o728l139L6347N229j5217m1929j6895
16974c4809J6408K705j1631J0110M124l9798R72K7137K6827K4196J8510m641j5895
16961B4215k2931O524l1060M405K2807l296J4671n0536l555k898p207K7252k1443
16948d3052m1300K3858J2870j8601L163K5664k0814k6149J605k1566K0349K1419
16936f2554J937M3853J3623j075k9018J7705K123J7823R158p1860k5256M001k1580
$$ y = [-45242, -7188, -1847, -10255, -14075, -40820, -56013, -39225, -8730, -30618, -61935, -56304, -21612, 25454, 66277, 81227, 53956, 19747, 11926, 21573, 26005, 15958, -10528, -24346, -32595, -52760, 418, 39900, 8065, -48045, -77444, -73483, -91323, -25279, 17749, 7440, 10348, -9703, -40059, -49423, -14080, -17675, 7523, 795, -2344, 34003, 39232, 24015, -17914, -34809, -18401, -15696, -27327, -17217, -13093, -52891, -51919, -24782, 2045, 26241, 44751, 40110, 24215, 1284, 7808, -23252, -18847, 3960, 664, 15335, -35201, -38756, -41654, -48861, -21609, -43052, -84352, -60494, -47624, -66225, -63062, -37398, -58212, -84361, -82756, -104322, -83973, -62554, -60617, -16764, -3141, -4216, -33234, -15529, -13406, 4417, 13575, -58285, -83541, -79540, -101120]
16923a01120L641N1903M4648P165l0206O675j2622j0528J9434L917k4962L877
16911c8178o686R318j6146l2315K5396N5847J4351J1380j7299j7007L594M7093
16899C9348j3426m0773L1155L497l9557k7950K9552L0602j9596r025N308J6630
16887E765l641Q704J6343K8025J0232J4147l344o4136k5111J3168R757J1877r252
16874A2534k9865J5601k2811k6976K3787K3424L737j7543L579K7648K0920j2331
16862B1704j4082n362K232l562M3296L3469K7352n920K9093K2518j8567K0808
16850A52979Q86l4886m7601m9506Q440K3958K095l7529k0912R941k850j8997k7708
16837d1690p452J9548J3794j4032K4641L9581J6019k2047m0283l2472J3492L6434
$$ y = [-101120, -97479, -45576, -928, 6237, -23969, -17294, -29916, -40444, -21010, -17093, -42055, -38178, -44864, -35546, -51692, -84007, -58611, -2764, 11587, 22967, 5668, -11339, -7745, 39348, 25922, -14851, 16304, 19801, -19756, -47706, -18154, 12448, -7148, -16173, -10865, 5765, 2124, 10828, 27171, 55196, 65428, 79575, 76231, 12095, -13016, 152, 9909, 21786, 12534, -17331, -1730, -24541, -51517, -27730, -4306, -569, -18112, -14533, 13115, 34035, 21704, 7622, 2260, 4492, 930, 44226, 77695, 105047, 99127, 128220, 150738, 132171, 152979, 153865, 118979, 71378, 21872, 30312, 54270, 56365, 18836, -2076, 7865, 5015, -13982, -41690, -49142, -29594, -15800, -29832, -5191, 34390, 50409, 28362, -11921, -44393, -30901, 5533]
16825E533R658m1619k5520K1088L8801k2994j8981k350l086J3546m9523P507N164
16812f2776L286M575j0757o425N140K7365j4546K8835K7133O578r048j7599l1761
16799e0000k4043L7185J9475r753J9281M118J0521O660J9115n336j2480K4080
16787C8823j7279m062Q471k8850j1750p669r353J438K4719K1227M569J1196l684
16774B7796m9714L654K4954j2789L893l0167j4274j2640p935M4251J3689m4417
16762e3699l2599n86K2014j856K1190j6438k3941J0288L2969P040r779r859J4914
16749d0342k788k2314J6830L4904j4716m1948K187J6330J5696j4036J1399P011
16737c1787J1263L548K2004K380m1745k0337O818J9417M877l7860j1907J2077
$$ y = [5533, 15191, -26428, -51948, -30860, 7941, -15053, -34034, -36384, -39470, -25924, -75447, -67940, -62776, -59490, -54915, -65672, -72097, -66957, -39592, -54138, -25303, 1830, 8408, -640, -18239, -50000, -74043, -36858, -17383, -27136, -7855, -3737, 6784, 13444, 32559, 27223, 14743, 38823, 21544, 17482, 25953, -2897, -14647, -22316, -31669, -30231, -5512, 15715, 20284, 31480, 27796, -21918, -18264, 6690, -6099, -2206, -32373, -46647, -59287, -67222, -22971, -9282, -53699, -86298, -86884, -64870, -66726, -45536, -61974, -85915, -75627, -42658, -35618, -45397, -55256, -40342, -43130, -65444, -48614, -13710, -28426, -70374, -68187, -51857, -36161, -50197, -38798, -31787, -20524, -16976, 5028, 7408, -34337, -54674, -47856, -28439, -23562, -61422, -73329, -61252]
16725f1252k0182O025J4249J7807L36q665J7403K8616m814o956r202P550J5028
16712d057J2909o760m9040r375Q752J1383J912k1025N739M233j1507n317L0123
16699c2030K4028K701k9155j1960N829j144R50k0066j9254J3444p187o622K2844
16686e7622P705r05L5149J0604r69j3786j9274k6565L728K0566j4779j1929J776
16673f6301j2572O7504L7025K790j8396l9933K3817K0319o761r753k3318j2916
16661c8495J4805p997J373k7188R613K7888O536J9945L2589j6761r349j9013K334
16648c720r59q101K5282J0097j4240k1591j8332N907L7118N943j6437l2257Q060
16635b3230K0282m321m313l2388j3146J3287k299L5905M665m133J3517j2805N690
$$ y = [-61252, -81434, -75409, -61160, -43353, -43017, -51682, -34279, -5663, -10477, -17433, -26635, -19085, -4057, 8852, 2092, -46948, -56323, -47571, -36188, -34276, -55301, -49562, -45329, -56836, -62153, -32030, -8002, -5301, -34456, -46416, -40587, -41731, -40781, -60847, -80101, -66657, -73844, -80466, -57622, -49917, -50822, -15673, -5069, -6038, -19824, -39098, -65663, -61935, -41369, -56148, -68077, -66301, -78873, -11369, 25656, 28446, 10050, -29883, -6066, 14253, 7492, -2261, -25579, -38495, -23690, -31687, -30314, -57502, -47889, -20001, -13465, 6480, 39069, 22308, 12959, -6054, -3720, -4679, -12780, 12502, 22599, 8359, -13232, -31564, -25657, 11461, 17404, 967, -31290, -23230, -2948, -7269, -11582, -43970, -57116, -43829, -46128, -10223, -5558, -9691, 3826, -8979, -3289]
16622c289q16q537j0325j1469J9712P925j5513K1939M649j6454r086J363m263
16609b4164J340J6529Q01Q913m697R858J3075p065J7038k0996m3145J4882L6500
16596A8869K5127j4823j6013k2671k3807r627K067J2046P372k3724l9335K049
16584h2470J2838K2844N3258M9507R310j2446l3158k2855k3234k6009O311L3922
16572a2182P747K2344L0887m938n0875K647K7663N729J2582q003K198l57n4888
16559a9446k6200j5385k1596J9738N3375K0821l6474j1559j0890K1227K8448L4465
16547C6524J6790k7613j2319J3530J3559r046l537r642K5555r09j8672m2999m4005
16534f2784J7796L2681J6823Q980M350m906m670M147O235j4589p709l2077J2616
$$ y = [-3289, -4105, -12642, -22967, -34436, -14724, -6799, -22312, -373, 4276, -12178, -21264, -19901, -24164, -22824, -6295, -5494, 3419, -1278, 8580, 21655, 14590, 31628, 10632, -32513, -17631, 18869, 43996, 29173, 13160, -9511, -33318, -42945, -40878, -28832, -21460, -45184, -84519, -82470, -69632, -46788, 6470, 55977, 65287, 52841, 19683, -3172, -26406, -52415, -46104, -12182, -4435, 17909, 48796, 43858, -7017, -4370, 23293, 29022, 41604, 33601, 35799, 35442, -19446, -45646, -61031, -82627, -62889, -9514, 11307, -25167, -36726, -47616, -26389, 2059, 36524, 53314, 25701, 13382, 26912, 40471, 31425, 27888, 18246, 43801, 42892, 24220, -18779, -62784, -44988, -12307, 4516, 13496, 17846, 12940, 8270, 12417, 18652, 4063, -3646, -35723, -23107]
16521b3107K6111j3238j0879L8072l3513k4362r206M8991J1611M3610J7049k5546
16509D5593r918l6335k5223j5002K0507M5207L88j2884j4445k6703k5297N375
16497d8737j4640L5224L616J0858L3765j7536j3865p102l050N371K7513J1510
16485B2927q331k8200M391n881n2607K0609P494J4492j379J4681J3708R369k1071
16472i798o544J5350K3496j0057J4676K0020j0739j9352m1751J3517Q477n864
16460h569q00j2052q184N552R442M993Q303K6127J8136j6736K410m3195j1183
16447b5756J4513P473O183K3665j4243j9029J8019M664r93K781L222j0091j8261
16434g853j5624j0835L144R685j7704k5508P495J9264k4852j3003M8906J8336
$$ y = [-23107, 3004, -10234, -21113, 16959, -16554, -40916, -50122, -1131, 10480, 54090, 71139, 45593, 35675, -660, -25883, -40885, -20378, 24829, 25217, 12333, -2112, -28815, -54112, -48737, -63377, -28153, -24537, -13679, 20086, 2550, -11315, -18417, -21467, -16096, 11417, 22927, 14596, -13604, -9213, -15094, -67701, -47092, -39598, -25106, -26485, -11804, 1904, 11273, -9798, -16342, -992, 22504, 12447, 27123, 47143, 36404, 17052, -24699, -11182, -2705, -8569, -9369, -21421, -29605, -24053, -14611, -9618, -1315, 24812, 42948, 26212, 28622, -14573, -25756, -11243, -3770, 2413, 26078, 11835, -7194, 10825, 15489, 14496, 17277, 20499, 10408, -7853, -23477, -34312, -31168, -21483, -39187, -64695, -57200, -37936, -62788, -75791, -26885, -8549]
16422h549l994M8196o536p0700R865k106K144O727L4346K734m5348l978J3889
16409b3310Q688m883j9435p726l6882O891L6026j58J4917O1426j6611n819M921
16396A8045k4620m4141k6925j9896J9073J0305O49O304j7718J6565K2259J2786
16384b7314L210L894k619L469l437Q880o480M772k656K8201R510j4372r394j3928
16370a8264K7275M1047l5943k3581K5864k0811j1978L2877J976o568o0544j7033
16358f5683L1710K3349n865o293L999R386J471n8734k3774L3855p264l7995L1115
16345g0723O1587J7989J1923l7963n724L3167J9786Q046j3755n4374l8883r672
16333g8596K7427o496J8565L6972N7556J6789K7264k9965j3601m3746m3643L814
$$ y = [-8549, -12543, 35653, 29117, -41583, -31718, -33824, -31680, -24953, 9393, 12127, -33221, -37199, -23310, -14622, -19505, -38940, -46666, -83548, -76657, -40631, -40789, -25872, 35554, 18943, 13124, 18045, -6575, -50716, -77641, -97537, -78464, -68159, -67510, -61206, -78924, -62359, -40100, -27314, -24104, -20210, -22829, -19360, -22797, -13917, -20397, -15625, -18281, 9920, 19430, 5058, -4336, -18264, 9011, 50058, 14115, -9466, 16398, -4413, -16391, 16486, 18462, 11894, -48650, -65683, -33973, -10624, -16489, -22782, -18783, -9397, -7926, -66660, -90434, -56579, -63843, -101838, -70723, -9136, 8853, 20776, -17187, -22911, 10256, 30042, 38088, 24333, -30041, -68924, -78596, -51169, -57665, -39100, -2128, 55428, 72217, 99481, 69516, 55915, 12169, -31474, -27660]
16321b7660K1116M993j7585l580j5212M7830O541m7718l2421K0176J0308j8006
16309e1218J4720N9328L3586j8707L4o291j4322r993j3085k1250K6052M403r069
16296e812J1764p575l0953M328j3062M117N400k0962J364l2302k0639j007L5350
16283f9989L6964M072K7174K7898j140m4033l5507m921J8909K5120J4253N258
16271D058Q068J6229k5065k4426p7J6990m440L4310k3661m2790q024M610k6860
16258g1078j509J8073l862O908o913l0942L1446K8925j12J7932K726Q617o409
16245f198n7397k8367M6277j8223J0293K8723J5825k779j9183k6258J3837L3202
16233a0248r781j9522l0837k713J9478r160k1093L652k084K3049j2630n815N4204
$$ y = [-27660, -6544, -1551, -19136, -22716, -37928, 9902, 16443, -31275, -63696, -43520, -33212, -51218, -36498, 22830, 56416, 37709, 37743, 31452, 17130, 7137, -5948, -27198, -1146, 3257, -5812, 5952, -1623, -32576, -28248, -41310, -37193, -31793, -52755, -51391, -83693, -104332, -105339, -69989, -33025, -28953, -1779, 26119, 24979, -19054, -54561, -59482, -40573, -15453, -1200, 4058, 12126, 28355, 3290, -21136, -21213, -4223, -8663, 25647, 1986, -40804, -48828, -44218, -71078, -72587, -54514, -58376, -51468, -58381, -89323, -57877, -28952, -29064, -11132, -8406, 211, -6198, -63595, -91962, -45685, -63908, -53615, -24892, -9067, -11846, -31029, -57287, -43450, -10248, -20029, -39551, -70388, -73101, -53623, -62783, -83876, -80224, -82308, -59259, -71889, -77704, -23500]
16220b3500J0841l810q906l4692k2346K3347K9478R671q556k6970p79K8662L0179
16207B619J3824j3984l2154K3458K2121R71o819m5907j4691j5296K3001J3032
16195b9825j891p831n104R53P587L5377r723k3679m6281J5374K8248j1650M905
16182d3540Q770q410L853m709L0285J4527J9423j2822K4018J3544k2096l2776
16170i933o5253J2992L7902K2884k331k4515j2029j0801K3951o447j637N287l190
16157c3120j4360K9247L0995j3469j1513L7768J426j0790k2658k8708P623K6558
16145a001j1865j4869J3062L6474K8200p591l9448k0757k3165M465p520j8179
16133f2194K2558K9226k6601j3397L8293L1451j5679j6236k1897k6470R023P872
$$ y = [-23500, -12659, -16469, -25375, -60067, -82413, -59066, -29588, -19917, -28473, -55443, -56222, -27560, 2619, 16443, 2459, -29695, -6237, 15884, 16855, 10036, -35871, -50562, -65858, -42857, -29825, -31716, -39547, -44651, -43698, -36111, -734, -10457, -34136, -80417, -65043, -36795, -48445, -43540, -34770, -43180, -39327, -44036, -13751, 776, 20199, 7377, 31395, 44939, 22843, -9933, -75186, -62194, -24292, -1408, -3739, -28254, -40283, -51084, -27133, -33580, -35217, -29930, -33120, -47480, -18233, 12762, -707, -12220, 25548, 26974, 16184, -6474, -35182, -27559, -1001, -12866, -27735, -14673, 21801, 50001, 42410, 2962, -17795, -40960, -36495, -44015, -62194, -39636, -10410, -37011, -50408, -12115, 19336, 3657, -12579, -34476, -60946, -51923, -44051]
16121d4051k6465k0280m597J8673j807P491k9665K2253K5335j9028K3777N1753
16109C389J0385L3724k7240p036Q340k3768k0342j3062K0690J669j3546j1666
16097c8463L4305k435o472R547j4315L912K3809l4034m9916O341O941l660K9708
16084c4732K9031K0556r664k961j5541K0196O993l347K052L716k109k7189p08
16071a3707J2407N00o02l6848k830K1672o767O728j1875k0149q24Q890M2363K6341
16057B5299j1993k6407J545J2947j247L057k7523L7225q204m4624j9898J5866
16045d3957N9687J3474p833N508k3747n7478K503k538O30P661k8244l323o520
16032h4177q623l602K5078L4583K1739m444j2028J1215K5816P508j8674j3103
$$ y = [-44051, -70516, -90796, -95393, -76720, -78527, -71036, -100701, -78448, -53113, -72141, -48364, 3389, 13774, 47498, 20258, 13222, 21562, -2206, -22548, -35610, -14920, -13251, -26797, -38463, -4158, -6593, -13065, -3518, -17833, -13921, 9888, -24146, -74062, -67721, -60780, -64440, -34732, -5701, 14855, 5191, 2230, -13311, 6885, 13878, 10531, 12583, 16299, 14190, -12999, -13707, -1300, -800, -1402, -38250, -41080, -19408, -26175, -19447, -31322, -51471, -52295, -43405, -1042, 25299, 13306, -13101, -11556, 1391, 144, 3201, -24322, 12903, 4699, -39925, -59823, -43957, 15730, 29204, 21371, 26879, 3132, -54346, -51843, -54381, -53751, -46090, -74334, -77657, -84177, -92800, -96402, -71324, -36741, -15002, -19446, -31474, -20259, 5557, 13065, -5609, -18712]
16020a8712k8020j9408K0399Q186M4699J0531p3315p473K3999K8995K5496J9195
16008C4572j5020n1010k4496j134L1600P338j0390J0801j8825J6265j5933n5121
15996i1353J710L1319J2025j9409r392j3609J1438O382j2006J7890J4929J2672
15984c7404J9130K5265K926L254J2230p09m6776L746r782m5015j6424J1024K1925
15971e6610L7408R232R10J4648K3419l5259k3503Q926N5909N823K1503l3502n8577
15958b9673L611j9706K3691J9689j2897J2075k3197l2759n114J7906M3491J0688
15946G805k651r751p433K546J4509K3812O329O9k0306j0103n3422o453L7763K464
15932a4822k5745J6300N005j7142k7207J7653n36n4848j043K343L4415K0355K9999
$$ y = [-18712, -46732, -66140, -45741, -37555, 7144, 17675, -55640, -63113, -39114, -10119, 15377, 34572, 19552, -31458, -55954, -57088, -25488, -18150, -28540, -17739, -36564, -20299, -36232, -91353, -89643, -58324, -46299, -65708, -75100, -88709, -77271, -70889, -82895, -65005, -50076, -37404, -18274, 6991, 9917, 13171, 25401, 24692, -22084, -18338, -28120, -73135, -89559, -78535, -56610, -19202, -9970, -9060, 5588, 29007, -6252, -29755, -20829, 35080, 40903, 62406, 28904, -29673, -26062, -45768, -22077, -2388, -15285, -3210, -26407, -59166, -64280, -46374, -2883, 7805, 5154, -4597, -12030, -9484, 5025, 28837, 35166, 35235, 14929, 4826, -48596, -55049, -17286, -14822, -40567, -24267, -19262, -36404, -63611, -45958, -46494, -101342, -102385, -100042, -65627, -45272, -15273]
15919a5273M927j5781j1285M549k1293r785L011K8375p606j0383j8498o837j5389
15906i1268L2159k704o5529K5917L9313j0381n135K2276p791j1163J4973L4547
15894b4786r315l109j311N083L5647j3914J235J0940L5027k0389r951L4904n160
15881C4901k9560m517k0543n404M81l321K0640J5463K2414N395k2206j0265L0707
15868C4185j5881q825J499j8972Q162L4147m474m3532L995J4690L3852k2419m1698
15855b5271o64J8409j2400l0735j3240M0425N9179J1502l1515l823k0344J2905
15843D428R006q713q222K2671j1245l7668J254K5799l4473J849M9127J2595m3951
15830a7543n0280m065L0837J4412o964j451P763K4218K8282P641j5284j4039j8765
$$ y = [-15273, -10346, -26127, -37412, -32863, -54156, -63941, -60930, -32555, -40161, -50544, -69042, -75879, -91268, -59109, -61813, -127342, -101425, -62112, -72493, -77628, -55352, -63143, -74306, -59333, -24786, -34101, -37210, -38521, -33438, 2209, -11705, -10470, 470, 35497, 15108, 5157, 40061, 34901, 5341, 824, -19719, -25123, -24642, -27963, -7323, 8140, 30554, 35949, 13743, 3478, 34185, 18304, 9479, 10978, -7994, 168, 34315, 29841, -13691, -9696, 4994, 38846, 16427, -25271, -25935, -7526, -19926, -50661, -63901, -23476, 35703, 47205, 15690, 11867, -8477, 4428, 13434, 4721, -3501, 19170, 7925, -29743, -28489, -2690, -37163, -35314, 13813, 26408, -17543, -67823, -71888, -41051, -26639, -33603, -35054, -27291, -3073, 25209, 32850, 17566, 3527, -15238]
15817a5238j8076j7481o067o571J6763K7102j0574K647k2562Q706L6330L1790
15805B6769J1856j0653j6997P475r55l1876j1961L8323K8385j8402j8299j7439
15793a3774J5871J402L507J9273j9506l6292l6833M682J5965n560J6550j7751
15781e2466M193j7399J0452M4426K211n525l0552j7803l0242j5684L43K1213l302
15768i0135J1283J0144K97j634m169L4417R373J6048m249O678K580M6390K2125
15755E9148m1431m4853K341l285J098J2844j2177k5452r17L308L0048O582R305
15742c441Q950j7255J8793M059N354J3438j5131n991k0678L888K8848J5872l5685
15729A021j7470J4697J6616j9699k8080r708J5967J6861l721R07k7719J880J2663
$$ y = [-15238, -33314, -50795, -56862, -63433, -46670, -19568, -30142, -27495, -50057, -41351, -5021, 26769, 38625, 27972, 10975, 18450, 17495, -14381, -26342, 11981, 40366, 21964, 3665, -13774, 2097, 3499, 7006, 26279, 6773, -29519, -66352, -61670, -45705, -51265, -34715, -52466, -48273, -65672, -55220, -10794, -8583, -14108, -44660, -62463, -92705, -108389, -108046, -86833, -90135, -78852, -68708, -68411, -70045, -74214, -39797, -30424, -14376, -18625, -11947, -9367, 37023, 59148, 17717, -27136, -24795, -28080, -26982, -14138, -26315, -51767, -52684, -49376, -19328, -12746, -3441, 5509, -11746, 7047, 11106, 16460, 29898, 14767, 8776, -11902, -8014, 20834, 36706, 1021, -16449, -1752, 14864, -4835, -32915, -42623, -26656, -9795, -13516, -12609, -40328, -38448, -25785]
15716b5785j4906K2867L8921q356J38j1696l4952j8895M698J2415M2114k743k9672
15703b5852k3454o086l05k2434K8949M7013n751j2885j2031K1289r742J7983K5598
15690B2292N5527L6723l7329n5586p0100K016J3700p795q895j1025q719K2631
15678d6560p947j6321m456j750l7035Q104J4770J3138P1383L4918j5735J6982
15666B9491J3457m0078M651k1700O405J0233L772K98K5048j8207j3737j4612N059
15653i920O822o35K3202J3784o8104K500K425P357q489K5051L462Q019J3919J8566
15639C7959j1208j9767J3908q042K1164j2367k7261J2221j6437J0113L9447K1444
15627F1174p352m0334n3384l3050O357L8894n16J4345j5952J841L5672j0880Q438
$$ y = [-25785, -40691, -17824, 21097, 12741, 12879, 1183, -33769, -52664, -47966, -35551, 6563, 3820, -25852, -49306, -55392, -55697, -78131, -49182, -2169, -7920, -20805, -32836, -11547, -21289, -3306, 22292, 77819, 114542, 77213, 21627, -48473, -46457, -32757, -40552, -49447, -60472, -69191, -46560, -54507, -70828, -75284, -77034, -114069, -105965, -91195, -78057, -6674, 28244, 12509, 29491, 42948, 2870, 7521, -14179, -7774, 2459, 6231, 6529, 31577, 13370, -367, -14979, -9920, -3098, -3733, 19469, 33253, -34851, -32351, -29926, -22569, -31058, -6007, -2545, 5474, 19393, 37959, 26751, 6984, 20892, 12850, 34014, 21647, -5614, 6607, -9830, 283, 39730, 61174, 53822, 13488, -39896, -72946, -66589, -27695, -28211, -13866, -29818, -27977, 7695, -3185, 5253]
15614E253L2483J5677n0392l1957J8312K8200J068k0627J604j1736p657k4284
15602d4056J9600K6293M8173J8717l1556n0124k6277L2313J0784j2694j6371l4567
15590e9765M7307L0395R548j7657n8280k3439J593J4735L7456R367j216o38J20
15577a0474P999j6759j251Q039J231m209r904P280J352J746l1168j0610J1493
15564d5235J6604K699j513Q543r992n139l4919l4050k2995K2825k720J2327J9422
15551g4143n506J4948O7087j3063o827N943Q486O505n041j5988Q968J793J1860
15538E022m93m363j2602P344J1221j0199j9717n726N5365J0858m1578q702M208
15525i362q277j8349k1462j3319K0986K3080K5891O433l2332n2356J7548L2497
$$ y = [5253, 37736, 53413, 3021, -28936, -10624, 17576, 18644, -1983, -379, -12115, -19772, -44056, -24456, 1837, 50010, 68727, 37171, -12953, -39230, -6917, 3867, -8827, -25198, -59765, -12458, 17937, 27485, 9828, -48452, -71891, -70298, -55563, -18107, -8740, -9956, -10594, -10474, -2475, -19234, -20485, -12446, -11215, -15424, -25328, -18048, -16696, -14950, -46118, -56728, -45235, -28631, -25932, -27445, -18902, -28894, -34033, -68952, -103002, -125997, -103172, -105892, -93565, -74143, -79649, -64701, 2386, -10677, -17504, -11561, -3075, 3430, -1611, -17599, -8631, -6838, 5022, 4529, 166, -12436, -5092, 6129, -4070, -23787, -29513, 25852, 36710, -4868, -13570, -9362, -17639, -35988, -57450, -70769, -49783, -26703, -812, 5621, -26711, -79067, -61519, -29022]
15513b9022Q310r937L1882K9705k9310o646n04k3468j5766J8849J0771o712k2264
15500d4112j7992j3792O448j0492J505J2405K4446Q15k4022k3690j1945J7751
15488h2675L3084M965j2057P368n234R002L0068l104n127k9367k8800P242K2955
15475e1680K4609L1829j1232o358m1995m4457r78L3550M2953P153M682p717J9163
15462d78L1394j9557l1371N637P798K982J9558j7745k1466J657N0582K1139p233
15449D2897l0495k1665k9434j6713J0090j1764J8982J8630M228j1546M7304J4205
15437C4719m9007l1278K2620K3610l348l1964L0184O7698Q419q745J0162l9114
15425C3956l0221k0525k4018K7938N0205J4483j6761k6185o366l7086M43K1038
$$ y = [-29022, -20712, -30649, 1233, 30938, 1628, -5018, -5522, -28990, -44756, -25907, -15136, -21848, -44112, -62104, -75896, -69448, -79940, -78435, -66030, -41584, -40769, -64791, -88481, -100426, -82675, -49591, -44626, -56683, -49315, -54549, -45547, -15479, -18583, -23710, -53077, -81877, -74635, -51680, -27071, 4758, -6474, -12832, -54827, -99284, -100262, -66712, -23759, -16606, -11924, -19641, -478, 30916, 11359, -20012, -14375, -6577, -3595, 15963, -1782, -23248, -21591, 28991, 50130, 42897, 12402, -9263, -38697, -55410, -45320, -57084, -38102, -19472, -15244, -26790, 20514, 34719, -14288, -45566, -22946, 664, -2684, -34648, -4464, 63234, 71653, 62908, 73070, 33956, 3735, -16790, -40808, -12870, 37335, 51818, 35057, 8872, 2506, -34580, -34137, -13099]
15413a3099j663j6271J2142K8224J0860k8897j0749K09j3171J2349L5898O932
15401B2764n873m951q280j3702j049P355j2117o919j8602K1496J8876j8281j9560
15388c8843r164K5239n41N397M7231j3049j3817P068j3049k0611N544l696M063
15375a8228k141k8791j3813J8722J5494J0678j0139j4721J9393K2955j7327m4023
15363f1941L1982L2333m3063k7853L1992M0930J0375R882k305k6485p436J4239
15351B650p376P706K0739m8109l1388j9934j4959J8907N0217K3217P780o826K0677
15338B3301r791j3650n343l2972J208R246k5426J3859K6181k2571m335n232J841
15325d3684L7244j4419k1684J3213J5457k9739m899n154N6753J0762R86k3977
$$ y = [-13099, -14762, -31033, -18891, 9333, 20193, -8704, -19453, -19244, -32415, -20066, 15832, 22764, 16891, 11940, 3660, -10042, -11091, -3736, -15853, -22772, -41374, -19878, -1002, -19283, -38843, -48007, -22768, -23309, -17912, 29319, 16270, 2453, 9521, -3528, -24139, -18595, -22291, -18228, -20369, -49160, -62973, -44251, -28757, -18079, -28218, -42939, -23546, -591, -17918, -61941, -29959, 2374, -40689, -68542, -36550, 4380, 14755, 24637, 22332, -4153, -11589, 2650, -4726, 2980, 23719, -24390, -55778, -75712, -90671, -71764, -21547, 1670, 9450, 2624, 23301, 13510, -140, -5483, -38455, -37247, -28001, -53427, -39568, -13387, -35958, -40293, -45525, -43684, -6440, -20859, -42543, -29330, -13873, -43612, -48511, -53665, 3088, 13850, 14836, -9141]
15313i141n839j514l243k1011k7398o446Q640J3510K0939L9976N174k8995j1308
15300b6656J686j1758p586j5627L64q284k1J0123K8234l268m6349j2602K1508
15287g0236P981K0833K2542N657j4779N656j287J024L2552j4402k5558J6427k2980
15274c6570n912M0876J6871m825J0633l716j293K3627m023j4682k7671K65L1072
15261B4652J9367k4354P258l8424j8213k2699r621L3874O486k0789J1465K5636
15249e362O845N175j5590J6422K1053J1649J0292P991k1095l4446j2807J2653
15237B780J865J234l7777P757J4105l2492k3301K842l265L978L9303n720J5772
15224a2919j8668l8649N3206K7910J2301m5863r703N291K733P271J8725J8655
$$ y = [-9141, -14980, -16494, -19737, -40748, -68146, -74592, -65952, -52442, -31503, 8473, 13647, -15348, -26656, -24970, -36728, -44314, -59941, -59577, -67861, -67882, -57759, -29525, -32793, -79142, -91744, -70236, -62255, -41422, -18880, -13223, -28002, -22346, -23633, -22609, 9943, -4459, -30017, -13590, -36570, -42482, -1606, 15265, 10440, 21073, 17357, 16064, 39691, 35668, 20986, -6685, -6420, 24652, 44019, 19665, 26923, -11501, -29714, -52413, -62034, -28160, -21674, -42463, -30998, -5362, 1483, 6658, -8932, 7490, 28543, 40192, 50484, 58475, 37380, 2934, -9873, 2780, 4645, 5879, -31898, -24141, -10036, -42528, -65829, -62987, -66252, -62274, -22971, -28691, -12919, -31587, -70236, -17030, 10880, 23181, -22682, -32385, -27094, -24361, -17090, 1635, 20290]
15212B0290j8152p069N647J2213L4764m1858r246j9009K0005J5326j2431k2261
15200b1781k2737j7861K1962K6642k578p801p516O956R581k8585q188K9702n687
15187b7891K5034r798l5920l3179K2616K1185k3115p989o123J1256O494K0066
15175c7364N27K5178o832K6963k1341j8806j6788l1432j014M8539K740J0670M038
15162a4922j1055R854k619M2064K3244l2164n8899l5218J9813R372M517R850k6842
15149f3005j123P884J0448m551J4693N0900K2086l183K2187j9606o09k7411n9516
15136e0806K1079L190O49j8754l6370r499K1235L1440O2713K5996j5870k7102
15124G901l835l331L179J0884q223Q71J3338j2730l2153j7066O612j83M338J3843
$$ y = [20290, 2138, -4931, 716, 12929, 47693, 5835, -3411, -22420, -2415, 12911, 480, -21781, -44518, -62379, -40417, -13775, -16353, -24154, -31670, -24714, -15133, -43718, -51906, -22204, -27891, -2857, -12655, -48575, -81754, -59138, -37953, -61068, -69057, -75180, -63924, -57430, -37364, -36837, -11659, -18491, 8472, -12869, -31675, -48463, -79895, -80909, -32370, -29630, -18960, -14922, -25977, -16123, -18742, 23322, 46566, 14402, -44497, -79715, -59902, -50530, -46013, -36163, -63005, -64128, -56244, -45796, -50347, -35654, 15246, 37332, 34149, 56336, 36730, 36121, 8710, -50806, -29727, -26537, -25888, -44642, -81012, -90511, -69276, -37836, 24877, 50873, 35003, 7901, 4066, 735, 3914, 14798, 6575, 7446, 20784, 8054, -24099, -41165, -34553, -34736, -30398, -16555]
15110a6555j5563k9354o005K0880K5480O457k3803j468K2578R504J3453l952l780
15097b128L9537p435j8049k7954J0093O0634J1167n6689n2401K7935P980l2898
15085d0208l786k101J1941K2877K0453L7422J2359m6362l7953K1207J3389J7243
15073B6481m1072l8264O354r244K8855J3168L1125j8539k3501J5929L0185k1735
15061b58J429L6734K8691j0214l6382J0403l0638l6149r86L9615J4600r334M163
15048A1674l655j0756p470k621L4601k10m6313j9096n634K6954K9138k88k5375
15035a9051O715J7618k7285r838l623P474J9517k2330l315J5676K3165l1243j5154
15022d1674J3711K3010L1371l0621N994K0150k3183k919N67K1881J1117k1591
$$ y = [-16555, -32118, -61472, -67477, -46597, -21117, -14660, -38463, -39931, -17353, -7849, 5604, 1652, -2128, 37409, 29974, 11925, -16029, -5936, 54698, 65865, 9176, -43225, -15290, -7310, -40208, -43994, -46095, -34154, -11277, 9176, 46598, 58957, 12595, -25358, -4151, 9238, 26481, -14591, -52855, -46501, -55745, -26890, -13722, 17403, -1136, -24637, -8708, 21477, -258, 1171, 37905, 66596, 56382, 20000, 30403, -235, -36384, -37370, 2245, 16845, 7511, 11674, 8019, -2737, -10207, -12828, 21773, 21563, -24750, -43846, -49480, -22526, 6612, 6324, -19051, -12336, 5282, -22003, -31841, -35464, -27990, -8473, -30803, -34118, -18442, 4723, -26520, -41674, -27963, -4953, 26418, -4203, 1791, 21941, -1242, -4161, -3594, 18287, 29404, 7813]
15010G813j0265n556k5985L987K6831l7881j679K2745P116K293q52N05K5903Q049
14996B3024p28k8753k2525K4791r0L7864P699k1314k7090J1390L6503K0368l0641
14983C0498j8977o87k9372l4865K8291K0111j0767M6538J1321n0478l1636r52
14971d0975J2719j7542M992K6685r933l407J7722K3719M9196J7811m6578n7258
14959b2849K5137J3950l54j7590p644l1207l3282K5383N6092K5580j1225n771
14947A6220j7065r661J5543J2370k5j0394R285M405o909k4793k9288l2490N897
14934f6905K8121J1970L4859J0850j5121k2873k866j5148l8153k6990M521K7602
14922g0133K2437J0905L967j7162l564K8563K7910p536n835L5824L0445j004l6723
$$ y = [7813, -2452, -8008, -33993, -30006, -3175, -41056, -42735, -19990, -12874, -10581, -11433, -10928, 14975, 23024, 22296, -6457, -28982, -4191, -4281, 33583, 41282, 19968, -7122, 4268, 40771, 61139, 30498, 11521, 10834, -18538, -53403, -25112, -5001, -15768, 30770, 42091, -8387, -40023, -40975, -28256, -45798, -40806, -14121, -24054, -27461, -9739, 13980, 63176, 80987, 34409, -22849, 2288, 16238, 15884, -1706, -9350, -40557, -73839, -48456, 7636, 33216, 21991, 16220, -845, -10506, 5037, 17407, 17382, 6988, 16273, 20678, 13769, -11024, -40312, -72802, -66905, -38784, -26814, 8045, 18895, 3774, -19099, -21965, -37113, -75266, -102256, -97735, -70133, -47696, -36791, -32824, -49986, -53550, -24987, 2923, -4613, -10448, 25376, 55821, 54817, 18094]
14909A8094j5698L1318O980k1490L772r793l2193j8752M821K7687K3408m3998
14897b5844j9738j7076K2802K5896K1331R379L4522k0470q202p064P787o065j3618
14884C640J678n0523k1137K4972M5906J4655k3103k1140n703N942Q597M0494J0953
14871C5231k4755j0385m4086j7565N7174q69j6320k0591R261J5238P641j3371
14859b3397O927O313j4966L598o925m073j2008M400m5223J0456L9191J5100Q185
14846a2422J0013M8285p0891m1290K8633N1254j829k6766j6868l4825N340L2551
14834b8815Q193O994R538M5827j5245k1261j9630j776J6275N4337P092k6881k3894
14821A0754j3084k0961J7486k30j6963k4922J7443K2918K6219N650k225J3011
$$ y = [18094, 2396, 33714, 40694, 19204, 22976, 13183, -19010, -37762, -32941, -5254, 18154, -25844, -45582, -62658, -39856, -13960, 7371, 16750, 51272, 30802, 22600, 15536, 23323, 17258, 3640, 5318, -45205, -66342, -41370, 4536, 19191, -3912, -25052, -30755, -24813, -16216, 24278, 35231, 10476, 91, -43995, -61560, -4386, -5255, -21575, -42166, -32905, -17667, -10026, -23397, -16470, -10157, -25123, -21525, -28450, -32523, -44531, -40131, -85354, -74898, -35707, -20607, -12422, -2409, 45876, -25015, -66305, -37672, 13582, 11753, -15013, -31881, -66706, -61366, -28815, -20622, -13628, -4090, 41737, 26492, 5231, -14399, -16175, 100, 54437, 61529, 34648, 10754, -2330, -23291, -5805, -6035, -22998, -47920, -30477, -7559, 18660, 24310, 22085, 35096]
14809C5096J7888k3454k2137k0042K893K3041O150N898J2324p078J931N879k6872
14796A1517k8012j3701O357j0573l0206Q847j3104j7670L8244K4603P170J7852
14784A324k554m0767Q047J70Q9Q752m1946j6785M0378L4241l999j4627L5750J6386
14770B4459K3471j4830k5821k9153k7883p535l202K0403J9813j7019J2212K9273
14758D188N152l4395m1561J3862J4516K4987M752k0282K5884k765J1555J792Q42
14745H527J6572J0545N328j6891l44M550j9922k8383p027K885J1748j183l6480
14732e0075J7704K4776J786o435j95L392m6176l4203K1140K3989L0261J2714R178
14719G856J1549n081o047K1238j9422j5903K8290J7531o580k2375q120l2923k0316
$$ y = [35096, 52984, 29530, 7393, -12649, -9756, 13285, 19435, 25333, 37657, 30579, 32510, 38389, 11517, -16495, -30196, -23839, -34412, -64618, -55771, -68875, -86545, -48301, -23698, -16528, 1324, -1230, -41997, -33950, -33780, -33691, -24939, -66885, -83670, -43292, -9051, -13050, -27677, 8073, 24459, 47930, 33100, 7279, -21874, -49757, -57292, -60494, -40091, -20278, -37297, -25085, 4188, 9340, -25055, -66616, -52754, -38238, -13251, -8499, -28781, -2897, -5662, 5893, 7685, 8527, 25099, 35644, 40972, 24081, 23737, 28287, 8365, -20018, -27045, -24160, -12412, -13595, -50075, -32371, -7595, -5809, -12244, -12439, -9047, -55223, -89426, -68286, -44297, -14036, -1322, 7856, 19405, 14324, 8277, 29515, 10093, -5810, 22480, 40011, 33431, 11056, 2936, -29987, -50303]
14706e0303L7865M0484k8262k3673k512K1184J9506K2001J7969k9397P117j8371
14694A3608l9429k9326J9820J6647O500J7742K2663m541k292N363l049m9413J2135
14681a3572J6385P322j6546k8902J1193M2277r367M701M960j1570n200R179K3802
14668C4662J7281K1363k1155l2304j8952j6981j9622R512K0429j659K4722m092
14656A3204j6713J5075M440j2257O037K5872r761l1022M906R177p67k0715m4949
14643e7473J0704j3233K7239L6030K414l3405K186J3765J2366L0470J5002m132
14631D1933j7230r653M748N720r909K5486R788n1667j7941Q214j2973O118J5769
14618a597J0176l9903J852j853k003K9672o441M286q540j5111L356l7516k9776
$$ y = [-50303, -12438, 28046, -216, -23889, -26401, -5217, 14289, 36290, 54259, 24862, 31979, 13608, -25821, -55147, -35327, -18680, -12180, 5562, 28225, 23684, 21392, 26755, 23706, -25707, -13572, 2813, 10135, -6411, -35313, -24120, 18157, 8790, 13491, 18451, 6881, 1681, 10860, 34662, 51943, 73306, 52151, 19847, 895, -16086, -35708, -26196, -5767, -7426, 17296, 13204, -3509, 11566, 16006, 3749, 9786, 35658, 25897, -5125, -219, 8958, 8191, -12524, -57473, -46769, -60002, -32763, 3267, 5681, -27724, -25538, -11773, 593, 31063, 46065, 41933, 24703, 15050, 19798, 25518, 15609, 41095, 50883, -784, -18725, -10511, -23484, -17366, -1597, 8579, -31324, -29472, -31325, -33328, -3656, -10097, -5811, -14351, -29462, -26106, -63622, -93398]
14605i3398M9426K8500k1298k551R334j5082j4923k7372J4106K2422J4236p136
14593d3736OM472J0445P594R612L4441P036k3243j2665p908k612Q326P4349K2497
14579H8614P295q279l6611k8190L473K0411r076k9184k0950K4364L1143l8135
14567D875k9764k2245J264L0249K4287j8808k8294m5210Q40L4844q656J1806J3203
14554c1609L898k3090J9611L757m149J3965K5066j2745Q282L055j0992k7437k8473
14541f0861J5784Q672R204P671J0184m8765J6J5021l578M1842L1380j5923j5897
14528e250R960j0893j1052M52J8264J4429J9233J5411J4919o075j2839m3695k6927
14515b4063K5172J1132J210Q462q042O916l530r34k4543p618J7727N7202N077
$$ y = [-93398, -43972, -15472, -36770, -39321, -29987, -45069, -59992, -87364, -73258, -50836, -36600, -43736, -43730, -39258, -28813, -21219, -11607, 22834, 29870, 6627, -6038, -13946, -16558, -8232, 66117, 88614, 95909, 87630, 51019, 22829, 26302, 46713, 37637, 8453, -12497, 11867, 43010, 4875, -24889, -47134, -45870, -15621, 8666, -10142, -38436, -83646, -82806, -47962, -56618, -44812, -31609, -27711, -50801, -31190, -27433, -31582, -17617, 7449, -5296, 2986, 6041, -4951, -32388, -60861, -45077, -36405, -27201, -19530, -9346, -58111, -58095, -43074, -46652, -4810, 26570, 10647, -5250, 4710, -6183, -17235, -16783, 1481, 15910, 35143, 50554, 65473, 59398, 46559, 2864, -24063, 1109, 12241, 13451, 21913, 13871, 20787, 17257, 16323, -8220, -15838, 1889, 59091, 64168]
14502F4168k5043k3639L4702J4335k0331m3587l0270k4598J7290P890K167k753
14490b9669K27L54J6744J0471K4611q088k8032K6421J8706n4240l1350M4016L0368
14477B0539j1681l3447O584J5621J9423l4690k3922m193k1371j3053K3877j1156
14465f7469L946k0908l8820j2063L4029K0517O5780O9189j5318m5368M80L697
14453b308j8877K9255R904L5584l472q526M780r145J3056m2794k9427J4990K5295
14440A8315m0655r765j2978M071J2140j9985K632K9274L8754l0679l8519p280
14428e4675J4906j9370L7210L2360L302j1414J985J3486j9697o1915n500N3436
14416a5886L9948R429j055l7341k4923k6540L575L5615N733K0061K5641j3649
$$ y = [64168, 39125, 15486, 50188, 64523, 44192, 605, -29665, -54263, -36973, -29083, -26916, -29669, -29442, -29088, -12344, -1873, 22738, 14650, -13382, 13039, 31745, -22495, -53845, -9829, 20539, 8858, -24589, -18005, -2384, 17039, -17651, -41573, -45766, -67137, -80190, -56313, -67469, -63523, -84431, -123251, -135314, -101285, -80768, -14988, 54201, 38883, -6485, -6005, -2308, -21185, 8070, 17974, 53558, 50086, 41560, 46340, 37195, 50251, 7457, -21970, -6980, 18315, -22340, -32105, -45083, -41012, -28872, -48857, -46225, -16951, 21803, -8876, -47395, -54675, -39769, -59139, -21929, 10431, 13733, 2319, 4304, 17790, -1907, -63822, -69322, -15886, 24062, 33491, 32436, -4905, -29828, -56368, -52793, -17178, -11445, 8616, 34257, 20608]
14404B0608L519J3107l3049k3759j4296K98J0880J0860N888Q219m763j0844o939
14391b0271m298K0622N5058L0830k3531l0006m7209J0495O0754M6404j7971m0492
14379D0385j6190Q727P146J6106k0219l0593K3077q007m4893L488L4110L1820
14367D4957o626l1377j6998K3971m08J521k2324o234j8528n506J843N991j6010
14354d5728j0047j4257J4191R307K2892J2714k4310l517M374J2163L3919M161
14342A5862J9006j2003M411J0185J2051m2706j6070r785j2768L0836J6859j4635
14330A243L342q262j8349M643K0224J7799q05k585j1244j8540j617J2754k8034
14317b9431j2713J9135K3673O3596K06p6946k6260J2304L1648J5250N6187R659
$$ y = [20608, 24127, 37234, 4185, -19574, -33870, -33572, -22692, -11832, -5944, 2275, -2488, -13332, -20271, -24569, -3947, 51111, 81941, 58410, 28404, -18805, -8310, 52444, 98848, 80877, 40385, 24195, 32922, 40068, 56174, 35955, 5362, 28439, 20432, -24461, -20973, 13137, 44957, 38331, 6954, -10044, 13927, 13519, 15040, -7284, -13518, -32046, -37552, -35709, -29718, -45728, -55775, -70032, -55841, -46534, -23642, -10928, -35238, -38755, -34381, -22218, 11701, 15862, 34868, 22865, 27276, 37461, 49512, 6806, -9264, -19049, -31817, -981, 15878, 1243, 4585, -3677, -22026, -17383, 2841, 20640, 19835, 17250, 6006, -12534, -14151, -1397, -29431, -42144, -23009, 664, 64260, 64466, -12480, -38740, -26436, 5212, 20462, 76649, 86308]
14305H6308l3095l7752O574k0466k5352L329j0894L2257J4412K1417M32K0722
14293E7892l002k5319K0250M1702k6161j0612K1557j4488j1437j1922k0530N620
14281B3550Q79j155P543J557n352k0403o952l0953P298J9261R420P55J5320o786
14267A3982k0184k6634K8249J3157L2593R174k0591l2007j7130J0169J9130K982
14255A2890R377j8227K0858J0953l0766j0304K718m952l5764j815L7831N3406
14243D6205J2943k1028j7263j1718j74l559k5117K5234K1391k8995q500j685l814
14230a6080j0758L332m762l54J2944O53K9396O039n2482l768m0435L137M5678
14217b7460K1809J8275j2981K4777M5331r117l3958l4801j5505K3971M4747J045
$$ y = [86308, 53213, 15461, 22035, 1569, -23783, -20454, -31348, 909, 15321, 36738, 37170, 57892, 54890, 29571, 49821, 91523, 65362, 54750, 76307, 61819, 50382, 38460, 17930, 23550, 24429, 23274, 30817, 32374, 27022, 6619, -333, -31286, -23988, -4727, 4693, 5448, 20768, 13982, -6202, -32836, -4587, 8570, 41163, 50337, 29746, -2261, -19391, -9222, 9908, 12890, 22267, 4040, 24898, 35851, 5085, -5219, -2501, -7453, -43217, -45032, -7201, 46205, 59148, 38120, 20857, 9139, 8965, 5406, -19711, 5523, 26914, -2081, -10581, -12266, -16080, -26838, -23506, -28268, -28622, -15678, -15025, 14371, 20410, -32072, -35840, -76275, -73138, -27460, -5651, 12624, -357, 24420, 69751, 60634, 26676, -8125, -23630, 341, 45088, 46133]
14205D6133P010k1718m843K4641J8429l0497o4753j5630K0668L072l9118N866
14193e0740N1378K3931m8849J3599K0518l21m0857k303n64J5156J6070m3660m276
14180e0918m834M3129j111j3014K3402P075k7431q418K7586J0087j6280K0230
14168I503J2322L1355r196L5656m958m8656K9084j2171q851p443k3452j0449m015
14155a1271J9327J2710j6945k760K531j0884k3958J7162j3846j4731j7370K0219
14143c9816K0456M0667K3252l5566j7564L2161P254J5350J5066l2697j9318J533
14131A0778J4536J2324k4895j3138j0895R34k1183o174k8546K5735K3179K1197
14119C852J4245q80l4142R363L4440j9572n579m6380l448M5909K1239L8833j683
$$ y = [46133, 53143, 31425, 26582, 51223, 69652, 39155, -25598, -41228, -20560, -17488, -56606, -50740, 638, 24569, -24280, -10681, 9837, 9516, -31341, -33644, -34208, -19052, -2982, -46642, -50918, -55752, -12623, -13734, -26748, -3346, 3729, -23702, -32120, -4534, 5553, -10727, 9503, 21825, 53180, 43984, 79640, 74682, 26026, 55110, 42939, 34088, 26645, 3193, -7256, -11271, 8056, 20766, 3821, 1061, 3592, -7292, -31250, -14088, -27934, -42665, -60035, -39816, -19360, 21307, 44559, 8993, -8571, 23590, 30844, 46194, 61260, 28563, 9245, 10778, 25314, 37638, 12743, -395, -11290, -10356, -31539, -37713, -66259, -40524, -17345, 3852, 18097, 17217, -16925, -7562, 26878, 7306, 1727, -44653, -48101, -2192, 19047, 57880, 56197]
14106E6197p052j3576j7645j8251j1013p369K8785L5846j6752j8150r261K8713
14094C0472M5592K8638k6393k6860l5343l8680K5664K1136p318N54q048O308p118
14081H604k4448L0987P6804l6833n7553K7292j5210j094L0970o624l546R080J1097
14068D9526J565j0893J1316k5125m0581m630K1254M0208j6881J8588l3507j6653
14056e813r118M464q338K7214M0032r407l0185l0252k5909J1873Q6K3389K3712
14043A1748j6734j9177M0313L0403R354P029J011j0745k172k0982r701q968k281
14030I098K4201k077R56N2410N6910m5727n3389K796Q155j824N1l5736j3820r069
14016g065K3853L5792M424k6416k835P318n227k6789K1328L2056L6701J8716j1480
$$ y = [56197, 49145, 35569, 17924, -327, -11340, -18709, 10076, 45922, 29170, 11020, 1759, 30472, 76064, 104702, 78309, 51449, 16106, -22574, 3090, 24226, 16908, 17462, 9414, 15722, 8604, -15844, 15143, 91947, 55114, -2439, 24853, 9643, 8549, 39519, 32895, 29349, 38429, 49526, 51091, 40198, 51514, 26389, -14192, -18822, 2432, 42640, 25759, 44347, 10840, -5813, -14931, -10467, -18805, 8409, 48441, 39034, 8849, -21403, -47312, -35439, -35353, -11964, 11748, -4986, -24163, 16150, 46553, 55907, 62936, 63947, 53202, 51030, 30048, 20347, 11379, 9098, 33299, 31222, 32178, 84588, 141498, 95771, 42382, 45178, 53333, 51509, 51560, 15824, 2004, -7065, 16788, 52580, 57004, 30588, 27753, 35071, 29844, 3055, 24383, 56439, 93140, 111856, 100376]
14003A00376m4636k2674j8156J0749J2188o6j2265k2215o413k4795j8393M665
13991d1635K2090J7806O091l5700m4832K7250K3726L2774R643K719M885k9434
13979d617j425K8889M931o08j319q973K5308J8960J5564j7721j8731l4483J2015
13966A7790L0791q857o4397r411K4624L346q566J6545L357K4543k3578k5086J1392
13953g507J7056J7034j8887K516l68n1924j0031J8228L8189J8245J3672O750J0161
13940E3134L3914L5528j3392j4397O164j4462j9986m9351k9118N042J8423J2523
13928B4022m7060K4801J1844r451k2517M8749J9991j7061l2774n403j6753N940
13916a5672K8870j2969J2645K5923k4989N7205L1470M234j2511n0091m3744L8461
$$ y = [100376, 55740, 33066, 14910, 25659, 37847, 37781, 25516, 3301, -3112, -27907, -46300, -41635, -19545, -1739, 4352, -31348, -76180, -48930, -25204, 7570, 17213, 19932, 24817, -4617, -6042, 22847, 27778, 27170, 25851, 16878, 42186, 61146, 76710, 58989, 40258, 5775, 17790, 48581, 39724, -24673, -34084, -9460, -6114, -14680, 1865, 5222, 29765, 6187, -18899, -7507, 9549, 26583, 7696, 10212, 9844, -42080, -52111, -33883, 4306, 22551, 36223, 42973, 53134, 87048, 122576, 109184, 94787, 100951, 86489, 66503, 17152, -11966, -6924, 11499, 24022, -23038, 1763, 13607, 4156, -18361, 30388, 50379, 33318, 544, -4859, -21612, -15672, 13198, 229, 12874, 38797, 13808, 71013, 102483, 106717, 94206, 44115, 371, 38832]
13904C8832K2926j0566k9141j0909K6150q732J2144K0766p606j6341J7832j6371
13892C8984n506k421J9324n668R167j9290j3428j0250L2951L2328N118q745P361
13879G9925m3550k6750J0195j2867k8244J1870L7826K2897P476m801k0383J1347
13867D4941K0234L9255m7136l3819J6737k4430k3599j1760r564K2697L3600j3835
13855A3321k5104L6582J8992o122K264j7152L151K8947l655Q59M950j5820j010
13842D0203j8906j6286Q94m5606j4261J5278M8219L4110r990o100N054l3776l4256
13829c5423j9102Q522K8573K5304j079j5643L6734M9990j4964o192K4321j9475
13817F1566k0127k7245J9432K4895J4796m6035l0715j5879J9372M5484N0019J5210
$$ y = [38832, 61758, 51192, 22051, 11142, 37292, 28560, 40704, 61470, 53864, 37523, 55355, 38984, 33478, 31057, 50381, 44713, 53880, 34590, 21162, 10912, 43863, 76191, 81309, 72564, 79925, 36375, 9625, 19820, 6953, -21291, -9421, 28405, 51302, 58778, 53977, 33594, 44941, 65175, 104430, 57294, 23475, 40212, 15782, -7817, -19577, -29141, -6444, 27156, 13321, -11783, 24799, 43791, 37669, 39933, 22781, 25932, 54879, 51224, 52083, 57033, 41213, 40203, 21297, 5011, 5905, -39701, -53962, -38684, 9535, 43645, 33655, 27555, 32609, -1167, -35423, -54525, -46003, -17430, 7874, 6795, -8848, 27886, 77876, 62912, 56720, 81041, 61566, 41439, 14194, 33626, 58521, 73317, 27282, -3433, -19312, 60, 45544, 95563, 110773]
13805A10773l7545n1559k657K9183K9924N338j7403q932K569k0186J1613m740
13793D6378l3838L5513J6689P691j0401J428m4605k6641j8317L2482K3161k5304
13781D236j2509J0860K0477Q649P440j616J2968k0900j5452P468K9306K9533K700
13768H3160l3001j2327p972j6996M294q638j8783l913K0154K9004k3709j2291
13756a018Q647K5242l132O906J5337J572m914n6547q47O3518M3102k3159k5669
13743D9038o079K0881L1592k874k5627j7343k6256k2869L5729K4034p618j3154
13731C9454J2431j1633j1460j3567j2676j5961K9340J5475j4234O117l9060j2082
13719b7856K8390j9225J1097K4061L1193J4338M078j4416l0103n258j0445J1678
$$ y = [110773, 73228, 21669, 19012, 48195, 78119, 83457, 66054, 57122, 59691, 39505, 51118, 46378, 12540, 48053, 64742, 72433, 62032, 63460, 18855, -7786, -26103, 6379, 29540, 4236, -8273, 2587, 23064, 31713, 39153, 37537, 50505, 29605, 14153, 21621, 50927, 80460, 83160, 50159, 37832, 29860, 12864, 17158, 8520, -10263, -14176, 5978, 34982, 11273, -1018, 7629, 32871, 29739, 36645, 51982, 53554, 48640, -7907, -8754, 54764, 97866, 74707, 49038, 42959, 63840, 95432, 92558, 66931, 49588, 23332, 463, 36192, 60226, 52608, 39454, 51885, 40252, 28792, 15225, 2549, -13412, 15928, 31403, 17169, 23286, -15774, -27856, 534, -18691, -7594, 16467, 47660, 61998, 66076, 51660, 21557, 16299, 5854, 17532]
13707A7532j7907R450J6200R398j6473n891J5749N0727J3852j5099l1464k2104
13695B3970m551L6760K8651J9569J5833j7133J77j8961k5327l1140l8782J4507
13683C573M1913j31l2552O339P972L2528N155M943Q58m8833m638J2504k0991j3376
13669d736J1568K0771L0382L821J303m3313q267L757J4392O621K1873J1164k9519
13656C9817n0450n472m505J8922J2870K7266J2628l3966l446J1829N790J2368
13644D3651j9857L343J3097J6000l151K5823J9310j957k0947l6349J0142k96K4849
13631G3658J7521P89l6639r917k2553K0955N957r716j6139j843k70J9369J6925
13618E8097J894m9021l6428K1797J079K6950J4861l3253N048O6814O436l2549
$$ y = [17532, -375, 9075, 25275, 34673, 18200, 12309, 28058, 78785, 92637, 77538, 46074, 23970, 19419, 56179, 84830, 104399, 120232, 103099, 103276, 84315, 58988, 27848, -10934, 3573, 45486, 45355, 12803, 19142, 27114, 59642, 64797, 69740, 70598, 21765, 17127, 29631, 8640, -4736, 6832, 27603, 57985, 61806, 63109, 19796, 11529, 15286, 29678, 36299, 58172, 69336, 39817, -10633, -16105, -20610, -1688, 11182, 38448, 51076, 17110, 13664, 25493, 31283, 43651, 23794, 27137, 40234, 56234, 53083, 78906, 98216, 96259, 75312, 38963, 49105, 48809, 73658, 91179, 91968, 55329, 45412, 22859, 43814, 49771, 40055, 23916, 22073, 21803, 41172, 58097, 59991, 10970, -25458, -3661, -2582, 24368, 39229, 5976, 11024, 77838, 84274, 51725]
13606E1725k4528j8802J4686k105Q305L5728M3389P340k1756k3284j9902l1539
13594A9257M376J0300J3592J7249p067k613N15K2285j1781l5193j9319J934M071
13581A7606M0708L3073k107q969J9184P983j7915m291m14J1050k1558q161k408
13568F3781K3159J103K1500j2533m3043n0622L0942j2567J73N2465L5052J631
13556A11041j5230R133k651r518l0374r385R195o237L039J5161O415j9953M157
13543F4793l0936J5743J946j8448J7328j046J7726p004k3046L0389J8105O152
13531I1702k9049k8901J1293p29k15K6370J760j1906J046j494L139J3306P623
13518H3945j3326r604l1431k1942K8308L2293j8403k1994L12K2197J7728k4609
$$ y = [51725, 27197, 8395, 23081, 20976, 29281, 65009, 108398, 115738, 93982, 70698, 50796, 19257, 23633, 33933, 47525, 64774, 57707, 55094, 55609, 77894, 66113, 30920, 11601, 13535, 17606, 58314, 91387, 89280, 80311, 99495, 107478, 89563, 85272, 84858, 95908, 74350, 66189, 63781, 86940, 88043, 109543, 97010, 53967, 3345, 34287, 21720, 21893, 74358, 109410, 111041, 95811, 104944, 102293, 92775, 62401, 53016, 62211, 55974, 59013, 74174, 80589, 60636, 64793, 33857, 49600, 51546, 33098, 50426, 49380, 67106, 60102, 37056, 67445, 85550, 91702, 62653, 33752, 45045, 44316, 44101, 70471, 72231, 60325, 61371, 59877, 63016, 76322, 83945, 70619, 61015, 29584, 7642, 35950, 68243, 49840, 27846, 28158, 50355, 68083, 43474]
13506D3474l878k30Q270j8051q070k1673J6439L8698K5817K3661M0n2907l9595
13493A1995j3706P050M2985M919j9502l4233K4452J9261k0233l4841K0059j295
13481F911j626k0961Q140K3391J7578J2290J9373j3940o229K8382l6971l3846
13469B492j8836L1261M1595r504k0390J6702r856J10P180j6196k7034M740L0206
13456C2470q407J2055J0024J6212J1445m99q49K2287m686K8192j2151j5983k593
13443H7517j4596j1552j6598J5972K1431j6004j1266N788L0709R787l0603l1711
13431C8874j6495o504L9409K2071k4879P88j3274L9065K0987k356l5011R555P865
13418H0095j3649m0349J2931M4702q710l7053o758j1129m913L2961J0948l218
$$ y = [43474, 39596, 39366, 47636, 29585, 21515, -158, 16281, 54979, 80796, 104457, 104497, 51590, 11995, -1711, 5339, 48324, 53243, 33741, -492, 23960, 43221, 22988, -11853, 8206, 6911, 5285, -15676, -7536, 15855, 33433, 45723, 65096, 51156, 44927, 73309, 36338, 2492, -16344, 14917, 56512, 47008, 26618, 43320, 33464, 33574, 40754, 24558, -2476, 2264, 32470, 24063, 36118, 46142, 62354, 73799, 73300, 72451, 94738, 90052, 118244, 106093, 90110, 87517, 72921, 61369, 44771, 60743, 82174, 66170, 54904, 60692, 91401, 101188, 70585, 38874, 22379, 15875, 55284, 77355, 52476, 53264, 39990, 79055, 100042, 97686, 62675, 72230, 80095, 66446, 26097, 39028, 83730, 75020, 37967, 31209, 20080, 15167, 48128, 59076, 55858]
13406E5858o446L663J3784k7541O744K4460J5247n748m0152m7349J4096J9961
13394B6577l738K4656K6320J080j3879j3088J5361P639n657L995j1302k5535K6156
13381E8585J0140J5172Q376M554J1635J7231N310k3751k6946j328K9174K0084
13369A28236j7408n672q465j1886l3877k360j2961j2461M3775K1143k24l3935
13357E3905j1846L509M384O984j133Q080N350r908l259K9825O935n397m5641o045
13343C5743K3308M7567J6642Q324l5046n131K7719j9593m0614l0097K5828J0914
13331F5564L7844Q433l1620l7698J1548J3318j6726j2747L5822N928Q300R889
13319I7855J5941k8009r083j5537L905J4288K1411L260J7441q667j6144m8169
$$ y = [55858, 49412, 53075, 66859, 39318, 46062, 70522, 85769, 80021, 39869, -7480, 6616, 26577, 22839, 47495, 73815, 74895, 61016, 47928, 63289, 70928, 65271, 69266, 57964, 32429, 58585, 68725, 83897, 92273, 96827, 108462, 125693, 131003, 107252, 80306, 78978, 108152, 128236, 110828, 105156, 96691, 84805, 50928, 48568, 35607, 23146, 66921, 88064, 87840, 53905, 42059, 45568, 49952, 56936, 55803, 63883, 69233, 59325, 56066, 85891, 92826, 87429, 41788, 35743, 59051, 106618, 123260, 131584, 96538, 91407, 119126, 99533, 58919, 28822, 54650, 65564, 103408, 111841, 80221, 42523, 54071, 67389, 50663, 37916, 73738, 79666, 87966, 97855, 113796, 85787, 76704, 61167, 65072, 79360, 100771, 104031, 121472, 112805, 96661, 48492]
13307D8492J637K4729Q051k6555R080K1876k3236Q986j8275k0143P38M0410j0289
13294F5501n0789R7O891J5525n010M0175P635k9863o637q773J1985M2020L8083
13281A26840l8254k7785K1193l0781K4741J2033r075K2740k2387j0171p748k3305
13269C8041j4706K6908J974P150J3011K3935R920q905j6593k9295J2740N9482
13257A23662J5567j2006k9219k333K0106K6375J6863n3454k7647J0329R729N19
13245I8491p296j5684J6625Q067k1682k7955M463K6765k089P31J183j1687J2623
13232H2555K4352J740k6698N347l0708j5780K9569M511l812k5522L0412K4012
13220I9978J0399q591m5542j8787O223R582L1256K601o988j056j2951O021J4369
$$ y = [48492, 50129, 74858, 82909, 56354, 65434, 87310, 64074, 73060, 54785, 34642, 35380, 75790, 65501, 14712, 14809, 21700, 37225, 32215, 72390, 80025, 50162, 43525, 34752, 46737, 88757, 126840, 88586, 60801, 81994, 51213, 75954, 87987, 78912, 101652, 79265, 69094, 61346, 38041, 23335, 50243, 52217, 59367, 72378, 96313, 106233, 97328, 80735, 51440, 64180, 123662, 139229, 127223, 98004, 95671, 115777, 142152, 159015, 105561, 77914, 88243, 97972, 98491, 91195, 75511, 92136, 100203, 78521, 50566, 55029, 81794, 79705, 80436, 81619, 69932, 82555, 106907, 108647, 81949, 87296, 56588, 40808, 70377, 74888, 71076, 45554, 75966, 99978, 110377, 101786, 56244, 37457, 43680, 53262, 84518, 87119, 80131, 79075, 66124, 72145, 86514]
13207H6514k051n307m486m1100L976L4825N097L5146K2187k08J8087J4105l0146
13194A36639l5978K3418L8013M445R355p918q458j8690J0821j8011j2772j4958
13182A05906K946J5758P69k7087l1503K9381J1957r66j1860l3214r927L5491J9941
13169A07592l2119l67J1381m9694k233k0464L0368J573J3106J3452Q171J6671
13157I7437o417J6335K906m362m272J4470O486J1038k312K3963j0371m9624l0136
13144F5141m2125K0368N9692J3913j0543j9075J8270L7835J7991k2343J0641J3444
13132A63209j542M10j0959k0094L8533k1530k0527j8383N977P219j4747k7659
13120G9907K606R842J9928K6698j9009l8658j9459K4476K8620J5354L512k2244
$$ y = [86514, 84463, 79156, 74670, 33570, 37546, 72371, 77468, 112614, 134801, 134593, 152680, 166785, 136639, 100661, 124079, 162092, 166537, 175892, 167974, 159516, 140826, 151647, 133636, 120864, 105906, 108852, 124610, 125379, 98292, 66789, 96170, 108127, 107161, 95301, 62087, 52160, 87651, 107592, 75473, 75106, 86487, 36793, 34560, 14096, 44464, 46037, 59143, 72595, 80766, 97437, 91020, 107355, 110261, 105899, 101627, 116097, 122583, 133621, 131309, 155272, 144901, 95277, 65141, 23016, 43384, 103076, 116989, 106446, 87371, 105641, 143476, 161467, 139124, 149765, 163209, 161667, 162077, 151118, 131024, 169557, 148027, 127500, 109117, 115094, 122313, 107566, 79907, 82513, 92355, 112283, 138981, 119972, 81314, 61855, 86331, 114951, 130305, 133817, 111573]
13108A11573j3438K829R27k5929k1628J5909M3746L3397J5064j0494k3257J8558
13096A47257j4077l7561m14K3938L7101j7962O217j0272k2029j7322k2270J740
13084G4346j0969J841L0073M6187J2786M3861L2568k9197k4905J2909k6338m1519
13072A21643j0453N845Q315J3013J2985J5219J1309j5521l6340k9559L2504K4289
13060A53249J8172K5751N0074M2108N1126M2455Q2721O6188j743k8478o6357n9437
13048C75829n7193n4678k2979k017k7890k6737L566K2051J2276p951n4476k5821
13036A33980K0296k3421R139M9091M9543p293j0677l0201j20J2100J4940J6620
13024B33997j8946P367K0700j583r093q074P634K125k4505K8998K3673N3248P6536
$$ y = [111573, 98135, 100964, 101891, 75962, 54334, 70243, 113989, 147386, 162450, 151956, 128699, 147257, 133180, 95619, 95205, 119143, 156244, 138282, 144499, 134227, 112198, 94876, 72606, 74346, 63377, 65218, 95291, 141478, 154264, 198125, 230693, 201496, 176591, 189500, 163162, 121643, 111190, 117035, 125350, 138363, 151348, 166567, 177876, 162355, 126015, 96456, 128960, 153249, 171421, 197172, 247246, 289354, 340480, 382935, 465656, 531844, 530101, 501623, 435266, 375829, 318636, 263958, 240979, 238962, 211072, 184335, 187901, 209952, 222228, 214277, 159801, 133980, 154276, 130855, 139994, 189085, 238628, 231335, 220658, 190457, 190337, 202437, 217377, 233997, 215051, 222418, 243118, 241535, 232442, 224368, 232002, 234127, 209622, 238620, 262293, 315541, 392077]
13011C92077J60889K48539K86542K29258P3240p8713j65526k17949k38754j64895
13001E24708j01134m3057l7396k8429J6626J6964J390N85j4983o187l1134k3478
12989B74475k0559j4920j3517N317L0448o012K6904j7158l3557k3211Q222J5680
12977B32112j911O410l027Q376j2263K7138K6291J3729J6621R2032J25563J47069
12965F78140K55060K46752K62477J17644q3188j52557k33407k38893k19124j32924
12955D99980l6199k7781l0361k0263k6431j0718k0125K3186J7421m8229r981J0374
12943C20873k2098k7490J9929l897k5562j1481n601j6808k967o768N5325J8797
12931B92252k8369n8303k2047M956N9183K8579j0896o008K6258N0130N4827N6073
$$ y = [392077, 552966, 801505, 1088047, 1317305, 1390545, 1311832, 1146306, 928357, 689603, 524708, 423574, 380517, 343121, 314692, 331318, 348282, 349672, 350257, 335274, 329087, 297953, 274475, 253916, 238996, 225479, 230796, 261244, 255232, 282136, 264978, 231421, 208210, 216432, 232112, 230201, 236611, 233584, 241960, 229697, 256835, 283126, 296855, 313476, 405508, 531071, 678140, 933200, 1179952, 1442429, 1560073, 1476885, 1324328, 1090921, 852028, 632904, 499980, 463781, 436000, 405639, 385376, 358945, 348227, 328102, 351288, 368709, 320480, 310499, 320873, 298775, 271285, 291214, 287317, 261755, 250274, 244673, 227865, 224898, 218130, 273455, 292252, 263883, 205580, 183533, 188489, 247672, 276251, 265355, 259347, 285605, 335735, 390562, 446635]
12919D46635M0196P1097J5591k8452k8395n7901p1145n1820j3495k235k3498k7623
12907B68955r900j3728j6395K1564J9382l426j3725k1955l3220M6302K3411j8649
12895B48616m7602m675K4291M5182p551k8359j2970r885k548L929J3736J3536
12883B35700M3228J2128n2061L845P304j576j4380l7505j7296N860J2581j5693
12871A82135j6626L6663K6303J9393J657l1480l8208m251K8778J8897l3835O119
12859A95545J4886L4874K2202J5474l7202r027j5637j7379j1336k8073N631K9241
12847A99199O078m2608j3484J1469L3651j2450k2958l4864J2809M7279M5648J1568
12835B41337k1857P565O887J6214J3392L2710j3524n7392j1234k2494O719J1152
$$ y = [446635, 486831, 557928, 573519, 545067, 516672, 458771, 387626, 335806, 322311, 320076, 296578, 268955, 259055, 245327, 228932, 250496, 269878, 266452, 252727, 230772, 197552, 243854, 267265, 248616, 201014, 196339, 220630, 265812, 258261, 229902, 216932, 207047, 204499, 208428, 222164, 235700, 278928, 291056, 238995, 242840, 250144, 248568, 234188, 196683, 179387, 185247, 197828, 182135, 165509, 202172, 228475, 247868, 249525, 218045, 179837, 175586, 204364, 223261, 189426, 195545, 210431, 245305, 267507, 282981, 245779, 236752, 221115, 203736, 192400, 164327, 169958, 199199, 205277, 162669, 149185, 160654, 194305, 181855, 158897, 124033, 136842, 184121, 229769, 241337, 219480, 227045, 233932, 250146, 263538, 296248, 282724, 225332, 214098, 191604, 198323, 209475]
12823B09475P916k853l4064J3046J1362J645k1525j64K3319P273L449J3847L3094
12810B65820j978J9599j9362q497m69K5891R387k4217O58K6860k3396l408n220
12797B61668m6069o6124n822J7138L4473M6088k9346J8712K6078J3766k2074k9928
12785B18560J5112K4183O622k0420j1144j5682P401j1882J42J1636M989j969j3513
12772B14035M0497P462m2590l944l0023J9721M7183L5711r82Q95l5369R550K4175
12759B86321K4639R884q483j3528l1897N1389j4229n2364J0068j9188j2363J9931
12747B50180k6662K6687M0762K8658J6421J4228l1487J0900K5267k5173q1547
12736B48234m5086R349L6019M6275J2500l4264k0400n635N980J7305K9592k529
$$ y = [209475, 217391, 214538, 180474, 193520, 204882, 206527, 185002, 184838, 208157, 215430, 218879, 232726, 265820, 263842, 283441, 264079, 255582, 255113, 281004, 290391, 266174, 266832, 293692, 270296, 266888, 261668, 215599, 149475, 143653, 160791, 195264, 241352, 212006, 230718, 256796, 270562, 248488, 218560, 233672, 257855, 264477, 244057, 232913, 217231, 224632, 212750, 212892, 224528, 229517, 227548, 214035, 254532, 261994, 219404, 215460, 185437, 205158, 252341, 288052, 287070, 287965, 252596, 262146, 286321, 310960, 320844, 312361, 298833, 266936, 318325, 304096, 251732, 261800, 242612, 230249, 250180, 223518, 250205, 290967, 319625, 336046, 350274, 318787, 329687, 354954, 329781, 248234, 203148, 212497, 248516, 294791, 307291, 273027, 252627, 246992, 252972, 270277, 299869, 297340]
12724B97340O280K9771N647P957j7227o3918m1390J400L5187J6756m894j4116
12712B58793r318M3376R624r82n7307l1871N7282L0248p350J5501j0762j1950
12700B85284K2278J7219j4997K0811K0669j766j9854l7029O245L3455j2325k4445
12688B95545K0803M5047P259j9087j2809J0028J8695r326l0489L006J9396J4324
12676C62392k311l4151k5896M6818k8855J6982L5431N432k7456k4672K9443J4958
12664C68115M030O658k9778P358J4108j2371J4190J2774j9989k5259j0221L3275
12652C62890l680N437j150k1498N909Q308M118j3664K1156o851j4880r676J8975
12639C55394K342q964j7934r005j0170Q088J798K6111N749m0629L2163L0036K1090
$$ y = [297340, 303620, 333391, 339038, 346995, 329768, 265850, 224460, 225860, 261047, 277803, 272909, 258793, 249475, 292851, 302475, 301493, 244186, 212315, 269597, 299845, 292495, 307996, 297234, 285284, 307562, 324781, 309784, 330595, 351264, 349498, 329644, 292615, 298860, 332315, 319990, 295545, 316348, 361395, 368654, 349567, 336758, 346786, 365481, 356155, 325666, 328672, 348068, 362392, 360081, 325930, 300034, 346852, 317997, 334979, 370410, 375842, 348386, 323714, 353157, 368115, 372145, 378803, 349025, 356383, 370491, 358120, 372310, 385084, 365095, 339836, 329615, 362890, 359210, 364647, 363497, 341999, 347908, 356216, 360334, 346670, 367826, 360975, 346095, 336419, 355394, 357736, 348772, 330838, 321833, 311663, 319751, 321549, 347660, 353409, 312780, 344943, 374979, 396069]
12626C96069P449k9753m078j7692k1058N090K5573L1409j5705o6093k0343K241
12614B93109N0019J7337j9702P416L1444k1514l0903L5351K7865k2877q561m364
12602C54620j0639K7967J2857k8419k2136M9125R512k0020K3964L4349P95p224
12590D24751r142n265j4999J1582k557N413J8136O838l6699n1766k6663J2621
12578C32250M0401L4857K3151R304m891J481N07l7233j7926j6460j7610l948K6219
12565C70102K3443L492m2517j5702L6307K4960o879j6089L8744J4125j1152O465
12553D25299n478j6578l594j4830J1207M0047J6793l5521l53Q834m1554J0092
12541C94364K3532M4198K0486n628M811r267l5209l0440K9913L8260n232j0780
$$ y = [396069, 403518, 373765, 369687, 351995, 330937, 336027, 361600, 393009, 377304, 311211, 290868, 293109, 343128, 360465, 340763, 348179, 379623, 358109, 327206, 362557, 390422, 367545, 358984, 354620, 343981, 371948, 384805, 356386, 334250, 383375, 392887, 372867, 396831, 431180, 431975, 424751, 415609, 410344, 395345, 406927, 404370, 409783, 427919, 434757, 398058, 346292, 319629, 332250, 372651, 407508, 430659, 439963, 435072, 436553, 437060, 399827, 381901, 365441, 347831, 343883, 370102, 393545, 397037, 354520, 338818, 375125, 400085, 393206, 377117, 415861, 429986, 418834, 425299, 419821, 403243, 399649, 384819, 396026, 436073, 452866, 417345, 416992, 425826, 384272, 394364, 417896, 462094, 482580, 476952, 481763, 472496, 437287, 406847, 436760, 475020, 469788, 459008]
12529D59008K6389M899k2327J1209k956j8296k3666K931n09j1826L0885K6463
12517D82204j3349J7330J776r854P004K2585J7855k448o819J4395j1928j6120
12505E02631J6084r625k9524r028j2027J2105J1391R698M1855j976l5044l507
12493D93033N5104O6067q263k5949K0613j7374j6081k1587J4929p876N957m8812
12481E09761n181J6290o531P823K458L756J8747k3663j8596M298L6646K033p748
12468E40093K7769J105j2208M6248n447M447L951j5232q449K5102J8067k3101
12456F02345j1802K843k118l8237m6391K4618J6447j0176J2639J0443l6820k1781
12444E02010K5168L2269r693P059L6151O409j2971r708L4381J0140l6923r282
$$ y = [459008, 485397, 490296, 467969, 479178, 476222, 457926, 434260, 437191, 436682, 424856, 455741, 482204, 468855, 486185, 487961, 478107, 485111, 507696, 525551, 523103, 516284, 530679, 518751, 502631, 518715, 509090, 479566, 470538, 458511, 470616, 482007, 491705, 533560, 531584, 496540, 493033, 548137, 614204, 605941, 579992, 600605, 583231, 567150, 545563, 560492, 552616, 558573, 509761, 504580, 520870, 514339, 522162, 524620, 528376, 547123, 523460, 504864, 509162, 545808, 547841, 540093, 567862, 568967, 556759, 603007, 597560, 602007, 605958, 590726, 582277, 607379, 625446, 602345, 590543, 593386, 591268, 553031, 506640, 531258, 547705, 537529, 550168, 560611, 523791, 502010, 527178, 559447, 549754, 556813, 592964, 599373, 586402, 576694, 611075, 621215, 584292, 575010]
12432E75010m016L6681O5442n176k9157j1325k2345q675M4753j1308p518J164
12420F23530L3606j927o2688P088K9097j0335J570J8942j0541O824J3449r578
12408F39037j5911J7532J8768m1531p785K2950J2970L8506K8540k7298m6108l974
12396F35696K0186K1439j3215l0763K486L7086R497j1030K29J5515K3521P809
12384G18456k0446M900M083l2666k4676L1003K3929k0981l9243O113K2974L5316
12372G08762J8280j8126j0048R699Q667l2591J6608J4928r859q018k8873l2391
12360F37038K918L5792M5571M6851J4709j6452j2475N824L949k1517l0966p908
12348G03334L703j7478J4089K6999J1501k986L7111N3157K5081J4841k1480r769
$$ y = [575010, 570994, 607675, 673117, 667941, 638784, 627459, 605114, 596439, 641192, 629884, 622366, 623530, 657136, 655209, 592521, 599609, 628706, 618371, 619941, 638883, 628342, 635166, 648615, 639037, 623126, 640658, 659426, 617895, 610110, 633060, 646030, 684536, 713076, 685778, 639670, 635696, 655882, 677321, 664106, 633343, 635829, 672915, 682412, 671382, 671611, 687126, 710647, 718456, 698010, 702910, 706993, 674327, 649651, 680654, 704583, 683602, 644359, 650472, 673446, 708762, 727042, 708916, 698868, 708567, 717234, 684643, 701251, 716179, 706320, 698302, 669429, 637038, 639956, 675748, 721319, 768170, 782879, 766427, 753952, 759776, 763725, 742208, 711242, 703334, 707037, 689559, 703648, 730647, 742148, 739162, 776273, 829430, 854511, 869352, 847872, 838103]
12336H38103k4860n0480j8166J3849l48J3134K530J0437l0433j3050k2086j390
12324G17240K7025K4286J236J80K949R02P755P388L0650j7355j5827J6796K0223
12311H23448l247r5P503j5215K4561k0924l0055j1888J0211O889J9235R625n935
12298H14113R873M0460J68k0277k2144l3985j3584K0084J2425K2105L0028L9557
12286H98823l5817j9175o11m074j2176K6198M1865K5910J2259J2161k8830k0463
12274H96070N047J3096J6293j1694k9099k9455P651k2060K7037M0649J3566l5481
12262H91620J1131L0564j2033k4186l31j3152p458k697J1590L26j5623P896j8636
12249H59011N713J5315M4339N721N39J0377L125O144Q805p244n340j4175k0942
$$ y = [838103, 813243, 762763, 744597, 758446, 758098, 771232, 773762, 784199, 753766, 740716, 718630, 717240, 744265, 768551, 769787, 769967, 772916, 773818, 781573, 788961, 819611, 802256, 786429, 803225, 823448, 820201, 820106, 827609, 812394, 836955, 816031, 785976, 774088, 784299, 791188, 810423, 820048, 814113, 823986, 864446, 864614, 844337, 822193, 788208, 774624, 794708, 807133, 829238, 859266, 898823, 863006, 843831, 843220, 839146, 826970, 853168, 895033, 920943, 933202, 945363, 916533, 896070, 901117, 914213, 930506, 918812, 889713, 860258, 867909, 845849, 872886, 913535, 927101, 891620, 902751, 933315, 921282, 897096, 896765, 883613, 876155, 873458, 885048, 885374, 869751, 877647, 859011, 864724, 880039, 924378, 930099, 930638, 941015, 944140, 950284, 959089, 951845, 946505, 932330, 911388]
12236I11388j2740K561Q537M9209J5866j7069O86k9328j5920Q643J0260K0242
12224I52335L782k641K87K9158J7112k5562L5761J4184K8493J3424n1206m0128
12212I74999l2704L6351p84L5689J7469O310J3283j3648m4096k4357q428K1621
12200I81705p981j8470K4051K3533N5617M6087l1103j5144j3063O91K1420j2122
12188A055221m862m492j5379k615O5077L7235K7903R713l9860r226L6268K82m3440
12175A111825j9068o971k3515K7297J6600J5539K8678j0453K573J5516m098R387
12163A163310R490J5242q783j8484R38K5485m821k8470j0962L0989L55L6514j0803
12150A200000k2444K5641j9876K7621K0255l5731J2522K9168p016o719j2463j065
$$ y = [911388, 898648, 901209, 909746, 958955, 974821, 957752, 958438, 929110, 913190, 921833, 932093, 952335, 956117, 953476, 953763, 982921, 1000033, 974471, 1010232, 1024416, 1052909, 1066333, 1015127, 974999, 942295, 978646, 977862, 1013551, 1031020, 1037330, 1050613, 1036965, 992869, 968512, 960084, 981705, 973724, 955254, 979305, 1002838, 1058455, 1104542, 1073439, 1058295, 1045232, 1045923, 1067343, 1055221, 1050359, 1045867, 1030488, 1027873, 1092950, 1130185, 1158088, 1167801, 1127941, 1118715, 1154983, 1155265, 1111825, 1092757, 1085786, 1062271, 1089568, 1106168, 1121707, 1150385, 1139932, 1142505, 1158021, 1153923, 1163310, 1172800, 1188042, 1179259, 1160775, 1161713, 1187198, 1182377, 1153907, 1142945, 1173934, 1174289, 1210803, 1200000, 1177556, 1203197, 1183321, 1210942, 1231197, 1195466, 1207988, 1237156, 1230140, 1223421, 1210958, 1209893]
12138A209893l0681k3190J1719L587J6275K1051M8042J7606l6966m7688l962N181
12126A190867K1531k432o449O875q009j0491n96r554K8328J4623l0637k4054j9791
12113A150211j1741q998J8418M3556K1836K1770N40j2727k0605J0531L4767L4130
12101A281688L0733K6490L0555O751M1224J2688l9474k5351k1270k9873k3304
12090A290857n981J0095N537j792n332l3973p443M0683k8156M767L2048m4284
12078A257026k1446R484R870m450r617M766J1941j8938j4538J427K3032o236m483
12065A237838J5802J865P949l743j1335J3116K1054J5782M4156J9860K9209P5149
12053A466702O527n803j8369j3780j0784m9998n0354m2864P124o81j4252M2730
$$ y = [1209893, 1179212, 1156022, 1167741, 1171328, 1187603, 1208654, 1256696, 1274302, 1237336, 1189648, 1185686, 1190867, 1212398, 1209966, 1203517, 1210392, 1202383, 1191892, 1191296, 1181742, 1210070, 1224693, 1194056, 1170002, 1150211, 1138470, 1129472, 1147890, 1191446, 1213282, 1235052, 1235592, 1222865, 1202260, 1212791, 1247558, 1281688, 1312421, 1338911, 1369466, 1376217, 1417441, 1430129, 1390655, 1365304, 1344034, 1314161, 1290857, 1284876, 1294971, 1300508, 1298716, 1293384, 1259411, 1251968, 1292651, 1264495, 1269262, 1301310, 1257026, 1235580, 1245064, 1254934, 1250484, 1240867, 1245633, 1257574, 1238636, 1224098, 1225525, 1248557, 1242321, 1237838, 1253640, 1255505, 1263454, 1259711, 1248376, 1261492, 1282546, 1298328, 1342484, 1362344, 1391553, 1466702, 1473229, 1467426, 1449057, 1435277, 1424493, 1374495, 1324141, 1281277, 1288401, 1287720, 1273468, 1316198]
12041A316198K3397l6781n7839J0289L7497K6356m281m779j1089l3334k4435N1882
12029A293081N1632k8410j4759j064R1R64J4399J97l0736n6519m846k0482K8558
12016A232106K0407K1307J9032q511P045j2678J4373L4369K7928L049o189j7133
12004A335105j2173q42K4931k0265o891j143j7449k5370j2517l4968K397K5752
11992A256567J6831k1941j7995j5956K3440R860k0447J506J0625Q822K8224k1538
11980A257998k4076L881k0171k7705j393J0600L5904K3496j0649K1173k279M74
$$ y = [1316198, 1339595, 1302814, 1244975, 1255264, 1292761, 1319117, 1314836, 1310057, 1298968, 1265634, 1241199, 1293081, 1344713, 1316303, 1301544, 1300480, 1300571, 1301535, 1315934, 1316131, 1285395, 1228876, 1224030, 1203548, 1232106, 1252513, 1273820, 1292852, 1284341, 1291386, 1278708, 1293081, 1327450, 1355378, 1358427, 1352238, 1335105, 1322932, 1322090, 1347021, 1326756, 1319865, 1318722, 1301273, 1275903, 1263386, 1228418, 1230815, 1256567, 1273398, 1251457, 1233462, 1217506, 1240946, 1250806, 1230359, 1231865, 1242490, 1251312, 1279536, 1257998, 1233922, 1237803, 1217632, 1189927, 1188534, 1199134, 1235038, 1258534, 1247885, 1269058, 1266779, 1267253]
$$ [...]
##END NTUPLES=NMR SPECTRUM
##END=
