##TITLE=Analysis number 311870
Compound Code cc 24810
Book Reference 378/156/1
Project Code adrs
Chemist Name benw
##JCAMPDX= 6.0         $$ Bruker NMR JCAMP-DX V2.0
##DATA TYPE= NMR SPECTRUM
##DATA CLASS= NTUPLES
##ORIGIN= Bruker BioSpin GmbH
##OWNER= NMR
$$ XWIN-NMR		Version 3.5
$$ Tue Jul 19 09:55:47 2005 GMT Daylight Time (UT+1h)  MAYBRIDGE\NMR@NMR_250MHZ
##.OBSERVE FREQUENCY= 250.131544655141
##.OBSERVE NUCLEUS= ^1H
##.ACQUISITION MODE= SIMULTANEOUS (DQD)
##.ACQUISITION SCHEME= undefined
##.AVERAGES= 16
##.DIGITISER RES= 18
##SPECTROMETER/DATA SYSTEM= dpx250
##.PULSE SEQUENCE= zg30
##.SOLVENT NAME= CDCl3
##.SHIFT REFERENCE= (INTERNAL, CDCl3, 0, 16.4289)
##AUDIT TRAIL= $$ (NUMBER, WHEN, WHO, WHERE, WHAT)
$$ ##TITLE= Audit trail, XWIN-NMR		Version 3.5
$$ ##JCAMPDX= 5.01
$$ ##ORIGIN= Bruker BioSpin GmbH
$$ ##OWNER= NMR
$$ C:\u/data/dgb/nmr/ADRS/6000/pdata/1/auditp.txt
$$ ##AUDIT TRAIL=  $$ (NUMBER, WHEN, WHO, WHERE, WHAT)
(   1,<2005-07-19 09:55:26.29 +100>,<MAYBRIDGE\NMR>,<NMR_250MHZ>,
      <created by zg, POWCHK disabled, PULCHK disabled
       configuration hash MD5:
       62 19 C7 07 E1 42 D1 B7 37 6C 3D D0 77 39 F9 E6
       data hash MD5: 64K
       D8 C4 2B 3C 23 CA EA 5D B3 95 46 12 BE EB D0 93>)
(   2,<2005-07-19 09:55:39.08 +100>,<MAYBRIDGE\NMR>,<NMR_250MHZ>,
      <Start of raw data processing
       ef LB = 0.3 FT_mod = 6 PKNL = 1 SI = 32K 
       data hash MD5: 32K
       3C EB 37 0E C9 FE 50 8D 84 B9 7F E2 0F 20 5B 45>)
(   3,<2005-07-19 09:55:41.35 +100>,<MAYBRIDGE\NMR>,<NMR_250MHZ>,
      <apk 
       data hash MD5: 32K
       AF 20 6B AD 61 80 C2 F0 0C 5D 91 C8 2C 96 DC B5>)
(   4,<2005-07-19 09:55:42.05 +100>,<MAYBRIDGE\NMR>,<NMR_250MHZ>,
      <abs ABSG = 5 
       data hash MD5: 32K
       5B 2C 19 72 AE D8 A7 62 B7 57 E0 C9 75 35 9A BE>)
$$ ##END=
$$ 
$$ hash MD5
$$ 6A 4B D5 68 B9 5C 84 C1 0D F9 95 63 50 AB 3E 8E
##$RELAX= 
##$RELAX= 
##$RELAX= 
##$RELAX= 
##$RELAX= 
##$RELAX= 
##$RELAX= 
$$ Bruker specific parameters
$$ --------------------------
##$DU= <C:\u>
##$EXPNO= 6000
##$NAME= <ADRS>
##$PROCNO= 1
##$TYPE= <nmr>
##$USER= <dgb>
##$AMP= (0..31)
100 100 100 100 100 100 100 100 100 100 100 100 100 100 100 100 100 100 
100 100 100 100 100 100 100 100 100 100 100 100 100 100 
##$AQSEQ= 0
##$AQ_mod= 3
##$AUNM= <au_zg>
##$AUTOPOS= <4 >
##$BF1= 250.13
##$BF2= 250.13
##$BF3= 250.13
##$BF4= 250.13
##$BF5= 500.13
##$BF6= 500.13
##$BF7= 500.13
##$BF8= 500.13
##$BYTORDA= 1
##$CFDGTYP= 0
##$CFRGTYP= 5
##$CHEMSTR= <none>
##$CNST= (0..31)
1 1 145 1 1 1 1 1 1 1 1 1 1 1 1 1 1 1 1 1 1 1 1 1 1 1 1 1 1 1 1 1 
##$CPDPRG= <>
##$CPDPRG1= <>
##$CPDPRG2= <>
##$CPDPRG3= <>
##$CPDPRG4= <mlev>
##$CPDPRG5= <mlev>
##$CPDPRG6= <mlev>
##$CPDPRG7= <mlev>
##$CPDPRG8= <mlev>
##$CPDPRGB= <>
##$CPDPRGT= <>
##$D= (0..31)
0 1 0 0 0 0 0 0 0 0.06 0 0 0 0 0 0 0.0002 0 0 0 0 0 0 0 0 0 0 0 0 0 0 
0 
##$DATE= 1121763325
##$DBL= (0..7)
120 120 120 120 120 120 120 120 
##$DBP= (0..7)
150 150 150 150 150 150 150 150 
##$DBP07= 0
##$DBPNAM0= <>
##$DBPNAM1= <>
$$ [...]
##$SUBNAM7= <"">
##$SUBNAM8= <"">
##$SUBNAM9= <"">
##$SW= 20.6930455092707
##$SWIBOX= (0..15)
0 0 3 0 0 0 0 0 0 0 0 0 0 0 0 0 
##$SW_h= 5175.983436853
##$TD= 65536
##$TD0= 1
##$TE= 295.16
##$TE2= 300
##$TE3= 300
##$TEG= 300
##$TL= (0..7)
0 120 120 120 120 120 120 120 
##$TP= (0..7)
150 150 150 150 150 150 150 150 
##$TP07= 0
##$TPNAME0= <>
##$TPNAME1= <>
##$TPNAME2= <>
##$TPNAME3= <>
##$TPNAME4= <>
##$TPNAME5= <>
##$TPNAME6= <>
##$TPNAME7= <>
##$TPOAL= (0..7)
0.5 0.5 0.5 0.5 0.5 0.5 0.5 0.5 
##$TPOFFS= (0..7)
0 0 0 0 0 0 0 0 
##$TUNHIN= 0
##$TUNHOUT= 0
##$TUNXOUT= 0
##$USERA1= <user>
##$USERA2= <user>
##$USERA3= <user>
##$USERA4= <user>
##$USERA5= <user>
##$V9= 5
##$VALIST= <valist>
##$VCLIST= <CCCCCCCCCCCCCCC>
##$VD= 0
##$VDLIST= <DDDDDDDDDDDDDDD>
##$VPLIST= <PPPPPPPPPPPPPPP>
##$VTLIST= <TTTTTTTTTTTTTTT>
##$WBST= 1024
##$WBSW= 4
##$XGAIN= (0..3)
0 0 0 0 
##$XL= 0
##$YL= 0
##$YMAX_a= 386073
##$YMIN_a= -302654
##$ZGOPTNS= <>
##$ZL1= 120
##$ZL2= 120
##$ZL3= 120
##$ZL4= 120
##$ABSF1= 16.42892
##$ABSF2= -4.26425
##$ABSG= 5
##$ABSL= 3
##$ALPHA= 0
##$AQORDER= 0
##$ASSFAC= 0
##$ASSFACI= 0
##$ASSFACX= 0
##$ASSWID= 0
##$AUNMP= <proc_1d>
##$AZFE= 0.1
##$AZFW= 0.1
##$BCFW= 0
##$BC_mod= 0
##$BYTORDP= 0
##$COROFFS= 0
##$CY= 12.5
##$DATMOD= 1
##$DC= 0
##$DFILT= <>
##$DTYPP= 0
##$F1P= 14.0000005364418
##$F2P= -0.99999901652339
##$FCOR= 0.5
##$FTSIZE= 32768
##$FT_mod= 6
##$GAMMA= 0
##$GB= 0
##$INTBC= 1
##$INTSCL= 1
##$ISEN= 128
##$LB= 0.3
##$LEV0= 0
##$LPBIN= 0
##$MAXI= 10000
##$MC2= 0
##$MEAN= 0
##$ME_mod= 0
##$MI= 0
##$NCOEF= 0
##$NC_proc= -5
##$NLEV= 6
##$NOISF1= 0
##$NOISF2= 0
##$NSP= 0
##$NTH_PI= 0
##$NZP= 0
##$OFFSET= 16.42892
##$PC= 1
##$PHC0= -79.22852
##$PHC1= 11.17227
##$PH_mod= 1
##$PKNL= yes
##$PPARMOD= 0
##$PSCAL= 4
##$PSIGN= 0
##$REVERSE= no
##$SF= 250.13002327948
##$SI= 32768
##$SIGF1= 0
##$SIGF2= 0
##$SINO= 400
##$SIOLD= 32768
##$SREGLST= <1H.CDCl3>
##$SSB= 0
##$STSI= 32768
##$STSR= 0
##$SW_p= 5175.98343685301
##$SYMM= 0
##$S_DEV= 0
##$TDeff= 65536
##$TDoff= 0
##$TI= <Analysis number 999999
Compound Code 99
Book Reference 9
Project Code 9>
##$TILT= no
##$TM1= 0
##$TM2= 0
##$TOPLEV= 0
##$USERP1= <user>
##$USERP2= <user>
##$USERP3= <user>
##$USERP4= <user>
##$USERP5= <user>
##$WDW= 1
##$XDIM= 32768
##$YMAX_p= 408834434
##$YMIN_p= -531719
$$ End of Bruker specific parameters
$$ ---------------------------------
##NTUPLES= NMR SPECTRUM
##VAR_NAME=  FREQUENCY,     SPECTRUM/REAL,   SPECTRUM/IMAG
##SYMBOL=    X,             R,               I
##VAR_TYPE=  INDEPENDENT,   DEPENDENT,       DEPENDENT
##VAR_FORM=  AFFN,          ASDF,            ASDF
##VAR_DIM=   32768,         32768,           32768
##UNITS=     HZ,            ARBITRARY UNITS, ARBITRARY UNITS
##FACTOR=    0.157963299565203, 1,           1
##FIRST=     4109.36632861609, 0,            0
##LAST=      -1066.61710823692, 0,           0
##MIN=       -1066.61710823692, -531719,     0
##MAX=       4109.36632861609, 408834434,    0
$$ Real data points
##PAGE= N=1
##DATA TABLE= (X++(R..R)), XYDATA
$$ [...]
27363 -132520 -125426 -96161 -25701 93695 86180 115721 -52439 -58850 -48897 -17476 -86516 -163896
27351 -163896 -137217 -148439 -83767 -130851 -74041 19316 94052 52111 -68833 13815 -21834
27340 -21834 7068 54304 134788 137769 65256 -109814 -55876 -50508 -98624 -128163 -152224 -195125
27328 -195125 -184906 -76833 -93762 -55634 -99572 -89085 50628 -53390 169380 318606
27318 318606 244893 52197 -7172 9593 85863 191180 239170 249258 134414 51497 8382
27307 8382 37123 114926 138944 96402 53741 18343 67716 1894 -65407 -58445 84668 84
27295 84 -81798 -106781 -59037 72890 104268 103687 146976 181804 207857 255782 277142 216527
27283 216527 107093 31282 123032 252256 191609 172368 22926 -4933 122087 139377 97848
27272 97848 -69649 -56463 -24799 41241 -40065 -109084 -104946 -38796 40857 28147 217515
27261 217515 268317 204095 205154 196303 195808 341030 308904 174289 252642 254622 121059 98350
27249 98350 -1891 33786 80603 83996 144539 136576 81469 34008 -151234 -186647 -131184 -52568
27237 -52568 -122577 -140999 -77130 -72349 -108971 16153 100039 89364 60848 23611 36128 181223
27225 181223 188231 188883 139129 226812 149759 130536 82696 30933 -5144 -2672 -182992 -186613
27213 -186613 -50958 -123551 -213016 -143242 -127247 -22292 3703 1538 32082 119299 94256
27202 94256 -36567 61362 19747 -138510 -43841 119652 43393 105749 169378 193582 128696
27191 128696 5632 88618 151848 107842 58985 6081 42631 42907 -43250 -137983 -128574 -115995
27179 -115995 -138724 -109507 16633 77226 26355 115326 270347 262261 258971 195915 200282 121752
27167 121752 95353 162310 167512 149058 137747 65680 -60575 11125 -26571 -17565 -37872 -25032
27155 -25032 68888 187649 284416 256880 259851 327915 191362 -32719 -104970 -33389 -18718
27144 -18718 74659 218683 278214 155849 91987 119241 121177 19944 -4255 1713 132054
27133 132054 186673 236123 212164 47684 -33675 9300 38230 -15638 117835 209799 97101
27122 97101 141157 215823 126941 -6678 60723 139786 61604 -56476 -46686 65262 69147
27111 69147 -24574 -117301 -7762 123546 129970 71065 49294 -56387 -1283 -14875 -963
27100 -963 -9619 -126868 -180170 -142080 -50304 44868 -7466 -69409 31831 127402 126670 43275
27088 43275 9118 -11442 20517 4783 61254 74784 53489 -16804 -63885 -309 -64998 -52925
27076 -52925 -66267 -112995 -145574 -137903 -19303 -9404 -31733 40885 35117 -38520 -142236 -73866
27064 -73866 -78150 -221520 -231171 -128653 -50064 59959 52043 -109708 -251433 -165785 -87038
27053 -87038 -103037 -157381 -106964 -34120 26884 28392 175757 255285 261607 228159 149007 52617
27041 52617 66037 132968 68345 110052 239223 175973 129308 91543 108230 67765 72185 239158
27029 239158 274517 258343 279833 78521 -20165 -5628 -36943 -12863 -29019 389 -47987
27018 -47987 -20005 77224 51886 -13095 29189 40759 -33575 -146763 -19346 -26335 -14781
27007 -14781 98261 110204 51381 20235 -15396 28081 107331 222637 246825 200971 159755
26996 159755 153771 182696 274608 350498 245848 9532 5972 1629 -43621 50888 26972 50901
26984 50901 102888 44680 -9822 61742 119396 171194 122952 147038 37415 -47824 -73443
26973 -73443 -22257 -44683 -88196 -41389 2970 21716 -54468 74441 35253 -75508 -115479
26962 -115479 -143049 -70393 -34047 43987 110843 175875 97005 89875 -39969 -52230 2373
26951 2373 35096 78874 171716 185861 252027 276566 232233 117608 120055 197921 171897 59168
26939 59168 29733 38356 54850 52437 187448 226768 201025 222622 54898 14178 80972 248989
26927 248989 138974 73382 140350 171636 108134 99181 66912 46524 29381 -1754 118119
26916 118119 112388 90452 127360 18041 35420 57040 131935 112105 24794 -58164 6198
26905 6198 122808 102672 7143 16314 30230 -57119 -25980 4661 34634 117495 71920 1012
26893 1012 -97978 -47315 -20556 18526 -73805 39907 51065 -79167 -14451 48626 -27148
26882 -27148 4279 169979 154609 93645 15265 97 105429 64785 111397 78262 124147
26871 124147 116094 160704 116798 121696 78320 82519 91978 19121 -42066 -18487 -17172 6322
26859 6322 45370 131926 207818 95488 16791 -3568 -93583 -39133 -77162 -79370 21492 2927
26847 2927 -181957 -355264 -254191 -77178 -67734 -45321 12395 193915 95060 90908 112456
26836 112456 129600 205254 157416 23282 -110556 -107947 -85239 -45044 -61857 1248 -21428
26825 -21428 -100794 -79156 -46480 -33873 40560 57122 7844 32789 59479 143937 132200 116726
26813 116726 149706 -30775 -93786 12456 61878 78226 179553 37082 -67855 42110
26803 42110 110577 137648 34985 27433 25053 94760 49465 -86556 -156973 -65195 39783
26792 39783 34572 -56244 -156047 -136786 90356 209209 205328 110133 255203 214321 56119
26781 56119 15443 81719 104291 277291 168233 35450 -54439 37125 68345 93027 77136
26770 77136 179957 179888 116439 178535 281889 251467 176557 176508 248344 249088 100516 -21753
26758 -21753 -4611 110091 111088 57841 67869 133831 204179 143802 46405 -87821 -176171 -209891
26746 -209891 -289575 -249900 -176113 -144306 -157712 -106314 -47909 -59790 -185841 -203880 -24818
26735 -24818 62846 130805 63052 23990 -17872 -69280 -61390 76840 125558 -58928 -183207
26724 -183207 -51066 16121 95578 94104 59767 -64950 -42504 -59720 -40811 -123085 -96400
26713 -96400 -79683 3731 78887 137262 232432 149853 9037 -50144 58900 25713 52501
26702 52501 19938 -59858 -73734 -49061 -10323 -96162 -99788 -8484 38718 -24655 1769 88769
26690 88769 73979 -35342 -79429 -167563 -94876 24704 60037 -161254 -72036 35751 84566
26679 84566 118837 136941 202462 187293 204594 253140 302767 263628 122057 5549 -52354
26668 -52354 -59491 -61531 -49118 -27867 -67810 -89598 96201 272811 236092 112845 7056
26657 7056 142721 187618 88859 -41427 -105104 -138190 -90936 -77393 -130674 -139005 -141781 -49905
26645 -49905 -59524 -56038 -30907 -168862 -210544 -120643 -51964 -96952 -54907 -71502 -79256 -115061
26633 -115061 -58296 29794 135829 185224 289339 198879 51346 78972 46280 113265 163126
26622 163126 82783 -60222 -207545 -205615 -190053 -175226 -150744 -58271 -19183 -86707 -48527
26611 -48527 64438 115973 110551 -14558 -26802 7964 -35348 -100536 47559 75564 199303
26600 199303 247660 199886 165763 151237 43816 77730 52286 27033 65774 5315 -2610
26589 -2610 -43184 -125757 -73522 -9516 77464 37218 -154690 -235940 -321752 -216356 -102133
26578 -102133 -7968 21069 29405 54801 46726 133316 209404 58120 -71786 -4968 -60835
26567 -60835 -230201 -241839 -307758 -206359 -106691 -62655 -144038 -210916 -62134 -23456 -63211
26556 -63211 2667 -9813 -80719 -115928 -133096 -178885 -123195 -149246 -196426 -29433 28585
26545 28585 -21166 -5262 -4680 33100 63942 117029 117705 123958 5332 79557 145100 112871
26533 112871 -7092 -127399 -134673 -61590 -89073 -63200 71518 105310 81678 -5764 -99413
26522 -99413 -91141 -4200 58050 66771 25007 -19188 73846 60861 63481 146154 239769 256611
26510 256611 270672 168861 123976 30273 -41251 -69301 -102975 -72969 -5750 -42047 -50381
26499 -50381 15674 -23450 -52561 51972 -56821 -169152 -68647 -48875 -97705 -97690 6049
26488 6049 83685 -22818 19635 -82983 -42975 -29897 45620 94566 135013 48239 13751
26477 13751 5436 -77222 20659 136993 174968 235755 186034 18565 4309 69687 177576
26466 177576 99167 62814 61950 115627 64822 -52053 -105962 20070 42758 132193 126891 168015
26454 168015 197979 121587 177001 186136 44435 43756 53928 30596 -20538 -701 53318 54612
26442 54612 -40579 -97385 57826 147395 99522 57812 -20472 -209027 -232136 -32447 -16926
26431 -16926 -975 -41495 -6183 97384 193303 210567 92308 150040 155963 54243 44083
26420 44083 27489 -20822 -964 150866 254318 77712 93273 42728 101011 51964 -75758
26409 -75758 -67722 41944 45473 130851 165152 158541 205156 198572 163347 78994 43230 155317
26397 155317 87261 -44057 -178995 -148275 5403 36165 4237 -82233 -27826 127570 224770
26386 224770 215864 174516 141284 92638 32423 32379 6267 2662 -60741 20381 198286 136546
26374 136546 8535 -148348 -244553 -133150 73599 59747 -19339 -76490 2396 -63321 -182038
26363 -182038 -87389 -926 34186 -10624 -10706 36444 115488 144239 70166 -23281 16937 80923
26351 80923 91330 182727 181580 99390 171157 198556 75836 12272 59067 -32685 -147121
26340 -147121 -80581 -22984 48666 -77342 -90416 -23574 -14317 37416 67389 5628 -36805
26329 -36805 -26414 -40203 -57738 -98741 -166577 -174172 -116364 39470 125028 80277 2600 116902
26317 116902 165798 67648 100177 98542 -15716 -54626 -82179 85686 153627 -6551 -42294
26306 -42294 127311 147053 133134 107484 125942 54331 -15532 155095 194962 39046 9392
26295 9392 72138 -14752 -24888 97452 154696 149793 115274 48784 7698 192305 240865 189871
26283 189871 257963 310708 359831 281462 184002 81324 589 -122025 10168 131379 174074
26272 174074 148814 -149662 -110819 -68781 15545 21434 -127787 -154861 -93340 -146668 -116692
26261 -116692 -11364 -21227 -96523 -88783 62279 46086 -7312 35902 50661 209238 246387
26250 246387 207625 213114 149204 127618 104113 181629 178639 158986 -29179 -158639 -143233
26239 -143233 -87191 -8477 -29691 -90937 -47627 33785 -97571 -102555 -36413 -63135 -54120 -111948
26227 -111948 -229398 -212680 -118839 -9759 112055 223442 244145 267110 266611 118770 37438
26216 37438 4057 62726 167396 254164 304797 218965 120535 68177 138835 48955 -52098
26205 -52098 7219 84918 40100 57179 53920 83155 51612 48978 89236 98222 93658 -15551
26193 -15551 -11314 98504 162486 152323 46794 211220 463261 376541 135419 64692 174995
26182 174995 233897 173391 71022 112752 44263 -7568 -10291 -90549 64509 287250 325643
26171 325643 209927 108730 139573 109800 135496 164122 218706 267086 231896 106487 -15705
26160 -15705 -73779 -87109 33717 74511 159809 74989 9740 -138340 -57690 -13249 111455
26149 111455 78127 96013 178972 228372 169307 83687 86359 -22373 -38608 62481 117303
26138 117303 105495 48824 -8312 84401 89080 90980 138056 78582 96718 63686 -43194 -25373
26126 -25373 -34157 -24732 -59577 17787 -97766 -144996 -254443 -89714 56319 -13802 -14986
26115 -14986 26091 43718 30606 -39236 -71515 83697 71497 -107738 -183576 -131610 -147824
26104 -147824 -118879 -110280 -160884 -83976 4740 52230 -38331 -86847 68275 17698 -138775
26093 -138775 -53112 79038 24790 45122 49782 -33893 45301 136869 196113 216634 183940
26082 183940 117458 129731 9318 -50659 88382 199397 224249 215891 91337 -96580 -72912
26071 -72912 53884 -89392 -268093 -226866 -19598 -16433 37347 79601 186235 138388 138309
26060 138309 251027 208333 52653 -10605 -22679 3810 -43071 16670 150355 79445 52272
26049 52272 42811 28607 121990 156291 103652 -60394 -157958 -221253 -130948 -98089 -70034 -73667
26037 -73667 53377 106970 77549 197113 80335 66064 71256 2143 -56628 -66690 -24944
26026 -24944 84817 43941 -72655 -250470 -212921 3366 102104 52330 -1725 -4886 64529
26015 64529 45002 -66085 -106700 -95411 -82762 -122391 -233421 -223064 -125017 -55228 -54624 -141913
26003 -141913 -93470 -120754 -6139 99667 141779 164095 81821 122063 104554 49109 51769
25992 51769 -34643 -61754 37238 32469 26144 51139 119231 106314 71716 78409 163409 258134
25980 258134 205716 80098 84678 218803 159804 53023 205115 229137 176323 -18878 -1546
25969 -1546 190346 161517 66039 16620 -97689 -106161 3155 35335 -63939 89500 271106
25958 271106 277730 195900 63711 -65601 -200211 -197759 -170856 -158896 -95293 -96286 -63248 -53209
25946 -53209 86687 138401 157129 19830 -27584 -61414 -158232 -130720 -56905 34326 126381
25935 126381 113114 -86636 -167160 -172793 -168096 -181609 -134787 -137874 -46850 82843 111771 69104
25923 69104 14609 -100400 -104199 -16382 11521 -61779 -24417 -19696 -21288 43970 105579 243848
25911 243848 140128 -22160 2735 -40695 -51932 21438 49609 25511 -74917 -81028 -10078
25900 -10078 5053 40225 10701 -29076 -41219 -26482 2622 119679 8447 -34200 -188075
25889 -188075 -175732 -32836 -29524 88482 152496 137236 54613 -15220 -57632 80698 84495
25878 84495 136061 19873 -18431 44510 56717 58587 57320 -56151 1865 199543 233674
25867 233674 226654 154844 -25243 -55226 -49506 -74671 -62334 -109278 -58656 70056 212472
25856 212472 229779 253190 175539 109693 51913 -32966 -72327 8871 -79192 -139821 -16226
25845 -16226 20817 119560 34622 -50004 -50207 -61981 -15530 22630 -106970 -128666 -156466 -140981
25833 -140981 -123737 -1826 -24552 -117076 -83209 37182 29883 -83112 -76355 -56173 12860
25822 12860 -7310 -19198 35834 96004 119537 85938 123842 67361 -38386 19941 79430
25811 79430 -46521 -64160 -143825 -98188 21691 166136 186054 66676 -9602 -13467 -82315
25800 -82315 -123630 -97602 59518 327118 338712 243182 167197 27716 -49767 -28035 144049
25789 144049 255046 180430 61730 155339 -10192 -162509 -121774 13721 -43235 -98313
25779 -98313 -164918 -181592 -205670 -77837 -28056 -21596 46449 140840 169081 98451 166398 29816
25767 29816 -53182 -143889 -140064 -118868 31312 172534 196985 76800 -27736 26335 -22081
25756 -22081 -23840 61187 -905 -40237 -85383 -115071 -130517 -67990 4265 188622 169122 34735
25744 34735 -67578 -15140 58377 95641 -582 -7112 -14215 38328 6141 -29867 -120293 -98498
25732 -98498 30755 3567 3657 -5106 107376 96052 37083 -44854 -18180 3165 4084 -75294
25720 -75294 -90791 -96165 -38780 32793 127269 149178 74206 16315 53139 141677 155514 192845
25708 192845 81781 -21631 -115195 -60295 -80447 -52095 48120 5770 -34689 -32754 37127
25697 37127 4582 -57990 72288 133112 118621 -73877 -161898 -115724 -33354 -58763 -234869
25686 -234869 -86652 95503 34318 42463 81009 277510 244696 -21296 -153737 -65108 -39720
25675 -39720 82452 183302 68315 -6570 3655 85766 118999 140146 132230 76159 78439
25664 78439 193823 129410 -51639 -191145 -132520 25487 161476 124580 34387 91417 67548
25653 67548 37688 82475 96565 68522 71753 29993 -114631 -119223 -56394 -28509 -63476 15843
25641 15843 45324 -8925 10523 72805 133914 -13174 -100228 -82176 1713 -66294 12897
25630 12897 108986 102060 101770 44913 -65413 -51840 20164 89700 153579 244508 273312 154667
25618 154667 123671 76023 -53383 -81883 -33058 -215948 -199106 -91702 -1282 -2243 -73905
25607 -73905 11297 47901 87159 51571 57562 101853 36865 -43335 -12884 -4595 52964 -2603
25595 -2603 -110992 -157506 -148876 3412 137487 11104 -102702 -112170 -65041 8104 28272
25584 28272 81516 71362 139284 98622 -34586 -44059 -9665 117022 16591 -50309 96846
25573 96846 121544 -413 -76976 -19618 492 1715 -36603 46838 79803 -5824 50938 89675
25561 89675 149133 156247 70368 60296 -55447 -36847 -60463 -99713 -5743 18324 15799 -36259
25549 -36259 -8369 -43983 -47680 -3365 -3756 58638 4410 -8089 18463 28422 106900 43187
25537 43187 -73974 24753 40151 -22334 -57697 -30207 -47291 -87827 -83436 -6450 29406 199232
25525 199232 299170 225530 169978 155742 240415 162558 152912 103285 43701 74442 94724 51465
25513 51465 129845 182707 232073 165524 199549 302652 259335 127750 -43473 -131571 -119097
25502 -119097 -151296 -172488 33336 149633 87527 31728 13773 -24685 -133045 -189257 39380
25491 39380 170507 163712 159455 174834 151618 138968 32573 -8017 2644 -140416 -173245
25480 -173245 -168271 -129953 -212386 -214957 -119111 90520 133612 46164 7811 -71108 -174622
25469 -174622 -183014 -114687 -12831 -47123 -123830 -210213 -23195 61565 -27998 -25651 104984
25458 104984 109833 -20690 64265 166145 197512 132472 42020 129496 162505 81449 31159
25447 31159 104930 8247 -113613 -59750 -27288 -79050 -38038 -22793 -7681 -105573 26885
25436 26885 115669 60442 82629 -1433 2115 -68773 -48164 -41971 -7475 -42749 47254 -25039
25424 -25039 -44274 -89996 -102575 -101161 -259823 -229299 -125137 -149610 -84848 -98384 -70411
25413 -70411 -70726 14032 119841 156910 46874 41704 -47226 -29620 3498 19036 98831 69006
25401 69006 43667 -2729 -61452 -90140 83610 190044 123299 96772 16011 -48479 104921
25390 104921 40262 12955 50811 59077 15237 -38393 -36094 84686 188601 232815 99856
25379 99856 109907 37409 135452 131594 -11193 10355 83622 56027 -44111 -136691 -216129
25368 -216129 -303488 -196076 -5368 4900 142777 185008 100887 53232 77624 110003 109697
25357 109697 45179 114368 178919 182538 270962 228164 118632 90695 1584 -67062 -56379
25346 -56379 34943 -700 -72395 -170871 -124721 -154655 -151141 -52138 98495 135401 66454 88026
25334 88026 25206 -32653 29610 -47743 -15419 -124121 -185231 -166236 -21513 30751 149069
25323 149069 207404 97547 -73884 -151456 -14956 71714 61380 -36579 -82746 -4425 5337
25312 5337 -18059 -46303 -110492 -40139 41630 34502 19389 41253 50165 31088 -85820 9539
25300 9539 137139 157247 71207 10484 4437 1785 -79697 -111523 3798 175290 84500 -28494
25288 -28494 -84318 -53508 -16661 -197272 -158672 -21669 -29196 -54346 23102 90566 72735
25277 72735 183983 295130 236454 231077 158561 128767 171189 119468 88118 72598 38302
25266 38302 5511 28943 99281 72697 -126200 -202933 17438 70674 -13531 88311 152031
25255 152031 121635 104410 17167 29457 65803 126720 90965 -115359 -139374 -34764 -68288
25244 -68288 -20546 10432 2645 -125616 -134667 -108380 -80008 -7465 7971 -32965 78235 188975
25232 188975 250044 147149 96706 229639 270108 232452 83547 42183 89377 58277 -21437
25221 -21437 58802 59536 -61715 -65186 -82529 68765 241401 200651 114851 124795 53328 -88229
25209 -88229 -139235 -176353 -79733 -5638 84428 2702 -110028 -127856 -68794 59759 3217
25198 3217 16147 52262 118324 76912 -71238 -70916 -19745 31332 59480 -48434 -68931 -154554
25186 -154554 -219638 -179070 -232101 -252440 -155399 -96452 -10565 -22348 -47831 -92779 -207495
25175 -207495 -280069 -215966 -107333 -91105 -68576 -160103 -119263 89043 16088 -89140 -182251
25164 -182251 -13221 1137 -15511 80774 99042 71407 105675 54006 -83698 -186424 -233792
25153 -233792 -150567 -64427 65720 197477 245550 287421 189198 162137 245985 294430 51722
25142 51722 -62886 32043 23201 17566 -36452 122295 69546 37669 173828 232059 252790
25131 252790 332068 228389 78868 -23283 51699 58577 59088 115177 7660 -144652 -49115
25120 -49115 46837 -113809 -49512 -74946 98153 192521 160849 188984 -98180 -63639 101723
25109 101723 145143 145390 99725 3591 -174830 -126196 -98811 -11092 14667 125232 67818
25098 67818 32019 80367 -8849 -37353 131991 267732 274990 148720 188038 254272 286605
25087 286605 114704 93979 12379 -81330 -17360 -113734 -71935 -57818 -105831 -1704 -57463
25076 -57463 -16917 86708 129031 76968 65333 -30776 87476 116267 19977 -82318 -36834
25065 -36834 102797 107333 -97278 -273903 -355210 -281630 -45966 82786 93091 -61205 -13349
25054 -13349 86013 109200 186356 227823 143048 -48775 -197289 -158003 -90899 1095 137738
25043 137738 172322 125807 110010 58643 175684 219670 207102 153012 84862 -32613 -117440
25032 -117440 -127440 -108160 -24243 74743 28577 -112392 -82753 104790 74410 -449 1540
25021 1540 68734 -439 13831 12883 100596 100099 -39964 -23863 -104297 -209498 -171833 -145190
25009 -145190 -15195 -77571 -167853 -155146 -39464 94059 124545 100204 153233 192221 110543
24998 110543 149151 95893 -25444 -59545 -50722 27649 83547 167027 101825 15853 -29102
24987 -29102 -43182 -81407 -101002 -110095 -143056 -65001 26501 34304 10285 -78077 -134994 -137885
24975 -137885 -73770 -77519 -7725 22412 -91006 -135311 -130316 -76624 70856 121748 69445
24964 69445 100520 74887 70389 114436 78024 -35812 -107195 -52240 -12175 -14152 9508 15483
24952 15483 33994 143772 221780 182234 44267 27309 85849 183433 97192 94529 207243
24941 207243 341759 291632 190520 91440 19081 128065 162720 150749 178373 198967 157747
24930 157747 351 -89655 -73430 -130154 -54623 -38465 -2715 208315 308322 165083 98390
24919 98390 30231 -107501 -119031 -135315 -124943 -131826 -149374 -215768 -230665 -50662 2809
24908 2809 -40763 -33654 -52633 -144383 -182698 -127235 -96631 168264 301440 143443 219156
24897 219156 311068 207701 74781 58968 99905 59170 -33120 152362 148293 118490 3911
24886 3911 -49376 -82567 -125157 -21559 139030 111192 37650 85394 81079 798 -26004 -129684
24874 -129684 -8709 171713 147239 11291 -6566 33101 53507 26739 -49545 -199733 -113099
24863 -113099 -58471 -50744 -30426 -136629 25745 201436 214167 214955 281476 312320 386593
24852 386593 408723 384904 197238 149938 -35447 -202190 -66891 -3596 -41556 -118782 -46998
24841 -46998 100942 32005 -25206 48970 -29803 -12483 114462 100241 17863 8671 137790
24830 137790 273899 216310 112742 45793 16755 27526 -1151 -20909 -63197 18445 157049
24819 157049 150264 163130 68164 84775 80077 -24784 24710 51096 10297 -11426 7655 86970
24807 86970 220336 165260 -9680 -85128 -111137 -178170 -82779 1321 -11540 -71942 46444
24796 46444 91675 68220 31639 -112075 -145632 -155153 -147600 -152259 -168034 -143 -36319 -19362
24784 -19362 -57333 -35384 -49777 98499 121054 51988 50069 89903 85827 57640 38491 123615
24772 123615 153738 12040 10851 -86809 -116941 -152011 -144255 -206364 -192920 -61502 -1161
24761 -1161 60888 142147 95282 124951 110100 108272 97411 42188 25308 95184 53403 13026
24749 13026 -18981 -65223 -49860 20806 9069 -9404 -15489 -50571 -163935 -147062 -55369 27879
24737 27879 175692 179806 72763 15022 -93164 -168304 -80534 6216 29267 30532 -11798
24726 -11798 -59726 -12202 6487 15732 -11571 -21664 -38601 -43656 -110244 -185265 -283734 -133251
24714 -133251 -44196 -114378 -125066 84028 119272 107713 114316 -47120 -68093 58481 92068
24703 92068 188122 246833 147232 72493 75236 3393 -58803 14827 -15112 -118915 -122502 -78071
24691 -78071 -63954 -57175 53380 164435 142772 75626 66762 24844 26053 -44191 -105549 -81067
24679 -81067 -27458 78754 31611 -71678 -238535 -149080 -30816 -10262 63866 11278 92408
24668 92408 94503 69783 24484 14850 21449 -48427 81064 95011 -23577 -176738 -78391 78448
24656 78448 82696 -29742 3756 -18384 -97480 -10215 83456 41145 116611 414 -46579
24645 -46579 16593 59379 3225 28266 90134 103758 31450 -124708 -87585 -71930 -128281
24634 -128281 -243853 -183017 8768 104095 50285 160499 143340 109651 45855 -48476 -31833
24623 -31833 -78056 6924 102619 120481 -18581 -112866 -185094 -201312 -190490 -9829 92006
24612 92006 34431 113418 223587 171106 113824 75738 62690 16475 -11445 -112698 -148444
24601 -148444 -267063 -82226 -18774 38541 55104 -14752 5241 -22895 100807 161248 54072
24590 54072 -128759 -19511 108846 48344 136709 181181 95521 35111 75176 50222 -52820
24579 -52820 -40865 -25846 -66245 -31735 19792 -122453 -86281 -114112 -195746 -181731 -181925 -178202
24567 -178202 -175792 -53191 67318 41063 51997 -72239 -196411 -156937 -67627 -218003 -239780
24556 -239780 -34996 -124133 -337535 -168029 -143 20426 -37961 75747 79712 5145 -595
24545 -595 12975 10265 819 66918 165041 345560 389600 245971 148210 126869 26042 -72597
24533 -72597 -120775 -107810 1710 80684 19833 7577 -59352 37908 73118 -44655 -83758
24522 -83758 -109881 -86462 -144955 -198200 -160822 -65027 -89996 -79293 -138107 -93743 28632
24511 28632 24049 -47503 -52070 -17029 -112327 -135408 -55725 -7817 -51583 -166002 -194323 -157432
24499 -157432 -27026 -36972 -80969 -83306 -101871 -53444 20371 25386 -71732 -54285 -70455 -164785
24487 -164785 -172046 -153406 -195250 -243829 -185020 -116178 -37232 -37641 8835 2233 111831 22858
24475 22858 -79227 -135627 -66929 -69492 19474 70406 12231 -28771 -33463 -4221 -75112 -111159
24463 -111159 13562 58545 65244 -8361 -90954 -192209 -204572 -80114 5269 -41102 109246
24452 109246 67191 -194376 -282342 -314910 -156618 -19610 96402 157159 63096 -121533
24442 -121533 -113027 -41633 -12657 -55738 -152995 -95126 -149335 -209846 -253310 -189969 -29000
24431 -29000 114242 140206 125331 123382 108028 186880 208678 309401 236017 215638 199752
24420 199752 220307 219532 160804 94269 154217 50258 -94196 -34412 -69076 -73461 34715
24409 34715 127395 132062 157055 340759 340926 222006 77629 -2013 -36582 -110916 -102828 -20727
24397 -20727 -57119 -57867 -64519 -102909 -146276 -77771 49144 114382 154673 131720 46929 -11861
24385 -11861 -10094 -10953 55559 -13092 -19496 21925 32236 73665 175341 146395 -27087 -178258
24373 -178258 -198144 -94704 13193 63943 54679 4060 74802 -64322 -130072 -48321 46277
24362 46277 101369 -89331 -118210 -83556 39470 79819 105934 -14690 -60620 -89181 -154595
24351 -154595 -39991 -20630 -17871 19801 -99096 -44667 -24610 -5430 112121 94677 52831
24340 52831 89514 149978 75079 -22117 -120532 -116814 -66755 -79406 -199801 -181583 -146157 -22263
24328 -22263 -31146 26743 146252 203085 171757 27617 792 108858 107838 -52999 -140618
24317 -140618 -193411 -165962 -115480 -25010 32371 -30713 52707 126127 155726 154767 108342 -13699
24305 -13699 28689 139144 201513 74076 -63562 -89162 -33649 23965 72702 128966 -20484
24294 -20484 -266935 -258502 -86278 -12500 51315 448 -16079 80728 53174 -52398 -133574
24283 -133574 -19672 -51891 -83520 -162689 -16754 103842 89604 -87687 -174484 -203567 -299377
24272 -299377 -229820 -5619 94018 48453 107269 152922 153023 54397 -6307 49586 -79022
24261 -79022 -85286 -5410 -42098 -42354 -52725 -117107 -164832 -199094 -204464 -95533 56848 55807
24249 55807 129626 39767 -19785 16270 114410 159073 243682 214520 207354 61416 74920 52848
24237 52848 -218344 -324004 -96377 175801 200587 175847 159019 163420 74842 71259 7238
24226 7238 -58099 1186 -26465 -144176 -47392 59290 224163 286949 257427 28585 9133
24215 9133 88534 147685 113666 107957 -32699 -63774 -29815 66644 106002 -58909 -192549
24204 -192549 -101200 -57784 -105689 -111806 -69531 111656 206275 198835 215312 202392 89935
24193 89935 98275 159578 -17294 -118989 -119325 -129187 -163962 -115813 14068 60946 22716 58088
24181 58088 40778 -161594 -137774 -127549 -289288 -356707 -224076 -106217 67186 112905 -8707
24170 -8707 -56219 -150575 -176921 -243598 -174333 -230480 -432695 -439828 -247167 -88963 -43937
24159 -43937 -36372 -3633 71636 98580 -28744 -59714 -124107 -171999 -188203 -46684 121851
24148 121851 253836 13654 -38969 -54865 -113460 -157265 -131689 -57631 15569 -21573 16487
24137 16487 44979 58611 980 -102516 -147475 -266028 -103185 19008 49842 81366 -109164
24126 -109164 -95956 85629 166161 50187 65340 30539 -105292 -83290 -8195 111957 88984
24115 88984 130648 63737 192452 254417 342589 353999 312879 322452 266141 112047 187337
24104 187337 295676 318459 257114 179483 69536 -37877 -29492 8790 82049 105073 -22825
24093 -22825 -54422 1534 107765 161275 98801 73329 110155 129816 311399 382571 389120
24082 389120 306492 210735 204031 103258 118434 186593 219383 173527 86716 51005 71002
24071 71002 185725 193455 200583 173555 83413 128850 131556 -13895 -15311 93739 165036 88295
24059 88295 -26945 -90882 -120754 20804 35558 -116702 -154782 -32576 -28835 -47511 -18738
24048 -18738 2855 17645 158897 204109 219246 251108 115677 -115184 -282297 -267534 -178321
24037 -178321 -225430 -119414 -42900 -2625 119882 131212 158567 184680 102522 38847 20825
24026 20825 79045 137345 108281 95710 149726 158371 135502 97108 53755 39313 90487 -18841
24014 -18841 -195316 -270385 -212623 53709 75929 38951 -45349 -98976 -138330 -86095 -86275 -148001
24002 -148001 -44355 -17999 37371 55133 -28011 -11945 73718 86395 112639 60754 53366
23991 53366 84799 38082 64728 158572 220607 232875 151022 200680 235343 141744 106682 168471
23979 168471 73383 26831 -118325 -198125 -146584 -117163 21712 146845 -26897 -179050
23969 -179050 -65333 -65339 -141383 -168991 -164076 -108873 -60830 73701 103713 106341 158578 73409
23957 73409 142198 153733 52366 7685 62735 67486 41569 107974 75237 161517 138319 39249
23945 39249 133235 208704 251617 124954 -31594 22150 30396 -104906 -236601 -181391 -97079
23934 -97079 -122876 -194690 -134191 48869 -11185 -34446 -80103 -158060 -53096 -25964 -50825
23923 -50825 -40517 -51097 -106149 90818 128029 170280 242328 205104 183062 151385 -13188
23912 -13188 41898 188847 162785 74798 19640 -44589 8335 60383 -75764 -170993 -164952
23901 -164952 -11411 -3804 -101881 -160431 -102192 -112313 -224372 -263025 -144122 36418 152684
23890 152684 46938 -72146 21517 64155 84563 45430 137925 100010 25707 25249 -895
23879 -895 71544 143009 155612 96247 -37184 -69800 -188291 -153464 -45733 102797 176278
23868 176278 19888 -119919 -232537 -189541 -195655 -232898 -120118 28581 50620 -2242 77503
23857 77503 31492 -173651 -204138 -140434 -169528 -174229 -128255 39912 -41028 -96708 -35366
23846 -35366 -39396 -117292 -214877 -166092 -182171 -126713 -98361 -49790 -28300 -44077 -23937 -42213
23834 -42213 -82446 -38521 13319 38814 106067 35954 51074 26921 73909 26766 -82227
23823 -82227 -194383 -109956 34858 135924 -8081 -24273 -52132 2790 29557 -53141 -49276
23812 -49276 -5430 93826 -9599 -30587 -33708 -25938 -25907 71846 17160 51095 46469 99616 106315
23799 106315 -34228 -143151 -94249 34403 63802 80329 95907 223697 255493 223027 153701
23788 153701 23013 -14673 -32598 -139721 -58036 103745 110514 52444 -23216 -49187 -101873
23777 -101873 -74319 33499 5915 -65423 -31173 -6706 110627 204306 212123 39668 89734
23766 89734 185530 281957 212348 184101 169880 150853 116126 328981 324054 247269 237704 143976
23754 143976 197285 203539 152633 68441 17884 -50825 -117828 -41399 45534 -7947 3106 88950
23742 88950 185097 166422 167539 131507 -15128 -163585 -77684 -82632 -6166 35121 21110 -96782
23730 -96782 -73987 13788 125150 118843 -4304 -44166 -28108 -2983 31779 34848 47167 72127
23718 72127 29601 23208 -9465 -103550 -188974 -230529 -241778 -85484 -45919 -118672 -164676 -82869
23706 -82869 -76238 -4238 161842 173401 303451 191471 65709 155628 249631 249026 168277
23695 168277 86669 190566 202653 135496 -26211 -74323 -134408 -202775 -114648 41735 71894
23684 71894 104646 -9092 -64422 -61687 26280 88294 55706 19539 40086 432 -154001
23673 -154001 -126303 -45656 -83110 -55317 -174386 -312869 -251419 -101674 -28611 -90044 -113466
23662 -113466 -85607 66481 17733 -113482 -33755 -3643 21481 36462 -37552 -200743 -206387
23651 -206387 -125512 -66278 -31546 59394 86239 17898 54770 140138 107291 172473 155467
23640 155467 30774 -87851 -93071 -133663 -141423 -87483 32458 60357 79000 148828 232389
23629 232389 280021 269253 98554 79205 76226 60473 107394 142289 84282 28358 133357
23618 133357 165046 93412 -23036 -64956 -62427 29513 -11065 -102056 -54466 -15608 -34100
23607 -34100 -89933 -91749 -94809 -53246 -95359 -37032 163348 88896 64603 143563 254202 190134
23595 190134 117013 65648 37161 15885 68432 33431 -32537 -53254 -161725 41341 125559
23584 125559 68564 125892 80314 10575 -22690 -126643 -78034 -174135 -192423 -141153 24566
23573 24566 72856 64885 -128591 -274929 -313039 -158362 15081 179448 211943 136904 11063
23562 11063 -35033 -80994 -169878 -220200 -205919 -148201 -9754 156119 183381 224391 119872
23551 119872 -17373 -73416 -95144 -199058 -244683 -232135 -298708 -132019 62103 -32251 -52542
23540 -52542 -97947 -87459 -153367 -83774 -114539 -133354 -70441 43151 77113 88928 31037
23529 31037 63877 24190 13981 79263 32077 29725 68869 42131 -22819 -19846 35189 89037
23517 89037 35352 3639 42693 -85786 -143809 -95773 -80510 -150421 -118239 -207372 -251882
23506 -251882 -252261 -272818 -321139 -335062 -160178 -68929 -30184 36541 122278 81119 79021 83224
23494 83224 78636 8058 -17815 -98450 -103327 -238604 -269587 -222017 -205716 -299133 -138727 -97576
23482 -97576 -9251 34712 39607 -6138 -128044 -151328 -130080 21563 49164 -130481 -154392
23471 -154392 -116639 -19893 32859 27247 529 -117222 -94530 -13912 33394 174559 130509
23460 130509 133094 201710 114692 101026 67222 -20839 -72171 -119020 -35460 -73997 -124506 -133246
23448 -133246 -78008 -183967 17154 84850 -86628 -217371 -156005 -100401 -90951 -115144 -140443
23437 -140443 -165334 -107672 -130637 -166381 -211696 -180763 -234268 -131523 -110738 -33231 99307
23426 99307 38199 -32365 -35988 78313 35035 -2267 -69223 -114679 -24213 -6619 -65298 -171714
23414 -171714 -145347 -44500 -2449 -20067 -41069 -39510 -31784 -70502 -23101 -45734 -43530 -27373
23402 -27373 -36231 -160739 -204758 -150226 -53752 60944 89790 76 -91274 -90629 -67310 -1685
23390 -1685 -3059 -56588 -97454 -154875 -95276 -143192 -297739 -247939 -108264 -53398 -44061 -34586
23378 -34586 -72215 -6608 -83341 -110072 -74280 -77641 -58038 16569 65542 61440 -47647 -202856
23366 -202856 -326263 -212981 -97289 -152050 -192120 -138142 -257046 -202602 -88140 -49769
23356 -49769 46102 32852 -76021 -96946 -77327 11076 7331 -23473 -111491 -145975 -128921 -69667
23344 -69667 -115506 -6451 204784 330120 105760 47113 33352 6699 41168 24603 24241
23333 24241 -95886 -223786 -305483 -286653 -88357 -13124 27659 -64781 -147487 -187042 -186974 -165313
23321 -165313 -11771 17982 -147706 -223736 -101505 5500 27369 102400 135238 119461 13020
23310 13020 18967 7756 30540 -14539 6346 -14148 -94491 -101992 -8612 69545 179814 141420
23298 141420 47125 54754 52431 114700 161908 94194 78247 81190 26025 107342 194857 220251
23286 220251 195697 50053 -153246 -116106 13299 -92173 -163271 -146527 -92019 -173811 -287285
23275 -287285 -350298 -335711 -219869 -133260 -48698 72292 94931 -43679 -87390 -102219 -55277
23264 -55277 3773 -57165 -77333 -67755 -55338 -175629 -294181 -212244 -29877 -3347 -50817
23253 -50817 -124170 -116915 -157228 -227610 -161796 -111610 -45445 20081 88621 88886 49073 -37126
23241 -37126 -69429 -79931 -30121 -71856 -57468 35334 98423 54039 75564 18621 -120454
23230 -120454 -198085 -275501 -156909 -119595 -72035 -139312 -275420 -257394 -281523 -217014 -193129
23219 -193129 -107337 49159 123715 76329 67773 -22932 -111984 -137306 -77856 -26355 40082
23208 40082 -98 -44312 -175791 -70762 45965 37598 11304 -48112 -77730 -63474 90213
23197 90213 75733 50551 74430 210767 187963 72838 -66293 -165008 -104597 14142 24042
23186 24042 -161879 -240551 -120954 -92399 -15141 168449 169189 81600 -63349 -124188 -149722
23175 -149722 -113694 -90783 -106121 -183329 -182309 62629 199091 86510 -11168 -1766 149074
23164 149074 147383 31120 18003 50690 91717 109985 -38914 -88141 -160379 -302539 -183821
23153 -183821 -67556 -18050 -93074 -83553 10767 94328 144548 33720 -45555 -19279 -38091
23142 -38091 -73862 -99810 -88405 -80550 -70224 -40714 -83485 -63657 91698 105085 63978 12511
23130 12511 29045 56498 -15701 53960 96852 66954 -72015 -258150 -334659 -243328 -115509
23119 -115509 -48424 -144853 -274425 -321759 -184414 -113649 -188593 -250915 -232552 -175963 -57544
23108 -57544 -27244 -76033 -79959 -32810 -59379 -45488 133609 204523 237446 115909 -91236
23097 -91236 -230309 -237691 -253371 -235037 -134344 -113982 -118083 -212602 -206099 -93597 -42784 -27062
23085 -27062 -14198 38411 104861 98576 80702 12479 -19831 35263 18047 -29509 -89141 -87286
23073 -87286 72266 160312 20378 -69599 122566 105079 17455 120627 38046 -139785 -37962
23062 -37962 147622 200449 200967 177501 125103 47373 62882 -32640 -127640 -42621 60992 -102862
23050 -102862 -254589 -153906 -118022 -66559 -60687 72009 36115 40675 -93367 -180893 -104737
23039 -104737 35352 58466 28149 -192857 -156929 -145225 -93092 4474 -15021 -38747 -88863
23028 -88863 -161561 -97701 -73217 -4489 -28518 -91925 -194336 -217959 -226574 -127697 -89233 -145650
23016 -145650 -128071 -39166 -29805 61269 68250 -65857 -194783 -205182 -59529 -76805 -198350
23005 -198350 -183102 -176453 -86100 57765 114324 109821 70438 -126906 -189697 -172104 -138451
22994 -138451 -52246 83020 187556 74404 3483 -47919 -51384 17269 164175 123517 -30847
22983 -30847 -160774 -120516 14320 26439 -23955 -156648 -263643 -104686 -77357 -141689 -64006
22972 -64006 -36523 -7744 59487 27924 -99978 -213403 -227289 -96608 -49170 -86754 83946
22961 83946 160803 250387 145816 12230 -29112 27327 193429 131376 -39763 -118456 -153182
22950 -153182 -124481 -33267 132815 67133 99866 69593 24834 -3775 35411 -6558 -35768
22939 -35768 88615 83920 18905 10751 -77902 -40027 -47105 -32396 -128929 -169601 -69385 -116638
22927 -116638 -212487 -208871 -71824 28973 81753 240885 274130 207392 135603 274321 295755
22916 295755 285521 142109 119243 -19889 -169705 -137656 -182095 -86852 145297 209188 16164
22905 16164 -39423 -14688 14246 -53177 -41726 -177608 -206624 -27058 221428 202657 114657
22894 114657 177612 85545 10145 -75339 -20332 87710 65041 -38366 -85062 -75746 -27313
22883 -27313 -110822 -89798 -115374 -178889 -165523 -42830 70001 49608 -48526 -28293 40575
22872 40575 91038 -85583 -50095 13817 -87584 -77122 -28299 -26218 -99968 -233732 -272391
22861 -272391 -199731 -160689 56902 51708 120929 63440 94203 -74311 -231515 -261305 -343629
22850 -343629 -172507 -144964 -78605 -23144 40949 67707 48662 -23097 -111662 -59296 -78689
22839 -78689 -24114 74046 64973 55554 51742 -79663 22787 97809 -182 -81266 -60597 -17456
22827 -17456 -14927 802 60680 43589 26457 14355 -33575 -36017 -51394 -84976 -105688 -251884
22815 -251884 -135279 -72876 -78763 -167997 -113684 -78922 -57846 395 -28462 -223116 -155696
22804 -155696 -122169 -183280 -279148 -239348 -165638 -160828 -142717 -87488 -70068 -56390 87179
22793 87179 45653 -40090 -17169 -26922 -32013 -121441 -57312 -82014 -178929 -249678 -253593 -119210
22781 -119210 -211032 -240267 -178209 -139596 -74384 -128957 -126383 13667 64225 81240 67935
22770 67935 148480 126722 28332 -36936 -50956 -119280 20252 52892 31326 32147 -15976 -90183
22758 -90183 -20457 39147 76040 11780 -82857 -129461 -65136 -18579 -5171 -13215 -74697 -45900
22746 -45900 -14423 95555 188751 278248 261604 100685 -39780 -40782 -815 12731 51057
22735 51057 66376 89359 28788 -74754 -66597 -54848 14764 8724 -77367 -108753 -213676 -72917
22723 -72917 86451 -25455 -111449 -45933 -8336 -63208 6158 -43557 -143118 -134773 -79363
22712 -79363 -44029 75717 50252 28416 -90424 -58988 38461 116228 66263 -4270 -57964
22701 -57964 -135429 -46885 171153 206021 155314 128519 57842 -100889 -133172 -93071 -35853
22690 -35853 8770 -17081 68806 132809 227802 196175 131453 59845 97568 113083 91084 57378
22678 57378 -69882 -128651 -39812 103842 251322 258819 90281 -1140 167181 216793 99402
22667 99402 -50978 38598 84382 130296 117586 -4353 -17394 -84653 -70618 -46710 -24668
22656 -24668 59240 162916 106421 10391 51819 38459 22333 29215 195993 85102 -95751
22645 -95751 -188735 -163224 -99841 26005 65621 -2325 -97741 -56684 -24239 -66988 5858
22634 5858 20902 168491 261847 208855 130669 114021 -102930 -225525 -157679 -108339 -118849
22623 -118849 -95187 -54374 -12038 -9737 -85702 -52188 28098 150977 325856 257246 130520
22612 130520 17616 53363 95433 -121892 -165290 -49791 -2309 11763 51359 138905 135455
22601 135455 43820 79402 74889 137415 46187 -109872 -118310 -42547 -71127 -210672 -233639
22590 -233639 -51706 159417 350392 266096 81203 -9422 -73367 14970 -73058 -58426 -78482
22579 -78482 -205268 -197882 -102194 83404 142075 74005 80640 16566 -82323 -107746 26737
22568 26737 -5080 -96360 -78827 38774 111554 91990 181513 230201 187472 175497 144432
22557 144432 116857 140445 168929 199082 17731 11523 -16630 -114829 -159843 1855 8160
22546 8160 -147890 -165752 -223004 -178683 -80519 -816 18696 -18741 -60095 -75057 -99879 -91149
22534 -91149 -39120 -56464 -97174 -103731 -38842 -40318 84603 159529 34720 -73533 83462
22523 83462 113280 -29788 -131498 -75239 -94108 -82979 80559 213944 231231 243866 183159
22512 183159 169598 58944 33824 11077 -3941 -84800 -150230 -125924 -35435 2974 131115
22501 131115 110048 12903 -39698 -17712 -35414 98221 230200 71494 33596 48891 54462
22490 54462 90780 151819 120541 15629 -12487 -86295 -110328 -173870 -323779 -182888 -111692
22479 -111692 -110657 -36291 -91504 -108235 -98186 -173993 -157418 -151038 -38260 4014 19247 76004
22467 76004 131273 79294 65551 101915 -41514 -44035 140663 19129 -43673 -63132 -7503
22456 -7503 11311 25509 119703 142951 136614 105206 55232 3469 74405 122115 146377 66366
22444 66366 180471 173871 62138 129103 15630 -75794 -18075 -96908 -34253 -169898 -168600
22433 -168600 47377 103778 -51355 -66546 42210 152515 122409 -1072 -27950 1537
22423 1537 -67159 14282 -3941 -140560 -136420 -61741 8129 -108596 -24761 23296 -14071 -69332
22411 -69332 -96631 -194057 -160227 -164825 -171535 -275715 -195913 -164822 -45780 944 -140813
22400 -140813 -161523 -63990 90640 348302 182794 -104497 -85415 -56049 -33639 -26637 36391
22389 36391 82895 68890 -81021 -31490 125186 57099 -79223 -76694 -97386 -44320 -47271
22378 -47271 -181013 -177844 -124038 -202133 -218270 -202753 -7205 27650 106116 -6267 -64867
22367 -64867 -93609 -27017 134223 180170 54314 -47203 -7752 34943 -14001 -98851 -123515
22356 -123515 103651 120522 -6867 -87907 -137794 -33957 -11057 21765 101162 139916 85552
22345 85552 119123 56077 -2561 -244 29855 28912 -74338 -169258 -289362 -302750 -151993 -71636
22333 -71636 -37945 -129985 -181253 -85847 -149220 -217566 -160468 -47700 -133128 -109812 63044
22322 63044 160975 81947 -78637 -202236 -90475 185702 244682 127531 74586 46172 107412
22311 107412 138097 91172 23152 -56319 -77227 28205 70598 68703 -82005 -131475 -119840
22300 -119840 -44583 -110626 -137549 -10396 127813 99635 41490 137484 369721 379520 234447
22289 234447 86895 -48598 55064 166021 241434 203779 27301 -22361 -120988 -119955 -165974
22278 -165974 -173479 -224196 -184608 -67974 -14331 37086 -4554 -86778 -79385 67155 41667
22267 41667 -166413 -258193 -238541 -214582 -122148 -115938 25837 88957 25584 41674 43583 -15089
22255 -15089 -80041 -112141 -176800 5474 -39428 -115700 33728 104833 58984 -55002 -92362
22244 -92362 -54160 5227 -22945 -93770 -4270 -59466 -19154 135689 106406 106636 171616 195941
22232 195941 119694 -5900 50747 136002 72418 7738 80305 134652 184870 278432 266489
22221 266489 194084 167597 71110 -42922 -84599 85552 205956 38288 -47419 97180
22211 97180 110496 162589 82448 -123275 -152956 -24330 -7151 124974 126702 48533 -41560
22200 -41560 1653 110574 69789 4736 -7930 -63036 16672 81758 74718 66465 -40666 -176649
22188 -176649 -72702 103742 122812 111992 108780 129616 132278 141053 111596 8566 -147835
22177 -147835 -207869 -163866 -127576 -130024 -188232 -167195 -112299 -174567 -202016 -124865 -30835 -120858
22165 -120858 -109546 -34539 -59421 -82287 -139967 -120641 -122908 -20419 14279 -32215 -36023 44107
22153 44107 -74480 -214235 -169529 -142627 -66875 49872 4558 -74086 -74883 24763 -14695
22142 -14695 -25924 -22689 -4754 65461 76771 55456 32478 5817 86276 107444 12576 74834
22130 74834 -23627 32957 23442 46164 89046 86174 177054 104896 35924 30004 107436 165335
22118 165335 126630 77434 61940 48173 101520 130757 135824 210386 154598 143529 96593 -75677
22106 -75677 -164202 -173705 -35622 -21845 -73097 -88792 -183250 -164310 -194407 -39611 -24598
22095 -24598 7268 43787 50170 57138 83691 84307 36943 -29545 -94624 -52752 48222 73371
22083 73371 47491 -20772 107792 118781 62329 -167273 -278098 -244305 -55509 -44022 -226504
22072 -226504 -123992 -10744 -53800 -101537 -134807 -148286 -72053 26296 -44689 -49237 -77428
22061 -77428 -162117 -181113 -162569 -192436 -200465 2222 42770 66402 117703 103979 132807 39777
22049 39777 -1537 140581 165279 55211 -7951 -7461 -125616 -158423 -43484 5323 -46298
22038 -46298 -126939 -64559 -109151 -36902 31237 -22192 -36651 -29517 -124458 -197138 -169034 -231465
22026 -231465 -201018 -151857 10919 81071 155901 229039 256480 161021 93628 32872 -8150
22015 -8150 -74012 -93597 57167 114072 105246 237212 236419 -7717 -145763 -63424 70694
22004 70694 90053 111183 30691 138804 165223 111653 95265 118547 182392 309361 247790
21993 247790 144924 41561 -27697 -79139 -145741 -152243 -62300 -170443 -275979 -252983 -221378
21982 -221378 -15650 -18820 -89410 -52213 102689 68705 40779 84762 -20632 -139830 -29785
21971 -29785 -6165 41399 -60234 -32328 -96546 -156497 -233824 -228503 -115202 -3919 -17298
21960 -17298 -110649 -99726 -50224 -17534 31216 55798 37694 10643 -99507 -80274 -101592
21949 -101592 -65882 -52307 -83476 -79376 -181215 -143914 -170753 -71303 5045 -42246 -89359
21938 -89359 -143412 -198104 -244787 -265457 -215048 -139694 -136541 -186392 -268154 -132703 -52410 -48337
21926 -48337 -38299 49092 32969 -43703 -2136 32061 110337 -51717 -161519 -112538 -157281
21915 -157281 63892 130517 3259 79151 83234 125105 147786 76867 63100 49092 -111383
21904 -111383 -179908 -135283 -117751 -60450 -105785 -217773 -185833 -110116 -18515 -43325 28343
21893 28343 15396 -53387 -95791 -165869 14803 111490 75759 -94314 -21498 157635 171854
21882 171854 293435 195008 2043 8267 -34596 -113470 -208922 -234046 -165724 -45863 -16806
21871 -16806 -156690 -104021 119477 275472 157454 16449 82820 54396 -59399 -79091
21861 -79091 -199150 -210856 -146288 -219398 -256574 -191929 -133769 -83411 -3572 -55013 -143444
21850 -143444 -260309 -243832 -182750 -182610 -108484 -62681 47964 86089 102210 110544 222980
21839 222980 343041 258813 54774 -47039 -14652 25462 49520 -55512 -81507 -103145 -111773
21828 -111773 -55119 35303 -44116 -39923 -71632 -76692 -47790 70262 89283 13223 -6689 -37669
21816 -37669 29209 172514 200972 126459 85070 125521 158013 76423 -17169 104228 159569
21805 159569 229989 116017 28812 45636 17188 -31624 -43437 -94078 -199017 -194107 -217019
21794 -217019 -315487 -242940 -225179 -213531 -172852 -110736 -58712 -166775 -256127 -199307 -115983
21783 -115983 -64351 -39402 -203681 -101553 -141259 -216627 -217634 -59760 14976 -29105 -44661
21772 -44661 -74170 -46872 -173721 -161607 -269629 -236091 -277800 -255119 -147146 -119004 -108827
21761 -108827 -85714 -113452 -125366 -70717 -33427 -107055 -121787 -89908 -155265 -216206 -110511
21750 -110511 -133588 -64324 20191 -38900 -74730 -5795 -172261 -204558 -178503 -189891 -51944
21739 -51944 -64416 -28244 -8517 -99277 -152685 -158438 -194353 -171151 -177389 -94210 67998 60638
21727 60638 2336 -86278 24203 112798 84481 123843 129932 180042 288685 321479 138406
21716 138406 84992 16348 43644 163543 65788 35403 108829 -16197 -114527 -180225 -82933
21705 -82933 -30142 -120517 -216451 -204769 -120693 -119918 16651 161567 234480 236357 154992 83872
21693 83872 -103795 -111164 -170918 -16956 122432 90095 90359 75799 77812 9390 -6603 -22712
21681 -22712 -119879 -189596 -137989 -123778 -162551 -202544 -74261 91648 37686 10066 11227
21670 11227 30767 67062 175685 104899 -33057 43216 39465 -161552 -226886 -254759 -176894
21659 -176894 -120544 -202271 -87131 -52394 -115547 -199396 -123464 26201 96565 166930 110314
21648 110314 77927 53853 15633 129788 16595 -68966 -91180 -31192 -94761 -211823 -269278
21637 -269278 -211271 -175269 -86129 -17604 -32665 77674 127278 24038 -86887 29044 -46741
21626 -46741 -136305 -109350 12943 40344 77528 136280 188166 -2147 -47203 21894 47841
21615 47841 115318 21544 152570 34412 -62552 -16663 71086 102670 87168 -24035 -59104
21604 -59104 -34675 -106562 -207950 -193720 -188319 -186475 -195933 -202687 -227982 -144836 -170147 -174982
21592 -174982 -178179 -160733 -57986 -44098 -13269 42192 78474 120452 96126 98473 155994 129342
21580 129342 -15854 -32386 -81276 -50450 -55324 6842 139324 -1910 8302 -63178 -86453
21569 -86453 -120741 -140305 -227790 -234971 -34216 70338 12095 26815 -16896 -143504 -91164
21558 -91164 -115139 -92060 -85468 -138371 -147137 -150530 -91705 31019 88356 81324 -77785 -11102
21546 -11102 4837 -178852 -212381 -94626 -111841 -191459 -222426 -231079 -344239 -387517 -193254
21535 -193254 -125210 -200410 -42366 67512 62489 32178 -119039 -36057 -87875 -112965 -150908
21524 -150908 -279802 -323333 -209756 -52143 -15919 -61294 -158501 -60289 -96773 -28222 -13044
21513 -13044 -86584 -69560 -91802 -114523 -90403 -2717 45670 53002 56812 20046 -59378 -163930
21501 -163930 -8663 -9498 -26093 -75051 -72223 -57279 -48328 -80354 41797 -7175 -166646 -247630
21489 -247630 -178996 -93820 -87678 -183226 -148257 -75513 16987 61551 -44635 -102733 -8334
21478 -8334 -5767 -179891 -100571 94091 49118 -55012 -28942 50224 116070 225612 146953
21467 146953 -30303 -134494 -116125 -28973 -43627 -77321 -22246 -148940 -251766 -127588
21457 -127588 -62906 -149773 -88588 -118749 -107264 -11244 -100643 -291477 -228400 -179535 -281246
21446 -281246 -280427 -186495 12663 81283 -46675 -116424 -123475 26197 -49615 -172358 -164441
21435 -164441 -96022 -22675 -35679 -149586 -262649 -157449 -67753 -142130 -130675 -161898 -154000
21424 -154000 -148631 -111077 -42832 81293 66639 22980 -82158 -40650 -53483 22625 52259
21413 52259 -42385 50471 62752 -16681 -96349 -123415 24988 84320 96801 89893 18627 -16680
21401 -16680 -82142 -17464 -46038 -141829 -104753 -29956 -90898 -17976 -59219 -110801 -45200 17391
21389 17391 65489 116089 51141 143731 91402 21477 102724 152799 140767 44739 -42245 -73609
21377 -73609 -100269 -126645 -127011 -36867 -9615 48445 145815 68979 79002 169464 150185 243
21365 243 -53462 30358 178652 92381 29196 -90638 -185394 -152863 -135362 -125543 -145414 -224220
21353 -224220 -355560 -340712 -88104 -14950 17315 124062 66596 112273 47182 -58778 -70321
21342 -70321 24817 -160791 -293142 -327218 -222127 -117664 -159728 -116428 38366 -24095 -15235
21331 -15235 -120679 -142229 -64509 -46189 -45508 21590 -1056 -61001 -57570 -39121 18737 61824
21319 61824 57280 2125 -21248 16615 41778 21977 -182627 -130741 -24930 -64916 -159224
21308 -159224 -130396 -45358 19448 28121 -124410 -119552 -28695 121067 236228 122336 -13925
21297 -13925 77171 29251 51617 98101 32327 -768 136128 100937 126159 256323 271717
21286 271717 228727 182786 -90200 -90091 -71032 -149012 -149881 -151489 -131968 -27190 -87116 -156573
21274 -156573 -105905 4813 130963 155245 256092 236714 87306 -182802 -213343 -128758
21264 -128758 -72012 -94422 -88192 -103779 -18345 58167 85218 177364 162921 32176 17845
21253 17845 64785 3105 -109555 -222203 -145330 -9998 12382 32218 15058 77979 69376
21242 69376 -16132 -107095 62026 -33449 -146662 -175061 -115004 -117317 -88807 -163359 -293337
21231 -293337 -339834 -164768 -64960 49004 91928 591 -82112 -122722 -170309 -132307 -3580
21220 -3580 -81258 -175033 -112628 -87965 -142133 -142897 -175048 -107777 -140374 -133176 -16665 -98022
21208 -98022 44914 181149 177504 37807 29547 17867 -60520 23576 90103 -42488 -121074
21197 -121074 -92570 -105772 -144309 -175273 -134128 -75915 -24850 22373 39773 55768 49132 106067
21185 106067 29334 -99076 -102701 -87533 -134585 -190254 -121623 60628 -29809 -165653 -95536
21174 -95536 -47810 -138815 -186523 -284443 -234640 -61407 26792 -3393 -29896 25147 13335
21163 13335 -105880 -157281 -178604 -147505 -56315 -29159 -71555 -58321 25838 27117 -76562
21152 -76562 -199119 -329557 -281791 -224840 -177943 -136533 -40100 -60885 -161214 -163631 -201467
21141 -201467 -269338 -253311 -321013 -311818 -277108 -204289 -86495 -80565 -126057 -190035 -271808 -186512
21129 -186512 -114316 -125008 -36373 43234 -19914 -62311 25380 6664 -70088 -109277 -149586
21118 -149586 -187252 -130899 -41308 -102261 -4756 -14872 -154283 -105863 -3902 74690 160224
21107 160224 176664 41191 -20274 -78036 -70554 -169236 -188150 -133038 -172550 -116503 -73497
21096 -73497 -95423 -226837 -172038 -30152 51520 77331 52550 34591 171467 264295 246776
21085 246776 204052 138042 121030 78782 92952 213719 261480 188741 95900 76565 116978
21074 116978 210345 192951 98648 25652 4650 -20274 59682 -85366 -58788 9811 -29987
21063 -29987 -81280 -144512 -88903 -108014 -74131 73409 82420 169881 112463 35513 -102408
21052 -102408 -203087 -110687 21949 145212 239827 156281 -146857 -185815 -141795 -106489 -84056
21041 -84056 -75426 -77149 -68705 39956 105394 -11253 -92131 598 19001 1511 -75539 -38640
21029 -38640 149650 112183 9992 -42106 -18224 9628 48055 2058 -54000 35932 43604
21018 43604 115870 138509 181672 213341 164525 154285 -47136 -86539 -97070 -106173 -20682 9327
21006 9327 26802 -100175 -140594 -84693 102900 86101 -219 74736 3204 -151766 -254714
20995 -254714 -176016 -131865 -76263 -20101 36363 121542 76354 -84675 -237136 -167678 -55745
20984 -55745 32231 -27852 -95727 -171623 -111352 39051 -55780 6936 -156377 -177762 -113080
20973 -113080 -111392 -19098 -14125 -57162 70690 168489 218249 171942 50916 53958 130452 99392
20961 99392 8848 -1811 -114091 -201739 -73939 -26637 -94429 -106459 -139866 -127521 -94818
20950 -94818 18077 112579 144811 128658 60439 178470 248861 286158 229391 155886 111605
20939 111605 160217 56138 -7053 -104765 -124111 -145139 -249575 -171493 -66022 -86646 -69759
20928 -69759 -23686 -60642 -40005 -12810 6927 -22605 -83665 -29299 -10111 -3734 -27949 -125468
20916 -125468 -150552 -162432 -142986 -84577 -148851 -161626 -246390 -234309 -189951 -170644 -148460
20905 -148460 -68352 -51465 -61970 -57341 77227 -1746 -63415 16856 -112198 -160109 -62785
20894 -62785 -79840 -82420 76665 19598 39860 17425 86424 124229 -40553 -222215 -280023
20883 -280023 -252415 -222367 -82102 90776 71628 11853 -113586 -122175 -85319 -129635 -19083
20872 -19083 58226 -20377 -58269 -84412 -86439 -89255 -194515 -223975 -105401 -108027 -9476 121907
20860 121907 92972 -1147 91634 118909 191008 169464 152906 65820 118245 155192 132461
20849 132461 248939 258393 180606 -19966 -41578 -92907 -166534 -170618 -190957 -306756 -276202
20838 -276202 -293864 -136693 28643 -15653 -34776 -37326 51931 83003 84106 93128 48392 -93191
20826 -93191 -136215 -91126 -155649 -122819 128557 85937 -139734 -217947 -144180 -112540 -56227
20815 -56227 -85606 -35053 -14888 12062 -20526 -18486 19490 -28746 -221486 -188279 -99974 -113506
20803 -113506 -176601 -280849 -213906 -88977 -16084 -79554 -11572 -18971 -16182 -38351 49585
20792 49585 -27176 -84201 -103601 -4067 1548 -62291 -46076 35104 130085 109068 -53647 -58106
20780 -58106 96646 125616 49534 5053 -84626 -248447 -241685 -94988 -138668 -55928 16459
20769 16459 -15954 -7985 67371 -16462 10444 10351 132252 64188 -22267 -2967 -34848 -70546
20757 -70546 467 72005 -6350 -105415 -182856 -151131 -121818 -48126 -88269 -204461 -201837 -226709
20745 -226709 -241366 -123448 -55648 73289 89426 -38777 -30781 118342 118847 -101765 -172904
20734 -172904 -169276 -88303 -74086 -78559 -135315 -141834 -125763 -78191 24089 -7685 17185 39131
20722 39131 -14315 -33353 142150 41018 -55582 -48297 16152 68156 -87961 -297537 -186313
20711 -186313 -184464 -130731 70437 129338 71441 72085 44031 43355 -36145 -118866 -42421 110599
20699 110599 78636 -69847 30667 -47439 -229063 -395791 -335059 -221897 -149079 -29214
20689 -29214 -71053 -94226 -169197 -161084 -53971 -74813 -7524 176394 144846 68632 -5681
20678 -5681 -47948 11431 -9238 -22083 -20098 -68808 -70652 -61940 -83439 -51148 -35023 -36088 -51479
20665 -51479 -95150 -154717 -38101 -82242 -137473 -24390 31406 52508 73855 -17452 -4905
20654 -4905 75136 108361 -31932 -75483 -16012 -105376 -149672 -143393 -110994 -22250 -15183 69040
20642 69040 102027 -23191 -92980 -114316 -13635 51990 -30866 -288620 -340108 -173457 -53252
20631 -53252 53323 42317 -52210 -139823 -134111 -194610 -327433 -216032 -147939 -205744 -134565
20620 -134565 41359 44166 100883 59470 -121825 -89951 -101698 -119259 -216507 -312897 -280143
20609 -280143 -331420 -342274 -236478 -147045 -87627 17575 134158 120852 109633 153216 157495
20598 157495 110492 229719 132267 -59358 -108274 -13665 60650 148205 252723 156205 69507
20587 69507 -53978 -113800 23093 144807 115669 115717 150464 67632 120674 163157 -17260
20576 -17260 -223487 -85894 84123 200131 200120 168170 216642 205458 36828 20056 -16674
20565 -16674 -101066 -32779 64665 39264 -8625 -61537 -47339 99627 131929 31138 -1910
20554 -1910 -221626 -254205 -108870 -74783 -27247 768 -69929 -63224 2186 -74961 -34193 94983
20542 94983 89847 -2919 25507 68886 50382 -6245 -9962 -10790 -4535 -57619 -35670 -37447 -154169
20529 -154169 -166583 -92631 -2109 131058 243835 169247 115455 19647 -57941 -86070 -177913
20518 -177913 -99291 34334 87143 82749 90718 36945 63978 101279 -76620 -128781 -114359
20507 -114359 -155080 -53472 -38364 -19381 73983 -10038 -38668 -51524 -48168 1967 -3835 -106200
20495 -106200 -104856 -142444 -124914 -113789 -82172 34852 105333 152376 97728 113901 -23190
20484 -23190 -75273 -12978 -97067 -7652 78877 70067 68691 126652 73904 -85484 -189042 -321746
20472 -321746 -337439 -280927 -243989 -277265 -319379 -371141 -209977 -154328 -174992 55936 97687
20461 97687 -19940 -224848 -147899 10198 -5957 -65928 13870 -37691 -30108 -25937 -50498
20450 -50498 -12797 13156 196284 211466 160027 1496 -65167 -98629 -197073 -223991 -169661
20439 -169661 -42281 -30913 52413 74980 -32021 21132 135397 169845 66302 3071 -15175
20428 -15175 -67768 -146412 -198047 -134066 -162210 -106112 -177455 -334421 -266445 -162537 -121858
20417 -121858 -91745 -41791 -18161 76962 93097 -23850 -86060 -126160 -257612 -280299 -335231
20406 -335231 -259829 -22313 -43389 -183975 -240226 -158381 -15688 57140 40863 13829 -86905
20395 -86905 -223351 -280648 -258047 -49872 49011 48737 30230 38890 -14651 25848 -16659 -53856
20383 -53856 45127 174954 124109 84213 -140272 -152031 -95666 -169348 -183543 -156919 -68668
20372 -68668 -34358 101281 65988 82860 107399 75589 84984 15757 -58172 26950 48880 -3099
20360 -3099 -41301 13298 -44741 -121020 23100 71694 105249 251712 366204 202289 165678
20349 165678 157296 191635 116947 19553 40150 68626 89963 101602 -34372 -63765 -191076
20338 -191076 -171086 -179755 -380170 -373755 -194930 -70837 -23204 -43002 -12451 -9799 -49213
20327 -49213 -105104 -200864 -186790 -65926 -61436 -13260 -12264 57744 83821 -58780 -124292 -109507
20315 -109507 -52460 -15041 102078 -64672 -128731 -143234 -73867 37223 -17037 -115796 -857
20304 -857 116075 199680 42561 -63497 -77413 -46707 14516 118557 91765 -40634 -88901
20293 -88901 -80843 -158854 -111331 -111746 -58249 -27299 68794 158614 151253 103466 57438 38220
20281 38220 16360 -85928 -103576 -198312 -249117 -163944 -138527 -67500 -46269 -9326 23424
20270 23424 92361 17544 9803 89851 121992 -38380 -24558 119771 156870 24730 -47180
20259 -47180 -89974 28145 65894 41316 70611 -8877 5463 17172 74625 11587 -15297
20248 -15297 -30582 20685 -4165 -137764 -159769 -28781 85356 105161 69356 226382 258603
20237 258603 158820 19217 -163712 -254403 -217913 -149275 -195005 -193741 1698 48469 22167
20226 22167 -6038 -58428 -37238 -20671 15893 44256 76294 99090 -44 -7270 203437 73440
20214 73440 49292 -9687 -48229 65935 147241 89699 52649 98256 162326 151958 115094
20203 115094 148201 143510 64374 29423 31633 47013 48343 67726 169323 196749 108713 22678
20191 22678 -47417 -56225 48811 -52696 -52208 -32655 -49335 -55863 -170933 -177598 -149200 -27307
20179 -27307 -6765 -14805 12069 -97868 -133759 -40151 -22527 -119336 -108664 -119742 -100317 -72844
20167 -72844 -26787 -33066 25358 -18350 -42957 -69154 -91817 -72861 -140390 -285906 -331482 -336538
20155 -336538 -194825 -102494 -122382 -122750 -81050 -148749 -137862 -120471 -13202 24470 -40600
20144 -40600 -32812 1796 92317 207152 168008 -45765 -197777 -206273 -98844 -85907 32411
20133 32411 132635 53351 -44631 -125588 -174121 -162614 -125470 -33652 -9278 -134011 -206236
20122 -206236 -176705 -5659 15548 -99721 -116582 -185363 -216782 -249530 -208760 -157250 -236473
20111 -236473 -275187 -198281 -106106 -76235 -139492 -179759 -87502 -12125 140130 159557 62960
20100 62960 -59893 -92631 -36041 -89690 -112614 -107526 -95104 11450 57801 78829 53886
20089 53886 36885 59736 38137 130688 214940 137945 12461 -40321 -89402 -82788 37694
20078 37694 -116275 -252609 -248281 -183590 18178 28404 -1572 59437 115139 754 -19992
20067 -19992 -91774 -125235 -105320 -116062 -110684 -201290 -117792 -72645 -155700 -229168 -226659 -206091
20055 -206091 -163929 -22008 -5535 -10185 26309 -124199 -108121 -150474 -130060 -108747 -18389
20044 -18389 -55308 -177926 -178346 -105027 -116018 -153352 -116044 -38985 -59929 61827 2373 -30602
20032 -30602 -24688 65174 29341 27726 -41568 -132787 -210513 -104980 6783 72277 -43711
20021 -43711 -163789 -86702 -32244 -2562 22640 -112731 -207348 -149322 -20783 -61564 21481
20010 21481 120416 133755 63293 -22180 -12809 14906 93052 66249 73552 130633 -14622 25339
19998 25339 21266 -49270 -101020 -53272 -66018 -62516 -75542 -21079 -43874 -53494 -67068 -55037
19986 -55037 83640 124518 -4642 88450 224143 153404 23558 55792 145631 182901 93411
19975 93411 203999 191549 54827 12190 153149 191028 85410 -96993 -117590 -254601
19965 -254601 -260577 -231778 -247864 -99591 99243 34407 7379 -52253 -84707 -30531 -16032
19954 -16032 118615 110626 69500 120940 118729 -19879 -96506 -160746 -238049 -269357 -153863
19943 -153863 -119092 -23130 32749 -40236 -113197 -105067 -113882 -184292 -136729 -79469 -28800 -62845
19931 -62845 -20254 -38987 -144898 -119132 -77343 -107703 -113551 -113208 -347857 -408792 -269279 -139079
19919 -139079 -68593 -88855 -77979 42257 192868 155532 98395 41574 4797 27346 252612
19908 252612 252183 211530 71910 -71770 -50627 92013 250167 183776 -6941 2025 975
19897 975 -195158 -217549 -205573 -72994 53761 46785 42170 98061 142121 166982 54275 -925
19885 -925 785 39219 84143 203442 168832 20683 -70695 -156081 51383 135562 83370 81778
19873 81778 -2496 -45443 44441 105965 114778 -2409 29218 9706 -69396 -164761 -199059 -40221
19861 -40221 36782 -111346 -138678 -121432 -206160 -176275 -192470 -143171 -11917 106 70285
19850 70285 89192 -16032 -44959 -24965 40492 11551 89952 185649 116239 44360 -64983
19839 -64983 -21698 21101 -12005 -39483 -8946 109705 98878 -48696 -84533 -143056 -72422
19828 -72422 -18470 -54417 -3944 16034 101763 294615 277704 159480 137997 108158 115928
19817 115928 58290 114317 165500 123409 66665 33146 -35734 -103145 -171845 -204478 -134857
19806 -134857 -108505 -92589 12735 66669 -70766 -175072 -39479 -68611 -218305 -195345
19796 -195345 -67142 77357 41201 -81202 -210386 -136167 85395 86367 -52858 -89791 -44447
19785 -44447 75286 95655 186497 184048 -4327 -124083 -34331 79253 72704 27760 89481
19774 89481 111701 128369 131637 262018 338594 326785 457182 629051 737566 852842 939909
19763 939909 1016577 1098913 1383391 1619592 1673304 1816973 1805964 1680861 1515173 1546700
19753 1546700 1444931 1217404 1256088 1360906 1365189 1493559 1781564 1744956 1695416 1747461
19743 1747461 1588159 1276982 998765 858405 756775 696605 570279 559480 346498 292806
19733 292806 318909 252484 252517 336137 301628 181406 111062 145500 126271 27298 -55038 105289
19721 105289 207226 140403 147401 165709 157473 177185 50695 -109604 -164602 -48105 -17060
19710 -17060 -231433 -270047 -112015 -42907 17485 125351 245534 245782 177836 121537 -25263
19699 -25263 52485 195494 143028 117137 81792 -128472 -150417 -81882 -45409 -13573 12010
19688 12010 -18733 13996 -43050 -117588 -85809 -119317 -117868 -140289 -110772 -216712 -329205
19677 -329205 -199110 -68340 -37523 -40052 -23376 14959 -20118 -165843 -274911 -312501 -167581
19666 -167581 -99617 35763 64467 49136 95974 132762 148006 6110 -112797 -67292 30464
19655 30464 -44343 -97172 -92537 -44512 73787 230267 158251 -76528 -191065 -179540 -21532
19644 -21532 47355 -9401 -22661 3849 -35482 -104667 -48139 144519 224654 150326 245460
19633 245460 110065 167918 37516 -71673 -135721 -93839 -117234 66010 135831 -24166
19623 -24166 -43302 -4438 -10210 -40868 120256 201131 209053 145842 100385 -11554 -207871
19612 -207871 -149723 -10460 102144 26735 -115780 -189151 -35358 69575 84180 23114
19602 23114 -71501 -159986 -172152 -166061 -140050 -231315 -230216 -92647 -67803 -143840 -144918 -176560
19590 -176560 -193098 -311809 -295871 -241912 -189728 -162703 -146325 -31931 -28595 -37238 -16069
19579 -16069 -55229 -136398 -354534 -334799 -133657 -123511 -45213 -119013 -228752 -110540 49016
19568 49016 125650 90093 3959 -66983 28069 30341 -33590 166833 170435 6436 44333 -52123
19556 -52123 -106481 -81205 -41802 14149 76936 -81145 -43740 -9736 2266 -112212 -136638
19545 -136638 -109360 87757 177086 38344 -72406 -7608 118367 100582 -26885 -94750
19535 -94750 -153418 -23365 95056 14580 -63268 28059 21409 34424 109064 150216 106065
19524 106065 88412 170769 196314 106051 86816 50686 60684 68990 46725 34170 -94024 -58975
19512 -58975 107321 133178 105939 24844 -34877 5234 8567 35001 195406 141398 -21009
19501 -21009 -12404 -92745 -157856 -98435 -69101 12922 -58798 -72607 197007 238732 210476 245137
19489 245137 301367 291000 249375 340081 404103 256093 -76009 -83093 80368 181600 251383
19478 251383 168794 80050 130955 139813 305945 280998 141066 68592 -11529 114611 143622
19467 143622 147050 129505 150205 190889 219397 222501 139980 112223 90116 74652 117632 141085
19455 141085 107077 124476 137502 241802 294235 212985 253399 304289 302660 288000 304604
19444 304604 222831 183527 180260 242812 342998 321123 368121 449161 315329 221489 242022
19433 242022 309654 319268 261858 288693 436857 429277 354990 210391 245882 337030 414657
19422 414657 455566 445091 491202 415602 302900 416055 541479 676434 804140 922114
19412 922114 1172870 1250571 1307471 1535997 1588367 1385472 1199760 1112607 1059364 917887
19402 917887 705724 551506 523877 483552 548889 519699 413846 404241 367754 341979 446262
19391 446262 492627 521695 531238 415576 386719 411794 499942 495767 486982 530480 429228 412699
19379 412699 505506 454208 357624 538388 697963 643306 683416 616551 543945 466068 447395
19368 447395 659715 713143 883330 1088083 1252375 1438838 1518124 1737827 1953304 2002682
19358 2002682 2107069 2185367 2189766 2081053 2015825 2057187 2086994 2119509 2145724 2030218 1850082
19347 1850082 1560007 1286136 1114202 1020812 945775 896619 904197 878801 902791 973172 979690
19336 979690 972218 966754 850069 641072 668521 943323 993313 839755 848435 806249 888183
19325 888183 971041 1037892 995739 1084964 1123273 1092783 1129150 1275080 1405023 1450892 1337676
19314 1337676 1207198 1272760 1362343 1431294 1424974 1421714 1468360 1466666 1441873 1620282 1705379
19303 1705379 1673520 1688711 1735953 1749977 1719147 1696570 1719518 1772544 1741826 1780591 1860001
19292 1860001 1842354 1740809 1761475 1801304 1804355 1909522 2055522 2122005 2138022 2060918 1986720
19281 1986720 1967821 2111319 2159218 2095218 2135420 2275476 2500443 2649611 2818518 2993492
19271 2993492 3093433 3145156 3239042 3476432 3732228 4027943 4339393 4818165 5373801 5962707
19261 5962707 6813535 7499549 8327742 9183061 10025474 10989751 12043770 13511347 15329348
19252 15329348 17326636 19409732 21821071 24831145 28247281 32266061 37066108 43009579
19244 43009579 50420941 59961378 72870152 90602875 114298915 144746986 181716904
19237 181716904 224199431 268960558 308075273 333060191 340037437 331518276 310831660
19230 310831660 282964102 253615029 232212378 227133765 240348266 267275950 300976426
19223 300976426 331324193 348652637 348216743 331192330 299708615 257535501 209265424
19216 209265424 162471559 125457156 101352112 86671634 77346540 71073797 66448239
19209 66448239 62659323 59280230 56083836 52967742 49926943 47273957 44834719 42898567
19201 42898567 41284273 39974521 38776261 37447486 36036816 34612916 32799457 30842765
19193 30842765 28707570 26604854 24809361 23132199 21658693 20312827 19086945 17883074
19185 17883074 16680930 15480279 14451426 13722389 12862632 12052076 11427594 10976560 10350240
19176 10350240 9726074 8987231 8416281 8079928 7756941 7314153 6834649 6544921 6207252
19167 6207252 5752887 5441037 5233493 4975990 4650065 4399194 4247701 4042089 3790335
19158 3790335 3596127 3359179 3132597 2974661 2802336 2656267 2569617 2506876 2433824 2288283
19148 2288283 2174057 2051691 1894691 1872513 1769641 1831645 1708477 1677519 1546776 1353509
19138 1353509 1268932 1261793 1329419 1375056 1185723 1084201 940167 897134 879715 867394 826868
19127 826868 792258 739411 814513 918393 808786 707033 717891 756266 774336 826242 899186
19116 899186 989530 1069914 1075002 1146716 1238141 1231109 1224239 1164701 1096230 1055897 1058999 1084557
19104 1084557 1076827 1083429 1295628 1340838 1193812 1245160 1392121 1394724 1376118 1343003 1341989
19093 1341989 1378987 1272205 1135627 985602 940666 1005823 989425 1027396 968887 845176
19083 845176 735879 598290 673599 582311 445018 507508 524020 518896 449692 486883 498615
19072 498615 549732 581056 551497 511361 593789 568975 595007 605947 615962 698823 779206
19061 779206 883631 976556 1018035 1036235 1271763 1523113 1817704 2155507 2384313 2622804
19051 2622804 2700309 2655719 2599441 2537433 2337349 1955696 1657883 1426806 1302892 1223660
19041 1223660 1248506 1183785 1146194 1116724 1139640 1044807 1036227 989982 820012 811836 824450
19030 824450 858768 1012946 1101613 1167067 1120021 1079970 1354429 1566602 1699160 1989270
19020 1989270 2263112 2584955 2875422 2958312 2931677 2776980 2517974 2252757 1973124 1743603
19010 1743603 1515022 1285468 970558 762716 714795 849020 833262 768268 782687 901003
19000 901003 835765 967766 938568 898046 819127 802333 772839 951015 1014144 977309 992980
18989 992980 897687 899169 950496 992341 991672 923033 912925 966145 1048396 1098642 1240602 1221973
18977 1221973 1153613 1204240 1259870 1331050 1433129 1480837 1540395 1697798 1869249 2011671
18967 2011671 2158042 2243991 2317055 2337833 2350499 2538758 2620989 2628786 2580103 2668252 2685630
18956 2685630 2556934 2435751 2401058 2314419 2186136 2207329 2154610 1947140 1795848 1804175
18946 1804175 1875259 1937460 1899105 1924292 1788286 1749095 1904556 2114254 2128994 2132848 2119275
18935 2119275 2192935 2454223 2638945 2885323 3172271 3430040 3617130 3846908 4179622 4505401
18925 4505401 4733730 4836040 4873506 4991468 5130665 5285722 5444210 5625883 6055328 6632741
18915 6632741 7443243 8463196 9393513 10373894 11714882 13343612 15203372 17208772 19387394
18906 19387394 21967005 25049269 28650139 33240632 39581062 48425815 60576101 76136986
18898 76136986 95816398 119576875 147719738 178180390 203865488 217204354 225206765
18891 225206765 235147852 238220010 225918406 202375878 177232445 157063228 134707971
18884 134707971 105248976 78956356 61829156 51202193 44592463 40324840 37333529
18877 37333529 35109567 33272869 32067063 31184507 30364606 29725412 29229527 28701472 28206391
18868 28206391 27530252 26975266 26612598 26196839 25599034 25038125 24784772 24646612 24665846
18859 24665846 24823407 25029325 25399267 26085516 26886617 27990347 29667892 31794921 34699000
18850 34699000 38600127 43827000 51057151 61257576 75194073 93834810 117273505
18843 117273505 145696988 179486428 217269616 252011559 272426166 282707623 294651321
18836 294651321 301607052 289023585 259139408 225501917 199257367 172907317 136890870
18829 136890870 101934107 78226763 63757412 54236341 47708780 43137136 39882899
18822 39882899 37495350 35422796 33724669 32512938 31532067 30811358 30245252 29494365 28800641
18813 28800641 28185708 27458113 26642988 25519084 24401504 23335153 22271725 21088741
18805 21088741 19857093 18736517 17736651 16889225 15840476 14735057 13907479 13102675 12219698
18796 12219698 11349547 10665061 10060226 9312467 8661385 8112223 7827250 7421999 6890024
18787 6890024 6506464 6242299 6042703 5801141 5438062 5085633 4865786 4918140 4721096 4534737
18777 4534737 4408696 4184072 4019116 3894018 3876504 3736419 3559102 3446973 3420824 3371863
18767 3371863 3343668 3436607 3561980 3592131 3337351 3057694 2721806 2396421 2161544 2100492
18757 2100492 2122106 1905904 1730848 1718411 1894290 1867787 1770647 1641783 1618273 1490110
18747 1490110 1323372 1304370 1376992 1381822 1163889 1152585 1236014 1283077 1302242 1244384 1142236
18736 1142236 1213668 1287385 1276698 1191462 1276416 1212840 1109928 1244996 1435285 1491616 1402386
18725 1402386 1433646 1481555 1574273 1455294 1344643 1303845 1313435 1410893 1529186 1675792 1751662
18714 1751662 1767701 1926834 1969151 2070395 2165051 2282377 2456476 2748750 2956455 2983635
18704 2983635 2927565 2819535 2676508 2568501 2403535 2231012 2098718 2115624 2224368 2239305
18694 2239305 2466835 2791540 3004188 2929812 2821781 2789122 2695956 2651331 2627904 2599892
18684 2599892 2634507 2602268 2582680 2580099 2589476 2594085 2576153 2549888 2318675 2006844 1771310
18673 1771310 1654803 1488235 1413911 1518640 1588213 1522345 1490946 1470083 1415256 1399185 1364518
18662 1364518 1317947 1329488 1405309 1393376 1488441 1539538 1460183 1500525 1643577 1855977 1985083
18651 1985083 2160429 2456748 2680156 2809928 2941641 2963281 2997340 3070225 3198360 3237327
18641 3237327 2814712 2328476 2151600 2138073 2234135 2308223 2194459 2189602 2209175 2205523 2281972
18630 2281972 2341192 2349514 2174071 2055694 2071350 2208129 2252158 2138856 1899736 1562331
18620 1562331 1310682 1249392 1129618 1114594 1162465 1146176 1157802 1106219 890021 958874 1077168
18609 1077168 949508 967171 935938 972882 997373 1050929 1146203 1182025 1112434 1121467 1318912
18598 1318912 1518761 1603231 1627484 1583864 1445540 1366356 1289731 1214645 1192791 1189121 1144980
18587 1144980 1009151 851064 910501 1073361 1021845 918291 967547 964575 912672 1048600
18577 1048600 1102803 1077470 1078697 973003 987785 1149966 1208479 1221692 1362195 1350884 1357029
18566 1357029 1531546 1741782 1872601 2116618 2234415 2139412 1918253 1877365 1953916 1884162
18556 1884162 1768684 1592067 1559803 1627604 1640093 1645758 1724503 1970993 2119356 2146168 2030807
18545 2030807 2139768 2174007 2064099 2108890 2036278 2042531 2219636 2458908 2673324 2758385
18535 2758385 2729504 2742129 2845170 2786614 2700418 2863281 2879493 2967526 3134290 3207824 3285636
18524 3285636 3459862 3553226 3575343 3609237 3609596 3653518 3869562 3914642 3851434 4010815 4126656
18513 4126656 4085595 4082815 4125333 4341456 4693446 4904666 5193856 5510988 5769230 6034868
18503 6034868 6396939 6668553 6899532 7148216 7488043 7802558 8051779 8374430 8756980
18494 8756980 9278131 9970869 10906372 11985790 13023883 14163777 15528015 16936560 18406322
18485 18406322 20277457 22577172 25400955 29016904 33509414 39243734 46705626 56733967
18477 56733967 70667611 89769180 114702637 145465108 181523681 222029444 262152452
18470 262152452 289711967 293949099 280267155 258946110 225208863 176891206 128988930
18463 128988930 95547359 75444718 63081153 55151333 50211931 47093302 45306515
18456 45306515 44623316 44798188 45533735 46654690 48095831 49670990 51404034 53672596
18448 53672596 56809524 60974200 66513404 73815458 83922311 97958795 117209957 143010205
18440 143010205 176070646 216029214 262543655 312949147 358404190 383099080 382071100
18433 382071100 365119824 336311441 288449345 230000869 183478728 159333635 152611991
18426 152611991 157735909 170978160 189601765 212460964 235392210 248763966 242235644
18419 242235644 225882131 212445191 196677102 175417622 161248893 160459975 170020698
18412 170020698 185831002 205567525 225541924 236977599 229687231 210919936 192805253
18405 192805253 171065480 140737511 112507536 93009369 80379304 71981017 65720121
18398 65720121 60966983 57149401 53975654 51505412 49323741 47369886 45872062 44782497
18390 44782497 43630074 42582739 41660002 40880290 40281343 39680159 39056075 39046581 39292711
18381 39292711 39362198 39899802 41021287 42738885 45027395 48332118 52903015 59429314
18373 59429314 68698165 81176444 96992838 115834494 137110795 158729305 174617906
18366 174617906 176322201 168054585 159888880 148831503 131184748 116959203 113332219
18359 113332219 118813600 130502946 146653858 164618945 178342411 179181256 168624889
18352 168624889 156916320 142386875 119476812 95662926 78920535 67881618 59571766
18345 59571766 52787157 47373172 43578503 40867045 38594275 36670399 34918051 33363524
18337 33363524 31943818 30603750 29499856 28378461 27309692 26293895 25125770 23942597
18329 23942597 23045126 22285277 21321318 20361885 19554689 18644524 17770796 17018873 16403302
18320 16403302 15603862 14883166 14179645 13626731 13496345 13683290 14037884 14286738 14502646
18311 14502646 14672861 14842279 15149103 15386192 15323054 15075160 15032145 15376903 15939376 16518850
18301 16518850 16988168 17295107 17322301 17159711 16415004 15257336 14095366 13033389 11915754
18292 11915754 10774834 9932192 9383479 8990841 8614408 8210928 8050270 7945008 7841305
18283 7841305 7896385 7816866 7590443 7447368 7285294 7035874 6717479 6396936 6176828 6150202
18273 6150202 6459842 6716399 6774750 6885491 7131890 7502903 7745518 8036981 8011477 7977503
18263 7977503 7962839 7755275 7627695 7909930 8305860 9036445 10063863 11526117 13130347
18254 13130347 14866449 16637151 18309643 19560128 20479984 20198520 18612023 16283336
18246 16283336 13987636 12129470 10809054 10059387 9859337 10005696 9962944 9858023 9764921
18237 9764921 9694882 9684503 9381811 8776083 8057051 7513422 7153680 6893699 6477420 6199170
18227 6199170 6169035 6164470 6215228 6109755 5957729 5775079 5591491 5301762 5105818 5110316
18217 5110316 5093418 5123002 5146163 5358711 5539249 5725851 5864852 6087557 6291116 6490652
18207 6490652 6549526 6338586 5866841 5697246 5765675 6001589 6622050 7258158 8070701 8960125
18197 8960125 9593436 10006599 10257715 10173082 9618210 8493059 7290451 6620026 6372764
18188 6372764 6261975 6186383 6266492 6242254 6162794 6279556 6482854 6660061 6993781 7248096
18178 7248096 7508988 7736076 8073101 8508401 8950515 9407780 10060850 10865593 11594802
18169 11594802 12322624 13150221 13974381 14961428 15863930 17015610 18417224 20012660 21881346
18160 21881346 23827990 26146883 29110472 32779760 37579565 44003695 52732499 64740887
18152 64740887 81326677 103371160 131492356 165056984 203690370 245428017 283765914
18145 283765914 306372763 309493869 299371999 285858975 275859868 257960295 223914589
18138 223914589 178906590 134061106 101674838 82130875 70403404 63153097 58360854
18131 58360854 55069394 53065137 52000637 51719049 52191510 53343846 55122234 57604097
18123 57604097 61052798 65276889 70464480 77093605 85995982 98416003 115246919 137390163
18115 137390163 165681271 200405497 242103751 288845147 333072845 364661009 383221903
18108 383221903 395323469 408484087 408834434 362659672 280459686 203757547 148497947
18101 148497947 114112536 93245691 79661479 70128650 62995021 57627950 53678328
18094 53678328 50677105 48438009 46597272 45206084 44169435 43415407 42932215 42339762
18086 42339762 41594117 40705692 39692156 38607082 37249487 35354945 33168515 30933743
18078 30933743 28708693 26523303 24697347 23146771 21660447 20412571 19288097 18179751
18070 18179751 17250953 16425299 15651080 14805363 14147434 13630652 13075791 12424525 11901484
18061 11901484 11476180 10969041 10507027 10102704 9738289 9388263 9013093 8718781 8363289
18052 8363289 8016841 7896663 7731210 7412426 6974608 6513643 6294987 6218913 6111764 5910717
18042 5910717 5665651 5563271 5521256 5523879 5491227 5548997 5616076 5453238 5346908 5321000 5223793
18031 5223793 5189164 5244481 5257902 5179210 5168121 5301161 5157850 4999957 5047531 5080613 5013647
18020 5013647 4988847 5142610 5323295 5518512 6206926 6943848 7687322 8515522 9539077
18011 9539077 10627863 11101946 10735356 9774369 8653971 7529888 6636517 5997826 5553844
18002 5553844 5251940 5183573 5209616 5203575 5330054 5394903 5170783 4931999 4654154 4563349
17992 4563349 4546997 4548877 4566490 4659919 4839059 4888854 4883574 4830056 4693189 4521291 4497542
17981 4497542 4380366 4305418 4327276 4254814 4145136 4084125 3988018 4133756 4321048 4449003
17971 4449003 4524014 4696689 4917467 4978538 5014911 5079772 4952181 4987780 5105809 5289949
17961 5289949 5607639 6078645 6689584 7479714 7994124 8352379 8345309 7864350 6998117 5994844
17951 5994844 5250741 4719063 4246933 4006798 3901810 3806512 3863359 3837488 3896596 3970424
17941 3970424 4069717 4130135 4304735 4288404 4287439 4294177 4415277 4435477 4356733 4358337 4268024 4261080
17929 4261080 3989315 3723134 3708714 3617036 3681514 3719226 3747718 3738356 3636653 3512570 3489128
17918 3489128 3432890 3444389 3471424 3662853 3834167 3819735 4025299 4320127 4538637 4870293
17908 4870293 5004020 5191448 5544921 5688000 5695346 5499725 5289995 5218912 5328964 5654635
17898 5654635 6174896 6801282 7501517 8177557 8503260 8375280 7695674 6937127 6190212
17889 6190212 5718007 5461571 5388423 5389509 5288599 5291228 5447998 5780252 6256974 6758566
17879 6758566 7175388 7391516 7468613 7492421 7273000 6727826 6210705 5941801 5668775 5595521
17869 5595521 5677862 5864878 5947111 6222512 6642868 7009356 7271744 7664621 7945847 8024741
17859 8024741 8021567 8123375 8318127 8390037 8527595 8707942 8995472 9265831 9299794 9123884
17849 9123884 8813211 8515390 8235467 7796377 7504238 7285636 7176978 6961943 6947033 6985677
17839 6985677 6897700 6848618 6747836 6699302 6717176 6562882 6480338 6345502 5965837 5723193
17829 5723193 5525961 5347300 5311967 5452740 5539114 5428548 5182192 4909029 4782263 4590236
17819 4590236 4385641 4129831 3744720 3503534 3341977 3364608 3476895 3539163 3501054 3493683
17809 3493683 3462899 3486361 3533427 3579401 3504142 3418042 3465333 3657666 3869911 4093214 4243966
17798 4243966 4415801 4438527 4170146 3812270 3575204 3376978 3290893 3169766 3069294 3058072
17788 3058072 3029584 3034445 2995358 2985849 2948339 2920665 2976162 2976761 2907476 2948830 2877549 2577278
17776 2577278 2381785 2224233 2171974 2200987 2231454 2303958 2369502 2461162 2636014 2986143
17766 2986143 3263770 3553394 3946435 4307836 4496230 4270520 3924373 3592072 3271415
17757 3271415 2981149 2755762 2632747 2555924 2536058 2411357 2428003 2517545 2514687 2427629 2233591
17746 2233591 1947570 1845624 1758296 1759012 1833407 1869346 1788929 1658613 1648392 1590641 1444298
17735 1444298 1321943 1269942 1094499 1258729 1372521 1363502 1246162 1108340 986046 1155212
17725 1155212 1372517 1528655 1614352 1559258 1509091 1550913 1485061 1507805 1483640 1441253 1535050
17714 1535050 1640222 1781353 1826541 1911269 2135068 2373237 2577039 2723749 2517741 2200504
17704 2200504 1746851 1387287 1166148 1094876 1071496 952807 856458 817979 908560 896811
17694 896811 931803 847997 929921 1108481 1097721 1052862 997817 1005610 1079000 962011 1053711
17683 1053711 974600 809323 853358 900941 896194 891420 829671 800810 781082 785839 796264 803174
17671 803174 632899 473984 523767 740958 842561 766218 752896 860856 740675 664511
17661 664511 872192 886066 733501 780164 794083 681608 598093 578207 724064 704301 562338
17650 562338 510189 609893 617100 710515 724266 608954 601830 564070 592466 591077 648053 605084
17638 605084 634330 655105 677862 740708 667415 449963 287387 285573 369294 321263 319367
17627 319367 464687 635943 538696 366370 409951 437689 480723 370884 302851 283137 286612
17616 286612 341287 491359 680507 722854 769104 819784 862220 1066025 1156502 1316692 1530222
17605 1530222 1719001 1767550 1725874 1791439 1711191 1663208 1601096 1299711 1042770 834820
17595 834820 641752 555137 490503 437867 535982 583582 680471 755064 590015 588948 682041
17584 682041 770812 916007 815497 679965 727868 846462 824144 760978 868403 1029980
17574 1029980 1202015 1329124 1565424 1888878 2027038 2003248 1768716 1696748 1793158 1629941
17564 1629941 1511722 1168848 829194 566110 350501 329076 409754 489255 429556 403550
17554 403550 560201 605755 523205 399238 333677 262494 313754 462630 516224 555937 531482
17543 531482 486877 478538 589395 557482 503195 423831 443706 439940 422348 386191 320571 365519
17531 365519 303607 313944 265897 205983 173360 103289 145645 297673 340582 299410 348238
17520 348238 380154 237328 132346 111126 203716 208000 143602 237255 303246 368230 342896
17509 342896 75004 36682 134658 125945 126601 149594 86312 107201 298514 430132 395606
17498 395606 403482 436877 464636 452933 461744 493655 493856 390360 239474 199897 105876 135733
17486 135733 153788 109680 98305 112871 226673 349295 431345 340795 218835 257999 225967
17475 225967 210788 204866 218418 223977 196804 244811 228614 77857 -37669 56833 -10991
17464 -10991 26645 63766 100379 92148 1463 35440 249483 341091 285832 335973 441557
17453 441557 402105 326206 404671 435820 427668 491891 595245 648593 498525 593047 906046
17442 906046 1190813 1528184 1491912 1203885 793337 403487 296570 310046 293624 194571
17432 194571 198514 239376 400603 510133 513328 404827 280866 119180 -5042 -47538 147944
17421 147944 278328 263614 275658 165768 55797 182001 258190 212726 238950 193348 185134
17410 185134 109542 26516 58464 172616 108112 -2777 -56746 116781 99647 7889 20103
17399 20103 98690 157279 295816 261989 165997 157573 204608 363900 307850 147797 147630 49168
17387 49168 -83722 -5915 76568 173285 178514 136166 186739 105182 146082 223904 345771
17376 345771 327169 233996 224886 81710 -13092 25777 -495 54756 207896 240282 280140
17365 280140 65228 28340 49826 -47652 -109897 10572 123537 5873 59062 159219
17355 159219 181263 55884 -4054 -2163 -18131 63688 63431 200072 309527 226111 154843
17344 154843 213308 268504 320701 248755 129226 114151 289739 394687 470180 574359 567417
17333 567417 749625 951542 1115901 1196192 1202439 1219279 1123457 1063022 1166115 1055709 762176
17322 762176 520784 526429 595922 650163 632149 521922 482445 570640 654531 914988 1259413
17311 1259413 1320858 1411622 1363303 1325271 1299801 1155217 1114409 1168720 1002735 703795 466310
17300 466310 338017 351957 349899 354310 325179 286330 171641 181723 133060 149429 205424
17289 205424 198032 278303 234118 207740 155388 112168 122224 133673 204844 307506 273097
17278 273097 413751 304965 115844 17193 -54576 50312 243269 120050 35922 44319
17268 44319 -24694 35485 153499 135909 97889 67704 -83818 -100512 -143055 -15179 158783
17257 158783 283977 232581 258305 195234 80674 -58565 -200685 -194450 -8007 161232
17247 161232 99167 -78515 -81645 -99735 -44365 8095 72922 -53433 -153091 -27673 -112544
17236 -112544 -71998 -76892 -234287 -236916 -125525 -19890 -144552 -226077 -206471 -131438 -122811
17225 -122811 -126674 -100717 -100280 -46165 59573 27740 49685 104675 92660 121508 147145 172435
17213 172435 64673 -119825 -163238 -107944 18677 -17369 1128 116559 9002 -56752
17203 -56752 -5351 -100610 -138459 16016 22413 36052 -3685 -10808 -151903 -184537 -102719 -74050
17191 -74050 -13392 98162 56132 3223 85654 166921 137082 102480 116362 31184 27160 -45184
17179 -45184 -69654 -41215 73107 8154 -89136 -143801 99068 135523 48435 -30536 -132575
17168 -132575 -77031 -196417 -13552 126515 15252 1808 78065 163168 171807 42680 -60619
17157 -60619 53275 79996 90025 108368 159873 142334 41939 118475 61655 -82047 -101048
17146 -101048 20306 -58635 -170192 -234907 -269206 -396162 -370136 -339450 -314603 -207733 -124488
17135 -124488 -50714 -142878 -188394 -124014 92279 104295 15355 -6584 -80581 -127563 -153018
17124 -153018 -35982 -72827 -105496 -123540 -182507 -145155 -18718 6192 9598 -56662 -73948
17113 -73948 12718 124179 154951 116698 57661 -23295 15684 29178 15868 121687 127379
17102 127379 190026 25728 -11094 -119663 -167601 -143953 -50846 20955 143974 78261 -72181
17091 -72181 -81602 -131794 -34630 52755 119745 236151 310822 251909 212138 81806 99180
17080 99180 246389 202892 60252 -94086 -70710 44235 75023 309393 300706 119392 32359
17069 32359 44998 64609 15487 9277 73417 32698 12405 -24677 -34693 -35225 -44486 119462
17057 119462 115699 125868 75067 -16970 -41972 -24458 -45988 51141 172620 261713 100903
17046 100903 -53873 -15146 29113 178678 288703 218620 194940 104107 105356 55072 41967
17035 41967 135669 130700 126616 73196 45535 162457 168802 82153 71667 202039 210656 190506
17023 190506 206349 272689 180488 135918 138518 103936 16326 -87747 -142845 -199049 -112976
17012 -112976 -61153 -45828 -35619 -75435 -85251 22702 100549 -57785 -214779 -209127 -94694
17001 -94694 -35940 -10476 -35648 -65450 -117096 52168 85493 -16602 -135007 -228643 -170425
16990 -170425 43112 89174 125178 189863 241883 70110 56279 101182 131765 67823 130847
16979 130847 31229 -73957 -101965 24362 -16761 -39140 27934 -112213 -108233 -101481 -71683
16968 -71683 56257 -20969 -40409 112709 125513 181437 260181 280615 220964 160345 -18453
16957 -18453 -56130 -254001 -351632 -373576 -273070 -214305 -197775 -219580 -189220 -250246 -305287
16946 -305287 -141339 -226711 -198391 -227439 -228114 -67115 115760 93247 -56312 -31123 -68993
16935 -68993 -132707 -107430 -87675 -155016 -169307 -209392 -190413 -44388 71505 115072 14436
16924 14436 -47286 -52708 8924 88935 60849 -24999 584 125397 115650 28585 24633 66723
16912 66723 104491 234726 233786 263232 298679 324201 351845 436118 635625 648473 781917
16901 781917 804076 807976 970329 1180651 1124049 940444 759936 701890 748565 727171 766927
16890 766927 676555 675550 785247 794681 919023 1063940 960063 766136 689834 741393 891225
16879 891225 854631 810412 754794 714770 697279 727108 609894 546901 712223 674427 570579
16868 570579 607250 754538 858119 982717 966144 698210 386813 338842 297307 236551
16858 236551 275560 227613 241215 245403 168881 106383 120609 97519 208104 225531 191200
16847 191200 210252 164587 209166 273826 115963 18918 104243 147935 116803 49497 102902
16836 102902 24694 53060 95448 250927 305724 256473 259361 229938 139923 100302 119567
16825 119567 119780 148938 82158 109298 8752 -48908 13819 66078 60018 23210 16004 -38144
16813 -38144 -157432 -4612 -19371 -65447 -32379 -29229 -3342 85798 239288 194614 215458
16802 215458 222042 241596 252009 200843 154527 115884 128338 153192 100254 70289 70647 76186
16790 76186 24094 51987 148890 236414 373946 353136 333913 307727 267903 255256 358740
16779 358740 403119 356032 355221 273370 230279 177712 83407 -69177 -51778 -56321 -5318 -66246
16767 -66246 -50242 -41999 105521 198176 175113 56432 32367 -14205 22942 92133 49585
16756 49585 45170 73466 107937 81739 59531 -1516 -45080 -26124 -177115 -132244 -33503 21237
16744 21237 20677 -22214 29478 36666 -113084 -76221 94603 57192 15016 55244 103656 11121
16732 11121 -134586 -216634 -102098 -112405 -122361 -154824 -174653 -79145 140694 231685 239284
16721 239284 240978 45153 -86440 -47336 -37680 29388 88074 16195 -12293 83517 121615
16710 121615 54820 -14029 -62327 18161 -898 -96598 -175884 -96937 -177891 -213496 -127301
16699 -127301 -120985 -135955 -157244 -88892 14257 40405 -53677 -139234 -56210 17537 68538
16688 68538 19341 55723 118430 133937 138173 97623 99599 196193 226792 89838 140870 93488
16676 93488 -29936 -75867 -51086 56192 24840 -144530 -86466 -69318 -223093 -209984 -229515
16665 -229515 -155612 51173 152577 229650 141956 84596 44934 4282 -20736 -19791 46696
16654 46696 -20972 -57617 -65491 -68378 -37315 -88789 -91555 -19072 -82868 13522 84921 -26190
16642 -26190 -163474 -51422 -46715 11254 -38884 127019 245192 181354 158136 78442 77353
16631 77353 123291 176679 105142 83877 62084 -100645 -41191 -15923 -155702 -93732 -16162
16620 -16162 22380 47112 54028 12639 -59127 -55654 -9385 -82394 -12471 107555 170251 164759
16608 164759 132165 75632 -161818 -245516 -156520 -216461 -152308 -96301 -106232 -48947 51045
16597 51045 93644 115338 43915 -27236 -91268 -124930 -29649 35556 -15870 -22842 -91283 -136197
16585 -136197 -111911 -6749 -57394 -135966 -60978 -77646 -33604 46143 1735 -23762 -5184
16574 -5184 -27303 -181350 -292255 -221929 -213265 -286316 -295606 -206725 -27177 10754 -57845 -65405
16562 -65405 -46692 -61049 -163105 -223736 -183843 -31621 104039 127539 -7706 -43441 -19975
16551 -19975 115105 51592 -31929 -72254 -97425 -266194 -196795 -274462 -232627 -214417 -176207
16540 -176207 -19753 102059 49714 -132715 -187171 -156532 -107454 -50150 178557 265049 207040
16529 207040 145987 73642 79868 29092 105200 60677 31354 29956 47006 -46670 -75155 -89246
16517 -89246 -33815 -18478 -45996 -19414 -91448 -120751 -151106 -268026 -264844 -222538 -185762 -122397
16505 -122397 -85144 -59371 -14062 69487 112711 -24963 -71199 -41704 -120184 -135443 -264688
16494 -264688 -296851 -202793 -198029 -246581 -323258 -119529 -120796 -78571 80060 20568 -10289
16483 -10289 -11237 -157978 -149836 -145244 -146455 -113546 -80597 -81669 -103232 -49747 131389 98368
16471 98368 38085 -161662 -238149 -128500 -58846 -36730 -78210 -176796 -258072 -295144 -319177
16460 -319177 -373063 -398119 -268096 -199883 -129217 -172387 -288084 -340695 -223865 -194681 -26394
16449 -26394 63392 104966 -32825 -231082 -234712 -38360 58077 -47722 -2881 69759 59872
16438 59872 -29123 -90124 -150015 -73359 30723 174333 201925 161804 24248 -210503 -207167
16427 -207167 -273686 -324101 -163539 -101196 55060 187934 66250 -37372 10759 89032
16417 89032 139263 161338 8609 -90638 23625 158496 43790 -1934 12751 -88329 -19229
16406 -19229 24758 21181 70795 64930 185181 191933 203559 176313 140546 190038 299965 140466
16394 140466 -17665 103807 239216 309519 347791 263533 33846 -72877 -115716 -127687
16384 -127687 -152120 -240991 -324565 -248084 -137017 -67608 -53046 8591 -47977 -81399 -53375
16373 -53375 -18145 21389 43618 80919 91081 82418 125510 82031 66114 70938 -61885 3154
16361 3154 120124 44189 -91697 -73092 -64703 -79903 -121346 -113801 -59320 -96594 -149765 -56476
16349 -56476 2061 -104093 -45852 101987 243303 -4696 -272717 -259764 -254865 -355724 -313198
16338 -313198 -261039 -151891 -22960 93 -130497 -269182 -218540 42041 291980 279447
16328 279447 222432 914 -153876 -277659 -270122 -248523 -150517 -71325 42584 127418 178116
16317 178116 92945 6876 -6187 5935 -94291 -21125 21976 114048 118090 185971 283076
16306 283076 196982 60422 55502 26563 -195212 -267721 -264954 -295277 -152009 -16143 -110923
16295 -110923 -122191 21890 148233 98729 68195 87245 143088 202261 105053 42512 80338
16284 80338 195765 201731 117386 -69212 -118882 -61536 -286022 -229087 -289713 -364082 -454150
16273 -454150 -342050 -239326 -314101 -259149 -184859 -159829 -41579 25106 -71706 -159661 -137991
16262 -137991 -6235 96565 56867 56709 -56534 -17366 47608 -2347 -125289 -226406 -264353
16251 -264353 -255810 -218124 -197426 -201051 -108572 -123246 -182748 -221245 -192643 -264477 -221787 -145970
16239 -145970 77920 105550 23756 27052 23444 137306 139137 129716 162339 112460 -4773 17450
16227 17450 20681 -19795 15534 48587 142425 132610 54562 -7791 -80719 -42072 -60237 -208474
16215 -208474 -142614 -92004 -131487 -229372 -226052 -158207 -14350 -31134 87330 136417 -101951
16204 -101951 -195650 -174320 47489 182144 158237 60897 -25849 5170 127481 44547 -63379
16193 -63379 -157546 -195736 -191695 -131790 -139531 -181803 -128898 -116508 -119717 -33611 -63060 -158760
16181 -158760 -308117 -302705 -247811 -178891 -151622 -167336 -221793 -257231 -212448 -259802 -320114
16170 -320114 -320259 -398037 -275134 -41516 -32501 -31760 -124225 -140006 -116042 -92614 -112296 -157903
16158 -157903 -74985 -37800 -95012 -33538 16071 -1121 118610 202187 265968 229793 185589
16147 185589 146396 68256 -2142 -14160 102376 257827 179631 84295 -69318 -149363 -205112
16136 -205112 -74926 48857 40195 -31385 -31969 -7149 -6098 -120182 -110106 -81985 -80868 -97991
16124 -97991 -69045 -11365 53553 9980 -85232 -166740 -116983 -57314 -32136 -51533 -179284
16113 -179284 -107585 -25224 -54608 38561 6291 -100620 -126641 -86617 -80239 -66506 18658
16102 18658 -75722 -38790 -26518 -23405 -83397 -168002 -124019 -27679 34603 -63545 34159 120897
16090 120897 158045 56232 101144 100487 49279 -52355 93865 -3022 -154593 -123939 -33291
16079 -33291 87047 48432 -73443 -129076 -147606 -222513 -291990 -230626 -150738 -120829 -128376
16068 -128376 21035 126456 732 71359 4718 -186458 -270703 -199722 -49447 -13136
16058 -13136 -45649 -39763 -109220 3606 79350 41514 79350 50118 -46528 -89448 -99064 -20895
16046 -20895 11020 81817 69285 -171 -110528 -170360 -148432 -126215 -116159 -178039 -163176
16035 -163176 -194925 -282357 -210360 -79667 33996 123544 131554 61745 -83032 -116679 -103260
16024 -103260 1706 57458 46246 37410 -15430 -115771 -216297 -369856 -300939 -54146 163377
16013 163377 139599 132582 204502 292446 228036 100781 -726 9267 -50317 7012 4417 -64568
16001 -64568 -41761 -24442 8533 -43419 -140852 -247008 -174698 -107163 -128997 -182792 -86466
15990 -86466 -135922 -236121 -145070 4683 97576 46758 67263 -29916 -193356 -262364 -25479
15979 -25479 180066 90585 43339 39322 -49306 -145297 -139232 -177199 -286784 -256022 -147176
15968 -147176 -229136 -168982 -121215 -117352 -86820 -28204 -31486 -93107 -151563 -239478 -108436 -379
15956 -379 18231 13151 -81048 -131790 9772 73491 -13893 -24243 -149471 -141475 -25909 -8314
15944 -8314 -61483 -45916 -22888 -8119 -53207 -64378 20260 -8074 20376 -114945 -187239 -190110
15932 -190110 -244547 -243156 -209367 -86536 -19259 -24337 -36846 -75111 -125054 -152022 -131102 -160546
15920 -160546 -44661 84383 88282 61294 -19966 -19024 -79991 -2907 67464 34638 66047 42120
15908 42120 15373 -57165 -181015 -147901 -159999 -119034 -159293 -100115 -83440 -112457 -149858
15897 -149858 -48226 53267 84276 42204 107017 257468 213043 8658 -70844 -19347 -3841
15886 -3841 40483 98968 86706 20600 34150 45510 129064 179676 214122 357784 269725 140347
15874 140347 170576 98618 71885 162626 173413 216701 219831 212148 344223 338034 189914 111326
15862 111326 67841 -5609 91427 69315 -116321 -144000 -81735 26055 147494 171008 170529
15851 170529 69386 148361 147248 149713 137359 94891 24556 75185 40777 23608 98718 139711
15839 139711 66719 185068 269945 154996 -37444 -104713 -58933 70217 129851 121063 103809
15828 103809 18257 6034 -53035 -176331 -102924 -7495 -18125 -4812 20033 53870 162301
15817 162301 289973 194555 -9496 -187119 -211235 -16337 114315 66566 108901 163617
15807 163617 98858 58021 -43661 -70823 -23183 -97209 -90240 -109271 -93802 47929 -36945
15796 -36945 -55493 19499 51704 132714 183544 132337 66833 113458 128134 38974 37039 -13676
15784 -13676 -108764 -106323 -106319 -51399 -107572 -136786 -25116 224848 162220 10378 -156530 -269787
15772 -269787 -238543 -111235 -94728 -28137 10937 -25705 -95582 -117347 -101469 -27079 79579
15761 79579 174565 225033 291332 291966 163163 65468 116151 8031 -101124 -133682 -65150
15750 -65150 35444 12494 97696 124935 13280 -152513 -197674 -157892 -27796 70960 71206
15739 71206 -69340 -53061 21507 85869 17829 22277 69627 75827 111942 117930 7500 -66690
15727 -66690 -44570 -38159 55905 111117 96666 14108 83197 127005 9781 -105446 -30199
15716 -30199 -40852 -144842 -225248 -75297 20900 28701 46494 166591 126216 96174 145714
15705 145714 109798 190539 357217 334044 179570 169447 344594 358026 397833 351448 298766
15694 298766 145309 -21942 -10156 28861 -39267 -25432 101386 24292 -138610 -125708 -11037
15683 -11037 124633 124375 157255 157919 126515 -23590 -29788 -34483 -97633 -81985 -62597 -140765
15671 -140765 -59531 -32913 680 16008 -116290 -117377 -106464 -242008 -377824 -433048 -229432
15660 -229432 -48519 33858 8699 -115811 -112140 -168225 -147292 -122045 -43741 -51596 -105750
15649 -105750 -76748 -93128 -32676 53340 -7361 22652 -16915 -15475 -59561 47413 27817
15638 27817 -130126 -126540 -113777 -131269 -74225 -6860 19888 55608 -21300 -176105 -249186
15627 -249186 -33665 129655 115279 216066 205364 216222 272318 393853 344027 219645
15617 219645 28549 -44658 18814 88704 57892 62549 124793 71635 39737 -13714 -50695
15606 -50695 14702 118301 171130 262657 207580 131934 90187 71770 -16173 -98729 -18819
15595 -18819 91863 155702 81810 39058 -38232 -75795 -838 67399 176343 100053 -60977
15584 -60977 -145977 -70967 -22079 -165157 -138346 49784 142405 178143 182099 137214 163877
15573 163877 133828 21470 -8776 723 134659 94779 146665 119967 167981 221735 269106
15562 269106 246152 232680 196700 66228 82322 73502 -18707 -39238 -2437 83759 192521
15551 192521 231484 257582 206003 153246 310197 453826 437484 285663 276539 255567 183459
15540 183459 133169 90670 53629 -12029 -178011 -180825 -108180 1158 8036 -2081 53159
15529 53159 35783 -63751 -8417 88101 136064 237970 265069 212950 427628 397384 294619
15518 294619 292083 327648 453112 538032 430709 401430 322919 222227 161298 86650 1870
15507 1870 -49723 -13230 101677 191802 157506 117106 43328 -38279 -120185 -166788 -19117
15496 -19117 -1549 -38782 -75145 98246 244911 251184 299118 154737 -57855 -173359 -101367
15485 -101367 -33201 -114648 -59563 72554 78863 77998 202242 90016 124140 234520 308758
15474 308758 233186 316820 357214 297117 298302 153834 180274 336624 313926 287198 209594
15463 209594 284706 340332 397075 370788 327974 345830 311770 277221 195681 363686 322503
15452 322503 192656 155953 129015 133504 170497 34436 4719 33060 101929 241843 93827
15441 93827 -32913 20011 197982 249494 81175 70105 12585 58894 28938 -14148 104808
15430 104808 212502 228125 152848 -106838 -296552 -351327 -410300 -442652 -366274 -207303 -123413
15419 -123413 -125283 -120896 -119757 -125404 -20189 68666 190857 125380 71443 -28274 -60586 -105448
15407 -105448 -246350 -130588 -21468 -96170 -52925 96750 191739 57792 -93470 -83330
15397 -83330 -11483 80689 117105 25509 121328 208625 184822 37855 38437 -923 -84354 -108039
15385 -108039 -145249 -95106 -184654 -234819 -195713 -182104 -179767 -161025 -11388 -35257 -46804
15374 -46804 33092 111548 -87095 -146780 -81526 52149 20513 -94907 -225256 -99523 -98419
15363 -98419 -180703 -192311 -172013 -41705 31778 32637 1428 12856 39689 8749 11493 27186
15351 27186 131652 96954 132302 52341 8643 61349 65392 -68394 -59771 -50513 -175206 -224674
15339 -224674 -242435 -309151 -288466 -219780 -204193 -164120 -201173 -191392 -140869 -149674 -50940 -59758
15327 -59758 -59627 -48025 -122944 -91802 -69907 -82731 -172035 -106697 -79427 -136364 -187259 -128156
15315 -128156 -173856 -149876 -47383 -36363 -129200 -103606 16983 -77782 -64406 10671 -99654
15304 -99654 -174635 -123587 3853 57876 121150 16618 -86778 -103222 -240007 -377628 -293616
15293 -293616 -136833 -87352 -105250 -20198 -7374 -47878 93888 22832 -165510 -77914 142791
15282 142791 110244 142147 21706 -101557 -53637 69857 202162 191276 -19743 -88721
15272 -88721 -102132 -47336 51351 -16616 -27482 -52398 4234 59964 111258 202756 217226 103324
15260 103324 9893 -7825 24158 18350 -61321 -65905 -77635 -128075 -236251 -284681 -47111
15249 -47111 158935 143431 96095 21537 -95212 -230918 -100847 -37224 9767 -110829 -144979
15238 -144979 -146291 -128035 -33284 -78406 -71632 116177 48641 -119141 -287932 -311028 -359235
15227 -359235 -317395 -235703 -163599 -115309 -134972 -201405 -118838 7191 50128 -100910 -86332
15216 -86332 40575 52148 46153 3992 -46507 3944 -771 -22882 18484 -32615 -142487 -166293
15204 -166293 -67240 -115475 -159677 -121876 -184666 -263954 -299928 -242146 -59622 111187 205618
15193 205618 174054 -37746 -26068 -76965 -67655 15690 93850 70919 86811 -46370 -135657
15182 -135657 -98513 -133311 -140307 -106654 3572 4075 -83296 -155226 -136260 -126216 -64840 -22934
15170 -22934 71672 66705 122225 134925 138151 199333 289148 245223 94917 -29958 -2718 57669
15158 57669 182515 317131 347478 209605 150843 35921 -30687 -11284 -130982 -234159
15148 -234159 -278141 -263548 -201657 -25508 145041 112372 -10529 -126595 -85330 115655
15138 115655 194594 165820 76473 149348 179022 171822 232631 144904 113740 132185 258951
15127 258951 164795 -63647 -54479 -100420 -160171 -112745 -142566 -199101 -108826 -92910 -62803
15116 -62803 -60957 26817 67980 88464 -55445 -60297 -115653 -112555 -255942 -194759 7501 49605
15104 49605 -25677 -129945 -224270 -141385 -65272 -136602 -34521 137386 77347 -43677 -53854
15093 -53854 -70576 -53368 32891 52525 57529 182296 116139 116069 84093 34164 5934 178423
15081 178423 188042 33939 -51670 -63692 51763 222393 163849 229177 301196 366501 413622
15070 413622 468287 638026 728136 698997 744789 608536 498231 515027 470752 336989 285488
15059 285488 208879 106900 -54494 -87413 -10382 63258 57633 -10309 -126988 -95557 -59188
15048 -59188 23151 60923 -17095 -76718 -158287 -115415 62367 190012 173110 62590 -12679
15037 -12679 2332 150842 214022 222864 237847 182139 157023 111083 72250 20494 -66214 -135611
15025 -135611 -56024 -160945 -199668 -38329 20940 -14666 -92020 2676 66441 32235 -17603
15014 -17603 -148929 -113159 -42649 44852 156357 137646 43115 102703 134415 166777 -18048
15003 -18048 -62109 30690 20605 -59062 -46989 61046 113380 152865 51608 10295 4839
14992 4839 9911 -152096 -229650 -195571 -169803 -79376 -84116 -184299 -164047 -205405 -185324 -168386
14980 -168386 -91251 -161460 -151577 -101214 -7124 145894 225830 162266 95679 47485 -5998
14969 -5998 -114327 -84671 -179413 -196456 -230670 -264056 -129108 -306164 -390165 -233871 -84421
14958 -84421 -90270 -48555 107191 150876 125712 215474 115464 -70854 -94918 -65852 37948
14947 37948 132055 107827 142906 188871 187287 187207 202314 117771 109400 17644 -11036 50530 107635
14934 107635 168082 238706 181732 94375 121369 201675 75636 56303 6761 -18584 -95457
14923 -95457 -70059 -95767 -40451 40258 70991 149172 93940 84771 105407 -38283 -175639
14912 -175639 -235152 -122031 -47568 -96609 -164209 6240 18222 -118882 -142764 -24300 22085
14901 22085 20354 -89305 -86520 -45256 -65848 -173957 -114688 -140447 -45265 18917 68760 162348
14889 162348 183730 154017 73819 -64924 -116066 -289233 -406949 -312717 -140324 -41944 -54319
14878 -54319 -28353 -12390 -222222 -393865 -340727 -69182 92372 123378 102541 32047 51800
14867 51800 92878 42869 -109306 -136330 -167294 -156661 -143921 -195920 -140172 -145678 -290109
14856 -290109 -296223 -289957 -213863 -60422 -81952 -126741 -168208 -287794 -335901 -189678 -156230
14845 -156230 10572 45845 -54584 9290 -36495 -127970 -66152 -185386 -355871 -416311 -387020
14834 -387020 -342354 -295149 -247547 -253178 -244784 -180937 -46159 -63160 -47556 1141 85095 59330
14822 59330 -10644 69548 69700 51588 90229 -61373 -155954 -139347 -133125 -117365 -199484 -73328
14810 -73328 91663 22209 -153196 -133741 -38527 -24487 43317 132787 154038 151634 122402
14799 122402 217715 153988 -29519 -178723 -230930 -227499 -239052 -117620 7725 -126717 -234400
14788 -234400 -186133 -119671 -123635 -153064 -227278 -242395 -242939 -112098 -32220 -125017 -142356 -85526
14776 -85526 -59812 40947 -7235 -78871 -256974 -163078 45365 245142 103698 62908 -13451
14765 -13451 -4278 -47740 7265 -23431 -110970 -80584 -72459 -33846 100470 155867 45539 -27857
14753 -27857 -35602 147 -57332 -118892 -151223 -58459 29737 -128702 -271984 -256296 -111485
14742 -111485 -109063 -68046 -140838 -122720 -112745 -57407 43239 -67997 6094 102380 19776
14731 19776 -50451 -127682 -106920 -121928 -121068 31930 253747 170305 62411 53884 -20308 -47823
14719 -47823 108759 189907 226813 76321 12702 -30619 -46826 -9996 -45584 -65251 27812
14708 27812 129770 235579 283822 115383 53596 -52364 -133821 -89517 -23779 -3339 -65300
14697 -65300 -61429 -131386 -128706 -148577 -201929 -257587 -81564 92004 143315 70550 168307 165898
14685 165898 9340 -42797 -9336 26464 -37000 -103865 -281983 -261426 -129293 -92697 -142906
14674 -142906 -101460 20915 54408 1762 -63660 -5870 71558 118334 83886 -16904 -5715
14663 -5715 67884 34849 -69648 -15853 60606 -846 -32312 -154016 -291554 -152484 -62300
14652 -62300 -67327 -176301 -52592 -69962 -264015 -312460 -322911 -254444 -204984 -387218 -497518
14641 -497518 -457024 -404611 -334043 -291924 -198030 -66052 -23435 -105299 -192794 -269047 -228722
14630 -228722 -345144 -363403 -241574 -286518 -284038 -185180 -174213 -100486 -33167 -28068 -113029
14619 -113029 -321918 -238264 -91689 -133289 -43905 32184 188348 169021 142653 119838 126762
14608 126762 129498 113495 -3092 -105512 -179905 -13532 76267 -53838 20090 101650 87884
14597 87884 78771 69375 79371 53858 80143 102976 78553 105279 10408 56967 72161 21336
14585 21336 14331 -33678 -136341 -204857 -175384 -144230 -119254 -128611 -61754 -77988 -180060 -168485
14573 -168485 -118625 -122328 -128157 -138164 -93167 -201685 -379961 -531719 -472751 -367239 -193955
14562 -193955 -134363 -170420 -258305 -285090 -256980 -196387 -89600 20441 166491 94576 -114556
14551 -114556 -126459 693 -4625 -140098 -151257 -31634 66840 18652 -168190 -238481 -187140
14540 -187140 -199190 -171680 -260734 -318310 -213551 -167492 -264835 -242976 -175899 -146559 -129678
14529 -129678 -89003 -122929 -173507 -94551 -132662 -228909 -323140 -236927 -198378 -303146 -362109
14518 -362109 -326743 -202763 -110191 45245 73414 -22961 -116212 -133748 -123091 23182 36971
14507 36971 9494 -38502 -100372 -186103 -225056 -142465 -172989 53209 229755 285627 182872
14496 182872 150709 -72975 -90692 8105 -13650 72650 7695 -32534 -47575 28200 -109515
14485 -109515 -292904 -325378 -325525 -160477 -18414 -10783 -34888 -132305 -233729 -112959 -107421
14474 -107421 -119329 -130312 -185991 -200058 -180972 -160305 -102597 -83347 39409 92392 149260
14463 149260 190480 238062 36266 -175017 -94293 -126886 -136312 26445 42637 -62669 -67979
14452 -67979 -5177 -48565 -15184 -56982 -43860 -116527 -203860 -231374 -71912 8682 -15534
14441 -15534 89479 124119 5787 -93318 -40096 -34691 -65802 -99854 -235883 -104836 -59859
14430 -59859 -138092 -126817 -141541 -132567 -68654 64009 17883 -25199 -49201 -77820 -55670 -87184
14418 -87184 -247876 -216771 69273 160447 170430 106414 128229 -29211 -112867 3460 -43774
14407 -43774 4393 12072 -132682 -122761 -132570 -204983 -111080 -57534 -37075 104468 83203 74592
14395 74592 119744 224078 119774 -59329 -166336 -160853 -30031 -1587 -54438 -18650 44680
14384 44680 52689 24106 -87034 -163564 -138322 -117094 -220623 -249499 -154198 -88469 100702
14373 100702 152574 9341 -91077 -79038 -179574 -132673 -38072 -48017 -89655 -35520 -44513
14362 -44513 -44829 12363 -22198 -100703 -42712 26853 109234 92859 -8760 -130615 -48022 75560
14350 75560 -206 -108924 -52565 -20664 -70002 -44765 -105887 -136244 -113287 -33762 -70862
14339 -70862 -4358 65345 188832 242276 202262 206320 241642 114706 15412 -47818 -70361
14328 -70361 -50845 95083 332627 331058 253904 -14311 -144572 -173914 -149478 -125833 -203235
14317 -203235 -237470 -175323 -301113 -232397 -132173 -169727 -205941 -117213 -52329 15415 83925
14306 83925 102829 34791 104162 220842 134073 274 37590 68328 46711 82375 843
14295 843 -75131 -37858 -34264 24076 -1265 -38030 94955 118757 56525 41357 95342 116993
14283 116993 161506 192363 21730 -85176 -23184 48392 73430 18034 -51895 -147844 -128371
14272 -128371 -118377 -40363 109253 151015 -34683 -108625 -158228 -165006 -106718 3674 16909
14261 16909 7472 -73513 -35849 -101469 -95204 -75024 56456 195681 284284 130299 149409
14250 149409 33809 -84591 -127995 -61287 -5116 -28197 17869 8247 -58350 -166777 -130337
14239 -130337 -143090 -161818 -229660 -279222 -213026 -131136 444 11256 103520 44281 -72249
14228 -72249 -209949 -165827 -16858 54863 63041 -137905 -231555 -112036 -20301 -12314 -68254
14217 -68254 -162347 -190398 -263499 -292877 -225506 -160216 -150493 -112760 -225194 -289160 -188609
14206 -188609 -183223 -199733 -250644 -170348 -46562 -58049 39385 10062 -80061 -88742 23294
14195 23294 23033 -72917 -154458 -81213 -39969 -58352 -27927 75343 99965 217626 226664 137513
14183 137513 39072 -36039 -72644 -72207 -57847 -8779 55248 125186 -28861 -173255 -117258
14172 -117258 -112128 -147094 -110861 -3480 2501 -98025 -122375 -62776 -108437 -95238 -40843
14161 -40843 110219 156293 109493 94960 105102 116321 21855 -12811 21489 32132 55982
14150 55982 -71476 -260185 -261286 -69367 47616 135745 59195 -204374 -256381 -165474 -96567
14139 -96567 -28917 -33378 -14450 -42185 -122105 -60281 31903 -33264 -141664 -135790 -139789 -92744
14127 -92744 78844 155564 136052 65572 -9870 -123353 -26436 34877 -2773 -48294 -30516
14116 -30516 -73393 89730 212857 191685 129037 37071 137197 164748 77595 29965 102074
14105 102074 153183 173092 226665 150748 10903 78051 103013 50114 -16636 -39350 43536
14094 43536 224057 276815 54938 -68495 -98317 -117588 -99377 -79942 103705 175721 87121
14083 87121 28119 -46208 37383 63037 -3610 -146506 -240783 -171957 -136115 -30178 69650
14072 69650 -19547 23234 47472 -67267 -50671 53005 50575 41613 17638 -3757 -7947 -95112
14060 -95112 -151438 -165436 -27631 69388 -53807 -195228 -149050 -192042 -139222 -177909 -223564
14049 -223564 -215362 -210576 -169116 -117542 -3626 -13175 -103986 -114233 -89964 -16616 -25889 -84470
14037 -84470 -90758 -232235 -280513 -167869 -121738 -57667 67744 94585 2914 -64085 -103859
14026 -103859 12515 131556 10462 -91036 -139934 -177484 -24752 50104 203205 194921
14016 194921 38886 -197715 -102085 15011 100974 110190 141663 167318 70301 23496 -89412
14005 -89412 -173377 -98236 45123 65964 691 -41421 -57899 -110325 28932 155469 134171
13994 134171 146017 113009 5967 -29797 -9014 106567 199580 168782 135095 132724 163413
13983 163413 114680 105645 211266 186444 102431 -45598 -74250 -39576 -5052 -59880 -31522
13972 -31522 102510 225538 211313 51842 1198 -197214 -218079 -71183 37279 92300
13962 92300 255735 241492 167759 215258 283217 276935 185593 158306 42183 -4683 22808
13951 22808 76166 -30879 -52600 -47441 -139239 -182785 -176180 -182586 -73573 13568 30356 88207
13939 88207 188739 154043 5392 -196873 -255871 -180826 -258954 -288370 -234506 -127348 -51676
13928 -51676 -25886 14049 39273 -46017 -142735 -131320 -134133 -128655 -213607 -183034 -124686 -11703
13916 -11703 -72304 -147262 -275867 -249806 -203309 -303454 -114932 -35671 -135586 -107690 -49793
13905 -49793 -124568 -148935 -197058 -272391 -165854 -60724 -131276 -119340 -184877 -206234 -164127
13894 -164127 -171103 -286917 -322281 -247338 -181557 -150682 -60657 -42273 -257240 -263208 -128128
13883 -128128 -60514 70395 187857 101532 -56785 -297413 -358057 -225035 -238024 -217058
13873 -217058 -205459 -28471 85761 175758 92745 -31350 -200992 -218893 -236753 -98698
13863 -98698 15947 -84488 -116425 -77582 42509 103225 91145 152724 186912 106944 687
13852 687 76487 112228 159634 63794 70192 163044 133296 65595 15737 -141806 -89510 68849
13840 68849 140242 -50734 -153037 -44105 -182718 -227409 -218596 -113738 -170890 -36832 34968
13829 34968 -18889 -101659 -100185 -90491 -21125 -197607 -287120 -169133 21201 32978 49043
13818 49043 107504 53931 504 24818 65392 -38661 -107468 -136663 -122230 -13443 18530
13807 18530 33376 45478 -57658 -89632 -50202 -25698 70786 163126 93157 -3871 133527
13796 133527 223124 269720 320814 296028 235366 170993 43940 -74747 -189538 -133104 -24621
13785 -24621 -15863 41600 71646 98776 57254 -26751 -88888 -56084 -62832 -63119 -5925 59022
13773 59022 127055 84342 24316 10146 94760 20510 -62445 -49083 -72410 -83509 -20898 8733
13761 8733 -81838 -192967 -61456 71450 56613 -64813 -98308 -150219 -137517 -136928 -152541
13750 -152541 -252714 -271208 -11066 40700 -44354 -91709 -156396 -119688 83670 127675 59746
13739 59746 -3251 -61876 -121654 -219678 -272150 -145790 -11884 -57737 -176035 -127029 -81911
13728 -81911 -59704 -107813 -67993 -56437 -38075 -15500 -42728 -19180 63984 101122 5233 -187411
13716 -187411 -259514 -120994 -90740 -115219 -88007 -85289 -22058 -10451 -89763 -87527 -84760 -149627
13704 -149627 -200690 -196332 -157351 -246682 -208904 -200618 -205653 -115602 -16431 -60973 -68984 -53640
13692 -53640 -185141 -191852 -97353 -30977 -128776 -56891 -20787 -78498 -34610 23812 -41850 -32390
13680 -32390 -101391 -973 79656 92402 145922 204703 264691 62834 -140087 -179398 -336155
13669 -336155 -313580 -214080 2988 217382 226806 267265 233258 230025 157435 148437 244517 189056
13657 189056 96519 60652 25051 -60009 -106757 -108484 -96905 -123200 20652 80300 94957
13646 94957 26654 138381 121825 72278 82556 130679 -32893 -50663 -40866 -164139 -126798
13635 -126798 -105442 -8776 68220 82569 -20918 -54187 108432 137658 167686 63175 -54378
13624 -54378 32105 101121 68482 60555 121072 126617 -2642 71436 157988 227632 262115 103363
13612 103363 -2941 5056 -103518 -122649 -251900 -250367 -103381 -52000 27716 44308 -16992
13601 -16992 4021 -109317 -105882 -120146 -139682 -116460 -225031 -171368 -135910 -112135 -25403
13590 -25403 -37901 -38378 36000 14350 3459 -142154 -84561 -228515 -355807 -340361 -96727
13579 -96727 -39426 8588 -156937 -159060 -123218 -143030 -58998 157124 97889 -46643 -147502
13568 -147502 -174953 -136892 -149162 -177718 -197535 -107371 20311 -71352 -163254 -205399 -157368
13557 -157368 -97335 -45601 -87816 -68869 -52790 -38375 -69343 -155189 -326310 -280510 -163930
13546 -163930 -135447 -182976 -176160 -175969 -241218 -244941 -318820 -237191 -269375 -150552 -113647 -153592
13534 -153592 -131069 -35830 -56414 -129765 -105493 -15591 -711 79425 84637 41894 26951 65422
13522 65422 38921 -12917 -17280 -83492 -114028 -139773 -57619 -91865 -46136 225411 278928 145294
13510 145294 -6765 60524 158470 71744 -4572 28022 72915 36016 -26220 -5279 78875
13499 78875 86018 91614 2334 -569 -29309 51162 106925 24365 -91762 -118233 -85570 -41129
13487 -41129 -145881 -150324 -116199 -134206 -181268 -186614 -210233 -126664 -39567 54240 -35126 -205365
13475 -205365 -224014 -68740 -9441 -20094 -62006 -90480 -110702 -72195 -125438 -92233 -2674
13464 -2674 -66590 -119089 -21887 -90958 -98695 -57837 34401 19272 74732 16180 -49303 10893
13452 10893 163599 269572 278890 347146 254755 151898 126414 99026 86710 20820 -61096
13441 -61096 -219737 -247730 -327406 -195964 -158069 -97966 -13012 89452 179336 77750 -1675
13430 -1675 35367 -11809 41973 123713 40142 39469 92102 50741 -97188 -214841 -202620 -49433
13418 -49433 86499 116172 57886 29330 -35719 -57913 -114574 -129277 -134197 -284494 -229154
13407 -229154 -139209 -41459 -57217 -110300 -26025 73757 -14676 -151 81633 183984 181339
13396 181339 42227 -50950 29574 73104 101844 70864 133592 194616 279971 289611 133602
13385 133602 135328 165350 188879 391944 437309 301672 212663 51365 21932 119701 62049
13374 62049 -21537 -16155 12420 79157 112368 117961 87114 2010 -3665 14055 149287 235540
13362 235540 71061 14598 32093 158126 298486 260142 211832 179026 127847 14426 3219
13351 3219 89569 66377 124461 104800 33384 -8024 -12635 101814 144350 147312 201505 74859
13339 74859 -50855 6763 72595 92912 34289 24521 128621 131106 161480 166110 254607 176229
13327 176229 132695 145950 202737 241745 67043 -50810 69378 174900 148801 163288 160932
13316 160932 172964 260940 210680 234586 314936 314717 363480 564072 672470 589763 692624
13305 692624 689257 684796 567747 466704 467592 602212 529820 385039 358022 332280 154743
13294 154743 16447 53899 94412 79891 163098 255884 341615 177337 129508 77779 61455
13283 61455 30491 35525 148723 137490 107101 115694 130739 159540 204200 272403 260550 321662
13271 321662 297000 190873 117162 100192 57956 181828 247875 210208 294195 338837 287970
13260 287970 111957 168825 183127 232007 284941 237247 274107 365475 344128 340957 445317
13249 445317 484403 361266 466209 438334 276513 221328 235847 266238 314151 352647 481317
13238 481317 532177 416739 459931 465905 527265 634073 724160 732451 712225 592745 439782
13227 439782 380152 438312 460678 483696 553128 641912 711074 722598 663309 556270 514866
13216 514866 481188 595069 603973 569329 715736 693422 731272 758605 870921 907196 1017603
13205 1017603 1078378 1116439 1138818 999070 984330 974679 736802 664317 728292 668410 467317
13194 467317 535068 697729 730496 767173 809836 880859 964136 1116502 1278624 1428205 1454301
13183 1454301 1228863 1118078 1108897 1115408 1151501 1137812 1061657 1033718 984048 921802 760427
13172 760427 741453 745654 785354 782991 653736 681344 744078 764067 844263 918876 960053 1067731
13160 1067731 1089757 1046687 1164993 1294111 1178033 1115560 1015023 987587 925015 917118 861245
13149 861245 781557 899945 966598 1049348 1242784 1390766 1597954 1773464 1909081 1963886
13139 1963886 1912105 1741815 1559011 1493175 1408356 1249471 981285 791404 719540 726155
13129 726155 759295 845532 813111 765045 686449 618871 629917 591145 492931 567009 639825
13118 639825 671212 770395 836702 883663 1029018 1160506 1193512 1238321 1162724 1133157 941929
13107 941929 714299 562586 523889 559882 512075 432081 541523 653353 800871 928595
13097 928595 1016585 1205000 1289218 1237268 1272685 1360914 1481343 1503472 1271230 899123 671095
13086 671095 661334 647066 677534 753487 726745 671238 564488 462028 388995 317939 245727
13075 245727 155931 174596 334078 499155 506293 567418 479973 418656 467664 650568 673251
13064 673251 661790 506877 324793 354926 298707 260125 216256 236007 270405 398138 611107
13053 611107 696067 541176 468950 433592 348086 449833 534009 661596 636643 546683 466431
13042 466431 432654 346192 331421 336616 219634 292767 331937 342123 402599 361276 414156
13031 414156 511870 506461 339072 340736 372354 337587 191778 212250 139176 117208 220128
13020 220128 199386 213266 115987 51700 123621 186115 173226 159874 210482 274115 241775
13009 241775 162460 148161 159961 170193 139 -51221 30840 -19771 -101649 -16467 42295
12998 42295 12632 -34983 -19363 -98155 -29707 189205 77592 -134333 -143307 -64378 23688
12987 23688 41775 79160 8616 -15200 -42976 57670 139382 250902 92338 -35276 -109877
12976 -109877 -123829 -61087 64628 197680 194926 95402 -85359 -101633 56226 271980 328321
12965 328321 300797 90237 -74655 -65839 51125 118578 121921 85401 57719 57928 25924 -46523
12953 -46523 29649 -124836 -132436 -9634 -730 84361 128075 226374 253956 275513 172159
12942 172159 160425 173761 121193 47625 47295 7862 56884 89163 117251 192823 223192 211538
12930 211538 219120 157840 225435 181594 113464 2865 7981 23611 12366 91475 157955 145386
12918 145386 91695 107191 212790 178427 -27182 -97588 -56829 71609 128339 46329 -34971
12907 -34971 52950 -50144 -41182 393 150837 221749 215968 229026 49025 2819 76696
12896 76696 118233 221069 215379 243250 278516 234118 225556 64665 41555 60909 16256 12859
12884 12859 119959 82616 129274 257818 116500 155270 118165 192680 347107 406998 303104
12873 303104 212560 213449 183260 218975 209460 224072 300661 407872 494597 511419 509354 501742
12861 501742 500160 545499 595093 512668 550589 661192 712750 723063 479179 296652 282093
12850 282093 450900 462360 302479 98880 12135 183365 153600 65199 30111 -32074 108203
12839 108203 137748 176268 181295 -11906 11620 15560 198768 310905 343422 364200 370673
12828 370673 330615 392312 430899 395281 129840 203008 430585 483365 512230 584481 678901
12817 678901 782339 713396 678839 679320 697955 675210 528933 364702 263787 321781 422694
12806 422694 434071 440472 463507 477382 493844 482647 592437 742169 941071 1035214 1036794
12795 1036794 1069831 973723 841769 797561 766689 704019 521261 496164 560578 542748 497433
12784 497433 425492 333856 299188 370405 296528 264963 157775 127602 154864 161176 207189
12773 207189 361300 540082 605496 644629 514099 425135 347457 429091 521211 515625 404221
12762 404221 137252 53548 80242 -24212 -102739 40177 150971 122896 131267 198655 293679
12751 293679 333041 406246 385796 272397 244438 308046 442902 453005 401129 340645 310754
12740 310754 344731 368287 318627 250276 159280 56171 -72687 -42144 44285 30580 109470
12729 109470 224708 268289 224240 238902 190801 270877 305546 152524 42646 7069 -59006
12718 -59006 -49842 111860 100700 99728 83085 17306 33844 161930 255389 235326 176997 101333
12706 101333 172918 212569 226047 86876 -19455 31779 121313 120775 125475 176882 123275 157383
12694 157383 60088 -81441 -92453 -31868 -116619 -126726 -8333 54805 149412 160637 105698
12683 105698 186727 268025 133882 36812 -90780 -85866 -43901 88294 205420 215306 160246
12672 160246 146917 269233 392023 362887 398417 528178 506544 406136 456836 401927 177455
12661 177455 96904 114965 238881 219617 96895 65738 200047 263854 96794 -73457
12651 -73457 -53417 -57986 46763 137031 17167 -31762 31509 3623 -65090 -67119 -37904 -110780
12639 -110780 -68357 30830 90331 46471 -38730 86497 200581 202008 129757 187402 106320
12628 106320 25691 -4192 36859 310186 399234 359238 316702 352904 354626 232191 152016
12617 152016 217575 184281 195393 18445 -131263 3935 103761 90587 56768 109439 233998
12606 233998 286456 323750 291156 122620 33536 25833 4188 -46845 -102430 -1228 8521
12595 8521 49952 187688 143530 254986 318786 165586 77509 81890 38596 74030 129347
12584 129347 175744 185842 166659 87467 43220 114992 189243 111462 47285 131767 265630
12573 265630 329337 344486 234282 95586 -47912 -124107 -196522 -190087 -226590 -168792 -135592
12562 -135592 -230041 -292665 -266734 -358855 -287611 -230195 -171052 -152472 -150356 -141129 -50099 -55950
12550 -55950 7776 187080 247300 135070 161296 109149 43085 37069 184541 97107 -121333
12539 -121333 -268982 -76228 135383 39496 131325 183984 46883 -10469 18998 -3262 71702
12528 71702 26191 -53619 -117768 -68075 -57410 10667 -29539 -52975 -109772 -30892 69303
12517 69303 133734 211329 296197 158673 110117 124840 137228 207556 303842 329877 381430
12506 381430 337473 417806 531887 535831 532254 502343 433329 313508 354440 412710 486144
12495 486144 450527 392247 413895 304739 258529 302497 377945 387825 350073 249251 280697
12484 280697 247034 205892 97136 22835 45917 -7369 -18414 49550 -76236 2757 181175
12473 181175 249185 140325 -1862 -114051 -62233 58313 151511 91174 94938 86677 73471
12462 73471 81901 115642 237252 315603 377211 410138 427849 415911 374730 339174 422236 406444
12450 406444 323538 227821 316712 326190 216388 248911 269572 150406 148543 111474 154542
12439 154542 217956 248108 260183 254225 166596 80161 32913 63022 151312 193402 159800 199366
12427 199366 203344 121072 56222 101122 89340 96989 40872 -5606 1119 -52889 -54417 -37335
12415 -37335 -13292 38716 62570 99214 75305 73214 93351 70840 60303 168296 217787 174267
12403 174267 48239 12593 64408 95630 165996 143074 39274 -28895 -90108 86667 176328
12392 176328 133146 48387 73275 100697 9830 -4305 -37299 -30767 74037 84888 63432
12381 63432 38866 68429 113476 -3978 52567 37308 35557 -40616 -113831 -39895 -38674 -103764
12369 -103764 -96167 -20198 -38573 -55185 44261 83180 110236 56109 94932 -11096 108322
12358 108322 207436 112738 24763 106448 88791 25020 -49610 -63240 -64776 -189574 -112488
12347 -112488 -74951 -94133 -225893 -224738 -102330 -1623 71375 45427 4400 -101268 -166741
12336 -166741 -182292 -24935 172594 226363 266992 247981 162074 262055 160293 53329 111107
12325 111107 102044 137056 263713 285800 306282 262634 64178 78686 58621 28778 91259
12314 91259 166687 168562 64010 148200 159685 83412 59271 180253 252390 198303 122796
12303 122796 146338 198935 148340 68350 57917 242169 429123 321401 212141 151878 108317
12292 108317 146098 134233 163240 190238 80822 -5327 88331 100518 97824 157869 279257
12281 279257 365794 285059 172041 68135 80690 2549 29524 91146 140486 254919 254151
12270 254151 177486 86812 113187 229415 118908 -23906 -37303 9905 -44881 -38038 71162
12259 71162 -76094 -78335 140280 216551 261294 283126 311096 336559 353682 321472 238885
12248 238885 40101 130932 218624 257120 158979 114909 21012 -109829 -31138 150138 225926
12237 225926 24026 -13758 -1585 13564 -9827 -64860 -46750 50369 103569 180213 142267
12226 142267 135397 103859 91164 101359 -9682 115701 208219 299311 191366 23021 -17355
12215 -17355 17053 112093 90625 117028 218680 94701 186325 248447 244755 282720 368749
12204 368749 325945 272243 281045 254341 222903 196022 101668 161127 149767 133408 48548 109447
12192 109447 288953 320124 301749 203440 331676 350073 338363 242503 173346 148533 170757
12181 170757 205629 200025 184834 90254 161039 228859 245136 188296 166266 269110 326202
12170 326202 292090 183760 249736 290494 178128 68067 99407 150594 218636 189618 118796
12159 118796 228450 300169 364350 364447 192127 51275 77369 228873 362470 411011 344327
12148 344327 407051 416750 396616 363231 328382 341124 341388 202834 78610 129668 45486 13911
12136 13911 52526 127097 134885 73328 15936 77801 270226 334825 277539 254024 284857 246052
12124 246052 319723 352260 248906 262750 198490 254124 297814 239018 232955 224530 161264 88981
12112 88981 202866 139550 173060 190239 152211 110677 132143 244696 366164 389589 396701
12101 396701 326890 312794 352281 386686 347626 422655 482799 424175 270902 137855 111350
12090 111350 221037 325515 270786 206595 115316 91596 112942 154643 182871 170423 108657
12079 108657 -20121 -141268 -163344 -140237 -173726 -115198 55961 181442 167611 106526 179249
12068 179249 237298 115406 128348 127121 49435 63377 105737 143975 85194 188480 252898
12057 252898 180485 121202 184521 279257 325121 356803 418554 316728 297140 312422 118383
12046 118383 4467 74992 -18022 -103734 -14043 10798 -5936 19280 85711 31095 68768
12035 68768 122989 4821 76830 77752 65106 -19556 -124155 -142147 -113404 -68652 26718 46455
12023 46455 -72085 -114181 -56033 -69918 -39260 99452 67487 -7424 74580 170335 111855
12012 111855 50210 26815 2933 16236 86924 -35903 -149076 -105018 -60358 -74702 -27834
12001 -27834 -69911 3313 -47046 -92940 -121451 -176392 -168989 -138828 -109077 -78863 -33868 52790
11989 52790 -15998 -201617 -174643 -58942 89164 260268 310666 262140 68114 -7371 103053
11978 103053 105062 -32723 -55312 -15001 -85591 -124159 -114293 -139211 -50360 39575 106934 111560
11966 111560 94989 10545 7275 80945 111115 71110 74531 165938 62227 79006 140996 64778
11954 64778 24842 113542 179042 65197 102142 209077 142029 192008 256581 184656 -58656
11943 -58656 -96822 -95599 82027 10398 -142647 -148250 -115771 -109952 -31498 -13331 -92194 -181114
11931 -181114 -157940 -135074 -156924 -196640 -20780 37297 49841 113941 7629 -26031 38681
11920 38681 -28741 -169696 -219023 -279460 -266770 -242124 -103499 66653 253222 174665 34233
11909 34233 -136055 -194823 -56506 -115448 -61142 -69623 -185012 -195740 -134348 -328335 -381423
11898 -381423 -453928 -414510 -368850 -206543 -208604 -280250 -311707 -461316 -457140 -329722 -223451
11887 -223451 -110248 -32003 83491 -74694 -197514 -89764 -66625 -186697 -200358 -162243
11877 -162243 -101961 -44334 -73029 -117399 -57292 -111287 -142507 -164739 -126094 -113556 -18733
11866 -18733 160837 201839 222711 202890 63192 -67521 -78768 -80657 19460 -31792 -74589
11855 -74589 72878 72065 86539 117899 22528 -99820 -190301 -141444 -105052 -89420 -55203 -18651
11843 -18651 29171 147187 152712 63980 -25383 -86028 -110 -73299 -146088 -139310 -113673 -115581
11831 -115581 -104602 -183748 -209957 -207455 -191077 -239147 -197454 -237585 -74346 -22880 -17376 -106675
11819 -106675 -94299 -63736 -43748 -25051 25996 25975 -192530 -254748 -198608 -97330 21069
11808 21069 -45844 -32464 -19164 8633 47178 -176614 -191345 -148787 -152999 -36996 -34887 -39138
11796 -39138 -176125 -226495 -125898 -114914 -41541 24541 167248 165287 87158 -17097 -26525
11785 -26525 -55582 -127233 -208051 -167700 13867 176303 282250 219079 90398 53943 40411
11774 40411 11510 -44517 -86178 -52526 -5647 79826 7745 -218248 -244479 -208676 -116732
11763 -116732 -162169 -199156 -57617 53306 49775 33044 36774 -52389 -138474 -173148 -147959
11752 -147959 -201496 -208160 -177002 -203420 -269951 -373364 -401536 -423464 -298823 -181328 -68339
11741 -68339 18755 -4961 -21760 -96672 -96158 -91473 -57576 -92181 -68013 -66868 -120400 -200965
11729 -200965 -269945 -197517 -73116 52893 99175 56160 -32444 -43220 -92637 -182315 -252412
11718 -252412 -143862 -17256 62210 28902 68310 74228 114835 81289 -70542 7109 42537
11707 42537 41228 36120 127644 87344 66896 85210 141993 174791 58428 -120193 -129667 -97177
11695 -97177 -84105 -124591 -49443 105123 -86042 -60793 -3054 75626 92151 22256 -4224
11684 -4224 -195868 -269228 -202762 -100992 -102033 -38645 23357 168421 227702 86039 5269
11673 5269 134810 76687 2597 143997 128117 75722 122168 106152 86187 228865 222438
11662 222438 220875 237731 209494 190602 191184 142912 126557 137618 241368 333897 405951 380550
11650 380550 378064 270396 328977 446087 372360 399894 479442 364884 288676 230258 200332
11639 200332 146936 246822 293798 317568 358561 339539 267673 268320 341108 407315 339838 216508
11627 216508 179734 109169 210653 288640 354837 370857 410129 518282 562136 664877 612600
11616 612600 366101 189785 88811 79009 76330 163655 231621 228108 180664 22474 127589
11605 127589 359479 361020 370162 345801 343394 327779 280059 309526 211509 223404 189262 172403
11593 172403 177492 -33235 -177061 -280499 -188383 -5614 -32168 -195095 -136416 -52999 -78587
11582 -78587 -31917 205748 305368 203865 51370 -74948 -52123 66002 99840 -1504
11572 -1504 -137822 -138969 3755 122575 164891 206976 80359 39282 117044 -70955 -31977
11561 -31977 -52423 -55509 -32101 -91971 -7074 82091 198898 226448 236243 401091 437984 241313
11549 241313 257260 248285 91710 37539 32479 -31523 6336 120881 12472 -109619 -123806
11538 -123806 -18191 63919 -96673 -152554 -82937 4539 136096 153908 204030 370453 293917
11527 293917 134301 13772 -62603 70333 90956 84581 201066 247506 223403 227054 250763
11516 250763 243318 174427 58026 -94586 -49632 60534 58416 208782 146903 66512 72784
11505 72784 -52503 -7933 -50907 -77532 -201146 -160221 -131519 -143980 -58237 15685 121042
11494 121042 106587 -24905 -11497 -40919 33378 130470 93357 16347 -47057 25953 142608
11483 142608 96543 36804 9884 50810 48934 12859 -6849 -23944 64974 45689 -230 28061
11471 28061 72515 44349 134361 84624 52536 159722 166730 121612 180559 43755 2673
11460 2673 163647 239744 117922 122502 185934 184758 59837 20963 107660 158906 219348 288980
11448 288980 307693 153064 136999 172907 209573 132580 66859 99733 243355 239846 128779
11437 128779 11171 -68714 -43347 -60301 -65071 -95392 -139506 -115878 -73265 23870 -47193
11426 -47193 46711 40683 -35248 -70373 15734 33011 13637 90062 79213 57309 75680 -22924
11414 -22924 -1194 32439 62522 48748 50467 8347 -3800 33337 138112 129799 186657 240566
11402 240566 85816 -14457 -40278 8325 191462 151705 98843 117480 47098 -26654 -5166
11391 -5166 88129 113916 92884 230998 397769 441601 349691 204805 60079 13831 42256
11380 42256 -26561 17808 -23353 -6830 -106294 -150000 -67896 11967 -73681 -217438 -168791
11369 -168791 -50518 -21729 26260 -55538 -41960 -121783 -384672 -470614 -264565 -98552 11337
11358 11337 2022 66251 52415 114125 96606 72072 129012 102381 14776 32786 126233 201203
11346 201203 184091 163735 -16926 -93316 105414 228589 21779 -47508 36534 47832 26918
11335 26918 -58908 -14218 90814 97607 224301 258925 184431 173713 101231 114791 153985
11324 153985 136961 87955 19981 -103846 -82666 -69280 115521 286300 339980 501205 786559
11313 786559 962533 1166008 1350415 1478018 1491258 1277743 924083 678605 514145 345514
11303 345514 282106 224240 172917 141693 197353 287509 319899 363835 274895 237603 184269
11292 184269 133114 160525 234054 178375 113640 41816 112814 169139 155697 151575 242828 307169
11280 307169 338405 457881 477952 452765 402374 469164 624251 719990 832994 981917 1321240
11269 1321240 1722258 2126537 2727581 3528870 4173724 4682764 4742631 4359369 3432571 2400961
11259 2400961 1604126 1308750 1131587 862097 728119 744986 646833 599563 596076 498229
11249 498229 565242 604091 530546 511509 532973 510687 631952 611229 570544 506751 593006
11238 593006 720241 751447 678397 544143 524779 649483 727756 761042 860354 996442 1084928
11227 1084928 1023487 1114370 1241301 1419599 1799804 2230602 2809729 3351842 4034623 4663770
11217 4663770 4994883 4934361 4314882 3105464 2168603 1720505 1464319 1216088 978214
11208 978214 909683 809329 700091 593197 677336 584469 454081 496001 605411 542417
11198 542417 543257 565452 694639 660804 525805 509377 488060 430799 494205 515927 514822 612999
11186 612999 683828 582045 513888 586521 634640 699542 839881 887367 891854 1045568 1222695
11175 1222695 1263433 1314042 1566920 1698373 1830448 1733980 1472872 1240696 981972 833470
11165 833470 666066 547775 503770 485000 436991 407362 354115 346567 391484 399217 423014
11154 423014 293501 278971 273917 276529 244128 301644 347230 378195 325565 197123 343036
11143 343036 277034 338135 322976 361510 257844 187044 254955 284869 339037 371114 469545
11132 469545 386602 222436 41017 -43093 24303 94127 48676 42895 77501 80457 121639
11121 121639 12712 -39619 -7495 59244 98309 109028 75469 133845 165512 92828 89961
11110 89961 -28492 46584 130142 65044 61609 118182 174272 113824 73394 40049 184482
11099 184482 240906 180293 -37818 -55233 16344 22245 27458 25158 -70827 -54335 -102140 -240686
11087 -240686 -217900 -62525 -4863 4228 -19008 47586 201665 191486 56810 -26553 16215
11076 16215 81960 -15853 -104519 -189742 -135144 -80924 -143784 -89604 -99997 -108904 -147898 -239683
11064 -239683 -134209 -168345 -237418 -205236 -52218 2687 -11918 91115 89547 92719 3881
11053 3881 100081 121310 4677 -111376 -124270 -80562 -20102 87974 65657 113662 84033
11042 84033 -24651 -198060 -270420 -152404 -200962 -115883 -56057 -90253 -27250 62449 131173
11031 131173 217827 191722 23254 3327 11873 115494 92689 219165 183677 119610 -25975
11020 -25975 -55640 -74957 -112459 -27642 61741 111072 76206 84587 182040 93424 65820 47367
11008 47367 161078 240355 245901 87933 -2003 -18074 -5168 -91619 -132534 23754 54147
10997 54147 -53902 -70800 39468 67737 32060 -23226 70061 53722 44870 171300 218408
10986 218408 177013 131752 143600 82894 104930 164984 11416 -19440 5831 50897 -9196
10975 -9196 -37047 -50949 -43595 -77383 -88109 -89383 -15510 22851 -19452 90498 188636 177407
10963 177407 12889 -53844 -102680 -45956 -74303 34034 75509 22102 47564 38885 158672
10952 158672 276939 410498 345670 201096 109290 31556 33951 7239 7890 83826 143291
10941 143291 184060 232224 193316 137997 118920 35762 29149 8542 -15151 8504 16225 83920
10929 83920 129123 108066 105193 150539 204840 130281 179292 79410 -4510 -30342 25698 89087
10917 89087 109795 24864 41172 79546 192724 109421 200038 224783 127189 22608 -78958
10906 -78958 -142025 -13148 78013 100114 -11516 -168195 -199535 -87844 -22178 -97476 -115038
10895 -115038 -3972 118217 116251 118617 62331 -10609 -35003 -133352 -12699 -37561 -80253
10884 -80253 -142771 -136566 -35551 -37565 -30541 -30139 50254 85266 104792 -83898 -128727 20878
10872 20878 132194 5067 -94505 -23921 -96539 -51927 5340 24395 119581 168795 82289
10861 82289 92899 118177 39413 67863 62418 193151 363833 426301 353251 152822 19733
10850 19733 152104 69343 191713 165151 135550 60848 -80443 -75700 64455 195198 225914
10839 225914 265105 213696 114674 93219 19251 -137203 -139213 29497 123625 248706 196220
10828 196220 127479 69671 -99321 -181643 -66327 -40543 33117 147682 203644 231476 254428
10817 254428 131402 146992 207530 264553 238832 210430 175940 173749 145005 44605 -57258
10806 -57258 -66737 164367 295415 129490 144650 124531 167078 157317 252616 453414 521463
10795 521463 440132 418684 431814 464766 566774 581959 534854 620042 727609 899173 1039128
10784 1039128 962522 805867 701395 508510 304973 285922 148718 72190 146843 291343
10774 291343 374512 345451 278464 323977 312011 216068 96751 150503 119286 145892 173081
10763 173081 147634 243370 202859 123474 89747 17331 25931 124554 214286 372034 418361
10752 418361 428100 371676 465045 507810 476227 502602 656945 795770 983989 1095323 1162938
10741 1162938 1181121 1265004 1255936 1207109 1076745 1097859 944002 853329 764610 549933 357413
10730 357413 377607 437303 495977 601154 581651 513268 485092 474607 405729 308984 364458
10719 364458 419876 490756 522043 459856 450671 499785 652472 831878 1014750 1031785 1140991
10708 1140991 1247072 1389240 1355588 1436257 1404136 1197852 1204209 1226822 1297668 1400444 1532278
10697 1532278 1963621 2424310 2701272 2800322 2666829 1982000 1345426 988745 899172 783530
10687 783530 622150 606101 754420 789769 776182 766250 666444 570149 662832 656842 733672
10676 733672 768292 845772 859408 793398 671602 607972 488839 553900 561753 545854 597625
10665 597625 475652 355395 380712 380190 212458 200557 210566 384928 428323 328639 277619
10654 277619 211901 261591 320339 243472 204812 213197 358146 279823 170063 189966 423457
10643 423457 553902 502458 404510 375979 435913 447033 280089 187294 282202 350978 329715
10632 329715 384369 420255 264987 139372 162616 267492 277144 353358 526639 616184 667633
10621 667633 749044 773626 770982 742767 710450 663180 468864 446718 428624 418570 390756
10610 390756 323969 397952 405362 302640 330959 322265 422988 359530 337604 337389 423504 505195
10598 505195 423780 399596 373739 282918 247854 200174 192483 121041 83764 154762 171718 207951
10586 207951 222090 145688 75966 110742 91931 78899 -21308 -76232 115259 101854 141325
10575 141325 107587 83985 179098 74662 31071 157842 89339 68054 110412 23510 -29011
10564 -29011 15591 129559 105225 123299 144748 214174 211245 159387 116356 127984 109758 124062
10552 124062 118376 135759 190424 236065 465507 402774 188329 320997 294637 146427 231774
10541 231774 404134 301923 174703 223290 362088 467261 554117 704059 788393 813050
10531 813050 809049 704054 770478 788393 799952 795450 939218 1172784 1375959 1694450 2121344
10520 2121344 2944829 4061957 5145464 6294987 7495905 8781871 9659172 9189414 7373195
10511 7373195 5216366 3674307 2766730 2316756 1969484 1674560 1513567 1476575 1402102
10502 1402102 1340463 1343566 1321221 1199197 1145212 1068960 959752 985241 1048643 1015953 1030922
10491 1030922 993327 884861 921231 953408 983616 1103835 1156394 1108872 1170156 1108614 1218201
10480 1218201 1282466 1171339 1043017 918598 851842 715198 608512 611718 531219 560152
10470 560152 493139 560951 580568 530722 591040 560887 577462 680076 809698 991223 973904
10459 973904 863297 841631 796057 796159 829640 870927 791614 762465 706100 755424 817182 687421
10447 687421 605716 460215 386296 392765 601989 764784 812513 796610 798421 840274 855774
10436 855774 739718 563375 496273 581937 614437 662680 523447 411302 414405 356825 420673
10425 420673 372381 367813 389927 453202 453041 439443 443856 513005 509427 434287 358070 180967
10413 180967 249013 322322 279419 357041 379524 312317 242917 154711 149409 147216 222097 175430
10401 175430 69853 37072 63587 136758 270322 274843 238580 254717 343365 355590 342424
10390 342424 342076 329283 256527 311277 475162 635556 600549 505012 384325 334391 420528
10379 420528 517355 504033 484091 550629 611806 558234 504564 501219 536462 606202 588992 559408
10367 559408 695370 649983 518189 534557 440502 438336 503154 479123 554726 542547 612429
10356 612429 769742 802950 854087 916501 1097793 1182919 1372484 1464269 1367899 1398029 1317572
10345 1317572 1248219 1230198 1197582 1112042 1141170 1190444 1170807 1159195 1119991 999554 979060
10334 979060 955424 1005851 986660 1119960 1021282 946198 1003459 1105876 1090620 1095939 1141446
10323 1141446 1122123 1111849 1215034 1398300 1405957 1334954 1373979 1371006 1494126 1585601 1748386
10312 1748386 1893431 2126526 2206990 2312635 2481298 2692868 2846821 3181762 3526842 3842136
10302 3842136 4044203 4203163 4381952 4590518 4724909 4725356 4850889 5025378 5100023 5486354
10292 5486354 5782223 5993985 6379100 6722885 7151015 7351507 7243792 7067323 6846196
10283 6846196 6544400 6281065 6135838 6057197 6280043 6437565 6730750 7045570 7435967 7651008
10273 7651008 7900034 7968806 7956438 7677623 7425887 7308094 7448444 7652651 7893427 7984130
10263 7984130 8056709 7942816 7701949 7360679 6957082 6376316 5964573 5749932 5561548 5590819
10253 5590819 5525573 5421580 5493914 5493208 5601358 5710513 5984728 6423685 6827802 7191663
10243 7191663 7627235 7865612 7665534 7426309 7224589 6752279 6105521 5366503 4724596
10234 4724596 4193070 3635695 3239601 3051160 2974724 2909393 2663992 2492863 2444283 2468393
10224 2468393 2555738 2791870 2941319 3022843 3209535 3327589 3286953 3337719 3341392 3011266
10214 3011266 2718395 2616339 2304512 1998552 1845366 1771851 1699796 1581970 1462318 1402145
10204 1402145 1558019 1692043 1789807 1870091 2079351 2140706 2425296 2481436 2320302 2196888
10194 2196888 2033102 1971742 1727275 1673544 1599620 1478626 1466132 1307288 1173500 1054211
10184 1054211 1063228 1201764 1143787 1082017 1190318 1373026 1542314 1558195 1580033 1714110
10174 1714110 1806405 1706036 1632263 1706800 1835645 1894242 1778106 1494114 1303565 1133464
10164 1133464 1150070 1024184 938084 985016 1087504 1182470 1222905 1393247 1445725 1402977 1348677
10153 1348677 1327044 1361265 1124791 1006821 782604 562250 466652 542243 501578 487492
10143 487492 530143 499929 547243 543091 609336 780141 753141 635941 602558 647709 518538
10132 518538 392389 556031 655577 610995 600104 548462 560003 522455 475980 497641 437324
10121 437324 325393 243915 322598 379003 557059 422968 295972 298837 334990 305983 270160
10110 270160 286743 197078 140909 177739 250419 283774 187387 130263 198324 261890 126417
10099 126417 153373 224408 240728 159455 71765 99465 141859 149506 125141 294506 337988
10088 337988 226295 139782 212282 418942 504297 415700 400353 340641 377606 445982 351127
10077 351127 186243 83053 78570 237564 454256 390319 276376 265387 148256 246804
10067 246804 286281 320840 341596 263662 193397 224056 335084 337876 370005 293733 294545 230226
10055 230226 256521 201894 82768 219779 221244 120167 200837 220266 122928 113747 219667
10044 219667 342950 306368 270870 191081 39400 -3804 -16562 146103 184335 62253 -65285
10033 -65285 -107767 87597 176494 262072 225427 57728 50917 108970 -11555 -3687 179906
10022 179906 203461 297467 310183 336393 330803 176670 117304 173566 232570 269112 272934 152996
10010 152996 51511 -36678 51585 66442 72649 229971 222377 176744 236839 331110 290982
9999 290982 169839 125461 87368 195692 273926 212896 93089 52274 104898 179052 106699
9988 106699 81023 183829 135601 183093 288521 473615 456435 414997 433645 421291 347783
9977 347783 333345 318831 257046 126906 81404 160676 80742 -49360 716 177117 131054
9966 131054 94057 54104 84197 122279 79982 23503 132919 149600 132097 153839 36621
9955 36621 10967 9208 26670 32466 127594 184952 182820 143813 198844 263255 274148 265648 351249
9942 351249 417343 231651 64924 -86597 -63626 42313 73750 158712 164089 233893 206923
9931 206923 97657 144981 265175 372642 525009 525129 509303 475912 463292 458708 374108
9920 374108 427645 386761 280479 196381 326737 414236 372382 263476 220668 257570 307941
9909 307941 359764 290332 333991 525677 546605 378313 187799 252272 248792 235132 195516
9898 195516 115463 72744 2616 -5128 43101 126052 178010 261256 350079 261350 246821 315539
9886 315539 301890 363499 453113 452079 564485 537695 537357 559000 566345 658997 664203 645599
9874 645599 593932 489879 342911 240702 440154 466715 491973 488821 240193 229335 277201
9863 277201 451856 560256 535621 435815 401841 407791 363066 285965 340400 336613 358418 388561
9851 388561 385870 449966 473516 473986 512408 550027 609344 622863 542486 581195 550298 487212
9839 487212 579387 733745 723303 578785 821766 1021244 1033763 1038864 1071558 1095746 1037342
9828 1037342 967996 841247 768812 594170 349526 326914 383004 448727 479426 415628 486154
9817 486154 626956 700814 591975 633569 763188 744362 571212 567622 562107 442419 282316
9806 282316 284354 314129 197932 272503 297847 223272 279610 242962 163726 197591 324536
9795 324536 323951 289972 308101 306659 281419 302069 298881 426070 541193 523545 631927 538795
9783 538795 469761 557502 481715 426354 526673 359698 353743 407526 456070 424138 325745
9772 325745 274663 203583 141080 365176 386835 307427 114195 127795 272327 426634 320351
9761 320351 187524 301374 234714 204051 111641 8822 -157931 -6996 199457 261108
9751 261108 254156 400871 363483 400973 366116 278970 231472 80843 46216 159308 213402
9740 213402 203385 138919 143362 209282 254396 385103 431657 352733 435125 345618 177040
9729 177040 100285 75852 113335 111928 -34672 -55054 16872 168085 339106 371799 303664
9718 303664 198378 165331 87812 57298 1875 59381 124398 203159 203539 129677 45809 -77858
9706 -77858 -85124 -176056 -20825 -38926 18023 163031 220673 259993 132831 53545 -4953
9695 -4953 63649 220108 298010 219200 150352 125154 151701 136604 81374 153212 295231 368719
9683 368719 268364 186507 74870 -33040 198131 261061 278378 259223 217945 71211 -12303
9672 -12303 47906 -16965 -52639 25977 -20742 -78549 -23254 -45951 -72717 -126998 -13225 49144
9660 49144 61035 125949 159326 160593 104615 3172 -51668 55721 67281 35600 56724 143632
9648 143632 219491 284650 127357 -84059 -77322 38076 153030 130494 146514 143455 44627
9637 44627 -37871 22636 108424 48216 106600 91420 128548 354790 335721 264093 209403 55018
9625 55018 126512 257341 262696 257617 329187 182825 85494 119060 231503 332233 292004
9614 292004 108973 10527 60941 -11992 32527 142717 197314 245841 358089 392025 325627
9603 325627 203872 117777 116346 179386 126339 156471 224773 215936 163978 237193 297310 245246
9591 245246 194715 -22407 -220709 -159717 -73864 -2830 83026 -76881 -73213 -57648 -105059
9580 -105059 -162889 -286198 -257514 -218603 -98437 41058 238169 225624 102391 80063 -37151
9569 -37151 -111074 -192152 -186053 -220898 -269928 -219380 -88181 80777 132390 32706 -35615 82324
9557 82324 161671 200957 171016 39843 63511 -85359 -223319 -224121 -121957 -47765 24844
9546 24844 137889 175405 57852 -1558 -4704 52738 82237 49118 31246 -41405 -34118 71414
9534 71414 131207 257845 117221 -40575 -136315 -44979 -14559 -108206 -84785 70472 21477
9523 21477 -129878 -33032 -33839 -78497 -76887 -106044 -51170 -111322 -143168 -88101 76766 35982
9511 35982 76438 78827 108275 178049 132592 70666 47705 79454 -43208 22729 79483 21693
9499 21693 -74589 -86373 -157467 -205208 -137118 33257 32697 4577 -22981 18718 39584 7446
9487 7446 -85279 -61300 -104733 -65398 4596 13016 58689 110809 33386 46030 30693 -7727
9475 -7727 62657 184309 212681 97232 21228 -81329 -179574 -121921 -83308 -19804 38740
9464 38740 106297 66786 197234 314617 297259 191418 118550 122840 133320 171542 136119
9453 136119 153491 151735 123002 -49737 -122951 -108651 -34191 -36752 -23543 -31684 -29654 21442
9441 21442 226584 174998 17485 -64741 -20964 -15262 -38407 -57559 4946 -72128 -86178 21515
9429 21515 90273 -1399 -176675 -147743 -90232 -121277 -49906 -38785 -70583 9243 11987 47069
9417 47069 55421 -55712 -101395 20265 194698 177805 132105 213651 307240 196586 83927
9406 83927 22163 63233 125840 148746 68731 72426 189643 79501 -4680 78923 120799 69342
9394 69342 -108777 -190672 -110735 26741 86459 185237 185205 105189 228690 322040 315883 339541
9382 339541 260603 210033 218043 225510 -8655 -173547 -229006 -159116 -95110 -2851 82587 181935
9370 181935 142842 60340 60219 -28504 -82800 -119998 -195098 -195403 -87182 -178377 -296731 -31175
9358 -31175 106949 201539 247881 67717 -277 18284 6502 -33529 104346 287620 268808
9347 268808 164990 193645 194336 147945 98109 61844 120491 141052 160054 201810 184919 62209
9335 62209 25169 253299 306894 138182 -28966 53848 246237 347429 299457 279158 192961
9324 192961 112621 105711 79636 87651 194627 225894 156018 122795 157867 104729 142033 119676
9312 119676 64113 91835 95634 60676 50640 113071 61175 87401 213539 349600 396834
9301 396834 375234 435644 422505 287785 291841 351228 432026 413899 297177 262356 150978
9290 150978 59827 70470 61660 -10373 -35157 -4338 -79925 -137971 -154407 -175081 -267811 -172576
9278 -172576 -866 91433 83642 -31632 -122230 -74692 43336 103007 150242 90719 198313
9267 198313 200440 214715 246342 274751 234824 173781 331153 396856 233888 156658 202606
9256 202606 216834 289048 323877 307154 342562 283211 212695 116157 193677 159917 130661 244894
9244 244894 161098 73692 -66642 -80682 -64629 82344 188585 280257 327918 263232 263109
9233 263109 352529 422377 454943 495552 400603 335020 293610 349232 288390 358034 137553
9222 137553 41336 43040 226537 232660 114735 82312 175564 279111 374371 392034 439876
9211 439876 383101 349071 330010 200251 162103 211768 184277 215112 298953 297199 282371 227960
9199 227960 246633 305601 377594 581380 572596 474544 490863 402401 382302 513266 578831
9188 578831 551549 549031 593542 751858 845861 1010240 1036555 1033108 1021140 1102390 1270929
9177 1270929 1271533 1212199 1184485 1250018 1052544 767581 739787 698619 708254 769584 855562 790224
9165 790224 708507 656785 646997 821121 968706 971017 977228 919127 997349 1230615 1451874
9154 1451874 1609200 1662271 1605844 1506739 1451082 1377373 1268936 1073149 912700 926362 812353
9143 812353 795553 789314 845225 885032 950408 1051269 1114999 1108587 1108415 1237960 1475744 1593784
9131 1593784 1662743 1741409 1585124 1306007 1022716 918911 909138 898033 764471 764042 848150
9120 848150 805411 851322 866252 915604 970029 1022719 1058335 1188529 1424886 1580292 1673108
9109 1673108 1768442 1747291 1692598 1621401 1404704 1280163 1157527 929596 949807 1040409 1121845
9098 1121845 1087468 1222925 1124779 1106679 1109565 1038548 983331 1051944 1101441 1115532 1078205
9087 1078205 1093070 1156188 1279567 1294509 1377022 1543499 1782286 1878146 1962332 2098454 2469541
9076 2469541 2950458 3366082 3746800 4312292 4973452 5592099 6388129 7495247 8872612
9067 8872612 10510729 12880661 15758759 19111772 23186370 27589600 31883748 35671856
9059 35671856 38337093 38584727 35638224 30591092 25086473 20391583 16500736 13656204
9051 13656204 11678169 10179191 9092226 8231496 7414572 6709649 6331541 5841873 5325115
9042 5325115 5058642 4956737 4788639 4385749 4249385 4130792 4086747 4184393 4123615 3930149
9032 3930149 3661587 3344047 3090759 2964554 2868517 2910149 2769183 2589177 2480422 2490624
9022 2490624 2409778 2119099 1793577 1575076 1735566 1733774 1653960 1613711 1474706 1411183 1412508
9011 1412508 1443965 1360470 1261998 1122055 1016709 1081722 1129812 962304 990026 1037663 981674
9000 981674 840565 814363 799294 829037 801849 654782 550764 626772 581854 543770 501414
8989 501414 639127 765442 734712 647052 645336 627090 590379 485132 499661 561274 602888
8978 602888 491144 381737 401406 370874 342115 465540 543983 530188 455516 405944 471679
8967 471679 444464 238037 191445 196270 239151 393321 459807 385049 501529 622732 516980
8956 516980 374738 427976 463734 441718 474759 405862 314827 371455 365130 353954 421142 351027
8944 351027 428053 533696 568698 591118 570285 684562 557497 394054 232016 218754 214766
8933 214766 308246 543673 632736 485785 390491 290886 206874 209562 192503 172204 100966
8922 100966 20021 222932 347257 390630 351012 261114 258732 265233 246082 361236 390547
8911 390547 397282 353024 375298 399082 384525 217731 141278 198499 320554 343930 400414
8900 400414 436216 485394 528444 523764 445305 388420 443316 445067 444176 529387 536380 577251 653251
8887 653251 699958 712159 765147 757487 792877 661761 476761 287890 277719 313314 438407
8876 438407 420674 521663 534802 555836 628984 723444 613158 546259 443702 382699 446351
8865 446351 417108 357778 532790 540004 505722 445267 330941 295385 441751 626285 570341
8854 570341 401380 373749 423861 513739 714970 880076 735732 586172 617696 655465 537058
8843 537058 410158 364515 401667 462032 476068 481456 445325 450945 541303 503214 488106 467134
8831 467134 475366 596049 718656 739318 679349 625019 570200 684617 681746 680571 698045 555343
8819 555343 516764 456631 390491 470160 555809 562908 512293 634736 704592 779929 836352 852081
8807 852081 838534 809296 841906 808595 804664 848563 963933 960801 867617 1078867 1367763
8796 1367763 1662651 1754797 1772232 1766017 1607270 1526793 1643218 1742605 1582850 1475817 1369402
8785 1369402 1210851 1041993 994159 1010584 902340 803429 771299 862624 828110 826487 783658
8774 783658 819528 920065 1042440 976825 930675 813650 764616 701223 726686 761656 776156
8763 776156 808173 757637 917913 959102 810233 818512 898723 1176165 1481140 1712089 2080384
8752 2080384 2404450 2720162 2971288 3236489 3220125 3028787 3053961 3075784 3198095 3466728
8742 3466728 3419964 3013893 2608948 2261553 2001602 2061916 2179262 2352056 2780921 3322598
8732 3322598 3977308 4659659 5234434 5825932 6173385 5825539 4938807 3847103 2918369
8723 2918369 2439800 2153013 1857097 1778293 1795966 1736991 1650145 1619740 1702147 1799334 1788061
$$ [...]
##END NTUPLES=NMR SPECTRUM
##END=
