##TITLE=Analysis number 311025
Compound Code cc 25506
Book Reference 441/81/2
Project Code adrs
Chemist Name colinb
##JCAMPDX= 6.0         $$ Bruker NMR JCAMP-DX V2.0
##DATA TYPE= NMR SPECTRUM
##DATA CLASS= NTUPLES
##ORIGIN= Bruker BioSpin GmbH
##OWNER= NMR
$$ XWIN-NMR		Version 3.5
$$ Wed Jun 29 10:56:02 2005 GMT Daylight Time (UT+1h)  MAYBRIDGE\NMR@NMR_250MHZ
##.OBSERVE FREQUENCY= 250.131544655141
##.OBSERVE NUCLEUS= ^1H
##.ACQUISITION MODE= SIMULTANEOUS (DQD)
##.ACQUISITION SCHEME= undefined
##.AVERAGES= 16
##.DIGITISER RES= 18
##SPECTROMETER/DATA SYSTEM= dpx250
##.PULSE SEQUENCE= zg30
##.SOLVENT NAME= CDCl3
##.SHIFT REFERENCE= (INTERNAL, CDCl3, 0, 16.522)
##AUDIT TRAIL= $$ (NUMBER, WHEN, WHO, WHERE, WHAT)
$$ ##TITLE= Audit trail, XWIN-NMR		Version 3.5
$$ ##JCAMPDX= 5.01
$$ ##ORIGIN= Bruker BioSpin GmbH
$$ ##OWNER= NMR
$$ C:\u/data/dgb/nmr/ADRS/5010/pdata/1/auditp.txt
$$ ##AUDIT TRAIL=  $$ (NUMBER, WHEN, WHO, WHERE, WHAT)
(   1,<2005-06-29 10:55:32.27 +100>,<MAYBRIDGE\NMR>,<NMR_250MHZ>,
      <created by zg, POWCHK disabled, PULCHK disabled
       configuration hash MD5:
       62 19 C7 07 E1 42 D1 B7 37 6C 3D D0 77 39 F9 E6
       data hash MD5: 64K
       64 98 DC 7A AD AF 02 DA C1 E1 C6 19 B8 F5 C7 CB>)
(   2,<2005-06-29 10:55:45.13 +100>,<MAYBRIDGE\NMR>,<NMR_250MHZ>,
      <Start of raw data processing
       ef LB = 0.3 FT_mod = 6 PKNL = 1 SI = 32K 
       data hash MD5: 32K
       93 85 92 30 82 A7 34 40 F6 09 18 94 8F 50 8C 96>)
(   3,<2005-06-29 10:55:47.82 +100>,<MAYBRIDGE\NMR>,<NMR_250MHZ>,
      <apk 
       data hash MD5: 32K
       DB 8A 1A 64 76 E0 EC AD 56 FA 1E DC EE 5D E1 6D>)
(   4,<2005-06-29 10:55:48.68 +100>,<MAYBRIDGE\NMR>,<NMR_250MHZ>,
      <abs ABSG = 5 
       data hash MD5: 32K
       44 22 D0 EF 99 63 87 ED 30 88 B9 60 9D E3 DA 9F>)
$$ ##END=
$$ 
$$ hash MD5
$$ 0C BD 45 8F 78 E0 52 1D 35 EB C0 F8 1B DE ED A1
##$RELAX= 
##$RELAX= 
##$RELAX= 
##$RELAX= 
##$RELAX= 
##$RELAX= 
##$RELAX= 
$$ Bruker specific parameters
$$ --------------------------
##$DU= <C:\u>
##$EXPNO= 5010
##$NAME= <ADRS>
##$PROCNO= 1
##$TYPE= <nmr>
##$USER= <dgb>
##$AMP= (0..31)
100 100 100 100 100 100 100 100 100 100 100 100 100 100 100 100 100 100 
100 100 100 100 100 100 100 100 100 100 100 100 100 100 
##$AQSEQ= 0
##$AQ_mod= 3
##$AUNM= <au_zg>
##$AUTOPOS= <13 >
##$BF1= 250.13
##$BF2= 250.13
##$BF3= 250.13
##$BF4= 250.13
##$BF5= 500.13
##$BF6= 500.13
##$BF7= 500.13
##$BF8= 500.13
##$BYTORDA= 1
##$CFDGTYP= 0
##$CFRGTYP= 5
##$CHEMSTR= <none>
##$CNST= (0..31)
1 1 145 1 1 1 1 1 1 1 1 1 1 1 1 1 1 1 1 1 1 1 1 1 1 1 1 1 1 1 1 1 
##$CPDPRG= <>
##$CPDPRG1= <>
##$CPDPRG2= <>
##$CPDPRG3= <>
##$CPDPRG4= <mlev>
##$CPDPRG5= <mlev>
##$CPDPRG6= <mlev>
##$CPDPRG7= <mlev>
##$CPDPRG8= <mlev>
##$CPDPRGB= <>
##$CPDPRGT= <>
##$D= (0..31)
0 1 0 0 0 0 0 0 0 0.06 0 0 0 0 0 0 0.0002 0 0 0 0 0 0 0 0 0 0 0 0 0 0 
0 
##$DATE= 1120038931
##$DBL= (0..7)
120 120 120 120 120 120 120 120 
##$DBP= (0..7)
150 150 150 150 150 150 150 150 
##$DBP07= 0
##$DBPNAM0= <>
##$DBPNAM1= <>
$$ [...]
##$SUBNAM7= <"">
##$SUBNAM8= <"">
##$SUBNAM9= <"">
##$SW= 20.6930455092707
##$SWIBOX= (0..15)
0 0 3 0 0 0 0 0 0 0 0 0 0 0 0 0 
##$SW_h= 5175.983436853
##$TD= 65536
##$TD0= 1
##$TE= 295.16
##$TE2= 300
##$TE3= 300
##$TEG= 300
##$TL= (0..7)
0 120 120 120 120 120 120 120 
##$TP= (0..7)
150 150 150 150 150 150 150 150 
##$TP07= 0
##$TPNAME0= <>
##$TPNAME1= <>
##$TPNAME2= <>
##$TPNAME3= <>
##$TPNAME4= <>
##$TPNAME5= <>
##$TPNAME6= <>
##$TPNAME7= <>
##$TPOAL= (0..7)
0.5 0.5 0.5 0.5 0.5 0.5 0.5 0.5 
##$TPOFFS= (0..7)
0 0 0 0 0 0 0 0 
##$TUNHIN= 0
##$TUNHOUT= 0
##$TUNXOUT= 0
##$USERA1= <user>
##$USERA2= <user>
##$USERA3= <user>
##$USERA4= <user>
##$USERA5= <user>
##$V9= 5
##$VALIST= <valist>
##$VCLIST= <CCCCCCCCCCCCCCC>
##$VD= 0
##$VDLIST= <DDDDDDDDDDDDDDD>
##$VPLIST= <PPPPPPPPPPPPPPP>
##$VTLIST= <TTTTTTTTTTTTTTT>
##$WBST= 1024
##$WBSW= 4
##$XGAIN= (0..3)
0 0 0 0 
##$XL= 0
##$YL= 0
##$YMAX_a= 527238
##$YMIN_a= -355022
##$ZGOPTNS= <>
##$ZL1= 120
##$ZL2= 120
##$ZL3= 120
##$ZL4= 120
##$ABSF1= 16.522
##$ABSF2= -4.171173
##$ABSG= 5
##$ABSL= 3
##$ALPHA= 0
##$AQORDER= 0
##$ASSFAC= 0
##$ASSFACI= 0
##$ASSFACX= 0
##$ASSWID= 0
##$AUNMP= <proc_1d>
##$AZFE= 0.1
##$AZFW= 0.1
##$BCFW= 0
##$BC_mod= 0
##$BYTORDP= 0
##$COROFFS= 0
##$CY= 12.5
##$DATMOD= 1
##$DC= 0
##$DFILT= <>
##$DTYPP= 0
##$F1P= 14.0000005364418
##$F2P= -0.99999901652339
##$FCOR= 0.5
##$FTSIZE= 32768
##$FT_mod= 6
##$GAMMA= 0
##$GB= 0
##$INTBC= 1
##$INTSCL= 1
##$ISEN= 128
##$LB= 0.3
##$LEV0= 0
##$LPBIN= 0
##$MAXI= 10000
##$MC2= 0
##$MEAN= 0
##$ME_mod= 0
##$MI= 0
##$NCOEF= 0
##$NC_proc= -5
##$NLEV= 6
##$NOISF1= 0
##$NOISF2= 0
##$NSP= 0
##$NTH_PI= 0
##$NZP= 0
##$OFFSET= 16.522
##$PC= 1
##$PHC0= -67.23184
##$PHC1= -18.96952
##$PH_mod= 1
##$PKNL= yes
##$PPARMOD= 0
##$PSCAL= 4
##$PSIGN= 0
##$REVERSE= no
##$SF= 250.13
##$SI= 32768
##$SIGF1= 0
##$SIGF2= 0
##$SINO= 400
##$SIOLD= 32768
##$SREGLST= <1H.CDCl3>
##$SSB= 0
##$STSI= 32768
##$STSR= 0
##$SW_p= 5175.98343685301
##$SYMM= 0
##$S_DEV= 0
##$TDeff= 65536
##$TDoff= 0
##$TI= <Analysis number 999999
Compound Code 99
Book Reference 9
Project Code 9>
##$TILT= no
##$TM1= 0
##$TM2= 0
##$TOPLEV= 0
##$USERP1= <user>
##$USERP2= <user>
##$USERP3= <user>
##$USERP4= <user>
##$USERP5= <user>
##$WDW= 1
##$XDIM= 32768
##$YMAX_p= 420661491
##$YMIN_p= -428717
$$ End of Bruker specific parameters
$$ ---------------------------------
##NTUPLES= NMR SPECTRUM
##VAR_NAME=  FREQUENCY,     SPECTRUM/REAL,   SPECTRUM/IMAG
##SYMBOL=    X,             R,               I
##VAR_TYPE=  INDEPENDENT,   DEPENDENT,       DEPENDENT
##VAR_FORM=  AFFN,          ASDF,            ASDF
##VAR_DIM=   32768,         32768,           32768
##UNITS=     HZ,            ARBITRARY UNITS, ARBITRARY UNITS
##FACTOR=    0.157963299565203, 1,           1
##FIRST=     4132.6476996994, 0,             0
##LAST=      -1043.33573715361, 0,           0
##MIN=       -1043.33573715361, -428717,     0
##MAX=       4132.6476996994, 420661491,     0
$$ Real data points
##PAGE= N=1
##DATA TABLE= (X++(R..R)), XYDATA
$$ [...]
26029 63077 -28841 -73195 14275 208739 212472 123767 -35914 -125791 -110121 -85145 -96989
26018 -96989 -3458 41985 39276 145541 210303 141393 -17411 -55489 -81476 -173279 -165538 -108407
26006 -108407 -59504 -110248 -133030 -124908 -108582 -111018 1448 98674 684 -2540 -34331 -87143
25994 -87143 -101686 -119403 -22839 -13350 -40503 -25100 67155 116344 80839 13757 34069 107563
25982 107563 187077 166616 101171 152525 136107 41294 -8399 344 8852 -23065 -107672 -180142
25970 -180142 -51664 8661 38652 51504 47216 104574 154557 233355 159323 162097 190095 45265
25958 45265 -47621 99891 243376 229070 64486 -13173 109331 151534 29800 42781 107499
25947 107499 26202 -3284 43300 108891 138740 85798 25597 -35575 -67832 57318 -586
25936 -586 -9212 9381 97308 15057 -21005 51808 110697 95379 117405 244730 328297 257475
25924 257475 48867 -40033 -2178 96160 113939 8632 -20236 4970 -56160 -21715 11803
25913 11803 -27806 53689 116308 144301 73865 62491 -18715 33154 130698 104157 39660 1002
25901 1002 -29867 -46685 -162685 -137280 -36383 -45200 -88639 -18172 -5329 -75813 -107149 -194393
25889 -194393 -220696 -199785 -133425 -14351 81627 118390 101580 111119 78907 -17113 -6712
25878 -6712 59549 -17274 -97247 -226692 -328630 -293468 -172663 -4617 94208 133670 220057
25867 220057 245293 162338 129728 -24468 -13683 52163 6024 156062 222391 151820 76603
25856 76603 -31218 -109782 -81828 -88957 -32406 45152 105862 111445 16776 -76673 -135850 -118821
25844 -118821 -128458 -55252 -35110 -24615 -18119 -99639 -86756 -45396 -69874 -81765 -2315 18588
25832 18588 52736 -43319 -25969 47494 72050 45700 -49232 -101035 -74271 -91318 -89231 -39156
25820 -39156 11492 64514 62707 -90829 -107624 24149 -41241 -61450 17065 16300 99782 130200
25808 130200 108483 6406 9235 27584 20868 27961 131386 162298 52754 -39043 24472
25797 24472 -29158 88554 168633 137325 54039 -49331 43628 140553 183693 81420 7753
25786 7753 12655 -76890 -149529 -132565 -127394 -81495 -94763 -105005 -6943 21276 46927 47535 -87629
25773 -87629 -24083 77290 105805 107237 49861 -20577 -1324 47103 46334 -11863 -45149 -38400
25761 -38400 6728 -5555 -56568 -92764 -36824 38813 52499 -14944 -13601 28402 -54727 -77184
25749 -77184 30526 152294 234608 181401 121411 77528 59365 1153 43205 56716 86102
25738 86102 145239 218712 156704 -50404 -118591 12500 59418 69323 66111 -25619 -57386 -82273
25726 -82273 -70440 -47189 -85650 -41649 99345 89781 -1163 -833 -42128 -83805 -140448 -132132
25714 -132132 -30095 -101841 -115508 -86384 41731 107300 32668 -35931 -16900 -38562 34415
25703 34415 41250 42219 19284 16217 56169 40625 -7885 61941 36804 -24507 -5754 -50215
25691 -50215 -29647 -55375 -95759 -32554 29915 -5840 -37469 -39507 -42581 -7657 -24983 -36609
25679 -36609 -28803 -61905 -104494 -169615 -264477 -189455 -126585 -56303 -60203 -42481 -24911 -34304
25667 -34304 -64847 -70108 -18119 62876 23818 -19176 -47761 -29490 -19998 -54248 -139014 -167402
25655 -167402 -33400 41816 73426 89765 43293 -17709 19150 41166 -65525 -67718 49844
25644 49844 42859 20372 54572 58193 -13879 -27309 26616 39079 -41052 -100042 -73101 -89317
25632 -89317 -36428 64902 73074 52743 -22450 -5841 66002 5017 -148402 -241693 -242266 -237710
25620 -237710 -148280 7128 21984 -1639 -34726 -41684 16712 195105 127648 149711 98980
25609 98980 -23645 -29708 72810 150861 172700 130247 42190 7238 20063 -42412 -93585
25598 -93585 -50171 60095 66752 65342 114241 96587 94778 75915 -81565 -168309 -61209 -20112
25586 -20112 -111370 -83779 -131297 -192448 -219200 -136187 -12441 -15401 -80875 -136097 -64286 8514
25574 8514 -6738 30528 73697 55367 55447 28702 28455 -18820 24116 9071 44692 39451 68276
25561 68276 55372 -6962 -124134 -200888 -64482 18493 100983 196208 163111 70018 99596
25550 99596 118694 99545 125905 146249 105906 76050 130382 89425 124579 35718 10390 61597
25538 61597 21171 79074 84721 58799 90015 -12791 -104579 -78509 -71978 289 -129220 -159321
25526 -159321 -98183 10588 4138 -87708 -26584 14291 16513 83510 78274 94078 124313 83754
25514 83754 36050 49672 14911 56347 79151 68633 59987 -35209 7069 37456 54827 40877
25502 40877 -17869 54771 28936 -31022 26472 145020 108197 -12108 -21225 -9307 -16523 21268
25490 21268 15244 -8356 -66238 -71605 23844 25592 -19968 -51439 -40819 -71077 -12085 10769
25478 10769 36814 16706 -46654 -127993 -95782 -9995 64338 92080 139526 201475 153874 96262
25466 96262 -3 44531 72678 38516 -4476 -76139 -2547 78360 16209 -18307 -9572 26064
25454 26064 1311 67814 51976 55516 89318 101524 71056 121805 103536 139820 67493 110860
25442 110860 14699 -104206 -158520 -107168 -57924 -73846 -129099 -105755 -51757 -15865 -23746
25431 -23746 -2771 109081 56138 -45019 -40020 7330 57990 31776 -25174 -77676 -39766
25420 -39766 -3436 21812 87267 -11768 -76118 5966 96063 50666 -46086 -11805 43885 -50490
25408 -50490 -142191 -86197 65761 128416 101601 -48030 -185804 -95832 4698 47156 66976
25397 66976 33206 26842 -33493 14491 -5895 -30612 -4552 -56689 -89852 47304 102091 28719
25385 28719 46522 88981 30517 107401 151931 156580 103396 121509 71997 -23963 -50397 -95453
25373 -95453 70714 172336 183285 125644 94988 86302 207475 151248 42635 -3373 -14057
25362 -14057 15687 51429 72952 110167 117373 -6103 -17351 -18392 -56639 40205 95247 64948
25350 64948 -10020 -2507 782 39092 169164 309676 253524 97403 -74079 -184596 -203076
25339 -203076 -210436 -95375 4453 74591 101182 102194 143517 158732 148526 100566 32931 14430
25327 14430 70105 135401 128125 109374 35737 -88463 -26599 -9576 57220 183902 101124
25316 101124 26421 43116 39515 86081 52787 -28364 -138610 -169397 -66973 -57741 -10013
25305 -10013 59940 124978 65311 74273 91931 17817 42450 101480 -9118 -37937 -93075 -45072
25293 -45072 36869 -46926 -80960 -30393 -4991 -5636 -9038 14484 6470 36181 11722 -5097
25281 -5097 52158 -32128 -12711 50461 25717 39205 17254 20638 13203 23541 38249 -28214
25269 -28214 -36684 39799 52498 -25677 -53183 -112965 -198761 -193453 -151115 -114644 -152507 -151778
25257 -151778 -85535 -145047 -89634 -67543 -69001 -96623 -115012 -14619 56253 124681 22740
25246 22740 -31158 29331 -38429 -66542 3858 -69142 -13610 -30022 -26648 -150668 -188401 -57953
25234 -57953 -556 50434 82599 32288 34424 -56204 -215264 -181652 -101364 27335 27984 57264
25222 57264 156662 141440 63419 10526 42174 121388 122373 1200 -102396 -68211 -50774 -102045
25210 -102045 -195574 -222195 -115560 -22344 -9854 -4786 14374 -71641 -77197 -111206 -80099 -26375
25198 -26375 -46056 -35103 -36861 21841 65193 72340 39332 11904 30942 54455 -91011 -170573
25186 -170573 -154751 -133104 -135677 -191164 -98803 -40666 17461 -8415 -115533 -147127 -91697
25175 -91697 -76353 -86357 -91299 42119 -45947 -128877 -38526 -11291 69331 99524 150728 123439
25163 123439 185244 181468 147231 120543 120296 114151 135592 147030 67166 73252 91097 14276
25151 14276 34076 57838 25765 67234 86921 76919 102258 80791 -73727 43506 100006
25140 100006 61411 -51257 -16661 24653 35589 92035 -24628 -135272 -155011 -151185 -172528
25129 -172528 -99834 -55777 -94537 -62823 -24390 55447 95398 137094 203169 204356 232549 158319
25117 158319 62876 73211 -12010 44946 111286 51691 124764 186137 178848 159603 158336 136449
25105 136449 61707 114392 109112 -59470 -147755 -120142 -121703 -127507 -53217 -78302 -67235 -2891
25093 -2891 -1993 -71768 27711 101506 16184 -81700 -68471 -27957 -120671 -255214 -257055 -241232
25081 -241232 -104210 100726 163105 111710 65258 136508 45489 -56726 5284 62432 68356
25070 68356 93895 121911 156586 28385 -96974 -59640 -104912 -183342 -130721 -54095 -23079
25059 -23079 -79612 -34986 78810 2535 -21276 13908 -101493 -136402 -102779 -87182 -53802
25048 -53802 41783 57614 98438 131570 89879 -6999 65517 151830 138062 47781 83024 105139
25036 105139 70512 68797 43168 -3005 11587 58832 8192 8986 -70185 -104550 -36663 -3414
25024 -3414 -66159 -72517 -107296 -56250 -33258 39642 42114 -59680 -77610 -52321 -105675 -29090
25012 -29090 129661 242356 277142 199631 135794 120635 45375 17472 50329 -28377 -48204
25001 -48204 95688 145545 111358 10362 -89366 -50629 51808 10536 -30302 -20014 43250
24990 43250 85379 140080 65063 987 -1350 35292 114840 128489 67860 15242 104954 172040
24978 172040 79258 57149 56065 89676 52890 36346 86652 32658 2971 -66751 -98578 36452
24966 36452 96207 99951 105037 69625 76985 44704 37285 103011 90742 -3041 -3053 -58461 -212929
24953 -212929 -157983 -48278 10016 178349 124979 154947 37424 -13253 43692 56130 56227
24942 56227 94015 30302 99423 122520 36293 16969 -106158 -93854 -17522 24790 113151
24931 113151 87647 52123 -40117 -154873 -141870 -79191 -95304 -115458 -66554 824 32424
24920 32424 -39122 -111893 -97436 -87588 -120882 -81718 -44632 6893 68400 36204 -11024 -36801
24908 -36801 -97434 -116115 -40658 -15436 -13991 -62817 -93120 -71261 9423 -36353 -19357 -55593
24896 -55593 -120937 -93393 -63188 -30259 -15814 -60631 -114259 -108944 -64933 -72699 -87982 -144122
24884 -144122 -72659 40703 -8583 -46600 25636 13577 1179 17541 -73082 -147227 -230321
24873 -230321 -188725 -134535 -66771 -26226 -119904 -224491 -191363 -114873 -4877 29624 -21306
24862 -21306 73784 64261 -63953 -138054 -64276 10391 -4760 39179 138378 105031 153589 70929
24850 70929 18446 -8740 77613 99712 30346 -113153 -186797 -101655 16889 -22871 -9763
24839 -9763 51453 104696 62995 -10771 -191 54967 121359 223963 118282 -25464 -48520
24828 -48520 -61956 -56961 -100755 -13672 24666 -43877 -57950 -65420 -148406 -197375 -122079 29472
24816 29472 -38377 -81743 -14706 102796 127604 120552 107096 96603 76973 28649 175374
24805 175374 118273 170029 120335 96207 59781 -65259 -175188 -139122 -17625 69394 68185
24794 68185 5578 75158 157726 84808 129327 156460 88121 -3770 -37981 -20206 33013 50893
24782 50893 18260 -26188 -93504 -125330 -133933 3086 13479 112633 207598 205065 204156 139261
24770 139261 68165 19971 -77074 -138729 -103110 -29387 4697 73347 119737 116106 65055 -23706
24758 -23706 -144784 -204069 -66459 18028 35547 -51504 -119272 -166284 -157857 -11285 34517
24747 34517 10208 -86318 -32208 -12643 21417 106367 86158 55746 110445 148653 104369 99856
24735 99856 106862 10724 -28352 -11383 2708 -66161 -135373 -150672 -77372 -38926 -56676 -56527
24723 -56527 -64089 -28654 -19837 -47538 -126245 -128685 -28594 -40326 -68243 -5159 -9141 -77765
24711 -77765 -51692 -4873 -19712 32992 121373 132450 154607 117849 18311 -11730 25334 60494
24699 60494 -21176 -120816 -113410 -49380 -33952 -116795 -132695 -74084 13314 29679 -55624 -93214
24687 -93214 -34426 11873 113911 95715 25413 -22280 -61675 -22428 -1713 5220 -437 16778
24675 16778 23297 -36118 75134 104817 3062 -54260 -112690 -24327 -9171 30374 76748
24664 76748 77372 100805 112557 71602 -32144 30007 97731 85214 10098 -23494 -12102 -40663
24652 -40663 14830 15044 -56698 8220 36561 140231 190196 159887 84947 -15222 -30854 -63565
24640 -63565 -147400 -228198 -147342 -127792 -215659 -56750 11342 22857 51379 -34933 -27676 31579
24628 31579 -16622 -36479 47761 -70527 -184169 -243090 -240174 -137720 -21365 90026 45216
24617 45216 20610 -25055 -96760 -13968 -71832 -96730 -66655 -19137 -6857 -22397 -4770 95022
24605 95022 99764 76647 -84650 -141781 -63304 -51935 -20050 -90734 -143834 -244923 -190845
24594 -190845 -64104 -57242 -78516 -34107 -73951 -165728 -149783 8573 154458 79840 75781
24583 75781 68044 -56409 39757 127855 18504 -41909 25798 101982 192587 213818 131393
24572 131393 -121163 -258346 -141223 -16609 103370 106644 -21277 -175498 -105340 -36776
24562 -36776 -106733 -156124 -78445 -70258 -62402 -78692 -180850 -143471 -64948 -97200 -94830 -32958
24550 -32958 -80442 -163551 -124367 -54275 4442 -42696 -63228 -84771 -56388 -46487 19203 63231
24538 63231 6756 31905 3107 -32940 -94359 -24874 -17247 12449 -88794 -88706 -77491 -87721
24526 -87721 36701 100183 -14648 2851 156346 106728 -73202 -35859 -38335 9329 107241
24515 107241 104209 77109 60382 32999 102255 179293 159942 143429 60813 67744 -11479 -27469
24503 -27469 -104475 -133272 -100523 20567 108537 159680 218302 295294 289807 116100 41183
24492 41183 -10923 -61931 -89618 -18992 32595 -6864 -62020 -70282 -32430 -49546 -92193 -161074
24480 -161074 -167489 -219068 -232461 -171523 -69718 114333 81063 49298 25103 -130196 -126367
24469 -126367 -131335 -101429 19522 151374 134396 127793 82253 120620 28772 32534 16377 -13214
24457 -13214 -6232 11443 43930 -100902 -244942 -216178 -180464 -29839 27446 -13300 10292
24446 10292 87768 151698 222844 170499 65801 -29049 70688 51759 -46374 -56900 -142054
24435 -142054 -117256 -15220 -70561 -28200 -4363 63247 132383 126349 6337 -80113 -109716
24424 -109716 -49904 -21428 35520 19193 -31111 -112992 -158513 -146809 -159009 -76525 -87984
24413 -87984 -24114 47648 42406 44553 43755 -67150 -145177 -104892 13082 16700 -2557 -35859
24401 -35859 -100909 -114430 -162260 -109660 -29829 -121649 -162482 -116900 -86554 -49998 -76965 58352
24389 58352 -17472 -122934 24674 59160 -2947 5600 85216 122156 96998 30189 -36947
24378 -36947 -125125 -114748 -128112 2070 71524 97264 16129 -56113 -120811 -197976 -214669
24367 -214669 -127048 -200337 -241444 -212982 -212525 -209987 -79920 -23964 -106433 -88513 -46064 -19499
24355 -19499 -5031 -17963 -57393 -138950 -180192 -97209 -96982 -34457 46874 55661 26357 -34816
24343 -34816 -57933 -133580 -110124 -13343 -122622 -172566 -254237 -208854 -142296 -31759 -45414
24332 -45414 -35680 -7461 -31095 -150430 -130193 6693 58170 9848 -80885 -104250 13304
24321 13304 -2232 -8758 36176 37366 36042 -86488 -99567 -5886 5126 -100704 -972 37619
24309 37619 -49867 -34242 19811 -19574 4040 -50956 10225 -68016 -42402 14688 80398 59292
24297 59292 -47404 -51838 11746 96340 166843 85417 12240 79730 57682 40682 78218 149582
24285 149582 178198 218204 157331 170992 128071 123512 129299 151303 43999 7799 76748 138583
24273 138583 110024 37087 71837 59493 101278 174017 196992 181914 88299 48918 117174
24262 117174 127153 34842 4418 15108 80213 60400 50300 93836 27534 -116432 -180349
24251 -180349 -214259 -231788 -229673 -336227 -259627 -41855 -26834 -92787 -149941 -117274 -47758
24240 -47758 40552 34970 11449 134099 147245 65162 55122 -20384 -23665 -13737 -26055 60626
24228 60626 90936 -61748 -134928 -106335 -162332 -152914 -76832 -87506 -76117 -12629 -49714 -96928
24216 -96928 -38008 2207 56192 12345 -12968 -26044 -36110 58669 34889 5105 60513 132327
24204 132327 115101 -44921 -89328 -33939 -122377 -214189 -182555 -82876 -42958 -19376 -47766
24193 -47766 -81256 -62010 -56444 -54722 -162716 -111732 -125513 -141005 -171838 -61014 42226
24182 42226 53996 -8646 7281 -34983 4846 26279 31643 101491 185809 185593 164883 100489
24170 100489 -13667 -45113 -8022 63630 92093 -54862 -52981 7778 9231 37706 15242
24159 15242 10518 18851 -145450 -109911 -222519 -304734 -213423 -118393 -96713 -134224 -166428 -141997
24147 -141997 -78475 9440 83065 68217 82003 63643 97648 -31613 -51414 92348 43635
24136 43635 -70057 -62445 -70697 -68342 -80802 -45680 -29303 -117867 -21907 54588 49718 -43314
24124 -43314 -34422 -60647 -6335 -26428 -99356 -168499 -108868 7445 -13272 -58189 -40179 11770
24112 11770 -57164 -37787 -68044 -63523 -63060 -124473 -69353 -40645 -30756 -190982 -291618 -233478
24100 -233478 -220273 -161607 -99762 -30372 7225 14266 -74446 -136294 -96605 -56396 -10651 25977
24088 25977 28199 -70681 -130728 -87702 -100672 -79294 -110785 -189148 -170843 -149995 -115505 -167285
24076 -167285 -181051 -98839 -155180 -153156 -192626 -192534 -175530 -135098 -249407 -262702 -252066 -187030
24064 -187030 -152617 -92539 -167296 -251947 -211768 -83425 -98044 -52046 -39256 -1210 93072
24053 93072 66013 -39198 -71744 -33274 28042 17616 -139403 -146551 -96641 -30753 -78259
24042 -78259 -92946 -51618 37599 138935 234295 247541 204886 213173 99215 4337 3183 -33072
24030 -33072 -98584 -65718 144003 137731 68105 63466 56717 111087 193021 156696 88830 167873
24018 167873 151600 128821 17349 -46109 27151 131193 163162 40705 35780 48241 11025
24007 11025 -43341 -91243 -69081 66094 88466 -35216 -12741 99587 85036 46167 35539
23996 35539 31246 -24519 -27912 -102934 -119519 -46988 -19735 47045 104011 136622 83313 91094
23984 91094 98218 122205 160211 25656 -50239 -20295 47337 137958 178726 110012 56991 17436
23972 17436 59460 86199 5826 -50723 44578 75732 8558 -33564 -53475 -93842 -93342 -21772
23960 -21772 -107404 -95140 -22639 36117 91757 18990 -27376 34016 81285 74050 110846 124611
23948 124611 117148 77248 26941 6361 19419 78555 203025 75173 -28561 -105699 -118732
23937 -118732 -23529 25113 45896 72030 81844 140642 111291 -5461 -71915 -128835 -136476 -118416
23925 -118416 -3113 76076 28586 -32012 -17737 54787 28516 -65805 40094 102363 61514
23914 61514 -91098 21098 36032 61091 64869 52034 145188 130233 43027 57939 56087 -23974
23902 -23974 9235 8972 85190 74630 38737 2533 22534 6561 -70445 -125738 -163658 -136530
23890 -136530 -129577 -104778 -143099 -109542 -17126 29511 73082 93815 101873 103140 76650 -12645
23878 -12645 -78300 -119521 -36670 74690 102669 40714 54018 68262 -7565 1991 8667 8557
23866 8557 -47290 -21840 21331 -3182 -67082 -118283 -197059 -231949 -153484 -152318 -140467 -49314
23854 -49314 -29386 -122611 -182887 -128028 -167299 -187531 -91273 89501 148644 101167 7665
23843 7665 5969 90602 90894 6023 86689 214397 190094 51804 -114366 -110493 30284 62978
23831 62978 97989 10127 8940 -63445 -134524 -171566 -133137 -87014 -80075 -91104 -44904 -73059
23819 -73059 -117304 -162099 -141979 -69109 -52017 -4856 -81438 -173289 -150855 -64410 -8987 96699
23807 96699 104220 20592 -9770 -53069 -123523 -80885 -66550 -39003 -74997 -103777 9136 19958
23795 19958 -37077 18952 31320 26352 91853 79882 52968 69272 154852 215790 214708 128253
23783 128253 134313 147862 151641 95278 63209 128 94590 181215 191325 239713 161266 34787
23771 34787 -40228 11550 43572 128982 59994 73526 18945 -156640 -157839 -49174 -46281 -24879
23759 -24879 -128906 -239492 -227135 -283879 -222558 -135745 19867 17009 -67119 -30562 -11369
23748 -11369 16421 -9346 -34844 -45939 -45089 -72236 -12787 -27142 -92639 -72739 -47192 -101966
23736 -101966 -138398 -132417 -54601 37198 -62681 -170882 -77004 39069 95656 70158 -80334
23725 -80334 -138285 -131536 -133899 -84747 -111304 -68092 -39669 -25684 29702 -14726 -65856 -100166
23713 -100166 -94903 -113318 -96298 -116462 -145609 -207105 -164651 -75355 -27689 35106 15332 23782
23701 23782 81024 118387 111014 -11864 -98094 -176125 -88699 -126169 -121764 -85808 -36664 -44224
23689 -44224 -151110 -153211 -89797 -29798 -12720 -19567 -90035 -105740 15427 37973 68135 73562
23677 73562 80675 157661 190313 183946 125566 105784 56310 24474 70181 111812 180128 170497
23665 170497 60627 100654 41104 -40988 -36104 26827 -55312 -149898 -163631 -131030 -137558 -316516
23653 -316516 -259648 -131157 -78478 -20372 64389 -8123 236 -19923 7672 27338 -43746
23642 -43746 -132605 -120678 -73962 -67923 -10849 -55926 -49211 7733 13922 26218 29354 3342
23630 3342 -85059 -171950 -126950 3904 30613 40857 48969 152643 271610 313644 205317
23619 205317 -9956 -120257 -63335 -104243 -195370 -110911 -67523 -59990 -53394 -45116 45335 56811
23607 56811 60955 -55173 -24876 20390 -27708 -47619 -51973 3696 77815 121976 118256 49696
23595 49696 98469 53056 -35318 37931 122499 63899 102968 70483 58502 17216 74491 77238
23583 77238 29288 -84409 16536 102134 29852 -100484 -73470 65763 -3756 -2025 -11455
23572 -11455 73371 14236 -78259 -66792 -37466 8717 -26692 -29157 -37028 -15903 32668 -449
23560 -449 27250 97744 119753 116744 161650 183684 31611 -132359 -163709 -140936 -84929 -38184
23548 -38184 -118597 -288968 -249466 -59765 -71670 -135182 -79747 -73011 -55122 10979 15707 4786
23536 4786 34765 -50182 21202 29113 -68478 -44964 -24827 -53669 -33415 -121584 -167408 -172828
23524 -172828 -163910 -71920 13910 49158 23892 25409 -51156 -158046 -261268 -264087 -167774 -27670
23512 -27670 -38649 -139705 -111368 -96132 -148459 -75484 -12796 -40209 55270 107975 67688
23501 67688 4223 30947 72147 54095 34730 18513 115921 190737 154283 54541 -48783
23490 -48783 34321 84445 -24947 -4143 51791 88754 -2943 -40555 -46413 -3415 6122 26282
23478 26282 -31062 -58945 -71210 -50405 -16169 30848 45052 -34825 -35021 -86324 4069 100131
23466 100131 121809 26620 -13103 -135650 -109045 -54617 -90243 -66501 -49894 -113586 -135219
23455 -135219 -74419 -50414 -392 -17798 -2097 1532 20773 49416 84192 -32729 -51852
23444 -51852 78058 48347 70581 89428 66826 60355 24291 -123405 -139716 -114721 -110507 -159762
23432 -159762 -119368 -182446 -132618 -56304 -36182 -17835 -4682 -43603 -141141 -186844 -123877
23421 -123877 -75687 -42550 -95510 -171008 -148010 -84525 23791 94634 123948 190806 116494
23410 116494 4749 -51628 -54101 -99313 -25533 137969 102989 6632 41228 100717 27488
23399 27488 -15627 -32252 4700 123553 168612 131816 41938 83827 118650 -2823 -81111
23388 -81111 -46590 -45207 -60067 -87987 -131239 -142574 -149387 -90027 -910 117673 145464 148652
23376 148652 59152 64376 6693 53274 37066 777 -86281 -101955 16516 208654 31525
23365 31525 -36183 -110807 -109941 -97669 12345 49288 -57000 -81547 -197394 -237991 -175997
23354 -175997 -119075 -52849 16784 32869 -115303 -260228 -334923 -143372 -64069 -48299 -6688
23343 -6688 -107684 -15905 33555 23571 32289 -30644 -22875 -147249 -152071 -145400 -100213 -63279
23331 -63279 -153448 -209894 -283417 -193355 -62729 -80941 -161029 -129268 -31947 105870 156949
23320 156949 69650 35402 -19204 27032 -6153 -23186 -29700 -119176 -100809 -39522 65099
23309 65099 91258 54591 49532 93886 8573 -17165 59608 141255 80190 -31819 69343
23298 69343 -7730 -123921 -284587 -362807 -305367 -151071 -38388 -10578 -11906 -40404 -20458
23287 -20458 -42382 -116967 -86294 2294 5613 36530 97963 143153 176857 213915 189236 90160
23275 90160 -61389 -91578 -111699 -126419 -147881 -157591 -29028 62937 39253 56676 196539
23264 196539 280890 241434 107676 42944 -79611 -108584 -111886 -109873 -27771 -130448 -104559
23253 -104559 -168972 -118253 104605 177139 111714 101063 17528 3097 32485 55050 43445
23242 43445 -62030 -122338 -79517 -86848 -71504 -115437 -112091 -65536 -60921 -88532 -97106 2160
23230 2160 84704 403 -50772 -37865 15252 43681 51766 3308 -9323 -4248 -4618 47409 69404
23217 69404 65701 163972 229271 101980 73671 45494 62781 108389 145328 176086 113632 -6122
23205 -6122 -22177 -3158 -23658 -54521 -4952 -62461 25513 81742 -35527 -68991 -81524 -92649
23193 -92649 -14124 35808 40507 72927 38115 66801 -6424 -12948 -2164 16543 6331 65357
23181 65357 34364 -51048 -35242 -89407 -61296 -6709 40807 48962 12423 -17135 -60117 23158
23169 23158 80174 73912 -27611 12531 66834 30097 20044 -32682 -100458 -75084 -100135 -104965
23157 -104965 -24768 -1113 -58603 -122684 -214733 -174250 -25333 82017 41901 -93780 -145996
23146 -145996 -134132 -73854 -57354 16647 37114 20919 -80990 -106652 -104859 -160802 -234130
23135 -234130 -215053 -119292 -95885 -39019 -21054 -71543 -22327 27597 16309 -70306 7358
23124 7358 -2602 -29354 -51363 -65042 15568 111930 43445 -38937 -116511 20949 96138 81955
23112 81955 107046 58646 95192 29969 24912 16676 -10148 -128403 -66589 -39213 -71069 -51686
23100 -51686 37118 69507 83047 24257 16341 -21559 58879 95985 27532 -95919 -133030 -119153
23088 -119153 -14671 30997 -32591 -8398 -50354 -29931 -31206 -101875 -99478 -55283 -81744 -200148
23076 -200148 -183607 -122280 -90426 -95451 -87298 -84904 -51337 -114257 -177345 -64611 -14090 7567
23064 7567 148088 133158 35542 34973 56785 128748 22139 -28203 57882 68309 -58466 -171416
23052 -171416 -178407 -208027 -110534 -92239 -90317 -200244 -121644 837 7668 56919 -2398 -37006
23040 -37006 -63256 -125184 -202049 -21145 24645 9636 7997 -24727 -66622 -88020 -51404 8966
23028 8966 34294 39221 87204 96385 94269 48003 42363 -18709 76297 99363 -2305 -77274
23016 -77274 -165380 -127375 -135793 -206233 -284105 -220953 -181545 -207779 -134616 -113491 -148262 -167998
23004 -167998 -78940 -38556 -72256 -81448 12713 47211 -4204 -154 3854 -123447 -135317 -182407
22992 -182407 -170996 -36109 -34637 -26813 3224 -12260 -53233 -78707 -20909 -74487 -144400 -299935
22980 -299935 -305255 -200897 -83067 -92639 -160447 -94296 -37053 -9704 -46520 -32091 82060
22969 82060 103278 45350 30587 -37788 -150311 -164087 -111703 -93897 -78892 -66941 28331
22958 28331 181623 169492 156906 140089 20331 -94374 -102002 -26952 -29356 -38314 -43754 -14894
22946 -14894 -13511 -59928 -72582 -103065 659 7521 -37421 -36169 47526 58872 47363 -54904
22934 -54904 -183641 -186835 -191246 -189931 -146704 -29583 -33309 -168945 -175020 -88861 -89372 -122190
22922 -122190 -108689 -88411 2389 47411 97591 104241 48138 8710 10326 11229 -46590 -60321
22910 -60321 21952 115115 88600 114297 50787 69740 59345 96934 107682 88872 137130 107708
22898 107708 87334 39744 82022 77190 -6053 -121578 -55574 67923 80776 170935 137320
22887 137320 111961 125454 113839 31356 -65601 -48357 -101423 -167909 -89180 -21258 45568
22876 45568 54827 59362 85911 148620 79045 -31407 -37073 -21659 -55091 -31522 22101 6114
22864 6114 93881 22087 -53950 -74154 8447 42226 22185 58077 114479 17813 -95058 -36181
22852 -36181 -98544 -209621 -165071 -12944 -9337 -56850 -20395 -8629 1908 53554 21229
22841 21229 -46643 -55855 -49057 -18239 -16642 -1793 94508 126718 201264 178012 76944 -42434
22829 -42434 23068 30469 50552 14134 -22710 -56705 -167965 -169733 -121726 -210163 -216599 -173737
22817 -173737 -176606 -109955 -102400 -122657 -113831 -61954 -5071 -22422 -37385 -20567 -14403 45795
22805 45795 62880 38309 115983 116343 95311 -17845 -91707 1675 58788 25406 58778 119940
22793 119940 79486 -20362 6696 -25631 -16479 -41973 -106655 47958 75525 38128 91018
22782 91018 -38406 -100740 -14996 -51575 -180429 -198420 -114445 -49176 11911 60246 108548
22771 108548 83891 28358 28956 97690 97055 87801 86269 71743 41083 -22156 -97386 -129392 -61428
22758 -61428 -101393 -147516 -206838 -265355 -107374 -21017 -49945 -93450 -56215 -126326 -208202
22747 -208202 -242614 -108660 21919 39479 63760 38536 72404 -9740 -887 99384 150433
22736 150433 51281 49941 76775 27483 -86024 -83997 -152537 -118930 -49944 -5048 -6353 -13164
22724 -13164 -19436 51390 8178 -108747 -81599 -109770 -156938 -105072 -124211 -113777 -45046 -81103
22712 -81103 -17864 77309 -5870 -80600 -49363 -66792 -136575 -264913 -187497 -1600 54016
22701 54016 -117942 -222043 -93808 -82903 -73303 5816 64663 109109 106996 88505 106011
22690 106011 178396 223069 229268 88116 5680 103642 119478 73715 -13718 -42769 -18116
22679 -18116 57416 125381 122720 71677 45442 34794 -43831 -41249 -68086 -40434 24744 58480
22667 58480 106413 102820 88575 -43704 -103712 -51897 -129960 -202118 -104542 -72563 -104843 -173231
22655 -173231 -75723 -74271 -75723 -12300 -20179 -56596 24689 175065 70878 -82345 -111398
22644 -111398 -26914 -816 -79488 -177539 -55825 -11805 -37230 -39960 645 22876 10434
22633 10434 -15143 -9468 -74726 -39457 3766 5475 -57002 -152389 17258 -73151 -95929 -69839
22621 -69839 -89768 -172173 -186244 -129701 -59563 -52102 39917 99086 102201 115393 57187 110752
22609 110752 168739 165623 73793 -21550 68257 91322 -46631 -44805 -6048 61685 74670 93506
22597 93506 125701 96615 76379 34304 19203 -28647 -2458 -14505 -40365 -49054 -52632 -69948
22585 -69948 -155632 -95324 -127815 -155266 -113642 -63587 -37375 -97400 -113305 -81758 -6252 20903
22573 20903 -12960 21971 -29689 -5825 53476 16976 -21422 -16278 -54050 -68265 -71194 -147302
22561 -147302 -235338 -157637 2768 43611 105806 135455 135659 116885 -12430 -92296 -123875
22550 -123875 -101112 17138 53717 2668 -83234 -72081 -99330 -123505 -31123 -70196 -52203
22539 -52203 7382 -51747 -66191 37200 2322 -58138 11057 -37013 -104080 -125051 -164695
22528 -164695 -261967 -250609 -111219 -32054 -28721 15262 -93427 -127134 -90682 -43722 97194
22517 97194 51188 -6457 -37265 -52387 -57561 30418 -76874 -46584 -18416 -22790 -43277 -106860
22505 -106860 -75647 -110236 -42626 -31753 -112528 -108270 -30177 -67241 -116915 -106379 17023
22494 17023 64837 -87696 -95253 -6986 -67372 -155552 -178917 -123719 -61021 -97364 -102231 -110934
22482 -110934 7575 29378 41157 -22070 -140248 -154535 -106518 -7803 -29346 -64090 -36148
22471 -36148 97855 119415 95066 14108 -91319 -160862 -115018 20477 26021 -32203 -29085
22460 -29085 176938 308493 295208 233286 183449 89544 24320 -61914 -79283 85768 40014
22449 40014 -31189 -35469 -79472 -121894 -82536 28863 59585 -110521 -79708 35743 -22415
22438 -22415 -15148 32688 21362 -3776 -50726 -62051 -33611 -89387 -30596 113889 181133 111949
22426 111949 88756 87088 63855 48505 594 64778 169117 113128 -2474 -82933 -149141
22415 -149141 -136226 -108654 -121767 -53843 30928 68432 4385 -6005 -81421 -196380 -76678
22404 -76678 50367 29163 -24119 7510 -34461 -76615 -53581 -48433 -48421 -90542 -120244 -153643
22392 -153643 -107266 45810 175973 270285 337676 389765 342243 183378 -40207 -98451 -58710
22381 -58710 -42576 -26957 25410 89194 46216 39043 55218 108423 29065 24107 59005 -54794
22369 -54794 -58652 -25517 -39116 2049 142430 105417 -12724 -13893 120040 175125 230086
22358 230086 168079 127374 13335 -33150 -61860 -123089 -121322 -130761 -142844 -118519 -175717 -205982
22346 -205982 -140810 -125095 -108180 -133027 -144475 -141991 -125701 -96254 -45273 26632 27813 -63762
22334 -63762 -114092 -103453 -75477 -114874 -181680 -187724 -125563 -184325 -232607 -216328 -234329 -288479
22322 -288479 -171663 -67301 -23156 47244 50274 34390 -24676 -38727 57573 17119 69181
22311 69181 97409 104902 87854 56303 5870 -15148 97972 7865 17316 86503 83337 29999
22299 29999 16664 -11775 -14593 62088 1171 16975 95868 104881 73632 49091 74696 68295
22287 68295 53133 111023 157430 144407 28158 102128 125184 21730 -2425 -21739 -64016
22276 -64016 -121184 -90705 -22798 96446 146718 171823 115228 82267 -18967 -109629 -162703
22265 -162703 -206523 -237150 -198774 -124327 -89798 -139268 -179125 -157285 -99334 -113899 -88130
22254 -88130 -28283 49535 16788 5328 -10138 -137584 -195740 -141610 -72590 -62366 -51585
22243 -51585 -31120 79870 88721 86537 55138 -27241 -85859 -160625 -168017 -45014 47655 22102
22231 22102 -44423 14673 -69457 -103054 -87416 -95523 -47143 -13537 -22128 17570 -19171 -73307
22219 -73307 -59899 2270 5512 -121646 -145500 -135112 -69978 -91665 -106718 -156067 -141760 -99091
22207 -99091 -157744 -154390 -142295 -209662 -151661 -30484 -135442 -231020 -204762 -135688 -21925
22196 -21925 80438 73082 84631 13226 -135460 -112027 -34758 36247 -34021 -135326 -174468
22185 -174468 -136620 -181535 -161953 -68867 -53269 1461 34639 46939 -16162 -49231 129100
22174 129100 176046 79290 -113289 -223774 -186977 -186941 -168558 -143944 -173929 -76342 21618 67883
22162 67883 69075 40581 -56318 -39318 27113 -54404 -96057 -115333 -209185 -270063 -270375 -262837
22150 -262837 -171539 -40642 -13909 -3590 15161 -28362 -47336 -85406 -44033 55439 23821
22139 23821 -6393 -98010 49306 104729 62498 87361 40527 -40663 -93749 32056 80415
22128 80415 70827 77452 -18136 -46530 -32556 35404 -7361 -47796 -7111 -28090 3090 -83949
22116 -83949 -88293 -74868 -148272 -211941 -212057 -69186 81274 122893 36100 -122681 -227074
22105 -227074 -189614 -207647 -134166 -67390 -36681 -32814 -20529 9416 -62570 -85045 6976 -65248
22093 -65248 -117961 -40998 -107759 -141164 -103357 -149168 -42207 83824 51006 -102269 -108902
22082 -108902 -186851 -222423 -140331 -172439 -205525 -153843 -66321 45643 -21148 66407 149070
22071 149070 102164 135334 109201 27869 -20483 -39826 -41576 -120564 -175876 -214817 -174985 70271
22059 70271 -17292 -72738 -41683 53066 18732 -41411 -23252 -74065 -149033 -110586 -81737 -31958
22047 -31958 -136222 -197847 -147976 -31443 138197 103789 28157 64381 43298 12715 -39746
22036 -39746 -72679 -28001 36066 36561 -8955 -103573 -177441 -147365 -103214 -90781 -62844 -42919
22024 -42919 17479 72567 68223 48216 82110 31273 -1929 78677 66217 -2048 -46037 -59147
22012 -59147 -88996 -25917 -50008 -57833 46972 73601 85357 106979 122937 126553 36399 -75135
22000 -75135 3340 20861 66 -72000 -80222 -83439 -121969 -117801 -72426 -11839 -11432 44657 75600
21987 75600 15105 86274 135518 68493 67842 8790 -13064 45051 46616 -26710 -87343 -100942
21975 -100942 -86008 -153986 -190033 -120939 -33803 -89534 -56341 -21788 -134326 -241371 -209376
21964 -209376 -6717 182870 213464 268402 240868 82263 124062 -7283 -41874 -109884 -154880
21953 -154880 -2893 171687 209441 107254 15656 -104863 -16061 108164 78652 68368
21943 68368 116292 28010 78854 156094 89760 33393 59145 38426 37933 100659 59995 13342
21931 13342 -99832 -57135 15262 55095 40453 -32081 -52673 -148499 -64787 79687 89744
21920 89744 77482 37802 48863 73275 -31054 -111433 -94435 -142416 -98022 -54078 -79548
21909 -79548 -53944 -31733 -83699 -225694 -257371 -250779 -278163 -238002 -183870 -133151 -12338
21898 -12338 2480 -40348 -77904 -146471 -240768 -241740 -170059 -104859 -150026 -210945 -220427 -199662
21886 -199662 -47982 6867 -112869 -247738 -183173 -124519 -48212 -79915 -81891 -9295 41023
21875 41023 -52100 57130 60888 -20974 -131323 -162283 -64402 23700 156848 151958 -35576
21864 -35576 -45294 15625 52878 50172 106698 28559 151 149408 129718 55795 62716 -22958
21852 -22958 20155 -42912 -75537 -160572 -120256 -36406 -6515 22342 -58525 -161010 -184065
21841 -184065 -163918 -98552 -49652 -36829 -50060 -35922 16472 39370 51864 39814 32828 -14559
21829 -14559 -2736 7667 35827 111051 92181 -17454 -168561 -94795 -37118 -1084 125
21818 125 61607 90725 31858 137453 115577 107423 153836 82419 -9945 -101388 -219514 -234587
21806 -234587 -154936 -37640 17174 -20467 -80295 -103872 -104818 -150790 -78734 -54166 -30784 -97005
21794 -97005 -34902 11778 29863 32030 62241 82474 104482 35904 45467 5170 21126 54557
21782 54557 11609 39378 -24846 -88650 -72394 46972 65689 13319 -60658 -121272 -75548
21771 -75548 -20283 15024 70397 77250 3613 -49279 -73402 -156422 -200623 -122199 -121854 -125308
21759 -125308 -1658 13681 -60646 -96033 -136798 -134504 -116698 -146239 -159871 -138528 -67328
21748 -67328 -68354 -105758 -135158 37720 59696 67325 -44784 -154893 -100576 -34398 80019
21737 80019 53382 122402 23038 -97939 -114604 -42456 7496 -17886 -76187 -24788 -48542
21726 -48542 -53455 74146 118043 85857 -94646 -78863 -7361 -78024 -179327 -197441 -120839
21715 -120839 -66373 -25319 -41949 -177217 -323744 -329182 -245532 -133723 -19466 46776 -103455
21704 -103455 -30659 95755 118887 57426 -32816 18230 -39039 -18335 14982 -145267 -242589
21693 -242589 -222320 -147358 -123502 -156148 -71646 47216 62820 32777 73070 -21491 -45714
21682 -45714 28562 -50171 -113037 -81583 -51657 -84350 -117611 -85130 -14503 0 -31754 -34706
21670 -34706 -81080 -56798 17282 -80603 -80638 33628 -6435 -51359 -51489 -122463 -110538 -96353
21658 -96353 -169830 -234234 -226796 -261130 -233429 -150169 -91377 -55615 36542 43347 648 13395
21646 13395 -2302 -37478 -2178 -2229 54624 183061 203779 65623 -39340 -54926 -120228 -181527
21634 -181527 -105839 -75648 2854 23669 67090 84125 92475 177728 218484 144723 96997 103559
21622 103559 59838 131366 185371 202295 204647 204977 194102 186875 134968 -55581 -110058 -22199
21610 -22199 11613 21981 40659 76909 95416 65492 51103 17546 -55325 -134827 -101847 -9606
21598 -9606 -4238 22363 -17167 -113910 -97647 -110010 -174709 -217284 -170831 -97144 -80124 -129372
21586 -129372 -287270 -250893 -114434 -32396 40510 149431 139120 39459 -51362 -23069 18433
21575 18433 -40943 -83845 -124231 -68505 16742 47592 -42024 -73612 -142167 -49996 -5249 -98689
21563 -98689 -37970 1330 40070 81000 33621 47862 -41384 -155421 -176299 -147924 -93756
21552 -93756 -117391 -50650 -68924 -60537 -125062 -195794 -138042 -107018 -211141 -219479 -106813 -79938
21540 -79938 -117361 -89244 -72083 -141742 -163398 -172627 -106580 -25565 55251 79130 14488 31254
21528 31254 29181 89101 41520 30315 131300 56624 -91997 -121760 -161380 -152484 -101437 -29533
21516 -29533 -98566 -66933 -48944 -84167 -72470 6010 -60354 -130572 -122381 -176782 -180325 -139439
21504 -139439 -171348 -129713 -141626 -136461 -99566 -71557 -32289 -30689 -857 45882 104910 85190
21492 85190 42090 -48026 -164265 -206612 -107330 -19214 209 -25928 -22388 26714 109601 144481
21480 144481 112507 156016 205096 289834 111814 -71144 -154471 -112036 -43020 21287 13770
21469 13770 -14032 -157898 -114812 524 39868 -108305 -132000 -61041 -24328 -13350 5565
21458 5565 9948 6507 10597 -8059 118148 118865 8832 14890 30349 -77130 -170335 -200581
21446 -200581 -180704 -60209 19959 78032 10214 -111938 -211714 -188925 -119758 -49585 -30674
21435 -30674 -46710 -122806 -6783 -7842 -50221 -53038 -80362 -126274 -91966 2008 -22434 16857
21423 16857 62583 26443 -58714 -170307 -153238 -126470 -111927 -90624 -114370 -130701 -145463
21412 -145463 -35903 31759 -99457 -139867 -130481 -40677 -42690 -40317 -61739 -147230 -120285 -120830
21400 -120830 -128228 -121167 -99532 -44658 -48272 -107483 -182206 -133905 5338 34926 -8806 -82304
21388 -82304 -129263 24965 98210 103892 129629 187983 235005 115682 -32770 -101270 -84840
21377 -84840 -120878 -79423 -53149 -28014 -42518 -40221 28626 53313 -7024 13416 69460 16760
21365 16760 -25281 -33094 -51122 6584 95669 79156 32431 8707 105908 144722 108877 196174
21353 196174 140176 134263 97138 53617 -35796 -70601 -33574 -45988 -145636 -116226 -22649 -116580
21341 -116580 -239387 -361422 -404372 -276378 -185064 813 78260 16618 -115349 -95285
21331 -95285 -45446 -70076 74745 102713 -11207 -132313 -238750 -95726 74251 114416
21321 114416 -4829 -58574 -132390 -139361 -10694 19630 43965 71832 84246 37566 13499
21310 13499 108030 100758 46006 -14188 -121714 -134006 -42953 84795 139117 110917 72661
21299 72661 -9640 -24120 67192 103024 75441 117368 21040 61665 109090 105749 70007 15738
21287 15738 -91707 -97698 9502 -11895 -61298 -33614 24182 56436 -61728 -188101 -163126
21276 -163126 -129626 -118566 -79196 -66631 -93861 -58098 -23910 53420 47513 83968 42529 63709
21264 63709 59556 -102349 -149013 -162352 -240758 -277689 -182315 586 -15848 -144596 -125138
21253 -125138 -87775 -123521 -159192 -104117 37507 13922 -105832 -21380 -24138 -25812 -6525
21242 -6525 -18172 -29293 68694 164543 71981 -28622 -127252 -249196 -290483 -151581 -98144
21231 -98144 -87655 -18314 37957 -25145 50199 -62272 -161755 -113528 -2865 30234 46558
21220 46558 47159 -23190 -36245 -88346 -5255 120507 224376 134148 -17632 -31580 34473
21209 34473 126578 110091 34372 -50749 -116594 -88424 -70242 -98831 -54091 -38403 -113886 -158760
21197 -158760 -104003 -118871 -40057 37518 44356 -51973 -67674 -57779 -153423 -163314 -67706 -77431
21185 -77431 -71066 10997 -967 -26329 20684 8839 15978 -31500 -172996 -206426 -172297 -118347
21173 -118347 -78603 -109739 -188351 -222831 -99628 -130025 -89457 -63053 -16526 -4871 -64070
21162 -64070 -68786 -178172 -185423 -139946 -103045 -141321 -100734 17704 76486 24875 65246 119297
21150 119297 37072 -1303 -102354 -197507 -165538 -194861 -277919 -277952 -264169 -186737 -230494 -148296
21138 -148296 -57821 21872 -31361 18498 65189 -63197 -166083 -190912 -203576 -184161 -120222
21127 -120222 -68214 -8689 -60945 -187361 -266316 -271363 -206615 -97782 -49214 -102106 -29027
21116 -29027 1082 33413 59488 18136 -23002 -94259 -75202 -118170 -272371 -214169 -210469 -217316
21104 -217316 -70610 73271 -55297 -107852 41846 181265 39945 -108981 -88937 73788
21094 73788 188989 147313 148603 79690 84250 74805 -46518 -53834 -34116 12490 27622 -53147
21082 -53147 -29367 -18229 -87022 -60203 -8895 -36785 -88798 -110635 -183906 -188399 -174114 -79945
21070 -79945 -15002 -49532 -92082 -52084 -11813 91570 65616 16141 24073 48728 48184 19009
21058 19009 37315 1899 32120 74873 95715 137388 180675 117261 84204 60781 -10169 -26943
21046 -26943 11846 -12241 -96382 -102726 -62638 -20926 -38398 12986 50078 73485 40898 73037
21034 73037 51504 -30813 -86303 -143973 -181324 -168843 -169092 -85383 -55457 -74111 -119816 -164107
21022 -164107 -190575 -146131 -146614 -210533 -185436 -82464 -34773 -73551 -79968 -53491 69701 60247
21010 60247 24989 50628 115365 24182 -62530 -28063 -109636 -238455 -67018 -55293 -63159
20999 -63159 -128993 -216194 -335678 -324111 -264676 -190295 -94056 -11055 -38916 -138205 -100616
20988 -100616 -84750 -36379 -13062 106868 207844 182202 149130 84120 100786 127140 18653
20977 18653 -24387 -32124 72904 94081 133871 121774 -29204 21148 33535 -109520 -161433
20966 -161433 -186323 -281068 -226779 -112755 -68310 -191983 -113271 -61495 -91894 -156361 -181496
20955 -181496 -173811 -113805 -81957 -116926 -106996 -19425 -10251 -61805 -11193 -11589 -64069 -61016 -9717
20942 -9717 -887 -29307 -61658 -128152 -215106 -233092 -134546 -112677 -156435 -128340 -77441 -82992
20930 -82992 -31614 -40755 -102796 -193400 -195301 -199242 -99092 -42550 -87869 -163624 -156707 -187769
20918 -187769 -166036 -116489 -61765 -158959 -218340 -293459 -325242 -284209 -295128 -224175 -144170
20907 -144170 -45047 -935 -3695 -69628 -89595 -24793 13494 -49332 -100728 88416 167105
20896 167105 86692 -60462 -104302 -68043 -90098 -182720 -200057 -122971 -57780 59294 104793
20885 104793 22588 -69481 -231560 -226741 -127048 -90964 -52743 44312 77639 53017 -8389
20874 -8389 -13737 -30323 -74256 33207 135515 202462 154934 99479 106392 131387 144206 220566
20862 220566 174174 75490 78980 132940 169350 151722 99065 175272 71065 -40760 -78989
20851 -78989 -81769 -50648 -68671 -100919 -24084 94039 116404 77208 78999 126812 184320 115273
20839 115273 -50692 -106371 -112534 -68005 -98760 -36982 -31422 -14001 -14693 -36103 18876 43591
20827 43591 9116 -40388 4755 74898 120480 191311 206752 164815 203191 138298 -14712
20816 -14712 -29285 -14795 56483 16499 -47327 -40943 -82108 -94229 -84131 21993 65264 9925
20804 9925 -72307 -57837 -56073 -25777 39454 43104 -11953 -7490 43920 -24991 -104182 4648
20792 4648 7174 -84989 -161254 -123491 -73974 70801 -90376 -165174 -82247 -67620 -96782 -218080
20780 -218080 -291499 -259935 -163299 -47894 -59135 -111098 -161895 -96738 -127712 -119888 -55147
20769 -55147 39480 104516 -45559 -156711 -255548 -206702 -193414 -180916 -162160 -133799 -127523
20758 -127523 -105020 -27082 -48660 -86238 -105655 -166652 -195681 -200015 -192866 -131242 -58680 16351
20746 16351 -64555 -184441 -130188 -79411 -118808 -48234 -68536 -118336 14518 96153 87036
20735 87036 115221 155437 115332 132045 75520 111437 66769 -44468 -87702 -45682 -131341
20724 -131341 -136626 -79531 -148652 -120054 -64422 -8157 -83632 -118618 -85370 -57717 -78614 -117690
20712 -117690 -36742 10298 -33924 -46323 -83620 -58337 -24300 -15818 41769 26901 30304 163888
20700 163888 120865 35829 12428 31639 87511 78767 968 49610 58140 -19335 -42375 -60410
20688 -60410 -777 120547 128388 -9821 -118936 -95352 -44453 -63463 -82387 -66486 -73713
20677 -73713 -48990 11237 -71916 -81315 28548 -36006 -100590 -129742 -107693 -78272 -73286 -29101
20665 -29101 -101582 -121339 -49336 13499 -10121 13403 -16745 -18265 -52013 -150827 -231071 -182917
20653 -182917 -51347 -108272 -147702 9474 79159 97872 199333 143797 22990 -171 38567
20642 38567 81947 55420 -6685 -44283 51500 245771 266264 191839 47313 -64728 -64664 49500
20630 49500 114667 53267 -2987 146 30540 -4367 70387 155245 -42707 -175931 -197277
20619 -197277 -118570 -81175 27606 -8276 -75886 -33071 -17716 -27161 -83079 -31424 72609
20608 72609 69751 74331 42300 57756 84835 73951 22219 49993 28943 39593 113559 187604
20596 187604 261331 170512 94558 -8483 -136856 -190624 -134970 -187824 -126146 34623 9433
20585 9433 -23762 -39776 75537 11667 -72941 -114424 -57343 13804 74343 85288 16147 59893
20573 59893 26156 -75554 -69382 -57367 9401 136076 254690 216019 176763 126638 16359
20562 16359 25152 78789 35993 -59870 -101925 -162321 -112895 14368 -6165 -83743 -49424 -139238
20550 -139238 -103003 -26282 -65824 5777 -22222 -110743 -123251 -18839 51393 6446 41317
20539 41317 141517 218118 140764 -31587 -98785 -158957 3446 176601 70177 -63386
20529 -63386 -141494 -205309 -146454 -45205 25376 17021 72659 75916 149722 107068 -63603 -74122
20517 -74122 -2170 -8657 -43141 -36435 -32126 -19385 142874 94737 132688 92521 62119 -99201
20505 -99201 -190373 -213795 -137170 -104319 -90152 83222 203604 81403 -30011 -27199 48439
20494 48439 4163 -95124 -86288 -145227 -119130 -110578 -87129 21893 49362 48693 -89064 -145470
20482 -145470 -82880 -44990 -31636 34648 125666 138850 36047 73774 37757 32313 66802
20471 66802 81169 -12900 13866 -59207 -35401 11915 -54336 -52860 -63210 -64275 -103758 -22766
20459 -22766 -39687 -41669 -54903 -40133 -10781 -17421 9079 -17981 -94149 -160818 -120067 8823
20447 8823 54843 -28268 2060 7579 757 -35321 -68487 -88999 -93009 -36439 -32222 -13487 49326
20434 49326 -64775 -9139 -23672 -97362 -137907 -109377 18020 9934 -59702 -140418 -184187
20423 -184187 -48150 -55662 -192004 -111337 -3040 71101 111902 94742 -359 -430 20764 51775
20411 51775 94680 145063 76711 33499 7058 -34743 -97080 -65481 -49079 -35784 -55298 -35864
20399 -35864 -42558 -21202 12128 37599 -69770 -169035 -180650 -262713 -281800 -216125 -199659 -192407
20387 -192407 -123763 -71768 -73677 -118923 -102425 -108270 -34759 -16995 56162 66715 -175 -31239
20375 -31239 -7659 8336 -12156 -18371 26931 24479 18131 20758 97760 209432 151909 25416
20363 25416 -126816 -156911 -112818 -32766 -7487 34912 37584 -7654 -19424 -27917 -136089 -250743
20351 -250743 -201058 -161942 -230510 -184587 -170601 -117739 -101034 -110581 -164648 -76547 -31286 -46614
20339 -46614 -108569 -76471 -45219 -52919 11245 -20589 -58308 -14654 48956 109055 55835 -27401
20327 -27401 -20908 -14882 -9647 44938 -11080 -109754 -105716 -84016 -34423 50840 90348 63052
20315 63052 89692 177180 184792 153983 80177 97848 77888 -54885 -178834 -161788 -183651
20304 -183651 -149359 -142824 -113084 52904 186637 93191 12497 115691 120265 32842 -3474
20293 -3474 -30362 26545 54876 8701 -35297 2577 115577 42601 -71696 -1767 74323
20282 74323 58474 -59816 -34672 -54787 -57053 -107673 -191990 -173715 -107228 -181734 -182386 -93138
20270 -93138 39244 159830 137122 75221 84417 103165 16875 -5542 46957 29702 -331
20259 -331 -32133 -25612 74116 85739 50886 74276 -95559 -218403 -75925 -49282 53231
20248 53231 41159 -43486 -75425 -47592 -68982 63185 95860 89931 -25523 -45336 -74506
20237 -74506 -87050 -57925 -13535 -94616 -144586 -37724 -23530 -3934 -259 -62936 -54721 42759
20225 42759 28246 63688 82845 32169 -57698 -232804 -161658 -16664 -49889 -4168 130271
20214 130271 116303 27029 -41312 -163774 -183264 -162881 -37487 46414 38919 52810 -20447
20203 -20447 -67391 -147633 -70764 -7507 -14571 -14899 -108579 -141934 -55548 -61335 -44070 -9599
20191 -9599 -76990 -124880 -221051 -129140 -150971 -253992 -238289 -110677 -127187 -193572 -293119
20180 -293119 -244052 -154334 -104382 -108569 -93684 -63987 -32757 44699 -16806 -84069 -120746 -136087
20168 -136087 -209375 -294629 -185740 -149397 -143109 -64041 -8338 -61498 -195842 -234461 -167049
20157 -167049 -81682 -98184 -61174 -20987 8836 -70160 -74502 -108653 -94452 -66471 -90004 -129610
20145 -129610 -123782 -11030 50517 93020 163219 175205 184610 117023 -611 16792 28619
20134 28619 28985 121137 209562 198050 153845 118918 104708 110154 89454 61775 97934 -11072
20122 -11072 -137890 -41994 121288 232802 164627 -1354 -135194 -149842 -126338 -68578 37942
20111 37942 66377 80522 82626 18359 -44363 -139689 -222641 -235467 -112677 30792 15743
20100 15743 -5373 -27479 85894 99721 -3519 -37602 -24463 -48631 -40514 -2362 25294
20089 25294 22324 -5882 -34502 -65226 -76107 -65453 -98503 -77582 -85557 -37878 -8218 -12220
20077 -12220 -162420 -267122 -245796 -20461 43914 51000 42003 -4022 -70876 8771 -34664
20066 -34664 -87967 -88813 -129889 -80784 17043 86355 135741 95105 28990 -1224 -24224 -1294
20054 -1294 -32306 5289 34401 86803 -53893 41913 94208 39892 13458 21624 35463 -19880
20042 -19880 10533 103996 142870 87782 61273 -27268 -70958 -18879 -83633 -91715 -89715 -76391
20030 -76391 -101321 -168212 -107947 -15686 -59891 -100642 -140263 -79179 -67130 -40194 -26732 -74393
20018 -74393 44699 -17825 -83069 -147797 -106213 -18126 3132 10016 -11940 32513 48145 -53003
20006 -53003 -140496 -225875 -242837 -208635 -100667 -44391 -61055 -86707 -88363 -85793 -59882 -97019
19994 -97019 -39168 -70434 -47240 36307 138 74249 90739 22167 -43793 -19748 49626 95306
19982 95306 91236 100853 46915 -64516 -93695 -36482 26234 72820 60949 43919 9959 17984
19970 17984 -46958 23472 129609 -31313 -117558 -93496 -127459 -55683 126960 93659 102482
19959 102482 123046 141846 181958 238665 230008 264814 261828 208996 246770 257584 133382 105486
19947 105486 54301 -68389 -28657 55534 72965 158372 293269 269805 116648 447 45697
19936 45697 86598 14826 -99671 -151811 -98730 -104573 -137300 -102133 -99694 -7979 -25012 -8598
19924 -8598 -32477 -5331 48125 99740 72084 -23004 65975 -12971 -89852 13535 67985 17189
19912 17189 -80989 -193486 -217484 -105310 -73158 -24161 -38832 -55442 -105015 -76616 -29214
19901 -29214 92453 -6782 -138506 -56282 -24150 -50108 -99089 -178493 -203758 -108406 -40674
19890 -40674 -40655 -5302 107002 211556 136673 97072 -29778 -105418 -30269 -22903 42819 68560
19878 68560 36058 9135 -98239 -24790 26092 -1190 17931 84429 45908 72201 86695
19867 86695 47453 -36460 -166416 -226494 -115717 -70666 -104063 -41530 54715 42042 92754
19856 92754 141397 44815 -73058 -80908 -92137 -120011 -57702 24221 -38542 -115091 -69867 1009
19844 1009 85469 81725 66811 69861 88492 131499 93923 120558 124040 116054 168061 70671 -47488
19831 -47488 -68130 15916 105075 192157 177967 115612 45773 81164 129697 208585 91958
19820 91958 26659 17380 16060 5685 16362 -2747 100833 114366 129872 124099 78440 -58759
19808 -58759 -178261 -91230 -52347 -81279 -53186 -1129 13693 -31626 16287 46117 3489
19797 3489 -2270 1644 -25768 -157122 -201632 -139426 -66126 -223559 -247929 -204119 -206522 -207545
19785 -207545 -137666 -130023 -180194 -128540 -30126 54172 55813 -5550 63218 46243 -49820 -57045
19773 -57045 -31880 -11987 34516 52750 61925 100002 67206 -139604 -75598 -53488 -2470 -58763
19761 -58763 -60331 -61626 -144899 -262789 -247811 -135887 -86290 -19834 -55471 -100175 -78212 -50018
19749 -50018 -108683 -241294 -231096 -193317 -136201 -16303 6745 -8255 32264 -50269 -162851
19738 -162851 -160734 -189437 -120800 -104648 -125646 -156047 -233687 -132437 -2127 41824 125586
19727 125586 106340 120841 80439 79221 55094 19259 25023 -86108 -64041 49064 130115
19716 130115 107267 26910 86985 143640 206341 138556 73539 59391 97538 92359 -41607
19705 -41607 -80539 -60430 -62906 -72993 -2392 41922 19652 -16875 12090 51863 45825 -72439
19693 -72439 -37357 -15964 -48612 -68772 -45087 26770 75234 43934 -52377 -123066 -72836 8293
19681 8293 42913 -46611 -49528 21751 87427 32792 -119581 -118024 -38442 -36399 -63781 -8465
19669 -8465 -17780 -48849 -74499 -64716 -25665 -40795 -62924 -112484 -74915 -64188 -43166 -14781
19657 -14781 30572 125513 14191 -41840 13929 -15747 -43325 -67262 8958 -61029 -216027
19646 -216027 -346513 -268521 -42345 78479 123280 179516 166693 131961 75894 -21212 11102
19635 11102 -148747 -214095 3431 119211 106079 78945 47460 36297 75338 122592 109084
19624 109084 63230 154004 106490 -28566 -40349 -55591 -86536 -87755 -75125 -122687 -130484 -153144
19612 -153144 -106043 50270 78066 22836 -68465 -87215 -48340 -100466 -195499 -105050 -35669
19601 -35669 -39585 -59193 -12705 -48806 28643 -892 -32110 -75589 -58470 -72485 -8330 113273
19589 113273 171985 75151 -21398 -63442 -141242 -71845 30475 4307 -27128 -66360 -87624
19578 -87624 -108065 -78596 -39427 66954 191840 209049 203591 151795 96619 -12202 53611
19567 53611 189108 131258 14939 13179 125510 84933 149561 189193 165752 152141 89294
19556 89294 88267 130145 70284 54636 71188 67914 76788 46416 -48 -37043 -66640 -23055
19544 -23055 -116016 -132301 -74534 -26768 -102489 -110047 -54728 -4107 -48458 -168739 -228929 -135034
19532 -135034 -105250 -115215 -155912 -119465 -15707 -35329 -18519 -12929 -42288 -32856 16657 -30736
19520 -30736 94329 140623 59365 44876 112455 838 -40784 -59845 -153095 -245631 -153311
19509 -153311 -145313 -130814 -206856 -245582 -134753 -46159 -20828 -12892 9926 134360 150936
19498 150936 78623 191759 194976 137182 72338 6529 -66511 -39094 14066 61432 94682
19487 94682 52053 196938 197842 116324 -27494 -29085 16871 15309 24437 70880 5533 -31662
19475 -31662 -8269 40175 70244 -10279 -45134 -71573 7476 176536 168346 -23426 5039
19464 5039 42096 40845 -23411 -6183 -18109 -48106 -42465 56145 43726 46113 -21722 9280
19452 9280 75871 155617 204926 127180 53620 27461 11327 -31426 37228 63376 113787 92253
19440 92253 78621 81233 140122 135886 -10510 -14434 -6660 -3972 -2139 21685 68963 91393 -5677
19427 -5677 -33265 -24771 109933 119395 -3577 23650 101672 -10894 -191826 -159415 -92628
19416 -92628 -66296 -54870 -11131 19656 132731 125570 71265 50845 57812 27944 -67121 -69849
19404 -69849 -89476 -179093 -159575 -111148 -99318 -21909 -6898 -12854 42917 142218 61498 -145034
19392 -145034 -85280 -13613 -35701 -19685 60206 32869 -25305 -102108 -124964 -47568 53904
19381 53904 70730 -3694 -48112 -71303 73838 80004 105875 133572 24847 -23275 -117547
19370 -117547 -108229 -30538 91863 137992 173237 115467 86773 26235 58231 27051 11515
19359 11515 -28078 15397 -13110 -48131 68924 140497 145188 69578 -19084 -76162 2001 -1432
19347 -1432 11852 24003 85667 120038 131597 101752 78827 -22917 18994 38369 37566 -15173
19335 -15173 -151826 -168951 -116227 -88745 -86978 -65414 -31974 -28044 -70376 -43095 -28983 -11513
19323 -11513 -124709 -135841 -61233 -35071 -45681 -182207 -202735 -41390 60827 -65156 -141963
19312 -141963 -176582 -137984 -112854 247 -64234 -131319 -184923 -59471 -4583 -68086 -4737
19301 -4737 59626 105970 19506 153299 191154 174751 147852 229893 291450 152385 57951
19290 57951 97678 151138 -35086 -26730 -9504 -52955 -2284 -85860 -89823 -46979 14314 -29507
19278 -29507 -69570 51258 37640 42999 155345 165325 82922 77942 62438 106320 76629 95006
19266 95006 211666 255048 183323 142890 110304 112684 67235 39180 121080 140287 78862 62089
19254 62089 55810 -9343 -101200 -152293 -144237 -33229 48913 -20265 14415 26306 44243 83862
19242 83862 54302 59059 44038 -24952 39064 9408 -63905 7211 17004 104260 140038 7782
19230 7782 5528 44809 -13475 -63180 -66573 -46595 100425 157321 144140 106437 65570 34947
19218 34947 73670 64110 51361 195419 171608 70731 134917 238963 148530 -18355 -74924
19207 -74924 -46616 13914 -109706 -143395 -74940 -82800 -87340 -59055 -75230 -76332 -39999 -35533
19195 -35533 5144 67793 76255 13992 -26500 -34923 -116313 -120737 -96350 -59062 -59613 -44136 -27243
19182 -27243 3121 -11711 16267 -85939 -140872 -78049 -89233 -52878 -36572 -81166 -37621
19171 -37621 -9179 26995 88665 123270 123660 83833 153143 133265 159170 58564 -54539 -110318
19159 -110318 -29868 32728 44846 94291 122404 172952 116643 -47186 -105315 -109624 -44251
19148 -44251 33521 26149 -33325 -40432 48546 112279 66302 31831 -45883 -70068 27486 -6956
19136 -6956 -122899 -61210 84097 90683 82660 49862 -38881 452 -24078 -32009 65693 137811
19124 137811 185778 158177 62923 24917 25881 23162 64351 86035 113197 51864 185435 217145
19112 217145 225581 222409 129920 39512 -12349 -57499 -7526 45497 31184 83547 264380 336565
19100 336565 269592 278643 244423 217826 253063 249052 103637 20322 103007 219912 213273 208410
19088 208410 214613 217976 253276 208169 171868 117577 68909 -21502 78083 204027 207841 174291
19076 174291 88519 85364 67364 120049 175550 157890 95271 63877 3163 141148 228517
19065 228517 161099 201309 187023 119619 158884 93835 -1649 -36468 -50206 -7155 -20937
19054 -20937 21348 -9505 74579 198404 137917 91552 71178 53321 121164 152343 232884
19043 232884 215449 174181 124321 107588 161294 100441 -5710 -55133 23480 83516 93330
19032 93330 99741 117505 137255 164524 154115 114819 166365 145114 88337 124981 188910 129795
19020 129795 106189 83672 44322 1192 46985 101465 26685 50134 126316 146836 147297 85332
19008 85332 7167 32963 48372 424 20790 45506 29352 -87823 -47818 14572 24102 54861
18996 54861 58513 60357 85404 130619 171447 116876 98096 36556 -15419 47194 138656 152336
18984 152336 65975 2026 -12683 32906 -14431 48721 79684 46018 76965 117374 112527 87428
18972 87428 104184 88651 133642 106447 162107 76543 114627 194939 147414 204300 270579 164419
18960 164419 76268 -26841 40275 69907 59722 42821 11891 44038 90811 149224 192876
18949 192876 217884 311517 298734 188820 118362 58530 9434 21468 -3412 86097 156759
18938 156759 115569 30681 36995 103853 80271 60372 119560 196859 75492 24229 47408
18927 47408 -29854 -102223 -66009 -16342 -7319 48983 82380 121576 89153 149558 154540 150530
18915 150530 96227 60081 48791 -78773 -158873 -116892 -28322 46209 102094 30033 44107
18904 44107 173446 237537 193609 118167 163009 95779 48153 69202 80361 30759 120463
18893 120463 111664 163665 173310 166622 132988 169759 228004 173151 262491 175667 117717 76176
18881 76176 39595 9377 38672 123729 159264 171595 86331 109100 47104 -25836 65496 150141
18869 150141 200068 197003 155122 82479 108482 102938 132095 2323 76784 163938 209538 224939
18857 224939 218826 158868 267965 359483 235017 167966 78956 -20330 -18069 45180 18715
18846 18715 -9049 -2406 175617 91820 141334 193745 230292 256924 230575 240575 323178 397106
18834 397106 457151 508767 474993 440334 373102 332400 262735 306404 410470 382917 463210
18823 463210 472542 538481 503849 370294 299400 330720 307006 333288 345688 375933 354530
18812 354530 367919 327021 292862 317099 370617 332648 300339 309999 388525 396201 269530 281161
18800 281161 372375 373017 490522 559371 588771 702579 710236 756734 889074 976398 1063438
18789 1063438 1137317 1225590 1203027 1133230 1087279 1148522 1131555 998155 922784 934576 1068631
18778 1068631 1219736 1326833 1326807 1406910 1404706 1413706 1425496 1383490 1394463 1577251 1635888 1645815
18766 1645815 1624234 1511219 1442310 1445011 1381118 1181124 1043779 1009375 811380 654926
18756 654926 708083 785935 854441 952499 937479 907665 948306 1033000 997484 919753 1010106
18745 1010106 987228 973161 924432 956158 1085254 1076202 1069914 1101015 1081663 1022072 1091649
18734 1091649 1150252 1256379 1364956 1397159 1408014 1487820 1526157 1500802 1292271 1337331 1338895
18723 1338895 1283151 1269642 1309603 1355213 1403978 1492417 1473240 1337972 1358931 1326313 1325564
18712 1325564 1291135 1202386 1171306 1099654 990880 930904 896224 880172 941192 946921 752121
18701 752121 652723 659891 724647 681356 690611 742954 697921 647123 630139 724915 650698 620418
18689 620418 647945 655975 555328 664664 722485 720131 690989 584522 495595 474790 531350
18678 531350 531639 487067 431072 464491 521199 486699 399232 361822 385501 340418 424114 400992
18666 400992 423370 381446 371567 403982 493280 457296 476569 437218 405305 438383 428145 317313
18654 317313 279986 343166 400287 386196 268624 250288 241005 314626 431355 493846 488729
18643 488729 405858 300278 282234 437189 381236 324418 303141 285948 319177 293798 394967
18632 394967 367937 342271 333395 305942 248267 196223 246731 187350 150824 231683 269562 309795
18620 309795 256010 298005 307801 332936 360522 355513 306054 338624 393011 454522 447646 362708
18608 362708 257919 153493 170056 214083 353499 414609 382699 437604 464318 428740 572418
18597 572418 567272 470120 458197 503757 549287 557814 509110 474593 478820 483045 570341 589627
18585 589627 524262 541344 624694 604236 517698 494547 467135 470052 319648 390977 487014
18574 487014 583286 595920 663214 587253 513016 494172 486542 518741 518510 524780 502391 392733
18562 392733 289655 429284 458545 410807 449064 538640 532078 487710 522096 564286 613862
18551 613862 649404 645770 585497 586851 636716 591148 542018 572875 626168 709706 653757 634837
18539 634837 734946 785590 759132 686426 650602 802258 940319 962234 1032511 1056855 1050143
18528 1050143 929577 791788 771061 945607 1087118 1135804 1108036 1145392 1197425 1261831
18518 1261831 1213099 1115159 1027363 1082674 1123901 1070030 1046456 1081786 1100074 1079334 1050506
18507 1050506 1151054 1214435 1239304 1232585 1092364 1036322 1129346 1278593 1358166 1389929 1454422
18496 1454422 1411659 1389302 1371241 1354352 1381624 1431227 1495787 1723535 1896628 1832384 1765963
18485 1765963 1760398 1769118 1754492 1731467 1728090 1778416 1821786 1911081 1913336 1905526 1902478 1852582
18473 1852582 1839037 1895779 1924728 2087078 2062894 2042844 2137803 2239233 2356841 2381567 2363793
18462 2363793 2281368 2268637 2248443 2133270 2005013 1918897 1809671 1797158 1786918 1853956 1868147
18451 1868147 1812252 1750100 1753648 1709435 1790451 1927230 2037464 1936406 2076537 2169184 2067232
18440 2067232 2055723 2102784 2106253 2138680 2259005 2302363 2298852 2364373 2475026 2575864 2637120
18429 2637120 2611857 2646826 2679743 2613065 2570936 2510117 2581217 2686930 2695119 2699947 2726692
18418 2726692 2715159 2815965 2909894 2892820 2957091 3006464 3022439 2987127 3029129 3021499 2993279
18407 2993279 2903756 2671338 2462084 2409435 2520679 2538105 2510598 2583504 2687982 2909183
18397 2909183 3122681 3162888 3226015 3398234 3533926 3551792 3540905 3580229 3673445 3772027 4021734
18386 4021734 4152344 4160332 4178932 4258939 4225616 4169133 4127469 4053217 3928603 4027885 4210103
18375 4210103 4341455 4591435 4759325 4957432 5215938 5361774 5390611 5151231 4995708 4901673
18365 4901673 4900062 4939168 4898659 4888605 5132120 5437200 5665518 6011970 6342853 6641584
18355 6641584 6726025 6671110 6574481 6407599 6349319 6368676 6579698 6776810 6889546 7157688
18345 7157688 7294751 7501245 7802205 7925617 8057458 8130059 8145693 8160208 8174008 8213311
18335 8213311 8233894 8347503 8439707 8639686 8725053 8599257 8662299 8863685 8968114 8921769
18325 8921769 8905036 8995544 9008721 9062859 9138423 9200061 9169663 9229559 9494705 9738327 9981967
18314 9981967 10272358 10520010 10857021 11163975 11427684 11781572 12232525 12700650 13241290
18305 13241290 13983800 14878060 15870102 16840029 17941044 18995963 19929410 20836957 21892161
18296 21892161 23184997 24674127 26614256 29023970 32004617 35770199 40171790 44210362
18288 44210362 46747679 47623195 48104499 49568816 52238964 55952764 60264743 64820898
18280 64820898 69520785 74469167 80137980 87192277 96709305 110253477 129645062 156538021
18272 156538021 190384285 225317630 248412122 249898550 237095480 218957772 196702607
18265 196702607 173249893 153135091 138129725 128071760 122228745 120310441 122097958
18258 122097958 126883687 132696691 135765160 132013929 122059948 110832893 101315497 94208971
18250 94208971 89088845 85311523 82616148 80827341 79645634 79256320 79457439 80202269
18242 80202269 81451811 83408799 85914475 88725683 91887536 95187838 98472799 101947138
18234 101947138 106429041 112287272 120288509 131431336 145666704 160976256 172714330
18227 172714330 176443931 173562363 169244157 166551601 166480212 169448392 176303501 188343488
18219 188343488 207500436 235294181 271703376 312456680 348783272 371902665 372072439
18212 372072439 341876531 292996660 246455799 210720452 184837024 165615667 150929038
18205 150929038 139371969 130058614 122571342 116633952 112358235 109663961 108581391 109289000
18197 109289000 111480220 113753644 113759515 109552664 102923532 96513511 91194186 87083554
18189 87083554 83995153 81697942 80105236 78947929 78052872 77518386 77186649 76966457 76687605
18180 76687605 75946424 74293051 71793065 68671397 65251667 62014545 58839409 55802884
18172 55802884 52907377 50207314 47749234 45576241 43766880 42222458 40743650 39399840
18164 39399840 38221104 37108457 36066657 35006584 33812761 32444059 31022314 29785253
18156 29785253 28692874 27648903 26630973 25522445 24523188 23528542 22523625 21560798
18148 21560798 20753189 19925320 19145774 18417669 17673112 16981238 16441503 15940388 15418322
18139 15418322 15031998 14706572 14454745 14231042 14057843 13997571 14025297 14013337 13992304 13883673
18129 13883673 13835934 14015066 14341139 14806818 15412928 16263491 17381898 18886246 20716905
18120 20716905 22616847 24301337 25707316 26876570 28051179 29653993 32054865 35775614
18112 35775614 41380308 49748627 61701668 76654819 90712345 94239879 82104077
18105 82104077 66091081 53747737 45168634 39325363 35087742 31727344 29005812 26888354
18097 26888354 25045322 23745200 22723880 21833295 21063990 20377499 19880690 19236824 18730670
18088 18730670 18289348 17977020 17602323 17410193 17233710 17000244 16864031 16781270 16735344 16788655
18078 16788655 16833530 17095285 17533868 17901120 18112931 18000088 17603909 17051734 16485531
18069 16485531 15956927 15288793 14634862 13970090 13353564 12799430 12329463 11953433 11718674
18060 11718674 11615774 11347154 11084542 10801621 10606130 10463152 10249946 10013151 9844504
18051 9844504 9733692 9651636 9640765 9666455 9658833 9621512 9632540 9680784 9642310 9739483 9709380
18040 9709380 9593408 9481814 9508513 9634780 9691466 9737173 9796229 9722999 9716814 9908664 10052240
18029 10052240 10007933 9970582 9927169 9838795 9807987 9890224 9888259 10004437 10200090 10246814 10287852
18018 10287852 10351102 10480822 10576265 10759604 10916178 10890437 10916376 11116325 11278337 11392822
18008 11392822 11535484 11773268 11995852 12318687 12811348 13267011 13691112 14071599 14618119
17999 14618119 15223353 15859098 16381014 17055635 17717286 18637642 19752219 21202661 22842272
17990 22842272 24692574 26400074 27901776 29363592 30975223 32885294 35152026 38093310
17982 38093310 42134066 47492030 54252650 61538891 67381319 69428981 69323951 70197447
17974 70197447 73356252 78456881 84729985 91533711 98426692 105332135 112823323 122157310
17966 122157310 134898173 153260884 180040611 217757970 266277333 318585897 355768543
17959 355768543 358512726 335488294 301766699 263009236 226411659 198044904 178050558
17952 178050558 164377089 155640375 150869707 150105210 153402570 159605471 165652771 166000978
17944 166000978 156688306 142337210 129206071 118965126 111443091 105862485 101724642
17937 101724642 98786937 96730836 95420863 94823482 94936635 95693765 96985105 98781220
17929 98781220 100979897 103539713 106183206 108480832 110459087 112566222 115373856 119594636
17921 119594636 126169181 135605658 147340642 158630116 164344204 161888007 155586506 150235253
17913 150235253 147289346 147280865 150628376 158189010 171133180 190228732 214163040 237988239
17905 237988239 257012427 270241543 272665805 252187864 215776274 181772620 156132576
17898 156132576 137653874 124069877 113709659 105568481 99056211 93673012 89236801
17891 89236801 85655815 83093439 81371636 80580079 80813205 81776807 82410907 81124850 77600245
17882 77600245 73562627 70074475 67269168 65106556 63552141 62249055 61251392 60320003
17874 60320003 59680925 59226849 58771634 58307670 57714828 56636620 54948782 52913471 50547583
17865 50547583 48100564 45796933 43594493 41409766 39278741 37453165 35939572 34521095
17857 34521095 33297446 32095958 31110415 30281869 29521834 28813630 28036828 27218306 26374211
17848 26374211 25618359 24863979 24205602 23602332 22957947 22413648 22101792 21864635 21625729
17839 21625729 21380788 21138184 21025416 20914581 20785768 20677746 20536008 20400944 20318262
17830 20318262 20251379 20497056 20869257 21349512 21792322 22159421 22783659 23434277 24182945
17821 24182945 25164705 26315721 27797952 29370614 30600194 31522126 32402851 33513703
17813 33513703 35063617 37067985 39645582 42731739 46599433 51520942 57395567 63926390
17805 63926390 70417421 76392416 81971094 87645020 94526694 103753755 116614903 134797027
17797 134797027 160350607 194059163 233371331 267962223 280180400 266888499 246865231
17790 246865231 231635228 221554205 215294974 214290696 220390396 235555065 261541945
17783 261541945 299298480 346087508 391273517 419084279 420661491 397992387 360047277
17776 360047277 318792526 284591196 260502564 245623479 238969754 239951181 247973581
17769 247973581 262511286 283561611 308617193 327485906 322497029 291165654 254082486
17762 254082486 224253591 202615080 186669338 174184373 164021981 155527322 148475488
17755 148475488 142550350 137250100 132380825 128193720 124444282 121424977 119324082 117819201
17747 117819201 116381119 114757664 112598925 109905797 106749548 103223910 99462042 95648605
17739 95648605 91659895 87852586 84389772 81412761 78859597 76756296 75024874 72973735
17731 72973735 70349001 67284186 63971982 60577979 57253865 54011030 50944104 48087758
17723 48087758 45448950 42999584 40723705 38576273 36541036 34689991 33010921 31443541
17715 31443541 29897581 28549540 27181477 25896051 24808875 23738016 22637645 21581804
17707 21581804 20667077 19753436 18887642 18106702 17481749 16829820 16192107 15549581 14791569
17698 14791569 13975340 13340737 12754916 12273779 11933736 11594477 11069285 10479516 10004592
17689 10004592 9593572 9246753 8895024 8689439 8492005 8169112 7870310 7514014 7147004
17680 7147004 6908692 6551367 6275645 6171944 6084557 5837728 5612117 5347144 5148551 4980908
17670 4980908 4923365 4875437 4659935 4359456 4054819 3834321 3899949 3890151 3706785 3564664
17660 3564664 3546450 3523383 3527601 3592794 3611061 3516080 3352907 3094888 3019091 2969979 2981948
17649 2981948 3023083 2935426 2817570 2866504 2901790 2859531 2841335 2746896 2744070 2682695 2596319
17638 2596319 2474604 2429343 2425051 2490760 2482412 2415079 2422210 2544056 2682158 2758038 2705992
17627 2705992 2730158 2695765 2663290 2609890 2642415 2709316 2850903 2913236 3063522 3136395 3103108
17616 3103108 3075146 3131513 3097743 3113735 3052791 3156590 3129999 3101793 3148439 3253773 3359751
17605 3359751 3472308 3519437 3485932 3479846 3451292 3444434 3445424 3445031 3524663 3538460 3506536 3331705
17593 3331705 3401479 3511446 3491795 3416551 3409813 3384012 3423711 3446344 3436941 3282070 3195912
17582 3195912 3227644 3275869 3228682 3148052 3089833 3063799 2995648 2915194 2851553 2792196 2806137
17571 2806137 2845174 2734491 2648696 2639308 2655230 2621376 2515328 2448988 2403758 2389173 2439198
17560 2439198 2450672 2441891 2340509 2217750 2117431 2075368 2101371 2034697 2089917 2035719 1985021
17549 1985021 1898515 1832787 1852817 1845010 1810303 1762158 1640142 1537663 1534904 1428804 1363044
17538 1363044 1434980 1385706 1311125 1248402 1269694 1305038 1321368 1264830 1272623 1294255 1261478
17527 1261478 1322575 1300333 1376996 1320577 1333956 1267846 1215723 1220946 1210190 1101889 1117931
17516 1117931 1191610 1158716 1153919 1207971 1222964 1275378 1295393 1317060 1350184 1283238 1253527
17505 1253527 1274091 1219938 1258309 1136373 1015628 874289 963658 1103708 1115536 1091104
17495 1091104 1098445 1037740 1014486 1066906 1161572 1181708 1147743 1118166 1165040 1293776 1306533
17484 1306533 1301555 1247608 1159724 1195989 1299021 1366818 1453024 1443428 1418380 1387795 1371394
17473 1371394 1460356 1506587 1575240 1522411 1461448 1448558 1447831 1523355 1436149 1604032 1697170
17462 1697170 1717898 1719713 1655333 1641513 1671900 1649805 1590604 1570378 1660923 1754243 1900984
17451 1900984 2167552 2266617 2186925 2166852 2140823 2144863 2138583 2228687 2452518 2689388 2703862
17440 2703862 2649610 2610327 2459239 2355362 2366123 2357753 2234161 2154831 1904954 1754307
17430 1754307 1590649 1581699 1626640 1628070 1578360 1502168 1537836 1564922 1543544 1532956 1535626 1540674
17418 1540674 1423016 1383448 1442534 1476920 1474806 1405992 1414325 1419583 1285589 1320315 1357738
17407 1357738 1391720 1368905 1353713 1446738 1528737 1459955 1565390 1749517 1627760 1674422 1700319
17396 1700319 1572557 1609592 1678744 1711702 1712038 1606196 1525893 1592779 1527788 1414371 1407358
17385 1407358 1445599 1553895 1591243 1498756 1451797 1377140 1384838 1547789 1571984 1582525 1551466
17374 1551466 1501670 1480091 1406199 1242994 1107515 1097941 1158904 1252503 1158838 1091000 1052190
17363 1052190 1080649 1080827 1065788 1220846 1298804 1254246 1109392 1084811 1079690 1102838 1067989
17352 1067989 1025125 944615 957095 943602 1055612 1074939 1022934 1096225 1164146 1120871 1078776
17341 1078776 1066200 1055415 944902 911690 1007878 1025249 1000049 856706 784527 873929 976965
17330 976965 940925 909704 955371 952752 826700 786871 837365 862354 874637 869417 854724 795403
17318 795403 753600 727419 720186 627624 701394 793914 800745 912192 840635 712744 717303 772856
17306 772856 751227 731598 774408 737790 634147 527034 510947 574623 607741 555985 573206
17295 573206 624559 686153 696981 738862 712432 639683 737089 790210 837179 791969 759729
17284 759729 796307 772305 754034 790261 774431 794711 806725 751958 741126 724259 764179
17273 764179 788444 778247 947564 923613 902296 803608 837689 918431 917992 934098 1018638 1049231
17261 1049231 1013518 1077485 1136917 1139498 1234569 1341337 1419224 1558734 1608671 1511984 1458645
17250 1458645 1378392 1409957 1491629 1521468 1494616 1504224 1572661 1673432 1789966 1885758 1942430
17239 1942430 2043125 2097571 2078997 2059019 2112537 2324195 2398459 2351726 2315072 2240948 2101840
17228 2101840 2161672 2267779 2252923 2199975 2179690 2287829 2517325 2594509 2661393 2710921 2752610
17217 2752610 2656520 2590867 2471895 2351706 2421559 2568893 2652772 2615038 2618637 2579704 2508675
17206 2508675 2676562 2820519 2818853 2784571 2705830 2703411 2827262 2924105 2992384 3200843 3231755
17195 3231755 3050371 2885965 2816541 2688646 2606063 2515360 2381640 2476440 2496950 2591915
17185 2591915 2823510 2986527 3083137 3186652 3033912 2746259 2544267 2457814 2318703 2213716
17175 2213716 2103562 2003342 1920177 1937882 1998453 2000268 1970511 1923794 1908839 1857727 1791446
17164 1791446 1685897 1640580 1468137 1335684 1325563 1362080 1423390 1358574 1295793 1211573 1127708
17153 1127708 1030738 1052829 1140134 1064844 1031829 999978 996718 838923 756748 721546 813800
17142 813800 934568 900460 831011 816044 837618 852666 838026 812676 1018245 1035325 907014
17131 907014 904840 843319 745229 748483 765591 683532 626275 689021 692992 585509 517324 448104
17119 448104 437593 520689 580109 553809 488816 400888 382941 494641 648898 664832 628532
17108 628532 694435 757810 826612 719846 662154 622198 561498 577379 608221 689099 761822
17097 761822 734520 699753 653182 570498 562962 645482 600278 525292 483731 433382 608952
17086 608952 659028 674492 695656 575716 633642 732041 725434 702729 696619 712663 797659 817560
17074 817560 702484 564349 548563 528899 596757 614969 646887 651140 686291 653636 705131
17063 705131 694576 625151 493206 523121 497794 563416 568933 542628 492626 619620 620946
17052 620946 589079 607002 594009 525885 496630 595929 653907 629269 740379 737206 641023
17041 641023 639910 634367 643401 644889 617958 651098 686798 772593 797353 728653 698794 675225
17029 675225 577826 550653 555402 581168 538933 515540 552026 488327 493184 590116 664257 708673
17017 708673 637401 514845 513335 595522 545581 514489 519230 584492 554333 624543 681212 757622
17005 757622 684084 665732 662176 748072 713201 635109 609764 519906 451355 555678 654787
16994 654787 638646 605245 632945 646745 647052 697986 726039 853671 812463 744430 800914 943099
16982 943099 908031 904535 884945 874673 867247 816558 813408 898243 844340 691576 673621 763572
16970 763572 805739 769374 890112 958168 993661 1064131 958373 832881 902924 896595 799354
16959 799354 794207 916012 1093734 1182001 1293885 1298286 1227005 1108611 987159 1016109 1049079
16948 1049079 1087185 1094011 1199590 1306470 1307104 1253015 1318609 1441139 1458224 1554245 1556683
16937 1556683 1400886 1361242 1445296 1465605 1424414 1459878 1398827 1443804 1432240 1350905 1365259
16926 1365259 1398185 1329368 1273734 1337538 1373073 1319470 1367350 1479193 1425550 1368293 1246031
16915 1246031 1197446 1196740 1203484 1205083 1191782 1217420 1175399 1154909 1177643 1203421 1165524 1232061
16903 1232061 1209236 1055333 992410 1055031 1116265 1134065 1129906 1124570 1182540 1217422 1129546
16892 1129546 1045846 1013660 1031868 1037513 1055315 1116680 1176801 1296964 1351364 1289101 1250682
16881 1250682 1283669 1273982 1261508 1195665 1309303 1332223 1327214 1344644 1289043 1272256 1312890
16870 1312890 1403958 1412151 1291006 1249414 1333014 1315084 1323763 1387356 1451083 1495926 1435463
16859 1435463 1424820 1493367 1488945 1494871 1447316 1482319 1501238 1565650 1556392 1592646 1630753 1748878
16847 1748878 1670507 1650220 1599385 1623694 1487642 1543727 1611698 1762970 1794396 1743920 1779655
16836 1779655 1844053 1842670 1869395 2015906 2051612 2032341 2144018 2266699 2350334 2421020 2425880
16825 2425880 2479116 2496972 2505859 2588570 2608874 2635893 2692031 2701535 2694564 2777632 2826851 2888975
16813 2888975 2891501 2973598 3016292 3125067 3145611 3139101 3191807 3375466 3430018 3492180 3588096
16802 3588096 3605432 3558422 3594867 3620855 3687940 3824141 3845195 3947708 4205221 4413385
16792 4413385 4419180 4399818 4457175 4591546 4824526 5029147 5093880 5163173 5286914 5395577
16782 5395577 5548576 5760248 5988848 6175031 6311129 6312157 6413401 6607680 6663245 6791835
16772 6791835 6969053 7249905 7362407 7455131 7622242 7698871 7736055 7939243 8198214 8413492
16762 8413492 8747144 8951332 9124097 9291431 9418047 9593076 9738254 10021505 10264892
16753 10264892 10403605 10514259 10768163 11182288 11589916 11968045 12297143 12478030 12773789
16744 12773789 13108001 13465798 13962162 14474447 14918649 15387417 15980982 16703191 17528449
16735 17528449 18387207 19293778 20215773 21388301 22680138 24202334 25922336 27636477
16727 27636477 29110322 30469282 31886468 33376611 35278672 37579878 40455323 44034234
16719 44034234 48405465 53688576 59898684 66562719 73140117 79363336 85415432 91997872
16711 91997872 100105047 110834695 125687686 146466364 174717799 209881796 247322533
16704 247322533 275245110 280593790 266127801 247364962 232777570 222745868 217415762
16697 217415762 218170632 226428487 243587430 270914852 307987260 350167797 387450506
16690 387450506 408363141 406041197 380981860 342742824 304261413 273435138 251967891
16683 251967891 238933336 233414026 234927335 242794560 256597837 275854334 296413213
16676 296413213 306936987 295483437 266010633 234390092 208824334 189671492 175026143
16669 175026143 163369164 154028978 146103067 139396527 133876745 129019844 124556683 120570387
16661 120570387 117177634 114499943 112418037 110826241 109332472 107528667 105125313 102082567
16653 102082567 98616224 95053277 91279567 87582509 84058938 80587207 77405687 74646512
16645 74646512 72287644 70205857 68257645 66088988 63460152 60414751 57174020 53982663
16637 53982663 50945024 47989820 45101520 42360376 39835201 37491097 35298272 33237537
16629 33237537 31419416 29774157 28260068 26719594 25217335 23793797 22505166 21265989
16621 21265989 20078539 19050049 18109259 17285896 16485624 15692892 14907261 14202150 13471333
16612 13471333 12696341 12120265 11547822 10843393 10212401 9617898 9145427 8786141 8472467
16603 8472467 8101077 7645456 7243468 6891958 6604706 6283750 5864085 5572374 5399863
16594 5399863 5096161 4723367 4449157 4221090 4057013 3865705 3700721 3581980 3531519 3388988
16584 3388988 3349676 3262227 2959863 2792058 2657019 2584708 2456870 2262398 2191165 1967967
16574 1967967 1726653 1632758 1522184 1518305 1607162 1615620 1605157 1632193 1646776 1509925 1430273
16563 1430273 1273856 1092040 940544 894517 943292 983029 962791 968039 951074 942020 942901
16552 942901 951911 1039860 1035785 981077 884362 766388 772631 815746 967556 1056462 1165462
16541 1165462 1148854 1289659 1281183 1302824 1367505 1364237 1417519 1531974 1566456 1604104 1668159
16530 1668159 1644369 1564854 1564262 1682780 1798698 1792403 1800858 1755972 1815366 1911909 1945814 1910335
16518 1910335 1864145 1837973 1957000 2047777 2165764 2177336 2198135 2170218 2235392 2263650 2249667
16507 2249667 2143415 2084179 2104585 2228334 2282430 2213988 2164886 2126879 2007050 2043327 2084445
16496 2084445 2105989 2195918 2160944 2015347 1997519 2031339 1969132 2015284 2005936 1894756 1728003
16485 1728003 1635888 1558172 1606884 1675899 1658415 1552490 1466581 1509353 1532903 1555087 1548359
16474 1548359 1496588 1475213 1436132 1410767 1255995 1132218 1072212 1095951 1147739 1170106 1090140
16463 1090140 976136 944323 1023829 1079138 963336 876154 868787 867370 860079 810170 731692
16452 731692 644099 648098 695725 828225 819028 795661 687627 625389 630539 661034 701585 633201
16440 633201 612054 618699 609432 499292 463576 456883 511994 555663 583468 531828 493499 440482
16428 440482 404098 373483 367846 297523 286380 318841 258786 302529 373607 315691 315069 322932
16416 322932 397905 373873 405771 422338 472514 457743 457103 447006 463669 417642 315380 294554
16404 294554 391813 409224 312989 364352 496491 531045 472638 387298 326265 376671 403455
16393 403455 386481 306829 265870 235852 221040 255526 331267 355374 376555 490467 571603
16382 571603 497219 418580 507300 573832 507197 416025 384114 383441 385588 430754 479075 475303
16370 475303 427673 432189 447276 540989 500298 423421 363774 292080 342000 465291 484590
16359 484590 481372 439967 356903 241795 187767 248813 347708 380660 364184 354126 327062
16348 327062 235568 352700 354672 409011 406804 303776 390277 383036 427270 467307 460305 409931
16336 409931 330758 286713 340786 377631 335969 257440 210523 227183 288286 258981 216802
16325 216802 329228 359508 281639 274532 273415 212185 184809 194453 266415 252961 201563 247342
16313 247342 362389 303610 178069 256561 252073 155794 125388 126478 60018 74259 118440
16302 118440 87496 136981 138016 34394 91858 185146 199885 102133 117624 148272 153225 59736
16290 59736 -24132 -10335 19763 123473 141811 179210 205725 170701 154910 74542 79933 109594
16278 109594 113704 60343 79856 99692 178969 200363 226597 255508 246378 198136 201991 100370
16266 100370 63332 92934 50393 56529 147704 143981 139492 207536 257825 246491 231891 201658
16254 201658 199186 209191 191731 183287 229757 306138 236558 109954 62266 19968 22051 53972
16242 53972 136619 281943 184759 114233 121017 58582 85263 19312 1633 65963 107556 208160
16230 208160 217958 130981 143983 146054 123745 176950 162751 176941 233871 179648 213223 248020
16218 248020 217071 194703 171503 105861 32569 144971 263065 192648 202357 194288 128431
16207 128431 83593 131838 149934 151934 224271 320977 358585 277656 299483 326155 272328 285850
16195 285850 204069 145955 182351 195498 68507 126647 270358 278573 211510 123943 192813
16184 192813 273128 437421 532347 467212 386792 396437 333255 334472 381692 414126 477680 537688
16172 537688 570398 586542 677370 878814 906435 878039 915650 901804 721387 619767 644284
16161 644284 638318 744584 868242 937920 1012966 1204770 1369912 1320695 1288713 1353710 1399319
16150 1399319 1328177 1259799 1191175 1199799 1252071 1271757 1268645 1214240 1198190 1332547 1347207
16139 1347207 1360311 1331083 1306740 1298271 1260976 1355732 1403582 1325823 1373268 1322236 1194468
16128 1194468 1048046 1030695 1017250 989569 970195 1007645 1044778 1079278 1148994 1257428 1379811
16117 1379811 1327118 1209618 1073982 995515 960466 823079 794394 681177 511751 566096
16107 566096 604906 571446 565119 512027 530220 626024 613491 481491 443123 494914 503098 430803
16095 430803 408350 351573 315733 299097 306928 340899 286441 254837 238344 240127 246106 297118
16083 297118 278934 215358 179968 250394 333020 341849 297870 257701 251127 228463 169567 182077
16071 182077 197958 168342 194408 278837 304284 218770 113967 129584 194760 171755 46516
16060 46516 -52411 -42877 -3628 29469 14021 32821 195954 155531 11425 72543 73115 28361
16048 28361 39631 46376 183328 256648 238438 235191 213006 154149 -2828 -47735 -14966 24335
16036 24335 24697 33980 -49909 -132042 -114502 -66232 -44877 -58015 -61591 -83899 -19135 -96328
16024 -96328 -100038 -76521 -64330 -44626 -40823 -19927 -102528 -91231 -5831 -82950 32111 104005
16012 104005 94390 112884 208369 121289 -3495 38484 -13942 -106745 -109806 -179108 -239996 -193127
16000 -193127 -172646 -135458 -52120 24131 93724 58173 71577 38414 -77839 -11333 91546
15989 91546 57440 8081 125690 127926 95327 7718 -76438 -104702 -71832 -40304 110122
15978 110122 125985 47128 -82832 -107379 -100198 -1919 100947 86939 142638 206839 163499
15967 163499 46078 26119 137601 207999 185232 61730 22155 -69835 -149526 -87061 -28529
15956 -28529 85767 114491 79501 37000 9351 27 137631 229029 149215 140501 254963
15945 254963 160727 -26557 -102922 -89925 -24935 18864 -68601 -21669 90304 48721 -73046
15934 -73046 -91425 17782 -52305 -97207 -133415 -140847 -96426 -46082 -35681 -21368 49656 104804
15922 104804 105614 34990 -30395 -72790 -39603 64024 108905 96682 59263 139405 55196 66451
15910 66451 80461 -59015 -121766 -130056 -150755 -117422 -136628 -156408 -148167 -63493 -55503 -58244
15898 -58244 -115050 -43927 -69920 -124153 2152 -80526 -166708 -72282 -44536 -81987 -55542
15887 -55542 -49819 -69777 -44965 -53431 -46546 68032 113319 62673 -17996 -856 70709 47831
15875 47831 66449 -50175 -53817 31131 67649 79658 80701 101580 127374 162276 52713 -87314
15863 -87314 -164418 -1646 160751 193281 131122 -105911 -172575 -177465 -90376 46279 -27043
15852 -27043 -75562 -176231 -209867 -104396 -40394 -46712 -21405 -40935 -156637 -129617 -96575
15841 -96575 -106664 -12553 11961 -5119 -37816 -116689 -44110 18386 -33542 -72171 -77717 -3868
15829 -3868 77769 47684 -42751 -58750 -61629 7309 67359 64282 38667 -21457 37403 41830
15817 41830 42607 56872 95754 24817 36483 61482 53209 47346 25093 189256 162355 45977
15805 45977 -93491 -111778 -136059 -104721 -89124 -105702 -44030 -62543 -84857 -111339 -93945
15794 -93945 -63130 -113585 -163235 -126624 -51308 15117 35563 44104 19513 -3008 88524 165763
15782 165763 102019 -17124 -68092 -14491 95051 108430 118296 101307 -71385 -92931 42979
15771 42979 94393 59558 42501 24192 32173 -74042 -149940 -205679 -162508 -118620 -119425 -109637
15759 -109637 -132207 -34153 30873 115183 70966 96492 224096 185077 117570 382 83172
15748 83172 50454 4140 67125 41229 -77840 -91337 -40088 84500 74120 41200 14506
15737 14506 60670 184348 86364 74293 8055 105921 153904 158122 112391 52134 17117 25264
15725 25264 50501 53677 132844 179855 64073 -37527 -6368 2324 -43801 -7748 83192 77641
15713 77641 68335 -27218 -108056 -116383 -158979 -198779 -141498 -92701 33456 80837 56214 131913
15701 131913 45968 -61785 -136066 -38583 -41527 -60599 -57645 -67163 -103183 -114052 -59199 -144051
15689 -144051 -51972 30063 -5659 -157144 -266494 -221780 -160164 -97836 -45536 77041 156502
15678 156502 97060 10942 -19243 -127263 -83201 -63337 -118802 -187391 -288827 -322480 -303422
15667 -303422 -262271 -138444 -98202 -127087 -175810 -87270 -3567 -64281 -52234 -38276 -59598
15656 -59598 -135636 -149351 -3604 57511 84886 122585 -3062 -29521 -37696 -87737 -156978
15645 -156978 -171654 -153141 -226842 -228350 -162084 -107531 -40633 -155131 -237834 -187376 -109493
15634 -109493 -19176 -10070 123636 95194 61691 61785 -41876 -98348 -101927 -70497 -53051 -113629
15622 -113629 -19287 93664 48004 -78762 -107846 -163939 -186425 -138167 -106141 -47196 10381
15611 10381 -2836 -37800 -52384 -73350 -30663 -275 30096 46856 7943 -8740 54238 88865
15599 88865 147900 165449 207824 164679 84151 21674 31576 4761 1953 7548 -69 -52630
15587 -52630 -5280 90313 115343 136829 128402 76414 36810 -12026 -93424 -100294 -51130 -119182
15575 -119182 -49781 29358 82650 138232 236766 178574 72859 44906 15951 30576 33769
15564 33769 -51535 -38410 -35447 -202 82728 2840 -96820 -114565 -48712 -27355 -17455 -101635
15552 -101635 -139024 -134989 -91428 -127995 -190598 -68148 27741 21612 82119 165316 125869 122427
15540 122427 41772 -85284 -16607 67558 63464 56820 -11213 -18069 -20176 -135308 -130018 -117495
15528 -117495 9155 9642 -26933 2127 59556 104446 53828 24307 9188 -21255 -85723 -17729
15516 -17729 -8679 -102334 -124260 -151390 -108761 21430 117949 123008 70412 90853 109811 44533
15504 44533 -31956 -131521 -131633 -37170 -3163 -47657 -169322 -166428 -169447 -200627 -164123 17614
15492 17614 59819 -54712 -114063 -149495 -145299 -148974 -121522 -48015 -21721 -97144 -95884 -22205
15480 -22205 58226 76490 -22410 -209122 -148188 -181943 -76875 90284 131391 148472 185096
15469 185096 90291 13148 60621 93146 144846 104689 109721 69773 50561 47632 -24610 -36443
15457 -36443 -21601 -57839 4101 121276 120163 -5786 -96542 -83291 7759 -19499 -126009
15446 -126009 -148848 -53402 -28609 -22400 18130 36507 -24613 -39641 -71940 -185511 -160340
15435 -160340 25355 42113 -71673 -141776 -70489 67081 38171 -85564 -116014 -4679
15425 -4679 73463 99563 81190 57355 -8133 -86423 -60051 96317 118221 30218 -133294
15414 -133294 -181090 -235682 -144660 -143353 -243121 -180077 -107199 -96548 -110644 -7201 57370
15403 57370 31762 57477 108072 121737 133917 130246 81859 506 -4981 -6763 -45944 -88155
15391 -88155 -93006 -133180 -146967 -71756 -41221 -91692 -138186 -141888 -136741 -178484 -303952 -428717
15379 -428717 -408536 -293169 -144045 -157610 -146251 -69811 52719 85380 49136 29621 -20330
15368 -20330 17294 -10566 -6026 61311 73935 49789 111170 64386 6969 8787 -7207 43897
15356 43897 193178 243861 173048 126721 82596 13567 7935 -30012 11428 100225 64209 63920
15344 63920 48525 -6795 -76868 -147621 -47060 15443 -104254 -172930 -127216 -31007 2420
15333 2420 -2406 27098 48858 78165 103644 78807 -50629 -160304 -133288 -89773 -51600 -158269
15321 -158269 -96309 -115413 -99060 -54613 -12743 -23258 -59250 -44767 23478 -58619 -174002
15310 -174002 -204189 -179097 -108652 -76597 -8996 -74067 -203976 -229480 -110116 -22715 -913
15299 -913 -61117 -115369 -70326 -36489 1245 -50653 -42062 -34881 -55540 -54997 39202 8213 -41840
15286 -41840 -61546 -34006 -47170 -88096 -50847 -19076 -50017 10428 25396 72150 75190 100750
15274 100750 89064 42146 40879 42837 -28770 -12252 24162 41442 -8491 -4450 24714 51681
15262 51681 28852 -67802 -72479 -117092 -100415 -40668 -6602 28286 -12270 23352 16181 12417
15250 12417 12923 -18178 -58440 -79924 -130738 -176326 -196245 -195685 -94759 30994 115581 90298
15238 90298 116414 166776 199061 154509 120851 82207 125028 82582 88647 87512 178425 220313
15226 220313 173514 148828 99123 74778 -53407 -106930 -21188 -31266 -102820 -135728 -39364
15215 -39364 85645 127873 161399 176235 50443 -42316 -12332 80390 194375 165439 223177
15204 223177 179615 104389 38382 91605 83676 -43485 -73308 -32672 -22543 14876 83707
15193 83707 -10127 -134494 -164265 5827 130246 245843 160368 9596 -22505 -49162 -43740
15182 -43740 19068 137712 169914 77480 -4469 -57036 -138241 -101526 2824 30709 20935
15171 20935 -7914 -26694 9606 8904 52045 98449 56650 33664 6461 -85366 -148201 -154369
15159 -154369 -125129 -15139 -30393 3310 -79681 -132961 -55966 26761 -19692 -44993 56214
15148 56214 12386 -40058 -14525 14211 33206 53717 75117 59956 91289 92490 155368 195258
15136 195258 132458 72964 4477 36159 99006 49832 15770 96172 83667 -14349 -56960
15125 -56960 41744 -37481 -64424 -95769 -36010 72139 43809 42880 101855 68486 6131 -29436
15113 -29436 -81496 -205726 -179828 -89255 -133631 -215524 -82580 20660 -48503 -113322 5070
15102 5070 134558 207705 329297 400548 281116 120894 -63701 -48286 37041 59301 101804
15091 101804 57241 24568 -32128 -74029 -56121 -104833 -100081 4142 48781 82391 35742
15080 35742 61114 68735 17407 -155011 -213535 -144671 -129102 -143905 -77804 -55399 -41942 -64652
15068 -64652 -124332 -90558 -93167 -21825 11799 54737 -22664 -83311 -28644 -58489 12735 -52148
15056 -52148 -129012 -146178 -160038 -94338 -85183 -73743 -25238 57066 107587 128403 33768 -43293
15044 -43293 -35390 -50813 60333 52071 55460 84203 72975 -54746 -98061 -132856 -41998 -102219
15032 -102219 -158674 -119637 -101846 -71914 -166453 -118721 5037 41253 -6677 15412 55856
15021 55856 110846 122912 14260 -76942 -61401 13840 -14747 56652 96438 -14521 62452
15010 62452 124100 185117 23183 -163822 -131249 -33134 -4831 100198 92882 72966 177
14999 177 5946 -8334 -35784 -56488 -44975 10895 13435 -40446 -62410 -77645 -118701 -36999
14987 -36999 -38268 -112597 -122830 -200391 -64477 87239 41980 -128635 -141507 -88318 9427
14976 9427 -1395 -50863 -11000 11381 -27504 -49132 -47773 -140323 -195805 -40719 -10669 -55238
14964 -55238 -45032 -131586 -148902 -135774 -148297 -124844 -21474 211 4699 -15875 -40817 -117666
14952 -117666 -166727 -67393 -107997 -131111 -62685 -97445 -82437 -38009 16605 -12857 16565
14941 16565 -88231 -63324 62055 59248 -32031 19914 -17791 -5485 -21999 -65717 -128578
14930 -128578 -173815 -144165 -143562 -182048 -130755 -56672 -173862 -119724 -36284 -17588 27622 -78437
14918 -78437 -92440 787 32487 -51913 -177004 -144860 -32148 61885 76502 125456 72487
14907 72487 99831 6093 -29632 -17290 86802 145759 182202 123113 -16041 46153 132385
14896 132385 137922 58361 7556 -44464 -112154 -104966 -102626 -137853 16288 31505 -25989 -118465
14884 -118465 -46049 47145 -33463 -52902 34905 58880 51100 -22518 -76726 -101507 -98589 -85313
14872 -85313 -4011 137006 65645 63361 -59189 -137732 -200064 -175011 -148928 -119366 -67129
14861 -67129 -89858 -38725 -93729 -116991 -108303 -93800 -104418 -100367 -75434 -53690 -75295 -100132
14849 -100132 -98519 -92011 -41561 -79052 -96528 -74028 -68828 -69355 21391 31494 -35023 -51714
14837 -51714 -11334 -39205 -85523 -6505 89706 32490 47121 35242 -23483 -141220 -156605
14826 -156605 12785 115438 128224 -4619 -20067 -14655 -60766 -84629 -24726 85448 201780
14815 201780 -10302 -91154 -12971 -33040 -114099 -111514 -48128 67809 165505 143229 87679
14804 87679 7389 122378 152364 70849 79484 64220 22143 43033 55740 5467 -136741
14793 -136741 -128124 -40136 -7630 -38214 10201 -7641 -164106 -157227 -116910 -113580 -80383 -78766
14781 -78766 -35506 -92849 -72604 27565 97345 39085 -26780 -30731 -32861 -73093 -123236 -149535
14769 -149535 -206778 -206950 -229202 -180427 -49795 -18913 -89882 -142112 -69462 -141515 -131209 -49161
14757 -49161 16372 17715 42343 -71624 -101418 -82291 -116322 -85557 -63557 -6004 59277 -7134
14745 -7134 -64353 -74304 90255 151268 135674 89625 104984 50859 -12615 55152 141419 206243
14733 206243 184493 177128 130791 126395 104503 167646 208779 117063 97744 142623 169232 160062
14721 160062 20660 4083 17411 -65024 -105597 -22954 15234 61847 62026 -12173 -47077 -56937
14709 -56937 85566 143613 20359 -24673 55146 56445 -24724 -113744 -194163 -120997 -40927
14698 -40927 -51391 165507 119032 -40278 -60588 -78226 -72404 80685 120411 21114 -29648
14687 -29648 -73141 43778 -890 -99314 -116847 -118236 -89956 -14745 74879 54639 -53441
14676 -53441 -79486 8402 16184 77942 90885 21303 -104956 -40173 123764 130364 45846 29264
14664 29264 34478 39137 -58769 -54536 13450 145936 157032 118181 74124 129376 88444 -67520
14652 -67520 -103520 -25926 78949 154741 17021 -120352 -76288 -66131 -55199 -61113 -122509
14641 -122509 -125381 -33263 44358 74316 82701 133952 117609 53076 32999 -18241 -44478 -76969
14629 -76969 -17234 -20381 -103177 -133198 -122326 -135249 -150350 -176108 -210515 -202622 -153215 -119002
14617 -119002 -27975 -45860 -3536 -42922 -105041 -40031 939 82302 69158 13491 -85710
14606 -85710 -62910 -46177 -71324 -12764 -23104 -120123 -213819 -185066 -151740 -105771 -149848 -173485
14594 -173485 -81639 -25610 -140565 -214232 -113216 -30007 -98396 -104399 -90884 -105527 6928
14583 6928 158325 140219 97000 103373 55795 -49103 42734 138190 169817 64233 66860 100307
14571 100307 49747 -3579 -36871 -27140 37255 14300 47475 99013 43501 -39698 -75738 -37711
14559 -37711 -97211 -40847 26093 -25700 5632 -8717 16093 73487 121364 80140 94068 63620
14547 63620 68434 153499 61708 -32070 27662 -58456 -95908 -185546 -177354 -51789 7319 75754
14535 75754 85615 36352 -31847 -16509 48353 71359 -51485 -165254 -81420 66801 198343
14524 198343 124075 90427 166204 171453 96367 -573 -1885 103872 76447 11657 -166467
14513 -166467 -215487 -232919 -76959 -20746 13325 21338 1305 94105 101681 99051 134664 82740
14501 82740 -41071 50849 70361 -755 -69545 497 37496 182342 153397 24547 -8744
14490 -8744 50572 152672 233186 98368 61192 98778 160695 130323 58761 52380 85752 29328
14478 29328 -4544 -35557 -47535 -157547 -183174 -155030 -122742 -18145 33753 15052 -22531
14467 -22531 -60922 -34835 -12900 -39801 35826 31663 -4918 -4590 -91871 -191849 -220152 -200773
14455 -200773 -123811 -12881 -16931 -68715 -111499 -32754 -28624 -107380 -53886 41036 172758
14444 172758 131465 5972 31186 71170 -19179 40063 104965 108753 28088 -47332 5938
14433 5938 55452 131387 165769 99152 -1150 55651 65933 27838 -28719 -9549 61497 217171
14421 217171 233270 84595 52270 29828 -46584 -129366 -58072 1228 -17005 -100301 -113777
14410 -113777 -104290 -142199 -29361 49004 24426 49860 -12424 -114754 -83591 -48069 -31282
14399 -31282 9839 28877 -26904 -177074 -97363 -88239 -160032 -145502 -93741 -94613 -114164 -82701
14387 -82701 -18160 19266 58645 35133 33005 41583 33585 46547 112064 103784 32892 -42502
14375 -42502 67538 95309 133608 84971 65999 99589 14321 -79892 -19819 10947 105887
14364 105887 150171 240552 129128 66406 4382 -155675 -154475 -96341 -93767 -85996 -90553 -40828
14352 -40828 -43509 -69103 -56446 85342 187696 94802 -79488 -106336 -72147 -132217 -269655
14341 -269655 -305925 -113343 -74639 -67890 -83350 -107970 -84319 21331 -9626 -69171 -36907
14330 -36907 -60543 -1143 65316 48233 25068 -41103 -93723 -113484 -201126 -165116 -97954 -72745
14318 -72745 2198 -126313 -121801 -209606 -112861 34888 71363 -13417 40787 63794 -58017
14307 -58017 -32776 -6533 -52880 -49711 -94731 -96566 -111369 -131080 -148494 -92428 -103010 -82030
14295 -82030 -87475 -50730 49785 -83043 -138921 -145098 -117318 -64768 -68442 -66630 -84306 -83572
14283 -83572 -119550 -110986 -75277 -109247 -99255 -34851 -22538 -21442 -99801 -114475 -176891 -198694
14271 -198694 -183922 -118062 -20198 30298 -4838 -189 32002 11753 -14957 89215 90797 12232
14259 12232 -83570 -74089 -24522 1531 -9125 -8667 -46609 -44845 -79159 -97674 -58341 -19506
14247 -19506 -20673 -22943 -5177 79875 95695 2720 26818 80867 87562 154566 70267 -76766
14235 -76766 -66276 -89870 27811 -3524 -51333 6740 5088 -71510 -86427 -148068 -150842 -162619
14223 -162619 -140494 -196682 -22991 115836 152611 120608 61913 -1108 -143572 -152890 -3241
14212 -3241 9408 -50795 -25207 35686 -63841 -143407 -122202 -116774 -140853 -64606 -5530 -64830
14200 -64830 -114545 -149319 -131587 -134807 -51950 -33606 -177958 -181715 -195421 -141949 -52793 -15337
14188 -15337 -50111 -30949 10431 86846 131938 63066 -128945 -135788 -25124 10568 7354 -25007
14176 -25007 -73699 78641 132206 109308 81115 74147 38462 -34261 -26804 -565 27698 12472
14164 12472 79278 59452 100345 105672 152696 117324 97426 41814 -4058 -99170 -143649 34131
14152 34131 70629 -49626 -51974 -32724 -95795 -164084 -127408 -130192 -176658 -235026 -158702 -8099
14140 -8099 -44909 -52674 -31528 -15303 26217 -67827 -77473 -1890 17725 -2281 -35271 47674
14128 47674 69456 28100 4299 -15499 -15951 -70118 -117053 -152263 -121595 -45251 -2059 1683
14116 1683 -17686 44912 150081 55769 -38759 -45685 -72474 39344 58504 17715 58440 79260
14104 79260 72759 17138 40027 -33124 -110448 -136184 -161290 -80042 -145732 -124755 -64231 12897
14092 12897 7888 17901 107639 121574 -8089 -24254 11880 7906 23848 -74953 -155693 -266501
14080 -266501 -188329 -77702 -72121 -103793 -182984 -139279 7905 71149 74308 108819 139352
14069 139352 44308 -31204 -37464 -5027 -19898 -23862 -83740 46539 70920 -35128 -76299
14058 -76299 -137852 -198299 -145121 -33455 81935 67417 40051 39563 44044 74004 77298 22113
14046 22113 -9311 13682 -8957 13550 35043 35086 -75347 -158622 -33806 142570 226257 208088
14034 208088 129246 118998 113289 86407 38470 69005 150663 142556 71939 111613 94464 31287
14022 31287 6743 -19212 -49644 -51840 -11474 -13026 -528 93401 70918 -10376 18822 92161
14010 92161 25461 69566 137552 101225 114558 122681 78146 12931 7963 3903 20453 83655
13998 83655 -12021 -68742 21677 1066 73139 168848 95204 66516 128066 124634 75694 107256
13986 107256 196758 109088 14504 -118172 -94174 -41795 -9884 14185 -2767 -78607 -106158
13975 -106158 -125187 -137048 -144734 -75494 -80035 -73307 5206 -14695 -111032 -137412 -207191 -230176
13963 -230176 -175244 -95072 -42165 -70666 -161149 -145782 16653 105317 79946 6823 14697
13952 14697 -23899 -5006 25461 16730 35843 -18127 -207494 -157731 -155264 -216962 -123913 -8349
13940 -8349 75729 -9280 2708 16165 34067 15466 -68489 482 4386 -52534 -63784 -48478
13928 -48478 -17754 -176089 -169258 -102388 -3027 -44518 4304 47420 -38677 -85119 -24358 4070
13916 4070 -15837 32709 65807 79715 -30728 -38759 -105569 -185077 -134558 -101893 -110067 -191292
13904 -191292 -266323 -395955 -252453 -93319 -49316 -32794 8004 -13893 7822 40473 146275
13893 146275 94010 60216 146635 78036 -45305 -22364 -22297 -12869 -113053 -167334 -203087 -159243
13881 -159243 -118887 44792 135110 74264 56045 114216 92857 104512 86857 42913 79662
13870 79662 29487 -28140 -125875 -214573 -194832 -276853 -281393 -148275 -72070 41641 -20029
13859 -20029 -31846 -111162 -98744 6721 -84451 -6668 137647 24643 -46841 14765 181700
13848 181700 232288 217576 215494 303367 262007 167582 52384 -31621 -22813 -5126 5766 -56036
13836 -56036 -104842 -90669 -51520 -13578 6848 -61978 -52495 -85666 -56922 -60942 -119675 -149560
13824 -149560 -196718 -84164 55880 98000 18597 -8422 23584 9288 1667 40991 40962 110328
13812 110328 187392 146506 96495 21979 44288 43653 -70047 -67499 -145924 -169002 -233207 -185779
13800 -185779 -144271 -102926 -125908 -182459 -95068 17072 68856 -18514 -68631 22158 69702
13789 69702 45826 189427 58986 14936 -100865 -83524 -66447 -72122 -80541 -17847 33300
13778 33300 67919 42955 -20790 -47496 4346 70829 102810 71510 -20451 -41182 -22571 29320
13766 29320 -21333 -2561 8668 49657 296 -22939 -90866 -109162 -106914 -121283 -204188 -181722
13754 -181722 -102140 -85314 1146 -11805 -94341 -137271 -98662 -43953 -4148 90182 82059 -54132
13742 -54132 -12769 -16203 -36035 -4724 14603 -11982 20565 146757 84768 -35217 -150763
13731 -150763 -271194 -123341 -64797 -126824 -110554 -87852 -61616 -26741 -135782 -176059 -130782
13720 -130782 -107830 -197812 -207661 -152744 -27524 -27584 -62324 -3815 104084 133960 95284 26234
13708 26234 -63301 -35347 3737 55566 52844 67087 -7142 -140570 -117720 -65846 -83084 -106062
13696 -106062 39650 87105 143097 173459 141791 21974 4941 -41663 8108 115145 206653
13685 206653 221295 194690 167539 113644 5752 -41416 59831 135228 158257 158306 118917 40995
13673 40995 -133569 -44132 -45375 -28370 -66056 -114971 -171766 -116711 -27073 19292 -17464 -128819
13661 -128819 -62511 22782 -8994 -48600 -53207 -56591 -78064 -86437 -10161 -12948 -31595 -46487
13649 -46487 76978 89956 94773 155834 246123 174737 45115 -6153 -18106 55352 76824
13638 76824 119625 143283 70926 36260 27739 4978 139824 54579 -64844 -20531 -43990
13627 -43990 -105470 -81170 -58634 -127943 -133146 33160 144987 119631 68967 -1163 -73455
13616 -73455 -38375 127586 177612 156442 30365 34422 -12580 -9926 -14003 14516 -24464 -43085
13604 -43085 -43239 -74450 -108257 -22055 -24533 -53388 -12571 -35257 -47760 4380 16534 64086
13592 64086 20664 -84115 -144096 -115179 5989 17259 -91935 -55015 -39636 51844 53465
13581 53465 53957 130823 117631 37387 -63404 -7829 120927 139722 78163 -63760 -38883
13570 -38883 -38134 -79323 -82817 42051 164434 145795 -35449 -137589 -135997 -124091 -120827 -106400
13558 -106400 -18378 -55 -1201 47449 49661 -102986 -140894 -112402 -13856 -20190 -77070 -184481
13546 -184481 -226346 -116752 -48730 -141541 -137115 -34735 92294 116723 58906 49495 72282
13535 72282 23810 -47550 -27608 -37431 -48555 -36198 -2753 -35046 47509 73612 50675 27025
13523 27025 71961 134347 32351 -75842 -81214 -85814 -86638 -95790 -98263 -67184 -103418 -74855
13511 -74855 -107560 -118211 -135131 -154194 -54738 69154 76703 153753 144068 86926 62871 56704
13499 56704 8820 -125416 -70508 -102029 -141704 -176660 -133894 43952 150448 207913 132528
13488 132528 2431 -6204 32922 -17379 -15768 -35283 -68020 -123704 -88433 -26400 -48986 -27307
13476 -27307 70610 134786 37122 43140 61243 190949 254582 96498 102008 161593 59420
13465 59420 26912 7624 -30287 -25 -51819 -38370 -78336 -139505 -149271 -124066 -90218 -113119
13453 -113119 -89270 -117385 -103963 -57077 -122953 -77238 -76258 -104395 -16680 -79283 -180435 -143016
13441 -143016 -104403 -191323 -163373 -136302 -132790 -37508 19357 141503 160262 26227 -91807
13430 -91807 -95791 -108054 -49733 -16633 -56607 -50652 -34922 -95635 -123865 -86630 -111803 -80437
13418 -80437 -90504 -141437 -267487 -247530 -247529 -191605 -228142 -198632 -90466 -5894 25309 50982
13406 50982 24390 24796 4517 -8119 -2440 -26280 -128491 -160217 -1171 61009 -18586 -131443
13394 -131443 -174449 -126660 -10684 154995 164640 96711 73549 138392 123924 110818 93747
13383 93747 104205 18154 -116102 -136322 -32476 7757 25997 -70241 -64387 -121770 -37739
13372 -37739 1712 -4390 80297 151969 133890 108554 53439 -16853 -49102 7588 -54371 -218777
13360 -218777 -173719 -71892 -63084 23753 144367 222739 188781 142518 209964 291854 201772
13349 201772 162538 93836 87274 124418 88308 63349 93239 23370 -14780 -144130 -149433 4477
13337 4477 -32264 -43094 -49351 479 -66444 -103320 -102550 -10764 -75323 1168 -19968 -118915
13325 -118915 -122197 -97127 -5474 74934 -33408 -167674 -166615 -166871 -39572 76260 76525 83816
13313 83816 67816 23060 -33456 -58218 -17783 -88455 -66202 9098 95909 -1408 -43369 -64816
13301 -64816 -13964 63053 67188 -30326 -103013 -193323 -255052 -319572 -278119 -189509 -130549 -30946
13289 -30946 28154 -655 66662 29338 -44981 -71384 -78713 -111475 -182647 -116348 34620 6382
13277 6382 61745 120063 22004 4943 43034 115123 56674 27123 -6122 63479 -8554 -50399
13265 -50399 -43254 -11961 84393 143660 151356 101163 -3853 -53216 35 128795 81766 2556
13253 2556 78090 68875 36560 21386 79199 6960 11373 106746 108166 45443 23984 -40789
13241 -40789 -29218 -120586 -169557 -107344 -16417 -158918 -189295 -25671 17293 65784 97730
13230 97730 71023 49993 106967 -36426 -105898 -24696 61257 51649 -19523 -83799 -114197 -142878
13218 -142878 -159663 -102804 -73596 -48558 -60534 39357 120180 33269 53711 31820 88700
13207 88700 166465 66002 -48280 46009 64784 102180 4057 -133852 -116253 -124762 -208469
13196 -208469 -104763 82384 145980 72308 72584 109214 85890 -28476 -31610 -20047 -80843
13185 -80843 -137012 -39617 23971 17343 116361 71382 33644 -17914 -79402 -102015 -97661 -101638
13173 -101638 -64537 -60594 68508 147777 30744 58096 99178 29648 -772 -22410 87533
13162 87533 91768 -40444 -50515 -53606 -39611 -110627 -118456 -32477 -64763 -66957 6225 43245
13150 43245 47664 39591 -11389 -20165 -52036 -51452 -7197 62689 88249 16446 -53591 -138633 -146564
13137 -146564 -78181 -71674 -74053 -41220 -50667 6501 135890 214442 181382 155620 106964 81356
13125 81356 64077 -79512 -114663 -31142 16296 39174 41068 59801 132850 82405 83134 -55968
13113 -55968 -196293 -223009 -201114 -105635 -84338 -52284 97215 194675 274123 245502 167099
13102 167099 -14102 -78387 -48541 -8597 -42658 -112368 -90488 -47870 -59198 -26401 -39080
13091 -39080 8841 84948 76160 113732 120507 -18988 -56681 48782 -49832 -100867 -35738 -8392
13079 -8392 51906 37708 -6399 6058 45804 79568 -55019 -209542 -227474 -176989 -82145
13068 -82145 135109 289904 194227 88401 97355 -17139 -99672 -72417 19699 -65781 -76047
13057 -76047 -37033 23949 71537 100222 105929 165770 58146 36329 -33698 -55271 67366
13046 67366 107006 138349 119028 89524 57443 195528 263436 78288 -12746 -25812 -152940
13035 -152940 -121352 -81112 9087 74389 -32879 -98368 39269 212863 189385 40029 642
13024 642 27595 59256 40480 67447 139827 69392 27420 103223 84972 23835 84193 101824
13012 101824 -46464 -10889 108484 226018 122975 67460 37499 100920 121906 73608 -17906
13001 -17906 -53208 -88563 -99140 -128264 -138403 -154457 -126431 -38270 73467 182298 126714
12990 126714 79708 -47117 -164217 -113484 -47177 -45553 -7278 -81970 -137037 -90708 -29503
12979 -29503 -24713 4708 42006 29371 44006 17737 20818 180331 245575 207613 124009 206892
12967 206892 177862 153868 111620 121368 190398 68706 -669 30745 35224 -44786 -110207 -40274
12955 -40274 6112 35131 113048 82374 -3057 96230 130241 200307 103172 103272 75166 23626
12943 23626 -83460 -31927 89467 17806 -47230 -24502 -37806 -41854 -4413 43945 136587
12932 136587 159791 1518 -45296 42077 -22161 -98683 27071 51153 -53599 6794 22330
12921 22330 -103087 -180849 -152673 -140343 -132137 -83842 -133674 -193647 -92841 -97625 -174496 -249483
12909 -249483 -216404 -188683 -173255 -112431 -33159 -23604 -95858 -66854 8990 -5399 -64942 -39782
12897 -39782 -76926 -86426 -41600 20601 -56224 27904 48487 135916 170517 140047 104590 10993
12885 10993 -50063 -64044 -77509 -119579 -26926 -27595 -8571 91493 63883 -33376 -107806 -84772
12873 -84772 25810 37309 -20425 -50603 -43758 7459 8699 713 -46067 -146475 -188084 -201587
12861 -201587 -167556 -116427 -176468 -180903 -164131 -52740 -89143 -82976 -40151 -113620 -82067 6811
12849 6811 123028 60471 -48109 -125020 -63081 37521 76273 86516 -13247 8490 55865
12838 55865 -73474 -86051 -126556 -163946 -117246 -146842 -103051 -31045 -50410 -10414 87331
12827 87331 145609 141984 157438 246103 388548 298762 128775 104401 20049 38387 76470
12816 76470 135349 139945 159339 80333 21652 -34099 492 11676 16218 16111 -15895 65703
12804 65703 25111 17227 -10011 51843 44731 82744 129105 79403 53492 70338 90719 115017
12792 115017 160741 175376 134375 171370 207220 93713 140544 185783 83518 46381 4402
12781 4402 -61851 -20751 20653 -45196 -132830 -174647 -125397 -66989 -12626 -72656 -129501 -67018
12769 -67018 9200 109050 2163 -31234 -60745 -37901 -111835 -247607 -236438 -149249 -135162
12758 -135162 -93028 -98656 -29671 45232 -32684 -40373 -45422 -31447 21518 23545 34756 105326
12746 105326 43442 9844 5896 44912 11296 -6252 -50805 -84865 -37973 -59878 -117070 -81040
12734 -81040 -115730 -81478 -63634 8486 90822 131685 107901 96106 41108 21220 73214 -6253
12722 -6253 -82233 -74484 20542 61056 91133 104977 36151 -1805 9334 39191 -2890 -1758
12710 -1758 -18382 72629 48269 -31189 -46537 -40846 -124612 -81716 -20166 -117993 -142276 -117166
12698 -117166 -60287 -1871 55082 38515 -14846 -47011 -34101 -39830 7467 42977 -34344 -69411
12686 -69411 7531 62527 58470 -56254 -96490 -118666 38484 112633 127712 136756 50987 2604
12674 2604 -34977 -20591 35135 12331 -19902 -74191 -91064 8666 51365 -50235 -126016 -68583
12662 -68583 59774 115438 125137 88801 58406 106703 121411 86957 34862 34409 80356 59103
12650 59103 25082 6524 23877 39257 -15517 -168754 -163584 -190622 -213422 -254497 -222201 -192012
12638 -192012 -244122 -173962 3076 127438 112677 -13499 -26235 -58110 -135957 -165034 -80583
12627 -80583 -440 28122 39144 44996 -40636 -98318 -125218 -37248 36686 -45778 -105722 597
12615 597 15380 -88825 -116693 -129403 45990 59761 32640 54276 67890 93285 -22754
12604 -22754 -43887 82472 182692 301315 213360 80899 -6812 -18378 1048 21925 29618
12593 29618 31500 19926 -8414 -38974 -32185 -95824 -174060 -183109 -170402 -69302 45458 -10662
12581 -10662 -36997 78194 163918 81668 -14984 -108148 -94579 -85234 -46798 -82428 -79281 -30199
12569 -30199 -26561 -3065 61959 26635 -23326 -20903 -14876 -35370 10190 98728 168789 149560
12557 149560 57276 -44131 -38690 45535 34604 -19996 -155960 -112627 -82641 -162770 -139420
12546 -139420 -132136 -69653 -988 63057 138345 181383 92401 45601 21278 -59234 -66998 -17330
12534 -17330 25822 22690 -32973 -32872 -89142 6511 36864 88261 111122 101505 38764 -68714
12522 -68714 -180488 -228608 -104659 65118 15052 26127 -19872 -66328 -53347 -45919 -64630
12511 -64630 -55299 -122158 -137106 -143643 -199863 -264154 -291736 -273979 -117794 53248 81378 111457
12499 111457 96855 55885 36058 -12432 -52624 -57622 -77163 -63124 -63166 -27787 -72770 -83625
12487 -83625 -18180 39524 51425 41639 89578 36049 -32111 -45088 -31994 -28612 53900 128654
12475 128654 32624 -7258 73267 89603 26943 85415 142765 170260 66943 16207 46604
12464 46604 21734 -73155 -12285 42315 22777 2692 3568 36010 74254 87046 35615 94483
12452 94483 112507 87813 47269 2331 -95235 -184647 -37368 62961 46073 93666 162739
12441 162739 134666 -72094 -93955 -58455 -30443 -42522 -79838 -7379 102401 187266 147655
12430 147655 26377 -16289 92139 74831 -31526 -56974 -129023 -84048 -43942 20011 103068
12419 103068 155474 178389 203595 147689 138683 61015 31151 19035 -9617 -4724 -37242 65486
12407 65486 37099 -38197 9005 13650 65128 50320 21264 -55766 -42879 -13908 -104188 -85517
12395 -85517 -90567 -53853 -9686 -34671 -36622 41835 2168 -100299 -103325 -9072 -15629 67929
12383 67929 165435 115379 -8705 12186 69330 72874 58405 8250 -8464 -47781 -27547 18407
12371 18407 -13688 42030 84596 38284 -105836 -161790 -89883 -69241 -73240 9116 28597 64899
12359 64899 67316 11014 -57776 -105493 -74464 -77927 -19854 76568 64539 21207 25452 119942
12347 119942 167437 109928 51783 112097 130436 150288 175023 104766 51460 46140 7278 -69907
12335 -69907 -80999 -39192 -40197 -17744 -25823 -11578 14874 89002 241139 252269 81990 -110209
12323 -110209 -140556 -99679 -41193 86828 87815 77687 12840 -7134 -6245 67402 80105 13498
12311 13498 86948 61569 -19370 112810 65368 -28086 -2247 -16909 -75995 -17111 41040
12300 41040 -12982 -78091 -17978 76179 169594 74567 62724 48146 -44547 -188380 -255273
12289 -255273 -163605 -62557 -35097 -42793 61467 136732 127257 122043 -202 -10773 30382
12278 30382 44182 50310 61090 -45166 -63181 -32564 67840 96077 50894 -38500 64294
12267 64294 56306 -16577 104 63296 83782 193123 142192 99420 115468 107463 62311 -7632
12255 -7632 -158841 -113148 -38794 37671 115876 153504 109601 118421 71220 169468 150411 100210
12243 100210 76748 16351 30041 43686 -38405 -63562 -58903 95083 101456 -218 -23057
12232 -23057 -81258 -126335 -30530 -44100 -1387 28186 48188 117896 141302 106646 32974 33108
12220 33108 -43649 -130582 -25179 -53851 -131886 -55719 69 -6828 -51438 -143597 -173386 -127679
12208 -127679 -86472 -64422 -82751 -181897 -192966 -56565 -4213 13253 33776 -34362 -51045
12197 -51045 -126079 -40797 26474 -10197 -63947 15063 25241 113610 42646 -45261 -104939 -47525
12185 -47525 -31240 -29567 -36764 -169142 -184727 -120482 3566 26931 -30953 -77814 -104440 -59910
12173 -59910 37237 45594 24710 -20327 36233 44377 2355 15330 64508 143885 141750 46258
12161 46258 -33314 -63347 -13319 25138 33839 -2370 11223 -3484 60404 35472 -48332 -59628
12149 -59628 -18295 -48846 7650 37958 -4283 42927 1802 -116460 -212933 -197665 -140285
12138 -140285 -78311 23250 150137 116566 56347 56794 54539 6486 -49252 12701 160759
12127 160759 202315 88827 -80226 -199386 -165909 -131855 -111307 -86623 -58143 9728 98969
12116 98969 34680 -72922 -116367 -149956 -180635 -130752 -84135 -12313 91514 133030 113829
12105 113829 154892 61687 -55831 -112908 -45792 125627 102579 54702 119503 190032 115721
12094 115721 58465 69199 24620 -47768 -100304 -16535 23569 -15052 -94010 -133596 -116952
12083 -116952 -61921 -60409 -73163 -24382 53575 133784 141809 59870 33508 -36673 -70727 -95406
12071 -95406 -123476 -47820 17208 -50585 -33325 60430 124034 57418 41229 13555 32403 40192
12059 40192 -7570 -65959 -111862 -7524 64928 23979 -51964 -71422 13617 4463 -84985 -121137
12047 -121137 -80075 -98170 -105254 -4085 19610 -38700 -71579 -61277 45525 95621 106202
12036 106202 141988 108354 57697 88708 82552 103070 155003 88717 97686 63290 41257 88787
12024 88787 30400 -50380 -37362 28997 -16869 -72674 -115315 117519 157251 112575 24855
12013 24855 23431 40526 57371 -42550 -70385 -18213 16162 39692 -6685 -32329 -1561 -16596
12001 -16596 -70987 -83875 -1339 126864 207137 163169 171845 77743 -41739 -162312 -191035
11990 -191035 -135118 -141706 -151821 -96960 52337 117227 171293 68123 -19892 -4913 32786
11979 32786 36426 -39871 10919 43829 4822 -46155 -110169 -95986 -162419 -155749 -94225 -29276
11967 -29276 -94511 -144775 -29175 6888 -75612 -63089 77283 112836 39316 -7383 17197
11956 17197 9231 -40164 -23214 110786 220066 283549 228039 59453 -23756 -144311 -151900
11945 -151900 -188206 -307924 -316560 -162578 -27090 -3602 29395 48677 192575 230678 219161
11934 219161 133026 56662 -24049 585 13536 -97083 -130505 -68902 65956 -9676 -54969
11923 -54969 -17262 -57611 -64604 -63458 -39331 48714 58560 -8390 43663 -79231 -91958 -45247
11911 -45247 -11891 57415 -27450 -85159 -85521 -138308 42382 123050 114626 49885 122061 -42248
11899 -42248 -176414 -225761 -204537 -71207 43388 128302 -257 -76536 -84966 -104828 -90331
11888 -90331 -57266 23881 67416 -6501 30732 114659 120333 110904 79624 37479 -99086 -130844
11876 -130844 -149672 -105895 -18243 7496 -32595 -103851 -194421 -217016 -219464 -183968 -148314 22938
11864 22938 154259 88766 -57006 -172677 -113686 -37139 -24658 45456 105215 95016 -29643
11853 -29643 -106374 -180946 -122287 -33069 -45426 -72787 -132154 -134615 -118470 -161666 -239509 -160476
11841 -160476 -6752 72458 25610 -76838 -72298 29225 48974 -66846 -79444 -83887 -157837
11830 -157837 -69577 61007 42621 2906 -11139 -49947 -43449 -6596 -32742 -61031 -57548 -64173
11818 -64173 -53017 -97928 -81893 -165758 -51509 7 39275 55773 66739 68823 -28655 -26723
11806 -26723 3567 64696 153369 175054 155766 19842 -14763 43413 4330 24161 63106
11795 63106 72947 112570 89586 29459 -44279 -22930 -17566 -49932 -43470 44940 53677 78316
11783 78316 91830 57322 189 -52265 19641 58348 111305 38492 -23195 -74397 -11616 41152
11771 41152 14662 -38100 1344 11966 -44532 -66284 18048 94155 160728 181562 137516 70862
11759 70862 28141 16550 -11499 35265 -24751 -41448 -76008 -81997 -15994 12935 -10507 -27315
11747 -27315 -39461 -36916 -51386 -48752 -24077 43517 26083 40439 -58229 -138868 -163540 -70625
11735 -70625 41393 103766 176365 83159 -19037 -38016 15482 121852 132935 12359 -130398
11724 -130398 -150896 -108466 -72879 -27803 -19275 -12216 1849 5300 -39994 -84245 -29074 76374
11712 76374 75053 67401 60103 1025 -77558 -119913 -28000 101185 129435 -9115 -61129 28919
11700 28919 134718 175365 66836 -32776 26817 16874 26808 -58948 17816 74589 104265 88036
11688 88036 5857 -59516 -123164 -74195 -32403 -68352 -66394 -96253 -60465 51 -40050 -98071
11676 -98071 -154536 -41213 32950 -75050 -141053 -114532 -18893 -24548 -55347 -153849 -217400
11665 -217400 -83765 27375 87025 51011 60012 102754 179360 215176 136110 48955 -43652
11654 -43652 -26266 4900 -8501 67799 90750 -50748 -42892 -56140 7173 -20536 -20742 -38161
11642 -38161 -34978 -57150 -35369 -63310 -125248 -198830 -215486 -80402 66492 26755 53685
11631 53685 -28310 -63626 -98727 -118534 -82234 12666 52936 -7757 -55096 -169569 -135562
11620 -135562 -45596 -2668 109429 131347 763 1878 28470 -34821 -103576 -103354 -130733 -185053
11608 -185053 -133892 -10666 94266 -11240 -118798 -105522 -10844 90187 52165 -65787
11598 -65787 -78348 -63763 -109978 -8420 93471 21506 -45333 -52125 -36160 13795 141304
11587 141304 227187 146073 -4624 -122850 21899 42179 -738 -28851 -103833 -120284 -155512
11576 -155512 -100415 -56900 -67444 -93245 -11842 -319 -90511 -78559 11242 40259 -12523
11565 -12523 -54258 -38015 -147709 -234765 -167194 -144842 -127175 -124384 -197738 -301453 -338385
11554 -338385 -202572 -160572 2657 68397 -1000 4885 22092 -20171 43255 22840 -67235
11543 -67235 11082 68375 54631 -62064 -191442 -207641 -155528 -102084 -188824 -117353 -33242
11532 -33242 -1658 -98543 -106851 -12891 -62966 -31361 23730 49724 64567 118845 127186 164657
11520 164657 234828 242820 187028 141736 195793 141857 11475 -17666 82809 41695 -50260
11509 -50260 -17624 30374 -106041 -119075 -27839 17098 -8581 -50549 -53722 -93384 -158532 -162724
11497 -162724 -150353 -129509 700 74620 83102 -23231 -28560 -41395 -56580 -195493 -113343
11486 -113343 -18438 -51528 -8913 32630 -8711 -23899 16812 -8777 71741 22396 3104
11475 3104 -19009 -60474 -68017 -47714 63921 104494 88315 -1019 -48891 -69011 -9056 -16968
11463 -16968 -42452 -87612 -28354 -54223 5486 24851 -93782 -152840 -100867 26756 89973
11452 89973 -15344 -2184 76009 74368 12261 13280 116791 189821 172720 108942 57755 -16872
11440 -16872 -111269 -149166 -113272 -22179 86308 81218 -11105 -1364 52867 67087 164998 243762
11428 243762 246297 261596 182058 46691 36680 56184 -22160 -25005 35805 102111 98934 70439
11416 70439 -10146 -99591 -184888 -150726 -155917 -88715 -23648 6861 3362 50345 82275 -35766
11404 -35766 -45645 -59476 20812 49353 61284 133047 172667 150392 167564 105108 -82058 -128771
11392 -128771 -104627 -113332 -46358 68062 -18588 -201117 -199246 -123658 -112441 -16984 -96388
11381 -96388 -218001 -164302 -97273 -20348 25160 98153 25407 26021 10222 13517 27998 43962
11369 43962 11941 37771 12193 -4393 19929 15395 11234 -54318 -79816 -48815 -57240 -65629
11357 -65629 -1585 23158 72569 65208 57410 20256 11009 15613 -97544 -181560 -106936 -78941
11345 -78941 -46218 324 -49308 -19394 15739 81605 77325 131988 62741 -61947 -51290 100165
11333 100165 140714 69687 2391 -20939 -52141 -118077 -82657 -16315 -27979 -73271 -93156
11322 -93156 -47690 70990 120735 179426 156672 82729 89835 135917 138595 1040 -59089 -61505
11310 -61505 -82348 64035 143479 88066 137786 216158 216433 111048 101152 80604 96757 64159
11298 64159 -76747 -105721 -42934 -4926 -80152 -95781 -82833 17233 124198 -39015 -174272
11287 -174272 -86446 33801 49720 102921 140540 138689 45193 -120444 -110734 -66480 -20354
11276 -20354 -255 -28847 11409 -12934 -54312 -18938 -82576 20799 71897 60812 3445
11265 3445 -32155 -67172 20068 19275 -32111 -66692 16150 103534 112601 97939 38254 -17860
11253 -17860 -5608 -30847 -48711 -13116 -36000 -141446 -180247 -238612 -238465 -101448 -91227 -109282
11241 -109282 -57743 -65815 24292 176789 85625 34584 116478 58698 -23346 -3089 9461
11230 9461 36907 -32355 -168502 -154147 -6315 69762 110422 228675 201869 100955 -31103
11219 -31103 -29624 133947 180910 40203 -46830 -38008 67251 159848 117954 52553 58911 129121
11207 129121 157897 143991 92736 55081 17421 122138 50875 -57109 -56984 -2559 60654
11196 60654 -33365 -112746 -102552 133 68574 -50011 -113856 -102632 -76258 68465 98536
11185 98536 -37686 -78586 -26352 62518 111799 25067 -167661 -188798 -149724 -71575 -85311
11174 -85311 -67561 56912 151352 145927 102550 39105 26794 -83772 -110131 -179573 -273306
11163 -273306 -319658 -155563 -7248 41138 47022 45393 48967 130681 155311 153161 79962 48391
11151 48391 -17960 -60380 -36190 -53065 -25874 -55554 -148151 -217974 -190831 -209349 -214550 -152046
11139 -152046 28456 207042 113618 80256 102073 -21106 -49183 -123004 -32909 -153757 -248484
11128 -248484 -219076 -195270 -158258 -127902 -77971 -89439 -16153 23419 -35789 -77075 -223571
11117 -223571 -311755 -76040 -12774 -166160 -194077 -124287 -63080 2798 1035 86341 212790
11106 212790 116360 81277 74003 146191 180221 105888 48142 73515 90991 63484 14721 -11722
11094 -11722 -2786 10676 -52626 -46039 -82911 17845 125773 137996 20307 -10293 -40093
11083 -40093 -27103 -60132 -58229 -8459 -50480 -112874 -100894 -18133 112864 117637 34334 28236
11071 28236 63601 62529 49828 41303 -7089 -12707 19629 60410 77045 141102 192375 86358
11059 86358 30655 82157 104142 143906 195441 295991 239893 90636 -54525 -43816 68943
11048 68943 188941 133628 28181 34209 7624 33667 19597 -9215 -33860 -34510 94923 191913
11036 191913 103679 40776 56301 95483 101156 107460 52632 709 -90408 -72959 84828 98069
11024 98069 43360 18391 4016 106022 64935 24067 -39554 -84236 -27427 -73649 -101867
11013 -101867 32593 72938 33941 -15309 -71611 -29786 47055 44258 22805 15960 48247 119617
11001 119617 166627 192493 145651 30414 -61086 -75907 -45820 -45290 -91225 -156233 -152641 -106551
10989 -106551 -154615 -144593 -63658 45016 48100 17376 78326 52171 163963 169839 45056
10978 45056 21476 -12666 -16947 24824 -6359 11038 -55222 -33965 18811 58394 39683 68725
10966 68725 -17370 -45537 12940 -12074 -38349 77936 66317 1044 -95123 -75112 -27511
10955 -27511 -45588 -125571 -107034 -37275 9383 50930 123560 131041 98869 102221 154963 62648
10943 62648 -38858 -82186 -140676 -44827 102476 50968 91695 61590 -1877 8875 32858
10932 32858 -72085 -135299 -89982 -180919 -180943 -113184 -80679 -5518 73951 66714 122661 112295
10920 112295 103763 41937 543 -14247 -56180 -101568 -126269 -67797 -5501 41939 39934 40040
10908 40040 6901 -19161 -10737 -30814 -33427 -9349 -63164 -78995 -69287 -32401 -20724 3826
10896 3826 -62560 -198822 -209988 -136662 -30262 -30176 -43486 -9555 28505 159902 217000 133517
10884 133517 109880 -335 -15767 39048 -43428 -42040 -126789 -98680 -21318 86456 118070
10873 118070 111119 67848 28091 25015 96763 -20260 -83112 -50766 -58559 -71259 -28963 70815
10861 70815 34654 -82590 -173026 -202727 -136950 -82563 -78988 25859 94896 84925 2263 -59662
10849 -59662 -63478 3382 -33720 -28894 -24242 -20744 -32761 37548 36801 68155 129632 94578 78155
10836 78155 120383 68208 -38349 -105626 -126221 25672 94945 49674 65340 86702 132171
10825 132171 134565 139080 87780 80304 114925 166179 60377 1964 -16287 -2517 -36421 -44264
10813 -44264 47802 29753 23149 -19041 26742 40338 71612 141691 100107 26748 101912 142222
10801 142222 77631 89165 81678 106477 155556 165891 116614 76558 -7721 15074 102618 172453
10789 172453 84863 -12312 -9697 142551 77198 12404 -102899 -152928 -62265 -80372 -64021
10778 -64021 9719 143 106383 -85178 -116646 -36672 -42739 -22933 61377 57679 95038 117722
10766 117722 -51891 -169786 -12062 105550 62023 26297 16721 23150 60040 31010 116891
10755 116891 107249 94485 31942 18737 16235 46474 131572 156292 166388 157284 55970 10708
10743 10708 48138 42460 -129330 -121775 -6074 38752 33906 -33705 33198 60691 168013 155750
10731 155750 32014 -63984 -103594 -45060 106432 159994 82792 121137 132613 73412 61408
10720 61408 3881 -27956 -2571 121104 74309 113220 91323 107352 43533 -74570 -110992
10709 -110992 -138845 -229413 -224402 -315341 -234224 -183422 -166677 -168427 -155647 -136973 -192274 -125880
10697 -125880 -69170 -116888 -171602 -109935 18235 46460 -63936 -31123 -34996 -54881 -85703
10686 -85703 -145030 24301 133431 106505 47472 90899 198305 274720 238505 196359 102664
10675 102664 57766 -4871 -33584 64323 65205 47661 65334 -26907 -536 79424 141354 188262
10663 188262 187651 93825 2010 -32714 -53750 5450 -18542 -36438 9262 -41740 19316 77757
10651 77757 8335 -103903 -106198 -53358 20666 -88824 -172721 -55322 48923 109835 177375
10640 177375 136365 98166 161930 275491 315685 91071 12355 -25860 -84962 -3636 118987
10629 118987 72648 91709 156497 96750 101284 -19051 -14772 -15800 -22966 -6891 -29188 -73569
10617 -73569 -136157 -86951 -74956 -142793 -159702 -94748 -59549 49057 -12837 -138830 -205776
10606 -205776 -97004 -10701 -55718 -74290 -7250 95955 78266 80213 -1640 -97371 -115117
10595 -115117 55721 240792 175586 89372 90914 10885 -46211 -22118 47915 -59287 -51225
10584 -51225 -28812 -60091 -59905 -105095 -38528 34113 88154 137299 153793 231427 142338 -20706
10572 -20706 54327 66746 33432 56870 -214 -86340 -88844 -8071 11353 -85285 -114511 15957
10560 15957 132987 111329 114315 29091 -191963 -176355 -145907 -72786 -110825 -43996 -48996 -92049
10548 -92049 -88186 -75060 -67309 -1963 -2316 -52099 12795 78384 99799 77758 28648 45317
10536 45317 43026 16554 54930 123479 30265 40959 -8317 8648 15830 -104985 -114959 -68987
10524 -68987 -87804 -43211 -48856 -31683 10880 157464 179513 77607 -40719 14410 38351
10513 38351 76060 77890 92636 39676 -51 -43357 -58765 1842 72332 46093 20569 24445
10501 24445 24078 109501 183992 121796 -11538 5754 72123 45537 77598 86842 158808 171698
10489 171698 213711 85110 3897 22410 -12484 65229 92759 -13302 -141799 -134110 -61639
10478 -61639 -65593 -54026 -12646 67801 112424 139110 34257 63585 126844 89595 36701 -24196
10466 -24196 -18178 31902 -69004 -51417 10502 -46035 21843 27997 -142358 -164755 -141638 -71928
10454 -71928 93675 78342 43273 104748 74162 -8402 -55303 51247 -52603 -33323 -30065
10443 -30065 -76768 24419 71049 38148 65373 97977 176503 189827 63004 -59658 -1674
10432 -1674 9886 -40896 -176171 -198459 -38634 -51186 -20496 22102 15021 16309 56809 21688
10420 21688 20123 107616 78101 74612 11373 -10437 -27135 -147171 -170575 -45576 122491
10409 122491 197890 72145 -16256 -11028 -65949 -87321 -89086 -80748 -18409 90411 38707 8732
10397 8732 51606 -93832 -143794 -127152 -11632 -46665 -64614 -81160 -17971 119881 185346
10386 185346 94364 25862 114492 107756 91214 53930 -32349 -16929 -175 15465 57553 135465
10374 135465 269604 210669 108968 -24245 -98898 -26444 136484 144863 91037 120412 228565
10363 228565 281843 279884 240442 200835 203138 171105 210196 136938 178627 246157 154185 30815
10351 30815 -29858 91419 109041 31020 35528 127033 201486 129767 78796 125575 173432 126051
10339 126051 137459 184111 161822 114170 98058 63517 114055 74423 -18488 -90511 -79562
10328 -79562 22984 107926 56216 -20196 -1596 146713 113994 100277 139736 223377 106148
10317 106148 -23045 -34735 13628 19064 35602 52860 26213 -51057 -113500 -28378 -59095
10306 -59095 -107010 -26463 55381 48457 28146 40761 46347 55505 173271 150498 154278 166955
10294 166955 135128 58381 -20397 -75686 -3840 177944 220714 152316 207730 286012 223324
10283 223324 123930 214769 220479 125310 43284 -16807 164941 179581 189505 264660 183239 120564
10271 120564 176201 108353 43452 29620 -23485 24352 116382 155097 230722 167461 32170
10260 32170 27628 -136681 -92017 -100882 -211226 -183817 -174617 -96001 -64080 -45277 -12655 92681
10248 92681 184103 243375 224604 171922 68149 74627 66509 61387 51034 30207 42021 41791
10236 41791 262652 308715 126279 3679 -79896 -114534 -49437 -10671 -17560 -53624 -79983
10225 -79983 -193199 -137818 -27959 -50827 -44811 -89512 18093 121709 80632 184802 214681
10214 214681 201746 137627 84342 -19377 -141172 -78867 -38540 -187370 -175569 -49803 60020
10203 60020 -486 -25913 -20853 -68944 -81228 50763 177464 175127 119463 128280 169455 94381
10191 94381 53600 78188 108128 146494 93247 -15710 -26497 -91152 -177388 -52294 -3717
10180 -3717 -10994 7664 23465 51004 73434 -19700 64943 190630 165037 66485 -29441 31283
10168 31283 67130 -9686 -138177 -179163 -101981 -130274 -190467 -200763 -119923 -63927 -78475
10157 -78475 -44955 -79014 -35950 25698 27283 109308 185887 208923 254899 136045 19043
10146 19043 29461 36069 18423 -22840 -136774 -149309 -98867 -72822 6465 -5795 -36629 59291
10134 59291 96682 47681 60521 121375 108662 28662 -25875 -9025 -28356 -125009 -73086 96067
10122 96067 156655 87204 94490 200652 147985 8399 -12378 4813 35385 -63884 -96877
10111 -96877 -61139 91239 102191 56229 -46215 -53846 -43759 8778 80301 132873 117547
10100 117547 120859 -7073 -6737 83581 54813 -78329 -39596 -23076 -43444 38243 25204 -28313
10088 -28313 -54857 3464 125265 47605 -86170 -183684 -17829 109447 115620 42053 -85884
10077 -85884 -68545 -43389 -17885 -58215 -100385 -46493 32431 118493 17203 -66012 -131628
10066 -131628 -69991 -51664 -6672 -35228 -10490 -80941 -87765 -72467 -26044 -9979 -19408 -101361
10054 -101361 -101777 -54057 -23840 38743 29873 109576 118997 9368 -109349 -56361 -9720 70209
10042 70209 100175 47905 24099 -28953 -81950 5659 38017 -10421 43206 84786 136229 79000
10030 79000 7453 12600 -80382 -200205 -236467 -147976 -164863 -91876 -18777 -2261 -39331 -44089
10018 -44089 26773 75931 56295 10002 6931 -35875 -42334 -11097 -55054 -4921 77467 51191
10006 51191 86021 70448 -11078 -188024 -172290 -76350 1086 17695 -45841 12366 103737
9995 103737 121679 101715 78914 50925 126202 107786 12179 -14325 -8527 153051 181518 121370
9983 121370 -12131 40347 25290 -72527 -68013 -153457 -159786 -119844 -15901 -127831 -265314
9972 -265314 -135262 -100801 -202385 -178240 -162848 -134450 -107364 -72524 -21028 -77375 -97844
9961 -97844 -44291 -44764 -64744 -39421 -3827 6900 11317 103168 185518 242802 234233 182404 114016
9948 114016 100906 117859 135375 48514 -11592 -125345 -46206 52224 56192 173340 181836 142170
9936 142170 129559 165045 186178 203442 177944 59795 21257 26859 78455 60268 51237 86263
9924 86263 78545 23399 -58760 -65514 -125730 -94480 -39928 50312 110690 161670 130584 108393
9912 108393 93684 78715 86738 42974 26262 58762 146348 35816 62909 65665 11650 -30200
9900 -30200 -96741 -111860 -48167 -43250 -23657 98021 48052 2827 -27249 68621 12394 -56227
9888 -56227 -19526 -66670 -88159 -41014 -109917 -118841 -94676 -86066 17469 114949 42821 1129
9876 1129 9586 20987 -26887 15563 63076 49448 -56270 -93868 -76153 -159623 -157327 -158740
9864 -158740 -120123 -93016 -123544 -148915 -211412 -232868 -39476 -17042 -57225 -35842 -98138
9853 -98138 -162893 -119099 -35360 -3248 -47186 30043 104953 150291 131212 108001 -47286 -139772
9841 -139772 -187986 -151762 -14958 10513 40823 72842 -15673 -53954 -38510 -134025 -295384
9830 -295384 -325275 -233300 -149695 -88687 14357 102851 100152 21855 49734 80459 62652 33434
9818 33434 81650 139529 91686 56307 23762 -71902 -93721 15670 68239 -21801 -90209 -13748
9806 -13748 134357 236297 154487 83756 85500 24417 46357 62990 77163 -25962 -55371
9795 -55371 58138 13922 -84737 -44438 22147 142035 179067 84534 -5710 45811 30958
9784 30958 5545 26236 14819 -12287 7655 -83711 -162096 -101687 -21862 58411 88502 103757
9772 103757 17078 -513 -75948 -161230 -198417 -239625 -213185 -190523 -114540 -82746 -79448 -60161
9760 -60161 -56855 -7754 48259 113690 90354 38168 112354 75866 22104 35982 2496 -26691
9748 -26691 -78587 -90933 -25821 -53096 91338 147576 1418 16489 20942 -136103 -172036
9737 -172036 -92677 44419 170787 168271 96319 40975 18484 1214 -30845 -48915 -105971
9726 -105971 -160963 -77730 -37816 -19814 -35636 -36553 -100368 -146284 -53037 31477 -91130 -192681
9714 -192681 -99307 -63078 -34717 -76627 -85882 -73790 -126556 -200790 -149480 -150531 -73862 4428
9702 4428 13238 -79963 -81175 -116031 -49452 46202 68905 16321 2798 -23653 -54829 -49587 -6285
9689 -6285 -24800 -108140 -184509 -164219 -42563 28262 -9794 -24191 27688 32118 -11200 -53055
9677 -53055 -18088 58509 -47734 29708 111938 162172 233817 119439 59639 28425 -20417
9666 -20417 -80453 -133029 -151587 -57164 59265 96799 68353 -8374 -43809 -87523 -59167 -61725
9654 -61725 -3830 78818 25367 50999 131117 113886 59260 51089 98419 74664 103565 244972
9642 244972 280100 314329 218529 161230 144743 51742 -8676 -24760 -376 -42119 -11316 53464
9630 53464 120864 191880 131619 26354 -13043 -55924 -41223 -26915 -1368 100811 86432
9619 86432 125734 158665 177190 249577 269263 218330 112827 25194 119076 95464 10337 -81298
9607 -81298 -8187 107968 39386 12063 31485 72472 111900 52473 82235 81205 37126 38491
9595 38491 5794 -59871 -50662 -33462 -14839 -463 -71219 -79751 -31462 -61354 -51502 -29390
9583 -29390 2391 -35000 -105557 -66284 2277 36461 -57119 -17248 39731 -3876 46385 -12318
9571 -12318 -4881 6166 52549 -63997 -91788 5776 36665 63376 121118 211964 156407 174625
9559 174625 172663 157091 192234 181422 141282 79222 -6753 -19441 46115 71652 93568 2231
9547 2231 -86583 -106334 -35593 -30176 86025 140455 98635 140478 108611 70027 5116 -83454
9535 -83454 -91776 4706 158046 244560 107328 78992 65872 63587 77344 54958 -11688 -25105
9523 -25105 -13762 -46572 3424 18956 -16657 -52229 -84232 -93980 -111996 -100095 22728 6374
9511 6374 48548 122207 88102 12661 -10747 -1315 62903 70961 89209 107683 219874 296478
9499 296478 286384 64725 5742 15976 59252 22499 59881 34267 12400 72963 96004
9488 96004 71109 57219 146544 64793 -56536 -95732 -48266 -28444 66061 99394 11168 -2212
9476 -2212 22693 -13849 -52641 26421 79598 102175 -76235 -145425 -75850 -114603 -96789 9877
9464 9877 83869 -10237 -78017 -144559 -34517 21897 -104750 -223812 -210587 -135357 8659
9453 8659 74289 68436 69769 58545 6926 -46531 -11398 86763 150009 86079 38511 22233
9441 22233 -46171 -45250 157324 152971 11911 20253 -20798 -82050 -53822 81987 139939 182184
9429 182184 184452 163215 201105 187540 137277 124379 69442 62942 46210 2294 41985 57602
9417 57602 132884 180164 156932 182860 166909 130310 79642 100716 160660 200766 141186 215338
9405 215338 216875 142867 129192 62153 -53952 -51569 29256 16113 -22947 -1367 97241 204228
9393 204228 276495 237759 171945 107800 136029 154078 93914 38193 41913 85324 60869 88459
9381 88459 43119 -35840 -30892 52922 43819 70370 43857 -14248 46447 25507 -6661 2176
9369 2176 -8275 -71712 18021 90366 135561 218817 240732 188859 68427 34533 97814 33801
9357 33801 42572 132202 119217 75283 59456 190288 225900 168124 107599 81315 107745 109181
9345 109181 55852 15921 54503 95842 150748 87335 131505 217228 181779 70669 31064
9334 31064 76832 144309 70409 124250 169428 143553 91445 73072 42915 -11215 -29790 180894
9322 180894 140075 55439 130643 197519 141427 153831 97880 118063 242241 285104 279520 350103
9310 350103 327892 150306 97752 141961 181306 53180 -7918 -77860 -117207 -64087 18904
9299 18904 118112 185002 176641 102694 -54824 46226 169510 146232 121191 103702 218055
9288 218055 311547 297350 357097 306678 273123 169235 76403 165361 87005 108540 183664
9277 183664 222649 154546 114293 161743 175782 290633 330599 212732 112416 147597 182840
9266 182840 102152 110280 70917 14151 22903 130945 161336 94452 17617 51449 106101 126442
9254 126442 134585 95382 133079 88739 130559 301982 298062 257028 244379 286382 386478 410416
9242 410416 334288 198170 294656 268011 238419 256609 173478 147258 235006 294767 280837
9231 280837 231256 180858 261568 345166 218986 267185 249439 211163 143195 80513 35344
9220 35344 27891 70790 104966 200148 199351 205637 286027 293314 376199 363365 305698 398657 331615
9207 331615 261010 270362 334584 375714 362518 294439 199186 226858 253073 292383 208052 103114
9195 103114 130410 216432 265664 192252 210623 127231 146626 235945 263591 253630 246738 225624
9183 225624 309436 339840 197839 187354 224849 278171 478819 492883 350290 365403 367590
9172 367590 314455 308778 311433 430449 436771 271836 281790 241223 200158 245475 288084 346162
9160 346162 346555 357257 337956 306483 371262 439676 358187 335444 402571 413405 423555 410051
9148 410051 337944 307826 420861 442290 493646 587139 595044 707184 662619 655518 662142 614372
9136 614372 504923 417751 340869 382061 343722 286176 346625 473863 610875 662372 614280
9125 614280 617155 726964 644145 627270 712281 765620 638607 602093 768178 883899 913840
9114 913840 846809 854754 1007566 995085 899962 866401 806725 759607 843408 1035609 1112019
9103 1112019 1150357 1226990 1212361 1206551 1125383 1082202 1068151 1125835 1288714 1326108 1446576
9092 1446576 1468943 1414871 1557074 1732422 1903337 2039263 2090465 2225217 2370964 2535689
9082 2535689 2581544 2795978 3007525 3317067 3660931 4084084 4603267 5165313 5911630 6870212
9072 6870212 7786620 8465814 8987013 9554318 10336306 11300858 12586525 14519231 17500143
9063 17500143 21839211 27726602 34057921 38052917 35574775 28269819 21498364 16816100
9055 16816100 13723581 11414729 9854858 8713043 7885715 7242071 6648048 6128878 5743636
9046 5743636 5581467 5407116 5147682 4885043 4683953 4531341 4488520 4512528 4504345 4438698
9036 4438698 4363238 4404747 4292359 4150804 4153784 4216297 4258990 4456374 4535137 4717894 4820172
9025 4820172 4730574 4485594 4152897 3825712 3488584 3216091 3010530 2732015 2411229 2148195
9015 2148195 2022541 1911579 1702686 1504377 1464316 1437747 1357763 1337186 1209856 1024201
9005 1024201 969907 786208 671527 720234 642107 647573 572295 630721 597112 608985 611017
8994 611017 470873 469104 306820 242346 263358 288955 215000 175378 233708 246276 176185
8983 176185 66851 5991 90791 155641 221861 171409 109583 55610 71901 136886 256527
8972 256527 322666 269554 244491 187733 69387 86787 -6255 -10621 -30965 -39245 -35125 -65676
8960 -65676 -79841 -92379 -72007 -85255 -179119 -120499 -36446 41544 64680 20007 -71660 -133437
8948 -133437 -80760 -38445 -19660 -74816 -186178 -142583 -189808 -184098 -165161 -148705 -142817 -179090
8936 -179090 -200428 -144620 -153265 -108344 -63851 2057 -22414 -96240 -215719 -215410 -171993 -165314
8924 -165314 -75136 -96838 -99551 -84794 -216454 -205201 -98170 6470 77299 -9570 -189909
8913 -189909 -263260 -190536 -163021 -76877 14913 -33072 -143094 -92284 -87325 -124700 -108519 -104167
8901 -104167 -65016 4172 62926 59052 58531 68463 32691 43199 57204 40552 105027 122700
8889 122700 146907 48100 -2677 23748 13710 21136 -13795 -52053 -76685 -23797 14311 48461
8877 48461 82371 137101 141031 56764 128692 171944 64862 26100 84251 56039 -52650 -81119
8865 -81119 -77928 -50542 18182 9127 -79009 -46854 -24105 -63573 -100339 -137563 -220963 -149008
8853 -149008 7796 94032 89665 99010 657 -64161 -142586 9488 191668 256922 188960
8842 188960 107993 -1556 -81521 -102176 -46592 41493 -6873 -85286 -110289 -71548 -4181
8831 -4181 21698 29489 76917 26836 -85297 -112527 -146061 -35652 -947 -36568 6191 151860
8819 151860 72928 -32458 40700 60825 63862 60163 33611 30689 24039 44480 15874 -37736
8807 -37736 -26178 -32755 -8032 -19450 1092 -129277 -75345 -62770 -171507 -123385 -85507 -141178
8795 -141178 -162940 -115984 -111597 -169029 -199165 -113914 -39481 -22373 13791 94028 116997 24986
8783 24986 7724 -21202 -39499 -33903 66611 129156 113397 147900 195240 142922 57700 -40427
8771 -40427 -50620 -48070 22164 41559 3612 -3091 88440 188946 176002 107107 9642 -13565
8759 -13565 -32388 11358 77815 25489 28431 30634 6476 -7313 -94200 -102444 -85713 -50391
8747 -50391 -130277 -189463 -160453 -176209 -221458 -117054 -78873 -117013 -101574 -117281 -118568 -91849
8735 -91849 -100540 -35650 -4986 -59602 6032 41008 -30269 -7540 -26038 -6578 -16006 -98586
8723 -98586 -111559 -83843 -59067 -73797 -111029 -64408 -20648 45470 92360 50426 46920 34869
8711 34869 -8682 7976 79178 -1855 -24573 7819 -59712 -127151 -126260 -127516 -152090 -102954
8699 -102954 -29066 -77710 -65138 -12245 24085 -17456 -109757 -105243 -99926 -37348 30022 14066
8687 14066 6253 -2478 108007 128337 119706 93677 89725 11562 -42383 8387 17645 -71418 -120628
8674 -120628 -269365 -296037 -235143 -99207 51272 88148 92265 9218 -34414 2406 5055
8663 5055 -40109 -113526 -131242 -112448 -76116 -52501 88851 129169 10344 44234 59819 35173
8651 35173 -65231 -127717 -202883 -124553 49243 179104 144942 27483 -14333 43891 149132
8640 149132 195467 107335 -44027 -8282 -794 112026 184153 194278 79900 26311 160700
8629 160700 208150 204404 217193 181831 169553 153262 80359 47584 35283 -34162 9782 52815
8617 52815 -31399 -125407 -176730 -94629 55410 35341 22667 22652 -64248 -123036 4578 134887
8605 134887 161931 126685 100718 57290 71075 197108 229371 138062 24885 28389 36969 93938
8593 93938 185306 188827 164310 109427 142312 140876 202298 256983 215321 114732 49963 36244
8581 36244 -39783 -72687 -21907 46818 104152 3254 -25077 -55800 -104 109297 66688
8570 66688 6937 -79106 -67416 -122604 -201461 -140430 -1961 18104 46175 46395 48530 29304
8558 29304 2544 30685 28770 -37356 -2232 48132 107934 111334 25180 49643 53023 4149
8546 4149 -4541 39793 -5835 -101593 -49869 136189 170404 12182 -151242 -226084 -245671 -155984
8534 -155984 -70518 -51736 -81867 -88451 -53997 4933 31013 8996 53302 97580 91071 44983
8522 44983 -12517 4641 78974 71454 32392 -39057 -38827 -26259 41630 133639 62096 16816
8510 16816 32408 117802 151708 117019 79111 26127 -34074 -13074 14747 22728 1340 -20620
8498 -20620 -25778 -80004 -40199 -2754 23222 107745 110443 137333 36552 -111647 -108312 -39886
8486 -39886 119200 59175 -14097 31289 45455 -2587 -33131 -50720 29636 117197 137184 37274
8474 37274 79490 117799 136972 141732 139851 156994 262680 177596 38498 27119 36791 67386
8462 67386 -38055 -69922 38181 108539 -7735 12046 91706 128329 166933 154147 99717
8451 99717 78698 -31383 -156581 -112300 -84743 -74746 -86546 54094 117114 45550 -16335
8440 -16335 81764 241885 292989 207417 105177 18324 67435 118948 140680 207355 88861
8429 88861 40986 36127 62138 40908 75145 21261 89357 88823 26646 -28706 -1575 31134
8417 31134 -19606 -50120 -60448 -140115 -147339 -14059 187808 124544 -20864 -91043 -104212
8406 -104212 -2909 26772 21309 66997 64275 41695 173941 232452 169393 73135 2032 34374
8394 34374 126789 155887 101389 157330 150234 53735 30169 -33124 -33756 -5837 -109212 -48877
8382 -48877 25282 29854 -2208 -47887 -26127 -86174 -159826 -68524 94165 30193 -65309 -186041
8370 -186041 -206871 -150514 -35062 -6625 -49513 752 -62624 -134325 -115312 -11299 55980
8359 55980 -12955 -39491 10566 5167 -25983 -64340 -43285 -1270 -22285 -101641 -127345 -66561
8347 -66561 -114816 -81137 -30810 57946 34125 -76490 -67872 -96644 -111670 -68517 -98882 -88187
8335 -88187 -59642 -24522 -82798 -113127 -154685 -161938 -176749 -124958 -54635 -41518 -106672 -171727
8323 -171727 -235342 -118544 -26554 9956 -72327 -134541 -48943 -41906 -1486 -49087 -77315 -78848
8311 -78848 -47541 -44380 -35357 -57784 -75865 -110882 -46353 73090 41125 1435 -18305 23234
8299 23234 -21581 -46095 21696 17519 -66382 -17318 14914 11782 -15154 -61408 -15399 68128
8287 68128 29699 9760 -84915 -91704 -44650 -15790 88925 80220 47708 -69616 -97636 -95386
8275 -95386 -109874 -150054 -118975 -166776 -143784 -36689 5622 88137 80525 1021 -30758 -134344
8263 -134344 -65586 7389 98541 66716 74576 -15481 -33200 -46101 -16614 49953 76473 61583
8251 61583 51684 46159 33496 6833 -10163 -1054 32628 -29274 6102 50631 -41147 -172819
8239 -172819 -103532 -27811 6118 -8518 -22696 11314 21557 8466 60869 136038 109216 8118
8227 8118 -117876 -145343 -118720 -83492 -15567 75035 35521 -16930 -31726 -6481 43244 51774
8215 51774 126872 175585 116730 123989 63245 51258 123185 95364 69772 55450 153626 123470
8203 123470 121555 126795 81663 46208 -15078 -194505 -147990 -43771 -30468 -19021 -16903 -132851
8191 -132851 -192014 -108886 -45548 -20249 -60041 -99206 -69610 -119907 -163805 -123520 -54550 -42551
8179 -42551 -71133 -36842 -62789 24240 -36278 -56518 5707 -38264 -42719 2743 27805 18374
8167 18374 -21388 39363 -33654 -58642 -3842 55923 3255 -48633 -57183 -54668 -18998 -26888
8155 -26888 -67585 -86614 -105475 -79503 46320 105334 12449 76469 85271 -4033 10070 42214
8143 42214 105013 103018 40020 -24814 -61669 -24810 -49625 -82585 -98850 -17941 46751 33669
8131 33669 1585 -51125 -64469 -47127 -80658 13800 47393 -11361 -32144 -19925 -131611 -70187
8119 -70187 84956 38028 -81290 -164125 -133755 -108054 -200065 -216077 -119216 44008 134084
8108 134084 -6433 -150869 -158973 -119898 -160891 -84551 -100247 -67716 -52540 -33579 -4929
8097 -4929 34895 -44332 -15592 40444 17280 -77979 -64033 -75318 -163256 -164586 -91039 38554
8085 38554 40996 59742 191780 207584 105433 128274 93934 58387 87188 -10276 -7928 -40974
8073 -40974 -9203 71871 113999 48436 16015 80702 92141 101093 54278 -38235 -94130 -117207
8061 -117207 -20813 92380 145869 118585 145635 106847 133277 144012 187315 285006 303607
8050 303607 266996 209794 147409 63010 39800 126790 200433 151062 80906 52521 45207 140101
8038 140101 142609 146448 157520 187359 71041 49996 -14639 -10924 -45668 -69518 -74748 -154215
8026 -154215 -66242 64343 122640 230244 265674 207498 177852 208 -59940 -27627 89490
8015 89490 131979 78527 58790 -34629 -37553 -34506 -36605 -3708 38222 60160 44134 132407
8003 132407 214762 184772 145190 59297 167933 161444 43023 2704 10137 58268 123337 34322
7991 34322 -41099 -62884 -62799 136849 161402 141655 110120 81997 -12918 -62311 -108528 -100125
7979 -100125 -157285 21269 151345 96488 46478 22177 43240 101787 74508 43939 99981
7968 99981 94612 140710 99369 90096 72817 -38624 -40979 -41886 11559 44991 30996 62401 91987
7955 91987 38595 117023 96212 84452 160424 144161 44848 -8141 19461 16015 7388 -67700
7943 -67700 1964 93188 135681 187248 181910 143346 121509 82760 40585 -86831 -65929 30965
7931 30965 14271 -76046 -86729 -74965 -88983 -15269 78183 124615 223634 292316 147855 111726
7919 111726 107353 149965 234212 234254 87079 6528 -105352 -94363 -116099 -75370 -45341 12569
7907 12569 135279 127211 -1586 -8330 -45536 -29752 42245 11317 -39145 36375 132118 136868
7895 136868 137912 30090 34423 6504 40633 -47200 -80927 -57649 -75594 -64881 -28014 -97679
7883 -97679 -88181 -74875 -80063 -28521 -85818 -79558 72294 45435 -52623 -100870 -58166 -20572
7871 -20572 6020 -540 -93566 -182613 -142189 -104509 -131930 -32802 -2524 103634 93570 5316
7859 5316 -78327 -156371 -151050 -103312 -52996 10841 -36990 -24935 -19593 -33663 -88962 -125733
7847 -125733 -111796 -77262 -76223 -191030 -154553 -81141 -46996 -4644 -82154 -74472 19903 36711
7835 36711 54091 12036 -45962 -1960 -49543 -52985 -19066 63090 69840 -13505 32902 101068
7823 101068 58948 -3771 101012 124829 72742 -1339 -80245 -173082 -132308 -25731 11835
7812 11835 -79564 -182594 -170290 -55827 -76266 -108307 -18507 88490 11339 -54227 -64522
7801 -64522 11584 42480 18813 -22022 -21377 1921 -42039 -61345 -59502 10739 99831 32544
7789 32544 4396 33082 39206 -8110 -58448 -15879 14994 43350 39875 50189 142533 27188
7777 27188 -18321 28314 -47669 -107162 -58579 -67007 -104937 -166698 -120659 15579 22222 6699
7765 6699 26961 46159 33109 121045 100464 53159 29569 22429 24796 -71233 -55176 -106333
7753 -106333 -106659 -107805 -77628 -156727 -148988 -74983 -112751 -138297 -129776 -64877 19808 50358 -7571
7740 -7571 37265 47963 18539 -31455 15453 113794 56618 5106 100053 34343 54266 84129
7728 84129 -18324 43459 104579 -30324 -64076 -42018 -70482 -26234 -7538 26447 21821 -14591
7716 -14591 -26287 -57930 -156112 -93532 -99228 -110749 -89094 -52044 3580 -6728 -65482 -178869
7704 -178869 -263489 -211615 -79655 -2757 18334 -110129 -136448 -172090 -167127 -127446 -136162 -75707
7692 -75707 -68185 -53761 -98539 -58910 50021 135054 217099 100155 46597 31604 -51637 -47705
7680 -47705 51241 92529 65990 15349 -64899 -122919 -158125 -170487 -240234 -168226 -43525 54301
7668 54301 6771 -55719 -52522 -35594 -39040 -21834 -50996 -124728 -121693 -36345 -8194 49 -52657
7655 -52657 40511 28723 -96734 -158783 -190987 -166099 -78339 -106359 -44208 -39282 -33365 2375
7643 2375 -349 -108148 -158665 -194786 -162139 -78907 -45177 20346 60086 174264 70771 35210
7631 35210 58333 21466 -61916 -127463 -124835 -69754 30691 78807 56298 56165 -11120 77845
7619 77845 64800 2538 -29027 9371 60545 93747 49331 7810 -19693 -140547 -168781 -157324
7607 -157324 -92803 -82281 -35776 -30335 22932 52080 21641 -6292 70161 163683 173212 181150
7595 181150 237685 264554 240036 213804 192056 110138 73829 -21643 61108 86384 -6301 -45206
7583 -45206 -33129 -87187 -38645 127380 117751 84475 42109 52599 -44175 -42113 -170794 -191758
7571 -191758 -220707 -212996 -123659 4386 37238 11397 -21763 -70641 -59256 -65138 32865 1494
7559 1494 -36228 -74840 36977 134301 118461 150278 226049 184042 60543 -19211 92675
7548 92675 157046 84365 19371 -2259 19736 95730 76753 -82393 -62108 30970 75433 136874
7536 136874 62316 52131 38874 108273 185809 131310 204540 168227 101338 65144 -51526
7525 -51526 -23348 -97742 -167256 -147525 -104021 -35879 -866 -33507 -23023 -129570 -162186 -163216
7513 -163216 -184565 3841 77587 34106 57220 75457 -2428 -66237 -95790 -109856 -113522 14924
7501 14924 153802 194813 109761 -45695 -41696 38499 27394 46037 86478 6401 -17431 -87658
7489 -87658 -76103 -96774 -66166 -32196 -31157 24223 98272 52374 -20561 28695 16648 62808
7477 62808 -15972 -128495 -227282 -234354 -144508 -137455 -160968 -162283 -138827 -120672 -124387 -124229 -129713
7464 -129713 -176718 -124964 -36739 -58162 -62869 -100284 27240 36387 25172 -44083 -36034 42454
7452 42454 -60734 -100208 -39272 -18836 -36525 -64429 -120944 -176747 -111656 -86005 -106517 -123966
7440 -123966 -186830 -239918 -81437 18394 38497 31816 83988 22984 -29130 -53403 -115335 -64164
7428 -64164 22365 135435 74895 -34989 -7268 98314 81206 13293 15518 5877 -4529 79206
7416 79206 123063 86390 1885 -113188 -66787 -88735 -202124 -178769 -105134 -48174 -19665
7405 -19665 -7163 -17303 -71363 -140931 -99059 -131331 -32575 61287 14363 -43757 -1188 -74298
7393 -74298 -61131 -2461 39642 21452 -30421 -57551 -126006 -173986 -125037 -48632 20657 -40439
7381 -40439 -71175 -95841 -78977 -71572 -17209 -36037 -42211 -32449 5672 11691 -53486 -85893 -45452
7368 -45452 -36808 -25780 35432 2659 -63914 -101713 -114129 -132264 -104296 -139657 -197825 -186603
7356 -186603 -138355 -231203 -172396 -95325 2139 -45212 -122119 -95453 42229 28222 -88656
7345 -88656 -141500 -189378 -115349 -52599 -30717 16708 -72288 -138885 -178801 -221030 -233444 -219629
7333 -219629 -149537 -85712 -17070 -30801 45474 42496 100179 74085 4140 -117623 -109506 -74534
7321 -74534 -44156 -76012 -178536 -44486 46584 -33970 -15446 15821 -3524 35669 108340
7310 108340 112660 -22366 -162585 -208802 -154681 -190872 -250528 -331743 -232714 11190 6677
7299 6677 -59132 -63738 -27083 -33993 -31644 -27145 -64356 -43566 31587 53412 36061 -31130 -73975
7286 -73975 -146015 -198671 -323426 -322040 -146926 -69071 -1717 29185 43356 74116 -49139
7275 -49139 -152015 -166867 -82897 72072 150194 79304 14509 124038 184741 104668 70417
7264 70417 81558 26035 -10284 -72498 -17684 1929 4393 -16875 -22183 -59471 -259881 -240498
7252 -240498 -168195 -80747 -17045 -26723 -139058 -111300 -64945 17480 46359 -123015 -183429
7241 -183429 -115647 -108704 -141097 -114898 -104087 -83670 26644 -37139 -115081 -63039 -18832 -20075
7229 -20075 26548 47272 39659 158202 142720 71214 31084 -4168 -63787 -84415 -60168 -92936
7217 -92936 -102042 -8183 -11081 -6568 -116441 -41632 -34575 39968 141111 170480 102047 30418
7205 30418 -43038 -2913 38031 56305 133493 24883 -9974 54388 22547 70760 147019 153709
7193 153709 58344 -28685 -52033 10048 -43833 -77077 -51405 -18178 -57532 -74897 -53715 -58977
7181 -58977 -50024 -19896 46599 36456 -56710 -168930 -133275 -69511 -69493 22005 23776 12176 68397
7168 68397 35438 -67809 -43867 2643 -73597 -129488 -199229 -225420 -232912 -194186 -216880 -195952
7156 -195952 -14898 75084 -81654 -99942 -179171 -290312 -229265 -101271 -44960 -62212 -17539
7145 -17539 -80598 -29554 59575 125040 13839 29677 63722 -25845 -116559 -106730 -72387 -17593
7133 -17593 16790 -20773 -35686 -58840 -93925 -42458 -36891 -34626 29063 87998 98773 17718
7121 17718 -105610 -169301 -122326 -38135 105523 168648 193477 121932 51576 17231 9565 -73433
7109 -73433 30287 59333 55510 74740 -51449 -134764 -7059 27601 -15229 -48826 17154
7098 17154 10411 66672 25316 -69623 -39217 50783 69212 160015 140892 103845 41394 184900
7086 184900 256382 155448 81299 57042 -5608 -42511 -104199 -149097 -192003 -120127 3511
7075 3511 56123 41519 1759 58293 -20157 46366 83526 23247 15025 54176 -41273 29615
7063 29615 140367 115683 118853 127250 56738 -20022 -13801 -22877 -54575 -96421 -38605 -30951 -43705
7050 -43705 -148062 -260000 -287386 -113804 -16738 -54609 -112222 -92379 31959 113813 100510
7039 100510 38090 -25916 -20830 -23788 -1470 12632 -11054 -3231 22684 -5411 -69590 -48700
7027 -48700 -4529 -13898 -56914 -113434 -146678 -156858 -109617 -89342 -2440 17187 54051 73907
7015 73907 124792 37391 -14169 -48666 -47407 -72275 -29841 -2604 89452 77100 39824 79315
$$ [...]
##END NTUPLES=NMR SPECTRUM
##END=
