##TITLE=Analysis number 309214
Compound Code cc 31109
Book Reference 397/46/2
Project Code adrs
Chemist Name brucer
##JCAMPDX= 6.0         $$ Bruker NMR JCAMP-DX V2.0
##DATA TYPE= NMR SPECTRUM
##DATA CLASS= NTUPLES
##ORIGIN= Bruker BioSpin GmbH
##OWNER= NMR
$$ XWIN-NMR		Version 3.5
$$ Tue May 31 13:26:51 2005 GMT Daylight Time (UT+1h)  MAYBRIDGE\NMR@NMR_250MHZ
##.OBSERVE FREQUENCY= 250.131544655141
##.OBSERVE NUCLEUS= ^1H
##.ACQUISITION MODE= SIMULTANEOUS (DQD)
##.ACQUISITION SCHEME= undefined
##.AVERAGES= 16
##.DIGITISER RES= 18
##SPECTROMETER/DATA SYSTEM= dpx250
##.PULSE SEQUENCE= zg30
##.SOLVENT NAME= CDCl3
##.SHIFT REFERENCE= (INTERNAL, CDCl3, 0, 16.4702)
##AUDIT TRAIL= $$ (NUMBER, WHEN, WHO, WHERE, WHAT)
$$ ##TITLE= Audit trail, XWIN-NMR		Version 3.5
$$ ##JCAMPDX= 5.01
$$ ##ORIGIN= Bruker BioSpin GmbH
$$ ##OWNER= NMR
$$ C:\u/data/dgb/nmr/ADRS/3680/pdata/1/auditp.txt
$$ ##AUDIT TRAIL=  $$ (NUMBER, WHEN, WHO, WHERE, WHAT)
(   1,<2005-05-31 13:26:33.42 +100>,<MAYBRIDGE\NMR>,<NMR_250MHZ>,
      <created by zg, POWCHK disabled, PULCHK disabled
       configuration hash MD5:
       62 19 C7 07 E1 42 D1 B7 37 6C 3D D0 77 39 F9 E6
       data hash MD5: 64K
       6D CE 11 73 4A 7E 59 8D A0 05 91 27 BA 6A B0 E2>)
(   2,<2005-05-31 13:26:43.92 +100>,<MAYBRIDGE\NMR>,<NMR_250MHZ>,
      <Start of raw data processing
       ef LB = 0.3 FT_mod = 6 PKNL = 1 SI = 32K 
       data hash MD5: 32K
       44 32 FC 36 E0 BE 6D 1B B3 6A 5C B1 15 84 A4 32>)
(   3,<2005-05-31 13:26:46.18 +100>,<MAYBRIDGE\NMR>,<NMR_250MHZ>,
      <apk 
       data hash MD5: 32K
       AC 06 2C 90 2F F0 41 04 D4 27 ED 46 A6 E0 05 37>)
(   4,<2005-05-31 13:26:46.90 +100>,<MAYBRIDGE\NMR>,<NMR_250MHZ>,
      <abs ABSG = 5 
       data hash MD5: 32K
       A9 15 79 7A 36 A5 BE 9A 79 BB FD C7 97 A1 72 EF>)
$$ ##END=
$$ 
$$ hash MD5
$$ 49 B1 36 F4 1B 36 2A 4E B7 98 F9 B9 10 E8 EC C2
##$RELAX= 
##$RELAX= 
##$RELAX= 
##$RELAX= 
##$RELAX= 
##$RELAX= 
##$RELAX= 
$$ Bruker specific parameters
$$ --------------------------
##$DU= <C:\u>
##$EXPNO= 3680
##$NAME= <ADRS>
##$PROCNO= 1
##$TYPE= <nmr>
##$USER= <dgb>
##$AMP= (0..31)
100 100 100 100 100 100 100 100 100 100 100 100 100 100 100 100 100 100 
100 100 100 100 100 100 100 100 100 100 100 100 100 100 
##$AQSEQ= 0
##$AQ_mod= 3
##$AUNM= <au_zg>
##$AUTOPOS= <54 >
##$BF1= 250.13
##$BF2= 250.13
##$BF3= 250.13
##$BF4= 250.13
##$BF5= 500.13
##$BF6= 500.13
##$BF7= 500.13
##$BF8= 500.13
##$BYTORDA= 1
##$CFDGTYP= 0
##$CFRGTYP= 5
##$CHEMSTR= <none>
##$CNST= (0..31)
1 1 145 1 1 1 1 1 1 1 1 1 1 1 1 1 1 1 1 1 1 1 1 1 1 1 1 1 1 1 1 1 
##$CPDPRG= <>
##$CPDPRG1= <>
##$CPDPRG2= <>
##$CPDPRG3= <>
##$CPDPRG4= <mlev>
##$CPDPRG5= <mlev>
##$CPDPRG6= <mlev>
##$CPDPRG7= <mlev>
##$CPDPRG8= <mlev>
##$CPDPRGB= <>
##$CPDPRGT= <>
##$D= (0..31)
0 1 0 0 0 0 0 0 0 0.06 0 0 0 0 0 0 0.0002 0 0 0 0 0 0 0 0 0 0 0 0 0 0 
0 
##$DATE= 1117542392
##$DBL= (0..7)
120 120 120 120 120 120 120 120 
##$DBP= (0..7)
150 150 150 150 150 150 150 150 
##$DBP07= 0
##$DBPNAM0= <>
##$DBPNAM1= <>
$$ [...]
##$SUBNAM7= <"">
##$SUBNAM8= <"">
##$SUBNAM9= <"">
##$SW= 20.6930455092707
##$SWIBOX= (0..15)
0 0 3 0 0 0 0 0 0 0 0 0 0 0 0 0 
##$SW_h= 5175.983436853
##$TD= 65536
##$TD0= 1
##$TE= 294.16
##$TE2= 300
##$TE3= 300
##$TEG= 300
##$TL= (0..7)
0 120 120 120 120 120 120 120 
##$TP= (0..7)
150 150 150 150 150 150 150 150 
##$TP07= 0
##$TPNAME0= <>
##$TPNAME1= <>
##$TPNAME2= <>
##$TPNAME3= <>
##$TPNAME4= <>
##$TPNAME5= <>
##$TPNAME6= <>
##$TPNAME7= <>
##$TPOAL= (0..7)
0.5 0.5 0.5 0.5 0.5 0.5 0.5 0.5 
##$TPOFFS= (0..7)
0 0 0 0 0 0 0 0 
##$TUNHIN= 0
##$TUNHOUT= 0
##$TUNXOUT= 0
##$USERA1= <user>
##$USERA2= <user>
##$USERA3= <user>
##$USERA4= <user>
##$USERA5= <user>
##$V9= 5
##$VALIST= <valist>
##$VCLIST= <CCCCCCCCCCCCCCC>
##$VD= 0
##$VDLIST= <DDDDDDDDDDDDDDD>
##$VPLIST= <PPPPPPPPPPPPPPP>
##$VTLIST= <TTTTTTTTTTTTTTT>
##$WBST= 1024
##$WBSW= 4
##$XGAIN= (0..3)
0 0 0 0 
##$XL= 0
##$YL= 0
##$YMAX_a= 494192
##$YMIN_a= -898851
##$ZGOPTNS= <>
##$ZL1= 120
##$ZL2= 120
##$ZL3= 120
##$ZL4= 120
##$ABSF1= 16.4702
##$ABSF2= -4.222973
##$ABSG= 5
##$ABSL= 3
##$ALPHA= 0
##$AQORDER= 0
##$ASSFAC= 0
##$ASSFACI= 0
##$ASSFACX= 0
##$ASSWID= 0
##$AUNMP= <proc_1d>
##$AZFE= 0.1
##$AZFW= 0.1
##$BCFW= 0
##$BC_mod= 0
##$BYTORDP= 0
##$COROFFS= 0
##$CY= 12.5
##$DATMOD= 1
##$DC= 0
##$DFILT= <>
##$DTYPP= 0
##$F1P= 14.0000005364418
##$F2P= -0.99999901652339
##$FCOR= 0.5
##$FTSIZE= 32768
##$FT_mod= 6
##$GAMMA= 0
##$GB= 0
##$INTBC= 1
##$INTSCL= 1
##$ISEN= 128
##$LB= 0.3
##$LEV0= 0
##$LPBIN= 0
##$MAXI= 10000
##$MC2= 0
##$MEAN= 0
##$ME_mod= 0
##$MI= 0
##$NCOEF= 0
##$NC_proc= -2
##$NLEV= 6
##$NOISF1= 0
##$NOISF2= 0
##$NSP= 0
##$NTH_PI= 0
##$NZP= 0
##$OFFSET= 16.4702
##$PC= 1
##$PHC0= -88.72958
##$PHC1= 28.37893
##$PH_mod= 1
##$PKNL= yes
##$PPARMOD= 0
##$PSCAL= 4
##$PSIGN= 0
##$REVERSE= no
##$SF= 250.130012956647
##$SI= 32768
##$SIGF1= 0
##$SIGF2= 0
##$SINO= 400
##$SIOLD= 32768
##$SREGLST= <1H.CDCl3>
##$SSB= 0
##$STSI= 32768
##$STSR= 0
##$SW_p= 5175.98343685301
##$SYMM= 0
##$S_DEV= 0
##$TDeff= 65536
##$TDoff= 0
##$TI= <Analysis number 999999
Compound Code 99
Book Reference 9
Project Code 9>
##$TILT= no
##$TM1= 0
##$TM2= 0
##$TOPLEV= 0
##$USERP1= <user>
##$USERP2= <user>
##$USERP3= <user>
##$USERP4= <user>
##$USERP5= <user>
##$WDW= 1
##$XDIM= 32768
##$YMAX_p= 427148148
##$YMIN_p= -33281
$$ End of Bruker specific parameters
$$ ---------------------------------
##NTUPLES= NMR SPECTRUM
##VAR_NAME=  FREQUENCY,     SPECTRUM/REAL,   SPECTRUM/IMAG
##SYMBOL=    X,             R,               I
##VAR_TYPE=  INDEPENDENT,   DEPENDENT,       DEPENDENT
##VAR_FORM=  AFFN,          ASDF,            ASDF
##VAR_DIM=   32768,         32768,           32768
##UNITS=     HZ,            ARBITRARY UNITS, ARBITRARY UNITS
##FACTOR=    0.157963299565203, 1,           1
##FIRST=     4119.69123558484, 0,            0
##LAST=      -1056.29220126817, 0,           0
##MIN=       -1056.29220126817, -33281,      0
##MAX=       4119.69123558484, 427148148,    0
$$ Real data points
##PAGE= N=1
##DATA TABLE= (X++(R..R)), XYDATA
$$ [...]
14487C1411O988r33K33K858N421j60n262j378J089O911m3J287k579k533N277K584
14471E1171l784L000K142J965L568o035r321J276K330M563R885M948m089k659
14457E8960j385l592j824o492k728n185O2P661O847K831P898J48q594p87l095
14442E0725L34j623J705P62L783j287j481j089L6m855l412Q20l105J568j05l015
14426C9761P09M559J0541m02k655p49M869K508m205O67o19m511p681m659l45L6
14410C7824l86R76K246q756n270l719L976J565j645O521P802k23J203K924O713
14395E1751J517q10j035l900L958Q723l440p306j308O957P989j776p913m899j950
14380D6558Q672R323o7N892l324R15L257K146M55m493n732J447M251l212R65L908
$$ plain form
14487 31411 38399 37466 37699 40557 45978 45818 40556 39178 40267 47178 47135 48422 45843 43310 48587 51171
14471 51171 47387 50387 52529 54494 58062 52027 42706 43982 46312 50875 60760 65708 61619 58960
14457 58960 57575 53983 52159 45667 42939 37754 37816 45477 52324 55155 63053 63201 54607 53820 50725
14442 50725 51059 49436 51141 51903 55686 54399 52918 51829 51865 47010 43598 44418 41313 42881 42776 39761
14426 39761 40470 45029 55570 55168 52513 51764 56633 59141 54936 55603 54984 50473 42792 38133 37788 37824
14410 37824 37438 38414 40660 31904 26634 22915 26891 28456 26811 33332 41134 40911 42114 45038 51751
14395 51751 53268 52458 51423 47523 51481 60204 56764 49458 48150 55107 63096 61320 53407 48508 46558
14380 46558 55230 64553 64486 70378 67054 67969 71226 73372 73827 69334 63602 65049 69300 66088 67053 70961
14364G0961N245j233m009p58l77k714l85J1557N336M968N840R536R401N96r89
14349A12975O606K120L390j966l632j601k068k76r992m965n414j0352n952j708
14335G7165n214n041l443J838n41m15K672L690L196k471n884K70N657J924j77
14320G3226L9r17o819m246P814L759m65L327J213K247l042M422r32m343m579k878
14304F7826j003L448M966l960N251k180k023R021K141n738L852M560L491M068
14290I3720L244O398j462K703Q480J031N526O636o668m996k768M572K082l951
14276A14547o356m468L55L856N816n279r773K62m723j425J340N211k507k757K930
14261I7029M469K187j706m11n611j1095n857k028k288M034P1L572J991O239J0551
$$ plain form
14364 70961 76206 74973 70964 70206 69829 67115 66730 78287 83623 88591 94431 103967 113368 113964 112975
14349 112975 119581 121701 125091 123125 119493 117892 115824 115548 105556 100591 95177 84825 78873 77165
14335 77165 71951 66910 63467 65305 64764 64349 67021 70711 73907 71436 65552 65822 71479 73403 73226
14320 73226 73265 72348 65529 61283 69097 72856 72391 75718 76931 79178 76136 80558 79626 75283 70704 67826
14304 67826 66823 70271 75237 71277 76528 74348 72325 81346 83487 77749 81601 86161 89652 93720
14290 93720 96964 103362 101900 104603 113083 114114 119640 126276 119608 114612 111844 116416 118498 114547
14276 114547 108191 103723 104078 107934 113750 108471 98698 98960 94237 92812 94152 99363 96856 94099 97029
14261 97029 101498 103685 101979 101568 95957 84862 79005 76977 74689 78723 78794 82366 84357 90596 101147
14246A01147L638J2661J1881M611M189O39P443J637j0098m4K226M039m062K91
14232A40198M857M481R349R934Q060N843N699M614O91P393R660J92M855J0721
14218B26547M898k840m829q979j566n749q635j843M183L479N397l831o779o9K086
14203B01470l733M273M641m31j831J88k782J185O842L607L637K048K250P508K184
14188B31056J614K032N32Q135Q824N4l068M683O399l106K046M294K983L889J579
14173B71946J590Q975P941L419P398J2585J3209K689O227J4494Q456m010P533
14160C62452O013J167L970J0222N957P909K291O895R322R737P965J8102J2346
14147D64348Q084J4269K0972J8808J3488J7134K3341K7990L0755L1647K6106K9845
$$ plain form
14246 101147 104785 117446 129327 133938 138127 138766 146209 147846 137748 137704 139930 143969 139907 140198
14232 140198 145055 149536 158885 168819 176879 182722 188421 193035 193726 201119 210779 210971 215826 226547
14218 226547 231445 228605 223776 214797 213231 207482 198847 197004 201187 204666 210063 206232 199453 199384 201470
14203 201470 197737 202010 206651 206220 204389 204577 201795 202980 209822 213429 217066 219114 221364 228872 231056
14188 231056 232670 234702 235234 243369 252193 252247 249179 253862 260261 257155 259201 263495 266478 270367 271946
14173 271946 273536 282511 290452 293871 301269 313854 327063 329752 335979 350473 358929 354919 362452
14160 362452 368465 369632 373602 383824 389781 397690 399981 406876 416198 425935 433900 452002 464348
14147 464348 472432 486701 507673 526481 539969 557103 580444 608434 639189 670836 696942 726787
14135G26787K4102L2241K4970K8691L2470L3020L4657L9740M1877M4641N8194
14124A121390O2281O5204P0350Q6012J09454J12092J20794J38130J52167J70319
14114B208193K03435K30627K79643L40011M17040N13941O31131P59540R31250
14105F514811J172063J504485K027824K813633L945718N448549P182024Q846960
14097C9456067R874390R562742P572821M215234K43448l743834p166994r328302
14089E0685572r786298q891501p327433n641175m145394k984874k172316j628150
14081H108431j255712j002271q28856p01412n91156m95942m10967l42121k74445
14072B205549k33562j95042j66790j33266j04480q5944q3444p5937o9987o2950
$$ plain form
14135 726787 750889 783130 808100 836791 869261 902281 936938 976678 1018555 1063196 1121390
14124 1121390 1183671 1248875 1319225 1405237 1514691 1626783 1747577 1885707 2037874 2208193
14114 2208193 2411628 2642255 2921898 3261909 3678949 4192890 4824021 5583561 6514811
14105 6514811 7686874 9191359 11219183 14032816 17978534 23427083 30609107 39456067
14097 39456067 49330457 58893199 66466020 70681254 70924702 67180868 60013874 50685572
14089 50685572 40899274 32007773 24680340 19039165 14893771 11908897 9736581 8108431
14081 8108431 6852719 5850448 5021592 4320180 3729024 3233082 2822115 2479994 2205549
14072 2205549 1971987 1776945 1610155 1476889 1372409 1286465 1203021 1127084 1057097 994147
14062I94147n1662m7596m7919m2389m8002m2598l1400k9044k6344k1118j7448
14051E88627j1628j2183r970p406j967j0725j4227k0515j6110k0606j6782j9661
14039D26847j5703j5250j4603j9052k1275j4679q799j4101j5757j9632j8271j5935
14027B33790j4026j3460j2553r606j1715m182p884j0479l409l653j2070p017k219
14014A21517J698Ol396k109l897o768q196N974O667K291k992p074n128L125L742
13999A05460Q078N801L505N010O626R257K022N051L021L622J1899J1432k69J125
13985A81640j192N851m389o656q446j2540j2615j0644j1148r956o36n095n940
13972I8234o461p428k309j625J109k269m136o626l763k104r663j0987k757j24
$$ plain form
14062 994147 942485 894889 846970 804581 756579 713981 682581 653537 627193 606075 588627
14051 588627 576999 564816 554846 547440 545473 534748 520521 500006 483896 463290 446508 426847
14039 426847 411144 395894 381291 362239 340964 326285 317486 303385 287628 267996 249725 233790
14027 233790 219764 206304 193751 184145 172430 168248 160364 149885 146476 142823 130753 123736 121517
14014 121517 123215 123221 119825 117716 113819 107051 98855 104829 111496 113787 110795 103721 98593 101718 105460
13999 105460 113538 119339 122844 127854 134480 143737 145759 150810 153831 157453 169352 180784 180515 181640
13985 181640 180448 186299 181910 175254 166808 154268 141653 131009 119861 109905 109269 104174 98234
13972 98234 91773 84345 82036 80411 81520 79251 75115 68489 64726 62622 52959 41972 39215 39091
13958C9091l958L158j74p780J262k639k081j873r069o828k507m304j675j526J728
13943H25J138N648J3035P087K671K739K290N806k822j564r093q887j0311n686
13929B876j922j863K227m12N69o445k043N119J721O590J905l275l836P58J0931
13914A2900K60J14l849j1509o985k810j486N3K979j146l409M609l538k595K692
13899a3720p19K533Q98P304J0611J427J226o578O269J554J829L722n657l456P323
13884A4566O772K425k170j581k766m356o351j313k299k8K056n464m117J68m371
13869h829L187m852O559N889M357K765K288n039j492o59k395k76L410k689K975
13854E199K305j540k477J458Q038K944K451m964o60N378N224L003l385O90k190
$$ plain form
13958 39091 35133 38291 38117 30337 31599 28960 26879 25006 15937 9109 6602 2298 623 -903 825
13943 825 1963 7611 20646 27733 30404 33143 35433 41239 38417 36853 27760 18873 8562 2876
13929 2876 954 -909 1318 906 1475 -4970 -7013 -1894 -173 6417 8322 5047 1211 1969 12900
13914 12900 13160 13274 9425 -2084 -9069 -11879 -13365 -13312 -10333 -11479 -14888 -10279 -13817 -16412 -13720
13899 -13720 -14439 -11906 -11008 -3704 6907 8334 9560 2982 9251 10805 12634 16356 10699 7243 14566
13884 14566 21338 23763 21593 20012 17246 12890 6539 5226 2927 2899 4955 -509 -4626 -4458 -8829
13869 -8829 -5642 -10494 -3935 1954 6311 9076 11364 6325 4833 4174 1779 1503 4913 2224 5199
13854 5199 7504 5964 3487 4945 12983 15927 18378 13414 12754 18132 23356 26359 22974 23664 21474
13839B1474p375j761P51P97L004j8n578o934M01P754N679J791m579l003q271j735
13823B397K592j0231p788O503L121k982J764P79P0J049l026J12%K845k336J716
13807c415M412L120N308n203k951L402j860K277j382k827j30J0193O43p584N113
13792I116J051j302n146n790P640J1593O142J351M598O789N404N41p638m760P31
13777C0320m073l54l739j015k095l317l306j502l857J786J558n7J187K927l011
13762A1452J052J185j498o586o233P158N136K591k56M334l280n286M095M204L245
13747B1313M498j319o442L916M419J639k666q47K534K80k223j1377n790N185K191
13732A5311L408P667M434Q59n956K67l605k697P159O163J831r8l15o284M49J264
$$ plain form
13839 21474 14099 12338 13089 13886 16890 16872 11294 4360 4761 12515 18194 19985 15406 12403 4132 2397
13823 2397 4989 -5242 -13030 -6527 -3406 -6388 -4624 -3845 -3775 -2726 -5752 -5640 -5640 -2795 -5131 -3415
13807 -3415 997 4117 9425 4222 1271 4673 2813 5090 3708 881 751 10944 11587 4003 9116
13792 9116 10167 8865 3719 -2071 5569 17162 23304 24655 29253 36042 41446 41987 34349 29589 30320
13777 30320 26247 25893 22154 21139 19044 15727 12421 10919 7062 8848 10406 10349 11536 14463 11452
13762 11452 12504 13689 12191 5605 -628 6530 11666 14257 14001 18335 15055 9769 13864 18068 21313
13747 21313 25811 24492 18050 21966 26385 28024 25358 24511 27045 27325 25102 13725 7935 13120 15311
13732 15311 18719 26386 30820 31679 25723 25990 22385 19688 26847 33010 34841 34743 34428 28144 28593 29857
13716B9857j14K082j254k151j511L564R406L248k861j820N816N459k636n602K085
13701D3568K446k015j937L535j313j851j988j726m724L525M726K625K575J90J645
13686D9281N62j725j836P39l645J13L058q281L419N311O996k383L656J2353K428
13671G0046p199p687m715K082K226o86k057M008r5L515K586l49l159K249N403
13656F6168q4J0994N522j643l394l72K192m589K307K005l521J971J2389J3845
13642A03790J5613J6430J5231J9504L5936M4162M3527M7942L7549K8869R419j1923
13630D06049j9158l4555l4326l1298k1829j2633r710q822j8341j6931j4096j9464
13618A64886j4791j4372j1953j3487j4710l675m75J237o46o191N94M222Q63k631
$$ plain form
13716 29857 29743 31825 30571 28420 26909 30473 39879 43127 40266 38446 44262 49721 47085 41483 43568
13701 43568 46014 43999 42062 45597 44284 42433 40445 38719 33995 37520 42246 44871 47446 47636 49281
13686 49281 49843 48118 46282 47021 43376 43489 46547 38266 41685 46996 53992 51609 55265 67618 70046
13671 70046 62847 55160 50445 52527 54753 54067 52010 56018 55923 59438 62024 61675 58516 60765 66168
13656 66168 66084 77078 82600 80957 77563 77191 79383 74794 77101 79106 75585 77556 89945 103790
13642 103790 119403 135833 151064 170568 206504 250666 294193 342135 379684 408553 417972 406049
13630 406049 386891 352336 318010 286712 264883 252250 242540 233718 215377 198446 184350 164886
13618 164886 150095 135723 123770 110283 95573 91898 91423 92660 92014 85823 86417 90639 91502 88871
13604H8871r390l592M815m084m073K813N84J466J572l611j095L573l538j536k716
13589G0059N59o00O52L460P353O523J382J696L712k071P53O23l404r211m986o27
13573G5873K094j368j576J431m005n719M847l70o838j424l271o265L771N137k627
13558E9690p479J325K205m99O082N366J033O090n08r36k080n511J79j016j492
13543F2449O908K77R302J944k032J326J611Q65Q45K50j087n396r8M326N99k130
13527G9959j429k928M528O460L158o247n814k881R34k76m04M30J877L270M11L837
13511H4885N335M237j323l543o05j534n204n31m958J361K317L217L624O918j585
13496I2611J727M350P185k297j908M249k508k928K638L963P77K739m83l830L718
$$ plain form
13604 88871 79481 75889 80704 76620 72547 75360 75944 77410 78982 75371 74276 77849 74311 72775 70059
13589 70059 70618 70018 70670 74130 81483 88006 89388 91084 94796 92725 93478 94101 90697 81486 76500 75873
13573 75873 77967 76599 75023 76454 72449 66730 71577 71207 64369 62945 59674 53409 57180 62317 59690
13558 59690 52211 53536 55741 55242 61324 66690 67723 73813 73305 72369 70289 64778 64957 63941 62449
13543 62449 69357 69634 78936 80880 78848 80174 81785 82650 83495 83745 82658 77262 77164 81490 82089 79959
13527 79959 78530 75602 80130 86590 89748 83501 77687 74806 75740 75464 75060 75490 77367 80637 81048 84885
13511 84885 90220 94457 93134 89591 88986 87452 82248 81717 76759 78120 80437 83654 87278 94196 92611
13496 92611 94338 98688 105873 103576 101668 105917 103409 100481 103119 107082 107859 110598 110115 106285 110003
13481A10003r65L578O483j636o710p424J325p67j626m506M25L61K188K644K740
13466A06113M839N776J698l813o554K212K264m3J343K948K67j954O121j352p612
13451A12253K186P828J0040L953M02N897M241L684r27k072m309l761k478O241
13437A43178L725L155N507P041L649L301k025k729L077Q410R076K806l724q654
13423A75793m067O690K557k905L635P378Q803l111q653N405K521k205m658L302
13409A90485O651K267Q700O208J1946N70j248j441Q061J2173Q40n045J250j774
13395B39643L355R720J381p50J528P684J954O636K568K036L458m67k483L804M316
13380B84383P704P000n254J60R284J0500N251L043q33P499L531J946N132P163
$$ plain form
13481 110003 109038 112616 119099 117463 110753 103329 104654 103887 102261 97755 98180 98541 100729 103373 106113
13466 106113 110952 116728 118426 114613 108059 110271 112535 112492 113835 116783 117050 115096 121217 119865 112253
13451 112253 114439 122267 132307 136260 136662 142559 146800 150484 149557 147485 143176 139415 136937 143178
13437 143178 146903 150058 155565 162606 166255 169556 167531 164802 167879 176289 185365 188171 184447 175793
13423 175793 171726 178416 180973 178068 181703 189081 197884 194773 186120 191525 194046 191841 187183 190485
13409 190485 197136 199403 208103 214311 226257 226827 225579 224138 232199 244372 245212 240167 241417 239643
13395 239643 242998 252718 254099 253349 254877 262561 264515 271151 273719 275755 279213 278746 276263 280067 284383
13380 284383 292087 299087 293833 293993 303277 313777 319028 322071 321238 328737 332268 334214 339346 346509
13366C46509M947l786J1503M149K16J0678R741N879N807L720J6245O760J64j462
13352D21070j098M321J4022R104Q038R541J2586J0510L467J1183J0089P881O811
13339E27525M530K558R477Q537J1611R615O399P176P620Q073J0616J7778J2603
13326F44118J3195J2633J3748J2449J4127J8272K0431J9075J2097J6148R902J2301
13314H18496K7834K2236K7777K9009J9947J6383K5955K2826L1164L5735K8124
13303A105486L5433L0153K6746L7013L4012K8393L5116L4080K6309K6970L4523
13292A454234L6366L9368M5645M0708M4714N1480N0064N3220N3520N3562N4469
13281A977350O4981O9044O7409O9343O8946P2935Q3313P6888P8042Q3319Q7127
$$ plain form
13366 346509 351456 347670 359173 363322 363538 374216 383957 389836 395643 399363 415608 422368 422532 421070
13352 421070 419972 424293 438315 447419 455457 464998 477584 488094 491561 502744 512833 520714 527525
13339 527525 532055 534613 544090 552627 564238 573853 580252 587428 595048 603121 613737 631515 644118
13326 644118 657313 669946 683694 696143 710270 728542 748973 768048 780145 796293 806195 818496
13314 818496 846330 868566 896343 925352 945299 961682 987637 1010463 1041627 1077362 1105486
13303 1105486 1140919 1171072 1197818 1234831 1268843 1297236 1332352 1366432 1392741 1419711 1454234
13292 1454234 1490600 1529968 1575613 1616321 1661035 1712515 1762579 1815799 1869319 1922881 1977350
13281 1977350 2042331 2111375 2178784 2248127 2317073 2390008 2473321 2550209 2628251 2711570 2798697
13270B798697R4739R4693R5681R7144J01515J00238R6068R8229R5568J01767J03247
13259C877586R9984R8064R9251R9524Q8529Q1876Q5818Q4644Q8330Q9734P3764
13248D867104O8124O6717P3527O3555N2835O2550N7996M9223N5127M5451L8548
13237E500757K9379L0505K9565K5589J4165R291M873N241M149l684j3188j5508
13225E621134j6723k4001j3932k0880k8042l4624m0988l2389l6779m2528l3742
13214E296506m0072m5679m8519m5848m1814m2815n6871m8079m4392l5154m0998
13203D806265m6964m8799m5410l1261k9047l1797k5433j6612k1255k0432q663
13192D480592N741J2294P435J5218J5810K5616L0715K9833L8752L7982M6025N7488
$$ plain form
13270 2798697 2893436 2988129 3083810 3180954 3282469 3382707 3478775 3577004 3672572 3774339 3877586
13259 3877586 3977570 4075634 4174885 4274409 4362938 4444814 4530632 4615276 4703606 4793340 4867104
13248 4867104 4935228 5001945 5075472 5139027 5191862 5254412 5312408 5361631 5416758 5462209 5500757
13237 5500757 5530136 5560641 5590206 5615795 5629960 5639251 5644124 5649365 5653514 5649830 5636642 5621134
13225 5621134 5604411 5580410 5566478 5545598 5517556 5482932 5441944 5409555 5372776 5330248 5296506
13214 5296506 5256434 5210755 5162236 5116388 5074574 5031759 4974888 4926809 4882417 4847263 4806265
13203 4806265 4759301 4710502 4665092 4633831 4604784 4572987 4547554 4530942 4509687 4489255 4480592
13192 4480592 4486333 4498627 4506062 4521280 4537090 4562706 4593421 4623254 4662006 4699988 4746013 4803501
13180D803501N4300N1596N5457N7878N7876O5635P7186P9424Q0815P6127Q9101
13169E548896J10389J35679J98096K65458K79939K22334O6059r5176j76304j62163
13159F393207j04399m9466o948J6475K9773K9823K1234J7848N655p436k5406k9986
13147F290374l9712n4354n6348o3935n9733n8298n8347o3325n4444o0925p2427
13136E648526p6277o3241p0038p4359p2330o3116o9707o2607n4730m3407m1378
13125D957336k0769L1664J30649K95316M98555O44138N42657J33678l82263p21234
13115F109727p43953n60889l68945k44557j75436j51135j58350j67059j71078
13106C368325j72378j68731j52044j35440j20664j00210r4389q6284p7817q0177
$$ plain form
13180 4803501 4857801 4909397 4964854 5022732 5080608 5146243 5223429 5302853 5383668 5459795 5548896
13169 5548896 5659285 5794964 5993060 6258518 6538457 6760791 6826850 6731674 6555370 6393207
13159 6393207 6288808 6239342 6232394 6248869 6278642 6308465 6329699 6347547 6353202 6345766 6320360 6290374
13147 6290374 6250662 6196308 6139960 6076025 6016292 5957994 5899647 5836322 5781878 5720953 5648526
13136 5648526 5572249 5509008 5438970 5364611 5292281 5229165 5159458 5096851 5042121 4998714 4957336
13125 4957336 4936567 4968231 5098880 5394196 5892751 6536889 7079546 7213224 6830961 6109727
13115 6109727 5365774 4804885 4435940 4191383 4015947 3864812 3706462 3539403 3368325
13106 3368325 3195947 3027216 2875172 2739732 2619068 2518858 2424469 2338185 2260368 2180191
13096B180191o9191o1090o2231n8597m8133m1860l9239m0035m0965l2922k0697
13085A665231j5343m076P582J4746K7518M9711R7450J89937L46516N53970P34703
13074C667945P13026L69480j75443o14917p43026o13981m26310k82692k02721
13065A691361j51213j23867j04863q8767p3518n8078m0913l1868j6400p777q87
13054I93210j1884l2493m9639m0545k8166k2256j9095j2676r014k939j3826j4258
13042G36419n486L554o68M603P609J3211K2325K3810L7552N5630J05567J72144
13030A176270K19079K19340J27693n3804k08283k67695k21942j57086r8692o7080
13020F67800l7852k7816k4894k6759k0041j2108j3610r917J4480J5576R239L235
$$ plain form
13096 2180191 2111000 2049910 1987679 1929082 1880949 1839089 1799850 1759815 1718850 1685928 1665231
13085 1665231 1649888 1645812 1653394 1668140 1695658 1745369 1842819 2032756 2379272 2933242 3667945
13074 3667945 4380971 4750451 4575008 3960091 3217065 2603084 2176774 1894082 1691361
13065 1691361 1540148 1416281 1311418 1222651 1149133 1091055 1050142 1018274 1001874 994097 993210
13054 993210 981326 948833 899194 858649 830483 808227 789132 776456 767442 764503 750677 736419
13042 736419 730933 734487 733819 738422 746031 759242 781567 805377 842929 898559 1004126 1176270
13030 1176270 1395349 1614689 1742382 1688578 1480295 1212600 990658 833572 734880 667800
13020 667800 629948 602132 577238 550479 530438 518330 504720 494803 509283 524859 534098 537333
13008E37333j2400k3908l3768k7217j0405j5135n756k371o727J3255K5765N575
12996D44241L37M051l373p363k412p645j6669k1220j7584j7777j6935j0022j7379
12983C10250r966j2283j0630l346p51l166k135m026o084m022M975l49K005j0718
12969B49754j2185p268R61J3451J1540L160l23o336K341k30N020N450M28P016
12955B72779N518J3359P487j205j1949j8587j4189j4710j4507k376n123l500j0636
12942B02361j269J375j075k605K509m429o893J820L897L2m088o51r64m761j4329
12927A70930q227l445l120L553O667L064J67P448j213J010J0158m230m294K103
12913A80571j711j815k566m184M414M271J234J81j507l506J056k554k985J0055
$$ plain form
13008 537333 524933 501025 467257 440040 429635 414500 408744 406373 399646 412901 438666 444241
12996 444241 444578 448629 445256 437893 435481 427836 411167 389947 372363 354586 337651 327629 310250
12983 310250 300284 288001 277371 274025 273274 270108 267973 263947 257863 253841 258816 258467 260472 249754
12969 249754 237569 230301 231262 244713 256253 259413 259090 252754 255095 254865 259885 265335 265763 272779
12955 272779 278297 291656 299143 297938 285989 267402 253213 238503 223996 221620 216497 212997 202361
12942 202361 201092 202467 201392 198787 201296 196867 189974 191794 195691 195723 191635 190984 190020 185259 170930
12927 170930 162703 159258 156138 159691 166358 169422 169589 177037 175824 176834 186992 182762 178468 180571
12913 180571 178860 177045 174479 170295 174709 178980 180214 180395 178888 175382 176438 173884 170899 180954
12899A80954R461Q333O389M903L997K017K9j324l595O589m72l83k275l693j392
12884B09538m76p849o012n453m077q897q982k69k629k455J955l896m838j0406
12870A45254n977K641j678l361L684P110l120M210K631L083P799L676N011L934
12856A74897Q044R749P183J2592K5257K6043L1890M6294N5981N5738M2677J5320
12844E11665j7198m2447m4656l4217l0927j7264q985K0852L6238P3044J30180
12833E76285J42538Q1894l3765j34708j53025j17137o8891m5438k6167k0893j6310
12822A84383j2935p272n651L297n282k241m69J427R200J5127J0687K1671K6546
12809B38488L7562M7249L2373N590j8617k0661j3957l723J1194L0179O6302J04590
$$ plain form
12899 180954 190415 198748 205137 210040 214037 216054 216083 214759 211164 217753 217281 216898 214623 210930 209538
12884 209538 209062 201213 195201 189748 185671 176774 167792 167523 164894 162439 164394 160498 155660 145254
12870 145254 139277 141918 140240 136879 140563 147673 144553 148763 151394 154477 162276 165952 170963 174897
12856 174897 182941 192690 199873 212465 237722 263765 295655 341949 397930 453668 496345 511665
12844 511665 494467 452020 407364 373147 342220 324956 315971 336823 373061 446105 576285
12833 576285 718823 800717 766952 632244 479219 362082 293191 247753 221586 200693 184383
12822 184383 171448 164176 158525 161822 156540 154299 153830 155257 164457 179584 190271 211942 238488
12809 238488 276050 323299 355672 361262 342645 321984 308027 304304 315498 345677 411979 516569
12797E16569J29545R9099L603j12702j44815j12485p5477m1762k0642j7027j7596
12786B06310j3208p188R07j0318o604J969Q530R434J3503J1748L8224N2851O2227
12773C68385P3713O6325J7265l6023p3165o7963n9863m1814l1233l0269j7623
12762A67735n941q23O805J1514J0310Q595K384j3689j8880j3702p250p131j2939
12749A26988q732j907L714N347p502J954j241J996J5274J3918J5950K6263L3290
12736B25312M3049O4602O5368M7855R010l1965n0795m8029m6401k0998r830m762
12724B42416J75l106O538j654j196q210K535l580k2887k2957k1439k1283j2858
12711A32494j1650j1398j0239O05k084q33p75k671j293M656P647Q361M358J577
$$ plain form
12797 516569 646114 745213 748816 636114 491299 378814 303337 261575 240933 223906 206310
12786 206310 193102 185914 186821 176503 169899 171868 180398 189832 203335 215083 253307 306158 368385
12773 368385 442098 508423 525688 489665 416500 348537 288674 246860 215627 185358 167735
12762 167735 161794 160971 167776 179290 189600 198195 200579 186890 168010 154308 147058 139927 126988
12749 126988 118256 116349 120063 125410 117908 119862 118621 120617 135891 149809 165759 192022 225312
12736 225312 268361 332963 398331 446186 455196 423231 372436 324407 278006 257008 247178 242416
12724 242416 242591 239485 246023 244369 243173 234963 237498 233918 211031 188074 166635 145352 132494
12711 132494 120844 109446 99207 99812 97728 96895 96120 93449 92156 96812 104459 112820 117178 118755
12697A18755L225J825J5211K0530K7821L0446L1262K2765J4139L096q583j7390
12685B63102l0540k6751j9609k5189j5792j4269j0156n490M646M884R010P993
12673A41839J1052K2159K2179K8681L2564L333j9477k2967k4929j8647l059K243
12661A74971L808J999J0411J3632P910L195r402j4083j7845j7539n766q299o618
12648A36374k620q619o464j710K78l530r6J995M964R498M873O548J3716J2921
12634A68128N189J5797K1741J5294P164L805r39j1768l258p694k1811j6699j2348
12621A62601j4605o893O437J635k607J091l9o471l461n545q964r219j1695K134
12607A04399K428P834J5669N736M058M463P220J1769J2614Q913o12k034L145J1003
$$ plain form
12697 118755 121980 123805 139016 159546 187367 217813 249075 271840 285979 289075 280492 263102
12685 263102 232562 205811 186202 161013 145221 130952 120796 115306 119952 124836 133846 141839
12673 141839 152891 175050 197229 225910 258474 261807 242330 219363 194434 175787 172728 174971
12661 174971 178779 180778 191189 204821 212731 215926 206524 192441 174596 157057 151291 142992 136374
12648 136374 133754 125135 118671 116961 117239 113709 113613 115608 120572 130070 134943 141491 155207 168128
12634 168128 173317 189114 210855 226149 233313 237118 236179 224411 221153 213459 191648 174949 162601
12621 162601 147996 141103 147540 149175 146568 147659 147620 141149 137688 132143 123179 113960 102265 104399
12607 104399 106827 114661 130330 136066 140124 144587 151807 163576 176190 185103 184491 182457 185602 196605
12593A96605N645J946o124j4654j1176j3219j3011j4105r610J350M357j962N302
12580A31344N684J0924J0367J7561K2107J6883N348M81k457q177n464j023J5575
12567B19153K5045L2766L8088L5433L1324P652j3940L035K0595K0689N62k4093
12555C96309k3118j1638j351J6098N3306Q8309J10645J11542P4321R743l3673
12544G90493j5835N3948J53481K88641M65003O53298O15987K30623k62074m21066
12534B552499k01562K467Q101j21599k46364k51135j95788j02033j8088Q2210
12524A508708K03342K78009K28334Q9021l9240l4580O6654J35460J17107O8427
12514B621242R0744J76682J95764P9615j08561k24023k10753j17283J3317J46057
$$ plain form
12593 196605 202250 204196 198072 183418 172242 159023 146012 131907 122297 123647 128004 126042 131344
12580 131344 137028 147952 158319 175880 197987 214870 220218 220699 218242 210065 204601 203578 219153
12567 219153 244198 276964 315052 350485 381809 389461 375521 378556 399151 419840 420402 396309
12555 396309 373191 361553 360202 376300 429606 517915 628560 740102 814423 824166 790493
12544 790493 774658 828606 982087 1270728 1735731 2389029 3005016 3235639 2973565 2552499
12534 2552499 2350937 2353404 2361505 2239906 1993542 1742407 1546619 1444586 1426498 1508708
12524 1508708 1712050 1990059 2218393 2307414 2268174 2233594 2300248 2435708 2552815 2621242
12514 2621242 2711986 2888668 3084432 3164047 3055486 2831463 2620710 2503427 2516744 2662801
12504B662801K11402K23677K24269K55355L23039M56783P73410J247244J385158
12495G763138O70393n38254j321165j202054p08836l74820k99296l19683l15910
12486C353513k80579k38295j68598j8974J59187K42744J67695k9134k12912k29676
12476B744971j09873j1954O007J7805R5172K06257K05228J7513k66673m37407
12466B467046m12514k76462j35571J996J03546J80457K23680J98896J08554K1311
12456B480939N7716K92352M85727K85844k30260o70655o88783m88934k81564j23400
12446A118982j5207N0681N6155M093q1158j26755j34876j13675p4217l9848j3952
12435F30223L966J1244J3196j169P277N3973J16658J70077K00465J67766M5289
$$ plain form
12504 2662801 2874203 3097880 3322149 3577504 3900543 4357326 5130736 6377980 7763138
12495 7763138 8433531 7895277 6574112 5372058 4663222 4288402 3989106 3669423 3353513
12486 3353513 3072934 2834639 2666041 2647067 2806254 3048998 3216693 3187559 2974647 2744971
12476 2744971 2635098 2623144 2629151 2646956 2742128 2948385 3153613 3171126 2904453 2467046
12466 2467046 2054532 1778070 1642499 1644495 1748041 1928498 2152178 2351074 2459628 2480939
12456 2480939 2538655 2831007 3316734 3602578 3372318 2701663 2012880 1523946 1242382 1118982
12446 1118982 1103775 1154456 1210611 1214704 1133546 1006791 871915 758240 684023 644175 630223
12435 630223 634189 645433 658629 657460 664737 718710 835368 1005445 1205910 1373676 1418965
12424A418965j12836k14200k13122j57740j06408o8282l6727j9138k3857k2653
12414D44002l0665l3848j9715j9182j3290p151K266j6O850J7908K7809L3339L4530
12401D42837K0807J0804r623j6625k1785j2957o941k960L003J2182J8364J4912
12389D52018K2389K3594L0959K5888J1282J4469K4381K5698L884k9428n4089o7664
12377D83381n7007l5692k0504j3658j1652j7364j2365k1007j6070q395j0246p654
12365B51767j1310j1827q779p171p068p160j2344k403M155R892J1299K3928J9768
12352B52747J8927J1510P134l355j7820k6190k7580l4400k1705k0652j1879j1986
12340A14751p206K431n245q490R54o79L292l123k337P297J3139Q919J1289J1308
$$ plain form
12424 1418965 1306129 1091929 878807 721067 614659 546377 509650 490512 466655 444002
12414 444002 413337 379489 359774 340592 327302 320151 322417 322401 329251 347159 374968 408307 442837
12401 442837 463644 474448 464825 448200 426415 413458 406517 403557 406560 418742 437106 452018
12389 452018 474407 498001 528960 554848 566130 580599 604980 630678 634562 605134 551045 483381
12377 483381 426374 390682 370178 356520 344868 327504 315139 294132 278062 269667 259421 251767
12365 251767 240457 228630 219851 212680 205612 198452 186108 183705 187860 197752 209051 232979 252747
12352 252747 271674 283184 290318 286963 269143 242953 215373 180973 159268 138616 126737 114751
12340 114751 107545 109976 104731 96241 97195 96516 99808 96685 94348 101645 114784 123703 134992 146300
12326A46300P179P045k726l112L494n854q034j4218j1866m164m825L066O682R503
12312A28470N643O135J3029P618k522K514N05o08k768m725j6028j0861r259r168
12298A07975q338q838O960K063n918j348J2880J1153K2185L5119N2401P8541R1962
12285C96797O6038J1593l5127n7968n5389m8187l6885k3223k4620k6240j3753
12274A53036j4760j2955m817o595j1415n762K634j1639j0951q377n324n760k599
12261E4716j096O522M19l23K62o182J01N538K312N795P447P084J8615K5843L6166
12246A63219L7868N9405J04367J69914K34735K65215J87193n278j90364k57438
12236G68836k18694j42948q9372n6217l1455j7893L209L0055M2942M7521L5579
$$ plain form
12326 146300 153479 160524 157798 154686 158180 152326 144292 130074 118208 114044 109219 112285 118967 128470
12312 128470 134113 140248 153277 160895 158373 160887 161392 160784 158016 153291 137263 126402 117143 107975
12298 107975 99637 90799 97759 99822 93904 92556 105436 116589 138774 173893 226294 304835 396797
12285 396797 462835 474428 439301 381333 325944 277757 240872 217649 193029 166789 153036
12274 153036 138276 125321 120504 113909 102494 96732 99366 87727 76776 68399 63075 57315 54716
12261 54716 53620 60142 60561 60238 60500 54318 54419 59957 62269 68064 75511 82595 101210 127053 163219
12246 163219 201087 260492 364859 534773 769508 1034723 1221916 1216638 1026274 768836
12236 768836 550142 407194 317822 261605 230150 212257 215466 245521 288463 335984 371563
12225C71563J1744j1613m1624m8453n2398n5025l4541k1180j2181j2975K771J888
12213I7976p382l915n87q65o99P15J3876J1169R369J0523K2656L3070N2833Q3418
12199C22157J26132J83423K58892K66727J58099o4565k35207k68043j95150j20934
12189D31531o9669l5453l758K9788O6273J16338J69058J93607J54479O9034n3263
12178A067965j55274j97590j91913j39503r1980n1203m1211k2358j9332j6776
12168A40825j3250j1319j0858o57p99m263j811k501K512L832O293J1914J5021
12155A34939K4853M5645P0049Q5476Q1113L3715l8989p0853o3308m3432k9989
12144B29219j3174J2569K7174M8991Q7527J44752J88227K08615J66761N6450q5816
$$ plain form
12225 371563 383307 371694 330070 281617 229219 174194 139653 118473 106292 93317 96088 97976
12213 97976 90594 86679 86092 85227 84528 85243 99119 110288 119657 130180 152836 185906 238739 322157
12199 322157 448289 631712 890604 1157331 1315430 1250865 1015658 747615 552465 431531
12189 431531 361862 326409 322651 352439 418712 535050 704108 897715 1052194 1121228 1067965
12178 1067965 912691 715101 523188 383685 291705 240502 199291 176933 157601 140825
12168 140825 127575 116256 105398 104741 103942 99679 97868 95367 97879 101711 108004 119918 134939
12155 134939 159792 205437 275486 360962 442075 475790 436801 365948 302640 259208 229219
12144 229219 216045 228614 255788 304779 392306 537058 725285 933900 1100661 1157111 1071295
12133A071295j88887k11887j73513j25296q0428m9746k4212j6571r258l44M036
12122A95189O229K6538K9940K6561K3242J5776L205j045j4875k6285k9392k9223
12110B25860k3011k2663j8659j4670r689j8302q809p16J3723J2180K359L172L856
12097A44631J1974K2752L6110N5357P0973P0198M3606M259l8916n9132n6598m3353
12085B61861k1216n365J0811J9854K9075K6752L0018K2539J588k0785l4652m0542
12073B79938l2554k8476k1370j5642k0643j7044q247r790L813j199r363l517J185
12060A17091k151j1740j0134p37l180O979N509N591P546O719n1N223O499O425
12046A39589J233Q898J585L980J250K841j66K090k031J062J27j153l509j861J492
$$ plain form
12133 1071295 882408 670521 497008 371712 291284 241538 217326 200755 191497 191153 195189
12122 195189 201418 227956 257896 284457 307699 323475 326680 325635 310760 284475 255083 225860
12110 225860 202849 180186 161527 146857 137168 118866 110057 109341 123064 135244 137603 140775 144631
12097 144631 156605 179357 215467 270824 341797 411995 455601 459860 420944 361812 305214 261861
12085 261861 240645 235280 246091 265945 295020 321772 351790 374329 375917 355132 320480 279938
12073 279938 247384 218908 197538 181896 161253 144209 135962 126172 129985 128786 119423 115906 117091
12060 117091 114940 103200 93066 92329 89149 96128 101637 107228 114774 121493 121442 126665 133164 139589
12046 139589 140822 149720 151305 155285 156535 159376 159210 161300 159269 160331 160458 159305 155796 153935 155427
12031A55427K606l895m826n277j1608j2876j1545o703q034p932K686k936o812
12018G8275q046j709l062K185l37n081K272n809k864K250q074r759P0M03J295
12003D2009k071l986m956L870j6M066j814n057j739J462m762l609L815J450L886
11988C2548m91L118k878N314k089j799l158L58O55m892M297J991J588j893L756
11973C6425l158l865m894n434k671N075l060j32L066N215O087L628r370m600Q746
11958C1058P375k760j0450L669M56l479p042j189M231K740M706N996L438K865
11944D1614P783J6424N928Q308K0902K2222K1202J4390J1634j309j874j1729j1834
11931A43661k2498k4151j0529l841P21p340q482K537N757r02m412K56L519N839
$$ plain form
12031 155427 158033 154138 149312 144035 132427 119551 108006 101303 93269 85337 88023 85087 78275
12018 78275 70229 68520 65458 67643 67306 62225 64497 58688 55824 58074 50000 40241 40311 40714 42009
12003 42009 39938 35952 30996 34866 34850 38916 37102 32045 30306 31768 27006 23397 27212 28662 32548
11988 32548 32057 35175 32297 37611 35522 33723 30565 30923 31578 26686 30983 32974 34562 32669 36425
11973 36425 33267 29402 24508 19074 16403 21478 18418 18286 21352 26567 32654 36282 26912 22312 31058
11958 31058 38433 35673 25223 28892 29348 25869 18827 17638 21869 24609 29315 35311 38749 41614
11944 41614 49397 65821 71749 80057 100959 123181 144383 158773 170407 169098 167224 155495 143661
11931 143661 121163 97012 86483 82642 83363 76023 67541 70078 75835 74933 70521 70777 74296 80135
11917H0135O800J4973J5434J7884K2500J5212Q994N787q060j9466j9643k2907
11905A17643j6279j0261q501o963k385m188j470N958N642j062K773J5101J8244
11892A14252J6254J7139J3268J5523O053o719n958o112r259n694p773j4514j1723
11879A14737j1795q877o867q32N22n68j483K908N436M375R261J4009K0158J5398
11865A56382J2833J6913P908q379m226j2827j5171j2548j2666p620k216j795O404
11852A22992Q73K443J1439R888O42K706j601n839j1722j1207j2854m129n850n919
11838I1862m366m913N252P73L156O945P26o21P302M125O480P873J0025J1206L993
11823A49818j286p246p803q768n037q042q272o178j0799l1K757O80J0044J0552
$$ plain form
11917 80135 86935 101908 117342 135226 157726 172938 181932 187719 179659 160193 140550 117643
11905 117643 101364 91103 82602 75639 73254 69066 67596 73554 79196 78134 80907 96008 114252
11892 114252 130506 147645 160913 176436 182489 175770 169812 163700 154441 148747 140974 126460 114737
11879 114737 102942 94065 87198 86366 86888 86320 84837 87745 93181 97556 106817 120826 140984 156382
11865 156382 169215 186128 194036 185657 181431 168604 153433 140885 128219 120599 118383 116588 122992
11852 122992 123865 126308 137747 147635 148277 150983 149382 143543 131821 120614 107760 103631 97781 91862
11838 91862 87496 82583 87835 88608 91764 98709 99435 98814 106116 110241 116721 124594 134619 145825 149818
11823 149818 148532 141286 133483 124715 119678 111636 103364 97186 86387 86356 89113 89793 99837 110389
11809A10389J6554L229m617J171J0749J3487J5097K856J765L198o360m197m268
11796A59053j5996o544n321j1194k524o656M755o85o99N937M503L253J111O832
11782A35825O388N463J584Q754J2677Q123j465n456j357m072j1233j0290q963
11769A35978j7254j0499n131r78O101J664R65M582K226L153J0560K284j043j568
11755A31040N014J047q299j0536o349R54n45o363m417L608j371m216p68L179P633
11740A09611R206P242J152P165J1070K410M611L31k541l107n18l902j816j790
11726A39124j1166o389o787K45N072R4o571l783K915J804n801q34R633J646N288
11711A24490O209R776N961O77q61L47l138r88q223l297r642k445P911K336P71
$$ plain form
11809 110389 126943 130172 125555 126726 137475 150962 166059 168915 170680 173878 167518 163321 159053
11796 159053 143057 136513 131192 119998 117474 110818 115573 114888 114189 120126 124629 127882 128993 135825
11782 135825 142213 147676 149260 158014 170691 178814 177349 171893 170536 166464 155231 144941 135978
11769 135978 118724 108225 103094 102116 108217 109881 110846 115428 117654 120807 131367 133651 132608 131040
11755 131040 136054 137101 128802 118266 111917 112871 112326 105963 101546 105154 103783 99567 98799 101978 109611
11740 109611 118817 126059 127211 134376 145446 147856 152467 152798 150257 147150 146632 142730 140914 139124
11726 139124 127958 121569 114782 115027 120099 120193 113622 109839 112754 114558 108757 107923 117556 119202 124490
11711 124490 130699 140475 146436 147113 146252 146599 143461 142473 134250 130953 121311 118866 126777 129113 129884
11696A29884k26J058K949L938M009J0143J2844Q867O267J2780R699j027p4n239
11682A95872n128p874j6283j0705r868o372k339k158J542m651l834n199L510J1457
11668A37970M060j750k022Q125P18N686K227K733k080r587o509l329L347j226
11654A38363m366k748k970L429j1508n785P833J819q452J449M084N36J683R358
11640A32725J0234n097M961O989r048k538J596K784m335N7j290K959K30M065l516
11625A40776p356M347N659K518M093N532O274M637L880K425M270R616M471J4358
11611B05500K107j185j4687j3501p405L372O062K405j727N257n434p886r42O498
11597A78434k345N15N27N691l20M874L165R583J1592K405O463N304k591Q49K80
$$ plain form
11696 129884 129658 130716 133665 137603 141612 151755 164599 173466 179733 192513 202212 201185 201111 195872
11682 195872 190744 182870 166587 155882 146014 139642 137303 135145 136687 132036 128202 123003 126513 137970
11668 137970 142030 140280 138258 146383 147101 152787 155014 157747 155667 146080 139571 136242 139589 138363
11654 138363 133997 131249 128279 131708 120200 114415 122248 124067 115615 117064 121148 121684 123367 132725
11640 132725 142959 137862 142823 149812 140764 138226 139822 142606 138271 138328 137038 139997 140227 144292 140776
11625 140776 133420 137767 143426 145944 150037 155569 161843 166480 170360 172785 177055 186671 191142 205500
11611 205500 207607 206422 191735 178234 170829 174201 180263 182668 180941 186198 180764 172878 171936 178434
11597 178434 176089 176604 177131 182822 182502 187376 190541 200124 211716 214121 220584 225888 223297 224146 224426
11582B24426J215P00K096m383N24l885K049O39N548j143k432l645k325K968j422
11567B20930l216L366j633J265K343M569K975M353O709J3503J1118q912r820n618
11553B41932k379p44l977k767M169P56P360N737r35M757n17L514L794P490M079
11538B72269M106Q723Q908N978O842N405L340j618J386M270K676Q288N407J3119
11524C49099J2643O136O736J8905K2258K2043K5155K4902K6155L7275N0168N7769
11512F59244P0730Q1218R6573J16368J33621J51064J68218J84247J71742J24337
11502A957362O5257l812n6652j08618j35614j34176j17971r6277p6019n2546k3974
11491A216960Q337L7418N4404Q6099J23197J75830K21038K67761L24232L78625
$$ plain form
11582 224426 225641 226341 228437 224054 224578 220693 222742 223381 228929 227786 225354 221709 219384 222352 220930
11567 220930 217714 221080 219447 220712 223055 227624 230599 234952 241661 255164 266282 257370 247550 241932
11553 241932 239553 238809 234832 232065 236234 236990 244350 250087 249152 253909 253392 256906 260700 268190 272269
11538 272269 276375 285098 294006 299984 306826 312231 315571 313953 315339 319609 322285 330573 335980 349099
11524 349099 361742 367878 374614 393519 415777 437820 462975 487877 514032 551307 601475 659244
11512 659244 729974 811192 907765 1024133 1157754 1308818 1477036 1661283 1833025 1957362
11502 1957362 2022619 2018807 1962155 1853537 1717923 1583747 1465776 1369499 1293480 1240934 1216960
11491 1216960 1225297 1262715 1317119 1403218 1526415 1702245 1923283 2191044 2515276 2893901
11481B893901L87439L49971K52330J07032n9011k05446l13398l61551l61718l31688
11471B357861k70395k15622j69459j20899q6345n9908l0614K179K5363N0932Q4964
11460A568057J18489J54592J91772K00732J72717J12283L3418o1137j31930j88142
11450B170851k16763k09673j69399j37636j03984p1828m9537k1344L851L0538
11440A225076N2244O5552R0613J23709J56775K14587K83500L54540M17384M50664
11430C434644M38540L60796K20673K8998j51170k92575l60374l71461l40391k74476
11420B693204k02096j38276p4582j6591L8370Q9990J53764K20596L13966M29189
11410C507534N54931P02261Q29371Q93012Q46932O60131L37924n8616m33378p00512
$$ plain form
11481 2893901 3281340 3631311 3883641 3990673 3931662 3726216 3412818 3051267 2689549 2357861
11471 2357861 2087466 1871844 1702385 1581486 1495141 1435233 1404619 1406798 1432161 1483093 1568057
11460 1568057 1686546 1841138 2032910 2233642 2406359 2518642 2552060 2490923 2358993 2170851
11450 2170851 1954088 1744415 1575016 1437380 1333396 1261568 1212031 1190687 1194538 1225076
11440 1225076 1277320 1342872 1433485 1557194 1713969 1928556 2212056 2566596 2983980 3434644
11430 3434644 3873184 4233980 4454653 4483651 4332481 4039906 3679532 3308071 2967680 2693204
11420 2693204 2491108 2352832 2278250 2261659 2300029 2390019 2543783 2764379 3078345 3507534
11410 3507534 4062465 4764726 5594097 6487109 7334041 7994172 8332096 8273480 7840102 7139590
11400G139590q42391q49927p66951o49790n17310l95511k91781k06369j42261
11391B477299p9049k1123K9618Q7968J64433K44984L03359L61348L89595L63862
11381D322294K62312J03760q1088k52625l72874m36212m45099l90570l36684k80568
11371B092646k22512j73523j29498q6679n9885m3713j9073L370J6164N0609P8991
11360A506897J21828J79933K32315K65101K67054K30119J50855L2595q4285j71431
11350B730981k23846k37841k13669j79073j40580r3327o1290k0688J8736M2067
11340A621470O3911J03022J52345K14524K86473L53195M23528M80110M64548L80744
11330D543870K30453J9675j86744l47174m44175m65309m29630l66257k98703k24579
$$ plain form
11400 7139590 6297199 5447272 4680321 4030531 3513221 3117710 2825929 2619560 2477299
11391 2477299 2398250 2377127 2406745 2494713 2659146 2904130 3207489 3568837 3958432 4322294
11381 4322294 4584606 4688366 4607278 4354653 3981779 3545567 3100468 2709898 2373214 2092646
11371 2092646 1870134 1696611 1567113 1480434 1420549 1376836 1357763 1361133 1377297 1427906 1506897
11360 1506897 1628725 1808658 2040973 2306074 2573128 2803247 2954102 2986697 2902412 2730981
11350 2730981 2507135 2269294 2055625 1876552 1735972 1642645 1581355 1560667 1579403 1621470
11340 1621470 1685381 1788403 1940748 2155272 2441745 2794940 3218468 3698578 4163126 4543870
11330 4543870 4774323 4793998 4607254 4260080 3815905 3350596 2920966 2554709 2256006 2031427
11320B031427j72165j25957q2341m3310j6757J1697M2748P5759J12275J45365
11310A978741J68196J84753J66684J25219N7991k8234j12325j71754k03111k16632
11300A949528k09140j75728j46817j30017j01448p6401n9421m8540m8648l9812
11290I13556k6622j3425j7328j9565r285m295p634r286k885j280n148m476j724
11277G90603N10J168k202n519O413N188j047n20L689k54L099L724O15M661M679
11262H14807j05r50J088N698P545R419R213J0764M294O88R816M922P091J842k91
11247H85841K040N089O206N976K015J10p50O976P085L590j546o571K153N942O673
11232I30829O409O105P770k045J931P950J4967Q321q60N065Q786N501M979R043
$$ plain form
11320 2031427 1859262 1733305 1650964 1607654 1590897 1602594 1645342 1721101 1833376 1978741
11310 1978741 2146937 2331690 2498374 2623593 2681584 2653350 2541025 2369271 2166160 1949528
11300 1949528 1740388 1564660 1417843 1287826 1186378 1109977 1050556 1002016 953368 913556
11290 913556 886934 873509 856181 836616 827331 823036 815402 806116 803231 801951 796803 792327 790603
11277 790603 791113 792281 790079 784560 790973 796161 795114 794594 798283 798029 801128 804852 805467 810128 814807
11262 814807 814702 813752 814840 820538 828083 837502 846715 857479 861773 862461 872277 877199 884290 886132 885841
11247 885841 887881 892970 899176 905152 907167 907277 906527 913503 920588 924178 922632 916061 918214 924156 930829
11232 930829 937238 943343 951113 949068 950999 958949 973916 982237 981377 986442 995228 1000729 1005708 1014751
11218A014751J1434R856P823Q672P332Q521J2587J1595K658O213R928J6210J3670
11205A141250J3694J6868J0789O216J7592K4376J9579K2602J5845J2512J0089
11194A311412J9922K5250K3203L1519L3753K3784K5835K7667K6318K5372L3926
11183A607961L3833L9225L8074M3249L7547M2798N3057N4671N5562N9401N4764
11172B120142N1995O3362P3011P4475P7657P6124P7908Q6262R4685R5422R2801
11161B983844J06623J07197J09576J17970J17406J20273J19214J20767J19162
11152D022032J10449J11373J06619R2980Q0835Q0598P2033O3336N6832N5991M5932
11141D899010L2199L0266K4435J0032J6436Q480m978q373j6976k9586l3686l8570
$$ plain form
11218 1014751 1026185 1036041 1043864 1052536 1059868 1068389 1080976 1092571 1095229 1101442 1111370 1127580 1141250
11205 1141250 1154944 1171812 1182601 1188817 1206409 1230785 1250364 1272966 1288811 1301323 1311412
11194 1311412 1331334 1356584 1379787 1411306 1445059 1468843 1494678 1522345 1548663 1574035 1607961
11183 1607961 1641794 1681019 1719093 1762342 1799889 1842687 1895744 1950415 2005977 2065378 2120142
11172 2120142 2172137 2235499 2308510 2382985 2460642 2536766 2614674 2700936 2795621 2891043 2983844
11161 2983844 3090467 3197664 3307240 3425210 3542616 3662889 3782103 3902870 4022032
11152 4022032 4132481 4243854 4350473 4443453 4524288 4604886 4676919 4740255 4797087 4853078 4899010
11141 4899010 4931209 4961475 4985910 4995942 5012378 5020858 5015880 5007507 4990531 4960945 4927259 4888689
11129D888689n0258o0929p5510q4920q3569q3338q9877r8157r5968q9597r6154
11118C980412q9819q2434p8911p7034o6177n9312n3962m7161l3406k5312k3810
11107C343074j5145j1056m839J822Q949J2159K0565L0884L5210L8233M7966N4801
11095C562623O2388O3722P7838Q7255R0869R8585J06699J09114J18352J37512
11085D514957J41151J53990J66932J75762J73021J93184J98914J95231K09697
11076F122839K14834K03874J98781K03048J96578J78069J82913J80168J60176
11067G841280J46342J34417J11840R6386Q0498N8475M6301L7707K5683J3904n497
11056H587336j9098m1850n5025o2476p5392r1465j09746j22993j30599j40452
$$ plain form
11129 4888689 4838431 4777502 4701992 4617072 4533503 4450165 4360288 4262131 4166163 4076566 3980412
11118 3980412 3890593 3808159 3729248 3652214 3586037 3526725 3472763 3425602 3392196 3366884 3343074
11107 3343074 3327929 3316873 3312034 3313856 3322805 3334964 3355529 3386413 3421623 3459856 3507822 3562623
11095 3562623 3625011 3688733 3766571 3853826 3944695 4043280 4149979 4259093 4377445 4514957
11085 4514957 4656108 4810098 4977030 5152792 5325813 5518997 5717911 5913142 6122839
11076 6122839 6337673 6541547 6740328 6943376 7139954 7318023 7500936 7681104 7841280
11067 7841280 7987622 8122039 8233879 8330265 8410763 8469238 8515539 8553246 8578929 8592833 8587336
11056 8587336 8568238 8526388 8471363 8408887 8333495 8242030 8132284 8009291 7878692 7738240
11046G738240j50099j63410j82733k01860k06512k08881k13501k10311k06927
11037E994006j98987j96872j97373j87602j77460j74264j51856j48921j46270
11028D414401j32927j17266j00393q8979r0762q4101o5997m9490m4132m2678m3492
11017C554184l8340m3413m1904l2792l5105k5419j3897q901j600Q126K1648K6788
11005C369375L6255L8839M7742O0483P2090P9277Q1793Q4431Q5473R3522J00754
10994D150034J06100R9031J00568R5574Q4436Q2683P2257O5641N1416M7159L8436
10983D993335L1108K0214J6958M49m920l204m511j5873k1940k5017k4128l3479
10971D928992m5267n6268p1206q1969q5278r8536j13904j16980j26192j21239
$$ plain form
11046 7738240 7588141 7424731 7241998 7040138 6833626 6624745 6411244 6200933 5994006
11037 5994006 5795019 5598147 5400774 5213172 5035712 4861448 4709592 4560671 4414401
11028 4414401 4281474 4164208 4063815 3974836 3884074 3799973 3733976 3684486 3640354 3597676 3554184
11017 3554184 3515844 3472431 3430527 3397735 3362630 3337211 3323314 3314413 3312813 3320939 3342587 3369375
11005 3369375 3405630 3444469 3492211 3552694 3624784 3704061 3785854 3870285 3955758 4049280 4150034
10994 4150034 4256134 4355165 4455733 4551307 4635743 4718426 4790683 4856324 4907740 4954899 4993335
10983 4993335 5024443 5044657 5061615 5062064 5057144 5053940 5049429 5033556 5011616 4986599 4962471 4928992
10971 4928992 4883725 4827457 4756251 4674282 4589004 4490468 4376564 4259584 4133392 4012153
10961D012153j15740j21832j26376j26328j23402j15236j11576j02826j03248
10952B965589j06933j01700r1925q5750q0616p2734o8314o6992o4597n9513n5806
10941B110709n0402m4410m6529m4407m0884l8349l6892l9785l6570k7088k9049
10930A676344k6256k7612k0660k4958k3590k6516j8411j2749k2643j7450r585
10919A445914j5151j9605j9670j2873j4814j7427j6253j4504j6584j2832k0133
10908A266068j5861j1821o831j2776q431j3682j1766q193r948n817j4437j4702
10896A131803o219r470O99l577q003q900j6808j5959j794m123o095n309k027q484
10882A035734j2397r573p281m982r406r053j2330j0708J930J098j379r890o223
$$ plain form
10961 4012153 3896413 3774581 3648205 3521877 3398475 3283239 3171663 3068837 2965589
10952 2965589 2858656 2756956 2665031 2579281 2498665 2425931 2357617 2290625 2226028 2166515 2110709
10941 2110709 2060307 2015897 1969368 1924961 1884077 1845728 1808836 1769051 1732481 1705393 1676344
10930 1676344 1650088 1622476 1601816 1576858 1553268 1526752 1508341 1495592 1472949 1455499 1445914
10919 1445914 1430763 1411158 1391488 1378615 1363801 1346374 1330121 1315617 1299033 1286201 1266068
10908 1266068 1250207 1238386 1231555 1218779 1210348 1196666 1184900 1176707 1166759 1160942 1146505 1131803
10896 1131803 1125584 1116114 1116813 1113236 1105233 1096333 1079525 1063566 1061772 1057649 1051554 1046245 1044218 1035734
10882 1035734 1023337 1013764 1006483 1001501 992095 983042 970712 960004 961934 963032 961653 951763 945540
10869I45540p770p569P98p7R04p2l645M431Q91n218N568Q219k075o875m987M444
10853I32507J4363N842J580r54K95j280Q431K883J423l670k031l249M515Q283
10839I68938L312Q856J1570N176j903j9734j3865m315r411j1142j669K280L211
10826I41304l792m871n945o610m22K205m589q387k562r262m327K265l635q155
10812H83217j217q200k3690j3690L261l053n232p456l56K935m651j3657j0937
10799G97274o998R81j1788j14n000n796j12j0546j624o87n256n406n04p788o130
10784G30506o530n296L69M631Q82l167l311K759P72n29j1667j289J239m473O631
10769G11527J1819Q199J2803N658o132q666m234J200k804P144Q85r053n872q686
$$ plain form
10869 945540 937770 930201 930999 930922 931826 931754 928109 932540 933431 928213 933781 942000 939925 933050 928063 932507
10853 932507 946870 952712 954292 953338 953633 952353 960784 963667 965090 961420 959389 956140 960655 968938
10839 968938 972250 981106 992676 997852 995949 976215 962350 958035 948624 937482 935813 938093 941304
10826 941304 937512 932641 926696 920086 919664 921869 917280 908893 906331 897069 892742 895007 891372 883217
10812 883217 882000 873800 850110 836420 839681 836628 831396 823940 823584 826519 821868 808211 797274
10799 797274 790276 791257 779469 779355 774355 768559 768447 757901 756277 755590 750334 744928 744424 736636 730506
10784 730506 723976 718680 719049 723680 724562 721395 718084 720843 721615 721086 709419 708130 709369 704896 711527
10769 711527 723346 731545 744348 750006 743874 735208 730974 732174 729370 736514 737399 728346 722474 713788
10755G13788o512j997p070l112j978O450n231K09l240L49J142l96J356o398m952
10740F82408J884m874r219n302K952J051r70o902n090L038o003k418m72k198m625
10725F43260n714l64o46m943m67l974m635k763J419N040k595L11P357M078P107
10710F42471J3915K8050L7348L1264L9036M5793O9898J00403J05625Q7284M6634
10699A247721j0025o8792j01253j04536r9281q8983o6748m9194k9441j7274k780
10688F09414r509j3589j1427o564l928j1338n851K35m558R82p234o909l827j261
10674E24636r25o302l098J979J521M498j790J106j032K932rk669P689j992m288
10659E22256M709Q506j265L808L175J981k955N782L30K44o184l62O967m463m181
$$ plain form
10755 713788 707276 705279 698209 695097 693119 699569 694338 694547 691307 691656 692798 692402 693758 687360 682408
10740 682408 684292 679418 670199 664897 667849 668900 667930 661028 655938 658976 652973 650555 650083 647885 643260
10725 643260 637546 637182 636536 631593 631126 627152 622517 619754 621173 626213 623618 623929 631286 635364 642471
10710 642471 656386 684436 721784 753048 792084 837877 907775 1008178 1113803 1201087 1247721
10699 1247721 1237696 1168904 1067651 963115 863834 774851 708103 658909 629468 612194 609414
10688 609414 599905 586316 574889 568325 564397 553059 547208 547443 542885 543867 536633 529724 525897 524636
10674 524636 523711 517409 514311 516290 517811 522309 520519 521625 520593 523525 523516 520847 528536 526544 522256
10659 522256 526965 535471 534206 538014 541189 543170 540215 545997 546327 546571 540387 540025 546992 542529 538348
10644E38348n866j2745p502k386J007N17o386n03N580K320m160p798k21J4290
10630E14495O507j103j398p761n716K819N499N950m12K380J431n000j119J589
10616E18161k101j010m235k653r004j9406q277j143n43l38k791m531K120R05k748
10601D62406K788o587k46Q004K494j1338j1036N223q27o683k674l408k705N02
10587D35913M181m53j120j57n664j051j104J708O268N117m208k014l142K891O612
10572D43777L038k305m395p482L250M886j977L558J790O85l398M431N625L500
10558D54983J0311J5369J9202J6273Q474O250K518m961p652j0839j7002p732n215
10545D79979r299j0233j1961p787L593j364O309N54L604Q250J2354K984q280p329
$$ plain form
10644 538348 532482 519737 512235 509849 510856 511373 504987 504484 510064 512384 508224 500426 500205 514495
10630 514495 521002 519899 518501 510740 505024 507843 513342 519292 518880 521260 522691 517691 516572 518161
10616 518161 516060 515050 510815 508162 499158 479752 471475 470332 469789 469451 466660 462129 464249 465154 462406
10601 462406 465194 458607 458361 466365 468859 457521 446485 451708 450881 444198 441524 438116 435411 435913
10587 435913 440094 439641 438521 438364 432700 431649 430545 432253 438521 443638 439430 437416 434274 437165 443777
10572 443777 446815 444510 440115 432633 435883 440769 438792 442350 444140 444825 441427 445858 451483 454983
10558 454983 465294 480663 499865 516138 524612 530862 533380 528419 520767 509928 492926 485194 479979
10545 479979 470680 460447 448486 440699 444292 442928 449237 449791 453395 461645 473999 476983 468703 461374
10531D61374p652o869j2295q926m224o324P30j463K207J0570l18K665m51m076
10517D24948J535N547J3298K0206K7820M8934M7241J3939k0730j8458J794K4667
10505E90741K0644k4636n1678m5822l1778j7454j3141m046l203k52J178J120L454
10492D25127k060n438K700P722J163M267N570m470j1672p605p022m720m781K159
10478D00940l324p519J846L462J952k417m662r596m731J233P863j698j407O75
10464C82617J390j2188j1663j1342m253o516q777l081n041l229J0928K2224J8297
10451C69366J4527Q995O409K570j3q03j633K419K354m16k477j031P21m695K388
10436C98681P681M055j737N261P852J3908J2541O061J1694J4849J3124R862R480
$$ plain form
10531 461374 453722 446853 434558 425632 421408 415084 415814 414351 416558 427128 426810 429475 429024 424948
10517 424948 426483 432030 445328 465534 493354 542288 589529 603468 582738 564280 566074 590741
10505 590741 611385 586749 535071 489249 457471 440017 426876 422830 419627 419375 420553 421673 425127
10492 425127 423067 417629 420329 428051 429214 433481 439051 434581 422909 415304 408282 403562 398781 400940
10478 400940 397616 390097 391943 395405 397357 394940 390278 380682 375951 377184 385047 383349 381942 382617
10464 382617 384007 371819 360156 348814 344561 338045 329268 326187 321146 317917 328845 351069 369366
10451 369366 383893 392888 399297 401867 401854 401051 399418 401837 404191 403775 401298 400267 400988 396293 398681
10436 398681 406362 410417 408680 413941 421793 435701 448242 454303 465997 480846 493970 503832 513312
10423E13312J18K882m707j5943j0733j0375j2141r806l972J345L967L824J220
10410D58991L155n2N974m388r77K080K558N355P162N374Q913K9534M6074N5377
10396F25130L2837j489k6343k0359J1681L7761K8555J208k2355l4042k3679L05
10384F09210M831J6672K5479N0835R0609J29594J45173J25675N6027k9557j01596
10373A122952j36970j19654r3269n6596m4516l2393j3113j0930j0635j3600m011
10362E87265r213j2523n652j0715M734J0850N934N434P803K0639J5747M785Q606
10349F33694J0325J2780J7207J4514J9758K9466K7999K7021K5763K0632K5127
10338H64286K3299K1896K8205K6543J5335K7796L5952M1911M7111N0819O5600
$$ plain form
10423 513312 513430 516312 511605 495662 484929 474554 462413 452607 448635 449980 453947 457771 458991
10410 458991 462146 462094 468068 463680 462703 464783 467341 472696 479858 485232 494145 523679 569753 625130
10396 625130 657967 656478 630135 609776 621457 659218 687773 688981 666626 632584 608905 609210
10384 609210 614041 630713 656192 707027 797636 927230 1072403 1198078 1254105 1224548 1122952
10373 1122952 985982 866328 773059 716463 671947 639554 626441 615511 604876 591276 587265
10362 587265 578052 565529 559877 549162 553896 564746 570680 576114 583917 604556 620303 625088 633694
10349 633694 644019 656799 674006 688520 708278 737744 765743 792764 818527 839159 864286
10338 864286 887585 909481 937686 964229 979564 1007360 1043312 1085223 1132334 1183153 1248753
10327A248753Q1293R7996J20475J55824J93667K26645K53245K68360K57468K23952
10317C127678J88633K07812K76022L79448M96701O40546Q00919R98411J301694
10308H417864J794926K567143L815180N885805R171455J3745013J8564254K1888789
10300H5850429K2229148J7456366O996256o094492j6389278k0701314k0668075
10293F8679040j7810084j3440215r335034o334670m342118l052384k216116j650775
10285A0497644j283753j050560q94904p48963o05873m87788l93051l16793k76626
10276D439333k92382l01856k87647k71432k29147j94328j63487j46768j26432
10267B425854j11323r1631q6553q0979p0685p2969o3925o4314m6325l2909l2524
$$ plain form
10327 1248753 1330046 1428042 1548517 1704341 1898008 2124653 2377898 2646258 2903726 3127678
10317 3127678 3316311 3524123 3800145 4179593 4676294 5316840 6117759 7116170 8417864
10308 8417864 10212790 12779933 16595113 22480918 31652373 45397386 63961640 85850429
10300 85850429 108079577 125535943 132532199 126437707 110048429 89347115 68679040
10293 68679040 50868956 37428741 28093707 21759037 17416919 14364535 12148419 10497644
10285 10497644 9213891 8163331 7268427 6519464 5913591 5425803 5032752 4715959 4439333
10276 4439333 4146951 3845095 3557448 3286016 3056869 2862541 2699054 2552286 2425854
10267 2425854 2314531 2222900 2136347 2055368 1984683 1911714 1847789 1783475 1737150 1704241 1671717
10256A671717l1137k7082j9272j5958j7604q088j9967k1517j8911k9637l6742
10245A425802l1260l5490l9162l2648l6194l1507l4949l4422l3633k8356k2796
10234A065385l0090l1654k1488k8148k1297j9365k4850j6311j6938j1816j2890
10223H30538l884J578j308j799J1418P798p381j9222j9774j7384m463O635K505
10210G85257o746j7807j4574k0582k8335k8482j6228j3234o337j1412o849l433
10198F11238l714J1012L138j501K089N72L029m67M409L584J701j505J316O906
10184F41807J2660J7290J9222K1550L0292L6675M8658N4686L7732K1043L070l860
10172I40825k820j7256l1530m1566k9259l1191m7524m7850l9644l4598j8640r754
$$ plain form
10256 1671717 1640580 1613498 1594226 1578268 1560664 1552576 1532609 1511092 1492181 1462544 1425802
10245 1425802 1394542 1359052 1319890 1287242 1251048 1219541 1184592 1150170 1116537 1088181 1065385
10234 1065385 1035295 1003641 982153 954005 932708 913343 888493 872182 855244 843428 830538
10223 830538 826654 828232 826924 825125 836543 844341 836960 817738 797964 780580 776117 782752 785257
10210 785257 778511 760704 746130 725548 697213 668731 652503 639269 632932 621520 614671 611238
10198 611238 607524 618536 621674 620173 622262 622834 625863 625396 629805 633389 635090 633585 634901 641807
10184 641807 654467 671757 690979 712529 742821 779496 828154 882840 920572 941615 944685 940825
10172 940825 938005 920749 889219 847653 818394 787203 739679 691829 652185 617587 598947 589193
10160E89193j2866j4841r695p323j1899p570j5874j4983m642l74N750L28L219
10147D98423Q637J4735R344k388L564J1388L784o619n095j0353l851n840p383
10134E08346l425p826j0655r808j4106j1291o341k804j725p74K062Q75m503o074
10120D31951l91P291R53k517q734m921q83l272p683j1185n213O07m15j040m635
10105C89913J598J779p125o459J619L062J58N058P602L183M121N58k207m353R68
10090C99475k881q278J260L856O445j120o783l637O877M503M798J737J299r092
10076C98459j4146L816o73p682m400M81O372L925N677j934p074l231o17k16P925
10061C86682M93n532k628m394p512N264R727J6309R563O186m839p525r672o597
$$ plain form
10160 589193 576327 561486 551791 544468 532569 524999 509125 494142 489500 489126 494876 495204 498423
10147 498423 507060 521795 531139 528751 532315 543703 547487 540868 535773 525420 521569 515729 508346
10134 508346 504921 497095 486440 476632 462526 451235 444894 442090 440365 439591 441653 442528 438025 431951
10120 431951 431560 438851 439804 437287 428553 423632 422749 419477 411794 400609 395396 396003 395588 394548 389913
10105 389913 391511 393290 386165 379706 381325 384387 384545 389603 397205 400388 404509 405067 402860 398507 399475
10090 399475 396594 388316 389576 393432 399877 398757 391974 388337 395214 399717 404515 406252 407551 398459
10076 398459 384313 388129 387456 379774 375374 375855 382227 386152 391829 389895 382821 379590 378973 378757 386682
10061 386682 387175 381643 379015 374621 367109 372373 382100 398409 407972 414158 409319 401794 392122 385525
10047C85525l711J814m617J585o109o983q255m049k173k187L211j028K76N5Q07
10032C54161k065o317n408J183n861K007k788m065L520P253RL35L397J573J8053
10017C64987K7235K2130J3433l390j6823j9166j1160p141p019j566o93n663o974
10004C48190j957K981o4l043K423K665M347k816K687L554j555k252Q22M594J6041
9989C76617J5104J3540R100o733j3385q461p140k654P578m338L01R791l662R63
9975C86621J0573q0K68m147k61k383J269N122k919o150l448J104L203k992m044
9960C81736N625L392M555n50O986l373j423k709J37p246l300P515P179L376k756
9945C99144k319j355r04l001P9O127R72o38m88p089o361J016l844o016j150K193
$$ plain form
10047 385525 381814 383628 379011 380596 374487 367504 359249 355200 353027 350840 354051 353023 353299 353354 354161
10032 354161 352096 345779 340371 341554 335693 337700 334912 330847 334367 341620 341629 341964 345361 346934 364987
10017 364987 392222 414352 427785 424395 407572 388406 377246 370105 363086 361520 360827 355164 348190
10004 348190 346233 349214 349150 346107 348530 351195 355542 352726 355413 358967 357412 355160 355982 360576 376617
9989 376617 391721 405261 414361 407628 394243 385782 378642 375988 383566 379228 379529 389320 385658 386621
9975 386621 397194 397114 397382 393235 392974 390591 391860 396982 394063 387913 384465 385569 388772 385780 381736
9960 381736 387361 390753 395308 394758 401744 398371 396948 394239 394376 387130 383830 391345 398524 401900 399144
9945 399144 396825 395470 394566 391565 391644 397771 398743 398105 397617 390528 384167 385183 381339 375323 374173 376366
9929C76366M673K935M129L390M280l444k008P09k212j040O223O909M131M571K318
9914D11930m545J510M367k251L457J1320N353O225J3824R655O951J3445J5903
9901D97144R856K2341K7914L8366N7523Q0816J11651J22886J27454J09612O2420
9890A267983K661n2325q2652q7538p2456n2571l3488j4343j160J8577K3503L6242
9878I52433M3910N9047O5726Q6321J02301J26878J56082J84904K09340K42977
9868B229919K96500L65004L77765K59976M5738r6177q9817j2691O5476J17856
9858C559549J34889J58606J69992J76305J85989K32672K88712L20521L38967L19650
9848E885852K83330K45964K00931J56147J22464J03848R1760J03250J26885J29107
$$ plain form
9929 376366 381039 383974 388103 391493 395773 392329 390321 391030 388818 387778 394001 400910 405041 409612 411930
9914 411930 407385 408895 413262 411011 414468 425788 431141 437366 451190 460845 467796 481241 497144
9901 497144 507000 529341 557255 595621 653144 733960 845611 968497 1095951 1205563 1267983
9890 1267983 1270644 1218319 1135667 1048129 975673 923102 889614 875271 874111 892688 916191 952433
9878 952433 996343 1055390 1121116 1207437 1309738 1436616 1592698 1777602 1986942 2229919
9868 2229919 2526419 2891423 3269188 3529164 3574902 3478725 3388908 3376217 3441693 3559549
9858 3559549 3694438 3853044 4023036 4199341 4385330 4618002 4906714 5227235 5566202 5885852
9848 5885852 6169182 6415146 6616077 6772224 6894688 6998536 7090296 7193546 7320431 7449538
9838G449538R6275M6635k820m6348m3512k3876o180j20K949K1038M5483O8743
9826G607805P8676P6160N8547M8603L3922K1124K8615M2121R6865K42050N58160
9815H892648J224634K373059L524124L487358J409842j708714l755012l777003
9807A1670936k668212j633058j036778p26802n39709m14158l23118k40282j81528
9798C907291j22209p5424n8667m6770n0698p3696o9077l8770Q158O1913J06444
9787C548495J26266J23032R9288N9682M1465L2058N3784R1417J27877J83217K34348
9776D720929K62229K78159K78739K65270K57172K69014K96294L46630L73694L62537
9766G710667L25854K83434K50905K47087K53171K52937K23293J82016J42079J04717
$$ plain form
9838 7449538 7545813 7592448 7589628 7543280 7499768 7475892 7469712 7469592 7472541 7493579 7539062 7607805
9826 7607805 7686481 7762641 7821188 7869791 7903713 7924837 7953452 7995573 8092438 8334488 8892648
9815 8892648 10117282 12490341 16014465 19501823 20911665 19202951 15447939 11670936
9807 11670936 9002724 7369666 6332888 5606086 5066377 4652219 4329101 4088819 3907291
9798 3907291 3785082 3709658 3650991 3604221 3553523 3479827 3410750 3371980 3380138 3442051 3548495
9787 3548495 3674761 3797793 3897081 3956763 3998228 4030286 4084070 4175487 4303364 4486581 4720929
9776 4720929 4983158 5261317 5540056 5805326 6062498 6331512 6627806 6974436 7348130 7710667
9766 7710667 8036521 8319955 8570860 8817947 9071118 9324055 9547348 9729364 9871443 9976160
9756I976160O6806K0665m0841q5927r1846q4271n6231l6358k0371j023K4312N1634
9744I722709O0467K4735k6881q4590j32361j49044j19501q5037p8184r3241j54073
9733H884999k12240k73644l32911l78595m16288m30447m13330l71631l21608k90824
9723E443481k76524k69332k64048k44284k32380j98826j72468j60418j47159j55233
9713C322809j69664j74056j91946k05723k11874k13728j98616j84087j72890j43054
9703A457171j15526j05695r1296p9525o1925n9834m3033l0314l0208l2580k9877
9692G77358l1042k2861k2646k4317k7171j8848j8990k1849j3402j0186j5640j7328
9680E33078j4164j0871l393o396j4627q518k434r241j2407k130m246j303L871
$$ plain form
9756 9976160 10042966 10063631 10022790 9936863 9845017 9760746 9704515 9668157 9647786 9646763 9671075 9722709
9744 9722709 9783176 9807911 9781030 9696440 9564079 9415035 9295534 9210497 9132313 9039072 8884999
9733 8884999 8672759 8399115 8066204 7687609 7271321 6840874 6427544 6055913 5734305 5443481
9723 5443481 5166957 4897625 4633577 4389293 4156913 3958087 3785619 3625201 3478042 3322809
9713 3322809 3153145 2979089 2787143 2581420 2369546 2155818 1957202 1773115 1600225 1457171
9703 1457171 1341645 1235950 1144654 1065129 1003204 943370 900337 870023 839815 807235 777358
9692 777358 746316 723455 700809 676492 649321 630473 611483 589634 576232 566046 550406 533078
9680 533078 518914 508043 504650 498254 483627 475109 472675 463434 451027 448897 444651 443348 447219
9667D47219l596r943j4019r735q086l941m442j2730n571l758KL16k844O113j2076
9652C62909l904l63m675l602o519j5864k911K130n075l866L174P658j983l696
9638C23413N37J580j560l090j761l02K832N200N013J2180P334j745L59k208j1494
9623C36288J957J0791J5799K853P82j5586k0789p255r522o244l447k495l944J300
9609C00488j49j131K303p390J229J716Q046J9734K7003L4666N3919P9023J03884
9596F23341J14545Q7710M0431J4288j3580m4247p4592r3454q6453o4588l8958
9585D64443k3284j5214j6785j8218j3705n327p945n542k780q28J254R193K6267
9572C91529J3038J4514J2522J4359J0695J8632K5836M0547O1582Q7596J24608
$$ plain form
9667 447219 443623 433680 419661 409926 401840 397899 393457 380727 375156 371398 371400 371716 368872 374985 362909
9652 362909 359005 358642 353967 350365 343846 327982 325071 327201 322126 318260 321434 329092 327109 323413
9638 323413 323950 325530 323970 320880 319119 318817 321649 326849 331862 344042 351376 349631 349990 347782 336288
9623 336288 338245 349036 364835 367688 368470 352884 332095 324840 315318 309074 305627 303132 299188 300488
9609 300488 300339 299208 301511 294121 295350 297066 305112 324846 351849 386515 440434 519457 623341
9596 623341 737886 825596 866027 880315 866735 822488 747896 654442 567989 503401 464443
9585 464443 441159 425945 409160 390942 377237 371910 363965 358423 355643 354815 356069 365262 391529
9572 391529 404567 419081 431603 445962 456657 475289 501125 541672 603254 690850 815458
9561H15458J15825O2315K874j7199k979L6804P0303J12502K07482M16213O78390
9550B497988P11420L66225j36207l90791l28426k45793k46848k94126k77958k19201
9540A436283j49113o8860J7670J25203K46955L20304L18686K89140L04719L45875
9530C186862K87300J07882o8131j47539j29392j04633j26074j43095j22538p1446
9520B669196k6678l3361q0654j32646j14224O244J84285L75802N79055Q72342
9510D299361J325299J856673J890991R40551n94828j696919j774914j345823r11775
9501C988616o21669m27343k54716o6489P1052J16217Q1262j0662o4452p741J06205
9490B910280J68451J63786J47205J52421J66268R1355n2024k00073k82732l17064
$$ plain form
9561 815458 931283 993598 996472 979273 976294 1013098 1083401 1195903 1403385 1819598 2497988
9550 2497988 3209408 3575633 3439426 3048635 2720209 2474416 2227568 1933442 1655484 1436283
9540 1436283 1287170 1218310 1235980 1361183 1608138 1928442 2247128 2536268 2840987 3186862
9530 3186862 3474162 3582044 3513913 3366374 3236982 3132349 3006275 2863180 2740642 2669196
9520 2669196 2642518 2609157 2528503 2395857 2281633 2287877 2472162 2847964 3427019 4299361
9510 4299361 5624660 7481333 9372324 10312875 9718047 8021128 6246214 4900391 3988616
9501 3988616 3366947 2939604 2684888 2618399 2689451 2805668 2886930 2876268 2811816 2804075 2910280
9490 2910280 3078731 3242517 3389722 3542143 3708411 3799766 3747742 3547669 3264937 2947873
9480B947873l55208l91671l44861k44047j46141n0735L2513J09609J88222K47721
9470A993275K54691K42729K60794L58716M28739K03966k69846o41755o26954m03338
9460A801017k37275j44537q9779l9834O022P39k9254p8723j19173j24351j11254
9449H33598q0400n9584n4582l7285j7016r174j093j6707j4922p641j0053p348
9437E17793n55N962J7559K5118L1330L2149K2421K0307J5827J0362J4676J9923
9425G32872L4763L5772J3978j138q618j8830k8921l5127l7496l8246k0689n446
9413F22874Q359Q141O279R441J6785K3946K8054J7051J4562K3109K7905L4839
9401H41345N1303N8134L9471K8775J7371J8179J2163J119k197l252o846n660j0472
$$ plain form
9480 2947873 2592665 2200994 1856133 1612086 1465945 1415210 1447723 1557332 1745554 1993275
9470 1993275 2247966 2490695 2751489 3110205 3538944 3742910 3473064 2831309 2204355 1801017
9460 1801017 1563742 1419205 1329426 1289592 1295614 1296353 1267099 1188376 1069203 944852 833598
9449 833598 753198 693614 639032 601747 584731 575557 574464 557757 542835 535194 525141 517793
9437 517793 517238 523200 540759 565877 597207 629356 651777 672084 687911 698273 712949 732872
9425 732872 767635 803407 817385 816247 807629 788799 759878 724751 687255 649009 628320 622874
9413 622874 631233 639374 645653 655094 671879 695825 723879 740930 755492 778601 806506 841345
9401 841345 892648 950782 990253 1019028 1036399 1054578 1066741 1067860 1065663 1062411 1055565 1049905 1039433
9388A039433j6542j7447k0599p889j4284l2356m4628l3586k8334l1833l7231k9775
9376G24929k7683k2083j7991j2615l679q034p427r747Q26R13p234j1718m610N58
9362E94405R861J7949J9827K6581L0084L6847L6963L4544M1752N3691N7334N6415
9350A016253P0667Q0282Q9865J19017J53084J88313K26897K69969L30996L79280
9340B924623M14412M11695L52579K23603N7971q9750k04291k67594k97725k97315
9330C228208k73265k45263k09937j68963j29418r9695o8684l9481q735J7044L9925
9319B041736Q1225J24517J62306K06158K62450L22799L80880M11737L85299K78626
9309D657733J08013p5061k30194l26209l47183l22110k82379k46422k13612j86049
$$ plain form
9388 1039433 1022891 1005444 984845 976956 962672 930316 885688 852102 823768 791935 754704 724929
9376 724929 697246 675163 657172 644557 640878 632844 625417 615670 616496 617409 610175 598457 593847 594405
9362 594405 604266 622215 642042 668623 698707 735554 772517 807061 848813 902504 959838 1016253
9350 1016253 1086920 1167202 1257067 1376084 1529168 1717481 1944378 2214347 2545343 2924623
9340 2924623 3339035 3750730 4103309 4326912 4384883 4295133 4090842 3823248 3525523 3228208
9330 3228208 2954943 2709680 2499743 2330780 2201362 2101667 2032983 1993502 1984767 2001811 2041736
9319 2041736 2122961 2247478 2409784 2615942 2878392 3201191 3582071 3993808 4379107 4657733
9309 4657733 4765746 4690685 4460491 4134282 3787099 3464989 3182610 2936188 2722576 2536527
9299B536527j68272j45992j15836p9976n3227j3408K2564O5502R9460J15988J11294
9288B374624J07032P9825N1873R893l2546o8835r1277j00745r2725p0977m2496
9277B123646K561L0212O3667J06723J55466K05848K67539L36393M16238N14346
9267D222639O02778O85991P50970P70500P45818O53932M81664K56514K5255j60564
9257I035497k39407k39042j94974j64510j96137k94405m09582m88365n09933m62774
9247E836368l77840k71240j63781o6274M6599J49046K53507L73007M98546O12408
9237F890346P05690P42987O78904N30634L18358Q4949j23878k75464l59364l93833
9227H799329m04842m36220m88527n55986o08104o11355n82512n31237m69584m13725
$$ plain form
9299 2536527 2368255 2222263 2106427 2026451 1973224 1959816 1982380 2047882 2147342 2263330 2374624
9288 2374624 2481656 2561481 2613354 2623247 2590701 2521866 2430589 2329844 2237119 2166142 2123646
9277 2123646 2126207 2156419 2220086 2326809 2482275 2688123 2955662 3292055 3708293 4222639
9267 4222639 4825417 5511408 6262378 7032878 7778696 8432628 8914292 9170806 9196061 9035497
9257 9035497 8796090 8557048 8362074 8197564 8001427 7707022 7297440 6809075 6299142 5836368
9247 5836368 5458528 5187288 5023507 4957233 5003832 5152878 5406385 5779392 6277938 6890346
9237 6890346 7596036 8339023 9017927 9548561 9866919 9951868 9827990 9552526 9193162 8799329
9227 8799329 8394487 7958267 7469740 6913754 6305650 5694295 5111783 4580546 4110962 3697237
9217C697237l55096k92590k42747k04881j69481j30233j05605j05690r2776p5641
9207A922497n9811n4458n2570l5603k2530j6862j046K1869N9539R8553J32920
9196A992498J72183K07411K30488K54587K87389L30808L93067M51486M90223N01727
9186E311867M68421L86083K88503K40995K40078K84867L17595K98898K09038M1480
9176H087825j44543l42510m94312n75187n76454n20995m37221l51338k66320j72398
9166D206547p4348K3471J13478K11678L15308M08899M81330M88101M23012K90008
9156F887484J54646O3863M0103P6517J19264R5403L079j55418l28959m57744n40982
9145E957256n59566n55257n33735m84402m32078l80324l31842k83308k36290k05536
$$ plain form
9217 3697237 3342141 3049551 2806804 2601923 2432442 2302209 2196604 2090914 1998138 1922497
9207 1922497 1862686 1808228 1755658 1720055 1697525 1680663 1679617 1701486 1761025 1859578 1992498
9196 1992498 2164681 2372092 2602580 2857167 3144556 3475364 3868431 4319917 4810140 5311867
9186 5311867 5780288 6166371 6454874 6695869 6935947 7220814 7538409 7837307 8046345 8087825
9176 8087825 7943282 7600772 7106460 6531273 5954819 5433824 4996603 4645265 4378945 4206547
9166 4206547 4132199 4155670 4269148 4480826 4796134 5205033 5686363 6174464 6597476 6887484
9156 6887484 7042130 7105993 7146096 7222613 7341877 7437280 7440359 7284941 6955982 6498238 5957256
9145 5957256 5397690 4842433 4308698 3824296 3392218 3011894 2680052 2396744 2160454 1954918
9135A954918j76872j48831j18195r2246p9058p4236p3593n5684m9038m5756l4803
9124A006606j9783j1984j5759j5508j4175n865P952J4921K4445L4166N1884O8365
9112A125265Q1308J02357J20679J35025J49029J68030J87564K16092K53674K63082
9102B802105K32981J40590m89j39772k38908k81414k76633k42909k13023j77742
9092A604786j37535j03670p2672m0144j2722Q234K5890M5277O4169Q2238R8087
9081A561938J21444J48221J79390K06888K18549K18573J80300R5376n449j14255
9071B810975k12877k76693k88519k65031k35051k05510j72344j51720j21976r7102
9061G84152p4739o0575n5609n5280m6743m1708l1505l2398l1518l8317l8148l4829
$$ plain form
9135 1954918 1778046 1629215 1511020 1418774 1339716 1265480 1191887 1136203 1087165 1041409 1006606
9124 1006606 986823 974839 959080 943572 929397 923532 931484 946405 970850 1005016 1056900 1125265
9112 1125265 1206573 1308930 1429609 1564634 1713663 1881693 2069257 2285349 2539023 2802105
9102 2802105 3035086 3175676 3175187 3035415 2796507 2515093 2238460 1995551 1782528 1604786
9092 1604786 1467251 1363581 1290909 1250765 1238043 1246277 1272167 1317444 1381613 1463851 1561938
9081 1561938 1683382 1831603 2010993 2217881 2436430 2655003 2835303 2930679 2925230 2810975
9071 2810975 2598098 2321405 2032886 1767855 1532804 1327294 1154950 1003230 881254 784152
9061 784152 709413 648838 593229 537949 491206 449498 417993 385595 354077 315760 277612 242783
9049B42783l7171m0704m3911m1644k4608M709M9175O4540M8322L8806K0004R108
9037B89409J931l92l985j761j1610k0645k0494j6447j0371m641p83O916R423Q878
9023B25428J1842J4109J0167J9033K3299L0071L5936L9146M4246M7433K7475K2332
9011E50517p358m9423n9865m0637k1793j3049m748r253m471m343p961J400n293
8998C23723j4552j4134l561Q364N649m661N072n374j0475j1632j4550N095K666
8985B71630j1238n452m698Q34J415L529J6400J0828J3486J4237J4833J5205J3764
8972C54773K437J147N267J617M294j1765k4267j9701K425K3496K9974K7165K8059
8959D24921K7665K1463Q663O744k645J227K651O524O734J719k739J344J5684K6954
$$ plain form
9049 242783 205612 164908 120997 79353 54745 59454 108629 173169 221491 260297 280301 289409
9037 289409 291340 290948 286963 285202 273592 252947 232453 216006 205635 200994 200211 207127 216550 225428
9023 225428 237270 251379 261546 280579 303878 333949 369885 409031 453277 500710 528185 550517
9011 550517 543159 493736 433871 393234 371441 358392 353644 344391 339920 335577 327616 329016 323723
8998 323723 309171 295037 291476 299840 305489 300828 305900 300526 290051 278419 263869 268964 271630
8985 271630 260392 254940 250242 251076 252491 256020 272420 283248 296734 310971 325804 341009 354773
8972 354773 357210 358357 363624 365241 369535 357770 333503 313802 316227 339723 369697 396862 424921
8959 424921 452586 474049 482712 489456 486811 488038 490689 497213 503947 505666 502927 504271 519955 546909
8945E46909K7726L1811M5848M5945M6887M9785M3706L8673M6188N9506P5666Q6649
8933A145299R0017Q6659P7605P4334Q9600J03632J03882J01003R6547J00502J09640
8922B178720J24310J48244J79602K05499K17225K47840K81278L42849M26252M99945
8912D851764N47896N86175O37977P08956Q35423J018724J277060J604219J997459
8903A4065653K459865K980191L511637M021122M668736N631825P009116Q991606
8895E3339751J2301710J8249945K8350572M4093808O5459294Q4509931Q0441015
8888C86746026M0402122j9271892o6446481p8881260o5503668m6557250l2164264
8881A18323333k3143589j7246098j2604995q929401o307971m577837l402223k566231
$$ plain form
8945 546909 574635 606446 652294 698239 745126 794911 838617 877290 923478 982984 1058650 1145299
8933 1145299 1235316 1321975 1399580 1473914 1563514 1667146 1771028 1872031 1968578 2069080 2178720
8922 2178720 2303030 2451274 2630876 2836375 3053600 3301440 3582718 3925567 4351819 4851764
8912 4851764 5399660 5985835 6623812 7332768 8168191 9186915 10463975 12068194 14065653
8903 14065653 16525518 19505709 23017346 27038468 31707204 37339029 44348145 53339751
8895 53339751 65641461 83891406 112241978 156335786 221795080 306305011 386746026
8888 386746026 427148148 407876256 341429775 262548515 197044847 150487597 118323333
8881 118323333 95179744 77933646 65328651 56399250 50091279 45513442 42111219 39544988
8873C9544988j973308j688962j851716k382242k880028k883522k481301j980060
8865B1423849j655409j558275j531041j433006j283269j123373r84578q62207
8857A0992691p33727o16833n29853m77020m34368m14722l89006l50184k94818
8848F752160k44545k02714j50998q4318J6608J66140L13890K99584K6070l40354
8838F551523n45948n21581m10323l11865k44127k04803j81232j59635j35936j38397
8828C697676j35421j27473j22428j26385j21597j15753j16582j14688j02492r5244
8818B519613q0334p2836o4154m6726m1094m2916l6521n6147p5371p1816o6419
8807A865279o0177o6591o0654n3046n0490n0095m0797k6749j2931r887j6808j0839
$$ plain form
8873 39544988 37571680 35882718 34031002 31648760 28768732 25885210 23403909 21423849
8865 21423849 19768440 18210165 16679124 15246118 13962849 12839476 11854898 10992691
8857 10992691 10258964 9642131 9112278 8635258 8200890 7786168 7397162 7046978 6752160
8848 6752160 6507615 6304901 6153903 6069585 6086193 6252333 6566223 6865807 6891877 6551523
8838 6551523 6005575 5483994 5073671 4761806 4517679 4312876 4131644 3972009 3836073 3697676
8828 3697676 3562255 3434782 3312354 3185969 3064372 2948619 2832037 2717349 2614857 2519613
8818 2519613 2439279 2366443 2302289 2255563 2214469 2171553 2135032 2078885 2003514 1931698 1865279
8807 1865279 1805102 1738511 1677857 1624811 1574321 1524226 1483429 1456680 1443749 1433862 1417054 1406215
8795A406215r139j8022j0592l33P753K5437K9745O0409J07958J73236L04829N10951
8783B588447P07703P45486N59894K78710J7551k46980n44576p35415p04263n33705
8773B132852l51236k24876j52812j13017p0624n1172n7607m9130l7820l0832n684
8762I88042R82k551j4354l1186l3592l0588l1289k1533j2997j2040r947o290q767
8749G73890q868j3441r454j4415k0849k3526k1501j8428j5794k835k933j767K344
8736F22423K796J9475M5171N6973M7390K4913j462j3329j8919k5260j9963j7350
8724G22858k0552k8937k2280r754j2368j2521r600n198K03j704J12j306o445q398
8710E84110j1230J076L254K505N640J066j3449k4750l6594k4821M371K2547J9425
$$ plain form
8795 1406215 1397076 1379054 1368462 1368129 1375882 1401319 1431064 1491473 1599431 1772667 2077496 2588447
8783 2588447 3296150 4041636 4601530 4880240 4897791 4650811 4106235 3370820 2666557 2132852
8773 2132852 1781616 1556740 1403928 1290911 1220287 1169115 1111508 1062378 1024558 993726 988042
8762 988042 989024 986473 972119 940933 907341 876753 845464 823931 810934 798894 788947 782657 773890
8749 773890 765022 751581 742127 727712 706863 683337 661836 643408 627614 624779 621846 620079 622423
8736 622423 625219 644694 689865 746838 794228 819141 817679 804350 785431 760171 740208 722858
8724 722858 702306 673369 651089 641335 628967 616446 606846 601648 601851 600147 600259 598953 592508 584110
8710 584110 572880 573956 577210 579715 585355 586421 572972 548222 511628 486807 491178 513725 533150
8697E33150P523n251r054j0804q14j93J756J0247J8399K2109K7410K0365M269
8684F19112M863J3219K556j3252j2485p072n074j6569k0380m927M726K3401L2375
8671F20493K7826J2040j5172l7776l4981j8437q681p111r78k652J850P265J1244
8658E54930P796L567j0467r582n927q342j389j032j1392j3423j2770l857j195
8645D86917L452L342N555R543K049J479m356n150k772n120R193J3239O782K023
8631E26176J057P475N362L905K0566J9684J1372J2776J4687K0027K6725M3938
8619G13750P1881J30800K34843M43590P96362J093592Q51659L8242q04082j006243
8609B564394p25197m21701k50983j51370j05904p7400o1734m6754k6211p809p284
$$ plain form
8697 533150 540673 535422 526368 515564 514750 514557 516313 526560 544959 567068 594478 614843 619112
8684 619112 623975 637194 639750 626498 614013 606941 601867 585298 564918 559991 564717 588118 620493
8671 620493 648319 660359 645187 607411 572430 553993 545312 538201 537223 534571 536421 543686 554930
8658 554930 562726 566293 555826 546244 540317 531975 530586 529554 518162 504739 491969 488112 486917
8645 486917 490369 493711 499266 508809 510858 512337 507981 502831 500059 494939 504132 517371 524153 526176
8631 526176 527233 534708 540070 543975 564541 584225 595597 608373 623060 643087 669812 713750
8619 713750 785631 916431 1151274 1594864 2391226 3484818 4336477 4374719 3570637 2564394
8609 2564394 1839197 1417496 1166513 1015143 909239 831839 770105 723351 697140 689331 682047
8598F82047N401J6469J1667N61m855k3058m0452l5418j2792r801k941J2576J8357
8585F17761L5072L5824K4943K4052L4449N1273O9335J03776J44876K17742L36501
8574A695604M38502M20050L35765M68368J108429J944959J853508M32755j414590
8565G283350k079657j589732r58768n58761l43492k30496j63961j29392j08420
8556A120671j01573o9050m5746j5862M109J8471M2985M8652K4946r466r969N2327
8544A060495J35113K56372L69396L93830K71730P1463r5742j89276k44636k34518
8534A794227j64199n7617J06847L42675O04885O00680K10733k64669l18096R1670
8524B947136O41033Q31642L46838n06627j018659r02597n77639l41335k02272
$$ plain form
8598 682047 687448 703917 715584 716145 711290 688232 647780 612362 599570 589769 586828 599404 617761
8585 617761 652833 688657 713600 737652 772101 823374 892709 996485 1141361 1359103 1695604
8574 1695604 2134106 2554156 2889921 3358289 4466718 6411677 8265185 8697940 7283350
8565 7283350 5203693 3613961 2655193 2096432 1752940 1522444 1358483 1229091 1120671
8556 1120671 1019098 950048 904302 888440 892549 911020 954005 1002657 1027603 1018137 1008168 1060495
8544 1060495 1195608 1451980 1821376 2215206 2486936 2558399 2462657 2273381 2028745 1794227
8534 1794227 1630028 1572411 1679258 2021933 2626818 3227498 3438231 3173562 2855466 2947136
8524 2947136 3588169 4419811 4766649 4260022 3241363 2338766 1761127 1419792 1217520
8515A217520j23482q1159n3877l1173j3909o30K3844N1830R2810J36851K23535
8504A442160L37079M32809M27003K99116J95796K24948L77364M61132K95512j43704
8494D349215n64781o55571m84668k70787r9525J8855J12207K08519L10741L43458
8484C267663J82348j13800l59504m10957l50434k83386k43341k06334j62984j26029
8474A193242q8640o9481n9926m4302l2282k8757o219M417M476J7977L6621P1364
8462I98490J20837K03721L53275N66962O80969M83725J7365l76425m02051j93932
8452B452936q682O864j40036k85715l06207k40123j68333j27407r7269o4585n8930
8441I62513m8799n1264m4761l9194l7072l8397l7551l3928l3749k6170j6738j4160
$$ plain form
8515 1217520 1094038 1012879 959002 927829 913920 913290 937134 988964 1081774 1218625 1442160
8504 1442160 1779239 2212048 2639051 2938167 3133963 3358911 3736275 4197407 4492919 4349215
8494 4349215 3784434 3128863 2644195 2373408 2273883 2292738 2404945 2613464 2924205 3267663
8484 3267663 3450011 3336211 2976707 2565750 2215316 1931930 1688589 1482255 1319271 1193242
8474 1193242 1104602 1035121 975195 930893 898611 869854 863635 868052 872528 890505 927126 998490
8462 998490 1119327 1323048 1676323 2243285 2924254 3407979 3425344 3048919 2646868 2452936
8452 2452936 2444254 2451118 2311082 2025367 1719160 1479037 1310704 1183297 1086028 1021443 962513
8441 962513 913714 862450 817689 778495 741423 703026 665475 631547 597798 571628 554890 540730
8429E40730r009j1014k328k134r298k719k33K798J1296K1527L6551N5707P4555
8416G06429J19975J87412K63289K82704J62848n2803k27279k51252j89780j27635
8406H73908q3198m9670l5299k4980j7649j7909k3488r060j7421k1003r991k1754
8394E42486k4773j4691q929j2685j1040j1879n624o165j5671j0363l402J794o732
8381D12326n738r63R0k295j0734p800m40j727J299p767j4683j4023j0842r171
8367C27532k247k720j742o481n689r595j4317n598L067O903M919q052n503L917
8353B84394j002Q097K591l59l289m007j249M485k51o47O195J357M888J546j391
8338C01358p76K654j882r4R632P448L750O395o456O853L841j306p161j3872p768
$$ plain form
8429 540730 531721 520707 518379 516245 506947 504228 503995 506793 518089 539616 576167 631874 706429
8416 706429 826404 1013816 1277105 1559809 1722657 1669854 1442575 1191323 1001543 873908
8406 873908 790710 741040 705741 680761 663112 645203 621715 612655 595234 574231 564240 542486
8394 542486 517713 503022 494093 481408 470368 458489 452865 446700 431029 420666 417264 419058 412326
8381 412326 406588 405625 405715 403420 392686 384886 384446 382719 384018 376251 361568 347545 336703 327532
8367 327532 325285 322565 320823 314342 308653 299058 284741 279143 282210 289113 294032 285980 280477 284394
8353 284394 283392 291489 294080 293721 290432 286425 285176 289661 289410 288763 294958 296315 301203 302749 301358
8338 301358 300582 303236 301354 301260 310892 318340 322090 328485 322029 328882 332723 331417 324256 310384 302616
8323C02616l468k177n558o507L191k228m845M081j218o580L325K6m1L929M617
8308B89163r98K129M980j349m731k091K453L599p155q164r004q700n306j110J496
8293B55212N756K631j0902q337l096n396k377J772k472K66m951l307j824q67n196
8278B16912n190p94L213L510m563m508J848K602j275R2k703o277j022K475J0319
8263B14639l55K618p250l329P490j095Q97m389k931j620k641P787M368n284J032
8248B09937j79P469L389l760m589k507m283l246n662q667J310N37o540j709p336
8233A74164l384K526Q811M11L851o667p625J942K119j842J333n18P0k640L873
8218A76424K896P89k538j5224j1402M158L86O511M328O506l196j571r379m545
$$ plain form
8323 302616 299148 296971 291413 284906 288097 285869 281024 285105 283887 277307 280632 280658 280617 284546 289163
8308 289163 288165 290294 295274 293925 289194 287103 289556 293155 286000 277836 268832 260132 254826 253716 255212
8293 255212 260968 263599 252697 244360 241264 235868 233491 235263 232791 233057 228106 224799 222975 222108 216912
8278 216912 211722 210928 214141 217651 213088 208580 210428 213030 211755 211847 209144 202867 201845 204320 214639
8263 214639 214284 216902 209652 206323 213813 212718 213615 209226 206295 204675 202034 209821 214189 208905 209937
8248 209937 209758 217227 220616 216856 212267 209760 205477 202231 196569 187902 189212 189749 183209 181500 174164
8233 174164 170780 173306 182117 182528 186379 179712 172087 174029 176148 174306 175639 175121 175191 172551 176424
8218 176424 179320 180109 177571 162347 150945 155103 155489 162000 166328 172834 169638 168067 158688 154143
8204A54143k058L87k03M601J553n126m158l953n093q5j0454K17N311J466R15j055
8188A36408l306n219l71Q214J546j907k842J768J2345K109m816L339j716l811
8174A41741l04J007L90j809j795m948l74J166Q052Q842N032R456q007j6799j2487
8159A29163k795k398n503j486p010K063L825R551P090m013m313R66k87l233j164
8144A20456l969N292N311l079l181O813P631l456q474m777l394m839L311J842
8130A15487N642Q807M989l874r847o645j1657p695k645N863J3263Q165L756n123
8116A18486K564L93n936Q72J780q003K52J289j359L785K273N353L996m038L936
8101A25643J53K980J3608P462n853m993m388k293m640k627l752k326L924q536
$$ plain form
8204 154143 152085 152472 152269 156870 158423 153297 149139 145186 140093 140008 129554 129771 135082 136548 137463 136408
8188 136408 133102 127883 127512 135726 137272 135365 132523 134291 146636 148745 143929 147268 145552 141741
8174 141741 141437 142444 142834 141025 139230 134282 133908 135074 143126 151968 157000 166456 158449 141650 129163
8159 129163 126368 123970 118467 116981 109971 112034 115859 125410 132500 128487 124174 125140 124853 121620 120456
8144 120456 116487 121779 127090 124011 120830 127643 135274 131818 123344 118567 115173 110334 113645 115487
8130 115487 121129 129936 134925 131051 121204 114559 102902 95207 92562 98425 111688 119853 123609 118486
8116 118486 121050 121443 115507 116379 118159 110156 110408 111697 110338 114123 116396 121749 125745 121707 125643
8101 125643 125796 128776 142384 149846 143993 139000 134612 132319 127679 125052 121300 118974 122898 114362
8087A14362o093O87j043n216J356L954n54l378J593l592p763K075Q093J0541o61
8072A14361o537o69Q124J202m143k185J49j794q662O002k581n665L581M376N750
8057A11309P086J8837K2568J7445J0298l059j0888j4919j5221r432L26j1695n345
8044A17310n533R72O50L649l611q948j108P423O289L75k870m282n772M41K373
8029A07358L34j152P7J379J229R68J792M772K996M2J395J373k26M898R79j718
8013A26496Q414R007P552J5755N483l741j476j414k235r749m290k652q812p970
7999A30368J969K868K962O937J003l441j4031j339L255m548j719J267N28L553
7985A29632J062j177l239j663l537j041o915j467n742L271N614J1001J388m920
$$ plain form
8087 114362 108269 108956 107913 102697 104053 108007 107453 104075 105668 102076 94313 96388 104481 115022 114361
8072 114361 107824 107155 115279 116481 112338 110153 110302 108508 99846 105848 103267 97602 101183 105559 111309
8057 111309 118395 137232 159800 177245 187543 184484 173596 158677 143456 134024 134350 122655 117310
8044 117310 111777 112749 113399 117048 113437 104489 103381 110804 117093 117468 114598 110316 104544 104985 107358
8029 107358 107692 106540 106617 107996 109225 110193 111985 116757 119753 119795 121190 122563 122337 127235 128214 126496
8013 126496 134910 143917 151469 167224 172707 168966 167490 166076 163841 154092 149802 147150 138338 130368
7999 130368 132337 135205 138167 145104 146107 142666 128635 127296 130551 126003 124284 125551 126079 129632
7985 129632 130694 129517 126278 124615 121078 120037 113122 111655 105913 109184 114798 125799 127187 122267
7971A22267M975J0924P635K018K848R351J2888n375j2298n273o567m200p608k791
7957A28794l378o79r25k51n686o876k328l78j835o779j344J914K921M409K887
7942A10466M608k021M236O932N838L341Q246J928M21m825j354Q880K623j799N570
7927A53090J983j875o393p697M712j479j928O309L129l441o298o425J054L459
7913A38200r24p874j1160r658r53P599Q490j689J785K135l114l905j545l145q97
7898A13345O946k229l696K958P363j749J894O077L018j421L354P015j639k303
7884A38933j782K927J566j817k753l122l244n373l694J070N37j426N60j308N62
7869A21636m927n360K048m036L198J862l579n058m807N511M407k623k084l662
$$ plain form
7971 122267 127242 138166 145801 147819 150667 160018 172906 167531 155233 149960 143393 139193 131585 128794
7957 128794 125416 124737 123812 123561 117875 110999 108671 108293 106458 99679 98335 100249 103170 107579 110466
7942 110466 115074 113053 117289 124221 130059 133400 141646 143574 143995 139170 137816 146696 149319 147520 153090
7927 153090 155073 153198 146805 139108 143820 142341 140413 146722 149851 146410 140112 133687 134741 138200
7913 138200 137276 129402 118242 108584 107631 115230 123720 122031 123816 125951 122837 118932 117387 114242 113345
7898 113345 120291 118062 114366 117324 124687 122938 124832 130909 133927 132506 135860 142875 141236 138933
7884 138933 137151 140078 141644 139827 137074 133952 130708 125335 121641 122711 123248 121822 122382 121074 121636
7869 121636 116709 111349 113397 109361 112559 114421 110842 105784 100977 106488 110895 108272 106188 102526
7855A02526R43K391l184j280p356m003M011K215J448o252K122M225j786o905q841
7840H0274l882n689J284Q006L619j427k278K1n218j231O052L161p92J882l928
7825G9854p062j135P861M325l627p362m38L954m160l611l865N149j0k579L556
7810G0850Q759n256n98m613j24m826l528K57j146R40m114n210J498J176P58M007
7794E8830N00j375k063m384R30M261j57j166n205k421P96N74j809r0k718j642
7778D2861j991j0154M24N440R308O878K131k842j133O715R576o787j0188M3p62
7763D9519j973M765k823L311M30j194J152p069p464k13N315L609Q055P454o510
7748E6364K735o921o248j885l277J309m270o013N682M803N215p51l076O442K430
$$ plain form
7855 102526 103469 105860 102676 101396 94040 90037 94048 96263 97711 91459 93581 97806 96020 89115 80274
7840 80274 76392 70703 71987 79993 83612 82185 79907 79928 74710 73479 79531 82692 81900 83782 79854
7825 79854 72792 71657 79518 83843 80216 72854 72416 76370 72210 68599 64734 69883 69873 67294 70850
7810 70850 79609 74353 73755 69142 69018 64192 60664 60921 59775 60715 56601 51391 52889 54065 54823 58830
7794 58830 59330 57955 55892 51508 52438 56699 56542 55376 50171 47750 48546 49120 47311 47221 44503 42861
7778 42861 40870 30716 31140 36580 45888 52766 54897 52055 50922 57637 67213 60426 50238 50281 49519
7763 49519 47546 52311 49488 52799 53229 52035 53187 46118 38654 38441 43756 47365 55420 62874 56364
7748 56364 59099 52178 45930 44045 40768 42077 37807 31794 37476 42279 47494 46743 43667 50109 52539
7733E2539l574k024K718M336K859J996n947k196M31m558n528l437k618o4r20L461
7717C7474M38n340J13N873M030j243L50m996K407j014o278N202N282O304J602
7702E0204r80k064p255q690P775J0744L971Q14j427L366L243n636k598J968p388
7687D6047n431N46P281l838j304L066k866m037P015K829m574l627L20J056M594
7672D7077o544L274K230j4927p611Q145P534m641l698K572J051L850j160k301
7658C4851K957j336J871l069K107N420L19l599J694L415j693l139l27n013l341
7643C1117J335K113M55K683k385N29o96O873j10n697k443l26k160l238L638l190
7627B8498J824L040M162k525O84q86L355N338j532m164J98M360n59n326j632j048
$$ plain form
7733 52539 48965 46941 49659 53995 56854 58850 52903 50707 51138 46580 41052 37615 34997 34933 34013 37474
7717 37474 37912 32572 32685 38558 42588 41345 41695 36699 39106 38092 31814 37016 42298 48602 50204
7702 50204 49224 47160 39905 31215 38990 49734 53705 54519 53092 56458 59701 54065 51467 53435 46047
7687 46047 40616 41162 48443 44605 43301 46367 43501 39464 46479 49308 44734 41107 41427 42483 47077
7672 47077 40533 43807 46037 31110 23499 31644 39178 34537 30839 33411 34462 38312 37152 34851
7658 34851 37808 36472 38343 35274 37381 42801 43120 39521 41215 44630 42937 39798 39471 34458 31117
7643 31117 32452 34565 35020 37703 35318 35847 35151 42024 41914 36217 33774 33448 31288 28050 31688 28498
7627 28498 30322 33362 37524 34999 35683 34797 38152 43490 41958 37794 37992 42352 41793 36467 34835 33787
7611C3787O548P193K352k360l82k286n901k618K464Q42L551p302l928K777n33
7596C4204M564J173J123J783K357l058k860l365m573Q728k005k033L969J505p825
7581C3687N685J073r486n340k75M253K981K550K888k001j854K53p79M480N008
7566D3123P32m992p00j627j607m157M90L377k015K95P495P318j406j296o9K058
7550D7019k711n278k693o528J964L073M049P72j778n007o769P4K954N524N507
7535D0172J193m29l175J127K752j162L842Q42k015o240l201m064j720L326N531
7520C6779N355k474j055L022q752o79P216J466m643L521p57m691j481K264k424
7505C2667L651J547m887p580k144R90Q110J4875J809r180Q51k653o304l489j145
$$ plain form
7611 33787 40335 47528 49880 47520 47138 44852 38951 36333 38797 39639 43190 35888 31960 34737 34204
7596 34204 38768 39941 41064 42847 45204 42146 39286 35921 31348 40076 38071 36038 40007 41512 33687
7581 33687 39372 40445 30959 25619 25344 29597 32578 35128 38016 36015 34161 34414 33635 38115 43123
7566 43123 43855 38863 38163 36536 34929 30772 31262 34639 32624 32919 40414 47732 46326 45030 44961 47019
7550 47019 44308 39030 36337 29809 31773 34846 38895 39667 37889 32882 26113 26187 29141 34665 40172
7535 40172 41365 40936 37761 38888 41640 40478 44320 45162 43147 36907 33706 29642 27922 31248 36779
7520 36779 42134 39660 38605 41627 32875 32196 39412 40878 36235 39756 38999 34308 32827 35091 32667
7505 32667 36318 37865 32978 25398 23254 24244 32354 47229 49038 39858 40709 38056 31752 28263 27118
7490B7118J234j65p302q819N730O127M259k892m26L212J6355J3292K859p62j0046
7475D9774j3032j507P01K890l769p805j997J572m512J410K523P124l314r207p065
7460A3786L053O362j04M573Q90r868M360J4605P324p448m084O91P11j214l24N923
7444C9236L683j842q561l744M458J447o942o027n116k699P542J0231J34m743p246
7429A9811j148j510n382K906J881O065O054k874L144P556M716m413K098j873k533
7414C4498j308k762K834l603m266K291L678N537K461n548o668j556n922k733K296
7399A9229n30K976R043j113n39R388K961k703o225n14lL688k848l620L00L155
7383C2645k810j659L090m72j146J557N888o260l128L77P03n612k998r56M807J328
$$ plain form
7490 27118 28352 28187 20885 12066 17796 23923 28182 25290 24864 28076 44431 57723 60582 59820 49774
7475 49774 36742 35235 35936 38826 35057 27252 25255 26827 22315 23725 26248 33372 30058 20851 13786
7460 13786 16839 23201 23097 27670 28560 18692 23052 37657 44981 37533 33449 34140 34851 33637 33313 39236
7444 39236 42919 41077 32516 28772 33230 34677 27735 21708 16592 13893 21435 31666 31800 27057 19811
7429 19811 18663 17153 11771 14677 16558 22623 28677 25803 28947 36503 41219 36806 38904 37031 34498
7414 34498 33190 30428 33262 29659 25393 27684 31362 36899 39360 33812 27144 25588 19666 16933 19229
7399 19229 18699 21675 30718 29605 29066 38454 41415 38712 32487 31973 31970 35658 32810 29190 29490 32645
7383 32645 29835 28176 31266 30794 29648 31205 37093 30833 27705 28082 28785 23173 20175 19219 24026 25354
7367B5354N897K385j508K21p354l897M475L53N491O36o964J25N105M11l502k497
7351B4731Q374L596M91o143J60j249n685M295N305J9n016m420J220O603J603q907
7335B4977n111p61J923N022O531J363m398r1p293j563N165O382K640M347o69p713
7319C0751o883n138J537J0921o046L357l226j5273k737J2294M891n110J378P50
7305B1466L227L420O330m149j0537m822K406O221l541L09l353p7M253K425M441
7290B8019l515L040j405p33k648q62L027k982o702M135K257J950J910p882p09
7275A6900Q088L806n008k654q204j0376j640O624M077K325N428M787R04r99j38
7260B3920j7l041o84K121l334r89M942P81m939k673L237j660K383J828k594k449
$$ plain form
7367 25354 31251 33636 32128 32349 24995 21098 25573 25926 31417 32053 25089 25214 30319 30730 27228 24731
7351 24731 33105 36701 37192 31049 31209 29960 24275 28570 33875 33894 28878 24458 25678 32281 33884 24977
7335 24977 19866 19105 21028 26050 32581 33944 29546 29455 22162 20599 25764 32146 34786 39133 38464 30751
7319 30751 23868 18730 20267 31188 25142 28499 25273 10000 7263 19557 24448 19338 20716 21466
7305 21466 24693 28113 34443 30294 19757 14935 17341 23562 20021 20330 16977 16900 21153 23578 28019
7290 28019 24504 27544 26139 25406 22758 21896 24923 21941 15239 19374 21631 23581 25491 17609 16900
7275 16900 24988 28794 23786 21132 12928 2552 912 7536 11613 13938 19366 24153 25057 24058 23920
7260 23920 23903 20862 20178 22299 18965 17976 22918 23699 18760 16087 19324 17664 20047 21875 19281 16832
7244A6832p29j39n098o20n0m8l71L233M089q000M71N180O19q18K543K148k325
7227A6917o45Q2Q752k657J790m899J359L428K650L157j558j920M199j791o244
7212B2620k216M325N819M22L79n855o724j842Q551O401j1167j886K482m400j121
7197A5788K293j464n560M480M517L638n696N451P655J109o917j0567m808J765
7183A1684K2Q490N567k072M338O47m018m128J44k76J529L890j710L0K240j436
7167B4941n049o74l447n295o87Q442J941k864o047k633q20j425q64J34O520J1301
7151B3474K223l74J568P13l756n020p73J66l325N166O073m84J985l705k644m206
7135A7081L026P619j226m57j883j356K518q498k447j457J938O83Q37K022l353
$$ plain form
7244 16832 16103 15964 10866 10246 10196 10148 9777 13010 17099 9099 9570 14750 15369 14551 17094 19242 16917
7227 16917 16272 16354 25106 22449 24239 19340 20699 24127 26777 29934 28376 26456 30655 28864 22620
7212 22620 20404 24729 30548 30970 31349 25494 18770 16928 25479 31880 20713 18827 21309 16909 15788
7197 15788 18081 16617 11057 15537 20054 23692 17996 23447 31102 32211 25294 14727 9919 11684
7183 11684 11706 20196 25763 23691 28029 28676 24658 20530 20674 20398 21927 25817 24107 24137 26377 24941
7167 24941 19892 19218 15771 10476 9789 18231 20172 17308 11261 8628 7808 6383 5519 5653 12173 23474
7151 23474 25697 25323 26891 27604 23848 18828 18055 18221 14896 20062 26135 25651 27636 23931 21287 17081
7135 17081 20107 27726 26500 26043 24160 22804 25322 16824 14377 12920 14858 15541 16378 18400 15047
7120A5047p58j118j29N743N641N125j344J8K674j1069k809O53J429K767J602n396
7104A8076l635k439j185j169m017j384L660N759O131P157o042m049K516R29j726
7089A8582o304l462m730n53O584M70M684P677O682n97m257q645K328l651k73Q06
7073A5341J406m973L181J742J787n98k468L615L849j72q661l821j187L018M917
7058A6976L651l034j581L209l042p79R35l490q582N050Q653l67P93M638n372k230
7042A5428N955J967j810p479n482K9J816o549j425P681N068j808k434r10o869
7027C178l86N474K150m336P658L468l236p592q833N021P477J795p57L034J229
7012A5344k99L085l907l762L768K502J840O326l562J98O850o878r886Q436j399
$$ plain form
7120 15047 14289 13171 13042 18785 24426 29551 28207 28225 30899 19830 17021 17674 19103 21870 23472 18076
7104 18076 14441 12002 10817 9648 5631 4247 7907 13666 19797 26954 20912 16863 19379 20308 18582
7089 18582 12278 8816 4086 3533 10117 10587 15271 22948 29630 29033 24776 16131 18459 14808 14535 15341
7073 15341 16747 11774 14955 16697 18484 17886 15418 19033 22882 22710 14049 10228 9041 12059 16976
7058 16976 20627 17593 16012 19221 16179 15400 16335 12845 4263 9313 17966 17599 18392 23030 17658 15428
7042 15428 21383 23350 21540 14061 8579 8608 10424 3875 2450 10131 15199 13391 10957 10047 3178
7027 3178 2792 8266 10416 6080 13738 17206 13970 6378 -2455 2566 10043 11838 11081 14115 15344
7012 15344 15045 18130 14223 10461 14229 16731 18571 24897 21335 21533 28383 21505 11619 20055 18656
6997A8656j0718q13J3000M729p306n843R9K598M779J0738M98l197p602m377L173
6982A8414M359k603l210L96M626J221o931o787p54J235O563J917k69j933l824
6967A2420L894J787l337L880j095m057j132K899O483k014k584L168J439J782k256
6952B1277l745O09k201m752N065N961J701k875l799k954n040M923R507M262M34
6937B8373J449l381m175J212j800q644l490J800M11j000j113l15L695O105O306
6922B5433n86k778j120o239l80N258L001L604k771p315k046J378L918o717k265
6907A0375M1Q248P82n645k015m42J473M363M623l028l429m403j182J837j346M548
6891A4800P915l718L01M281n504k378J005k702j528K56K256K686Q306P80J427
$$ plain form
6997 18656 7938 7125 20125 24854 17548 11705 11804 14402 19181 29919 30417 27220 19618 15241 18414
6982 18414 22773 20170 16960 17356 21982 23203 16272 9485 8731 9966 16529 18446 18177 16244 12420
6967 12420 16314 18101 14764 18644 17549 13492 12360 15259 21742 19728 17144 20312 21751 23533 21277
6952 21277 17532 18141 15940 11188 16253 22214 23915 21040 17241 14287 9247 14170 23677 27939 28373
6937 28373 29822 26441 22266 23478 21678 13034 9544 11344 11755 10755 9642 9327 13022 19127 25433
6922 25433 24847 22069 20949 14710 14330 19588 22589 26193 23422 16107 14061 15439 19357 12640 10375
6907 10375 10416 18664 19446 13801 11786 11344 12817 17180 21803 18775 15346 10943 9761 11598 10252 14800
6891 14800 22715 18997 19298 23579 18075 15697 16702 14000 12472 12728 14984 17670 25976 26756 28183
6876B8183o073m441m005l280j181n074K993M356J119m70j659j416N525Q830l10
6861B3097R22j301L573L938N780J3464K2952K0671J1226M38j1777j2828j122J2061
6847I1094J7049p761k3668j8357r490m783j1406q347K021j117l996M317L752l554
6833B5754n825n650m41j463K102Q211K405l76K114r66L069O079J48m373m156M599
6817C1231O827M669J0363N037N801l9N12j3795n644p532q326J0771J1650O390
6803E7915O344Q961Q600l646j2347j2688p665l144N10l742r321j1897J810K492
6789B2182O734m278M862P447P038K515l518k806J653J112L571n19N050J256R884
6774F2183Q081K627M16j226m341O178J1822J0843J9074K2027J1722n812p941r219
$$ plain form
6876 28183 22110 17669 13664 10384 9203 4129 7122 11478 12597 12127 10468 9052 14577 23407 23097
6861 23097 24019 22718 26291 30229 36009 49473 72425 93096 104322 104760 92983 80155 79033 91094
6847 91094 108143 100382 76714 58357 48867 44084 32678 24331 26352 25235 21239 25556 29308 25754
6833 25754 19929 14279 13838 12375 14477 22688 25093 24717 26831 25865 28934 35013 35161 30788 26632 31231
6817 31231 38058 42727 53090 58127 63928 63889 64401 50606 44962 37430 29104 39875 51525 57915
6803 57915 64259 73220 81820 78174 65827 53139 45474 42330 42840 39098 29777 17880 19690 22182
6789 22182 28916 24638 29500 36947 43985 46500 42982 40176 41829 42941 46512 45993 51043 52299 62183
6774 62183 70264 72891 73307 72081 67740 73918 85740 96583 115657 137684 149406 143594 135653 126434
6760A26434r819p21o654j0771n315n410P59K363J526N922N881N162Q589N490O111
6745A29547J897m638p48M22p49L926K190r198j5716j5757j4322k06k91L83Q258
6730H4998J0582J2714K3299K3713J6678o468j9657k0574k0264j6904o486l465
6718G8166k08O39M315O694J1044R640M57M176N787j0179j3951q367j3927q892
6704F5394n030N272J1986J1711M804P894P263J7805K2844L1710N6228R1177J31288
6691D60346K00930L08907M07441L70747J19908k30179m18138l84981k50073j54874
6681D30034j00560n8751m7523l6489k9211k1481j5123q951j8683m623l291m850
6669H0498k025K462L488M501N035L594q056j1823j2077j2101r398J538J139n91
$$ plain form
6760 126434 116615 115894 109240 98469 93154 87744 88503 90866 92392 98314 104195 109357 117946 123436 129547
6745 129547 131444 126806 126058 126480 125731 129657 131847 122649 106933 91176 76854 76648 76357 76740 84998
6730 84998 95580 108294 131593 155306 171984 165516 145859 125285 105021 88117 81631 78166
6718 78166 77958 78597 82912 89606 100650 110290 110747 114923 120710 110531 96580 88213 74286 65394
6704 65394 60364 65636 77622 89333 94137 102031 109294 127099 149943 181653 237881 329058 460346
6691 460346 661276 970183 1377624 1748371 1868279 1638100 1219962 834981 584908 430034
6681 430034 329474 270723 223200 186711 157500 136019 120896 111945 93262 88639 85348 80498
6669 80498 78473 80935 84423 88924 93959 97553 89497 77674 65597 53496 44098 45636 46775 46184
6655D6184j526Q25m74K866J414n964q59K073j471l35l609k685K192K819k713J661
6639D0398n941K310Q054O09j819k827j138l592r099o587j100O300K570n881m699
6624A7558m441N394O585l394k133l667N108K316k62o404K323L329L782J448N303
6609C2845J704J186l417J163O268m332l879p671m811n082J621J230q78M468j513
6594A8902l956K985K669k823P062P60m620l866o622m395N22M416l073m783M017
6579G195P851l56j430k316J811k488J172O977Q921j469n106l836L756p64k236
6564A7682O392m92l552J246n216m490L497j588l234m092n024J0830R692n126o429
6549A0096l319L020K448n116l868N726O304K596p52k994n31j769q95o531K860
$$ plain form
6655 46184 44658 45483 45009 47875 49289 43325 42466 44539 43068 42733 39124 36439 38631 41450 38737 40398
6639 40398 34457 36767 44821 45430 43611 40784 39646 36054 26955 20368 19268 25568 28138 22257 17558
6624 17558 13117 18511 25096 21702 19569 15902 21010 23326 23064 16660 18983 22312 26094 27542 32845
6609 32845 34549 35735 32318 33481 39749 35417 31538 23867 19056 13974 15595 16825 15947 20415 18902
6594 18902 14946 17931 20600 17777 24839 25599 20979 17113 10491 6096 6618 11034 7961 3178 7195
6579 7195 15046 14690 13260 10944 12755 10267 11439 18416 27337 25868 20762 16926 20682 19918 17682
6564 17682 24074 23582 20030 21276 16060 11570 15067 13479 10245 6153 1129 11959 21651 16525 10096
6549 10096 6777 9797 12245 7129 3261 8987 15291 17887 17135 14141 13610 11841 10946 4415 7275
6534G275L848n28M26j446l734M755L431l097p304K037O026P259j98J694m137k494
6518A3813m626J092k568k426j649M353L36J977n207j082N400k657M930k96l788
6503G602N599Q000j686K82n031k671K828N428k807j3074k210j570O571J627l473
6488E415J837N201k085l460m79K12O709K720j699l440k73J623K443J109J146J621
6472A8600l715K030j325l037j0N528j2J677O08m936k250l203o60L085J261K595
6456A6236L691N742J982o559m959m352J258K419l152j580k126l5M622Q410L597
6441B5194o008p510p62M736j756l956N271M376n366q814r720j997P541M74L377
6426E080O824K029K134K421Q52K074K349L083J158k379J822m387o70q529q389
$$ plain form
6534 7275 11123 10595 11021 9575 5841 10596 14027 10930 3626 5663 11689 18948 18750 20444 16307 13813
6518 13813 9187 10279 7711 5285 3636 7989 8325 10302 5095 4013 9413 6756 11686 11390 7602
6503 7602 13201 21201 19515 19797 14766 12095 14923 20351 17544 4470 2260 690 7261 8888 5415
6488 5415 7252 12453 10368 6908 6429 6641 13350 16070 14371 10931 10658 12281 14724 15833 16979 18600
6472 18600 14885 16915 15590 12553 12543 18071 18059 19736 20344 15408 13158 9955 9295 12380 13641 16236
6456 16236 19927 25669 27651 21092 16133 11781 13039 15458 12306 10726 8600 8565 13187 21597 25194
6441 25194 19186 11676 10914 15650 13894 9938 15209 19585 14219 5405 -4315 -6312 1229 1703 5080
6426 5080 11904 13933 16067 18488 19340 21414 23763 26846 28004 25625 27447 23060 22390 13861 5472
6411E472K04J069M091L700o662J409k506m233K818P407J185K357n120o139q738
6396c686k861O924L993P056L407q188n909K553N628Q27o823J5090J5950p631M016
6381C0346J80q140m139n123o828K354R681L741l606j73M832k426m942K48n052
6366A0953n48N884K161j661j669k556n854k257n99L747n595m741p71M868J0701
6351A2063K475j029k139k074j249O402L278k069o424J947m192l716r046N200P304
6336F731N159M527m669n25J436m640K31K355K991K525p04j799l82J670K613K337
6320A9856o636j303J008l687K049j766n771M166K060J176K307n558n764p024Q01
6305d086M387K265q99P500M587N261q73o453j725m944K474N558n67L416l380j611
$$ plain form
6411 5472 5676 6745 10836 14536 7874 9283 6777 2544 5362 12769 13954 16311 11191 5052 -3686
6396 -3686 -6547 377 4370 11426 14833 6645 736 3289 8917 9744 2921 18011 33961 26330 30346
6381 30346 30526 22386 18247 13124 6296 8650 18331 22072 18466 18293 23125 20699 15757 16005 10953
6366 10953 10405 16289 18450 16789 15120 12564 6710 4453 3854 7601 2006 -2735 -3506 1362 12063
6351 12063 14538 13509 11370 9296 8047 14449 17727 15658 9234 11181 6989 3273 -5773 -573 6731
6336 6731 11890 16417 11748 11223 12659 8019 8250 10605 13596 16121 15417 13618 13236 14906 17519 19856
6320 19856 13220 11917 12925 9238 11287 9521 3750 7916 9976 11152 13459 7901 2137 -4887 -4086
6305 -4086 301 2566 1667 9167 13754 19015 18142 11689 9964 5020 7494 13052 12485 15901 12521 10910
6289A0910q098K131R001Q54K980k930l001O176M588m912J442n625j387K412m297
6274A0244o603N194P630l36J737K586n7k89o947k076k183l087J269L422l522o22
6258F360k279K011k637p564l326K149K483K172M408K40R720L270j0165j0047n174
6243h379K426L194P055N045j656r52O86j271L166N18M48j799n893O565Q054j592
6227A5615l968p6l939m711M182K278k196j821N709q689R19K033K896j669K34j87
6211F610n86R931J26n842m294l529j666P569r96p134p690K335K050O188K470m838
6195G04k538O790Q939M878o989o692K980L911k675q523P071Q568J475n183p340
6180E376k282K315N1M162L577L289l558L353n80k290q842j660L003l953l651J00
$$ plain form
6289 10910 2812 4943 13944 14798 17778 14848 11847 18023 22611 17699 19141 13516 12129 14541 10244
6274 10244 3641 8835 16465 16129 17866 20452 20395 20106 13159 11083 8900 5813 7082 10504 6982 6360
6258 6360 4081 6092 3455 -4109 -7435 -5286 -2803 -631 3777 4017 13737 17007 6842 -3205 -8379
6243 -8379 -5953 -2759 4296 9341 7685 6733 7419 6148 9314 9832 10280 8481 2588 9153 17207 15615
6227 15615 11647 11571 7632 2921 7103 9381 7185 5364 11073 2384 3303 5336 8232 6563 6797 6610
6211 6610 6024 15955 16081 10239 5945 2416 750 8319 7323 189 -7501 -5166 -3116 3072 5542 704
6195 704 -1834 4956 13895 18773 11784 5092 8072 11983 9308 785 7856 16424 17899 12716 5376
6180 5376 3094 5409 5460 9622 13199 16488 12930 16283 15703 13413 4571 2911 5914 1961 -1690 -1590
6164a590M391m378o818K498O25K283L220K553P668K545j633M00n249n490J78L87
6148A590K331m43L106l96K868O862P923R68j0271l792L548j329l405j813m794
6133B953l548n240j281j134M06J063N157M747n6L266j936K086N093l071k631L207
6117I081N584k812J661L355m643l030m404M224l44l587L56O642k305j0399J523
6102I02N058l453K65J072o19K712N705j811o311n091j121k953J035M943J851L703
6086E887J646p424O83R306L690j111j317N58M706M709k56m279m250j642n881J096
6070F121k052k399l103K532J486N738J367K618k959m755o79o975K292k864n8k471
6054f161K350L314K221k573j327n037Q7N919M637K137Q555n778p735K263L629
$$ plain form
6164 -1590 2801 -1577 -8395 -5897 -5272 -2989 231 2784 10452 12997 11364 11764 6515 1025 1203 1590
6148 1590 3921 3478 6584 6188 9056 15918 23841 24809 14538 10746 14294 12965 9560 7747 2953
6133 2953 -595 -5835 -7116 -8250 -7844 -6781 -1624 3123 3067 6333 4397 6483 11576 8505 5874 9081
6117 9081 14665 11853 13514 16869 12226 9196 4792 9016 8672 5085 5441 12083 9778 -621 902
6102 902 5960 2507 2772 3844 3225 5937 11642 9831 3520 -1571 -2692 -5645 -4610 333 2184 5887
6086 5887 7533 109 792 10098 13788 12677 11360 11918 16624 21333 21077 16798 12548 10906 5025 6121
6070 6121 4069 1670 -1433 1099 2585 8323 9690 12308 9349 4594 3915 -3060 -768 -3632 -3690 -6161
6054 -6161 -3811 -497 1724 -849 -2176 -7213 -7126 -1207 3430 5567 14122 8344 609 2872 6501
6039F501n999J132O428n379l425J016k686L775l430l787J775L782K715K763O98
6024E879k496l125J043l99K965J790O06K310m561j117J852m075q32N034M722N107
6008A4703o236q88J092K974r40q96J754n914M89l90O823J1541L619K105o319r426
5992A4091m60k028l639L052o06r2L468l275k935m823K370K278k641l082J615N408
5976H701O862m89n882m642p409m09J492K253L518K399O90l706j315K580K420K822
5960I885R0N504p96o673n62J620P92k787j990l338R78M846L546R76n611k745J1674
5943A5409j448n194m451L351Q31n652Q55L605K005o408j066R621Qk935m792K498
5927F237l466P05L407j618K976l403n05k222o272O29R18L73L780N909J0126m58
$$ plain form
6039 6501 502 1634 8062 2683 -742 274 -2412 1363 -2067 -5854 -4079 -297 2418 5181 5879
6024 5879 3383 258 1301 902 3867 5657 6263 8573 4012 2895 4747 672 -160 4874 9596 14703
6008 14703 8467 7579 8671 11645 10705 9809 11563 5649 6138 5748 12571 24112 27731 29836 23517 14091
5992 14091 13631 11603 7964 11016 10410 10318 13786 10511 7576 2753 5123 7401 4760 1678 3293 8701
5976 8701 15563 15074 9192 4550 -2859 -3268 -1776 477 3995 6394 7084 3378 2063 4643 7063 9885
5960 9885 9975 15479 14683 8010 7448 9068 9860 7073 5083 1745 2723 7569 11115 12091 6480 3735 15409
5943 15409 13961 8767 4316 7667 8498 2846 3701 7306 9311 2903 1837 11458 11466 8531 3739 6237
5927 6237 2771 3476 6883 5265 8241 4838 4333 2111 -4161 -3532 -2614 -2241 1539 7448 17574 17116
5911A7116l497m430K392j962j470K80Q03Q05p037K464M314j251m22J118O375R409
5895B5007m59j5531p129O04n462rO584L571l429J423m965l392J237k934K023O636
5879C775K182p50J389k749L012n401j557k310L884O39j831N411J2499j309r67
5864A5917j009P66j39m675m405J263n033l501J278J759j057K800q93J617Q546
5849A3234l659j2504P28Q461l062L14K629J789O892l233n264k439j272j754k032
5834a172l719j901L953M359o81k597r243N045J0345L454J504l350n611K022L995
5819F403l407m831J01J466n733j19k667K38M441m15J078Q299J1298q30n768J946
5803A1500J109j985k978M79k327n610n320N229J1723K539M998r289l243l412J2
$$ plain form
5911 17116 13619 9189 11581 9619 8149 8429 9232 10037 3000 5464 9778 8527 8105 9223 15598 25007
5895 25007 24548 9017 1888 2492 -2970 -2979 3605 7176 3747 5170 205 -3187 -1950 -4884 -2861 3775
5879 3775 5957 5207 6596 3847 6859 1458 -99 -2409 1475 2114 283 5694 18193 16884 15917
5864 15917 14908 15674 15535 10860 6455 7718 2685 -816 462 2221 1164 3964 3071 4688 13234
5849 13234 9575 -2929 -2201 6260 3198 3512 6141 7930 14822 11589 6325 3886 2614 860 -1172
5834 -1172 -4891 -6792 -2839 1520 839 -1758 -11001 -5956 4389 7843 9347 5997 386 2408 6403
5819 6403 2996 -1835 -1734 -268 -6001 -6120 -8787 -8549 -4108 -4523 -3445 4854 16152 15322 9554 11500
5803 11500 12609 10624 7646 8125 5798 188 -5132 97 11820 14359 19357 10068 6825 3413 3425
5788C425P552k259l66K893j626J824k627j74J828j888p70j158L875K103K065o753
5772G944m597M280P10m255m021N267L950O076m9k686q672m537L044Q560P089l834
5756A4269j0073J459J675j0562k380N444L769Q9P827J403n316o46J167J727N304
5741A5156j221r103J56R186l315j207j18j740P5j64j458j120O14J522O17J031
5725H911n143j841Q04l849m808J32P842K739P00l602m028k015L735N781L674j644
5709G388K904k832o904p86k33M718N231o573m069m511P61K917J651K584N257k658
5693D845k383N61O66J309K132n312J666Q032K36P90n040p85j963l803L189J947
5677F087n521j54P280N15l652m096N218P580R97m116r519l081k479j645Q475N455
$$ plain form
5788 3425 10977 8718 8352 11245 9619 11443 8816 8642 10470 8582 7812 6654 10529 12632 14697 7944
5772 7944 3347 7627 8337 4082 61 5328 9278 15354 15305 12619 3947 -590 2454 11014 18103 14269
5756 14269 4196 5655 7330 -3232 -5612 -168 3601 3690 11517 12920 7604 6958 8125 9852 15156
5741 15156 13935 4832 4988 14174 10859 9652 9534 7794 7869 7705 6247 5127 5741 7263 7880 8911
5725 8911 3768 1927 2731 -1118 -5926 -5794 2048 4787 5487 1885 -2143 -4158 -423 5358 9032 7388
5709 7388 10292 7460 556 -230 -463 4255 9486 2913 -1156 -5667 -4906 -1989 -338 2246 7503 4845
5693 4845 2462 3023 3689 4998 7130 1818 3484 11516 11752 12542 7502 6717 4754 951 4140 6087
5677 6087 566 412 7692 8207 4555 459 5677 13257 14254 10138 619 -2462 -4941 -6586 1889 7344
5661G344l054K430M680o198j336K618K336J176k813k427O80k99M209J210Q03P777
5645A9136L465p15k354m130m10P40q204l960K973L223j961j429k120L076j716
5630E614N845M674k991m998k226j624K180j15p552Q15R061P781J541l287k049
5615A2669M325m817o197M571K844L790o490j3036p12N455j389j897M015K928R03
5600F962k372K48Q59K67J637p385m095K814R89J831O276K317k860l531l00J928
5584E585N075K530O6j499l210K302k170m445M678L624K94n42j251j2753k116k270
5568f102j478R241R625K142o921k555N412j459L193m837k963J999J224m551j592
5553C78J317O548l098J85l571k931l72N9n435O196M980k674N624N453k135j951
$$ plain form
5661 7344 4290 6720 11400 5202 3866 6484 8820 9996 7183 4756 5436 5137 9346 10556 11359 19136
5645 19136 22601 21886 19532 15402 14992 15732 7528 3568 6541 9764 7803 6374 4254 7330 5614
5630 5614 11459 16133 13142 8144 5918 4294 6474 6359 -1193 -378 8683 16464 18005 14718 12669
5615 12669 16994 12177 5980 10551 13395 17185 10695 -2341 -3053 2402 1013 -884 3131 6059 6962
5600 6962 4590 4838 5697 5964 7601 216 -3879 -1065 -76 1755 8031 10348 7488 3957 3657 5585
5584 5585 10660 13190 13256 11757 8547 10849 8679 4234 8912 12536 12830 12288 11037 -1716 -3832 -6102
5568 -6102 -7580 1661 11286 13428 6507 3952 9364 7905 11098 6261 3298 5297 6521 1970 378
5553 378 1695 8243 5145 5330 1759 -1172 -1544 -1485 -6920 -724 4256 1582 7206 12659 10524 8573
5537H573n996N42N698L097J188L443K405n149n665m392K187q79k981o781l552
5522h262O179j345m27l127J474K430J754m110l322p75N994K095j729K482M311
5507C622P666M123J972K873k819o497p746p756J70N515N124j394j84L23K553J155
5491H700j933m957m228j680N334j038j106L503m607l174L439n3n52M611J30M427
5475F816n290n878J375J968J617N173N970m573k135p55K525l591j105K199k792
5460A524p11N413n615j837L363n82m820q011J747L387m95m81K132L568O43m776
5444e551N15O4o918J779K677M037J2675O243M055L776p427q768p782n046Q781
5429C110M412j519j43M431K537m261p185M26Q796K086m886n479k559L937J551
$$ plain form
5537 8573 2577 3119 8817 11914 13102 16545 18950 13801 8136 3744 5931 5052 2071 -4710 -8262
5522 -8262 -2083 -3428 -3855 -6982 -5508 -3078 -1324 -5434 -8756 -9531 -3537 -1442 -3171 -689 3622
5507 3622 11288 15411 17383 20256 17437 10940 3194 -4562 -4392 1123 6247 4853 4669 4992 7545 8700
5491 8700 6767 1810 -2418 -4098 1236 198 -908 2595 -2012 -5186 -1747 -1800 -2352 2259 2389 6816
5475 6816 1526 -4352 -2977 -1009 608 5781 11751 7178 5043 4288 6813 3222 2117 4316 1524
5460 1524 813 6226 611 -1226 2137 1555 -3265 -11276 -9529 -6142 -6637 -7118 -4986 -1418 -775 -5551
5444 -5551 -5036 -4972 -11890 -10111 -7434 -3397 9278 15521 19576 23352 15925 7157 -625 -5671 3110
5429 3110 7522 6003 5860 10291 12828 8567 1382 1808 10604 12690 7804 2325 -234 3703 5254
5414E254j824m929n115K100P826J082n100j027J46M123l126J906m60k232J078
5399b98L291j135n577j597k509L256L909K215N242O381J802m047o321L85J105
5384F102k398J143n075j566l151r86M046Q497J1o00k207p64L348m1p712N313J293
5367E253J566j771p023j862Q461n576o10P765K775j312J440j005P57J740n928
5352D670k703J203j928q68L162K875q34M252J906p13J777k434m127M048j021k077
5336G188k926o21k406k983m27O315O44n94K918K960k427m937OK1J325o308m470
5319f722l07L91L577p18n442L114O323K792O39k896J445k793K552K826L256q73
5303G164o874p41M038m48J589O51N090K688n545l111l8K75K459K270m315j2769
$$ plain form
5414 5254 3430 -1499 -6614 -4514 3312 4394 -706 -1733 -1587 2536 -590 1316 856 -1376 -298
5399 -298 2993 1858 -3719 -5316 -7825 -4569 -660 1555 6797 13178 14980 10933 4612 4997 6102
5384 6102 3704 4847 -228 -1794 -4945 -5931 -1885 6612 6623 6023 3816 3052 6400 6359 -1353 3960 5253
5367 5253 6819 5048 -1975 -3837 4624 -952 -1562 6203 8978 7666 9106 8101 8858 10598 4670
5352 4670 1967 3170 1242 374 3536 6411 5577 9829 11735 11022 12799 10365 6238 10286 9265 7188
5336 7188 4262 3641 1235 -1748 -2175 4140 4784 4190 7108 10068 7641 2704 2710 2731 4056 -2252 -6722
5319 -6722 -7029 -6638 -3061 -3779 -9221 -6107 216 3008 3647 751 2196 -597 1955 4781 8037 7164
5303 7164 290 -451 3587 3139 4728 5379 10469 13157 7612 4501 4463 4738 7197 9467 5152 -7617
5287g617j043R121Q170M979m443N433k514m558P80j9r393k857L898J739K853l066
5271A463n230k239J884O148L412N55m360l450j398K962m818j934K478j552K57
5256e822M57k961j511M361J0954l657J58K202K511l856L391P362m669j0583l2
5241a695J040l175Q832Q966K72j479l756l698m504M43J158O41n113q13P15m43
5225b609R105p259k419L033N959j462k818K49J792n210K661N031p099m615L152
5210b509K564l447j395J2455j760k802j733Q5k140M53k336l208k824M376m68Q128
5194C439M041l449M463p11m972J19j932m543K094n2N036J224M00j142n05n04r16
5177B090j683j955m751q553M350N372R298O50p82n28q73l317m886m345Q657j888
$$ plain form
5287 -7617 -8660 461 8631 13610 9167 14600 12086 7528 8308 8289 -1104 -3961 -63 1676 4529 1463
5271 1463 -3767 -6006 -4122 2026 5438 5993 1633 -1817 -3215 -253 -5071 -7005 -4527 -6079 -5822
5256 -5822 -5365 -8326 -9837 -5476 5478 1821 1979 4181 6692 2836 6227 13589 8920 -1663 -1695
5241 -1695 -655 -3830 5002 13968 14240 12761 9005 5307 803 1246 2404 3045 -2068 -2881 -2166 -2609
5225 -2609 6496 -763 -3182 -149 5810 4348 1530 1779 3571 -1639 1022 6053 -1046 -5661 -2509
5210 -2509 55 -3392 -4787 7668 5908 3106 1373 1458 -682 -229 -2565 -5773 -8597 -4221 -4689 3439
5194 3439 7480 4031 8494 7783 2811 2930 998 -3545 -1451 -1503 3533 4757 5157 4015 3510 3006 2090
5177 2090 407 -1548 -6299 -14852 -10502 -5130 4168 4818 4036 3508 2635 -682 -5568 -9913 -1256 -3144
5161c144o309N406N451m347l10J922N968n59J834o459k317o040M384L554O763
5146E797l527j1136j763N175R78R22L348K68r16j878l644Q53K666P14l07Q22M887
5129C259M791j190l674j813M39p26l75o221l555J0017N598k710M942l379j0032
5114d629m922O083J381K160j214O492L363r25o662O98M200L995k804o121p232
5099f137m516O20K550L932Q700N033k005k915L732k908j832J62m495q39J594K368
5083C044m43j733k597l372K13N378L180M703m165o610o49K668K284M97q47p067
5067e516m982K6p92L353J2326O110N891p025j1171L947O745m614l268n140l557
5052g667L3L877m652L227P560m929p149P89J832k543N498J144K590K54P039K345
$$ plain form
5161 -3144 -9453 -4047 1404 -2943 -3253 -1331 4637 4078 5912 -547 -2864 -8904 -4520 -966 5797
5146 5797 2270 -8866 -10629 -5454 -4476 -3554 -206 62 -854 -2732 -6376 -5523 -2857 -2143 -2450 -1628 3259
5129 3259 8050 6860 3186 1373 1812 1086 711 -5510 -9065 952 6550 3840 8782 5403 -4629
5114 -4629 -9551 -3468 -2087 73 -1141 5351 8714 7789 1127 1825 6025 10020 7216 1095 -6137
5099 -6137 -10653 -10033 -7483 -3551 5149 10182 8177 5262 8994 6086 4254 4416 -79 -918 676 3044
5083 3044 2601 868 -1729 -5101 -4888 490 3670 8373 4208 -2402 -3051 -383 1901 2398 1551 -5516
5067 -5516 -10498 -10472 -11264 -7911 4415 10525 16416 9391 -1780 2167 8912 4298 1030 -4110 -7667
5052 -7667 -7634 -3757 -8409 -5182 2378 -2551 -9700 -8911 -7079 -9622 -4124 -2980 -390 -136 6903 9248
5036I248j1887q256l68p106o05J0809J673K00J2197K629n242k434J505n657K325
5021i69L497O049K484j523l514n719k148N444j788K996J790p095l918Q264J698
5006E548o682n400n07L152P705K722o303m020J105P544m964o807O94J514N863
4991A164J0010P702l300o964m549j247q571n967J821Q801K34k214Q49K066k174
4976b339L601j302J955j755j035n42M743M384m40n395l253j925J480R05N447R199
4960A3728q826r200q47k082O450L115n121r589O864j28l471L007O83K070k526
4945e873K867L223K065K429Q19l558J126N438k132J730J697o679k735j551n471
4930f605J007O791O728J589n735k385M020n367p598M366K432K591M25L025q77
$$ plain form
5036 9248 -2639 -10895 -11263 -18369 -18974 -8165 -6492 -6292 5905 8534 3292 858 2363 -3294 -969
5021 -969 2528 8577 11061 9538 6024 305 -1843 3601 1813 4809 6599 -496 -4414 3850 5548
5006 5548 -1134 -6534 -7041 -3889 3816 6538 235 -3785 -2680 4864 -100 -6907 -6213 -4699 1164
4991 1164 11174 18876 15576 8612 4063 2816 -5755 -11722 -9901 -1100 -866 -3080 -2231 -165 -2339
4976 -2339 1262 -40 1915 160 -875 -1417 3326 7710 7270 1875 -1378 -3303 -1823 -918 4529 13728
4960 13728 4902 -4298 -5145 -7227 -777 2338 -2783 -12372 -5508 -5636 -9107 -6100 -5417 -3347 -5873
4945 -5873 -3006 217 2282 4711 5530 1972 3098 8536 6404 8134 9831 3152 417 -1134 -6605
4930 -6605 -5598 1193 7921 9510 3775 1390 5410 43 -7555 -3189 -757 1834 2259 5284 4407
4915D407k85k987k461j170k622o044R532O28j1316K568J1254K631k807q708l083
4900a0463K060N516L292N82m253o930j122M67J803P938p611m313L332j115P708
4885c109M370m92l122p90r45m737K532J586l534K537O945M881k89j351m709l244
4869c471K99r01K038l466L53L033J337j573l150k639k555k363N452L758J082M075
4853A309o96m484J093m846L605L324Q879N710N272n838m674n640m049J044L25
4838C34k092R70K199l692m807q84K43R39L124M545j154p280r4P267J052K898m51
4821C117K296n36m75j214j135J168o785J787Q071l44m78K030k352p58k895M03
4805A900j418K32M751L554k572o121m683L600N792j406n11L835J594k318j18j668
$$ plain form
4915 4407 4122 1135 -1326 -2496 -5118 -11162 -1630 -1002 -12318 -9750 1504 4135 1328 -7380 -10463
4900 -10463 -8403 -2887 405 987 -3266 -10196 -11318 -10851 -9048 -1110 -8721 -13034 -9702 -10817 -3109
4885 -3109 1261 769 -2353 -3143 -4088 -8825 -6293 -4707 -8241 -5704 1241 6122 5833 4482 -227 -3471
4869 -3471 -3172 -4073 -2035 -5501 -5148 -2115 -778 -2351 -5501 -8140 -10695 -13058 -7606 -3848 -2766 1309
4853 1309 613 -3871 -2778 -7624 -4019 -695 8184 13894 19166 13328 8654 3014 -1035 9 334
4838 334 -1758 -788 1411 -2281 -7088 -7972 -7729 -6790 -3666 879 -275 -7555 -7649 -382 670 3568 3117
4821 3117 5413 4877 4402 3188 2053 3221 -3564 -1777 6294 5950 5472 7502 5150 4392 1497 1900
4805 1900 482 714 5465 9019 6447 326 -4357 -757 5035 3629 3118 6953 8547 6229 6111 4443
4789D443n670J44L834J149n427K366N731m89p24l985l02O912l646j398J179K299
4773F416m004o292l27K440J135j3621o911J4576J0217M998J965k579R92l057j334
4758D614J837J543J376L909j270l26o535m519M50q56l344k688o286j151P399k87
4742f134j760j889n30O53O782J355J259L94m94j795p50M390k580l579n981j851
4726a2510J0845N928l525R84l057j613q09L120N902J933k222k658o733j528j116
4711g059q85J88O418K409k851o372L023q3L890M775m191n342r62N816o160n095
4695a2481j006O00K942N025k487M331Q886M006k858q445j594J83J925M595l555
4680F7K89l897N489M098J688L163j426n29j943J808j653n817l085m016J123R912
$$ plain form
4789 4443 -1227 -1083 2751 3900 -1527 839 6570 6081 5357 1372 1070 7982 4336 2938 4117 6416
4773 6416 2412 -3880 -4207 -1767 -632 -14253 -21164 -6588 3629 8627 10592 8013 9005 5948 4614
4758 4614 6451 7994 9370 13279 12009 11683 5148 629 1079 223 -3121 -5809 -12095 -13246 -5847 -6134
4742 -6134 -7894 -9783 -10313 -9660 -2878 -1523 -264 130 -364 -2159 -2909 1481 -1099 -4678 -10659 -12510
4726 -12510 -1665 4263 738 1722 -1335 -2948 -3757 -637 5265 7198 4976 2318 -4415 -5943 -7059
4711 -7059 -7944 -7756 -1338 1071 -1780 -8152 -5129 -5212 -1322 3453 -738 -6080 -7042 -1226 -7386 -12481
4695 -12481 -13487 -12887 -9945 -4920 -7407 -3076 5810 9816 6958 -1487 -3081 -2898 -973 3622 67
4680 67 356 -3541 1948 6046 7734 10897 9471 8942 6999 8807 7154 1337 -1748 -5764 -4641 5271
4664E271K346k174m46Q96n857M715L424o147k677o987K880K692l441O088M261
4649D844l586m682M241O07N681j703n297k753L578j204j523n251k042n103K488
4634a1705Q858P581k594l866L485K995O905J766j51r85k631m943m370m991K436
4619b210P836j421k122M007L066o068n242M431L385L231L710r935k514p93p905
4604h544k378N950J3004L46k282J144l937k29L325j115l567n63p41k526n050k528
4588i691K297j664N764L851o570r76K501q651J140N918Q467J956l296o608k059
4573g621j244K413m69k667n501M694N346N70L189n048r62L278O34O240J200o742
4557b690l77L794L201m650R17M142j21M35r58J72Q34j514M833l117n492j701K139
$$ plain form
4664 5271 7617 5443 4997 5893 36 4751 8175 2028 -649 -7636 -4756 -2064 -5505 583 4844
4649 4844 1258 -3424 817 1424 7105 5402 105 -2648 930 -274 -1797 -7048 -9090 -14193 -11705
4634 -11705 -2847 4734 2140 -1726 1759 4754 11659 13425 13274 12289 9658 4715 345 -4646 -2210
4619 -2210 5626 4205 2083 6090 9156 3088 -2154 2277 5662 8893 12603 2668 154 -639 -8544
4604 -8544 -10922 -4972 8032 8378 6096 7240 3303 3074 6399 5284 1717 1154 413 -2113 -7163 -9691
4588 -9691 -7394 -9058 -3294 557 -6013 -6989 -4488 -13139 -11999 -6081 2386 4342 1046 -5562 -7621
4573 -7621 -8865 -6452 -6921 -9588 -15089 -10395 -5049 -4479 -1290 -6338 -7300 -4022 -3388 2852 4052 -2690
4557 -2690 -3067 727 3928 -722 195 4337 4216 4651 3693 3865 4699 3185 8018 4901 -591 -2292 -153
4540a53J449p263K60M107j289l77m251k696Q00N441k741l908l921L130j074L852
4524h634j833j703L054O855O551k777j327J43m248o323n29j492q266K634J5017
4509b878L580r03l87M87n449N622Q85K385k22j512k122m425K790o302j243N695
4493c999Q708J1618j518n904K365k470m615j418n426j085J871M131N93n532M03
4478b278O468l771J874j384l241l164q384L257Q772L297K24O808K258m424q399
4463b087m34J899K620M061n342k697O790n688N37Q0p808L600J486Q19k77K040
4447d01Q87m67k235j205L372o448k886Q981O585q99J675l311m796O63R73K860
4431C348r26q802k95O998l075o39j136n223J929P148K375l743l000K272J71p732
$$ plain form
4540 -153 1296 -5967 -5707 -1600 -2889 -3266 -7517 -10213 -9413 -3972 -6713 -10621 -14542 -11412 -12486 -8634
4524 -8634 -10467 -12170 -9116 -2261 4290 1513 186 329 -3919 -10242 -10771 -12263 -20529 -17895 -2878
4509 -2878 702 -201 -588 -101 -5550 72 957 3342 3120 1608 -514 -4939 -2149 -8451 -9694 -3999
4493 -3999 4709 16327 14809 8905 11270 8800 4185 2767 -2659 -3744 -1873 2258 2851 -2681 -2278
4478 -2278 4190 419 2293 909 -2332 -5496 -13880 -10623 -1851 1446 1670 8478 10736 6312 -2087
4463 -2087 -2521 -622 1998 6059 717 -1980 4810 -878 -341 -261 -8069 -4469 -2983 -2164 -2441 -401
4447 -401 486 19 -2216 -3421 -49 -6497 -9383 -402 6183 5284 6959 3648 -1148 -485 488 3348
4431 3348 2422 -6380 -6675 323 -2752 -3391 -4527 -9750 -7821 -673 1702 -2041 -5041 -2769 -2598 -10330
4415a0330K665O151l365J540N060n479j468M295N70m386J838P234l830J036N172
4400F703J47l727m453k713M615l348j207L52k268k430m202K93M545n02k352N691
4384d856l06j668l005l24L218M612L488j961n470J362J366J225J506K044N7j164
4368A24k620J182L110Q61o278l394J190o055K830N095r06j903o942J461J690p265
4352a7820O102M371q882j0523L553P480N854q9j091J502o181J956J0413P607K035
4337F287m797l148N149k28j347j63k780k894L934K669o273k379j920J605R55j398
4321f728m480L210J766k19J418J621K284n606l905m81k124M688N076K35l090m466
4305a0801M636N448K813p4O578N551n594p137K030O20l533K172l786o462q30j897
$$ plain form
4415 -10330 -7665 -1514 -4879 -3339 1721 -3758 -5226 -931 -361 -4747 -2909 4325 495 1531 6703
4400 6703 6850 3123 -1330 -4043 572 -2776 -3983 -3631 -5899 -8329 -12531 -12238 -7693 -8195 -10547 -4856
4384 -4856 -5162 -6830 -9835 -10159 -6941 -2329 1159 -802 -6272 -4910 -3544 -2319 -813 1231 1288 124
4368 124 -2496 -1314 1796 2657 -3621 -7015 -5825 -11880 -9050 -3955 -4861 -6764 -13706 -12245 -10555 -17820
4352 -17820 -11718 -7347 -16229 -26752 -23199 -15719 -9865 -9954 -11045 -9543 -15724 -13768 -3355 4252 6287
4337 6287 1490 -1658 3491 3263 1916 1753 -1027 -3921 13 2682 -3591 -5970 -7890 -6285 -5330 -6728
4321 -6728 -11208 -7998 -6232 -6451 -5033 -3412 -1128 -6734 -10639 -11120 -13244 -8556 -3480 -3245 -6335 -10801
4305 -10801 -6165 -717 2096 2022 8600 14151 8557 1420 3450 4070 537 2709 -1077 -7539 -8369 -10266
4289a0266j703l92L926L08P73K357O013J971K535j344l03l054M559n510o512M19
4273f223L352k374K996R167M06l16j700L032N333K216m748m589q874j110O560
4258C128m25K083m269o885L48l716k990N685M41j713J893L21O82m18P084L204
4242D453q653k99m653l534J891j092q4K411l532j625N866J283L703j27k989m679
4226a1660J403R49j037K480L478L374M589M940J763n601p020o082l522l631M690
4211a0887P709j46j032m304L053L280n28l156l853m67L777k706N829N60o235K024
4195g082j543j001q14K505J502L100o011J511L994K218j504o74N048K583m02j0134
4179f704L552N76k015j58K454O80O964Q70O539j511n712k769J609J241K670J025
$$ plain form
4289 -10266 -11969 -12361 -8435 -8127 -7354 -4997 1016 2987 5522 4178 3875 821 5380 -130 -6642 -6223
4273 -6223 -2871 -5245 -2249 6918 7324 7008 5308 8340 13673 15889 11141 6552 -2322 -3432 3128
4258 3128 2703 4786 517 -6368 -6020 -9736 -12726 -7041 -6600 -8313 -6420 -6099 -5417 -5835 1249 4453
4242 4453 -4200 -4499 -9152 -12686 -10795 -11887 -11971 -9560 -13092 -14717 -8851 -7568 -3865 -3992 -6981 -11660
4226 -11660 -10257 -9308 -10345 -7865 -4387 -1013 3576 8516 10279 4678 -2342 -8424 -11946 -15577 -10887
4211 -10887 -3178 -3324 -4356 -8660 -5607 -2327 -2855 -6011 -9864 -10331 -6554 -9260 -3431 -2871 -9106 -7082
4195 -7082 -8625 -9626 -10440 -7935 -6433 -3333 -9344 -7833 -3839 -1621 -3125 -3799 1249 3832 3430 -6704
4179 -6704 -3152 -2576 -4591 -4749 -2295 -1615 5349 6219 12758 11247 5535 2766 4375 5616 8286 9311
4163I311n026o088K828l519J380N057p42J978o63o5l968j432k580o084K607j611
4147h617K902J236m109k723j418K369N700L646j323n272L412K329K79l126m5j159
4131e919k949m88O801K293m99M955j349l035J975n667J130J2569J419n359n747
4116A30j1137l71R80R07M69J531r1p26j154R585M32o864j89L114L350j0029J920
4099h143N665L342p89K920K190q34j621p519R11J97J907l464j368j128l201N22
4083a0413O07M323K119l548n018j673J005J374M636L256K990l420q082N375K441
4068d028O68M7K315m637n706N698L636Q22K28M938p4l361J721N867o100m697l250
4051e913o905l037L44K47N094Q135L331J458N14k83k355K711m010L647n677J984
$$ plain form
4163 9311 4285 -1803 1025 -2494 -1114 3943 3201 5179 4516 4451 483 -949 -3529 -9613 -7006 -8617
4147 -8617 -5715 -4479 -8588 -11311 -12729 -10360 -4660 -1014 -2337 -7609 -4197 -1868 -1589 -4715 -4760 -5919
4131 -5919 -8868 -9356 -2555 -262 -761 4194 2845 -190 1785 -3882 -2752 9817 11236 5877 130
4116 130 -11007 -11378 -10398 -9491 -9022 -7491 -7582 -8308 -9462 123 555 -6309 -6498 -3384 -34 -10063 -8143
4099 -8143 -2478 864 75 2995 5185 4351 2730 -4789 -3878 -3681 -1774 -5238 -6606 -7734 -10935 -10413
4083 -10413 -9806 -5483 -3364 -6912 -11930 -13603 -12598 -11224 -6588 -3332 -342 -3762 -11844 -6469 -4028
4068 -4028 -3360 -3313 -998 -5635 -11341 -5643 -2007 -1185 -957 3981 3907 546 2267 8134 2034 -2663 -5913
4051 -5913 -12818 -15855 -15511 -15264 -10170 -2035 1296 2754 3268 2985 630 3341 -669 2978 -2699 -715
4035g15p9k783o167K239N373k81j669m670K768O089J273j61j230K188J708k056
4019A827l242k637o134l872J631P072m026k692P735M046K362o227j459n1K146
4004c521p21o790n597K548N077M833M855K94N41j336m524L469N126N83m488J582
3988A931m960m75K912L65j801M650L59k046j891n616L735M341o76j503k963o001
3972i639K096O609O110J293m371l012m782P04Q010j005J227M184O372Q62j0p222
3956G426j1878k029m659m839P512M652k25o51K661J437n12M902J954k291n209
3941a749K179K439J20n429N54J432j0274j399Q023L678M031m491m466J363K852
3926a137o349n882q482l356L483N178O097K858m372o395R548P981l206n619k070
$$ plain form
4035 -715 -794 -3577 -9744 -7505 -2132 -2413 -4082 -8752 -5984 105 1378 1217 -13 2175 3883 1827
4019 1827 -1415 -4052 -10186 -14058 -12427 -5355 -9381 -12073 -4338 -292 2070 -4157 -5616 -5667 -3521
4004 -3521 -4242 -11032 -16629 -14081 -9004 -4171 684 978 1519 183 -4341 -872 4254 4837 349 1931
3988 1931 -3029 -3504 -592 -227 -2028 2622 2981 935 -956 -6572 -2837 1504 828 -675 -3638 -9639
3972 -9639 -7543 -934 5176 6469 2098 -914 -5696 -4992 3018 2013 3240 7424 13796 14658 14648 7426
3956 7426 -4452 -6481 -11140 -15979 -8467 -3815 -4040 -4691 -2030 -593 -1105 3797 5751 3460 -1749
3941 -1749 430 2869 2989 -2440 -1886 -454 -10728 -12127 -4104 -426 3605 -886 -5352 -3989 -1137
3926 -1137 -7486 -13368 -21850 -25206 -21723 -16545 -10448 -7590 -11962 -18357 -8809 -828 -4034 -9653 -11723
3911a1723J480r09J982M52k949L736N350Q481k778L025n480m067j674M868k740
3896b946n444M470Q751N430J238p559n708K551O001m836k008N379J959J39K188
3881I605k916k023k886m608n501L347o66o45L76J813M670K01n733L247k90k627
3865d636k889o823j598M617J377p98k278j4420k117Q399M787N625L775O242l00
3850a037K701l453l682k047M316k482q030l150o12O951J20L786Q425J257n075
3835b012K280P586J359n525N06p537r472j396R5N982J0843K982p813n013R0J417
3819e628Q820J262l727l2j600J828k585o365l188J963P938O463q111r934N25L526
3803h845M968R683p26o326k836N319j217r22m41K835K327K129P49O59L355m3l378
$$ plain form
3911 -11723 -10243 -11152 -9170 -8718 -11667 -7931 -2581 5900 3122 6147 667 -3400 -5074 -206 -2946
3896 -2946 -8390 -3920 4831 10261 11499 3940 -1768 783 6784 1948 -60 5319 7278 7417 9605
3881 9605 6689 4666 1780 -2828 -8329 -4982 -5648 -6293 -5917 -4104 566 767 -4966 -1719 -2009 -4636
3865 -4636 -7525 -14348 -15946 -11329 -9952 -10750 -13028 -27448 -29565 -21166 -16379 -10754 -6979 -737 -1037
3850 -1037 1664 -1789 -5471 -7518 -3202 -5684 -13714 -16864 -17476 -10525 -10405 -6619 1806 3063 -2012
3835 -2012 268 7854 9213 3688 4194 -3343 -12815 -14211 -14116 -8134 2709 5691 -2122 -7135 -7045 -5628
3819 -5628 3192 4454 727 695 -905 923 -1662 -8027 -11215 -9252 -1314 5149 -2962 -12896 -12371 -8845
3803 -8845 -3877 5806 5080 -1246 -4082 1237 20 -902 -1343 1492 3819 5948 6697 7356 10711 10668 7290
3786G290m390P55k371O312J198p374q693n747P919R368J718K986M625j119Q48
3771A3325J63M522m227m246q738k519M629o12p010M241L277J04j146q295n427
3756a1959J156J215O122M009o271o77R75n153K606L950j546O8M03m27m129K905
3740f753Q873o586k562N404N991j041J495m9o412J152k693M286L024l131q96K163
3724B265k620k962N719R64m400J56M522k717o676J876o784n84M508J204K893m577
3708g213l66L184P376m663l239j357l051N133n0J126k069o32J359K770n83o957
3692i232q124j574K607L953N715L779N577M883M314K944j812k980m360k613m604
3677a527m147m344R370M374k043q004Q34N486o451k07j409J925N315K624q661
$$ plain form
3786 7290 2900 3655 1284 7596 8794 1420 -7273 -13020 -5101 4267 5985 8971 13596 12477 13325
3771 13325 13488 18010 13783 9537 799 -1720 2909 2297 -4713 -472 2805 2909 1763 -6532 -11959
3756 -11959 -10803 -9588 -3466 543 -5728 -6405 -5430 -10583 -7977 -4027 -5573 -5505 -5102 -5529 -9658 -6753
3740 -6753 2120 -4466 -7028 -1624 4367 3326 4821 4772 -1640 -488 -3181 1105 4129 998 102 2265
3724 2265 -355 -3317 2402 3366 -1034 -878 3644 927 -5749 -3873 -10657 -11241 -6733 -5529 -2636 -7213
3708 -7213 -7579 -4395 2981 -1682 -4921 -6278 -9329 -4196 -4246 -3120 -5189 -5821 -4462 -1692 -2275 -9232
3692 -9232 -17356 -18930 -16323 -12370 -6655 -2876 2701 7584 11898 14842 13030 10050 5690 3077 -1527
3677 -1527 -5674 -10018 -648 3726 1683 -6321 -5487 -1 -6452 -6659 -8068 -6143 -828 1796 -6865
3662f865M096N223k512n10R7K507L980j936J124k819R27J568j484k933q85J28
3646b94k38K01J0516k573q784K544l65k684m499p680o05q49L520P363J286o557
3630i698p992l847k073R18L812L116M775P740J209J14l679m832m803L252K927
3615i061p608k093M877N888k205j793L352J21J587O627L276Q093l79q328o013
3600c659j678J21L711j249k768O432k414l33m300j590J466Q94r30J390L962O164
3584E219J75N72L262m61n180m705o335m302J170L954o089n364L784L899j644P626
3568d419L644K288k841l45o911j990N922O325Q68J853J986K937k405o146k00K032
3552B598q64r84P351M534m60k263q225q86O29M316m897Q81l278k484O176o822
$$ plain form
3662 -6865 -2769 2454 -58 -568 -471 2036 6016 4080 5204 2385 3312 4880 3396 463 -422 -294
3646 -294 -532 -331 10185 7612 -1172 1372 1007 -1677 -6176 -13856 -14461 -15310 -11790 -4427 -3141 -9698
3630 -9698 -17690 -21537 -23610 -22692 -18880 -15764 -10989 -3249 -2040 -1926 -5605 -10437 -15240 -11988 -9061
3615 -9061 -16669 -18762 -13885 -7997 -10202 -11995 -8643 -8522 -6935 -308 2968 11061 10682 2354 -3659
3600 -3659 -5337 -5216 -1505 -2754 -5522 910 -1504 -1837 -6137 -7727 -6261 -5367 -6297 -4907 -945 5219
3584 5219 5394 5966 9228 8767 3587 -1118 -7453 -11755 -10585 -6631 -12720 -18084 -14300 -10401 -12045 -4419
3568 -4419 -775 1513 -1328 -1673 -8584 -10574 -4652 1673 2541 4394 6380 9317 6912 766 566 2598
3552 2598 1734 750 8101 12635 12175 9912 1687 801 1430 5746 849 1730 -1548 -4032 2144 -4678
3536d678o793O884L833m82n616L299l091n760m062k071K309j076M053L1j8k108
3520a5346Q0L677N56J774M058M120j40J581o473j001j899k669O254M238m222K075
3504c337K770l093m856m536L761P445P93n480p540R027m501p83K052M97k713R54
3488i540O005j385n107k887Q1M523J734m450M28K102p344n50N680O007L932J256
3472D85L8l769L510M338J662J799j368l135p56L84k673K251N07O44o41N00k466
3455A310j705n741j243j62J83L687N206l529p011j440O83L282p636k765M178N368
3439g335l051K046q85K658n433m542j219J679P524N575J0539M53o481m505k384
3424e361p14l875l286o163J793M180N789n424L781L560O479J684J587M416n473
$$ plain form
3536 -4678 -11471 -4587 -754 -1236 -6852 -3553 -6644 -12404 -16466 -18537 -16228 -17304 -13251 -13220 -13238 -15346
3520 -15346 -15266 -11589 -11033 -9259 -5201 -1081 -1221 360 -6113 -7114 -9013 -11682 -5428 -1190 -5412 -3337
3504 -3337 -567 -3660 -8516 -13052 -9291 -1846 -1053 -6533 -14073 -5046 -9547 -10330 -8278 -7781 -10494 -9540
3488 -9540 -3535 -4920 -10027 -12914 -12833 -8310 -6576 -11026 -10598 -8496 -15840 -16390 -10710 -4703 -771 485
3472 485 523 -3246 264 4602 6264 8063 6695 3560 2804 3188 515 2766 3273 3917 3276 3776 1310
3455 1310 -395 -6136 -7379 -7541 -7358 -3671 1535 -1994 -9005 -10445 -9762 -6480 -14116 -16881 -12703 -7335
3439 -7335 -10386 -8340 -9225 -6567 -12000 -16542 -17761 -16082 -8558 -2983 7556 8009 1528 -2977 -5361
3424 -5361 -6075 -9950 -13236 -19399 -17606 -13426 -7637 -13061 -9280 -5720 759 2443 4030 8446 2973
3409B973J97l103l406J73n110J449j293j0643K483L559N111M272r354k832O779
3394h745Q410n32q37M126q55R04P96P80J816m481m260J208l472j093M776N216
3378C757R190n023l246j878J662K322n734p385j830p92K909M517j467q50M05j994
3362e437j703L876L14j513j614m564J430l41K282L69j115O446L253q10r89K574
3346B458L666j322J865k29k641m785m764J149k162j716M961j598N003M799p208
3331b524n546n60M099K583J632r110j1318l252O394O320O022l290m860M819Q321
3316b70L983j536k438o666p507J336Q658l821L471J0890M506p081k853k832j29
3301b289K911r045k264O161n895m567o16M4M240j723P379j750o612m67Q789K639
$$ plain form
3409 2973 3170 67 -3339 -3166 -8276 -6827 -8120 -18763 -16280 -12721 -7610 -3338 -12692 -15524 -8745
3394 -8745 -335 -867 -1704 2422 1567 2471 3267 4047 5863 1382 -2878 -1670 -5142 -6235 -1459 3757
3378 3757 12947 7924 4678 2800 4462 6784 1050 -6335 -8165 -8957 -6048 -1531 -2998 -3848 -3443 -5437
3362 -5437 -7140 -3264 -2950 -4463 -6077 -10641 -9211 -9552 -7270 -6901 -8016 -1570 1683 873 -116 2458
3346 2458 6124 4802 6667 6438 3797 -988 -5752 -4603 -6765 -8481 -3520 -5118 -115 4684 -2524
3331 -2524 -8070 -8630 -4531 -1948 -316 -9426 -20744 -23996 -17602 -11282 -5260 -8550 -13410 -8591 -270
3316 -270 3713 2177 -261 -6927 -14434 -13098 -4440 -8261 -4790 6100 10606 3525 672 -2160 -2289
3301 -2289 622 -8423 -10687 -4526 -10421 -14988 -15604 -15560 -11320 -13043 -5664 -7414 -14026 -14493 -5704 -3065
3285c065K357L030m634N114L50m177j555m889j135K361J082l06l336N227P593
3270D017J751l05o325q851M359q0M849M905p541m045J455N87k611p41k590K905
3254h261J417k526k314k450R28L697K997J873M658J782K620l809l697j273K109
3239b249J0542m035n20j332k177q50j945j986L625r58m46K554L24q339k309j143
3223a1244K444p11J305J129j662J987l78L15l982n192K766J2316L293K409N107
3208I902j482p962K638L292O529j165o943n482p3p50J675O72p024j495j920J169
3192h419K896Q223k285n765o313P135K498j585N678M613J423p639o938K585K036
3177a857j217M813L445j1146n560L296J702o2M831K479j613l97J245q24k834k532
$$ plain form
3285 -3065 -708 2322 -2312 2802 3152 -1025 -2580 -7469 -8604 -6243 -5161 -5467 -8803 -3576 4017
3270 4017 5768 5463 -862 -9713 -5354 -5434 -585 4320 -3221 -7266 -5811 -5224 -7835 -8576 -11166 -8261
3254 -8261 -6844 -9370 -11684 -14134 -13206 -9509 -6512 -4639 19 1801 4421 612 -3085 -4358 -2249
3239 -2249 8293 4258 3738 2406 229 -621 -2566 -4552 -927 -1885 -2331 223 547 -7792 -10101 -11244
3223 -11244 -8800 -9511 -8206 -7077 -8739 -6752 -7130 -6815 -10797 -15989 -13223 -907 2386 4795 9902
3208 9902 8420 458 3096 6388 12917 11752 4809 -673 -746 -1496 179 851 -6173 -7668 -9588 -8419
3192 -8419 -5523 2700 415 -5350 -11663 -4528 -2030 -3615 2063 6676 8099 460 -6478 -3893 -1857
3177 -1857 -3074 1739 5184 -5962 -11522 -8226 -6524 -6586 -1755 724 -889 -1286 -41 -865 -3699 -6231
3161f231K988k917p818K436M085O047N65m817O465N89p903n08J362N144O497L224
3145I208q870l501q618L702K777M160L714J290J410Q47j163n737l029J471j655
3130c994m486l580Q350P036q565l231O954K749L500o454l270p49N946N036j643
3115C599l172j189p29j130l801O72N988J320L572o593m141m8J160Q08k19o015
3099i918r7K818o562k129k402J771O298M469l259N366L193J288L412o97m581l094
3083d124k604m85M237K930j868J542O28J04O92N012K463l094m250j362q477o325
3067a4981R402O556l467j651J393K963n11j374L644j187l082M61J761N239Q047
3052A3213M940m25m519q134n015n680n709N59O059N107J242n985j522P61K22N492
$$ plain form
3161 -6231 -3243 -6160 -13978 -11542 -7457 -1410 -845 -5662 803 1392 -6511 -7019 -5657 -513 5984 9208
3145 9208 338 -3163 -11781 -8079 -5302 -1142 2572 3862 5272 6119 4956 -781 -3810 -2339 -3994
3130 -3994 -8480 -12060 -3710 3326 -5239 -8470 -1516 1233 4733 -1721 -4991 -5740 206 5242 3599
3115 3599 427 -762 -1491 -2621 -6422 -5750 238 1558 5130 -1463 -5604 -5652 -4492 -3684 -3903 -9918
3099 -9918 -10015 -7197 -13759 -15888 -18290 -16519 -10221 -5752 -9011 -3645 -452 836 4248 3551 -1030 -4124
3083 -4124 -6728 -7213 -2976 -46 -1914 -372 256 360 1052 6064 8527 5433 1183 -179 -8656 -14981
3067 -14981 -5579 977 -2490 -4141 -2748 215 -296 -1670 1974 787 -2295 -1834 -73 5166 13213
3052 13213 18153 17728 13209 5075 60 -5620 -11329 -10770 -4711 396 1638 -4347 -5869 -5108 -4886 606
3036F06J44l108J842O532k163n155M427J996m310k823K437O388J840l553m175
3021I25l508O01j2346n842K121L248P318M509J242M58n927j559o11J130J62K104
3005e975J944j975l966k991j592J862N945P09R92N488m6k242p677J305O534l325
2989e010K33J359p686J032O295N732R63m68m84o161m318j228P53K864K255K426
2973a443l670j0330K651J218O298P960p927J972M456l384n744O113P567L411K927
2958A2075l537p23m975n072n351p668K252M353Q642k405J628j356n513k348J998
2943h000K19L887M790l713J411O618o285j285J025o351Q339P56m143R38J172P48
2927A26l555k053M326M358J038o73P72j012j875j21l671j085J313m48L702k619
$$ plain form
3036 606 750 -2358 -516 6016 3853 -1302 3125 5121 811 -2012 425 6813 8653 5100 925
3021 925 -2583 -1982 -14328 -20170 -18049 -14801 -7483 -2974 -1732 -1274 -7201 -8760 -9371 -8241 -8079 -5975
3005 -5975 -4031 -6006 -9972 -12963 -14555 -12693 -6748 -6039 -5047 441 395 -1847 -9524 -8219 -1685 -5010
2989 -5010 -4777 -3418 -11104 -10072 -3777 1955 2918 2450 1966 -4195 -8513 -9741 -8988 -6124 -3869 -1443
2973 -1443 -5113 -15443 -12792 -11574 -5276 2684 -5243 -3271 1185 -2199 -7943 -1830 5737 9148 12075
2958 12075 8538 7815 2840 -2232 -7583 -15251 -12999 -8646 -4 -2409 -781 -2137 -7650 -9998 -8000
2943 -8000 -7781 -3894 896 -2817 -1406 5212 -1073 -2358 -1333 -7684 655 1411 -2732 -1794 -622 126
2927 126 -3429 -5482 -1156 3202 4240 3567 4339 3327 1452 1331 -2340 -3425 -2112 -2560 1142 -1477
2911a477m262l9m53R92j0585n233K398N205R032N870o959l888N463m360k610O541
2895d365L443j276O59J459K616N058k273p421l529n68J548M619J795m040j810
2880d085M856N47m664l8k995m424K08M023n143N381N861J762J2o590J494J080
2864b715O212L16n0O27q166m860J065L97j452j264K766k195K979P79k231K331
2848e461J0883k018j467j676n212k511l43n92L822Q001L021j236K073K61m444
2833C101q742M572R157k255m256r855K533L399n435l118q40K123j965N727L93
2818e461J525J149L73r09m347K93j219k353K118k164J453J485M65N04J989J960
2802c139L953k685K271j663M310Q251l328j481j195m025K679q296m176m721N486
$$ plain form
2911 -1477 -5739 -5778 -6231 -5239 -15824 -21057 -18659 -13454 -4422 1448 -5511 -9399 -3936 -8296 -10906 -4365
2895 -4365 -922 -2198 -1539 -80 2536 7594 5321 -2100 -5629 -6197 -4649 -30 1765 -2275 -4085
2880 -4085 771 1318 -3346 -3384 -6379 -10803 -10595 -6572 -11715 -6334 -473 1289 1301 -5289 -3795 -2715
2864 -2715 3497 3813 3763 4390 -3776 -8636 -7571 -7174 -8626 -9890 -7124 -9319 -6340 -5561 -7792 -5461
2848 -5461 5422 3404 1937 261 -4951 -7462 -7805 -8397 -4575 3426 6447 5211 7284 7545 3101
2833 3101 -5641 -1069 8088 5833 1577 -8278 -5745 -2346 -7781 -10899 -11739 -9616 -11581 -5854 -5461
2818 -5461 -3936 -2787 -2414 -3323 -7670 -7377 -8596 -10949 -8831 -10995 -9542 -8057 -7592 -7088 -5099 -3139
2802 -3139 814 -1871 400 -1263 3047 11298 7970 6489 5294 1269 3948 -4348 -8524 -13245 -7759
2787g759R126n052p52m227j031j533p351P47N028J3253M225l185l150p468K292
2772f837L298L126L764J463j143l961k445O888J533m693l842l938n484L295j620
2757a0596o507K313N576L246M203N708j426j069q11l485o249m924j031J903N873
2742g276L373O34J816L929K540l926J131m411m402P282N365o201o949K383R958
2727E246Q467q835j889M53j4656l040M227N70j942o59l98N55j83M106K092R99
2711d887p01K429j74p33J108n544o778Q254M591l828K974o56L039J069m289p471
2695a1597O305N531M726k728k861k269L116O613r143r286j316L377L313k710M215
2680d714K976J611k364p465K492M184L52N099j044J115m012J992J551m054r09
$$ plain form
2787 -7759 1367 -3685 -4437 -8664 -9695 -11228 -18579 -17832 -12804 449 4674 1489 -1661 -9129 -6837
2772 -6837 -3539 -413 3351 4814 3671 -290 -2735 4153 5686 993 -2849 -6787 -12271 -8976 -10596
2757 -10596 -17103 -14790 -9214 -5968 -1765 3943 2517 1448 637 -2848 -9097 -14021 -15052 -13149 -7276
2742 -7276 -3903 -3269 -1453 2476 5016 1090 2221 -2190 -6592 690 6055 -146 -7095 -4712 5246
2727 5246 13713 4878 2989 3442 -11214 -14254 -10027 -9457 -11399 -12058 -12456 -11901 -12084 -7978 -5886 -4887
2711 -4887 -5588 -3159 -3333 -4066 -2958 -8502 -15280 -7026 -2435 -6263 -3289 -3945 -906 163 -4126 -11597
2695 -11597 -5292 239 4965 2237 -624 -2893 223 6836 -2307 -11593 -12909 -9532 -6219 -8929 -4714
2680 -4714 -1738 -127 -2491 -9956 -7464 -3280 -2928 2171 1127 2242 -1770 222 1773 -2281 -3190
2665c190N87n645O414L801K890l324K349m430j023J034j945m406M049L425l276
2650b690M552k805l666q20M163J550l506j513o744N246L837O679o689o871L732
2635e545O415p71k208j1084j285j461K742L761O750O58k878M40l463l099K124
2620h904N279J408n733j994j298L412J295J410j561l943J0454N434l926L414O392
2605A1139m605r402l766n176O169O171j001R88J658L398k32m774m629m015K545
2590e532R11L523L381L05L29J886J919n799o724l038L1J374K942j509j453M285
2574c169q66j302J2412P274O076n937j491j413K260O784p71m974j0150j2234J611
2559e890Q886l215n740Q50p30K729l405K754O198J907j663j13n32j658N171j703
$$ plain form
2665 -3190 -2603 -8248 -1834 1967 4857 1533 3882 -548 -1571 -537 -2482 -6888 -2839 586 -2690
2650 -2690 1862 -943 -4609 -5429 -1266 284 -3222 -4735 -11479 -6233 -2396 4283 -2406 -9277 -5545
2635 -5545 870 99 -2109 -13193 -14478 -15939 -13197 -9436 -2686 -2028 -4906 -4466 -7929 -11028 -8904
2620 -8904 -3625 -2217 -7950 -9944 -11242 -7830 -6535 -5125 -6686 -10629 -175 5259 1333 4747 11139
2605 11139 6534 -2868 -6634 -11810 -5641 530 -471 517 2175 5573 5341 567 -4062 -8077 -5532
2590 -5532 -4621 -1098 2283 2588 2917 4803 6722 923 -5801 -8839 -8808 -7434 -4492 -6001 -7454 -3169
2574 -3169 -4035 -5337 7075 14349 20425 14488 12997 11584 13844 20628 19857 14883 4733 -7501 -5890
2559 -5890 2996 -219 -5959 -5109 -5839 -3110 -6515 -3761 2437 4344 2681 2568 2036 378 5549 3846
2543C846p792j268r43k069j632k114L089J639L417O85q435n974m972J7K174J1303
2527i029J736N95L029J60J651j85n838l834N355L904M171n233p10L907j833m083
2511f237n751N169M379K065p2l00n331p320j375K761P600L249M3k040L73J471
2495a316J874n232l992J022p77k4l614m728j703L840J887l75L228k001k636N004
2479i543K337J2496O958m826k005l770J423K266o81K774p577m73O0j639P14j056
2463b542N84q206q05R586M648J778j723n369o716k019L986J486J912K939P76o265
2447e950k156k889n049j805N049R627N939L409k382j997j258l649k908p49k767
2432i535j787L700j547J9k961K834p86l665K727j913L001M333J73J328P264o323
$$ plain form
2543 3846 -3946 -5214 -6157 -8226 -9858 -11972 -8883 -7244 -3827 -3142 -11577 -17551 -22523 -22506 -20332 -9029
2527 -9029 -7293 -6698 -3669 -3509 -1858 -2043 -7881 -11715 -6360 -2456 1715 -3518 -4228 -321 -2154 -6237
2511 -6237 -11988 -6819 -2440 -375 -447 -747 -6078 -13398 -14773 -12012 -4412 -1163 -1120 -3160 -2787 -1316
2495 -1316 558 -4674 -8666 -7644 -8421 -8445 -12059 -16787 -18490 -14650 -12763 -13138 -9910 -11911 -14547 -9543
2479 -9543 -7206 5290 12248 7422 5417 1647 3070 5336 4655 7429 -148 -621 -561 -2200 -1486 -2542
2463 -2542 -1958 -10164 -10969 -1383 3265 5043 3320 -2049 -8765 -10784 -6798 -5312 -3400 -461 315 -5950
2447 -5950 -8106 -10995 -16044 -17849 -12800 -3173 2766 6175 3793 1796 538 -3111 -6019 -6768 -9535
2432 -9535 -11322 -7622 -9169 -9150 -12111 -9277 -10063 -13728 -11001 -12914 -9913 -5580 -5407 -4079 3185 -3138
2416c138k748K746j545m543K224L234j424J641M031l717J69k545r23k066r1k768
2400a1463q080k571P106O483N446J100m627j808J14N382j65L20q6n079n504p88
2384a4220M30N620K937P54n943K540P677n534m991k280K292j88m166P577L294
2369d201q43k278j434K871O884O301j81n854j025N952N74m835L053j931j1895
2354h842m107K35m43J097M770O899M624L142J137Q29o222J28N284n396o21o27
2338A887j570K631K137n266j888m0l590l087N450O953j667j780J322J399l059
2323a68p23O281r71m701p69J504k187j912k080n207L231P414M385P435l21k699
2307H512n200j0483j671M897m720l642O11M012j853M309O773k483K787p181m116
$$ plain form
2416 -3138 -5886 -3140 -4685 -9228 -7004 -3770 -5194 -3553 478 -3239 -3070 -5615 -6538 -8604 -8695 -11463
2400 -11463 -19543 -22114 -15008 -8525 -3079 -1979 -6606 -8414 -8300 -2918 -3083 -2763 -2849 -7928 -13432 -14220
2384 -14220 -13790 -8170 -5233 -4479 -10422 -7882 -205 -5739 -10730 -13010 -10718 -10906 -15072 -7495 -4201
2369 -4201 -5044 -7322 -8756 -5885 999 7300 7119 1265 240 6192 6766 1931 4984 3053 -8842
2354 -8842 -12949 -12714 -13157 -12060 -7290 -391 4233 7375 8512 9341 3119 3247 8531 3135 2514 1887
2338 1887 317 2948 5085 -181 -2069 -2109 -5699 -8786 -3336 3617 1950 170 1492 2891 -168
2323 -168 -891 5390 4419 -282 -1051 453 -1734 -3646 -5726 -10933 -7702 -288 4097 11532 11211 8512
2307 8512 3312 -7171 -8842 -3945 -8665 -12307 -11696 -7684 -9537 -5228 1545 -938 1849 -5332 -9448
2292i448N85L826K772N546J001L863L066n006l356k851j0750M150P181l457r145
2277a2023k709l014O97P05J0038K312k788k47M123M658k045L832O5k30k38L86
2261C522j767j719k00J507k884n101K028M035M896j622K034K683l555n013j482
2246b638j701L532Q344J137j767o921o962J459k94o10P57j8L573J290j446j696
2230c961J713L740N09K142j448M585m660j846J915m063j871j0391L467J0036P42
2215F09j450L314K455Q11j509R349M151k343j3017q833J27m975K457K075m283
2200a1062O046o89L417N353L981j257o291j616m779K813j833P797M515J787J252
2185I434N554L092q944p449L167M438L15p046P28j857J785p152m665o2M451k75
$$ plain form
2292 -9448 -8863 -5037 -2265 3281 4282 8145 11211 6205 2849 -2 -10752 -6602 579 -2878 -12023
2277 -12023 -14732 -17746 -17049 -16344 -6306 -3994 -6782 -7029 -2906 1752 -293 3539 3604 3374 3136 3522
2261 3522 1755 36 -164 1343 -1541 -6642 -4614 -579 4317 2695 4729 7412 3857 -1156 -2638
2246 -2638 -4339 -807 7537 8674 6907 -14 -6976 -5517 -5811 -6421 -5664 -5682 -2109 -819 -2265 -3961
2230 -3961 -2248 1492 2001 4143 2695 7280 2620 774 2689 -1374 -3245 -13636 -10169 -133 609
2215 609 -841 2473 4928 5739 4230 13579 17730 15387 2370 -6463 -6336 -11311 -8854 -6779 -11062
2200 -11062 -5016 -5705 -2288 3065 7046 5789 -502 -2118 -6897 -4084 -5917 1880 6395 8182 9434
2185 9434 14988 18080 9136 1687 4854 9292 9607 2561 3289 1432 3217 -3935 -8600 -8662 -4211 -4486
2169d486r51m851N8J396o54M24L934O422j260j721k063l947l119N189J883m455
2153h201j67p91J898M766N476M000L43p60k713j919k759n855j264K350M632L849
2137B885r4P3K331L216M5L440O187J749o543q321K299j777l233n173l285m288
2121a0489K793P24N933Q818k095r321K768K697l282j44J582l321O55K822n428
2106e288m311m43J635k150L118N127q099J015j566k633O611M446N77J302P692
2091G033M777m678j336J474n500l318q05r77L684P784N28l057J898l988n403N910
$$ plain form
2169 -4486 -5437 -10288 -10230 -8834 -9488 -9064 -5130 1292 32 -1689 -3752 -7699 -10818 -5629 -3746 -8201
2153 -8201 -8368 -9159 -7261 -2495 2981 6981 7324 6564 3851 1932 -827 -6682 -7946 -5596 -964 2885
2137 2885 2791 2864 5195 8411 8456 11896 18083 19832 13289 4968 7267 5490 2257 -2916 -6201 -10489
2121 -10489 -7696 -6972 -1039 7779 5684 -3637 -869 1828 -1454 -1598 -16 -3337 -2682 140 -5288
2106 -5288 -9599 -10042 -8407 -10557 -7439 -2312 -10411 -9396 -10962 -13595 -6984 -2538 -1961 -659 7033
2091 7033 11810 7132 5796 7270 1770 -1548 -2353 -3330 354 8138 8666 5609 7507 3519 -1884 4026
$$ [...]
##END NTUPLES=NMR SPECTRUM
##END=
