##TITLE=Analysis number 307204
Compound Code cc 33116
Book Reference 414/66/3
Project Code adrs
Chemist Name mattw
##JCAMPDX= 6.0         $$ Bruker NMR JCAMP-DX V2.0
##DATA TYPE= NMR SPECTRUM
##DATA CLASS= NTUPLES
##ORIGIN= Bruker BioSpin GmbH
##OWNER= NMR
$$ XWIN-NMR		Version 3.5
$$ Mon Apr 25 08:32:07 2005 GMT Daylight Time (UT+1h)  MAYBRIDGE\NMR@NMR_250MHZ
##.OBSERVE FREQUENCY= 250.131544655141
##.OBSERVE NUCLEUS= ^1H
##.ACQUISITION MODE= SIMULTANEOUS (DQD)
##.ACQUISITION SCHEME= undefined
##.AVERAGES= 16
##.DIGITISER RES= 18
##SPECTROMETER/DATA SYSTEM= dpx250
##.PULSE SEQUENCE= zg30
##.SOLVENT NAME= DMSO
##.SHIFT REFERENCE= (INTERNAL, DMSO, 0, 16.564)
##AUDIT TRAIL= $$ (NUMBER, WHEN, WHO, WHERE, WHAT)
$$ ##TITLE= Audit trail, XWIN-NMR		Version 3.5
$$ ##JCAMPDX= 5.01
$$ ##ORIGIN= Bruker BioSpin GmbH
$$ ##OWNER= NMR
$$ C:\u/data/dgb/nmr/ADRS/2070/pdata/1/auditp.txt
$$ ##AUDIT TRAIL=  $$ (NUMBER, WHEN, WHO, WHERE, WHAT)
(   1,<2005-04-25 08:31:38.54 +100>,<MAYBRIDGE\NMR>,<NMR_250MHZ>,
      <created by zg, POWCHK disabled, PULCHK disabled
       configuration hash MD5:
       62 19 C7 07 E1 42 D1 B7 37 6C 3D D0 77 39 F9 E6
       data hash MD5: 64K
       3D 7F B4 66 1A 0F 70 1A 39 10 79 34 A9 E1 62 E8>)
(   2,<2005-04-25 08:31:53.51 +100>,<MAYBRIDGE\NMR>,<NMR_250MHZ>,
      <Start of raw data processing
       ef LB = 0.3 FT_mod = 6 PKNL = 1 SI = 32K 
       data hash MD5: 32K
       1E BA 4F 5C E4 F9 06 B8 23 00 BC CC 51 9A D9 8C>)
(   3,<2005-04-25 08:31:55.32 +100>,<MAYBRIDGE\NMR>,<NMR_250MHZ>,
      <apk 
       data hash MD5: 32K
       46 AA 24 E7 02 03 E3 13 8D 85 E6 98 09 57 1F B3>)
(   4,<2005-04-25 08:31:56.37 +100>,<MAYBRIDGE\NMR>,<NMR_250MHZ>,
      <abs ABSG = 5 
       data hash MD5: 32K
       20 04 7E 4E A4 12 B5 50 7A FF 28 4E 64 98 CB D8>)
$$ ##END=
$$ 
$$ hash MD5
$$ DC 52 5C 5D CB 27 70 FD 07 3D 34 E3 35 F2 39 E7
##$RELAX= 
##$RELAX= 
##$RELAX= 
##$RELAX= 
##$RELAX= 
##$RELAX= 
##$RELAX= 
$$ Bruker specific parameters
$$ --------------------------
##$DU= <C:\u>
##$EXPNO= 2070
##$NAME= <ADRS>
##$PROCNO= 1
##$TYPE= <nmr>
##$USER= <dgb>
##$AMP= (0..31)
100 100 100 100 100 100 100 100 100 100 100 100 100 100 100 100 100 100 
100 100 100 100 100 100 100 100 100 100 100 100 100 100 
##$AQSEQ= 0
##$AQ_mod= 3
##$AUNM= <au_zg>
##$AUTOPOS= <1 >
##$BF1= 250.13
##$BF2= 250.13
##$BF3= 250.13
##$BF4= 250.13
##$BF5= 500.13
##$BF6= 500.13
##$BF7= 500.13
##$BF8= 500.13
##$BYTORDA= 1
##$CFDGTYP= 0
##$CFRGTYP= 5
##$CHEMSTR= <none>
##$CNST= (0..31)
1 1 145 1 1 1 1 1 1 1 1 1 1 1 1 1 1 1 1 1 1 1 1 1 1 1 1 1 1 1 1 1 
##$CPDPRG= <>
##$CPDPRG1= <>
##$CPDPRG2= <>
##$CPDPRG3= <>
##$CPDPRG4= <mlev>
##$CPDPRG5= <mlev>
##$CPDPRG6= <mlev>
##$CPDPRG7= <mlev>
##$CPDPRG8= <mlev>
##$CPDPRGB= <>
##$CPDPRGT= <>
##$D= (0..31)
0 1 0 0 0 0 0 0 0 0.06 0 0 0 0 0 0 0.0002 0 0 0 0 0 0 0 0 0 0 0 0 0 0 
0 
##$DATE= 1114414297
##$DBL= (0..7)
120 120 120 120 120 120 120 120 
##$DBP= (0..7)
150 150 150 150 150 150 150 150 
##$DBP07= 0
##$DBPNAM0= <>
##$DBPNAM1= <>
$$ [...]
##$SUBNAM7= <"">
##$SUBNAM8= <"">
##$SUBNAM9= <"">
##$SW= 20.6930455092707
##$SWIBOX= (0..15)
0 0 3 0 0 0 0 0 0 0 0 0 0 0 0 0 
##$SW_h= 5175.983436853
##$TD= 65536
##$TD0= 1
##$TE= 295.16
##$TE2= 300
##$TE3= 300
##$TEG= 300
##$TL= (0..7)
0 120 120 120 120 120 120 120 
##$TP= (0..7)
150 150 150 150 150 150 150 150 
##$TP07= 0
##$TPNAME0= <>
##$TPNAME1= <>
##$TPNAME2= <>
##$TPNAME3= <>
##$TPNAME4= <>
##$TPNAME5= <>
##$TPNAME6= <>
##$TPNAME7= <>
##$TPOAL= (0..7)
0.5 0.5 0.5 0.5 0.5 0.5 0.5 0.5 
##$TPOFFS= (0..7)
0 0 0 0 0 0 0 0 
##$TUNHIN= 0
##$TUNHOUT= 0
##$TUNXOUT= 0
##$USERA1= <user>
##$USERA2= <user>
##$USERA3= <user>
##$USERA4= <user>
##$USERA5= <user>
##$V9= 5
##$VALIST= <valist>
##$VCLIST= <CCCCCCCCCCCCCCC>
##$VD= 0
##$VDLIST= <DDDDDDDDDDDDDDD>
##$VPLIST= <PPPPPPPPPPPPPPP>
##$VTLIST= <TTTTTTTTTTTTTTT>
##$WBST= 1024
##$WBSW= 4
##$XGAIN= (0..3)
0 0 0 0 
##$XL= 0
##$YL= 0
##$YMAX_a= 303188
##$YMIN_a= -280393
##$ZGOPTNS= <>
##$ZL1= 120
##$ZL2= 120
##$ZL3= 120
##$ZL4= 120
##$ABSF1= 16.56396
##$ABSF2= -4.129215
##$ABSG= 5
##$ABSL= 3
##$ALPHA= 0
##$AQORDER= 0
##$ASSFAC= 0
##$ASSFACI= 0
##$ASSFACX= 0
##$ASSWID= 0
##$AUNMP= <proc_1d>
##$AZFE= 0.1
##$AZFW= 0.1
##$BCFW= 0
##$BC_mod= 0
##$BYTORDP= 0
##$COROFFS= 0
##$CY= 12.5
##$DATMOD= 1
##$DC= 0
##$DFILT= <>
##$DTYPP= 0
##$F1P= 14.0000005364418
##$F2P= -0.99999901652339
##$FCOR= 0.5
##$FTSIZE= 32768
##$FT_mod= 6
##$GAMMA= 0
##$GB= 0
##$INTBC= 1
##$INTSCL= 1
##$ISEN= 128
##$LB= 0.3
##$LEV0= 0
##$LPBIN= 0
##$MAXI= 10000
##$MC2= 0
##$MEAN= 0
##$ME_mod= 0
##$MI= 0
##$NCOEF= 0
##$NC_proc= -6
##$NLEV= 6
##$NOISF1= 0
##$NOISF2= 0
##$NSP= 0
##$NTH_PI= 0
##$NZP= 0
##$OFFSET= 16.56396
##$PC= 1
##$PHC0= -79.96152
##$PHC1= 7.544764
##$PH_mod= 1
##$PKNL= yes
##$PPARMOD= 0
##$PSCAL= 4
##$PSIGN= 0
##$REVERSE= no
##$SF= 250.129989502589
##$SI= 32768
##$SIGF1= 0
##$SIGF2= 0
##$SINO= 400
##$SIOLD= 32768
##$SREGLST= <1H.DMSO>
##$SSB= 0
##$STSI= 32768
##$STSR= 0
##$SW_p= 5175.98343685301
##$SYMM= 0
##$S_DEV= 0
##$TDeff= 65536
##$TDoff= 0
##$TI= <Analysis number 999999
Compound Code 99
Book Reference 9
Project Code 9>
##$TILT= no
##$TM1= 0
##$TM2= 0
##$TOPLEV= 0
##$USERP1= <user>
##$USERP2= <user>
##$USERP3= <user>
##$USERP4= <user>
##$USERP5= <user>
##$WDW= 1
##$XDIM= 32768
##$YMAX_p= 443896987
##$YMIN_p= -1281173
$$ End of Bruker specific parameters
$$ ---------------------------------
##NTUPLES= NMR SPECTRUM
##VAR_NAME=  FREQUENCY,     SPECTRUM/REAL,   SPECTRUM/IMAG
##SYMBOL=    X,             R,               I
##VAR_TYPE=  INDEPENDENT,   DEPENDENT,       DEPENDENT
##VAR_FORM=  AFFN,          ASDF,            ASDF
##VAR_DIM=   32768,         32768,           32768
##UNITS=     HZ,            ARBITRARY UNITS, ARBITRARY UNITS
##FACTOR=    0.157963299565203, 1,           1
##FIRST=     4143.14292123316, 0,            0
##LAST=      -1032.84051561985, 0,           0
##MIN=       -1032.84051561985, -1281173,    0
##MAX=       4143.14292123316, 443896987,    0
$$ Real data points
##PAGE= N=1
##DATA TABLE= (X++(R..R)), XYDATA
$$ [...]
30404 -519746 -527944 -412829 -49165 -104916 27901 81276 15634 -171182 30896 55624 -17258
30393 -17258 7260 84846 183292 532580 391132 256505 327902 238604 254375 254518 426233
30382 426233 410779 170194 -2930 176553 201794 253937 246412 311232 616672 597910 427408
30371 427408 182439 334697 371400 161338 149432 212538 -39714 -290643 132551 440437
30361 440437 487231 269537 18102 -96357 -235138 -117215 -57087 -344649 -290709 -42729
30351 -42729 28128 -61074 61828 312223 601316 680048 483531 83543 -81542 89155
30341 89155 190343 272524 308107 -203979 -444441 -494466 -419689 16434 112717 -159355 -284437
30330 -284437 -219961 -135858 -86259 -160234 107490 100266 43140 -40122 -303613 -155192 68339
30319 68339 -128892 95245 111205 462458 591510 306000 108588 29645 500794 481999
30309 481999 102914 -71343 -33294 28398 207861 314665 156500 121715 -15487 -117861
30299 -117861 -116520 29918 -89307 -236489 59691 527656 512737 180008 -132912 -234997
30289 -234997 -81165 -148249 44343 240843 105490 -18653 333847 358455 232274 123486
30279 123486 -60332 -438970 -470653 -298172 -288139 -89873 149202 364967 218786 105229
30269 105229 -67607 78324 63947 -14161 -190271 -305048 -231493 -28735 195993 627692
30259 627692 614446 249642 296211 347093 227435 181794 -139923 -245436 -316863 -452909
30249 -452909 -515509 -234777 -110836 -269539 -312475 -241568 190957 230792 351053 489256
30239 489256 420276 619884 694492 687846 773639 952213 993736 869827 884054 930311 820557
30228 820557 395999 105928 -221704 -297184 -309357 -227534 -9762 49463 -493380 -759773
30218 -759773 -575603 -328452 11125 -37043 66603 -10700 124596 204339 10418 -11442
30208 -11442 84883 316913 74242 -172081 -159245 29711 211749 325568 339823 220714
30198 220714 519411 778318 527164 201394 225584 59698 -238937 -421175 -529843 -339867
30188 -339867 -101248 -173303 -120436 -95209 -323805 -464121 -2524 -40556 -345473 -313116
30178 -313116 -230398 -166319 -267551 -61459 -345194 -476967 -274057 -9606 211995 -123846
30168 -123846 121714 586199 585059 576439 519871 92538 -196560 -332905 -331051 -175083 -175423
30157 -175423 -309296 -121936 -154575 -461028 -299624 113570 137113 286931 296930 142949
30147 142949 284116 265841 140790 249328 286686 -5219 -94976 10423 18531 303824
30137 303824 254355 -105418 -165292 -285795 -132573 -112293 5657 188151 95805 256158
30127 256158 218207 -163103 -377419 -330550 -64847 -42186 191685 36360 -392393 -30652
30117 -30652 425620 327331 139893 55491 39357 93568 291064 127556 374147 531589
30107 531589 526725 204991 -131850 -233106 -215393 -12037 102795 166287 113824 -13894
30097 -13894 39119 -11138 120819 405583 493261 357386 269857 627475 923044 735001
30087 735001 450325 390637 523565 735326 646428 98187 213143 630073 643025 248701
30077 248701 129889 136688 323529 278384 92078 175839 297376 279666 264503 213628 308631
30066 308631 627575 436783 186639 -114178 -31463 78853 178526 179152 181026 88923 -211595
30055 -211595 -141775 -150811 -30650 -41049 -257476 -227496 110459 337028 435490 158200 188252
30044 188252 414935 499608 449747 400171 410758 378335 -51337 -262787 -215570 48615 233364
30033 233364 313145 367982 312774 357546 163737 17649 -133627 -310897 -509593 -365382
30023 -365382 -81046 -193125 -247916 106712 644587 705918 225934 -4385 297141 626699
30013 626699 421352 287862 213531 137149 254048 193969 198008 152590 179143 61077 21549
30002 21549 -203959 -458855 -552599 -395729 -216467 -344505 -212014 31717 -308839 -600760
29992 -600760 -639120 -501093 -364770 -108056 94824 6869 -143632 -493135 -464096 -452498
29982 -452498 -232260 -35235 163811 168729 -218590 -363691 -34281 117216 14034 -252101
29972 -252101 -340960 -102827 466822 335509 134829 -135040 -423695 -611032 -713998 -607189
29962 -607189 -458634 -158492 -37284 -16511 150289 119467 -195066 4041 188156 121442
29952 121442 141541 290925 448460 134874 -191375 -402686 -566764 -315395 9807 117166
29942 117166 -31304 -169985 -286701 108346 436211 263282 171882 99830 10079 289213
29932 289213 -226048 -560383 -218780 189352 460360 291668 -3184 -34482 -111405 -339004
29922 -339004 -355806 -2240 48513 -111789 -101972 -150619 -259891 205707 203083 -275509 -435699
29911 -435699 -527982 -339523 62926 376123 458110 280018 101657 -53841 197428 23444
29901 23444 -72142 -183001 -388689 -450009 -333537 -307660 -269412 -218485 -2018 149834 129280
29890 129280 11267 -4919 -38543 -181140 -375453 -394113 -281899 -259390 39758 178559
29880 178559 139820 159312 185289 202842 351999 489909 479567 648079 624766 307594 487686
29869 487686 530598 153926 86357 2524 16077 -70178 -165095 -410039 -274910 -509228 -398615
29858 -398615 -212959 -260051 -411792 -352287 -299264 -42698 63163 250932 394553 328959
29848 328959 363324 343643 344058 422306 535673 546053 686070 568631 554767 442979 378766
29837 378766 371387 277646 188489 -1908 -220478 -272878 -279010 -507457 -710097 -315239 -280466
29826 -280466 -459873 -371454 -139944 -15584 -18062 20552 259426 315726 175759 -181641
29816 -181641 -128570 303728 354302 408016 356085 358541 399379 217837 28722 -12912 -308319
29805 -308319 -331724 179005 313366 437902 555279 182260 -137811 -97907 72144 512125
29795 512125 619962 598670 72617 -208408 -336225 -445512 -479062 -84293 -183339 -189406
29785 -189406 28141 26251 117418 -232721 -475261 -169976 48647 235371 323418 229444
29775 229444 454700 533163 111166 -307529 -498937 160303 598380 533658 495950 559933
29765 559933 412465 62796 283373 476264 312253 499288 666349 460368 256837 -145880
29755 -145880 -38543 196038 193111 -27769 -191686 -210609 -315926 -348057 -207156 -240622
29745 -240622 -151810 -89506 -2693 398037 581272 260363 222342 106155 25743 -276445
29735 -276445 -542344 -327888 -74630 41393 -248995 -243442 -290795 -133891 195783 246436
29725 246436 -151415 -49484 108572 36717 -10627 353730 339041 -65570 -96947 -19613
29715 -19613 55708 -90517 296694 377480 70238 229294 229953 -63899 -133998 -32464 126855
29704 126855 283697 347240 270932 315585 338168 71012 169122 285662 144564 182056 193244
29693 193244 364637 214175 -22479 201335 10477 -470291 -619048 -611495 -615036 -516938
29683 -516938 -695028 -660004 -264170 -37473 177294 387373 287306 241973 -142 -242690
29673 -242690 -505502 -274067 295308 516095 367447 232116 -976 206845 247517 405195
29663 405195 126762 -71667 -107227 68466 -57107 -4519 44361 433461 698450 470064
29653 470064 28014 -86320 -129593 -143495 -161183 -47491 57767 101768 211631 156561
29643 156561 260047 337160 223279 16209 205233 -51637 -268603 -268777 -349712 -265371 -120066
29632 -120066 -150696 -390148 -424113 -25654 278477 489460 282365 4700 -40763 -373373
29622 -373373 -592085 -266225 -50804 -66696 205598 302129 -116545 -367810 -364502 -128497
29612 -128497 136757 384447 562251 340544 135270 138569 117936 -288829 -336717 -353594
29602 -353594 -307969 -68066 186411 237401 213922 129028 291441 449233 705219 501533
29592 501533 264668 521056 607037 136274 -328618 -548651 -582156 -437676 -304183 -136509
29582 -136509 -103345 96119 193237 264394 432736 91033 -9794 -122784 15921 267002
29572 267002 236236 150708 301877 226944 361118 167176 -317631 -122093 30878 128239
29562 128239 98339 189252 126748 84095 -1381 -10685 -163507 -203582 -208883 -140370 286103
29551 286103 528020 556628 416749 143624 -124697 -53161 61171 290617 263421 283728
29541 283728 408417 321017 97677 47359 -72288 199314 363644 250133 -47508 137392
29531 137392 308054 -204368 -552415 -315630 -338684 -369685 -279404 -408839 -432493 -316293
29521 -316293 -500694 -585758 -502865 -349406 -680521 -518384 -266481 -344195 -366508 -399067
29511 -399067 -534904 -286767 -207410 -213193 -314214 -262697 -348018 -538160 -699487 -554573
29501 -554573 -209722 -315743 -378146 -480634 -555647 -32848 260953 216369 -3372 -93639
29491 -93639 -158365 -207866 39 436237 678315 663263 432123 278273 235901 132414
29481 132414 -80334 72271 169947 197724 242103 165004 -89612 226613 468629 142320
29471 142320 -194719 -325365 -155941 -202023 -130478 46722 331718 331404 20267 -229157
29461 -229157 -410506 -128455 188798 19622 -4871 247022 157995 171162 430426 296060
29451 296060 84316 186180 188335 307932 84964 -311823 -355847 52147 297877 196352
29441 196352 149301 -34835 -324709 -81365 -68370 -168096 -481457 -504507 -302276 -263437
29431 -263437 -322297 -388432 -395827 -275497 148546 262098 -12305 -142697 -40882 186940
29421 186940 148680 221211 -53918 -53691 -1132 -300128 -739215 -607958 -438340 -406522 -251319
29410 -251319 -155498 -430002 -256270 126000 242945 -45766 203310 204400 -157725 -347646
29400 -347646 -136970 -235046 -442633 -702183 -350824 -357170 -187758 -231583 -4347 124769
29390 124769 -106944 248164 -32522 -493861 -450965 81324 -58136 115537 305593 -107040
29380 -107040 -35978 578603 473043 70315 105390 55572 -196985 32542 307013 473505
29370 473505 435592 344413 -88270 -395108 -116427 96702 283050 299067 119411 177909
29360 177909 -160013 -177469 292827 638928 516521 54373 126615 -3637 158128 253633
29350 253633 -69038 23902 -121015 -271807 -249952 -329937 -507361 -265606 192930 208280
29340 208280 220678 380525 495070 840983 718992 412125 -117769 11390 -413776 -650064
29330 -650064 -405853 -202116 -231074 -265225 101584 286434 -7740 -85434 -75038 75470
29320 75470 249938 465738 585800 472845 261161 -236357 -125429 -136313 -110540 66649
29310 66649 2125 -259459 -421413 -277604 52010 5318 -102775 -88494 -385301 -581245
29300 -581245 -408974 -182788 -444932 -325224 260206 470692 580870 293893 280836 118440
29290 118440 -4318 247372 300308 109256 54793 -32491 -160318 75172 -119582 -390337
29280 -390337 -154510 23990 197644 68871 -202598 -338491 -32954 53450 -196247 -227759
29270 -227759 -130115 16695 -135634 -323354 -430182 -309040 -30606 -252014 -266423 -115342
29260 -115342 -43427 -101837 -238645 -99593 93555 -278316 18684 109961 15762 -195671
29250 -195671 -194343 -276682 -393623 80223 313153 320888 288279 169469 -166441 -60698 -22308
29239 -22308 -69343 50711 -52213 -146639 -361502 -380368 -307052 -44240 -34485 52870 -80062
29228 -80062 -119690 76484 209592 -184447 -503898 -816303 -653188 -424244 -286178 -205641
29218 -205641 -226326 -185834 -218018 -261013 114229 137464 157826 19658 43337 -79845 -543190
29207 -543190 -342425 -284312 34316 408057 461877 370784 -74444 -54769 174546 255556
29197 255556 143395 171463 269215 336963 621900 677561 80535 -273541 -288601 -244491 -4881
29186 -4881 57152 -45275 88411 158438 201977 123290 -21298 -21897 98806 174907 50945
29175 50945 -347 152616 407360 632323 676000 349609 277283 229415 267144 335962 486225
29164 486225 256324 69050 188007 480433 224534 209071 488872 802959 686159 565943
29154 565943 657723 503352 602960 151178 -133500 410999 577193 521841 414492 436484
29144 436484 350370 418621 661843 516670 572032 457816 685363 728066 421368 187690
29134 187690 283790 426992 336407 180755 326039 555357 329351 330200 623646 305909
29124 305909 303517 317954 -114684 -265987 -345860 -334272 -270077 -11552 230116 110880 87110
29113 87110 98845 22624 -249366 -269594 -101842 -266659 -42084 165909 41973 -80166
29103 -80166 307394 111694 -510871 -410111 -172854 194472 502090 562581 379386 143798
29093 143798 194188 257262 233725 229056 60780 -381302 -326059 -208943 -124423 153154 233427
29082 233427 247794 -120004 -379761 -284655 -90501 36896 144008 95891 5656 20047
29072 20047 167870 69520 -232923 61001 56786 -255693 -34190 -44194 514547 770244
29062 770244 439309 416995 375296 204970 142106 108045 245283 120237 -102071 -244227
29052 -244227 -91412 162438 567515 231204 -223307 -162306 -225731 -181753 -68085 -58543
29042 -58543 -9609 122408 -295365 -387194 -259716 238720 131120 -378836 -651834 -733620
29032 -733620 -422312 -448044 -225191 55042 -69364 -161797 -161845 -215051 -135301 -178610 -5537
29021 -5537 253638 464009 318264 236429 463583 399595 218408 156913 -447496 -277263
29011 -277263 225911 394801 326649 415795 403044 339624 221663 -94678 -192751 -102403 -216138
29000 -216138 -429577 -598555 -420212 -75926 -80563 -237217 -92889 108098 -134960 -257011
28990 -257011 -89519 353842 92161 -341220 -408488 -395093 -430482 -93454 250880 60024
28980 60024 117225 141482 -44673 -81474 116485 123685 232073 531143 614782 482294 448516
28969 448516 565137 820090 796354 551249 330104 414504 566642 487009 337606 116066
28959 116066 96580 176105 282171 -339586 -615521 -191996 133239 278723 124035 262825
28949 262825 186536 -23438 447849 364930 260437 331249 638822 703919 651376 317946
28939 317946 15574 -301128 -374895 -172596 -37308 46264 85584 3617 -158457 -174170
28929 -174170 206127 355009 237365 -81235 -27346 23346 183550 482916 465800 124312
28919 124312 -377819 -632069 -349619 131865 170254 46320 275477 714429 844405 757094
28909 757094 313091 61955 396124 773655 931988 837630 996112 837049 780418 516786
28899 516786 189900 -84770 -306591 -331946 -239291 -215399 -79128 71851 595737 676485
28889 676485 341166 379598 332573 476601 301703 180201 194840 351698 233598 398290
28879 398290 473673 260699 465914 497643 495959 522487 574891 353593 177416 604332 648581
28868 648581 349581 243108 -137250 -308052 -127211 82877 128753 13731 -308654 197972
28858 197972 552217 426522 311689 134960 137274 218718 264572 373827 387369 11269
28848 11269 -39773 -213426 -142770 -320643 -607582 -219831 144086 37258 143635 52757
28838 52757 295048 269879 135272 289463 511627 490465 585238 761913 722232 504407
28828 504407 464621 410785 338362 466816 212303 95291 70437 44361 47968 -158076 -461353
28817 -461353 -214280 328954 363453 5865 -79784 -183710 -268323 266158 347968 267613
28807 267613 400310 515251 404232 284646 81743 189049 118743 273742 119943 -165692
28797 -165692 -121798 383692 301529 253414 222282 170488 403836 705229 596187 414944
28787 414944 515818 680671 656773 518056 356878 -17136 -78731 -123134 -261363 -394041
28777 -394041 -341441 -245266 -191407 -244273 -282024 -107616 137058 341164 76878 -145968
28767 -145968 -309567 -262000 -573491 -662183 -403457 176895 452410 349783 292142 527006
28757 527006 537030 199346 60176 104551 -307398 63695 195210 50776 -61760 27834
28747 27834 142215 -22249 199831 341978 4900 -285992 -90282 227883 220735 113730
28737 113730 329887 672540 610819 157699 -138163 -57760 112483 171952 306471 559319
28727 559319 516531 245663 138260 228361 -29074 -61203 -141613 -91420 -25901 4158 -121248
28716 -121248 -488467 -653463 -279471 195388 139118 -115267 -177068 -109360 -227894 20615
28706 20615 235571 183485 153225 -35600 46095 311937 252126 -5906 94926 185705 -2219
28695 -2219 -138307 -68240 37549 97022 -70206 -160508 -226173 35856 252924 352396 587647
28684 587647 383707 385272 769339 954449 477164 170149 38508 215676 679941 990526
28674 990526 920405 759375 460609 540261 312839 39234 79042 -210144 -351171 -242144
28664 -242144 -429176 -409553 -336534 -248461 -168692 51354 -76245 -441213 -318930 -85837
28654 -85837 -194458 -2682 -17188 -83615 12204 -18610 -9745 -53842 37872 -14870 273342
28643 273342 326805 233145 -70248 -117390 -284384 -526253 -518215 -377860 -158742 -47394
28633 -47394 -295316 -169671 -48616 110331 188393 127871 235671 132428 217484 358527
28623 358527 328365 -44023 -211831 -62194 112618 265150 16019 -151504 -72267 240691
28613 240691 263978 -42267 89874 273161 99665 -245227 -280355 -19377 -9422 -175257
28603 -175257 -80142 1305 3260 -25906 145124 523641 429419 623963 86124 -471361 -403492
28592 -403492 -197323 -229861 -242810 -151121 -63720 -802 -177594 -206081 117273 490827 397869
28581 397869 104761 188074 556462 335076 316116 363574 336226 -67509 -11336 -44899 -123590
28570 -123590 269578 373515 164908 240844 -43371 -297715 -140256 -139640 -34251 117720
28560 117720 48934 108866 262323 215309 38811 104756 412640 232396 359371 334450
28550 334450 523341 651674 341097 58263 -32537 -154867 -213021 -129588 178205 325623
28540 325623 256754 -132316 9011 15513 -169261 -23591 -219055 -276745 -416246 -592263
28530 -592263 -173469 -197928 -415503 -170044 -8055 181743 204596 243419 184439 55813
28520 55813 135706 185948 -27253 149841 216102 193723 -171175 -324784 -153864 214407
28510 214407 530312 564483 39877 -280518 -379592 -637986 -657420 -503084 -371357 -249650
28500 -249650 -99876 26485 115643 107281 40794 -108797 -20423 101842 -591210 -716416
28490 -716416 -739230 -679145 -259955 -72105 -1040 -53507 -302903 -475772 -599711 -349804
28480 -349804 248183 439543 210766 90807 -43841 -360814 -338858 -224298 -100260 -109390
28470 -109390 -35656 -7464 -42599 -171891 135820 532156 629966 462861 -81298 -364721
28460 -364721 -359187 -386672 -242485 39794 99384 104296 326842 349471 446648 220996 93591
28449 93591 258915 150259 14582 -239826 -199063 -18956 137921 453429 740031 605230
28439 605230 304401 -90304 -15633 126900 -61011 -161764 -154032 69863 129774 48092
28429 48092 273641 225217 69555 156922 198397 355876 474374 275670 202967 294253 280949
28418 280949 449439 309463 520467 433051 -86029 -140190 79193 204175 -231842 -127669
28408 -127669 167838 268379 266198 -59014 -4909 -169708 -476991 -216550 26406 274176
28398 274176 90314 54475 -151820 -66033 -217629 -217982 -235902 -120505 -14650 32696 -115237
28387 -115237 -102844 -57000 46258 102967 56477 -1051 -34401 105736 272609 278903 422163
28376 422163 496823 263454 278097 373510 472517 571698 8589 -94850 151422 678965
28366 678965 661037 243615 -40325 -250103 -103675 -131227 -313646 -42709 -103638 -124388
28356 -124388 -77419 119414 297362 170347 -50998 -25656 -122288 -131635 3812 212451
28346 212451 -115045 -424403 -273381 -404213 -509815 -199281 -134837 204922 -48464 -315878
28336 -315878 -321942 -87673 209416 481495 695722 308681 -30736 142447 263019 493850
28326 493850 555036 556680 745965 713801 266948 -33728 -303166 -83457 -82480 -169903 306966
28315 306966 924456 813370 292675 89988 121843 -103442 -275696 -54676 190176 369410
28305 369410 459403 634303 538409 19811 -321570 -181792 -84920 -79341 -194664 -152986 -219178
28294 -219178 -512062 -224776 -76753 211063 365683 507219 84485 163436 45022 -238261
28284 -238261 -339843 -254775 -44348 174804 277906 441568 80554 -165586 -64676 348784
28274 348784 540426 715432 689975 340514 -7081 144338 227473 203559 364805 391509
28264 391509 171520 346690 498921 164981 -154285 158558 441017 712993 608884 595183
28254 595183 246808 80849 180483 369178 591805 477720 248305 154543 137501 367945
28244 367945 327519 -179312 8003 -115876 6868 325375 450067 452795 683586 826750
28234 826750 869537 819816 527895 365092 423105 454001 410934 312235 383268 206323 -28124
28223 -28124 28842 60167 7928 -145746 -22859 189097 75275 56328 -40734 -170190 -268725
28212 -268725 -346704 -517262 -627723 -652846 -545765 31288 62140 -325509 -378536 -337984
28202 -337984 -188448 90991 24073 -338473 -649468 -524946 -326045 -201442 -128348 -25101
28192 -25101 40382 -80160 140022 170237 149794 198326 13285 -821 408198 601494 884746
28181 884746 629073 -86346 -319668 -253908 -7084 93476 111078 172360 49704 322034
28171 322034 424561 480023 447069 435840 271138 59687 81651 -81660 -40541 109285
28161 109285 212666 438223 314833 351414 252097 187113 173631 -19436 19467 245795
28151 245795 58720 107891 18538 -86056 -268029 -49602 -180269 -64509 65278 -176916
28141 -176916 -180311 60308 -16738 -52258 -131640 -213480 3941 271170 1988 -366273 -418233
28130 -418233 -427140 -193870 -84697 -202100 241098 422791 274467 -150246 -209063 -4623
28120 -4623 381646 336165 -59307 -53867 -225170 -437902 -241502 -122227 -138632 31107 76061
28109 76061 -33472 26145 141835 257994 556762 797457 706702 366675 78008 9123
28099 9123 -64244 -101809 56027 347275 389325 507968 500889 438188 593454 589374 393061
28088 393061 278730 248482 49093 -98541 256149 457205 271927 534934 702599 228617
28078 228617 7424 327429 326527 126594 -101536 -210548 -113390 -217770 -261117 -247748 -211412
28067 -211412 -156631 -104890 -219358 -248683 -232915 48238 214077 245510 -122352 25133
28057 25133 408069 744162 474158 601771 461825 -59188 -149893 365355 469194 516189
28047 516189 390233 154593 239482 187694 -238063 -556773 -386094 -49368 234581 231548
28037 231548 -352055 -631085 -316920 6934 -42218 68483 -59438 -166090 46313 208028
28027 208028 143588 161516 457984 439054 270700 261684 145567 348436 405839 486623 565556
28016 565556 744205 715199 410210 67165 -162517 -112829 133954 274591 227943 309311
28006 309311 164310 -74599 -134110 -377722 -292674 -230129 -196133 -151799 -438945 -484273 -328352
27995 -328352 -322067 -80024 287780 396073 241735 220647 126814 257281 399376 540979
27985 540979 686891 655952 528187 439520 379130 440276 476742 292247 2883 51072 -110181
27974 -110181 -408844 -355326 -265482 -156985 -103863 -169860 -206561 -218839 -315349 -252501 122507
27963 122507 214496 219367 240405 13128 -201367 -144696 105144 305009 210865 139967 128520
27952 128520 499740 524261 623741 448249 -66694 -234238 -256922 -100518 63557 287060
27942 287060 227090 121414 364395 490942 293045 144814 168105 475299 223058 202689
27932 202689 438926 432799 340417 598118 312845 276457 362420 125688 134124 -49627 55970
27921 55970 463642 612008 654387 775175 991439 755655 459052 497634 409422 496316
27911 496316 412654 426002 231093 -21907 -571275 -754464 -502151 -380353 -214838 -77118
27901 -77118 214651 127768 326938 391194 172337 -55782 -106649 -102129 -174540 -428121 -487044
27890 -487044 -42835 18102 61108 217345 126517 176338 528203 490662 407792 353258 197359
27879 197359 398656 403925 192783 459122 733174 580551 207024 74487 -140191 -237965
27869 -237965 -63671 529022 675438 457451 -84466 -214592 -302449 -88778 311686 387767
27859 387767 467712 445059 54925 -120920 -201467 30597 -47964 -264110 -386111 -291987
27849 -291987 -122086 -59206 -140076 109789 100792 205175 323449 267768 56364 -55980
27839 -55980 378115 566371 316797 344268 300403 221311 308322 490122 498351 231131 125724
27828 125724 165902 34320 -117872 -242811 -417375 -461425 -496639 -479709 -537435 -509311 -388915
27817 -388915 -348262 -349165 -283861 69552 243294 122977 298383 391988 22419 2010 -234613
27806 -234613 -241930 31176 98153 177254 333362 93321 137989 139952 152616 8760 183924
27795 183924 394096 565338 602858 470455 686453 769006 449209 202232 -216019 -32799
27785 -32799 -149137 -303402 -256742 -150769 68450 220182 130474 203814 415403 315608
27775 315608 201501 216332 144742 189204 20665 -111191 166031 235436 455628 226787
27765 226787 -147557 88887 331171 268853 316598 461442 370325 373941 229556 991
27755 991 36100 237529 321479 363509 672244 645990 442879 137062 -78093 -301900 -381044
27744 -381044 -374210 -121087 119336 270373 148733 -78953 -19240 297350 554619 602974
27734 602974 -5608 -186611 322750 396239 164174 106657 130420 -17597 -306491 -48449
27724 -48449 -256900 -180563 83954 212615 347985 473554 298224 254829 182925 197774
27714 197774 380408 239809 -185229 -372043 -274124 72289 397993 382798 440798 379732
27704 379732 316611 397427 298753 441924 504090 343241 547903 495713 797890 649410
27694 649410 246403 203391 291012 245624 -103855 -139663 183278 582879 472561 338003
27684 338003 248492 48410 129454 58981 132267 64662 25822 -81384 -75767 -16456 49694
27673 49694 -76333 61332 45211 367987 382448 561549 594145 490735 172381 -90056
27663 -90056 -333637 -174413 145653 153708 151643 100604 50849 513550 927467 922838 590359
27652 590359 489307 446153 567310 609311 299776 -50203 -522682 -665550 -404064 -96844
27642 -96844 187408 329390 227695 211712 252070 199704 88854 -84510 15940 245776
27632 245776 145355 -45378 -275336 -336766 -286893 -160944 -78706 -76146 15785 249989 112362
27621 112362 365978 402241 119839 -55918 -142696 -124423 -109757 -325146 -575448 -779853
27611 -779853 -721355 -360544 29544 224980 323524 244749 181527 107728 -195996 58833
27601 58833 297956 292694 158954 482040 758271 324493 383745 343003 245956 342871 392570
27590 392570 280210 -90270 -160649 24249 82137 82355 310967 129478 155466 196221 389504
27579 389504 537836 299634 58849 -349482 -199316 142619 -152417 -216954 -228217 108658
27569 108658 606685 782859 734707 481624 224956 296604 -161410 -247653 -175594 167489
27559 167489 183293 157958 448881 290294 355926 491849 445699 -26329 -20303 265646 -936
27548 -936 55642 192717 216683 -99566 -35494 -230266 -189749 -347575 -485694 -640682 -651011
27537 -651011 -332631 92228 103199 269179 240172 21657 -20735 56431 234990 163515
27527 163515 382178 519675 424428 281278 -79901 -455932 -304559 -323482 -241795 151933
27517 151933 399860 344129 556157 711048 947764 992041 740358 594367 645986 638856
27507 638856 176844 -140966 -17900 -69255 -112040 -298264 -575097 -296615 -4243 91422
27497 91422 197926 198830 201443 48910 -11019 -17647 -100035 -169257 -268639 -121421 -189474 -91267
27485 -91267 -276550 -162372 -84761 -223376 -421377 -583777 -752542 -738152 -671053 -346913
27475 -346913 -327502 -242610 77210 -35361 -46344 -150156 -163650 -529423 -801459 -678614
27465 -678614 -646945 -269516 326114 464089 245615 115078 -175977 -282896 -292666 -9257
27455 -9257 174110 188996 339569 325621 281559 92033 38166 137042 175793 289296 56605
27444 56605 71318 -136934 -126186 -95809 -128340 -5006 174484 199286 300356 6288 -188851
27433 -188851 47734 267692 331116 -121518 -106519 -205599 -18413 67012 -212439 52563
27423 52563 132611 61125 -76281 -185581 -312421 -26557 -63380 -207683 51816 314915
27413 314915 -248657 -385461 -21065 74769 -38889 -116269 -59821 -21452 -62523 244978
27403 244978 84569 27004 250223 445689 376205 447007 348338 353386 154340 -61213 -119616
27392 -119616 -203835 38684 135113 158254 -36546 170615 55554 -144150 -164141 -215992
27382 -215992 -340438 -580176 -259704 -144115 170931 225761 -75909 104906 -124370 49022
27372 49022 240776 220401 413269 263744 572033 668350 456529 120982 21871 -9381
27362 -9381 -209417 249412 441978 384281 272712 166595 111041 185787 26814 -97429
27352 -97429 185793 171738 -278395 -495465 -525413 -90971 403684 702929 463867 -31576
27342 -31576 81918 324635 359117 419259 309635 428664 516811 244926 151267 81344 -144969
27331 -144969 -162991 -215661 -12148 278584 369121 291369 24607 -124422 -155261 22305
27321 22305 127723 -45953 -302378 -546594 -447719 -232687 -50051 97724 271705 153119
27311 153119 -72069 -407410 -236036 -177553 -274952 -183051 -506929 -401976 -59087 71333
27301 71333 183097 443458 617048 551612 280888 214751 412822 379476 290966 378372 539544
27290 539544 513005 494241 307869 525796 631749 385488 257985 155935 44129 351733
27280 351733 208608 5707 -13755 60011 -9117 -9816 -37265 48911 425209 709013 549330
27269 549330 450872 557130 607607 207123 232880 173467 15701 317478 528498 377395
27259 377395 70049 -169340 -246178 -231831 -170830 -83580 -137735 -38743 -293059 -566280 -164276
27248 -164276 62439 -557662 -839888 -794825 -510765 -306464 -283599 -35127 313256 254745
27238 254745 63334 158440 236722 43264 -206799 -133111 45760 302519 555545 730715
27228 730715 796838 990707 869863 937607 694916 249480 86259 174944 427612 263756
27218 263756 -5936 -191105 -33003 -33027 63283 -9674 -337193 -210552 -54853 189104 -27598
27207 -27598 -319090 -156100 -203212 -221657 -381701 -644705 -966926 -831802 -404291 164915
27197 164915 340480 328763 167388 -200910 -397404 -397980 -117527 2212 -114886 -141835
27187 -141835 172652 436071 205372 -168868 -270492 -60759 126713 166299 4601 -312136
27177 -312136 -307452 -168147 -57757 230284 329990 335495 323048 169536 204288 -46030 -318906
27166 -318906 -323438 76288 210447 -134215 -495956 -747000 -896422 -724012 -444259 12238
27156 12238 504258 572366 475729 298806 412515 348719 293871 -64152 -171023 33188
27146 33188 11110 31095 12120 69748 36661 21890 196623 50859 -138976 -227390 -136812
27135 -136812 -231700 -110855 71308 76523 114673 -10906 -41728 -130469 -315604 -20673 201337
27124 201337 245191 318594 441772 402107 496176 -39548 -463331 -286738 -89287 -42759
27114 -42759 -155840 84777 299353 324603 293904 347921 129675 76454 6410 177208 -192275
27103 -192275 -322374 -382030 -302237 -170626 -72358 -27651 -246511 -341887 -171733 -59407
27093 -59407 -56071 -129636 110907 91747 -132227 -409890 -429071 -767837 -677218 -166592 -68838
27082 -68838 -301012 -71014 173102 580487 648082 622578 370942 218806 257530 378443
27072 378443 489783 346985 -134320 -161681 -217338 -333377 -63481 372713 563587 220503
27062 220503 -249468 -636284 -329045 -42955 37605 61642 560166 982912 585454 400648
27052 400648 448986 168906 298592 -174412 -350630 -148585 -110560 11579 20577 34720
27042 34720 -251026 -299356 -53656 181533 477825 477721 192566 -94268 64806 314964
27032 314964 88041 -91860 -287195 -14662 111268 -15745 -108729 130280 47594 -275595
27022 -275595 -383634 -6334 127665 172507 -61634 -86990 -175336 -141837 -329762 -530303
27012 -530303 -289768 -210351 -297333 -128491 -21924 125651 243493 -19896 -25814 -371269
27002 -371269 -224497 -83290 -358761 -360475 -399110 -285627 -227244 98410 503856 548752
26992 548752 450623 713706 948543 837137 266827 -268076 -313138 47637 21365 138231
26982 138231 92656 189100 360309 256817 211333 -74560 99312 25829 183488 363866
26972 363866 154366 65805 401140 600520 435353 214385 273593 355162 322856 243330
26962 243330 -29634 -338348 -13392 64731 -289025 -311471 -219885 -138508 -263347 -174506
26952 -174506 29675 -158234 140987 223966 339989 221935 244573 357153 376244 289881
26942 289881 129928 -29921 -192801 90392 200073 307251 359880 667026 703106 787030
26932 787030 792708 313469 -158322 53733 73233 275316 354682 285458 307313 580703 717067
26921 717067 701657 476128 331934 389240 133133 -14219 27993 153498 116695 268030
26911 268030 255055 557161 463179 355668 204931 231323 310405 223051 81343 -37639
26901 -37639 -140136 -80383 -23519 361527 271817 21215 193800 244021 231656 412215 524686
26890 524686 499265 259418 -22391 10956 -5181 84681 539127 557985 447585 303782
26880 303782 109981 -137949 -240982 -436104 -412619 -117200 322799 139730 42589 -12562
26870 -12562 63507 386157 333078 261710 397062 135077 135367 168696 121331 84371 306442
26859 306442 165520 220393 248352 347194 328345 159693 -60555 -41502 -26814 292766 573683
26848 573683 620951 418065 245267 37928 -165025 108532 103185 21903 11777 71930 -160616
26837 -160616 122392 157577 -24598 209690 -31941 -179194 55069 280147 215047 190166
26827 190166 194905 173893 273071 142248 -179759 -466761 -371222 -224922 5974 371600
26817 371600 642741 592371 509037 135225 129092 -145548 -512430 -380347 -161549 -39640
26807 -39640 -102535 -125667 -109948 -442000 -490567 -476960 -238951 339025 515877 469206 145515
26796 145515 -258636 -75627 176096 -81973 -483783 -394091 10579 -40672 -222880 3460
26786 3460 6682 -429937 -553589 -111506 500911 292565 11969 -142015 -303024 -66618
26776 -66618 -184780 77557 188319 11842 134569 279083 458418 411252 197059 70481
26766 70481 -77177 92728 24794 6958 36264 202560 416183 341453 -136083 -257532
26756 -257532 -48838 96753 329018 310035 29685 52646 180913 45206 -49500 393638
26746 393638 611491 553832 347308 261585 151865 182936 100511 62378 53080 78003 261640
26735 261640 355291 430793 423666 151152 -61385 -6497 -45970 3963 -237161 -411216 -99429
26724 -99429 -162500 -75718 99991 148901 167001 21317 -463394 -835059 -632063 -148435
26714 -148435 57625 114026 359246 358892 116964 34109 -274840 -413208 -382626 -395918 -174672
26703 -174672 -354508 -279097 -183972 -155600 91622 297573 486102 634020 588565 417422
26693 417422 265045 298036 563091 843648 927893 911070 757896 350325 17532 101450
26683 101450 -201291 -316353 -429496 -460851 -306047 -84396 -8583 100216 48197 50106
26673 50106 -119918 -326355 -371374 -86069 -180804 -415420 -239672 -211780 -525568 -297569
26663 -297569 -50027 -50665 -212920 -532077 -385172 -234147 -207574 -53394 -147842 -233753 -461161
26652 -461161 -353853 -68168 -39024 -191131 -374306 27893 49665 -231118 -59103 -105336
26642 -105336 -253327 38524 358238 527381 379612 73575 -2856 -172627 299602 513804
26632 513804 515933 528430 446175 334457 665144 886953 451079 141814 -181248 -238682
26622 -238682 -171457 -298282 -139385 20254 29806 298692 326182 21078 -150558 -57906
26612 -57906 252993 321355 88286 -279904 -603770 -471706 -226688 13200 188723 312143
26602 312143 432559 349153 260478 46638 -51347 30803 247072 81946 56314 160058
26592 160058 491164 599466 433692 247056 214978 -112610 -223205 -68376 298156 294521
26582 294521 115828 47402 -51236 -79129 5183 111127 2947 12558 172219 572907 519985
26571 519985 438042 558214 630148 131898 144030 13286 -55558 67755 428866 501703
26561 501703 147619 156128 147360 37310 225907 513673 655082 204279 -274902 -118323
26551 -118323 58919 154395 43459 37102 -368081 -426157 -505303 -443043 -433584 -305754 -41113
26540 -41113 -71661 -132674 -483832 -532559 -678749 -633702 -406203 -386109 -300223 -61182 99178
26529 99178 31404 -327415 -514416 -801758 -757051 -549842 60403 211542 279891 344132
26519 344132 298901 171651 108054 106921 35226 59289 279683 268020 72125 -237362 -338926
26508 -338926 -58832 -7451 -96578 -223498 -71049 230691 655576 493563 161200 -59801
26498 -59801 -213748 -76538 184534 449137 467295 494080 600949 288193 -177329 -552784
26488 -552784 -665040 -361926 -117674 -397066 -509199 -408742 -199875 54563 292543 -85682
26478 -85682 -10722 68649 -258028 -129505 79390 275787 359137 88456 -122651 25298
26468 25298 352610 516163 628385 276072 -246404 -363743 -221684 35894 37122 -84932
26458 -84932 -80919 -379948 -359699 -494154 -35308 369283 74488 -280126 -740759 -767606
26448 -767606 -102183 20376 -174947 -77352 -77318 33508 135100 253379 356909 633582
26438 633582 737939 394135 -3634 -111984 -128354 -34079 80292 150515 237961 248716
26428 248716 407991 498143 44571 -217176 -348005 -390656 -155779 151888 227769 64089
26418 64089 -95001 -91912 407661 408571 172369 158119 66540 160992 556641 251623 8789
26407 8789 5935 -51804 167212 137855 156381 31435 -19087 264331 188199 206433 268762
26396 268762 582571 372414 78839 139791 225877 104278 166959 110669 5776 -74158
26386 -74158 104275 126361 -137789 -176074 85005 258774 231554 -8426 -96662 -267019
26376 -267019 -369636 -375767 -503208 -327593 123211 317857 419530 243077 -106708 -347638
26366 -347638 -362252 -562167 -479834 -377817 -60091 254632 167306 292193 475873 277669
26356 277669 215267 346705 416768 168830 -46467 57200 12697 -285377 -182857 -85556
26346 -85556 -143910 -240904 -378770 -286877 -38648 -177867 -377263 -483003 -520018 -264430
26336 -264430 243487 503293 671662 680951 657138 248367 157376 110027 107377 311194 96675
26325 96675 65080 -140257 -141626 -42819 -203386 62200 -95532 -237310 -252590 -88157 117173
26314 117173 -164178 -142423 -222576 -295508 -146584 -216654 -236729 -224485 16620 -113551 -145927
26303 -145927 8766 430162 443251 13178 -221068 -244975 -218797 -203154 -449569 -587528
26293 -587528 -428759 -644425 -508259 -33268 -14585 -368985 -312774 58493 222527 126812
26283 126812 -59966 15221 281493 231373 340830 -46211 -52558 -316906 -626675 -317565
26273 -317565 278586 279866 162883 199189 -31738 -27387 120674 393470 528190 76692
26263 76692 -19493 153280 298218 256001 -125990 39866 -5236 -24112 50847 28624 -238237
26252 -238237 -270728 128646 157818 11980 259 -78742 73274 159702 298652 229606 70097
26241 70097 -522500 -724720 -495822 -100632 214938 131480 -132593 -409317 -126916 -157533
26231 -157533 -156522 -224564 -322328 -344542 -418116 -343019 -29346 21010 82274 234095 285479
26220 285479 446217 269847 30921 -211607 -350046 -127880 160626 326612 204094 96234
26210 96234 54788 -137564 -627785 -366909 -139675 170017 267085 187032 2283 -313643
26200 -313643 -305990 -102731 -37006 -110118 -449407 -421870 -269000 -163104 93266 153455 -85664
26189 -85664 -431184 -436798 -43984 225098 53828 -29981 -165442 91971 51506 -258879
26179 -258879 -282165 100579 124134 -176696 -39090 393986 324325 256066 510715 711361
26169 711361 657937 661160 538204 478493 682416 889366 1024538 780110 531903 43188
26159 43188 -115590 -1197 374649 455387 133198 194887 131391 -276899 -382056 -456980
26149 -456980 -393510 -204720 136758 544738 678431 511949 477078 21095 -259020 -156728
26139 -156728 146899 118298 131033 342271 279923 200067 161236 325378 185321 25671
26129 25671 -363611 -105701 -4224 -236649 -585853 -510131 -249608 274509 276278 683038
26119 683038 738759 539658 161745 -98787 -94623 -269573 -55537 90709 31449 216216
26109 216216 295597 121931 -158465 -316696 119240 69309 -239385 -374361 -185323 8274
26099 8274 -13388 -140183 -10215 297140 312368 353988 381123 284046 139062 2601 188143
26088 188143 123762 -46194 -154542 -326893 -644243 -565364 15354 99778 217668 269687
26078 269687 414360 354282 390345 250277 69833 235219 329804 83094 -298510 -396330
26068 -396330 -313984 -210407 -296283 -236356 62950 382128 623396 598347 558556 546837 544667
26057 544667 374717 123993 201175 596987 579659 713966 547817 270622 96523 -11058
26047 -11058 181007 326269 390136 168432 5849 217882 540317 695530 617615 449153
26037 449153 186303 -230915 -260351 -146608 -113447 -46038 153193 98373 132171 46572 -54879
26026 -54879 -38958 118579 147589 108010 124025 171350 -56417 -172584 69019 203653 210366
26015 210366 182512 83059 -141713 24397 133990 118769 238198 34859 -193120 -416793
26005 -416793 -243075 -109415 -60205 -23106 251916 302133 168919 -72884 101228 173813
25995 173813 31576 108860 211501 263218 205445 65397 -91312 142440 -33281 113037
25985 113037 80201 -210542 -70330 -53859 -427370 -642641 -344554 -164981 35007 72632
25975 72632 182986 77532 85136 -218311 74629 -214287 -479605 -308985 -83645 -87880
25965 -87880 129619 195835 -9554 -358714 -684065 -684939 -2763 53300 -62107 58697 105997
25954 105997 445316 662554 505572 274018 155704 -152440 -186233 -291616 -133009 37030
25944 37030 61098 55280 267714 649644 510917 597914 496112 320693 -42140 -111869 135837
25933 135837 446692 398639 -30826 -333681 -231002 -150391 -318180 -396745 -520421 -615132
25923 -615132 -663129 -435569 -80574 3378 -36217 -198924 -232896 32996 481217 415687
25913 415687 63002 -117053 -28163 6128 -293669 -423593 -309309 -75736 303821 134263
25903 134263 61382 -157249 -312439 -405420 -351948 -308762 131590 13153 75659 105196 89183
25892 89183 85979 -175029 -251792 -238744 20199 -109878 -262001 -265537 -250488 -229607 -326743
25881 -326743 -258827 -231980 -627982 -400054 -136208 -404576 -303841 29507 59422 -276845
25871 -276845 -670716 -311333 -51930 14196 64100 286447 160761 259750 301819 304340 246855
25860 246855 267906 482898 591898 367217 477793 75910 22284 20813 -306113 -327122
25850 -327122 -233698 -180088 175499 422054 293125 177925 268914 385418 433900 503181
25840 503181 465180 230817 333581 247808 89738 -46412 -33345 -347241 -508624 -730563
25830 -730563 -387061 100167 114361 172297 138213 142035 186227 -33428 284670 749273 760284
25819 760284 684549 457871 292531 -90838 -535498 -488388 -296148 32155 -65302 -282219
25809 -282219 -294901 182841 211867 -26816 -3244 207450 -81099 -401209 -612308 -642379
25799 -642379 -360186 -488238 -213678 406583 256170 54933 -106222 -353979 -236265 -26372
25789 -26372 -309869 -214963 -385315 -691531 -615154 -719428 -626353 -368286 -455066 -459086 -18897
25778 -18897 87604 15184 -50007 -181232 -174692 2845 1 -47725 87229 417577 379911
25767 379911 228670 285567 23968 -204863 -371126 -277436 -314473 19045 216155 451535
25757 451535 431700 224496 328290 217131 -61504 37051 233306 394987 307880 -68159
25747 -68159 -154275 280374 314074 142555 365257 624097 337509 158050 294058 471815
25737 471815 257505 77951 -134575 115116 189132 323824 428935 354596 289135 147124
25727 147124 52937 61815 -257889 -215413 -192959 -322151 -649766 -717680 -392193 34912 -15069
25716 -15069 -84249 93496 434299 386032 145895 1974 42843 400118 429695 100545
25706 100545 -19474 -31470 -338406 -456434 -399241 -191547 -135877 -216669 -199888 -44055
25696 -44055 143442 43534 176515 461936 522136 403804 201012 104636 45543 157313
25686 157313 151705 168499 -5779 41929 -22227 -209474 -97843 -262633 -448102 -466114 -151906
25675 -151906 -87623 12751 81476 133105 286875 247119 232309 112714 104325 -40161 -180827
25664 -180827 183149 332324 -24997 -181766 418134 403986 61042 -11443 7436 363122
25654 363122 542268 408907 84578 58139 -164137 -100223 91779 -320553 -660172 -374841
25644 -374841 -71077 120758 -189926 -83073 -217856 -192352 -352313 -493542 -283667 -68055
25634 -68055 -174765 56499 -60002 -245847 -260383 32288 299414 319154 482973 365196
25624 365196 290275 159834 -50529 -202342 -128561 170536 169834 311992 466279 491459 473954
25613 473954 194435 -734 -184161 -316776 -200973 58809 -101241 -151525 12809 256938
25603 256938 146649 477779 175331 -237842 -297162 -227940 -401234 -148322 103041 -166750
25593 -166750 -365716 -350403 -394047 -324476 -358691 -204526 -86607 214179 433733 525059
25583 525059 540070 567118 559015 511110 314338 104226 -61834 -280770 -296590 -248981 -14695
25572 -14695 110423 171705 277789 -214988 -300541 -199555 -97425 150163 -66105 -128168
25562 -128168 -89099 99095 -139373 -117918 -242663 -62227 -144752 183357 274360 47646
25552 47646 53281 49615 28413 -70440 212188 215608 21071 -295357 -261654 45493 129443
25541 129443 100585 101494 135415 184292 -84865 134010 477749 313043 -11947 -90796 283076
25530 283076 274265 175799 98825 -95479 -139441 -92569 150632 513489 616710 608592 351716
25519 351716 164763 257486 226074 382444 140172 58082 361183 261135 270595 500502
25509 500502 367080 124573 -12908 52932 -56776 -164487 -420699 -400229 -135484 -352084
25499 -352084 -497773 -155747 -108791 -326828 -250398 153128 442539 558581 525746 418776
25489 418776 304121 -81324 -280561 -249413 24516 79822 463021 546937 390122 28175
25479 28175 116840 45774 -86823 -239219 -62994 91198 18051 -184433 -59203 333383
25469 333383 647896 696977 232170 -240071 -145078 240711 179089 -98046 -317193 -437054
25459 -437054 -200100 -390479 -418588 -106046 -181618 -300684 37277 125325 -105816 -583348
25449 -583348 -724928 -495893 -228248 41578 63204 -196893 -327965 -241479 -58690 106125
25439 106125 49635 -351061 -267880 135164 239869 95908 -81838 105029 267500 86753
25429 86753 277575 342160 143959 -239694 -203223 -192408 -171528 124623 138048 -238315 -59321
25418 -59321 320871 121978 -229857 -502825 -371347 -117823 -139922 -385672 -334949 -225685
25408 -225685 -269287 -429268 -275359 -223370 -177748 -221797 4413 72747 -300661 -632320
25398 -632320 -725939 -520931 -332801 -286454 -72629 324956 132167 -166846 -223714 -394290
25388 -394290 -297488 147574 603623 580716 343114 49008 -144513 59246 309522 723396
25378 723396 787525 688936 419444 285947 207533 146343 326215 565549 153455 -85256
25368 -85256 269743 227028 225960 -72755 -394635 -395879 -463823 -458802 -348664 -169878 -14608
25357 -14608 70904 285814 165157 228329 512369 740939 252037 -426293 -509807 -319767
25347 -319767 -414872 -116495 273385 391102 659677 552324 394172 245943 243210 345866
25337 345866 46399 -185883 -129302 -158909 -66558 -122080 25515 -63692 -159404 -20368 426348
25326 426348 406557 250483 181739 -169878 -319635 -401430 -293715 -337092 -215314 -150469
25316 -150469 28005 152434 167284 137491 -57582 -232094 -149354 -102560 -173111 5330
25306 5330 106686 -49565 -152211 -323458 -579255 -291680 -211638 -197527 -325598 -266656
25296 -266656 -45455 -55004 -11930 92211 36001 60124 160141 230468 364131 298535 -26367
25285 -26367 -72231 -168988 -183428 34145 233080 140870 -372768 -600753 -593090 -265599 -82202
25274 -82202 65773 189181 97312 64849 -132637 -83810 -291389 -673795 -995710 -843803
25264 -843803 -639590 -523709 -489331 -290709 -153340 -127379 -230405 -291583 -330844 -512420
25254 -512420 -525978 -429132 -384009 -732621 -686867 -284425 -273753 -685679 -510867 -261368
25244 -261368 -67272 152019 284014 234234 45844 8949 125324 358309 173205 -89703
25234 -89703 -440462 -123536 269420 391498 44546 -195084 -167616 164840 511199 629003
25224 629003 603635 531485 458067 173954 -55566 -329746 -46489 -83819 -115968 160058
25214 160058 38049 -438404 -690603 -356075 -6773 158138 -53389 13604 -177205 -434040
25204 -434040 -493372 -509239 -402221 -315276 -227900 -190863 -327501 -246519 -280116 -231164 54057
25193 54057 17628 64927 -40309 -85894 -145521 -351442 -471293 -266309 -98253 -136571 -244060
25182 -244060 -267384 -231530 -277791 -49902 189208 -13687 201887 238272 311229 95821
25172 95821 -28909 -73170 -164244 -268298 -176602 -303705 -543900 -286924 -355136 -473063
25162 -473063 -84760 198138 335513 663244 501043 97377 313109 369931 169917 -64860
25152 -64860 43223 179719 210885 243700 -94268 9422 464714 150108 109173 371812
25142 371812 322806 249445 229687 161055 -84362 -164058 -379731 -905047 -1079670 -972438
25132 -972438 -607823 -385912 -577726 -576716 -392722 199756 165974 133281 202131 570314
25122 570314 361285 291380 195945 625317 333760 331405 120744 -69425 1362 -142425
25112 -142425 -541815 -549434 -90308 60249 195621 356901 89416 194443 568226 543428
25102 543428 367375 230029 -53783 186681 64336 -100383 67539 42844 35327 163182
25092 163182 72410 -171953 -85316 -206803 -408242 -88060 305205 514310 419918 403033
25082 403033 193689 -60207 -234443 -185286 49640 -86286 -126798 -12101 -77918 204403
25072 204403 347953 120680 -9025 232014 195020 302492 225881 -80818 60753 -114742
25062 -114742 -354408 -31556 25335 -68937 -175188 -382678 -523609 -423841 -306735 -177063
25052 -177063 -223066 24206 128093 272568 333511 262277 42077 -65413 -207925 -218866
25042 -218866 -2541 -189235 -299444 -539430 -554989 -548693 -553857 -441763 -358217 -189036 -395217
25031 -395217 -568759 -285067 68758 9883 216814 397564 330454 336943 -98649 -565134
25021 -565134 -442263 -319233 24065 147585 159793 16456 -277685 -188015 -56148 174045
25011 174045 145199 87427 77413 -191373 -449822 -313721 1822 26825 -176965 -339999
25001 -339999 -483961 -415691 -247888 -186996 -12622 102232 129662 120527 -342232 -191971
24991 -191971 -88200 -138938 -176091 -292686 -149558 -270158 -273793 -33038 -79038 -179616
24981 -179616 -284516 -268126 54898 -241646 -418767 -316899 -144770 -177259 -134625 -554390
24971 -554390 -564855 -273838 -40609 -35549 123061 346663 230694 209728 122298 -11562
24961 -11562 87945 29866 -62913 -54113 -500150 -382632 -143915 -315982 -274713 -343227 -247753
24950 -247753 -46265 -283818 -215886 -173945 -197425 -449427 -813822 -513688 -125248 -31596
24940 -31596 -176843 -81015 132984 171510 -177431 -474475 -203747 75101 349782 432144
24930 432144 465444 24361 -253930 -591088 -635451 -277135 3417 237212 217674 95273
24920 95273 -124025 -334177 -257369 -420424 -315854 -123287 160665 -78762 -274031 -263877
24910 -263877 -376695 -429410 -545587 -693472 -363605 35230 -41085 4419 333456 511608
24900 511608 417921 238989 -370533 -494393 -295432 -266325 -150468 -61889 -11193 14651
24890 14651 46599 62728 -121011 -163633 -331799 -417538 -440283 30640 500819 390289 146137
24879 146137 60282 -223196 -50052 317614 14507 -186899 -332723 -110033 -195507 -334441
24869 -334441 -92903 20086 -266646 -299408 -390409 -640531 -193870 139491 20773 -221327
24859 -221327 26436 350402 387019 206114 -58413 141652 211530 206910 168108 352282
24849 352282 290487 304446 241437 237914 -15857 -81418 273977 497682 665430 241375 -196011
24838 -196011 -246945 -492238 -486870 -399158 -267144 -134869 -129408 -273907 -321578 -442917 -275944
24827 -275944 7441 67768 -146077 -499315 -409792 -262962 -445640 -456169 -611059 -590539
24817 -590539 -753857 -587192 -213228 -172542 -147558 -117705 -128536 -109355 -143217 -288301 405
24806 405 55299 -101100 170758 131992 140582 71992 236768 137180 307572 350898 377577
24795 377577 256050 386150 386073 192367 40232 209869 217314 212374 164027 -220755 -386956
24784 -386956 -373618 -345524 -132224 -111781 -314724 -554439 -564610 -167188 -179772 -392268
24774 -392268 -376777 194790 328894 2068 -79667 -224593 -314725 -117676 -163525 -72862
24764 -72862 84825 12426 -8474 -30076 -250087 -198199 -134328 47617 271284 99459 315491
24753 315491 502097 213837 66469 187636 206270 -23426 -188733 -456879 -397518 -513858
24743 -513858 -352238 -4414 153433 196707 357250 347507 277275 136153 139514 -162941 -328425
24732 -328425 -485330 -271841 -214912 -490463 -597702 -380074 -191467 -122300 -140639 23455
24722 23455 265250 346767 348573 286089 216683 -11843 -276519 -215752 -135043 81984 254410
24711 254410 -77848 -226529 -335352 -284481 -479817 -512129 -337878 -441248 -626665 -483221
24701 -483221 -216263 -338582 -247563 96581 494289 502319 496976 239592 370025 44457
24691 44457 -244257 -58109 172286 520946 756769 443063 -97637 -64535 359424 416188
24681 416188 341994 510612 509517 332370 52589 -306326 -246878 -205618 -399151 -267935
24671 -267935 17077 -3945 15315 126434 116423 286636 222586 -204758 -147297 -84872 -276559
24660 -276559 -317708 -99032 -291281 -263332 -525564 -719387 -518066 -605193 -369813 18459
24650 18459 134705 9748 400898 662488 931196 981223 632951 427077 355071 195735
24640 195735 -47304 5042 166428 82721 -132026 -237919 -276446 -77193 114453 42490
24630 42490 -193457 -58569 58683 -207606 -160381 -333225 -295564 9538 217278 53601
24620 53601 -202435 -168446 -110082 -112841 -466580 -392335 -395620 -700516 -587667 -141400 -63301
24609 -63301 -388521 -56910 609809 468841 220376 253267 240033 -332580 -426975 -74564
24599 -74564 228073 200098 -56580 130814 60531 29625 -45376 109214 155922 -72587 -368388
24588 -368388 -600056 -569921 -444304 -174346 3466 -67150 20534 -179407 -324624 -289412
24578 -289412 -49897 -36170 -95678 -332426 -194953 -206460 -346106 -310221 -446262 -333154
24568 -333154 -2343 114755 192547 154644 92795 -32714 -89517 13376 394217 502299
24558 502299 774203 371230 -50602 -307475 -111246 -191675 -339692 -201968 -63992 -5691
24548 -5691 -299211 -546831 -456298 -241534 -158701 -393434 -342350 -309002 -164457 -95689 -218849
24537 -218849 -91955 218910 254851 51472 156149 210416 -34388 -212048 -179748 -160548
24527 -160548 -250897 -172978 -123044 14746 413095 244491 93677 210659 1471 -134082
24517 -134082 -415853 -99391 125672 231503 -254590 -405130 -340679 -531571 -744762 -515946
24507 -515946 -299904 -268037 -152813 4033 -115625 102280 297700 237541 322091 -8842
24497 -8842 -244310 -252764 -46331 -151936 -421208 -337937 -280573 -173086 44919 105734 -81681
24486 -81681 -21412 -206595 -450574 -298015 22553 335109 547217 516371 277016 -72545
24476 -72545 -546235 -523775 707 279075 206645 170999 -153399 -151321 127673 -133756 -223870
24465 -223870 10938 2456 -181433 -56896 -139096 -235597 -57273 -25342 -92856 33477 -98642
24454 -98642 -362504 -278785 -72532 -327644 -595555 -592227 -266513 171788 367922 422942
24444 422942 327465 292102 192881 -30229 -218479 -296524 -568254 -410436 -176594 -46613
24434 -46613 -22838 254066 378913 154746 -173611 -75305 -84912 -326940 -253140 -291736 -107740
24423 -107740 304941 92668 170402 270201 186959 295647 80220 156152 -88430 -54433
24413 -54433 366436 472095 684820 326699 -69287 33275 328890 162935 338872 452277
24403 452277 321226 130543 94093 61709 81913 82136 -122493 -208992 -79975 -205377 -443470
24392 -443470 -250324 -100844 -26972 13743 252501 290591 366755 233941 241897 59217 -214561
24381 -214561 -210494 -143511 -96066 -48466 -222098 -181881 -253392 -154359 -104641 102400 383666
24370 383666 179511 -220534 40637 200871 57639 193998 45725 -205565 -379265 -429079
24360 -429079 -348147 -409120 -496709 -405284 -391073 -199790 25813 167023 22025 78971 202000
24349 202000 70750 86840 -198802 -395955 -278050 -64673 -50197 -38151 -8547 42414
24339 42414 222079 245901 25457 -151183 121615 150950 114601 -170439 -477300 -353842
24329 -353842 -352859 -162262 -26914 -1794 -92417 -309317 -393049 -207310 -200753 -91690 -188592
24318 -188592 -288534 -188152 -311056 -607104 -836008 -709180 -607399 -433112 -512459 -294688
24308 -294688 -137835 -191102 -243612 124917 172564 71934 30061 -20460 122357 508796
24298 508796 221884 -34303 -187198 -89088 265269 218623 -61616 -330590 -342609 -226953
24288 -226953 -164865 -19853 -236060 -266041 -405512 -249763 223685 503339 -10865 -137361
24278 -137361 -19109 -197743 -77653 -207505 -346269 -85450 -184363 -219177 120868 205453
24268 205453 152518 -79992 -118930 322567 230754 -94229 -205325 -166114 -53362 211860
24258 211860 212174 73377 129653 55405 -52130 245527 125602 268306 358635 335779 345384
24247 345384 261160 -56530 -130232 -133459 -13555 -129492 -99808 -43235 25357 47825 43421
24236 43421 173633 134935 -53603 -37334 -308825 -449023 -293207 -470580 -443160 -145775
24226 -145775 -114088 27475 266079 560880 202272 -73749 -143441 -391563 -351683 -26472
24216 -26472 -341739 -601993 -337067 -250700 -411891 -339812 -349143 -58862 -221378 -495847
24206 -495847 -456324 -537598 -501932 -782415 -824250 -351243 164113 86344 -199734 109507
24196 109507 294034 52110 -563688 -314612 102084 222095 -132964 -362929 -456797 -288247
24186 -288247 -374854 -572919 -525864 -352897 31002 174203 131410 301401 89093 -127794
24176 -127794 -53365 -291389 -488921 -779453 -761420 -656339 -350851 -239861 17875 93233
24166 93233 418562 300847 -124570 -399493 -242215 -342551 -382928 -202550 -35352 192170
24156 192170 177076 -111016 -384719 -330666 -1379 150056 -196567 -420583 -371821 -642484
24146 -642484 -896711 -980181 -568394 -463107 -514850 -543647 -241877 -307248 -456496 -307724
24136 -307724 -220078 -131223 -128229 -350467 -112582 -42089 -127888 83310 -178252 -485052 -337666
24125 -337666 -215244 -183689 -393108 -143099 -90093 -380547 -528683 -395065 -284796 -314426
24115 -314426 -237228 -59844 51028 202641 2922 -153760 -106285 158874 -21599 -105545
24105 -105545 -160206 -290895 -235332 -347146 -690770 -603664 -295369 -51095 -123270 -227157
24095 -227157 -66499 29219 153798 140317 -172423 -288530 -322916 -187141 194239 -121789
24085 -121789 -365996 -338777 -250470 -65656 52747 144005 197392 145690 202806 153531 130857
24074 130857 227640 109012 -171177 48426 225480 143713 -214604 -371202 -7490 129541
24064 129541 304626 458624 430782 287618 5602 83981 194142 -23597 178548 91212
24054 91212 -25997 222496 179807 285774 288794 436161 465306 228027 205408 -92662 -184680
24043 -184680 311884 723136 694633 424069 306212 118266 16794 362740 194380 -153975
24033 -153975 -135962 -138609 -229945 -304835 -672805 -871065 -382568 -172524 -182648 -213641 -442472
24022 -442472 -482021 -546313 -550914 -234430 -218023 -273463 -730074 -767444 -684308 -602678 -588261
24011 -588261 -105358 271614 307678 183706 45504 -18882 -91989 -23752 60658 275279
24001 275279 442947 125356 -168151 -382988 -251759 201800 520351 199850 138028 235364
23991 235364 13033 136211 -69091 -475552 -514935 -368546 -405967 -504180 -416124 40270
23981 40270 136864 -52012 -9394 12075 67982 -135753 -338261 -536059 -411751 -280225
23971 -280225 -208224 25546 -67863 -112452 -67071 -241491 -199897 23979 273810 92993
23961 92993 -55635 -42533 123354 -21464 -211725 -113898 -167097 -159244 -54143 -22944 -171474
23950 -171474 -203023 -346112 -301681 -167699 -37906 -270625 -313774 -218047 70345 8800
23940 8800 -214640 -721699 -704373 -468757 -485015 -731031 -616043 -298280 -195923 -75698
23930 -75698 7308 36251 100473 202803 195688 73154 -236097 -284218 -261724 -230309 21315
23919 21315 37927 -193352 -123128 5725 44986 -102923 -123715 -130700 -183614 -837 -297817
23908 -297817 -206444 76894 103552 -35799 43238 86202 64022 -31984 353001 477980 174822
23897 174822 95807 122794 126230 117110 -97368 -304929 -113532 -160258 -284413 -342925 -200896
23886 -200896 28288 165872 271104 128544 -265676 -463760 -397798 -85019 -216226 -371788
23876 -371788 -129285 -269134 -254506 -539502 -474420 -477475 -393780 -163360 -38650 -113054 -87610
23865 -87610 -410629 -452651 -246140 -318294 -435926 -545182 -241552 -175005 -242231 -66895
23855 -66895 113986 92930 -32509 -398965 -673602 -419429 -10195 389970 375542 15766
23845 15766 95281 117258 -56627 -158490 -465157 -543798 -409317 -363873 -282042 -291820 -490703
23834 -490703 -303872 55945 110217 60223 36481 -192358 -261529 -297100 -25070 235770
23824 235770 275377 304623 -17857 -281889 21963 185434 176047 17475 -30293 1429 -23029
23813 -23029 -236677 -411374 -69362 381483 524631 607369 469631 564624 413619 218527
23803 218527 116601 195578 -39529 6219 -61913 -82952 33912 -90184 44211 134525
23793 134525 430001 490109 202533 -91767 -163695 -79681 60681 219085 163064 9742
23783 9742 -182015 -125931 91681 57869 106306 218679 584891 678625 470016 472937 112765
23772 112765 328018 411635 758310 757357 848428 458866 22625 233340 366647 295669 -17927
23761 -17927 -228910 -328524 -206551 35487 253587 30064 -446790 -524289 -157506 192500
23751 192500 -143284 -699413 -749192 -422781 160880 33542 -201602 -147791 -313079 -186422
23741 -186422 -163052 -70144 -28092 3393 -87214 256892 158080 -117762 -227351 -294282 -717725
23730 -717725 -1013218 -721704 -870 198839 352711 428260 349992 484415 276566 121127
23720 121127 251237 427168 383965 219945 89196 118281 77638 -94713 -313899 -778295
23710 -778295 -575497 -430245 -463840 -244215 -159283 -50898 -93466 -139610 -376734 -437056
23700 -437056 -316219 -113707 -58713 -189692 -100278 -87678 -210008 -295704 -610161 -826499
23690 -826499 -545882 -368306 -432249 -517433 -564024 -559517 -475260 -432224 -312292 105602 -85438
23679 -85438 -485077 -646021 -664922 -411619 -317304 -696722 -810925 -706741 -750721 -577520
23669 -577520 -410814 -332203 -692317 -657934 -223937 -68700 -66807 -223514 -393932 -288024
23659 -288024 -265163 -28971 346518 57243 -11873 -201124 -102810 142458 -40539 -232808
23649 -232808 -526470 -628004 -301566 -66224 614033 553639 97990 -45824 -211935 -299325
23639 -299325 -182809 37801 208004 -232562 -428091 -293057 -227674 -10958 -62792 -241218
23629 -241218 -232824 92755 315796 417619 160930 219165 286874 376123 440882 401059 306419
23618 306419 303216 -2613 -114810 -259727 -469956 -425000 -390822 -341979 -524377 -629252
23608 -629252 -453026 -394768 -255307 35008 6848 -356754 -655025 -500354 -359417 -486978
23598 -486978 -772083 -495938 -323683 -77638 219289 -100186 -299319 173954 143219 -19531
23588 -19531 107594 88436 -180432 -517383 -532356 -225990 -336358 -380439 -57697 -74727
23578 -74727 -235782 -281028 -263478 -318306 -292400 233021 571652 657358 409987 257898 313648
23567 313648 268413 147004 85818 -61323 -428343 -616305 -457748 -321036 -253446 -177226
23557 -177226 -137969 -251737 -166865 -71734 -49267 80259 -170490 54530 354845 246299
23547 246299 455041 495921 88922 -236092 -228083 -581343 -509003 -267578 -672808 -704291
23537 -704291 -411593 -58008 -190376 188120 492262 291755 114406 349848 125847 -31214
23527 -31214 320893 648746 574145 221304 -132309 -638299 -649494 -343194 -238713 221160
23517 221160 405968 282034 63901 365938 191448 -93479 50526 292681 213505 -90046
23507 -90046 -33640 12425 55856 -65670 -59033 134065 82801 -76165 -235347 -100766 -55361
23496 -55361 24814 -152849 -309956 -53090 259634 -3992 82407 273693 -98841 -88181
23486 -88181 -120298 -110509 79907 415565 443540 315285 210723 208953 297282 -80456 -385230
23475 -385230 -358807 -322432 -129276 37010 104575 -184126 -320899 -455198 -656094 -812656
23465 -812656 -608856 -228437 2173 283420 331255 85617 144960 17712 -94214 40030
23455 40030 -4966 -250131 -259287 -149332 -215639 -141518 -108391 -165429 -133490 -185515 -260331
23444 -260331 -312293 -309257 -221471 -297480 -197691 -211540 -389901 -281055 247096 481858 180960
23433 180960 139295 170329 -107556 -419813 -457121 -199349 -39642 44267 -319009 -380892
23423 -380892 -138074 -122226 -63450 141813 24816 -17128 -179688 -210571 -315046 -625154
23413 -625154 -496286 -106044 99422 -108321 -123452 -220285 170937 324193 201439 175717
23403 175717 28408 -142349 -74940 -91162 -106498 49074 -53247 -471533 -546808 -45048
23393 -45048 106567 -112051 -109234 -204356 -487475 -343071 -49920 -40608 -150556 -377616 -624490
23382 -624490 -673083 -409280 -72039 344948 7910 -24545 -120287 29967 236003 142546
23372 142546 152086 211654 99570 28350 -48804 -218722 -230361 -301835 -337334 -468353 -351689
23361 -351689 118037 111045 224725 139431 -134127 -150322 44972 272117 134906 139256 75718
23350 75718 129739 111503 -45433 -72888 -362079 -323817 -348992 -177059 -241092 -48262 108564
23339 108564 -50520 457586 724500 221352 -209820 -100756 227207 221749 171640 236029
23329 236029 585372 418199 118108 11055 390505 107423 -297924 -152342 27452 198708
23319 198708 356399 150343 118466 -69315 16103 193747 334988 319627 106725 16776
23309 16776 93842 251306 501958 326776 131642 -623 -110776 -186180 -254292 -106003
23299 -106003 -175354 -242530 8196 -73490 -140671 -89670 -135779 -167208 -207445 -334757 -642641
23288 -642641 -594166 -405002 -484585 -496663 -188527 -465462 -572412 -634495 -769629 -667188
23278 -667188 -262170 -507765 -323895 236235 222690 41112 -226196 -46386 -98006 -35425
23268 -35425 173740 173984 -205344 -77870 -174816 58161 41864 -633260 -547900 -227217 -117559
23257 -117559 -329682 -591921 -710435 -622424 -231150 -107449 -283772 -37124 276524 331028
23247 331028 443569 413876 199291 -17486 -27335 -94837 -54452 -236588 -457163 -358979 -209949
23236 -209949 18151 85208 -94679 -459310 -362238 -339951 -471184 -680049 -589388 -358585
23226 -358585 -10985 21199 -101550 -140803 -212281 -306127 -139005 -163588 121072 258831
23216 258831 108084 -268285 -696997 -637558 -382364 -154331 -271819 -265312 -115679 -329440
23206 -329440 -233449 -192593 -474122 -237168 -74248 -151982 -337838 -210121 86787 23378
23196 23378 -235459 -257482 -241598 -28857 -340748 -246290 198523 460561 291724 43420
23186 43420 -332513 -622151 -363587 -253926 152780 133548 245567 258633 -36041 -333957
23176 -333957 -418133 -411121 -353267 -156102 -125068 -215538 -277838 -251304 -219319 -70494 -35820
23165 -35820 -133299 24853 -155958 -190716 -333475 -330531 -54406 217223 69329 -75146
23155 -75146 -4112 -79655 -22490 -288163 -253576 169844 31083 -118216 66842 208716
23145 208716 -110283 -116492 35683 352605 260997 -104307 -103524 72655 314196 642947 803502
23134 803502 436074 -364442 -637787 -819167 -678559 -573766 -367814 9462 -221335 -174983
23124 -174983 -52742 -134829 -27680 64881 161427 -84380 -255414 -127785 294811 736527
23114 736527 736625 407416 470953 566904 286154 7885 19242 -135429 -24065 137835 238125
23103 238125 87748 72242 -9679 -10254 -255773 -288103 -435138 -664867 -659656 -613348 -540562
23092 -540562 -593046 -714642 -831886 -780967 -625545 -328807 -159350 -39406 -134502 -427645
23082 -427645 -560411 -148209 -159620 -51230 -64948 181654 322017 -72824 -61170 -279303
23072 -279303 -327454 6725 108514 -6337 17246 68089 183268 318985 621842 397267
23062 397267 139957 -191683 -477357 -422889 -111835 385285 366097 47980 -63807 148184
23052 148184 239798 578751 664714 721097 751150 203709 -56115 60436 394239 354193
23042 354193 -174107 -475353 -396046 10352 201404 131319 406981 248516 417977 708855
23032 708855 598399 310919 161662 -23367 -141852 -215658 -212963 -11419 -33766 167221
23022 167221 157835 -99978 -295977 -263185 -649675 -527943 -148680 -119371 -28554 -48096 218080
23011 218080 509292 593724 378795 165649 322257 551511 539038 264936 -366374 -507037
23001 -507037 -533483 -341506 -197955 -158511 -58544 60288 7262 -192084 -155458 -28442
22991 -28442 271626 386050 110010 42983 -231806 -174500 78495 278779 451208 114126
22981 114126 300624 697221 782294 684572 629218 232223 -56509 -206154 -215865 -237156 -96163
22970 -96163 -41031 109421 61392 -102685 -369036 -619956 -333216 -396116 -420368 -191432
22960 -191432 -18853 38874 163832 -142817 -299386 -395585 -157266 -25553 119269 171660
22950 171660 177750 137525 -220154 -474359 -457842 -607794 -572318 -483072 -420262 -413257 -370569
22939 -370569 -133232 -317702 -417360 -203281 208873 421227 4192 -242409 26116 -98846
22929 -98846 -164825 -322302 -488980 -485308 -410693 -261214 -319752 -337817 -559836 -732950 -1003101
22918 -1003101 -1068147 -470198 93855 36383 15484 -89478 -251396 -420450 -391290 -189910
22908 -189910 53951 41433 -72312 -80229 121122 86317 -67588 -227035 -290983 -205348 120999
22897 120999 202829 24142 -55075 140123 201772 60988 -14038 20649 -48587 163707 144032
22886 144032 99397 -235998 -586988 -537609 -489107 -266240 -78332 -38795 -227634 -276149
22876 -276149 -493623 -464822 -166071 -272104 -179427 -82584 -228385 -430514 -584175 -288284
22866 -288284 102649 157842 133499 388542 392762 271022 444507 481777 226910 11917
22856 11917 119653 4392 -245910 -199256 1746 25821 -263280 -630813 -35789 203569
22846 203569 411289 689021 617509 702823 533638 399279 175348 -38947 114175 129096
22836 129096 204124 172175 221067 237160 210986 241087 70044 -101173 -190314 -333013 -355698
22825 -355698 -508798 -402763 -193936 -414043 -446136 -253364 -453935 -460386 -257544 11331
22815 11331 -83122 11881 139393 231955 90488 -248282 -110042 -322212 -341334 -561710
22805 -561710 -771613 -461923 -348984 -364025 -179887 39851 146890 66382 -15171 37100
22795 37100 -34136 -64661 -59856 -133620 -170078 -30512 -98278 -384028 -568341 -571346 -436758
22784 -436758 -702631 -515868 -346129 -184957 -233344 -84406 -17503 91050 -206439 -418458
22774 -418458 -342492 -485556 -281384 -191361 -132109 -199909 -68571 27775 148205 27130
22764 27130 -152262 -116437 -128747 -286844 -310156 -6580 11696 -37843 -48197 -375853 -566544
22753 -566544 -398005 -420031 -652572 -872382 -492587 -591349 -768033 -494164 64526 55664
22743 55664 -345599 -91457 26610 -424946 -35049 88316 61471 118816 137782 -8700
22733 -8700 -223108 -73144 354589 331960 369995 329487 -105137 73117 183554 123412 -163765
22722 -163765 -104234 29283 55028 144856 368151 605508 377324 -13295 438070 630227
22712 630227 435874 199460 92041 -14978 -33352 232117 408191 341267 29246 16497
22702 16497 15888 -96051 -384646 -337631 -209400 186646 482912 662010 373922 9110
22692 9110 181565 161664 474473 205091 -394824 -24154 128006 -163950 -401451 -321672
22682 -321672 -284061 -484177 -718689 -580274 -243110 19030 -204989 -279319 -137744 -197720
22672 -197720 12560 -109227 42553 -17229 279519 388424 75283 -312268 -229677 -69178
22662 -69178 -144589 -143978 -307293 -380695 18947 271770 332905 249793 -3977 20688 -285874
22651 -285874 -445362 -369974 -166280 -42015 242135 526992 446951 147727 125601 -90955
22641 -90955 -307336 -218980 -631905 -568135 -186055 -96528 86644 142694 -132008 -269570
22631 -269570 -133275 -81499 -357577 -329961 363578 591258 480680 121878 -21904 292358
22621 292358 409228 103689 -123110 -177481 -174944 -95108 -62959 86779 67868 -202337 194123
22610 194123 518181 56703 -41573 104355 -67095 -169728 -61086 -275689 -239445 -311001
22600 -311001 -358699 -255518 -599867 -955977 -543799 -267739 -547351 -731027 -588595 -338232
22590 -338232 -538323 -130649 -39795 -210422 -186847 -86110 -328576 -159131 32706 240647
22580 240647 493732 366235 279706 -9021 -135599 109734 468725 194862 133734 349693
22570 349693 247563 166249 35279 -197165 -24356 99846 -88921 -244014 -305076 -264400
22560 -264400 18810 501616 418218 227254 51668 3023 8434 51679 92640 73702 -33626
22549 -33626 22593 81334 83891 274173 131133 -280393 -521957 -611310 -721220 -561807 -328258
22538 -328258 -84939 -162887 -243720 -367039 -269550 -430141 -608623 -444755 -203147 -122195
22528 -122195 -278093 -482718 -560370 -191767 -205334 -191617 58555 8558 -123775 127583
22518 127583 565304 771959 596761 522076 238496 23986 -231021 -465998 -599676 -557289
22508 -557289 -326192 177564 277101 444603 4815 -188144 100213 157530 440009 334868
22498 334868 -6885 -328131 -510428 -290066 298989 399661 277564 -74926 -115930 88500
22488 88500 145668 128603 -127169 -335416 -257786 93261 112179 218488 320626 320255 441922
22477 441922 351963 151231 -15088 -163226 -202045 -77148 -137169 -124183 -279402 -259718
22467 -259718 -34486 4644 -426580 -314048 -124251 -359831 -339017 -276840 -408390 -470484
22457 -470484 -14697 261190 63476 -426387 -498205 -551770 -582341 -415668 -421342 -276463
22447 -276463 -346978 -349191 -94792 -40243 -135409 -90250 -314167 -435104 -391222 -263761 -149398
22436 -149398 -159316 -174138 -516778 -1061690 -1168253 -1145449 -1215577 -1094335 -701475 -391906
22426 -391906 -272432 -355252 -338547 -47058 -39210 2425 262168 599884 498142 375677
22416 375677 180054 157525 234384 215720 -138185 -65716 188386 161846 48984 -285752
22406 -285752 -508445 -593724 -426517 -279310 -259008 -133394 2428 258570 242297 -51144
22396 -51144 96839 -134320 78378 362484 137768 -6835 -131313 -203141 -88004 93793
22386 93793 122954 -382631 -370641 39209 165565 14967 -333288 -581673 -315668 60891
22376 60891 151191 -233567 -380145 -174039 94757 249982 233662 148949 -249875 -604464
22366 -604464 -530986 -516655 -253694 -173468 -347725 -613837 -386402 -60446 -298134 -813415
22356 -813415 -476710 -70095 -152407 -128735 -107803 272857 122917 -130670 -162113 -104739
22346 -104739 -286554 -144868 -33073 228742 68246 -173002 -127579 -11307 202992 715399
22336 715399 451280 166355 123330 -167295 -658856 -844754 -577461 -249736 64886 138556
22326 138556 165566 174249 -203406 -460723 -414388 -279076 -37637 -105455 -184988 -173239 15903
22315 15903 -50911 102900 449905 339845 431526 497970 749315 930505 592627 185020
22305 185020 173534 -97729 -318631 221804 590577 255155 -346148 -457058 -362320 -481130
22295 -481130 -567931 -500912 -83608 -137526 -69378 -188918 -377628 -139395 144648 402857
22285 402857 413251 324830 -71976 -283700 -444673 -423254 -127807 -331636 -326047 -136832
22275 -136832 -271761 -192467 -274282 -293075 -354910 -486141 -569461 -591035 -433515 -410706 -288780
22264 -288780 -337284 -351859 -78482 -24478 -82778 -515634 -497828 -316668 -450106 -189506
22254 -189506 -18576 -205676 -53038 -155839 -189823 -274997 -143118 391807 392816 404304
22244 404304 280961 28517 -52914 130832 369987 188727 -51795 -465367 -644354 -437430
22234 -437430 -287242 -107972 -128741 -181891 -362030 18862 -101674 -132945 -122312 -259247
22224 -259247 -474929 -700591 -558992 -332141 -492593 -540112 -498456 -335870 -95477 -27960
22214 -27960 -472693 -787924 -633074 -327945 -462519 -362286 -390248 -548642 -457856 -36816
22204 -36816 235595 106761 -409902 -415690 -453714 -605112 -659514 -469014 -660473 -602907 -430550
22193 -430550 -297013 -232048 -316005 -286263 -16105 -83770 -47544 264048 488843 467588 74654
22182 74654 4136 -237330 -233467 154550 300815 40827 170485 -58310 -82029 -7389 -290281
22171 -290281 -108582 17507 -232573 -318926 -36862 205568 443206 262908 252038 290794
22161 290794 364181 97621 -62928 122737 -132936 -445985 -114971 -103732 -184728 -375616
22151 -375616 -398078 -129688 -89067 -136059 -130985 266917 438893 129407 238276 244053 99164
22140 99164 346328 331285 386722 409833 293314 61129 63532 108933 173800 202160 -113715
22129 -113715 -59869 463810 452249 181110 -107664 -246572 -403837 -548988 -665871 -352288
22119 -352288 71455 172057 62910 -65689 16478 41358 -287922 -384905 -553613 -651547
22109 -651547 -221652 -39462 -198462 -34838 411499 379638 103324 184326 158230 24908
22099 24908 34004 104158 163126 236172 403625 269068 44873 -22704 -76343 210174 370623
22088 370623 476128 413384 828406 825047 622617 919317 1337022 1536436 1902785 2099352
22078 2099352 2119457 2222356 2146908 2078986 2059104 2155729 2438001 2336878 2354095 2475943
22068 2475943 2489184 2395060 2132666 1945678 1869927 1599576 1307081 1290960 1378087 1386228 1405877
22057 1405877 1590428 1627933 1265256 997341 679588 716857 843588 948211 736825 606740
22047 606740 649930 294120 81134 367010 580812 617648 249079 9487 223663 563979
22037 563979 428914 50990 110316 7851 -79864 -10732 103342 504637 684757 765232
22027 765232 752613 318419 -9002 2178 285695 33594 45784 278800 294010 244381
22017 244381 299263 338589 533050 324408 179841 153239 146231 60371 -229877 -315217 -575000
22006 -575000 -388054 -218976 74423 310777 451681 395352 345782 34845 -169751 7344
21996 7344 282430 512583 660398 563380 596701 506484 68180 300477 357220 159046 411
21985 411 41108 189889 -58064 -189658 -121954 3020 134691 -157778 -304346 -156432
21975 -156432 56237 -76106 -139520 -171533 -151857 -287017 -89148 43747 -86778 -130413
21965 -130413 -189524 -308801 -327679 -88515 252317 471404 390067 315597 329974 237138 264803
21954 264803 199211 239921 398677 335057 221638 80352 -18153 228609 222566 342897 26992
21943 26992 -439175 -576267 -251516 -125011 -33284 21072 155092 249308 167981 95884 104038
21932 104038 248121 200283 200474 -200230 -184222 -112534 -185654 -124704 56742 97400 239452
21921 239452 118734 130897 -224216 -123236 360691 551726 431934 43466 -57598 -161323
21911 -161323 -85711 -76134 -58634 -250894 -144389 45964 -230855 -33225 173849 559587
21901 559587 420995 388841 262449 76601 -150653 -149734 -102148 238757 401271 340334 107378
21890 107378 -186694 -54361 110829 271661 694821 535892 632344 406825 105834 -58802
21880 -58802 137060 65232 -121686 516 -182761 -421567 -212959 -56553 -114160 -34552
21870 -34552 -415946 -492328 -349007 -441015 -274357 -6154 -25891 -112135 -73626 -341967 -730118
21859 -730118 -834474 -659303 -515416 -186360 -12789 117984 217695 692050 890662 562356
21849 562356 251749 126879 529869 573493 633742 351660 65475 34530 199936 548557
21839 548557 622849 524155 458217 -35737 -231165 -145870 -239565 -160854 -173723 -22808 26032
21828 26032 -280889 -271132 -228523 -123816 24651 -34140 90856 132928 44980 -23443 -206925
21817 -206925 -25386 159991 240399 196066 141980 60292 -5783 127576 169018 108897 75172
21806 75172 -187728 -25920 154952 225560 129435 -149089 -17058 318574 346470 39762
21796 39762 -34112 123087 168593 52236 -102486 -424425 -585854 -414742 -286165 -228235
21786 -228235 -232654 -36003 191020 317273 606338 674515 422962 102655 79791 181525
21776 181525 206623 522257 386010 81989 -292914 -198802 53269 219779 114670 122787
21766 122787 285177 464611 454086 659071 792175 851439 863330 1029997 965776 746446
21756 746446 755847 660277 391272 399654 155800 315861 341920 602770 847489 517481 515679
21745 515679 463788 217063 203803 140789 -278834 -477470 -148247 151633 -145152 -283989
21735 -283989 -439761 -318366 -96785 147544 468814 458345 511695 624268 608938 694161
21725 694161 498270 482544 338465 331144 348616 506289 537875 668305 515683 186373
21715 186373 -134932 107839 168342 40359 -140499 76705 362795 621778 357559 330532
21705 330532 550984 702810 408550 212218 87575 -15097 80188 -129851 46038 419645
21695 419645 437660 286821 -29495 -142073 83013 -207466 -448224 -198219 52066 391144
21685 391144 959962 673339 246142 -265585 -344227 -69485 514018 595129 408660 251925
21675 251925 457592 857232 839062 377024 495425 847865 712261 500859 598688 691765
21665 691765 883262 1157514 1205469 737105 552031 405933 443732 474696 367303 449896
21655 449896 351510 254432 80110 -65222 105272 305317 145124 -23414 191427 132026
21645 132026 -220729 -256784 161220 485152 478734 462908 184771 -208514 -167361 121129
21635 121129 160631 -41541 -34793 398210 369375 133455 461048 703689 332368 348329
21625 348329 527437 673427 548719 342377 497825 775894 765658 749149 600353 491679
21615 491679 603956 618467 474657 343282 196216 319226 360673 716273 939107 1044219
21605 1044219 1388207 1784792 1694656 1490422 1521972 1678948 1687295 1693824 1636930 1607272 1693928
21594 1693928 1686752 1854618 2340876 2404927 2091952 1970258 1760011 1872203 2120766 1970598
21584 1970598 1965307 1885138 1287629 1406271 1808584 1831535 1718317 1712663 1448001 1369169 1378402
21573 1378402 1204606 1592311 2067364 2013500 2165205 2263870 1815747 1805672 1764332 1686978
21563 1686978 1707255 1860003 1976035 2222066 2324288 2183156 2164048 2037026 2090384 2155601
21553 2155601 1993911 2430346 2626986 2748397 2792168 2712621 2841358 2788731 2671993 3118821
21543 3118821 3330127 3500561 3670017 3764167 3870908 3990826 3660366 3716628 3784563 3777624
21533 3777624 3849189 3819439 3616261 3495238 4198802 4564088 4509183 4464904 4589163 5210473
21523 5210473 5984834 6182972 6326436 6273863 6299045 6532029 6803818 7029636 7463113 7830665
21513 7830665 7828313 8050594 8491392 8897746 9513617 10327036 11049290 11680565 12567751 13714434
21503 13714434 14787134 16129564 17247482 18269137 20197348 22511089 24411322 26620622
21495 26620622 29490059 32611911 36545239 40515359 44986084 50549728 57443670 65821333
21487 65821333 76271782 88729922 104552636 124733291 149934148 180579052 216372251
21480 216372251 255116281 293512307 327898174 356195413 379040674 397550703 412687317
21473 412687317 423467155 429630207 432617322 434977328 438264724 441969612 443896987 442563869
21465 442563869 437436478 428038812 413465643 392287845 364649187 330943958 293567899
21458 293567899 256651269 222564963 192945718 168266072 147922945 130905962 116325452
21451 116325452 103735586 93042327 83680313 75493614 68196978 61589206 55891626 50754378
21443 50754378 45960847 41969235 38308439 35194381 32059796 29318914 26986511 24755244
21435 24755244 22908977 21388638 19838100 18503079 17245687 16388475 15292158 14527094
21427 14527094 13747118 12414899 11448557 10762843 10445591 9884842 9129942 8450733 8244467
21418 8244467 8007006 7681711 7446763 6965826 6552503 6403099 6057102 5671561 5376728
21409 5376728 5313214 4797468 4506985 4496653 4570420 4279402 4077373 4201225 4101141 3702267
21399 3702267 3628858 3885862 3562580 3187099 3071247 3039715 3365127 3466334 3502174 3430474
21389 3430474 3177383 2753888 2470149 2296949 1636345 1360757 1208652 1471182 1444676 1692535
21379 1692535 1922178 1661318 1435824 1249721 1305801 1601200 1702202 1735367 1558780 1380963
21369 1380963 1381454 1307424 1421038 1383337 1432095 1665506 1434110 809506 705743 715711 858279
21358 858279 1140043 1266800 1072593 1023435 970379 566547 968021 1119960 1150962 1143126
21348 1143126 1174129 1058633 787831 603670 488021 444825 841124 1080339 942240 612572
21338 612572 584805 503197 1010598 1250491 1336691 1329194 1562741 1640451 1921174 2121442 2181456
21327 2181456 2356807 2579793 2759431 3036823 3172466 3397433 3470637 3677158 3698794 3423280
21317 3423280 3258269 3318707 3459616 3337423 3280560 3110166 2851398 2668272 2530649 2451118
21307 2451118 2242219 2016335 2023694 2007662 2102472 1920339 1815633 1764336 1643980 1520594
21297 1520594 1326555 1342560 1885858 1994874 1688345 1292670 1144573 1125656 1186823 1333668
21287 1333668 1408901 1099394 1013840 836832 809944 653750 581830 551959 319923 86735
21277 86735 99824 265169 81826 236503 236263 -1519 37570 134314 376451 351607 275776
21266 275776 341937 389308 435231 510846 550742 371413 -173526 -507167 -609362 -355727
21256 -355727 -83045 173602 305570 469998 251175 211150 433657 458096 392119 288148
21246 288148 384889 254771 304033 171697 102283 62651 -36501 -106747 -103282 154171 194054
21235 194054 7936 37342 286932 246835 78284 -68264 -165457 -81103 -291269 -239653
21225 -239653 48516 229640 373828 561227 658127 719289 774038 746332 916096 829189
21215 829189 883908 547113 393385 389479 180854 -190474 77003 222298 159261 260649
21205 260649 175394 68330 178252 111286 170247 413119 148164 114454 33214 -68651
21195 -68651 41344 217677 -216032 -520462 -386615 -530024 -589066 -449074 -462988 -673411
21185 -673411 -610210 -515377 -492564 -614130 -404755 -226060 -441401 -505624 -252128 1625
21175 1625 205976 214869 303269 235529 131622 114204 -64111 -440722 -634706 -606549 -417477
21164 -417477 -396146 -212655 36252 -117299 -52034 281352 628157 401649 -68813 -361587
21154 -361587 -760918 -555820 -374389 -530021 -514205 -327066 -209843 -46462 82191 -55306
21144 -55306 -410334 -538729 -470570 -175205 97719 -84774 -414329 -419378 -363516 -452244 -533227
21133 -533227 -429350 -344711 -562611 -684983 -562555 -481593 -720966 -521612 -328994 -206224
21123 -206224 -69910 -267107 -177240 178227 81423 -306119 -560922 -268321 -62105 -324320
21113 -324320 -584836 -703685 -417353 -204860 -364628 -148023 -106708 -18568 162484 303085
21103 303085 410311 324283 -92275 -2286 166085 17876 25457 50667 -214202 -254722 142809
21092 142809 310740 252916 -208501 -143302 -48886 -321308 -681439 -586886 -663020 -572433 -622528
21081 -622528 -656738 -425561 -589542 -652081 -91178 140639 123177 327825 248853 -115327
21071 -115327 -321071 -418539 -135800 7382 91524 -20835 -213479 -183040 -184610 -57964
21061 -57964 -32030 -54531 -273767 -22947 197579 333375 230212 160272 -237058 -352841
21051 -352841 -447337 -153272 -44938 -412640 -463366 -639947 -591345 -633440 -259191 336002
21041 336002 224430 113093 -236520 -331271 -250397 -61337 67853 -180845 -412191 -608391
21031 -608391 -660053 -385877 -462274 -144481 15113 -130603 -257393 -634669 -660561 -649267
21021 -649267 -157803 -185348 -578524 -579802 -515438 -238327 -185100 -268009 27561 -86264 -318765
21010 -318765 -223860 -390594 -753575 -791559 -675167 -592648 -418966 -269131 -387685 -657605
21000 -657605 -619451 -227909 -107234 -391081 -431734 -366107 -344043 -359409 -311796 -243372 -303524
20989 -303524 -284353 -128556 -215776 -407216 -457367 -646923 -349608 -119852 -187679 -133326
20979 -133326 -103711 60503 -99951 -527084 -624054 -434850 -325531 -266957 -284144 -327622
20969 -327622 -130572 -8485 53612 22548 -202077 -84503 122713 -20315 -362629 -564435
20959 -564435 -620617 -435544 -334020 -206694 -226774 -361317 -332233 -72348 108438 103668
20949 103668 -134421 -149030 -286462 -317728 -428717 -394875 -136921 127469 424093 328573
20939 328573 5054 -377682 -590913 -577264 -570346 -481970 -276665 -334744 -555753 -727419
20929 -727419 -542527 -485479 -665054 -940396 -1133403 -792711 -298157 5542 229586 293714
20919 293714 255646 381227 360657 281056 327598 24775 26822 -115051 -74591 -602016 -880156
20908 -880156 -749105 -358021 -219276 -122098 -35501 -39087 -233760 -226335 -330823 20395 248118
20897 248118 402610 -8174 -338856 -562129 -404154 -320678 -218713 117784 175562 18016
20887 18016 -134124 -197864 -255623 -204728 -25976 -150844 -176802 48502 190442 358922
20877 358922 182975 276881 438139 418322 559150 989933 1305308 1443019 1818580 2241158
20867 2241158 2335683 2263710 2101515 2205802 2220286 2219319 2594344 2810542 2538269 2209960
20857 2209960 2274614 2563737 2446818 2357154 2251031 1700141 1495072 1563749 1544336 1297504
20847 1297504 1131222 1052425 904151 866686 713012 379448 69873 9251 -30925 407336
20837 407336 437468 263240 423782 716666 221665 117639 -6165 -84064 161622 62608
20827 62608 -200877 -119943 -92679 247772 100749 27644 -99680 152982 385809 342726
20817 342726 193531 96633 -389 -164293 -336364 -313687 -215187 -232949 -182496 -284311 -392570
20806 -392570 -704165 -871665 -1019135 -1272330 -855220 -394776 -475825 -483998 -376647 -327071
20796 -327071 -181229 152881 380505 182653 -314255 -323785 -562260 -395891 -326523 -657636
20786 -657636 -417345 -418447 -228760 129812 69607 -44314 -263408 -153851 -220782 -428022
20776 -428022 -215348 -7350 -134906 -229687 -138019 317328 470258 -54040 -392875 -142531
20766 -142531 220148 -7841 -68115 103817 41469 -132039 88685 -61149 -157770 -188817
20756 -188817 -483045 -953791 -767377 -364148 -149015 17783 -156487 -204037 -60839 -97790
20746 -97790 -43346 -129325 -214320 -248584 -257893 -327725 -505475 -378146 -253000 -327935 -681625
20735 -681625 -718151 -725726 -672745 -505415 -501869 -754132 -917195 -813336 -613655 -367247 44308
20724 44308 -88095 169222 178331 -264388 -38035 301380 -15017 -353977 -398964 -385562
20714 -385562 -394604 -702373 -779450 -641259 -50377 -36833 -227190 -126635 180513 349016
20704 349016 -28298 -306417 -507624 -552118 -486420 -334594 -12998 -44496 -322809 -433175
20694 -433175 -488041 -646753 -457463 -126212 377823 198805 -228688 -314039 -161458 13226
20684 13226 3159 33183 326840 297230 -57004 -433245 -359346 -353733 -413564 -333255 -254892
20673 -254892 -238653 58899 450891 302788 22986 83198 -111524 -191106 -163429 -257280
20663 -257280 -190852 -61730 12705 -308649 -476367 -451013 -66527 19864 -106488 -253419
20653 -253419 -151357 -302113 -345618 -339962 -349301 -375452 -94059 388604 440227 264700 52190
20642 52190 -87092 2814 184435 30242 158328 340016 305753 114100 174360 -104515
20632 -104515 -354150 -444099 -371663 80932 263484 212977 156202 -134021 -69547 -101747 -324020
20621 -324020 -326709 -157204 105848 242490 209595 256895 73988 -374829 -372767 -240861 -119591
20610 -119591 -225568 -439123 -175576 -178313 -224260 -64761 57180 119206 52577 -58222
20600 -58222 -36836 -228120 59341 93095 -260273 -629384 -809545 -633881 -729290 -345936
20590 -345936 135863 -43964 -223676 -536184 -529476 -249600 -58576 5235 49809 129528
20580 129528 93103 383881 204976 73070 487741 340892 109376 332080 393717 14029
20570 14029 -544806 -507686 -420413 -250201 -238971 -215216 -201291 -314555 -196161 3373 46137
20559 46137 -89137 -493953 -379438 -398516 -294374 -242785 -128944 -174554 -74780 -173529 -140507
20548 -140507 -419939 -630796 -339365 -264961 -341226 -410328 -255307 -389983 -365849 -248260
20538 -248260 -725571 -944510 -607366 -280496 -149059 35962 -95372 -60295 -226002 -324071
20528 -324071 -274843 -335270 -446481 -449279 -229203 41952 17394 -115619 -94483 -81187 -182010
20517 -182010 -24164 -50901 4210 175625 166287 108225 173632 435493 181231 5403 -20587
20506 -20587 85975 81079 110221 -24362 -98905 233326 -41524 -507272 -669497 -813466
20496 -813466 -741774 -239499 -129129 211995 322245 -111517 30575 290165 228306 256584
20486 256584 378209 99166 9059 76973 -45832 -205835 -287738 -104482 120 38488
20476 38488 -47711 2781 -32050 -61055 138957 415058 175830 184789 -35298 -114411 2676
20465 2676 70600 -20228 -144267 12157 -116864 -327444 -329201 -185702 -371611 -770732 -627609
20454 -627609 -155386 18463 -31098 -79623 59981 -18347 15188 -77416 -258596 -439015
20444 -439015 -502548 -494093 -666281 -579812 -489658 -664933 -769997 -404701 -132466 -81280 -366856
20433 -366856 -358871 -324578 -358530 -504507 -563671 -553880 -401683 -461475 -300304 -90719 84027
20422 84027 -328801 -375853 268478 416124 387454 306837 156940 270540 459069 265085
20412 265085 237807 -108331 -352532 -245134 -90075 212685 139070 52355 -36298 -189448
20402 -189448 81359 287856 -143960 -361651 -342511 -452706 -111680 61378 48900 158114
20392 158114 653070 781265 515276 333548 97351 -91322 -71579 153094 420890 340906
20382 340906 -69806 178442 21549 -220845 -322385 -366472 -445460 -450239 -204014 -81572
20372 -81572 28116 136492 100164 -13013 -243449 -459309 -306462 -110423 -76055 -258283
20362 -258283 -632963 -713907 -672154 -409922 -284237 -313346 5149 32178 -399583 -957175
20352 -957175 -1281173 -657217 -350814 -441968 -559574 -690361 -532201 -152747 216123 71779
20342 71779 95638 -204894 -340377 -296126 -69973 -38756 -29225 -257470 -684880 -629363 -343551
20331 -343551 -16626 497830 320456 69877 367587 338616 81958 15525 179399 48511
20321 48511 -206002 7699 48745 -176334 -580470 -533754 -175683 -138291 -171758 -207288 35813
20310 35813 -22640 66843 180560 55864 -40755 -2008 108656 197438 399273 527020 241979
20299 241979 77935 30665 19659 -399252 -526902 -450531 -317547 51812 108795 -184052
20289 -184052 -712456 -851546 -646589 -602608 -293380 163240 189879 7213 268510 94850
20279 94850 -148009 -197502 -56377 77049 30280 117211 349674 416921 312078 339636 24033
20268 24033 85133 30250 -98280 -124364 7750 -69481 -274670 -9543 -166354 8902
20258 8902 -254435 -117451 -152342 -248493 -191079 -223680 -65732 -34327 51842 43647 209044
20247 209044 166457 13826 -125799 -210015 99438 114576 253111 221117 -22881 -227080
20237 -227080 -667361 -552106 -21895 194236 188496 330460 274781 181504 445395 59609
20227 59609 -344777 -487944 -617996 -483702 -225445 38831 184060 121247 362774 458914
20217 458914 95469 -293823 -142722 371548 682429 668028 412817 247332 189420 66753
20207 66753 103631 244230 293891 -121315 -340211 -296050 -178743 14654 59129 107212 82437
20196 82437 30105 54609 -59504 -162905 -160474 -27024 -35801 -148663 -309352 -327677 -187397
20185 -187397 233012 287209 277822 506720 222753 -79315 -2295 -25482 -400300 -58705
20175 -58705 27189 -243046 -202258 2239 -5675 105828 43658 128076 -214419 111633 608280
20164 608280 791465 762731 624589 430786 436105 113254 -33907 -163127 183650 397209
20154 397209 320125 311940 674611 541202 478920 851802 548347 504701 461300 -11709 -77856
20143 -77856 102606 296568 215423 358268 537615 526638 200789 291379 502664 237914
20133 237914 204483 390153 274649 298955 7341 -116779 30064 -48439 -95148 -229333
20123 -229333 62566 234280 474345 315434 172098 111514 342434 370665 482152 559464
20113 559464 343741 56213 -145658 -13512 126563 168703 476869 266724 288034 366601
20103 366601 648388 827898 586607 262865 174501 138982 500056 549248 611160 464834
20093 464834 250441 119597 50300 -133493 -393678 -2791 579668 543634 458056 337828
20083 337828 313757 178472 259988 848420 1100235 1073847 909804 342826 31316 99536
20073 99536 -1279 25486 239930 274409 388939 103970 377875 641806 790248 841675
20063 841675 861940 847535 483591 449460 487521 456835 292556 343411 599705 790709 794503
20052 794503 620723 528121 371964 380120 745435 930840 1019596 1145453 911355 845226
20042 845226 739297 475404 723153 828398 955997 1012206 1101754 1251432 1801560 2160477
20032 2160477 2028067 1922017 1972011 2105247 2202821 2148105 2012323 2165284 2461271 2595818
20022 2595818 2262021 1983879 1891131 1770292 1942218 2115939 2179820 1706750 1496292 1768166
20012 1768166 1984494 2138664 1968004 1605709 1351442 1134561 1013893 750333 801934 911615
20002 911615 943924 576076 454015 749293 586161 776817 662920 336595 269906 304241
19992 304241 538883 604769 800126 925985 705472 690399 655196 544383 445909 660793
19982 660793 564057 419823 270899 233120 200449 336323 157773 181702 256622 83947
19972 83947 158653 426495 630875 638485 582693 511572 420681 118495 168163 -21716 -374345
19961 -374345 -85926 216898 622979 644626 558114 624534 899625 907829 649928 741838 840801
19950 840801 841762 574857 360096 182327 576185 932377 731933 310413 265370 377498
19940 377498 314360 169050 254342 198189 293515 433962 305880 391049 532166 603088 585147
19929 585147 491193 720758 633003 383763 536460 672196 539984 276249 231135 409275
19919 409275 490080 238326 162018 534603 810696 871639 826231 1069771 1112963 629129
19909 629129 344144 334961 502557 209050 358567 552633 526630 567749 310872 190942
19899 190942 348670 360975 151336 398125 390404 526992 389088 318128 337010 418174 778202
19888 778202 617655 318542 448021 364687 634929 890430 868717 599140 494723 14414
19878 14414 199976 198453 155227 230373 237751 150145 268046 508484 504779 453959 493010 680020
19866 680020 718703 373966 933 -89900 365541 398356 269979 165506 223439 530134
19856 530134 694035 358279 264943 300084 388259 531627 440626 446737 393830 376540 116886
19845 116886 4351 -5988 105005 309718 352267 613340 750913 219934 161879 -9381
19835 -9381 107806 299773 417788 728288 788560 384447 153411 387665 624571 783090
19825 783090 632818 582517 302734 168591 244260 141897 370011 752119 834348 481114
19815 481114 335438 359190 359492 470872 375439 529052 375659 201473 130358 428215 673044
19804 673044 527764 221750 156391 35778 -10445 26748 180595 204673 394784 441471
19794 441471 497202 478409 576301 569575 325285 254974 291874 228044 46770 -83013 137090
19783 137090 318943 209873 35883 219035 546468 752553 523906 369210 385224 341322
19773 341322 52980 153426 -71980 -17890 -55781 169642 393096 174071 91361 -112771
19763 -112771 -320047 -313024 -174508 -124776 -42866 -116788 333493 597600 650512 652964 531882
19752 531882 170322 122841 248310 230612 254258 220652 238085 610421 821328 608588
19742 608588 340947 188650 291284 491547 390370 513393 386823 -161989 -197366 226550
19732 226550 286687 647874 587698 393919 248027 317516 414977 328623 488921 413619 348508
19721 348508 181083 -16723 -42309 29689 168787 171733 71307 61341 351164 687499 656591
19710 656591 478443 464353 469744 759754 741847 968901 896975 716250 547320 680741
19700 680741 954083 778250 481071 426574 582824 381785 402684 411018 383876 424216 707190
19689 707190 960795 713681 695157 790792 759179 835242 638695 823685 1074222 1090973
19679 1090973 1025947 1118915 1043598 691763 499782 818561 885973 955776 926676 1199814
19669 1199814 1513377 983404 524374 158644 193329 483535 831372 819039 910887 588858
19659 588858 584096 858446 1006277 1006919 875508 923319 787476 898808 881101 932076 1228632
19648 1228632 650433 263711 547286 370278 90823 369200 319657 305071 324158 725205
19638 725205 858101 939263 1005141 879077 717375 754404 732219 869209 1024918 1004402
19628 1004402 974284 704490 458343 521686 981609 969550 1023220 1003471 964224 843693
19618 843693 828956 908914 694239 425247 558538 822457 762189 655743 546031 522180
19608 522180 413554 461016 891941 1001761 995502 993422 1328747 1320345 1141036 762081 572475
19597 572475 473086 586181 686746 508944 718170 1200116 1633351 1843428 1865915 1475311
19587 1475311 1412536 1435185 1624908 1826651 1861236 1326863 1279017 1619337 1795853 1959868
19577 1959868 2155058 1948186 1712105 1652027 1732079 1270039 1019283 1035186 1624677 1954905
19567 1954905 1934838 1651666 1387236 1540020 1569114 1735426 2212329 2311011 2106017 2123680
19557 2123680 1878910 1561381 1509200 1654154 1946038 2053778 1924182 1998747 2017095 2220650
19547 2220650 2440979 2869611 2831968 2517552 2398703 2723262 3150023 3067366 3024769 3364306
19537 3364306 3458159 3668601 3882410 3837175 3645768 3587882 3518663 3486677 3635843 3858713
19527 3858713 3990046 3851938 3741519 3903273 4094237 4274551 4295488 4273725 4538852 4444631
19517 4444631 4438433 4392855 4200671 4193296 4295730 4400075 4259297 4085132 4010147 3868510
19507 3868510 3906131 3911685 3832542 4211638 4288893 4086212 4299192 4230949 4456553 4546245 4719665
19496 4719665 4649769 4820362 5003307 4721561 4814560 5151308 5185182 5001813 5074348 5262173
19486 5262173 5374406 5455680 5988964 6252112 6247282 6463483 6684517 6641598 6588957 6898682
19476 6898682 7002701 7077043 7165510 7207753 7566656 7747810 7913508 7867215 7950703 7990519
19466 7990519 8139325 8472669 8814289 9027148 9323265 9488417 9634829 9789654 9962015
19457 9962015 10085639 10717685 11549782 12201894 12861883 13678838 14354932 15137448 16026696
19448 16026696 16818450 17423769 18167150 19274307 20333664 21074617 21986319 22827288 24150099
19439 24150099 25460027 26795986 28248625 29502639 30938604 32729681 34421727 36668392
19431 36668392 39188045 41732096 44527092 47711029 51432426 55422470 60213515 65444720
19423 65444720 71453109 77947604 85408080 94055791 104081196 115589043 128601092 143558361
19415 143558361 160758080 179781256 200704104 223784831 248569138 274136869 299442649
19408 299442649 323667448 346062815 365437474 381721902 394590004 403521474 408007563
19401 408007563 407743849 402631083 393345933 380422494 364292898 345430815 323770723
19394 323770723 300873308 277844067 254955136 233145839 213336178 195105909 177948218
19387 177948218 162243603 148204131 135506542 124301274 114277814 104997266 96669304
19380 96669304 89561848 82418562 76407376 71095861 66094399 61471932 57521436 53718233
19372 53718233 50048865 46995572 44380413 41657251 39443550 37545172 35252889 32863661
19364 32863661 31029509 29245561 27521576 26244869 24805995 23322430 22038873 21318661
19356 21318661 20407237 19342343 18463477 17693582 16998264 16537296 15679899 14545855 14045990
19347 14045990 13610400 13052279 12525729 11924685 11238650 11127252 10631369 10001423 9909227
19338 9909227 9578664 9424555 9202789 8849352 8727300 8393762 8090350 7932261 7590970
19329 7590970 7340588 7153437 6804365 6578364 6305327 6005215 5602721 5269215 5511290
19320 5511290 5705129 5297081 5173409 5124340 5149282 5171997 4977924 4655033 4513169 4360708
19310 4360708 4354236 4251531 4098240 4070978 3955214 3758230 3782037 4085664 4252632 4152869
19300 4152869 3715681 3468751 3653339 3507756 3371283 3298835 3275129 3210140 2705503 2691399
19290 2691399 3102319 3292904 3364504 3182681 3186518 3106828 2737736 2931296 2882774 3164168
19280 3164168 3338789 3249815 3241301 3084899 2518926 2531514 2585842 2530815 2670646 2952442
19270 2952442 3080137 3368027 3184983 3092048 2830164 2441297 2444813 2467010 2440831 2506590
19260 2506590 2417438 2449472 2431828 2674452 2701936 2391124 2331280 2658815 2585885 2446216
19250 2446216 2681453 2730857 2750872 2871362 2931719 2929395 2700573 2382422 2098695 2007362
19240 2007362 2366632 2730706 2441870 2345364 2372557 2562850 2318198 2195466 2017134 1973476
19230 1973476 2109647 2080096 2102286 2115910 2395007 2451823 1938713 1941680 2084179 1896468
19220 1896468 1359642 1169387 1230722 1616582 1704459 1760190 1358395 1237364 1349528 1823148
19210 1823148 2509898 2667911 2619394 2386178 1933187 1575942 1728081 1741156 1888443 2007829
19200 2007829 2041373 1876190 1540835 1604209 1741779 1827756 2096453 2014702 2218983 2319661
19190 2319661 2297530 2505299 2503125 2298931 2300281 2355469 2337254 2374944 1923553 1656841 1831591
19179 1831591 1955804 1963306 2016981 1944744 1947292 1895449 2208820 2135809 2073600 2326356 2331085
19168 2331085 1995338 2044427 2375924 2455929 2562855 3022165 3506039 3385792 3251250 3193596
19158 3193596 3442866 3713369 3974535 3616241 3589241 3393134 3326163 3191156 3100461 2787366
19148 2787366 2493422 2416596 2147153 2319416 2715198 2703058 2626091 2675279 2681502 2581321
19138 2581321 2112520 1736857 1925541 2370961 2376367 2584838 2786298 2882030 3124075 3035734
19128 3035734 2824681 2895921 2875054 2708628 2632203 2942161 3028827 3006995 2606729 2521471
19118 2521471 2688131 2689296 2578481 2843380 2991666 2964152 3124066 3162316 3067237 3076865 3051153
19107 3051153 3129777 3163463 3030487 2906842 2787223 2834938 3276965 3019684 2901914 3180142
19097 3180142 3726178 3579502 3577118 3670894 3172845 3108001 3080890 3540122 3972464 4006384
19087 4006384 4258953 4288255 3906574 4119722 4151156 4137114 4095758 4050868 4105853 4167666 4440491
19076 4440491 4561961 4724662 4984099 5018796 4719176 4584894 4459846 4646083 4653852 4977528
19066 4977528 5495283 5670032 5865940 5960965 6074037 6187434 6462987 6921537 6899237 6674490
19056 6674490 6731583 6842398 7275924 7493366 7431855 7378340 7277255 7365121 7307983 7369960
19046 7369960 7636758 7809611 7727277 7514394 7691848 7823332 8176623 8582372 8486947 8771414
19036 8771414 9129205 9384003 9538396 9861121 9981533 9820061 10057401 10434178 10307014
19027 10307014 10295655 10537911 10817936 10795984 10801538 10506957 10421946 11125734 11698690 12307999
19017 12307999 12520535 12421871 12320518 12446350 12968979 13526711 14244847 14532308 14774930
19008 14774930 15142159 15470439 16065058 16875563 17590527 18328502 18846629 19104612 19717282
18999 19717282 20021836 20277887 20778663 21507559 21956952 22717149 23296282 23940826 24504516
18990 24504516 25245325 25906014 26501162 27043325 27705053 28226449 29438701 30499137 31470308
18981 31470308 32747986 33987155 35196822 36435504 38174818 39642797 41270884 42639433
18973 42639433 44361294 46197221 47955843 49941731 51592257 53317972 55410377 57704649
18965 57704649 60238832 63147567 66562777 70012516 73353127 76843927 80799782 85221908
18957 85221908 89969373 95107988 100540675 106276075 112442378 118977254 126024402 133420861
18949 133420861 141558369 149821966 158089340 166541879 175537290 184719786 193373480 201473098
18941 201473098 209714372 217732468 224652294 230853260 236180777 240934931 244878640 247757980
18933 247757980 249820344 250855325 251111806 250419136 248666185 246833301 244596031 241901196
18925 241901196 239285774 236947277 235086552 235028267 236352147 239566846 245259306 253704231
18917 253704231 264750779 276954383 289047156 300224408 310650328 319965767 327768938
18910 327768938 333020016 333907729 330172772 321492095 309243124 294680988 278435806 260387869
18902 260387869 240780238 220440885 200481009 181529917 164497028 149949987 137292607
18895 137292607 126397832 117103370 108866218 101981795 95634228 90154351 85491776 80915722
18887 80915722 76901669 73960173 71581783 68962324 66244426 63846366 62292264 61072705
18879 61072705 59920643 58564004 56921463 56052761 55015730 54423948 54658976 55149399 55881776
18870 55881776 57094683 58962837 61064794 63916555 67788513 72719425 78886428 86934682
18862 86934682 96883953 109347665 124895184 143966809 165985677 190476146 215698860
18855 215698860 239626257 262272051 283257922 301474669 316284489 325928686 329464467
18848 329464467 326150250 317217590 303981062 287844997 268972731 247350796 223769285
18841 223769285 200332254 177854506 157214195 138622715 122862469 109583967 98345780
18834 98345780 88704470 80390419 73112982 66523827 60398224 55098207 50649994 46851537
18826 46851537 43718714 40596244 37755347 35171987 32966210 31163290 29791879 28085862
18818 28085862 26575839 25568301 24347129 22897519 21907293 20961926 19897702 18330211
18810 18330211 17304121 16828757 16180508 15500760 15099045 14426945 13611406 12928658 12238482
18801 12238482 11938001 11792275 11325607 11015698 10775006 10070013 9991723 9821830 9439914
18792 9439914 8971200 9039540 9417649 9043823 8827938 8839518 8842983 8633870 8456582 8385236
18782 8385236 8308184 8100359 8163105 8323033 8142664 7831800 7895957 8106738 8122538 7664977
18772 7664977 7548082 7707663 7457060 7191493 7151504 6816115 6616459 6587214 6228085 5561743
18762 5561743 5212037 5187481 5042417 5010851 5128788 5090396 5078897 4774272 4770525 4552052
18752 4552052 4046893 3926625 3960984 3725753 3755228 4064465 3919750 3533818 3451505 3724057
18742 3724057 3875685 3846956 3981047 3786701 3587236 3523146 3248423 3407284 3824786 3932270
18732 3932270 3557876 3457426 3283078 3187191 3316863 3014004 2886584 2488590 2434707 2582976
18722 2582976 2842732 2620159 2740399 2667108 2275300 2366471 2375903 2141599 2273763 2764610
18712 2764610 3061848 2722082 2345144 2222632 2503672 2476048 2380119 2544534 2822513 2964138
18702 2964138 3008230 3036869 2915457 2964376 3095391 3040742 2701495 2451103 2639799 2740786
18692 2740786 2991290 3424255 3088909 2351127 2047558 2125918 2158905 2428746 2580363 2566646
18682 2566646 2332464 2225174 2222245 2072071 1632338 1566074 1506266 1438242 1422116 1483511 1771635
18671 1771635 2116532 2316319 2157446 1938492 1801146 1620504 1849020 1959701 1731631
18662 1731631 1765263 2072235 2214032 2033304 1947504 1915298 1969666 2015847 1822104 1548332
18652 1548332 1514290 1267399 1269098 1472623 1324320 1608179 1892168 1725497 1817517 1864257
18642 1864257 1673056 1849238 2128092 2453195 2497911 2396183 2341338 2129617 2040521 1992178
18632 1992178 2340730 2507935 2641976 2660454 2694169 2363752 2333854 2521218 2672543 2613605
18622 2613605 2646855 2449036 2146053 2091867 1988949 1799847 1824350 1869695 1874051 1640294
18612 1640294 1748954 2123287 1933309 1871836 1782734 1692452 1777360 2081603 2282957 2375326
18602 2375326 2401428 2367930 2479791 2740581 2617786 2290410 1933617 2181383 2808467 3336960
18592 3336960 3647899 3888680 4205465 4474919 4202056 3699897 3551104 3383665 3565149
18583 3565149 4044034 4523161 4598181 4578966 4485638 4462085 3951335 3551457 3439492 3094570
18573 3094570 3273766 3378686 3279583 3322864 3636404 3678037 3362822 2904461 3023684 3259363
18563 3259363 3360158 3285842 3481545 3676182 3743254 3705705 3735730 3519363 3697522 3707316
18553 3707316 3870707 4265798 4855813 5202223 5701627 6239313 6558599 6548471 6484211 6834085
18543 6834085 7375713 7547495 7692731 8299741 9199223 10279990 11191831 11957590 13111180
18534 13111180 14338793 15525164 16524452 17708185 18991321 20819201 22352901 24809306
18526 24809306 27993685 31734623 36776947 43433809 52256702 64395850 80781513 103740484
18518 103740484 135851332 178432854 228731642 276063527 306378058 312640098 297298019
18511 297298019 269084132 240476375 221048610 215894706 226598386 252688563 289091293
18504 289091293 322745206 339405354 332007950 302954108 261256339 217261695 178894078
18497 178894078 149131139 127212790 110939364 97902061 87342766 78497089 70888329
18490 70888329 64254569 58222111 53332910 49147626 45739189 42921161 40495303 38291569
18482 38291569 36196733 34401611 32805717 31419491 30295410 29693367 29382526 29468168 29491673
18473 29491673 30033375 30169755 30463131 31029855 31819546 32579652 34030848 36042315 39504693
18464 39504693 44065038 49938879 58082937 68825220 84154111 105721268 134767423
18457 134767423 170731601 207536448 234579218 243958562 235534145 214629110 190089020
18450 190089020 171113420 162929745 166712103 182623502 208255839 235703352 253025334
18443 253025334 252310687 233269412 201252751 165306612 133177374 108391033 89953970
18436 89953970 76502912 66548906 58507533 51473262 45214752 40229605 36031435 32310388
18428 32310388 29127708 26185191 23713804 21655907 19732662 18346662 16878078 15145260
18420 15145260 13679545 12609364 11699598 11017591 10359625 9842278 9354995 8682050 8071820
18411 8071820 7428951 6733503 6102991 5512248 5278115 5181587 4634053 4120672 3813945 3635645
18401 3635645 3170265 2625349 2828173 2954223 2710634 2611716 2781947 2391645 2172822 1917542
18391 1917542 1674234 1569301 1674182 1469224 1472487 1634993 1559254 1610042 1751570 1833004
18381 1833004 1679671 1757770 2095018 1827053 1625329 1901861 1807009 1958199 2219254 2032196
18371 2032196 2062297 2122635 2294854 2569871 2453825 1992990 2044070 2477480 2422931 2333520
18361 2333520 2535299 2936173 3426470 3319372 3183701 3285764 3126110 3151569 3008372 3017068
18351 3017068 2895035 2741093 2862801 2620331 2354897 2118540 2284365 2330351 2400847 2472633
18341 2472633 2617936 2367817 2514825 2502375 2421240 2078492 2289272 2198970 2296686 2630472
18331 2630472 2372579 2228856 2251955 2074322 1822079 2083102 2269847 2400852 2430536 2357263
18321 2357263 2302276 2065229 1864989 1745589 1650615 1297591 1337650 1437828 1138822 893404
18311 893404 907234 1371454 1170702 1124250 1237572 1307831 1619258 1932984 1773261 1406766
18301 1406766 1378810 1553217 1679502 1514724 1487626 1465167 1525134 1831578 1852952 1570448
18291 1570448 1308076 1016330 1186020 1508612 1331400 1016199 1081846 1061489 1134148 1299392
18281 1299392 1758588 1798384 1350270 1004891 1027974 903992 658934 593022 702529 1049818
18271 1049818 1091051 865134 848703 914038 561748 528643 900201 998392 916502 1284017
18261 1284017 1031030 989507 912013 767146 680924 559851 -29031 -35707 328545 466682
18251 466682 541634 769861 641493 446584 184032 160548 497946 589063 350324 293478
18241 293478 548273 889554 1113034 1086230 969000 971052 783942 821304 789311 628665
18231 628665 161888 18068 10357 13500 -94150 -64763 153988 329744 489082 582013 327487
18220 327487 166828 49500 304580 173605 145698 227677 105574 -63213 -49803 -169761
18210 -169761 -620374 -768203 -479442 -271176 63867 150 -219950 -351384 -297061 -241391
18200 -241391 -338314 -108218 153174 56454 -221294 -320567 -99733 -232744 -357790 -523320
18190 -523320 -494563 -322218 -57521 374096 513020 388911 598716 703471 478424 6390
18180 6390 -372846 -355352 -187734 -86914 44404 151892 173929 325374 426088 282311
18170 282311 -133033 -164715 89628 120492 -142749 -216052 -13994 39340 -110493 212
18160 212 252512 407385 -44935 -477509 -350423 -68233 215315 70505 -160587 -250581
18150 -250581 -133118 -292246 -177041 101245 328899 383380 122913 351023 611858 593371
18140 593371 786559 666574 666835 706591 570030 491815 657994 874526 561363 278777
18130 278777 93572 207189 165034 294878 444363 271778 618493 584795 564788 450230
18120 450230 123100 159660 232290 136928 -62813 210781 444390 329725 342506 661485
18110 661485 557270 409881 488645 837494 832046 583091 593074 587862 1050207 1267661 1139617
18099 1139617 568075 324305 303726 164776 100359 323881 268384 60906 25034 13650
18089 13650 110576 191249 336645 475856 614342 512323 653731 679275 468234 302477
18079 302477 304404 254617 485577 253064 96121 396346 767981 629906 499261 370075
18069 370075 309591 121942 -63334 118393 477078 515619 763515 616132 191298 -42809
18059 -42809 -202485 -78603 74723 -97919 39197 108693 353861 381231 426108 434919 225411
18048 225411 159667 -34944 -364607 -266196 97023 491585 656924 208249 -145890 -208680
18038 -208680 -150447 -168702 -197465 -379687 -423448 -380803 -410393 -390373 -277084 -388665 -372475
18027 -372475 -369738 -309397 -281962 -111447 -232693 -113063 107675 494791 391242 190434
18017 190434 86450 409845 327500 150386 -32337 -147537 -180848 -418960 -383254 -148914
18007 -148914 197866 240166 -254310 -190254 -78973 13967 101523 -172004 -177878 -150436 -93813
17996 -93813 -173194 -241978 -195344 -191664 99322 220637 -73947 -84147 -513935 -547615 -212800
17985 -212800 -347762 -294017 -195758 -259323 -465622 -280048 199477 371139 445415 334430
17975 334430 66241 -47105 -9574 23098 72126 28411 538435 922440 1044641 1082518
17965 1082518 1069926 1139203 1098449 917160 873283 1295392 1403406 1664603 1943659 1896497
17955 1896497 1512840 1167715 789238 602268 374091 458103 615161 509606 617301 276733
17945 276733 388781 174650 -296110 -91936 98711 -190792 -139947 123999 220346 405899
17935 405899 452185 465416 513565 257364 3185 15172 10766 56847 99119 570206 479199
17924 479199 593647 523253 325641 128629 146792 246289 80195 -49506 -167984 217907
17914 217907 457194 571655 554717 738083 790773 1024608 1560004 1497280 1127361 1021515
17904 1021515 1037548 992493 942298 958104 886024 894730 1138252 1029765 805500 630798 608432
17893 608432 621922 505024 105971 39753 -283429 -296846 -217754 -331881 -511181 -339617
17883 -339617 34709 99575 107251 -87194 -236509 -319706 85094 166687 273346 -41049
17873 -41049 -284866 -722163 -869443 -688569 -734298 -847772 -845333 -834923 -1125014 -912347
17863 -912347 -555309 -200671 -365370 -423645 -430853 -599231 -511896 -277001 -153383 -368790
17853 -368790 -239154 -184801 -502898 -363242 -85995 -115547 -239244 -218552 -18574 232543
17843 232543 198892 -31794 -267674 -16154 -5861 135887 306557 324095 124366 -78057
17833 -78057 -297435 -287671 -276728 -111263 -141088 -227896 -381135 -718092 -697876 -336059 -399705
17822 -399705 -287952 -226948 -278137 -296704 -418698 -754785 -1098323 -918413 -535193 -113015
17812 -113015 90714 -46742 -67652 -274232 -515909 -382355 -599288 -383197 -384973 -443176
17802 -443176 -5853 113858 -50116 -357293 -605245 -774143 -494187 -410220 -467829 -509978
17792 -509978 -592826 -512395 -279357 -237221 -548059 -691864 -378392 -36395 -70743 -183953
17782 -183953 33517 273085 380552 184984 28641 -201053 -309067 -316446 -243415 -289379
17772 -289379 -419157 -399085 -270821 -488024 -587177 -383670 -309234 -373440 -499901 -539212
17762 -539212 -356569 -78988 195245 417976 211805 193899 322694 203273 -76402 -88400
17752 -88400 -201740 -417500 -165671 56216 -136937 116243 474084 341827 -93209 -220952
17742 -220952 -190810 -252799 -282759 -238016 -188011 -116696 -272633 -181363 116006 112173 112221 219911
17730 219911 165583 -320617 -365793 -421733 -321061 123344 531248 562656 281705 76373
17720 76373 -502420 -565598 -433319 -296371 -89489 107996 397253 206196 39383 51533
17710 51533 170629 361432 340620 -164036 -176721 -577681 -658557 -742306 -533803 -420376
17700 -420376 -373689 -145671 -136249 -79128 -195496 -411874 -135225 -86159 -309820 -110436
17690 -110436 -9582 -222161 -479690 -402093 -433235 -468850 -388058 -138343 22746 -190120
17680 -190120 -305365 -274650 -121166 -118701 -509249 -455341 -395537 -552177 -654761 -727872 -465150
17669 -465150 -153543 -304797 -580670 -533762 -353638 -300818 -135543 -357183 -209012 199476
17659 199476 74624 -18952 -123295 58897 -111716 -682731 -890728 -771676 -529951 -387576
17649 -387576 -300019 -240181 -291147 -108573 -178631 -442848 -355448 -417694 -471887 -722004 -556337
17638 -556337 -390522 -327414 -411436 -477342 -751564 -649752 -816448 -518192 -50368 -169036
17628 -169036 -246662 -86704 36098 -143991 -344508 -441585 -273491 116423 231929 124653
17618 124653 -91978 -168047 -330034 -364603 -401509 -249169 -297269 -146491 -109012 -148784 70978
17607 70978 144324 324522 236410 190117 -245973 -599782 -827469 -799053 -785119 -637749 -525862
17596 -525862 -393437 -363498 -476825 -483141 -749576 -648752 -249071 231311 261610 -121588
17586 -121588 -224468 -213820 -400662 -375084 -556312 -542775 -209957 83093 118668 -118037
17576 -118037 -117706 -266548 104480 244304 257579 230345 -6236 -292436 -331895 -250599 -465634
17565 -465634 -745197 -926800 -702643 -628639 -139117 -201891 -118886 -62086 -224145 -315821
17555 -315821 -240079 -227444 -315038 -32746 114241 234915 202069 -194303 -53532 43187
17545 43187 68948 232957 76190 -52952 -263075 -636624 -652382 -601982 -748679 -602774
17535 -602774 -353365 -121683 151655 48708 47842 45898 -90131 -487711 -547632 -353779 -488216
17524 -488216 -346382 -65643 -60003 -112740 -177419 -44445 66952 102388 -218807 -529153
17514 -529153 -612126 -797630 -635195 -912113 -898183 -661817 -607106 -452921 -223385 202785
17504 202785 66659 -116675 -61631 -64990 -324332 -756010 -872446 -487694 -274278 -311164
17494 -311164 -53091 253246 36485 -81300 -294719 -552855 -788919 -813638 -769506 -646089
17484 -646089 -538469 -316850 -124781 20013 129188 -8233 -322074 -572501 -416757 -356115
17474 -356115 -322846 -170379 140028 257448 177009 -77846 -339157 -149385 117918 4228
17464 4228 -51808 -49950 -359117 44272 158702 -137645 -392104 -398079 -256412 -148620 111386
17453 111386 -86298 84776 458104 576142 329875 23438 -70929 -281247 -283214 -247659
17443 -247659 -180988 -38079 -217941 -127090 -315493 -341606 -651831 -962897 -892046 -890617 -645890
17432 -645890 -548507 -370097 -260717 -293050 -118164 92157 -141535 -279265 -425770 -602814
17422 -602814 -677832 -678348 -394603 -33283 134821 -279936 -580350 -452014 -308665 -151480
17412 -151480 -255334 -160269 99531 -147811 -229939 -201952 -525683 -293480 -300961 -214004 136372
17401 136372 536328 -82279 -513597 -371245 -486679 -631042 -527721 -463390 -525561 -938183
17391 -938183 -915844 -552734 -416534 -355480 -215051 -43263 -119289 -194939 -197157 -25433 158546
17380 158546 321527 206135 51464 -35915 -276520 -251054 -236991 -156415 -448025 -234664
17370 -234664 109644 214006 -217348 -460828 -410767 -315554 -242799 -299886 -288206 -29824
17360 -29824 114026 215835 -19253 21364 280547 405874 184996 -106258 -30720 262583
17350 262583 127006 87609 -89281 -106787 -27924 -110753 -135284 -57644 31653 -35561 -239050
17339 -239050 -181904 -4808 -190306 -392969 -267132 -103880 -232822 -317690 -115522 133740
17329 133740 -103159 -204518 -299220 -490977 -403669 -98828 -270333 -300245 -171870 -136751
17319 -136751 -209983 -246349 -161261 -264001 -109269 191959 347446 477448 383186 296570
17309 296570 132691 -27351 -133502 -384204 -98821 -103676 142338 73236 85494 -14086
17299 -14086 -36694 -332859 -508471 -368052 -155801 -230125 -297655 -353854 -282278 -231314 5233
17288 5233 70225 40726 -174942 -343652 -597225 -717413 -593079 -366082 -314905 -172252
17278 -172252 -163244 -79712 -196789 -315356 -36162 400554 368984 117139 -150652 -71146
17268 -71146 132454 131879 86480 8497 137518 -59405 -118506 -285467 -238768 -287071 -42375
17257 -42375 23122 -78426 30716 29962 13091 -34361 -188367 -482716 -588984 -648345 -487140
17246 -487140 -370959 -223588 -624712 -667655 -494475 -241782 -226440 -305894 -449280 -264474
17236 -264474 -271078 -354297 -318576 -218055 -118981 -266056 -358619 -524546 -293987 -73884 49579
17225 49579 1366 46182 -24178 -232032 -317543 -178728 -195743 -348821 -200668 -334554 -459731
17214 -459731 -530638 -561496 -281754 -211091 -127964 41720 423 16290 -239682 -169025 -132509
17203 -132509 114457 -87157 -195406 -20124 140723 200461 16891 -72877 -209939 -152519
17193 -152519 -207463 -110007 -556060 -773201 -613001 -399598 -267829 -139188 -274564 -297275
17183 -297275 -385413 -476614 -359700 -227942 -145113 -262975 -362994 -573631 -828657 -760350
17173 -760350 -529682 -343205 -296139 -190396 127556 177011 118481 34629 182098 127176
17163 127176 -28528 -129782 -308514 71883 103058 132368 -305099 -576092 -866944 -745166
17153 -745166 -324092 64495 87950 13829 237038 302016 201446 94535 -245121 -148573
17143 -148573 -129880 -247652 -94541 115344 239741 132056 -324358 -469494 -509857 -395141
17133 -395141 -341503 -325217 -503213 -804645 -761300 -398826 -78734 -82757 -244788 -319359 67443
17122 67443 68723 -450567 -591654 -431426 -351633 -117701 -277513 -315400 -367404 -378395 -81816
17111 -81816 17571 121017 -108974 -230768 -2657 -48061 -208325 -435042 -452576 -643984
17101 -643984 -517774 -224663 129722 138725 -479790 -1111453 -1176360 -946379 -831105 -682353
17091 -682353 -457655 -259660 -154548 -146402 -152049 -274529 -503127 -562602 -803491 -816596 -625528
17080 -625528 -649123 -604851 -460022 -368682 -253055 -196644 -95650 119339 46915 59161 69134
17069 69134 76145 95724 241376 254128 153818 8853 109797 230671 155523 272671 145006
17058 145006 -31914 -156161 -29155 -65115 -36434 -87349 -36747 45073 -156938 -285088
17048 -285088 -447467 -584456 -460958 -147080 135359 17995 -173046 -325636 -39213 -9515
17038 -9515 -151523 -190662 -339613 -392207 -433892 -106858 117546 132268 114060 -135352 -380128
17027 -380128 -157570 118525 -28884 -362053 -448763 -333328 -121760 12766 27645 -30875
17017 -30875 26209 261462 237614 465828 640847 432763 79809 -377003 -797313 -874021
17007 -874021 -645930 -336616 -289505 11823 206568 253277 -48811 -426796 -640031 -554344
16997 -554344 -216165 -255483 -490924 -540662 -514847 -373047 -66066 -264830 -533744 -489947
16987 -489947 -381478 -337638 -382017 -559520 -225488 110921 -157372 -118730 -395245 -354689
16977 -354689 -279349 94969 406851 472975 -138236 -321888 4609 59578 -31446 2530
16967 2530 147842 172730 347378 -33752 -508548 -708225 -636564 -713440 -552980 -486769 -665716
16956 -665716 -531920 -329926 -44391 -105676 -487801 -331029 -393597 -401112 -262089 -263586 -243979
16945 -243979 -125925 139092 -22324 -159813 -108388 -203629 -235078 -35174 157462 313796
16935 313796 303443 158516 -93303 -101802 2585 7041 91419 185375 285663 245615 210118
16924 210118 -37746 -219554 128079 234187 39995 -199939 -439907 -101499 305592 93755
16914 93755 -210707 -337555 -354189 90875 55140 -179621 -437495 -221020 -67537 -197257
16904 -197257 215372 122094 -263013 -578904 -478968 -142180 32715 -191223 -286458 -152427
16894 -152427 -16258 -123145 -337323 -361968 -297324 -120833 -30647 -30309 29208 58571 125452
16883 125452 392318 427946 178017 -134030 -196482 -148480 50820 169953 294992 126964
16873 126964 -218399 -429812 -390153 43121 471157 394801 225152 337865 219901 -354297
16863 -354297 -521139 -294279 -318654 -443935 -138784 289304 455599 317554 -47035 89411
16853 89411 9556 -80457 -44412 12617 -494811 -698366 -910504 -597466 -406024 -106508
16843 -106508 38585 37606 -142228 -156362 -134416 -291930 -551593 -642543 -394618 31259 189412
16832 189412 -27128 -187947 -415501 -270030 -366219 -313570 -232683 -133853 71722 377636
16822 377636 292200 251048 49673 -211676 -11542 446269 577202 480212 335530 197144
16812 197144 112386 283303 240326 -73755 64777 13071 140149 177418 -76737 -59674
16802 -59674 -317857 -241042 -212914 -118694 25353 127350 -254801 -293018 -383298 -366609 54196
16791 54196 445858 559107 446073 161156 147939 523910 414345 194100 400502 732065
16781 732065 784281 336431 121524 -28585 151648 143519 -24829 -21628 -145825 61482
16771 61482 -160885 -586673 -153497 262818 430101 530207 567048 319083 255483 54468
16761 54468 -559814 -1122184 -1001835 -694239 -344597 -96293 -53733 14442 -127320 -154937
16751 -154937 -289637 -582468 -535269 -78536 -178737 -339278 -556465 -314980 -257304 -139346
16741 -139346 243198 195481 -148817 -295864 -586726 -377170 -329030 -419953 -418420 -130068
16731 -130068 -232364 -86969 36602 126849 81736 -68251 -191924 -121904 -16857 -162858
16721 -162858 -283361 -559037 -529814 -178515 -256709 -178815 42884 139455 -187514 -376790
16711 -376790 -446131 -588215 -633439 -365898 -294185 -423054 -445901 -652434 -496028 -429493
16701 -429493 -361263 -52234 172695 98808 -141110 -458505 -811036 -955979 -678402 -378821
16691 -378821 -340737 -413693 -475248 -51250 48796 -52922 -306714 -468245 -524825 -396709
16681 -396709 -226562 -177733 -50802 171084 195835 -98138 -124416 -6004 52631 -315719
16671 -315719 -270868 -183807 -311223 -388928 -281268 -15774 34299 69071 46728 -7945 196552
16660 196552 375253 428135 162073 -81954 21837 281367 271342 -195814 -399738 -460959
16650 -460959 -504236 -490321 -535637 -312986 -216676 -28416 -23149 60932 3628 -4097 87809
16639 87809 136747 55551 -33956 56814 277137 452524 323407 61370 231459 366541
16629 366541 11941 -183446 -156182 -388922 -349360 -93903 -69449 250382 404819 -68809
16619 -68809 -228830 -390258 -278025 41118 -70062 -250102 -493828 -570087 -510285 -478736
16609 -478736 -734228 -506309 -239376 -252125 -783270 -704443 -165888 269557 265494 35927
16599 35927 -256408 -210251 249712 364746 -17152 -282629 25211 102626 -294229 -490732
16589 -490732 -544894 -437443 -48827 -48412 -352923 -637357 -529518 -56386 77178 -193255
16579 -193255 -338280 -700949 -797290 -424976 -316584 -11852 -132130 -325426 -390157 -262141
16569 -262141 -124414 -20841 -348848 -83389 14936 -200418 -490688 -498649 -159943 25542
16559 25542 258392 117343 -267100 -287101 -126389 -251275 -270547 -103203 -418514 -412519
16549 -412519 -440633 -43623 -202193 -299629 -120350 79575 306946 -86007 -403434 38271
16539 38271 -134019 -324844 -353082 -758952 -486671 -37282 94480 -75506 -554610 -614476
16529 -614476 -352689 -241889 -82706 7178 -120553 1391 14511 -177443 -71279 74190
16519 74190 -142500 -222513 -369603 -552178 -683675 -614361 -324830 -556196 -749590 -741196
16509 -741196 -602754 -441062 -370360 -240184 87952 277993 159443 64556 -213477 -304023
16499 -304023 -226877 -300422 -93909 -367120 -318126 -91221 122947 -3013 -300673 -473389
16489 -473389 -254921 -131020 -257730 -406998 -292420 -144240 117414 522870 560893 251384
16479 251384 131395 -13744 -210271 -124851 -148272 -216111 -354347 -314339 -68453 79840
16469 79840 103378 253929 295637 -13027 -283935 -108817 338088 730152 660374 438306
16459 438306 449356 604937 455357 146882 267376 312660 232615 473520 819574 860079
16449 860079 768470 675951 355630 357857 459256 555114 567175 548596 577149 688082 620227
16438 620227 864834 1349435 1826601 2306609 2479287 2395549 2432763 2281558 2240782 2362323
16428 2362323 2109495 1717446 1245523 1011708 1030795 1018755 792209 518465 113261 381617
16418 381617 390385 83977 71894 407100 434291 639419 1160865 1376510 920489 544415
16408 544415 505080 434745 312891 476302 846202 1117752 939532 779443 983340 1021650
16398 1021650 1394755 1608615 1684038 1981342 2045959 1776777 1464177 1240952 1202121 1454815
16388 1454815 1320358 1110534 956496 866562 525517 257947 190706 100762 344508 627490
16378 627490 571444 454107 509419 309442 146712 35161 141511 922 109650 124209
16368 124209 103627 -191823 209582 214972 -61388 -225891 -281121 -283099 -69115 215534 373741
16357 373741 281675 450967 495462 374849 213752 510998 606866 142936 -239346 -431561
16347 -431561 -545826 -541047 -609531 -464304 57621 413622 384142 109207 -342415 -494927
16337 -494927 -816162 -681083 -622056 -675574 -730722 -883268 -696111 -425573 -350312 -303977
16327 -303977 -201460 -25555 214271 -49065 -213885 22572 158737 299729 313719 237021
16317 237021 -8618 -37627 -6802 75221 6133 -59372 -159599 -222090 19241 230470 328748
16306 328748 386061 269481 56287 -198584 -39773 320727 698097 548720 109883 -394464
16296 -394464 -552102 -386126 -259569 -337242 -198060 -95499 -285062 -519350 -559391 -491978
16286 -491978 -120836 -18930 -94559 -184525 108038 -142363 -278868 -79605 -292609 -404223
16276 -404223 -282610 -138961 -26015 68821 115580 -22636 -55234 -131521 -430798 -162056
16266 -162056 -163643 -81620 -98674 102907 22827 -339384 -128629 180454 208128 -30588 -48612
16255 -48612 -10176 39427 -147697 -223589 151579 770678 753659 531416 585222 200214 33833
16244 33833 87574 146296 106813 -214128 -36502 -39175 -456828 -445697 -355165 -462525 -346253
16233 -346253 35267 -35183 -128515 -4270 191634 211722 53719 208663 196040 218169
16223 218169 300584 261268 306981 9937 -299585 -390958 -236671 79554 183448 21943
16213 21943 -148950 -44812 186195 418685 626114 692765 259736 -125975 -55731 -88275
16203 -88275 270121 416290 231049 86486 260000 178929 542099 574812 586877 456612
16193 456612 283614 -10659 89623 122062 -166618 -240838 -217172 -16977 142958 222580
16183 222580 110124 206367 539610 467958 367305 198148 281584 306712 140198 -75254
16173 -75254 -121905 -73573 -400144 -329719 -383817 -283273 -215057 -367374 -442691 -316801 171607
16162 171607 53177 -658375 -888596 -719761 -568520 -644647 -203087 92926 -251125 -86682
16152 -86682 361205 95509 -403014 -690063 -759036 -473795 -178316 -80917 316653 191950
16142 191950 124621 243335 26304 238724 -47848 -91535 278976 410296 74378 -76041
16132 -76041 -197310 -514506 -662141 -525961 -484800 -234014 111508 -58316 -318090 -248082
16122 -248082 -19571 315302 450319 337208 82592 -70284 -152042 -512145 -605380 -398552
16112 -398552 -298209 -20915 139339 171917 21598 -69336 129262 192352 541027 897146
16102 897146 1060060 1077501 782092 750741 909427 628105 401743 399289 132877 46862
16092 46862 80761 270688 238280 3153 -93714 -50023 -171104 29331 312156 146702
16082 146702 31518 -5669 -76723 -59231 52927 -145354 37489 427257 443057 529307
16072 529307 509689 626477 395376 146741 -1610 283667 367711 290757 461597 600093
16062 600093 877522 1212227 1109047 438268 215304 250717 346489 403311 401746 404655 478433
16051 478433 463011 274860 49506 -69914 208633 346600 304610 215806 -229798 -379072
16041 -379072 -153068 -93822 -22544 78864 172352 112226 -181906 24516 434410 245569
16031 245569 303553 332089 217229 100268 216820 -141828 -367897 -363423 -237554 -134080
16021 -134080 -27962 -94474 57771 -11037 -89899 -52279 -28294 72441 -86922 -198327
16011 -198327 -19678 196583 -92400 -203858 18280 -136309 70874 -122877 -227966 108819
16001 108819 242985 469963 403055 -33940 -314768 -360679 -354684 -267635 -445544 -132148
15991 -132148 170035 -223245 -316544 -111609 6993 -136061 233093 685145 556247 95477
15981 95477 318286 465321 499068 513212 590834 735279 892573 1143126 1125053 664607
15971 664607 294848 558130 633902 332993 66627 94054 93840 58537 89677 360341 519339
15960 519339 345666 456257 361356 218818 241665 385692 524139 413472 191279 125221
15950 125221 -91522 140595 217769 180234 232815 -168779 -452926 -246148 242469 608791
15940 608791 282968 384217 475556 249842 289084 471846 270322 209883 354677 576041
15930 576041 416804 205070 224158 56908 -6205 104376 303865 669610 704315 633383
15920 633383 191773 -13784 -72409 267420 299010 145893 75648 -50080 182219 130997
15910 130997 301046 157289 -25490 52237 -31895 -293731 -448960 -391756 -141539 120026
15900 120026 227963 154599 96037 740797 1003364 690968 243864 230754 256993 251478 237729
15889 237729 315693 531664 457363 84590 -94641 76718 380824 666851 388282 182490
15879 182490 -69053 -223834 -290047 -296466 -152452 -100985 -212279 -466574 -615602 -342148
15869 -342148 -547796 -849560 -655102 -310638 -436543 -386252 -182519 -335728 -175979 -14055
15859 -14055 82352 34319 4303 223900 306567 294549 271339 -87330 -483990 -293486 -3391
15848 -3391 153124 -8826 -187450 -393463 -626133 -865310 -633817 -460313 -350758 4804
15838 4804 59679 100256 108798 -50439 -392594 -361497 -402999 -216921 46184 155098 -26616
15827 -26616 -128773 -144636 -154926 256055 87780 -268571 -273621 -250372 -126378 152987 173832
15816 173832 128084 227102 188877 157925 508347 536637 283082 -54725 -458919 -550828 -323747
15805 -323747 -405416 -664060 -484687 -270068 -339968 -182932 -70665 -162360 -443061 -511767
15795 -511767 -466915 -55629 -55616 -125607 80082 -98224 -411485 -342371 -273454 -238808 69287
15784 69287 169906 339732 131012 -86087 -51256 -102382 -227985 22410 143749 505712
15774 505712 179511 -56045 -197123 -155525 148238 78460 -88646 -77169 -49283 -328156
15764 -328156 -677483 -600111 -136537 173018 523502 866782 1258712 1508437 2232843 3720895
15754 3720895 6357818 11067197 19463753 28965130 32382251 29580285 22312649 14582893
15746 14582893 9691401 7285345 5608138 4881404 4331294 3828092 3550334 2724565 2474795
15737 2474795 2376252 2002195 1632200 1249668 842400 843905 900885 977375 550966 218245
15727 218245 -96408 -177325 -50175 478076 640337 665148 382716 313620 304606 250390 612273
15716 612273 570605 258675 -75367 -26636 36907 90691 -99543 -140610 -133971 -287871 16259
15705 16259 50210 44927 66137 -127879 -28554 22172 2117 135224 331764 362461 614701
15694 614701 603536 445358 313490 432092 561271 755482 827239 553763 283068 47207
15684 47207 123832 78823 -97991 -305495 -220025 272719 766595 903373 577700 163541
15674 163541 -70044 -154899 -216310 -264244 -402802 -154094 153204 -102552 -503534 -318894
15664 -318894 -213556 -124229 -70602 32022 -37682 -129625 -159921 -76944 -63572 38746 17611
15653 17611 19326 70187 288406 297983 -325120 -475275 -116087 -154976 -513023 -403198 -322663
15642 -322663 -248387 -114944 123817 480160 499385 366929 212169 204831 175520 378170
15632 378170 285359 91608 -121062 -150668 -412208 -519428 -614557 -435454 -322543 -93966
15622 -93966 74856 -144984 -274992 -341927 -391127 -646056 -356530 -292358 -299163 -367683 -249964
15611 -249964 -52209 164861 95669 -202103 -381665 -326941 -167609 -523162 -799772 -870221
15601 -870221 -826980 -572559 -251282 -189350 -44620 -227500 -157024 -47089 -80532 -194897
15591 -194897 -547554 -532149 -420041 -586781 -497036 -185627 -423637 -698902 -546182 -226218
15581 -226218 -108588 92241 257624 -224527 -353064 94724 -3835 -70198 116873 376187
15571 376187 -6151 -80382 85402 140001 -13266 312684 77080 123125 428564 287340
15561 287340 29928 -274438 -15245 104051 36685 -12656 -91031 -61550 -12629 80887 171189
15550 171189 17399 -108532 -78521 72312 -270036 -431272 -515355 -593992 -520254 -623824
15540 -623824 -676630 -701429 -409931 -238726 -61160 73 32494 -284611 -387043 -599246
15530 -599246 -693954 -692622 -346535 -38962 -105013 -96130 18066 -294514 -811229 -760830 -546095
15519 -546095 -468253 -410556 -455153 -524554 -408091 -258090 -201834 -275919 -197116 -286760 -614468
15508 -614468 -565240 -686965 -510631 -283498 -91559 -37295 -103676 -90173 -94780 -235740 78419
15497 78419 313062 179908 -75159 83803 11610 -199379 -295052 189255 441360 105133
15487 105133 -187455 -493030 -397659 -270006 144132 287587 262829 224687 119142 280656
15477 280656 164404 25173 125692 313758 253842 77046 -99780 140662 292618 394490
15467 394490 128194 250650 491117 644498 748937 459245 360673 318518 168055 -74695
15457 -74695 -184621 92444 -38356 -81259 38352 -324525 -304220 -19691 19240 -104092
15447 -104092 -292331 -542571 -311286 -224063 -35731 -298675 -515288 -480411 -227746 187642
15437 187642 219392 286484 228391 507248 524921 651923 478867 74943 61503 294884
15427 294884 242093 -200000 -315527 -244144 -35460 126443 132563 58387 223676 451383
15417 451383 206778 -202555 -221113 -163386 -38513 31963 131392 420376 11745 -450708
15407 -450708 -200917 39928 87803 31082 -268757 -156003 -170864 -187122 25878 389048
15397 389048 518965 455114 563992 527266 424124 422426 354068 316361 265700 436733 524586
15386 524586 643941 638063 165661 14492 70924 198299 209027 328761 444965 191770
15376 191770 -106033 -91331 -292820 -28415 44013 273229 209221 132231 327452 327917 301991
15365 301991 374157 152354 -60264 -123878 -97812 45932 182309 176680 14990 -201663
15355 -201663 -292350 -260935 -108614 211154 69224 -175684 -42311 103797 -59385 116239
15345 116239 519157 325287 40052 -508916 -400933 -367992 -455702 -873271 -460040 -274329
15335 -274329 -328129 171949 269807 44408 166684 229585 -110291 -355637 -521830 -794600
15325 -794600 -694898 -270655 13665 23964 51609 1672 -98340 -453266 -584463 -349600
15315 -349600 -281185 -45224 185492 621438 602291 660818 637422 235946 127484 328978
15305 328978 302528 361832 465864 334439 42117 55600 279361 626841 543345 15115
15295 15115 -177947 -164653 -115741 -130949 -51773 44468 -67404 -241848 -253589 -109083 424756
15284 424756 708234 783070 576422 330067 19935 -209653 101133 205913 20484 61630
15274 61630 266243 196124 4017 -261323 -273241 134288 193730 284277 229058 314850 167028
15263 167028 117744 51684 54389 27235 60400 65628 -13267 86202 -31863 -28476 -26355 189704
15251 189704 197803 345624 581905 699251 597861 628045 548801 359406 399684 547042
15241 547042 771925 628356 843803 1014278 706870 405854 36913 26016 334279 508780
15231 508780 263256 88944 563775 759776 551344 426983 638433 951988 895341 678626
15221 678626 568245 617412 264975 163989 262625 154049 114154 -67703 -341058 -363911
15211 -363911 -316436 -154197 -9990 -7578 -163861 -321903 -736117 -756506 -495413 -392436
15201 -392436 -371799 -156388 271753 207360 -246442 -507348 -317966 105403 309183 94195
15191 94195 -146843 9897 98303 -50363 -341759 -530792 -535774 -290743 -187104 -198942
15181 -198942 100339 198711 17699 -96196 -162000 240286 418727 -145152 -238417 -88943
15171 -88943 151586 133452 155240 10273 70163 300209 537181 403544 244431 382578
15161 382578 318252 197582 351290 398695 471725 446602 306472 169009 318047 244723
15151 244723 371996 490051 340544 153555 174862 435580 535236 579055 855411 859971
15141 859971 615423 896232 1060380 932681 822078 1072595 892100 804382 624534 648462
15131 648462 826347 1049386 966595 822923 661386 754972 709264 696413 1032806 1233643
15121 1233643 1530992 1283455 1173068 1146075 1273769 1284251 1416613 1588497 1636607 1219828
15111 1219828 813146 1051781 1123504 1294028 1196805 1178666 1476801 1427357 1655005 1589466
15101 1589466 1106664 785258 807683 1072666 1299505 1515055 1568410 1248742 1156237 942024
15091 942024 1063127 1435964 1235485 892609 884981 898272 1040057 1039980 1069261 1130504 837707
15080 837707 728446 1263047 1434118 1496564 1424721 1360828 1188948 932656 1132028 1437647
15070 1437647 1542236 1954312 1990213 2106505 2178667 1930856 1740234 1780453 1878704 1653408
15060 1653408 1436524 1209139 1345311 1146493 1088572 1097722 995292 944822 663276 368151
15050 368151 191247 507168 701993 429033 600465 456758 366334 324217 48630 -3977
15040 -3977 -95354 136895 448942 490702 560853 688623 573418 325437 311152 597550 800828
15029 800828 860402 952156 906448 690676 635126 751282 579749 323213 213190 733607
15019 733607 854217 493170 352827 510249 778174 818418 678328 536702 677458 636698
15009 636698 58532 -40348 182583 236633 432539 810333 1013490 884773 921881 920819
14999 920819 1003095 944921 769781 610695 460034 437313 763558 919391 815505 798400
14989 798400 1104736 1359616 1112443 647715 491550 405579 211587 -67674 138402 210470
14979 210470 129245 -128955 -3181 307256 494444 587264 608526 726345 587822 418427
14969 418427 168917 -56372 11579 31871 -135907 82598 -3646 307202 402345 253443
14959 253443 186472 106229 -153303 83754 397811 664194 599275 399570 282839 245276
14949 245276 148501 354813 417166 162371 -164680 -239294 154145 268841 111553 30084
14939 30084 -87465 322965 755114 897184 607098 300421 158590 161218 384785 477509
14929 477509 446928 488894 377869 78178 13237 56429 105093 362750 366328 190602 394365
14918 394365 299489 199503 383479 760657 795869 878326 440138 459730 546685 408009 447164
14907 447164 579643 1039635 1096864 1006250 1055381 1165900 1350073 1057534 922661 995435
14897 995435 1144277 1453901 1533257 1333364 950507 754929 588110 406983 567320 565416
14887 565416 596779 383477 596015 932504 1324161 1200642 1170712 1006628 1111594 1066241
14877 1066241 1035405 882296 960110 936741 786493 108636 -55598 -57657 -40290 295940
14867 295940 601117 823623 667048 391053 176911 200519 548899 783162 966131 1290182
14857 1290182 1317594 1471925 1453283 1355252 1264392 907306 636656 734403 854409 968319
14847 968319 1062197 857350 1050416 903057 360047 330254 477975 312045 584908 457366
14837 457366 280102 599201 935774 972258 591971 311731 274820 75424 257123 159145
14827 159145 275 27456 135148 335387 310532 570239 503855 330632 328618 322989 263487
14816 263487 205516 6192 -71669 175666 580533 571551 414620 364945 256377 -89883
14806 -89883 233096 363699 -60753 67839 338733 228784 150219 235172 312127 306870 21263
14795 21263 34619 -57227 -147290 26428 629855 415152 246887 231264 450586 430625 6825
14784 6825 96544 128109 545540 695592 563306 294769 123705 396671 247488 -43376
14774 -43376 -118329 23102 193239 309813 395363 412173 545090 735921 759261 423923
14764 423923 332928 682504 763374 465827 27889 -217575 -33370 5066 597326 776590
14754 776590 722500 853092 864882 645047 818407 692266 402214 181841 -6856 675860
14744 675860 958858 521791 314342 537459 521003 282299 174549 405602 542882 230028
14734 230028 204221 177448 282821 326200 467538 482219 214224 200466 347136 294654 530888
14723 530888 258285 210103 209441 15237 -101567 -54161 -70154 291751 571084 723937 497200
14712 497200 378526 215291 217002 184946 287958 157562 204044 733932 693812 470908
14702 470908 325874 348701 631838 462335 266738 256332 35747 61888 -44971 -203451
14692 -203451 104822 507093 330598 403352 288177 332728 173032 166240 309302 103798
14682 103798 -24746 295255 472441 363474 205313 211944 165287 303137 193833 501228
14672 501228 296490 110551 193972 542275 579084 703966 629418 618771 567036 237164
14662 237164 3430 -35364 261764 22806 -55771 144776 76406 -57312 276305 488643
14652 488643 641629 597681 676851 775204 650679 320011 311317 296722 2063 178964 392656
14641 392656 398842 473798 611812 316145 208134 2964 63549 195791 640195 579821
14631 579821 309871 292703 369444 -57282 -415863 -231415 154812 365343 462686 362877
14621 362877 132970 -97855 -44072 335290 816344 961373 718829 612983 578991 486214
14611 486214 249403 498591 789849 843783 427740 243987 216103 197524 255586 449385
14601 449385 278816 -147941 -205586 -42701 -46801 35796 253560 338185 433667 278334 -92066
14590 -92066 60493 -7692 -92518 191261 423461 373233 553753 574562 410294 421577 899603
14579 899603 1173760 661930 696572 1055544 921144 797381 574087 361250 460921 433214
14569 433214 342589 404787 491737 222125 220705 428492 272150 -92016 -118769 -193778 -145541
14558 -145541 -251438 -112622 11707 201079 454947 348427 407531 382302 169326 23651
14548 23651 -16384 89245 275258 73171 -216374 -526532 -358676 22359 129273 242185
14538 242185 192177 -27021 280607 539445 629874 476500 -231792 -442909 -401475 -588058
14528 -588058 -510751 74513 595274 638382 483307 451692 150834 262807 574562 429632
14518 429632 317618 697306 755347 472145 493107 351323 115380 170880 -22662 -18303
14508 -18303 -33120 -122017 -71052 152246 150022 574550 792379 601199 174874 69465 197778
14497 197778 334022 217493 15844 -38266 -104473 -485924 -654685 -476437 -405389 -158694
14487 -158694 31324 77699 16785 56153 194819 648779 896778 755796 741969 684089
14477 684089 457094 -115257 -95712 -129064 -124312 -140809 -235756 -185432 -241841 -158785 -306233
14466 -306233 -422293 -316353 -246271 -68161 -69822 95126 353366 248975 282292 336356
14456 336356 304140 309792 115880 277124 480656 475577 138903 -227002 -348902 -320673 -323263
14445 -323263 -310801 -110724 145628 -54499 50098 53115 179239 119613 50714 -146239
14435 -146239 -179677 41100 373041 485658 523075 635944 486033 165129 173719 166561 499897
14424 499897 732157 414630 562021 451057 55832 -209791 -320650 -67928 203846 518533
14414 518533 620689 619490 587480 255091 332439 449349 542157 631933 338553 196489 300557
14403 300557 335449 521112 627219 516603 343012 149802 385451 341192 169556 346112
14393 346112 -66653 -78330 266645 283533 160705 214036 255043 370180 549172 575750
14383 575750 630202 374741 46108 -15923 27810 17529 158753 -65545 -130677 -178834 -361052
14372 -361052 -324268 -158387 365424 433763 725321 892792 723858 286557 -84739 -86499
14362 -86499 34749 137498 242391 353464 244196 -70661 -236694 -238190 33572 215114
14352 215114 182576 59957 148258 197491 206050 278455 56750 -64155 -42781 -161856 -310435
14341 -310435 -220662 -13887 -89594 -150134 -8065 -305012 -478269 -500578 -865592 -1014364
14331 -1014364 -741189 -351276 -136596 59663 42492 134571 224060 298963 512692 580023
14321 580023 603412 719693 777445 801260 693039 592306 604414 293357 357995 706554
14311 706554 394705 338229 413151 285197 302670 42361 -36210 -213177 -174136 191579
14301 191579 564906 234050 -131493 -264092 -169623 78283 139185 143603 -102545 -185094
14291 -185094 45944 275313 383564 512616 615889 321553 197108 348970 437590 538155
14281 538155 328538 399453 239523 -39219 20657 -114597 -151768 135873 163162 396549
14271 396549 564256 515817 444686 547149 968960 975917 806107 722059 723745 664057 709087
14260 709087 376382 358910 388590 269325 43658 13023 178019 402192 253360 103571
14250 103571 462441 782640 834562 567888 -194246 -188032 -148587 -265322 -375146 6651
14240 6651 103264 34743 418001 217514 -182451 -56895 94629 388644 183320 37599
14230 37599 -68082 -285023 -329345 37439 318920 240485 218087 355016 378582 330974 408627
14219 408627 441314 616445 541982 473036 379360 429246 412309 182142 -217260 -426511 -434677
14208 -434677 -180778 228202 640778 690219 610049 652686 648519 545666 283997 110012
14198 110012 338444 281333 174709 164018 72131 101537 362658 385609 262426 402522
14188 402522 317685 73432 -156895 -89932 63402 198126 116849 -102707 42250 240564
14178 240564 -100529 -450604 -701805 -550494 -246794 -198828 -144212 -264575 -356222 -208499
14168 -208499 -96697 86154 -33577 134064 89925 191717 316303 458215 573184 322948
14158 322948 164120 124447 262085 39966 121830 296126 392454 250487 -167431 -169225
14148 -169225 -256523 -30820 596360 751614 797830 930008 584374 176479 95522 80594
14138 80594 341944 812935 920617 932679 734457 457406 130969 232417 430824 387247
14128 387247 313182 99324 -204713 -62734 348832 363066 410987 485553 330883 236428
14118 236428 93023 91736 256235 212805 43611 -30199 21318 93624 -141033 -320189 -183558
14107 -183558 -476911 -664662 -754446 -738123 -259251 193590 80080 2026 173450 419556
14097 419556 462902 173713 160868 -3951 -427168 -327137 115313 344593 602413 605474
14087 605474 697869 858295 807927 512365 474384 562454 491615 419584 440349 373151 294773
14076 294773 -18824 53961 287089 538037 863441 872936 820657 442069 -31455 64490
14066 64490 11527 -236181 -562181 -611222 -414018 -93096 -141834 -170648 -135142 -969 265694
14055 265694 296260 342941 214696 49298 146060 34128 128833 250298 188171 228283 327823
14044 327823 309864 490809 522448 486636 416850 166320 -200377 -112693 -67784 -99225 -121399
14033 -121399 179282 599932 580631 517393 367244 507906 646516 775376 958497 663558
14023 663558 450149 318711 126472 -61247 18394 287237 535174 425639 172683 107357
14013 107357 35286 -156282 -137626 164843 189428 205231 8626 -27717 140873 42447 136433
14002 136433 199962 -127032 -8804 121851 -68273 -189011 -240765 -239296 -217479 -202835 152257
13991 152257 127674 50390 262026 435856 312036 -16044 276472 556490 774715 844495
13981 844495 1011182 1064044 854559 649269 504313 659856 695376 824672 886612 702073
13971 702073 229272 42487 -334155 -146417 -88998 32125 240440 419483 617568 472711
13961 472711 76511 359307 277226 375212 468869 428204 541268 497535 423942 405719 383391
13950 383391 132108 157790 35827 176511 339548 112304 224043 325357 240660 223724
13940 223724 227790 135810 100064 180202 321135 310909 177119 111694 95563 3785 177428
13929 177428 232786 243901 -31375 -148452 -90424 -57310 -188347 -181133 -110612 20775 345858
13918 345858 361348 382961 274052 310619 119942 -185814 -13498 124961 266774 224043
13908 224043 -109604 -282869 9478 202113 -82019 -119222 64343 89290 334639 647922
13898 647922 690653 732078 654742 407117 248605 263332 239926 112207 104244 173112 49461
13887 49461 -214169 -400688 -315884 -79025 59465 118792 242089 339967 354752 851441
13877 851441 922782 606072 389733 388006 453963 207756 -43908 22 -6051 173320 203010
13866 203010 95007 -43567 97898 120602 29048 99789 242718 396942 237784 423264
13856 423264 410085 531872 929588 620653 229016 -43503 83463 346556 99138 -41720
13846 -41720 229947 395576 472975 383033 118009 -81282 -270772 113531 629823 767716
13836 767716 449502 137336 1636 33198 179178 207119 241454 -264315 -223852 250011
13826 250011 587165 254573 181704 326110 419392 287965 -40502 -107332 -214920 -192835
13816 -192835 163175 352235 382830 288162 382608 430384 613154 527520 504885 147975 -40732
13805 -40732 -273340 -107100 174829 380634 356119 378950 441375 344014 43348 -262138
13795 -262138 -303814 -197577 -16935 185570 403825 491482 295061 665624 846526 955179
13785 955179 972462 719771 819746 782486 424865 231975 776740 910709 776852 944496
13775 944496 1158381 1284344 1383643 992759 780923 578488 592019 702030 645698 700454
13765 700454 843481 682461 691615 670292 513357 624462 715202 555246 522950 596822 267223
13754 267223 220814 84852 164162 455758 729326 965036 885755 702127 379004 454005
13744 454005 548249 453791 269388 74697 23602 -54256 -351882 -232457 79915 286389
13734 286389 214611 82064 -107639 -121009 39550 502776 592514 562026 667083 930533
13724 930533 691291 475099 452510 46776 -65476 208688 361376 254672 -161134 188610
13714 188610 241954 134092 281354 331923 541080 806288 745766 494519 298390 -44091
13704 -44091 -490299 -339357 9625 -262558 -368739 -204221 -87493 31946 -86719 -39104
13694 -39104 359741 296187 300793 290236 83020 24485 220863 454293 430429 248955 339014
13683 339014 621115 435766 69945 142488 489165 552153 724660 744680 1169712 1179040
13673 1179040 935524 881470 741192 774837 545922 318561 341214 94303 129934 150219
13663 150219 403768 294271 -35643 -174870 355422 759188 791255 711290 726593 586117
13653 586117 716154 888866 876571 1034182 1139360 1190887 1220344 1244993 1379725 1484128
13643 1484128 1634517 1544775 1505308 1403786 1505490 1776643 1882058 1834392 1384065 1205704
13633 1205704 1058339 1069773 962949 1056778 1533616 1518625 1577574 1548608 1384532 1103084
13623 1103084 1223806 1312283 1389728 1481276 1183665 1219973 1309798 1021481 652078 711040
13613 711040 983252 1057378 939517 583567 695830 870619 727424 471847 743135 764635
13603 764635 226979 206060 645338 958632 1006765 809959 549241 619261 932864 1265137
13593 1265137 1225274 1347399 1205979 1107107 944032 547199 383604 335426 384338 354939
13583 354939 489503 910939 1160134 1328150 1273459 923639 868767 685675 564487 421106
13573 421106 432258 438687 327081 617885 613271 865147 1025019 750064 833882 467020 475035
13562 475035 761709 889395 1030417 1356536 1276397 1388918 1121779 1172688 1205510 1147919
13552 1147919 756629 572163 559833 526117 886533 1477634 1695938 1628239 1418671 1396164
13542 1396164 1226087 1218481 1325106 1193445 988218 844035 879657 906114 604316 526307
13532 526307 451691 357470 353505 499232 590311 650303 500415 198187 668618 1382921 1233027
13521 1233027 764631 668235 579713 613392 838337 896811 870678 941090 588843 478125
13511 478125 162186 174394 481317 481713 432296 496239 599711 704224 676394 471144 482248
13500 482248 633566 711934 745153 444900 119197 171562 415002 854722 1137379 1288004
13490 1288004 1052757 1177244 1193571 973397 816974 874326 1210112 1426772 1355605 1157250
13480 1157250 1112954 877434 752774 1278735 1428230 1051668 920153 888889 794276 1167512
13470 1167512 1418425 1378287 929786 361020 111753 327972 417219 526756 434262 392911
13460 392911 554598 728577 571640 144321 234001 313789 442856 528959 373153 483117
13450 483117 755837 1078906 996791 1304495 1390292 1252448 1269953 1442054 1467138 1201951
13440 1201951 878956 702880 579225 496855 625349 916975 1076918 1050327 809733 987946
13430 987946 1156177 1080252 1049695 994452 1022744 890062 737698 856892 764276 836333 775479
13419 775479 884396 927324 756497 1065811 643965 474574 548091 295643 515249 804700
13409 804700 913809 814533 1006369 1030862 854594 757786 653114 497511 670797 715150
13399 715150 785897 545938 723409 1268488 1282321 1284136 1310802 1287641 1362276 1559261 1054847
13388 1054847 608619 450741 493167 491138 273715 410319 289362 126652 238748 479976
13378 479976 877422 946953 637312 443484 384373 748852 898603 642203 670623 1038559
13368 1038559 1124042 827931 778364 915723 790298 584727 952755 1190502 1056939 718765
13358 718765 720610 810457 902255 957864 834433 524503 383865 272375 573815 818541
13348 818541 1130969 1375466 1192840 1092147 998654 723064 585616 722228 951169 1180120
13338 1180120 1359927 1454837 1474829 1487846 1477118 1350865 1081733 885386 951566 915283
13328 915283 663932 672213 867754 1140281 1471440 1577658 1407958 1141927 1111345 1142794
13318 1142794 1086504 1052748 1069925 968144 973066 1039694 794488 567681 415611 605245
13308 605245 780506 859490 923003 735955 544354 534565 762719 992383 1252501 1243279 943200
13297 943200 655735 541964 567049 788721 1303600 1501962 1465465 1240738 1084436 991264
13287 991264 771886 928776 1071301 877263 1062937 1361011 1319089 1025824 987661 1002539
13277 1002539 1066053 1262126 1246132 1260000 1209503 1308251 1242300 1023360 764392 1057831
13267 1057831 1085198 929984 843496 700271 707092 689727 648003 648975 780610 780584 1022507 1112441
13255 1112441 1320128 1033544 879052 1326494 1149065 1163791 1191757 845396 721380 871249
13245 871249 1080818 1472548 1743493 1560530 1068390 652139 769964 1243145 1453772 1524072
13235 1524072 1219040 758140 1040990 1572268 1857368 1839899 1621615 1308134 1451882 1425667
13225 1425667 1575609 1726955 1834434 1660439 1523398 1538408 1429755 1136112 1095936 1234388
13215 1234388 1340550 1406734 1529630 1544715 1547352 2014470 1844622 1738475 1981877 2039143
13205 2039143 1838893 1725627 1802422 1732459 1595877 1886008 2253912 2391452 2264501 2058868
13195 2058868 2339350 2265852 2193863 2550087 2606861 2422753 2334059 2478035 2580593 2214264
13185 2214264 2038653 1789106 1429387 1695675 1975175 2156334 2181385 1968401 1917249 1955927
13175 1955927 1840233 1825285 1785189 1649091 1656780 1701631 1290792 1256096 1501028 1601159
13165 1601159 1889495 2001878 2126385 2292379 2163656 2253889 2266810 2150968 1918756 2230522
13155 2230522 2227919 2167892 2293901 2599912 2746138 2538550 2343294 2096934 2262515 2313881
13145 2313881 2190159 1999874 1622468 1877605 1979990 1843888 2047919 2174176 1907984
13136 1907984 1926728 2139529 2431178 2195988 1814527 1821572 2010192 2296536 2615426 2946525
13126 2946525 2655342 2697502 2643316 2348612 2550919 2559029 2978607 3569029 4260941 4675830
13116 4675830 4306942 4070182 3910428 3793345 3481946 3008022 2745974 2797881 2656237 2656403
13106 2656403 2715984 2521110 2263818 2265289 2365357 2455030 2362360 2572491 2844822 2741872
13096 2741872 2374445 2312269 2279823 2256934 2270639 2307151 2489540 2577610 2345313 2391716 2731621
13085 2731621 2824410 2849959 3366849 3771323 4401439 4775546 4827266 4617481 3916614 3352220
13075 3352220 3150981 3080298 3128465 3216272 3175993 3517471 3807127 3853175 3852896 4406389 4982445
13064 4982445 4843046 4159209 3663136 3664581 3371626 2994884 2793353 2424485 2432430 2555090
13054 2555090 2676840 2443604 2247411 2167513 2108696 1615371 1292597 1656594 1849804 2439957
13044 2439957 2365342 2174503 1859182 1835729 1761354 1644389 1851437 1731882 1561956 1530679
13034 1530679 2099490 2416487 2562414 2748703 2893629 3032004 3703638 4483098 4616012
13025 4616012 4783619 4940266 4759202 4289080 3701721 3351460 2833834 2637490 2535640
13016 2535640 2408028 2248495 2055933 2298244 2353558 2409628 2190526 1952296 1752725 1620274
13006 1620274 1673676 1853119 2002778 2056434 1829528 1998541 1966699 2082385 2386262 2249128
12996 2249128 2335803 2440370 2535717 2229694 2192979 1968097 2022434 1922338 1833736 1864695
12986 1864695 2140531 2161754 2069511 2152601 1953498 1778635 1741666 1624031 1625389 1775865
12976 1775865 2187845 1936810 1941195 2027081 2042673 2014918 2156430 2011949 1702698 1639897
12966 1639897 1567385 1464754 1986483 2279597 2289501 2325470 2266284 2279949 2421458 2842212
12956 2842212 2912438 2646940 2728559 2986462 2974350 3025950 2549794 2425991 2434896 2207642
12946 2207642 2203169 2534492 2743122 2657734 2385636 2165341 2291612 2435827 2472129 2383701
12936 2383701 2500678 2540067 2398073 2391613 2303570 2267161 2127449 2198693 1928872 1630778
12926 1630778 1593552 1435382 1291201 1342147 1421838 1267286 1091288 1092433 1094165 1351601 1720846
12915 1720846 1806836 1970597 2192915 1931541 1862102 1822079 1753742 1519108 1584094 1613569
12905 1613569 1780409 2125129 2171576 2223033 2268766 2147565 2215890 2320734 2235610 2034624
12895 2034624 1969995 2232296 2485475 2580772 2479045 2704377 2283485 2388399 2651858 2649727
12885 2649727 2711937 2413087 2301086 2333953 2102780 1951404 1949727 1970678 2041605 1767951
12875 1767951 1792791 1615184 1829131 2214888 1888851 1707669 1950807 2207875 1922172 1887751
12865 1887751 1989135 1883667 1833871 2100631 2127707 2205471 2431277 2605793 2416050 1796868
12855 1796868 1755830 1759610 1874457 1946426 2339833 2575940 2500305 2265610 2179390 1603336
12845 1603336 1396076 1289381 1088506 1086748 1129571 1582147 1373385 1705305 1982440 2252526
12835 2252526 2267764 2202680 1960385 1553805 1440404 1567898 1704005 1667726 1549515 1631431
12825 1631431 1847746 1626408 1471756 1406494 1695332 1884703 1836314 1700572 2019258 2063807
12815 2063807 2056926 2104938 1976450 1813714 1928993 2115347 2165948 2255231 2153980 2137083
12805 2137083 2038199 2184718 2505555 2610206 2536322 2598652 2353036 2093169 1865529 1942322
12795 1942322 1930727 1899973 1986307 1873959 1955485 2104410 2218705 2194479 2113126 2065902 2095003
12784 2095003 2004181 1990812 2233223 2365421 2425811 2316367 2094252 1901045 2086001 1837527
12774 1837527 1543165 1495232 1509440 1695119 1866325 2039412 2345091 2572656 2365368 2332510
12764 2332510 2055700 1874756 2008735 2069946 2108863 1881708 1775241 1756478 1537142 1613164
12754 1613164 1600080 1903716 2537494 2883102 2862879 2708611 2692821 2599175 2414570 1808803
12744 1808803 1537548 1717747 1758504 1427797 1451572 1433843 1561198 1651368 1701439 1659356
12734 1659356 1311010 1392833 1857509 1684829 1497472 1637259 1935077 1779389 1512399 1333570
12724 1333570 1690377 1999940 2087237 1934854 1604684 1209598 1166458 1213664 1528194 1832398
12714 1832398 1864714 1864821 1948585 2041274 2171283 2140844 2257736 2026958 1662339 1809381 1755552
$$ [...]
##END NTUPLES=NMR SPECTRUM
##END=
