##TITLE=Analysis number 312053
Compound Code cc 33152
Book Reference 414/106
Project Code adrs
Chemist Name mattw
##JCAMPDX= 6.0         $$ Bruker NMR JCAMP-DX V2.0
##DATA TYPE= NMR SPECTRUM
##DATA CLASS= NTUPLES
##ORIGIN= Bruker BioSpin GmbH
##OWNER= NMR
$$ XWIN-NMR		Version 3.5
$$ Fri Jul 22 10:44:28 2005 GMT Daylight Time (UT+1h)  MAYBRIDGE\NMR@NMR_250MHZ
##.OBSERVE FREQUENCY= 250.131544655141
##.OBSERVE NUCLEUS= ^1H
##.ACQUISITION MODE= SIMULTANEOUS (DQD)
##.ACQUISITION SCHEME= undefined
##.AVERAGES= 16
##.DIGITISER RES= 18
##SPECTROMETER/DATA SYSTEM= dpx250
##.PULSE SEQUENCE= zg30
##.SOLVENT NAME= DMSO
##.SHIFT REFERENCE= (INTERNAL, DMSO, 0, 16.522)
##AUDIT TRAIL= $$ (NUMBER, WHEN, WHO, WHERE, WHAT)
$$ ##TITLE= Audit trail, XWIN-NMR		Version 3.5
$$ ##JCAMPDX= 5.01
$$ ##ORIGIN= Bruker BioSpin GmbH
$$ ##OWNER= NMR
$$ C:\u/data/dgb/nmr/ADRS/6410/pdata/1/auditp.txt
$$ ##AUDIT TRAIL=  $$ (NUMBER, WHEN, WHO, WHERE, WHAT)
(   1,<2005-07-22 10:43:35.21 +100>,<MAYBRIDGE\NMR>,<NMR_250MHZ>,
      <created by zg, POWCHK disabled, PULCHK disabled
       configuration hash MD5:
       62 19 C7 07 E1 42 D1 B7 37 6C 3D D0 77 39 F9 E6
       data hash MD5: 64K
       68 0A E4 E8 72 7B 32 35 15 50 79 8B 6E C2 59 85>)
(   2,<2005-07-22 10:43:57.52 +100>,<MAYBRIDGE\NMR>,<NMR_250MHZ>,
      <Start of raw data processing
       ef LB = 0.3 FT_mod = 6 PKNL = 1 SI = 32K 
       data hash MD5: 32K
       F9 8D E0 94 35 EC E7 33 4A 0E 51 9D 4A 7F DC 2D>)
(   3,<2005-07-22 10:44:03.30 +100>,<MAYBRIDGE\NMR>,<NMR_250MHZ>,
      <apk 
       data hash MD5: 32K
       DF 76 86 76 C7 87 E1 04 5E D8 C3 28 93 D9 AD DB>)
(   4,<2005-07-22 10:44:05.44 +100>,<MAYBRIDGE\NMR>,<NMR_250MHZ>,
      <abs ABSG = 5 
       data hash MD5: 32K
       F4 25 8C 23 7A EE 41 1E 64 65 CD A9 BE 0E 1A CC>)
$$ ##END=
$$ 
$$ hash MD5
$$ DC 88 71 F5 ED 95 1C 6A DA 5C D7 07 F6 F8 97 7F
##$RELAX= 
##$RELAX= 
##$RELAX= 
##$RELAX= 
##$RELAX= 
##$RELAX= 
##$RELAX= 
$$ Bruker specific parameters
$$ --------------------------
##$DU= <C:\u>
##$EXPNO= 6410
##$NAME= <ADRS>
##$PROCNO= 1
##$TYPE= <nmr>
##$USER= <dgb>
##$AMP= (0..31)
100 100 100 100 100 100 100 100 100 100 100 100 100 100 100 100 100 100 
100 100 100 100 100 100 100 100 100 100 100 100 100 100 
##$AQSEQ= 0
##$AQ_mod= 3
##$AUNM= <au_zg>
##$AUTOPOS= <11 >
##$BF1= 250.13
##$BF2= 250.13
##$BF3= 250.13
##$BF4= 250.13
##$BF5= 500.13
##$BF6= 500.13
##$BF7= 500.13
##$BF8= 500.13
##$BYTORDA= 1
##$CFDGTYP= 0
##$CFRGTYP= 5
##$CHEMSTR= <none>
##$CNST= (0..31)
1 1 145 1 1 1 1 1 1 1 1 1 1 1 1 1 1 1 1 1 1 1 1 1 1 1 1 1 1 1 1 1 
##$CPDPRG= <>
##$CPDPRG1= <>
##$CPDPRG2= <>
##$CPDPRG3= <>
##$CPDPRG4= <mlev>
##$CPDPRG5= <mlev>
##$CPDPRG6= <mlev>
##$CPDPRG7= <mlev>
##$CPDPRG8= <mlev>
##$CPDPRGB= <>
##$CPDPRGT= <>
##$D= (0..31)
0 1 0 0 0 0 0 0 0 0.06 0 0 0 0 0 0 0.0002 0 0 0 0 0 0 0 0 0 0 0 0 0 0 
0 
##$DATE= 1122025406
##$DBL= (0..7)
120 120 120 120 120 120 120 120 
##$DBP= (0..7)
150 150 150 150 150 150 150 150 
##$DBP07= 0
##$DBPNAM0= <>
##$DBPNAM1= <>
$$ [...]
##$SUBNAM7= <"">
##$SUBNAM8= <"">
##$SUBNAM9= <"">
##$SW= 20.6930455092707
##$SWIBOX= (0..15)
0 0 3 0 0 0 0 0 0 0 0 0 0 0 0 0 
##$SW_h= 5175.983436853
##$TD= 65536
##$TD0= 1
##$TE= 295.16
##$TE2= 300
##$TE3= 300
##$TEG= 300
##$TL= (0..7)
0 120 120 120 120 120 120 120 
##$TP= (0..7)
150 150 150 150 150 150 150 150 
##$TP07= 0
##$TPNAME0= <>
##$TPNAME1= <>
##$TPNAME2= <>
##$TPNAME3= <>
##$TPNAME4= <>
##$TPNAME5= <>
##$TPNAME6= <>
##$TPNAME7= <>
##$TPOAL= (0..7)
0.5 0.5 0.5 0.5 0.5 0.5 0.5 0.5 
##$TPOFFS= (0..7)
0 0 0 0 0 0 0 0 
##$TUNHIN= 0
##$TUNHOUT= 0
##$TUNXOUT= 0
##$USERA1= <user>
##$USERA2= <user>
##$USERA3= <user>
##$USERA4= <user>
##$USERA5= <user>
##$V9= 5
##$VALIST= <valist>
##$VCLIST= <CCCCCCCCCCCCCCC>
##$VD= 0
##$VDLIST= <DDDDDDDDDDDDDDD>
##$VPLIST= <PPPPPPPPPPPPPPP>
##$VTLIST= <TTTTTTTTTTTTTTT>
##$WBST= 1024
##$WBSW= 4
##$XGAIN= (0..3)
0 0 0 0 
##$XL= 0
##$YL= 0
##$YMAX_a= 300959
##$YMIN_a= -212496
##$ZGOPTNS= <>
##$ZL1= 120
##$ZL2= 120
##$ZL3= 120
##$ZL4= 120
##$ABSF1= 16.522
##$ABSF2= -4.171173
##$ABSG= 5
##$ABSL= 3
##$ALPHA= 0
##$AQORDER= 0
##$ASSFAC= 0
##$ASSFACI= 0
##$ASSFACX= 0
##$ASSWID= 0
##$AUNMP= <proc_1d>
##$AZFE= 0.1
##$AZFW= 0.1
##$BCFW= 0
##$BC_mod= 0
##$BYTORDP= 0
##$COROFFS= 0
##$CY= 12.5
##$DATMOD= 1
##$DC= 0
##$DFILT= <>
##$DTYPP= 0
##$F1P= 14.0000005364418
##$F2P= -0.99999901652339
##$FCOR= 0.5
##$FTSIZE= 32768
##$FT_mod= 6
##$GAMMA= 0
##$GB= 0
##$INTBC= 1
##$INTSCL= 1
##$ISEN= 128
##$LB= 0.3
##$LEV0= 0
##$LPBIN= 0
##$MAXI= 10000
##$MC2= 0
##$MEAN= 0
##$ME_mod= 0
##$MI= 0
##$NCOEF= 0
##$NC_proc= -5
##$NLEV= 6
##$NOISF1= 0
##$NOISF2= 0
##$NSP= 0
##$NTH_PI= 0
##$NZP= 0
##$OFFSET= 16.522
##$PC= 1
##$PHC0= -85.51532
##$PHC1= 5.714197
##$PH_mod= 1
##$PKNL= yes
##$PPARMOD= 0
##$PSCAL= 4
##$PSIGN= 0
##$REVERSE= no
##$SF= 250.13
##$SI= 32768
##$SIGF1= 0
##$SIGF2= 0
##$SINO= 400
##$SIOLD= 32768
##$SREGLST= <1H.DMSO>
##$SSB= 0
##$STSI= 32768
##$STSR= 0
##$SW_p= 5175.98343685301
##$SYMM= 0
##$S_DEV= 0
##$TDeff= 65536
##$TDoff= 0
##$TI= <Analysis number 999999
Compound Code 99
Book Reference 9
Project Code 9>
##$TILT= no
##$TM1= 0
##$TM2= 0
##$TOPLEV= 0
##$USERP1= <user>
##$USERP2= <user>
##$USERP3= <user>
##$USERP4= <user>
##$USERP5= <user>
##$WDW= 1
##$XDIM= 32768
##$YMAX_p= 362941333
##$YMIN_p= -934229
$$ End of Bruker specific parameters
$$ ---------------------------------
##NTUPLES= NMR SPECTRUM
##VAR_NAME=  FREQUENCY,     SPECTRUM/REAL,   SPECTRUM/IMAG
##SYMBOL=    X,             R,               I
##VAR_TYPE=  INDEPENDENT,   DEPENDENT,       DEPENDENT
##VAR_FORM=  AFFN,          ASDF,            ASDF
##VAR_DIM=   32768,         32768,           32768
##UNITS=     HZ,            ARBITRARY UNITS, ARBITRARY UNITS
##FACTOR=    0.157963299565203, 1,           1
##FIRST=     4132.6476996994, 0,             0
##LAST=      -1043.33573715361, 0,           0
##MIN=       -1043.33573715361, -934229,     0
##MAX=       4132.6476996994, 362941333,     0
$$ Real data points
##PAGE= N=1
##DATA TABLE= (X++(R..R)), XYDATA
$$ [...]
24883C47992N1149l1276R3832j45445o1147j73749o1537R6505P2781k2031r8269
$$ 347992 399141 367865 461697 316252 255105 81356 19819 116324 189105 167074 68805
24872F8805N340N782R4384j679o6933j81020M4228R0857N4472J7886J73684J48705
$$ 68805 74145 79927 174311 172632 105699 -75321 -31093 59764 114236 132122 305806 454511
24860D54511l1161j69622L3937m6668k65938k0180J98252k4194L9391j0592j2925
$$ 454511 423350 253728 287665 240997 -24941 -45121 153131 128937 168328 157736 144811
24849A44811Q1330Q7100k8163j22652l7804k7875j19230M7378Q3196Q554N704
$$ 144811 226141 313241 285078 162426 124622 96747 -22483 24895 108091 116645 122349
24838A22349K18140p7097j17531J1402L170J2016j05379n3768K85945K82496N948
$$ 122349 340489 263392 145861 157263 160433 172449 67070 13302 299247 581743 587691
24827E87691j9316l57065l60515L8609J78934L03453M9601J93077m2450k71282
$$ 587691 568375 211310 -149205 -110596 68338 371791 421392 614469 572019 300737
24817C00737k43465N3637J44183j25793n4213j00094J48396J06469O0045l12078
$$ 300737 57272 110909 255092 129299 75086 -25008 123388 229857 289902 -22176
24807b2176r5140J35425l2983j32096N3315J66196J03631l3011q4633k77422r4524
$$ -22176 -117316 18109 -14874 -146970 -93655 72541 176172 143161 58528 -218894 -313418
24796c13418K4530Q9746J09995R6863j02832J58132l476K0749K10565o9434j1041
$$ -313418 -288888 -199142 -89147 7716 -95116 63016 59540 80289 290854 221420 210379
24785B10379P0908n5645j30922p7450k1725J81276J11937l3586k02124P4346J79544
$$ 210379 281287 225642 94720 17270 -4455 176821 288758 255172 53048 127394 306938
24774C06938J42653o7611r6057k0773m1541k94872j0462K96326J25958k07259
$$ 306938 449591 381980 285923 265150 223609 -71263 -81725 214601 340559 133300
24764A33300k34462J29940O3210j38840R9384M1066L3934J57723K90607Q4938
$$ 133300 -101162 28778 91988 -46852 52532 93598 127532 285255 575862 660800
24754F60800k35296k58519k91125r3337K43J15548J05662J03326J69977L3913
$$ 660800 425504 166985 -124140 -217477 -217234 -101686 3976 107302 277279 311192
24744C11192m69202j86684N4272J17268J85809j01080j58433R3843J63526J65156
$$ 311192 -158010 -344694 -290422 -173154 12655 -88425 -246858 -153015 10511 175667
24734A75667K1224l9544j06901J26718l04j00607q3862J53988N1728K30124P7812
$$ 175667 196891 157347 50446 177164 176860 76253 -7609 146379 198107 428231 506043
24723E06043k02031J0054j0817j67612q8693K0882o0960r184K22258n1210j57620
$$ 506043 304012 314066 303249 135637 46944 67826 6866 -2318 219940 168730 11110
24712A1110j32339K30127J79819n1598O7963n5692j87154L3253L9136L6554K12913
$$ 11110 -121229 108898 288717 237119 305082 249390 62236 95489 134625 171179 384092
24701C84092k7594J7574k9232l8674j51367j68057k0488M1087J22025J7150j65709
$$ 384092 356498 374072 344840 306166 154799 -13258 -33746 7341 129366 146516 -19193
24690a9193P4551J10626J31432n5688j60565L7416L2462J73189J85679j23480
$$ -19193 55358 165984 297416 241728 81163 118579 151041 324230 509909 386429
24680C86429n6755J04258l3415j98295J05905J04289p9806k03441k09945M8848
$$ 386429 329674 433932 400517 202222 308127 412416 332610 129169 -80776 -31928
24670c1928K18472M6186K2045j36135n4181N7971J21658n8437M6462J73599O304
$$ -31928 186544 232730 254775 118640 64459 122430 244088 185651 232113 405712 412016
24659D12016r9940j37754j86513J98710J71903n8480j49489j2427J48168m6425
$$ 412016 312076 174322 -12191 186519 358422 299942 150453 138026 286194 239769
24649B39769o7463k1204m9281m7009R2545M5313P1535j31180M0018N6515p2212
$$ 239769 172306 151102 101821 54812 147357 192670 264205 133025 173043 229558 157346
24638A57346j72334j17635J23202L5820P0964J19583J45472N106m8116j11450
$$ 157346 -14988 -132623 -9421 26399 97363 216946 362418 367524 319408 207958
24628B07958o7386j32479o7699K08563J13758J04596O8193J02873k32338j66921
$$ 207958 140572 8093 -59606 148957 262715 367311 435504 538377 306039 139118
24618A39118j12223M7304J16090K7354o9120k99980k72951J93347L02642j15266
$$ 139118 26895 74199 190289 217643 148523 -151457 -424408 -231061 71581 -43685
24608d3685j16387O5878O1453j58299K8182O5999M809q3006J13375J97116J19517
$$ -43685 -160072 -94194 -32741 -191040 -162858 -96859 -92050 -175056 -61681 135435 254952
24597B54952r3454j67438q7907L2078r3577P6684K95056k7582n284K05290p4500
$$ 254952 161498 -5940 -93847 -61769 -155346 -78662 216394 188812 183528 388818 314318
24586C14318j53542k59560r2522J41998J52361K2628J22932O9812m0977O8258
$$ 314318 160776 -98784 -191306 -49308 103053 125681 248613 318425 277448 345706
24576C45706M1006j5139J6104p4334p9583P5633K358l6569r7475J32200R21j45551
$$ 345706 386712 371573 387677 313343 233760 309393 311751 275182 177707 309907 310828 165277
24564A65277j22828j00304J32007M7591Q681J7729O8249k3193n5783j3580j02270
$$ 165277 42449 -57855 74152 121743 130424 148153 216402 193209 137426 123846 21576
24553B1576j1661J60704m456j68485R9661J437k4144j11170l252K5911Q573N5324
$$ 21576 9915 170619 166163 -2322 97339 98776 74632 -36538 -39790 -13879 -5306 50018
24541E0018P1643J0622J8968P8710r5639O4427R3627M3685L9421J44949j66323
$$ 50018 121661 132283 151251 229961 134322 198749 292376 336061 375482 520431 354108
24530C54108j16776J22616q6894j25154R7753R656j16499l7382k05396J0531L1383
$$ 354108 237332 359948 273054 147900 245653 255309 138810 101428 -103968 -93437 -62054
24519f2054K3675M488l6891j04865j389R5485m0538R1125P9867J56973J17419
$$ -62054 -38379 -33891 -70782 -175647 -177036 -81551 -122089 -30964 48903 205876 323295
24508C23295j50073J16973p2695j28645j40102j14279J37131Q017l7184j01149
$$ 323295 173222 290195 217500 88855 -51247 -165526 -28395 -20378 -57562 -158711
24498a58711K4395L59332M9811J4578P5687l41343n3727J422Q067J09360o7354
$$ -158711 -134316 225016 274827 289405 365092 23749 -29978 -28556 -20489 88871 21517
24487B1517p0585L7070J91626j03274k13177J03248K1458J21655M4504j23914
$$ 21517 -49068 -11998 179628 76354 -136823 -33575 -12117 109538 154042 30128
24477C0128j08995j17321K06777o5963j72967R4730k4753L2797P3671R8738L3062
$$ 30128 -78867 -196188 10589 -55374 -228341 -133611 -158364 -125567 -51896 46842 79904
24466G9904L5226n4644k4267k60589o4580j71404J99053L40171O5281M7696L7721
$$ 79904 115130 60486 36219 -224370 -288950 -460354 -261301 78870 144151 191847 229568
24455B29568k25544j90535l7491p3119J29007J99363K00314k2532j06435j56571
$$ 229568 4024 -186511 -224002 -297121 -168114 31249 231563 209031 102596 -53975
24445e3975P5794P7918O568K3167q038j66910K5815p4100j21575J94323J64609
$$ -53975 21819 99737 106305 129472 121434 -45476 -19661 -93761 -215336 -21013 143596
24434A43596m7420M3844j43402o7153p411M2163O9329R7932J04897j44923k62318
$$ 143596 96176 140020 -3382 -70535 -77946 -35783 33546 131478 236375 91452 -170866
24423a70866J01950K24184k2806q7434J6474R8838O4833j70972j34223m0131j66454
$$ -170866 -68916 155268 132462 45028 61502 160340 225173 54201 -80022 -120153 -286607
24412b86607Q6Q2755J2966m085J37636K92576J56887n8542j65448J13666K33985
$$ -286607 -286521 -203766 -190800 -194885 -57249 235327 392214 333672 168224 281890 515875
24401E15875j28498j56589j35118j9173R8099J51818p1656r082M140j83204l1050
$$ 515875 387377 230788 95670 76497 174596 326414 254758 245676 249816 66612 35562
24390C5562j5615j94077q2855K90905O8105k0162k49545J76847N7908R5818J43433
$$ 35562 19947 -174130 -256985 33920 102025 81863 -167682 9165 67073 162891 306324
24379C06324L4008o4658R509p5564q8720P9551p3724j84803j53190m2853O5103
$$ 306324 340332 275674 285183 209619 120899 200450 126726 -58077 -211267 -254120 -189017
24368a89017J68227J05045m4318k066m0634l2o8606R736K253R4011l557K11068
$$ -189017 -20790 84255 39937 37871 -2763 -2795 -71401 -61665 -59412 34599 31042 242110
24356B42110P8080l03920J73301O7620j1352j03107k8405j44646L8385j49520
$$ 242110 320190 16270 189571 257191 245839 142732 114327 -30319 8066 -141454
24346a41454J8534J78040j46415j06224J14707J55518j37309j32811n7992n5238
$$ -141454 -122920 55120 -91295 -197519 -82812 72706 -64603 -197414 -255406 -310644
24336c10644K2950K25920Q6660k5701n8489K0188O2417o9818k19722L0980K42038
$$ -310644 -287694 -61774 24886 -815 -59304 -39116 23301 -46517 -266239 -235259 6779
24325F779M8522P4828P0726o6673N1039M1733p8557j2485l4736J1230Q8135k00006
$$ 6779 55301 130129 200855 134182 185221 226954 148397 135912 101176 112406 200541 535
24313E35R6435J63462o3299p7205j51862j3162N9820O0550j61849p2311p8608
$$ 535 96970 260432 197133 119928 -31934 -45096 14724 75274 -86575 -158886 -237494
24302b37494j28132N7257Q3516J90373n0699P637Q2383J17770J92002R6020J18927
$$ -237494 -365626 -308369 -224853 -34480 -85179 -77542 4841 122611 314613 410633 529560
24291E29560J04253K5509j26540j46899p5634m3359J3979m1252l0853J00285k7388
$$ 529560 633813 659322 532782 385883 310249 266890 280869 239617 208764 309049 281661
24280B81661L176j17721M1810m6901O4496J12565m4912j60120r9746j1422k1568
$$ 281661 284837 167116 208926 162025 226521 339086 294174 134054 34308 22886 1318
24269A318J00762O1732j14198L155O456J1981J31026J46684n7391k22968K7763
$$ 1318 102080 163812 49614 52769 59225 71206 202232 348916 291525 68557 96320
24258I6320k41382j98116n0357J42346L8211J84660J00676Q2739K7167l9733j70981
$$ 96320 -145062 -343178 -393535 -251189 -212978 -28318 72358 155097 182264 142531 -28450
24247b8450P2872o6362q2300p2081l7701L7870j6263Q1910j03955p2881J18622
$$ -28450 44422 -21940 -104240 -176321 -214022 -176152 -192415 -110505 -214460 -287341 -168719
24236a68719J12210O3378J01515m3408q5874N0973M8230J053M0797p6770J0729
$$ -168719 -56509 6869 108384 64976 -20898 30075 78305 79358 120155 43385 54114
24225E4114M6860l6027J33836j67963j52602N2559O5267k8916o1584r2936M6955
$$ 54114 100974 64947 198783 30820 -121782 -69223 -3956 -32872 -94456 -187392 -140437
24214a40437J36466M8953M6877J6124K6478l9822j9354j32168k36597q0676J98847
$$ -140437 -3971 44982 91859 107983 134461 94639 75285 -56883 -293480 -374156 -175309
24203a75309J83090r8481k44160N6358J19587l4215p1772L349J84155K5585Q1702
$$ -175309 7781 -90700 -334860 -278502 -158915 -193130 -264902 -261553 -77398 -51813 29889
24192B9889M3181N8858J12285k31348p4702j52017j35747p327p7641J89329L79903
$$ 29889 73070 131928 244213 12865 -61837 -213854 -349601 -356928 -434569 -245240 134663
24181A34663L17212L7877l1011J5516j60398k29977j69297K5715K2483j06686
$$ 134663 451875 489752 458741 474257 313859 83882 -85415 -59700 -37217 -143903
24171a43903N4282k663q9651N8637j9488j54968n93k8907J00690J75250J978Q7788
$$ -143903 -89621 -92284 -181935 -123298 -142786 -297754 -298347 -327254 -226564 -51314 -49336 38452
24159C8452j08328j72943r8767j44830K46109Q4599L2701J22054J39697K4240
$$ 38452 -69876 -242819 -341586 -486416 -240307 -155708 -123007 -953 138744 162984
24149A62984r8708m5419j8932J95288J66503Q2112j24395j05913l7245O2640J7142
$$ 162984 64276 18857 -75 195213 361716 443828 319433 213520 176275 238915 256057
24138B56057l5921p5375Q4112p5189j85058O9872Q2673j67509r8159N8605l1848
$$ 256057 220136 144761 228873 153684 -31374 38498 121171 -46338 -144497 -85892 -117740
24127a17740Q9822r025J05990J47935j28578k15544j03933J02799J5457o4807
$$ -117740 -27918 -36943 69047 216982 88404 -127140 -231073 -128274 -112817 -177624
24117a77624j56663J04375M2169p1890K00655R6035q5323k3685P8371J34685n968
$$ -177624 -334287 -229912 -187743 -259633 -58978 37057 -48266 -71951 6420 141105 135137
24106A35137J61267n4568j01962j67254j05784J31511L48504J28169p5362o3806
$$ 135137 296404 241836 139874 -27380 -133164 -1653 346851 475020 399658 335852
24096C35852j48851J38894j85793j48829r0857k14784l8231J52731J04726J18437
$$ 335852 187001 325895 140102 -8727 -99584 -314368 -352599 -199868 -95142 23295
24086B3295j67320r5132l0585P0675r5763l5278J77268P6778Q9042J06276J21950
$$ 23295 -144025 -239157 -269742 -199067 -294830 -330108 -152840 -76062 12980 119256 241206
24075B41206M1128o4373j57706N4231j23842j70732M7687J05173l4679j17853
$$ 241206 282334 217961 60255 114486 -9356 -180088 -132401 -27228 -61907 -179760
24065a79760Q7250J77783J08565j33044L7734j2426r8482j16159J5588J45401
$$ -179760 -92510 85273 193838 60794 98528 86102 -12380 -128539 -112951 32450
24055C2450J53532R0162k68118r9030K2470J71427N5826k2174J17934q9356r2742
$$ 32450 185982 276144 8026 -91004 -68534 102893 158719 136545 254479 165123 72381
24044G2381k21067k15239J4514J64401J16325K2892J32267P3100O0761M4321r0146
$$ 72381 -148686 -363925 -349411 -185010 -68685 -45793 86474 159574 220335 264656 174510
24033A74510o6209L6635k8408P0369l7635Q0077j52483j43472l8356M2405K39579
$$ 174510 108301 144936 116528 186897 149262 229339 76856 -66616 -104972 -62567 177012
24022A77012P8865m4288j10863k02969J578J32315J13389l3546o0230O739O2145
$$ 177012 255877 211589 100726 -102243 -100665 31650 145039 111493 51263 58002 120147
24011A20147m8960j54679j26809K34970K88399M8806m0691j22206j39511k2126
$$ 120147 71187 -83492 -210301 24669 313068 361874 321183 198977 59466 37340
24001C7340n4526J11001L04176R8019k56018j52602J62365j97708j72609p3649
$$ 37340 -17186 93815 397991 496010 239992 87390 249755 52047 -120562 -194211
23991a94211R0618R3191J8661n199Q2650O6950m8757K09070n0422j98333k113
$$ -194211 -103593 -10402 8259 3060 85710 152660 103903 312973 262551 64218 62105
23980F2105J67702j15825k22419J2282K31728N6702k448p3382k05821k8172o0768
$$ 62105 229807 113982 -108437 -96155 135573 192275 189827 116445 -89376 -117548 -178316
23969a78316q297J45052J13858j59887k3702J07662L7050Q7136l8010N1182J096
$$ -178316 -186613 -41561 72297 -87590 -111292 -3630 33420 120556 82546 133728 134824
23958A34824m1616m7787m859K3173n5385j52435O8967O5107N8067K2700P5958
$$ 134824 93208 45421 40562 63735 8350 -144085 -75118 -10011 48056 70756 146714
23947A46714L0051n4737L7018q7907L2036n5438O9048L4458O5895k8171k79980
$$ 146714 176765 122028 159046 71139 103175 47737 116785 151243 217138 188967 -91013
23936i1013m3302N9770P7080K57704L9302p4895k27800N6369J94664k5085r5921
$$ -91013 -134315 -74545 2535 260239 299541 224646 -3154 53215 247879 222794 126873
23925A26873m1459K3849n4660J74486j8275j84384j9154j40379j76740J11526
$$ 126873 85414 109263 54603 229089 210814 26430 7276 -133103 -309843 -198317
23915a98317R9658M9318N7909K3974j68767J5243J16145q4265m0602P8243L9879
$$ -198317 -98659 -49341 8568 32542 -136225 -120982 -4837 -89102 -129704 -51461 -11582
23904a1582n3801j36221J47261P4601j53724l33336J3760J36057J95539J18036
$$ -11582 -65383 -201604 -54343 20258 -133466 -466802 -453042 -316985 -121446 -3410
23894c410M4594M9169j15945j27520J9132J0275O4031J17799P7838m7336k27350
$$ -3410 41184 90353 -25592 -153112 -133980 -123705 -59674 58125 135963 88627 -138723
23883a38723M4362l8785J84324j68256j51672J01202J03893J86555J10011k02022
$$ -138723 -94361 -133146 51178 -117078 -268750 -167548 -63655 122900 232911 30889
23873C0889k7410j30193j6445p8243L7484O9305N2504J11J8862P2610j9508l1726
$$ 30889 3479 -126714 -143159 -221402 -183918 -114613 -62109 -61998 -43136 29474 9966 -21760
23861b1760M3776O8663j66553J28500k0005l9459L1013n4526J6686j81140o6535
$$ -21760 22016 90679 -75874 52626 32621 -6838 24175 -30351 -13665 -194805 -261340
23850b61340o2814N1142J15126M6515n5019L8360K68149J26996k10382l2305J22782
$$ -261340 -324154 -273012 -157886 -111371 -166390 -128030 140119 267115 56733 24428 147210
23839A47210O9106k08224j17897o1873p4465o4712L67385R6202K7114p9907m4709
$$ 147210 216316 8092 -109805 -171678 -246143 -310855 56530 152732 179846 99939 55230
23828E5230k33865k96582o3397L2527J90698K26512m8830j71866M5160J76120
$$ 55230 -178635 -475217 -538614 -506087 -315389 -88877 -137707 -309573 -264413 -88293
23818h8293O6131J39739j5102j08610n8852o7360J9089N0035j06706j5622J5235
$$ -88293 -22162 117577 102475 -6135 -64987 -132347 -113258 -63223 -169929 -185551 -170316
23807a70316R4648J58924m3557k51501j82392R4553L22638N0625k3553j0655j32693
$$ -170316 -75668 83256 39699 -211802 -394194 -299641 22997 73622 50069 39414 -93279
23796i3279k1178Q455K9729N5101k09770j85108N54J91419J16174J3378k0914
$$ -93279 -114457 -106002 -76273 -21172 -230942 -416050 -415496 -224077 -107903 -94525 -115439
23785a15439j53218m3295R4695p308p9654J5673J146J34946J58291j9473n5439
$$ -115439 -268657 -311952 -217257 -224565 -304219 -288546 -287400 -152454 5837 -13636 -69075
23774f9075r5371j50553o8928O6901M2202l7K50082k3956J12017J21699j82166
$$ -69075 -164446 -314999 -383927 -317026 -274824 -274861 -24779 -48735 63282 184981 2815
23763B815k97730N3349N6268K07258J03678J21315J5864p5650k29514J7572J6712
$$ 2815 -294915 -241566 -185298 21960 125638 246953 262817 187167 -42347 -24775 -8063
23752h063j07178R2195J17876j49656k25935l875J4031j27639K10801J20420n9938
$$ -8063 -115241 -23046 94830 -54826 -280761 -284636 -270605 -398244 -187443 -67023 -126961
23741a26961j08227O0362J05292K3681M9734r4359N542K4109j0674j2702n9202
$$ -126961 -235188 -174826 -69534 -45853 3881 -90478 -84936 -60827 -71501 -84203 -143405
23730a43405J99O9658k9344O39K0118M2058J99055J12141J9271l1662r7245O9293
$$ -143405 -143206 -73548 -102892 -102253 -82135 -40077 158978 271119 290390 258728 161483 230776
23718B30776j21666n2157j07626j59789K21383M6937l5490N5609m3105l5893J62512
$$ 230776 109110 56953 -50673 -210462 10921 57858 22368 77977 34872 -1021 161491
23707A61491J00474l9618m8531R6132Q3025M1882j78297l9182Q9148j72636l03512
$$ 161491 261965 222347 173816 269948 352973 394855 216558 177376 266524 93888 -209624
23696b09624j66488J22896J65448K81165j27119q9039j45963n428J45015L3355
$$ -209624 -376112 -253216 -87768 193397 66278 -22761 -168724 -174152 -29137 4218
23686D218J18240q8041J41472J11917K8603r8455j85088k08847o1091q4740j62561
$$ 4218 122458 34417 175889 287806 316409 217954 32866 -175981 -237072 -321812 -484373
23675d84373q424K76534J88073m2847r8287o3247R9906J21437r9683m5630J71081
$$ -484373 -492797 -216263 -28190 -71037 -169324 -232571 -132665 -11228 -110911 -156541 14540
23664A4540o3335r8288j59262J7130J00106K24659L37276Q3057j35021k05395
$$ 14540 -48795 -147083 -306345 -289215 -189109 35550 372826 455883 320862 115467
23654A15467j575O3862k8801j46908j41781r5599J28986K41344j641j36019Q8628
$$ 115467 113892 177754 148953 2045 -139736 -235335 -106349 134995 133354 -2665 85963
23643H5963K0034M9018o6636j87656j57393q1814P2135N7540K8232j1923N3457
$$ 85963 105997 155015 88379 -99277 -256670 -338484 -266349 -208809 -180577 -192500 -139043
23632a39043O1504m3291m4339K09342L25309J9202m17501j49809o6348R7092m6154
$$ -139043 -77539 -120830 -165169 44173 369482 388684 -28817 -178626 -244974 -147882 -194036
23621a94036p9978Q3998J61769J34065p482P2841k2343Q452j58791J9141J31125
$$ -194036 -274014 -190016 -28247 105818 98336 171177 148834 157286 -1505 17636 148761
23610A48761j34893k69198q9530J16977P7302j7035N1723J2121j23056R2206J89145
$$ 148761 13868 -255330 -344860 -227883 -150581 -167616 -115893 -103772 -226828 -134622 54523
23599E4523J04636m9798k09147r7275j7228J2120K28574J14683m7727j07112n3270
$$ 54523 159159 109361 -99786 -197061 -214289 -202169 26405 141088 93361 -13751 -67021
23588f7021k1813O850j1716J20529m8303o4434O568m6960K8302j80838j05624
$$ -67021 -88834 -81984 -93700 26829 -21474 -85908 -79340 -126300 -97998 -278836 -384460
23577c84460K34910j09619O9094o550J30500J53361N4668l6246K4464q0011k31657
$$ -384460 -149550 -259169 -190075 -196625 -66125 87236 141904 105658 130122 50111 -181546
23566a81546R232l7265J48039J15466o8650R188l4470O6081P9065j62685j19873
$$ -181546 -172314 -209579 -61540 53926 -14724 -5536 -40006 26075 105140 -57545 -177418
23555a77418j02437M5907J92918j07881O5734j8232o447j24403N1822l2111R2853
$$ -177418 -279855 -233948 -41030 -148911 -83177 -101409 -107856 -232259 -180437 -212548 -119695
23544a19695J72298L7622j9873p2747o610k30604k4202R1914l0505J9036N7747
$$ -119695 52603 90225 70352 -2395 -9005 -239609 -263811 -171897 -202402 -183366 -125619
23533a25619J22775n8721O0665J03071K02171K7871k66205q7781j7255j0352j08494
$$ -125619 -2844 -61565 -900 102171 304342 332213 66008 -21773 -39028 -49380 -157874
23522a57874K191O0966J2608P7763j10709P6800N7545j83535k5371R921O5282
$$ -157874 -155683 -94717 -82109 -4346 -115055 -38255 19290 -164245 -189616 -179695 -114413
23511a14413J402l8077j00107M1656J48822K71625P4135P7800j74743j32540J56471
$$ -114413 -113011 -151088 -251195 -209539 -60717 210908 285043 362843 188100 55560 212031
23500B12031N6637j23592k12967P6449j19929P0632J96986j8540j33715j80604
$$ 212031 268668 145076 -67891 8558 -111371 -40739 156247 137707 3992 -176612
23490a76612o6813p112n0963K03170J63184J10527p7397m8320K1187k4612j47821
$$ -176612 -243425 -250537 -301500 -98330 64854 175381 97984 49664 70851 46239 -101582
23479a01582k11091J8714Q5252J23616m2721O3260N0897O4078M4248o8657m2720
$$ -101582 -312673 -293959 -208707 -85091 -127812 -64552 -13655 50423 94671 26014 -16706
23468a6706l28010L4967K63218K1670k33071J80601J98593L9J52021k6431k82506
$$ -16706 -344716 -309749 -46531 -24861 -257932 -77331 121262 121301 273322 246891 -35615
23457c5615k24890m4177J32583J4808j0865Q963O220L3257J43639l9030j22099
$$ -35615 -260505 -304682 -172099 -157291 -168156 -159193 -152973 -119716 23923 -15107 -137206
23446a37206j832P6424k6871p0433O596R8250k48928m6283J16926N1640Q2381
$$ -137206 -139038 -62614 -89485 -159918 -153322 -55072 -304000 -350283 -233357 -181717 -99336
23435i9336J93603k09410J24452N8809k72754J3023k0474m387L1639q1676J04912
$$ -99336 94267 -115143 9309 68118 -204636 -191613 -212087 -216474 -184835 -266511 -161599
23424a61599M7355J98494o3611j24099j93610p6018L9675K32256O2728n005l5637
$$ -161599 -114244 84250 20639 -103460 -297070 -373088 -333413 -101157 -38429 -43434 -79071
23413g9071n7760q2022j34493J51579J13818j5313P7849n8220M5568j4617q9833
$$ -79071 -136831 -218853 -353346 -201767 -87949 -103262 -25413 -83633 -38065 -52682 -142515
23402a42515l2370J00690j37312J14965J85668q3401j85017P933L3586j2283J22954
$$ -142515 -174885 -74195 -211507 -96542 89126 5725 -179292 -171359 -137773 -150056 -27102
23391b7102M0927R1206n0538j29945n8658j3324L42692n0881k33929L5202N2695
$$ -27102 13825 105031 54493 -75452 -134110 -147434 195258 144377 -89552 -54350 -1655
23380a655j9774p9021q4837J01854J5956j49012q9928K13159R6511o2962J46228
$$ -1655 -21429 -100450 -185287 -83433 -67477 -216489 -306417 -93258 3253 -59709 86519
23369H6519j42195m3904L4747K60628N19J29398J62186m2761k28786o2200j77824
$$ 86519 -55676 -99580 -64833 195795 196314 325712 487898 445137 216351 154151 -23673
23358b3673J920M2284M0234Q475j6214M1420n2590l7884r0169J22902j37096k27089
$$ -23673 -21753 20531 60765 69240 53026 94446 41856 3972 -86197 36705 -100391 -327480
23346c27480K9342N4714n3932J4144J30414N0951l1476J46714K04736n2001k01784
$$ -327480 -298138 -243424 -297356 -283212 -152798 -101847 -133323 13391 218127 166126 -35658
23335c5658q6095J29107J79064K8881K0475j16880n4163N8502q8161M8614L6659
$$ -35658 -121753 7354 186418 215299 235774 118894 64731 123233 35072 83686 120345
23324A20345n1435j20938J15638J17830p7613J32623j50956m9553L2809j24901
$$ 120345 68910 -52028 63610 181440 103827 236450 85494 35941 68750 -56151
23314e6151j14032K89958m5973j54873J49036K0898j8373N3175M1827j72821k83198
$$ -56151 -170183 119775 73802 -81071 67965 88863 70490 123665 165492 -7329 -290527
23303b90527m0307K37614J54491o5547l0696J7752o3661J48620J23811L3338n3888
$$ -290527 -330834 -93220 61271 -4276 -34972 -17220 -80881 67739 191550 224888 171000
23292A71000q9467j86765j09131o7995L34600L7337q2920j63270l5518K48980
$$ 171000 81533 -105232 -214363 -282358 52242 89579 6659 -156611 -192129 56851
23282E6851j3877j16602P3914O1680k06413j87629N9566K01631K67951J6601j70422
$$ 56851 42974 -73628 286 61966 -144447 -332076 -272510 -70879 197072 213673 43251
23271D3251l4290j98792r7952O4579J86124o6243l081j22177Q6250K49513L5334
$$ 43251 8961 -189831 -287783 -223204 -37080 -103323 -106404 -228581 -142331 107182 142516
23260A42516J30382n8362j82064j49291o1698N864R3771r8805L54K29713k2699
$$ 142516 272898 214536 32472 -116819 -178517 -172653 -78882 -177687 -177333 52380 29681
23249B9681j58640j41748O348J30600J51801N0768N1618j8725k2382j7402m6384
$$ 29681 -128959 -270707 -264359 -133759 18042 68810 120428 101703 79321 61919 15535
23238A5535Q1348K6942j81205k0586L28P0594o9242j6014j91457Q2855P8382j6826
$$ 15535 96883 123825 -57380 -77966 -77638 -7044 -76286 -92300 -283757 -200902 -122520 -139346
23226a39346J0739j15775J23226N0487q8289J79766j996Q3431P0002j76745k47952
$$ -139346 -128607 -244382 -121156 -70669 -158958 20808 18812 102243 172245 -4500 -252452
23215b52452p0540K37442J32313J13188j4005j12783P0419N0514p3373j37549
$$ -252452 -322992 -85550 46763 159951 145946 33163 103582 154096 80723 -56826
23205e6826o7423n8842j00187n9023M4319K53336J09652p4504j66372k21712j19731
$$ -56826 -124249 -183091 -283278 -342301 -297982 -44646 65006 -9498 -175870 -397582 -517313
23194e17313J46431N9618k7579J8994K15045J36731P3526J96579n32j37088j12075
$$ -517313 -370882 -311264 -338843 -319849 -104804 31927 105453 302032 301500 164412 52337
23183E2337j05379l1388N1829J99677O8709k29925k12575m5018P6955m8193l5277
$$ 52337 -53042 -84430 -32601 167076 235785 5860 -206715 -251733 -174778 -222971 -258248
23172b58248K43996J5875n4125k3677J7789j58691m6766J5323J48701J14926J34420
$$ -258248 -14252 1623 -52502 -76179 -58390 -217081 -263847 -248524 -99823 15103 149523
23161A49523M2182m1505n2336j68410j17286J80557j22290j94563Q0194J10549
$$ 149523 191705 150200 97864 -70546 -187832 -7275 -129565 -324128 -243934 -133385
23151a33385K09439p590J17149p9352k12138j60911R6158O6685L9065R5399J08013
$$ -133385 76054 68464 185613 106261 -105877 -266788 -170630 -103945 -64880 30519 138532
23140A38532O7704k37098j9320M1905K04146M4300j8194J36938J18961j27703
$$ 138532 206236 -30862 -50182 -8277 195869 240169 221975 358913 477874 350171
23130C50171j25617j17047j87323O6329p9119L5903J48951K66650k02184m8718
$$ 350171 224554 107507 -79816 -13487 -92606 -56703 92248 358898 156714 107996
23120A07996k18959k92533J90528J92045L2091K2481j11972N0894K24025M5761
$$ 107996 -110963 -403496 -212968 -20923 11168 33649 -78323 -27429 196596 242357
23110B42357p3570j34253Q3743j36764n9915J79708Q6306L2163k10111j3666p9152
$$ 242357 168787 34534 118277 -18487 -78402 101306 187612 219775 9664 -4002 -83154
23099h3154o5030k0875K29632J67866n9272L5856k60740o6864K68180j387J00675
$$ -83154 -148184 -169059 60573 228439 169167 205023 -55717 -122581 145599 144212 244887
23088B44887k62158r8199j242J18362j16465j52683p055m8443j0902K10937L3432
$$ 244887 -17271 -115470 -116712 1650 -114815 -267498 -274553 -322996 -333898 -122961 -89529
23077h9529m8824N5371r0457j33732k6769K23360Q3409J13305j29751M8619j07557
$$ -89529 -138353 -82982 -173439 -307171 -333940 -110580 -27171 86134 -43617 5002 -102555
23066a02555j32258k3514M6589K24052M7765N3699k6273j73924N6624R0638k7277
$$ -102555 -234813 -258327 -211738 12314 60079 113778 87505 -86419 -29795 60843 33566
23055C3566k2215j44530R8049J09465o3483p6958n4631J1282q1542n8047J38495
$$ 33566 11351 -133179 -35130 74335 10852 -66106 -120737 -109455 -190997 -249044 -110549
23044a10549K77135R7299k05898j34938J77633j4030N7330K34525j74102k7257
$$ -110549 166586 263885 57987 -76951 100682 86652 143982 378507 204405 177148
23034A77148o5263R9519q784j16057k53338J764K0310P9891J61920J9661L3851
$$ 177148 111885 211404 202620 86563 -166775 -165011 -144701 -64810 97110 116771 150622
23023A50622O9454j50341k23235k4211J28737j10794Q8231J8625N8337O5365k7137
$$ 150622 220076 69735 -153500 -177711 -48974 -159768 -71537 -52912 5425 70790 43653
23012D3653j53512m4247r385j82929j405J03697m2016j25881R5451J48116O7669
$$ 43653 -109859 -154106 -163491 -346420 -347825 -244128 -286144 -412025 -316574 -168458 -100789
23001a00789n2771K37653Q3114o0433k7867j66628j46741k7047l4954k541M0091
$$ -100789 -153560 84093 167207 106774 78907 -87721 -234462 -261509 -296463 -299004 -258913
22990b58913j45987O4408O2483Q5749J22593m4785m0096J28578k4462n9322j76043
$$ -258913 -404900 -340492 -278009 -192260 -69667 -114452 -154548 -25970 -50432 -109754 -285797
22979b85797K3880R3932n4510m0973J77054J57983m2688M88l8494J30014j82210
$$ -285797 -261917 -167985 -222495 -263468 -86414 71569 28881 29369 -9125 120889 -61321
22968f1321p3145K06474J38213p0292k31950k02463M8485J0182L2190n1106o9060
$$ -61321 -134466 72008 210221 139929 -92021 -294484 -245999 -235817 -203627 -254733 -323793
22957c23793l218Q0109Q2146j39233j09186N1077K39093J05922J52007M9628l3795
$$ -323793 -327011 -246902 -164756 -303989 -413175 -362098 -123005 -17083 134924 184552 150757
22946A50757J4626m59Q7260n7054k88452q5995l6909J7385N2843P0966o7472Q1204
$$ 150757 165383 164924 252184 195130 -93322 -179317 -216226 -198841 -145998 -75032 -142504 -61300
22934f1300j21303j35648R8940m4338J18924J43348J30285K1553J4881j21613
$$ -61300 -182603 -318251 -219311 -263649 -144725 -1377 128908 150461 165342 43729
22924D3729k16103k66570O226J12758K04352n7149Q220J77147r0038r4896M0784
$$ 43729 -172374 -438944 -432718 -319960 -115608 -172757 -164537 12610 -77428 -172324 -131540
22913a31540n3197R0287L0174l9605l1884K18560Q115j52284M5871j5300j05180
$$ -131540 -184737 -94450 -64276 -103881 -135765 82795 90910 -61374 -15503 -30803 -135983
22902a35983l5956J6390J67949j80162n0097Q4923j22043r1895m0523J80223J32612
$$ -135983 -171939 -155549 12400 -167762 -217859 -132936 -254979 -346874 -387397 -207174 -74562
22891g4562k0841L6432q1583r6436P2999L5473J19928O1749O6116l5377P3627
$$ -74562 -95403 -58971 -140554 -236990 -163991 -128518 -8590 53159 119275 83898 157525
22880A57525J99140L8324K5359j25067m02390l68679J72506J94697R7572M6877
$$ 157525 356665 394989 420348 295281 -107109 -475788 -303282 -108585 -11013 35864
22870C5864R5179l2652j24823j32849J06900o9730j37990J12590j68317n3388
$$ 35864 131043 98391 -26432 -159281 -52381 -122111 -260101 -147511 -315828 -369216
22860c69216m8320M2810J14997N3687m4667P099R5002J09284Q2085j03699j66585
$$ -369216 -417536 -374726 -259729 -206042 -250709 -243610 -148608 -39324 42761 -60938 -227523
22849b27523J32978K34264J1267m2238j80106n5966J01424J02651o8657M8135
$$ -227523 -94545 139719 150986 108748 -71358 -127324 -25900 76751 8094 56229
22839E6229m2649q4788j06782n0519J65155p8121l3010J45221j29121j37225m7021
$$ 56229 13580 -71208 -177990 -228509 -63354 -141475 -174485 -29264 -158385 -295610 -342631
22828c42631q9761J23552M0946j13101m9285N8610K33483j578m1050J81005J18502
$$ -342631 -432392 -308840 -267894 -380995 -430280 -371670 -138187 -139765 -180815 190 118692
22817A18692N3829k86579j3363N0495R338j64308K5497P5245K42116O9949k87200
$$ 118692 172521 -114058 -127421 -76926 -67588 -231896 -206399 -131154 110962 180911 -106289
22806a06289j77483L7696r1820N8398J62109J77774j55419o6183L3179M2451K21794
$$ -106289 -283772 -246076 -337896 -279498 -117389 60385 -95034 -161217 -128038 -85587 136207
22795A36207k4178n7080N5043k674j97328j43142l5244K1678K57899O5837n3264
$$ 136207 112029 54949 109992 107318 -90010 -233152 -268396 -246718 11181 77018 23754
22784B3754m5946k5127J19794P888p4382j68989j47968k2943Q8690p8512K7437
$$ 23754 -22192 -47319 72475 80363 5981 -163008 -310976 -333919 -245229 -323741 -296304
22773b96304K5992M0323J18414K57699J76827k38336l06493r7296O0114Q7563
$$ -296304 -270312 -229989 -111575 146124 322951 84615 -221878 -319174 -259060 -171497
22763a71497p3223J18971J6553j7347k5099j9191P0889k2408m7262k0367j12329
$$ -171497 -244720 -125749 -109196 -126543 -151642 -170833 -99944 -122352 -169614 -189981 -302310
22752c02310L5879J75681K02053J13999Q2126k11761p1967n5209L6890J63001
$$ -302310 -266431 -90750 111303 225302 307428 95667 23700 -31509 5381 168382
22742A68382k8050n9730k3878M3975k2155k36436P1941J31095n4251j3457O9747
$$ 168382 140332 80602 56724 100699 78544 -157892 -85951 45144 -9107 -22564 47183
22731D7183J27159N1632N0818k2358M119p0056j57825l3075j5345L5731o8828
$$ 47183 174342 225974 276792 254434 258553 188497 30672 -2403 -17748 17983 -50845
22720e0845P5415J48765J6830r0092j03070M8367k18283K1044K19655J34521j03423
$$ -50845 24570 173335 190165 100073 -2997 45370 -172913 -151869 67786 202307 98884
22709I8884j38355m9467K6144J39250J36733j69061j48031K4178j06119Q5153
$$ 98884 -39471 -88938 -62794 76456 213189 44128 -103903 -79725 -185844 -100691
22699a00691o551L5414J6477k22751j5487q6500j17002K16565n0490j06410O2804
$$ -100691 -107242 -71828 -55351 -278102 -293589 -380089 -497091 -280526 -331016 -437426 -374622
22688c74622J75555K17349J59253k517l258j38919J3582j7634l6123J67428k5331
$$ -374622 -199067 18282 177535 175018 171760 32841 46423 28789 -7334 160094 134763
22677A34763j19722M3819o6216j44378l4223L7676J54495N447m356P190p9631
$$ 134763 15041 58860 -7356 -151734 -185957 -148281 6214 11661 7305 14495 -65136
22666f5136k6490m3723m2253Q646j6484j89356j18610J16044K16221J05923J7298
$$ -65136 -91626 -135349 -177602 -168956 -185440 -374796 -493406 -377362 -161141 -55218 -37920
22655c7920K44503J6032j10361l98366P4939J55633r2283j69717j12459p536K5694
$$ -37920 206583 222615 112254 -286112 -211173 -55540 -147823 -317540 -429999 -437535 -411841
22644d11841O3893R1415m5415n9841O0566K15002j32375p4413J87886J1318m566
$$ -411841 -347948 -256533 -301948 -361789 -301223 -86221 -218596 -293009 -105123 -93805 -98371
22633i8371l307J4281L1617o70m6722O3336n682J40192J01192j39317j07273K11314
$$ -98371 -101678 -87397 -55780 -56450 -103172 -39836 -45518 94674 195866 56549 -50724 160590
22621A60590L3202j30371j68741j94343j21607k4695R5879K51472N8399m183L2615
$$ 160590 193792 63421 -105320 -299663 -421270 -445965 -350086 -98614 -40215 -44398 -11783
22610a1783j87174o3578J35485J04816j38148K2409l3798j28735M0749L2572q5327
$$ -11783 -198957 -262535 -127050 -22234 -160382 -137973 -171771 -300506 -259757 -227185 -312512
22599c12512K27481J82339r5571J42274n784j52854J26p233K1920p7635r2667
$$ -312512 -85031 97308 1737 144011 138227 -14627 -14501 -21734 186 -77449 -170116
22588a70116n4936r5512j04847J94098O4901J54368O3008n4917m6564k32780m7558
$$ -170116 -225052 -320564 -425411 -231313 -166412 -12044 50964 -3953 -50517 -283297 -330855
22577c30855j10803L13379K44654k9013m1271l1466j32775M3111L0291K924J3525
$$ -330855 -441658 -128279 116375 87362 46091 14625 -118150 -75039 -44748 -41824 -28299
22566b8299k78871p9602j8520j8906J58006R6948r8389J47647M9570K5333N4227
$$ -28299 -307170 -386772 -405292 -424198 -266192 -169244 -267633 -119986 -70416 -45083 9144
22555I144m6577k28389r162J49970J41637P4450K5936r6095n9231j8000J67286
$$ 9144 -37433 -265822 -274984 -125014 16623 91073 117009 20914 -38317 -56317 110969
22544A10969m5821j35408K06936J942J7547J12517J4142j7505K2215k5574k91142
$$ 110969 65148 -70260 136676 138618 156165 268682 282824 265319 287534 261960 -29182
22533b9182j43495j10610K59593N1614l1885j04371j7540K5903k8544p5952J7098
$$ -29182 -172677 -283287 -23694 27920 -3965 -108336 -125876 -99973 -128517 -204469 -187371
22522a87371J3796K4480r0190q11J44388J71889K206m0207k19865k8454N4567
$$ -187371 -173575 -149095 -239285 -240096 -95708 76181 78387 38180 -181685 -210139 -155572
22511a55572J38542n0628J13436L2239J4606n0391J41930L8813r7005O6618j6043
$$ -155572 -17030 -67658 45778 78017 92623 42232 184162 222975 125970 192588 176545
22500A76545j51123n2147r170k05356o2880K11199N3422P4405j05593J50252r6921
$$ 176545 25422 -26725 -35895 -241251 -304131 -92932 -39510 34895 -70698 79554 -17367
22489a7367j40310J44862N0632l1724k45257k3847q2563P7106J02332P842J41365
$$ -17367 -157677 -12815 37817 6093 -239164 -263011 -345574 -268468 -166136 -158294 -16929
22478a6929K963J43946J9174R7767J92901n5872l3917m0870p1455o5297K5338
$$ -16929 -13966 129980 149154 246921 439822 383950 350033 309163 237708 172411 197749
22467A97749j48767N1776l088k84477J37034J45920Q122N8899k099k07448O7502
$$ 197749 48982 100758 97670 -186807 -49773 96147 104269 163168 161069 -46379 21123
22456B1123J24394K69892J79539Q2277p4785l8868R4137K72058J11331j24136
$$ 21123 145517 415409 594948 677225 602440 563572 657709 929767 1041098 916962
22446I16962j95290m6308M0855R090K23911o7801j32383j05947j03882j3651N4435
$$ 916962 721672 675364 716219 725309 949220 881419 749036 643089 539207 525556 579991
22435E79991j15960k1177j08430j29972k596J66965R4958j52426j31867n4895
$$ 579991 464031 442854 334424 204452 201856 368821 463779 311353 179486 124591
22425A24591j70961j9545K4770j02090N2056p9495R9657o1931j64320K4817R5151
$$ 124591 -46370 -65915 -41145 -143235 -91179 -170674 -71017 -132948 -297268 -272451 -177300
22414a77300J25810m4831j09924m9176n7631K04739Q1534n1924p2675M238K3107
$$ -177300 -51490 -96321 -206245 -255421 -313052 -108313 -26779 -78703 -151378 -147140 -124033
22403a24033n8605J44608J16150K52875r5820k03338J8176m9490j58434L8085
$$ -124033 -182638 -38030 78120 330995 235175 31837 50013 523 -157911 -119826
22393a19826l2616k7860k0900Q1059m509o6487o6824J0777k8180M1312J19840
$$ -119826 -152442 -180302 -201202 -120143 -124652 -191139 -257963 -247186 -275366 -234054 -114214
22382a14214O1895K0705r4363M7281K23290J59112k30312j74055j25521J6703
$$ -114214 -52319 -31614 -125977 -78696 144594 303706 73394 -100661 -226182 -209479
22372b09479q3943K7377k17147N125q452J29821K17863J36498j5313p512j60432
$$ -209479 -293422 -266045 -483192 -478067 -486519 -356698 -138835 -2337 -17650 -25162 -185594
22361a85594R6208K98359j15048k10601q8259q823J02415r7627O6317J41449R1809
$$ -185594 -89386 208973 93925 -116676 -204935 -213758 -111343 -208970 -142653 -1204 90605
22350I0605J22225j04008j92494q5068J2712m1846J1702l6138K4398q46K1256
$$ 90605 212830 108822 -83672 -168740 -156028 -197874 -186172 -222310 -197912 -198758 -177502
22339a77502N8585p423J8957r300j25540p0280J90098O151j04482q2491Q0664
$$ -177502 -118917 -126340 -107383 -116683 -242223 -312503 -122405 -116254 -220736 -303227 -222563
22328b22563Q7311J41761Q1471j67616M7018R2848r860J28088J32383L3823r7663
$$ -222563 -135252 6509 87980 -79636 -32618 60230 50370 178458 310841 344664 247001
22317B47001K9100J3691k37630j99004k2853J11041J41300q3394j67820r1120
$$ 247001 276101 289792 52162 -146842 -169695 -58654 82646 -748 -168568 -259688
22307b59688M4737J28295o2396j2862J17609J12564J07267q6045M3954l8318j61863
$$ -259688 -214951 -86656 -149052 -161914 -44305 68259 175526 89481 133435 95117 -66746
22296f6746j6508p4148J75030R0941M7522Q662j95895P2677O5270m0935K861l9266
$$ -66746 -83254 -157402 17628 108569 156091 164753 -31142 41535 106805 65870 68731 29465
22284B9465N3444J30627r2147l6895J8804j25172M0306l5779j69361o3040k0355
$$ 29465 82909 213536 121389 84494 103298 -21874 18432 -17347 -186708 -249748 -270103
22273b70103n3863k41573J95547L45336J48022j13184k1046L605K4767N5058j46497
$$ -270103 -323966 -565539 -369992 -24656 123366 10182 -10864 -7259 17508 72566 -73931
22262g3931l08022p8115J78322K33746R9342j05906O4806J51009j25559n9226
$$ -73931 -381953 -460068 -281746 -48000 51342 -54564 10242 161251 35692 -23534
22252b3534M8277P1558l3480o0826K02363J33270k26485N666j34468j04837J7114
$$ -23534 24743 96301 62821 1995 204358 337628 111143 116809 -17659 -122496 -105382
22241a05382Q3589j05915K2254K21072L1341o9502j99799j5667J53997n5707r2500
$$ -105382 -21793 -127708 -105454 115618 146959 77457 -122342 -138009 15988 -39719 -132219
22230a32219j25665o3042J99083J15381j15210j21722K08387K13840K4267j89991
$$ -132219 -257884 -320926 -121843 -6462 -121672 -243394 -35007 178833 203100 13109
22220A3109n28J55264k04687j88607p8474R1948J38124m9683Q8311Q9105R4546
$$ 13109 12581 167845 -36842 -225449 -303923 -211975 -73851 -123534 -35223 53882 148428
22209A48428o6095j29949O3668O1277k69554p4287j72996J18504J85337j35344
$$ 148428 82333 -47616 16052 77329 -192225 -266512 -439508 -321004 -135667 -271011
22199b71011k29590r1524K87118L50901J18036j67936R0437R6044N71j97991r4880
$$ -271011 -500601 -592125 -305007 45894 163930 -4006 86431 182475 183046 -14945 -109825
22188a09825N6963K04052J1502k6207k36136n6568q458P673K0963O1920l5151
$$ -109825 -52862 151190 162692 136485 -99651 -156219 -164677 -157004 -136041 -74121 -109272
22177a09272m0854O1743p876m0050j31450j4096K03543m4878j7204J38390O6484
$$ -109272 -150126 -88383 -96259 -136309 -267759 -281855 -78312 -123190 -140394 -2004 64480
22166F4480J23759j4868J59678j12253j64354j74631J04658j9531q7515m4480
$$ 64480 188239 173371 333049 220796 56442 -118189 -13531 -33062 -120577 -165057
22156a65057o4245J36292L1216l4336Q9592K06587O008o1109n342k3735L4361
$$ -165057 -229302 -93010 -61794 -96130 -6538 200049 206057 144948 139606 115871 150232
22145A50232N2468q0803j9574k1114j3529K11855J01969n9506j78499p04P2763
$$ 150232 202700 121897 102323 81209 67680 279535 381504 321998 143499 142795 215558
22134B15558j24598k85778J25416J98904n0617R526O6124k89084m8392J62221
$$ 215558 90960 -194818 -69402 129502 78885 88411 154535 -134549 -182941 -20720
22124b0720k51574j57744R3406N7261Q027R3458O191m7906o9252j92788p4649
$$ -20720 -272294 -430038 -336632 -279371 -271344 -177886 -171695 -219601 -288853 -481641 -556290
22113e56290J33306K48702R0772q9133l9992n5237j1948N4493j17144q1862K30714
$$ -556290 -422984 -174282 -83510 -172643 -212635 -267872 -279820 -225327 -342471 -424333 -193619
22102a93619J62176q5026j18780M2515J22551K21282R641r2542j83361L2148K18329
$$ -193619 -31443 -116469 -235249 -192734 -70183 151099 160740 68198 -115163 -83015 135314
22091A35314N2536p3434J38592J41653k93533j38388L7160J0169P4010J11110
$$ 135314 187850 114416 253008 394661 101128 -37260 -100 10069 84079 195189
22081A95189O399n1976l3521Q5042k0404M3752J6448N4440m6334j09159k03075
$$ 195189 201588 149612 116091 201133 180729 224481 240929 295369 249035 139876 -63199
22070f3199k42065K40120J44370l457j21485o374J28978J16693q9536n3656L1385
$$ -63199 -305264 -65144 79226 75769 -45716 -52090 76888 193581 104045 50389 81774
22059H1774r7723J7851J5196P6676J49577o00O4833k85767l2274M621j50874N1662
$$ 81774 -15949 1902 17098 93774 243351 242751 307584 21817 -10457 -5836 -156710 -105048
22047a05048J06675q735q1079M1432Q6547J1969p2051J44002K01118J55190j86251
$$ -105048 1627 -7108 -88187 -46755 39792 51761 -20290 123712 324830 480020 293769
22036B93769l35533J27618N9433o3277J55608O9511k37491j40236L0068R5494
$$ 293769 -41764 85854 145287 82010 237618 307129 69638 -70598 -40530 54964
22026E4964l2671R8621J21070m030l6837k99215j06830o113K87208K9102p6520
$$ 54964 22293 120914 241984 237954 201117 -98098 -204928 -211041 76167 105269 28749
22015B8749L8469O4404j71371j66041r4470J4758K26850r109o4589O3196j25J47961
$$ 28749 67218 131622 -39749 -205790 -300260 -285502 -58652 -67761 -132350 -69154 -69279 78682
22003G8682q9345j55541q1895m9309j6695l1670K26235R9952j09469J44439J89931
$$ 78682 -10663 -166204 -248099 -297408 -314103 -345773 -119538 -19586 -129055 15384 205315
21992B05315Q2714k3900N234L6286L5318o7097l7994j15988j14344L4575J86431
$$ 205315 288029 264129 269363 305649 340967 273870 235876 119888 5544 40119 226550
21981B26550Q5113N4048j91614j98939j45853m4843J18894J07964n2434r7602
$$ 226550 311663 365711 174097 -24842 -170695 -215538 -96644 11320 -41114 -138716
21971a38716n7059J00602Q3607j44069J12389L9386j8816K21207L09304p6021
$$ -138716 -195775 -95173 -11566 -155635 -43246 -3860 -22676 198531 507835 431814
21961D31814O966j90024R5321J90286j39007m232l17470j83960j1210R896L7983
$$ 431814 438780 248756 344077 534363 395356 391124 73654 -110306 -121516 -111620 -73637
21950g3637K7052j25433R7716J92978p8725j69187k7785O6670J14403j13945p3185
$$ -73637 -46585 -172018 -74302 118676 39951 -129236 -157021 -90351 24052 -89893 -163078
21939a63078K6708J9995M8005J72739J66024J36073L9571p2790k3350n896p7544
$$ -163078 -136370 -116375 -68370 104369 270393 406466 446037 373247 349897 344001 266457
21928B66457r5845k40044m1681l350J08082J13655n9787n5357M2243J36741J5835
$$ 266457 170612 -69432 -111113 -114463 -6381 107274 47487 -7870 34373 171114 186949
21917A86949j90156q3480N0753J02499J69088n5586n2628J22255k2914J74661
$$ 186949 -3207 -86687 -35934 66565 235653 180067 127439 249694 226780 401441
21907D01441j4021j75161j13089R6245P0116J00438J4861K7140N7733L5065Q0994
$$ 401441 387420 212259 99170 195415 265531 365969 380830 407970 465703 500768 581762
21896E81762j5871o4561p1706O0497R4782j7525o6907q9457k8859P4803J04804
$$ 581762 565891 501330 429624 490121 584903 567378 500471 411014 382155 456958 561762
21885E61762L0450J69896j08612p0702J87117K10691P2634m6269j7609J27144
$$ 561762 592212 762108 653496 582794 769911 980602 1053236 1006967 989358 1116502
21875A116502R0537j10060P6312J2079J25038L08335K89445J19928M983K16624
$$ 1116502 1207039 1096979 1173291 1185370 1310408 1618743 1908188 2028116 2033099 2249723
21865B249723L22645K70644K98050L78786M57164O53619P60771O55065M78903
$$ 2249723 2572368 2843012 3141062 3519848 3977012 4630631 5391402 6046467 6525370
21856F525370O14043P48735O65648J021383J236454J481447J689988K086618K570853
$$ 6525370 7139413 7888148 8553796 9575179 10811633 12293080 13983068 16069686 18640539
21847A8640539L101695M412572O208428R064220J3835569K1107324K9504372L3479919
$$ 18640539 21742234 26154806 32363234 41427454 55263023 76370347 105874719 139354638
21839A39354638K5359937J0908338J377710J689709J1209164K2573046K1962462
$$ 139354638 164714575 175622913 177000623 178690332 189899496 212472542 234435004
21832B34435004J1098266M678582M880942m53691j4122973k2799850k1449863
$$ 234435004 245533270 250211852 255092794 254639103 240516130 217716280 196266417
21825A96266417j0873607K275832M421466q248759k3205730l0838916l0495860
$$ 196266417 185392810 187668642 192090108 183841349 160635619 129796703 99300843
21818I9300843k5100140j8402456j2729677q743649o156837m650924l708130k962620
$$ 99300843 74200703 55798247 43068570 34324921 28168084 23517160 19809030 16846410
21810A6846410k379785j863915j611276j235098j006082r47741p85881p88067
$$ 16846410 14466625 12602710 10991434 9756336 8750254 7802513 7016632 6228565
21802F228565n61478m45182n59746l98635k29470m84196l01587j98762l93398
$$ 6228565 5667087 5221905 4662159 4263524 4034054 3549858 3248271 3049509 2656111
21793B656111p5012j52026j72457k29901k21020P497O3687j45112j49539j26811
$$ 2656111 2581099 2429073 2256616 2026715 1805695 1813192 1876879 1731767 1582228 1455417
21783A455417m9748r7769j96326k26317L8211L3403j4866q3769O9093O2557J6099
$$ 1455417 1405669 1307900 1111574 885257 923468 956871 942005 858236 927329 989886 1005985
21772A005985J11102j23839k00631J09471J00275n1749k03154p8625j8320K1882
$$ 1005985 1117087 993248 792617 902088 1002363 950614 747460 668835 650515 672397
21762F72397l3706j15997q4370q6291K19110O7151o474q3403p2488Q5355N8693
$$ 672397 638691 522694 438324 352033 571143 638294 631820 548417 475929 561284 619977
21751F19977J17640Q1787j67030k19736o4408J3110r5616k4439O2677J07936N4408
$$ 619977 737617 819404 652374 432638 368230 381340 285724 261285 323962 431898 486306
21740D86306p1473k0053N9878k1427L1270N9959n6945j01553O9404L6786R2494
$$ 486306 414833 394780 454658 433231 464501 524460 467515 365962 435366 472152 564646
21729E64646J6322k1949q5304l0729j35697m488J40357Q6198k96404k27615J926
$$ 564646 580968 559019 473715 442986 307289 302801 443158 529356 232952 5337 7263
21718G263M0432Q2271O6197K0003j01246L7442J23850J75288K4607J27777J55982
$$ 7263 47695 129966 196163 216166 114920 152362 276212 451500 476107 603884 759866
21707G59866R7984J0421n7997N067o1945j31011r6854p9728j403j06857j27518
$$ 759866 857850 868271 810274 815341 753396 622385 525531 445803 444400 337543 210025
21696B10025O8411j17273j28071J6767J41110o0655l2513n0391M7375p8679j139
$$ 210025 278436 161163 33092 49859 190969 130314 97801 47410 94785 16106 14967
21685A4967m2019j01052L1981O9639Q2111R902j73579j72307L3424R5515J42356
$$ 14967 -27052 -128104 -96123 -26484 55627 65529 -108050 -280357 -246933 -151418 -9062
21674i062L6160P3954k9012j27608l5714P18J82419P0086j43001M188J5283O991
$$ -9062 27098 101052 72040 -55568 -91282 -90564 91855 161941 18940 23128 38411 45402
21662D5402Q7599k8520P51q3540j25914M086J0598m0990p850J08738J11737M0149
$$ 45402 133001 104481 105232 21692 -104222 -100136 -89538 -130528 -138378 -29640 82097 122246
21650A22246r3740l9604J10380K02109P0403K3689l4622j33787J27728L3293j27368
$$ 122246 28506 -11098 99282 301391 371794 395483 360861 227074 354802 388095 260727
21639B60727k08457L6725J47410P107k03933Q855K1852p2738j45294k8888K5221
$$ 260727 52270 88995 236405 243512 39579 48434 70286 -2452 -147746 -176634 -151413
21628a51413O4920K9164J6245J27613j22838k24283j58305P5408K94605L2853
$$ -151413 -86493 -57329 -41084 86529 -36309 -260592 -418897 -343489 -48884 -16031
21618a6031r6458j78642J06142N5530j262p4288j73829j18829J68791J38316J0946
$$ -16031 -112489 -291131 -184989 -129459 -130721 -205009 -378838 -497667 -328876 -190560 -179614
21607a79614M6283K9035P7545K57534j22701n9951n6941q6037p0603P6637J74055
$$ -179614 -133331 -104296 -26751 230783 108082 48131 -8810 -94847 -165450 -88813 85242
21596H5242K35466L2115j07042j03062k7390K2836L1776R6237j2020l31575k39864
$$ 85242 320708 352823 245781 142719 115329 138165 169941 266178 254158 -77417 -317281
21585c17281J92813L12867k1956r4765j31246P7842K60310j32361j35993n363
$$ -317281 -124468 188399 166443 71678 -59568 18274 278584 146223 10230 4867
21575D867L5902j2154j3609J04553J11834O5746o9083j12677N7807K41100M2091
$$ 4867 40769 28615 15006 119559 231393 297139 228056 115379 173186 414286 456377
21564D56377m42m2539j26071N2357j28972j44791Q1911j2209J15137J40623l9574
$$ 456377 455935 413396 287325 339682 210710 65919 147830 135621 250758 391381 351807
21553C51807l48N0816O8137o8006l16626k33347q0278J75446K41316J97480O6189
$$ 351807 351459 402275 470412 402406 85780 -147567 -227845 -52399 188917 386397 452586
21542D52586k92399j04207p5712R1003J82564P0453p8286k26002k64902J33350
$$ 452586 160187 55980 -19732 71271 253835 324288 246002 20000 -244902 -111552
21532a11552N4412J40736O0890q9354J04873R7895j05783k02363K2464r7881q1016
$$ -111552 -57140 83596 144486 55132 160005 257900 152117 -50246 -27782 -125663 -206679
21521b06679K48218P1963l13661j58107O9317N0143j35550m3820J74560K9334
$$ -206679 41539 113502 -200159 -358266 -288949 -238806 -374356 -418176 -243616 -214282
21511b14282j09021J29955J40707J12131m8019j1911M7317o7048J52048L31j13227
$$ -214282 -323303 -193348 -52641 59490 11471 -440 46877 -20171 131877 132208 18981
21500A8981l9387m0714p8916n4610J11580j30795q5954k4310M8939l3828l4199
$$ 18981 -20406 -61120 -140036 -194646 -83066 -213861 -299815 -324125 -275186 -309014 -343213
21489c43213P1330J49310J23509k9254Q5239Q0307m2871j35655j3313r5009L010
$$ -343213 -271883 -122573 936 -28318 56921 137228 94357 -41298 -54611 -149620 -146610
21478a46610k0738Q2819J16127J44398r7139n0422M1605O3018j13774k8181r2001
$$ -146610 -167348 -84529 31598 175996 78857 28435 70040 133058 19284 -8897 -100898
21467a00898K2809J21765K6466k40677j2009L2208P0722N9279K7222j65355m15723
$$ -100898 -78089 43676 70142 -170535 -182544 -150336 -79614 -20335 6887 -158468 -574191
21456e74191o9816J90799J14307O0369R1109Q7834q4331q1282Q3603R9151J53553
$$ -574191 -644007 -453208 -338901 -278532 -187423 -99589 -183920 -265202 -181599 -82448 71105
21445G1105m2732r8669j8064J01587J03462O8312o3164J19736Q5569o0275l24379
$$ 71105 28373 -70296 -88360 13227 116689 185001 121837 241573 327142 266867 -57512
21434e7512m4924r5900L4223K53123L8941k52022N0870J88835K4194j79872p4709
$$ -57512 -102436 -198336 -164113 89010 127951 -124071 -73201 115634 139828 -40044 -114753
21423a14753L5269l8344J35146J29307j15402N4343j3870k3775j02059k03447
$$ -114753 -79484 -117828 17318 146625 31223 85566 71696 47921 -54138 -257585
21413b57585N8060q2474r9575K774L14831k4427k58522q3620R8479J9994K18624
$$ -257585 -199525 -281999 -381574 -378800 -63969 -88396 -346918 -430538 -332059 -312065 -93441
21402i3441K89891r6067j76796L9883r3759j30787n3924q4621l638K7191Q5316
$$ -93441 196450 100383 -76413 -36530 -130289 -261076 -315000 -399621 -403259 -376068 -290752
21391b90752R8361j04219k16025J29508J14233J18515J1158m8052K1123J07887
$$ -290752 -192391 -296610 -512635 -383127 -268894 -150379 -139221 -187273 -166150 -58263
21381e8263m7500p6701j66011L673L7811j38329J7053O3839M4179l3400R8315
$$ -58263 -105763 -182464 -348475 -344802 -306991 -445320 -428267 -364428 -320249 -353649 -255334
21370b55334J46850J18933K5269J9099J85743n444j25883o3046p3296k7105R6945
$$ -255334 -108484 10449 35718 54817 240560 235116 109233 46187 -27109 -54214 42731
21359D2731K1204O3326O037M2840n7834k16438J6976O8420J46854o8282j39637
$$ 42731 63935 127261 133298 176138 118304 -98134 -81158 -12738 134116 65834 -73803
21348g3803k52966j3485J73914K06873J7980M4270o9287n7447J05952p7274j37336
$$ -73803 -326769 -340254 -166340 40533 58513 102783 33496 -23951 82001 4727 -132609
21337a32609j17802J28206r5691j16489K8700j3212j51452N9332K22932P7873
$$ -132609 -250411 -122205 -217896 -334385 -305685 -318897 -470349 -411017 -188085 -110212
21327a10212o0741K1800J69798r8832j71601j60072j09349K02188J72947n0047
$$ -110212 -170953 -149153 20645 -78187 -249788 -409860 -519209 -317021 -144074 -194121
21317a94121j42094J1909J08350L0645p8220m5940K1852R433J05338N2923L7795
$$ -194121 -336215 -324306 -215956 -185311 -263531 -309471 -287619 -278186 -172848 -119925 -82130
21306h2130m7711o8669m0405P0067n0688L7644J33020M5815k21950k8089J90897
$$ -82130 -129841 -198510 -238915 -168848 -219536 -181892 -48872 -3057 -225007 -253096 -62199
21295f2199J63392j26565n8914J21365M6397j55248j33321q5270J19079J54860
$$ -62199 101193 -25372 -84286 37079 83476 -71772 -205093 -290363 -171284 -16424
21285a6424r7321J4986l9141J9689p5489q6465M840r6070J10425J26042J19157
$$ -16424 -113745 -98759 -137900 -118211 -193700 -280165 -275325 -371395 -260970 -134928 -15771
21274a5771J55976j25853k9167N7915P8752J9470j68420J27051r354p4087l9058
$$ -15771 140205 14352 -14815 43100 121852 141322 -27098 99953 90599 16512 -22546
21263b2546m0123K3750J7360q3277k7675o8810l8807l4432j7585o4099R3223K59837
$$ -22546 -62669 -38919 -21559 -104836 -132511 -201321 -240128 -274560 -292145 -356244 -263021 -3184
21251c184K8920n3236k16936n2348J74033R5272r3939j90404K01080K07334J47427
$$ -3184 25736 -27500 -244436 -296784 -122751 -27479 -121418 -311822 -110742 96592 244019
21240B44019J6516j7526J82494j26065r8371R2426j42009p3168j12526Q6450j95584
$$ 244019 260535 243009 425503 299438 201067 293493 151484 78316 -34210 52240 -143344
21229a43344n8408J13844j37547k06N3745j1217M8383J34503K06646O4021K56443
$$ -143344 -201752 -87908 -225455 -225661 -171916 -183133 -134750 -247 206399 270420 526863
21218E26863M08253J37458j73240n2648r1796q2869R5233J46512K3420N6122Q5857
$$ 526863 935116 1072574 899334 846686 754890 672021 767254 913766 937186 993308 1079165
21207A079165o8810j6934j07126q5270p9380j80042J31680J20828j23170j21794
$$ 1079165 1010355 993421 886295 801025 721645 541603 673283 794111 670941 549147
21197E49147p9249l22259k56544J4469O0051j06856j14455J09828J31815K3035
$$ 549147 469898 147639 -108905 -94436 -34385 -141241 -255696 -145868 -14053 8982
21187H982j58929k3441O885K70304L0961N3471j61185m7754k0284m8944l8704
$$ 8982 -149947 -173388 -166503 103801 134762 188233 27048 -20706 -40990 -89934 -128638
21176a28638R5952J73118R2064j5397k51896l9934k97K02851J04164j38256m3039
$$ -128638 -32686 140432 232496 217099 -34797 -74731 -75028 127823 231987 93731 50692
21165E0692J29587k26296l06527q9164J57254K22213K6608j62443L08648L506
$$ 50692 180279 -46017 -352544 -441708 -284454 -62241 -35633 -198076 110572 114078
21155A14078j00128N7765o1594m5051J30672O7346r1628J95289J91010p6146M4275
$$ 114078 13950 71715 10121 -34930 95742 163088 71460 266749 457759 381613 425888
21144D25888n6204j85762j92693N7630k9287L6341q9185o0000R7766J41819j27998
$$ 425888 369684 183922 -8771 48859 19572 55913 -33272 -93272 4494 146313 18315
21133A8315j90773P3286m6201l2727K05308P3232j82947l3355M9427J6755r9893
$$ 18315 -172458 -99172 -145373 -178100 27208 100440 -82507 -115862 -66435 -49680 -149573
21122a49573k24027l9729J76660K69590K00040o2120q9040j03371o8349J67723
$$ -149573 -373600 -413329 -236669 32921 232961 170841 81801 -21570 -89919 77804
21112G7804J03483o6157k8510n1840m1048N1329n0073j30180Q4140J83262p6651
$$ 77804 181287 115130 86620 34780 -6268 45061 -5012 -135192 -51052 132210 55559
21101E5559j57333q9780J4361J26777L329k8382J31808L99902L91391J17434L5176
$$ 55559 -101774 -191554 -177193 -50416 -47087 -75469 56339 456241 847632 965066 1000242
21090A000242j7234J07562R3868K65395k0864L214J98214J08653k06301k22613
$$ 1000242 983008 1090570 1184438 1449833 1428969 1432183 1630397 1739050 1532749 1310136
21080A310136N2506l4151O0868o2665l7539k7506k19060j62918k61365k83718
$$ 1310136 1362642 1328491 1389359 1326694 1289155 1261649 1042589 879671 618306 334588
21070C34588k45536k2028j7524r2106o4782R0635Q3654j8629l4181k7243n9750
$$ 334588 89052 67024 49500 -42606 -107388 -16753 66901 48272 14091 -13152 -72902
21059g2902R2811J98513k30233j10192Q2414k4723r2064j43967r8930J26126K53603
$$ -72902 19909 218422 -11811 -122003 -39589 -64312 -156376 -300343 -399273 -273147 -19544
21048a9544K09369P7769J38125K5075j66523j94920j46395J1944M7096m5958l7083
$$ -19544 189825 267594 405719 430794 264271 69351 -77044 -65100 -18004 -63962 -101045
21037a01045k4854r3502L1745q51Q5793O5925k33872q2840P5941R6045M7759K74825
$$ -101045 -125899 -219401 -187656 -188507 -102714 -36789 -270661 -353501 -277560 -181515 -133756 141069
21025A41069J18544p8334P786j38065j3539Q9914k61618m0917j2989k4991J11410
$$ 141069 259613 181279 189065 51000 37461 127375 -134243 -175160 -188149 -213140 -101730
21014a01730K72188r6879k38897p8561J17069n2646J15989J48426k0135m9286
$$ -101730 170458 73579 -165318 -243879 -126810 -179456 -63467 84959 64824 15538
21004A5538j98297o3970o7131j4721K28380p819O6452J46136q5087O541J59913
$$ 15538 -182759 -246729 -313860 -328581 -100201 -108020 -41568 104568 19481 26022 185935
20993A85935j16064j80458j56507j93365K8337J06698j3228K22147n7773m2356
$$ 185935 69871 -110587 -267094 -460459 -432122 -325424 -338652 -116505 -174278 -216634
20983b16634J58845j81217j89397J82336J84737N9079O2419j19527m095r623R0312
$$ -216634 -57789 -239006 -428403 -246067 -61330 -2251 60168 -59359 -63454 -73077 17235
20972A7235j29109j82354m3567N385l5882J7343J10580N5537l5862J52924Q5680
$$ 17235 -111874 -294228 -337795 -332410 -368292 -350949 -240369 -184832 -220694 -67770 17910
20961A7910k070J14818R1172j58257j7311q8000j28474N8804l6339k7271Q9636
$$ 17910 15840 130658 221830 63573 46262 -41738 -170212 -111408 -147747 -175018 -85382
20950h5382R6932O2626M0044l516K9640p0149P3939k5077j50341p7754O5657K37047
$$ -85382 11550 74176 114220 110704 140344 70195 144134 119057 -31284 -109038 -43381 193666
20938A93666P908j01346l0935J52002K6649k00052k32020J17939P8728j18845
$$ 193666 201574 100228 69293 221295 247944 47892 -184128 -66189 12539 -106306
20928a06306M568P3032M2623j2984j59457m1988P5794N0497L7257j22194j73049
$$ -106306 -101738 -28706 13917 933 -158524 -200512 -124718 -74221 -36964 -159158 -332207
20917c32207O5562L12534J10274J07172L3829j58846L5182p0640j50649N3879
$$ -332207 -266645 45889 156163 263335 297164 138318 173500 102860 -47789 6090
20907F090L0558m4987K4540p748o7969O6875R335N3713o9427j68619j77444J27499
$$ 6090 36648 -8339 16201 8453 -59516 7359 16694 70407 980 -167639 -345083 -217584
20895b17584M5942R84j44980n524Q2797J78969j7537q8035k1602r1168q0405M5684
$$ -217584 -171642 -170658 -315638 -321162 -238365 -59396 -76933 -164968 -186570 -277738 -358143 -312459
20883c12459J81608Q4716r9272R7935J6916j61913k9786L7350N3047k9012n6669
$$ -312459 -130851 -46135 -145407 -47472 -30556 -192469 -222255 -184905 -131858 -160870 -217539
20872b17539j15992n3814J32312J39287K47972j36602l4952J6038M5659j04045
$$ -217539 -333531 -387345 -255033 -115746 132226 -4376 -39328 -23290 22369 -81676
20862h1676j04795j9329M1786J27892K08684j35320j41355P0912J70570j59963
$$ -81676 -186471 -205800 -164014 -36122 172562 37242 -104113 -33201 137369 -22594
20852b2594j55152j15220N1558J4000q7964N2707m3424J80661p8461J40687J95474
$$ -22594 -177746 -292966 -241408 -227408 -315372 -262665 -306089 -125428 -203889 -63202 132272
20841A32272k8048j7994l8070j12815J9488R0325j03214j563p8133j81858j81575
$$ 132272 104224 86230 48160 -64655 -45167 45158 -58056 -59619 -137752 -319610 -501185
20830e01185K01637J40082J94162J90914k4022r2391l07635j10027j2775J25676
$$ -501185 -299548 -159466 34696 225610 201588 109197 -198438 -308465 -321240 -195564
20820a95564J9155Q5363j03853p2493R5545J29031J62562j4561J3337R5730r9805
$$ -195564 -176409 -91046 -194899 -267392 -171847 -42816 119746 105185 118522 214252 114447
20809A14447j55139N6702L0090j04941j18187l00917k31841K37857L11505Q2769
$$ 114447 -40692 16010 46100 -58841 -177028 -477945 -709786 -471929 -160424 -77655
20799g7655O7451K07765L5203j69446k9180j8491j18571j04131j33932j74976
$$ -77655 -10204 197561 232764 63318 34138 15647 -102924 -207055 -340987 -515963
20789e15963l1396J62836K17004J44619n9155q3311O0228m2789J2184N8407L1804
$$ -515963 -547359 -384523 -167519 -22900 -82055 -165366 -105138 -147927 -135743 -77336 -45532
20778d5532N5370q1977p0290m9823J59770J36910j05238k0630j95781J7691o450
$$ -45532 9838 -72139 -142429 -192252 -32482 104428 -810 -21440 -217221 -199530 -205980
20767b05980K38725O1782K4443q7142q255j0715l3579j09580J9780J26311O6492
$$ -205980 32745 94527 118970 31828 23573 12858 -20721 -130301 -110521 15790 82282
20756H2282j23537k74322R7515P5002O9009j54405J15691J08710j74638k68950
$$ 82282 -41255 -315577 -218062 -143060 -74051 -228456 -112765 -4055 -178693 -447643
20746d47643q1836O3924J9504J07146K15954J41990J64661K04273L2179k15217
$$ -447643 -529479 -465555 -446051 -338905 -122951 19039 183700 387973 420152 204935
20736B04935o8484L1026J02673l0665q2809m2925J18195J35576k2479O8185p2799
$$ 204935 136451 167477 270150 239485 156676 113751 231946 367522 345043 413228 340429
20725C40429j3165P2180J30462j56300J61566J54386o3976l5987K18295J54455
$$ 340429 327264 399444 529906 373606 535172 689558 625582 589595 807890 962345
20715I62345J36486Q0615m8074j28883J8545o5772q5518J9973p2703k1598m8413
$$ 962345 1098831 1179446 1131372 1002489 1021034 955262 869744 889717 817014 795416 747003
20704G47003q6375K7971O7915P4556J08848k0536J15228j6571l33735k44151j83135
$$ 747003 660628 688599 756514 831070 939918 919382 1034610 1018039 684304 440153 257018
20693B57018n6817P8736J7967j08991M6829j73426M3210K40900p4674O5457M4404
$$ 257018 200201 278937 296904 187913 234742 61316 104526 345426 270752 336209 380613
20682C80613r6561J3903j29028j04202K7081m1963r2461m3362r6397J07016J65117
$$ 380613 284052 297955 168927 64725 91806 49843 -42618 -85980 -182377 -75361 89756
20671H9756k53424k39146J0865J91870K13526J80129K34360q1843k00381k67707
$$ 89756 -163668 -402814 -391949 -200079 13447 193576 427936 346093 145712 -121995
20661a21995l52020N0136J54953J6600J37798J01339j24855N2203K03456J63602
$$ -121995 -474015 -423879 -268926 -252326 -114528 -13189 -138044 -85841 117615 281217
20651B81217p028R5122J03605j17505j90008j57444J05956R3952O5639n3827k3464
$$ 281217 274189 369311 472916 355411 165403 7959 113915 207867 273506 219679 196215
20640A96215N4535j7000m4529k60281l06055O3728J96498J62534J31384N9672
$$ 196215 250750 233750 189221 -71060 -377115 -313387 -116889 45645 177029 236701
20630B36701N2108m2275p7298l0208q5955q3214m4383n8909O5377J40660J97857
$$ 236701 288809 246534 169236 139028 53073 -30141 -74524 -133433 -68056 72604 270461
20619B70461K5242l20r3120j03562K2510J20287q01k33345j06719P5683J58017
$$ 270461 295703 295383 202263 98701 121211 241498 240697 7352 -99367 -23684 134333
20608A34333k4078K3908j71980j7958n0432J71458J04069j64125n9349j4612m5315
$$ 134333 110255 134163 -37817 -55775 -106207 65251 169320 5195 -54154 -68766 -114081
20597a14081k016J09261j1400O2357j42902M9388J46991J60814p1775j58769p7711
$$ -114081 -116097 -6836 -18236 44121 -98781 -49393 97598 258412 186637 27868 -49843
20586d9843N3179m9272j30299J40088K64691N6973o2442l1754J4082J92639K151
$$ -49843 3336 -45936 -176235 -36147 228544 285517 223075 191321 205403 398042 400193
20575D00193j96755j63748L5067J0501j67960j08017J10321J27283k6115j90089
$$ 400193 203438 39690 74757 85258 -82702 -190719 -80398 46885 20770 -169319
20565a69319J3942J80502j0560k3417K41556j8057k7446r8206q5039K0729j2605
$$ -169319 -155377 25125 14565 -8852 232704 214647 187201 88995 3956 24685 12080
20554A2080K8146q1478L2724P1160m5870N5875p2699M1748q1535k3831n6323l4022
$$ 12080 40226 -41252 -8528 62632 16762 72637 -62 41686 -39849 -63680 -120003 -154025
20542a54025J13485R8147P570m7837J4096J89310m4547m2105J42418j32430j6258
$$ -154025 -40540 57607 65177 17340 31436 220746 176199 134094 276512 144082 127824
20531A27824N0481P0792r6360R924k26866l48912J60423K36804N681q2158j4979
$$ 127824 178305 249097 152737 162661 -64205 -413117 -252694 -15890 -10209 -92367 -107346
20520a07346J38803J17374L3840J8116j14666q9475m9551P0753J43629j33870
$$ -107346 31457 148831 182671 200787 86121 -3354 -52905 17848 161477 27607
20510B7607n2589k79628K0948J59812N8572m2390j16321m9312J92935J23348k4636
$$ 27607 -24982 -304610 -283662 -123850 -65278 -107668 -223989 -273301 -80366 42982 18346
20499A8346n5676j50290N7300r2603O0976N8321n3113R2439J7649J52536J09440
$$ 18346 -37330 -187620 -130320 -222923 -161947 -103626 -156739 -64300 -46651 105885 215325
20488B15325m0253j12003m6629M1892j08355J01189q0463j34446k5625k5125O4847
$$ 215325 175072 63069 16440 58332 -50023 51166 -29297 -163743 -189368 -214493 -149646
20477a49646K42708K15900O8501k276r2810r184P1986q1239k11016k12541p347
$$ -149646 93062 308962 377463 375187 282377 273193 345179 263940 52924 -159617 -166964
20466a66964J44855j08891n7722Q4367O4251K67289K54467j31797j40754r4659
$$ -166964 -22109 -131000 -188722 -104355 -40104 227185 481652 349855 209101 114442
20456A14442j03152N2073J1799n9750q0958p5950K62193Q1093m6194n5293k08847
$$ 114442 11290 63363 75162 15412 -65546 -141496 120697 201790 155596 100303 -108544
20445a08544N0645J01561r4226K857j6820j54033Q9240R6156N0916O4032J9861
$$ -108544 -57899 43662 -50564 -47707 -64527 -218560 -129320 -33164 17752 81784 101645
20434A01645L3761o6033J37108k7963P270J06482L9818p2776j10758M1784N5222
$$ 101645 135406 69373 206481 178518 185788 292270 332088 259312 148554 190338 245560
20423B45560j36574p8539p2752K26139N1428j15755l0963O3277J43306L2949r9813
$$ 245560 108986 30447 -42305 183834 235262 119507 88544 151821 295127 328076 228263
20412B28263J7540Q9481J77487K0120m3961j62495J07257K45729J44943J0885
$$ 228263 245803 335284 512771 532891 488930 326435 433692 679421 824364 835249
20402H35249j6239J01865J97931k3210o598O3763j04949j91764k55711M5644M4270
$$ 835249 819010 920875 1118806 1095596 1088998 1152761 1047812 856048 600337 645981 690251
20391F90251M7534J48146L09136J28358k00973p61j07956l74684q4589j89174
$$ 690251 737785 885931 1195067 1323425 1122452 1121691 1013735 639051 554462 365288
20381C65288j25298k199j04281Q2495L3417o9885Q061n3623j9274R6129j0034
$$ 365288 239990 237791 133510 216005 249422 179537 187598 133975 114701 210830 200796
20370B00796k9427r499k0756k73079J8020R6171J06843P2503J27849P1314r6648
$$ 200796 171369 161870 141114 -131965 -113945 -17774 89069 161572 289421 360735 264087
20359B64087j55446M1044K61874j00989l08579m1229J25843N8061L7411l5901
$$ 264087 108641 149685 411559 310570 1991 -39238 86605 144666 182077 146176
20349A46176J45225L5941j15634m8974l4738j70039P8762J62614j9766j02013
$$ 146176 291401 327342 211708 162734 127996 -42043 36719 199333 179567 77554
20339G7554K713J09656K3138O685N817j66248k52759P9529K26081K8383j34094
$$ 77554 80267 189923 213061 219746 225563 59315 -193444 -113915 112166 140549 6455
20328F455J12733K3943j10231j16104J29035m5974r5219M8845K07293J51121J32263
$$ 6455 119188 143131 32900 -83204 45831 -143 -95362 -46517 160776 311897 444160
20317D44160P0596j25411m3126q4488k454J05340J25917p3444j02846k1717p2554
$$ 444160 514756 389345 346219 261731 259277 364617 490534 417090 314244 292527 219973
20306B19973j06680r7147J23294P2602J2656J70028j03670J11874J90237Q5128
$$ 219973 113293 16146 139440 212042 224698 394726 291056 402930 593167 678295
20296F78295l8562j55546j04164N6727j11555o9393j0937N0494J21943q2098M1721
$$ 678295 639733 484187 380023 436750 325195 255802 244865 295359 417302 335204 376925
20285C76925J1599P1869N3081O6596j31676j15472J89833l1155p4177J1793n4490
$$ 376925 388524 460393 513474 580070 448394 332922 522755 491600 417423 429216 374726
20274C74726j76217l1868j02097L1704K49006J66062j12016j62610j57287J77802
$$ 374726 198509 166641 64544 96248 345254 511316 399300 236690 79403 257205
20264B57205K38708K6228K81768J95071K87511M27861M03518R67835Q69716K02779
$$ 257205 495913 522141 803909 998980 1286491 1714352 2117870 3085705 3955421 4158200
20254D158200l08736n67345o41003p07833p06120l62422j43340n1325j44542j52421
$$ 4158200 3849464 3282119 2641116 1933283 1227163 864741 721401 670076 525534 373113
20244C73113j0448K946o749J49498J59800j02106j18714m1774K00436P4983O310
$$ 373113 362665 365611 358862 508360 668160 566054 447340 405566 606002 680985 687295
20233F87295m801j56105j23379J00457J28846n9412o2081J09835J96313J36768
$$ 687295 682494 526389 403010 503467 632313 572901 510820 620655 816968 953736
20223I53736j81404j10072j44781j81397J00851j02982o6216o4824j95945J69743
$$ 953736 772332 662260 517479 336082 436933 333951 267735 202911 6966 176709
20213A76709J12976k81326L7274k6180L8671J01592J58833K60779L4612k06496
$$ 176709 289685 8359 45633 19453 58124 159716 318549 579328 613940 407444
20203D07444o9862o140j66734j15587j48476M4540J97813k7855n5737O4976K72476
$$ 407444 337582 331442 164708 49121 -99355 -54815 142998 115143 59406 124382 396858
20192C96858Q6210j4195j09095j25614j02490R3812R5778K5562M3626j4597J26867
$$ 396858 483068 468873 359778 234164 131674 225486 321264 346826 390452 375855 502722
20181E02722j96141k8805K8789j29151J58594n0716J38668L2729L749j2292j88257
$$ 502722 306581 277776 306565 177414 336008 285292 423960 456689 460438 448146 259889
20170B59889K3836k54309M2687J88238K21027k1014J06010K02582j22753k79642
$$ 259889 283725 29416 72103 260341 481368 460354 566364 768946 646193 366551
20160C66551l92091k32310J99046J35696J2784R5262M9976Q688l4224N8602P5485
$$ 366551 -25540 -257850 -58804 76892 89676 184938 234914 243602 209378 267980 343465
20149C43465j3701O6542R3575k3907l2671n8585Q6152R0248R731l10827J0199
$$ 343465 329764 396306 489881 465974 433303 374718 460870 551118 560849 250022 260221
20138B60221L5377L1438J04146j45695k8439J18329J28238M5517n292K0347J0157
$$ 260221 295598 327036 431182 285487 257048 375377 503615 549132 543840 564187 574344
20127E74344r7856L8916J27549n9257P3743J72631L3598n830j23214m7980O5812
$$ 574344 476488 515404 642953 583696 657439 830070 863668 857838 734624 686644 752456
20116G52456N6285R2279J31123N5478R2670L7494J21784p4007j39704K50841N2781
$$ 752456 808741 901020 1032143 1087621 1180291 1217785 1339569 1265562 1125858 1376699 1429480
20105A429480j6405P9827J48712K24780J20735K13264J04876J23564J29691J66457
$$ 1429480 1413075 1492902 1641614 1866394 1987129 2200393 2305269 2428833 2558524 2724981
20095B724981O7890K71657m87O5274l5947J02258J94683M04391K53074K76766
$$ 2724981 2792871 3064528 3064041 3129315 3093368 3195626 3390309 3794700 4047774 4324540
20085D324540M81468M19977L46890K09481M57077Q04458R53544P88921P03015
$$ 4324540 4806008 5225985 5572875 5782356 6239433 7043891 7997435 8786356 9489371
20076I489371Q09447J152790J158011J456924K227999K783072L691897N309095
$$ 9489371 10298818 11451608 12609619 14066543 16294542 19077614 22769511 28078606
20068B8078606P695317J1300102J6549156K4343883L3050696L4871670K5020090
$$ 28078606 35773923 47074025 63623181 87967064 121017760 155889430 180909520
20061A80909520J2885288Q266038P537284R15487j2830474k2938013k4624836
$$ 180909520 193794808 202060846 209598130 210513617 197683143 174745130 150120294
20054A50120294j8874395q450830M127944J7290022K7848528K7469298J6264423
$$ 150120294 131245899 122795069 126923013 144213035 172061563 199530861 215795284
20047B15795284O078574L278083R17411j0498032k6040891l5261197l5568228
$$ 215795284 221873858 225151941 226069352 215571320 189530429 154269232 118701004
20040A18701004l0141538k2841830j6045298j1121001p803381n835631m150164
$$ 118701004 88559466 65717636 49672338 38551337 30747956 24912325 20762161
20033B0762161k808760k430839k025267j592304j084166j009679r72047q07627
$$ 20762161 17953401 15522562 13497295 11904991 10820825 9811146 8839099 8031472
20025H031472q84579l98148k72153l92277k79685m36886l65829j02856l76875
$$ 8031472 7146893 6748745 6476592 6084315 5804630 5367744 5001915 4899059 4522184
20016D522184k19090k39541j87088k46936q3813j04041j31335J89327R5531o7952
$$ 4522184 4303094 4063553 3876465 3629529 3545716 3441675 3310340 3499667 3595198 3527246
20006C527246j106k12569k32113l27161l38941j84685k012O1624j12946k01348
$$ 3527246 3526140 3313571 3081458 2754297 2415356 2230671 2228659 2290283 2177337 1975989
19996A975989j91565j78144J31989K55877J91403n0601j77048l1969r8102j67679
$$ 1975989 1784424 1606280 1738269 1994146 2185549 2134948 1957900 1925931 1827829 1660150
19986A660150j41075l6663j00446J01590q0493J68613J69982j6095l07997l08923
$$ 1660150 1519075 1482412 1381966 1483556 1403063 1571676 1741658 1725563 1417566 1108643
19976A108643k51376k65527j51341Q7590O2159J07643O9391Q7161p813M7931j07281
$$ 1108643 857267 591740 440399 527989 590148 697791 767182 854343 846530 894461 787180
19965G87180J32644K28579L6191j9197k06696r7870n9271M0010j09055o204P8391
$$ 787180 919824 1148403 1184594 1165397 958701 860831 801560 841570 732515 726311 804702
19954H04702L5878J81225J49466J34816j59028k58526k15552j16990N0425J15129
$$ 804702 840580 1021805 1171271 1306087 1147059 888533 672981 555991 606416 721545
19944G21545J51460L31478J90246o7414k06485p4270J70603L41843m4350k55378
$$ 721545 873005 1204483 1394729 1327315 1120830 1046560 1217163 1559006 1514656 1259278
19934A259278j31084J14911L3922j3267Q6372k3556j14198K32118L20982J23795
$$ 1259278 1128194 1243105 1277027 1263760 1350132 1326576 1212378 1444496 1765478 1889273
19924A889273p0589O3614P7297j91551k13549J90543K17204k00789k90599j54602
$$ 1889273 1818684 1882298 1959595 1768044 1554495 1745038 1962242 1761453 1470854 1316252
19914A316252j22090k87897r6486n8787j43058l3801R9632J48599J8242j01810
$$ 1316252 1194162 906265 809779 750992 607934 574133 673765 822364 840606 738796
19904G38796o1014M3916m032o0043q9837o6334K26299J8617K8141L5842J75547
$$ 738796 677782 721698 717666 657623 567786 501452 727751 746368 774509 810351 985898
19893I85898O2115J2425o1288j58206k02910l23344o3518N8064l6404O216L17257
$$ 985898 1048013 1060438 999150 840944 638034 314690 251172 309236 272832 279048 596305
19882E96305J75748J24520n9108J9207j35016j16880l64477j11630K87324J92517
$$ 596305 772053 896573 837465 856672 721656 604776 240299 128669 415993 608510
19872F08510l1913P4957J19539R4879J51616J91996K0024o3666P1040q6674j45961
$$ 608510 576597 651554 771093 865972 1017588 1209584 1229608 1165942 1236982 1150308 1004347
19861A004347L0707O3526O3652K59272J44749K00911M0831m50021l31721r1706
$$ 1004347 1035054 1098580 1162232 1421504 1566253 1767164 1807995 1357974 1026253 934547
19851I34547N426j05709j80768L3291j1345j83314R836J21534J88701K20191o4129
$$ 934547 939973 834264 653496 686787 675442 492128 501964 623498 812199 1032390 968261
19840I68261k5852q2590r8554R8931O7466M5131M8927j40627J37970K09150N3384
$$ 968261 942409 859819 761265 860196 927662 972793 1021720 881093 1019063 1228213 1281597
19829A281597R566l3791J64724R6622J60079K50638j07702q2529j53662j19413
$$ 1281597 1291163 1257372 1422096 1518718 1678797 1929435 1821733 1739204 1585542 1466129
19819A466129m956J2404J14675J03867P3392j0045n7588J12956K45980M46251
$$ 1466129 1461173 1473577 1588252 1692119 1765511 1755466 1697878 1810834 2056814 2503065
19809B503065M49097K48523M15686J60375k6201J68111J18960j89878j26065K86313
$$ 2503065 2952162 3200685 3616371 3776746 3750545 3918656 4037616 3847738 3721673 4007986
19799D007986N29445L45510J14459J31209L04647L07953M82394O43992N78412
$$ 4007986 4537431 4882941 4997400 5128609 5433256 5741209 6223603 6867595 7446007
19790G446007O46659N25830L98802K19401J93345J73295M26740Q47280J105580
$$ 7446007 8092666 8618496 9017298 9236699 9430044 9603339 10030079 10877359 11982939
19781A1982939J114110J318190J670652J980929K647745L197233M026891N601315
$$ 11982939 13097049 14415239 16085891 18066820 20714565 23911798 27938689 33540004
19773C3540004P868682J1698383J8198110K8412459M2899871N7975607O0532589
$$ 33540004 41408686 53107069 71305179 99717638 142617509 200593116 261125705
19766B61125705M0286965M321515k8277295m3865529m2649336l0520553j3435278
$$ 261125705 301412670 305734185 277456890 233591361 190942025 160421472 146986194
19759A46986194M491755K1400039L4794587M2095537M4728297M1917136K6527788
$$ 146986194 151477949 172877988 207672575 249768112 294496409 336413545 362941333
19752C62941333j703136l0011917m4729681m2257261k8892363j5699365j2301139
$$ 362941333 361238197 331226280 286496599 244239338 215346975 199647610 187346471
19745A87346471j7383970k4415778k8204053k6575236k1535399j6056896j1303360
$$ 187346471 169962501 145546723 117342670 90767434 69232035 53175139 41871779
19738D1871779p864384n401682l921811l108599k461774k025454j535214r47762
$$ 41871779 34007395 28605713 24683902 21575303 19113529 17088075 15552861 14605099
19730A4605099n85269o75131p76962p90840m06131k26684k90943l55559m12871
$$ 14605099 14019830 13344699 12567737 11776897 11370766 11144082 10853139 10497580 10084709
19721A0084709k45515j62580Q9O31r0984o9295J25486L79302M77503N50790N36328
$$ 10084709 9839194 9676614 9676703 9677334 9586350 9517055 9642541 10021843 10499346 11050136 11586464
19710A1586464N58542O69634Q53765J257156J725519K343068L057537M805556
$$ 11586464 12145006 12814640 13668405 14925561 16651080 18994148 22051685 26857241
19702B6857241Q000710J2649578J9973529K8991708L4593720K9448440J3225805
$$ 26857241 34857951 47507529 67481058 96472766 131066486 160514926 173740731
19695A73740731o034754j9524432k3551004j8952470q853958L662208J6491913
$$ 173740731 167705977 148181545 124630541 105678071 96824113 100486321 116978234
19688A16978234K5918452K5018988J0867414r338231k5235401l1598950k9474507
$$ 116978234 142896686 167915674 178783088 169444857 144209456 112610506 83135999
19681H3135999k2790694j5757532j0557403p269065n032742l916604k854402k068163
$$ 83135999 60345305 44587773 34030370 26761305 21728563 17811959 14957557 12889394
19673A2889394j755442j695794j281488q23060p49341m68060l24964m02685l40015
$$ 12889394 11133952 9438158 8156670 7333610 6584269 6116209 5791245 5388560 5048545
19664E048545r4408q4820k27438m29988m08113k38756j14201j78933l05927K11416
$$ 5048545 4954137 4869317 4641879 4211891 3803778 3565022 3450821 3271888 2965961 3177377
19654C177377m7309j9207k0515j18229k45612l78805l75647j95907k98537j70925
$$ 3177377 3130068 3110861 3090346 2972117 2726505 2347700 1972053 1776146 1477609 1306684
19644A306684j24761K54930J75212O2367o0287J29736J17130l26459j27185j99236
$$ 1306684 1181923 1436853 1612065 1674432 1614145 1743881 1861011 1534552 1407367 1208131
19634A208131M4931K25885L79378N7738k40732J50051P8600j6749o9550n0878
$$ 1208131 1253062 1478947 1858325 1916063 1675331 1825382 1903982 1887233 1817683 1766805
19624A766805j78246j12525j37744j57698N5098Q9010j36606l9490J01560j18150
$$ 1766805 1588559 1476034 1338290 1180592 1235690 1324700 1188094 1148604 1250164 1132014
19614A132014K1085o1787j79192j97820P6499j1255q4378J36380K01771j08106
$$ 1132014 1153099 1091312 912120 714300 790799 779544 695166 831546 1033317 925211
19604I25211j56967k6710j60182J00288n7199j8861p9752k2214k19672O5256J4631
$$ 925211 768244 741534 581352 681640 624441 605580 525828 503614 283942 349198 363829
19593C63829j2892j6483r3910p5665j40998n6911J63958J31662O0553j20189k6484
$$ 363829 350937 334454 240544 164879 23881 -33030 130928 262590 323143 202954 176470
19582A76470M5506J50971J5087j12840l3044J02881J81983J26406L9473J20642
$$ 176470 221976 372947 388034 275194 242150 345031 527014 653420 692893 813535
19572H13535R4134J20838J07158k96451j77341m0901J66688J22592j72917j91232
$$ 813535 907669 1028507 1135665 839214 661873 620972 787660 910252 737335 546103
19562E46103k43651O7387L55426K8226j30063J73177o3982k95647j12549m2738
$$ 546103 302452 369839 725265 753491 623428 796605 732623 436976 324427 281689
19552B81689K5535l7395J131O2861J52711l3858R4071j10320j87618m5892J96310
$$ 281689 307224 269829 270960 333821 486532 452674 546745 436425 248807 202915 399225
19541C99225R8775k0226k88211l67745m8731K19249J80115k3112k1227J40930
$$ 399225 498000 477774 189563 -178182 -226913 -7664 172451 149339 128112 269042
19531B69042J07600j3794O72J12004M9193O6185K469O0959J10592J5074J64591
$$ 269042 376642 362848 363520 475524 524717 590902 593371 654330 764922 779996 944587
19520I44587J43271M07212N1462J33754r784j28647O2425P1313K15822J27269
$$ 944587 1087858 1495070 1546532 1680286 1670502 1541855 1604280 1675593 1891415 2018684
19510B018684j15371j51209k10782m79265l92370k16981o85L26664j47265R856
$$ 2018684 1903313 1752104 1541322 1062057 669687 452706 452021 778685 631420 641276
19500F41276K33600O7647k61672j41324j62284L940j2756O8022Q4014N892J9885
$$ 641276 874876 942523 680851 539527 377243 381183 368427 436449 520463 526355 546240
19489E46240k6339N0797J25120o0138P993o5348j86862j90092K5507J58924J59758
$$ 546240 519901 570698 695818 635680 643673 578325 391463 201371 226878 385802 545560
19478E45560P7750N6627J04231J52788O7288L1839n1998j8826L4354j05354L1190
$$ 545560 623310 679937 784168 936956 1004244 1036083 984085 965259 999613 894259 925449
19467I25449j10274P3688o038K54372R9605M6785J93812K70584K04067Q2558k5214
$$ 925449 815175 888863 882825 1137197 1236802 1283587 1477399 1747983 1952050 2034608 2009394
19456B009394l7341j55898L00992L32995P9044J42882K77877L173n5145J44522
$$ 2009394 1972053 1816155 2117147 2450142 2529186 2672068 2949945 2953118 2897973 3042495
19446C042495K19365K37219L16691K29909K26225M76606N02753L29661M56617
$$ 3042495 3261860 3499079 3815770 4045679 4271904 4748510 5251263 5580924 6037541
19437F037541O64964M99271O25501J074034J540441J740192J960430K465379L395256
$$ 6037541 6702505 7201776 7827277 8901311 10441752 12181944 14142374 16607753 20003009
19428B0003009M649403O717452R846002J4198931K0046406K3198429K0385341
$$ 20003009 24652412 31369864 41215866 55414797 75461203 98659632 119044973
19421A19044973J5381086J3882173J6496624J7985985J3520690L046299q926714
$$ 119044973 134426059 148308232 164804856 182790841 196311531 199357830 190431116
19414A90431116j4937681j4372833j2150822j3950838j8491362k1189693k0440846
$$ 190431116 175493435 161120602 148969780 135018942 116527580 95337887 74897041
19407G4897041j7268344j3391437r797786p014180m953804l685365k535627k085400
$$ 74897041 57628697 44237260 34439474 27425294 22471490 18786125 16250498 14165098
19399A4165098j750205j271383q23708q80544q31760p34955o77750m51362k12459
$$ 14165098 12414893 11143510 10319802 9439258 8607498 7872543 7194793 6743431 6530972
19390F530972N4409R125j78990J8898j0268j2134k10444K5076l4356j14574j58953
$$ 6530972 6585381 6594506 6415516 6434414 6424146 6412012 6201568 6226644 6192288 6077714 5918761
19379E918761L4095O7279K24670M94359N44282M82193Q04422J155614J342428
$$ 5918761 5952856 6020135 6244805 6739164 7283446 7765639 8570061 9725675 11068103
19370A1068103J963100K638671L913916N884365Q506362J2275164J6003134J6137019
$$ 11068103 13031203 15669874 19583790 25468155 33974517 46249681 62252815 78389834
19362G8389834J2093981Q746697R784531J3257043J3945773Q062051j940911j0064379
$$ 78389834 90483815 99230512 109015043 122272086 136217859 144279910 142338999 132274620
19354A32274620j1724561r183149q451681j1675986j5148460j6052893j4363194
$$ 132274620 120550059 111366910 102915229 91239243 76090783 60037890 45674696
19347D5674696j1344886q112924n741601m105004l008556k236109j661953j393263
$$ 45674696 34329810 26216886 20475285 16370281 13361725 11125616 9463663 8070400
19339H070400j045306q65722n57338m65793n61073o10640k65679k3224l40476
$$ 8070400 7025094 6159372 5602034 5136241 4575168 3964528 3698849 3675625 3335149
19330C335149j31188j08158j46957j2961j92538m76870p2091j05359j82356j29581
$$ 3335149 3203961 3095803 2948846 2935885 2743347 2266477 2194386 2089027 1906671 1777090
19320A777090l44018q9378N0784j48314j35692k60368m1046j9361Q3302m4368
$$ 1777090 1433072 1343694 1394478 1246164 1110472 850104 809058 789697 872999 828631
19310H28631k8261N2387j07661J24804n5657j0237N78N6545q0400k41287O3188
$$ 828631 800370 852757 745096 869900 814243 804006 804584 861129 780729 539442 602630
19299F02630K73897K2733j0061K0365K60342m5990j67489r8314N2281Q4224l1814
$$ 602630 876527 899260 889199 909564 1169906 1123916 956427 858113 910394 994618 962804
19288I62804J9364l14918J4136J34733n8633L2720L8694Q0208j5183k58897j5816
$$ 962804 982168 667250 681386 816119 757486 790206 828900 909108 893925 635028 619212
19277F19212j06211k24048Q8808P9457j27213O3633J38154R3870k29718n2565
$$ 619212 513001 288953 377761 457218 330005 393638 531792 625662 395944 343379
19267C43379j82329R9904J47763m3862m5265o9205l7500J33305N1439q4486l19369
$$ 343379 161050 260954 408717 364855 319590 250385 212885 346190 397629 313143 -6226
19256f226k6931p5101N9902L0265l8772j6723J10876P5891Q9855Q2556K1058j58519
$$ -6226 -33157 -108258 -48356 -18091 -56863 -73586 37290 113181 203036 285592 306650 148131
19244A48131k32187O3848J51883k6433M6366J89511R7907J13604O2990Q386Q6707
$$ 148131 -84056 -20208 131675 105242 151608 341119 439026 552630 615620 624006 710713
19233G10713j54660r7456J51126M5589J19830l3549j47390j41416j3209J107R4737
$$ 710713 556053 458597 609723 655312 775142 741593 594203 452787 439578 440685 535422
19222E35422M0576k5109p2080l4396j96126l34474j02189o7954J25486J68998
$$ 535422 575998 550889 478809 444413 248287 -86187 -188376 -256330 -130844 38154
19212C8154J64408j21697r037J12092L0472P0116N3498O1125P3870P2613J39376
$$ 38154 202562 80865 71828 183920 214392 284508 338006 399131 473001 545614 684990
19201F84990k996m3652J04248n0675k39454m1428K4506K8184O810J71077J0299
$$ 684990 681994 638342 742590 691915 452461 411033 435539 463723 470533 641610 651909
19190F51909M6133M1357N1927n8794k65354P3351L9184j98273p1150K4236k02292
$$ 651909 698042 739399 791326 732532 467178 540529 579713 381440 310290 334526 132234
19179A32234r0509m7753N3929P3523M3098j11516M0621o8212q39J6532J17587
$$ 132234 41725 -6028 47901 121424 164522 53006 93627 25415 24576 41108 158695
19168A58695N5418M1785q0723M5654J7505j01256r7808j01670j12421j05598J48724
$$ 158695 214113 255898 175175 220829 238334 137078 39270 -62400 -174821 -280419 -131695
19157a31695K61238K00657K5277j62293j16600P5110J20067K9337j4309L613K1648
$$ -131695 129543 330200 355477 193184 76584 151694 271761 301098 286789 290402 312050
19146C12050j11797J60355J45464M4598N4543Q5754l9359M6427l6526k53768j22958
$$ 312050 200253 360608 506072 550670 605213 690967 651608 698035 661509 407741 284783
19135B84783L27452K53631P6192L0192k4904j70500l3128l849J45948R5671m5893
$$ 284783 612235 865866 942058 972250 947346 776846 743718 739869 885817 981488 935595
19124I35595J10991j0343K3069j51120o0729l8624k92534j733l0503J4194J69409
$$ 935595 1046586 1036243 1059312 908192 847463 808839 516305 514572 484069 498263 667672
19113F67672K8416M4903L4724j3448p558j15966j1043R5467k1282k03286k44382
$$ 667672 696088 740991 775715 762267 754709 638743 627700 723167 701885 498599 254217
19102B54217M7451O147n525m8054r7579m1868j20709n1894m000O7840K12097N9459
$$ 254217 301668 307815 302290 254236 156657 114789 -5920 -57814 -61814 6026 218123 277582
19090B77582j37390k40159P6007l8553j12524k16943j35658N0014J1246L421q8413
$$ 277582 140192 -99967 -23960 -62513 -175037 -391980 -527638 -477624 -466378 -462957 -551370
19079e51370Q4254L03791J23549Q6909j37263j33621K01445K07981N1646j43721
$$ -551370 -467116 -163325 -39776 47133 -90130 -223751 -22306 185675 237321 93600
19069I3600q2222m7657n0535j0417l330l29L5660K7661j9535k11213Q439K89120
$$ 93600 11378 -36279 -86814 -97231 -100561 -100890 -65230 -37569 -57104 -268317 -259878 29242
19057B9242p9495j66277J01826K2160n1079j8716j93439N3302L80969K8994J6089
$$ 29242 -50253 -216530 -114704 -92544 -143623 -162339 -355778 -302476 78493 107487 123576
19046A23576q7200r6744L3565j46080j71670J48130J12660p561n1866j36022k43923
$$ 123576 36376 -60368 -26803 -172883 -344553 -196423 -83763 -91324 -143190 -279212 -523135
19035e23135j5294K01675L00056K2134J1426j4735m6069J46502j789k00203p1375
$$ -523135 -538429 -336754 -36698 -14564 -3138 -17873 -63942 82560 80771 -119432 -190807
19024a90807K17667M0929q4067R4998J91090m4371j28017k36504k14921R0321
$$ -190807 26860 67789 -16278 78720 269810 225439 97422 -139082 -354003 -263682
19014b63682O6135m1484J643K7710J07451l2234o5689M6073M5338J326J19371
$$ -263682 -197547 -239031 -237388 -209678 -102227 -134461 -200150 -154077 -108739 -107413 11958
19003A1958Q1276n9827q6121J4917O8285l7299j88604k63881K862J88193K07672
$$ 11958 93234 33407 -52714 -37797 30488 -6811 -195415 -459296 -456434 -268241 -60569
18992f0569J92448k24206q9444k2533l9047p2282m4598P5775J22819K2986J26214
$$ -60569 131879 -92327 -181771 -204304 -243351 -315633 -360231 -284456 -161637 -138651 -12437
18981a2437J82051q7661j30106Q3938P4182l1641j29425K6320n1889K5358l6211
$$ -12437 169614 81953 -48153 35785 109967 78326 -51099 -24779 -76668 -51310 -87521
18970h7521n2565K766j59037Q6385O258j73965n0367M5828J01879j37627J33377
$$ -87521 -140086 -137320 -296357 -209972 -203714 -377679 -428046 -382218 -280339 -417966 -284589
18959b84589L3539J86106j8455m9156J76321N885p4715O782j9730j38016k49472
$$ -284589 -251050 -64944 -83399 -132555 43766 49651 -25064 -18282 -38012 -176028 -425500
18948d25500K17062R6736P7568O8697M1593j49804N6076j7393l943J64863M33
$$ -425500 -208438 -111702 -34134 34563 76156 -73648 -17572 -34965 -38908 125955 126388
18937A26388q3673j62363K6676p7844k651J4612o1071J31955R6858N8724K06100
$$ 126388 42715 -119648 -92972 -170816 -173467 -158855 -219926 -87971 8887 67611 273711
18926B73711P5665j94527j5001p7125k4056j14479k11571j8676J06651J50243
$$ 273711 349376 154849 139848 62723 38667 -75812 -287383 -306059 -199408 -49165
18916d9165J14121K19104J0774k09630j44181J29364R612p1041j02736J29828
$$ -49165 64956 284060 294834 85204 -58977 70387 79999 8958 -93778 36050
18906C6050o5116N5412l2371Q7142j9377n0363j79911l9755p9714J57949K11755
$$ 36050 -29066 26346 -6025 81117 61740 11377 -168534 -208289 -288003 -130054 81701
18895H1701j5274n5807O6450J6751j19025J476k3421J65426J90555J7664j67494
$$ 81701 66427 10620 77070 93821 -25204 -23728 -47149 118277 308832 326496 159002
18884A59002o1842o5276j61750r5554p4846J75039K28657j0381l4359K8292j13942
$$ 159002 97160 31884 -129866 -225420 -300266 -125227 103430 93049 58690 86982 -26960
18873b6960l7371J25410J53544j09761j03768p2273J4270j46222K35885J92265
$$ -26960 -64331 61079 214623 104862 1094 -71179 -56909 -203131 32754 225019
18863B25019M8576O4415L3190K0175K8072o2785N290P8090M5479M1737K3874J54991
$$ 225019 273595 338010 371200 391375 419447 356662 361952 440042 485521 527258 551132 706123
18851G06123J49619j49691p4979m0211L0273K1638k23695k84528j86063O0286
$$ 706123 855742 706051 631072 590861 621134 642772 419077 134549 -51514 8772
18841H772J95575K3361k67042J02563Q362K0279l7251K8678R0386j04709k22999
$$ 8772 204347 227708 -39334 63229 71591 91870 54619 83297 173683 68974 -154025
18830a54025m0612J8185J56961n1031l3552J77881J04440K8018m9041r03j49949
$$ -154025 -194637 -176452 -19491 -70522 -104074 73807 178247 206265 157224 156321 6372
18819F372j28901M285J6258J14689k89138J57098J63279q2845m4388j02777J09844
$$ 6372 -122529 -118244 -101986 12703 -276435 -119337 43942 -38903 -83291 -186068 -76224
18808g6224J74229N6632j03089k10357j3534p5207j7120J83268J99688K34191
$$ -76224 98005 154637 51548 -158809 -172343 -247550 -264670 -81402 118286 352477
18798C52477K31127l4264J97611P8216p7886j26697r3760m7659o7455j5949K693
$$ 352477 583604 549340 746951 825167 747281 620584 526824 479165 411710 395761 398454
18787C98454k65379j51183K16189O6376l7387L785r5850k84095p9760J44212N9928
$$ 398454 133075 -18108 198081 264457 227070 230855 135005 -149090 -228850 -84638 -24710
18776b4710J94821o137r7519j73688Q8553J5308J21747K50860J72162k20355n5795
$$ -24710 170111 163974 66455 -107233 -18680 -3372 118375 369235 541397 321042 265247
18765B65247p2075j76886k13871n1411Q602J40088M1277o5999q0385O8074m5703
$$ 265247 193172 16286 -197585 -248996 -240394 -100306 -59029 -125028 -205413 -137339 -183042
18754a83042r2321J10002J41175j37254j70943J36639J69446M9967M6923o2554
$$ -183042 -275363 -165361 -24186 -161440 -332383 -195744 -26298 23669 70592 8038
18744H038k30577k445j0706J00750j06967J24492J73746j20262n2032k189k03255
$$ 8038 -222539 -224984 -235690 -134940 -241907 -117415 56331 -63931 -115963 -118152 -321407
18733c21407O2569N2009q0450k9411k5755j5109N0690m5090l0844j48342K03687
$$ -321407 -258838 -206829 -287279 -316690 -342445 -357554 -306864 -351954 -382798 -531140 -327453
18722c27453Q8535J8408N5503P3937N6836j74776o6369r5835M378Q4190N2629
$$ -327453 -238918 -220510 -165007 -91070 -34234 -209010 -275379 -371214 -366836 -282646 -230017
18711b30017k4795J46261L5204K46014L5124M7260k01469j62032k9438J47971
$$ -230017 -254812 -108551 -73347 172667 207791 255051 53582 -108450 -137888 10083
18701A0083L52173o9173j06790j21808p0356J38471J78294K2345j87611k39831
$$ 10083 362256 293083 186293 64485 -5871 132600 310894 333239 145628 -94203
18691i4203N5970P0978n1963j49446q6050m3498n8902j69677Q2068K28122J92651
$$ -94203 -38233 32745 -19218 -168664 -254714 -298212 -357114 -526791 -444723 -216601 -23950
18680b3950j8329j85582o1441K270M5100K16257K63323J27276l9418j41302o8730
$$ -23950 -42279 -227861 -289302 -287032 -241932 -25675 237648 364924 325506 184204 115474
18669A15474n1044J11461n1768k27499J01436R4338q7858l6501J55791p2680p5104
$$ 115474 64430 175891 124123 -103376 -1940 92398 4540 -31961 123830 51150 -23954
18658b3954J602J14741r411r8469P2939j6198J482m2760O9863j29906k7597N7443
$$ -23954 -22352 92389 82978 -15491 57448 41250 42732 -28 69835 -60071 -87668 -30225
18646c0225k76436j89151J83779J44834J06998J5337j63897p1612J72028J16203
$$ -30225 -306661 -495812 -312033 -167199 -60201 -44864 -208761 -280373 -108345 7858
18636G858r7246J59590L4939j40296k2156L5812Q1452J7503n8607j22074L1734
$$ 7858 -89388 70202 105141 -35155 -57311 -21499 59953 77456 18849 -103225 -71491
18625g1491j62111k44976J90942J58378J83938R5204r1477k16922j13377R71J7661
$$ -71491 -233602 -478578 -287636 -129258 54680 149884 58407 -158515 -271892 -270921 -253260
18614b53260n0639n3382m4185R7391K12510r995q040k2067j11262k17607q1004
$$ -253260 -303899 -357281 -401466 -304075 -91565 -101560 -109600 -131667 -242929 -460536 -541540
18603e41540J53164K31381j05081k2755Q8224P2870j66086J72171N0622k05488
$$ -541540 -388376 -156995 -262076 -284831 -196607 -123737 -289823 -117652 -67030 -272518
18593b72518L9480J56933m5344r1414k2108J26709P9225m4217j66159j17223J15435
$$ -272518 -233038 -76105 -121449 -212863 -234971 -108262 -29037 -73254 -239413 -356636 -241201
18582b41201Q4147O8443J24086K552R8551r0280P7970P8287j23252l00789o4591
$$ -241201 -157054 -88611 35475 38027 136578 46298 124268 202555 79303 -221486 -286077
18571b86077J06919O0767m5479p1788J05704K02034m0411N2670Q5241M1239r1477
$$ -286077 -179158 -118391 -163870 -235658 -129954 72080 31669 84339 169580 210819 119342
18560A19342k85950K473n564m3045P4195j9236j08829M0352R508j19763O5182
$$ 119342 -166608 -164135 -169699 -212744 -138549 -157785 -266614 -226262 -216754 -336517 -271335
18549b71335J2581M1866m1826o2003J424J3446J39133K33531j9049j64520l5832
$$ -271335 -258754 -216888 -258714 -320717 -319293 -305847 -166714 66817 47768 -116752 -152584
18538a52584j48191j32841K38665O3612j57590j09852J17771M0048j13048j64926
$$ -152584 -300775 -433616 -194951 -131339 -288929 -398781 -281010 -240962 -354010 -518936
18528e18936K45905R6201j34011Q7010J77975j99709j07128P1879R4273j9057
$$ -518936 -273031 -176830 -310841 -223831 -45856 -245565 -352693 -280814 -186541 -205598
18518b05598j30464o1192m1542Q1224L02088J22050o2935N6998p2998j60075l8840
$$ -205598 -336062 -397254 -438796 -357572 -55484 66566 3631 60629 -12369 -172444 -211284
18507b11284m8413Q5887J05613j34272P041J25735O6512j50521J28934K27518
$$ -211284 -259697 -173810 -68197 -202469 -195428 -69693 -3181 -153702 -24768 202750
18497B02750J48j73301j49429q9940L32963K02276M6079l3685j15478n9905o4622
$$ 202750 202898 29597 -119832 -209772 123191 325467 371546 337861 222383 162478 97856
18486I7856m8720m1005j8367J6400O4295j43111J43347J73585r2550n923l5597
$$ 97856 49136 8131 -10236 6164 70459 -72652 70695 244280 151730 145807 110210
18475A10210p5060k13988j74348r979R6651R565k6362K17992k9746O7180K27140
$$ 110210 35150 -178838 -353186 -363165 -266514 -256949 -283311 -65319 -95065 -27885 199255
18464A99255M9371q2152j44658j06195j02092Q5003m7738J08309K31564k1112
$$ 199255 248626 166474 21816 -84379 -186471 -101468 -149206 -40897 190667 169555
18454A69555m0059r3289M931m4002J34853m5948j37548K4411K147k16564m2374
$$ 169555 129496 36207 41138 -2864 131989 86041 -51507 -27096 -24949 -241513 -283887
18443b83887j16072K0643K2093Q0492P3028j19428k4540R7314J30635j35015l1961
$$ -283887 -399959 -379316 -357223 -276731 -203703 -323131 -347671 -250357 -119722 -254737 -286698
18432b86698J25366N6436l1691n4538n8011J50182J30371m4459k3520o5425k45644
$$ -286698 -161332 -104896 -136587 -191125 -249136 -98954 31417 -13042 -36562 -101987 -347631
18421c47631k21627R4013N2519n1743J7137K49948J10658P7479K2156J7212o7592
$$ -347631 -569258 -475245 -422726 -474469 -457332 -207384 -96726 -19247 2909 20121 -47471
18410d7471j56043j53798j40818J55957J35912l2613q4988J56064p8652N6886
$$ -47471 -203514 -357312 -498130 -342173 -206261 -238874 -323862 -167798 -246450 -189564
18400a89564J8061j69016Q7139K09173J95531j1072n0776k5577l7807j95519r2730
$$ -189564 -171503 -340519 -253380 -44207 151324 140252 89476 63899 26092 -169427 -262157
18389b62157J80087J17389j42206k4852Q5210j31935O1153J2512p3999M6545J58071
$$ -262157 -82070 35319 -106887 -131739 -46529 -178464 -117311 -104799 -178798 -132253 25818
18378B5818j88061j05230j7676k78801P5747K12500M5771j195q998J91210l5895
$$ 25818 -162243 -267473 -285149 -563950 -488203 -275703 -229932 -231127 -240125 -48915 -84810
18367h4810j77029j20654L9337r4021m4716Q9733K6552P6124K1708L15005O5735
$$ -84810 -261839 -382493 -343156 -437177 -481893 -392160 -365608 -289484 -267776 47229 112964
18356A12964j22235m4070J9171J09693K9787j18200j56749r9415J02205K66122
$$ 112964 -9271 -53341 -34170 75523 105310 -12890 -169639 -269054 -166849 99273
18346I9273p9971j7607r4233M4846o6031n0534N8222O5635o9992p0488Q1809J98442
$$ 99273 19302 1695 -92538 -47692 -113723 -164257 -106035 -40400 -110392 -180880 -99071 99371
18334I9371j60121N9890J81681j26714l02448k49442k0452J52664n3080J67013
$$ 99371 -60750 -860 180821 54107 -248341 -497783 -518235 -365571 -418651 -251638
18324b51638L35678P730j55977L3025J83k4470k57217M8063L16237m3840k12227
$$ -251638 84040 91770 -64207 -31182 -30999 -55469 -312686 -264623 51614 7774 -204453
18313b04453m1257R8848J73152n4600j44889j30361R3836O0208J64198J15587
$$ -204453 -245710 -146862 26290 -28310 -173199 -303560 -209724 -149516 14682 130269
18303A30269j09938j07629j03112J20564L9558j65497J81809J23843m0115j8617
$$ 130269 20331 -87298 -190410 -69846 -30288 -195785 -13976 109867 69752 51135
18293E1135k93680n5750Q7269m2415Q0713N8901P9835Q7557J36959j14027j06132
$$ 51135 -242545 -298295 -211026 -253441 -172728 -113827 -33992 53565 190524 76497 -29635
18282b9635n4929p7123J07394j0896j59404M3993k3365J01358K05524k13865j19692
$$ -29635 -84564 -161687 -54293 -65189 -224593 -180600 -203965 -102607 102917 -110948 -230640
18271b30640o1702j6183J82703O2688k48085l6436J66732J99476N2052k08059
$$ -230640 -292342 -308525 -125822 -63134 -311219 -347655 -180923 18553 70605 -137454
18261a37454r1561k8786Q9277N6179J02745M6478m7780p9242q4270q2651J28266
$$ -137454 -229015 -257801 -168524 -112345 -9600 36878 -10902 -90144 -174414 -257065 -128799
18250a28799P9776j12152J59825K44670o4542p3445l5470R1660O9263J1503K4478
$$ -128799 -49023 -161175 -1350 243320 178778 105333 69863 161523 230786 242289 266767
18239B66767k0612k9014j45112q4432j57913p369J37838K42101J2905j29879q845
$$ 266767 246155 217141 72029 -12403 -170316 -177685 -39847 202254 215159 85280 76435
18228G6435K0946j6250o5518J5938j00597L1028K91174r5940j10222m8783k90
$$ 76435 97381 81131 15613 31551 -69046 -38018 253156 157216 46994 -1789 -2079
18217b079j24162k44935m4770P7937k3866K0166l504K5962Q0103Q2750J20358
$$ -2079 -126241 -371176 -415946 -338009 -361875 -341709 -345213 -319251 -239148 -156398 -36040
18206c6040k50013l16407j42334O6447K03130J96263K673n7067L435L0382n5997
$$ -36040 -286053 -602460 -744794 -678347 -475217 -278954 -276281 -333348 -329913 -299531 -355528
18195c55528J54308j8722j48390K2630j4048L7235Q5646k8630o9169J44591K0738
$$ -355528 -201220 -219942 -368332 -345702 -359750 -322515 -236869 -265499 -334668 -190077 -169339
18184a69339J40706q7088Q530j93958L2183N6580k00736K1884M09876K24933M6105
$$ -169339 -28633 -115721 -107191 -301149 -268966 -212386 -413122 -391238 18638 243571 289676
18173B89676j26690j03300p4242k09313j27178Q6488N6585r0924r1647J85358
$$ 289676 162986 59686 -14556 -223869 -351047 -264559 -207974 -298898 -390545 -205187
18163b05187K84718J33931m4222j94437k2342q9050P126n9237k68041J36046J69222
$$ -205187 79531 213462 169240 -25197 -47539 -136589 -129463 -188700 -456741 -320695 -151473
18152a51473J76038R2635m6980k5212J05770L4287n313l4589K3925J21211j51093
$$ -151473 24565 117200 70220 45008 150778 185065 179752 145163 169088 290299 139206
18141A39206k4137l0915n7608r218M4902N9193N7426j6732R8528r1666r5586k2981
$$ 139206 115069 84154 26546 17328 62230 121423 178849 162117 260645 168979 73393 50412
18129E0412j89102j69112k7078j3247L31846K69194o0536k29002l2047L3401J69846
$$ 50412 -138690 -307802 -334880 -348127 -16281 252913 192377 -36625 -68672 -35271 134575
18118A34575P7690j14444n9470m4317R6902q2060j11369q388J5405K2363M1309
$$ 134575 212265 97821 38351 -5966 90936 8876 -102493 -110881 -95476 -73113 -31804
18107c1804J68296J54162L17228k8230k3952L924j69539n6188J41126m3986k0642
$$ -31804 136492 290654 607882 579652 555700 559624 390085 333897 475023 431037 410395
18096D10395J74366n4054m1678J48875j9579k47297j51039J07988k774k06633
$$ 410395 584761 530707 489029 637904 618325 371028 219989 327977 325203 118570
18086A18570j42756O5818N471j18440M594p7840L6231o3367m7244n7582j24397
$$ 118570 -24186 41632 47103 -71337 -66743 -144583 -108352 -171719 -218963 -276545 -400942
18075d00942L08382L22945o3234O4631j06633q3352j15621l9748J06888Q1491
$$ -400942 -92560 230385 167151 231782 125149 41797 -73824 -113572 -6684 74807
18065G4807n9630j86342L7340K2154J84314P7310P7157K44591K41690j97770k31404
$$ 74807 15177 -171165 -133825 -111671 72643 149953 227110 471701 713391 515621 284217
18054B84217J66877L50099M4401k5572m5071m8699L121L4125j36776r4591j07736
$$ 284217 451094 801193 845594 820022 774951 726252 729373 763498 626722 532131 424395
18043D24395k49537j02829J08936p5239r7031k6660k00138J2664k6227K88317
$$ 424395 174858 72029 180965 105726 8695 -17965 -218103 -205439 -231666 56651
18033E6651J77874J9058p1852n2115n5765N8047j71131j68684K8932Q3336J4241
$$ 56651 234525 253583 181731 129616 73851 131898 -39233 -207917 -178985 -95649 -81408
18022h1408r7503J63412k9967j51907j2041J57969J82285j02945j98905m3991
$$ -81408 -178911 -15499 -45466 -197373 -209414 -51445 130840 27895 -171010 -215001
18012b15001J32354O9583K5044K15020k3478k50929L6432J91908J18439l5239
$$ -215001 -82647 -13064 11980 227000 203522 -47407 -10975 180933 299372 264133
18002B64133Q8450K54732J18152N8086k11644n0756J04149N7516q8660n3573k2149
$$ 264133 352583 607315 725467 783553 571909 521153 625302 682818 594158 540585 518436
17991E18436J32987O0937O8695L9447j9505r7350j67328j06194k4958j0710m2865
$$ 518436 651423 712360 781055 820502 800997 703647 536319 430125 405167 394457 351592
17980C51592P2948p1408k81830L1424K00734J80833M1315J20852j15134K2968
$$ 351592 424540 353132 71302 102726 303460 484293 525608 646460 531326 554294
17970E54294J06343Q517j61138m8481J72035J06228j7019k14711j46743P282J08009
$$ 554294 660637 669154 508016 459535 631570 737798 720779 506068 359325 366607 474616
17959D74616N7499Q0262L7970o0981j15823J98868j04435k95739j27752J21269
$$ 474616 532115 612377 650347 589366 473543 672411 567976 272237 144485 265754
17949B65754n0970M0089m7704K00155J40373J512j33363Q8120j81402j02470J48885
$$ 265754 214784 254873 207169 407324 547697 549209 415846 503966 322564 220094 368979
17938C68979K78193q7313j50450r5242o5239j22505J4068J78463M9034j72728
$$ 368979 647172 559859 409409 314167 248928 126423 140491 318954 367988 195260
17928A95260J2231O0936j4557k52838L4778J48393n5370k0277L882P5884k6653
$$ 195260 207491 268427 253870 1032 35810 184203 128833 108556 112438 188322 161669
17917A61669j08695j16659O8587M6918L257K24161n1611j78042j02891L7967j9439
$$ 161669 52974 -63685 4902 51820 55077 279238 227627 49585 -53306 -15339 -34778
17906c4778J87346J69945j26590j69182p209L2847J9283k8615l5304m7160J22271
$$ -34778 152568 322513 195923 26741 19532 52379 71662 43047 7743 -39417 82854
17895H2854J60007N6552o8257l9836R1131Q295j96306N2284P7964J27154j11056
$$ 82854 242861 299413 231156 191320 282451 290746 94440 146724 224688 351842 240786
17884B40786m7376p5125K50803Q5422j41142j09638j11553j00496l7391J122N1857
$$ 240786 193410 118285 369088 454510 313368 203730 92177 -8319 -45710 -44588 7269
17873G269J81134L0644q2985j35579K0892O917J12412L2796j3821K601J7358m1861
$$ 7269 188403 219047 136062 483 21375 28292 140704 173500 159679 162280 179638 137777
17861A37777j66258o6330j39166l6536J25588j1278r3590k16546M3598J17171
$$ 137777 -28481 -94811 -233977 -270513 -144925 -156203 -249793 -466339 -422741 -305570
17851c05570K88865J31574k60728j24837L1071O6680K9850k6723J08296l5503
$$ -305570 -16705 114869 -145859 -270696 -239625 -172945 -143095 -169818 -61522 -97025
17841i7025j09380j2887O9313k28M3226J3501j30722n1482J11680r5371K0974
$$ -97025 -206405 -219292 -149979 -150207 -106981 -93480 -224202 -275684 -164004 -259375 -238401
17830b38401J63871J80883k49887j27306M6107N4929R6087n9497q3477n9377Q468
$$ -238401 -74530 106353 -143534 -270840 -224733 -169804 -73717 -133214 -216691 -276068 -267600
17819b67600K1198J9688q6230m5773m1466J55421J81107j45911O2430R8903K39184
$$ -267600 -246402 -226714 -312944 -358717 -400183 -244762 -63655 -209566 -147136 -48233 190951
17808A90951J55453J20003Q4596k34160k31245K5235m4551k619o5689L0983m0073
$$ 190951 346404 466407 551003 316843 85598 110833 66282 63663 -2026 28957 -11116
17797a1116J7685K00796J51887L5088j69120j39912j92123P6613P0406p9592o8746
$$ -11116 6569 207365 359252 394340 225220 85308 -106815 -30202 40204 -39388 -108134
17786a08134j21220n6711j10822L3718j13658J17909J60363Q2994J95678o9905
$$ -108134 -229354 -286065 -396887 -363169 -476827 -358918 -198555 -115561 80117 10212
17776A0212j95825p2010L4623n0204J3718J1045k02307m8518J59613K8192N7884
$$ 10212 -185613 -257623 -223000 -273204 -259486 -248441 -450748 -499266 -339653 -311461 -253577
17765b53577M2986J1863n3890k6815J94735J11827q3902R7796m9381J3986j33301
$$ -253577 -210591 -198728 -252618 -279433 -84698 27129 -56773 41023 -8358 5628 -127673
17754a27673P4636N2621M3676o060O1800j72138j09140J22981J2964q200n0744
$$ -127673 -53037 -416 43260 37200 99000 -73138 -182278 -59297 -46333 -54533 -105277
17743a05277N4788L1521n8298o7863k68326R0823K32627L6307j31256j89283J34066
$$ -105277 -50489 -18968 -77266 -145129 -413455 -322632 -90005 -53698 -184954 -374237 -240171
17732b40171J68381K08005j85192k47430J7186J82128J57992k4149O3415l2799
$$ -240171 -71790 136215 -48977 -296407 -279221 -97093 60899 36750 100165 67366
17722F7366L156K9652p5789q6654j46497m6121K09225J29923j04057r771j72333
$$ 67366 70522 100174 24385 -62269 -208766 -254887 -45662 84261 -19796 -29567 -201900
17711b01900J28672k1301k08188N7053R3208K45150J24714j89442l9500R254R9398
$$ -201900 -73228 -94529 -302717 -245664 -152456 92694 217408 27966 -11534 -2280 97118
17700I7118R8927k9310j72264j14186P1789q4235j07332p4355N3587o9609l008
$$ 97118 196045 166735 -5529 -119715 -47926 -132161 -239493 -313848 -260261 -329870 -332878
17689c32878J80889p8343o6854R6910J19917l208K00176P514j10974n0680O0207
$$ -332878 -151989 -230332 -297186 -200276 -80359 -83567 116609 124123 13149 -37531 22676
17678B2676j30097K7579J4568r4848j86835n3993J98251l2132p863j0991O523
$$ 22676 -107421 -79842 -65274 -160122 -346957 -400950 -202699 -234831 -242694 -253685 -247162
17667b47162R5289m9802N9241J19983o5778j18009j68441j17179j05031K8925
$$ -247162 -151873 -201675 -142434 -22451 -88229 -206238 -374679 -491858 -596889 -567964
17657e67964J31498J29940M3403J03647j16720k02055p3874J64015K8951r2827
$$ -567964 -436466 -306526 -263123 -159476 -276196 -478251 -552125 -388110 -359159 -451986
17647d51986K5107J90920Q8210m153J28573r6278l5398K34804J26116q4199j85848
$$ -451986 -426879 -235959 -147749 -151902 -23329 -119607 -155005 79799 205915 121716 -64132
17636f4132j8697Q8257J7035K2715k7391n6107l2888L560j20301l8360J5607K43887
$$ -64132 -82829 5428 22463 45178 17787 -38320 -71208 -67648 -187949 -226309 -210702 33185
17624C3185J45709k8976Q1931k78990k91933O3517J94553Q1629R4716P1121o3678
$$ 33185 178894 149918 231849 -47141 -339074 -275557 -81004 625 95341 166462 102784
17613A02784l31339j52613K08922K35387n4869j42552j1186j3218J79260N3161
$$ 102784 -228555 -381168 -172246 63141 8272 -134280 -145466 -158684 20576 73737
17603G3737j64485k1451J53957K5262p7349J20619P7625k41303j32689J42551
$$ 73737 -90748 -112199 41758 67020 -10329 110290 187915 -53388 -186077 -43526
17593d3526J463q951j125j70950L8485j09284O0044m6069k6762Q4703k5327j1295
$$ -43526 -42063 -51014 -52139 -223089 -184604 -293888 -233844 -279913 -306675 -221972 -247299 -258594
17581b58594r0442J3520K09788K75761J91561o2032m7900L4861k16807O5639O2267
$$ -258594 -349036 -335516 -125728 150033 341594 279562 231662 266523 49716 115355 177622
17570A77622j64160K7034K5212J9557k46605j35039Q9259J52038J22103l3352
$$ 177622 13462 40496 65708 85265 -161340 -296379 -207120 -55082 67021 33669
17560C3669o2993j50201j50289p0911Q5798L7560O84J23265m779J56838k276n8801
$$ 33669 -29324 -179525 -329814 -400725 -314927 -277367 -276683 -153418 -158197 -1359 -3635 -62436
17548f2436J26450O9597q8953J14677J13926q9994j1533L9930j76314j65229N8793
$$ -62436 64014 133611 44658 159335 273261 183267 171734 211664 35350 -129879 -71086
17537g1086K0531Q2034J02720r2055n1618o487Q2983j54984l2513k0760N6583
$$ -71086 -50555 31479 134199 42144 -9474 -15961 67022 -87962 -120475 -141235 -84652
17526h4652O1279J4109P2806J552j7800J8256M9759K61301L8268p4119j64310
$$ -84652 -23373 -9264 63542 65094 47294 65550 115309 376610 414878 340759 176449
17515A76449m7050p8569j24009m4649Q4291J83413O7225m8303p673j85503K4836
$$ 176449 129399 50830 -73179 -117828 -33537 149876 217101 168798 161125 -24378 458
17504D58N3968N3207N8897n3759o7308k8843j88743k50473L17N5806l532J65886
$$ 458 54426 107633 166530 112771 45463 16620 -172123 -422596 -422279 -366473 -370005 -204119
17492b04119M1709l2835p9286l0544Q1028K91064r0278J7552J61644l8066j86921
$$ -204119 -162410 -195245 -274531 -305075 -224047 67017 -23261 -5709 155935 117869 -69052
17481f9052L2007J48125p473N9973J63793p6041l8475q6544q2726o1452o1175
$$ -69052 -37045 111080 103607 163580 327373 251332 212857 126313 43587 -17865 -79040
17470g9040j65271k68733J67361K17361J66855M8685j7933k8913p6311k70016
$$ -79040 -244311 -513044 -345683 -128322 38533 87218 69285 40372 -35939 -305955
17460c05955M1601O087J8248k6298m4049K7031K20929K9904k36791k20732j68625
$$ -305955 -264354 -258267 -240019 -266317 -310366 -283335 -62406 -32502 -269293 -490025 -658650
17449f58650J79291J5027J73816J58802k2160K43645M6846k73135Q7932P4486
$$ -658650 -479359 -464332 -290516 -131714 -153874 89771 136617 -136518 -48586 25900
17439B5900J86078k01984M4251p8111K6453r972J18250M1648j12998N0209R4310
$$ 25900 211978 9994 54245 -23866 2587 -7385 110865 152513 39515 89724 184034
17428A84034j29155j44863k66063n7941J56971R4853J26332K61238J54849q8523
$$ 184034 54879 -89984 -356047 -413988 -257017 -162164 -35832 225406 380255 291732
17418B91732j56792k99304o2521N3583K28337q8811q3447L1459J37796J57991
$$ 291732 134940 -164364 -226885 -173302 55035 -33776 -117223 -85764 52032 210023
17408B10023K77516j78040l58487P0176L2637o8897j85563j48399J31724M8993
$$ 210023 487539 309499 -48988 21188 53825 -15072 -200635 -349034 -217310 -168317
17398a68317k08176J54381M5236K0541l4477m2556m7981J32624p4572P9693J42311
$$ -168317 -376493 -222112 -176876 -156335 -190812 -233368 -281349 -148725 -223297 -143604 -1293
17387a293K12893L9429j0721J11339j45847j34128R024Q055j1790j86562o7052
$$ -1293 211600 251029 240308 351647 205800 71672 80696 88751 76961 -109601 -176653
17376a76653K43789j3882j41503l5375M3766K6520Q9124J0526P1175m3954j06423
$$ -176653 67136 53254 -88249 -123624 -79858 -53338 35786 46312 117487 73533 -32890
17365c2890j48772o2951J69012J48619j33317J54521j16134k08476l4783J24075
$$ -32890 -181662 -244613 -75601 73018 -60299 94222 -21912 -230388 -265171 -141096
17355a41096J37985J08527J02199p8554p2684j4450j65908R1586K97308Q6146
$$ -141096 -3111 105416 207615 129061 56377 41927 -123981 -32395 264913 351059
17345C51059p7395j38091j34369r609j07397M1486r23K4599P1952J76873m337
$$ 351059 273664 135573 1204 -8405 -115802 -74316 -75239 -50640 21312 198185 193848
17334A93848k18932n1290P8028K88085p0906k27106o3070J09776l8799J4593J33218
$$ 193848 -25084 -76374 1654 289739 218833 -8273 -71343 38433 -366 14227 147445
17323A47445j70463j28102l089J7575P5368J87416J29435L2557k34576k45403
$$ 147445 -23018 -151120 -154209 -136634 -61266 126150 255585 288142 53566 -191837
17313a91837q7554J80156N5245J81065j14956k36795P2317K12908R7770Q294q1748
$$ -191837 -279391 -99235 -43990 137075 22119 -214676 -142359 70549 168319 176613 94865
17302I4865k44438o4728R5383o4205k9249J94221M2956j73592P3411L7703j43057
$$ 94865 -149573 -214301 -118918 -183123 -212372 -18151 24805 -148787 -75376 -37673 -180730
17291a80730L1070j04836o6083j37750J05193J22579j41516L9210K05596M8790
$$ -180730 -149660 -254496 -320579 -458329 -353136 -230557 -372073 -332863 -127267 -78477
17281g8477n5519j41967j83215L8977K78840J24437J57555j30577J8999J7632
$$ -78477 -133996 -275963 -459178 -420201 -141361 -16924 140631 10054 29053 46685
17271D6685j03333j67546J5379J78189N6742K2681J17544p9897k12237k34678
$$ 46685 -56648 -224194 -208815 -30626 26116 48797 166341 86444 -125793 -360471
17261c60471J8296J56995K98137J14104j22263j51138L1565j04533j23906Q9605
$$ -360471 -342175 -185180 112957 227061 104798 -46340 -14775 -119308 -243214 -153609
17251a53609N1093M3361j6335j94049Q2297J55616j04523l34593J37203K22522
$$ -153609 -102516 -59155 -75490 -269539 -187242 -31626 -136149 -470742 -333539 -111017
17241a11017k3973k52575M5433J96572J50624J67262J18399j98927J4079J01020
$$ -111017 -134990 -387565 -342132 -145560 5064 172326 290725 91798 105877 206897
17231B06897q5727j87569j63581l7994j07679J28304J15293j72516k1753j13553
$$ 206897 121170 -66399 -229980 -267974 -375653 -247349 -132056 -304572 -326325 -439878
17221d39878L4502K77029k7216Q7448J05286n4200o5098P8187j90606q4772k0704
$$ -439878 -405376 -128347 -155563 -68115 37171 -17029 -82127 -3940 -194546 -279318 -300022
17210c00022R7702K238k6165j15243j8694K55023k3302m3478r8616p9384N1578
$$ -300022 -202320 -200082 -226247 -341490 -360184 -105161 -128463 -171941 -270557 -349941 -298363
17199b98363Q7650j1912J47392j0196O3873K7202q8759m8106J9651K15018j64536
$$ -298363 -210713 -222625 -75233 -85429 -21556 5646 -83113 -131219 -111568 103450 -61086
17188f1086N7236J41819m132l483R575k9894L2525j55225o1390P3431K5033N3049
$$ -61086 -3850 137969 133837 130354 139929 110035 142560 -12665 -74055 -624 24409 77458
17176G7458J0654J25622K5594K0161J21043k09293k38789l02228j79358K07004
$$ 77458 88112 213734 239328 259489 380532 171239 -67550 -369778 -549136 -342132
17166c42132L05422l7058j6944q9364J16922Q2983l33956k61913L1721J94076
$$ -342132 -36710 -73768 -90712 -180076 -63154 19829 -314127 -576040 -544319 -350243
17156c50243J91681Q0868k43069l0392J21472N047Q7022Q3383n1345J18909J14519
$$ -350243 -158562 -77694 -320763 -351155 -229683 -224636 -137614 -54231 -105576 13333 127852
17145A27852j14186Q2524n4929m8329n8217K8131n4264P7378J56068K11687k47454
$$ 127852 13666 96190 41261 -7068 -65285 -37154 -91418 -14040 142028 353715 106261
17134A06261l26812p4185Q0369j4353K738L8575j02968j2979J05603J4325K1145
$$ 106261 -220551 -294736 -214367 -228720 -225982 -187407 -290375 -303354 -197751 -183426 -162281
17123a62281O3143Q053J12182P4451L740k07115n5061p5871j08164J08823J16747
$$ -162281 -99138 -91085 21097 95548 99288 -107827 -162888 -238759 -346923 -238100 -121353
17112a21353J15539O3098j51570j76252J88364J65167j75920q2720L8609N1655
$$ -121353 -5814 57284 -94286 -270538 -82174 82993 -92927 -175647 -137038 -85383
17102h5383j1864J71963l0952q3018q2017p051n3639J67567J98057j52219j14560
$$ -85383 -97247 74716 43764 -39254 -121271 -128322 -181961 -14394 183663 31444 -83116
17091h3116J04625p4405l1373M5128J42434j8026l6281j638j29942P1951O6262
$$ -83116 21509 -52896 -84269 -39141 103293 85267 48986 47348 -82594 -10643 55619
17080E5619j8605j29277J9852N6454r53J1962K2674K42055j16485j4558l978m9712
$$ 55619 37014 -92263 -72411 -15957 -16910 -4948 17726 259781 143296 128738 124760 75048
17068G5048j42370m9040J68101L5895j40172J8751R0769l4497j14776j03380P0164
$$ 75048 -67322 -116362 51739 87634 -52538 -33787 56982 22485 -92291 -195671 -125507
17057a25507p764M4693N6086q6265j55016O617R0561J23485M32K0224q34n1566
$$ -125507 -133271 -88578 -32492 -118757 -273773 -267156 -176595 -53110 -52678 -32454 -33288 -84854
17045h4854J79058j2031j75130k22595K5108p7827J24398K21875j90551j22007
$$ -84854 94204 82173 -92957 -315552 -290444 -368271 -243873 -21998 -212549 -334556
17035c34556J42798k048M4485J53530J75610P76k30728j31715J3639j5376k87165
$$ -334556 -191758 -193806 -149321 4209 179819 180595 -50133 -181848 -168209 -183585 -470750
17024d70750M1505R0461K23366J61562k4251j67199J10048Q8219j59197j03733
$$ -470750 -429245 -338784 -115418 46144 21893 -145306 -35258 52961 -106236 -209969
17014b09969O7339J10352K0716K0965j4818j12224o9308l8146P0642p6991J26641
$$ -209969 -142630 -32278 -11562 9403 -5415 -117639 -186947 -225093 -154451 -231442 -104801
17003a04801Q0963k72300J0697J88223j271q1100J95710J52794n9726p078q4894
$$ -104801 -23838 -296138 -285441 -97218 -98489 -179589 16121 168915 109189 102111 17217
16992A7217P7924J75168N7365j19055J25439M931O4402j32302q0993O2688r1321
$$ 17217 95141 270309 327674 208619 334058 338989 403391 271089 190096 252784 161463
16981A61463j58495j3228J86786R9084n3591j02791J6572l9805j4523o6583j4109
$$ 161463 2968 -10260 176526 275610 222019 119228 135800 95995 81472 14889 780
16970G80R1017j55095p9229L28165k5646J48325j00827M1346k9275l80600k18329
$$ 780 91797 -63298 -142527 185638 159992 308317 207490 248836 219561 -161039 -379368
16959c79368O8522j09847j34674J28054K3048J44256J96195J73638j04252p6815
$$ -379368 -310846 -420693 -555367 -427313 -404265 -260009 -63814 109824 5572 -71243
16949g1243J85836k49701k4877J14112J0900O8632P3593M6116L1895j29559j35567
$$ -71243 114593 -135108 -159985 -45873 -34973 33659 107252 153368 185263 55704 -79863
16938g9863J17739j5617J0336j54504m7123j34993N1547J8038J1514L507J42198
$$ -79863 37876 22259 32595 -121909 -169032 -304025 -252478 -234440 -222926 -219419 -77221
16927g7221O9261j41257k55098L814K50964J54367j12157k21043J14994K41430
$$ -77221 -7960 -149217 -404315 -400501 -149537 4830 -107327 -328370 -213376 28054
16917B8054m8105q4449J4560J09164J26346k86159p2372J03405j00074p5551r8907
$$ 28054 -20051 -104500 -89940 19224 145570 -140589 -212961 -109556 -209630 -285181 -384088
16906c84088K87399J78005p093j35061L6147K536j1007L8815k16348q2905M5998
$$ -384088 -96689 81316 74223 -60838 -24691 -22155 -33162 5653 -210695 -293600 -247602
16895b47602J81642P8863J0380k5993K3143J08429j44565k32453q4112J57736
$$ -247602 -65960 12903 23283 -2710 20433 128862 -15703 -248156 -332268 -174532
16885a74532J29025k4392j81771j15132M6479L5748J8901M9528j2990R0296j61771
$$ -174532 -45507 -69899 -251670 -366802 -320323 -284575 -265674 -216146 -229136 -138840 -300611
16874c00611J91103P1023Q1066Q2171M9001O289o5796j26454K7179J11412p0631
$$ -300611 -109508 -38485 42581 124752 173753 180042 114246 -12208 14971 126383 55752
16863E5752R9998K33239j92362k40755r7286m3096m3493K46332K4924m2938J90112
$$ 55752 155750 388989 196627 -44128 -141414 -184510 -228003 18329 43253 315 190427
16852A90427J3631N8110l3037j51208k57035k0877J62368K3209p8250P6683k0495
$$ 190427 204058 262168 229131 77923 -179112 -199989 -37621 -14412 -92662 -15979 -36474
16841c6474k922o7484j09636L3227k00N3679m2665R3326P8457J21158Q8504Q1460
$$ -36474 -39396 -106880 -216516 -183289 -183489 -129810 -172475 -79149 -692 120466 208970 290430
16829B90430Q2647j75695j70792j68961J16154k8795q9471j52510L7223j10722
$$ 290430 373077 197382 26590 -142371 -26217 -55012 -144483 -296993 -259770 -370492
16819c70492j84472J51077J01705Q2310L4797K1565m8046k5832K44849N0978O9277
$$ -370492 -554964 -403887 -302182 -219872 -185075 -163510 -211556 -237388 7461 58439 127716
16808A27716K9779l1363n4021k06912j62673j05061J2258J90439j943j03474K0285
$$ 127716 157495 126132 72111 -134801 -297474 -402535 -390277 -199838 -201781 -305255 -284970
16797b84970K9263K57030L11517j8402j69496k8463j10279Q5841J43210o2195
$$ -284970 -255707 1323 312840 294438 124942 96479 -13800 72041 215251 153056
16787A53056k36049j02703j8011R1587p5230j02407m6482J05944R5165j27792
$$ 153056 -82993 -185696 -203707 -112120 -187350 -289757 -336239 -230295 -135130 -262922
16777b62922j57479J01560R3686K16314J2000n9541J07659J57986o3063J4447
$$ -262922 -420401 -318841 -225155 -8841 3159 -56382 51277 209263 146200 160647
16767A60647r041p7130j21958j02759Q8437j9626J30455j7389j4732J12426J07358
$$ 160647 151606 74476 -47482 -150241 -61804 -81430 49025 31636 16904 129330 236688
16756B36688j27910r2096P7068o321j15046j01674Q1841K52996j35318j35956
$$ 236688 108778 16682 93750 87429 -27617 -129291 -47450 205546 70228 -65728
16746f5728J60860J03680p9648j18797k9650O5921J01535J9679q1907p7314L6355
$$ -65728 95132 198812 119164 367 -29283 36638 138173 157852 75945 -1369 34986
16735C4986P1753j1125m6004k2914R7700M3367K2670k5192r5314j40320m4245
$$ 34986 106739 95614 49610 26696 124396 167763 190433 165241 69927 -70393 -114638
16724a14638j60185k02271K4755L06998O9206k26252q6243J75236K1049O851J58584
$$ -114638 -274823 -477094 -452339 -145341 -76135 -302387 -388630 -213394 -192345 -185494 -26910
16713b6910n5917p2946Q0582j20838J721R3956J33548p1204j92121M0156J27511
$$ -26910 -82827 -155773 -75191 -196029 -194308 -100352 33196 -38008 -230129 -189973 -62462
16702f2462o3383K1206Q4451l6839L719J39476J59266o9535k53147l16666Q5761
$$ -62462 -125845 -104639 -20188 -57027 -53308 86168 245434 175899 -77248 -393914 -308153
16691c08153K12899K10043J08740J61068o2652j98013j0954n2915n1394j0972
$$ -308153 -95254 114789 223529 384597 321945 123932 112978 60063 8669 -2303
16681b303J16342K92049k40780j26015r7018l21256p3044J9582J13343j46435
$$ -2303 114039 406088 165308 39293 -57725 -378981 -452025 -432443 -319100 -465535
16671d65535K967L01581j4888p3356R4678J02398O9723L3515j72070l4559j54769
$$ -465535 -462568 -160987 -175875 -249231 -154553 -52155 17568 51083 -120987 -155546 -310315
16660c10315Q5731J86513M1050M4210M3562M4687n5120m6333N0532k3879l12464
$$ -310315 -224584 -38071 2979 47189 90751 135438 80318 33985 84517 60638 -251826
16649b51826j24614J24548J23034j02853R3483O2207j23651M5506J8890J31745
$$ -251826 -376440 -251892 -128858 -231711 -138228 -76021 -199672 -154166 -135276 -3531
16639c531J00784j01214Q9818N4290o2826j42920k4379K47212R3140j13930m5288
$$ -3531 97253 -3961 85857 140147 77321 -65599 -89978 157234 250374 136444 91156
16628I1156O6771l7188O8798J47691o651l10066o6652M5076J23507k0701j14591
$$ 91156 157927 120739 189537 337228 330577 20511 -46141 -1065 122442 101741 -12850
16617a2850P0956K3283o8438K4975n2621K6628l7444K3828q9125n9076J84867
$$ -12850 58106 81389 12951 37926 -14695 11933 -25511 -1683 -90808 -149884 34983
16606C4983N7484J12170L8014j65154r1993L6628n9425q6378M0310R0609J19326
$$ 34983 92467 204637 242651 77497 -14496 22132 -37293 -123671 -83361 7248 126574
16595A26574k9725j9176k5189L6632J10901M3623r0956k01569O4444L8227j27333
$$ 126574 96849 77673 52484 89116 200017 243640 152684 -48885 15559 53786 -73547
16584g3547l31499j67951J14291R084N0395K19967J59110J60057J08395o3347
$$ -73547 -405046 -572997 -458706 -449622 -399227 -179260 -20150 139907 248302 184955
16574A84955o1811j67726k6923k4968l6564p1042j63612r5653Q0509J63630R1669
$$ 184955 123144 -44582 -71505 -96473 -133037 -204079 -367691 -463344 -382835 -219205 -127536
16563a27536j08014j08835N0025p519J52255J93012n4672k77058J32656J01193
$$ -127536 -235550 -344385 -294360 -301879 -149624 43388 -11284 -288342 -155686 -54493
16553e4493j11760k83190K5826M1138L8546K44172m6088j8217J05369M13250P2722
$$ -54493 -166253 -449443 -423617 -382479 -343933 -99761 -145849 -164066 -58697 354553 427275
16542D27275j03601j21285j41418q9302P0146q4311k3253j62230J38667J24693
$$ 427275 323674 202389 60971 -28331 41815 -42496 -65749 -227979 -89312 35381
16532C5381p4842j60276J08860J46172j79375j33289J51240L0306l1113k1748
$$ 35381 -39461 -199737 -90877 55295 -124080 -257369 -106129 -75823 -106936 -128684
16522a28684j96416n5274J77868K38093N9067q4497k13661J31347Q0050j62013
$$ -128684 -325100 -380374 -202506 35587 94654 10157 -203504 -72157 7893 -154120
16512a54120M5267m1076l29876k6406L11170P6162K1608p7635L4640J11211M8718
$$ -154120 -108853 -149929 -479805 -506211 -195041 -118879 -97271 -174906 -140266 -29055 19663
16501A9663J78484J01785j76846j50526r9286o1314P7667l7808n1400n3521J66558
$$ 19663 198147 299932 123086 -27440 -126726 -188040 -110373 -148181 -199581 -253102 -86544
16490h6544l3542p77O018N791q6082L9827Q1184r8157m4215l3260P7326m0416
$$ -86544 -120086 -120863 -114845 -109054 -195136 -155309 -74125 -172282 -216497 -249757 -172431 -212847
16478b12847j8040K27678J21001K8140j24429J078j04728j66489P1481Q026J06219
$$ -212847 -230887 -3209 117792 145932 21503 22581 -82147 -248636 -177155 -169129 -62910
16467f2910R2487j50589j26064L5367J28058R2508J12386j01246j2518n7615k0586
$$ -62910 29577 -121012 -247076 -211709 -83651 8857 121243 19997 7479 -50136 -70722
16456g0722J90398j13818j26164j06298o8768q3040r157J9053P2262o835j25147
$$ -70722 119676 5858 -120306 -226604 -295372 -378412 -387569 -368516 -296254 -303089 -428236
16445d28236M4907J78829n4273o3558K0881J78538k18309o2914L34582K17427
$$ -428236 -383329 -204500 -258773 -322331 -301450 -122912 -341221 -404135 -69553 147874
16435A47874l6004k04397k1009l9267l3185J43526J56418O1234j574J26134K1097
$$ 147874 111870 -92527 -113536 -152803 -185988 -42462 113956 175190 173616 299750 320847
16424C20847m4250j41631p1220j02512j35734j61443J41486J49035Q9095M4034
$$ 320847 276597 134966 63746 -38766 -174500 -335943 -194457 -45422 43673 87707
16414H7707J03942k51452j65058J7137l1207m8031L1439P9140J25621n7024j78782
$$ 87707 191649 -59803 -224861 -207724 -238931 -286962 -255523 -176383 -50762 -107786 -286568
16403b86568J28764N8127J00023J44545J43805m0377K4693L5028j09918j48448
$$ -286568 -157804 -99677 346 144891 288696 248319 273012 308040 198122 49674
16393D9674n108o6217m2450J08529Q0974m2928k6798j41560k53605r7734K65857
$$ 49674 44566 -21651 -64101 44428 125402 82474 55676 -85884 -339489 -437223 -171366
16382a71366L52555K76473j20436k86830n0183P459q2305p4401r9408J2092K53450
$$ -171366 181189 457662 337226 50396 213 7672 -74633 -149034 -248442 -236350 17100
16371A7100Q9732J32655q3249L3440r321q8248J00685k35381l4765J10972P2076
$$ 17100 106832 239487 156238 189678 180357 92109 192794 -42587 -77352 33620 105696
16360A05696J37953J31718j1072k96607k5876O8959j91294j02080J02130J44302
$$ 105696 243649 375367 364295 67688 41812 110771 -80523 -182603 -80473 63829
16350F3829k2100j49425p0012Q5680J75961j05575J03263M2773j6427k04264j25438
$$ 63829 41729 -107696 -177708 -92028 83933 -21642 81621 124394 107967 -96297 -221735
16339b21735m7053K02295o8647n7550J2871l8950j4251k1784J87706m3720p3217
$$ -221735 -268788 -66493 -135140 -192690 -179819 -218769 -233020 -254804 -67098 -110818 -184035
16328a84035J37763l12372q2455J40790q5133J7982R5094Q2586l2321O760P0333
$$ -184035 -46272 -358644 -441099 -300309 -385442 -367460 -272366 -189780 -222101 -215341 -145008
16317a45008j24711m6436J96416K12225j20700j04915K8356Q1806L3876j58090
$$ -145008 -269719 -316155 -119739 92486 -28214 -133129 -104773 -22967 10909 -147181
16307a47181J52721L09077l25497k54048n7852J36352J8817J3284L7821r8376
$$ -147181 5540 314617 -10880 -264928 -322780 -186428 -167611 -154327 -116506 -214882
16297b14882q5671J3184j60216N1984K81531Q8224K8046k0885j9009l3121j24901
$$ -214882 -300553 -287369 -447585 -395601 -114070 -25846 2200 -18685 -37694 -70815 -195716
16286a95716o5235j10785R1619K30233J172N6889J05502J23741j19593k41904
$$ -195716 -260951 -371736 -280117 -49884 -48712 8177 113679 237420 117827 -124077
16276a24077P8162O6472l2999j45183j64839J69577O6983N8952m8925N3173J86030
$$ -124077 -45915 20557 -12442 -157625 -322464 -152887 -85904 -26952 -75877 -22704 163326
16265A63326M76l32274o0238J04067K3146J95220K3371K1455j92969j70604Q1972
$$ 163326 163802 -168472 -228710 -124643 -101497 93723 117094 138549 -54420 -225024 -143052
16254a43052J50604J6433o8116q8087j05050J63127O0842J52475k9969N4440k41724
$$ -143052 7552 23985 -44131 -132218 -237268 -74141 -13299 139176 109207 163647 -78077
16243g8077k70300J12336m912j2085n8600J32755K33824r170k04476j03253J31
$$ -78077 -348377 -236041 -240953 -253038 -311638 -178883 54941 45771 -158705 -261958 -261827
16232b61827N9132K5030m6941j02406m941L5845L4146J23374J3698L925N8471
$$ -261827 -202695 -177665 -224606 -327012 -331953 -296108 -261962 -138588 -124890 -120965 -62494
16221f2494N6822k0531O0390k7546k1847M0707J22094J0847j08258j13845k3992
$$ -62494 -5672 -26203 34187 6641 -15206 25501 147595 158442 50184 -63661 -87653
16210h7653K69075J18048o9356k30702J55211j36185k09194K60869O7287j42837
$$ -87653 181422 299470 230114 -588 154623 18438 -190756 70113 137400 -5437
16200e437k9882K3293j34424R788m4307K09190m8046m7601r7107l2964Q6869K8637
$$ -5437 -35319 -12026 -146450 -136662 -180969 28221 -19825 -67426 -164533 -197497 -110628 -81991
16188h1991p1687l086J23776O0860k66630P2788O4533N0691J80681j18780l10357
$$ -81991 -153678 -156764 -32988 27872 -238758 -165970 -101437 -50746 129935 11155 -299202
16177b99202m0782J39617N0754J78031j00538j83337K3153K3065q2052L1352Q9195
$$ -299202 -339984 -200367 -149613 28418 -72120 -255457 -232304 -209239 -291291 -259939 -170744
16166a70744j6159l2967J39812L6578k41981q3047O8454j36349N1738J57290R1758
$$ -170744 -186903 -219870 -80058 -43480 -285461 -368508 -300054 -436403 -384665 -227375 -135617
16155a35617p081l4878J5072L913M1885P8169Q5909R683j42933j12383K9716O6588
$$ -135617 -142698 -177576 -162504 -158591 -116706 -38537 47372 57055 -85878 -198261 -168545 -101957
16143a01957m602j11640O8385R6431m6956n8292j94855j43213m6298l8607R0525
$$ -101957 -106559 -218199 -149814 -53383 -100339 -158631 -353486 -496699 -542997 -581604 -491079
16132d91079J02451K61744O7731K1281M7325p6828n6437j71638J1727J28111P6009
$$ -491079 -388628 -126884 -59153 -37872 9453 -67375 -123812 -295450 -283723 -155612 -79603
16121g9603k5452O5050Q3310J0821m0747J51403R4323p7730L3665M9974q6076
$$ -79603 -105055 -40005 43305 54126 13379 164782 259105 181375 215040 265014 178938
16110A78938o9942q4579j7372L1243K9692P6459j00049n1803q7315m4355J03416
$$ 178938 108996 24417 7045 38288 67980 144439 44390 -7413 -94728 -139083 -35667
16099c5667j22456n7736J94944n7766j74313j64810J4240K94893M2062k5767Q8148
$$ -35667 -158123 -215859 -20915 -78681 -252994 -417804 -403564 -108671 -66609 -92376 -4228
16088d228q0462j52179n5579j18974n5547O4249j3579J26447J64819j35157j92972
$$ -4228 -84690 -236869 -292448 -411422 -466969 -402720 -416299 -289852 -125033 -260190 -453162
16077d53162J53940N0740R0579K05768J0742q2390j50835N7046P2003p5441m7927
$$ -453162 -299222 -248482 -157903 47865 58607 -23783 -174618 -117572 -45569 -121010 -168937
16066a68937K6853M9933j6651m5027M262q205j4370j81276J32733L3881o5631
$$ -168937 -142084 -92151 -108802 -153829 -149567 -157772 -172142 -353418 -220685 -186804 -252435
16055b52435L8685Q16m933k8916K17661J14244p288l3422o0855Q0572j6102l9545
$$ -252435 -213750 -212934 -217867 -246783 -29122 85122 77834 44412 -16443 64129 48027 8482
16043H482j67480j18958O7256M3807J61363n7900k78931J4438L05417J04465J85984
$$ 8482 -158998 -277956 -210700 -166893 -5530 -63430 -342361 -327923 -22506 81959 267943
16032B67943J4616k37063j40641k68096L4513k4982O1715J48122j5257M9357l4150
$$ 267943 282559 45496 -95145 -363241 -328728 -353710 -291995 -143873 -159130 -109773 -143923
16021a43923k6092J1124o0949q5497J18763J81137j63703k95405q8259K74796
$$ -143923 -170015 -158891 -219840 -305337 -186574 -5437 -169140 -464545 -552804 -278008
16011b78008L6701m358P689J07428j08764P7432O351J08635j08615j07205q302
$$ -278008 -241307 -245665 -237976 -130548 -239312 -161880 -155529 -46894 -155509 -262714 -271016
16000b71016K16501j00008J3088J83695J16109k6566q9936j37885k83173j12283
$$ -271016 -54515 -154523 -141435 42260 158369 131803 41867 -96018 -379191 -491474
15990d91474J27175J37786J55091J01706J52180N4300j56709j3289K4742m3100
$$ -491474 -364299 -226513 -71422 30284 182464 236764 80055 66766 91508 48408
15980D8408J4971M6703k17368o2045N6454R1690J36225J09122j84396j16815J6256
$$ 48408 63379 110082 -107286 -169331 -112877 -21187 115038 224160 39764 -77051 -60795
15969f0795M1648k2414j05198K9082m429K8477L1837o5583M3340L10131P9915
$$ -60795 -19147 -41561 -146759 -117677 -122106 -93629 -61792 -127375 -84035 226096 306011
15958C06011r8797o7821j04108r8940O6147R8653N2876l894K42411j34800k08239
$$ 306011 207214 139393 35285 -63655 2492 101145 154021 150127 392538 257738 49499
15947D9499q6587P2775p1462n5233K3843q6414M2064N0901L2838q1906m8331J44012
$$ 49499 -37088 35687 -35775 -91008 -67165 -153579 -111515 -60614 -27776 -109682 -158013 -14001
15935a4001r2146k856J08190j81952j3248j43281k9819L4876K22292J74255k06954
$$ -14001 -106147 -109003 -813 -182765 -196013 -339294 -369113 -334237 -111945 62310 -144644
15924a44644M3925J07534r848r5871n1193j14834l9732K12432M8028k60570j66349
$$ -144644 -100719 6815 -3033 -98904 -150097 -264931 -304663 -92231 -44203 -304773 -471122
15913d71122j4612R9957J63825P5975k6973m6775P9979L7982K6710j15557q6960
$$ -471122 -485734 -385777 -221952 -145977 -172950 -219725 -139746 -101764 -75054 -190611 -277571
15902b77571j08512j23732Q7383J22358N5855N9848k5808j4067N584q6440K2706
$$ -277571 -386083 -509815 -422432 -300074 -244219 -184371 -210179 -224246 -218662 -305102 -282396
15891b82396m8604J07943J50507R1198q3220R05m0284k243n5799J64241k4451
$$ -282396 -331000 -223057 -72550 18648 -64572 -63667 -103951 -106194 -161993 2248 -22203
15880b2203r1596o7300j56565o009J34176L7729o3449j28416J85017O2667j6150
$$ -22203 -113799 -181099 -337664 -343673 -209497 -171768 -235217 -363633 -178616 -115949 -132099
15869a32099k3108J8521Q4237k1976O428p5817q5895j40089J06038J70251O4922
$$ -132099 -155207 -136686 -52449 -74425 -67997 -143814 -229709 -369798 -263760 -93509 -28587
15858b8587J22718m8800k54041N0689n9636L0544J35313L2807R3580K1171k6792
$$ -28587 94131 45331 -208710 -158021 -217657 -187113 -51800 -18993 74587 95758 68966
15847F8966J17419J9768j74013j78707k3906j17669m0494L0523J75097K00895
$$ 68966 186385 206153 32140 -146567 -170473 -288142 -328636 -298113 -123016 77879
15837G7879K9413j34444q6468Q8340j4810Q4661N7245j57393j0604P770j02747
$$ 77879 107292 -27152 -113620 -25280 -40090 44571 101816 -55577 -66181 -58411 -161158
15826a61158P5154n1222K14100j0667j23649j21220j4291R7751K40414k08992
$$ -161158 -86004 -137226 76874 66207 -57442 -178662 -192953 -95202 145212 -63780
15816f3780k81176k9283K4206J2291P9545O0459J0068J15538P8225j61183J5089
$$ -63780 -344956 -374239 -350033 -337742 -258197 -197738 -187670 -72132 6093 -155090 -140001
15805a40001m5093J37929M8740K0026j15404k42666J11269Q7139J36314L1142
$$ -140001 -185094 -47165 1575 21601 -93803 -336469 -225200 -138061 -1747 29395
15795B9395K8145j14134m821j603R9318o416L190p8997n2827k8934O1296j68792
$$ 29395 57540 -56594 -61415 -63018 36300 29884 33074 -45923 -98750 -127684 -66388 -235180
15783b35180k8982Q3935j22772j8748K4630O368K2617K68068J99689l6400j55401
$$ -235180 -264162 -180227 -302999 -321747 -297117 -290749 -268132 -64 199625 163225 7824
15772G824o9024q3768j5269q2977r6625K26605P5498j42260J28568J39232j04616
$$ 7824 -61200 -144968 -160237 -243214 -339839 -113234 -37736 -179996 -51428 87804 -16812
15761a6812j02256j42346K2411R2241P9478l1250k03699l3501l6999K11488K03038
$$ -16812 -119068 -261414 -239003 -146762 -67284 -98534 -302233 -335734 -372733 -161245 41793
15750D1793K1128K6239l6677N9580j9006L6885j04994L7585m7636k74823j93788
$$ 41793 62921 89160 52483 112063 93057 129942 24948 62533 14897 -259926 -453714
15739d53714j27147J35955N8896O2610J27288O7743K4039m8168J47338n9551o3237
$$ -453714 -580861 -444906 -386010 -323400 -196112 -128369 -104330 -152498 -5160 -64711 -127948
15728a27948k5697J68285N7170N3450K48602r3206N1459p0977J40926J45442k50064
$$ -127948 -153645 14640 71810 125260 373862 280656 332115 261138 402064 547506 297442
15717B97442k12891l126K25296P3815J1954k92708j07855L8433O8957L3237O7642
$$ 297442 84551 81425 306721 380536 392490 99782 -8073 30360 99317 132554 200196
15706B00196k07101n7875K2658r4494q7909k2515j02347J76358q6072J60995J05113
$$ 200196 -6905 -64780 -42122 -136616 -224525 -247040 -349387 -173029 -259101 -98106 7007
15695G007p5690l1773k72775M4533K49363o17j36171N8345O1822N7654k9819j32800
$$ 7007 -68683 -100456 -373231 -328698 -79335 -79952 -216123 -157778 -95956 -38302 -68121 -200921
15683b00921j17396K36453J33125l8693j08367M2023j27859j5426K21916p8885
$$ -200921 -318317 -81864 51261 12568 -95799 -53776 -181635 -197061 24855 -54030
15673e4030q786L8212J08029L4827O4472r5505J06710m3822j04784o2547K05723
$$ -54030 -62816 -24604 83425 118252 182724 87219 193929 150107 45323 -17224 188499
15662A88499j13199k74552p4935J7990k6252l1275J05442J12929O0635N0980j21424
$$ 188499 75300 -199252 -274187 -256197 -282449 -313724 -208282 -95353 -34718 16262 -105162
15651a05162K432L24564J17378q5031p8152j54715j00660N1610J55522J21685
$$ -105162 -102730 221834 339212 254181 176029 21314 -79346 -27736 127786 249471
15641B49471k00638j97927J29684Q2780k14137j45732N0946k6621L9596m6467
$$ 249471 48833 -149094 -19410 63370 -150767 -296499 -245553 -272174 -232578 -279045
15631b79045j30274J64400K35255J05501j38944j3040j55491j57655K6998J68222
$$ -279045 -409319 -244919 -9664 95837 -43107 -56147 -211638 -369293 -342295 -174073
15621a74073Q1169j44432J3178P3622J25230O4600K5502L0214j29871P5363P7173
$$ -174073 -92904 -237336 -224158 -150536 -25306 39294 64796 95010 -34861 40502 117675
15610A17675K00609Q1864k59689K5023K4563o9285P2164q2138j52468o2709L13776
$$ 117675 318284 400148 140459 165482 190045 120760 192924 110786 -41682 -104391 209385
15599B09385K36704j45824j15217J14737r490M016j45202j22503M4337J64105
$$ 209385 446089 300265 185048 299785 290295 294311 149109 26606 70943 235048
15589B35048J27188r9268k19660p3256J66029J3390k00416p4121J34270q545R2329
$$ 235048 362236 262968 43308 -29948 136081 149471 -50945 -125066 9204 659 92988
15578I2988L1995j56988o702k6322N1000l9818J72303J68203K4815k31819M1603
$$ 92988 124983 -32005 -38707 -65029 -14029 -53847 118456 286659 311474 79655 121258
15567A21258j14265L5914o2570Q838j23076o8592K26609N7052l7114k8036q2270
$$ 121258 6993 42907 -19663 -10825 -133901 -202493 24116 81168 44054 16018 -66252
15556f6252K0435r1342N760j91883K2824K16944J8078j24022L4448j21513m1605
$$ -66252 -45817 -137159 -131399 -323282 -300458 -83514 -65436 -189458 -155010 -276523 -318128
15545c18128k3424J69829K50164L7305P0126N0259j44160k13832M0555m8507J27886
$$ -318128 -341552 -171723 78441 115746 185872 236131 91971 -121861 -81306 -129813 -1927
15534a927J13898J16450q6946q0697j20044n49J58431J40940M54j15564j76050
$$ -1927 111971 228421 141475 60778 -59266 -59815 98616 239556 240010 124446 -51604
15523e1604K1339m8066J14562J87323j33664j52688k0448j2077K8736Q114n6164
$$ -51604 -30265 -78331 36231 223554 89890 -62798 -83246 -95323 -66587 -58473 -114637
15512a14637M8179J67734J02283j96977J83010J8203K0383M6625p9416j7976M1278
$$ -114637 -66458 101276 203559 6582 189592 207795 228178 274803 195387 177411 218689
15501B18689q8829j10184J0554r9346j03998L6038R2716K77672J6907j41774k18651
$$ 218689 129860 19676 30230 -69116 -173114 -137076 -44360 233312 250219 108445 -110206
15490a10206l2349J72701j35982j82945j84594P2359J20500Q1843k8729n371K97680
$$ -110206 -142555 30146 -105836 -288781 -473375 -401016 -280516 -198673 -227402 -232773 64907
15479F4907J0035k7015Q2344P8920j20937j59981K5237J37981l2309r1542J16111
$$ 64907 74942 47927 130271 209191 88254 -71727 -46490 91491 59182 -32360 83751
15468H3751q7500j54987L7693j52173k8307m5769J64640O5027J7833m8519j1553
$$ 83751 -3749 -158736 -121043 -273216 -301523 -347292 -182652 -117625 -99792 -148311 -159864
15457a59864P4779j36706j07721n4295J55948J33971Q3897L23435J97546o2965
$$ -159864 -85085 -221791 -329512 -383807 -227859 -93888 -9991 313444 510990 448025
15447D48025j00230k54746O1680J24158j51326k04722j21172q2657J56397j3816
$$ 448025 347795 93049 154729 278887 127561 -77161 -198333 -280990 -124593 -138409
15437a38409j18031J26781m05R1990j22131Q5944L15050J01427J7527q5746j7896
$$ -138409 -256440 -129659 -130064 -38074 -160205 -74261 240789 342216 359743 273997 256101
15426B56101p4570j44477r7624j53734j11914J94078J98120J24144k1903m9235
$$ 256101 181531 37054 -60570 -214304 -326218 -132140 65980 190124 168221 118986
15416A18986p0063r886M1519M6329r3527j25002Q0532j30308l0456K3371Q2041
$$ 118986 48923 39037 80556 126885 33358 -91644 -11112 -141420 -171876 -148505 -66464
15405f6464M0619J19515L2470l919q3559j58323j14370K12180J03038j1512l5418
$$ -66464 -25845 93670 126140 122221 38662 -119661 -234031 -21851 81187 69675 34257
15394C4257P6822j25570j26070K73591L55838j54185m19766o6843R523J81787
$$ 34257 111079 -14491 -140561 133030 488868 334683 -85083 -151926 -142403 39384
15384C9384K790o4502J52374L5382r4084L7077k9480l1557l2586j50894k51185
$$ 39384 42174 -22328 130046 165428 71344 108421 78941 47384 14798 -136096 -387281
15373c87281k1147m28K8240L4510K55214Q7745L6992l6863k6126M3642m3328k01950
$$ -387281 -408428 -408856 -380616 -346106 -90892 -3147 33845 -3018 -29144 14498 -28830 -230780
15361b30780L7391O1060R5687n8543p1388r3075q0805J08378K1806j4842J0226
$$ -230780 -193389 -132329 -36642 -95185 -166573 -259648 -340453 -232075 -210269 -225111 -214885
15350b14885J93220j34849J4557O3983J02469j01320j37121K5360J53246P8057
$$ -214885 -21665 -156514 -141957 -77974 24495 -76825 -213946 -188586 -35340 42717
15340D2717L0502o4910k2546J10104L9151M5352N2890J6311l8122R378J62282
$$ 42717 73219 8309 -14237 95867 135018 180370 233260 249571 211449 220827 383109
15329C83109M8301j02664k40805Q6585p0352P6402j44330j27182Q5159J76432
$$ 383109 431410 328746 87941 174526 104174 180576 36246 -90936 -5777 170655
15319A70655K11623q0678j07915j37904j1464j23358P2345K02166m4727j6308
$$ 170655 382278 301600 193685 55781 44317 -79041 -6696 195470 150743 134435
15309A34435J43930k7364L2706n7640p0375O3198J10694j81885k28935j55265
$$ 134435 278365 251001 283707 226067 155692 218890 329584 147699 -81236 -236501
15299b36501N7908l2823j29636J2541n0495O5248J36710j5940P5341L0110R1183
$$ -236501 -178593 -211416 -341052 -328511 -379006 -313758 -177048 -192988 -117647 -87537 3646
15288C646Q3333k41312j01796Q4218j0859J07319l8313J13472J62819k6699m7161
$$ 3646 86979 -154333 -256129 -171911 -182770 -75451 -113764 -292 162527 135828 88667
15277H8667O886R8189j22325j91458k258K3592M3970r3945k94515n8282L13576
$$ 88667 95553 193742 71417 -120041 -122299 -98707 -54737 -148682 -443197 -501479 -187903
15266a87903Q5574j53263j5408J36450J23766j02893O3646J11401K7216n5415
$$ -187903 -102329 -255592 -271000 -134550 -10784 -113677 -50031 61370 88586 33171
15256C3171k51152k89172M6123K50875K2618o402o1924J26237K60915Q6675k16303
$$ 33171 -217981 -507153 -461030 -210155 -187537 -193939 -255863 -129626 131289 217964 1661
15245A661j91916j86408J0696J28363k4009J51768J38346l3902j1451M0098j1547
$$ 1661 -190255 -376663 -365967 -237604 -261613 -109845 28501 -5401 -16852 23246 11699
15234A1699J05172J8046k33276j48576N04r9945l1891J82736K11009N7752r6232
$$ 11699 116871 134917 -98359 -246935 -246431 -346376 -378267 -195531 15478 73230 -23002
15223b3002k955M9618n9577p5090J25348J87198K46699P4678j62988j65356J0522
$$ -23002 -25957 23661 -35916 -111006 14342 201540 448239 522917 359929 194573 205095
15212B05095J55191k1462k27605k26910r9848K42285P4616R8658J09519j92595
$$ 205095 360286 338824 111219 -115691 -215539 26746 101362 200020 309539 116944
15202A16944n2678Q9421K08731n8209j11602l23096o6929J75818O4573o2424N5673
$$ 116944 64266 153687 362418 304209 192607 -130489 -197418 -21600 42973 -19451 36222
15191C6222r698O5865J14844K14776L63j76839k20770j88325O1433L31996p1823
$$ 36222 26524 92389 207233 422009 422372 245533 24763 -163562 -102129 229867 158044
15180A58044n3748O0816j3030K4754O093p3733J05135J98654j19613J791j7719
$$ 158044 104296 165112 152082 176836 182929 109196 214331 412985 293372 295163 277444
15169B77444J91666q4778j34517o2624o40l6240j40678j3413j09820J25932K60200
$$ 277444 469110 384332 249815 187191 186551 150311 9633 -3780 -113600 12332 272532
15158B72532J2934J0666N6448n6718j06533o8378k38165J55012R6526R508r7739
$$ 272532 285466 296132 352580 295862 189329 120951 -117214 37798 134324 143832 46093
15147D6093o5969n6331O3784j9174J6669J47902K27507J06875j78408k01545l8783
$$ 46093 -19876 -76207 -12423 -31597 -14928 132974 360481 467356 288948 87403 48620
15136D8620j41560j91358J53668K69450n1500j71270j43319J18348K42220M5448
$$ 48620 -92940 -284298 -130630 138820 87320 -83950 -227269 -108921 133299 178747
15126A78747Q8394q5985l8084O9370j18018o5870P1042K64339L0962j28221j63885
$$ 178747 267141 181156 143072 212442 94424 28554 99596 363935 394897 266676 102791
15115A02791r1101j27349k07288k8188K92398l9878r3172p0815M8445O0620O0190
$$ 102791 11690 -115659 -322947 -351135 -58737 -98615 -191787 -262602 -214157 -153537 -93347
15104i3347R8043K5547r8011q5509J74864K11865J10323k54306j59233N218r9131
$$ -93347 4696 30243 -67768 -153277 21587 233452 343775 89469 -69764 -64546 -163677
15093a63677l166l6731j42875R5322J95429J51321J46087k386j36006J14275L7674
$$ -163677 -166843 -203574 -346449 -251127 -55698 95623 241710 239324 103318 217593 255267
15082B55267J0636k38655j40614k05908M9828K5487J72590p2007j35591r9241
$$ 255267 265903 27248 -113366 -319274 -269446 -243959 -71369 -143376 -278967 -378208
15072c78208M8795p8218o8192J40343J57877r0597J31778K08673P3344P726J1367
$$ -378208 -329413 -407631 -475823 -335480 -177603 -268200 -136422 72251 145595 153321 164688
15061A64688L4228K2697j78398o6521j8822P1190j29134j4651K7609j59506J03026
$$ 164688 198916 221613 43215 -23306 -42128 29062 -100072 -114723 -87114 -246620 -143594
15050a43594L6269J61623j7626j20383J22978K35447O1637p7405J0585j83420
$$ -143594 -107325 54298 36672 -83711 39267 274714 336351 258946 269531 86111
15040H6111j35450L46M5913j18169J17410J5224k1461o0104j01782k5376N4683
$$ 86111 -49339 -48993 -3080 -121249 -3839 11385 -10076 -70180 -171962 -197338 -142655
15029a42655O0979J05065M523K4489J85537J31899k84876j62797j49244K23725
$$ -142655 -81676 23389 27912 52401 237938 369837 84961 -77836 -227080 -3355
15019c355J0184L5064k0773Q085J47465l7858Q1527K0446o6568j18750M0740m0774
$$ -3355 6829 41893 21120 29205 176670 138812 220339 240785 174217 55467 96207 55433
15007E5433j27132j35945J28927M3940Q1279J01762k3407j70945p6693J72896
$$ 55433 -71699 -207644 -78717 -34777 46502 148264 124857 -46088 -122781 50115
14997E0115j08360j42915m0431L48420j38046j31011L8135J40008m9901j23437
$$ 50115 -58245 -201160 -241591 106829 -31217 -162228 -124093 15915 -33986 -157423
14987a57423J06939K95633l0263k38752k5956J12552R3358j02983l29338j21095
$$ -157423 -50484 245149 214886 -23866 -49822 62730 156088 53105 -276233 -397328
14977c97328M26732L32927n713j5106j22372O8217n35j32231j52935j02905o2799
$$ -397328 29404 362331 356618 341512 219140 287357 286822 154591 1656 -101249 -164048
14966a64048J002J38991k4928j20624j71710p6978j12450J37911K45643J32340
$$ -164048 -163046 -24055 -48983 -169607 -341317 -418295 -530745 -392834 -147191 -14851
14956a4851q5846j70808j00388K14438J64715j014j13171k2812K3563O7289J14764
$$ -14851 -100697 -271505 -371893 -157455 7260 6246 -106925 -129737 -106174 -38885 75879
14945G5879n4313n053K82424k0262j52563n1113j37796j31757o5220J72399J17378
$$ 75879 21566 16513 298937 278675 126112 74999 -62797 -194554 -259774 -87375 30003
14934C0003R0009Q9488R8667k8893K11j10804m8121l4258o21J17462r2789o0387
$$ 30003 120012 209500 308167 279274 279485 168681 120560 86302 85681 203143 110354 49967
14922D9967J66379M0657l06942j71929j46134M1562J05465O5221j3493K0314J54727
$$ 49967 216346 257003 -49939 -221868 -368002 -326440 -220975 -155754 -169247 -148933 5794
14911E794J29565J59706O3980n3854q4591j12654o788L6769m4685n6873J24108
$$ 5794 135359 295065 359045 305191 220600 107946 101158 137927 93242 36369 160477
14900A60477O0676N1891m325j26312r2127o7513R0269p4925N067r9759j05936
$$ 160477 221153 273044 268719 142407 50280 -17233 73036 -1889 3178 -96581 -202517
14889b02517m8820O0835J25603n5986J66406R6022k26611j22035m0203O81N3291
$$ -202517 -251337 -190502 -64899 -120885 45521 141543 -85068 -207103 -247306 -246625 -193334
14878a93334L5772J78207Q6300m2468j7972q81l6437n6582J2011J1771L6680J60791
$$ -193334 -157562 20645 106945 64477 46505 45624 9187 -47395 -35384 -23613 13067 173858
14866A73858l7248r9617m9374L8456j05624J24814k1039P5337O7236M907j72496
$$ 173858 136610 36993 -12381 26075 -79549 45265 24226 99563 166799 171706 -790
14855g90q9042Q5889J10400p4292j6128J74693N1572k7100j19950n4537l1815
$$ -790 -89832 -3943 106457 32165 16037 190730 242302 215202 95252 40715 8900
14844H900n5559O9511Q3012j91409J9570K69485R8597m4693j48652R8704P6060
$$ 8900 -46659 22852 105864 -85545 -65975 203510 302107 257414 108762 207466 283526
14833B83526O694q2973j05648j67708o301O6750J85143K7848M3403K7296Q8192
$$ 283526 290220 207247 101599 -66109 -72410 -5660 179483 207331 250734 278030 366222
14822C66222k10498k43118k0290j48536L5639K11152P1664j22358j33185O4929
$$ 366222 155724 -87394 -107684 -256220 -220581 -9429 62235 -60123 -193308 -128379
14812a28379j51673j96303J23109Q698N6344L6912L8528L26333P0067o7807j23846
$$ -128379 -280052 -476355 -353246 -344548 -288204 -251292 -212764 113569 183636 115829 -8017
14801h017Q6748j85540o7235J26245J80678M4439N8839n0235j67566l872j8934
$$ -8017 78731 -106809 -174044 -47799 132879 177318 236157 185922 18356 14484 -4450
14790d450O897j3542J34932j50771j51915O1192K2815Q0146L1297N9214n2272
$$ -4450 2447 -11095 123837 -26934 -178849 -117657 -94842 -14696 16601 75815 23543
14779B3543l15414L2792q130R0285L7949p5873J98899o1294K20042J03144j74138
$$ 23543 -291871 -259079 -267209 -176924 -138975 -214848 -15949 -77243 142799 245943 71805
14768G1805n4874J75366L9291k3527n7868m1751j79393p837l7032J15194m6634
$$ 71805 16931 192297 231588 208061 150193 108442 -70951 -78788 -115820 -626 -47260
14757d7260J1431K8476O146J6031q2102N9607J3357J59039K7428p4447M5479j41299
$$ -47260 -35829 -7353 -1207 14824 -67278 -7671 5686 164725 192153 117706 163185 21886
14745B1886j5723N2848L5455K7093j22046j29818l3990K61360r2182M2761L5647
$$ 21886 6163 59011 94466 121559 -487 -130305 -164295 97065 4883 47644 83291
14734H3291p7342r9439n8326J57151N4131k9578l6202k5325r0697o1744n9733
$$ 83291 5949 -93490 -151816 5335 59466 29888 -6314 -31639 -122336 -184080 -243813
14723b43813M7104j02070K46986J78801J02639Q8249m0679j34104P9654N8124
$$ -243813 -196709 -298779 -51793 127008 229647 317896 277217 143113 222767 280891
14713B80891j60991q4925p6608J5625N6752P2989o4713q8094J02326N9536j522
$$ 280891 119900 34975 -41633 -26008 30744 103733 39020 -49074 53252 112788 111266
14702A11266j41193J31205J85461j80956J0296n4547j30375r5873L205J173j84182
$$ 111266 -29927 101278 286739 105783 116079 61532 -68843 -164716 -161511 -160338 -344520
14691c44520J0941J35782J95912R8640M8124k65387K4682Q0138K0757p8328j45649
$$ -344520 -333579 -197797 -1885 96755 144879 -120508 -95826 -15688 5069 -73259 -218908
14680b18908j7188k1914P4985J04062p3003j64564p8342K2590P8857K4113J4959
$$ -218908 -236096 -258010 -183025 -78963 -151966 -316530 -394872 -372282 -293425 -269312 -254353
14669b54353J74406k4054J38008J16919n0642k35097j85291q4051Q2428K47233
$$ -254353 -79947 -104001 34007 150926 100284 -134813 -320104 -404155 -321727 -74494
14659g4494N7862N7795k6254R6228O8315j36683r1998J91026l3972p7363j9625
$$ -74494 -16632 41163 14909 111137 179452 42769 -49229 141797 107825 30462 10837
14648A0837Q1756j4614k31625j3885r854Q0348n7104k29562O7478J24382r8054
$$ 10837 92593 77979 -153646 -167531 -177385 -97037 -154141 -383703 -316225 -191843 -289897
14637b89897m9660K29785K64903L5840l3720j10121j13700l6314J22965q9867
$$ -289897 -339557 -109772 155131 190971 157251 47130 -66570 -102884 20081 -69786
14627f9786j36614K6463J56039K21604r4248n3512J29191R0148j13730j65164
$$ -69786 -206400 -179937 -23898 197706 103458 49946 179137 269285 155555 -9609
14617i609j02392J41822J41762j20006r4277K16573j17976j73513J71683j32615
$$ -9609 -112001 29821 171583 51577 -42700 173873 55897 -117616 54067 -78548
14607g8548J67457p6836R9533K3626M07j16020O0195L17906Q3385j25462j84396
$$ -78548 88909 12073 111606 135232 135639 19619 79814 397720 481105 355643 171247
$$ [...]
##END NTUPLES=NMR SPECTRUM
##END=
