##TITLE=Analysis number 312032
Compound Code cc 33804
Book Reference 416/192
Project Code adrs
Chemist Name stevep
##JCAMPDX= 6.0         $$ Bruker NMR JCAMP-DX V2.0
##DATA TYPE= NMR SPECTRUM
##DATA CLASS= NTUPLES
##ORIGIN= Bruker BioSpin GmbH
##OWNER= NMR
$$ XWIN-NMR		Version 3.5
$$ Thu Jul 21 14:54:53 2005 GMT Daylight Time (UT+1h)  MAYBRIDGE\NMR@NMR_250MHZ
##.OBSERVE FREQUENCY= 250.131544655141
##.OBSERVE NUCLEUS= ^1H
##.ACQUISITION MODE= SIMULTANEOUS (DQD)
##.ACQUISITION SCHEME= undefined
##.AVERAGES= 16
##.DIGITISER RES= 18
##SPECTROMETER/DATA SYSTEM= dpx250
##.PULSE SEQUENCE= zg30
##.SOLVENT NAME= CDCl3
##.SHIFT REFERENCE= (INTERNAL, CDCl3, 0, 16.522)
##AUDIT TRAIL= $$ (NUMBER, WHEN, WHO, WHERE, WHAT)
$$ ##TITLE= Audit trail, XWIN-NMR		Version 3.5
$$ ##JCAMPDX= 5.01
$$ ##ORIGIN= Bruker BioSpin GmbH
$$ ##OWNER= NMR
$$ C:\u/data/dgb/nmr/ADRS/6310/pdata/1/auditp.txt
$$ ##AUDIT TRAIL=  $$ (NUMBER, WHEN, WHO, WHERE, WHAT)
(   1,<2005-07-21 14:54:31.89 +100>,<MAYBRIDGE\NMR>,<NMR_250MHZ>,
      <created by zg, POWCHK disabled, PULCHK disabled
       configuration hash MD5:
       62 19 C7 07 E1 42 D1 B7 37 6C 3D D0 77 39 F9 E6
       data hash MD5: 64K
       EE 31 4C 63 22 05 6C AE EC CF A5 8A 61 A2 C4 3F>)
(   2,<2005-07-21 14:54:44.21 +100>,<MAYBRIDGE\NMR>,<NMR_250MHZ>,
      <Start of raw data processing
       ef LB = 0.3 FT_mod = 6 PKNL = 1 SI = 32K 
       data hash MD5: 32K
       BD CA 03 D8 1C BC 39 CD 1F 6B 61 64 ED D6 F5 D8>)
(   3,<2005-07-21 14:54:45.96 +100>,<MAYBRIDGE\NMR>,<NMR_250MHZ>,
      <apk 
       data hash MD5: 32K
       5B E3 26 D6 26 27 C0 FE AC 99 B0 30 9B DE 32 6F>)
(   4,<2005-07-21 14:54:46.71 +100>,<MAYBRIDGE\NMR>,<NMR_250MHZ>,
      <abs ABSG = 5 
       data hash MD5: 32K
       83 47 C6 81 01 97 A0 B3 F6 F8 CD 72 32 9B C7 F6>)
$$ ##END=
$$ 
$$ hash MD5
$$ 29 77 13 82 1C FA BB D3 1B 4A C8 50 A3 DA 83 D7
##$RELAX= 
##$RELAX= 
##$RELAX= 
##$RELAX= 
##$RELAX= 
##$RELAX= 
##$RELAX= 
$$ Bruker specific parameters
$$ --------------------------
##$DU= <C:\u>
##$EXPNO= 6310
##$NAME= <ADRS>
##$PROCNO= 1
##$TYPE= <nmr>
##$USER= <dgb>
##$AMP= (0..31)
100 100 100 100 100 100 100 100 100 100 100 100 100 100 100 100 100 100 
100 100 100 100 100 100 100 100 100 100 100 100 100 100 
##$AQSEQ= 0
##$AQ_mod= 3
##$AUNM= <au_zg>
##$AUTOPOS= <37 >
##$BF1= 250.13
##$BF2= 250.13
##$BF3= 250.13
##$BF4= 250.13
##$BF5= 500.13
##$BF6= 500.13
##$BF7= 500.13
##$BF8= 500.13
##$BYTORDA= 1
##$CFDGTYP= 0
##$CFRGTYP= 5
##$CHEMSTR= <none>
##$CNST= (0..31)
1 1 145 1 1 1 1 1 1 1 1 1 1 1 1 1 1 1 1 1 1 1 1 1 1 1 1 1 1 1 1 1 
##$CPDPRG= <>
##$CPDPRG1= <>
##$CPDPRG2= <>
##$CPDPRG3= <>
##$CPDPRG4= <mlev>
##$CPDPRG5= <mlev>
##$CPDPRG6= <mlev>
##$CPDPRG7= <mlev>
##$CPDPRG8= <mlev>
##$CPDPRGB= <>
##$CPDPRGT= <>
##$D= (0..31)
0 1 0 0 0 0 0 0 0 0.06 0 0 0 0 0 0 0.0002 0 0 0 0 0 0 0 0 0 0 0 0 0 0 
0 
##$DATE= 1121954071
##$DBL= (0..7)
120 120 120 120 120 120 120 120 
##$DBP= (0..7)
150 150 150 150 150 150 150 150 
##$DBP07= 0
##$DBPNAM0= <>
##$DBPNAM1= <>
$$ [...]
##$SUBNAM7= <"">
##$SUBNAM8= <"">
##$SUBNAM9= <"">
##$SW= 20.6930455092707
##$SWIBOX= (0..15)
0 0 3 0 0 0 0 0 0 0 0 0 0 0 0 0 
##$SW_h= 5175.983436853
##$TD= 65536
##$TD0= 1
##$TE= 295.16
##$TE2= 300
##$TE3= 300
##$TEG= 300
##$TL= (0..7)
0 120 120 120 120 120 120 120 
##$TP= (0..7)
150 150 150 150 150 150 150 150 
##$TP07= 0
##$TPNAME0= <>
##$TPNAME1= <>
##$TPNAME2= <>
##$TPNAME3= <>
##$TPNAME4= <>
##$TPNAME5= <>
##$TPNAME6= <>
##$TPNAME7= <>
##$TPOAL= (0..7)
0.5 0.5 0.5 0.5 0.5 0.5 0.5 0.5 
##$TPOFFS= (0..7)
0 0 0 0 0 0 0 0 
##$TUNHIN= 0
##$TUNHOUT= 0
##$TUNXOUT= 0
##$USERA1= <user>
##$USERA2= <user>
##$USERA3= <user>
##$USERA4= <user>
##$USERA5= <user>
##$V9= 5
##$VALIST= <valist>
##$VCLIST= <CCCCCCCCCCCCCCC>
##$VD= 0
##$VDLIST= <DDDDDDDDDDDDDDD>
##$VPLIST= <PPPPPPPPPPPPPPP>
##$VTLIST= <TTTTTTTTTTTTTTT>
##$WBST= 1024
##$WBSW= 4
##$XGAIN= (0..3)
0 0 0 0 
##$XL= 0
##$YL= 0
##$YMAX_a= 415853
##$YMIN_a= -483844
##$ZGOPTNS= <>
##$ZL1= 120
##$ZL2= 120
##$ZL3= 120
##$ZL4= 120
##$ABSF1= 16.522
##$ABSF2= -4.171173
##$ABSG= 5
##$ABSL= 3
##$ALPHA= 0
##$AQORDER= 0
##$ASSFAC= 0
##$ASSFACI= 0
##$ASSFACX= 0
##$ASSWID= 0
##$AUNMP= <proc_1d>
##$AZFE= 0.1
##$AZFW= 0.1
##$BCFW= 0
##$BC_mod= 0
##$BYTORDP= 0
##$COROFFS= 0
##$CY= 12.5
##$DATMOD= 1
##$DC= 0
##$DFILT= <>
##$DTYPP= 0
##$F1P= 14.0000005364418
##$F2P= -0.99999901652339
##$FCOR= 0.5
##$FTSIZE= 32768
##$FT_mod= 6
##$GAMMA= 0
##$GB= 0
##$INTBC= 1
##$INTSCL= 1
##$ISEN= 128
##$LB= 0.3
##$LEV0= 0
##$LPBIN= 0
##$MAXI= 10000
##$MC2= 0
##$MEAN= 0
##$ME_mod= 0
##$MI= 0
##$NCOEF= 0
##$NC_proc= -4
##$NLEV= 6
##$NOISF1= 0
##$NOISF2= 0
##$NSP= 0
##$NTH_PI= 0
##$NZP= 0
##$OFFSET= 16.522
##$PC= 1
##$PHC0= -79.71349
##$PHC1= 5.471076
##$PH_mod= 1
##$PKNL= yes
##$PPARMOD= 0
##$PSCAL= 4
##$PSIGN= 0
##$REVERSE= no
##$SF= 250.13
##$SI= 32768
##$SIGF1= 0
##$SIGF2= 0
##$SINO= 400
##$SIOLD= 32768
##$SREGLST= <1H.CDCl3>
##$SSB= 0
##$STSI= 32768
##$STSR= 0
##$SW_p= 5175.98343685301
##$SYMM= 0
##$S_DEV= 0
##$TDeff= 65536
##$TDoff= 0
##$TI= <Analysis number 999999
Compound Code 99
Book Reference 9
Project Code 9>
##$TILT= no
##$TM1= 0
##$TM2= 0
##$TOPLEV= 0
##$USERP1= <user>
##$USERP2= <user>
##$USERP3= <user>
##$USERP4= <user>
##$USERP5= <user>
##$WDW= 1
##$XDIM= 32768
##$YMAX_p= 298733734
##$YMIN_p= -222922
$$ End of Bruker specific parameters
$$ ---------------------------------
##NTUPLES= NMR SPECTRUM
##VAR_NAME=  FREQUENCY,     SPECTRUM/REAL,   SPECTRUM/IMAG
##SYMBOL=    X,             R,               I
##VAR_TYPE=  INDEPENDENT,   DEPENDENT,       DEPENDENT
##VAR_FORM=  AFFN,          ASDF,            ASDF
##VAR_DIM=   32768,         32768,           32768
##UNITS=     HZ,            ARBITRARY UNITS, ARBITRARY UNITS
##FACTOR=    0.157963299565203, 1,           1
##FIRST=     4132.6476996994, 0,             0
##LAST=      -1043.33573715361, 0,           0
##MIN=       -1043.33573715361, -222922,     0
##MAX=       4132.6476996994, 298733734,     0
$$ Real data points
##PAGE= N=1
##DATA TABLE= (X++(R..R)), XYDATA
$$ [...]
17399E5663L4034k6220n1110k838P6069O4245m4044o0959m9209m7688k038r416
17387f3511j0143N0571j5461k098L4407k0602L7695O1690j581n9743j6970J3690
17375G944Q9487O778p0904n5987m1717J0437K1091P770N0491K2757n778j6512
17363B5857j5278p876p9113m5623K9737N1760K9528p595K9839N6107J266J8166
17351H6775m8739j7313k3669K8893m3926o6226L527K8592L289K4540K0319K2916
17339A8978L1068J4151j9013l1231L7244j3732q9668m3233J2759j7595R979K9420
17327f0873M8100O5921L9m6000R78K266l0389N497K4281M522l0992K5126j8695
17314a0219r2880O919M8739J3348J8593L2628J8214k3416l2351R611K9241M3251
$$ plain form
17399 55663 89697 63477 12367 9529 85598 149843 105799 44840 -4369 -52057 -54095 -63511
17387 -63511 -73654 -23083 -38544 -40642 -6235 -26837 10858 72548 70967 11224 -5746 7944
17375 7944 97431 104209 33305 -22682 -64399 -53962 -32871 -25101 25390 48147 42369 25857
17363 25857 10579 2703 -76410 -122033 -92296 -40536 -11008 -18603 11236 67343 68609 86775
17351 86775 38036 20723 -2946 25947 -17979 -84205 -80678 -52086 -48797 -24257 -3938 18978
17339 18978 50046 64197 45184 13953 51197 37465 -52203 -95436 -82677 -100272 -90293 -60873
17327 -60873 -12773 53148 53187 7187 8165 10431 -19958 -14461 9820 14342 -16650 8476 -10219
17314 -10219 -103099 -96180 -47441 -34093 -15500 17128 35342 11926 -20425 -10814 18427 61678
17302F1678l1821k0546O1319N4250J2402j05554N17J6778n684r9723O7832M0326
17290E1774K6434k0241k5135K9668K9032L1314m7202k484p2681m4237L9755N916
17278A913m5676L8295L3781K0643N358J6164K286l0063n4708J082J9879j455L3356
17265D0855P2423n828j05196J3722Q530J78k7227J5830L8908J9559k374o1996
17253G384p694K2833j7116K350M7089J2239K1227k1213l5606P019l4575J242J7399
17240B2578o4402m5587L6090N9800P9488K5116l2744o6221k8113K3542K2504l8135
17228f084l2100N3064J2720j7158J0976O3358m68O537o0478J6110K970l0850K727
17215B1324j4308N4057j3890o5340J4747j887o979r665J0458l717K5520l223k2427
$$ plain form
17302 61678 29857 9311 70630 124880 137282 31728 32245 49023 43339 -56384 11448 51774
17290 51774 78208 57967 32832 62500 91532 122846 75644 73160 479 -43758 -4003 1913
17278 1913 -43763 -5468 28313 48956 54314 70478 72764 42701 -12007 -10925 8954 7499 40855
17265 40855 113278 107450 2254 15976 24506 24684 -2543 13287 52195 71754 69380 7384
17253 7384 -310 22523 5407 7757 54846 67085 88312 67099 31493 38512 3937 5179 22578
17240 22578 -41824 -87411 -51321 8479 87967 113083 80339 14118 -13995 9547 32051 -6084
17228 -6084 -38184 14880 27600 10442 21418 84776 84308 90845 30367 46477 49447 18597 21324
17215 21324 7016 61073 47183 -18157 -3410 -5297 -12276 -21941 -11483 -15200 10320 7097 -15330
17202a5330N3596l571N88L976q006J526m7248K2940K1894l9353l5696n915K3951
17189b6648O1755M0088n299j4126j9689n5930r764O698k940J163m836M4440J1373
17176B6285K4486J5652M765j4275n6382m1205J9562N9040M5309m1957m3568n520
17164g808M487n1746K0170O2107K5968O5447K9403q5940n5287R118l089o5196
17152e2366R963M941o100p2689j9683j358k5063K3388P3787M1049N4039L9429
17140F9337J1882n1352k6338j421m2671P85K8573K0904K6287j5467k9960k2977
17128c2418o5136L616R029J7696j0134K6280O9664k5936q519n1187J6530L4066
17116a6449K209j4020j7086K5697L3110l6508p8385Q859R704M5107J04907O1628
$$ plain form
17202 -15330 38266 34695 35283 39259 31253 32779 -14469 8471 30365 -8988 -44684 -50599 -26648
17189 -26648 35107 75195 69896 55770 36081 -19849 -29613 -22915 -25855 -24692 -29528 14912 26285
17176 26285 50771 66423 71188 56913 531 -40674 -21112 37928 83237 41280 -2288 -7808
17164 -7808 -3321 -55067 -34897 27210 53178 118625 148028 62088 6801 15919 12830 -52366
17152 -52366 -42403 -37462 -43562 -116251 -135934 -137292 -162355 -138967 -65180 -24131 29908 69337
17140 69337 81219 29867 3529 2108 -40563 -39778 -11205 9699 35986 20519 -9441 -32418
17128 -32418 -97554 -93938 -84909 -67213 -77347 -51067 18597 -7339 -15858 -67045 -50515 -16449
17116 -16449 -14240 -28260 -45346 -19649 13461 -23047 -101432 -92573 -82869 -37762 67145 128773
17104A28773l9841m3277m2142L9596P310n0512M056K590j0881K860K1430K0990
17092D0952R101j5676o786j500k1318K2185N7464l3608l905K3372r814J359M0593
17079A02419m1217p2507N0208L0769m8471k3981j0200k1728k0360J3927J8966
17068b2175J1547N612n059J0301j809m4335J4485N3212M7394N8929l0670j5575
17056H1857O583N418l7858o7611p407O7127N0203L2857j8521j20476o0182n1758
17044a19768M289k1509L9874Q464j1133O4826M5509o51N451m6904l9498M6815
17032b4235K1703j1136J7963o9258j2879M0091K7920J6095K4338Q828l0855k8851
17020b0276M0910K8489n6603J9536j4727n3821k0135P1721K3687l7273J2572Q0164
$$ plain form
17104 128773 88932 45655 3513 43109 50419 -93 3963 6553 -4328 -1468 19962 40952
17092 40952 50053 34377 27591 26091 4773 26958 84422 50814 46909 70281 60467 61826 102419
17079 102419 61202 -11305 38903 69672 21201 -2780 -12980 -34708 -55068 -41141 -22175
17068 -22175 -10628 -5016 -10075 226 -1583 -45918 -31433 21779 69173 128102 97432 81857
17056 81857 88440 93858 56000 -11611 -19018 48109 98312 131169 112648 -7828 -68010 -119768
17044 -119768 -115479 -136988 -97114 -88650 -99783 -34957 10552 9901 15352 -31552 -71050 -24235
17032 -24235 -2532 -13668 4295 -64963 -77842 -37751 -9831 6264 30602 39430 8575 -20276
17020 -20276 20634 49123 -7480 12056 -2671 -56492 -76627 -4906 18781 -18492 -5920 74244
17008G4244m687j5352K1458k6524J1628j8757J1648J9679k5050n8796O7854L0920
16996H8265l5443m8910m3740k1573J12276J175l5306J3910J991k7678p0186l324
16984f8543p549O6209j1608J8097K4511o0483m762L9329R4603R06k9333j2101
16972D9276p37M8862k671m685L8681p171k5981M577o24p3212j1835k1882l3572
16959d0974N387L8165M476N638L892N0358n5200p1724m9177J6737M6260J4308
16947c1854j2951o511N1482J6936j1522j1008k769r89Q263n778L5428N225j7117
16934A6835k9105j1611N6811k9011L520j7511l6235J7001J3840j5914m9792J1597
16922f9575R2174J0584O463K5536K666j5744K1176q6798k8397j8417J3835K379
$$ plain form
17008 74244 69557 54205 75663 49139 60767 42010 53658 73337 48287 -10509 57345 88265
16996 88265 52822 3912 -39828 -61401 50875 52050 16744 30654 32645 4967 -65219 -68543
16984 -68543 -76092 -9883 -21491 -3394 21117 -39366 -44128 -4799 89804 90710 61377 49276
16972 49276 48539 97401 94730 90045 128726 121555 95574 100151 99527 26315 14480 -7402 -40974
16959 -40974 -35587 2578 7054 12692 16584 66942 11742 -59982 -109159 -92422 -46162 -31854
16947 -31854 -44805 -51316 166 17102 5580 -5428 -8197 -9186 -923 -6701 28727 33952 16835
16934 16835 -12270 -23881 32930 3919 7439 -10072 -46307 -29306 -15466 -31380 -81172 -69575
16922 -69575 22599 33183 39646 65182 67848 52104 73280 -13518 -41915 -60332 -46497 -44118
16910d4118k4819k9782k2122K8026J9745L6040j8174j2183L4453M1912k6983L0541
16898A2536K3727k3497n3940k8860L586j2527p591K8695j2891J3234J0675r7434
16886a44287p8635M8968M5721J8645K4303j241J4688O3754K4426n7591n6968l7735
16874a35952r048K0181L8908J6234N142N7088M8210m8358l8266p6485K4595O7135
16862c0616J9991j0051q0961J1107R0255N3426J8249l3188o0396K5131j6123M2126
16850B8950J7009m6982k6389N8976K3626l6095j5869m1674J1808L168j6638O1822
16838B1712K3549p821m112n180j0663Q998K013k9240p582q06O359q796M2197L4230
16824F4858l7003n3516K4713N492J1874K0810J1798k0642l9104K563J4253K9993
$$ plain form
16910 -44118 -68937 -98719 -120841 -92815 -73070 -37030 -55204 -67387 -32934 8978 -18005 12536
16898 12536 36263 12766 -41174 -70034 -66448 -78975 -86566 -57871 -70762 -57528 -46853 -144287
16886 -144287 -222922 -173954 -128233 -109588 -85285 -86526 -71838 -8084 16342 -41249 -98217 -135952
16874 -135952 -145000 -124819 -85911 -69677 -64535 -7447 40763 -7595 -45861 -122346 -97751 -30616
16862 -30616 -10625 -20676 -101637 -90530 -275 53151 71400 38212 -22184 2947 -13176 28950
16850 28950 45959 -1023 -27412 31564 55190 19095 3226 -38448 -26640 -23472 -40110 21712
16838 21712 45261 37440 33328 28148 17485 26483 28496 -744 -8326 -9132 -2773 -11569 30628 64858
16824 64858 27855 -25661 -948 4544 16418 37228 49026 28384 -10720 -8157 6096 36089
16812C6089J7966j8448o1854j1706R925m3508k4983J2642N973M3898q349k8262
16800g0617p3271J3201N0285N2082J7448J2894n2221m8703N1067Q4815J8344K589
16788E7913J1235l8980m1572p9328q821n92j333K0137N8466k480L42J1926j8874
16775c1961k2o870j2160J6640Q259J3595J6129l903j358j7493K7911J1604J7642
16762C8013n3594K415R692j5818L3397L8791m8479r105j8272p340J3282l1517
16750d8535K2337N2543Q410l5722J2518l1339j5071k402k468M2062L2195Q0574
16738A15102J4858k5559p5355k7657L9437k2897o190k0141L9036J2246K5459J1008
16726G9347M711l9980Q521p922J4569P764k774l8493j3400M7730L195m1188K9600
$$ plain form
16812 36089 54055 35607 -26247 -37953 -28028 -71536 -96519 -83877 -77904 -34006 -42355 -70617
16800 -70617 -143888 -130687 -80402 -28320 -10872 2022 -50199 -98902 -47835 36980 55324 57913
16788 57913 69148 30168 -11404 -90732 -99553 -100145 -101478 -81341 -22875 -25355 -25013 -13087 -31961
16775 -31961 -31983 -38853 -51013 -34373 -26114 -12519 3610 -293 -1651 -19144 8767 20371 38013
16762 38013 -15581 -13166 -3474 -19292 14105 52896 4417 -4688 -22960 -30300 -17018 -48535
16750 -48535 -26198 26345 34755 -967 11551 -19788 -34859 -37261 -39729 2333 34528 115102
16738 115102 129960 104401 29046 1389 40826 17929 11739 -8402 30634 42880 68339 79347
16726 79347 84058 44078 52599 44677 59246 67010 64236 25743 12343 60073 63268 22080 51680
16713E1680m4403m6737O6016J2399q58l6147j2312K6739M0662K6704m1032m7278
16701d567j7395l4019j6834J4825K8871P644K6784l3476m5898J0051L1587M0740
16689H313l0033q954L1605M0166M9043m958r555M1798n5612m7294M814o1664q344
16676e0675K671m518l3863N7177p971j9356J2873J992j5844k1109N494M6154n926
16663c2901j5283l8215J9961L0447M4218J9429o6423k9602j0585J8672O9545J4836
16651B4099O392L0531l9525J0094m1343j0749j3416K018q433k4847J3556O9662
16639A8039J9492j673q5451J804P428j4569K2466P5373L3750k3446l1474k4470
16627b731k2932o783J2326L6457p255L083N3086l3151m9124l794k511J3967M7751
$$ plain form
16713 51680 7277 -39460 26556 38955 38097 1950 -10362 16377 57039 83743 42711 -4567
16701 -4567 -21962 -55981 -72815 -57990 -29119 -21475 5309 -28167 -74065 -64014 -32427 8313
16689 8313 -21720 -30674 931 41097 90140 85182 75627 117425 61813 14519 19333 -42331 -50675
16676 -50675 -48004 -52522 -86385 -29208 -37179 -56535 -43662 -41670 -57514 -78623 -73129 -26975 -32901
16663 -32901 -48184 -86399 -66438 -35991 8227 27656 -38767 -68369 -78954 -60282 9263 24099
16651 24099 30491 61022 21497 31591 -9752 -20501 -33917 -31899 -40332 -65179 -51623 18039
16639 18039 37531 35858 -49593 -47789 -40361 -54930 -32464 42909 76659 53213 21739 -2731
16627 -2731 -25663 -32446 -20120 16337 9082 12165 65251 32100 -17024 -20818 -23329 -9362 38389
16614C8389j2078q573m703p7769n535J5821p21p748k0343p030L355l102K9387
16601f0650Q769o4014l1884j1198O3002M2815M6634K6434K0680N9914n701L611
16589I8412p14q4573o2939M000K3356r401N0113L8148l6854m7853K7104l3532
16577c4733j5725R471K2785q78m8417M0535O2307k5613m4348k079M9559M1377
16565E4241L376k229p048r731k2726k3889k6088l2958j6735j1574K7177K1105
16553d7079P8122K1158k2236N8398L31q1186K3846M927p6819m2812J9094L0699
16541c3557J07507M4659j6912k7907n1593j8018J182q710q6l660l183K166J6067
16528G955m8099M6139L9967j7296l9270n8175O8796Q1653l1600k3964K3654K253
$$ plain form
16614 38389 26311 17738 13035 -64734 -70269 -54448 -55169 -62917 -83260 -90290 -86935 -90037 -60650
16601 -60650 -51881 -115895 -147779 -158977 -95975 -53160 -6526 19908 40588 100502 94801 98412
16589 98412 97698 13125 -49814 -45814 -22458 -31859 18254 56402 19548 -28305 -1201 -34733
16577 -34733 -50458 -40987 -18202 -19080 -67497 -26962 35345 9732 -34616 -36695 12864 54241
16565 54241 57617 55388 48340 38609 15883 -8006 -34094 -67052 -83787 -95361 -68184 -47079
16553 -47079 31043 52201 29965 88363 88694 7508 31354 36281 -40538 -83350 -64256 -33557
16541 -33557 73950 118609 101697 73790 22197 4179 5361 -3349 -3435 -7095 -10278 -8112 7955
16528 7955 -40144 5995 45962 28666 -10604 -68779 17 81670 50070 26106 49760 52013
16516E2013k3943J1622l1888j8715J7097j5888R105M0378m2007o2006n098J7274
16504e2056j6500L4062P0429M7274Q0r6240n310L9751n4931j3655k5551l105O7629
16491h123J7129j1399m6508k044N433J5664k1223j9481K7602l3639K1953L3534
16479b1102N7480o467O577K2728O009p535n4034l7299j227P793j3302N5871O1527
16466G7019n107j503K8260j2612k1387n6644j1006m751o350n3027l8424M7993
16454e7539M5490K0189L5384J9933R659k7814n3442J3449M1905j2998o4700K3588
16442f896M1176l6947k750L6415k7781J2516N47o834k8342k7916K7898M049J853
16429a3012J1588O0068L068n3618L797K3221k6796R172l8019n6187K0648j9011
$$ plain form
16516 52013 28070 39692 7804 -10911 6186 -9702 -597 39781 -2226 -64232 -69330 -52056
16504 -52056 -68556 -34494 35935 83209 83289 -12951 -18261 21490 -33441 -47096 -72647 -75752 -8123
16491 -8123 9006 -2393 -48901 -50945 -45512 -29848 -51071 -70552 -42950 -76589 -54636 -21102
16479 -21102 36378 29911 36488 59216 65225 57690 3656 -33643 -34870 -27077 -40379 15492 77019
16466 77019 71912 70409 98669 86057 64670 8026 -2980 -7731 -14081 -67108 -105532 -57539
16454 -57539 -12049 8140 43524 63457 73116 45302 -8140 5309 47214 34216 -30484 -6896
16442 -6896 34280 -2667 -5417 30998 3217 15733 16280 9446 -18896 -46812 -18914 -14865 -13012
16429 -13012 -1424 58644 61712 8094 11891 35112 8316 17488 -20531 -76718 -56070 -75081
16417g5081l6226P1297L9451P26m4564m1113K9496Q699k2973l4270K8353L4822
16405d1383J8709J1836K7905M1088j7920o9045k9950K6051M4136J9432k1468n2932
16393d3541m7545l8789K2602l26j8404O1200N2567m7791l8399L2300K2428Q934
16381c4764K9896N3618l9017o24O546J8178J9452j2327l1200R258J193l046j6989
16368A74l0275m698M9115j5775J2792K1462M1571J6110m9998m6444K2692j113
16356A5613K6081L3745k8851M5069n002l7457o4221k6069L3109k0587k8890L394
16344e4066O0437P4317m3719k1260L375Q8923j7807r1352m4314K1695J7113K9591
16332B2933l4638l4308m4175Q3721R3421q987l6848l1763n199k8173j4001j5883
$$ plain form
16417 -75081 -111307 -40010 -559 167 -44397 -85510 -56014 -47315 -70288 -104558 -76205 -41383
16405 -41383 -22674 -10838 17067 58155 40235 -28810 -58760 -32709 11427 30859 9391 -43541
16393 -43541 -91086 -129875 -107273 -107599 -126003 -64803 -12236 -60027 -98426 -66126 -43698 -34764
16381 -34764 -4868 48750 9733 9109 15655 33833 53285 40958 9758 19016 20209 17163 174
16368 174 -30101 -34799 14316 -1459 11333 32795 74366 90476 40478 -5966 16726 15613
16356 15613 41694 75439 46588 91657 86655 49198 -15023 -41092 -7983 -28570 -57460 -54066
16344 -54066 6371 80688 36969 15709 19084 108007 90200 -1152 -45466 -23771 -6658 22933
16332 22933 -11705 -46013 -90188 -6467 86954 77967 41119 9356 4157 -24016 -38017 -53900
16320e3900J3429L2975j4315N872n287j3839n597M5828M8323N907k1723J8104
16308E5777k0907j7178r938p219K1433j7579o7681L8997L4962K3960j8974n168
16296A0485M3293q954k5509j6811o4511l4700J1931J1743M1446m49j1124O067
16284c7093L3462N8072l4095o6385m9478J589O5948M4271j8849j00991j2089N1349
16272f4289J3286k8509O389K3291k612O4403M6425n2647k8895j8310K3353J2488
16260e627q9734r730K595k7270K5403M4702Q32K0230J9481n874k1432K5226K1908
16247G10j1975J1351m6183k0786j947N3250M1327M8099j829j26730m7829K7961
16235g4581k7580J4133J01873Q3992M2639q4241l1498L959k0513K6412j5056j2975
$$ plain form
16320 -53900 -40471 -7496 -21811 -15939 -21226 -35065 -40662 5166 53489 59396 37673 55777
16308 55777 34870 17692 7754 535 21968 4389 -63292 -24295 10667 34627 15653 10485
16296 10485 53778 44824 19315 2504 -62007 -96707 -84776 -73033 -31587 -32036 -43160 -37093
16284 -37093 -3631 54441 20346 -46039 -95517 -93928 -27980 16291 -2558 -103549 -115638 -64289
16272 -64289 -51003 -79512 -73123 -49832 -52444 11959 58384 5737 -23158 -41468 -18115 -5627
16260 -5627 -95361 -105091 -102496 -129766 -104363 -59661 -58829 -38599 -19118 -24992 -46424 -21198 710
16247 710 -11265 86 -46097 -66883 -68830 -15580 25747 73846 72017 -54713 -102542 -74581
16235 -74581 -102161 -88028 13845 97837 140476 56235 24737 28696 8183 34595 19539 6564
16223F564j3404J282J0616j5658o0054N779M6852L1287J2672L4799l7837L9612
16211F2510j0891n2383o698j087o5501K7329P2135L2640j7931l4984n0190l8721
16199h3772N4404Q6484J3961n7803l7297R8917q126l5784p8093Q535N8307N761
16187B5494l8986Q675K7828k299q097j0422l4453k5846k4485L2001K9361j3534
16175c4763j7190j6701L0898M2336j3239J4902J1600N21m127O687L6927L3586
16163I1437j8333l8844k5502m8454K4996q757Q678L4358K5472o4138j07240R774
16151a16553L2943N5774n778M2828M3539n348p438J9934J0492l4285o534L3247
16139F2821l0856J5301k4809M802L157N2779j1783r2879K9265O7161k949L420
$$ plain form
16223 6564 -6840 -5558 5058 -10600 -70654 -64875 -18023 13264 25936 60735 22898 62510
16211 62510 51619 -764 -7462 -8549 -74050 -46721 25414 58054 40123 5139 -45051 -83772
16199 -83772 -29368 57116 71077 13274 -24023 74894 66768 30984 -47109 -38574 19733 25494
16187 25494 -13492 -4817 23011 20712 12615 2193 -32260 -58106 -82591 -50590 -21229 -34763
16175 -34763 -51953 -68654 -37756 4580 -8659 6243 17843 18364 14237 20924 57851 91437
16163 91437 73104 34260 8758 -39696 -14700 -23457 -14779 19579 45051 -19087 -126327 -116553
16151 -116553 -83610 -27836 -33614 9214 52753 47405 39967 59901 70393 36108 29574 62821
16139 62821 31965 47266 22457 27259 30416 83195 71412 -21467 7798 74959 72010 75430
16127G5430l869n5329j4402M1954l0632j6444k4315K1998j469j1866L9078M7408
16115F7542m0040l5697m7618j1157K1221J086Q273q416R466o6449l6344K1751
16103a16382M6681l1792K229P4095K505l5099k2687j2874L4493P9617k812j6139
16091A835l6075l7250J5006R520M1250J7441j4787o5773j3284L8360K0623j2881
16079c6015L4956K6927l969P963L0598J2011q7743l9903J5479j1005m033r126
16067f3860P5191k0015l6040L702M3914k4215m2364O032K7626l0610m5089R569
16055i6159K3167M2894J4077n8074n3144P5842M0921Q674P649P8691m9062r7049
16043f1573L2972m760j9757P2433K2763k095j540K08k7474N0081K8680o7361o4392
$$ plain form
16127 75430 71561 16232 1830 43784 13152 -3292 -27607 -5609 -7078 -18944 20134 67542
16115 67542 27502 -8195 -55813 -66970 -45749 -44663 -36390 -44806 -35340 -101789 -138133 -116382
16103 -116382 -69701 -101493 -99264 -25169 -22664 -57763 -80450 -93324 -58831 20786 17974 1835
16091 1835 -34240 -71490 -56484 -46964 -5714 11727 -3060 -68833 -82117 -43757 -23134 -36015
16079 -36015 -1059 25868 21899 29862 60460 72471 -15272 -55175 -39696 -50701 -54734 -63860
16067 -63860 11331 -8684 -44724 -41022 2892 -21323 -63687 -57655 -30029 -60639 -105728 -96159
16055 -96159 -72992 -30098 -16021 -74095 -127239 -51397 -10476 -1802 5847 84538 35476 -61573
16043 -61573 -28601 -33361 -53118 19315 42078 39983 38443 38651 11177 61258 89938 22577 -41815
16030d1815O032Q334n3350K5660P0330J9285j8250K429L6288k2061k7011k5661
16018a9790k740M359K5101j5108p36n4176k7460L9275l49N9722l5061j4355N2471
16005A1153m8684O21L7718K3309r041k2189m8146o7919P4720O7672K1746J7503
15993E8463j1430m5578p563K5446L4119J1342N98J4688q5858n042k4620j8554
15981e3989K613l5522K7405J1968J5440K5150O4005O1962J4495n9629l5157p4423
15969c5682k2309J9993j5491M184k2646n7476q036P1531N4828O4103L0119l9505
15957D3613j4973m5577k7311L7561M5859p448K5000J3488m3128m380M7609m982
15945F5331j0324m468m2309j6143J5692M378K6535J3483k3328K3460n9818k0236
$$ plain form
16030 -41815 -35783 -27449 -80799 -55139 15191 34476 16226 18655 54943 32882 5871 -19790
16018 -19790 -22530 -18171 6930 -8178 -8914 -63090 -90550 -51275 -51624 8098 -26963 -41318 11153
16005 11153 -37531 -36910 808 24117 15076 -7113 -55259 -123178 -48458 19214 40960 58463
15993 58463 47033 1455 -6108 19338 53457 64799 65397 80085 -5773 -10815 -35435 -53989
15981 -53989 -51376 -86898 -59493 -47525 -32085 -6935 57070 119032 133527 73898 38741 -35682
15969 -35682 -57991 -37998 -53489 -49305 -71951 -129427 -137463 -65932 -11104 52999 83118 43613
15957 43613 28640 -16937 -44248 -6687 39172 31724 56724 70212 27084 22704 70313 65331
15945 65331 55007 50539 8230 -7913 7779 12157 38692 52175 28847 52307 -7511 -27747
15933b7747j7284j6028j5776m674j5419O768K8235J039J7742P3345r439m3784
15921b3022L4847r616L4560K5222K8923L8082n8416j0886N2637L1935n834m8284
15909I0148m3566j3813k019O809n656p1494L7781m852J0767J6740l7182j1726
15897b8063J1756j6061P848R567L7825o6592O587J4166l9722k1028L0011P7755
15885B4049J4378n2498p1007P652L6941k2158K7064m589L7726M7148p024P97o0829
15872b2350O5570K7687l969K6248k8875p100j8170k1835M3183K1908m7791o140
15860B8366k0475L1321K7734l7059q7843o653P0014K7379j381J8727K1105M1718
15848A12953n8166j2033M004k4143k1918o045K2565L5689K8543j3070l0653o3639
$$ plain form
15933 -27747 -45031 -61059 -76835 -81509 -96928 -90160 -61925 -60886 -43144 30201 20762 -23022
15921 -23022 11825 2209 36769 61991 90914 128996 70580 59694 112331 144266 138432 90148
15909 90148 46582 32769 30750 37559 31903 -39591 -1810 -6662 4105 20845 -16337 -28063
15897 -28063 -16307 -32368 -24520 -14953 22872 -43720 -37133 -22967 -62689 -83717 -53706 24049
15885 24049 38427 -14071 -85078 -77426 -40485 -62643 -35579 -40168 -2442 44706 37682 38479 -22350
15872 -22350 43220 70907 66938 93186 64311 57211 39041 17206 60389 82297 34506 28366
15860 28366 7891 39212 66946 29887 -57956 -64609 5405 32784 31403 50130 71235 112953
15848 112953 54787 42754 46758 22615 697 -5348 17217 52906 81449 68379 37726 -25913
15836b5913k3536k5386K2132J3886L0404l7915N407L3521O7139K5210k7344j8189
15824C9416j5546m4643J0194K2944J1307N9535j588P652K7333q8679n0647M4508
15812B1786m0570j2840K6013L5653l9191l6351r013J4307K5571K722K4046O4110
15800G6243l802l1550k7429k7967J7529r0137M063J4701m856L3326L7768K9481
15788B7370m5744o002M2781J8045R723m5478o3411R619N6993j329M7235J6559
15776F6361n0032k9219N1060L1005l3933k5296n4744j2021J4123r752O9322j7698
15764h24k7529l9039j2939O253J1572L4570j2938r732K6062k213L1146L2381j273
15751C5497R274q106P181l3188n3162j0400M0211K483L107k0582M597L3590M0658
$$ plain form
15836 -25913 -49449 -74835 -52703 -38817 -8413 -46328 -40921 -7400 59739 84949 57605 39416
15824 39416 23870 -20773 -10579 12365 23672 83207 81619 89271 116604 27925 -22722 21786
15812 21786 -18784 -31624 -5611 30042 -9149 -45500 -54513 -40206 -14635 -11913 12133 76243
15800 76243 72441 40891 13462 -14505 3024 -87113 -83050 -68349 -73205 -39879 -2111 27370
15788 27370 -18374 -24376 18405 36450 46173 695 -62716 -53097 3896 2567 49802 66361
15776 66361 16329 -12890 38170 69175 35242 9946 -44798 -56819 -42696 -52448 16874 -824
15764 -824 -28353 -67392 -80331 -74078 -62506 -27936 -40874 -50606 -24544 -26757 4389 36770 35497
15751 35497 44771 36665 43846 10658 -42504 -52904 -12693 -10210 -7103 -27685 -23088 10502 51160
15738E1160k7628m9649n1143j7626L0233N7039P2595J613j7362L181l7407l6901
15726b1895n32K2753L318k3843J0380j7410J1779L4144l7698J3865Q4595m2512
15714C6944k3506K5872k2601k7063J1672m0996m4403p168m373N8886O0360K2050
15702D5674j0922n1383n245j4491j3974l1353m2290L6005P4007k338j1294L3300
15690E696J1812P137n1144j5378k3937l0717m3305J1015P7654l1940k7971P3913
15678c7165M8482Q958j1338k4447k4366l0324Q191O0963Q191l270O335K1512n407
15665B6315l8464k8050N9867N6139m8118k3609j5975m0623j7692J7145O2014N1908
15653F0857k5155o0205M639J0191j783j3249J3205o737j0691L4593M8598m6129
$$ plain form
15738 51160 23532 -26117 -77260 -94886 -64653 -7614 64981 66594 49232 52413 15006 -21895
15726 -21895 -22427 326 3644 -20199 -9819 -27229 -15450 18694 -19004 -5139 79456 36944
15714 36944 13438 39310 16709 -10354 1318 -39678 -84081 -91249 -95622 -36736 23624 45674
15702 45674 34752 -16631 -21876 -36367 -50341 -81694 -123984 -87979 -13972 -16310 -27604 5696
15690 5696 17508 24645 -26499 -41877 -65814 -96531 -139836 -128821 -51167 -83107 -111078 -37165
15678 -37165 11317 20275 8937 -15510 -39876 -70200 -62009 -1046 7145 3875 10210 31722 26315
15665 26315 -12149 -40199 19668 75807 27689 4080 -11895 -52518 -70210 -53065 8949 60857
15653 60857 35702 -24503 -19864 -9673 -11456 -24705 -11500 -18237 -28928 5665 54263 8134
15641H134l4512L5300m016Q954K3638j8977Q206j9894m1322K840r895P334K1257
15628a2953k8042J4862J6900K1513l4727n2L727L4385K0040n8625k1498p624M5966
15615f128o0720m2014J4029K5259j6423j4894j6298K2477k7680N3517P1195N3686
15603E6006o4627l9950M539M0646P7441Q539q1622l0674L2793n0313J3091j5255
15591d9386J7568M5954L2719m8646k5107j9724l2475J4444M8560M514L8062k143
15579B4340L434M978k9522N5950L4457k2493j6605k1238m7567r350o6630L5124
15567e5122J7375L7253L9295j9457n7176j0604J7068l40k1779J0685j8328L9668
15555b1462k5095k68N7374O2714p364n6484l9796J3389K3423M9280K6828k6275
$$ plain form
15641 8134 -26378 8922 4906 13860 37498 18521 26727 6833 -34489 -31649 -41544 -34210 -12953
15628 -12953 -40995 -26133 -9233 12280 -22447 -22499 -18772 15613 35653 -22972 -44470 -52094 -6128
15615 -6128 -66848 -108862 -94833 -69574 -85997 -100891 -117189 -94712 -122392 -68875 2320 56006
15603 56006 -8621 -48571 -44032 -3386 74055 82594 972 -29702 3091 -47222 -34131 -49386
15591 -49386 -31818 14136 46855 -1791 -26898 -46622 -79097 -64653 -16093 -11579 26483 24340
15579 24340 27774 32752 3230 59180 93637 71144 54539 33301 -14266 -23616 -90246 -55122
15567 -55122 -37747 -494 38801 19344 -37832 -48436 -31368 -31708 -53487 -42802 -61130 -21462
15555 -21462 -46557 -46825 10549 73263 65899 9415 -30381 -16992 6431 55711 82539 56264
15543E6264m7827j423O7619k9539K3870o2253j7398J9118m8692m0518r4977K8741
15531a47015R8725M53k045L3745M1204J9360m7521J6647o3719p607m999O8187
15519E415J5542o021K3385N4673k5887l5999m9620k938K5928J1013J6694j6460
15507A5725j675K4788p160m2304j4365K9857O5450N5504j6423r7616m4380L6361
15495C762R882r5929l3377k0772M7181N4444J1598j1171K3170P2048p3901J7937
15483D872m0448m004J7268k5668J6712L6341K558J4446n1129p9272q919K4531
15471i2712O6224K2612j6243R374J4922r414L7375R3475j5882o5570j9672o8499
15459d4010j4604O3853N1984m3580q3541j8161L5980M1259J5636k1292m9446K3934
$$ plain form
15543 56264 8437 7014 74633 45094 68964 6711 -10687 8431 -40261 -80779 -175756 -147015
15531 -147015 -48290 -47837 -49882 -16137 25067 44427 -3094 13553 -50166 -57773 -62772 5415
15519 5415 20957 14936 38321 92994 67107 31108 -18512 -21450 4478 15491 32185 15725
15507 15725 14050 38838 31678 -10626 -24991 4866 70316 125820 109397 11781 -32599 3762
15495 3762 13644 -82285 -115662 -136434 -89253 -34809 -23211 -34382 -11212 60836 -13065 4872
15483 4872 -35576 -39580 -22312 -47980 -31268 5073 7631 22077 -29052 -108324 -117243 -92712
15471 -92712 -26488 -3876 -20119 -10745 4177 -5237 32138 125613 109731 44161 24489 -44010
15459 -44010 -58614 5239 57223 13643 -69898 -88059 -52079 -10820 4816 -16476 -65922 -41988
15447d1988K5401k9812l3301L314j2988k3919j5786J8198M4560N8121N0133L6440
15435G8373J0594n4151r1556J4759K5038J6698j5392m2315l0647K8005L0688R507
15423b0399K4728K7165M5567l3170R756l7977L7457K3160r1476n3001P4249K9148
15411C5207j4185j0628m6186j8838N0666P9715l4545m2280K5750o9088k6756N63
15399g0605l2758J088j68M0335O9930j9915j6368P2828N3474m383P670J0164j3520
15386I7772K4961j8794o8372r4233K311J420r803m8580M0244M6576j7140l9300
15374h2938O521O9534j4928L365J4538m7423n8243N8767K6393M622J752M1207
15362B3167j3307j8304J7615q273J5688j8140n5975j5502Q6371M0646J7830N752
$$ plain form
15447 -41988 -16587 -46399 -79700 -76386 -89374 -113293 -129079 -110881 -66321 -8200 41933 78373
15435 78373 88967 34816 -56740 -41981 -16943 -245 -15637 -57952 -88599 -60594 -29906 -20399
15423 -20399 4329 31494 77061 43891 53647 15670 53127 76287 -15189 -68190 6059 35207
15411 35207 21022 10394 -35792 -54630 -3964 75751 41206 -1074 24676 -44412 -71168 -70605
15399 -70605 -103363 -102275 -102443 -62108 7822 -12093 -28461 44367 97841 93458 101128 111292 97772
15386 97772 122733 103939 35567 -58666 -56355 -54935 -64738 -113318 -73074 -26498 -43638 -82938
15374 -82938 -76417 -6883 -21811 -18446 -3908 -51331 -109574 -50807 -24414 -19792 -18040 23167
15362 23167 9860 -8444 9171 898 16586 -1554 -57529 -73031 13340 53986 71816 77568
15350G7568q071j9487N020m7528m6091O4403M6766j5748m6192k2866r531l944
15338b5701N6135O1847p246l0391k2038R16j7782l104p883K2125R483J9240N3695
15325A09296L2845p7929o0142k3787l3140N8181J2500j955M2834r334K7238J9685
15313I6292n1804l8567O907L6966O1896P756K0622J4690R774n3725o2599R538
15301E7746L5586L1894l4724n4267k637j2058k3122m1632N0009M3212M2297m0495
15289E1809m5577l0394m8255m4289K1616j510o1994l6300M721L2697N4237j3778
15277a17017K206J1091M1818N8705M7500o651L0011L9875l8531m1602j9920k7550
15265b0065L2055J8399j2779l869m0732j2811K0166m495L0959L1266k2922r810
$$ plain form
15350 77568 69497 50010 55030 7502 -38589 25814 72580 56832 10640 -12226 -21757 -25701
15338 -25701 30434 92281 85035 54644 32606 33522 15740 12636 4753 26878 36361 55601 109296
15325 109296 142141 64212 4070 -19717 -52857 5324 17824 15869 58703 49369 76607 96292
15313 96292 44488 5921 12828 49794 111690 119446 140068 154758 164532 110807 48208 57746
15301 57746 93332 125226 90502 36235 33598 21540 -1582 -43214 6795 50007 92304 51809
15289 51809 6232 -24162 -72417 -116706 -95090 -96600 -158594 -194894 -190173 -157476 -103239 -117017
15277 -117017 -114811 -103720 -61902 -3197 44303 37652 67663 107538 69007 27405 7485 -20065
15265 -20065 11990 30389 17610 13741 -26991 -39802 -19636 -24131 6828 38094 15172 5362
15253E362k606j5322M1857R376n7289J2350l6688j4366k0815K5793K7306j9975
15241d5017l5942K9062L533m0781J9215M0285l5763p13K2998k3400j6797J9940
15229f3380J8022j5452R0934J0823J6257q63m015Q36L0338P899o6320r291J9621
15216C5409o596l8651n2724J440N6661N3369n3634k0578k3074N4649N2249j8652
15204C9868l6626J1473J2085j1557J71j7710J4263r426l0768m3106o2169M6169
15192h7333P003M3970n4524O762K7922K3044N5648q919L5565k6184J0421J601
15180C4976q9825n4195L0543P1094N2847K3572k1423j4987m585p8031o6613K1012
15168i5615M7288L6376l7166Q694M5001k5462M5113L8131p3503m9834K1809Q18
$$ plain form
15253 5362 2756 -12566 29291 38667 -18622 -6272 -42960 -57326 -78141 -52348 -25042 -45017
15241 -45017 -80959 -51897 -48364 -89145 -69930 -29645 -65408 -66121 -43123 -66523 -83320 -63380
15229 -63380 -45358 -60810 30124 40947 57204 56341 52326 53162 83500 91399 25079 15788 35409
15216 35409 28813 -9838 -62562 -61122 -4461 48908 -4726 -25304 -48378 6271 58520 39868
15204 39868 3242 14715 26800 15243 15414 -2296 11967 2541 -28227 -71333 -133502 -87333
15192 -87333 -80330 -36360 -90884 -84122 -56200 -33156 22492 13573 49138 22954 33375 34976
15180 34976 -54849 -109044 -78501 -7407 45440 69012 47589 32602 28017 -50014 -116627 -95615
15168 -95615 -48327 -11951 -49117 -40423 4578 -20884 24229 62360 -11143 -60977 -39168 -38350
15156c8350o435k1336J0468l7831j7342O2254Q0212k0920j7066j8658L0194n213
15144b3m1154q797K3399M836M287K630j9870J9185k1303l3046k6926m153M7024
15131e3911N2288M849j5160K0564K2841N518l1167q444L0925j2800m6115m4504
15119g5116j3694L5743l4259L8620L0114P095j5055m4220j4870K3445L2411j1686
15107d1472j3586o086N1426J5454J892K2371J7501K034j1233n1570l9254N1230
15095a293K6907K68L2806K4145n3737o5780n3960m808R652N4834K7915j4704m0947
15082e8702l5919J1040K6426M253N202o932j630k4882j547O457N399j9461M2554
15069d7742K7330P448q3049m0662j8699r99J0217L1874M6658N7432O2499M1969
$$ plain form
15156 -38350 -44785 -66121 -55653 -93484 -110826 -48572 31640 10720 -6346 -25004 5190 -23
15144 -23 -41177 -49974 -26575 -21739 -17452 -14822 -34692 -15507 -36810 -69856 -96782 -100935 -53911
15131 -53911 -1623 3226 -11934 8630 31471 36989 5822 -2622 28303 15503 -30612 -75116
15119 -75116 -88810 -53067 -87326 -48706 -18592 -11497 -26552 -70772 -85642 -62197 -29786 -41472
15107 -41472 -55058 -61144 -9718 5736 7628 29999 47500 49534 38301 -13269 -52523 -1293
15095 -1293 25614 25882 58688 82833 29096 -36684 -90644 -95452 -85800 -30966 -3051 -17755 -58702
15082 -58702 -94621 -83581 -57155 -52902 -47700 -54632 -56262 -81144 -82691 -76234 -70835 -90296 -47742
15069 -47742 -20412 -12964 -96013 -136675 -155374 -156373 -146156 -114282 -67624 -10192 52307 94276
15057I4276l3606m8975j5381J8747j1405N8582k6039j34080l9993N0783J4323
15046g2768L2081L001k7001J9322n148N4185M3517J6881l7764J569l6451o9756
15034g8332q806L4483N0510r218k0126j6094k7516l43L940l132N7815M278j7028
15021b9569Q878L9237L6751j1826l815l1978j0K6124k3968O398N332n125n9271
15008d2842j3007o933L6384k9063o4384K61N0540k8272O1585L4741J7466m426
14996A2050J1877J3184M0701L5292k2945n0597k7951j6302K1580k3133l6073P251
14984c5066P5195j6364m9468L679M3345J2560l9127p4472k7097R3844R658K2669
14972A9356j1497m4866K6138k5863j1304r058M3445J1401L1470m5738J596J5992
$$ plain form
15057 94276 60670 11695 -3686 15061 3656 62238 36199 -97881 -137874 -87091 -72768
15046 -72768 -40687 -37686 -64687 -45365 -50513 3672 47189 64070 26306 27875 -8576 -78332
15034 -78332 -87138 -52655 -2145 -11363 -31489 -47583 -75099 -75442 -71502 -74634 -16819 -12541 -29569
15021 -29569 -20691 18546 55297 43471 39656 7678 7668 33792 9824 16222 21554 16429 -42842
15008 -42842 -55849 -62782 -26398 -55461 -119845 -119584 -69044 -97316 -35731 -990 16476 12050
14996 12050 23927 37111 77812 113104 90159 39562 11611 -4691 16889 -6244 -42317 -35066
14984 -35066 40129 23765 -25703 -22024 21321 33881 -5246 -79718 -106815 -12971 -3313 19356
14972 19356 7859 -37007 -10869 -36732 -48036 -57094 -13649 -2248 29222 -16516 -14920 1072
14960A072L1128M9354q879n132m6839m8911q830K4595O3469K0440j1714j9646
14948D0107o8567p4526M2973J6378J172J7999M6275j4536k1202k2903n3380K5536
14936f4674K8231K0464J0545m9682m4941l7017M6604N0687M2082L2169J4317l5711
14924A3074N552M9324k0691j0956j1326m6066L021N8454K3115l5543m9111k1189
14912d2342m5717L5019R7286K0566K3851k1601n6068n9609K9739N246k3457J2259
14900b4828j8057k42J8103N5198M4884J18o2157o143l921J332N3529O9059j9125
14887A07750n1573l8384m6441m3599M7821l0283K3102K4376k1404j5978O4904
14876B0291R019k488J2434l2789q913K7248K2859m5451m0094M598L7836J8245
$$ plain form
14960 1072 32200 81554 72675 67543 20704 -28207 -37037 -12442 51027 71467 59753 40107
14948 40107 -28460 -102986 -60013 -43635 -42463 -24464 21811 7275 -13927 -36830 -90210 -64674
14936 -64674 -36443 -15979 -5434 -55116 -100057 -137074 -90470 -39783 2299 34468 48785 13074
14924 13074 18626 67950 47259 36303 24977 -21089 -18068 40386 63501 27958 -21153 -42342
14912 -42342 -88059 -53040 44246 64812 88663 67062 10994 -48615 -18876 -13630 -37087 -24828
14900 -24828 -42885 -43127 -25024 30174 75058 75176 13019 6876 2955 4287 57816 126875 107750
14887 107750 56177 17793 -28648 -72247 -24426 -54709 -31607 -7231 -28635 -44613 20291
14876 20291 29310 26822 39256 6467 -2446 24802 47661 2210 -37884 -33286 4550 22795
14864B2795k9274m9160K6934Q2323M019n3131k1679k0759L5898N3132k4856p4623
14852d8381k2243M7497K5498n1167M080L889m3322N7036M046O580k0253L1485
14840e255p7421m5875N3944L7288N4007k1263l5975L4468J4653J4369m3235n6242
14828g6537N5605L8393M82p080m43k2605k8172M2292l672j2532K1169J7769k599
14815B2070l2712k7364j0759r665N2115J3126j6671j1665j0306K7470N1885k6615
14803B0909k1471K1113m773j7841k1621O847N0162K4836j9086j6908n8582K2607
14791a3808j2009m0783r122k0819K2455K2889j2822j2703K7159J0309l3890K1826
14779e1318J6625j4887K3816N1902l6401l1504J4849K2693J1755K9293m311l6070
$$ plain form
14864 22795 -6479 -55639 -28705 53618 57637 4506 -17173 -37932 -2034 51098 26242 -48381
14852 -48381 -70624 -23127 2371 -48796 -44716 -40827 -84149 -27113 -23067 -16487 -36740 -5255
14840 -5255 -82676 -128551 -74607 -37319 16688 -4575 -40550 -6082 8571 22940 -20295 -76537
14828 -76537 -20932 17461 17943 10863 10420 -12185 -40357 1935 -1737 -14269 6900 24669 22070
14815 22070 -10642 -38006 -48765 -58430 -6315 6811 -9860 -21525 -31831 -4361 47524 20909
14803 20909 -562 20551 15778 -2063 -23684 -16837 33325 58161 39075 22167 -36415 -13808
14791 -13808 -25817 -66600 -75722 -96541 -74086 -51197 -64019 -76722 -49563 -39254 -73144 -51318
14779 -51318 -34693 -49580 -25764 26138 -10263 -41767 -26918 -4225 7530 36823 32512 -3558
14767c558o660M4615J4499l6548l1227k2639K6716P5525l2900o0340J522J2747
14755a8248J1659j1954n3856L4591Q1186l5733j05201k1390K6906O9176M2838
14744A9974m4175o6034N2778L4699J2120J4834R310J0578L2201n6083q1664j4625
14732g6087N72k3287P416m689n91J0502R382K2087N561m6782o3499N3997L0490
14719g4928L1305L1108K3878P7229p76j8935l1140O059l907j0210n0617m2363
14707f3297j9214K2847J2869n999l935J8221K0952M8404K1944o3383J3921j5774
14695a2444J8567N441K1043N407m9997l4064r1567m4027N1350P4078k4629j8139
14683i8981K4147Q988P739P932L6190N5158l7709m6356P403K4206J3862p024j5388
$$ plain form
14767 -3558 -10218 34397 48896 12348 -18879 -41518 -14802 60723 27823 -32517 -30995 -18248
14755 -18248 -6589 -18543 -72399 -37808 43378 7645 -97556 -118946 -92040 -22864 19974
14744 19974 -24201 -90235 -37457 -2758 9362 24196 33506 44084 76285 20202 -61462 -76087
14732 -76087 -75515 -98802 -91386 -96075 -96666 -86164 -76782 -54695 -49134 -95916 -159415 -105418 -74928
14719 -74928 -43623 -12515 11363 88592 87816 68881 37741 43800 39893 29683 -20934 -63297
14707 -63297 -82511 -59664 -46795 -52794 -56729 -38508 -17556 30848 52792 -10591 3330 -12444
14695 -12444 6123 11564 32607 38014 -11983 -46047 -137614 -181641 -130291 -56213 -80842 -98981
14683 -98981 -74834 -65846 -58107 -50175 -13985 41173 3464 -42892 -35489 -11283 2579 -4445 -19833
14670a9833M1507m7277o562j0615j12540j5263O1861L6064O7056L2557j8488p0280
14658f1813m6872N9805J9977l3151M1260M7681L9761k817r334j6704l1751j1411
14646e369o070k9256M10K5598L1998l4266l2570O893N8114M3713l800p653r625
14633C8117p3884N759K5626j2641k6283j7060J2262J1252p9226k0481Q1956q618
14621f3221L3605P5570l028m6332j1479l9539J8661J4251o0016J0571M6310K5442
14609G95L5701J3340K7134m632m3764k7280K0104K1809o3113k4918J2762L1884
14597a78J6259j4946J6239m0423n6608l4224L5596O5608L5142L0772m6911p0344
14585f4018O1748j2190o2224o585K4358L1664L0877K6216N3097J4918j5559r275
$$ plain form
14670 -19833 21674 -25603 -32165 -42780 -155320 -170583 -108722 -72658 -5602 26955 8467 -61813
14658 -61813 -108685 -48880 -28903 -62054 -20794 26887 66648 63831 54497 37793 6042 -5369
14646 -5369 -11439 -40695 -40285 -14687 17311 -16955 -49525 -42632 15482 59195 55395 47742 38117
14633 38117 -35767 -30008 -4382 -17023 -43306 -60366 -48104 -36852 -116078 -136559 -54603 -63221
14621 -63221 -29616 45954 42926 -3406 -14885 -54424 -35763 -21512 -81528 -70957 -24647 795
14609 795 36496 49836 76970 72338 28574 1294 21398 43207 -19906 -44824 -32062 -178
14597 -178 16081 1135 17374 -23049 -79657 -113881 -78285 -12677 22465 53237 6326 -64018
14585 -64018 -2270 -14460 -76684 -83269 -58911 -27247 3630 29846 82943 97861 82302 73027
14573G3027j9206p046J769R6640l679r9947p9266l8053L168L1045N9293M898n4032
14560c1389L637J4289L2915l032j040p614k1564k907O919Q706n8668k5981M552
14547h1177M4849P1221O28l6391K1520j3219k6942K0796N290J3336L0788J6014
14535F6713m2412j03700o457M1577o432K9950m0284n6908O6130J9060l1698J5842
14523d8619M8780R142L873j5787l900k6781L81k855L5588j4323j099N5995m300
14510C6095j1135k4555p845J5200J1522L44n215o1526o2935M3788L5201K3331
14498g730K4768J2681q1399j1125R641l0204k1431K5698K3077p4108J3644N7328
14486e9160M0891M991j5718J7381L5000M906k0064n0453n783K0187l6804K5029
$$ plain form
14573 73027 53821 46775 48544 145184 141505 41558 -37708 -75761 -72593 -41548 17745 22643 -31389
14560 -31389 -27752 -13463 19452 16420 15380 7766 -13798 -16705 -9786 -1080 -59748 -85729 -81177
14547 -81177 -36328 34893 35521 -870 20650 7431 -19511 1285 6575 19911 50699 66713
14535 66713 24301 -79399 -85856 -44279 -50711 -20761 -61045 -117953 -51823 -32763 -64461 -48619
14523 -48619 161 9303 13176 -2611 -6511 -33292 -32911 -35766 -178 -14501 -15600 40395 36095
14510 36095 24960 405 -7440 7760 19282 19626 14411 -47115 -110050 -66262 -31061 -7730
14498 -7730 17038 29719 -51680 -62805 -53164 -83368 -104799 -79101 -56024 -130132 -116488 -59160
14486 -59160 -18269 -13278 -28996 -11615 23385 28291 8227 -42226 -48009 -27822 -64626 -39597
14474c9597N9425j1668m3609j0119o886j9913L5306n99p2084J5524O5553K2110
14462f557l7496j4806J1381O0089K3028J2874k6314n4306L2064J372J3891R40
14450A6160Q964l2196n1406N3492K2438l417o6482j209N1589J2941j6659j5868
14438b1653j2854m8100K1080L0938l8600L2544M1406J3128K4272L1921q5229n8656
14426f9803k5624J474K8362P0272N3523k0393p925K2506P501l6583j8085j6752
14414a1527M559K5751J7356k4952k6238K5870l0033j2341K7551R549l7793r1173
14402a23421K2186R1153L4020J9412o4659K8253L7150l2929k3046k1228k2893
14391e6002J003k1048L3898k5249J4202N6456l8988m2883J457r801K3936L6070
$$ plain form
14474 -39597 19828 8160 -35449 -45568 -52454 -72367 -37061 -37660 -109744 -94220 -28667 -6557
14462 -6557 -44053 -58859 -47478 12611 35639 48513 22199 -32107 -43 1329 15220 16160
14450 16160 25124 -7072 -58478 -4986 17452 14035 -52447 -53656 -2067 10874 -5785 -21653
14438 -21653 -34507 -82607 -61527 -30589 -69189 -36645 4761 17889 42161 74082 -11147 -69803
14426 -69803 -95427 -93953 -65591 4681 58204 37811 29886 52392 59893 23310 5225 -11527
14414 -11527 -6968 18783 36139 11187 -15051 10819 -19214 -31555 -4004 5545 -32248 -123421
14402 -123421 -101235 -10082 23938 43350 -21309 6944 44094 11165 -11881 -33109 -56002
14391 -56002 -54999 -76047 -42149 -67398 -53196 3260 -35728 -78611 -77154 -86955 -63019 -26949
14379b6949M1853K1339L6125p7788N140L4722J9570K2107l0040J4405M1672M5688
14367A47844l2668k9137l8114r221K2955p2915j4199L3172N4346K3003l6012m8395
14355F59K293n0858j0007Q355l8251O0257N9395n0408q4422J1228M0944J4217
14343c6598K414k3713R863M136j4659K8052k0514M8196Q2544L3035j7561o4485
14331C0710j9627N0119o045m231J5622j0624r288K0730K2359k5589K9721o9484
14319B4373n9343K1943K0058K9447k5703J8562r059l1399m466j3100l3687k6266
14307h8640L4861O6677M0089J1218m2535l6465k856M406L634L3256K8252L4068
14295H5965j0614o4585j3190o90k9256K5734p774k3613L096J32R319J7001o7623
$$ plain form
14379 -26949 14904 36243 72368 -5420 -280 34442 54012 76119 46079 60484 102156 147844
14367 147844 115176 86039 47925 38704 61659 -11256 -25455 7717 62063 85066 49054 659
14355 659 2952 -47906 -57913 -49558 -87809 -27552 31843 -18565 -102987 -91759 -50815 -36598
14343 -36598 -34184 -57897 -48034 -43898 -58557 -30505 -51019 -2823 79721 112756 95195 30710
14331 30710 11083 61202 55157 50926 66548 55924 46636 67366 89725 64136 93857 24373
14319 24373 -34970 -13027 7031 36478 10775 29337 20278 -11121 -15587 -28687 -62374 -88640
14307 -88640 -53779 12898 52987 64205 21670 -14795 -17651 -13245 -9611 23645 51897 85965
14295 85965 75351 10766 -2424 -3114 -32370 -6636 -14410 -38023 -34927 -34795 -25476 -8475 -76098
14282g6098K8038P766l964l0430M1312L8041k000q920k4570o88J6466l0553l0660
14269g6260J534K3658j3245j532N7066O9753K0424k0987o7000p5012K017k1694
14257a01278J3892j753L4593N1092k9633J2037m45M356L0108M7487j6513K3124
14245F7067o7938m3496l7626j6293O5300L9902j8656l5904K1947k1002k3527L6912
14233c3314J4703M9373K1818k3401l7652J7336L9858j0232J5737q733l8780M3779
14221E0492L8182m5964K869K4169J0274O669K5333j5807L7414j0426l0449j09412
14209a6656k8561q80M8053M6872m5569k1390J1420M4952R242p964L301n9532m9447
14196f6159Q4367k5240k6203Q768M0001J3208m363J3435l301J4558l4655K6511
$$ plain form
14282 -76098 -48060 -40294 -44258 -74688 -33376 4665 2665 -6255 -30825 -31513 -15047 -45600 -76260
14269 -76260 -74726 -51068 -64313 -65845 -8779 60974 81398 60411 -6589 -81601 -79584 -101278
14257 -101278 -87386 -89139 -54546 -3454 -33087 -21050 -21495 -17139 12969 60456 43943 67067
14245 67067 -871 -44367 -81993 -98286 -32986 6916 -11740 -47644 -25697 -46699 -70226 -33314
14233 -33314 -18611 30762 52580 29179 -8473 8863 48721 38489 54226 45493 6713 50492
14221 50492 88674 42710 45579 69748 80022 86691 112024 96217 133631 123205 92756 -16656
14209 -16656 -45217 -46097 1956 48828 3259 -18131 -6711 38241 47483 39519 42820 -16712 -66159
14196 -66159 18208 -7032 -33235 -24467 15534 28742 24379 37814 34513 49071 14416 40927
14184D0927r422l1452n6768k0368K8909M3715Q8629J7015j08498m7226K6147N5765
14172B7373O3871q3884m0047j7286K2133P6735R1298N607o6608n6843m4401N27
14160b1525Q600K2698j1352J0121P102j9698o627O388N4652M1598j4393m4336
14148C3228K5086P0242j0742o254m6542p041m741o1209k8297J3845K829j4144
14136c3740N8194J2670j6768L846P482o4771o1200j6631N3776k0952P1136M5775
14124C8817M509m489j9298k3591l2994L6110J3865l0635L1649o596j9636j024
14112a3313k4291N4675Q848n9576K3762K4567J5125n7778K0391L2686k6065m0056
14100d1025k7641K6272P053n7218K767J1595l5647P051P3832L625o478N8473K4162
$$ plain form
14184 40927 31505 53 -56715 -77083 -48174 -4459 84170 101185 -7313 -54539 -28392 27373
14172 27373 91244 7360 -32687 -49973 -27840 48895 140193 145800 79192 22349 -22052 -21525
14160 -21525 -12925 9773 -1579 8542 15644 -4054 -10681 -4293 50359 91957 77564 33228
14148 33228 58314 128556 117814 111560 65018 57977 53236 -7973 -36270 -22425 -19596 -33740
14136 -33740 24454 37124 20356 24202 31684 -33087 -94287 -110918 -57142 -78094 -6958 38817
14124 38817 43326 38837 19539 -4052 -37046 -936 12929 -17706 13943 7347 -12289 -13313
14112 -13313 -37604 17071 25919 -33657 -9895 14672 29797 -27981 -7590 25096 -969 -41025
14100 -41025 -68666 -42394 -35341 -92559 -89792 -78197 -113844 -106793 -32961 -29336 -35814 22659 46821
14087D6821k2731J6519P1479p267j0711r730l6474q2020n7785J0028O5634N4412
14075C8175Q130k0391N2205J2999p717l8379k0673l3246k4132l0809j588j9104
14063h4530j0388J2893o4693N5321N7097O2850j940l7026k4375N7831J8644l8661
14051C023p7233n6234j1829M0654K5602L5650Q090J2642O5157J6990M7629o3296
14039D6845q8422k1994J8563M2997M1231k204n0339m6219p690L7547K1131R0282
14027H1728J8312k3292m8698l8366jM3810m7480k9600J0567l8038j8088o697J5317
14014h0526N4615l6367O928L6973k0911J3145M3828j167M7242J6598m6003j3879
14002B0476J1424o744o984K3145P99j6604l2756l2948o950M5954L8783j76k0199
$$ plain form
14087 46821 24090 40609 112088 104821 94110 84380 47906 -34114 -91899 -81871 -16237 38175
14075 38175 46305 25914 78119 91118 83401 45022 24349 -8897 -33029 -63838 -65426 -84530
14063 -84530 -94918 -82025 -146718 -91397 -34300 28550 26610 -10416 -34791 23040 41684 3023
14051 3023 -74210 -130444 -142273 -101619 -76017 -40367 -32277 -19635 45522 62512 110141 46845
14039 46845 -41577 -63571 -45008 -2011 39220 37016 -13323 -59542 -67232 -29685 -8554 81728
14027 81728 100040 76748 28050 -10316 -10317 33493 -13987 -43587 -33020 -71058 -89146 -95843 -80526
14014 -80526 -25911 -62278 -55350 -18377 -39288 -26143 17685 16518 63760 80358 34355 20476
14002 20476 31900 25156 18172 41317 42116 25512 -7244 -40192 -47142 -1188 37595 37419 17220
13989A7220P937o7440n2849M0600M02K7397N4281k3163l6150q605k2702l6366
13977i9438K1464J4277m9752p885M0878j669J0154P4012K2254k4186O251K0685
13965B7045O983R791m6624p9449M720P1950L2102O2659K5060m5188l6742M7078
13953G9385J3960M6668J4411n6116l3445J2853P649q408j2024O698n318L9653
13941A05966k8927m9984L1636K587p815j2474o772J4424n7365k3587P169J7213
13929g929K6703J9434k6677m6943N8969N6703m0381q5842j0960N8949K5252l2844
13917e566M2804M6483N3502L1177k5142K6356m0934n4365J2542K607j0682q4155
13905e373n4518p9452l0947P6652J05715O8887K8946n8019k1854L7502k9751l9353
$$ plain form
13989 17220 25157 -42283 -95132 -54532 -54130 -26733 27548 4385 -31765 -40370 -63072 -99438
13977 -99438 -77974 -63697 -113449 -121334 -80456 -82125 -71971 2041 24295 109 6360 27045
13965 27045 34028 43819 -2805 -82254 -77534 -5584 26518 89177 114237 69049 32307 79385
13953 79385 93345 140013 154424 98308 64863 77716 85365 76957 64933 71631 66313 105966
13941 105966 77039 27055 58691 61278 53463 40989 34217 48641 -8724 -32311 -25142 -7929
13929 -7929 18774 38208 11531 -35412 23557 80260 39879 -45963 -56923 2026 27278 -5566
13917 -5566 37238 83721 137223 168400 143258 169614 128680 74315 86857 89464 78782 -5373
13905 -5373 -59891 -139343 -170290 -93638 12077 80964 109910 51891 30037 67539 37788 -1565
13893a565K360M5768L574n1616j0107j052p994J5579L2744K6432K1024L1372J512
13880A08031j4358n7363m966K6982j0116K8168k0316J9965N0586K7866k7910J0189
13868A36758j2513l3381m8147m8970k0811r745L8364L5419l263q2175L6176M4785
13856C2497L6706J8410L156P12n4527L639L071J2578j2071j6251j7423P883P899
13843B6279L5693k066o4928l1088J27397J3980j3799o612o1452m0438k6037O9734
13831B6663j6658j04959J124J32834L6074l8198l9103m9730K3265N1332o812l9041
13819b3209M8671k965j2052k6040K8438K6312j3113o0156O059J0608M4391j6162
13807A0782o641J8742k2892M3282j617k9615K0005j5586R432j7769L7683L224
$$ plain form
13893 -1565 795 46563 50137 -1479 -11586 -12638 -20632 -5053 27691 54123 75147 106519 108031
13880 108031 93673 36310 31344 58326 48210 76378 56062 76027 126613 154479 126569 136758
13868 136758 124245 90864 42717 -6253 -27064 -36809 1555 36974 33711 -48464 -12288 32497
13856 32497 69203 87613 90769 91481 36954 40593 43664 56242 44171 27920 10497 18380 26279
13843 26279 61972 59906 -5022 -36110 91287 105267 91468 84856 23404 -17034 -43071 26663
13831 26663 10005 -94954 -93830 39004 75078 36880 -2223 -51953 -28688 22644 15832 -23209
13819 -23209 25462 22497 10445 -15595 12843 39155 26042 -34114 -28055 -17447 26944 10782
13807 10782 4141 22883 -9 43273 41656 12041 32046 16460 25892 8123 45806 49030
13795D9030J1147m666j1866O930j3878l0425J1142N3859M722J6730j954q627l96
13782H1748l7131k8721M4624m7003J0096J1909k9140k3596M423m380K7969k7841
13770a7043j5807M8939n2989M2689q74L4849j6133l0515k969j5568m970k7721
13758e8112K8563J3188K4687m9257m4469J0933K8121M0482J2346l8944j4623L2442
13746a4643M7916M6999k3129m7305L593K8554k6018j2897J1035k8580N5356O0995
13734A01876m7208m9848N4364R073J1280o1327j1787M1894o5882J1155J2792K4126
13722C0508K808K0900L5939n1424k7423p506q200L8425P130O669n387q7527l952
13709d9040k8474k0844P0277l7027m112k0991M812K3465J876k4056l2298j8239
$$ plain form
13795 49030 60177 55511 43645 50575 36697 6272 17414 71273 75995 92725 90771 82144 81748
13782 81748 44617 15896 60520 13517 23613 35522 6382 -17214 -12791 -17171 10798 -17043
13770 -17043 -32850 16089 -36900 5789 4915 39764 23631 -6884 -9853 -25421 -30391 -58112
13758 -58112 -29549 -16361 8326 -40931 -85400 -74467 -46346 -5864 6482 -32462 -47085 -14643
13746 -14643 33273 80272 57143 9838 13431 41985 15967 3070 14105 -14475 40881 101876
13734 101876 54668 4820 59184 68257 79537 18210 6423 48317 -17565 -6410 6382 30508
13722 30508 33316 54216 90155 38731 11308 3802 -4398 34027 41157 47826 42439 -45088 -49040
13709 -49040 -77514 -98358 -28081 -65108 -69220 -90211 -85399 -61934 -60058 -84114 -116412 -134651
13697a34651L711N0672j7224l6555J3714L331m327M1597J3636K3303M2298K1378
13685B0883J4354n7809n867p176n4040l9676L8808J3458L1056N4164L2322l5090
13673E387j0836P093J9782m2449k73j4031k9013n2669Q928P4343L0768j3826J3877
13660b919K9420j1733k9767k0521j1194j093j3888L7023O3174Q261L0070J4734
13648I1567N752O843J3937L7092j03684j0930j4557p599K5297l9386N4376k2080
13636C6628m8664j9693p1705K7536L3863n0154O5701J7597L0075j9927J3699K7395
13624D2351m1942R480K0130M476J8688L711K2272m3758p7296m6659N682J6220
13612f6645P5134l3315k4077Q643k7262K3395N2360J8588m2584m091K1210J5176
$$ plain form
13697 -134651 -130940 -80268 -97492 -134047 -120333 -117002 -121329 -79732 -66096 -42793 -495 20883
13685 20883 35237 -22572 -28439 -35615 -89655 -129331 -90523 -77065 -46009 8155 40477 5387
13673 5387 -5449 1644 21426 -21023 -21296 -35327 -64340 -117009 -108081 -33738 -2970 -16796 -2919
13660 -2919 26501 14768 -14999 -35520 -46714 -47807 -61695 -24672 38502 46763 76833 91567
13648 91567 97319 104162 118099 155191 51507 40577 26020 18421 43718 4332 58708 36628
13636 36628 -12036 -31729 -103434 -75898 -42035 -92189 -26488 -8891 21184 1257 14956 42351
13624 42351 409 9889 30019 34495 53183 56894 79166 35408 -41888 -88547 -82865 -66645
13612 -66645 8489 -24826 -48903 -40260 -67522 -44127 8233 26821 -15763 -19854 1356 16532
13600A6532K3981k4931K2036O7644j01786j0096M202j8944j3241j155L1265L861
13588f32k013K1457Q1869m2653o1518Q427l4529k1652J5100K6824K2566r854K374
13575E766J2672K4739K7901j5104j2394L0097l0321k2386J9306R983L44p382l3975
13562I246n779k0817J7916J6340J1023l1508n9998N3685L5592J8429m867k990
13550C6272k2251K046L3476L654r404n3289m7345L4093K7211J8293k5288n1574
13538e4106p3191L7910P9475M6220k7172j4746J2921o6812K5338M6663K282J9002
13526C3784P98k4316K8978L3242o9992o2613K1210k7239r418k8844j9669K0907
13514a03172J958j0829L7113Q062K7875L5958J2986l260K1803Q376K3536m0801
$$ plain form
13600 16532 40513 15582 37618 105262 3476 -6620 -2418 -21362 -34603 -35758 -4493 -632
13588 -632 -2645 18812 100681 58028 -3490 4937 -29592 -51244 -36144 -9320 13246 3392 5766
13575 5766 18438 43177 71078 55974 43580 73677 43356 20970 40276 50259 50603 43221 9246
13562 9246 3467 -17350 566 16906 27929 -3579 -63577 -9892 25700 44129 39262 36272
13550 36272 14021 16067 49543 53197 43793 -9496 -56841 -22748 4463 22756 -2532 -54106
13538 -54106 -127297 -89387 -9912 36308 9136 -5610 7311 -59501 -34163 12500 14782 33784
13526 33784 34582 10266 39244 72486 2494 -60119 -38909 -66148 -75566 -104410 -124079 -103172
13514 -103172 -101214 -112043 -74930 -66868 -38993 -3035 9951 6691 28494 36870 60406 19605
13502A9605m8356k8748j5530K9582K0814j1954O917J8270l2856l4899j271J7411
13490f1015R425K8909K817K168j6372J5131O055j8525j2140Q303k8475k9042o2396
13477a55157k188Q1660M6267l0875J8027M6962J14349K988n2248n1295l218L0248
13465D5520M2513l1770q123m8539l2302j2234K757q224K7552j3937r732L0610
13453a5909K5438k3473k0679j0370P0264P1522M925q7080m8246M8032L2542N9893
13441A06859n3531m3655J7721K4999L669k3558m7966l3917J6921Q4618r92j1417
13429C9751q358n47o3909k3207L6806l3328L836L948K7793K4693L2774o880j8145
13416A5227q625J840M733K8836l289l7048P4556L0269J0283l0685M5372M426k4055
$$ plain form
13502 19605 -28751 -57499 -73029 -43447 -22633 -34587 -27670 -9400 -42256 -77155 -78426 -61015
13490 -61015 -51590 -22681 -19864 -17696 -34068 -18937 -12882 -31407 -43547 -35244 -63719 -92761 -155157
13477 -155157 -157345 -75685 -29418 -60293 -42266 4696 119045 122033 69785 18490 15272 45520
13465 45520 88033 56263 48140 -399 -32701 -44935 -42178 -50402 -22850 -36787 -46519 -15909
13453 -15909 9529 -13944 -34623 -44993 25271 96793 101718 14638 -33608 14424 46966 106859
13441 106859 53328 9673 27394 52393 56062 32504 -15462 -49379 -32458 52160 51168 39751
13429 39751 31393 30846 -33063 -56270 -19464 -52792 -48956 -45008 -17215 7478 40252 33372 15227
13416 15227 6602 8442 13175 42011 38722 1674 76230 106499 116782 86097 131469 135895 111840
13403A11840o6076K0091K0403p4161m6083L05M026K4103j0868q191K9052P1770
13391G6211R896k2791l0483J1977l7351P675N0878K8741o7805k7213N2517q933
13379D3319m1646M2181K5790m837L1370j3629n3573K1530j7276p4787K1484K3190
13367C116L1871r438o2350M03l159N1640j8979k3400K6370N7732O2442o1311J492
13354E6429J1568j3446j1571K0649K9764l1180j9463K1380o637k3039n0028j3658
13342b9232m243l4055O636J829L2677J0959M9843L0217j1843R874k4023m0205
13330a566K8204J3130L9184j084j8677j368J5019J6873q464m6082Q580k1056j3829
13317H864m3644P491N2201J4344N635r024l0985J3184J5073J949r070l4038O706
$$ plain form
13403 111840 45764 65855 86258 12097 -33986 -33681 -29655 -5552 -16420 -24611 4441 76211
13391 76211 86107 63316 32833 44810 7459 15134 66012 94753 26948 -265 52252 43319
13379 43319 1673 43854 69644 64807 96177 82548 28975 50505 33229 -41558 -20074 3116
13367 3116 34987 25549 -36801 -36398 -39557 12083 -6896 -30296 -3926 53806 116248 54937 56429
13354 56429 67997 54551 42980 63629 93393 62213 42750 64130 57493 34454 -15574 -29232
13342 -29232 -33475 -67530 -60894 -59065 -26388 -15429 34414 64631 52788 62662 38639 -1566
13330 -1566 26638 39768 78952 77868 59191 57823 72842 89715 81251 35169 43749 22693 8864
13317 8864 -34780 -27289 24912 39256 44891 35867 4882 18066 33139 35088 26018 -8020 -1314
13304a314K587m3644j8480Q2138j3392J0717R2055L6095q430j8177J6954o8394
13292F8715o5239m1315k3737L6556R230j3642n579j6858L3484K7967L3797R465
13280E2844J0193P644j8438L9699Q624n6768J9917m029p6564j005K0193K2374
13268B4684N69J6574j8061k9170L392j466N2792N2175O3704K0742o775k2061P38
13255A57837J9950n6125N674j3370L2283M3035l1156n7862L927N008j127K2134
13243A30208J8828O0600L5772Q417J1420N0995J72566J30093J44343J74684J16181
13232A054107K0201J7594o8322j43671p4545j14285q2294n4238m5072r8513l7113
13221C73849l5772n059j8576K1616L0942N3323P2967l0754N0087P2172L0324j5242
$$ plain form
13304 -1314 1273 -42371 -60851 21287 7895 18612 110667 146762 138332 120155 137109 68715
13292 68715 3476 -37839 -61576 -25020 -15790 -29432 -35011 -51869 -18385 9582 43379 52844
13280 52844 63037 70681 52243 91942 100566 43798 63715 59686 -16878 -17883 2310 24684
13268 24684 25253 41827 23766 -5404 -2012 -3478 49314 101489 165193 185935 179160 157099 157837
13255 157837 177787 121662 127336 113966 146249 189284 158128 100266 104193 109201 108074 130208
13243 130208 149036 209636 245408 253825 265245 316240 488806 618899 763242 937926 1054107
13232 1054107 1074308 1091902 1023580 879909 805364 691079 608785 554547 509475 410962 373849
13221 373849 338077 333018 314442 336058 367000 420323 493290 462536 512623 584795 615119 599877
13209E99877J0822J02461O8995K7221J29207J15917Q9104N9333M7482l4005j00468
13198A115946r1430j09437j01017q5316q112L1918k1469p274m373l3478n6412
13187F29546o7760q0170o0302k4564j6087o1506j7815M7489R160k8876O3278R0750
13175D83143J08913J75284J76422J44740J67699R223p1412j38305j50483j51487
13165G53737j19479q8610r4181j18503r3598p5272k1487J9368o3327m2706J2427
13154F8369N571m6865j7902O1342M4113N1989K4697m8104m7802K8763J4405n9002
13142G9574J3477r222J2779J9378n3936J9984J4679j220n548k5850M4186k4255
13130H4026n9027k2856J097J1388l7755J6913L1594l2695J9809O8952L3730k0537
$$ plain form
13209 599877 610699 713160 782155 809376 938583 1054500 1143604 1202937 1250419 1216414 1115946
13198 1115946 1024516 915079 814062 728746 720634 752552 731083 723809 719436 685958 629546
13187 629546 561786 481616 421314 396750 380663 319157 301342 348831 357991 329115 392393 483143
13175 483143 592056 767340 943762 1088502 1256201 1265424 1194012 1055707 905224 753737
13165 753737 634258 545648 451467 332964 239366 164094 142607 161975 98648 55942 68369
13154 68369 73940 27075 9173 70515 114628 166617 191314 143210 95408 124171 138576 79574
13142 79574 93051 83829 96608 115986 62050 82034 96713 95493 89945 64095 108281 84026
13130 84026 24999 2143 3240 14628 -23127 -6214 25380 -7315 12494 81446 115176 94639
13118I4639l2436l5274m2805N1101K4040M7223j3989o1872k8380P822N1175N3266
13106A14510L7497O39m1868k8763j2840n5430l1722L6823L9897L1369l8337m764
13094D7011P9598M0745m2462m148m6278q736N4089m036L401k5619r176j861J9327
13081A01855l1693K5285J6165q3661m379N9016n1191n0882L5173N5946L6512m9825
13069E8321l8126O7092R8919o9009k6838J689k1777K5191J1918j3338j2864K601
13057H3779j4310m611k5501q754k22L6704M6924l416j0551j8723K0561m4057P8994
13044A36817O0993m918l7038q772O4667K9461K648M280k5938N4726l7443m5510
13032A93973J5096n0550k0113R325n0949K2049l2517k6360K6856P789j5237K5818
$$ plain form
13118 94639 62203 26929 -15876 35225 59265 106488 92499 30627 2247 10069 61244 114510
13106 114510 152007 152646 110778 82015 69175 13745 -17977 18846 58743 90112 51775 47011
13094 47011 126609 167354 124892 120744 74466 65730 119819 115783 119184 93565 84389 82528 101855
13081 101855 70162 95447 111612 27951 23572 82588 31397 -19485 15688 71634 108146 58321
13069 58321 20195 87287 186206 117197 90359 92048 70271 95462 107380 94042 81178 83779
13057 83779 69469 64858 39357 30603 30381 67085 114009 110593 100042 81319 101880 57823 136817
13044 136817 197810 192892 155854 147082 211749 241210 243858 248138 222200 276926 239483 193973
13032 193973 209069 158519 138406 147731 96782 118831 86314 59954 86810 94599 79362 105180
13020A05180J7783L5714M7283J0041Q598q990J0725r878j0485m1745k1119J5782
13008A58889q666J0998J6409L3638l8187n510j0721k2500j3457k1967l949P4716
12996A69693Q0631m6283J6393l329M7183m9922o4481J4415O1270K2520k4644J2555
12984B36001l795j8831p8748n3129l977N9289N5248N7961L3129N5233O3590m6912
12972C55059j48607k9536J8422Q375j8137l4344J5903L9695J094l5283N880J8439
12960A96960J6680J2511k8989n2511m9383r291j3657j636J4366M9217l3209K4765
12948A25823K0083m60K6250J9486j2189l3924k7064j714J8246J2247J9589M6652
12936B13025M5523j3153k8162M3387N2489q154K0062j2223O0748J3626q4459o6031
$$ plain form
13020 105180 122963 158677 205960 216001 224599 215609 226334 216456 205971 164226 143107 158889
13008 158889 150223 161221 177630 211268 173081 167571 156850 134350 120893 98926 94977 169693
12996 169693 250324 204041 220434 217105 264288 214366 149885 164300 225570 248090 223446 236001
12984 236001 232206 213375 134627 81498 77521 136810 192058 250019 283148 338381 401971 355059
12972 355059 206452 176916 195338 203713 185576 151232 167135 206830 207924 172641 178521 196960
12960 196960 213640 226151 197162 144651 95268 85977 72320 70684 85050 134267 101058 125823
12948 125823 145906 145446 171696 191182 178993 145069 118005 116291 134537 146784 166373 213025
12936 213025 258548 245395 217233 260620 313109 304955 325017 312794 373542 387168 302709 236678
12924B36678m6410J2211J9444L4011k3130n6484J3115Q7599O3199M3445j0460
12913C73218R213j3292q8820m3812L2822K2148Q8109J13368J66836R5181K8057
12902G83028K6307P5352K9642o532j4981o3372j00798q3655k8295n216r531k6826
12890E75123p3255n4763k2013K37O0548O277K4611P9588J3385l0437N950N0732
12878F35983M7954K8357N553M1252J9636j5843J6299o5232n1834m3920K8689K0159
12866F67053n2167j1215K6772J4331j3977k966k9785l416L7954L8042L1262L6814
12854G38702O76J6680L2884N2011L5222m2053p9289K1471P2021n439K7579R5711
12842I66176M7876k4512r4700M4293O9280O241P4968m819M606N8495M9606O1345
$$ plain form
12924 236678 190268 202479 221923 255934 232804 176320 189435 277034 340233 383678 373218
12913 373218 382431 369139 280319 236507 269329 291477 379586 492954 659790 754971 783028
12902 783028 809335 884687 914329 907797 892816 829444 728646 644991 616696 611480 601949 575123
12890 575123 501868 447105 425092 425329 485877 492154 516765 596353 609738 579301 585251 635983
12878 635983 683937 712294 717847 759099 778735 762892 779191 713959 662125 618205 646894 667053
12866 667053 614886 603671 630443 644774 630797 627831 598046 594630 632584 670626 701888 738702
12854 738702 739378 756058 788942 840953 876175 834122 754833 776304 848325 842886 870465 966176
12842 966176 1014052 989540 894840 939133 1008413 1014654 1089622 1084803 1089409 1147904 1197510 1258855
12830A258855M399J4256l003K2790N3578J0048P6014J26508R4329R1160N7944
12819A806878K0637P1611J43689J65404J73590J20226J38608J76422J05787J35008
12809C057860J73784K22330K98823L42055K92503L79359N30329N43283O26119
12800F466445P55212Q73486R69190J169246J229291J358641J680844K109511K802500
12791A9414366L710614M967729O909437R712933J3642061J9012931K5483282L2163732
12783A35017085L5853840L0561853J5459584j624221j5638006k4898722k8025599
12776A46705814k6178591k1913455j6877270j2117301q016325m494599j587737
12769E5520536R44443L362579O003081Q627308J1022830J2601282J2708070J0950701
$$ plain form
12830 1258855 1263254 1277510 1274507 1297297 1350875 1360923 1436937 1563445 1657774 1748934 1806878
12819 1806878 1827515 1899126 2042815 2208219 2381809 2502035 2640643 2817065 2922852 3057860
12809 3057860 3231644 3453974 3752797 4094852 4387355 4766714 5297043 5840326 6466445
12800 6466445 7221657 8095143 9064333 10233579 11462870 12821511 14502355 16611866 19414366
12791 19414366 23124980 28092709 35002146 44715079 58357140 77370071 102853353 135017085
12783 135017085 170870925 201432778 216892362 215268141 199630135 174731413 146705814
12776 146705814 120527223 98613768 81736498 69619197 61602872 57108273 55520536
12769 55520536 56464979 59827558 65830639 74457947 85480777 98082059 110790129 121740830
12761A21740830P988759N151706L316203L104514M710587Q437786J3475441J8510706
12753A86436532K1687032K0351467J2447121O48667j0116939j7548824k0702842
12746A93202214j9794223j6362673j1784128p386660l636183o31213J040698O00183
12738A35248015j952017n555610q845739j1130575j1739379j0919331r265510
12731G5839854p167517m676633j989688J101371M768368R343177J5265929K2342228
12723A14827089K9700630L4984379L4875625K5302994O978082j1914475k5559232
12716B09195092l2873594l3822977l0215530k4719159j9227800j4510050j0895275
12709D2930707q067168o020658m560065l422342k715157k207017j767575j540395
$$ plain form
12761 121740830 129729589 134881295 138197498 141302012 146012599 154450385 167925826 186436532
12753 186436532 208123564 228475031 240922152 241570819 231453880 213905056 193202214
12746 193202214 173407991 157045318 145261190 137874530 134238347 133607134 134647832 135248015
12738 135248015 133295998 127740388 118894649 107764074 96024695 85105364 75839854
12731 75839854 68672337 63995704 62006016 63107387 67875755 77218932 92484861 114827089
12723 114827089 144527719 179512098 214387723 239690717 246668799 234754324 209195092
12716 209195092 176321498 142498521 112282991 87563832 68336032 53825982 42930707
12709 42930707 34863539 28842881 24282816 20860474 18145317 15938300 14170725 12630330
12701A2630330j400988j166779j042313q77813p35563o52108o04688n01200l42779
12692E306099l28341l53862l17809k48596j98624k21092k17068j44092j36997
12683C139618j54600p1503j60623j26010q5972q8226j15071o3638o5160m2968
12673B165847j12610o9655k3953j27610p5734j7236k5897p5266k9925n343l9093
12662A563525j9051n577K0442k9073p433L3771L425R149o8077o2540l0945p0240
12650A337376n6414k9404l7408o4959q0267q5481J3812O955n2313J8766J9425
12639I90088O780J9423Q866j0904p1040J460J2794p120n2697n7647K3973Q478
12627H72454n988K0596P630J423J5276K7482M8753K6426l4517m7114j5402l537
$$ plain form
12701 12630330 11229342 10062563 9020250 8142437 7406874 6754766 6150078 5648878 5306099
12692 5306099 4977758 4623896 4306087 4057491 3858867 3637775 3420707 3276615 3139618
12683 3139618 2985018 2913515 2752892 2626882 2540910 2452684 2337613 2273975 2208815 2165847
12673 2165847 2053237 1983582 1959629 1832019 1756285 1739049 1713152 1637886 1607961 1602618 1563525
12662 1563525 1544474 1538897 1559339 1530266 1522833 1556604 1560029 1569178 1501101 1438561 1407616 1337376
12650 1337376 1280962 1251558 1214150 1149191 1068924 983443 997255 1004210 951897 970663 990088
12639 990088 996868 1016291 1025157 1014253 943213 944673 957467 950347 897650 840003 863976 872454
12627 872454 866466 887062 894692 896115 911391 938873 987626 1014052 979535 932421 917019 913482
12615I13482n6161P4360M6626j9599l0145j6750p3157J5886O1290M4544K7548
12604I87924O8264N9223N7309N3015k1548m4320n0578n2250r7216o9597Q2623
12593I72849L0479m9945o4448q8977j29746l0707m1967q4030l3555L0667m4235
12582D66385o9124O6692M5426K1845J1197m6063j00136l8147L7132k3789p946
12571C63472l1300l3269n5319k8612J1330N3178q171K3256M2593j1104q167J8984
12559C36871r732o8856o855M0284j7536K6136q143k9445j2499K1168J3262O8239
12547C52894j5994j1262K7430o8449p8261J422k8975P888o860j4984m7025n0436
12535F7388J8656P9925R4174M5158L9232N816J4588o0503n0725k475m1821j1672
$$ plain form
12615 913482 857321 931681 978307 958708 928563 911813 838656 854542 915832 960376 987924
12604 987924 1056188 1115411 1172720 1225735 1204187 1159867 1109289 1057039 959823 890226 972849
12593 972849 1003328 953383 888935 799958 670212 639505 597538 513508 479953 510620 466385
12582 466385 397261 463953 509379 531224 542421 496358 396222 358075 395207 371418 363472
12571 363472 332172 298903 243584 214972 226302 279480 271309 294565 337158 326054 317887 336871
12559 336871 327139 258283 251428 291712 274176 300312 292169 262724 250225 271393 284655 352894
12547 352894 336900 325638 353068 284619 206358 207780 178805 186693 179833 164849 117824 67388
12535 67388 86044 165969 260143 305301 344533 350349 364937 304434 253709 251234 209413 197741
12523A97741l8518L6897J9442r717K127Q865M2757N0216M946j8761r531m8089
12511B38375q969l1373k8615K1912L5243m6490n2711L0429M3255K6654M3575L1925
12499C03210J1824l4215n5491k8529N0305M5841J7682P996j3665J5690J8370j5477
12487C23541p780n6277n0914r925l7543O581o02K2686j6171k3703L32M730j7163
12474A37792N561L7887p747K4145k6012M8773L0309J0116o8578p0543K9235K4429
12462A75367J7572l7177N978k2421M76j4242J7674K7161Q590l3933j7858k4169
12450A03018K4634J1328k9966k3423J8540j6503p259J9537P201R952J3497K3019
12438A53575l6033p5483K4288L8194N736O045O8195J1546J9756q096k6844m0709
$$ plain form
12523 197741 159223 196120 215562 205845 207972 216837 259594 309810 314756 295995 286464 238375
12511 238375 229406 198033 169418 191330 226573 180083 127372 157801 201056 227710 271285 303210
12499 303210 315034 280819 225328 196799 247104 292945 310627 318623 304958 320648 339018 323541
12487 323541 315761 259484 208570 198645 161102 167683 167081 189767 173596 149893 150225 154955 137792
12474 137792 143353 181240 173493 197638 171626 220399 250708 260824 192246 121703 150938 175367
12462 175367 192939 155762 161740 139319 139795 125553 143227 170388 178978 145045 127187 103018
12450 103018 127652 138980 109014 85591 104131 87628 80369 99906 107107 117059 130556 153575
12438 153575 117542 42059 66347 104541 110277 116322 184517 196063 215819 207723 180879 140170
12426A40170J5270J0296l3725L9334K6897k5746o7255m365q337j5553n6533q439
12414A2014K2208L8226L8115n0019P622L539M9640j2315k3912p1261j0460j4862
12402a1465O8618M7310O1273J5316q4833q5509j443k589K103m3711k8766j4720
12390g8416j6142L3281N8046O7713K1297j5176o0091O920K6424J3685m0025J9853
12378C7369k1405K3019K6626N2445P426r349k8894n0570k6608L8203O2276j1547
12366I8991j5838K8571k587o0965j0590M9173K1716k9836m2496j7208Q8456P3343
12354A80730l0099l0885J221q166q613l4835J506n311K193L6082M4242m1850k0363
12341H5852L3608M2928j4685j3065n8485J9490O2172k7085j3103Q5782J12756
$$ plain form
12426 140170 155440 165736 132011 171345 198242 172496 105241 100876 92539 76986 20453 12014
12414 12014 34222 72448 110563 60544 68166 71705 121345 109030 85118 13857 3397 -11465
12402 -11465 57153 104463 165736 181052 96219 10710 9267 6678 8781 -34930 -63696 -78416
12390 -78416 -94558 -61277 -3231 64482 85779 70603 10512 17432 43856 57541 17516 37369
12378 37369 15964 38983 65609 118054 125480 116131 87237 36667 10059 48262 110538 98991
12366 98991 83153 111724 109137 48172 37582 86755 108471 78635 36139 18931 107387 180730
12354 180730 150631 119746 120967 112801 104188 69353 70859 65548 67741 103823 148065 106215 85852
12341 85852 119460 162388 147703 134638 76153 95643 157815 130730 117627 203409 316165
12330C16165O4022N5636O2704J69387J63184J56317J17537M2076k7938j41969
12320I77121j62655j01263j36808n7419q034k8436n3531J733m3926j7302l0166
12309C39314O4664N2845O485P8472J01509R001N690J513M8622M2662O1943J12470
12297I25190J87534M1994P0035Q2489N907j21899j30147n2506r274j7052n9649
12286I22622j2358o9898k7291M603k7329j7220j6573m7861j0328p5269q1027M3667
12274E85738J691q1072m7831j291k0585k2774M8457R5573J45256K28643K01437
12263A133242J18325Q4251N9502r2992j39261j54025j87781k11912j60558n2804
12253C95987o7097r6308o4260J2892o428j5395j6903J0879k5084K0857L7455M1307
$$ plain form
12330 316165 380187 435823 498527 667914 831098 987415 1104952 1147028 1119090 977121
12320 977121 814466 713203 576395 518976 510942 482506 428975 430708 386782 369480 339314
12309 339314 403978 456823 463308 541780 643289 652290 657980 659493 708115 750777 812720 925190
12297 925190 1112724 1154718 1224753 1307242 1313149 1191250 1061103 1008597 999323 982271 922622
12286 922622 910264 840366 813075 817678 790349 773129 756556 708695 698367 623098 542071 585738
12274 585738 587429 506357 458526 457235 436650 413876 462333 557906 703162 931805 1133242
12263 1133242 1251567 1335818 1395320 1302328 1163067 1009042 821261 609349 448791 395987
12253 395987 328890 232582 168322 181214 174786 159391 142488 153367 128283 149140 186595 227902
12241B27902k1873j28364p9508M4605K2636k9392M1348J704N4750L9595K3852
12230A97255L3934p8165m1254N4758J2932l1257j2580l1082k1925M1768k5321
12219I9063j2J7160n7837K0568Q419L7491M9601m2027p9809O454Q285K0753j5871
12206G2238J5534K6320o0209m087l440J9891N048N475j6267M5522O5743L3899
12194B05667K0143k6731m5460K6948r993K7763k3160j9794J19473Q4010Q1576
12183D40442J00900J53788K00896J02042J45703P0461R959o5708j07700j04886
12173I45897j71593j34467l5946r702p1868n9969n0819L33m612N5140R3492K8378
12161E84264P1675N1771O5389m7602q6895k0456l154J3345N4627J03853R5298
$$ plain form
12241 227902 206029 77665 -1843 42762 65398 36006 77354 79058 133808 173403 197255
12230 197255 231189 153024 111770 166528 179460 148203 135623 104541 82616 124384 99063
12219 99063 99051 116211 58374 78942 87361 124852 174453 132426 52617 59071 67356 88109 72238
12206 72238 87772 114092 53883 49796 46356 66247 71295 76770 60503 106025 171768 205667
12194 205667 225810 199079 153619 180567 170574 198337 175177 155383 274856 358866 440442
12183 440442 541342 695130 896026 998068 1143771 1214232 1224191 1158483 1050783 945897
12173 945897 774304 639837 603891 594189 522321 462352 411533 411866 407254 462394 555886 584264
12161 584264 655939 707710 773099 725497 638602 618146 614992 628337 682964 786817 882115
12150H82115O9927N0091J40162J25934N0312j3489k3737o7001q5163p3097j627
12139A054427j36083j25167k4226j7335j8117m7854j29747m9448p6759o2122N3597
12128D21166J1760n2466k8192N426Q5878Q5725L7682J20210J23299N2634J71180
12117A034302J02257K1015p3407p6149o7039j07978j18775l5909m0499j24383
12107E13435j10973o4526m8019k8092l550j324l6662o8492k3044n326K0180K5184
12095A68791p07J9949o536n5384p247N4548j4701K5359K4430j4147j8647j3082
12083A62626M450p5657K8123M8928r87R690l4664J0922L7960N051j3193k8681
12071A54568m7257K9925L5925K3117M6736O713l9616p2550k3034J2836O0313P444
$$ plain form
12150 882115 952042 1002133 1142295 1268229 1318541 1305052 1281315 1214314 1129151 1056054 1054427
12139 1054427 918344 793177 768951 751616 733499 685645 555898 506450 429691 367569 421166
12128 421166 432926 380460 352268 357694 443572 529297 566979 687189 810488 863122 1034302
12117 1034302 1136559 1157574 1084167 1008018 940979 833001 714226 678317 637818 513435
12107 513435 402462 337936 289917 261825 258275 256951 220289 151797 128753 123427 143607 168791
12095 168791 168084 188033 181497 126113 118866 173414 158713 184072 208502 194355 175708 162626
12083 162626 167076 91419 119542 168470 167483 177173 142509 153431 191391 196442 183249 154568
12071 154568 107311 137236 173161 196278 243014 249727 210111 137561 114527 127363 187676 195120
12059A95120m0459q9959j2478L1965J9858M3130j3386q867n926K9659j37l1850
12047A16670K517L2616m8978l3801K9241M0014K4160L7823N180M428K5476l4863
12035B00483l1378l8665j9612N6495J1474m2219l415N7484k414l4367o2205R679
12023A01340M735k2916L3998L8829l0697J6483k58L609K1645K0773j9436j492
12011A66613K804n8103L4489O7350M2532N4911l1291m4246J4915m8376k8500n417
11999A67681K2717l7229m2243P2362Q7690j7129k1378N7627k80p2781n0665k922
11987A63450K8136j2877J1342k8700j6945p147j1547n620L2004M4108K8703L4349
11975B59256k7938J5610K3095J1567n5346l8134j4277J7357K3696q258j8057L47
$$ plain form
12059 195120 154661 64702 52224 84189 104047 147177 133791 124924 118998 148657 148520 116670
12047 116670 119187 151803 102825 69024 98265 138279 162439 200262 205442 209870 235346 200483
12035 200483 169105 130440 110828 167323 178797 136578 133163 190647 188233 153866 91661 101340
12023 101340 106075 83159 117157 155986 125289 141772 141514 145123 166768 187541 168105 166613
12011 166613 169417 111314 145803 213153 255685 310596 279305 235059 249974 201598 173098 167681
11999 167681 190398 153169 110926 183288 270978 253849 232471 290098 289818 217037 166372 163450
11987 163450 191586 178709 190051 161351 144406 137259 125712 120092 152096 196204 224907 259256
11975 259256 231318 246928 270023 281590 226244 188110 173833 191190 214886 206628 188571 188918
11963A88918k3364j4992N1544j459J3270K3623J8411j5352k7536j1196l5227J8546
11951A85186M4594M710m2174J0379K4247J4421j8439l8174o0960l214K8668P3336
11939B22580M867n8224K474N7554O5459j758j783J1636n3770m3648p3498j2202
11927A19687L5102l0895n6561p7517J7659P2148N4217J8134M7389k4418R374K2804
11915B07123K4786K195K5426k4897l9252l9816P2636K8136l5020L6578N2041J6046
11903C25982L0829O021k1613l4535p187L7129J5842K7180p7351q5748M9602N2532
11891C18683K5905K0036J2271l6154N0860M5231Q212J1758P919k4940J8011O7841
11879E25633Q8828P6693P4102Q3119N6397J45086J67672L7811L2976k3059n4161
$$ plain form
11963 188918 165554 150562 202106 200647 213917 237540 255951 240599 213063 201867 166640 185186
11951 185186 229780 234490 192316 202695 226942 241363 222924 184750 123790 120576 149244 222580
11939 222580 227447 169223 171697 229251 294710 292952 291169 302805 249035 205387 131889 119687
11927 119687 154789 123894 67333 -10184 7475 79623 133840 151974 199363 174945 184319 207123
11915 207123 231909 234104 259530 234633 195381 155565 228201 256337 221317 257895 309936 325982
11903 325982 356811 362832 341219 306684 299497 336626 352468 379648 302297 216549 266151 318683
11891 318683 344588 364624 376895 340741 391601 436832 445044 456802 464721 439781 457792 525633
11879 525633 614461 691154 765256 848375 904772 1049858 1217530 1255341 1288317 1265258 1211097
11868A211097o2837j09655r9540o9723o6723j46535r7786k5472M0791j5496K7799
11857E85920L8862l1233L6534j5267K2857N6772j1983k4695o466J8642K8074J0588
11845G08605R3811J1199l2079l6692p8588j4681K1872l2693K4636k8039j6176
11834F21175N0235j046K2252M407K6378j4283o714l2234M6772N5162K7178l761
11822G95521j6873M9744K1803Q0008N4829L7955J1930J8464L8124l2837j1652
11811A047016O3771K3554n2516n3630j8655O0354J19417m863K7433R1954M5547
11800A349382L4279N9901M5368M6861M5733P4124J37289P9778L0465R7728R9607
11789B100515P2925R1023J32759J19059J60217K03848K27497J31816J64781K60067
$$ plain form
11868 1211097 1148260 1038605 939065 869342 802619 656084 558298 532826 573617 558121 585920
11857 585920 624782 593549 630083 614816 637673 694445 682462 657767 651301 669943 698017 708605
11845 708605 802416 813615 781536 744844 666256 651575 673447 640754 665390 637351 621175
11834 621175 671410 670364 692616 697023 723401 709118 702404 670170 716942 772104 799282 795521
11822 795521 778648 828392 850195 930203 985032 1022987 1034917 1053381 1091505 1058668 1047016
11811 1047016 1110787 1134341 1081825 1028195 1009540 1069894 1189311 1184448 1211881 1303835 1349382
11800 1349382 1383661 1443562 1488930 1535791 1581524 1655648 1792937 1872715 1903180 2000908 2100515
11789 2100515 2173440 2264463 2397222 2516281 2676498 2880346 3107843 3239659 3404440 3664507
11779C664507K32969K34476L48685M05692M28910M80056N69053O82403Q05615
11770G852366R58503J145412J418279J773167K122883K560153L151280L874980
11762B4857023N058581O900203R594291J3357215J8333516K4718684L1572874
11755A34392387L6018855L3965052K3832356Q163359p980191k0476960k7488296
11748A80426562k8962169k6466048k1857830j6523505j1496129p129550l404827
11741F4586504n5156L206883O458171R211319J0944948J1198159J0218681Q265990
11733A24035499N629638K503716l13120j990102j737924R69329N910398J2451225
11725A47458659J9254121K4138598K4612663J9344417R170660k810488j3067524
$$ plain form
11779 3664507 3897476 4131952 4480637 4886329 5315239 5795295 6364348 7046751 7852366
11770 7852366 8810869 9956281 11374560 13147727 15270610 17830763 20982043 24857023
11762 24857023 29915604 36815807 46410098 59767313 78100829 102819513 134392387
11755 134392387 170411242 204376294 228208650 236372009 228391818 207914858 180426562
11748 180426562 151464393 124998345 103140515 86617010 75120881 67991331 64586504
11741 64586504 64531348 67738231 74196402 83407721 94352669 105550828 115769509 124035499
11733 124035499 129665137 132168853 131855733 129865631 128127707 129097036 135007434 147458659
11725 147458659 166712780 190851378 215464041 234808458 243979118 241168630 228101106
11718B28101106j8990022k0013746j7112139j2404777p827005m703264l422314
11711A43627839l712782n142846p434155r979815j1841391j2487990j1790693
11704H1238167r903059p534427n050186k513327P5107K873220O223570J0292956
11696G5702021J5110944K0574599K6008717K9069333K6323297J6220362J383734
11689B10393007j2988553k3145755k7827968k7739811k4532261k0198497j5782132
11682E8178030j1886893q804850o533538m978290l948084l226988k584778k158728
11674A4055881j778926j488441j226253r98203q96642p79860o06451m70309m26941
11665E383855l52865l31732k89789k45418k55337j80485k12341j84638k04720
$$ plain form
11718 228101106 209111084 189097338 171985199 159580422 151753417 147050153 143627839
11711 143627839 139915057 134772211 127338056 117358241 105516850 93028860 81238167
11704 81238167 71335108 63800681 58750495 56237168 56312275 59185495 65409065 75702021
11696 75702021 90812965 111387564 137396281 166465614 192788911 209009273 210393007
11689 210393007 197404454 174258699 146430731 118690920 94158659 73960162 58178030
11682 58178030 46291137 37486287 30952749 25974459 22026375 18799387 16214609 14055881
11674 14055881 12276955 10788514 9562261 8564058 7667416 6887556 6281105 5810796 5383855
11665 5383855 5030990 4699258 4409469 4164051 3908714 3728229 3515888 3331250 3126530
11656C126530j67071p8197p6441q3489n2487o7709j32188j23060j15805n5838
11646B174245o5739q1542q1814n609k5450n4494n7828n2246j22998q9159k3072
11635A514294j295O4484M4041o227k3664n6237J9917N8689L9912N1073q286j19551
11623A577150r8257k0652p7627j20689j34447o9995K1824M3801o538l436r2738
11612A018396l9799p368L0021M7732P765j7535m3782j0924l0828k2732j1819j06067
11600H13060n6625m7832L4296Q1254K3152O9000K2869M2851q824l013k2611k6848
11588I20729m2504l2487L3015l8206k7509j7490j5831q583l4013o0594o049J3754
11576F84232M4735N6187K7229l3978M1577M1200L175o61k5223J1542K5643O9829
$$ plain form
11656 3126530 2959459 2881262 2804821 2721332 2668845 2601136 2468948 2345888 2230083 2174245
11646 2174245 2108506 2026964 1945150 1939541 1914091 1859597 1801769 1749523 1626525 1537366 1514294
11635 1514294 1512999 1577483 1621524 1615297 1591633 1535396 1555313 1614002 1653914 1704987 1696701 1577150
11623 1577150 1478893 1458241 1380614 1259925 1125478 1055483 1077307 1121108 1114570 1111134 1018396
11612 1018396 978597 971229 1001250 1048982 1056747 1039212 995430 984506 953678 930946 919127 813060
11600 813060 756435 708603 742899 824153 847305 916305 939174 982025 973201 970188 947577 920729
11588 920729 878225 845738 878753 840547 813038 795548 779717 771134 737121 676527 670478 684232
11576 684232 728967 785154 812383 778405 819982 861182 864357 863696 838473 850015 875658 945487
11564I45487P324o2742o8532l1478q6731o2951m5834o4800q1119j100J1210J8333
11552D77067n6255q2106L0710j0609o8895k5335K0230K2531N5811j6529r7742
11541B48878n0419j9773p193L2625J9669L0461N9682Q499K4092k639l3627o829
11529C03426K7097O038l037M1092r422l6366R817J6036k6284l3678J4039j271
11517C07487m7027K6932J8482m6242m0326j3362k2574j1800j6872l977J3434P8546
11505B42701J26229O1929l0405k8828j5327r701J1595L0795o1711n5478l9687
11494B32112k4486K4433Q4253j5680r9030k0235m0113l877J5124J4043k4181P623
11482A49986q678K5221k9976j7007J2832L5340o689K6718Q3090K3388q042l2392
$$ plain form
11564 945487 952811 890069 821537 790059 703328 640377 594543 529743 448624 447524 458734 477067
11552 477067 420812 338706 369416 358807 289912 264577 284807 307338 363149 346620 248878
11541 248878 198459 178686 171493 204118 223787 254248 313930 322429 346521 343882 310255 303426
11529 303426 330523 336561 333524 374616 365194 328828 338645 354681 328397 294719 308758 307487
11517 307487 260460 287392 305874 259632 219306 205944 183370 171570 154698 150721 164155 242701
11505 242701 368930 430859 400454 371626 356299 346598 358193 388988 327277 271799 232112
11494 232112 207626 232059 316312 300632 201602 181367 141254 137377 152501 166544 142363 149986
11482 149986 141308 166529 136553 119546 132378 167718 161029 187747 270837 294225 286183 253791
11470B53791j7170j1631J3716N864R717J4695j9930K4030P4605J2825n7804j4225
11458B88483l0479m7691o351l5003P453N2731r854m8740l4766k7121j1511m9403
11446D7748l1767K7984k5649j4145Q9873K7243J6006j9914J2143N4577J4270k9317
11434A69052P0884j2953l6982j2189o625J0751l7987p023J4534K4545K957j4660
11422A64304m1593j2599J9662P2047m6458q9026o1791k9946K5148j0116Q223Q6094
11410H3949O5323j0020m0496r674l6333l0089l4540L0085N2841M1026J4742K697
11398A29511J4688j1608l9884n102L2921J3417q3471p9825M5480J5312m841k5621
11386I77P1584J6174l105J0597L6442j0704k1796p662K8594j3238p971j2705m2985
$$ plain form
11470 253791 236621 224990 238706 244570 254287 268982 249052 273082 347687 360512 302708 288483
11458 288483 258004 210313 203962 168959 176412 229143 219289 170549 135783 108662 97151 47748
11446 47748 15981 43965 18316 4171 94044 121287 137293 117379 129522 184099 198369 169052
11434 169052 239936 226983 190001 177812 171187 181938 143951 136928 151462 176007 178964 164304
11422 164304 122711 110112 129774 201821 155363 66337 4546 -25400 -252 -10368 -2145 83949
11410 83949 149272 139252 98756 89082 52749 22660 -11880 18205 71046 112072 126814 129511
11398 129511 144199 132591 92707 87605 120526 133943 50472 -29353 16127 31439 26598 977
11386 977 72561 88735 85630 96227 132669 121965 100169 92507 121101 107863 99892 87187 44202
11373D4202k3623O4098K2273k1624j8156K8243K1891K2988j2608n4306j8327K4075
11361G9126K6799m4224l7069L5244j1134L684J1027L0286l2550r985k9556j9517
11349B131o7355l3500O4620O9341M3438l5328K991k4997J0991P8713J2409N108
11337A28562L340j362j5716M261m1522M5201R6123Q3669k466J9434J03763J04474
11325E27761J48894J57560J24806R3270J7846P8604q503l0057m7810q4373j43881
11314H34117j21132j11486q3719o1678q963J0244L932K889J7894K6450K9737P2023
11302F10308J16907K0490j4663L3366O9053J9893n659j1361J9603J09484J63946
11291A131367J01353K4925m727j5678j0576j46378j24630L8457J3476o1742m2217
$$ plain form
11373 44202 20579 84677 106950 85326 67170 95413 117304 140292 127684 73378 55051 79126
11361 79126 105925 61701 24632 59876 48742 52426 63453 93739 61189 51204 21648 2131
11349 2131 -65224 -98724 -34104 35237 78675 43347 46338 21341 32332 111045 123454 128562
11337 128562 131902 130540 114824 119085 77563 122764 218887 302556 300090 319524 423287 527761
11325 527761 676655 834215 959021 1052291 1070137 1148741 1140238 1110181 1062371 977998 834117
11314 834117 712985 601499 517780 456102 447139 457383 461315 464204 482098 508548 538285 610308
11302 610308 727215 747705 733042 766408 835461 855354 849695 838334 857937 967421 1131367
11291 1131367 1232720 1257645 1252918 1237240 1226664 1080286 955656 994113 1007589 945847 903630
11280I03630o9805m4976j4136k259J1084p4648n4824j00696k683j7824l461o0759
11268D68643o6129j6570L1330O5594M7651J03712J80865J14362J29137Q6784K2775
11257A168154p531j37676j95434j83253j04953r6553m8087l8692n9565m1474o3797
11246A91139n6346j1953J4679j819k7633l7171L4352M9365j2500q636J2810j5343
11234A30944k469j367j327k7740L1856j2666j7636q350J4765j8014q768K3738
11222A02966k3728m301p202N9969O022M504m7315j4278K6987K624k2684n553J9221
11209I7232J1938j7215k6732r3801k7887N921j1694M0219P832n295J8858O0805
11197F0181L7481n4835j9360o82O4501J8788M33o1863q7812l0518O7282K7896
$$ plain form
11280 903630 833825 788849 774713 772454 783538 708890 654066 553370 550687 532863 529402 468643
11268 468643 402514 385944 417274 482868 530519 634231 815096 929458 1058595 1145379 1168154
11257 1168154 1160623 1022947 827513 644260 539307 442754 394667 355975 296410 254936 191139
11246 191139 134793 122840 137519 135700 108067 70896 105248 154613 142113 133477 146287 130944
11234 130944 128475 127108 125781 98041 129897 117231 99595 91245 106010 87996 79228 102966
11222 102966 79238 74937 67735 127704 133726 138230 90915 76637 103624 106248 83564 78011 97232
11209 97232 109170 91955 65223 -28578 -56465 -50544 -62238 -22019 -14187 -19482 -624 60181
11197 60181 97662 42827 23467 22785 87286 106074 106507 44644 -43168 -73686 -6404 21492
11185B1492l1983m8048r370J7738N9119J7229Q123L6567P176m3421j2601p42m1903
11172b0624L0297K9981P909Q74j7278k735l958j5999l589O4322j2338M914J8858
11159H0634L1872r400j2608L00k1571k3099m6055j126M3283N5446o080n019K4105
11146A10682j7425m7823M117k2478j4449J891k5178q865J5651J9765J404J5825
11134C3117N0543l6202o5453L5709K6511l261M9708k3310o7806j0032j8216L951
11122b4741J3631N9934n109L4280M1125l6553J2979L5836j8107l4272j6461K4515
11110H7057M5858N5275j484n3466n3088l4588M119M8482J2479k787m3897j2492
11098E1468k0060N2512j4045l5047j5896k3972k359J24K9473Q157m57Q969j4944
$$ plain form
11185 21492 -10491 -58539 -67909 -50171 8948 26177 34300 70867 78043 34622 22021 21279 -20624
11172 -20624 9673 39654 47563 48437 31159 28424 24466 8467 4878 69200 56862 61776 80634
11159 80634 112506 103106 90498 90798 69227 46128 73 -1053 42230 97676 91596 86577 110682
11146 110682 93257 45434 49551 27073 12624 14515 -10663 -19528 -3877 15888 17292 33117
11134 33117 83660 47458 -17995 17714 44225 40964 90672 67362 -444 -10476 -28692 -24741
11122 -24741 -11110 48824 43715 77995 119120 82567 95546 131382 113275 79003 62542 87057
11110 87057 132915 188190 186706 133240 80152 45564 49683 98165 110644 107857 63960 51468
11098 51468 31408 83920 69875 34828 18932 -5040 -7399 -7275 22198 30355 29898 38867 23923
11085B3923n1107L036L7306O0737P407K6832l3331k7086p137k1524M669j6501
11073G224n3511o42O0620K56J2930J1407L5802L5518L5600J9071l2647m7963P733
11060I1398k9474j449k0391q077l4184M7432N3605m9904j6148R26L4599J3292
11048H1625o0604p7740j1633j745L2681M5684J0007l2433M750M3117K0075o673
11036D7111k2205l104p9608Q689J1965r877O9640L4662m6074j5812J4452K0248
11024C0087L1708K5925k0415l274J003o048o451k536p330m061L6582j5884M696
11011F4002l309M2515n766j7282j8137j2530O16K6924J2385J1704P8237J20173
10999B99532K0767o3268o5835L295O725m4588l475j6609n8768j3934K4154O966
$$ plain form
11085 23923 -27184 -24148 13158 73895 81302 108134 74803 47717 40580 19056 23725 7224
11073 7224 -46287 -46929 13691 13947 26877 38284 74086 109604 145204 164275 131628 83665 91398
11060 91398 61924 60475 40084 32007 -2177 45255 98860 48956 32808 33734 68333 81625
11048 81625 21021 -56719 -68352 -70097 -37416 8268 18275 -14158 -9408 33709 53784 47111
11036 47111 24906 21802 -57806 -49117 -37152 -47029 22611 57273 11199 -4613 9839 30087
11024 30087 61795 87720 67305 64031 65034 58986 52535 49999 42669 38608 75190 59306 64002
11011 64002 60693 103208 97442 80160 62023 49493 50109 77033 89418 101122 179359 299532
10999 299532 320299 257031 191196 194491 201216 156628 153153 136544 77776 63842 87996 94962
10987I4962N1168J7980k5245m9277p3921j9656j8927K9173K4270L7293k6781j8241
10975B2798o1892L8904N1789l0678j2738N8052N2884m5679m9205k7182j0240Q714
10963d473k2241J0403j1926J3417J0482L9840K416K4846l2770o4836L9160K8353
10951C2671n76j9919K2328O085j1234o636P723K3768K985j4070m796l0927J5266
10938B2668J15322M8791L15o3601n8602l2673K5780m405l9129q669n326l7245
10926c6774l7644O8035K6010r576N4103L4734m3068L2425P983P502o4197k8518
10914A1015K9608K8940M4896k9513k1485j8415q69m7247l3816K2Q0624l6347J6981
10901B4394K2664m8300J360l0409j8335K9053M6128K0809j7263r438k4854l1123
$$ plain form
10987 94962 146130 164110 138865 89588 15667 -3989 -22916 6257 30527 67820 41039 22798
10975 22798 -39094 -190 51599 20921 8183 66235 119119 73440 24235 -2947 -13187 -4473
10963 -4473 -26714 -16311 -28237 -14820 -4338 35502 37918 62764 29994 -34842 4318 32671
10951 32671 32095 12176 34504 40589 29355 22719 30442 54210 57195 43125 38329 7402 22668
10938 22668 137990 186781 187096 123495 64893 32220 58000 53595 14466 5797 471 -36774
10926 -36774 -74418 -6383 19627 10051 64154 98888 55820 88245 96228 103730 39533 11015
10914 11015 40623 69563 114459 84946 63461 45046 44177 -3070 -36886 -36864 43760 7413 24394
10901 24394 47058 -1242 118 -30291 -48626 -19573 26555 47364 30101 20663 -4191 -35314
10889c5314k889N4802J5849m6915L1449k9769n9979K0906o1706L1515Q0259r920
10877a1712m7641m3662l3043L3202N3528j781J3920j081J4645m1931P055L2046
10865b6455L5150j9538n884K7876M3409J6162n5977j6567L8436n3630J5117O3042
10853F1141l5807n7327J0045O833J2823N9392O688L1812J3204m5448k9927j1558
10841B1871M041l917Q301l4439m8354P3791L3232n008L404m6168n8397n9876O1800
10828d9719Q935m2165K3946L1651j4628L900j4095N1974J0450K3475m6198m7332
10816e9806M6433M7506j8855r603N7618k3408k0448j2366J5494J3569l6496K912
10804B550N4471L1020j9720l1383n8992m4287K4207L5209m9940J2057N3222M0235
$$ plain form
10889 -35314 -38203 16599 32448 -14467 16982 -12787 -72766 -51860 -113566 -82051 -1792 -11712
10877 -11712 -59353 -103015 -136058 -102856 -49328 -51109 -37189 -38270 -23625 -65556 -58501 -26455
10865 -26455 8695 -10843 -16727 11149 54558 70720 14743 -1824 36612 -17018 -1901 61141
10853 61141 25334 -31993 -21948 -15115 -2292 57100 63788 95600 108804 63356 33429 21871
10841 21871 25912 21995 30296 -4143 -52497 21294 54526 49518 52922 6754 -51643 -111519 -49719
10828 -49719 -40784 -82949 -59003 -27352 -41980 -38080 -52175 -201 10249 33724 -12474 -59806
10816 -59806 -13373 34133 15278 5675 63293 39885 19437 7071 22565 36134 -362 2550
10804 2550 57021 88041 68321 36938 -22054 -66341 -42134 -6925 -56865 -44808 8414 48649
10792D8649k4304m266o283m3604J496R839j0543m0452j449j7572L3496M3871P2385
10779F1263P238n9638j8368L368j093M146j1190k1259O0025J7504m03n123p1852
10766c5382j6727N3466M8936l791l9582K3146m4049l8865m4091M8360O8230j4762
10754D889J3668J0984J4951k3302J2871j1082m7551l9861P027J5397j584O5699
10742B2106J0716n482M9718L7208n2027r0162J1817J00877j9427n0970l0185k0440
10730c6251K4603M4358J6959r527l530m534m2190L1664l2904j7624K3721J5189
10718I934p3952j311l3120K3627K4112N4370M0716o0346P576Q1880p4569l4565
10706c5648Q1916O8747J1590k8829m9250K3118k4030l6554n7694k8919P9281N8545
$$ plain form
10792 48649 24345 20079 13796 -29808 -28312 -18473 -29016 -69468 -70917 -88489 -54993 -11122 61263
10779 61263 68501 8863 -9505 -6137 -7230 -3084 -14274 -35533 24492 41996 41593 36470 -35382
10766 -35382 -52109 1357 50293 46502 6920 30066 -13983 -52848 -96939 -48579 19651 4889
10754 4889 18557 29541 44492 21190 34061 22979 -24572 -64433 -57406 -42009 -43593 22106
10742 22106 32822 27340 77058 114266 62239 -27923 -16106 84771 65344 14374 -15811 -36251
10730 -36251 -11648 32710 49669 40142 36612 32078 -10112 21552 -11352 -28976 -5255 9934
10718 9934 -64018 -65329 -98449 -74822 -50710 3660 44376 -15970 -8394 73486 -1083 -35648
10706 -35648 46268 115015 126605 97776 48526 71644 47614 11060 -46634 -75553 3728 62273
10694F2273J3918k318K5746J6271j7291N379J9395m0986k4807j7255p942k5145
10682G238J8777J7643o353n637m674l8201l6055q668K1040K2065J6620M483L9630
10669D7908k673p699k6794j7011L1619j0371k9764J0343R056L6753L4777K1369
10657I7513j7462K059m830M905M471k1553m0641k9787L3688m766O4797j6732k7401
10644D4261j5042J253L6050j2139k371J6567j9015k7077o0028J4618M3935J6323
10632C7335m5483J2906L2348J5178k1825o8530J7048M9499N172p366n142l4680
10620a3540Q274k3951l397m109K4071J8008k7700J5172L7005K0927o75o912r687
10607C3486k1128o3881j6631L031m0701O373N2696J37K6401n2425j1718P9053
$$ plain form
10694 62273 76191 73873 99619 115890 98599 103978 123373 82387 57580 40325 32383 7238
10682 7238 26015 43658 37305 31668 26994 -11207 -47262 -55930 -34890 -12825 3795 8278 47908
10669 47908 45235 37536 10742 -6269 25350 14979 -14785 -4442 4614 41367 76144 97513
10657 97513 80051 82110 77280 82185 86656 65103 24462 -5325 28363 23597 88394 71662 44261
10644 44261 29219 30472 66522 54383 52012 68579 49564 22487 -37541 -22923 21012 37335
10632 37335 -8148 4758 37106 52284 30459 -38071 -21023 28476 33648 26282 21140 -13540
10620 -13540 -5266 -29217 -32614 -36723 -12652 5356 -22344 -7172 29833 50760 50085 43173 33486
10607 33486 12358 -51523 -68154 -65123 -105824 -99451 -46755 -46618 -20217 -72642 -84360 -5307
10595e307N9587l9162j2499m7270K2367K5063j6221N0850r053k2578j5533J4883
10583E127M6142j4423l6543k751K0977k6460J0012L598Q508J6862m0556j765k827
10570a4099J6984J8311k2373j324m5847J1316P5519L4799Q008o7k9313j9572J4077
10557D6419k411p5981o6518N8531M7908J922P804J6918L3786j3102m3921k5478
10545a4123K9473m771Q435N8232l7395o0943l2582M825Q5599J4464K4229k7619
10533D7824j5451M1427J8119m1491m3041j5857L2362M5151p3468o5491J468M5399
10521b3049N1383M0358O38l5218l8453l1926K4267p127K4439N2834O2997m3859
10509G7284o7984L9860l1321k2386J8073l1057P718J4192K3337o70j630k6167
$$ plain form
10595 -5307 54280 15118 2619 -44651 -22284 2779 -13442 37408 28355 5777 -9756 5127
10583 5127 51269 36846 303 -2448 18529 -7931 2081 5679 14187 31049 -9507 -11272 -14099
10570 -14099 2885 21196 -1177 -2501 -48348 -37032 38487 73286 81294 81227 51914 32342 46419
10557 46419 44008 -31973 -98491 -39960 7948 9870 17674 34592 68378 55276 11355 -14123
10545 -14123 15350 10579 19014 77246 39851 -21092 -53674 -48849 36750 51214 75443 47824
10533 47824 32373 73800 91919 50428 7387 -8470 23892 69043 -4425 -69916 -68448 -23049
10521 -23049 28334 68692 69330 34112 -4341 -36267 -12000 -19127 5312 58146 121143 77284
10509 77284 9300 49160 17839 -4547 13526 -17531 -9813 4379 27716 27046 25416 -751
10497g51J5611J8704L6615K6635M825n9700m4420K9525M6149l918M3226J7744
10485A30245o9966m4859k4565K6793K5966K6872o4054n7452Q0983o1347n9575
10474i0959L2071L6420J4214k5863L8211K2983K4334J3928L4398m125p0132k1949
10462C531o422L2924O998o880j7571k245N391J5552N196M306j7838J4704L946
10449D1592n3030r928m4699l911L0801L710J1888N6373L9758m7235j7157J3904
10437B2066k9504q715J1733L1974k2047l6777J7024L9618l6335J0599R054k0279
10425a1589q539j9803l5129m525M7217O3102m2683r355K4592L3017k1505K0096
10413C4896k288l0387p9137K2642L8412j9485m49k1298K4840l4169j2038k6005
$$ plain form
10497 -751 14860 33564 70179 96814 101639 41939 -2481 27044 73193 69275 112501 130245
10485 130245 60279 15420 -9145 17648 43614 70486 6432 -51020 29963 -31384 -90959
10474 -90959 -58888 -22468 -8254 -34117 4094 27077 51411 65339 99737 95612 25480 3531
10462 3531 -2891 30033 37031 30151 12580 10335 15726 31278 36474 40780 22942 37646 41592
10449 41592 -11438 -21366 -66065 -69976 -39175 -35465 -23577 32796 72554 25319 8162 22066
10437 22066 -7438 -16153 -4420 27554 5507 -31270 -14246 25372 -10963 -364 8690 -11589
10425 -11589 -20128 -39931 -75060 -79585 -32368 30734 -11949 -21304 3288 36305 14800 34896
10413 34896 32608 2221 -76916 -54274 -15862 -35347 -35796 -57094 -32254 -66423 -78461 -104466
10401a04466M8852N6661l6902j8398L254N0483N1880J6550m7853l485l2593j4672
10389c0689p301K111K7145L4786K0386k3364k3538j1178J7095K1825j3936j4952
10377a610l2787j0093N2992m942N883n97k2816j5232k8335K464L8311j405k5608
10364d3775m3051J1232K6418K0421K2006K389K9600J6481l9117j867J6396K3723
10352D0856l5334q1672j4884Q2266N6782m3053q2824k5937R54N1159K7667J3176
10340a0844j6790J7045L6212L042K3607m3147k384K2275k4339l9333m867k0167
10328e9690K6997o0183J5544L5428j8867k408O3417K5347n7557n4060M259L6915
10316d4858Q5311K2097l2498j0824j48k1529M5905J8246l9871n2067N0930M2043
$$ plain form
10401 -104466 -55614 1047 -35855 -54253 -50999 -516 51364 67914 20061 16576 -16017 -30689
10389 -30689 -37990 -35879 -8734 26052 46438 23074 -464 -11642 5453 27278 13342 -1610
10377 -1610 -34397 -44490 8502 3560 9443 8846 -13970 -29202 -57537 -55073 -16762 -18167 -43775
10364 -43775 -86826 -75594 -49176 -28755 -6749 -4360 25240 41721 2604 737 17133 40856
10352 40856 5522 -76150 -91034 -8768 48014 4961 -77863 -103800 -102846 -51687 -24020 -10844
10340 -10844 -27634 -10589 25623 28665 52272 9125 6741 29016 4677 -34656 -39523 -59690
10328 -59690 -32693 -92876 -77332 -41904 -60771 -63179 238 25585 -31972 -86032 -81773 -44858
10316 -44858 40453 62550 30052 19228 19080 -2449 43456 61702 21831 -30236 20694 62737
10304F2737P296J141k5886j5419j9622K9286K2384k4007j8675M7410m612M1879
10292A03912l7806j28065o9498l3951M2864L1135R5818M6663k0878k4082K0977
10281B7089M1972P151o6884l1928m4026l7376p756L1620L4080L227k691K3674
10269b1848P374m1166L5086m6552j0583N0159N1615O1005Q605p4423n7274j1404
10257d9406M9286p144K505j671m6829P688O9754N0151n2742o5839O648k6138L4067
10244b9670M9739M547m4534o7390p706K5260l1950L017R9266O2329p0172l9428
10232d6692N8564K457j7808N42K059j2950l7587l1949J3792M4519j8308Q413M6843
10219A1895p0964n9257K5403M2673M9298P309k6260J7245K078k2352j10066O248
$$ plain form
10304 62737 70033 71174 45288 29869 10247 39533 61917 37910 19235 66645 62033 103912
10292 103912 66106 -61959 -131457 -165408 -122544 -91409 4409 51072 30194 6112 27089
10281 27089 69061 76212 9328 -22600 -66626 -104002 -111758 -80138 -46058 -42831 -45522 -21848
10269 -21848 -14474 -55640 -20554 -67106 -77689 -27530 24085 85090 93695 19272 -38002 -49406
10257 -49406 -120 -7264 -4759 -6430 -53259 -45571 24183 74334 21592 -44247 -37599 -63737 -29670
10244 -29670 20069 24616 -19918 -87308 -95014 -69754 -101704 -98687 579 62908 -7264 -46692
10232 -46692 11872 14329 -3479 -2937 -878 -13828 -51415 -83364 -69572 -25053 -43361 -34948 11895
10219 11895 -59069 -118326 -92923 -50250 -952 6357 -19903 -2658 -580 -22932 -132998 -126750
10207a26750O1136J5804K55K106l1814L711L0201M8556j02m8848J1884j0906K6844
10194a7923L0255m7914n9030j9191l6185J6294N3944L7856M8737L7648k3312m2226
10182b1047J3420L265M617j6981o8397k3305K283L4204O5250L5955O3751K0339
10170A13354l1667n2446j2441L7636p727K685o510l1109N6372n8838p4099Q45
10158f3945L0008Q8282N1876o9176r1338j0543N3367m4666l5184m4023L2221N2655
10146e0466L2720M123j1722j7961k3932P2828M3455j2944K5390o2493K2435L3859
10134E5292K1045m2211J7344n185j7071J344j1902l538k120K2562l403J6695l2483
10121A6369q082n3633J9404Q0370n1986l9851M2435J8025n8023m0465r0O607M4332
$$ plain form
10207 -126750 -65614 -49810 -49555 -47449 -79263 -75552 -45351 3205 3103 -45745 -33861 -44767 -17923
10194 -17923 12332 -35582 -94612 -113803 -149988 -133694 -79750 -41894 6843 44491 21179 -21047
10182 -21047 -7627 -4362 255 -16726 -85123 -108428 -106145 -71941 -6691 29264 93015 113354
10170 113354 81687 29241 16800 54436 46709 49394 42884 11775 68147 9309 -64790 -63945
10158 -63945 -33937 54345 106221 37045 -54293 -64836 -11469 -56135 -91319 -135342 -103121 -50466
10146 -50466 -17746 -13623 -25345 -43306 -67238 5590 49045 36101 61491 -1002 21433 55292
10134 55292 76337 34126 51470 46285 29214 30558 18656 15118 12998 35560 32157 48852 16369
10121 16369 8287 -45346 -25942 54428 2442 -37409 5026 23051 -34972 -75437 -75527 -68920 -24588
10108b4588k6492J3554L0072R47N24J8276J0981N3519J1257m2742k9925n4794
10096c9411k1503L9533M9450k3701m8339O730N9307m860O0916o395k091o3353
10084F283m0256J8986K3097k1632K0032N397m1965L5260L5193P0877R3168j9761
10072A84679o2467o7147j7864O3850J7613l6315J0342n990l8977n4509m4632l1741
10060h3158J8847K8972J1635N751Q2727K2080o9251l7667m109M6954J8144K934
10048D3859L5416q128l0706J5019K579M7219k6744q829l013J323j7351J1050l6007
10035B5687m8691l0012p939k5964N0631M0876K5710j7085J3617p239n5841P4297
10023C8047M2701j8355k9768j2977o9797l8229j9680L1557O0462P1273n2834j2960
$$ plain form
10108 -24588 -51080 -37526 -7454 -6507 -5983 12293 23274 76793 88050 45308 15383 -39411
10096 -39411 -60914 -21381 28069 4368 -43971 -37241 22066 17206 78122 71727 69636 6283
10084 6283 -33973 -14987 8110 -13522 6510 11907 -30058 5202 40395 111272 204440 184679
10072 184679 122212 55065 37201 101051 118664 82349 92691 86701 47724 -6785 -51417 -83158
10060 -83158 -64311 -35339 -23704 -17953 64774 86854 17603 -20064 -24173 22781 40925 43859
10048 43859 79275 71147 40441 55460 58039 105258 78514 69685 66672 67995 50644 61694 25687
10035 25687 -23004 -53016 -60955 -86919 -36288 4588 30298 13213 26830 19591 -36250 38047
10023 38047 80748 62393 32625 19648 -50149 -88378 -108058 -76501 -16039 55234 2400 -10560
10011a0560j9243K866K5579n7813m2850M9936j8713n0621L3457J833J8989k8320
9999i5460O590K0655N662m4674J5208L1909L3301L5831l09j6908j7671j7139k8968
9986g1973L5865J8301P0593K5939k2950p2952o0259J5255P7806j8255J4370j2765
9974a025j65M7181J3838J2750n6173j9920k2746m8162J1699J4029L9037K5732
9962A6075m3426o937J4261L263j9535m7023m954l2617N3197O6411J3739l8758
9950b6304M932r89j0085j1480k9445k605L0679K6651N0230j9916n9047j2024L6361
9937b3042l8590k9605j5306M893j553O5902J25869J5698o1688k3485n193j1997
9925A903l6732K1081r090j3483k8590j726L1332J1634L875M9374P1926M3026m3382
$$ plain form
10011 -10560 -29803 -26937 -1358 -59171 -102021 -52085 -70798 -121419 -87962 -86129 -67140 -95460
9999 -95460 -88870 -68215 -62553 -107227 -92019 -60110 -26809 9022 8713 -8195 -25866 -43005 -71973
9986 -71973 -36108 -17807 52786 78725 55775 -17177 -77436 -62181 15625 -2630 11740 -1025
9974 -1025 -1190 45991 59829 72579 16406 -3514 -26260 -74422 -62723 -48694 -9657 16075
9962 16075 -27351 -34288 -20027 -16764 -36299 -83322 -88276 -120893 -67696 -1285 12454 -26304
9950 -26304 -21372 -22361 -32446 -43926 -73371 -75976 -45297 -18646 31584 11668 -47379 -59403 -23042
9937 -23042 -61632 -91237 -106543 -101650 -103203 -37301 88568 104266 42578 19093 13900 1903
9925 1903 -34829 -13748 -22838 -36321 -64911 -66637 -35305 -23671 -19796 29578 101504 144530 101148
9912A01148R743J1051k9517o9872k9411P983J2529J4663l4210K558K4748m8613
9900b7200m7082J3754l6650j2608L2373R1330k6972K0917J6042N0595K8989l900
9888I9588j3206m4518q276j1058K4237k888p6541k1280Q090L4757K841J4347K122
9875H215k6521L1666l2626j02394j8938J7603L1988K5059L9907J2955j0129m8781
9863g1996p167L4778M7404J0566k8148k0085j0976K2860N0252O9224N5257l3019
9851A18950n4973l3594o6416k6008J4508q0871P402Q7390O222j565k3077K2852
9839b9180L3291K4220K0612J3280J053J0605q724J3739K1956k9944r509j3812
9827D7587k7297n7530j8108J5797J8595K5606P7949J9441k2211j2407J8032j1405
$$ plain form
9912 101148 110891 121942 92425 22553 -6858 1125 13654 28317 -5893 -3335 21413 -27200
9900 -27200 -74282 -60528 -97178 -109786 -77413 13917 -13055 7862 23904 74499 103488 99588
9888 99588 86382 41864 33588 22530 46767 43879 -32662 -53942 -45852 -11095 -8254 6093 8215
9875 8215 -18306 13360 -19266 -121660 -140598 -122995 -91007 -65948 -26041 -13086 -23215 -71996
9863 -71996 -79163 -44385 3019 13585 -14563 -34648 -45624 -22764 27488 96712 151969 118950
9851 118950 63977 30383 -36033 -62041 -47533 -128404 -121002 -33612 -27390 -28955 -52032 -29180
9839 -29180 4111 28331 48943 62223 63276 73881 65157 78896 100852 70908 61399 47587
9827 47587 20290 -37240 -55348 -39551 -20956 4650 82599 102040 79829 67422 85454 74049
9815G4049o5614J369n5651K009o405j1271K5001Q523p572m5979j8677M1693L5359
9802b3166j0144r209p611Q511j8843j3033J3790M411M5199j5601L7524M125L2790
9789D8743J2351o004m427k4376m6036J7032J3585q1400m9878N8116N4264L7409
9777B9379M762l986l6009k6009j9425J6271M192N330O417K4202J2893j6945L2746
9764C3818L3669k970l2055o4995r522P1440M9097k5726p4302j1138O2569J4080
9752D3965K2206Q598m2265l6707L1225j4286l0010l119l2614K1499P1540K7818
9740F7850P480J3481l0207p7577j0264j998k6655m0091l1828o192M3200K9038
9728f3763P404K9260Q6979Q40j5692L4090R160q3823o6942K8498P127J9154P607
$$ plain form
9815 74049 8435 9804 -45847 -43838 -50243 -61514 -36513 -27990 -35562 -81541 -100218 -58525 -23166
9802 -23166 -33310 -42519 -50130 -41619 -60462 -73495 -59705 -55294 -10095 -25696 11828 15953 48743
9789 48743 61094 55090 50663 26287 -19749 -2717 10868 -70532 -120410 -62294 -8030 29379
9777 29379 34141 30155 -5854 -31863 -51288 -35017 -30825 -25495 -19078 5124 18017 1072 33818
9764 33818 67487 64517 32462 -32533 -42055 29385 78482 52756 -21546 -32684 29885 43965
9752 43965 66171 74769 32504 -4203 27022 12736 -17274 -20393 -53007 -31508 40032 67850
9740 67850 75330 88811 58604 -18973 -29237 -31235 -57890 -97981 -129809 -136001 -92801 -63763
9728 -63763 -56359 -27099 59880 60720 45028 79118 88278 4455 -62487 -33989 -26862 -7708 -101
9715a01q030n9402L6977N1771L2932K2152n079l0691n494l3579l610n473k7498
9702c5125K4556k0854k7159k1933P557k475J253M7340l198k9260J6454K4445J006
9689a7393L9289O2744k0809k1262p3482m5279j2053J8717K4400K7261J4208l4394
9677c8053K0026L6151j9467o5106M2173M2567j0522m3669k7407P045N016K4610
9665b6636m2499j2306l832J6194j6312j09K9133j4848k6487M5845O0100l3275
9653b5032j6836J7009j4691O2488M468k3315j3934m8354M0646l7451K7372N6258
9641B8628o799K589J662j7204j1107k718P0408M4622r1718o3226K2333K8028j8842
9628a3344P586m2942Q868J0250m1484K1624K3901q685J0358k2170n2756n7876
$$ plain form
9715 -101 -8131 -67533 -30556 21215 54147 76299 71220 40529 35035 1456 -2154 -7627 -35125
9702 -35125 -10569 -31423 -58582 -80515 -72958 -75433 -74180 -26840 -30038 -59298 -42844 -18399 -17393
9689 -17393 21896 84640 63831 42569 -30913 -76192 -88245 -69528 -45128 -17867 -3659 -38053
9677 -38053 -18027 18124 -1343 -66449 -24276 18291 7769 -35900 -63307 -56262 -51246 -26636
9665 -26636 -69135 -81441 -85273 -69079 -85391 -85500 -56367 -71215 -97702 -51857 8243 -25032
9653 -25032 -41868 -24859 -39550 22938 27406 4091 -9843 -58197 -17551 -55002 -27630 28628
9641 28628 21829 24418 26080 8876 -2231 -4949 65459 110081 18363 -44863 -22530 5498 -13344
9628 -13344 -5758 -48700 -39832 -29582 -71066 -49442 -25541 -34226 -23868 -46038 -98794 -156670
9616a56670N0079K8078N2484P6417j157O758p2472k0654j0723K4025O8908L5866
9604H0939k9119j2343m258J260L7216J0349j8818o1250m3843k2003k6262M7800
9592d0332N9063M3550K7725J493K8825k5134o2522l8542K3502K4634k1101o808
9580A4353L6191m1480j7918K514J3148j1911o548l170J6325o6247k4979N1945
9568c7777M7697j3490j8464r240r102K4004k8602l7691J6195P0988N8134k098
9556F0554J9160m5619j953k3887k4551L4274O4802j6979n6974K1184j2905k3725
9544f619j9048n414L7048K5741K8618k9399J133N9562n6352l5059N2956P2328
9532A25495j2864p8774l2293l6298O550K2561R706k7759k8703m5007k6377O5368
$$ plain form
9616 -156670 -106591 -78513 -26029 50388 49231 55989 -16483 -37137 -47860 -23835 45073 80939
9604 80939 51820 39477 35219 36479 73695 84044 65226 3976 -39867 -61870 -88132 -40332
9592 -40332 18731 62281 90006 91499 120324 95190 32668 -5874 17628 42262 21161 14353
9580 14353 50544 9064 -8854 -6340 6808 -5103 -11651 -14821 1504 -64743 -89722 -37777
9568 -37777 9920 -3570 -22034 -31274 -40376 -16372 -44974 -82665 -66470 4518 62652 60554
9556 60554 79714 34095 32142 8255 -16296 17978 82780 65801 8827 30011 17106 -6619
9544 -6619 -25667 -31081 5967 31708 60326 30927 32060 91622 35270 211 53167 125495
9532 125495 112631 33857 1564 -34734 -28184 -5623 4083 -23676 -52379 -97386 -123763 -58395
9520e8395M143n815J4245P564j0409L3616m684p669O6628R88L9038p108j8045
9507E4097m5067k5359J6055k375l2250N267L1260m8139l449q236j4099o701M8446
9494c0550N7744J633O254l7244k0791k399r84n3867K4371K4979L7797J429J5089
9481B3461n742K0343K7092j0566j2877n7323l5311j1864L8796L4853Qm7916k3752
9468f0798K578j5806N2815L5889l5523j065p735O365n2276K8801P4034L8471p3813
9455h063r913O300R3898O9204q5787l1626j8748k0595J1509K4564M08l4480l953
9442g282l0056L5842l4187j1945L6069l2570m5822K384k2793o77N7873J5450K405
9429c5309P1380P73p538J8024j5056j4364j3274J5439p614j7420K1346Q6257M9502
$$ plain form
9520 -58395 -54252 -60067 -45822 -38258 -48667 -15051 -19735 -27404 39224 40212 79250 72142 54097
9507 54097 9030 -16329 -274 -2649 -34899 -29632 1628 -46511 -49960 -58196 -72295 -78996 -30550
9494 -30550 27194 28827 35081 -2163 -22954 -25353 -26337 -80204 -55833 -30854 6943 8372 23461
9481 23461 17719 38062 65154 54588 41711 -15612 -50923 -62787 -23991 10862 10870 -37046 -60798
9468 -60798 -58220 -74026 -21211 14678 -20845 -21910 -29645 -23280 -75556 -46755 27279 65750 -8063
9455 -8063 -17976 -11676 82222 151426 65639 34013 15265 -5330 6179 30743 31151 -3329 -7282
9442 -7282 -37338 -1496 -35683 -47628 -11559 -44129 -89951 -87567 -110360 -111037 -53164 -37714 -35309
9429 -35309 36071 36844 29306 47330 32274 17910 4636 20075 12461 -4959 16387 102644 152146
9416A52146m1257j7092k5698m2730J394K9210k1960j5381j0152L1073L0596m1559
9404B8590R203j3359j2013m6761m2620J00501J2647L885k7941J4703M904j7984
9392A3755R729n0981k3409K8496P006j9524l5741k2273J0624O5665K8454r825
9380A976n400L7398j7954p6569m8182p59J3779K1038M1210O594m3402J3943k8563
9367h4891P316P6934m1834k9355O692M7916K7356k3179L6619K8942l0784l2589
9355a0857N9210K8446O55j3256k972M3677l5422l5573p645K835J4141p116l5701
9342D22k1757m0406M318L4563l2458M4654K3266o8256K8985L2970o3522m015q686
9329f9922l8106O0159O1778J0465j2686n258M0670N7481K0088n076l4669R166
$$ plain form
9416 152146 110889 93797 68099 25369 26763 55973 34013 18632 8480 39553 70149 28590
9404 28590 37793 24434 12421 -34340 -76960 23541 36188 40073 12132 26835 31739 13755
9392 13755 23484 -27497 -50906 -22410 -15404 -34928 -70669 -92942 -82318 -16653 11801 1976
9380 1976 -3424 33974 16020 -60549 -108731 -109490 -95711 -74673 -33463 -26869 -70271 -56328 -84891
9367 -84891 -77575 -641 -42475 -71830 -65138 -17222 10134 -13045 23574 52516 21732 -10857
9355 -10857 48353 76799 77454 64198 61226 104903 69481 33908 26263 29098 43239 36123 422
9342 422 -21335 -61741 -57423 -22860 -55318 -10664 12602 -55654 -26669 6301 -57221 -61236 -69922
9329 -69922 -108028 -47869 13909 24374 11688 6430 47100 104581 124669 119593 84924 94090
9317I4090R117J379j5772P2970r158n1668o336j6320j3777m1701L693M5227q282
9304F3462k6472L3551N2069K6379j6219r6671j7003j8567j2070K3059Q4636J6104
9292A12258m2136k9124R653m1180L2787L6034M4498K1484J65L2900k1375m5476
9280A10488l2697J7497J7247o9115m4821l9392L7006k103n1356j587k7872o9073
9268a55778K6092R0214O7122L4224p3633j6839M4984J2169o507J7282j0614M2224
9256G0940M3915m9206K4872p176l2187o8214n3709L9910P9445L4958k1283k7446
9244C4819l8324k3669O2041L4334m4035l3556m8293Q12N1440M3810Q5854j1788
9232A13445J4014N077j049L194L1034K7871j3198K24l3977L760l2883k0989L3665
$$ plain form
9317 94090 103207 104586 88814 161784 152626 100958 94622 78302 64525 22824 26517 71744 63462
9304 63462 36990 70541 122610 148989 132770 36099 19096 529 -11541 11518 96154 112258
9292 112258 70122 40998 50651 9471 42258 78292 122790 144274 144439 177339 155964 110488
9280 110488 77791 95288 112535 43420 -1401 -40793 -3787 -5890 -57246 -58833 -86705 -155778
9268 -155778 -129686 -39472 27650 61874 -11759 -28598 16386 28555 22048 39330 28716 70940
9256 70940 114855 65649 90521 83345 51158 -17056 -70765 -30855 48590 83548 62265 34819
9244 34819 -3505 -27174 34867 69201 25166 -8390 -56683 -55871 -4431 39379 125233 113445
9232 113445 127459 132536 131487 134681 165715 193586 180388 180612 146635 150395 117512 96523 130188
9219A30188J11459M0447n6845p0587L1134J5674l916Q576K6180O178J9889O9943
9207C28320O0400n0151k7542K9753M0659O2003Q993P303m6133P5734Q1839N0607
9195F21785M1524J67249J02595N7450P0020R3066J28565J51432J94270J37735
9185A765691J75278K81201L65244M15164O15628Q07879J117342J502756K041062
9176I087245K946561M380310O727401R480197J0272126O320812M51502l597054
9168D6069100o470850q183091p880974o219947m391302l054103k156600j522464
9160F189769j180772q32768p18128n98986m21561k71227k27420k69181k07971
9151A461755j52593j07015j35275p3868q3097j27520n8291o2918l1135p7596j6146
$$ plain form
9219 130188 241647 282094 225249 154662 185796 201470 197554 206130 232310 238488 258377 328320
9207 328320 388720 338569 311027 340780 381439 443442 452435 459738 413605 489339 571178 621785
9195 621785 663309 830558 933153 990603 1060623 1153689 1282254 1433686 1627956 1765691
9185 1765691 1940969 2222170 2587414 3002578 3618206 4426085 5543427 7046183 9087245
9176 9087245 12033806 16414116 23141517 32621714 42893840 49214652 49666154 46069100
9168 46069100 39598250 31415159 23534185 17314238 12922936 9868833 7712233 6189769
9160 6189769 5008997 4176229 3458101 2859115 2437554 2166327 1938907 1669726 1461755
9151 1461755 1309162 1202147 1066872 993004 909907 782387 724096 661178 630043 552447 536301
9140E36301N3991k9207l5780m3741m807K1379N109j03695r6972o176J2851J758
9128C11011o881k7352k0544J1482l7503m7730K2459J5378n0978j7455k192Q80
9116A50575m822r372p8220k1963Q6073P3365J2980l4902n305K7756J898l3771
9104A64292l502n83m2270k9938p91m980Q9358k6849k3385j5775o2988j4114L937
9091C2412r012J6691m5459J0658P2098L1423o1256o2557M9847M907K4545K354
9079F6651K4698M4222Q0489j4274n1459p1294M691P857j2728j0988N7407m0952
9067H4320q7442j0951M4826O7699K7470l6879p2692m013O8180M9051k0639j6419
9055I2511j3438l5157m3659o7816k8641O8338P8893M9518k0949l305j9860K9260
$$ plain form
9140 536301 590292 561085 525305 481564 476757 498136 503245 399550 302578 296402 309253 311011
9128 311011 304130 276778 256234 267716 230213 182483 204942 220320 169342 151887 149695 150575
9116 150575 145753 136381 58161 36198 122271 195636 208616 173714 168409 196165 198063 164292
9104 164292 160790 160207 117937 87999 87208 82228 171586 144737 121352 105577 42589 28475 32412
9091 32412 23400 40091 -5368 5290 77388 108811 47555 -15002 34845 39752 64297 66651
9079 66651 91349 135571 216060 201786 150327 79033 83724 91581 78853 67865 125272 84320
9067 84320 -3122 -14073 30753 98452 125922 89043 16351 12338 80518 129569 108930 92511
9055 92511 79073 43916 257 -67559 -96200 -27862 51031 100549 79600 76295 56435 85695
9043H5695J6999J1109n9732r0377k7643K3065K017M240M6047j08002j4088O2894
9031d7776J08890P0288K2718J7345l0292l0201n7876k2027J9793l9214k7257N4927
9019C9318J6116M3158K0337m275n0840p947L6936J1678m1752n2440M982J2915
9007B8186K4738N0724k0886J6489l7308J3525J2882n6983L5833J7405o750l8916
8995C8939k3105M101j4887M1188q073n9793R040J7967p127j7965K7657O1399J7543
8982H6884o2846k9370J9954P206l7166K1666K0945Q974j2079J3970J03170R490
8970A50798m1477j9483q0182q8372J011P240J6127N1112N3313k5711j1166k7655
8958a4445K4746L7788K8507j2501o1217L2220J6632K7174L7288k6205l0338l06
$$ plain form
9043 85695 102694 113803 54071 -36306 -63949 -40884 -38867 -34627 11420 -96582 -110670 -47776
9031 -47776 61114 131402 154120 171465 141173 110972 53096 31069 50862 11648 -15609 39318
9019 39318 55434 98592 118929 114654 63814 55867 92803 104481 62729 10289 15271 28186
9007 28186 52924 103648 82762 99251 61943 75468 88350 31367 67200 84605 77855 38939
8995 38939 15834 19935 5048 46236 38163 -21630 -12590 5377 -1750 -19715 7942 69341 86884
8982 86884 24038 -5332 14622 21828 -15338 6328 27273 36247 24168 38138 141308 150798
8970 150798 109321 89838 9656 -78716 -77705 -70465 -54338 -3226 50087 24376 13210 -14445
8958 -14445 10301 48089 76596 64095 2878 35098 51730 78904 116192 89987 59649 59343
8946E9343K0804n8716n4761l4360K6746K2411k772k7424o3091K4633J615q388
8934i3960N1356O6485L8559K8055k8085J1828k3671J1910l0619k2231L931L9670
8922E3228M0417j7310j1847P345L1387O6607o4482p8572K5928M635l7460k6907
8910g031M7679J4941L5018p777l2206j1893O5923p159J922N4090m3775m1788J5539
8897H3483L8585n4215l8392K684m7658K151L5864J9605k8161n8905K4814P5224
8885E5079n248k8270M7090J7937k2531O2299K0800L7091N9347k4686K7097O8738
8873C14743N3923K7283m409Q1366J60183K21515K74255L83100O45976R58532J438719
8862D555186J595934Q69884q9600o60709j071507j172018j055889p66849m96160
$$ plain form
8946 59343 80147 21431 -33330 -67690 -40944 -18533 -21305 -48729 -111820 -87187 -85572 -93960
8934 -93960 -42604 23881 62440 90495 62410 74238 50567 62477 31858 9627 13558 53228
8922 53228 93645 76335 64488 71833 103220 169827 105345 26773 52701 57336 19876 -7031
8910 -7031 40648 55589 90607 82830 50624 38731 104654 97495 99417 153507 109732 67944 83483
8897 83483 122068 67853 29461 32145 -15513 -13362 22502 42107 13946 -44959 -20145 55079
8885 55079 49831 21561 68651 86588 64057 126356 147156 184247 243594 218908 246005 314743
8873 314743 368666 395949 391540 472906 633089 854604 1128859 1511959 2157935 3116467 4555186
8862 4555186 6151120 7021004 6931404 6270695 5199188 4027170 2971281 2204432 1708272
8853A708272l77194k65177k17251j97647j06422q4495j46635o2491J9423K9905
8843C00288o7417j02299k1096M5939l8771k7287k0657P246J849o974n345J1646
8831G7122J3847m22n8928K0414N5926K3973J3606j1843L4101K1741P649k5560
8819A71626q755j05604j8744L8567R563p859n2169k4921k4289J7798J6537n0370
8807c8620J6870K7441J6653R582q597m8851N7562L0281n7753k3614O133L3905
8795B0992L690j0046m2529l4633n8460N4734Q7784j8783L2596L0054q860K5688
8783H2227o8072j9378J0802j5158L0069L5646l2375k978J6165N8281J8593l4835
8771G8987L916M94K1305j6739n4683m0878K6733K9718q123m1279K5309l3530j09366
$$ plain form
8853 1708272 1331078 1065901 848650 651003 544581 460086 313451 250960 270383 300288
8843 300288 232871 130572 109476 155415 116644 89357 68700 75946 77795 70821 65476 77122
8831 77122 90969 90547 31619 52033 107959 131932 145538 133695 167796 189537 197186 171626
8819 171626 162871 57267 38523 77090 86653 78794 26625 1704 -22585 -4787 11750 -38620
8807 -38620 -21750 5691 22344 31926 23329 -25522 32040 62321 4568 -19046 -12913 20992
8795 20992 24682 14636 -27893 -62526 -120986 -66252 21532 2749 35345 65399 56539 82227
8783 82227 14155 -5223 5579 -9579 20490 56136 23761 20783 36948 95229 113822 78987
8771 78987 82903 83397 104702 87963 33280 -7598 19135 48853 40730 -549 24760 -8770 -118136
8758a18136K811O0724m4312k4801K0470k0384n995N8583M2463j1343L0898R581
8746E59M7652L2870l5647j2770l573j5550J8795Q252j0192K592k1474k1363M7456
8733C7607k2918K70M4914n2776r0469j0248K3699j4499k2405M7298J0197M5169
8721d161J4322o2289n350N544K5010N720j17k464J8574L1806o9155k2723J3090
8708e2193L210p788K6105L2181m2492l3405m3779k4892N9204P22r232O4611O1760
8695C4012n3311l359M0904n9429l9310q223k9004M6879L6909M0942L5461K901
8683D5372p7297O385J6177K0116m0725k6358p5K4081l05j509J9874N9792J8032
8670F3560J0913n1623n0590J1361j103Q270k161j3684o283o51p920o985L2132
$$ plain form
8758 -118136 -115325 -54601 -98913 -123714 -103244 -123628 -129623 -71040 -28577 -39920 -9022 559
8746 559 48211 81081 45434 32664 29091 13541 32336 40588 30396 32988 11514 -9849 37607
8733 37607 14689 14959 59873 7097 -83372 -93620 -69921 -84420 -106825 -59527 -49330 -4161
8721 -4161 10161 -52128 -57478 -51934 -26924 -21204 -21321 -23785 -5211 26595 -42560 -65283 -52193
8708 -52193 -48983 -56771 -30666 1515 -40977 -74382 -118161 -143053 -83849 -83127 -92359 -27748 34012
8695 34012 -19299 -22658 18246 -41183 -80493 -88716 -117720 -70841 -33932 7010 42471 45372
8683 45372 -31925 -25540 -9363 10753 -29972 -56330 -56405 -32324 -32629 -34138 -14264 45528 63560
8670 63560 74473 22850 -27740 -16379 -17482 -9212 -11373 -25057 -31340 -31991 -39911 -46896 -14764
8657a4764O527L5927N6773M657q307R385J2382j7535m3097M826l6774m2915O136
8644b6779o3757K8118P7282J1469k2012J7129R76M409N4270J1883R705k6711o3375
8631A2607l1887k2985j05607p695J22437J9434k7106K0848J9075M997n3480l0076
8619g9438Q1603k676J3112N3329k7725K1696L6460K2115j4847o791N958k608m5999
8606E4189n099k4840L7518l639l78p758j01397k3236j5248j0027N9282L9382N16
8593g35N4290P5818m3300k4160R650m351j882m003n1678k1426K8677R296j9105
8580G091O335M0302M5496j9575j9273j6304J9247j1850J7406j9990k323n619l2665
8567H278q5273k0656K5727J4725L1508n127M0973K8805K4131L5900M2710r3147
$$ plain form
8657 -14764 -8237 27690 84463 89120 80813 90198 102580 85045 41948 46774 10000 -32915 -26779
8644 -26779 -90536 -62418 14864 26333 4321 21450 22426 26835 81105 92988 102693 75982 12607
8631 12607 -19280 -42265 -147872 -155567 -33130 -13696 -40802 -19954 -879 4118 -49362 -79438
8619 -79438 2165 -511 12601 65930 38205 59901 96361 118476 103629 96838 102796 100188 54189
8606 54189 49090 24250 61768 58129 57751 49993 -51404 -74640 -89888 -99915 -40633 -1251 -735
8593 -735 53555 129373 86073 61913 71563 67212 65330 61327 9649 -11777 16900 26196 7091
8580 7091 13426 53728 99224 79649 60376 44072 63319 51469 68875 48885 46562 40943 8278
8567 8278 -76995 -97651 -71924 -57199 -25691 -30818 10155 38960 63091 98991 141701 48554
8555D8554m8918L112J4325l5731j1666J6930P4049L9694Q4199J4003o616l7659
8543A54276n4300l1135p513K476k5051m2845L398K7867j7942k9926L7166J5117
8531C1588n0892k24N1865M9971Q925l3316R517j0690L6676l0934l4430K9366M873
8518F2295m5168k1442m1803k616N05l5034k3004M8152M3510K7071L1563L4720
8506G8749k0044l7223J4164m621k4138K4865k1195o4857p413J3290L6337P952
8494d134l7772p7281J0916O2514R505L3531M5643k8749K9879L9754k971r699n4297
8481A6839Q16J4510L0495J4976j087J8284K6676k6035j7328L777M234j5004n8012
8468A3141j040O592j0124L5335n980m6229N919O008l909m9226l5662N780N4379
$$ plain form
8555 48554 -364 2748 17073 -18658 -30324 -13394 60655 100349 184548 198551 191935 154276
8543 154276 99976 68841 61328 63804 38753 -4092 -694 27173 9231 -20695 16471 31588
8531 31588 -19304 -19528 32337 82308 91233 57917 67434 56744 93420 62486 28056 57422 62295
8518 62295 17127 -4315 -46118 -48734 -48229 -83263 -106267 -58115 -14605 12466 44029 78749
8506 78749 58705 21482 35646 31025 6887 31752 10557 -54300 -61713 -48423 -12086 -4134
8494 -4134 -41906 -119187 -108271 -45757 -36252 -2721 42922 14173 44052 83806 80835 71136 16839
8481 16839 17655 32165 62660 77636 76549 94833 121509 95474 78146 81923 86157 71153 13141
8468 13141 12101 18693 8569 43904 37924 -8305 -2386 3622 -287 -49513 -85175 -79395 -25016
8455b5016K1990N3667J0053k4312k0651Q261K5535K5835L7871n728o0831O619
8443E3293K7983J3571n4204m7873K3149j030L8836L0042m6442o258J676N3588
8431H6331p302k9159j3222n7702P992L4925K7273J4269n0498k36m5999k3175j088
8418e7591m9862o227K7369K3669k850M8537k1195k1952P7702k362k7405K4727
8406A2560l0258n5067J1580L2440K0911J3151J7959j3788n0106K0379K3699o7970
8394f4510p0685k225K8548O0831j6565k2696M7761M4163l7079l9768M1313Q876
8382b2036K0660o501l7470N8844p967n2016k9035K1949K1947M6601M9087K6047
8370I0110l7984m460n1198k1334n32k0527n9975m2095R864M7925K7008k5141J3686
$$ plain form
8455 -25016 -3026 50641 60694 36382 15731 23992 49527 75362 113233 107505 46674 53293
8443 53293 81276 94847 40643 -7230 15919 14889 53725 83767 37325 31067 32743 86331
8431 86331 79029 49870 36648 -21054 -13062 21863 49136 63405 12907 12671 -33328 -56503 -57591
8418 -57591 -107453 -113680 -86311 -62642 -65492 -16955 -38150 -60102 17600 15238 -12167 12560
8406 12560 -17698 -72765 -61185 -28745 -7834 5317 23276 9488 -40618 -20239 3460 -64510
8394 -64510 -135195 -137420 -108872 -48041 -64606 -87302 -39541 4622 -32457 -72225 -30912 -22036
8382 -22036 -1376 -7877 -45347 13497 5530 -46486 -75521 -53572 -31625 14976 64063 90110
8370 90110 52126 47666 -3532 -24866 -25398 -45925 -105900 -147995 -138131 -90206 -63198 -88339 -74653
8357g4653O877N932M9387K2458J1544K8992j3325o1443K2718j4818q986k275j4128
8344d1720K0168K5859K5845M418m53K1178J2521L1674l2826m0860k2181N4513
8332E8136K8216k5642p028o5226l7430K4881k423K561l3900N781p530L3569R7700
8319G1665J0976k8397l0456r798o2059o910N8063L5614m3547l8873l479Q7590
8307D0389k4244j8073O118q138L151K279k7152j6151K643n9865O454j2558J6287
8294h8860Q6857K3952l1471P2101M1391K5017n3775o480J1797o916l1323j8542
8282B3748K1634k369k9238l3202J8625K3801m3959k2345J4292N8348K5289J0678
8270F5302k3558n7823R319N0755j3709k3783O378J0566M350K598j9768k1381m7682
$$ plain form
8357 -74653 -67776 -61844 -12457 10001 21545 50537 37212 -24231 -1513 -16331 -25317 -27592 -41720
8344 -41720 -21552 4307 30152 34570 34117 55295 67816 99490 66664 25804 3623 58136
8332 58136 86352 60710 53682 -11544 -48974 -24093 -26516 -23955 -57855 -52074 -59604 -26035 71665
8319 71665 82641 54244 23788 13990 -48069 -54979 3084 38698 -4849 -43722 -47201 40389
8307 40389 16145 -1928 4190 -3948 -797 1482 -25670 -41821 -39178 -99043 -92589 -105147 -88860
8294 -88860 -2003 21949 -9522 62579 103970 128987 75212 68732 80529 73613 42290 23748
8282 23748 45382 43013 13775 -19427 -802 22999 -20960 -43305 -29013 29335 54624 65302
8270 65302 41744 -16079 -6760 43995 30286 6503 12881 23447 27797 30395 10627 -10754 -58436
8257e8436J5405K0566K4267M4582j0488m4618q8306L1444Q7902M2662j6670J5007
8245F3317j226j2322m5614M016P7243j6089m727L5439j3379q5954p194o078l422
8232a5990k4483p9009P492J7436L6124j136L56M498L4155K3100j168K5466R897
8219C6738l5230l5199K1614L0332J8379j1629j2819j1634k6760k330m1316M1303
8207b8551P9012j0978k5994m3720k87K4154k4121j5566K5164k7800j1184l9175
8195i9046L2860K9037q310l2684m762M7963p786K1353k4739k8343r256R302J4286
8182f0125O277l6243L5818K970k408K1427J2681J9289k9210J8996j6574q4291
8170a11393M0052R2614M7786k8573R057m3706o8078q6392l7983L7279n465L0286
$$ plain form
8257 -58436 -43031 -22465 1802 46384 35896 -8722 -97028 -65584 22318 64980 48310 63317
8245 63317 62091 49769 4155 8171 85414 69325 64598 100037 86658 704 -6490 -12568 -15990
8232 -15990 -40473 -119482 -111990 -94554 -58430 -59566 -59210 -54712 -20557 2543 1375 26841 36738
8219 36738 1508 -33691 -12077 18255 36634 25005 12186 552 -26208 -28538 -69854 -28551
8207 -28551 50461 39483 13489 -30231 -30518 -6364 -30485 -46051 -20887 -48687 -59871 -99046
8195 -99046 -66186 -37149 -45459 -78143 -82905 -34942 -42728 -21375 -46114 -74457 -83713 -74411 -60125
8182 -60125 -53848 -90091 -54273 -51303 -53711 -32284 -19603 -314 -29524 -10528 -27102 -111393
8170 -111393 -71341 21273 69059 40486 49543 5837 -62241 -148633 -186616 -149337 -154802 -124516
8158a24516N8107M3869k222K7892k3336K5481Q97l2719k5097j1744K92j0673J4244
8145e9525P4999j7958k1157M0479k8845L0883j7461R20l2120j3231J0001L943
8133b9072O105m621K1567L6408o4793M6799P4306K4687l3341l8468M125J6826
8121F0528k141J6583k2276n1837j7595N6410l865j6140l6934O04k0404j0028J247
8108d5848l9316K0187J23517O5342l5361j17209o3276M3615j7793m6623L6284
8097g6481j7127L828M9285R1265m250p4130L4014m22m3311k6866K1091P0644L0378
8084E7918j3918l9369l5494K9083K121n7809k6748k0500l868L0075N8241O713
8072a3555N4974J7323o311k0824l1721J2067l2057J1354n6396j1917N1158k558
$$ plain form
8158 -124516 -66409 -22540 -24762 3130 -20206 5275 6172 -26547 -51644 -63388 -63096 -73769 -59525
8145 -59525 15474 -2484 -23641 16838 -12007 18876 1415 2335 -29785 -43016 -33015 -29072
8133 -29072 -22967 -27588 -6021 30387 -34406 12393 86699 111386 78045 39577 43702 60528
8121 60528 58387 74970 52694 857 -16738 39672 35807 19667 -17267 -16663 -37067 -47095 -45848
8108 -45848 -85164 -64977 58540 123882 88521 -28688 -91964 -48349 -66142 -112765 -76481
8097 -76481 -93608 -89780 -40495 50770 46520 -27610 6404 5982 -37329 -64195 -43104 27540 57918
8084 57918 44000 4631 -30863 -1780 341 -57468 -84216 -104716 -108584 -78509 -20268 -13555
8072 -13555 41419 58742 52431 31607 -114 11953 -20104 -8750 -65146 -77063 -25905 -28463
8060b8463N0683M26n2365K3944m0228o6824L0756O0177J1762L801K1508q45J7998
8047C2330m6063l0494j7589J9188j0155n799K0949P8292L3439o1675o2575K2125
8035b8027L8029l323l6571M3239R222K0224o1759n8866k9195j276N0467L6287
8023b1549k8167K2910K6565k9796l5675k2502r910K3557P147L0248L2578L2055
8011B7461K6730l8069j3762J539J3341l2842J9440L4264K46n819k1603L4256K8772
7998G3954r723n7565K5113L0590J6915m761M7476j8854q1827l6593j2151p9811
7986a07237J9128O7494N979M3635K392l6028k1778p6288J3849Q4253J7550k1127
7974h178K6873j9542m20n5682l6520K2842m546P1334J2420J2027K5454l3716o136
$$ plain form
8060 -28463 22220 22646 -29719 -5775 -46003 -112827 -82071 -21894 -10132 -6331 15177 14332 32330
8047 32330 -13733 -44227 -61816 -42628 -52783 -58582 -37633 40659 74098 12423 -50152 -28027
8035 -28027 10002 6679 -29892 13347 22569 42793 -18966 -77832 -107027 -108303 -57836 -21549
8023 -21549 -49716 -26806 -241 -30037 -65712 -88214 -98124 -74567 -67420 -37172 -4594 27461
8011 27461 54191 16122 2360 3899 17240 -15602 3838 38102 38348 32529 10926 45182 73954
7998 73954 64231 6666 31779 62369 79284 74523 121999 103145 21318 -15275 -27426 -107237
7986 -107237 -88109 -20615 -14636 28999 31391 -4637 -26415 -102703 -88854 -4601 12949 -8178
7974 -8178 18695 -847 -1267 -56949 -93469 -70627 -75173 -3839 8581 20608 46062 12346 6210
7961F210k1951Q3647L3294j8835m7017m571N9397n4204o0041P5701O1942o1408
7949E2164j08O1271J9173m6685l7831K8744j4801l1311n5220o5825M9959N7497
7937A7027O4107j6890j0982N226l2598k7791k5358K822N859J0267P8648M2732
7925A13069o8754p9381K540j0841N47J7291J9137J5654n7263n7219K4506J01719
7913B1005l028L237j2498j5477k107L103l676j3993J5396R542k1507Q6722K4829
7900I1548q3762o5223M0758K6680L1021k1304k6832M5110J100k9322N592Q2506
7888I7872j7357o096J9605k1375j3949J729K7768r911k0961m0281l3416L6495
7876B0123q136k6970k508K6758j6985K66k4585k7023k4061P1357l938m4687J1407
$$ plain form
7961 6210 -15741 67906 101200 82365 35348 30777 90174 35970 -24071 51630 113572 52164
7949 52164 52056 113327 132500 85815 47984 76728 61927 30616 -24604 -90429 -40470 17027
7937 17027 81134 64244 53262 58488 25890 -1901 -27259 -24437 -18578 -8311 70337 113069
7925 113069 44315 -35066 -32526 -43367 -42820 -25529 -6392 9262 -48001 -105220 -80714 21005
7913 21005 17977 21214 8716 -6761 -8868 -5765 -9441 -23434 -8038 1504 -20003 66719 91548
7900 91548 7786 -57437 -16679 10001 41022 19718 -7114 37996 39096 9774 15366 97872
7888 97872 80515 74419 94024 72649 58700 60429 88197 78286 57325 17044 -16372 20123
7876 20123 11987 -14983 -17491 9267 -7718 -7452 -32037 -59060 -83121 -11764 -15702 -60389 -48982
7863d8982n414j2243j3335K7733P973q0613l5568K0552N8985K1551L0151Q894
7851b0316j9613n4997n2854P5075L8640q6783n5931J8680L2118P9164n852K0385
7839c2284J0207K9557L3542l4876m2379M0007P1731q4737l0389M2580k456N188
7827E691J4457j9766M702n7793K2573J7498l7955Q073M0941r5977q948J7663K1166
7814f7675J2555K0914O2296L0378K5537J2237M683j5695j8201J1637j853n537
7802G1276j1269l7150o1717N666l2935m4439O294N0883M4726K6455L3675K3526
7790G4991o462L9791N1364j4616l7145R468l2445n3553J1143Q285o0786m7675
7778e7640J8886J8055j3303k4718k1432L6082N9042j1970k5981l6401K2417M8419
$$ plain form
7863 -48982 -54396 -66639 -79974 -52241 -44268 -124881 -160449 -139897 -80912 -59361 -29210 -20316
7851 -20316 -39929 -94926 -147780 -72705 -34065 -120848 -176779 -158099 -125981 -46817 -52669 -32284
7839 -32284 -22077 7480 41022 6146 -36233 3774 75505 -9232 -39621 2959 503 5691
7827 5691 20148 382 5084 -52709 -30136 -12638 -50593 -42520 -1579 -97556 -106504 -88841 -67675
7814 -67675 -55120 -34206 28090 58468 84005 96242 100925 85230 67029 78666 76813 71276
7802 71276 60007 22857 -38860 -33194 -66129 -110568 -104274 -53391 -8665 17790 51465 74991
7790 74991 68529 108320 159684 145068 107923 117391 84946 31393 42536 50821 -9965 -57640
7778 -57640 -38754 -20699 -34002 -58720 -80152 -44070 14972 3002 -22979 -59380 -36963 11456
7766A1456m953k7189L1557n284L9177J275m7159p5528o0839N4439O0931J2643
7754i474M7218l7973o2624J8756L1036K1822J5227P210L063k5596k1049K9469
7742A7085O034N396k0255m3238Q770k6039Q267M3111o9227J1439N621M150N2687
7729C801K5574j273k7025o2812l5608Q075J8611P7768M0445L9608k2910m7124
7717A7130O8316K8135l1061k5144K565J5575r782l9384k1487J6864K0799j6158
7705B6368k5485qL1900J1441k6980j9831j4040J4823L8118j0262j5855R382l3627
7692a4056J3309M3690p459K2576J9467p6974j239M5183l7053J560P684p062R248
7679A8874p9195L4811q051q754l4782o1081M8073J04934J506K8197m4682n8540
$$ plain form
7766 11456 6503 -20686 10871 5587 44764 46039 -1120 -76648 -137487 -83048 -22117 -9474
7754 -9474 37744 -229 -62853 -44097 -13061 8761 23988 31198 34261 8665 -12384 17085
7742 17085 23119 28515 8260 -34978 -26208 -52247 -43980 -869 -70096 -58657 -53036 -48886 3801
7729 3801 29375 28102 1077 -61735 -97343 -89268 -70657 7111 47556 87164 64254 17130
7717 17130 85446 113581 82520 57376 59941 75516 65734 26350 4863 21727 42526 26368
7705 26368 883 875 32775 44216 17236 -2595 -16635 -1812 36306 26044 10189 19571 -14056
7692 -14056 -747 42943 35484 58060 77527 553 -686 44497 7444 9004 16688 9626 18874
7679 18874 -60321 -25510 -33561 -42315 -77097 -138178 -90105 14829 16335 44532 -150 -58690
7667e8690q970L083L2528M9684N75P055p2131o3814O8177Q8622J3212k0040J0751
7654E0042k539l9822K9333m5700l5629O099J3584P644K9432K2016l718j7827j7545
7641d630J2106L1089j9148M2670L892q5461l9796K6874K3631M1718N6314J2349
7629A01608k5763J0113j1073n4449l0841n0496K4576J9777L580M4511J3185n00
7617D4228k5438k2651r003L320k5754J7917M0266M2418N04m1730o6536l6457K0198
7604e8718J4763O9543k9231m5997K3405P0831j6331n94K506k1462j1496R720K3333
7591C0272p108L4799J0251m3909n548m7106J9598k5447m6200j4294L0410K0763
7579d3519Q677P5511j3583m3482l5719j6286J9083J8955J0639o3635J1052m96
$$ plain form
7667 -58690 -67660 -64577 -32049 17635 18210 25265 -46866 -110680 -42503 46119 59331 39291 50042
7654 50042 47503 7681 37014 -8686 -44315 -38216 -24632 -16988 12444 34460 30742 12915 -4630
7641 -4630 7476 38565 19417 62087 65979 -19482 -59278 -32404 -8773 32945 89259 101608
7629 101608 75845 85958 74885 20436 -10405 -60901 -36325 -16548 -12968 31543 44728 44228
7617 44228 18790 -3861 -12864 -9544 -35298 -17381 22885 65303 65807 24077 -42459 -78916 -58718
7604 -58718 -43955 25588 -3643 -49640 -26235 44596 28265 27671 30177 8715 -2781 6939 30272
7591 30272 23164 57963 68214 24305 18757 -28349 -8751 -34198 -80398 -94692 -64282 -43519
7579 -43519 -34842 40669 27086 -16396 -52115 -68401 -49318 -30363 -19724 -83359 -72307 -72803
7567g2803J1213N0016R6032K055p2325L107L0006k0116k8129q370l0954o217L270
7554d3215J5523K2493J6075J1896L4401K583r21J1717J1906J0712n3344r8507
7542e8681k8597K750L6593N6850k8843m2480n45M5605K1947K0294k0838m2122
7530c8067K3377l3600l8705O3025L4107j4364m1932O91K8419l7698l205j0942
7518f8894j3810L575O324J7221M330k354R3536N7170o7282o6260J091o637L2842
7505i148J706k0851O2951M122n4339M679O5064n1869k2081R145J6903L2457l0757
7492G982J1848j867K7467O2292l5369M345Q973j8404k2389J497j3328m6143n3722
7479f6818o0812M0180M5174Q4533K7268n8286K8696J0821l4168J139p723J4677
$$ plain form
7567 -72803 -61590 -11574 84458 86513 14188 17295 47301 27185 -944 -9314 -40268 -46485 -43215
7554 -43215 -27692 -5199 10876 22772 57173 59756 58835 70552 82458 93170 39826 -58681
7542 -58681 -87278 -84528 -47935 8915 -19928 -62408 -62953 -17348 4599 24893 4055 -38067
7530 -38067 -14690 -48290 -86995 -23970 10137 -4227 -46159 -45468 -17049 -54747 -57952 -68894
7518 -68894 -82704 -79129 -72805 -55584 -51254 -53608 39928 97098 29816 -36444 -35353 -41990 -9148
7505 -9148 -7442 -28293 34658 38780 -15559 -10880 54184 2315 -19766 -10621 6282 38739 7982
7492 7982 19830 17963 45430 107722 72353 76698 85671 67267 44878 46375 33047 -13096 -66818
7479 -66818 -127630 -87450 -42276 42257 69525 11239 39935 50756 16588 17727 10004 24681
7467B4681l5550j6359P380n2456J716J3211k0219k0741L3654N9313N0680j1996
7455C3314k0737k2934j697J9449k5j1277J05O075k3706R279O7368K71l0824L9833
7441F4494O301j7058m035O182k7906p2924l0042K6373k6971K6576L0863N416J8140
7428E409m800r797j2516Q616K9985o1840L1998N4662l568L317k8636k5357K1640
7415I113j9256j5408J9725k5924j2716L0527N2891q0839o6161n967O29K8180N4108
7402c1098k3716J033Q3738J6944p65J049J7348K8343M010K1643j6364J0746j6077
7389I6834n7275m7436K1605m371l9086k30P651j0765m3779L5166P2412m8249l0896
7376d8419L0339K0781k1646j1969K2539r530L8035O660P0793k7477o6112j4634
$$ plain form
7467 24681 -10869 -27228 -19848 -72304 -70588 -57377 -77596 -98337 -64683 -5370 45310 33314
7455 33314 12577 -10357 -12054 7395 7370 -3907 -3802 2273 -21433 -12154 55214 55485 24661 64494
7441 64494 70795 53737 49702 55884 27978 -44946 -74988 -48615 -75586 -49010 -18147 -12731 5409
7428 5409 609 -9188 -21704 -13088 16897 -44943 -12945 41717 38149 41466 12830 -12527 9113
7415 9113 -10143 -25551 -5826 -31750 -44466 -13939 38952 -41887 -108048 -114015 -113386 -85206 -31098
7402 -31098 -54814 -53781 29957 46901 46136 47185 64533 92876 96886 118529 102165 112911 96834
7389 96834 39559 -7877 13728 9357 -29729 -29959 -22308 -33073 -76852 -41686 30726 -17523 -48419
7376 -48419 -18080 2701 -18945 -30914 -8375 -17905 20130 26790 97583 70106 3994 -10640
7364a0640K8399K3914l514l3916m3922k6120M249K9263k9887K9061l3487o3506
7352a30106K5966R1524J4286l6983J9372L3636k6455p585j1896n4297j6692J02952
7340C722J387n4769n4536m1355M925M8016O7451j0727n8163k5953K2926N9299
7328c7777M1801L1270j1505m8025k2070R735n784J6524k7672o4050k3743j2760
7316a54056M0249N8104K1172j2141m7706l9834Q1695N0256k4651l0209O405M5943
7304d773J2348k0362N2584L1744l0438o5376j091l1319o0552n6754M1956J15089
7292a6944K0512k9534k4503L2763m047k1556j0175K0981k129K8520K0895P691
7280B2474j5107J2274Q650j4538J0312j7653k4556J1578m780J800j1878m4537
$$ plain form
7364 -10640 17759 41673 38159 4243 -39679 -65799 -61550 -32287 -62174 -33113 -66600 -130106
7352 -130106 -104140 -12616 1670 -35313 -15941 17695 -8760 -16345 -28241 -82538 -99230 3722
7340 3722 5109 -49660 -104196 -145551 -140626 -92610 -25159 -35886 -94049 -120002 -97076 -37777
7328 -37777 4024 35294 23789 -24236 -46306 -36571 -42355 -25831 -53503 -117553 -141296 -154056
7316 -154056 -113807 -55703 -34531 -46672 -94378 -134212 -52517 -2261 -26912 -57121 -50716 -4773
7304 -4773 7575 -12787 39797 71541 41103 -24273 -25364 -56683 -117235 -173989 -132033 -16944
7292 -16944 3568 -25966 -50469 -17706 -21753 -43309 -53484 -32503 -34632 -6112 14783 22474
7280 22474 7367 19641 28291 13753 24065 6412 -18144 -6566 -11346 -9546 -21424 -65961
7268f5961l4592j7961O6578L9364n2176l3065J2658N0839M4670k2538k8317j8170
7256e8671N7099K9294K4931K1489o5037o5856L712j3090m65K3859K970l122N2100
7243I213j0017j3104l103k0479M4416j8827q423M9437N0636j3618L1467L997m1624
7230E9971l2764L1386k8716l442m8202k9302O1682l3444j8521l056j6578m1763
7218a02749m2218J3631M101n8171j6119P3541K4983P3295K6986m4581j04081J1952
7206a39430K6023L8738M5144J5760L4998K1580L8703J1266o0450q601J6875r541
7194C1065J0095l5277l4862L0549k4122k4489j2787K655M0833k6436K7489K6992
7182A1705J785J0361M7989L1390m8937k9681k33O1815J0067n178m2258m4545J1896
$$ plain form
7268 -65961 -100553 -118514 -51936 -12572 -64748 -97813 -85155 -34316 10354 -12184 -40501 -58671
7256 -58671 -1572 27722 52653 74142 9105 -56751 -53039 -66129 -66594 -42735 -39765 -42887 9213
7243 9213 -804 -13908 -17011 -37490 6926 -11901 -20324 29113 79749 66131 97598 101595 59971
7230 59971 27207 58593 29877 26435 -21767 -51069 10613 -22831 -41352 -44408 -60986 -102749
7218 -102749 -144967 -131336 -127235 -185406 -201525 -127984 -103001 -29706 -2720 -47301 -151382 -139430
7206 -139430 -113407 -74669 -29525 -13765 21233 42813 81516 92782 32332 23731 40606 31065
7194 31065 41160 5883 -28979 1570 -22552 -47041 -59828 -57173 -16340 -42776 -15287 11705
7182 11705 13490 23851 71840 103230 54293 24612 24379 86194 96261 91083 48825 4280 16176
7169A6176J7808M5975R163k6090j9122M0088k4543p0382J2341l1660k0377K8614
7157b2009l12N7826J6614o2006q6019J8592Q7341k029K6333J4144k5690k7469
7145d684J9593J7341J6514j2510k8927l7951J0879N1390K3492O308J8216l0863
7133D8798k2061j4561J1558k2539J9585K4833j5311l1893j3008l4521j7717L9745
7121b7092J0345m4958r264O5882L2548L2744j6766J3237m5983j7450m4723M4147
7109g333L2700o1785Q076J7375L2436l274k8794j9127M2102l0089k2286m7614
7097h7613J7577P1137m6242j9936L970p205J412L2691m7912l3702K0081O7960
7085b7782j8343n9401j141L4853j7734J7964J2219m1813L3929Q9733K6825l0865
$$ plain form
7169 16176 33984 79959 89122 63032 43910 83998 59455 -10927 1414 -30246 -50623 -22009
7157 -22009 -22321 35505 52119 -9887 -95906 -77314 10027 7998 34331 48475 22785 -4684
7145 -4684 14909 32250 48764 36254 7327 -30624 -19745 31645 55137 61445 79661 48798
7133 48798 26737 12176 23734 1195 20780 45613 30302 -1591 -14599 -49120 -66837 -27092
7121 -27092 -16747 -61705 -70969 -5087 27461 60205 43439 56676 10693 -6757 -51480 -7333
7109 -7333 25367 -36418 -28342 -10967 21469 18195 -10599 -29726 12376 -17713 -39999 -87613
7097 -87613 -70036 1101 -45141 -65077 -61107 -68312 -66900 -34209 -82121 -115823 -95742 -27782
7085 -27782 -46125 -105526 -106667 -71814 -89548 -71584 -59365 -101178 -67249 22484 49309 18444
7073A8444k7791J0432q223n9309q5331P1917R2559K8571q312l4454n6133k5789
7061h3419Q3991P3390k4149j2396l1871n1404l621M7732K5872J1363k9919n169
7049D00k6163l0256M1618N254l5631l6557j437L9986O1080P719n9797K262J2057
7036a9465J7081J2651k3002j1393l5530m670Q47l215R817J2864l5166k4491O127
7023i7545L5875L9338l3364K28L4192l734p449l4553K0347J8566j9764J7204N3044
7010B2385N4476m1794m7598k653P7L0666r937j7508k2077L1244k9405L0531k7918
6997b9511n1603k691l2394m6015J9647L0061Q4401Q3650Q110L6728L551l3169
6985G0765n4351m2676O534J6522J6359K8353k9593Q995Q79m813p2142m5463K2636
$$ plain form
7073 18444 -9347 1085 -7138 -66447 -151778 -79861 12698 41269 32957 -1497 -57630 -83419
7061 -83419 572 73962 49813 37417 5546 -45858 -49479 -1747 24125 35488 5569 400
7049 400 -25763 -56019 -14401 -9147 -44778 -81335 -82772 -42786 18294 26013 -33784 -31522 -19465
7036 -19465 -2384 10267 -12735 -24128 -59658 -64328 -63481 -66696 -56879 -44015 -79181 -103672 -97545
7023 -97545 -61670 -22332 -55696 -55468 -21276 -25010 -32459 -67012 -46665 -28099 -47863 -30659 22385
7010 22385 76861 35067 -12531 -15184 -15107 15559 5622 -11886 -33963 -2719 -32124 -1593 -29511
6997 -29511 -81114 -83805 -116199 -162214 -142567 -112506 -28105 55545 63655 100383 103934 70765
6985 70765 16414 -26262 -19728 -3206 13153 41506 11913 20908 21787 16974 -55168 -100631 -77995
6972g7995O9098L5877j6611k6064j1243P9535N2308p2035k0675k9860L1070L2374
6960D5779m4088k4200N1334k686j16997m6028P9525O7838m650k9488M330n178
6948b4509k4721J0665N3064J9075l272o7350n043L8958P4374j7160l5812k5653
6936g384K9588L9739J8722k2872j0485o41l5479l711k7185K6879j6564p6837o0297
6923a46527k2286K917J7157N4092J7821o006j2847R608M9866M4948j1776J6137
6911A3104J2277j977O1458K1447n2410q1984o9358J8698L2837J6429L2064N0712
6899E3297L2113J9613l7491n8951n981k138J1545k9521L1009J5897l6052o2445
6887f9105j2623K1595M8548k3059n5247l1430K5836N9577N6574L4214m4465o850
$$ plain form
6972 -77995 -8897 26980 10369 -15695 -26938 52597 104905 32870 12195 -17665 13405 45779
6960 45779 1691 -22509 28825 26139 -90858 -136886 -57361 10477 5827 -23661 -19331 -24509
6948 -24509 -49230 -38565 14499 33574 30302 -37048 -42091 -3133 71241 54081 18269 -7384
6936 -7384 22204 61943 80665 57793 47308 46667 11188 7477 -19708 7171 -9393 -86230 -146527
6923 -146527 -168813 -165896 -148739 -94647 -76826 -82832 -95679 -86071 -36205 8743 -3033 13104
6911 13104 25381 23404 84862 106309 53899 -28085 -97443 -78745 -45908 -29479 2585 53297
6899 53297 85410 105023 67532 8581 2600 462 12007 -17514 13495 29392 -6660 -69105
6887 -69105 -81728 -60133 -11585 -34644 -89891 -121321 -95485 -35908 20666 54880 10415 3565
6875C565K0872J2226k0269m9687l3227N2063M4314n618q839j1910J670J661J9113
6862B5934j2401n5929r595l0953m1817J9151M6588j7169j4808N6028N9979m367
6850B0641M1798p6006o1630N7020Q2650j5m8486l9859n9688j8832L3495M7745
6838b1167k2361J8234K7080p183J7600L936p4536j7823K6272k2679N668k9213
6826i6172n053N8938J4941p078m0688M5315J9857M0872m0400m8100k1848J9296
6814f0120k0113l3705M3769N3551K9226l908j7817m5839m8743R601J682K4057
6802f8359J6758O978m8039M0093R8090J03239j9000j36792l0861K8677O0773M6213
6790I7770n0896q0723k0228J8775M132J9006J1127j8762k3984j6826r309l7846
$$ plain form
6875 3565 24437 36663 16394 -33293 -66520 -14457 29857 24239 15400 3490 5160 6821 25934
6862 25934 13533 -42396 -51991 -82944 -124761 -105610 -59022 -76191 -90999 -34971 25008 20641
6850 20641 62439 -13567 -75197 -18177 64473 64458 15972 -23887 -83575 -102407 -68912 -21167
6838 -21167 -43528 -25294 1786 -5397 12203 16139 -58397 -76220 -49948 -72627 -66959 -96172
6826 -96172 -101225 -42287 -27346 -34424 -75112 -29797 -9940 30932 -9468 -57568 -79416 -60120
6814 -60120 -80233 -113938 -70169 -16618 12608 8700 -9117 -54956 -103699 -94098 -92416 -68359
6802 -68359 -51601 -44623 -92662 -52569 45521 148760 129760 -7032 -37893 -9216 51557 97770
6790 97770 46874 -33849 -54077 -35302 -31170 -12164 -1037 -19799 -43783 -60609 -69918 -107764
6778a07764j2939P6186J4392k1073J5519M9740M8005P783K72l1245k1142m6855
6766b9121N471J9599o560l893j6870j1245l6987k732K9349J00988L057n7347l2227
6753c8518N1047j5036m328K0531N771j1068M420J4770L2297k2375m9305r853P2023
6740E0376K822j1725M580j4233k7923l6514M8258j5608N116K8436L6611j4315
6728E5881j4671k5452j1660N9944j6851l788L0357L2969M2063R2447J12047Q0916
6716D34202j3836m4112o8178k1025k1784r2154m7693j1072m5021j1204j1454L9302
6704H5971k1220m7452m3775P1623r253l4550j5902j6179o9116J4916K6432L0367
6692b8138M701L6751J6875L5523L715R74o2252j4103l646j0730M318O869J0581
$$ plain form
6778 -107764 -120703 -44517 -30125 -51198 -35679 14061 62066 69849 70121 38876 17734 -29121
6766 -29121 -23650 -4051 -10611 -14504 -31374 -42619 -79606 -82338 -52989 47999 51056 -6291 -38518
6753 -38518 12529 -2507 -6835 13696 19467 8399 12819 27589 59886 37511 -11794 -21647 50376
6740 50376 53198 41473 46053 31820 3897 -32617 15641 33 5149 33585 70196 55881
6728 55881 41210 15758 4098 64042 47191 43403 73760 106729 148792 241239 353286 434202
6716 434202 420366 376254 308076 287051 265267 173113 125420 114348 69327 58123 46669 85971
6704 85971 64751 17299 -26476 45147 35894 1344 -14558 -30737 -99853 -84937 -58505 -28138
6692 -28138 -23437 13314 30189 65712 69427 70401 8149 -5954 -9600 -20330 -16012 -9143 1438
6679A438K9003p2429n5284L7998P3770P059k716n8257l1051K3354o3238J6173
6667i4180Q6521N5589L3365K1995k4535k9557n4182l6686k9772M6141O213l0126
6655d9214L5772L2820P2730r757q7331M389K3400M971K9923Q219J7488o6154n3374
6642c6118j3523K7703k4467L9530M9921m5579k0475K367L1529K1205m588n0819
6630b3314J8576l299j340J4524r3735l0181N2591K2354J2768k8902J3546L5226
6618a1186l5934j4610l277j161j9540o499K1306J96j5616l7239M85K5417N6536
6605d1122O306m435Q0942m555K0840j850j532m3530p116p778j2716K5210O506
6592A5170K4191p9040k109M5477M3328m2119l0864j5849j1402J5290j5022m9190
$$ plain form
6679 1438 30441 -41988 -97272 -59274 14496 21555 18839 -39418 -70469 -47115 -110353 -94180
6667 -94180 -7659 47930 81295 103290 78755 49198 -4984 -41670 -71442 -25301 -19088 -49214
6655 -49214 -13442 19378 92108 82351 -4980 -591 22809 27780 57703 65922 83410 17256 -36118
6642 -36118 -49641 -21938 -46405 -6875 43046 -2533 -23008 -20641 10888 32093 27505 -23314
6630 -23314 -4738 -8037 -9377 5147 -88588 -118769 -66178 -43824 -31056 -59958 -46412 -11186
6618 -11186 -47120 -61730 -65007 -66168 -85708 -92207 -70901 -70705 -86321 -123560 -123075 -97658 -41122
6605 -41122 -34816 -39251 41691 37136 57976 56126 54594 11064 3948 -3830 -16546 8664 15170
6592 15170 39361 -39679 -41788 3689 47017 4898 -25966 -41815 -53217 -37927 -52949 -102139
6580a02139O5188L9407n646M07j485l2163M8361K9931m394j9254j6163j3602L9034
6567B7482l967K1479n0528R756k869n0640M2804r645k9380J6393j8275k707k5764
6554g5861M1599P4976J0460m1764q4280k4272L4393P6751l8424m8765p185l286
6542h5658J5011J4513N4184J4874J9962j6006Q036l4030M0393L9756j3186p2650
6530a4801n7214L8113O2744J6365J8371j3044l5680n1451J2830K9978K736k4303
6518a5356q117r669k3771J8796M1077l3627K316L2345L5262M03L2121j1923j464
6505E8393k4877p9709o129O864l397K0514L379K1096K2871m6483M1317N5044j5617
6492E3266m9023k9353N6610M2453l4603m0214J2766M7504k5749l8992M8454L6663
$$ plain form
6580 -102139 -36951 2456 -3190 -2783 -4268 -36431 11930 41861 37467 18213 2050 -11552 27482
6567 27482 23515 44994 -5534 4222 1353 -49287 -6483 -16128 -45508 -29115 -47390 -50097 -75861
6554 -75861 -34262 40714 51174 9410 -74870 -99142 -64749 12002 -26422 -75187 -82372 -85658
6542 -85658 -70647 -56134 -1950 12924 32886 16880 24916 -9114 31279 71035 57849 -14801
6530 -14801 -72015 -33902 28842 45207 63578 50534 14854 -36597 -23767 6211 8947 -15356
6518 -15356 -23473 -33142 -56913 -38117 2960 -30667 -28351 3994 39256 39659 71780 59857 58393
6505 58393 33516 -46193 -52322 -45458 -48855 -28341 -24962 -3866 19005 -27478 13839 68883 53266
6492 53266 4243 -25110 31500 73953 39350 -864 11902 59406 33657 -5335 43119 79782
6480G9782l8174r3597j6436K3285L4040J6410l260n3865q704J1269r427J4455
6468d4222J7277l080K9469k6849L1315p627O149k4847O632P816l9187K5672M6414
6455B4932J3063L5193j831k9997j6099L774N3529M0896J1654r5598q2294L3424
6443i354M4826M5471n584k6984L8430N936k0038j8024o9214L6417K4323o8373
6431b2168k1723K2548j3776m5222j874j0382o2292M0934N5714k5731r511k4078
6419a17561J4017M1267J8370l8606m8830J4604L2267L994L2450L5846K0156q7077
6407g9103j7773N9781J1109M9702K1927n505j9732j921m928k1210j7774k2334
6395d7761l5764M670N0252P114m1927L1823Q1660J6189j194N288k0757J3862k7646
$$ plain form
6480 79782 41608 -51989 -68425 -45140 -11100 5310 2050 -51815 -60519 -49250 -58677 -44222
6468 -44222 -26945 -30025 -556 -27405 3910 -3717 2432 -22415 -15783 -7967 -47154 -21482 24932
6455 24932 37995 73188 71357 41360 25261 29035 82564 123460 135114 39516 -42778 -9354
6443 -9354 35472 80943 75359 48375 86805 92741 72703 54679 -14535 21882 46205 -22168
6431 -22168 -43891 -21343 -35119 -80341 -82215 -92597 -154889 -113955 -58241 -83972 -93483 -117561
6419 -117561 -103544 -62277 -43907 -82513 -131343 -116739 -84472 -80478 -48028 -12182 7974 -79103
6407 -79103 -96876 -37095 -25986 23716 45643 40138 20406 18485 13557 -7653 -25427 -47761
6395 -47761 -83525 -78855 -28603 -21489 -63416 -31593 50067 66256 65062 70350 49593 63455 35809
6382C5809j0228R321m6667n8912K4444k9127J235L2645n3690J1340N7151M9334
6370B2655L1836K954M8376j7158l6701k6129Q1383J7941n2245j0384k5173k3081
6358A4274n8214L833N700K025j4350r970J2354P149O1181K5283K2170j3404j1793
6345D6238k5464J3724j024q0199n7672P959J7904O194M7593J3568m4455K339P080
6332d6215P992J5682r601p700k6352j1128k1037P9451l0545m8767O6717M8760
6320A7257J4106o2894n5727j4584R370K2607P2069K1733j2917l7700k4700J7156
6308c4224N4179N1031l5924j8338p6156L4867L2409l3641m7494m2722M2186J1737
6296f2090j6527q087M3029J3659O523L745k0876r4620J4672P5049K391j7378J2862
$$ plain form
6382 35809 25581 34902 -11765 -70677 -46233 -75360 -74125 -41480 -95170 -83830 -26679 22655
6370 22655 54491 57445 105821 88663 51962 25833 107216 125157 72912 62528 37355 14274
6358 14274 -43940 -40107 -34407 -32382 -46732 -56702 -44348 -37199 23982 49265 71435 58031 46238
6345 46238 20774 34498 33474 -46725 -104397 -96438 -78534 -72340 -24747 -11179 -55634 -53295 -46215
6332 -46215 -38223 -22541 -32142 -39842 -66194 -77322 -98359 -18908 -49453 -98220 -31503 17257
6320 17257 31363 -31531 -87258 -101842 -92472 -69865 2204 23937 11020 -26680 -51380 -34224
6308 -34224 19955 70986 35062 16724 -59432 -24565 7844 -25797 -73291 -116013 -73827 -62090
6296 -62090 -78617 -86704 -43675 -30016 -23493 -19748 -40624 -135244 -120572 -45523 -43132 -60510 -47648
6283d7648j8090j0640l242O4011m5533K0036j0281K073J3382M0228L8509j4574
6271B8231m5808K5244K9572N830L785k3427M599K3409M1558k1049k9082j4085
6259B8777q7632Q599j8229o853K7791M9974L6686K6706j7668j2890n4417j5680
6247c4836N6809N2366k753j7891M70k8876l8396j7412J5447l7686k6986m192l158
6234h7094PJ9073J0560K6413L3911L3992l0194j5082k7723r271j8821Q520N7672
6221A963J629J0396L9264m6801k1517j17N7721M6020k7614J4131p6594k8531M8384
6208A8334m4295l2531q000L3168P6148K754k7041k8194k816J2732r1623J1528
6196g9836L1060j6904k189L0757M4561l0149M7765N1801K4586n5365J705p959
$$ plain form
6283 -47648 -65738 -76378 -79620 -15609 -61142 -41106 -51387 -49314 -35932 4296 42805 28231
6271 28231 -17577 7667 37239 43069 46854 23427 28026 51435 92993 71944 42862 28777
6259 28777 -58855 -50256 -68485 -75338 -47547 2427 39113 65819 48151 35261 -19156 -34836
6247 -34836 21973 74339 71586 53695 54165 25289 -13107 -30519 -15072 -52758 -79744 -83936 -87094
6234 -87094 -87087 -68014 -57454 -31041 2870 36862 6668 -8414 -36137 -45408 -64229 -55709 1963
6221 1963 3592 13988 53252 6451 -15066 -15183 42538 88558 60944 75075 -1519 -30050 18334
6208 18334 -25961 -58492 -66492 -33324 42824 45578 18537 -9657 -12473 259 -91364 -79836
6196 -79836 -48776 -65680 -67869 -37112 7449 -22700 25065 76866 101452 46087 47792 39833
6184C9833j0186k978L1295J0545R768J3172k4049O862k3209n7913j8644K8709
6172C205q762j5552j8505m2022P917K0993K2629J9919k4232K4392J3755j07753
6160a04016n227K9563K2430L3898J9854N3979m7875J0366L7735p9966p9681L392
6148a05548J06377L4852r428J2350J4159j9906l7236k6190J5300M0256k7642K3762
6136B1106K0228J4786p1001n2924M9557O9688k4674k3645P969k6471m949n263
6124b5593K4741m7505M0558j4185j5502M2663J2074k8293q093K5973M6542o177
6112D7203j0860m3851j0828K3185Q699j3036K6359l522j1360j893O6737k8588
6100D8245M346L5758O70o4157j20L5687o0229n3752K442j6509L1359K3110j9523
$$ plain form
6184 39833 29647 26669 57964 68509 78277 91449 67400 74262 51053 -6860 -25504 3205
6172 3205 -5557 -21109 -39614 -81636 -73719 -52726 -30097 -10178 -34410 -10018 3737 -104016
6160 -104016 -109243 -79680 -57250 -23352 -3498 50481 2606 12972 50707 -29259 -108940 -105548
6148 -105548 829 35681 26253 38603 52762 32856 -4380 -30570 -15270 24986 -2656 21106
6136 21106 41334 56120 -14881 -67805 -18248 51440 26766 3121 11090 -15381 -20330 -25593
6124 -25593 -852 -48357 -7799 -21984 -37486 5177 17251 -11042 -19135 6838 53380 47203
6112 47203 36343 -7508 -18336 4849 13548 512 26871 23349 11989 10096 76833 48245
6100 48245 52591 88349 89019 24862 24742 60429 200 -53552 -51110 -67619 -36260 -13150 -32673
6087c2673M8716k6879n1430Q784L7340J4625k2125l5711K1225J6491O3431K6207
6075F8001m2394n1334l6373K7696L9423N0536K175m957Q136l9855m6828L6217
6063A0443M4442K8171n5511J8582J8767Q771j6275P584L8412m091m3498Q787j460
6050F3124k3951J8651K6819K8915K2626j123k9691Q705j9661l6480j1198j4299
6038C2437m6651n7997J0549O0973p221Q833L50K2850j8298j8071K6827k904o8789
6025e7112l7082N215M1339K9979p6O132K518J6146L1553m7535r0060l3864K4086
6012a08761N6717J4496M304P1636r909k0896j8352k6086m2800K3777P4041L558
6000B1725r831n0538l5814l1050J2370m637j6738L4531Q4328k861j394K7049l1045
$$ plain form
6087 -32673 16043 -10836 -62266 -53482 -16142 -1517 -23642 -59353 -38128 -21637 41794 68001
6075 68001 25607 -25727 -62100 -34404 5019 55555 57730 52773 60909 21054 -25774 10443
6063 10443 54885 83056 27545 46127 64894 73665 57390 64974 103386 99295 55797 64584 63124
6050 63124 39173 57824 84643 113558 136184 135061 105370 114075 94414 57934 46736 32437
6038 32437 -14214 -72211 -61662 -689 -7910 923 1273 24123 5825 -12246 14581 11677 -57112
6025 -57112 -94194 -88979 -47640 -17661 -17737 -11605 -9087 7059 38612 -8923 -98983 -132847 -108761
6012 -108761 -52044 -37548 -33244 38392 28483 7587 -10765 -36851 -79651 -55874 18167 21725
6000 21725 11894 -38644 -74458 -105508 -93138 -97775 -114513 -79982 4346 1485 91 27140 -3905
5987c905k3929K2016M1897m1575j15218k540Q9120k5092M9742L8261J5542k6535
5975A7784n756L9036M877r403J6958J8710K5995K278l9482l1666l0156j1447N2246
5962D9974o8291m2468M2603M5199Q9823J0144r6080j06722o9428j7694n395j0686
5950a79021k2006L8126L7973Q189j3028O6183K5482j5856j2299J7425k0420j934
5938g1186O4791M785p123K9972L0778L3047k2872k1440o837J6653K4959o3353
5926A2174M8059M1943o0807j8268P094k0998J2p61l3508o9978q90Q997n88J4737
5912g2782M5855K395M535K4530L1466n5017m5050K7085j3988K7292j1157k3180
5900e8016M8961j5036o8923J2510J5746M6640L2416M4318m7821n3277n2260o961
$$ plain form
5987 -3905 -27834 -5818 36079 -5496 -120714 -123254 -34134 -59226 -9484 28777 44319 17784
5975 17784 12028 51064 55941 46538 63496 82206 108201 110479 70997 39331 9175 -2272 49974
5962 49974 -18317 -60785 -18182 27017 116840 126984 30904 -75818 -145246 -162940 -168335 -179021
5950 -179021 -201027 -162901 -124928 -116739 -129767 -63584 -38102 -53958 -66257 -48832 -69252 -71186
5938 -71186 -6395 -1610 -8733 21239 52017 85064 62192 40752 33915 50568 75527 12174
5926 12174 60233 102176 41369 23101 30195 9197 9209 8448 -25060 -95038 -95928 -86931 -87519 -72782
5912 -72782 -26927 -24532 -19997 4533 35999 -19018 -64068 -36983 -50971 -23679 -34836 -58016
5900 -58016 -9055 -24091 -93014 -80504 -64758 -18118 14298 58616 10795 -42482 -94742 -101703
5888a01703K1339N094N7987L6930L5995l5035p3190p4889r585o769N5667P5337
5876a2822O7394m2398L2851M9250j5968p214j01208k5385K8780K2073K2343K2109
$$ plain form
5888 -101703 -80364 -75270 -17283 19647 55642 20607 -52583 -127472 -137057 -143826 -88159 -12822
5876 -12822 54572 12174 45025 94275 78307 71093 -30115 -55500 -26720 -4647 17696 39805
$$ [...]
##END NTUPLES=NMR SPECTRUM
##END=
