##TITLE=Analysis number 309582
Compound Code cc 33958
Book Reference 416/170
Project Code adrs
Chemist Name stevep
##JCAMPDX= 6.0         $$ Bruker NMR JCAMP-DX V2.0
##DATA TYPE= NMR SPECTRUM
##DATA CLASS= NTUPLES
##ORIGIN= Bruker BioSpin GmbH
##OWNER= NMR
$$ XWIN-NMR		Version 3.5
$$ Wed Jun  1 14:07:21 2005 GMT Daylight Time (UT+1h)  MAYBRIDGE\NMR@NMR_250MHZ
##.OBSERVE FREQUENCY= 250.131544655141
##.OBSERVE NUCLEUS= ^1H
##.ACQUISITION MODE= SIMULTANEOUS (DQD)
##.ACQUISITION SCHEME= undefined
##.AVERAGES= 16
##.DIGITISER RES= 18
##SPECTROMETER/DATA SYSTEM= dpx250
##.PULSE SEQUENCE= zg30
##.SOLVENT NAME= CDCl3
##.SHIFT REFERENCE= (INTERNAL, CDCl3, 0, 16.273)
##AUDIT TRAIL= $$ (NUMBER, WHEN, WHO, WHERE, WHAT)
$$ ##TITLE= Audit trail, XWIN-NMR		Version 3.5
$$ ##JCAMPDX= 5.01
$$ ##ORIGIN= Bruker BioSpin GmbH
$$ ##OWNER= NMR
$$ C:\u/data/dgb/nmr/ADRS/3710/pdata/1/auditp.txt
$$ ##AUDIT TRAIL=  $$ (NUMBER, WHEN, WHO, WHERE, WHAT)
(   1,<2005-06-01 14:07:01.63 +100>,<MAYBRIDGE\NMR>,<NMR_250MHZ>,
      <created by zg, POWCHK disabled, PULCHK disabled
       configuration hash MD5:
       62 19 C7 07 E1 42 D1 B7 37 6C 3D D0 77 39 F9 E6
       data hash MD5: 64K
       CC AF 1E CB 64 16 B2 B1 FC 96 DA 72 43 C0 20 EC>)
(   2,<2005-06-01 14:07:13.56 +100>,<MAYBRIDGE\NMR>,<NMR_250MHZ>,
      <Start of raw data processing
       ef LB = 0.3 FT_mod = 6 PKNL = 1 SI = 32K 
       data hash MD5: 32K
       0D E5 62 2A EC A6 2F FA E8 96 60 6D DF 74 C2 71>)
(   3,<2005-06-01 14:07:15.38 +100>,<MAYBRIDGE\NMR>,<NMR_250MHZ>,
      <apk 
       data hash MD5: 32K
       1A 82 8C 52 9A FF BF B1 5A 7B AA 64 CC C1 26 6A>)
(   4,<2005-06-01 14:07:16.10 +100>,<MAYBRIDGE\NMR>,<NMR_250MHZ>,
      <abs ABSG = 5 
       data hash MD5: 32K
       5D F7 F2 96 D7 1D E4 69 14 B9 B2 CE 31 F9 49 62>)
$$ ##END=
$$ 
$$ hash MD5
$$ 3E BF A1 FF E8 28 2C 8F 01 BF 36 78 F6 FC A9 02
##$RELAX= 
##$RELAX= 
##$RELAX= 
##$RELAX= 
##$RELAX= 
##$RELAX= 
##$RELAX= 
$$ Bruker specific parameters
$$ --------------------------
##$DU= <C:\u>
##$EXPNO= 3710
##$NAME= <ADRS>
##$PROCNO= 1
##$TYPE= <nmr>
##$USER= <dgb>
##$AMP= (0..31)
100 100 100 100 100 100 100 100 100 100 100 100 100 100 100 100 100 100 
100 100 100 100 100 100 100 100 100 100 100 100 100 100 
##$AQSEQ= 0
##$AQ_mod= 3
##$AUNM= <au_zg>
##$AUTOPOS= <31 >
##$BF1= 250.13
##$BF2= 250.13
##$BF3= 250.13
##$BF4= 250.13
##$BF5= 500.13
##$BF6= 500.13
##$BF7= 500.13
##$BF8= 500.13
##$BYTORDA= 1
##$CFDGTYP= 0
##$CFRGTYP= 5
##$CHEMSTR= <none>
##$CNST= (0..31)
1 1 145 1 1 1 1 1 1 1 1 1 1 1 1 1 1 1 1 1 1 1 1 1 1 1 1 1 1 1 1 1 
##$CPDPRG= <>
##$CPDPRG1= <>
##$CPDPRG2= <>
##$CPDPRG3= <>
##$CPDPRG4= <mlev>
##$CPDPRG5= <mlev>
##$CPDPRG6= <mlev>
##$CPDPRG7= <mlev>
##$CPDPRG8= <mlev>
##$CPDPRGB= <>
##$CPDPRGT= <>
##$D= (0..31)
0 1 0 0 0 0 0 0 0 0.06 0 0 0 0 0 0 0.0002 0 0 0 0 0 0 0 0 0 0 0 0 0 0 
0 
##$DATE= 1117631220
##$DBL= (0..7)
120 120 120 120 120 120 120 120 
##$DBP= (0..7)
150 150 150 150 150 150 150 150 
##$DBP07= 0
##$DBPNAM0= <>
##$DBPNAM1= <>
$$ [...]
##$SUBNAM8= <"">
##$SUBNAM9= <"">
##$SW= 20.6930455092707
##$SWIBOX= (0..15)
0 0 3 0 0 0 0 0 0 0 0 0 0 0 0 0 
##$SW_h= 5175.983436853
##$TD= 65536
##$TD0= 1
##$TE= 294.16
##$TE2= 300
##$TE3= 300
##$TEG= 300
##$TL= (0..7)
0 120 120 120 120 120 120 120 
##$TP= (0..7)
150 150 150 150 150 150 150 150 
##$TP07= 0
##$TPNAME0= <>
##$TPNAME1= <>
##$TPNAME2= <>
##$TPNAME3= <>
##$TPNAME4= <>
##$TPNAME5= <>
##$TPNAME6= <>
##$TPNAME7= <>
##$TPOAL= (0..7)
0.5 0.5 0.5 0.5 0.5 0.5 0.5 0.5 
##$TPOFFS= (0..7)
0 0 0 0 0 0 0 0 
##$TUNHIN= 0
##$TUNHOUT= 0
##$TUNXOUT= 0
##$USERA1= <user>
##$USERA2= <user>
##$USERA3= <user>
##$USERA4= <user>
##$USERA5= <user>
##$V9= 5
##$VALIST= <valist>
##$VCLIST= <CCCCCCCCCCCCCCC>
##$VD= 0
##$VDLIST= <DDDDDDDDDDDDDDD>
##$VPLIST= <PPPPPPPPPPPPPPP>
##$VTLIST= <TTTTTTTTTTTTTTT>
##$WBST= 1024
##$WBSW= 4
##$XGAIN= (0..3)
0 0 0 0 
##$XL= 0
##$YL= 0
##$YMAX_a= 532293
##$YMIN_a= -775092
##$ZGOPTNS= <>
##$ZL1= 120
##$ZL2= 120
##$ZL3= 120
##$ZL4= 120
##$ABSF1= 16.27302
##$ABSF2= -4.420149
##$ABSG= 5
##$ABSL= 3
##$ALPHA= 0
##$AQORDER= 0
##$ASSFAC= 0
##$ASSFACI= 0
##$ASSFACX= 0
##$ASSWID= 0
##$AUNMP= <proc_1d>
##$AZFE= 0.1
##$AZFW= 0.1
##$BCFW= 0
##$BC_mod= 0
##$BYTORDP= 0
##$COROFFS= 0
##$CY= 12.5
##$DATMOD= 1
##$DC= 0
##$DFILT= <>
##$DTYPP= 0
##$F1P= 14.0000005364418
##$F2P= -0.99999901652339
##$FCOR= 0.5
##$FTSIZE= 32768
##$FT_mod= 6
##$GAMMA= 0
##$GB= 0
##$INTBC= 1
##$INTSCL= 1
##$ISEN= 128
##$LB= 0.3
##$LEV0= 0
##$LPBIN= 0
##$MAXI= 10000
##$MC2= 0
##$MEAN= 0
##$ME_mod= 0
##$MI= 0
##$NCOEF= 0
##$NC_proc= -5
##$NLEV= 6
##$NOISF1= 0
##$NOISF2= 0
##$NSP= 0
##$NTH_PI= 0
##$NZP= 0
##$OFFSET= 16.27302
##$PC= 1
##$PHC0= -74.97649
##$PHC1= 5.757309
##$PH_mod= 1
##$PKNL= yes
##$PPARMOD= 0
##$PSCAL= 4
##$PSIGN= 0
##$REVERSE= no
##$SF= 250.130062274554
##$SI= 32768
##$SIGF1= 0
##$SIGF2= 0
##$SINO= 400
##$SIOLD= 32768
##$SREGLST= <1H.CDCl3>
##$SSB= 0
##$STSI= 32768
##$STSR= 0
##$SW_p= 5175.98343685301
##$SYMM= 0
##$S_DEV= 0
##$TDeff= 65536
##$TDoff= 0
##$TI= <Analysis number 999999
Compound Code 99
Book Reference 9
Project Code 9>
##$TILT= no
##$TM1= 0
##$TM2= 0
##$TOPLEV= 0
##$USERP1= <user>
##$USERP2= <user>
##$USERP3= <user>
##$USERP4= <user>
##$USERP5= <user>
##$WDW= 1
##$XDIM= 32768
##$YMAX_p= 521131742
##$YMIN_p= -1085365
$$ End of Bruker specific parameters
$$ ---------------------------------
##NTUPLES= NMR SPECTRUM
##VAR_NAME=  FREQUENCY,     SPECTRUM/REAL,   SPECTRUM/IMAG
##SYMBOL=    X,             R,               I
##VAR_TYPE=  INDEPENDENT,   DEPENDENT,       DEPENDENT
##VAR_FORM=  AFFN,          ASDF,            ASDF
##VAR_DIM=   32768,         32768,           32768
##UNITS=     HZ,            ARBITRARY UNITS, ARBITRARY UNITS
##FACTOR=    0.157963299565203, 1,           1
##FIRST=     4070.37145363019, 0,            0
##LAST=      -1105.61198322282, 0,           0
##MIN=       -1105.61198322282, -1085365,    0
##MAX=       4070.37145363019, 521131742,    0
$$ Real data points
##PAGE= N=1
##DATA TABLE= (X++(R..R)), XYDATA
$$ [...]
22233 -50729 -61796 -70885 -85219 -57681 -33319 -29076 -30309 -14104 -4138 -2652 90957 178820 169074
22220 169074 101342 81002 48741 55069 52490 14868 -22606 -256 -15886 -17839 -10205 -18274
22208 -18274 -7507 -11382 -11910 26358 8946 50316 68730 34817 19171 -20916 31943 69944
22196 69944 72337 83920 79216 51224 30312 80036 37444 -71471 -78906 -71195 -45779 -48571
22184 -48571 -90183 -52265 -18190 47385 52641 60767 13420 7080 23620 -3508 -53925 -36457
22172 -36457 -16948 44621 90737 83518 108429 108319 76023 55689 61120 76595 111388 87681
22160 87681 69566 66814 43708 -50439 -103711 -102363 -83124 -59994 -50863 -39478 3878 7063
22148 7063 2215 11916 50867 73226 87377 60296 774 -19703 -10564 146 24740 8547
22136 8547 11305 5562 -39406 -55760 -14315 3510 225 -49168 -58409 -48690 -48975 -62404 -59566
22123 -59566 -33073 -18468 -6769 -23153 -52369 -58163 -30154 3645 11460 18891 29491 7733
22111 7733 -3266 -35856 -36234 -49020 -61450 -113679 -111929 -64873 -46187 -5560 6279 9618 -29089
22098 -29089 -47879 9362 8536 14313 5745 -17141 -47990 -50996 -65284 -24574 -55320 -52269 -70391
22085 -70391 -120769 -74567 10773 -629 5526 11041 24300 1851 -19822 -16026 1962 -3157
22073 -3157 -14409 -9416 23765 45510 53949 31437 791 609 8069 16076 9948 33926 56848
22060 56848 17697 37489 97492 69157 64955 27091 45322 81588 40376 23917 38843 76338
22048 76338 52699 30883 -9821 -29200 14884 23752 7778 587 -37266 -40703 -10189 21849
22036 21849 21001 -9138 -25997 -31246 -40414 -5698 31143 19271 -30587 -76798 -114488 -114782 -55746
22023 -55746 -10158 -3463 -38748 -36918 -40290 4197 11206 -43782 -15975 -35331 -22041 -2910
22011 -2910 25979 30653 25142 -22437 -38440 -41350 -31074 -8313 42448 -19999 -78217 -78406 -41610
21998 -41610 21423 60923 41985 19251 -50485 -69149 -48886 -36890 -15124 7314 31304 46571
21986 46571 64132 100225 121342 108393 52933 48039 46705 17511 -21876 -2864 -575 -4485
21974 -4485 41242 28507 -38230 -19749 2072 9617 -35664 -45638 -53813 -32630 53376 51594 28015
21961 28015 28458 35496 44026 32333 -19395 -40307 3648 12522 -23117 -28265 -31013 -56809 23680
21948 23680 76020 91497 90526 43991 2837 6717 20084 41254 -44183 -80600 -25089 -37508
21936 -37508 -91863 -68802 -53022 -31156 -44278 -130901 -139027 -45507 211 -47290 -54787 -23671
21924 -23671 25109 39054 19942 -2880 -1100 7791 71479 44036 25977 52221 31215 -10763
21912 -10763 -63246 -63618 -75178 -55516 -37471 -64653 -54454 -3921 21908 27836 34498 53876
21900 53876 82261 109560 121355 69515 11391 21348 13852 14854 14730 22396 11885 -15256 -13419
21887 -13419 11692 -3574 -29805 -44538 10697 54920 52750 14982 -3698 13662 -20427 15927
21875 15927 74191 123147 67073 23327 70109 39224 20852 45783 7573 -46947 -42875 22552
21863 22552 46994 64051 34486 -3539 -58421 -83364 -41019 25573 12971 -15409 -67751 -36814
21851 -36814 -16755 -21232 -43280 -28807 -15895 4534 42224 89336 112802 119972 120527 58050
21839 58050 14654 4814 4707 49191 75795 37656 32687 22233 -28838 -34127 55509 83161 -4276
21826 -4276 -78675 -29242 -27492 -12764 18388 18618 -14865 -53115 -18702 -7528 -61736 -48472
21814 -48472 -21217 11703 59818 41791 23720 25226 -8802 -64062 -80532 -153954 -124247 -69587
21802 -69587 -36187 -16831 -28999 -21610 -29858 -41198 -72229 -55992 -5676 1782 8716 3301 -62541
21789 -62541 -101792 -72427 -71404 -98291 -57886 -64017 -50371 -37078 34389 48993 31823 36340
21777 36340 67561 152399 183383 119920 59765 56055 61416 11105 -27068 -28522 -28806 580 -372
21764 -372 -34120 26568 -2258 -21381 -5397 87543 119445 81108 95371 91226 130447 118941
21752 118941 8586 -26892 16012 -16922 -67633 -55243 14551 53111 60406 9038 -3369
21741 -3369 44048 66096 44355 8973 -34354 14751 52124 48813 -6503 -25437 -33000 -19273
21729 -19273 -3364 -57493 -99871 -17580 24537 -5338 -24817 28032 64036 74774 -9028 -33147
21717 -33147 -9140 -2897 36812 14857 18160 26942 39187 6376 -2734 18900 50322 22419
21705 22419 39328 9581 -30235 -34771 19187 56955 84450 73670 149451 187447 115201 59345
21693 59345 -922 6207 76762 99249 75783 37058 20872 53655 46849 9000 -20841 -28507
21681 -28507 -93039 -65662 -38769 -60479 -22520 26127 18847 -6290 -44741 -65528 -63859 -68547
21669 -68547 -61929 -46282 -42620 -9622 11416 57603 67804 67437 -1647 10241 36970 11488
21657 11488 51538 72028 51889 -6062 -38432 -2937 25509 -49027 -83991 -60881 -80945 -77816
21645 -77816 -66546 -13484 24718 120 -29590 -56562 -50294 -58792 -58947 -75825 -85695 -58881 -23822
21632 -23822 29401 6127 5305 34317 57005 41138 5919 23760 8025 52742 37160 -16133
21620 -16133 -9518 -59781 -113517 -89687 -4140 51792 17915 -2675 44245 28675 -25638 -35746
21608 -35746 -38416 -2245 40956 33196 26787 56430 62419 64538 69934 38445 3761 12457 15203
21595 15203 -7154 458 -11466 8374 16228 24721 -46785 -79249 -68847 -42660 -10841 -13437
21583 -13437 -34760 -31448 -13508 -856 34228 22773 -14079 -42327 -8405 -32387 724 -25360
21571 -25360 -17524 12778 -762 -64487 -133046 -98288 -26177 3386 -6929 -61589 -76623 -74184
21559 -74184 -19201 21565 37413 76518 48110 -11285 -49912 -88889 -17902 42805 105070 77642
21547 77642 10566 -16475 -17198 -25503 -25929 -2329 -9500 -11475 -16312 -37106 -43425 -33622 -73286 -48435
21533 -48435 39098 68193 85336 73747 56369 47933 37502 40896 62848 32276 -30740 -62092
21521 -62092 -67616 -10612 -15700 -16138 64643 89894 74170 40140 21815 77623 39825 16696
21509 16696 21700 19300 21553 30510 12254 -5692 29626 -13052 -53425 -14079 -7201 -17973 13720
21496 13720 8426 -20336 -30880 30374 33060 -29723 -49934 -12355 44743 48790 9984 -30178
21484 -30178 -27113 -2233 -4148 -51943 -83032 -113722 -101694 -78015 -84296 -67150 -40253 -6091
21472 -6091 -669 -12635 -57209 -73322 -39150 27043 50929 21868 -38954 -37411 -34155 -7494
21460 -7494 -19495 -19931 -41202 -75851 -76104 -30087 3635 25120 15343 74035 88952 55503 15501
21447 15501 -44451 -92945 -87079 -67497 -34609 -52746 -49378 -56974 -42960 -64788 -112154 -101486
21435 -101486 -67758 -9550 -40060 -88878 -58243 -12625 17247 37629 -2639 9351 4674 -33419
21423 -33419 -65189 -64019 -53581 -77656 -68073 -51312 -59294 -52065 -43669 -9883 -3092 -23980 -44141
21410 -44141 -36359 -10239 -8180 -9186 -29351 -6273 13178 96 -48042 -51236 -59830 7873 34995
21397 34995 67290 83793 47005 -1472 -56388 -132278 -106006 -100785 -90372 -97147 -71139 -79340
21385 -79340 -98665 -69778 -45564 -35448 58226 88247 12905 -7134 -30168 -53286 -31870 -32660
21373 -32660 -36994 -29811 12525 -20203 -15499 3290 -11037 -7730 -27075 -45857 -35795 -10675
21361 -10675 -28348 -30101 -17446 -26266 -11994 14216 -18994 -25954 32404 28155 -4540 -43571
21349 -43571 -67023 -17290 -46525 -86085 -103950 -135140 -100586 -73235 -46624 -36093 -30041 -41061
21337 -41061 1894 -4099 -4568 -5279 49312 76552 9683 -33136 -55061 -53162 2966 47839 21697
21324 21697 -42147 -63369 -21539 3647 -35523 -50526 -11236 26812 10750 -17500 -26872 21257
21312 21257 24680 45859 67341 708 -10612 -25256 -19670 285 15961 -24719 -36084 -10304
21300 -10304 -5287 27505 35142 13463 -48159 -90140 -52239 -12237 -14800 -3269 16635 -39151
21288 -39151 -27552 -7533 -24725 -39294 -13027 15463 57787 93430 96216 134180 104626 72906
21276 72906 47930 -49084 -28680 23596 3024 -25541 -65832 -75555 -29039 3273 -25913 -74508
21264 -74508 -57077 5673 -10569 9299 -5451 54707 111546 140353 108744 14222 -13181 -12712
21252 -12712 -46830 -69112 -59733 -42991 25291 -6237 -48911 -53665 -55361 -54764 -43789 -32230 -16216
21239 -16216 5085 -19196 8528 18094 46603 26112 42358 66455 71184 86948 90478 99415
21227 99415 57125 56753 105442 122990 112336 72694 27955 -3943 -5776 -2991 38620 -6157
21215 -6157 -11163 36579 31767 8028 -4241 22564 54947 59388 47563 69864 45522 48391 55306
21202 55306 40111 9819 10744 19007 11930 31292 59686 23820 -23543 26723 24553 -27600 -104401
21189 -104401 -134144 -116346 -69010 -39670 -32362 32182 20379 -28302 -17416 -54713 -74342 -57166
21177 -57166 1926 -29643 -32629 -17512 -16927 -14853 -35552 -48520 4597 -33142 -72132 -48784
21165 -48784 -17689 -57943 -97331 -64947 -42179 -64230 -45950 -31492 -30995 -46658 -38348 -26095
21153 -26095 46178 35860 6316 -22285 -4079 18016 37327 81272 74758 68712 23971 30878
21141 30878 5296 7471 -59931 -57041 -27384 -66813 -33734 -21219 35511 23780 -24996 -47244
21129 -47244 -44257 -28412 -60252 -103130 -68428 14967 29471 -1661 18157 86362 42731 -21864
21117 -21864 -61859 -47295 -10336 8795 -32649 -45352 -23504 25173 42168 42172 64951 30053
21105 30053 39929 49991 29426 13634 28799 77412 146464 117818 73490 64098 23647 -32045
21093 -32045 -50622 -70974 -36928 40860 91388 79550 16607 19969 41870 17796 -9592 -61213
21081 -61213 -49836 -2054 -31373 -61048 -101886 -91904 -115231 -121095 -76981 -37216 -39641 -3889
21069 -3889 54534 33590 -28139 -25701 17577 10285 -4517 9329 -20423 91 43248 46042
21057 46042 31919 41620 55843 13554 -3167 -24371 -20562 16621 48995 49563 86456 86438 26378
21044 26378 -1090 -6220 14402 -6367 -43755 -74160 -52134 -45980 -58269 -119980 -121987 -148608
21032 -148608 -114559 -47513 -73466 -101923 -121254 -109488 -83870 -19463 -31676 -55315 1291
21021 1291 -38292 -55221 10459 -11733 -2245 33699 80822 54173 7255 6552 2290 21003 61913
21008 61913 33379 25797 -13408 -33718 -19109 -39305 6815 26500 25489 62397 60324 -8980
20996 -8980 -14111 -38371 -62866 -60294 -24631 8970 -21943 4216 53560 70839 75246 31437
20984 31437 19895 57516 46493 -16781 -30833 21539 15933 -26274 14434 -6448 10937 9678
20972 9678 -28736 -9859 -22385 -52338 -30129 -92287 -61759 -20683 10561 42358 30049 30513
20960 30513 921 6323 10613 -2356 18663 4504 8590 -13236 45547 56788 -4748 -22094
20948 -22094 8346 5404 -34735 -32747 -26680 51 3586 16649 7004 13473 13682 11128 -22269
20935 -22269 17184 25080 16343 -2702 -78313 -59415 14874 14403 -15830 -48480 -12199 -11609 -3700
20922 -3700 24508 21137 -15996 -15305 2390 30594 26458 29323 75307 77352 90809 48581 -4986
20909 -4986 -22159 -37095 -36740 -39636 -76421 -4 25250 -19075 -47832 -21293 4828 -13212
20897 -13212 -40824 -23131 2254 -26001 -63054 -84700 -92564 -69566 -8117 -17516 -58763 -59224
20885 -59224 -30092 -257 -4649 40352 27297 16254 51136 74917 38499 -35046 -4102 16510
20873 16510 15349 51211 73437 29898 -5700 -22709 12203 58542 71755 62868 26365 25548
20861 25548 16058 23755 -12258 -30321 -37100 -22245 -373 34952 398 -4748 -38771 15699
20849 15699 53887 42415 21824 -29304 -129825 -149629 -144656 -101822 -12666 -10928 -37046 7203
20837 7203 15175 -22839 -1967 40251 -5088 -39290 -38225 -32861 15841 15140 -30573 5082 53039
20824 53039 82175 73351 66301 43866 10675 27296 32557 36761 54916 2204 -24261 -22094 2249
20811 2249 33953 23915 89355 83360 66761 69895 29267 -28953 -30102 411 56626 -11749
20799 -11749 -77436 -125471 -114646 -85415 -57627 -37898 -91709 1010 25630 37012 39923 2746
20787 2746 -61642 -79527 -26858 59785 70983 40162 -4707 -39439 -48986 -40886 -46845 -57922
20775 -57922 -31106 -39379 -25461 -7922 -13090 -19796 40612 20890 -39551 -36619 38816 59552
20763 59552 39587 -27040 -4031 18122 -20707 12692 22431 41436 47565 21874 44730 63299
20751 63299 56230 60615 66265 38202 30825 56890 61505 34334 2278 -27404 -8500 16640 39285
20738 39285 50427 65414 43426 39699 23210 6865 51290 133706 123786 68601 58937 31100
20726 31100 10081 38067 41824 22761 70740 131601 157243 143861 59643 -31009 -64536 -64155
20714 -64155 -59810 -46316 -71811 -72621 -48725 -36071 -69308 -53203 -24740 -40696 -28471 -60280
20702 -60280 -83348 -46202 -8101 26494 10406 -1674 -3633 -26752 -74740 -112727 -97063 -70483
20690 -70483 -88296 -93260 -11856 20008 94556 140178 90322 33974 63794 68851 -12237 -9397
20678 -9397 22964 -16325 -56596 -52113 22873 -2465 17324 50257 36024 41646 53079 27339
20666 27339 -35446 1896 34712 -24288 -90649 -190024 -179853 -156782 -128018 -104689 -116723 -84657
20654 -84657 -52457 -21642 20014 71834 36862 -21499 -63301 -92022 -65678 3535 46222 3114
20642 3114 35598 62945 63330 54883 45067 10838 18328 41647 53438 -4694 -25348 28968 6996
20629 6996 -60829 -76682 -53345 14038 46050 -7685 -44885 -32324 -44292 -36527 -32178 -41725
20617 -41725 -25257 13656 17189 17024 33027 40919 30341 20097 5547 -9661 8316 28025
20605 28025 22445 5075 32327 36693 8769 35620 80824 120494 103596 43658 28502 -12966
20593 -12966 -68033 -78632 -83600 -10218 52962 102223 156001 93332 93251 49008 3105 -106046
20581 -106046 -115005 -103477 -87594 -61883 -61711 -41797 -33725 -24051 14731 37497 40668 36849 31385
20568 31385 17696 3200 -14860 -32851 -25979 10594 -34772 -69010 -56429 -107247 -178317 -108362
20556 -108362 -71683 -60000 -42230 -37676 -19425 4845 30161 28001 -28597 -54426 -49757 -44631
20544 -44631 -307 -739 -25884 -50280 -49409 -62078 -77344 -53649 39548 17738 -51574 -49821 -75156
20531 -75156 -98589 -73550 -60673 -38790 -36897 -26360 -1232 -24349 -22303 -40647 -76177 -112191
20519 -112191 -102863 -46422 19375 45538 178 -24407 -16214 -45232 -62806 -50858 -37339 -10012
20507 -10012 12271 -20639 -58356 -42671 -48515 -40031 -73196 -58043 -37641 -3436 55509 59721
20495 59721 56613 85063 48401 15886 -16552 -32957 -45759 -42899 -67350 -13810 26168 40273
20483 40273 48352 92676 61854 -12128 -19404 22165 26052 -28100 -7556 7946 -24130 -88695
20471 -88695 -151445 -138249 -116074 -62945 -33834 -51550 -71572 -39623 -81819 -48571 -13096 -54505
20459 -54505 -62777 -97460 -89976 -57019 -28640 -9185 -2435 -49648 -90308 -105857 -68940 -54462
20447 -54462 -37526 4476 -18946 -6788 32521 21273 -6589 -30340 -39927 -15735 -1839 -26599
20435 -26599 -422 15800 2758 -18018 -24954 18159 47211 62653 5677 -48532 -66098 -90768
20423 -90768 -54268 -25685 -15209 -10551 24616 27481 45281 30619 82157 119662 78651 72513
20411 72513 55934 -24181 -52487 16270 5480 -41684 7762 43091 11471 4133 -11807 25514
20399 25514 27882 11591 -12430 -36133 -14158 -29183 -47211 -13553 -27726 -44576 -64578 -64464
20387 -64464 -36889 -39221 -24649 -45245 -75539 -78300 -56864 -27783 -22471 18024 23563 55249
20375 55249 25398 368 -14151 -56272 -59933 -72598 -65815 -22333 -30872 -741 -55075 -34760
20363 -34760 -30904 -32577 -62247 -61738 -28969 2380 39253 22356 72969 100957 67686 19051
20351 19051 2357 60340 60613 9289 -27723 -33915 -16005 -11539 15682 9761 2071 10714 18116
20338 18116 -47552 -38405 -56970 -74124 -76614 -50635 -67882 -120672 -159191 -115535 -56694 -55251
20326 -55251 -73268 -104920 -91655 -60090 -7724 -34697 -49837 -10503 25976 54420 40058 28966
20314 28966 40138 8298 4632 45851 48994 80907 34055 -45359 -42353 38333 40261 51381
20302 51381 58177 -6893 -52836 -78744 -59189 -42378 -46515 -11171 -33768 -54770 -55369 -23227
20290 -23227 -9468 -47875 -31969 -33545 -91640 -137017 -54024 3115 -27088 -63251 -45396 35058
20278 35058 85427 54072 -33036 -71529 -92922 -68473 -71924 -46305 -17763 -11113 -60692 -29967
20266 -29967 -23255 -30917 -34589 -34007 16978 -37208 -7254 107114 157459 86025 41871 18124
20254 18124 26803 34631 51945 95182 41005 38428 17789 11190 5498 -10854 20530 24183 1317
20241 1317 -56831 -38103 -23454 -16806 -22769 -43380 -32115 -34106 -22710 -17531 -13152 -15165 -40052
20228 -40052 -15951 8721 30453 22474 385 49538 -25848 -52187 10729 15684 28476 -17180
20216 -17180 -93005 -92612 -38950 -34753 -22370 -44833 -35542 -73436 -111821 -137186 -121775 -70359
20204 -70359 258 43142 48878 37945 8927 37208 44293 11566 4363 -23147 -25645 -21175 -32402
20191 -32402 -22880 -38270 -7916 -5588 -3095 36294 53266 38597 23949 -14652 -58656 -67378
20179 -67378 -47092 -5314 -48652 -3757 -14687 -35287 17906 76109 91837 95383 75999 36108
20167 36108 -25356 383 2266 -7738 -117 4878 38047 45250 14963 -32672 -34831 -24128 -25536
20154 -25536 -105405 -92003 -42045 24538 4140 -64863 -51918 -24150 -42681 -45248 -28554 -11152
20142 -11152 -4592 -23556 14638 43296 36400 -24302 -53792 -77532 -82844 -33606 -7537 -3672
20130 -3672 -4278 41869 56767 28607 30154 32381 4495 281 -22462 -20779 9950 31158 -5443
20117 -5443 -13761 -9777 53266 63419 -4727 -40928 -31538 -20650 26307 56786 75363 102921
20105 102921 103341 109896 66060 91373 81545 20512 13413 12794 -68804 -82061 -8851 18234 -53328
20092 -53328 -96142 -64523 -59863 -33368 -34422 -75896 -96436 -51842 7395 -18161 -3802 -24979
20080 -24979 -27528 21574 47541 53324 16084 20910 -20944 -33654 -90441 -98598 -86122 -57576
20068 -57576 -54527 -39496 -31203 -40599 -57015 -142141 -120366 -32169 12518 11487 63695 109789
20056 109789 26988 -29921 -32910 1617 5966 63633 46706 -24530 -67480 -32438 43548 -2544
20044 -2544 -11668 8451 1028 -58750 -58332 -44453 -31011 -85531 -100080 -39720 28936 61514 48621
20031 48621 39435 26903 -12854 -193 5365 19990 18741 44584 62853 80738 37671 25245
20019 25245 65832 63129 -20778 -38051 15492 -23277 -82908 -68627 -56395 -84619 -70053 -20070
20007 -20070 22452 40111 40216 98014 106088 50112 11781 -11394 -32343 -22357 -23338 -24160 -25106 -23364
19993 -23364 -27905 -20799 -32966 -22529 -8667 -23475 -43162 -38450 -43696 -47409 14853 35599 5997
19980 5997 3694 -19810 -48077 -69723 -38769 16168 -14612 -65798 -42303 -13670 -28274 -23275
19968 -23275 8867 -26435 -48552 -8957 -108 47137 24452 61357 80327 54085 54134 17902
19956 17902 -10194 -6497 -42855 -76485 -47296 -54209 -32723 -70063 -102898 -61564 -52799 -64717
19944 -64717 -35564 -80114 -102979 -67126 -75865 -10146 -12278 -10668 -4625 -18650 -49092 -44942 -39109
19931 -39109 -36688 -17641 10851 33403 -21880 -7525 36328 8460 -27856 -9236 -2312 -32638
19919 -32638 -93570 -91929 -13550 52856 69304 8034 -25422 -26411 -12245 -44945 -56550 -75014
19907 -75014 -22742 22360 -34891 -72076 -87166 -85319 -23898 25132 62046 10801 2679 65083
19895 65083 74228 43149 1818 269 24177 14376 -2102 40522 10791 -24729 -75111 -99762
19883 -99762 -86273 -97748 -67115 -50613 -22314 48960 15770 -19003 -37055 -43765 -9415 4675
19871 4675 19093 23759 11845 -21001 -53530 -13678 -13033 -10124 -33160 -44160 -44910 -39273 -66279
19858 -66279 -29236 51035 50756 18160 -9277 -56330 -47298 -44533 1457 -2785 -7017 -7772 52238
19845 52238 113578 57220 532 44008 47852 32680 -11238 23801 20596 17350 17891 -39328 -48317
19832 -48317 12595 76391 51339 -871 -28426 -57389 -63850 -69473 -34268 -33781 6649 42725
19820 42725 73417 71367 71158 61433 73594 88907 109265 146402 189884 195540 166341 153461 177505
19807 177505 140951 128338 75569 48730 6644 15208 40416 15419 -37750 -49755 -27504 -20850
19795 -20850 -42388 36885 106080 82636 30333 -22753 -13027 -7963 8267 5841 55434 34656
19783 34656 21688 765 24136 96153 142443 128142 60099 42229 38995 1760 -39422 -34715
19771 -34715 -36023 47057 89994 118146 92207 107929 37969 -43327 -1818 54066 61971 -7094
19759 -7094 31626 51778 34316 51922 59806 45087 21907 56554 50014 19860 42976 50927
19747 50927 65926 67402 30252 -10720 -29283 -34228 7468 -13871 5356 37316 45524 4696
19735 4696 -12262 -38287 -45266 428 23926 36769 57022 14554 -27702 -16433 -32041 -58893
19723 -58893 -82111 -70203 -6170 -60092 -55639 -25603 -31076 -41562 -71040 -97078 -137322 -87779
19711 -87779 -17754 60032 44433 -13441 -62694 -77293 -70395 -21145 56029 61004 61574 54622 29075
19698 29075 15324 7711 35303 26662 2303 9113 45558 73429 47340 21639 6734 34883
19686 34883 38099 50743 52760 42358 76805 69748 44890 95459 80824 57642 44993 34870
19674 34870 54328 68684 58696 32772 -1828 4315 50984 92545 48208 935 45346 60990
19662 60990 -9548 -10114 -14987 -17925 7741 34391 47400 7293 -33841 -58544 -46826 -26086
19650 -26086 -32396 -67579 -68676 -38398 -31054 -58201 -31555 -20996 -60018 -89571 -98046 -50788
19638 -50788 -38452 -21766 14120 -31654 -63130 23052 65325 37695 -5368 -48592 -43853 -9779
19626 -9779 -19577 -52272 -32312 16462 18250 -33490 -76833 -54974 -17798 -16073 5314 386 -47939
19613 -47939 -76649 -74738 -78903 -53971 -71588 -103466 -99610 -93877 -110720 -84378 -79640 -18490 -19591
19600 -19591 -26195 -7426 -3565 9753 -33471 -54242 -79894 -44969 -56329 -83347 -43681 19226
19588 19226 32821 68469 61055 88201 52125 52523 48985 -20939 3482 46885 52476 -9195 -9060
19575 -9060 30296 -13609 -24773 -35132 -58975 615 11181 -33200 -32498 15507 45447 13212
19563 13212 -70143 -69401 -42358 2988 -17756 -53168 -38578 -9688 -63398 -65102 -58758 -44937
19551 -44937 -20408 -30911 25309 40024 -21585 -33680 -29501 -55894 -39278 -30957 22352 48962
19539 48962 59914 8489 35932 60644 102092 123842 92405 50978 79976 103400 109984 69449
19527 69449 -14292 -44172 -36257 -56606 -95085 -45713 11362 15134 2862 -15450 -37439 -38402
19515 -38402 -75082 -102020 -68595 -5517 24676 58925 29528 22757 60507 71754 40337 -13268
19503 -13268 -30152 -30277 -21170 17729 1708 5712 -3113 -21629 -71365 -88815 -69197 -8970 46008
19490 46008 49346 67245 33702 -7013 -27769 -29040 -9931 29098 35067 43722 25884 -30691
19478 -30691 -58768 -18211 -29724 -56101 -67883 -55719 -19311 -32120 -55473 -43389 -21963 31282
19466 31282 11662 -3415 -27382 -64943 -46547 -48085 -9879 -12040 -28612 -54037 -38116 -63717
19454 -63717 -47759 -26404 32849 15309 -76962 -82936 -70315 -54203 -72769 -133434 -121365 -67199
19442 -67199 -69812 -18536 7351 31426 -23978 12299 24580 19222 22253 26025 4739 29574
19430 29574 10839 23335 37384 7656 7318 5095 36135 23100 42877 39891 38142 -54162 -80264
19417 -80264 -88240 -67515 -68523 -97863 -100786 -78948 -69626 -64675 -34355 21961 47501 89684 81873
19404 81873 36810 -68808 -167593 -142629 -59059 -38708 -42886 -67785 -22154 56943 66869 51906
19392 51906 77626 110502 90049 76549 26259 -14192 3371 -8958 -8710 -25168 46899 66491
19380 66491 500 -59667 -93952 -89458 -71419 -26635 -506 44942 33287 -88012 -123120 -67908
19368 -67908 -7605 -14658 6353 6108 15182 13114 -10009 -32950 -62956 -81349 -98687 -80544 -5074
19355 -5074 34449 62460 75120 81368 80361 57422 36425 46192 79324 16125 -70327 -69446 -60934
19342 -60934 -121168 -160660 -154813 -135958 -84431 -40221 -28565 -96476 -163952 -148144 -96810 -77196
19330 -77196 -45029 -4935 -13368 -23942 -33413 53316 92036 49595 37155 47098 18025 -4789
19318 -4789 46354 35407 32508 18766 23686 74677 1937 -26182 -10904 71 -60369 -30456
19306 -30456 34762 54972 27473 -19911 8542 203 -62726 -8700 20647 -24186 -51761 -23868
19294 -23868 7500 45013 22386 31993 41951 -7915 -2786 6306 -52980 -63325 -34839 -27963 -46790
19281 -46790 -83035 -28279 28431 -977 -84430 -48062 43440 9167 -49151 -43103 -64358 -89626
19269 -89626 -86040 -39071 -8210 10902 25648 11875 -10527 2500 27041 54281 11149 -23774
19257 -23774 1695 -36732 -20671 1864 8622 48454 46375 29725 -39151 -51505 -3315 10759
19245 10759 42506 -8690 -20450 49518 71442 -139 -44629 -7541 -15370 13457 56559 46101
19233 46101 33770 24797 15726 -37466 7640 18708 -6878 -31139 -8648 17424 -42259 -65499
19221 -65499 -45086 -26087 -38145 -14522 60121 46558 18088 44017 28731 13315 -60015 -3515
19209 -3515 81914 115809 67560 47704 19418 -27230 -61994 -60219 -107140 -70766 -37145 -8733
19197 -8733 -26828 -67460 -37012 -24450 17077 58001 39843 1553 7520 34691 43830 6645
19185 6645 -24870 -52926 -39785 -27685 -14595 41503 14763 -56908 -50922 -32123 -11436 -10547
19173 -10547 -35397 -59982 -68013 -13918 29818 26847 -12491 -50814 -43327 -68149 -100708 -46776
19161 -46776 -53439 -43782 -29162 -33232 -45149 -52379 -10433 37337 -4902 20090 -13878 -23052 -32438
19148 -32438 18519 15894 -22796 -26470 -14611 14343 92544 87912 199 -28474 -14412 12794
19136 12794 20682 -20041 -45762 -30819 -14300 -27741 -24054 -6170 -2328 -37007 -9227 42663
19124 42663 38598 34198 5645 -50597 -69157 -70003 -47809 -57296 -68249 -45926 -69393 -17047 -27989
19111 -27989 -67018 -24446 1294 -62068 -13997 15102 1187 -45680 -38521 -39339 -43018 -13935
19099 -13935 -33069 -30285 -18755 -17166 22029 -52927 -64618 -101795 -126890 -122943 -60471 35310
19087 35310 75390 45271 -1806 -49325 -60445 -87078 -89238 -63920 3573 -31362 -34076 7319
19075 7319 2330 7254 28841 12667 11165 53527 64961 62010 20456 -14503 -31215 -964 14681
19062 14681 -26874 -26281 -20248 -31270 -10890 -48080 -39782 -26375 -31004 -17438 20603 34073 -29523
19049 -29523 -88536 -73090 -69059 -131370 -116159 -83901 -83773 -74922 -35277 46454 4299 -43846
19037 -43846 -6319 -19964 -30643 2570 441 -37441 13825 6621 23019 22436 3599 7186 14747
19024 14747 22524 -30264 -9252 41209 105540 100629 69119 35800 48124 32481 30809 69316
19012 69316 24384 8863 7449 28349 64626 49895 41326 6095 -24314 -26908 -42563 -13856
19000 -13856 39037 71619 20075 -332 13965 -196 -10689 8996 29307 44574 67928 94158
18988 94158 90808 24105 -6080 -27500 -16485 40324 75246 57315 30437 69088 69428 76582
18976 76582 28826 8219 76239 55595 -11996 -21573 -19913 -21436 -56456 -89290 -54030 -8551
18964 -8551 29417 7469 15601 -3440 37253 32900 48867 7239 -50977 -16404 -8009 -14841 25468
18951 25468 30170 30170 59750 22640 -4066 -16249 -46312 -37617 13439 -20653 -33987 -44081 -52838
18938 -52838 -22157 48189 25333 -30227 -63880 -28631 -35148 -17745 -17646 14334 29411 5297
18926 5297 1988 -7004 -35867 -12847 -18520 -20835 -17905 -44185 -37848 11887 69215 105089 48075
18913 48075 51407 71999 94119 86365 43051 7113 -82636 -96733 -64737 -16159 12051 15954
18901 15954 34325 36095 3159 -4098 28486 65130 68579 45558 27660 -13330 -61265 -44417
18889 -44417 -26621 -14900 8918 16994 -14476 -17649 16724 69772 30744 31306 52827 52403 18435
18876 18435 -52008 -73816 -55359 -23124 33709 77432 18736 20803 34833 39562 48875 26072
18864 26072 40303 18208 -15700 -86466 -87228 -26154 33953 45852 16998 -11210 -2767 21463
18852 21463 32086 1974 -5959 -4595 -15001 -23733 -43020 22901 19832 -26521 8040 10361 46983
18839 46983 34814 -7148 5272 36391 52031 45279 36921 6801 28679 61620 51741 32119
18827 32119 -24320 -8376 19164 62792 113893 78932 30477 -21694 13368 40760 33501 51632
18815 51632 30400 -18793 -27950 -27714 -22307 -384 25916 34602 22606 9854 45413 44241 73520
18802 73520 82479 39406 7289 1549 34576 50813 57856 56702 53138 3666 25735 37119 -3120
18789 -3120 -23413 -30845 -7748 -1589 50612 84949 62651 -7517 -50271 -43080 -52591 -46435 -26028
18776 -26028 -2208 12734 30442 37511 53069 81006 139767 130550 176691 294366 359285 391818
18764 391818 321602 227058 148942 130435 113350 125038 93348 53776 78344 102211 102246 123681
18752 123681 88958 100895 46806 9689 17896 -22464 -52467 -72517 -49592 -32104 -18449 -11613
18740 -11613 -12764 -6517 -31554 -20782 2286 24683 51044 32104 23229 32517 -1482 5346 18184
18727 18184 68927 74552 28581 8796 -19246 -43538 -62766 -44050 -6144 62396 83092 109593
18715 109593 129572 61044 53645 72547 72638 42679 39673 41820 126380 117505 127710 105491 35984
18702 35984 7873 -80648 -106011 -94001 -53762 -6189 -42283 9880 39539 62761 77263 26895
18690 26895 9705 52951 54208 50345 37143 59964 95057 80225 57635 44071 82774 98064
18678 98064 72578 56568 74201 26160 -10026 7504 52024 64912 24438 -24337 -26531 -11597
18666 -11597 -10310 -37572 -38122 -21106 -55931 -47587 -40994 -14073 -1903 -25428 -7384 31198 41860
18653 41860 35948 -15105 -31792 -8556 43566 91311 58706 -12023 -34032 -42717 -27829 20738
18641 20738 -6295 -66513 -59291 -47420 -35119 -5874 -31025 -10455 33063 41147 58584 36483
18629 36483 33298 -27152 -26718 12459 44308 47226 23813 -39119 -70576 -97314 -82045 -28272
18617 -28272 -19168 19769 105058 86554 51075 28644 43138 42543 58970 85030 60896 30111
18605 30111 14910 -26993 10466 59108 23358 -15583 -2319 28365 54381 71576 138745 112551
18593 112551 78318 84531 100942 122456 55522 24213 62010 140025 178334 189448 211082 213650
18581 213650 156287 120732 78136 48820 83745 103595 102605 115683 79469 21862 57807 75984
18569 75984 76961 54495 47322 10211 27460 4801 4079 32743 69320 95026 68582 -23854 -31693
18556 -31693 6175 -24576 -9037 -5410 27681 42297 9418 14051 65868 75346 21714 30259
18544 30259 4654 20453 82315 159576 165868 165929 185362 246413 245830 197287 165522 145244 208771
18531 208771 248842 244357 224880 203765 229279 233574 263757 286909 313010 305458 330945 349371
18519 349371 379189 430784 458670 507304 538228 561060 624102 673024 659625 618483 597248
18508 597248 632543 632258 627943 636555 661746 735099 721573 712557 738219 745819 685500 624045 602334
18495 602334 590023 563700 586486 563209 524136 518625 489035 490326 474909 438752 377033 259892
18483 259892 166109 143805 196739 267816 304612 246654 169444 181799 218922 304863 367723
18472 367723 419777 468714 512363 514579 491910 486502 501024 516506 558193 635231 681976 704503
18460 704503 764730 868904 960431 951412 952191 994085 1000739 964369 893437 864118 865398 894925
18448 894925 836633 797963 815734 811759 815991 765136 696444 646815 611233 557325 523474 503657
18436 503657 484437 443933 421300 418471 366848 356371 302047 269465 249456 215653 171747 202833
18424 202833 234131 239821 180668 146371 196461 247314 259657 297211 269981 236538 195322 187832
18412 187832 223707 288551 362589 400354 414230 405358 324271 218943 158431 116452 159144
18401 159144 110031 121643 172631 167332 187929 176518 142867 74917 102971 131995 95450 102119
18389 102119 103729 115413 131118 127698 130120 99912 95146 111020 157357 201621 161461 188097
18377 188097 235028 243374 215189 183488 124250 100271 114070 137373 136959 167378 179069 166884
18365 166884 186050 259713 227239 204040 190182 221865 208188 151887 104510 138239 147379 195035
18353 195035 187317 163446 211676 254291 285646 312682 272265 240077 244102 221010 236074 247133
18341 247133 277197 272836 249083 294847 288304 295460 330183 394576 389193 400830 402630 338208
18329 338208 394849 381281 390117 450271 481789 545572 573704 653418 685604 680593 695380 726597
18317 726597 750086 693856 543500 427715 349799 267119 157604 59578 68908 117703 72466
18306 72466 83100 77874 39422 -6739 30363 67751 90898 99111 64505 33545 3576 17118
18294 17118 83991 133368 179233 170077 195485 243948 268985 269827 312032 324591 365327 348752
18282 348752 360907 358058 397681 411660 408950 429684 540694 550305 466396 475061 521506 596579
18270 596579 603327 589792 606847 652992 672919 653511 702689 682173 603531 448754 280139
18259 280139 139003 67479 -45505 -83036 -49552 -10379 -37519 -65397 -60537 -67173 -118031
18248 -118031 -137435 -119432 -113307 -56552 -24583 -32803 -20204 -45206 4633 10746 12370 1834
18236 1834 13652 37310 -36717 -61718 -28317 5827 63716 88757 89292 132502 115880 41082
18224 41082 8095 14513 57243 167708 214889 243984 199328 206377 209419 214658 230913 176110
18212 176110 112032 72770 52628 110625 88677 91927 89741 127329 185872 226186 167514 155024
18200 155024 201847 225555 218274 265621 323945 329127 344510 353479 382442 414335 420800 465446
18188 465446 445434 436479 419213 338033 266610 237863 190151 180912 225797 232787 227510 229465
18176 229465 272145 297466 261566 199967 202838 258207 263036 293487 340601 338252 334966 359181
18164 359181 370467 391714 431063 451577 467708 431979 473973 537231 560252 551907 582388 571157
18152 571157 530363 503608 460852 476446 465801 443597 447773 386127 388575 428128 423299 519319
18140 519319 550344 570789 602254 643289 673441 697006 777748 861297 985138 1040849 1125742
18129 1125742 1215330 1308472 1377223 1485305 1620836 1768098 1999477 2307225 2758944 3262949
18119 3262949 3922046 4804804 5929383 7445864 9530694 12520192 16804780 22861236
18111 22861236 31383604 44016414 61535996 77279175 78453898 66736244 50770159
18104 50770159 36437773 26274996 19657907 15368713 12514941 10451450 8855996 7739150
18096 7739150 6916444 6228916 5777531 5414410 5059188 4722573 4498105 4374016 4254316
18087 4254316 4152156 4046797 3982810 3906970 3868959 3921946 3951923 3939543 3927034 3919976 3928742
18076 3928742 3944744 4011686 4022352 4072608 4176612 4195698 4211302 4111542 4053528 4050005 4003354
18065 4003354 3982429 3916154 3868178 3868945 3835527 3873854 3886582 3900701 3971860 3978942 4005086 4085964
18053 4085964 4232387 4372579 4645129 5000883 5460800 6007846 6545840 7183275 7947574
18044 7947574 8902058 10048309 11553087 13353214 15467391 17659296 19861201 21994242
18036 21994242 23720392 24777331 25324009 25615577 25919660 26582436 27794532 29994318 33531542
18027 33531542 38960946 46948885 58055311 73207728 92753266 115506169 139360111
18020 139360111 163059891 184353069 197988659 201181808 195775219 184242687 168144589
18013 168144589 149594172 131613489 116444441 105092603 97448579 92822134 90309946
18006 90309946 89080856 87845175 85163987 80467642 74182500 67011898 59654410 52723436
17998 52723436 46721448 41924626 38292687 35703197 33947517 32825069 32195111 31887583
17990 31887583 31889032 32228949 32920603 33964689 35523714 37893617 41169408 45771180 51819680
17981 51819680 59099419 67201944 75531580 83526009 90185880 94488281 96722124 97969120
17973 97969120 99672460 103238644 110157281 121576117 137910503 159664276 185621265
17966 185621265 211776195 234482568 252410190 262449226 259255736 242635433 217657500
17959 217657500 188544421 158356581 130238377 106586539 88340433 75115880 65871101
17952 65871101 59638217 55704370 53489206 52454089 52033222 51882771 51690180 50728194 48701624
17943 48701624 45827182 42494766 38976256 35628886 32683572 30306082 28383081 26870961
17935 26870961 25669397 24644594 23770441 23005496 22312562 21676922 21119198 20515763 19913966
17926 19913966 19298153 18631715 17921720 17233955 16474105 15735274 15048045 14402936 13796078
17917 13796078 13150555 12580228 12067569 11609037 11169644 10705579 10328843 9964718 9615727
17908 9615727 9307872 8959583 8604949 8284856 7961972 7618479 7303793 7015804 6777418
17899 6777418 6571614 6381449 6159325 5923796 5733944 5550635 5392108 5229716 5031778
17890 5031778 4889232 4756382 4572356 4396655 4270288 4164357 4058304 3948296 3846739
17881 3846739 3703796 3552106 3439360 3369475 3237540 3144321 3096192 3079000 3044148 2994559
17871 2994559 2926005 2893000 2949673 2945126 2958618 2998977 2966888 2909086 2800948 2660216 2503559
17860 2503559 2361179 2274299 2215053 2191835 2232988 2196766 2229384 2213065 2225495 2266280 2319235
17849 2319235 2244646 2120480 2012816 1998089 2003453 1975060 1942445 1837605 1828902 1876896 1880372
17838 1880372 1879385 1875578 1902877 1937572 1905162 1869000 1834721 1824706 1786060 1714767 1687117 1683963
17826 1683963 1625378 1580537 1567614 1587614 1618329 1554903 1486669 1501641 1486347 1478092 1468036
17815 1468036 1541981 1624961 1632435 1611914 1567587 1523153 1384166 1228709 1133199 972048 816211
17804 816211 760471 776369 801435 901152 964806 981469 1016358 1044780 1081875 1116786 1164611
17793 1164611 1160843 1186517 1162603 1130923 1065564 1013456 980149 942300 934190 987651 1012344 993355
17781 993355 971863 977638 973106 937465 952782 928908 920962 941548 911237 867405 932859 953976
17769 953976 922360 903645 922035 943371 934603 844535 765233 738038 741056 758409 790600 747361
17757 747361 726100 699137 672476 699437 673569 705643 756731 780142 784094 809262 765395 714830
17745 714830 699286 694890 689223 690930 729868 740453 749979 713689 633115 607550 644115 711741
17733 711741 745741 737842 688938 708510 747224 801554 860750 862963 862722 867626 744783 681500
17721 681500 634298 512596 407510 305869 233108 171679 111721 150770 188325 198841 198559
17710 198559 231975 300592 336688 335445 315655 316216 301470 302738 296633 292704 270977 303970 336197
17697 336197 301123 277619 264039 221693 243163 265239 272235 307214 360419 389922 396596 390834
17685 390834 413261 448177 482199 485476 492362 466877 465942 449140 413154 373071 346874 334586
17673 334586 320346 346758 343946 309154 322369 312140 254267 157017 -10463 -102927 -123189
17662 -123189 -203778 -289747 -282525 -213883 -121971 -1227 72406 148180 268199 330542 345503
17651 345503 372194 362155 379073 402811 492139 544933 557800 614412 651226 670979 730233
17640 730233 738461 689304 806879 888819 927042 884075 881082 963345 1042708 1105909 1132721 1157578
17628 1157578 1232253 1241634 1291238 1340178 1327531 1286661 1302977 1354999 1412792 1443054 1522039
17617 1522039 1531446 1554154 1628583 1670905 1742129 1856470 2081810 2235669 2330711 2414048 2544932
17606 2544932 2639335 2803219 2932728 3095046 3247483 3443397 3641326 3809527 4011451 4391121
17596 4391121 4899415 5555969 6360479 7236492 8283690 9559406 11129024 13077996 15434106
17587 15434106 18368068 21797323 25693019 29615953 32865706 34858071 35365254 34797697
17579 34797697 33875811 33386107 33968358 35985510 39733468 45527563 54038386 65970308
17571 65970308 82595124 105177602 134696169 170710236 209862292 245430600 269248996
17564 269248996 275767900 265003338 241762976 212429922 182435582 155259578 133009650
17557 133009650 116469548 105714029 100156335 98719407 99779546 101094475 100530965 96567411
17549 96567411 89116377 79504516 69477352 60333769 52771907 46905755 42497466 39238995
17541 39238995 36816749 35136848 34007122 33362060 33195797 33386135 33934762 34906362 36282551
17532 36282551 38068065 40373987 43384044 47467307 52878662 59700895 67868801 76631970
17524 76631970 84603988 90328702 93005873 93063082 92304044 92740552 95985906 103213516 114858390
17515 114858390 130836677 150529624 172647344 195144470 214776719 226634437 226346122
17508 226346122 212409653 187622215 157837217 128851642 104180836 84969212 70793430
17501 70793430 60542317 53219009 47939868 44144167 41782792 40640173 40302589 40489428
17493 40489428 40784555 40766159 39902952 38079049 35487647 32598677 29772733 27287794 25305740
17484 25305740 23682259 22305834 21189832 20268911 19449052 18780111 18209191 17670795 17182601
17475 17182601 16819655 16493559 16080487 15577775 15103301 14516251 13858398 13230281 12647545
17466 12647545 12026919 11432632 10840074 10395970 10001271 9632484 9326279 9141615 8916283
17457 8916283 8679568 8423028 8175280 7886740 7603687 7295508 6898329 6591862 6350573
17448 6350573 6127756 5917138 5699755 5495535 5417823 5302681 5215629 5150874 4943112 4704818
17438 4704818 4515373 4327856 4137524 3975249 3786220 3615583 3469847 3339100 3153890
17429 3153890 3019174 2865722 2755376 2616982 2498200 2370707 2269196 2188249 2192019 2115802
17419 2115802 2051840 1984765 1924755 1906971 1849894 1838909 1812906 1759683 1731703 1702415 1669091
17408 1669091 1639330 1622234 1678154 1756635 1767596 1732624 1766511 1806891 1811027 1841334 1823200
17397 1823200 1809304 1813992 1768525 1675964 1672416 1711484 1703929 1712526 1653847 1584707 1536978 1494248
17385 1494248 1506605 1536892 1516928 1484294 1512963 1529669 1503604 1478270 1461699 1443648 1288050
17374 1288050 1166710 1109839 1083863 1150282 1097915 1024216 991028 1002825 1036773 1057234 1055086
17363 1055086 1098925 1083823 1058259 1063898 1138157 1105216 1029318 1052821 1034674 1020572 996742
17352 996742 1005032 993399 978170 958258 953085 902227 892936 920626 908027 947064 1017347 1019864
17340 1019864 1018878 1002100 984026 1007658 981346 915723 875728 862477 865113 906659 927268 955761
17328 955761 1000947 979213 971799 965442 906682 857131 931179 965084 953056 982058 978598 934198
17316 934198 893945 862578 801739 832124 862375 852788 850352 851467 778676 761821 791637 750719
17304 750719 712143 759910 760381 755493 747058 795496 801671 788077 813405 731682 688415 712019
17292 712019 740965 729854 742778 741639 776941 781112 751086 725571 679642 653057 647086 676407
17280 676407 687952 699921 712432 724124 790435 827323 827722 804466 815733 794577 701426 578505
17268 578505 495105 342103 184948 6423 -121466 -178821 -145333 -167463 -151265 -125624 -90425
17257 -90425 -41434 29145 79256 71971 57593 23598 11851 -8763 -39446 -26835 -399 71155
17245 71155 117599 153887 113225 122655 165745 228947 300692 284615 297041 331437 352447 346337
17233 346337 353196 352352 324758 322275 366751 362686 382561 351818 319427 263369 179277 171029 253262
17220 253262 292549 312324 313675 253629 153240 79737 14194 -28207 -109196 -230996 -319451
17209 -319451 -461679 -479435 -440513 -436859 -466246 -428044 -361913 -281214 -225768 -252184 -190603
17198 -190603 -92698 -62775 -94769 -142791 -116543 -42396 -45840 -107358 -152063 -130876 -139066 -107366
17186 -107366 -41625 9242 -14764 -22428 -48876 -34298 -28069 -8834 72287 87372 70004 1614
17174 1614 -45389 -35844 -35556 -22444 5545 60520 106018 114347 72856 41702 81829 65737 71230
17161 71230 72596 76775 101559 84490 62411 64699 50594 45931 26673 -805 24137 101832
17149 101832 169643 122904 123143 135114 104506 103955 138783 174980 133018 111348 77973 69037
17137 69037 77893 129722 106329 69765 42683 91574 114861 135561 91622 67385 61102 42170
17125 42170 85108 97114 96622 86925 78196 56901 78380 92471 98259 24784 -16977 26186 76343
17112 76343 56570 57455 73795 85707 49775 62519 150752 137915 69124 73042 76921 81838 48329
17099 48329 43409 89478 78956 66909 125344 143046 145121 185494 241126 241280 216606 260851
17087 260851 256761 233885 246463 308445 323511 315839 396148 545747 610204 670999 777278
17076 777278 846141 814072 821354 863064 859702 755676 688022 658534 619954 634910 699358 699392
17064 699392 716746 817532 881703 908178 860845 798850 748734 664479 553082 476479 440873
17053 440873 400120 381904 363714 342499 336641 362375 372328 362302 389064 359018 305429 371230
17041 371230 357801 328101 287846 285765 300277 312773 297259 294445 328324 325559 330528 381030
17029 381030 457579 567138 647750 708671 844842 893209 866917 886507 830211 797732 786270
17018 786270 726511 692139 579349 503114 494450 500456 519165 497597 483646 528060 567112 669625
17006 669625 799602 894940 882712 897827 875810 812129 720190 586467 505437 473599 393300
16995 393300 315121 311513 297321 275933 271992 232058 224978 238873 221770 238200 238546 239179 213123
16982 213123 174348 149999 156371 98456 107735 135093 136994 161017 150017 117867 127360 99747
16970 99747 63016 65818 113148 134822 110291 72333 127263 170592 174778 119292 113281 162641
16958 162641 117405 49120 22502 29370 81229 44016 75774 135853 124680 135763 153669 120811
16946 120811 109811 83384 36300 5274 -25025 -14620 54958 44399 -39016 22336 50536
16935 50536 29774 53204 67341 51568 48486 63118 31715 30376 31017 -15226 -27174 9563
16923 9563 28508 44511 70660 109383 99555 39195 27939 75519 100106 138997 168330 173195
16911 173195 121248 120083 94664 38985 67176 87190 65161 -23493 3762 46822 58228 44099
16899 44099 8685 -23020 -24485 17793 25711 30894 63708 31067 23315 -16301 11338 77315
16887 77315 66509 39345 47367 88924 83719 115494 163961 154111 108062 18342 -1186 68382
16875 68382 76285 52247 46883 82036 51181 31544 24377 21211 58610 88783 131943 160372
16863 160372 90670 16972 -487 56917 77479 53421 43477 75122 61797 20157 -10316 -17124
16851 -17124 33779 39151 8554 24614 61372 32421 -26861 -5148 -36636 -29745 -12163 8258
16839 8258 43460 74209 39803 -4026 21887 35345 41442 33839 87492 95140 55700 55609 78870
16826 78870 28698 -25178 -18073 -9522 8461 68556 66222 36372 -7906 -40905 -50825 -31391
16814 -31391 -21554 46562 71316 64120 25125 21590 373 -34055 20637 79436 88084 114934
16802 114934 125002 128739 99906 71339 85802 61812 2598 -410 23395 38456 40483 2353
16790 2353 -14300 -25496 -20338 -26345 14155 45644 38947 -12609 -31620 -34067 -37274 -26535 -20790
16777 -20790 -2067 -30691 -19328 20443 35292 10261 -8522 31122 11350 25648 84268 47070
16765 47070 26545 15298 530 -55807 -73583 -20915 -19199 18441 36980 68762 64153 7340
16753 7340 -51191 -51580 -87386 -28912 11897 45069 35946 49895 4374 -34131 -59439 -62356 -37085
16740 -37085 -1875 6844 7744 28895 47353 67109 32541 54705 73268 79798 92122 61454
16728 61454 16520 62920 68420 11131 -37471 -41929 -65400 -35218 26629 51111 -14506 3621
16716 3621 55997 80239 32257 -15338 -4949 -28125 -40528 -4691 -32963 -35687 -19974 39251
16704 39251 57730 28926 23264 -6474 -20369 -35199 -23927 -12798 11379 59847 44245 22949
16692 22949 -39259 -48929 -69010 -119717 -141782 -115383 -82850 -120061 -92458 -60103 -16581 -10726
16680 -10726 -47101 -101625 -61963 -29606 -2391 -24210 -68507 -85893 -54888 -44429 -46511 -105347
16668 -105347 -132650 -120523 -115732 -112161 -98037 -49359 20149 51048 21804 11829 -45852 -108924
16656 -108924 -93546 -66212 -75297 -73046 -33762 15522 52830 48164 24502 19062 -29835 -10658
16644 -10658 -18175 -90155 -122515 -40111 -23602 265 -37676 -42011 -58516 -36932 20667 55028
16632 55028 35674 664 45747 82587 7353 -48496 -92652 -126609 -133319 -101252 -25628 37194
16620 37194 1549 28924 14665 16080 53814 60092 30540 30635 5270 8534 -4706 -40273 -29570
16607 -29570 12253 7320 -5891 -6405 12742 4776 41637 73305 61988 29881 3014 -7469
16595 -7469 10315 26806 43371 12380 10054 -22860 -14094 10896 40363 -15392 -48315 -27432
16583 -27432 -6376 10973 22229 38378 36490 -28895 -79788 -81426 -75238 -66271 -77426 -42802
16571 -42802 -6556 29691 44734 44791 51510 55335 12908 -3753 -25736 -20748 -29057 -79961 -105625
16558 -105625 -94686 -61245 -21944 31792 8335 -7587 -11930 -5723 -5753 4240 26155 46285 66010
16545 66010 90818 90431 50889 44772 7331 18943 52821 51739 50471 53866 -16230 -59294 -24863
16532 -24863 -30830 -25201 18795 25159 49778 47668 -41244 -126606 -153903 -126250 -105256 -100069 -67016
16519 -67016 -44657 -49449 -53556 4612 -1942 31884 13590 -26996 10251 -32009 -88348 -81307
16507 -81307 -72048 -110484 -105391 -72185 -60463 -67262 -48441 -11637 -38405 -66407 -50922 13184
16495 13184 44376 88096 104468 20268 9189 -7323 -2123 3345 19715 -5841 -7730 -83230
16483 -83230 -140997 -33953 28101 1698 -65670 -55082 -10391 -35193 -48410 -74163 -95555
16472 -95555 -102793 -124063 -95206 -14130 -15191 24173 51552 47593 33096 25622 8065 -7035
16460 -7035 209 2077 18896 3884 -49830 -65279 -43861 -34251 -59058 -31085 26014 33764 -10817
16447 -10817 -42927 -110217 -121741 -85834 -30769 -34609 -2662 44416 34375 18209 -36225 -71187
16435 -71187 -48758 -4248 44513 34226 -47599 -36930 -9321 -16155 -86783 -76612 -28867 -41607
16423 -41607 -49949 -30198 -57594 -71046 -20841 25934 30167 -7513 -31916 -23910 -51616 -56260
16411 -56260 -8968 17226 -20185 -57603 -78192 -78731 -68313 -57088 -52827 -39259 -60547 -85489
16399 -85489 -89796 -9222 14904 -41215 -72182 -20949 -9452 -22547 -3841 -63065 -159764 -139255
16387 -139255 -58348 -2714 34215 34778 19406 10700 -12227 -26228 -61867 -111697 -63835 13570
16375 13570 59852 43814 44915 69654 83305 16227 -19466 -28337 -39987 -8380 -16484 -28500
16363 -28500 -25922 10451 1230 18790 55915 56875 50814 62755 38329 30586 48637 -18175 -75148
16350 -75148 -113411 -99859 -64502 -57342 -64822 -22201 29912 25883 -26248 -28053 -86031 -154191
16338 -154191 -164191 -103174 -11512 6361 12488 13154 -2678 -30222 -77876 -81365 -103997 -66800
16326 -66800 -65401 -51363 -67907 -7263 -21234 -64503 -69702 -51760 -19885 21527 53033 40204
16314 40204 12894 10023 -18642 -22031 -13674 -2096 -91323 -104150 -71863 -38377 -14646 -33933
16302 -33933 -71838 -64829 -50497 -64101 -37219 4211 40308 -16579 -22160 20425 53755 68774
16290 68774 68186 13920 -1008 8900 33448 6238 -25009 -4844 -22233 -44087 -18735 -28418
16278 -28418 28732 74318 49804 21692 -24343 -77274 -52327 -35750 -41925 -67996 -82963 -66335
16266 -66335 -68268 -56462 16805 34366 48255 33695 2294 36967 53438 -32106 -84642 -60868
16254 -60868 11046 8884 10423 14326 18658 6203 -24131 -70540 -66926 -98055 -148218 -145703 -115786
16241 -115786 -104973 -69831 -81053 -144028 -134114 -68154 -79295 -125763 -77853 -66467 -90174 -42285
16229 -42285 -14230 10551 14681 59574 8139 -37745 -36619 -29378 -46498 -24165 -6823 -24513
16217 -24513 -70430 -106271 -73683 -82813 -48324 -57949 -36983 -8773 43890 7680 -53904 -46692
16205 -46692 -40291 -39067 -7309 7507 -8581 -8075 20957 42145 -7130 4355 29847 74943
16193 74943 84072 19171 -9485 -649 -43322 -63193 -35817 -15054 7973 9705 9895 73605 82104
16180 82104 67793 -3002 -18966 -53631 590 -15576 -12158 -8819 -47227 -53651 -48160 26693
16168 26693 13314 -80226 -134562 -125602 -139373 -130954 -90554 -22350 58663 35428 -1547 -55968
16156 -55968 -94059 -129702 -115293 -97384 -88138 -76006 -101554 -156944 -185309 -212408 -120592 -49386
16144 -49386 -30657 -43734 -52523 -37125 -21532 12504 -31215 -6137 -3554 -14850 -36732 -31962
16132 -31962 22216 26927 26804 22165 -4090 -36326 -2187 47401 92359 100238 24272 -24765 -15950
16119 -15950 20196 17805 9715 -19830 -56421 -119551 -154771 -123713 -113498 -81690 -47302 -36213
16107 -36213 -20490 -26474 -6731 27029 56129 62899 82984 84066 72406 64173 49314 -15857
16095 -15857 -21519 -31416 -33216 -22794 -25829 -41627 -40707 -44355 -56913 -14408 -5632 -44500 -26385
16082 -26385 -11869 -9378 -14026 6675 1164 487 58609 66671 39119 -13457 -39064 -68521 -46955
16069 -46955 -18153 -19374 -17587 -4224 -783 -9479 19430 39177 -6125 -85605 -111259 -108638 -107533
16056 -107533 -116506 -134462 -123012 -59392 -28297 -59657 -67717 -62142 -29567 -54330 -25670 -6772
16044 -6772 -19033 -46823 -57947 -41555 -5420 -27478 -47000 -33398 -4591 24629 -14545 -32673
16032 -32673 934 43424 67132 77783 58840 29993 -7202 9730 10039 32237 21250 16877
16020 16877 47861 46404 12272 -21432 952 51294 55531 54089 4280 24293 15718 -72245
16008 -72245 -119302 -111758 -131505 -139993 -81349 -43590 -7408 8289 22834 11533 -5047 19307
15996 19307 16770 50792 57193 -2844 -47355 -65970 -20560 9674 42246 36618 -24399 -4206
15984 -4206 26121 40579 21106 65575 155847 84600 22020 21488 -31284 -59742 -62593 -37551
15972 -37551 -39586 -53781 -70793 -85196 -50559 14419 -11439 -25647 -44132 -59997 -78834 -59849
15960 -59849 -37722 -39946 -21842 -10886 39473 93586 34220 -47956 26158 28839 -30998 -79625
15948 -79625 -32518 -7188 -20558 -17540 -31438 -11408 15245 42443 47725 61337 66694 -21488
15936 -21488 -29456 49093 84343 29163 14967 15823 36648 60758 17470 -3661 -31644 -55501
15924 -55501 -38296 -1935 162 29825 39945 62605 72036 58989 -7115 -2850 21744 38093
15912 38093 -30293 -92462 -119771 -19631 21447 -47056 -137510 -186893 -147806 -95761 -52964
15901 -52964 -63693 -38076 -84605 -105944 -69759 -87292 -95563 -79792 -52036 -15492 -53725 -78968
15889 -78968 312 18117 -56403 -50547 -13904 -43291 -21796 12673 7089 9169 30338 26718
15877 26718 7345 -16934 106 5129 14313 39860 10488 -30112 -4160 -2952 10564 6612
15865 6612 -47067 -60581 -58340 -26223 -60203 -47247 -124314 -99682 -91950 -114055 -85864 -73407
15853 -73407 -24247 -10487 -52028 -92345 -111872 -81431 -111154 -108072 -86337 -92686 -70988 -74760
15841 -74760 -31761 -3544 -35650 -67467 -85364 -63910 -113499 -158342 -140833 -130731 -128796 -73597
15829 -73597 -81379 -99354 -142618 -126436 -63756 -58051 -55126 -7635 43351 16938 -5286 -11477
15817 -11477 2711 55510 64410 55915 79744 27554 6372 9870 -6817 9632 18894 3685
15805 3685 -11027 -13111 -30640 -51044 -76361 -43440 -29067 -39619 -35950 -49588 -54962 -13832
15793 -13832 -10187 -918 -5739 -71409 -82524 -47570 -24368 8023 -6929 -29371 -6023 -53605
15781 -53605 -47465 -68082 -90777 -87502 -84829 -111146 -132257 -104323 -44804 -45964 -37131 -33383 -6917
15768 -6917 -18081 -62359 -60258 -44278 -28801 10858 702 -30826 -26124 -56522 -76362 -77343 -47813
15755 -47813 -14341 -11152 -44636 -27907 3408 38615 68657 47669 -19263 -79644 -112639 -87254
15743 -87254 -80883 -96921 -99354 -114889 -105761 -82313 -33802 -31000 -68019 -41177 -44493 -97687 -90349
15730 -90349 -91995 -86412 -88487 -91584 -86282 -89301 -79697 -112916 -55877 19160 -29571 -17077 -50485
15717 -50485 -102940 -112052 -50342 -47834 -40367 -63850 -108983 -126430 -60646 -60748 -57049 -9155 -8214
15704 -8214 27013 27925 17443 -2071 -13033 -23994 4290 28783 8880 -38723 6069 61898
15692 61898 8252 11618 -20794 -62410 -71849 -24788 37449 37996 45057 41189 50180 -7956 -78262
15679 -78262 -90260 -98365 -117182 -94580 -112570 -139547 -146979 -130703 -95314 -77708 -122197 -107682
15667 -107682 -42798 -5813 2741 9683 -20762 8101 -3077 -7697 27008 -28219 -90649 -60966
15655 -60966 -10376 -12798 -21047 -33063 -56835 -62791 -73205 -34784 12295 -14962 7008 6372 -15732
15642 -15732 48249 129498 74259 57420 69184 33422 -15336 -55311 -40390 -16342 27735 65973
15630 65973 1895 -22592 15251 35556 -4239 -26103 -40914 -45881 -11062 -4958 -38129 -16161
15618 -16161 29328 3762 14155 6086 -5121 -25624 31009 29212 -33123 -70425 -102737 -89063
15606 -89063 -90284 -78339 -42573 38413 100663 102090 87078 33099 17869 15197 33516 38169
15594 38169 37670 20085 -5801 -44113 -3491 3552 67859 89331 121942 134824 93471 -3660
15582 -3660 -67731 -94558 -37043 7687 37375 48234 73015 53621 69588 59077 58652 55679
15570 55679 63063 60660 36255 20362 37412 54408 63877 26372 -940 -12494 -23311 4345
15558 4345 -12387 12887 34905 65638 24413 -5606 44784 38579 9924 -22224 -25486 29133
15546 29133 -945 -75536 -74708 -54362 -49303 -7547 45813 33884 -42539 -30700 16657 87518
15534 87518 95633 6585 -54938 -51589 5550 63553 75033 47774 77325 113446 78594 62489
15522 62489 48739 49893 37791 47937 124962 92596 69508 61325 65432 66925 76005 77742 114764
15509 114764 145430 116678 74669 105178 126803 117474 103269 58240 72070 53556 12608 -16804
15497 -16804 258 4067 71330 129997 140260 143005 150441 139075 107327 64597 47503 107598
15485 107598 128202 83681 61855 119080 81139 8802 11193 37800 19693 2179 -14673 37903
15473 37903 56516 -3718 -2999 -27308 -16046 73123 104994 88593 105111 93980 20928 -27534
15461 -27534 -67982 -50037 33214 74610 65548 47247 103680 131950 100742 95062 57235 86407
15449 86407 94692 23605 -52095 8235 65676 72709 49842 9777 18234 7284 -34515 -12201
15437 -12201 -49448 -125344 -137381 -14532 51863 71773 46634 77615 96426 46722 44970 39120
15425 39120 5980 12759 92946 89486 102320 107544 130963 118581 58163 55306 37418 38171 14712
15412 14712 -6684 93813 114890 48656 -18203 -40306 -41746 -43626 -6246 44052 77796 49582
15400 49582 65936 78212 46349 -15630 17902 37299 32198 45617 11757 -90498 -75508 -66143
15388 -66143 -33426 -2275 17895 22168 -6614 -37246 -35805 24713 20673 -7274 -586 10003
15376 10003 20915 42454 73041 64481 59421 72552 85003 78356 61814 41624 80113 109579
15364 109579 107138 65912 16033 -2629 -19200 -42134 -85078 -122956 -67520 -9087 4738 -9669
15352 -9669 -32356 -102401 -99888 -14872 21909 -6516 58326 -2871 -73215 -42450 33459 25950
15340 25950 18059 25124 59354 84613 64257 50811 36499 -12961 3017 11943 -25454 -47374
15328 -47374 -29909 19795 19931 19966 63775 76695 45099 64533 59881 71082 75732 91256 103936
15315 103936 102862 55558 10452 34910 -1815 -50100 -69951 -64196 -18298 -15401 -38605 -58659
15303 -58659 -75571 -74459 -59125 -33693 41563 5510 -56461 -90101 -130048 -99908 -79647 -125493
15291 -125493 -146247 -150101 -82981 -67344 -22543 34251 96403 -7886 -74026 -106559 -88364
15280 -88364 -55132 -67638 -105138 -103092 -94031 -74119 -8881 -4480 -47366 -119888 -67303 -33333
15268 -33333 13762 40761 5806 27146 -111 -15206 37971 48561 29035 25986 11663 -12415
15256 -12415 -25553 -43606 -44717 -26204 64332 86901 31851 29926 14573 -10304 8208 6745
15244 6745 24696 81808 55402 6437 17211 87889 59696 62990 58360 33732 -1485 -36517
15232 -36517 -70106 -91096 -59836 918 -29187 -21941 -29029 -58762 -69745 -75377 -65345 -22016
15220 -22016 2570 -11895 -46347 -14787 11628 -43262 -90547 -85323 -52620 -30078 -1088 -15607
15208 -15607 -11975 41977 35677 33729 25220 -16961 -56818 -71781 -77938 -120799 -94415 -62863 -51899
15195 -51899 -62180 -56072 -68271 -18209 10271 3822 -28204 -79357 -113389 -139172 -87844 -64723
15183 -64723 -51869 -74717 -74329 -41765 -32082 -85524 -84983 -64038 -43689 9279 55451 57344 91426
15170 91426 76485 61181 27170 64075 67597 74946 64910 2947 -43085 8153 2337 13683
15158 13683 -6150 -26384 19707 42481 40792 -18219 -74753 -65285 -58300 -90175 -72237 -78029
15146 -78029 -81976 -67648 -58525 -68004 -41926 -59137 -38723 -42648 -24238 -16734 -18993 27028 3202
15133 3202 -9397 -24433 -46271 -28451 13149 53842 4047 -41139 -50852 -71884 -74145 -34117
15121 -34117 -23249 -39015 -50451 -73556 -78816 -38312 -22542 -33172 -50535 -39203 -18728 -27230
15109 -27230 11908 -19011 -26970 10644 -13336 -13499 26967 57158 60277 29585 43364 -2952
15097 -2952 -36143 -53145 -68768 -75274 -86997 -48148 -64150 -66111 -57231 -29844 -78763 -105773
15085 -105773 -89676 -64297 -99236 -115805 -90080 -110701 -106533 -98867 -95650 -35742 -48292 -53060
15073 -53060 -65686 -100859 -23759 -12893 -19286 -21668 -28872 22736 46757 48460 20886 -53302
15061 -53302 -123619 -141290 -132653 -205382 -202844 -183066 -144181 -158661 -194500 -128208 -107537 -104745
15049 -104745 -77837 -40539 -51589 -110854 -109402 -74695 -6578 33605 81740 66855 2022 -4198
15037 -4198 -39065 -12248 18019 22430 -42597 -49400 866 1439 -13305 49311 55224 44962 24779
15024 24779 -1513 -25332 -51118 -42339 -42613 11118 34033 52624 -5109 -20266 -20022 -86386 -122101
15011 -122101 -101711 -54872 -20973 -25761 -20386 -7778 1023 -24433 -16077 -24398 -25235 -38217 -79201
14998 -79201 -65114 -13806 1015 -18945 -70435 -42537 -43768 -52579 -87775 -92650 -147939 -140332
14986 -140332 -130683 -71817 -46391 -68822 -74607 -52063 -53245 -48864 -44018 -60679 -35181 -22007
14974 -22007 -62894 -89943 -89929 -79128 -67208 -14867 -10135 -53103 -74641 -72709 -55974 -45564 -37019
14961 -37019 -45445 -21568 27691 -33369 -84189 -122418 -87311 -54933 -1469 -9926 -16456 -37813
14949 -37813 -58342 -79515 -76060 -45657 -31850 -83835 -72943 -31020 -11897 -31315 -49091 -95980
14937 -95980 -107471 -137870 -118092 -69686 -66054 -82096 -64057 -31340 -62383 -60981 -65665 -92485
14925 -92485 -132504 -109600 -88441 -53485 -46736 -55279 -35159 23503 -6049 -5689 29235 78808
14913 78808 79984 24236 -14049 -25994 10978 24354 -63371 -113607 -74538 -85888 -95278 -85530
14901 -85530 -106571 -110786 -106664 -94963 -84477 -34333 -40147 -30123 -36093 -15375 11278 -13269
14889 -13269 -66130 -86515 -89313 -58634 -368 -18612 1236 8882 5122 -3988 3845 4505 -34205
14876 -34205 -44543 -42673 -22549 -57128 -65186 -50234 -70085 -80950 -117258 -146145 -109831 -118866
14864 -118866 -109581 -99300 -88755 -91196 -86092 -61718 -76415 -58700 -31209 -61558 -68191 -65918
14852 -65918 -39250 2438 60783 77757 71773 16007 -30593 -53895 -83316 -61830 -30368 -11714
14840 -11714 -34368 -8111 9649 2141 45035 18951 -5437 -65621 -56346 -10687 21362 39280
14828 39280 8400 25433 63087 80441 36794 25694 105226 106353 39736 -17793 -19975 -9560
14816 -9560 -20542 -24148 -38950 -18311 -37864 -92726 -75239 -48316 -12905 -25991 1812 -44446
14804 -44446 -99399 -124490 -120388 -129022 -87478 -40796 -78302 -115113 -85043 -84140 -51400 1662
14792 1662 8942 -53377 -104044 -79093 -57383 -49096 -64892 -35016 3355 8844 -23811 -7642
14780 -7642 -18681 -86058 -52013 -67241 -97554 -109813 -153190 -194968 -221138 -128309 -80703 -96326
14768 -96326 -97226 -53321 16398 53303 25728 -1306 22269 43594 24106 1015 -19705 -19140
14756 -19140 -53611 -112010 -107760 -123883 -157552 -106136 -63048 -68101 -24857 -67161 -42541 37073
14744 37073 55350 48741 45735 10005 -7246 -3963 -66533 -103103 -98749 -71166 -37403 -47512
14732 -47512 -79112 -81579 -84218 -78732 -45357 -57096 -30023 -23946 -30580 -20382 -53226 -100043 -74405
14719 -74405 -60345 -13415 -14991 -28217 -51405 -64109 -30250 -59349 -137271 -114610 -60966 -77228
14707 -77228 -89067 -82081 -38629 -7527 10335 -11396 -58985 -74790 -104291 -97668 -102625 -108453
14695 -108453 -47044 -49931 -97848 -112979 -105401 -116734 -126447 -98485 -49504 -70987 -96606 -63460
14683 -63460 -51977 -101290 -127983 -83873 -67827 -41595 -59835 -30978 -28595 1167 -19012 -57758
14671 -57758 -55908 18985 46883 21289 -24720 -74455 -113282 -175661 -126862 -73757 -65172 -89794
14659 -89794 -94670 -54221 -49613 -10307 -24752 -76396 -28102 2508 -16003 -65314 -110663 -77370
14647 -77370 -84059 -71200 -56187 -89526 -56297 -13610 -35496 -55645 -59178 -62696 -109169 -80959
14635 -80959 -33691 8427 24034 -1506 3538 -34253 -78711 -105536 -100121 -121861 -69055 -62072
14623 -62072 -15431 12865 -20786 11504 -2077 -53228 -69185 -83470 -71684 -102099 -37762 -676
14611 -676 -4060 -18616 -62176 -104439 -94674 -79552 -94567 -83387 -66533 -91087 -85419 -49015 13945
14598 13945 32041 -11323 -62058 -50082 -55641 -108535 -95783 -55304 -48620 -73308 -82320 -9934
14586 -9934 35690 51046 -36884 -68760 -75545 -8571 24971 31644 94656 37629 1536 -39292
14574 -39292 -63725 -84007 -111888 -68095 -43055 -114339 -96036 -108282 -131851 -80894 -131908 -183963
14562 -183963 -165631 -123308 -113967 -94093 -44903 -1258 14513 38564 48549 -41655 -99544 -105111
14550 -105111 -92536 -70846 -120409 -140884 -114446 -123177 -87436 -27511 -4297 -41884 -81913 -139836
14538 -139836 -143108 -126764 -83230 -128481 -164681 -130346 -114889 -66201 -7664 -36646 -73512 -87775
14526 -87775 -102767 -134797 -159095 -110939 -68911 -53937 -37017 -9312 -10652 -47813 -57172 -89948
14514 -89948 -115712 -118136 -131307 -82981 -53275 -93232 -117699 -124405 -65742 -24039 5029 -28034
14502 -28034 -72286 -4674 -21804 -11173 -24601 -40990 -13791 -41725 -23038 -8400 -45086 -117257
14490 -117257 -153333 -183609 -181056 -172071 -165977 -181303 -125073 -49929 -63487 -87782 -94044 -108089
14478 -108089 -97781 -79837 -41028 -80319 -67217 -42756 -50303 -61257 -69924 -40303 -73281 -59034
14466 -59034 -59418 -38353 -942 -11924 -37501 -8875 -34180 -33775 -23785 -28152 -25187 -42796 -50989
14453 -50989 -65932 -118876 -177918 -195753 -185902 -163861 -113719 -83634 -143623 -158139 -154319 -176036
14441 -176036 -162290 -104831 -100372 -74277 -35651 -14818 -18887 -12169 15874 -30636 -30504 14679
14429 14679 3815 -13312 -21284 16627 16904 10325 1171 -49344 -70023 -85673 -4886 12773 -28918
14416 -28918 -38144 -19568 -3860 -18313 1372 -48752 -93105 -82878 -44259 -109058 -136902 -120888
14404 -120888 -83767 -67817 -40259 -49571 -68735 -44285 -77399 -63292 -49994 -48723 -51009 -66866
14392 -66866 -87683 -108182 -80252 -87349 -102930 -123536 -126630 -130210 -44606 -9114 -39024 -57547
14380 -57547 -57956 -14876 20196 2012 -13104 -9662 -30054 -43647 -53491 -56766 -107699 -109660 -115574
14367 -115574 -102809 -68071 -3993 -1556 -3778 -38844 -22237 -37496 -75424 -85399 -75560 -61892
14355 -61892 -76412 -107650 -93801 -86831 -105114 -97169 -56607 -63414 -16009 -42287 -107932 -153138
14343 -153138 -96509 -49712 -10 -16814 -11064 5246 -9471 -16783 -27281 -53257 -78860 -114927
14331 -114927 -163693 -138999 -154662 -125254 -75655 -68024 -77948 -105061 -115742 -105348 -137223 -173310
14319 -173310 -175287 -148962 -104726 -57519 -47706 -1812 65041 32372 -15563 -66645 -46186 -73167
14307 -73167 -76366 -77262 -67167 -87409 -86450 -79279 -65813 -131925 -103897 -55661 -58392 -46620 -24894
14294 -24894 28419 45691 11753 13613 -40792 -55229 -69703 -58889 -122855 -122177 -88223 -59221
14282 -59221 -80513 -72463 -79507 -111625 -103860 -88955 -102497 -107032 -106327 -94737 -82349 -64940 -83179
14269 -83179 -82306 -57057 -44976 -27197 -14145 -6373 -44443 -81256 -13066 18216 -52818 -115171
14257 -115171 -101269 -108613 -78545 -64068 -45090 -6893 -19332 -56272 -72963 -57383 -25444 -55893
14245 -55893 -137910 -165007 -167919 -165521 -196778 -167182 -117998 -58494 -32963 11692 27128 -40906
14233 -40906 -61314 -53894 -10391 24648 -10865 -24832 58992 58146 -34289 -104155 -100745 -82602
14221 -82602 -36943 -17738 -56773 -36896 3375 2345 -50128 -11911 -41553 -72800 -35897 39093
14209 39093 6824 -43920 5948 2060 -20133 -20629 -70748 -66678 -75790 -27600 -17436 -77045 -76804
14196 -76804 -32968 18933 -70219 -69326 -55863 -71901 -75072 -28400 -31492 -71187 -68271 -60195 16775
14183 16775 83696 81405 63386 14287 -14733 3733 26581 51633 19471 -5388 15626 38892
14171 38892 60928 23155 3150 -23564 -87098 -68878 -90493 -91702 -48866 -43918 24574 963
14159 963 -10869 26974 -790 -49244 -43337 -46632 -53839 -43808 -34912 -58189 -24550 74605 130057
14146 130057 41220 -44749 -47531 -33413 7424 21323 -24455 -8035 -12987 -59792 -74225 -74244
14134 -74244 -58536 -44214 -8630 20801 -49505 -134540 -154730 -180387 -137906 -87106 -76892 -36006
14122 -36006 -30659 -27701 -56836 -99772 -70321 -55374 -66976 -62783 -51711 -47373 -18528 -15756 -33981
14109 -33981 -22378 -12264 -1579 -18062 -35157 -57338 -98587 -109904 -121382 -136680 -49166 -6309
14097 -6309 -83836 -120854 -84555 -39669 -41559 -63870 -92152 -56932 -74227 -70629 -71040 -59679 -106037
14084 -106037 -152288 -118208 -87388 -73146 -61187 -28328 -20131 -39030 -24061 -8624 -28384 -37933
14072 -37933 22957 -7506 -90271 -77847 -47448 -39668 -48772 -49630 -59249 -103950 -122167 -134043 -101712
14059 -101712 -50087 -22027 -14188 -28333 -62323 -128778 -131011 -87327 -88612 -52899 -50060 -64339
14047 -64339 -21334 21457 39845 -7380 -11115 18932 -5289 -37274 9009 61484 62114 14167
14035 14167 -12688 -7392 -20279 -29832 -2868 -32593 -50248 -35173 -55279 -66167 -79130 -57270
14023 -57270 -51978 -57230 -55393 -77483 -70950 -62606 -113237 -123509 -149353 -177116 -133356 -129501 -104307
14010 -104307 -67438 -41862 -12849 17233 -2698 21952 48913 40614 5292 -11076 -40234 -75375
13998 -75375 -80737 -71360 -55099 -38232 -33607 -10178 -32773 -38976 -31057 -45526 -37219 -43301 -68111
13985 -68111 -69034 -97364 -124781 -115912 -97385 -71134 -54320 -23231 13083 6266 38140 6980
13973 6980 -48296 -51319 -56978 -103432 -150251 -112649 -102273 -66247 -75585 -103515 -142663 -96275
13961 -96275 -71936 -57052 -100517 -108472 -55381 -47601 -71602 -102563 -152097 -106556 -61966 -78250
13949 -78250 -94079 -102263 -113974 -148928 -131298 -167047 -210311 -141578 -117829 -128445 -105670 -125519
13937 -125519 -56597 -74450 -10539 6217 -48964 -77705 -54687 -10551 21097 -2044 -44040
13926 -44040 -35033 -33528 -52309 -53589 -36399 -7092 -8683 -13373 -58785 -91000 -143098 -151004 -96271
13913 -96271 -31729 -66661 -89072 -94003 -152106 -130666 -142219 -115507 -62709 -12012 -14367 -30398
13901 -30398 -13536 -33511 -98020 -131138 -124338 -165880 -157930 -147114 -57143 -34577 -41361 -30675
13889 -30675 -16657 -39878 -16639 6988 84434 95085 -33523 -85186 -81098 -108477 -126427 -140217
13877 -140217 -143920 -58004 -3754 11757 -17184 -80225 -82691 -60743 7394 -3768 -60795 -36988
13865 -36988 -68718 -150563 -149339 -100849 -54890 -44823 -55531 -68511 -109828 -76292 -63944 -61513
13853 -61513 -77779 -146461 -110985 -51131 -20810 -18651 -47942 -95442 -75763 -27935 -33207 -86021
13841 -86021 -140570 -100411 -83259 -72147 -76269 -63088 -20229 -56074 -82708 -85263 -64861 -27441
13829 -27441 -12761 -56237 -102434 -97700 -4924 28567 -21743 -7870 -27365 -41857 -79319 -90711
13817 -90711 -54363 -21874 -2798 25871 5707 -23581 -69240 -65221 -65877 -72126 -112229 -127773
13805 -127773 -63194 3003 40844 23302 18931 -14839 -91221 -84685 -79382 -118433 -65831 -42016
13793 -42016 -51152 -48208 -23056 -40120 -57194 -8919 4701 -43830 -49468 -8930 -10008 13180
13781 13180 -29157 -66957 -85904 -63679 -61997 -50450 -27779 -2084 -2858 -3662 -49278 -103107 -136765
13768 -136765 -163767 -134506 -58775 -47985 -94189 -106649 -93215 -43134 -62218 -27428 34395
13757 34395 62855 39203 19326 -6072 -41358 -293 56286 51218 -13778 -35811 -64728 -64453
13745 -64453 -73084 -79624 -95951 -49117 -47810 -74953 -80252 -74863 -78257 -113036 -88578 -57228 -58307
13732 -58307 -77996 -129693 -99279 -64596 -76702 -118310 -120286 -115948 -122547 -74293 -20500 -18738
13720 -18738 -25831 2044 -23210 -87837 -124277 -124575 -162548 -189227 -168630 -140616 -149237 -76082
13708 -76082 -43182 -40833 -32351 -93563 -175212 -182827 -125753 -107402 -105584 -78110 -80242 -84943 -86820
13695 -86820 -88013 -116693 -107063 -83866 -66971 -79721 -91239 -102318 -124111 -104294 -70557 -51867
13683 -51867 -12106 -12537 -50045 -51911 -44181 -44741 -97456 -107496 -90420 -105290 -115458 -57474 -45223
13670 -45223 -74614 -113813 -120589 -128409 -121714 -129969 -104056 -80419 -76590 -45348 -19246 -6907 -80200
13657 -80200 -85102 -112063 -111511 -91278 -85802 -65338 -55122 -47081 -69119 -92336 -109500 -65977 -34161
13644 -34161 -18967 -26449 -18705 -51983 -73304 -68741 -70866 -56620 -31800 -56528 -103818 -116284
13632 -116284 -95387 -37853 -40055 -67009 -48893 -42202 -29271 -6624 -3722 6182 -126 -809 -24183
13619 -24183 -23823 -58564 -126529 -115199 -111372 -113032 -87683 -96265 -66848 -44178 -99226 -129468 -152325
13606 -152325 -84235 -56439 -25262 -56849 -114057 -133653 -89308 -42591 -40198 -87832 -58069 -77210
13594 -77210 -142779 -123803 -117367 -97479 -95946 -82728 -104377 -112524 -142500 -138160 -187964 -179080 -142984
13581 -142984 -101768 -49372 -71572 -102770 -105245 -44164 -7159 -12570 -28614 -65812 -88283 -104138
13569 -104138 -96988 -45656 -27784 -87252 -146769 -143463 -135675 -148436 -65493 -25568 -50305 -80478
13557 -80478 -66115 -73622 -65759 -57799 -37840 -54162 -4946 -39041 -50166 -94992 -114014 -164210
13545 -164210 -147371 -129610 -129636 -153274 -162166 -192528 -172327 -138151 -116733 -77005 -52026 -56121
13533 -56121 -42230 -55049 -47834 -37271 -37349 -40558 14591 75948 23538 -34316 -45026 -87999 -98153
13520 -98153 -61204 -56051 -42856 -19610 25792 -1653 32936 19406 -26866 -97036 -116648 -133855
13508 -133855 -109733 -89445 -93970 -84106 -91304 -101764 -68059 -85902 -78515 -116431 -125680 -101431
13496 -101431 -100459 -87619 -43830 -52683 -60052 21086 71223 54054 -3997 918 -29153 -19233 15032
13483 15032 32769 -4644 -64415 -82728 -90226 -113467 -152165 -128790 -111773 -96904 -75128 -108392
13471 -108392 -145053 -115600 -61261 -11308 -104678 -84149 -52131 -35831 -87436 -119486 -132672
13460 -132672 -96305 -82108 -62850 -45961 -49314 -62132 -68380 -94234 -97277 -103946 -105906 -114658 -50533
13447 -50533 -49578 -55640 -86364 -92239 -38669 34968 69699 41984 39876 49411 72171 71198 21888
13434 21888 2831 -13008 -38163 -75684 -48856 -14567 8538 -36342 -97414 -58202 1910 -2439
13422 -2439 -34908 -19715 33190 5231 -14679 22183 -24305 -22513 16739 24252 -7686 1906
13410 1906 -36761 -93653 -76906 -128865 -89030 -7572 -35501 48395 83453 6481 -20224 -54798
13398 -54798 -27475 32970 295 -39874 -45601 -41381 -5156 -3941 21804 35264 19804 -6784
13386 -6784 -2548 -12110 -13614 -5610 -12476 -17135 -26883 -35407 -53717 -68459 -79854 -39280 10903
13373 10903 4810 -48380 -71247 -69371 -44929 -40497 -110958 -108370 -92255 -102495 -134712 -160456
13361 -160456 -138892 -126296 -92825 -102594 -65725 -31996 -21011 -34971 -37066 -74189 -45667 -32165
13349 -32165 -19076 -7361 -11433 -41838 -45964 -89441 -57555 -19196 24493 -16696 -70945 -84036
13337 -84036 -89327 -105428 -84939 -87615 -94996 -82733 -92590 -85065 -74537 -103082 -64666 -24660 -46666
13324 -46666 -65870 -76488 -104488 -43894 -3044 16551 -13761 -45972 -63164 -75397 -87719 -48365
13312 -48365 -89279 -85035 -48961 -11359 22135 13149 -19944 -58367 -16956 -60566 -82270 -111577
13300 -111577 -102548 -81048 -71312 -48471 35972 119303 177185 181814 193858 189110 246829 274144
13288 274144 258093 271771 242620 214730 152890 75292 11422 -7009 6482 12317 -14856 38310
13276 38310 54222 19064 48103 124871 146840 108115 176367 234542 209666 226673 266247 289378
13264 289378 230570 133876 145410 100080 29029 16259 -25363 -17777 15632 -12018 -36423 -36644
13252 -36644 -87737 -94715 -67073 -97986 -58145 -28927 -12276 -35354 -46915 -43434 -14691 -4499
13240 -4499 -40104 -57539 -48222 39289 68958 14818 -45057 -48055 -29700 18507 14109 -13498
13228 -13498 15150 14049 24681 105912 100768 98007 70735 67130 94765 65004 26866 40553
13216 40553 73912 126337 224954 263644 323569 493697 550688 607568 549211 526514 486880
13205 486880 432869 354808 312567 291073 212913 213523 216387 158088 125509 42515 26531 93749
13193 93749 139566 167859 140683 136556 151203 196472 225322 244383 295135 359899 397733 351796
13181 351796 341341 386097 381024 352818 307522 323302 296306 247257 286920 337675 320319 358794
13169 358794 478658 686269 888612 1037816 1204061 1221712 1079389 856738 640090 551333
13159 551333 440864 336693 236156 154958 120977 135382 74431 52432 71586 82048 92077
13148 92077 129309 98220 68593 49850 120153 189424 204981 154318 154927 100850 92866 74317
13136 74317 59559 69440 11123 -14666 -3019 4768 -19413 36878 117803 160829 216420 328263
13124 328263 405492 519617 703513 925203 1115231 1178516 1076224 898915 659887 470819
13114 470819 375599 333390 206649 102793 73285 133775 153040 154003 105924 43298 -263
13103 -263 69053 152062 103034 49579 63727 47486 36669 45685 30989 17897 29449 25536
13091 25536 2673 58906 130862 167893 160511 116113 92455 75246 121048 194926 203330 160837
13079 160837 186954 192835 249452 384278 437907 394418 312632 300332 281152 238841 170178
13068 170178 149534 131763 105551 76930 31523 12074 47542 37318 112700 122213 120936 147110
13056 147110 130814 85273 88646 80548 82692 122599 142060 108378 103833 121950 113058 116950 144442
13043 144442 138944 105380 113302 129360 64355 58878 79475 90107 66092 -16935 -20759 15889
13031 15889 34531 50584 24419 3330 -34030 -43216 -50655 -66994 -35272 19827 50369 -2521
13019 -2521 -46187 -99313 -78471 19989 54684 48641 80539 92568 105531 109574 79160 55377
13007 55377 47970 48999 33041 45552 69488 80338 159593 147502 124365 124859 129356 164744 183656
12994 183656 190194 200767 186787 194930 165400 93704 93893 101861 149122 171858 159162 174955
12982 174955 209045 262759 296180 371256 406854 388089 362184 420266 508450 607576 723972
12971 723972 917774 1147727 1438148 1727872 2000012 2256139 2467817 2605761 2638116 2594156
12961 2594156 2491807 2310646 2064258 1742557 1445225 1233004 1027564 849035 708277
12952 708277 617777 560454 576238 578777 525540 429182 400709 398860 425691 458595 436334 456372
12940 456372 447358 379111 315243 352046 375984 376803 343928 345669 366121 345315 321437 295794
12928 295794 294887 290225 295416 273705 233760 237597 262937 235601 188819 163388 194546 226607
12916 226607 243531 198827 167642 178192 181821 194019 178033 185092 208733 226751 219534 169587
12904 169587 157162 210881 217555 154412 101156 82180 100953 86667 100796 86475 146044 221463
12892 221463 192068 172380 214640 247699 228547 232111 264722 280966 302402 291166 311573 349416
12880 349416 387187 340446 276665 320048 342303 321020 334696 312923 319268 307854 326873 363559
12868 363559 373579 435153 444215 433076 420490 441085 496604 497254 496368 560862 535984 554250
12856 554250 584008 701213 777223 788679 837540 946897 1028957 1142500 1219582 1391989 1522972
12845 1522972 1543353 1544534 1477638 1387722 1224043 1030701 783510 523909 240807 7492
12835 7492 -190179 -334210 -402624 -425689 -398182 -386745 -390501 -367356 -380742 -343693 -317575 -286454
12823 -286454 -218079 -181556 -198251 -215248 -245614 -211352 -179771 -181354 -174912 -188152 -92594 -58095
12811 -58095 -15776 65035 99678 98121 118120 134972 123794 136810 114559 90464 83572 113446
12799 113446 82505 66208 57717 14859 27852 73551 57067 35557 -2544 -1230 4312 8280
12787 8280 15463 -26036 -15607 12341 37466 24090 2639 -21633 -5773 76833 130633 150369
12775 150369 156674 159256 178611 155565 137335 88643 63876 52819 12386 35541 84819 74260
12763 74260 40621 -17575 -43578 -7204 60643 87339 11896 -24333 -45590 -29685 4759 37530
12751 37530 81731 89455 121696 110943 75345 29911 -12850 -79091 -55439 660 29240 18688
12739 18688 13485 48140 45195 57230 93828 47951 33286 47595 851 -8142 -20931 -45372
12727 -45372 -43391 5952 -20759 -31282 20645 63416 89698 100158 94279 91994 64072 48892
12715 48892 63155 88079 78800 56544 69026 111334 141839 104781 106673 126559 132929 196633
12703 196633 203629 240532 316082 357432 312835 314767 421389 545202 602467 680566 759313
12692 759313 799629 799130 822701 909884 1013798 1131997 1257811 1386583 1499824 1597494 1626606
12681 1626606 1669624 1598878 1466240 1279720 1095198 919017 818867 694154 551222 447822
12671 447822 351110 328158 360836 328018 338735 372778 426043 477832 562524 568153 521458 470388
12659 470388 492391 508461 524499 513414 452371 408120 322790 212133 194626 169102 200730
12648 200730 218247 285162 331812 358646 401089 472237 543035 576766 669371 772055 785526
12637 785526 816748 866496 849297 861081 918973 943710 995149 1062397 1098762 1149984 1169307
12626 1169307 1168331 1234715 1312150 1427530 1492910 1585957 1718339 1863336 1987660 2081085 2165713
12615 2165713 2181533 2216961 2220221 2191668 2239673 2324696 2365976 2394783 2387098 2436894 2518792 2576367
12603 2576367 2693526 2779288 2853518 2957625 3018008 3079456 3184238 3307082 3428881 3527687
12593 3527687 3597744 3674431 3799302 3942553 4103635 4289650 4486492 4673953 4836797 4989368
12583 4989368 5163702 5340979 5504652 5752959 5930450 6129464 6358105 6664658 7014773
12574 7014773 7415507 7921483 8562052 9398819 10336839 11434815 12727080 14221385 15873080
12565 15873080 17724021 19866573 22365474 25318932 28723246 32661739 37197620 42357675
12557 42357675 48197609 54932964 62921120 72751757 85202371 101482109 123040300 151466739
12549 151466739 188416893 234645765 289066583 348272287 407215203 459830118 499692848
12542 499692848 521131742 520881090 499285390 460084945 408870772 351891786 295293674
12535 295293674 244094168 201138348 167172435 141347955 122118308 107739821 96803769
12528 96803769 88206588 81134748 75051292 69537917 64476584 59756983 55490318 51755609
12520 51755609 48615034 45994939 43855026 42085739 40601417 39437392 38450331 37626162
12512 37626162 36960010 36357363 35864427 35431760 35048093 34598062 34033967 33306664 32471801
12503 32471801 31535394 30514765 29272644 28011313 26741003 25489172 24323741 23219849
12495 23219849 22129945 21047656 20043344 19146382 18301372 17464162 16658131 15896663 15180927
12486 15180927 14534161 13933547 13382129 12850055 12335508 11919452 11500163 11114699 10723210
12477 10723210 10345704 9920605 9464396 9040372 8652548 8287275 7890045 7500110 7194301
12468 7194301 6973688 6700908 6377466 6094414 5869239 5625651 5397222 5192898 4999164
12459 4999164 4830472 4642218 4471892 4319098 4197974 4002852 3814664 3643314 3553462 3459749
12449 3459749 3385375 3309384 3215060 3071271 3002262 2871148 2734396 2672266 2595763 2593838 2598051
12438 2598051 2555456 2516610 2524263 2592868 2660816 2668459 2648466 2641497 2593635 2615569 2589815 2502033
12426 2502033 2436146 2394116 2343149 2342484 2393879 2408331 2318793 2261683 2271864 2309146 2316053 2300899
12414 2300899 2283402 2250198 2208328 2144927 2021573 1872358 1729861 1661178 1577721 1468683
12404 1468683 1378325 1321762 1285966 1240741 1213245 1177475 1136338 1130103 1136667 1074149 1028146 981087
12392 981087 960495 978900 987466 955675 1023651 1063729 1086385 1102385 1122431 1109475 1108887 1116326
12380 1116326 1104936 1119464 1091372 1117273 1171320 1222078 1202074 1219282 1236726 1236233 1225577 1180612
12368 1180612 1180198 1180353 1184123 1172547 1135670 1059970 1045918 1078599 1162695 1149557 1126951 1142029
12356 1142029 1205785 1200534 1172492 1183869 1156541 1168152 1101458 1070609 1074346 1064346 1007767 966178
12344 966178 1003337 1095459 1111544 1041838 1010886 994557 1016087 1024458 1007400 945380 956518 957755
12332 957755 935954 877870 899691 904575 895492 850971 856627 853613 856106 873647 871212 850775 812746
12319 812746 757763 744153 783460 847818 879746 877496 796771 708025 669301 627635 603408 614435
12307 614435 628793 627887 606104 606892 637996 655184 681497 667477 603699 593926 593886 623509 719177
12294 719177 724152 754053 754559 807242 787587 684135 631831 660777 634935 673156 737138 758952
12282 758952 719184 664587 575974 606710 703353 646526 676296 635016 538983 526019 530340 605766
12270 605766 628315 626255 640156 612772 601584 656814 681756 678623 705627 732652 750748 834022
12258 834022 874988 884968 856856 837913 885211 889284 912040 887378 876070 813888 659645 461558
12246 461558 203277 -37668 -294776 -584179 -780379 -891265 -1020152 -1085365 -1074284 -1073425
12236 -1073425 -978638 -871917 -725036 -576884 -490959 -430318 -420299 -342770 -225620 -230179 -250537
12225 -250537 -218977 -182586 -151648 -140686 -178907 -155926 -103172 -80144 -75919 -109929 -124862 -70651
12213 -70651 -43853 -6056 39644 37894 20216 3292 -33068 -58455 992 47679 14655 -8954
12201 -8954 36620 45545 45678 23372 -12982 16433 65854 72469 46146 48088 60178 48899 47970
12188 47970 83640 113131 30092 29289 93478 135856 145857 106202 111750 106307 123810 140998
12176 140998 176243 155635 75990 69638 59509 79607 91996 103220 123014 168319 167329 181687
12164 181687 234109 232433 158560 105677 93577 52803 24496 48844 31792 17827 3034 48304
12152 48304 68318 64811 114449 132479 102207 102123 139717 139859 133653 119335 145978 132343 135354
12139 135354 163329 191477 147274 162740 236155 240084 273036 343143 329500 368867 416061 454729
12127 454729 490294 516354 580985 680630 761086 885511 1155177 1408602 1678243 1974949
12117 1974949 2207053 2437733 2604820 2739532 2744308 2651653 2430461 2109555 1855400 1631799
12107 1631799 1391891 1219651 1030790 888028 828052 778961 703381 681259 689020 660659 629775
12096 629775 642839 620876 538222 504868 519302 518959 501959 467030 445486 455075 502178 537604
12084 537604 480286 424010 375823 347226 333537 311133 320727 347004 379924 369322 303966 278841
12072 278841 192632 219846 252906 252008 260823 268390 278341 260741 261003 259554 236550 280745 289818
12059 289818 296881 285972 261849 260569 228844 221100 220233 280370 246949 223993 259003 254731 177903
12046 177903 142861 214424 272553 273877 279844 286876 288051 277969 297446 346792 389614 385566
12034 385566 448718 473778 456625 493049 576620 627845 609747 605134 617602 632010 653130 706728
12022 706728 751899 877890 1009146 1097426 1180377 1239239 1261914 1260876 1258983 1269744 1209852
12011 1209852 1127311 1109242 1068845 1004440 971975 985889 1018103 991438 997754 947931 920863
12000 920863 974105 1013735 1010380 1060914 1157100 1245731 1311712 1347681 1391616 1414478 1430172 1453896
11988 1453896 1523640 1626132 1727104 1784387 1803716 1835150 1791205 1812587 1799109 1717951 1633945
11977 1633945 1608403 1563730 1541395 1480339 1419680 1376869 1361169 1292490 1192210 1140858 1118682
11966 1118682 1076691 1079532 1074275 1042529 1000405 979527 962883 949498 1032009 1103878 1162141 1192798
11954 1192798 1220850 1370668 1491540 1571758 1662883 1795698 1819089 1784008 1698659 1608633 1483783
11943 1483783 1330266 1228129 1175733 1068753 984422 978950 927123 846554 751903 721852 743504
11932 743504 734169 686620 674753 686275 669519 671627 668653 669405 676434 625448 550737 547151 561211
11919 561211 529165 583135 677142 731903 688288 668180 632255 633143 645260 682874 678359 702025
11907 702025 777652 799242 849029 885637 954076 985252 1025997 1022995 1023509 1081853 1112308 1138123
11895 1138123 1146572 1069105 981269 935835 833974 774377 693699 658393 655945 592408 554904
11884 554904 533101 516906 526027 572359 661372 713398 743463 735180 737054 796161 815451 826530
11872 826530 877267 934616 944888 915939 939478 967319 1009810 1027692 1009716 960458 924964
11861 924964 911603 932126 812341 716446 615671 571954 550755 496014 413008 384628 401410
11850 401410 343836 293503 257335 270897 296608 277436 276573 289344 276017 286986 260488 262478
11838 262478 326812 379298 403597 461438 486005 559721 614705 622878 712032 788998 768169 762491
11826 762491 664450 580715 429301 313232 226126 71778 9258 -15522 -38527 -27570 -29543
11815 -29543 -47829 -27068 -26478 -40828 -23129 15944 58680 58921 14539 -15695 17372 52443
11803 52443 86273 62722 46188 66020 76799 87237 96385 100278 111372 128745 133744 106367
11791 106367 74829 117798 127177 119036 82842 53593 70536 71940 97858 146664 108310 113321
11779 113321 117637 133354 93208 81450 51599 62742 80953 78589 81021 116837 146528 132382
11767 132382 106937 107042 128879 174684 173701 172086 155773 165993 185859 162881 165432 180170 214763
11754 214763 207700 225142 261193 260177 228313 222718 257974 251406 247826 244821 307508 351486 361679
11741 361679 379477 341707 310815 338152 384634 508397 526000 538374 572566 617440 582421
11730 582421 579872 572960 555402 595820 664454 632568 627890 623992 626096 636607 602364 587400
11718 587400 562496 615248 690082 738321 774755 804720 786454 785666 839741 847365 814931 810399
11706 810399 802516 803866 782486 786666 812011 786730 865914 941935 1004019 1035385 1054929 1107606
11694 1107606 1149399 1206890 1306823 1405319 1471691 1572257 1611884 1594411 1498638 1453800 1477419
11683 1477419 1478652 1533304 1557880 1572878 1547718 1544240 1578862 1581926 1563672 1605377 1697984 1770929
11671 1770929 1869096 1928275 2005385 2169960 2287471 2389953 2475065 2598080 2700215 2746364
11661 2746364 2852168 2910791 2975970 3049421 3048113 3122830 3236316 3254380 3353540 3400916 3436862
11650 3436862 3520269 3561134 3716353 3805460 3840563 3891541 3899345 4019235 4115253 4248035 4369990
11639 4369990 4416160 4445204 4544452 4679141 4860549 5041725 5237129 5444472 5703438 6050728
11629 6050728 6407994 6773411 7219804 7689992 8171625 8777667 9425826 10139840 11016799
11620 11016799 11890007 12743292 13726122 14846609 16177654 17679584 19457213 21595711
11612 21595711 24114101 27114125 30737980 35057991 40203154 46417985 53871053 62797054
11604 62797054 73510661 86167582 101118310 118484786 138241036 159844147 181625828
11597 181625828 201141677 215597178 223117516 223285096 217156076 206504884 193237977
11590 193237977 179073246 165359358 153002307 142551809 134285121 128224189 124341384
11583 124341384 122492763 122553078 124209963 127208540 131218839 136057537 141929557 149054598
11575 149054598 157583573 167598585 179057344 191860726 205644537 219732656 233743669
11568 233743669 247456532 260790831 273731563 286031090 296894685 305125169 309363705
11561 309363705 308656958 303235054 294238872 283301997 271900833 260914725 250700837
11554 250700837 241017592 231447831 221578522 211255883 200620099 190191715 180382911
11547 180382911 171364755 163294402 156242932 150134858 144942608 140532366 136995783 134561070
11539 134561070 133363939 133790642 136144376 140808740 148143561 158639260 172680503 190456530
11531 190456530 211634516 235143257 259041439 280717677 296606900 302686044 296232423
11524 296232423 277745757 250928725 220710689 191175340 164889800 142803767 124762360
11517 124762360 110231141 98396819 88670736 80682423 74065010 68383105 63491409 59247113
11509 59247113 55486145 52087022 49060042 46283773 43746369 41543379 39566650 37722266
11501 37722266 36137479 34753379 33552795 32510705 31532176 30620794 29826845 29064810 28322995
11492 28322995 27664367 27026073 26385489 25671731 24847379 24001541 23199726 22334904 21363445
11483 21363445 20429567 19536773 18713487 17905314 17135938 16444493 15774825 15133354 14474945
11474 14474945 13885458 13298783 12791749 12287296 11798240 11395514 10984556 10550297 10124528
11465 10124528 9750687 9388110 9048663 8724544 8375720 8051537 7715047 7445315 7242156
11456 7242156 7023433 6776728 6542963 6314426 6127050 5966105 5831856 5763293 5653223 5458601
11446 5458601 5334183 5176014 5035044 4917879 4797732 4681296 4617341 4536344 4446761 4376669
11436 4376669 4328086 4221155 4131597 4056784 3962078 3860461 3785980 3717409 3644167 3564841 3517929
11425 3517929 3435107 3354512 3305044 3330738 3335082 3236348 3195585 3211365 3236057 3244980 3222296 3217170
11413 3217170 3163966 3106792 3136528 3187184 3176595 3100127 3124453 3164571 3139829 3134044 3108942
11402 3108942 3158159 3209813 3211646 3166194 3133622 3107125 3047346 3000652 2893264 2822899 2806966
11391 2806966 2734970 2564128 2392201 2361160 2319629 2284808 2252661 2251576 2230709 2196571 2202957
11380 2202957 2219559 2175587 2166262 2148852 2127835 2142223 2155889 2163422 2159421 2170060 2130215 2095334
11368 2095334 2017165 2051062 2089485 2135296 2150987 2137669 2136708 2129417 2100011 2036013 2018020 1998808
11356 1998808 1962482 1994898 2014521 1974068 1922643 1922671 1934285 1946010 1926057 1919938 1887031 1843304
11344 1843304 1754631 1733782 1760613 1779060 1830196 1870920 1848296 1870516 1828044 1803896 1803254 1758866
11332 1758866 1732871 1782482 1773143 1773739 1762121 1709021 1707798 1714255 1697771 1728481 1677015 1594042
11320 1594042 1552559 1564628 1659275 1689883 1689327 1662400 1627998 1571352 1570842 1607693 1637250 1592842
11308 1592842 1592097 1585060 1578168 1580433 1594130 1608162 1563776 1526174 1455611 1290136 1191259 1105619
11296 1105619 989268 862139 771228 669364 657820 740907 769656 778340 787062 809432 856714
11285 856714 907613 909131 910658 902847 912291 966448 971670 966496 943857 1003813 964826 857114
11273 857114 794826 786141 768535 734088 638544 560468 525512 468394 349791 269011 235277
11262 235277 220058 168405 87280 41076 -7514 -35848 -29532 9994 46993 69570 36573 -2441
11250 -2441 11032 11831 23181 58993 79060 71743 106735 160007 161609 167129 194273 302281 358229
11237 358229 352719 350537 371144 314589 215434 177550 160874 108211 -35273 -196112 -391112
11226 -391112 -504430 -545704 -509820 -491999 -488948 -418844 -369276 -400383 -402150 -275907 -193915
11215 -193915 -246146 -228146 -168992 -92606 -50615 -112149 -60769 -18069 -27144 -41333 -38741 -59417
11203 -59417 -64737 -18460 14205 44111 101286 96447 99362 127606 143501 111854 121025 143129
11191 143129 167270 198914 208769 183243 176032 196339 164875 158831 159551 161999 214031 277150 382322
11178 382322 423133 416800 475975 554803 659723 809567 887091 993990 1073402 1155728 1226750
11167 1226750 1259526 1303703 1287059 1245769 1223010 1134089 1049436 961916 869406 824871 774755
11156 774755 760798 738240 716431 692356 684018 656580 694333 756322 797483 888237 983584 997297
11144 997297 1062618 1113383 1152564 1245287 1386452 1409309 1445074 1550501 1664391 1746125 1765218
11133 1765218 1720005 1764782 1768489 1709847 1620251 1575713 1497808 1361059 1279591 1232117 1162738
11122 1162738 1148911 1117983 1022850 973487 964798 928372 890550 933667 897296 830736 787974
11111 787974 787168 809703 793106 793836 862714 943197 1016370 1078230 1172661 1316802 1399798 1441807
11099 1441807 1558330 1600899 1584195 1594242 1492991 1304818 1100517 926556 872975 778040
11089 778040 652235 549631 462606 377279 317099 338195 311373 248961 284976 316496 313622
11078 313622 329157 285829 233166 228433 206840 222603 217289 215005 252458 207856 174330 213971
11066 213971 176964 201190 224706 158332 101711 127193 160877 177991 204148 265194 263972 258952
11054 258952 209272 157447 172676 170175 187124 127808 87887 65731 31195 78985 110489 110620
11042 110620 179903 215336 183539 153567 149922 136248 149300 133720 96049 101383 48798 -19086
11030 -19086 -4996 39468 27349 16540 -1677 -3919 39430 97628 125900 183966 128278 94323
11018 94323 81580 56574 91496 97235 76864 78019 113918 102174 97983 69871 112052 120924
11006 120924 155504 134042 89990 117219 128630 135076 131351 126222 134636 89685 94793 139882
10994 139882 150045 140439 101377 80498 92479 135718 162676 120047 99501 79377 70161 79586
10982 79586 111741 105271 118034 118754 140524 174567 172900 213992 162391 121865 100279 63470
10970 63470 73049 69302 47329 17041 -32716 -58970 -26250 26072 67190 89563 102771 110887
10958 110887 130442 99452 68896 64243 91938 104584 100255 112997 112873 132516 145472 203118
10946 203118 190681 182794 156461 152604 121623 60160 67581 122649 127068 71447 83449 80238
10934 80238 126073 121414 124684 148947 194136 172928 147538 135455 126653 197859 256011 293223
10922 293223 277629 245676 238360 218757 175115 145758 128395 125744 125996 136604 167108 169827
10910 169827 199393 164355 206670 238328 284665 352386 342734 341938 354753 327690 365149 334845
10898 334845 262163 180376 145633 120989 153577 196475 218672 210334 229410 245799 223914 150264
10886 150264 176857 216094 290773 298252 344736 362436 337807 337914 327108 368811 341811 338715
10874 338715 334016 294310 271882 266581 240970 178859 170284 203993 238678 376865 458810 493052
10862 493052 518829 515555 437018 406730 400247 349950 370480 364572 318053 273254 258405 304932
10850 304932 283277 222144 175011 160334 181400 173740 190662 199074 158245 189708 237562 261852
10838 261852 229883 234788 260049 310564 299663 329669 335606 309582 260271 215797 212482 211628
10826 211628 256636 269575 250589 245596 296368 328193 356870 429629 456696 391849 387685 337273
10814 337273 312030 274882 238159 233332 279128 277935 246552 184107 132062 109665 94623 133576
10802 133576 177505 167242 129727 96758 97421 65715 83870 107932 109416 102813 100231 85389
10790 85389 70468 84833 147442 117458 72743 84768 79458 118634 112508 101327 105224 134366
10778 134366 146920 148263 161962 178069 186763 151701 95234 69413 121531 133426 126108 143504
10766 143504 147211 124465 115532 118629 119782 105796 55665 29467 74307 71150 48207 16049
10754 16049 91297 78575 60166 84519 16358 42553 72281 141811 101612 79184 98612 71094
10742 71094 47133 87993 82198 17011 28073 -14455 -37834 184 24298 36018 119397 114341
10730 114341 91964 101334 148717 100459 51518 -14278 6179 38261 135928 119210 59452 64453
10718 64453 94489 142562 125511 131873 177651 191958 182784 192472 249721 231121 190391 192961
10706 192961 196185 236999 226766 158702 136391 142280 168645 159223 107448 120619 121475 99807
10694 99807 123685 68524 38560 69729 108819 123303 128632 163007 208195 181076 183286 161187
10682 161187 107158 63006 92930 147291 183224 166185 164801 119075 93928 114337 67126 76096
10670 76096 132069 118798 108799 148741 171037 158934 90626 61987 105601 158968 153484 127901
10658 127901 81211 96367 129610 106376 104058 134899 134012 140193 90828 115680 110298 107996 84280
10645 84280 140652 225909 192156 150543 111116 44875 41784 12790 3009 43817 100232 120474
10633 120474 73553 28946 29505 17612 18837 39036 32599 63518 95649 139412 139424 120448 76016
10620 76016 71378 79856 75336 103483 29063 3872 8504 27645 58457 94420 164745 160698 119214
10607 119214 43401 31586 52457 48116 56014 80288 122203 126940 106922 81832 96201 56229
10595 56229 28689 -6384 -23523 30566 91567 125162 86747 103107 94379 89962 118287 105968
10583 105968 78744 137439 196284 220779 243145 292755 284695 294585 315789 314626 271283 187654
10571 187654 169645 127019 60283 86024 138045 176064 161523 178039 182471 184784 253997 314299
10559 314299 354870 357277 356214 341145 336838 311648 286816 277367 271793 270044 256542 278539 248644
10546 248644 162225 107001 73030 105535 114882 139264 132607 216120 267535 394669 486084 523505
10534 523505 598393 582252 495805 416048 405287 285998 231543 242045 297956 338460 312842
10523 312842 240131 223813 241162 260743 277188 244422 214742 255038 311761 373731 362696
10512 362696 338747 358123 381146 377850 332523 280204 278329 258091 216748 129995 81857 90706
10500 90706 84705 122811 172382 188525 219157 286135 318224 299388 268655 237223 235860 230773
10488 230773 240305 196833 217756 188774 128141 161590 226146 267555 265385 229626 287537 348114
10476 348114 411652 439917 499059 495445 471846 490516 465709 407753 400586 350210 316949 255693
10464 255693 204640 208467 196553 143463 164157 233051 253468 195525 145256 175229 186733 148834
10452 148834 163440 86756 12390 54598 84189 109908 112035 137253 92318 131266 200400 239972
10440 239972 277564 308919 251178 208308 145167 125675 140267 133276 116805 129026 132192 148383
10428 148383 104804 112361 115938 155988 192552 278899 276936 258871 233920 215047 228036 188324
10416 188324 151984 160207 102306 74574 53463 55595 72287 106106 141309 107629 94914 112793
10404 112793 123145 95950 95295 108214 135193 119137 91475 128543 160613 136346 120676 155877
10392 155877 173483 130108 118884 139747 137265 152817 124405 124069 145625 147730 150292 135027
10380 135027 167689 215120 203317 159035 204308 221268 232551 226007 234339 139151 115809 162591
10368 162591 147675 92945 157691 164823 135833 133030 135171 185306 207371 192624 193991 240559
10356 240559 269207 262277 211265 221107 231969 215825 195759 196351 198553 225697 233536 277357 334982
10343 334982 302181 313411 297593 249108 174227 150021 114281 147080 201747 232731 255099
10332 255099 238036 236680 224849 289654 311956 313551 291733 285860 267834 262099 272000 320960
10320 320960 312494 245030 195553 153976 189385 253453 263081 179919 229679 244459 246102 253509
10308 253509 305050 306222 275259 271232 315068 340080 370939 404497 380351 338628 301014 237738
10296 237738 243475 258074 216489 195760 182951 201908 201572 237144 279976 305964 258402 219817
10284 219817 206145 205268 186374 195610 254487 266442 230505 259035 318229 338180 290505 214866
10272 214866 193243 188132 213253 235472 235130 275510 297637 300787 324833 349129 355399 338943
10260 338943 337090 317144 255842 278420 232487 175375 153418 154009 155161 132948 152374 160403
10248 160403 135587 147679 141005 150125 183829 228421 222001 206166 230854 279222 271002 299703
10236 299703 312536 347483 348578 329820 279235 249599 221312 199742 189897 141350 67871 72466
10224 72466 98967 137535 131010 160875 193293 229318 263706 269406 298110 240491 205813 200162
10212 200162 248930 270060 234885 211259 201727 202758 216003 206717 196540 245881 233512 249059
10200 249059 276258 314174 276438 259862 333153 337470 309219 295228 299757 259331 231832 179972
10188 179972 166447 185662 185440 173072 133114 143940 150753 170496 190712 157683 130206 125103
10176 125103 79806 73970 71148 130437 214960 242234 208930 204129 220376 250417 224508 267199
10164 267199 260352 195963 180827 187015 189019 299301 344339 306514 296727 309642 284939 261755
10152 261755 293783 340079 363824 326600 280732 299710 279724 239735 267188 354285 367480
10141 367480 351453 340090 335488 288066 240250 287039 335698 306043 242824 179738 191553 208668
10129 208668 209106 308526 392845 410945 404194 437012 442632 434264 389221 398356 434350 488562 501275
10116 501275 444700 403520 405922 405062 318311 278013 346926 455658 451762 439608 454135 437993
10104 437993 489431 549521 585894 573514 562349 565448 625029 664915 658945 710559 760585 767924
10092 767924 796541 877339 977728 1020571 1104711 1130112 1195064 1277228 1415539 1546116 1652197
10081 1652197 1844367 2097019 2398773 2769185 3175398 3650086 4249877 5057434 6188376
10072 6188376 7592237 9573008 12211615 15502409 19167861 22025373 22800694 21296830
10064 21296830 18467838 15390394 12764712 10695052 9210133 8170511 7549756 7234249
10056 7234249 7193486 7314041 7578185 8126402 9000802 10218310 11828644 14038063 17048298
10047 17048298 21093600 26201664 32083440 37805178 42374806 44964516 44494546 40850058
10039 40850058 35434962 29948812 25547023 22657028 21072385 20659071 21337622 23155800
10031 23155800 26174011 30713235 36915313 44291746 51234016 55823159 57076861 55553491
10023 55553491 52962057 50876071 49389964 47137450 43048012 37705474 32435203 28109028
10015 28109028 24987022 23073106 22187427 22099210 22770063 24282457 26807312 30547253 35963056
10006 35963056 43394796 53218357 65564835 78739726 88373063 90651324 86203171 78180081
9998 78180081 69073213 60121661 51866493 44909721 39700412 36198002 34377164 34097889
9990 34097889 35322593 37973913 41398736 44196403 44939682 43824668 42262558 41743412
9982 41743412 42843427 45711103 49675216 53404214 55860983 56250629 53606415 48209535
9974 48209535 41675999 35665843 31037817 27946769 26254746 25751626 26247272 27863211
9966 27863211 30665672 34753343 40385835 46912315 52424044 54944667 53443322 48486241
9958 48486241 41796404 35097474 29351229 24815508 21455368 18975427 17141028 15753962
9950 15753962 14764573 14154202 13776472 13565742 13616584 13930193 14525124 15473932 16986845
9941 16986845 19071288 21804858 25169302 28533666 30336516 29524630 26499649 22624382
9933 22624382 18924968 15855452 13540630 11797070 10508784 9444722 8654224 8030128
9925 8030128 7515519 7115989 6809784 6459390 6108796 5806551 5514850 5299239 5116555 4871238
9915 4871238 4675884 4592293 4505864 4367353 4294109 4228514 4123284 3953999 3833567 3737380
9905 3737380 3579915 3468682 3389916 3330598 3304644 3199400 3116947 3025054 2949606 2914266 2814372
9894 2814372 2714447 2603409 2505514 2397082 2307347 2218058 2131373 2017812 2010561 2004049 1945096
9883 1945096 1899667 1839718 1776728 1719415 1770947 1763834 1761527 1720562 1724349 1741375 1740358 1680984
9871 1680984 1689873 1671673 1619047 1589285 1679740 1779237 1836505 1867212 2007310 2175704 2433283
9860 2433283 2874249 3526217 4472171 5557733 6374549 6520771 5888840 4837788 3842700
9851 3842700 3139900 2638433 2284332 2035071 1860206 1726302 1604529 1503249 1448063 1408907
9841 1408907 1394596 1345204 1286678 1284035 1270320 1231879 1227552 1188020 1188871 1211438 1218203 1250844
9829 1250844 1267628 1222254 1161973 1131834 1093633 1127431 1119212 1128745 1133450 1142628 1111009 1086561
9817 1086561 1073272 1037762 1064687 1069845 1030081 1050276 1085319 1043611 1097559 1107223 1084859 1039713
9805 1039713 1032017 1079142 1101343 1124791 1117146 1139685 1146441 1124663 1076914 1068838 1123776 1138107
9793 1138107 1189918 1200508 1274090 1268008 1239363 1231398 1291990 1326168 1355817 1316691 1326972 1313505
9781 1313505 1281291 1249211 1267087 1319027 1290623 1203999 1178021 1194166 1230559 1254136 1249265 1264233
9769 1264233 1255384 1266099 1265796 1284125 1289560 1355469 1445853 1461099 1447155 1424114 1428208 1507209
9757 1507209 1529102 1578899 1655024 1664696 1707268 1752355 1744569 1713971 1789253 1808775 1789187 1791741
9745 1791741 1802352 1737597 1718957 1682884 1639868 1676485 1698413 1655471 1656520 1740077 1740205 1770660
9733 1770660 1742898 1697942 1725140 1750138 1703580 1663489 1676759 1677377 1662962 1663675 1714532 1729807
9721 1729807 1735516 1838898 1981756 2077896 2175235 2225409 2238052 2343820 2397270 2360601 2365038
9710 2365038 2318996 2313353 2271823 2154349 2127838 2082252 1994672 1946387 1952306 1901626 1814812 1799648
9698 1799648 1869907 1949529 2004648 2051832 2111991 2198093 2259782 2305636 2332069 2402168 2435113
9687 2435113 2513955 2724819 3019444 3421987 3915985 4602126 5479552 6373896 7002676 7177657
9677 7177657 6949260 6350610 5437302 4587864 3852726 3366204 3095496 2838357 2598547 2469805
9667 2469805 2408606 2356082 2317151 2261070 2224931 2145832 2054124 2017968 2008214 2001897 1964849 1961111
9655 1961111 1935574 1922949 1904508 1922209 1926988 1915071 1867745 1859977 1919482 1973346 1961611 1902267
9643 1902267 1941246 1980647 1944135 1913613 1900906 1865881 1842057 1782111 1740331 1694733 1708396
9632 1708396 1750875 1725831 1708339 1764777 1747250 1684360 1684581 1737635 1761453 1805867 1844356 1782954
9620 1782954 1733399 1743155 1708214 1712070 1736505 1701705 1695462 1672804 1629534 1613352 1603597 1574219
9608 1574219 1461727 1424804 1458778 1457577 1447790 1429997 1386821 1385461 1475911 1506371 1538247 1521462
9596 1521462 1531350 1547298 1558496 1590489 1641160 1644221 1669306 1669972 1630871 1683877 1704698 1710533
9584 1710533 1693860 1672568 1622771 1607370 1623715 1607734 1556710 1571199 1611111 1592865 1584255 1595530
9572 1595530 1651270 1667778 1636920 1646241 1630113 1674948 1709838 1701527 1658402 1665367 1659808 1567584
9560 1567584 1600492 1651741 1716424 1732988 1796588 1877786 1846400 1876356 1984154 2101801 2136448
9549 2136448 2080627 2025128 2040177 2090413 2121680 2165452 2202030 2151379 2141749 2172076 2235981 2232984
9537 2232984 2206998 2239960 2308460 2327457 2330698 2361186 2419002 2485780 2550270 2597357 2656297 2748685
9525 2748685 2841794 2850352 2758544 2779896 2864164 2989007 3061085 3061766 3126648 3184911 3217147 3233652
9513 3233652 3265436 3329633 3362876 3388529 3466978 3578795 3674612 3756914 3821926 3833979 3910597
9502 3910597 4048114 4137557 4197158 4239103 4310328 4384991 4402679 4408558 4466238 4568013 4640657
9491 4640657 4692637 4785661 4895586 4955467 5004281 5079271 5201738 5317456 5443568 5568307
9481 5568307 5659937 5782270 5938996 6058952 6150222 6262331 6354556 6545441 6699162 6827079
9471 6827079 7008820 7174141 7357531 7557768 7742480 7955105 8234517 8467579 8665754 8889151
9461 8889151 9068733 9263916 9450341 9535847 9604120 9781870 9966128 10164304 10414241 10643272
9451 10643272 10818683 11066759 11356998 11589658 11851989 12189107 12542671 12913441 13295790
9442 13295790 13696197 14146419 14625264 15149237 15600623 16051942 16504350 17025222 17552334
9433 17552334 18063126 18585768 19159997 19814898 20502721 21230540 21950171 22684198 23564701
9424 23564701 24502567 25435888 26473962 27549914 28618304 29685821 30811473 32103611
9416 32103611 33514063 34937854 36396599 37913576 39510181 41196572 43015797 44968047
9408 44968047 47046823 49198788 51498267 53968680 56532416 59320452 62269343 65337988
9400 65337988 68663618 72277320 76108936 80056064 84083198 88310868 92662192 97220216
9392 97220216 101884260 106416869 110625291 114110509 116506594 117497856 116852333 114768103
9384 114768103 111576379 107809710 104051539 100508525 97361903 94636338 92429257 90790692
9376 90790692 89785648 89478762 89652975 90307688 91277964 92380101 93647087 95238951 97170335
9367 97170335 99523091 102369350 105598950 109124841 112931158 117023166 121224196 125503883
9359 125503883 129788291 133949630 137794583 141231028 144231121 146694230 148516514 149575570
9351 149575570 149743372 148897511 147319568 145200160 142781030 140391448 138455849 137133311
9343 137133311 136320408 135832504 135574031 135628489 135919005 136415134 137069358 137821261 138605807
9334 138605807 139644040 141094647 142952445 145183162 147574637 150079516 152932807 156455144
9326 156455144 160784816 166219440 173078477 181347964 190722290 200562332 210164421 218862525
9318 218862525 226045118 231021927 233005465 231475291 226558185 219060261 209898751 199905201
9310 199905201 189865324 180220203 171657795 164731279 159900670 157158198 156237631 156763162
9302 156763162 158297891 160225751 161919401 162951431 163120072 162762551 162438139 162514014 163103389
9293 163103389 164036515 165269623 166866305 168875790 171386683 174534166 178230091 182301438
9285 182301438 186235798 189362753 191005306 190570114 187739680 182533978 175456183 167328518
9277 167328518 159013375 151397543 145181589 140536081 137381701 135464097 134150962 132798276
9269 132798276 130836202 127983324 124367412 120179706 115603729 110746457 105950330 101445990
9261 101445990 97594041 94552836 92355154 90841705 89987927 89894146 90618679 91979251 93516837
9252 93516837 95148660 96579807 97613732 98409352 98855653 98574823 97156513 94362987 90213132
9243 90213132 84985283 79293691 73621307 68438241 63959949 60257638 57237770 54738811
9235 54738811 52586318 50642572 48775615 46800932 44695589 42451709 40072012 37656853
9227 37656853 35387999 33251055 31325394 29665767 28220410 26891915 25831812 24911474
9219 24911474 24112650 23384204 22761417 22171167 21552890 20979063 20509462 20060327 19633720
9210 19633720 19104816 18593656 18096839 17588051 17143793 16786107 16474711 16189413 15970421
9201 15970421 15754836 15590978 15472221 15385039 15343307 15353179 15280125 15067014 14761345 14411790
9191 14411790 14166199 13984830 13850222 13732083 13726191 13777736 13923590 14217196 14581095 15080523
9181 15080523 15670645 16348631 17144765 18097487 19188581 20498988 21832779 23090254 24191386
9172 24191386 25102923 25758894 26183241 26429282 26613714 26888732 27380226 28106561 29200128
9163 29200128 30608506 32219449 34056322 36067735 38192483 40437886 42805798 45438085
9155 45438085 48457373 51666771 54694384 56934370 57952162 57619378 56062292 53898136
9147 53898136 51663554 49788964 48648447 48381037 48868276 49902941 51355919 53017620
9139 53017620 54711407 56295583 57508145 58197681 58696551 59114189 59385570 59547524 59678014
9130 59678014 60047867 60813251 62135067 64059915 66674093 69955353 73787299 78150920
9122 78150920 82789885 87283197 91225106 94215836 96122881 97270862 98015514 98567802
9114 98567802 98998789 99190007 98909070 97787975 95917290 93442946 90592506 87581073 84440799
9105 84440799 81215135 78107855 75079190 72249483 69791740 67711492 66162629 65231253
9097 65231253 64956190 65495667 66694479 68745624 71571822 75317512 79938538 85319150
9089 85319150 91161550 96869053 101653886 104876593 106212292 105924770 104302062 101879473
9081 101879473 99029574 96170709 93358975 90596858 87968744 85546421 83375512 81341869
9073 81341869 79310823 77138370 74780513 72447008 70364702 68661973 67533931 66921527
9065 66921527 66402335 65494192 63858059 61492217 58790950 56124364 53969544 52522867
9057 52522867 51941550 52133113 52963232 54149955 55429690 56436392 56808523 56473216 55489895
9048 55489895 54075072 52691507 51599608 50940226 50615457 50531983 50712820 50971944 51092067
9039 51092067 51002465 50608395 49706494 48117794 45876713 43035574 39776897 36422964 33275743
9030 33275743 30586125 28295451 26290986 24614937 23249726 22166807 21280649 20752957
9022 20752957 20513414 20556369 20964948 21631236 22491556 23236071 23450492 22918903 21806346
9013 21806346 20412235 19103230 18143602 17609760 17502257 17807262 18322773 18769626 18951179
9004 18951179 18628751 17631328 16208372 14676048 13203957 11906687 10793452 9994232 9385220
8995 9385220 8840367 8337539 7885303 7565532 7328496 7066708 6704293 6469427 6201174 5937841
8985 5937841 5701959 5469901 5296502 5135273 5020664 4865577 4700837 4584404 4533425 4481631
8975 4481631 4400347 4240827 4094484 3988319 3889505 3890023 3838315 3725293 3615588 3500512 3436131
8964 3436131 3436249 3342941 3282122 3208334 3156530 3169904 3183573 3174525 3130424 3073904 3016142 2938397
8952 2938397 2910811 2906947 2847162 2785891 2717096 2697777 2682503 2719875 2740823 2673410 2662353 2659634
8940 2659634 2636327 2643893 2649545 2684506 2699873 2670261 2657088 2648665 2614200 2610837 2643530 2655251
8928 2655251 2627296 2608512 2576890 2567586 2508546 2452038 2433520 2401429 2330536 2272821 2240393 2253062
8916 2253062 2260398 2312121 2297472 2304285 2350848 2364727 2370452 2432307 2507822 2538140 2532184 2551474
8904 2551474 2548039 2533039 2500152 2448011 2436283 2380721 2309807 2273834 2244077 2223790 2196206 2113115
8892 2113115 2037067 2012754 1998918 1938165 1932163 1917461 1933577 1940610 1897229 1869044 1897797 1922268
8880 1922268 1955446 1935152 1884104 1844567 1877974 1884187 1870897 1835389 1843002 1841930 1830531 1872239
8868 1872239 1837154 1848415 1819951 1779845 1765476 1773043 1785030 1726469 1724729 1668550 1618649 1545049
8856 1545049 1458375 1413774 1370099 1284732 1204827 1183471 1163394 1121002 1141205 1097970 1074347
8845 1074347 1039934 977220 1035744 1060337 1106326 1063347 1036524 1066507 1078342 1116775 1150318
8834 1150318 1142694 1078848 1019783 991623 935073 919806 982377 992433 931399 831435 818906 805095
8822 805095 747910 716061 607416 533401 545773 588489 600279 560193 531764 529840 573188 593319
8810 593319 599365 556479 573779 563407 505443 435369 427193 421028 418433 434641 450585 450524 413390
8797 413390 472287 529311 519615 468678 491590 514925 522268 479350 417072 397429 435081 422039
8785 422039 321838 317936 276302 238322 218858 222566 229418 276861 290923 278010 316730 312421
8773 312421 335371 315873 277400 301087 302400 327981 342885 393183 425622 388961 324389 340171
8761 340171 371384 434304 493990 512164 538889 477042 428240 435908 436038 419501 420938 406725
8749 406725 411858 416292 414942 375960 342769 348398 370252 363864 347639 370168 418590 476461 469677
8736 469677 465597 478918 469663 450281 403457 446084 494977 498498 479524 519257 532864 589609
8724 589609 631460 704692 781452 846533 828401 784309 742107 718669 692003 664228 686323 675991
8712 675991 708715 730805 697795 672720 601216 554108 574668 644458 672364 661079 611902 602541
8700 602541 587574 583047 577057 570058 565483 672273 725014 666559 632053 660113 734708 775750
8688 775750 840434 867111 891562 949261 976666 1049337 1092644 1055561 976997 861450 778336
8677 778336 759277 737819 721169 683879 700054 758319 790476 791176 746190 727502 755462 738262
8665 738262 723575 758393 854455 966879 1063703 1179021 1306285 1476301 1761396 2030622
8655 2030622 2001318 1854327 1638006 1388454 1195822 1068867 983507 931599 895342 890799 855435
8644 855435 831251 786633 757542 771231 742345 650691 600658 627977 607735 633584 707647 677628
8632 677628 620842 624616 645868 625612 622490 642539 590496 564509 576773 562102 534775 602589
8620 602589 650195 703725 763562 890333 1100644 1368482 1642787 1999677 2514040 3040302
8610 3040302 3139700 2835315 2345460 1871004 1503044 1255861 1069352 920829 794932 692317
8600 692317 660750 680228 666550 611035 582596 521182 502597 535854 554422 494777 397454 457004
8588 457004 483923 483180 457177 387616 379935 438507 499473 476098 431136 421663 412665 410722 478327
8575 478327 526127 594309 608659 583818 634379 684488 803716 941282 1161023 1459188 1575702
8564 1575702 1441171 1212788 995504 801400 677686 534454 473189 461122 407936 363569
8554 363569 397219 421479 385402 362345 338071 252729 210249 234356 252280 269225 273566 275804
8542 275804 274235 274539 307497 272495 239592 236805 227981 224920 196497 211712 212172 206280 144074
8529 144074 172928 174644 243197 326753 316083 279863 240191 178661 234982 316129 301302 228859
8517 228859 230095 204250 152417 191375 209477 210593 227833 206989 230981 183088 198460 248457
8505 248457 261026 233868 250475 284918 274672 263328 225169 179965 140461 148127 206841 233689
8493 233689 167556 145436 166776 162895 142094 151594 183651 205536 210718 233981 227525 257295
8481 257295 262278 231699 217107 284063 333167 318847 272096 196997 182234 182037 229389 261139
8469 261139 245758 207341 183460 142237 115069 179646 212213 140417 144206 187339 165095 175056
8457 175056 158269 188291 193937 162962 131229 121427 144977 60260 56091 121374 165526 170408
8445 170408 194318 231633 210561 249154 331141 378992 361178 349306 382987 438499 481817 438625
8433 438625 404363 390213 374618 335675 328149 312941 248665 230620 261849 287479 299351 294518
8421 294518 292914 269367 274624 229889 202596 204351 179935 176198 229208 279754 289087 267247 245524
8408 245524 218629 222946 272720 281676 278964 232728 214072 235958 245978 255750 227701 218697 251309
8395 251309 268209 248389 271658 339226 425767 562615 601292 676976 675651 605200 486917
8384 486917 414753 354382 286003 287112 274541 271096 291148 266136 246222 250858 244960 229461
8372 229461 255704 279008 241311 248252 188304 159411 127200 126701 157501 156528 173978 235795 223026
8359 223026 199817 201105 195456 184474 169909 208995 242348 224029 235544 250003 240613 275583
8347 275583 307222 303679 324696 377035 423392 419218 393974 366205 309646 248997 203304 170376
8335 170376 156148 151907 112544 134860 157873 161276 110280 128948 165568 183326 189658 194826
8323 194826 205230 273139 229257 191780 151157 177323 188671 151893 142651 123130 77369 55288
8311 55288 118615 142981 145392 122339 149877 191870 150445 118956 145832 179733 175085 173033
8299 173033 200761 202265 166589 147003 131488 129513 113864 76100 67357 92703 68044 48217
8287 48217 71033 86475 109693 148687 140414 101188 100242 96883 47453 31158 115829 139976 161649
8274 161649 219910 192000 159175 159399 139571 140545 96818 66021 129206 120835 63349 23720 -3400
8261 -3400 21363 80176 81953 65257 123919 140159 112303 73920 68765 119405 165699 90823
8249 90823 62748 87846 103582 72861 33242 93479 143095 150072 128586 89598 70505 86757
8237 86757 140888 103249 98340 135384 143683 156943 171010 151389 92544 56986 30277 -27868
8225 -27868 14824 68863 77891 52970 93044 106049 99334 114314 111270 127091 148815 163297
8213 163297 119123 55070 78558 117017 87468 105858 123125 129630 137416 146839 104046 101264
8201 101264 135291 57983 24771 66982 60758 -9304 -20946 22356 59074 94352 78695 53539
8189 53539 40467 23026 30013 34279 60713 63756 52180 72759 76333 59212 99030 159279 161696
8176 161696 141356 133042 109765 60514 44180 52694 80498 102262 94911 93351 84828 101504 153980
8163 153980 173528 135462 108589 101103 80192 65530 107487 90727 84080 100014 108954 106608
8151 106608 142250 130206 100324 131316 172847 161010 120790 126197 102396 67136 49579 69046
8139 69046 72895 33032 30225 29272 16857 -7264 12638 -10867 94979 146192 107172 112173 157903
8126 157903 136495 170411 174535 146709 183887 141643 85329 113559 172135 169425 210176 208806
8114 208806 196617 218907 130195 71662 144420 185803 189674 184523 124806 75446 160859 258227
8102 258227 270258 258052 193138 168261 180082 203397 200070 145324 134447 99317 109872 87728
8090 87728 91989 107981 111243 157597 185705 196324 201371 230757 207155 167346 177289 142133 141244
8077 141244 172837 211159 247838 165368 131610 178486 232741 262548 217959 207022 239183 260086
8065 260086 266302 264505 259017 212990 232132 246664 251748 310001 335814 311363 275035 254892
8053 254892 238906 236712 223871 177768 125920 139396 178143 223399 214122 178986 153007 90032
8041 90032 89564 81197 98780 129706 107216 130070 182010 160021 22110 55782 124779 162450
8029 162450 154116 71368 109372 154877 125694 106565 93393 73034 99313 155745 173415 153902
8017 153902 147312 176323 188177 132731 117235 162184 255623 263671 226671 241939 278140 262468
8005 262468 254853 233190 194377 161652 159995 164209 199314 211865 152987 102373 121830 184191
7993 184191 169297 168268 131751 104447 130587 186711 167250 168799 185236 198847 201619 196944
7981 196944 153522 103220 112603 107462 125237 80695 51433 87099 87586 85864 147294 214134 261065
7968 261065 211276 193605 193949 204460 198322 166664 113613 131836 221018 245460 249709 275302
7956 275302 270499 225933 175773 157200 197294 209574 175515 197120 180667 134984 155450 212787
7944 212787 245212 238175 253376 275346 291819 335120 337555 280595 260569 229123 231278 327774
7932 327774 380474 435200 447558 397921 329001 331080 338231 284750 287400 335458 324120 344853
7920 344853 291579 204201 230579 216608 285939 299743 291001 270805 234214 234327 276251 269337
7908 269337 260111 245438 264375 300797 262690 239512 274980 327734 331726 389209 459444 463929
7896 463929 509699 571430 626197 647747 601306 585233 583111 463443 428905 482542 425493 461623
7884 461623 473741 499066 501185 496221 506592 525317 526097 507462 438380 453455 431700 415911
7872 415911 360736 399123 474501 545955 580744 605959 629103 721105 771669 818683 823303 850420
7860 850420 841294 793251 828902 924324 1006018 1022962 1109892 1199470 1317398 1371139 1342424 1288498
7848 1288498 1146420 990370 895126 892220 875366 879247 886331 865515 865047 806848 795536 758381
7836 758381 688961 642387 597885 599412 615405 648247 666040 696040 668354 618888 626824 679718
7824 679718 728745 800110 915494 1047238 1129488 1220566 1346559 1496355 1560426 1497617 1487356
7813 1487356 1520842 1537096 1555942 1467447 1354270 1342399 1275549 1309720 1326402 1331454 1306242
7802 1306242 1200285 1129493 1165010 1232832 1279946 1268549 1205045 1185841 1124840 1059426 1069896
7791 1069896 1042661 982499 935747 959833 972112 971022 970706 942812 946098 985329 974131 951361
7779 951361 974984 953913 882347 885704 928955 980421 991509 1016465 1060176 1078484 1082612 1094277
7767 1094277 1032609 999891 999150 1068660 1075656 1001295 972313 1012802 998590 979770 1033083 1122611
7755 1122611 1227464 1269966 1317399 1322669 1354718 1369359 1265200 1148871 1024195 927033 838505
7744 838505 749793 746249 769573 835100 818399 813891 812599 816337 780374 749768 736649 711765
7732 711765 657056 689134 780031 857964 949861 1079382 1190550 1201318 1159797 1093699 1072583
7721 1072583 1036624 1000847 918630 875361 820564 843352 860812 860151 922281 968855 974312 922112
7709 922112 841757 892900 935427 926724 900365 923890 938802 938811 870648 851672 850282 878677 872358
7696 872358 868443 826781 780453 748451 756175 769551 783264 822117 864191 848271 811258 752022
7684 752022 742597 730766 696331 672455 672888 654442 645190 664744 729317 788665 753597 769451
7672 769451 786188 705366 651662 632909 704806 798522 885246 959474 971547 994323 981475 1006391
7660 1006391 998518 987058 987135 917746 861628 846278 827115 704390 561270 533728 574395 496071
7648 496071 409653 422218 472738 490979 497141 482263 518010 591532 575835 567706 552378 539947
7636 539947 556029 603562 582857 566493 525916 485430 515018 552556 558238 544916 558185 600704
7624 600704 601287 566879 609657 656145 660694 676521 719917 791960 839680 906827 939184 944943
7612 944943 960128 899381 856145 813770 763971 727926 660904 641839 636182 669553 690750 721281
7600 721281 722601 698368 670691 668786 604669 532228 519525 500879 504680 458148 421451 446739
7588 446739 450784 416971 436518 451057 492274 542987 641428 664278 668172 718386 699499 671075
7576 671075 710469 765797 766035 800301 803715 754147 767952 713456 675781 701104 758568 826706
7564 826706 834981 763399 712460 698983 718525 762882 808287 814570 784330 764272 737861 668782
7552 668782 594441 547399 520069 498597 491936 562945 602844 668599 724146 737643 756457 791756
7540 791756 757213 703226 663067 613502 591337 531846 525674 531007 604546 710914 714360 703782
7528 703782 663419 646588 641173 728675 762468 796937 783813 799597 802585 804390 861783 921172
7516 921172 911279 903515 937626 903276 920138 941505 887102 827538 763985 713203 722547 686562
7504 686562 684984 698194 640326 607533 524858 437938 404861 365050 329750 281614 231454 228110
7492 228110 283774 324172 347758 345810 305462 238443 261001 288269 308650 320756 338479 375826
7480 375826 353238 321639 285918 300449 336859 330099 332357 342753 367767 445456 512677 512758 427925
7467 427925 420142 467377 491199 506851 530095 529170 486825 479141 491350 509829 565798 627371
7455 627371 666917 649090 642226 636292 616350 600206 563895 565096 588105 587582 518947 488159 554279
7442 554279 502140 466165 407153 406093 443049 423974 414909 459334 517136 548850 541046 497170
7430 497170 466069 448592 432499 481156 522624 605542 571104 590104 681455 714400 769177 812430
7418 812430 854788 893878 906498 857101 804107 855573 1007572 1105509 1130140 1177758 1149513
7407 1149513 1168639 1170358 1142584 1147162 1142039 1137229 1207093 1268656 1298798 1340195 1386833 1440469
7395 1440469 1495873 1503900 1541149 1583254 1645638 1689029 1779561 1850714 1925740 2055942 2232479
7384 2232479 2379582 2511584 2663700 2864971 3036221 3254864 3526114 3885285 4308036 4866587
7374 4866587 5394910 5704985 5647265 5302855 4844397 4388420 4064933 3905887 3873483 3874765
7364 3874765 3987669 4245783 4580547 4995111 5594957 6424490 7580919 9153409 11237761
7355 11237761 13889085 16809914 19239095 20634446 20919349 19925806 17851190 15445693
7347 15445693 13269995 11558206 10182466 9066327 8214155 7592843 7133337 6805005 6651610
7338 6651610 6621391 6620804 6685785 6828803 7055592 7376108 7752279 8151636 8655477 9216221
7328 9216221 9868074 10749473 11863982 13288841 15035570 17136380 19927905 23809014 28897265
7319 28897265 35595129 44403878 55496589 67908682 79650993 89344260 97069202 102361229
7311 102361229 103745235 101676276 99329066 99913938 104166822 109785295 114029105 117009602
7303 117009602 120514034 124854804 128013493 128875653 128513852 127076105 123451458 118099419
7295 118099419 113372558 110869190 108972566 104306390 96647282 88772509 83389986 82070885
7287 82070885 85181256 91596283 98410170 103004731 104743731 102427444 95468829 86335640
7279 86335640 78251176 73147090 71917675 74389632 80241718 88346143 96606829 103391413
7271 103391413 108324738 110929108 111130983 110713027 112048067 115797250 119728604 121557337
7263 121557337 122365266 124987423 131607722 141756929 152164786 160307722 165958467 168210402
7255 168210402 164853735 154393090 138679233 122302509 109057436 100829326 98079916
7248 98079916 100627356 108074653 119168881 131414238 142545244 151051606 155282144 154897591
7240 154897591 150939602 144502695 134855833 122678225 111156657 103191863 100274672 102729284
7232 102729284 109620695 117924230 123643091 126280037 128947602 134249171 141739084 148795605
7224 148795605 154321220 158935983 162164749 163296107 164206239 167916332 175573324 184555374
7216 184555374 190766649 193381383 194628435 194532717 190960083 183776740 175556368 169356788
7208 169356788 165979619 165255648 168345378 176204918 186162076 192657010 192307866 186568882
7200 186568882 178669342 169364807 158468650 147590819 139409188 135107941 133054528 129982294
7192 129982294 125096121 120505370 118370784 118130566 116886141 113329603 107835344 100142981
7184 100142981 90290717 79579643 69649608 61477675 55313777 50820587 47747503 45851201
7176 45851201 45038542 45247788 46353040 47806195 48548136 47942266 45980514 42838013 39190625
7167 39190625 35752153 32913686 30720925 28942875 27473352 26157021 24992965 24055723
7159 24055723 23328605 22691136 22249535 22056088 21986787 22089703 22468299 23268065 24380223
7150 24380223 25697531 27176871 28463482 29027056 28708902 27523740 25493586 23007325
7142 23007325 20506330 18300827 16547729 15134905 14047397 13205767 12530814 11969801 11458355
7133 11458355 10912833 10372140 9850202 9354466 8958925 8607750 8282518 7941650 7651665
7124 7651665 7446516 7263228 7072000 6889793 6769526 6628202 6556967 6524609 6552888 6702940
7114 6702940 6833877 6997787 7089243 6922772 6540210 6134049 5798507 5486668 5245968 5065461
7104 5065461 4866360 4711247 4614423 4487925 4399143 4269390 4206597 4108419 3984411 3867064
7094 3867064 3782272 3751066 3690965 3593494 3566856 3497977 3417474 3391589 3359634 3315212 3274968
7083 3274968 3214454 3092160 3090280 3073018 2976721 2910331 2846218 2852948 2803247 2707072 2644747 2610612
7071 2610612 2632591 2647144 2568162 2480342 2456938 2433456 2425408 2350136 2357341 2424887 2454178 2444022
7059 2444022 2430855 2412899 2357765 2259051 2163918 2111199 2100997 2048134 1967277 1917524 1902869
7048 1902869 1863677 1843409 1858191 1926172 1980159 1994024 1950376 1933836 1934872 1915507 1934148 1945328
7036 1945328 1947081 1941188 1894327 1889173 1839929 1817085 1793721 1750697 1778678 1790816 1795595 1833431
7024 1833431 1835176 1845390 1850540 1839284 1819103 1784741 1805992 1793434 1757985 1615171 1490024
7013 1490024 1430018 1417688 1425222 1415428 1342915 1292336 1253172 1244462 1212560 1166710 1117455 1095806
7001 1095806 1091618 1091093 1100346 1033178 1015288 1009532 992629 948691 926829 945699 984875 960161
6989 960161 966181 996390 970609 965669 894109 803415 805767 821342 824542 850527 894732 906805
6977 906805 875068 908149 940713 937864 958005 891923 899683 851500 827047 816801 729014 659423
6965 659423 683202 679442 702961 702591 671049 633170 585125 565433 461717 433025 427877 477757
6953 477757 496964 525486 560652 632585 646419 664611 639993 580035 501341 433827 386070 360322
6941 360322 386403 416026 397421 370545 338400 369935 451312 451534 358683 334366 330860 351145
6929 351145 332771 319224 321582 340847 310991 266550 211538 181411 184893 131020 110918 108596
6917 108596 100630 99007 50257 -2877 -47798 -61271 -63430 -10956 -39631 -72940 -50175 -49074
6905 -49074 -79655 -114452 -158482 -165735 -180088 -128764 -103563 -137986 -180844 -186192 -195667 -181053
6893 -181053 -108509 -104380 -169886 -222886 -202699 -202494 -260582 -259510 -260479 -222200 -186569 -217161 -203792
6880 -203792 -99324 -82212 -61058 -24096 -32152 -30943 -47126 -66195 -48129 23083 71048 57877
6868 57877 57884 81599 81025 59038 71965 98848 126942 137767 125861 166590 227611 276914 329841
6855 329841 295006 213576 181938 190379 206370 195674 171650 136831 141372 110857 131450 194436
6843 194436 240143 242891 201219 150841 151524 138866 143227 213021 273712 300170 347397 409670
6831 409670 478709 521400 482928 441999 460483 397196 356653 308967 311990 381545 429649 453119
6819 453119 460379 499317 468036 401669 403812 338209 269782 227574 226755 320074 305420 249887
6807 249887 210244 171019 137730 174658 216411 275542 328013 288883 280438 376534 496897 534889
6795 534889 514439 513506 534286 654693 733396 742272 801002 820834 717826 614389 551148 509780
6783 509780 478403 457186 471726 521517 523408 538509 465073 478390 517702 634802 733720 757445
6771 757445 788968 824483 827358 816456 777570 710882 626890 587598 536352 522820 576254 585994
6759 585994 554535 455729 393778 409246 399147 446437 463911 541296 604687 635743 660911 704396
6747 704396 707856 724868 782003 746937 704526 695926 690124 696499 689558 682454 687140 678439 648240
6734 648240 713238 787813 944748 942799 977930 1000335 953881 900631 852142 824583 760753 741188
6722 741188 658168 620310 618103 589165 593478 579745 584464 620012 571012 525866 520807 550378
6710 550378 624970 675319 671811 654811 637471 647167 682069 753026 785594 830289 789786 712080
6698 712080 685859 667960 575946 568123 573343 560914 566218 626520 637648 660961 619484 538729
6686 538729 519844 564010 657595 650553 643417 605685 556312 507766 544277 587006 623251 595487
6674 595487 563810 550105 471480 390910 338295 313609 359514 393402 415445 422544 376848 269214
6662 269214 269660 310110 293645 262491 243397 293391 339500 344059 395078 389679 398715 431759 430597
6649 430597 359185 363413 374313 348973 365640 408800 393279 395460 453557 446962 431024 432434
6637 432434 419297 400924 368593 266552 228516 223560 240492 243874 204788 205676 220114 219383 233144
6624 233144 206077 191211 128935 89615 89123 102488 108729 133380 156169 212031 267347 262396
6612 262396 200000 224890 207926 180812 72543 -5776 35869 71465 127817 142740 139891 138383
6600 138383 150627 108658 94867 103762 140527 165649 194236 187026 140537 117785 68190 53541
6588 53541 24612 46462 56743 81898 54005 36017 8047 13240 41698 49426 108945 143095
6576 143095 133094 98086 109477 94194 71137 75449 102652 146644 180764 164859 154677 96441
6564 96441 66334 68122 60488 22034 76520 97171 110165 135743 121584 75157 54144 57943
6552 57943 49922 71233 62801 70398 92030 95111 66754 36603 18375 77016 140859 84583 23504
6539 23504 6774 17652 21070 -9863 475 5941 57515 80349 60136 73786 86328 42525
6527 42525 -30017 -21840 22423 16672 46296 64970 82861 112011 126281 61682 10881 50813
6515 50813 118314 131285 95036 72754 60890 45509 22677 61795 117975 79275 64766 62295
6503 62295 35823 27022 17300 6084 32868 30462 10532 -72814 -70633 16329 51689 38820 36250
6490 36250 42586 36465 12895 8289 50769 81189 144130 118701 66641 51018 21718 10774
6478 10774 -13696 -50610 -60610 -65421 -31285 3656 17984 -5832 1691 -3421 14111 7622 69739
6465 69739 73081 65165 89629 105087 119426 73826 29708 -18808 4790 3069 -15898 -36931
6453 -36931 -36113 28694 76387 65558 29869 -6259 13149 37652 42203 32643 51662 78433 56273
6440 56273 58308 51887 -9509 -53078 -44470 -19661 -2048 -14817 -19706 3781 15972 3278 16165
6427 16165 22549 10100 -27907 -6972 44444 22822 24774 68285 110691 73888 32726 39334
6415 39334 58653 63294 73061 81732 107128 100636 79094 46736 38297 44977 59916 12952 25524
6402 25524 69722 23400 -20975 -30101 -19738 7778 12799 16410 -16340 1167 77814 99817
6390 99817 113457 78640 64292 20669 -30708 -53441 29737 48907 -5732 -11208 29796 31170
6378 31170 15513 -15839 -4418 28130 26679 43981 5326 28739 -6823 2370 6611 43868
6366 43868 -12896 10670 37464 56281 39001 48645 56949 40517 44515 32978 40919 20317 -28251
6353 -28251 7819 67260 58944 30238 27296 8192 -22566 -26227 -66969 -146999 -174293 -129734
6341 -129734 -105828 -95015 -42778 -52946 -54698 -22861 -30873 -40024 -33237 -52737 -46396 -58187 -13838
6328 -13838 -12767 -48244 -51129 -1305 33564 83577 79251 74093 34476 10610 157 17628 -13374
6315 -13374 -28572 -41901 -26728 -6978 10599 82643 108463 105201 139936 116466 133797 92577
6303 92577 784 -43516 -5390 55263 31561 -47079 -49107 8931 33946 16472 17161 37920
6291 37920 86359 26865 28849 66708 11603 -12892 -55095 -71403 -124220 -122989 -65775 -33270
6279 -33270 -13899 -48817 -24731 -64374 -53613 -26461 -34955 -27579 -15037 -17070 -34895 -1050
6267 -1050 26505 -27842 -72670 -37727 -26656 -52354 -9976 35617 20879 -15634 -67059 -93066
6255 -93066 -101573 -69276 -39005 -30220 -12068 17971 -184 -38538 11447 51952 27039 47929
6243 47929 89623 98483 94110 98041 73128 42506 56362 134246 130239 88038 30894 2449 49555
6230 49555 64047 47007 49440 27787 8077 10348 21198 36890 61691 78655 92821 33593
6218 33593 -2691 -6124 992 -18185 -22859 -14803 -33100 -941 37760 35083 13426 -21780 41491
6205 41491 53186 31475 50218 43126 22669 -18871 -3249 45519 76218 94665 137648 126388
6193 126388 116750 67015 29021 40222 -37940 -128855 -110271 -54663 -16602 30261 57388 -15403
6181 -15403 -41948 9583 54744 50739 61476 97791 77537 45037 34473 -17575 -39895 46895
6169 46895 48581 14270 9153 -42465 -96501 -57958 -20238 44269 38542 -23920 -81648 -57944
6157 -57944 -34759 -20120 -50863 -56578 -18977 -2877 -6920 -3774 21035 3065 -73063 -83062 -96895
6144 -96895 -100483 -82496 -45865 -954 -35845 -69788 -11917 44484 59449 6413 -29363 -60370
6132 -60370 -44029 -42434 -45453 -51641 -48919 -20265 1280 7327 -63710 -128958 -67523 -8459 4216
6119 4216 56529 35575 -29513 -82301 -105142 -83892 -103622 -62648 -82750 -63587 4835 -5717
6107 -5717 20917 1467 -686 -17596 9323 3911 22209 -10042 -13380 -35599 -19240 14244 13478
6094 13478 25615 -9739 -5363 -12079 -31050 17342 -2941 -38774 -19629 -38130 -48479 -27597
6082 -27597 -70140 -107484 -58025 -43262 -64050 -54977 7691 33689 38768 78903 73070 52640
6070 52640 42003 -3110 -25149 -28537 -21654 -35054 -78686 -45352 17969 45375 29270 63941
6058 63941 89736 75553 65951 78772 54992 26105 -29421 -73312 -60250 -21720 -24840 -26204
6046 -26204 915 -16993 6440 21989 11435 -6236 16676 -27615 -39567 3626 42351 44154
6034 44154 35297 -2234 221 -9370 -44596 -60185 -80942 -8336 37570 32811 74110 60443 31258
6021 31258 57958 5209 -53177 -54259 -68852 -95398 -59896 -82541 -158122 -158888 -92730 -66543
6009 -66543 -48346 -37435 -29398 16691 24337 -3492 2524 72263 53403 19501 50686 45175 19196
5996 19196 57295 59836 83055 82663 46393 43863 -21663 -79883 -80880 -37676 -49522 -63278 -81024
5983 -81024 -86461 5930 83733 37230 -27299 -19225 -20911 -5188 17312 -640 -28337 -57347
5971 -57347 -65654 -30906 3321 40865 30320 2750 -7987 27521 15644 -1411 58983 47527
5959 47527 -18126 -13682 18868 -22795 -41104 -48193 -59055 -29399 -1934 -24403 -62491 -89708
5947 -89708 -92455 -82740 -118505 -112594 -107764 -63383 -54912 -76058 -82662 -52698 -40449 -26525 -13486
5934 -13486 -43046 -42062 -15040 -29540 -66593 -107895 -108494 -40288 -19411 -12153 -29903 -25107 -6749
5921 -6749 -624 -39162 -43518 -43274 -52282 -69079 -113376 -54216 13750 -20435 -51349 -44446 20763
5908 20763 53071 62544 52703 -24564 -49805 -27504 -36795 -47976 -45924 -23178 -10545 -24909 -18112
5895 -18112 -14492 21582 15473 6908 -21970 -27609 -37466 -4016 30971 -8493 -16888 -27652 -1090
5882 -1090 8926 19064 7245 1558 -33857 -36553 -33143 -62193 -75047 -22256 -35969 -67145 -34326
5869 -34326 -24624 -59523 -87387 -41054 1693 -19407 17861 9687 9788 19771 -37424 -77416 -56200
5856 -56200 -29896 -34991 -87776 -89890 -7169 -18926 -81767 -52018 -30902 -50164 -57748 -76159
5844 -76159 -89212 -64808 -28425 -57559 -46516 -59022 -40814 -19165 -18025 -55663 -111770 -129988
5832 -129988 -104343 -106160 -69937 -53688 -130665 -115378 -48028 -26871 23311 -35290 -131943 -101966
5820 -101966 -35244 -60180 -151480 -142076 -102576 -93998 -93567 -22489 21179 20749 1633 10818 6999
5807 6999 -12349 10072 54527 25909 -24777 -45879 -88013 -50771 -30481 -49444 -63238 -49613
5795 -49613 -99425 -136976 -119226 -87173 -58577 -40178 -18481 -50324 -34744 -1967 -16243 -24689
5783 -24689 -16213 6952 32744 41690 9614 -41019 -27021 -26418 -16600 -30719 -37644 -88283 -95976
5770 -95976 -115711 -88088 -45142 -46076 -110285 -104579 -50267 -18149 -28211 -56713 -114194 -118891 -95930
5757 -95930 -24496 14116 313 -12966 -15881 24013 20499 223 -3569 -18838 -77325 -75249 -40079
5744 -40079 -48677 -24507 45327 53943 -4816 -47357 -35066 -17018 -47941 -77874 -45696 -18278
5732 -18278 -25958 -39042 -28343 -13850 -92028 -112708 -108835 -60494 -24233 -19687 -12827 -62400 -92279
5719 -92279 -101779 -113320 -88396 -23927 -10412 -56269 -67561 -20380 40825 38896 27837 63209
5707 63209 12521 -43600 -43031 -45248 -54807 -80026 -94626 -54094 -20723 -13147 -41307 -40918 -33370
5694 -33370 -67794 -47883 -48334 -26728 11444 25450 -12966 -69276 -57785 -22390 -39207 -41030
5682 -41030 -32287 -7316 -1894 40802 29749 -553 9395 12510 18996 -12290 -49935 -27331 20129
5669 20129 71732 44586 6086 4601 -26534 -31362 -29724 64993 102961 96742 76767 30199 2688
5656 2688 -21798 -10226 -7924 -10324 16213 71302 24898 -22039 -23045 -406 10570 25370 15596
5643 15596 -9612 -26629 -89005 -94781 -47690 1496 42934 25527 -65499 -84286 -33986 -52333
5631 -52333 -42416 -56283 -35245 -51108 -47199 -6525 37470 4430 18799 -13080 -54637 -16865
5619 -16865 -2205 14570 22011 9419 -37372 -71674 -108269 -25282 32255 10166 -50021 -36255
5607 -36255 -24799 -20535 9472 1297 -22696 10651 30766 42026 27892 -22239 -19595 15970
5595 15970 -271 -45097 -94822 -49399 -35839 -21791 -3947 40598 24339 -8297 -38619 -39661
5583 -39661 -52466 -39225 -17685 -82232 -74900 -7130 2275 -16521 -90107 -69746 -38918 -37741
5571 -37741 -9756 -14034 -43130 -40012 2855 54745 56646 -21688 -24305 4286 -15059 -17928 -9393
5558 -9393 -22227 -1513 -19541 -24245 -41895 -91684 -108643 -55287 -30175 -38810 -115787 -161286
5546 -161286 -81556 9913 105260 122375 27751 -14626 11420 -44070 -104175 -136853 -69140 53783
5534 53783 118213 93136 130584 119905 59952 -1080 -8327 -10384 -26718 -22790 -8878 -15093 -36955
5521 -36955 -26084 -344 39207 50669 17417 -14148 -22308 -20305 -45083 -76243 -46810 -44907
5509 -44907 -51922 -60296 -29360 -19799 -31018 -14448 25125 -30003 -41167 -1298 9150 -56752
5497 -56752 -80707 -43543 16748 97562 69550 58669 33819 -13030 -41909 -19574 40958 60570
5485 60570 34784 11418 50534 9837 -42805 -43211 -5080 -8527 -54471 -75194 -75850 -109812 -133691
5472 -133691 -104069 -68300 -64036 -56645 -50612 -30375 24072 -4289 -24591 44529 12616 18244
5460 18244 1089 4403 -25518 -58368 -74189 -106277 -75696 -83775 -48512 -36484 1182 7254
5448 7254 37421 90206 69247 29698 22144 25714 37684 81959 64081 48919 45427 -3037 -17865
5435 -17865 -9943 -23175 -15345 -12055 23116 18224 -48004 -8808 21983 -864 -30742 -50713 -34650
5422 -34650 -66683 -71513 -58618 -42932 -46628 -100359 -133278 -103176 -95388 -84222 -71415 6382
5410 6382 56341 74929 24334 1736 5073 34658 21469 -80640 -143254 -134788 -82449 -36667
5398 -36667 -3897 -20084 10992 -6825 -37566 -25856 -21074 -28895 -37629 5228 24524 7221
5386 7221 29723 35388 17665 -21636 -52649 -29237 -5514 -16477 19702 32262 12436 4370
5374 4370 46637 18665 -33607 -81590 -47913 -17491 -39374 -47518 -83509 -109571 -54127 -37462
5362 -37462 -57781 -57567 -69831 -97426 -75463 -49359 -30056 -43000 -33990 29821 26354 -39906 -40245
5349 -40245 -19524 -66858 -45531 -9585 -23642 -48867 -8532 -6301 -10216 -4893 -576 -46829 14157
5336 14157 25141 -945 -32333 -61794 -59428 -63214 -26843 12080 4459 -43383 -26282 14590
5324 14590 -66906 -45611 66672 129679 143855 128467 88917 -10986 -44879 4893 -56629 -99187
5312 -99187 -80273 -52044 -74127 -32046 25774 17756 -3355 24761 41204 40469 71578 101259
5300 101259 75811 13553 -3766 -5274 28730 -12884 -37534 -78117 -102756 -101513 -94825 -79890
5288 -79890 -7865 29057 6818 -38684 -50364 -32169 -14096 -40467 -98301 -100782 -75022 -17149
5276 -17149 -225 -14190 -71986 -108145 -91841 -89837 -64910 7906 29182 27723 23333 20152 25617
5263 25617 -33689 -117731 -78064 -42106 -26315 -49170 -104383 -133266 -104698 -44876 -10662 -623
5251 -623 31580 26151 -22720 -68751 -59761 -43193 1899 31176 18323 -29102 -83535 -87807 -31255
5238 -31255 -53876 -107198 -86985 -47425 -22488 -115007 -101787 -56398 36728 6592 -82627 -69079
5226 -69079 -50751 -29013 -27624 26971 23718 -9501 -66957 -104447 -77825 -18026 -6050 -25129
5214 -25129 -6148 -19732 -12245 -46789 -55494 -65374 -54038 -36067 -29517 -26536 -33088 -896 -24154
5201 -24154 3357 4534 -26774 -38653 -61183 -19439 10253 6126 -1565 -10791 -11239 -52521 -20642
5188 -20642 27581 -21571 -41892 -28527 -73503 -92551 -72418 -72991 -67735 -11098 42353 15419
5176 15419 -45855 -88575 -99224 -84086 -70919 -69567 -62790 -80264 -96401 -72940 -40135 -49330
5164 -49330 -9205 -56101 -85763 -86267 -110937 -139076 -101246 -34194 -30169 -7986 -40028 -54916
5152 -54916 44994 84815 68401 67755 41575 40348 5726 -11847 29022 102722 82706 56895
5140 56895 -4781 -23908 -72026 -76941 -24128 3883 94876 127988 85619 59175 37057 -12735
5128 -12735 -45895 -84317 -104197 -138958 -120528 -83837 -102276 -113889 -69307 -49355 -64659 -24113
5116 -24113 7880 9509 13768 -1242 -21771 -12254 9940 46636 48923 36591 19399 12602 15985
5103 15985 22250 2192 -22454 -37941 10837 60384 103628 89722 93482 72736 35517 -17807
5091 -17807 -56140 -32808 3771 12491 -48648 -90968 -44302 -43 22156 8915 -24809 -40753
5079 -40753 -32332 -41246 -72129 -69813 -39893 -23166 -47850 -26096 6679 -533 35905 58798 -3988
5066 -3988 -38001 -4145 -2705 6484 8163 23686 44015 -648 11050 43394 28955 46367 18378
5053 18378 -19489 14644 35720 992 -3739 10290 -6925 -11998 -48726 -65686 -43925 -56331
5041 -56331 -48393 -72786 -91237 -135560 -78172 -34340 -53683 -83584 -84621 -55600 -57040 -79745
5029 -79745 -105591 -128914 -79764 -108754 -66271 -39350 -84328 -115143 -137399 -132893 -72848 -32498
5017 -32498 -30401 -32428 -31079 -59144 -83912 -86718 -71602 -75217 -53065 -25043 -57472 -38428 37182
5004 37182 60127 38109 9631 67953 71955 40789 -4242 11856 26201 3897 -48253 -73217
4992 -73217 -31982 -3961 -6487 -14862 20596 33855 -8894 -49898 -37291 -69985 -106587 -112470
4980 -112470 -116588 -112005 -53384 -19209 -43167 -86995 -77012 -83704 -83564 -145294 -156103 -127439 -89857
4967 -89857 -108970 -111995 -85640 -25450 7287 48880 18412 -18878 -46084 -23143 3982 -7575
4955 -7575 -58352 -65937 -68115 -81372 -95057 -92162 -96815 -67673 -88223 -115702 -73890 -40329 3077
4942 3077 -7956 -43972 -19889 -38694 -54896 -5030 57079 39470 29493 22014 16426 -2614 3470
4929 3470 -14623 50356 86626 61943 34847 -9026 -45535 -60545 -78603 -24228 7032 -50103
4917 -50103 -24909 -1713 -3820 -76094 -111652 -88711 -46372 -23502 -5490 16105 -198 -45297
4905 -45297 -85411 -103812 -75256 24072 7473 -19484 -42297 -55566 -76796 -123492 -118191 -96751
4893 -96751 -67992 -37672 -40038 18812 26737 18025 -13784 -33380 -69438 -65262 -69282 -27328 5581
4880 5581 -22487 -66702 -110673 -117359 -8042 29955 -34451 -19513 19365 23658 17226 20627 -36573
4867 -36573 -11901 -36091 -59179 -8679 -62932 -90110 -77364 -12249 56437 89735 75825 86566
4855 86566 116812 114545 72315 58208 67146 53038 22455 -9492 -17648 -55169 -51607 -54514 -18895
4842 -18895 11142 -40273 -58708 -64366 -54574 -37546 -33359 17563 4652 -21160 22018 57237
4830 57237 28437 19317 -11855 -34074 -39805 -52908 -41371 -77954 -104993 -137599 -127391 -112193
4818 -112193 -69002 7550 -21809 -112853 -190468 -152659 -74484 -91210 -74240 -43860 7636 -23981
4806 -23981 -27626 39039 20166 1968 4759 16421 82353 75166 60480 49759 79271 68960
4794 68960 1302 31683 21541 37556 79572 83861 30253 3613 -16762 19934 4557 -33532
4782 -33532 -39397 -13022 77455 95592 71507 21009 -25967 -68185 -60530 -75891 -78726 -73700 -67783
4769 -67783 -51446 -9785 -21852 -49111 -63840 -48879 -21639 -9953 -26921 -24902 -95036 -102848
4757 -102848 -97014 -104690 -106591 -99773 -101391 -83318 -41067 -46308 -14576 26213 -12838 -31091 -404
4744 -404 -42876 -91882 -62534 19415 111109 110346 77866 70651 11432 -3262 -34724 -44066 -26859
4731 -26859 -58554 -38677 -7848 -28212 -21519 -20791 -29627 -16484 14413 -6628 -55158 -75959 -22931
4718 -22931 21746 16422 -4854 -45820 -81833 -31200 -45448 -15495 -32709 -51659 -48781 -86250
4706 -86250 -98174 -50861 -48971 1210 43929 5915 -7432 -39664 -78293 -67475 -69960 -31153
4694 -31153 48263 29429 26300 19211 2146 17928 8400 -21614 -36805 -65734 -87587 -89863 -101936
4681 -101936 -57510 -56360 -84161 -51860 -57323 -54021 -61659 -60211 -78527 -63019 -14210 -27497 -40984
4668 -40984 -46245 -63252 -97289 -67055 -41771 -54257 -27428 6908 64999 57973 32144 11893
4656 11893 -18673 -25751 -11683 22731 -6388 -21763 16835 23965 6972 -364 -7087 -11824 -2721
4643 -2721 -74123 -89571 -60565 -18766 54057 92468 58170 -9503 863 -11827 -62941 -66928
4631 -66928 -29094 3139 -5760 -51576 -47520 -18530 -26183 -29382 -60081 -36557 20261 18925 13720
4618 13720 -7058 1266 35340 90469 75428 5732 -15586 -50168 -45910 -51499 -15368 -5511 -16006
4605 -16006 -18205 21876 55036 44156 -33445 -79084 -84764 -67816 -34066 -16442 15657 30067
4593 30067 9443 -11946 -13487 -12600 -43980 -37418 -44984 -3681 14683 -18191 -14867 -6973 -34238
4580 -34238 -33036 -16813 38359 26852 9510 -78136 -93153 -59092 -18158 19172 48461 43132
4568 43132 -13901 -47357 -82494 -34021 -59778 -59142 -47937 -19192 10648 -18474 -86182 -64496
4556 -64496 -39177 -27835 -62409 -81555 -91342 -88818 1549 42825 18552 44535 74285 23572
4544 23572 29303 17265 -11593 17793 18313 -24977 -22732 -18769 34628 47940 22365 10615 21832
4531 21832 26359 -5417 -50511 -63384 -27453 -37941 -21543 -30867 -36986 -23257 24555 31143 -30049
4518 -30049 -59718 -38271 -67420 -98307 -63442 -18578 -1161 26907 38752 -36529 -58076 -25390
4506 -25390 -14828 -24332 -22143 -54608 -49185 -29673 -42988 -33307 -2909 13377 2835 -34649 -14815
4493 -14815 -49822 -58054 -117891 -107190 -56889 -37257 -96978 -92200 -125269 -155110 -87752 -81685
4481 -81685 -117582 -116276 -77084 -57424 -13409 19007 20662 -17818 -65468 -11551 36188 -21672
4469 -21672 -6240 -10080 4520 16379 4020 33301 41450 -16575 -72610 -85410 -88118 -63141
4457 -63141 -86331 -94418 -73805 -45937 -52185 -30873 -57651 -81931 -62310 -44481 -47788 -55634 -40238
4444 -40238 -69592 -83890 -104483 -69362 -70416 -91485 -62955 20438 -7233 -51562 -59951 -34594
4432 -34594 20582 -6427 -58802 -44380 22170 76477 51576 33629 56631 72465 57213 51531
4420 51531 58703 64282 55632 33171 43971 34715 8866 -33296 -37052 -18502 -616 -14342 -33473
4407 -33473 -27993 -10335 -29427 -59350 -72957 -49259 -28658 -19268 -43539 -78341 -56142 -78573
4395 -78573 -103783 -67037 -63025 -34602 -20592 -30293 -9794 -66412 -157037 -110650 -45807 -67720
4383 -67720 -93949 -101021 -100250 -105858 -79272 -51277 -38089 -69582 -76908 -14006 4721 2698 -13450
4370 -13450 -69305 -93905 -89751 -116643 -53612 1343 -25843 -39334 -28016 -18894 -4883 -216
4358 -216 -22768 -43217 -68672 -55894 -73141 -66323 -28774 24450 47547 1181 1793 -18389 -2890
4345 -2890 -55867 -70232 -46025 -38436 -64754 -36292 29110 30369 17628 -9696 -18162 -54624 -2406
4332 -2406 1027 -9856 -71593 -128933 -125636 -89088 -85162 -77284 -90483 -81738 -57321 -48148 -66131
4319 -66131 -88071 -39071 -26720 26801 9723 -11556 29188 -2943 -71856 -95143 -56595 -46761
4307 -46761 -67373 -53567 -42622 17627 -4950 -26272 -9170 7120 54890 46244 -2179 -86898
4295 -86898 -122453 -123611 -71538 -29625 -16907 20685 4387 -86241 -63763 -51030 -42627 -44761
4283 -44761 -24455 3765 20512 31818 -10815 -18476 -16010 -15825 -15449 -66504 -77825 -84948 -110077
4270 -110077 -109202 -132983 -113211 -90013 -50217 -40499 -31606 -8981 54609 71968 62636 34081 46101
4257 46101 28768 300 -7267 -38989 -59479 -6097 2164 -18695 -28953 -27972 -78258 -77377 -111962
4244 -111962 -73459 -66391 -24315 -16568 -5223 10976 15430 -41771 -79300 -75652 -75492 -72647 -98131
4231 -98131 -116731 -81936 -40578 24840 68054 78752 27555 -54734 -63053 -38140 -31809 -30653
4219 -30653 -16329 -39758 -12763 27977 -8088 -20862 -28119 -81444 -116958 -108070 -121311 -125878
4207 -125878 -93251 -35268 -46858 -36550 -31375 -11596 -22845 -47876 -41788 -8156 19877 -8486
4195 -8486 1900 -35508 -84527 -55336 -21619 18091 -28834 -52614 -84254 -17526 -19005 -68017
4183 -68017 -118062 -104988 -122681 -139619 -97930 -76333 -66331 -42455 -5144 35055 42355 68585
4171 68585 29841 -41703 -69374 -99151 -98068 -100518 -62644 -25705 -47821 -94615 -71192 -68512
4159 -68512 -66714 -15293 -17385 -47201 -36483 -46916 -78776 -73848 -72679 -80861 -108889 -95351 -52119
4146 -52119 -41879 -17302 6891 42582 67105 64224 35529 52261 21209 35090 42779 -14412
4134 -14412 33390 35829 5541 -21476 -78259 -73320 -47252 -83104 -32103 -22502 -19247 -17077 5088
4121 5088 -26464 -60159 -98943 -115458 -87994 -93914 -86016 -76471 -50769 -6220 -16165 -3055 23795
4108 23795 -2976 -24670 -68542 -102140 -109142 -97040 -107350 -92927 -69818 -10766 -15852 -57519
4096 -57519 -65010 -21782 -9648 -48517 -28779 10476 28194 -1902 -17431 -84084 -132009 -121014
4084 -121014 -86220 -38037 1056 37948 23356 18819 46458 35576 -8226 -43034 -29860 -19955
4072 -19955 -10850 -7718 -18663 -44726 -10838 -13757 -37007 10553 58269 68888 29263 -15483
4060 -15483 -24135 -680 -6999 -16945 -24646 -47580 -22250 19069 -16729 -16860 -5318 -74036 -115303
4047 -115303 -57135 -7221 -177 -19658 5234 34398 27158 42234 -8971 -66661 -43457 -18782
4035 -18782 38664 56388 37857 -17483 -87410 -59607 2038 -36476 -24550 -24855 -32004 -27815 -5670
4022 -5670 -54929 -24747 -38074 -25753 54115 87039 75852 -35 -24635 -2324 2775 24107
4010 24107 -17599 -9454 -67879 -58602 6656 26348 17502 61980 78122 69675 64144 34751 75804
3997 75804 94218 60398 2267 -47345 -89959 -102779 -102742 -55570 38549 79133 87684 34601 -30052
3984 -30052 -30324 -510 17553 -31363 -52186 -17459 -39353 -46269 -47300 -67179 -54319 -41079 -4707
3971 -4707 -28387 -59778 -69753 -9793 -37357 -33790 34511 38153 46028 -16995 -90762 -99105 -115700
3958 -115700 -144319 -131809 -99555 -63422 -24547 -17808 -27867 34990 25184 -48603 773 -14377
3946 -14377 -26722 -8193 -23312 -22189 11125 44869 63869 -6455 -52717 -43477 -6552 23616
3934 23616 12600 35070 -4377 -29774 -36774 -24927 -15089 42960 72180 48999 62205 71332
3922 71332 55661 -7841 -59514 -68609 -11202 47307 69202 15234 -50063 -103125 -101706 -96039
3910 -96039 -54532 40225 31028 19489 -3688 -39139 15043 26227 -21182 -67710 -130381 -106866
3898 -106866 -64236 -22087 30751 -1766 -2873 24803 -6060 -48272 -27407 24452 57876 44726
3886 44726 -32877 -75192 -73476 -52633 -25037 13154 36205 -10388 -6349 8600 30934 62143
3874 62143 -4637 -72343 -94429 -84774 -93855 -76866 -99257 -95444 -68406 -84992 -99710 -54431
3862 -54431 -21006 40916 10355 -65800 -49083 -9428 -13289 12651 105098 102034 17462 -7900
3850 -7900 24201 20657 43950 22464 34815 90986 115507 73547 23361 -45513 -31606 -20069
3838 -20069 -52813 -57255 -38494 5506 20855 26507 40325 56783 18147 -1757 -38399 -96655
3826 -96655 -52677 7915 17040 56997 88097 62629 -23335 -40468 -53200 -96299 -58626 -34268
3814 -34268 -3825 7231 -8546 -36205 -65408 -87089 -118515 -175463 -197901 -100345 -63918 -91401
3802 -91401 -45088 -50734 -93452 -120413 -101522 -113132 -86927 -95967 -108111 -77090 4627 46627
3790 46627 21932 -22037 -56371 -49534 -18845 -24825 -32295 -65708 -58174 10084 13705 -7161 -40721
3777 -40721 -97404 -61993 -19865 -43753 -63381 -70970 -42542 3464 -5029 -37441 -31813 -63104
3765 -63104 -57182 -21820 26302 58753 28358 10943 -49123 -67298 -49939 -17689 -45392 -99456
3753 -99456 -89988 -48260 -47554 -46338 -57324 -66226 -44794 -17139 -59027 -80605 -87752 -23208 26345
3740 26345 3139 -60533 -70129 -92020 -80160 -80225 -58502 -29060 19116 17059 37513 29326 -6467
3727 -6467 -62989 -74391 -18378 -30615 -23013 -35861 -33861 7836 17438 -6965 -15742 -29776 -14323
3714 -14323 -32581 -6953 -66343 -114672 -65114 -47217 -55211 -6139 -5660 -6524 668 8128 31785
3701 31785 -2359 -59793 -15520 -53143 -67014 -1250 33134 54130 60251 53028 23630 37597
3689 37597 27849 12809 -34524 -58695 -73793 -54219 -39949 -17057 -26628 -4985 -11643 -48481
3677 -48481 -10101 -28745 -74733 -65201 -68112 -108129 -77299 -21471 28334 -21938 -26908 -40693
3665 -40693 -21862 -49704 -85839 -134600 -115228 -165932 -189936 -193233 -99729 -36530 -38333 -41831
3653 -41831 -25889 -14197 23297 24290 -39761 -107338 -90006 34591 22122 -28882 -58299 -27161
3641 -27161 17604 7583 -46556 -25342 -22823 -23672 8902 -10553 22493 10703 -614 31437
3629 31437 15286 -53388 -67584 -45953 -52002 -60838 -104048 -115578 -78365 -64317 -83465 -118472
3617 -118472 -106357 -64931 -31409 -8484 8984 -27751 -31425 45361 10646 2195 -28196 -46768
3605 -46768 -63505 17167 -3949 -47354 -57825 -55201 -8161 48997 56553 -7938 -51402 -37437
3593 -37437 2664 -1777 -73162 -54483 -16225 -41522 -66638 -56088 -31728 -92902 -72529 -72247
3581 -72247 -57889 -14563 -52257 -97416 -117309 -97243 -61569 -69738 -9574 13319 36405 22834
3569 22834 -7234 -17745 -28072 -33778 -3965 590 -18148 -15705 19725 -10401 -61563 -25242
3557 -25242 -32013 -129984 -132956 -115168 -99123 -93292 -70930 -100611 -115157 -43373 -17089 -79768
3545 -79768 -70060 6522 -6162 -28928 -52031 -75190 -67046 -74198 -69778 -45789 -26324 -32823 -25728
3532 -25728 -22236 -29702 -26498 -20216 -41998 -19847 7602 18895 53811 51193 52210 20823 -31583
3519 -31583 -59362 -33016 -29851 -62865 23981 46905 8024 21856 -30804 -49367 -40655 -50566
3507 -50566 -58954 -47055 -61078 -26674 -23322 -77268 -42913 -29417 -22349 14935 88548 41348
3495 41348 30404 23124 -1857 20640 -2861 -33329 -42866 -43633 -49869 -72497 -86997 -60049 -30767
3482 -30767 -25558 -52323 -32082 23691 5537 25754 13971 -27225 -90808 -90746 -40792 -2132 -238
3469 -238 8527 4678 -10334 -50314 -70108 -84105 -47273 -54287 -84008 -83153 -100780 -99366 -158539
3456 -158539 -176887 -146755 -42620 -17090 16266 12298 1999 6876 41857 10531 58335 52475
3444 52475 -6043 -54740 -71856 -70201 -30546 -16655 -17772 -32344 -72342 -50966 9685 23046
3432 23046 21945 21828 45238 62393 38272 62744 50829 53509 61820 25353 -34050 -42153 -62183
3419 -62183 -99695 -101308 -54390 -16198 -3149 19487 -13526 -45733 -41360 -45909 -43304 -37149 -74582
3406 -74582 -61228 -11518 -33387 -72413 -44725 -14368 -20966 -55494 -59822 -31458 -3634 -20129
3394 -20129 775 50482 56024 33892 12035 34383 1243 -8520 -20231 66954 6299 -18347
3382 -18347 -40515 -30696 -56263 -81495 -71341 -52519 15906 47050 56136 58843 56559 26968 40581
3369 40581 5651 -31905 -61146 -44292 22865 62673 43159 70020 33494 -2091 -37076 -40060
3357 -40060 -23071 -48560 -33442 4791 7777 38159 -12037 -25591 -39372 -73172 -77333 -50834
3345 -50834 -39332 -30574 -41964 23922 34608 -6060 15519 27304 54954 38052 -4689 -39254
3333 -39254 -99250 -63867 -48559 -37106 -49502 -60444 -59084 897 -10829 -5157 27381 75687
3321 75687 51670 -264 -8608 3727 21867 -37882 -81819 -96843 -74627 -36995 31546 25268
3309 25268 -26164 -35973 -33584 -46517 -65544 -54741 -30136 -53498 -48769 -13319 -17977 -9510 -6390
3296 -6390 -18840 9264 26196 64654 56057 9291 -25132 -32727 -35388 -35117 32759 51930 41018
3283 41018 -19853 -50777 -41741 -48676 -50856 14788 35139 14574 -19468 -64567 -79557 -107054
3271 -107054 -92838 -73932 -34914 -27215 -68595 -79525 -81473 -92499 -123698 -102850 -56753 -50951
3259 -50951 -83974 -18489 -24425 -46496 -40643 -32282 -45789 -48381 -115202 -123500 -67791 -49765 -25149
3246 -25149 -9777 -1773 -18540 -23110 39243 123512 146118 116404 33656 31919 81758 72925 41402
3233 41402 74476 63942 32009 88394 112371 84669 56861 11329 47330 38301 13097 -39377
3221 -39377 -90889 -92618 -83768 -20182 -50796 -74255 -104203 -74562 -89426 -56488 -33261 -5831
3209 -5831 16017 -15630 -1084 39582 49313 41303 24223 33386 46934 73142 84368 42428 22504
$$ [...]
##END NTUPLES=NMR SPECTRUM
##END=
