##TITLE=Analysis number 312076
Compound Code cc 34004
Book Reference 416/196
Project Code adrs
Chemist Name stevep
##JCAMPDX= 6.0         $$ Bruker NMR JCAMP-DX V2.0
##DATA TYPE= NMR SPECTRUM
##DATA CLASS= NTUPLES
##ORIGIN= Bruker BioSpin GmbH
##OWNER= NMR
$$ XWIN-NMR		Version 3.5
$$ Mon Jul 25 09:43:14 2005 GMT Daylight Time (UT+1h)  MAYBRIDGE\NMR@NMR_250MHZ
##.OBSERVE FREQUENCY= 250.131544655141
##.OBSERVE NUCLEUS= ^1H
##.ACQUISITION MODE= SIMULTANEOUS (DQD)
##.ACQUISITION SCHEME= undefined
##.AVERAGES= 16
##.DIGITISER RES= 18
##SPECTROMETER/DATA SYSTEM= dpx250
##.PULSE SEQUENCE= zg30
##.SOLVENT NAME= CDCl3
##.SHIFT REFERENCE= (INTERNAL, CDCl3, 0, 16.522)
##AUDIT TRAIL= $$ (NUMBER, WHEN, WHO, WHERE, WHAT)
$$ ##TITLE= Audit trail, XWIN-NMR		Version 3.5
$$ ##JCAMPDX= 5.01
$$ ##ORIGIN= Bruker BioSpin GmbH
$$ ##OWNER= NMR
$$ C:\u/data/dgb/nmr/ADRS/6460/pdata/1/auditp.txt
$$ ##AUDIT TRAIL=  $$ (NUMBER, WHEN, WHO, WHERE, WHAT)
(   1,<2005-07-25 09:41:56.38 +100>,<MAYBRIDGE\NMR>,<NMR_250MHZ>,
      <created by zg, POWCHK disabled, PULCHK disabled
       configuration hash MD5:
       62 19 C7 07 E1 42 D1 B7 37 6C 3D D0 77 39 F9 E6
       data hash MD5: 64K
       2F 2F 37 A1 1A F8 AD 5B FF 45 F8 78 9B D9 03 B9>)
(   2,<2005-07-25 09:42:35.10 +100>,<MAYBRIDGE\NMR>,<NMR_250MHZ>,
      <Start of raw data processing
       ef LB = 0.3 FT_mod = 6 PKNL = 1 SI = 32K 
       data hash MD5: 32K
       AB 5C 8B 03 A0 F0 4E E1 37 81 9F 37 87 03 C3 13>)
(   3,<2005-07-25 09:42:41.13 +100>,<MAYBRIDGE\NMR>,<NMR_250MHZ>,
      <apk 
       data hash MD5: 32K
       19 50 4C 92 6A 3A 29 49 D1 B7 E6 F8 5C 07 08 AC>)
(   4,<2005-07-25 09:42:43.13 +100>,<MAYBRIDGE\NMR>,<NMR_250MHZ>,
      <abs ABSG = 5 
       data hash MD5: 32K
       8E D0 B5 38 0A EA 6E AA DF A0 BE DE EC A8 72 8F>)
$$ ##END=
$$ 
$$ hash MD5
$$ 67 80 CD 24 80 55 FA 05 AF E0 49 61 10 CA 74 A9
##$RELAX= 
##$RELAX= 
##$RELAX= 
##$RELAX= 
##$RELAX= 
##$RELAX= 
##$RELAX= 
$$ Bruker specific parameters
$$ --------------------------
##$DU= <C:\u>
##$EXPNO= 6460
##$NAME= <ADRS>
##$PROCNO= 1
##$TYPE= <nmr>
##$USER= <dgb>
##$AMP= (0..31)
100 100 100 100 100 100 100 100 100 100 100 100 100 100 100 100 100 100 
100 100 100 100 100 100 100 100 100 100 100 100 100 100 
##$AQSEQ= 0
##$AQ_mod= 3
##$AUNM= <au_zg>
##$AUTOPOS= <3 >
##$BF1= 250.13
##$BF2= 250.13
##$BF3= 250.13
##$BF4= 250.13
##$BF5= 500.13
##$BF6= 500.13
##$BF7= 500.13
##$BF8= 500.13
##$BYTORDA= 1
##$CFDGTYP= 0
##$CFRGTYP= 5
##$CHEMSTR= <none>
##$CNST= (0..31)
1 1 145 1 1 1 1 1 1 1 1 1 1 1 1 1 1 1 1 1 1 1 1 1 1 1 1 1 1 1 1 1 
##$CPDPRG= <>
##$CPDPRG1= <>
##$CPDPRG2= <>
##$CPDPRG3= <>
##$CPDPRG4= <mlev>
##$CPDPRG5= <mlev>
##$CPDPRG6= <mlev>
##$CPDPRG7= <mlev>
##$CPDPRG8= <mlev>
##$CPDPRGB= <>
##$CPDPRGT= <>
##$D= (0..31)
0 1 0 0 0 0 0 0 0 0.06 0 0 0 0 0 0 0.0002 0 0 0 0 0 0 0 0 0 0 0 0 0 0 
0 
##$DATE= 1122280907
##$DBL= (0..7)
120 120 120 120 120 120 120 120 
##$DBP= (0..7)
150 150 150 150 150 150 150 150 
##$DBP07= 0
##$DBPNAM0= <>
##$DBPNAM1= <>
$$ [...]
##$SUBNAM7= <"">
##$SUBNAM8= <"">
##$SUBNAM9= <"">
##$SW= 20.6930455092707
##$SWIBOX= (0..15)
0 0 3 0 0 0 0 0 0 0 0 0 0 0 0 0 
##$SW_h= 5175.983436853
##$TD= 65536
##$TD0= 1
##$TE= 296.16
##$TE2= 300
##$TE3= 300
##$TEG= 300
##$TL= (0..7)
0 120 120 120 120 120 120 120 
##$TP= (0..7)
150 150 150 150 150 150 150 150 
##$TP07= 0
##$TPNAME0= <>
##$TPNAME1= <>
##$TPNAME2= <>
##$TPNAME3= <>
##$TPNAME4= <>
##$TPNAME5= <>
##$TPNAME6= <>
##$TPNAME7= <>
##$TPOAL= (0..7)
0.5 0.5 0.5 0.5 0.5 0.5 0.5 0.5 
##$TPOFFS= (0..7)
0 0 0 0 0 0 0 0 
##$TUNHIN= 0
##$TUNHOUT= 0
##$TUNXOUT= 0
##$USERA1= <user>
##$USERA2= <user>
##$USERA3= <user>
##$USERA4= <user>
##$USERA5= <user>
##$V9= 5
##$VALIST= <valist>
##$VCLIST= <CCCCCCCCCCCCCCC>
##$VD= 0
##$VDLIST= <DDDDDDDDDDDDDDD>
##$VPLIST= <PPPPPPPPPPPPPPP>
##$VTLIST= <TTTTTTTTTTTTTTT>
##$WBST= 1024
##$WBSW= 4
##$XGAIN= (0..3)
0 0 0 0 
##$XL= 0
##$YL= 0
##$YMAX_a= 456922
##$YMIN_a= -520383
##$ZGOPTNS= <>
##$ZL1= 120
##$ZL2= 120
##$ZL3= 120
##$ZL4= 120
##$ABSF1= 16.522
##$ABSF2= -4.171173
##$ABSG= 5
##$ABSL= 3
##$ALPHA= 0
##$AQORDER= 0
##$ASSFAC= 0
##$ASSFACI= 0
##$ASSFACX= 0
##$ASSWID= 0
##$AUNMP= <proc_1d>
##$AZFE= 0.1
##$AZFW= 0.1
##$BCFW= 0
##$BC_mod= 0
##$BYTORDP= 0
##$COROFFS= 0
##$CY= 12.5
##$DATMOD= 1
##$DC= 0
##$DFILT= <>
##$DTYPP= 0
##$F1P= 14.0000005364418
##$F2P= -0.99999901652339
##$FCOR= 0.5
##$FTSIZE= 32768
##$FT_mod= 6
##$GAMMA= 0
##$GB= 0
##$INTBC= 1
##$INTSCL= 1
##$ISEN= 128
##$LB= 0.3
##$LEV0= 0
##$LPBIN= 0
##$MAXI= 10000
##$MC2= 0
##$MEAN= 0
##$ME_mod= 0
##$MI= 0
##$NCOEF= 0
##$NC_proc= -4
##$NLEV= 6
##$NOISF1= 0
##$NOISF2= 0
##$NSP= 0
##$NTH_PI= 0
##$NZP= 0
##$OFFSET= 16.522
##$PC= 1
##$PHC0= -82.93074
##$PHC1= 6.713723
##$PH_mod= 1
##$PKNL= yes
##$PPARMOD= 0
##$PSCAL= 4
##$PSIGN= 0
##$REVERSE= no
##$SF= 250.13
##$SI= 32768
##$SIGF1= 0
##$SIGF2= 0
##$SINO= 400
##$SIOLD= 32768
##$SREGLST= <1H.CDCl3>
##$SSB= 0
##$STSI= 32768
##$STSR= 0
##$SW_p= 5175.98343685301
##$SYMM= 0
##$S_DEV= 0
##$TDeff= 65536
##$TDoff= 0
##$TI= <Analysis number 999999
Compound Code 99
Book Reference 9
Project Code 9>
##$TILT= no
##$TM1= 0
##$TM2= 0
##$TOPLEV= 0
##$USERP1= <user>
##$USERP2= <user>
##$USERP3= <user>
##$USERP4= <user>
##$USERP5= <user>
##$WDW= 1
##$XDIM= 32768
##$YMAX_p= 281306139
##$YMIN_p= -247418
$$ End of Bruker specific parameters
$$ ---------------------------------
##NTUPLES= NMR SPECTRUM
##VAR_NAME=  FREQUENCY,     SPECTRUM/REAL,   SPECTRUM/IMAG
##SYMBOL=    X,             R,               I
##VAR_TYPE=  INDEPENDENT,   DEPENDENT,       DEPENDENT
##VAR_FORM=  AFFN,          ASDF,            ASDF
##VAR_DIM=   32768,         32768,           32768
##UNITS=     HZ,            ARBITRARY UNITS, ARBITRARY UNITS
##FACTOR=    0.157963299565203, 1,           1
##FIRST=     4132.6476996994, 0,             0
##LAST=      -1043.33573715361, 0,           0
##MIN=       -1043.33573715361, -247418,     0
##MAX=       4132.6476996994, 281306139,     0
$$ Real data points
##PAGE= N=1
##DATA TABLE= (X++(R..R)), XYDATA
$$ [...]
28486b2558p756J0806M4125O717k4791Q381J3837O334j2370j6752J6986k0614
$$ -22558 -30314 -19508 24617 31334 6543 14924 28761 35095 22725 5973 22959 2345
28474B345p785J8357l617P939N041k4531N039K576J2456k4888J0525L9448J8727
$$ 2345 -5440 12917 9300 17239 22280 -2251 2788 5364 17820 -7068 3457 42905 61632
28461F1632K674k9450j8257j6942J4374j6079k4989j1692j4270L6342K1603J1446
$$ 61632 64306 34856 16599 -343 14031 -2048 -27037 -38729 -52999 -16657 4946 16392
28449A6392K4264k0792r69k2132k0671Q078J1211m194J6804j3091k680l676M833
$$ 16392 40656 19864 18895 -3237 -23908 -15830 -4619 -8813 7991 -5100 -7780 -11456 -6623
28436f623P813j4851j444J4549O647k4605k3697J4943J6286r219j0748M009N283
$$ -6623 1190 -13661 -15105 -556 6091 -18514 -42211 -27268 -10982 -20201 -30949 -26940 -21657
28423b1657Q507P703k433j965j3199K6469N901J3674J06M886m623r865j348j341
$$ -21657 -13150 -5447 -7880 -9845 -23044 3425 9326 23000 23106 27992 23369 13504 12156 10815
28409A0815j5890j3845j29K284J7120J9945k3392k755K565K0627N007J1881K0007
$$ 10815 -5075 -18920 -19049 -16765 355 20300 -3092 -5847 -3282 17345 22352 34233 54240
28396E4240k1827j6306j7483o94P174J5106L1768r095j0277p028j607J3355k7983
$$ 54240 32413 16107 -1376 -2070 5104 20210 51978 42883 32606 25578 23971 37326 9343
28383I343k5721p079N741L7237L2898m334l7614j0096n273J1392J2288j2150J3099
$$ 9343 -16378 -23457 -17716 19521 52419 48085 10471 375 -4898 6494 18782 6632 19731
28370A9731J0750n85j3391k3321L426K538j431J4841J9644K8124k4342k1358j2082
$$ 19731 30481 29896 16505 -6816 -3390 -852 -2283 12558 32202 60326 35984 14626 2544
28357B544j1418j9621Q301K9169K850J5536K1702q727k0841P868r918k469j3242
$$ 2544 -8874 -28495 -20194 8975 11825 27361 49063 40336 19495 27363 17445 14976 1734
28344A734q913J595N09j3259j1251L4859J4997l6286p489K0910J9054j9345J3272
$$ 1734 -7179 -5584 -5075 -18334 -29585 5274 20271 -16015 -23504 -2594 16460 -2885 10387
28331A0387K8728k2961n64j8089P860R32j0573L20j7866J9991L0638K3744l797
$$ 10387 39115 16154 15590 -2499 5361 6293 -4280 -3960 -21826 -1835 28803 52547 48750
28318D8750j8776j693j097k136r676M013K3124o567k2445l2705k765J017K0466
$$ 48750 29974 28281 27184 25048 15372 19385 42509 35942 13497 -19208 -21973 -20956 -490
28305d90j1953j1310J2503L4508q918j0210N1K748N0672o520m1020k4678J4886
$$ -490 -12443 -23753 -11250 23258 14340 4130 4181 6929 57601 51081 10061 -14617 269
28292B69K489J3964q745j6714n82j7470k4444L582K9967N3550m758j9747J1062
$$ 269 2758 16722 7977 -8737 -9319 -26789 -51233 -47651 -17684 35866 31108 11361 22423
28279B2423M760k890j7109J9309J8750k2655r726p666L6262q078l5200n2367Q029
$$ 22423 27183 24293 7184 26493 45243 22588 12862 5196 41458 33380 -1820 -54187 -46158
28266d6158K4590J1207l3206L647J5651k541K7511J6635j2447J1462O515J833
$$ -46158 -21568 -10361 -43567 -39920 -24269 -26810 701 17336 4889 16351 22866 24699
28254B4699J5962J3926j2053j5429l639j5987o262L423n329j1705P258J3068l3160
$$ 24699 40661 54587 42534 27105 23466 7479 1217 4640 -689 -12394 -5136 7932 -25228
28241b5228k9742J0818J5213M845m906j5269J0606k6157J5270l169J112J462q753
$$ -25228 -54970 -44152 -28939 -24094 -29000 -44269 -33663 -59820 -44550 -47719 -46607 -45145 -53898
28228e3898L0497N5867j9344l2908j9583L3022N458l283j4597q709r037J4351
$$ -53898 -23401 32466 13122 -19786 -39369 -6347 -889 -4172 -18769 -27478 -36515 -22164
28216b2164J3646J5413O248j5797m430l7060O83K4489J769r84J8663j9693j188
$$ -22164 -8518 6895 13143 -2654 -7084 -44144 -43461 -18972 -17203 -18187 476 -19217 -20405
28203b0405J5935l30J7627Q140j7573l1105r548J2567K0630J4481l024j454j3685
$$ -20405 -4470 -4800 12827 20967 3394 -27711 -37259 -24692 -4062 10419 7395 5941 -7744
28190g744j2818k798q249n3M28J347o334Q822K1043K2645J8965Q92m825j2706
$$ -7744 -20562 -23360 -31609 -31662 -31234 -29887 -36221 -27399 -6356 16289 35254 36146 31321 18615
28176A8615j8157m416j4409o395K889J5907m237P435q155M807L1492j0007k3597
$$ 18615 458 -3958 -18367 -24762 -21873 -5966 -10203 -2768 -10923 -6116 25376 15369 -8228
28163h228J3831Q860R544J6066P986j5462k0263K580j471p160J0838k9667k4845
$$ -8228 5603 14463 24007 40073 48059 32597 12334 14914 13443 6283 17121 -12546 -37391
28150c7391r777J0929L3488Q5j5245K1792m213k088J3800J9438j9923m642L679
$$ -37391 -47168 -36239 -2751 -2666 -17911 3881 -332 -2420 11380 30818 10895 6253 9932
28137I932n557j0932J2667K0011p692k882R301p714k6040m336K7657M78J9008
$$ 9932 4375 -6557 6110 26121 18429 15547 24848 17134 -8906 -13242 14415 14893 33901
28124C3901J3466j8472k0339p089J9026m790k2872j4806O073J5812J0987j5254
$$ 33901 47367 28895 8556 1467 20493 15703 -7169 -21975 -15902 -90 10897 -4357
28112d357k5270J1656M368P089K2033j1612O037j8498p781J9314J502K777o384
$$ -4357 -29627 -17971 -13603 -6514 15519 3907 9944 -8554 -16335 2979 4481 7258 874
28099H74Q538J2200j3665n115N373j4328k597L865k365J0949K5222n916j5740
$$ 874 9412 21612 7947 2832 8205 -6123 -8720 -4855 -7220 3729 28951 23035 7295
28086G295r655oP615K410Q094j5673k1353k6397j4044K5147J4375q720R876R606
$$ 7295 -2360 -2366 5249 7659 15753 80 -21273 -47670 -61714 -36567 -22192 -30912 -21036 -11430
28072a1430J41J5496R555r374j8120K592m043p461J235P902m494J6242k365l4179
$$ -11430 -11289 4207 13762 4388 -13732 -11140 -15183 -22644 -21409 -13507 -18001 -1759 -4124 -38303
28058c8303j7266J7079o031R743J1624q578L9264l55k9155j502K5557Q040J2853
$$ -38303 -55569 -38490 -44521 -34778 -23154 -31732 7532 7177 -21978 -23480 2077 10117 22970
28045B2970q206p600j3761J553m954q03k48M073j4602k0393P465K6589M067n553
$$ 22970 14764 7164 -6597 -5044 -9998 -10801 -11049 -6976 -21578 -41971 -34506 -7917 -3850 -9403
28031i403j6693l923L614M4356K2791P424l2567l0665L267R162o406N811L995
$$ -9403 -26096 -30019 -26405 17951 40742 48166 15599 -15066 -11799 -2637 -9043 -3232 763
28018G63m668J3644L610J2931n602n042p919J8824J7597l642J2299J987k0633
$$ 763 -3905 9739 13349 26280 20678 15636 7717 26541 44138 40496 52795 54782 34149
28005C4149k2040m763o548J3634J7466L211k3068k1770j0120j9770Q331J8622
$$ 34149 12109 7346 798 14432 31898 35109 12041 -9729 -19849 -39619 -31288 -12666
27993a2666N591j0232l521m645k0221J617J7187J209M786k0578M993K4352J4363
$$ -12666 -7075 -17307 -20828 -25473 -45694 -44077 -26890 -25681 -20895 -41473 -36480 -12128 2235
27980B235K4176o493k2161P988J3151j7403l5642K236J7629K7388J4314m19k4225
$$ 2235 26411 19918 -2243 5745 18896 1493 -34149 -31913 -14284 13104 27418 26999 2774
27967B774k1223J4751n77k486l33k2822k3782j15L5417J5379J088J030P014k873
$$ 2774 -18449 -3698 -4275 -6761 -7094 -29916 -53698 -53813 -18396 -3017 -1929 -899 6115 3242
27953C242k4450p143J6192J5109N172k1677m66j8890Q108R357j8917m357K6176
$$ 3242 -21208 -28351 -12159 2950 8122 -13555 -14021 -32911 -24803 -15446 -34363 -38720 -12544
27940a2544J75L891L0402q029k3903k1205k5791j5747K9562L1001L9842j20j1027
$$ -12544 -12369 -8478 21924 13895 -10008 -31213 -57004 -72751 -43189 -12188 27654 27534 16507
27927A6507k335J199n891j1980j8928l391L118j0666j0947q138J3693K4114L979
$$ 16507 14172 15371 9480 -2500 -21428 -24819 -21701 -32367 -43314 -51452 -37759 -13645 -9666
27914i666k2068j027J2118J3586j0083K6666K7580l797J5696j1888k0931j9537
$$ -9666 -31734 -32761 -20643 -7057 -17140 9526 37106 33309 49005 37117 16186 -3351
27902c351j436P231j9398n410J2219m2804J1621J1982J4363M1732M204k2592j7010
$$ -3351 -4787 2444 -16954 -22364 -10145 -52949 -41328 -29346 -14983 26749 30953 8361 -8649
27889h649J151K2207J1960j3408P536K8146j5303p322q388j582k8836K5234J0630
$$ -8649 -7498 14709 26669 13261 20797 48943 33640 26318 17930 16348 -12488 12746 23376
27876B3376j3883k971j254j1081O55J2732J2130M030j4308m2312M330M689j1218
$$ 23376 9493 6522 5268 -5813 -5158 7574 19704 23734 9426 -32886 -28556 -23867 -35085
27863c5085j854K2326K2031K91j69j360K085J2306o777J7317K1393j4977k1015
$$ -35085 -36939 -14613 7418 7709 7540 6180 8265 20571 13794 31111 52504 37527 16512
27850A6512q729P426j3467R573P597n966O624O30k14J0862p689j3329O373q448
$$ 16512 7783 15209 1742 11315 18912 12946 19570 20200 19986 30848 23159 9830 16203 7755
27836G755j1740Q342M533R470M216J3061j6354k7097r322M270j5240K4075r274
$$ 7755 -3985 4357 8890 18360 22576 35637 19283 -7814 -17136 -12866 -28106 -4031 -13305
27823a3305K1081J6190k3551k006M778K531q715K5615J2278k641l3200j9001M434
$$ -13305 7776 23966 415 -1591 3187 5718 -2997 22618 34896 32255 -945 -19946 -15512
27810a5512P686p157Q53j3449J0130J6847J2491l1004Q097K9740J4249M554o625
$$ -15512 -7826 -14983 -14130 -27579 -17449 -602 11889 -19115 -11018 18722 32971 37525 30900
27797C0900j0822l0676l7388K813K4646o437j5430N958J4788m658p599K8809J0553
$$ 30900 20078 -10598 -47986 -45173 -20527 -26964 -42394 -36436 -21648 -26306 -33905 -5096 5457
27784E457r949m385K1565k2978j8743N819r596K9509K3853M375J3992j1701l8861
$$ 5457 -4492 -8877 12688 -10290 -29033 -23214 -32810 -3301 20552 24927 38919 27218 -11643
27771a1643j9150Q56K3494J0881O55K1787J1983o237j8243k7229j9122J8207P612
$$ -11643 -30793 -29937 -6443 4438 5093 26880 38863 32626 14383 -12846 -31968 -13761 -6149
27758f149K980J5252N100l1847k597J136J9640J6060n592j1459L301j0382J1339
$$ -6149 -3169 12083 17183 -14664 -17261 -16125 3515 19575 13983 2524 5825 -4557 6782
27745F782K2458j621J4941n672n751k0130j2703k6439J3798j5902j1477L684K195
$$ 6782 29240 27619 42560 36888 31137 11007 -1696 -28135 -14337 -30239 -41716 -38032 -35837
27732c5837J8901K3840L9058J7822k9618k4523k485j2505J994Q589K7979k448
$$ -35837 -16936 6904 45962 63784 34166 9643 7158 -5347 -3353 5236 33215 30767
27720C0767k5134l1428p654K8048M524j0234j1268J2838O184l326j3560j0338
$$ 30767 5633 -25795 -33449 -5401 -877 -11111 -22379 -9541 -3357 -6683 -20243 -30581
27708c0581l1199K4767K2294M448P024K5210J9136J2881n05l457o435q395m542
$$ -30581 -61780 -37013 -14719 -10271 -3247 21963 41099 53980 53475 50018 43583 35188 30646
27695C0646j0224p732o108o291M614j2117j0078j6744N170R393J5117j1983p045
$$ 30646 20422 12690 6582 291 4905 -7212 -17290 -34034 -28864 -19471 -4354 -16337 -23382
27682b3382O57L55J4331J7986q315J2230j2868j5479J493O864j0851k0197N743
$$ -23382 -22725 -22370 -8039 9947 1632 13862 994 -14485 -12992 -6128 -16979 -37176 -31433
27669c1433K859j0593N977L0998K7007q281k2087J6267L22J9239J543j0838l8654
$$ -31433 -28574 -39167 -33190 -2192 24815 16534 -5553 10714 11036 30275 31818 20980 -17674
27656a7674k4203M447J4646K7284K7235r747J1030n435j7948m2702j7220J470
$$ -17674 -41877 -37430 -22784 4500 31735 21988 33018 27583 9635 -33067 -50287 -48817
27644d8817K9918j6529K206K3487K5683k8595j4607n160j6785O435M3423J4620
$$ -48817 -18899 -35428 -33222 -9735 15948 -12647 -27254 -32414 -49199 -42764 659 15279
27632A5279r515r810k8476K2891J7534J4469o768k7009J2784K826J474L601m620
$$ 15279 5764 -4046 -32522 -9631 7903 22372 15604 -11405 1379 4205 5679 9280 4660
27619D660O208J39L799J1994J1425J60j0919R705J125j5428K858J1771l7747j2624
$$ 4660 10868 11007 14806 26800 38225 38385 27466 37171 38296 22868 25726 37497 -250 -12874
27605a2874K4959L837O98j1049N131n719k0793J6587J7137K7711j6430j6501J4782
$$ -12874 12085 15922 16620 5571 10702 4983 -15810 777 17914 45625 29195 12694 27476
27592B7476Q980O210R047K75J1894k3173k9379o909J2130J5043J9817j6316l1886
$$ 27476 36456 42666 51713 51988 63882 40709 11330 4421 16551 31594 51411 35095 3209
27579C209j6216o767j3776j1406n956L4200J4272k3450k553q38J0251L697L1964
$$ 3209 -13007 -19774 -33550 -44956 -50912 -16712 -2440 -25890 -28443 -29281 -19030 -15333 16631
27566A6631p611k2268J3378q47k4849J2490Q615k1341j0684l3957L4736K4290
$$ 16631 9020 -13248 130 -717 -25566 -13076 -4461 -25802 -36486 -70443 -35707 -11417
27554a1417O715r434k9009j6376J8356N578K0679K0954M53k825j7259K8138J3628
$$ -11417 -4702 -14136 -43145 -59521 -41165 -35587 -14908 6046 6499 3674 -13585 14553 28181
27541B8181R22O498o372O630J7543J5155j3097Q961N238k9799l3297k6160j9979
$$ 28181 29103 35601 29229 35859 53402 68557 55460 64421 69659 39860 6563 -19597 -39576
27528c9576j686l260L8586J2828K1815j8202k3633J793J644K7723J7625J9299
$$ -39576 -41262 -44522 -5936 6892 28707 10505 -13128 -11335 -9691 18032 35657 54956
27516E4956J6378k0287p152r305j7049j2450j6981J0284J2927J0799M51j2719
$$ 54956 71334 51047 43895 34590 17541 5091 -11890 -1606 11321 22120 22571 9852
27504I852k0297Q811k0614K0749o434J6079j606r290L957j2849o089J2768K0929
$$ 9852 -10445 -1634 -22248 -1499 -7933 8146 6540 -2750 1207 -11642 -17731 -4963 15966
27491A5966K4340K5932q749k2436j262j732N795r659j5566N602J069J288j2328
$$ 15966 40306 66238 57489 35053 33791 32059 37854 28195 12629 18231 19300 20588 8260
27478H260l453J4490J5736L464j4744j7428l304P70j0211p612Q811M0849p064
$$ 8260 4807 19297 35033 38497 23753 6325 3021 3791 -6420 -14032 -5221 35628 28564
27465B8564k5327J4821L3718J653j5644o420j5321N562Q63j8737j1670Q680J2032
$$ 28564 3237 18058 51776 53429 37785 31365 16044 21606 22469 3732 -7938 742 12774
27452A2774L284M431j5905O329J0842k7108p386j939O868j3644M026j2932j9993
$$ 12774 16058 20489 4584 10913 21755 -5353 -12739 -14678 -7810 -21454 -17428 -30360 -50353
27439e0353J002J5262N419o541M1133K1252j1789j1071q914P183j153l5213L070
$$ -50353 -49351 -34089 -28670 -35211 5922 27174 15385 4314 -4600 2583 1430 -33783 -30713
27426c0713J8483K322K9522K5113k1746m1066m558J2724P222N140k719q378K7673
$$ -30713 -12230 -9908 19614 44727 22981 -18085 -22643 -9919 -2697 2443 -276 -8654 19019
27413A9019K2769k2105J0710J3430j44j3667q913r631k8593j7722L0857J3724
$$ 19019 41788 19683 30393 43823 43679 30012 21099 11468 -17125 -34847 -3990 9734
27401I734K0658j927k0598j4341K5564K1045J2559r726k9206J2945q360j3829
$$ 9734 30392 28465 7867 -6474 19090 40135 52694 42968 13762 26707 18347 4518
27389D518k558J5042R205Q989P572K0308j5371l2406M619J2653j7056j350J4921
$$ 4518 1960 17002 26207 35196 42768 63076 47705 15299 19918 32571 15515 14165 29086
27376B9086l0573j4235l927K99j981j0265J9628k767r916K374J7916r698L082
$$ 29086 -1487 -15722 -19649 -19350 -21331 -31596 -11968 -14735 -24651 -22277 -4361 -14059 -10977
27363a0977L324K0833j8375j6008K1666J5232o935k3791j4787j7521J2784J1078
$$ -10977 -7653 13180 -5195 -21203 463 15695 8760 -15031 -29818 -47339 -34555 -23477
27351b3477K4413M957j025J2789K0780q387Kj8927j3399j1237j7028L5527K3019
$$ -23477 936 5893 4868 17657 38437 30050 30052 11125 -2274 -13511 -30539 4988 28007
27338B8007K575j1103r626J4507J0335j218j0587J0890N447J1075J2845n399j2075
$$ 28007 30582 19479 9853 24360 34695 33477 22890 33780 39227 50302 63147 57748 45673
27325D5673k30K975q615p482M149o055l991j6230j9428P706M0363j7170j5026
$$ 45673 45443 48418 39803 32321 36470 30415 26424 10194 -9234 -1528 38835 21665 6639
27312F639j6847l2762K903P935N601q669J1735Q6L575J8460k28j0026K7857j413
$$ 6639 -10208 -42970 -40067 -32132 -26531 -35200 -23465 -23379 -19804 -1344 -1572 -11598 16259 14846
27298A4846m277r076k1299Q777K5797n703J2762O771j5956j6909l918K551j2288
$$ 14846 10569 1493 -19806 -11029 14768 9065 21827 28598 12642 -4267 -8185 -5634 -17922
27285a7922j253M6509N159k0731n507k0733j6781J4361N146K199J9593R07K775
$$ -17922 -19175 27334 32493 11762 6255 -14478 -31259 -16898 -11752 -9553 10040 10947 13722
27272A3722L261M037k6257K501Q847J2742R321j4843j0905n137J3636J5019m679
$$ 13722 16983 21020 -5237 -2736 6111 18853 28174 13331 2426 -2711 10925 25944 21265
27259B1265l998j7252k732l1K455o141q4j45J3095J3666k096n866L612q854q531
$$ 21265 17267 15 -2717 -2748 -293 -6434 -6518 -6663 6432 20098 18002 12136 15748 6894 -1637
27244a637K1309l545j3505p229Q37J7634K0912j2509k401k3221j5181l291j307
$$ -1637 19672 16127 2622 -4607 -3770 13864 34776 22267 19866 -3355 -18536 -21827 -23134
27231b3134J569o524L4382J3340L480l761j4345o838j4410Q971L3370r543l640
$$ -23134 -21565 -28089 6293 19633 23113 19352 5007 -1831 -16241 -7270 26100 16557 12917
27218A2917k0569j3442l608J64j2365Q872Q226J8318J0715J5144n281M588L567
$$ 12917 -7652 -21094 -24702 -24538 -36903 -28031 -19805 -1487 9228 24372 19091 23679 27246
27205B7246j5691m352J2220k348k4546k6795j1321K4402l61j21k097J5161n52
$$ 27246 11555 7203 19423 17075 -7471 -34266 -45587 -21185 -21546 -21667 -23764 -8603 -9155
27192i155N098J4408K4863J2803J370l2818r186j0146k4204n623M646r324M680
$$ -9155 -4057 10351 35214 48017 49387 16569 7383 -2763 -26967 -32590 -27944 -37268 -32588
27179c2588J8117N704M921J1345N256O252j8338k4964K4387K2268k0364o721n682
$$ -32588 -14471 -8767 -3846 7499 12755 19007 669 -24295 92 22360 1996 -4725 -10407
27166a0407l287n2958l2339R540J2593K6678L471r961J2879J4280L1467n272K428
$$ -10407 -13694 -66652 -98991 -89451 -76858 -50180 -46709 -56670 -43791 -29511 1956 -3316 -888
27153h88r307k1362j2070K1741j028J698P042q135J2681L2137J1477q642L709
$$ -888 -10195 -31557 -43627 -21886 -22914 -21216 -14174 -22309 -9628 22509 33986 25344 29053
27140B9053l156k4383k3837q076r701J1738J7177j1733J0099K8035k0525p500
$$ 29053 25897 1514 -22323 -30399 -40100 -28362 -11185 -22918 -12819 15216 -5309 -12809
27128a2809K9176j051q991Q608p127K356J1500J1752P48k0089J788M025J3086
$$ -12809 16367 15316 6325 14933 7806 10162 21662 33414 34162 14073 15861 19886 32972
27115C2972j1892n269N438L495m385L488p890o822l139r338L165O315M636J0796
$$ 32972 21080 15811 21249 24744 20359 23847 15957 9135 5996 -3342 -177 6138 10774 21570
27101B1570J3140J6635l683k7447N321N337J7112N132l8130j041k6037l855j396
$$ 21570 34710 51345 47662 20215 25536 30873 47985 53117 14987 13946 -12091 -15946 -17342
27088a7342J6687J3715K7370j464Q621o90k8871Q40j6941K517K952j0498n609
$$ -17342 -655 13060 40430 38966 47587 46897 18026 18866 1925 4442 7394 -3104 -8713
27075h713J2149M651j069k9428K7559J0806J2005j1555l1184n979L5227P184k8731
$$ -8713 3436 8087 7018 -22410 5149 15955 27960 16405 -14779 -20758 14469 21653 -7078
27062g078r863L8912P752M219j3779k5534o009Q061N805Q245o668M490j8777K791
$$ -7078 -16941 21971 29723 33942 20163 -5371 -11380 -3319 2486 10731 4063 8553 -10224 -7433
27048g433K2302M21j0839Q169o841k2904j0264K882K1577J6814P979Q850J9512
$$ -7433 14869 15290 4451 12620 5779 -17125 -27389 -24507 -2930 13884 21863 30713 50225
27035E0225P652k7492o293J4649j6671k4508K663J6266J020N86k587J0457j3521
$$ 50225 57877 30385 24092 38741 22070 -2438 225 16491 17511 18097 15510 25967 12446
27022A2446k0058r802o498J3339K0013j034j0102K5084o944q571J1765P405k0360
$$ 12446 -7612 -17414 -23912 -10573 9440 8406 -1696 23388 16444 7873 19638 27043 6683
27009F683j5677j0175J3334J7356m932N908P043Q540j7247j034K1913L0766O754
$$ 6683 -8994 -19169 -5835 11521 6589 12497 19540 28080 10833 9799 31712 62478 69232
26996F9232k6362j8815n3195J7762K2893m536j8222J3827L331o524j7263n719
$$ 69232 42870 24055 -29140 -11378 11515 6979 -11243 2584 5915 -609 -17872 -23591
26984b3591k104j7174j487J6452J6941J1964j7115o834l372m219J1258R721k873
$$ -23591 -25695 -42869 -44356 -27904 -10963 1001 -16114 -22948 -26320 -30539 -19281 -9560 -12433
26971a2433M383J6268N662l999j0536k0355K590K0949L2061j3694l2280Q666K8254
$$ -12433 -8050 8218 13880 9881 -655 -21010 -18420 2529 34590 20896 -11384 -2718 25536
26958B5536k1683j7078J5006o800O711m296J1606K7700p095K017j6016J8161j0650
$$ 25536 3853 -13225 1781 -5019 1692 -2604 9002 36702 29607 31624 15608 33769 23119
26945B3119j3037K470L991M794j3336r18P511j3236K7626j517r889L071M489O318
$$ 23119 10082 12552 16543 21337 8001 7083 14594 1358 28984 27467 17578 20649 25138 31456
26931C1456k3527j2696l4713J883M033q294J2290O297j0468Q063J6062R988k0935
$$ 31456 7929 -4767 -39480 -37597 -33564 -41858 -29568 -23271 -33739 -25676 -9614 374 -20561
26918b0561j8742P599L1992J3437P261p564Q109j1463q132j22N772j207r318J085
$$ -20561 -39303 -31704 288 13725 20986 13422 21531 10068 1936 1814 7586 6379 -2939 -1854
26904a854J2816L715n94K645J7812R058n683m2581p949J1624o90J4112K7886p083
$$ -1854 10962 14677 14083 16728 34540 43598 37915 -4666 -12615 -991 -1681 12431 40317 33234
26890C3234J157P536K252L400k3471k1272j3749N565K550m776K053O240q747j8533
$$ 33234 34391 41927 44179 47579 24108 2836 -10913 -5348 -2798 -7574 -5521 719 -8028 -26561
26876b6561q997J860O204R773r131M776K5476j4692k0812q94M856j5116K29L8647
$$ -26561 -35558 -33698 -27494 -17721 -26852 -22076 3400 -11292 -32104 -32998 -28142 -43258 -43029 -4382
26862d382J2479j8567j5896M998Q803k2664K980R010R876P053o235J7375L2522
$$ -4382 8097 -10470 -26366 -21368 -12565 -35229 -32249 -23239 -13363 -6310 -12545 4830 37352
26849C7352k71n712j9163j0907J6141J1029o112P008j3483k4817J2548K6656L2609
$$ 37352 37081 31369 12206 1299 17440 28469 22357 29365 15882 -8935 3613 30269 62878
26836F2878J0454j8013j6502Q200J158p241q900J0577O386J5007k4310k3478K3770
$$ 62878 73332 55319 38817 47017 48175 40934 32034 42611 48997 64004 39694 16216 39986
26823C9986O552p664j6079k879p689j1350N359j3357o893K7769J4464q399k9706
$$ 39986 46538 38874 22795 19916 12227 877 6236 -7121 -14014 13755 28219 19820 -9886
26810i886k9233o698J9130J5809L3597J3363M182M950j0313l2543J429K3112j0530
$$ -9886 -39119 -45817 -26687 -10878 22719 36082 40264 45214 34901 2358 3787 26899 16369
26797A6369P075j9756M25l258l951j1512l938M685M363j4462n981J3317J4123
$$ 16369 23444 3688 4113 855 -3096 -14608 -18546 -13861 -9498 -23960 -29941 -16624 -2501
26784b501j5759K3055P20r563P985j1933J1398q72j7497q762J8558K4206Q770
$$ -2501 -18260 4795 5515 -4048 3937 -7996 3402 2530 -14967 -23729 -5171 19035 27805
26771B7805j227q319j2102j1233J8986J7327j1554k4281j1796k230K0420O134
$$ 27805 26578 18259 6157 -5076 13910 31237 19683 -4598 -16394 -18624 1796 7930
26759G930o320j4273n515J1143k81O80M893q946m0797m543Q73J5555J5221Q346
$$ 7930 1610 -12663 -18178 -7035 -7316 -6636 -1743 -10689 -51486 -56029 -55156 -39601 -24380 -16034
26745a6034P493K9569K9416j294n328k7807k3059m762n449R957J6889J259k0052
$$ -16034 -8541 21028 50444 49150 43822 16015 -7044 -11806 -17255 -7298 9591 10850 -9202
26732i202J5392K5639j6962l6457O522j2212L03q664K4461l11j3259O652Q964
$$ -9202 6190 31829 14867 -21590 -15068 -27280 -26977 -35641 -11180 -11491 -24750 -18098 -9134
26719i134K7738j7626j379M4055L1875P528j1115m1106l947o121k5601j6599o697
$$ -9134 18604 978 -401 43654 75529 83057 71942 30836 26889 20768 -4833 -21432 -28129
26706b8129J6167K8188j3452j6498j5004J5336L4275N577j0102j7313N77Q804
$$ -28129 -11962 16226 2774 -13724 -28728 -13392 20883 26460 16358 -955 -378 8426
26694H426J4467P439J0976K2638k1906p363J2004R899k4651J630o379j5341j2512
$$ 8426 22893 30332 41308 63946 42040 34677 46681 56580 31929 33559 27180 11839 -673
26681f73j3853k0381O888R747J1064K4866P909J7228J4353k668q829j4080j2042
$$ -673 -14526 -34907 -28019 -18272 -7208 17658 25567 42795 57148 54480 45651 31571 19529
26668A9529j0326k025J0558O661L890N819j5924l5717J991K1783o19m824J57j975
$$ 19529 9203 7178 17736 24397 28287 34106 18182 -17535 -15544 6239 5620 796 953 -1022
26654a022p869q247J0239K6902j2135L740k2537l5777j2525J4856J1780P514K2711
$$ -1022 -8891 -17138 -6899 20003 7868 11608 -10929 -46706 -59231 -44375 -32595 -25081 -2370
26641b370m138l5655m261J0266j1483M0111K8633j7259k0755O0K5219o074j9621
$$ -2370 -6508 -42163 -46424 -36158 -47641 -7530 21103 3844 -16911 -16851 8368 2294 -17327
26628a7327J7827K9739J3565r917k1909m595J8296k075p409j6663J0719r197P251
$$ -17327 500 30239 43804 33887 11978 7383 25679 23604 16195 -468 10251 1054 8305
26615H305K8844j514l2092J3340K1902L38P389J7705k068k9313m1299l108K0820
$$ 8305 37149 35635 3543 16883 38785 39123 46512 64217 62149 32836 -8463 -11571 9249
26602I249M893k0233l8943j6693n446M0437K4031P518J4314r410k0724O695J5758
$$ 9249 14142 -6091 -45034 -61727 -67173 -26736 -2705 4813 19127 9717 -11007 -4312 11446
26589A1446k640j1822j8456J2060J6687J560n284R038m553j492Q672j503l2706
$$ 11446 8806 -3016 -21472 -9412 7275 8835 3551 12589 8036 6544 15216 13713 -18993
26576a8993k2959J7309K8241m550m503L9925J0468k3215o313k5874m401j8150
$$ -18993 -41952 -24643 3598 -952 -5455 34470 44938 21723 15410 -10464 -14865 -33015
26564c3015J8091K7314J0219o132l7468j5715J1047J8711R383M632r086o567l7159
$$ -33015 -14924 12390 22609 16477 -20991 -36706 -25659 -6948 2435 7067 -2019 -8586 -45745
26551d5745J3552L3882J7649l1062m2429k6089K7959R449M0741J7001j932j5042
$$ -45745 -32193 1689 19338 -11724 -54153 -80242 -52283 -42834 -2093 14908 12976 -2066
26539b066l130Q027k0601q397J3160Q158Q134J8226k4938l4602O638J2042J0470
$$ -2066 -5196 2831 -17770 -26167 -13007 -4849 3285 21511 -3427 -38029 -31391 -19349 -8879
26526h879J3096J377m366j8371j4710l4500N809Q163K5623M1871R653r237j2715
$$ -8879 4217 5594 1228 -17143 -31853 -66353 -60544 -52381 -26758 15113 24766 15529 2814
26513B814k4289j3201r172J8036J4744J1078r173K543O984k306O656K9420M910
$$ 2814 -21475 -34676 -43848 -25812 -11068 10 -9163 -6620 364 -1942 4714 34134 39044
26500C9044j8210j0157O795j5157k3258N46j313p747n182j2169j2972j995L4789
$$ 39044 20834 10677 17472 2315 -20943 -20397 -21710 -29457 -34639 -46808 -59780 -61775 -26986
26487b6986N650j2563J0675K3111Q979o098q213K0339o575l1005k2866j052K576
$$ -26986 -21336 -33899 -23224 -113 8866 2768 -5445 14894 8319 -22686 -45552 -46604 -44028
26474d4028P612L7658N498l32K4350j1170j9732k51j1872j0231J7213n206N221
$$ -44028 -36416 1242 6740 6408 30758 19588 -144 -395 -12267 -22498 -5285 -10491 -5270
26461e270L4003L1043L472r689j7436j1603Q354j9374l3826k1082j4036J8679
$$ -5270 28733 59776 63248 53559 36123 24520 32874 13500 -20326 -41408 -55444 -36765
26449c6765K044K2483k2693l498K8661N615J1452l733j7r320p060J0141R65j7313
$$ -36765 -34721 -12238 -34931 -38429 -9768 -4153 7299 3566 3549 -5771 -12831 -2690 -1725 -19038
26435a9038j2925J1645K701k115N517L482J156J0594j5803j2211k983K308j1536
$$ -19038 -31963 -20318 -17617 -19732 -14215 -10733 -9577 1017 -14786 -26997 -29980 -27672 -39208
26422c9208K3083J8744N768n588K1801n247j6283k1007l154L0024J3889k2714
$$ -39208 -16125 2619 8387 2799 24600 19353 3070 -17937 -21091 8933 22822 108
26410A08J5153K3320k331l2666j5995K6119j373j5620l585M524n684K5177r559
$$ 108 15261 38581 36250 3584 -12411 13708 12335 -3285 -6870 -2346 -8030 17147 7588
26397G588k2530j168j978J6043P58l0939l660Q075N685Q906J6154J9577J2550
$$ 7588 -14942 -16110 -18088 -2045 -1287 -32226 -35886 -27811 -22126 -13220 2934 22511 35061
26384C5061O205J919K51j853j1406l8967k2794l312J5485o973J4606N872l681
$$ 35061 41266 43185 43436 41583 30177 -8790 -31584 -34896 -19411 -26384 -11778 -5906 -9587
26371i587Q4n8j2054P451K939j364J7121m645R200J000j342N479j912n60l209
$$ -9587 -9503 -9561 -21615 -14164 -11225 -12589 4532 -113 9087 10087 8745 14224 12312 11752 8543
26356H543j4270l292R074k607Q587J6784j3863j9079j0159j690J7033j4326J5517
$$ 8543 -5727 -9019 55 -2552 6035 22819 8956 -10123 -20282 -21972 -4939 -19265 -3748
26343c748l1183p499n390J935P685M1984j8354l1125J7161J3382O580o093P374
$$ -3748 -34931 -42430 -47820 -45885 -38200 3784 -14570 -45695 -28534 -15152 -8572 -14665 -7291
26330g291o600Q091J8518J01K1719j449k1439j162K02Q575J3161k2505j0096J6665
$$ -7291 -13891 -5800 12718 12819 34538 33089 11650 10488 10690 19265 32426 9921 -175 16490
26316A6490R350j2700o68J9516N860j0205k1509j3584J469K2356J5927K0032K0063
$$ 16490 25840 13140 12472 31988 37848 27643 6134 -7450 -5981 16375 32302 52334 72397
26303G2397k7927j9553J6052K279J4182k0826Q72j1708k1994k1979j3875K476
$$ 72397 44470 24917 40969 43248 57430 36604 37476 25768 3774 -18205 -32080 -29604
26291b9604K0428J6911N978j2731k0907J278Q113Q788P634L7505L2183K7344n99
$$ -29604 -9176 7735 13713 982 -19925 -18647 -10534 -1746 5888 43393 75576 102920 102321
26278A02321m9885l5315k0060M631J8215l5111Q095N751N2081P304j7987j0205
$$ 102321 52436 17121 -2939 1692 19907 -15204 -7109 -1358 50723 58027 40040 29835
26266B9835j4572P423l443n11K396k439j7788l551R666l5385q773L7330Q160j636
$$ 29835 15263 22686 19243 18732 21128 18689 901 -2650 7016 -28369 -37142 188 8348 6712
26252F712k4455M65J6987J9820L8517J1093l8009n4754N408K6069K289k5380J4953
$$ 6712 -17743 -17278 -291 19529 58046 69139 31130 -23624 -18216 7853 10142 -15238 -285
26239b85J0859M923o222k0852o580l579J9400K4744K1291j9432j5529k7779l9102
$$ -285 10574 15497 9275 -11577 -18157 -21736 -2336 22408 43699 24267 8738 -19041 -58143
26226e8143L8002J1643n991M572Q18K345J8058K3625m876j4428k4350j5547L5538
$$ -58143 -20141 -8498 -14489 -9917 -9099 -6754 11304 34929 30053 15625 -8725 -24272 11266
26213A1266n255j6076j2222K6073P452j4575j6262k2907k007J1214Q259N123N299
$$ 11266 6011 -10065 -22287 3786 11238 -3337 -19599 -42506 -44513 -33299 -25040 -19917 -14618
26200a4618j7541J5709J4880L3933j3589k2930l858M829p87k2354J4250J6447
$$ -14618 -32159 -16450 -1570 32363 18774 -4156 -8014 -3185 -3972 -26326 -12076 4371
26188D371k0577k1670l999k95o06Q192N729K654K8032N214m618L7277n631j5351
$$ 4371 -16206 -37876 -41875 -42170 -42776 -34584 -28855 -26201 1831 7045 2427 39704 34073 18722
26174A8722l8931k6480l805J1360J7636J9425q34n251k7970J4784O851J8260P248
$$ 18722 -20209 -46689 -50494 -39134 -21498 -2073 -2907 -8158 -36128 -21344 -14493 3767 11015
26161A1015j402J5578n857j0646J4508k3293q374N486L827n870j17p447K388N568
$$ 11015 9613 25191 19334 8688 23196 -97 -8471 -2985 842 -5028 -5145 -12592 -10204 -4636
26147d636j644P442k2472q653J0939n088k0529J2368L2931J6430J5098J6204q245
$$ -4636 -6280 1162 -21310 -29963 -19024 -24112 -44641 -32273 658 17088 32186 48390 40145
26134D0145j8229j4942j604l722j2200j3963l084J0444J7827O029k767n074J7381
$$ 40145 21916 6974 5370 1648 -10552 -24515 -27599 -17155 672 6701 3934 -1140 16241
26121A6241j1118l012J1016M559j3601q444l078j7537k2483K5109P432J1168k0573
$$ 16241 5123 2111 13127 17686 4085 -4359 -7437 -24974 -47457 -22348 -14916 -3748 -24321
26108b4321J60K4676K6286r208k3861j552k672J5882J8403K996k8617k531J8859
$$ -24321 -24161 515 26801 17593 -6268 -7820 -10492 5390 23793 26789 -1828 -4359 14500
26095A4500n505K597q186k4978k7605k0254J7613R196J3839J8031j0527O238N084
$$ 14500 8995 11592 3406 -21572 -49177 -69431 -51818 -42622 -28783 -10752 -21279 -15041 -9957
26082i957K094j033K9304M585K1708J1304l5373k0759j6139j3362J540j8262M520
$$ -9957 -7863 -8896 20408 24993 46701 58005 22632 1873 -14266 -27628 -26088 -44350 -39830
26069c9830J8315O969j225P66J7901k1505J561J7247j1110r118N631K0215K1023
$$ -39830 -21515 -14546 -15771 -15005 2896 -18609 -17048 199 -10911 -20029 -14398 5817 26840
26056B6840k5148k5946K395N585M662K5611P258o92K6290j6385k4819J550L893
$$ 26840 1692 -24254 -21859 -16274 -11612 13999 21257 20565 46855 30470 5651 7201 11094
26043A1094p152n014l920K8807j5301m0490L358L6757J8272K163j978o953l5485
$$ 11094 3942 -1072 -4992 23815 8514 -31976 -28618 8139 26411 28574 26596 19643 -15842
26030a5842k9050k1025K1370p520j1954R741J161j846O101R876j0350J6110K3657
$$ -15842 -44892 -65917 -44547 -52067 -64021 -54280 -53119 -54965 -48864 -38988 -49338 -33228 -9571
26017i571L0857K001j3108j4798J4925L746j4954j763K2727L383k0347p328l4410
$$ -9571 21286 23287 10179 -4619 10306 14052 -902 -2665 20062 23445 3098 -4230 -38640
26004c8640j5869K0033K1907k2430J3299K8744O952R832m279j2306j729j810k2776
$$ -38640 -54509 -34476 -12569 -34999 -21700 7044 13996 23828 19549 7243 5514 3704 -19072
25991a9072M6165K4877r805p524k8795j9870k8679Q913J2484J7851j472J309j0516
$$ -19072 27093 51970 42165 34641 5846 -14024 -42703 -33790 -21306 -3455 -4927 -3618 -14134
25978a4134J5102J3156M715O311J384P584n58p000J537k9296K406R744m005j5130
$$ -14134 968 14124 18839 25150 26534 34118 33560 26560 28097 -1199 1207 10951 6946 -8184
25964h184m306Q318J4170J7798l1413O432K8143O161l1828M78P060o934k725Q830
$$ -8184 -12490 -4172 9998 27796 -3617 2815 30958 37119 5291 5769 12829 5895 3170 12000
25950A2000r376k2494j0736P847K0742O795n196j41j0183j324K2848q676J0730
$$ 12000 2624 -19870 -30606 -22759 -2017 4778 -418 -559 -10742 -12066 10782 2106 12836
25937A2836n591j1141n932j2270j6800j3324j1928K9354M3120L5444J0190k9119
$$ 12836 7245 -3896 -9828 -22098 -38898 -52222 -64150 -34796 8324 43768 53958 24839
25925B4839l3248M306K38J6481j2280n357J6680j1497L733J3231J4343O033k4043
$$ 24839 -8409 -4103 -3865 12616 336 -5021 11659 162 3895 17126 31469 37502 13459
25912A3459k4163J9754L00N804J4972j7486j3204J1577j074k1748K7263N83k1962
$$ 13459 -10704 9050 9350 15154 30126 12640 -564 11013 9939 -11809 15454 16037 -5925
25899e925k0122k0405J8292J6647j5466j899r718m929K4918Q160n906J8581R013
$$ -5925 -26047 -46452 -28160 -11513 -26979 -28878 -38596 -43525 -18607 -10447 -16353 2228 11241
25886A1241L322q916j5579l012Q428Q587J4467j3930q966J086r893j6449M271
$$ 11241 14563 5647 -9932 -12944 -4516 4071 18538 4608 -4358 -3272 -13165 -29614 -25343
25873b5343J6344J5576K0915R123n362l8291j7287L9594j0439j0516J1806K76
$$ -25343 -8999 6577 27492 36615 31253 -7038 -24325 15269 4830 -5686 6120 6396
25861F396j0245J7140J7298k90k6738r445L483J2975j4742r427N213J5492N874
$$ 6396 -3849 13291 30589 30299 3561 -5884 -2401 10574 -4168 -13595 -8382 7110 12984
25848A2984J3518j7466M805m702n555p018p842j512q676M76K88M568M079j6369
$$ 12984 26502 9036 13841 9139 3584 -3434 -11276 -12788 -21464 -20988 -20700 -16132 -12053 -28422
25834b8422J6480J9857k7217q836L2777M24K207n345k583j1103K2526p420j5224
$$ -28422 -11942 7915 -19302 -28138 4639 5063 7270 1925 -658 -11761 10765 3345 -11879
25821a1879l582j6831k344J2577L6417m646P218j197l0299l3147q79m110Q410
$$ -11879 -15461 -32292 -34636 -22059 14358 9712 16930 15733 -14566 -47713 -48592 -52702 -44292
25808d4292J1969J0268Q50j119K6634j1549J1837J8331q058p193L557j8272M297
$$ -44292 -32323 -22055 -21205 -22324 4310 -7239 4598 22929 14871 7678 11235 -7037 -2740
25795b740J8720j8791K2166O543l627m763K0390J0206j208q454j1969r006j7435
$$ -2740 15980 -2811 19355 25898 22271 17508 37898 48104 46896 38442 26473 17467 32
25782C2N96J5036j1334j2318j734J4434J0106P209k3868q043j5414K058J4387
$$ 32 628 15664 4330 -7988 -9722 4712 14818 22027 -1841 -9884 -25298 -23240 -8853
25769h853l278j0796K727K7561N61j4456k672J4734M991j4107p143l80J3057J2877
$$ -8853 -12131 -22927 -20200 7361 7922 -6534 -9206 5528 10519 -3588 -10731 -11111 1946 14823
25755A4823J3437m270o095k3329K746m28k474N323K1316O636m051o286O524l8765
$$ 14823 28260 23990 17895 -5434 -2688 -3116 -5590 -267 21049 27685 23634 17348 23872 -14893
25741a4893J812j0j5894j1701J15L5960P803j7413p816K5608M275k5892K5675
$$ -14893 -13081 -13091 -28985 -40686 -40571 -4611 3192 -14221 -22037 3571 7846 -18046 7629
25728G629M0755R982j5075l6414j8152o054J3971J9332J927l91n142l5698k6099
$$ 7629 48384 58366 43291 6877 -11275 -17329 -3358 15974 17901 17510 12368 -23330 -49429
25715d9429J7914O322j8660n695M063m87P951n571L942P519J7674J6225l656l626
$$ -49429 -31515 -25193 -43853 -49548 -45485 -45972 -38021 -43592 -39650 -32131 -14457 1768 -1888 -5514
25701e514j871k4510N675q830o789J7613J1661k056j9579L1277K2229P826m122
$$ -5514 -7385 -31895 -26220 -35050 -41839 -24226 -12565 -14621 -34200 -2923 19306 27132 23010
25688B3010j6005j2270j5163O799K467l1501n822J9054M8054Q252J2226j3607
$$ 23010 7005 -5265 -20428 -13629 -11162 -42663 -48485 -29431 18623 26875 39101 25494
25676B5494j7858k195j6205j3823L8958J5602j6171n384j5789j9228K617K4496
$$ 25494 7636 5441 -10764 -24587 14371 29973 13802 8418 -7371 -26599 -23982 514
25664E14p970j3247L821L189m784j2740j1862n249K1858P266j8471Q34j8130r741
$$ 514 -7456 -20703 -16882 -13693 -18477 -31217 -43079 -48328 -26470 -19204 -37675 -36841 -54971 -64712
25650f4712P892J1713M5060L0185j7148P834j1904k2201J2122J4092p587J5054
$$ -64712 -56820 -45107 -47 30138 12990 20824 8920 -13281 -1159 12933 5346 20400
25638B0400M229k5498r839M711j1544k798N061R793j314J0353M699L084J4344
$$ 20400 24629 -869 -10708 -5997 -17541 -20339 -15278 -5485 -6799 3554 8253 11337 25681
25625B5681J8735k0838o053N32j4241j2041l91n710Q644J4598n510M454l936R27
$$ 25681 44416 23578 17525 18057 3816 -8225 -8616 -14326 -5682 8916 3406 7860 3924 4851
25611D851j6059r894o188K8608J9108J1063k0876k4686j3404K2869K3110k1824
$$ 4851 -11208 -21102 -27290 1318 20426 31489 10613 -14073 -27477 -4608 18502 -3322
25599c322j3097k2607j2930q910k5915J6289K4741M8830J0725j1690j654o236
$$ -3322 -16419 -39026 -51956 -60866 -86781 -70492 -45751 3079 13804 2114 460 -5776
25587e776k3240Q176J6371o797j6593j7305J6731L504J7444j1149k0566K8473
$$ -5776 -29016 -20840 -4469 -11266 -27859 -45164 -28433 -24929 -7485 -18634 -39200 -10727
25575a0727K1494o571K389k2183k5097J239M628L3999L917j7531j3381m241K6620
$$ -10727 10767 4196 6585 -15598 -40695 -39456 -34828 -829 3088 -14443 -27824 -32065 -5445
25562e445K5407j1641j175J5995L2712j6716j9940j4608p401r56K4284l3202N175
$$ -5445 19962 8321 7146 23141 55853 39137 19197 4589 -2812 -3768 20516 -12686 -7511
25549g511K2431N006m2811k6758J7581m45J0181L740L0239K6282L1148j1671l8341
$$ -7511 14920 19926 -22885 -49643 -32062 -32507 -22326 -18586 11653 37935 69083 57412 19071
25536A9071o732R084j847j3873j4222p384l749L65J5896O536J3956j6278R10J7175
$$ 19071 12339 21423 19576 5703 -8519 -15903 -19652 -19287 -3391 3145 17101 823 1733 18908
25522A8908m233k1573N606N121k1649k0608o57K0875j1101j3313k546J8003K2501
$$ 18908 14675 -6898 -1292 3829 -17820 -38428 -39085 -18210 -29311 -42624 -45170 -27167 -4666
25509d666M8703K2156j7516k9538q965p796j6182k92l919Q968K3168N390o997
$$ -4666 44037 66193 48677 19139 10174 2378 -13804 -14096 -18015 -9047 14121 19511 12514
25496A2514k7764L053k4609q566J1362k6958j9920J5599r030J6740K3231R590
$$ 12514 -15250 -12197 -36806 -45372 -34010 -60968 -80888 -65289 -74319 -57579 -34348 -24758
25484b4758J3569Q795j2301o988K8274L2181m261j8735k9218j0716J2918K1879
$$ -24758 -11189 -2394 -14695 -21683 6591 38772 34511 15776 -13442 -24158 -11240 10639
25472A0639q058j8995j4824J2228K1136J3930N722k1622K2208J5435N497J62j8825
$$ 10639 2581 -16414 -31238 -19010 2126 16056 21778 156 22364 37799 43296 43458 24633
25459B4633j5014N98j4506K796M258J3223p963P594K1638j0869j3109j9176p294
$$ 24633 9619 10217 -4289 -1493 2765 15988 8025 15619 37257 26388 13279 -5897 -13191
25446a3191j2483K6788M4452k2347j0511n572K07k0551J3581L4470m042n3947
$$ -13191 -25674 1114 45566 23219 12708 7136 7343 -13208 373 34843 30801 -23146
25434b3146j9505q747J2882K0456J3658k58j7667j9097K4892K2780n171l274q183
$$ -23146 -42651 -51398 -38516 -18060 -4402 -4660 -22327 -41424 -16532 6248 1077 -2197 -10380
25421a0380n177k024q49J8223k789Q820j9891M78L0520J025J0083j6583m201l0049
$$ -10380 -15557 -17581 -18430 -207 -2996 5824 -14067 -13589 16931 17956 28039 11456 7255 -22794
25407b2794m7177j1799K224K7723Q039j3078L089J8003m142m984m819j9135L856
$$ -22794 -69971 -81770 -79546 -51823 -43784 -56862 -53773 -35770 -39912 -44896 -49715 -68850 -64994
25394f4994K3467J5253J5850r45J7767J2313k556K0851q42j0931N242K788k0607
$$ -64994 -41527 -26274 -10424 -11369 6398 18711 16155 37006 36164 25233 30475 33263 12656
25381A2656k537j6024m183l086j2313j3244K5892J2024j7348J6290N424J773R238
$$ 12656 10119 -5905 -10088 -13174 -25487 -38731 -12839 -815 -18163 -1873 3551 5324 14562
25368A4562J093k2137m3807J3011R952k00p31K0639j0825N401J7841J976Q665
$$ 14562 15655 -6482 -50289 -37278 -27326 -27526 -28257 -7618 -18443 -13042 4799 6775 15440
25355A5440K5520J7504M62k6126j1497j0047j7989L112o127m3175Q889l96n166
$$ 15440 40960 58464 58926 32800 21303 11256 -6733 -3621 -9748 -52923 -44034 -44430 -49596
25342d9596J0096J0786K4730k3463l0557K2083L2036J6066j8464l0154J0739J2355
$$ -49596 -39500 -28714 -3984 -27447 -58004 -35921 -3885 12181 -6283 -36437 -25698 -13343
25330a3343K7683l528k0618O516K1157J1272n137k7383Q13J7398j1054J432n74
$$ -13343 14340 10812 -9806 -3290 17867 29139 24002 -3381 -2568 14830 3776 5208 4634
25317D634j6033Q230m053j9677j4959k526K2076L4699K0576m361j9193j4221j3198
$$ 4634 -11399 -3169 -7222 -26899 -41858 -44384 -22308 12391 32967 28606 9413 -4808 -18006
25304a8006l56j3815j2035J3455o082j7201J6367Q453o655K2087j4386J35L8174
$$ -18006 -18362 -32177 -44212 -30757 -36839 -54040 -37673 -29220 -35875 -13788 -28174 -28039 10135
25291A0135L1071m270l8285k2279K1789l034j5569j1394R824j1191j1798n41J1343
$$ 10135 41206 36936 -1349 -23628 -1839 -4873 -20442 -31836 -22012 -33203 -45001 -45542 -34199
25278c4199m723o239m896N481J688J9848k184J1299J9473P09k8291J072L3044
$$ -34199 -38922 -45161 -50057 -44576 -42888 -23040 -25224 -13925 5548 6257 -22034 -20962 12082
25265A2082j0480k163J367k531O546K8217j386j3356q361K6937l589j3860J2699
$$ 12082 1602 -561 806 -1725 4821 33038 31652 18296 9935 36872 33283 19423 32122
25252C2122l989j4117j8262J4351Q155k0217k1333p128J5663J2327J5717P487
$$ 32122 28133 14016 -4246 10105 18260 -1957 -23290 -30418 -14755 -2428 13289 20776
25240B0776l8262K417L1396j6928O26M6742p871j4779k6123L20J7304O426L31
$$ 20776 -17486 -15069 16327 -601 25 46767 38896 24117 -2006 -1686 15618 22044 22375
25227B2375j0788j948j4691J7215L6128J9p792j0248n0044l5257J2507R418k471
$$ 22375 11587 9639 -5052 12163 48291 48310 40518 30270 -19774 -55031 -42524 -33106 -35577
25214c5577O1140K4017m1059l2572j0386q218J1889M785K039J3324K6074K7824
$$ -35577 25563 49580 8521 -24051 -34437 -42655 -30766 -25981 -23942 -10618 15456 43280
25202D3280j9755k6821K576l057K6357K534Q197j4497k528J6761J6316j7496k0277
$$ 43280 23525 -3296 -720 -3777 22580 25114 33311 18814 16286 33047 49363 31867 11590
25189A1590J4338k519k5345j3571k2181J0330J97L2438J9408Q588j5669J345p475
$$ 11590 25928 23409 -1936 -15507 -37688 -27358 -27161 5277 24685 33273 17604 18949 11474
25176A1474K3960J4049l0701k1900l798K2032m208j2741L2056M409k3933P061
$$ 11474 35434 49483 18782 -3118 -6916 15116 10908 -1833 30223 34632 10699 17760
25164A7760J3895N705k3620j9665m118K5900J5728J50q953l572q417l798J6545
$$ 17760 31655 37360 13740 -5925 -10043 15857 31585 31735 22782 19210 10793 6995 23540
25151B3540P168p2p488j5520P82J5181N602m027N427K4213k3573j0131k4246j6523
$$ 23540 30708 30636 23148 7628 8410 23591 29193 25166 30593 54806 31233 21102 -3144 -19667
25137a9667k750n82n635J5072J3535j3369j8258J2696J0513j0993M839m181Q709
$$ -19667 -22417 -22999 -28634 -13562 -27 -13396 -31654 -18958 -8445 -19438 -14599 -18780 -10071
25124a0071J4136J6008j8365j9418j1431K3522K7720K8655l698j6325n771K1535
$$ -10071 4065 20073 1708 -17710 -29141 -5619 22101 50756 47058 30733 24962 46497
25112D6497j5769k1521j7086n754M45J8425P785P586n832l006K644N312P713k0795
$$ 46497 30728 9207 -7879 -13633 -13188 5237 13022 20608 14776 11770 14414 19726 27439 6644
25098F644r328o039k3701J7518R574o199J1258J789J119l839j3060J2244k550
$$ 6644 -2684 -8723 -32424 -14906 -5332 -11531 -273 1516 2635 -1204 -14264 -2020 -4570
25085d570k3313P275j071o743K4965Q131k204l561K2671j3446l2815k5082K9732
$$ -4570 -27883 -20608 -21679 -28422 -3457 4674 2470 -1091 21580 8134 -24681 -49763 -20031
25072b0031K7122r350J1578r383K323M1117J2969k1922j0084l563P721K760j1061
$$ -20031 7091 -2259 9319 -64 2259 43376 56345 34423 24339 20776 28497 31257 20196
25059B0196k1385l7377k5323K9737Q811J7981J1285J8605K8823o026k3969k1072
$$ 20196 -1189 -38566 -63889 -34152 -25341 -7360 3925 22530 51353 45327 21358 286
25047B86k8400o564L1625J9535J7424j2588l1640k6833J280n788k75L6008J5533
$$ 286 -28114 -34678 -3053 16482 33906 21318 -10322 -37155 -35875 -41663 -41938 -5930 9603
25034I603p498K8266K1333j188k74P8k6030P125j8377j0670J1648N433L419l853
$$ 9603 2105 30371 51704 50516 50242 50320 24290 31415 13038 2368 14016 19449 22868 19015
25020A9015K1026Q599l7235J0257J9646K403p898l828q564k108k5140j6643J0034
$$ 19015 40041 48640 11405 21662 41308 43711 35813 31985 23421 21313 -3827 -20470 -10436
25007a0436p227N398K5358n224l0630K0324K078j4664L858n263P850Q310J5775
$$ -10436 -17663 -12265 13093 7869 -22761 -2437 -359 -15023 -11165 -16428 -8578 -268 15507
24994A5507j6858k1142j6669j186J6566J8513P779L3231M2640k2804k3435P294
$$ 15507 -1351 -22493 -39162 -40348 -23782 -5269 2510 35741 78381 55577 32142 39436
24982C9436r75k6047K762K3690N964m0160j1282j2181o242K9642K0612J0300j9466
$$ 39436 38461 12414 15176 38866 44830 4670 -6612 -18793 -25035 4607 25219 35519 16053
24969A6053m506k1910l4386M733O793J2502n281j4426M639K3754P818N496O564
$$ 16053 11547 -10363 -44749 -40016 -33223 -20721 -26002 -40428 -35789 -12035 -4217 1279 7843
24956G843j7144l582L6839M677J0197J903k1693P417k7260O81J5320l288q7r288
$$ 7843 -9301 -12883 23956 28633 38830 40733 19040 26457 -803 -122 15198 11910 11823 2535
24942B535J8913R087k9787j1594j5959R167K7377k5217k0769J4721Q679K2356
$$ 2535 21448 30535 748 -10846 -26805 -17638 9739 -15478 -36247 -21526 -12847 9509
24930I509J4264j0093J1643j3248L835L5556n708m5129J0186J8607q462J5103
$$ 9509 23773 13680 25323 12075 15910 51466 45758 629 10815 29422 20960 36063
24918C6063J7525m2464j9248M314J7089p011j4378k6533j427k655J7726J2797
$$ 36063 53588 11124 -8124 -3810 13279 6268 -8110 -34643 -36070 -38725 -20999 -8202
24906h202n439R20J6911Q827j7830K628J5879N934K27L306j0931j0444M501L78
$$ -8202 -13641 -12721 4190 13017 -4813 -2185 13694 19628 19855 23161 12230 1786 6287 6665
24892F665l4719N164M8435K2926J3276J988l1667j6063k3854j3077j1301M06L444
$$ 6665 -28054 -22890 25545 48471 61747 63735 32068 16005 -7849 -20926 -32227 -31821 -28377
24879b8377P262J7379L1123n083j3122L962k080r219N296J205n498p503K770J7644
$$ -28377 -21115 -3736 27387 22304 9182 13144 11064 1845 7141 8346 2848 -4655 -1885 15759
24865A5759o902L891j1138j089L268m403J0237k2356j2468K5644J6711R558R809
$$ 15759 8857 12748 1610 521 3789 -614 9623 -12733 -25201 443 17154 26712 36521
24852C6521j5830j5549j3415j835J6891l060J244J1393k288j7598P596Q634j1657
$$ 36521 20691 5142 -8273 -10108 6783 3723 4967 16360 14072 -3526 4070 12704 1047
24839A047j2218q482l269M62j6871L844J4323Q613k4200Q377K4356L7513k4688
$$ 1047 -11171 -19653 -22922 -22460 -39331 -35487 -21164 -12551 -36751 -28374 -4018 33495 8807
24826H807j9550k934K0530K2316l550R679j1312N280j1872j1550l569j1376N114
$$ 8807 -10743 -13677 6853 29169 25619 35298 23986 29266 17394 5844 2275 -9101 -3987
24813c987n819P41R08l009J4228l996J2614J7167j2660l0162J6382K6675p794
$$ -3987 -9806 -9065 -8157 -11166 3062 -934 11680 28847 16187 -13975 2407 29082 21288
24800B1288j3101r381K9219k322j5044N104J7319o633k1980k3686p128N53J8342
$$ 21288 8187 -1194 28025 25703 10659 15763 33082 26449 4469 -19217 -26345 -25792 -7450
24787g450J642K4558J2982k5312m3687J1387Q813n481J5954R992j4668m365N530
$$ -7450 -5808 18750 31732 6420 -37267 -25880 -17067 -22548 -6594 3398 -11270 -15635 -10105
24774a0105k276j8040k3441L981J279J4024M426J4868L876K8347P251K891J4158
$$ -10105 -12381 -30421 -53862 -49881 -48602 -34578 -30152 -15284 -11408 16939 24190 27081 41239
24761D1239K541j4822l0841m2038k7870K7999M620J3799j758k9464L0716J7977
$$ 41239 43780 28958 -1883 -43921 -71791 -43792 -39172 -25373 -27131 -56595 -25879 -7902
24749g902j8573n842j2978M652j3414L616L1124N623J9191J5848K0378k3683j7936
$$ -7902 -26475 -32317 -45295 -40643 -54057 -50441 -19317 -13694 5497 21345 41723 18040 104
24736A04M7786L3585j7339m1642j3246m215j797L5591r280J492j6477M631J6987
$$ 104 47890 81475 64136 22494 9248 5033 3236 38827 29547 31039 14562 19193 36180
24723C6180j6377k0033J2105K591q670m21k3028J025K7828K0384k8461k6003K001
$$ 36180 19803 -230 11875 14466 5796 5375 -17653 -16628 11200 31584 3123 -22880 -20879
24710b0879L900Q451P65J0666J7522k1833j1552J6414p490j9579j990j2495J4837
$$ -20879 -16979 -8528 -7763 2903 20425 -1408 -12960 3454 -4036 -23615 -25605 -38100 -23263
24697b3263J8023L920j4768Q866N341J7640n960p909K1343J8651J4740r113p639
$$ -23263 -5240 -1320 -16088 -7222 -1881 15759 9799 1890 23233 41884 56624 47511 39872
24684C9872r010k1128q540l45J5316p879k2897K9167K4193l2524l6612J3835J5569
$$ 39872 30862 9734 1194 849 16165 8286 -14611 14556 38749 6225 -30387 -16552 -983
24671i83j0340j142M950L407q879J6294j1255m047Q355K1115M726j9854j1662
$$ -983 -11323 -12465 -7515 -4108 -12987 3307 -7948 -11995 -3640 17475 22201 2347 -9315
24658i315n755l507R146J3929J929r277J5953J5605n293j4471j0741j5361j1611
$$ -9315 -15070 -18577 -9431 4498 6427 -2850 13103 28708 23415 8944 -1797 -17158 -28769
24645b8769r456K816L4236J7843J224O751P275k7393K6287K5849k6734m0652j0120
$$ -28769 -38225 -35409 -1173 16670 17894 24645 31920 4527 30814 56663 29929 -10723 -20843
24632b0843K2736r140k6448J5761K0784L7319J8197l1464j6924k4340j701o159
$$ -20843 1893 -7247 -33695 -17934 2850 40169 58366 26902 9978 -14362 -16063 -22222
24620b2222J6912O869k832k1764r252K817m994J6204L2112J6740k3063k8724K824
$$ -22222 -5310 1559 -1273 -23037 -32289 -29472 -34466 -18262 13850 30590 7527 -21197 -18373
24607a8373L6834J6896P869O603j4988j2868j7864n925l412J9053j1797j9840
$$ -18373 18461 35357 43226 49829 34841 21973 4109 -1816 -5228 13825 2028 -17812
24595a7812n467K3799K9098L982k0641o460j6562K290K150M69j2797R923N065
$$ -17812 -23279 520 29618 33600 12959 6499 -10063 -7773 -5623 -5154 -17951 -8028 -2963
24582b963j2005j9382j4070o503M446J3797j1732m532n585J5819P100J3535R079
$$ -2963 -14968 -34350 -48420 -54923 -50477 -36680 -48412 -52944 -58529 -42710 -35610 -22075 -12996
24569a2996R745M917m606j8933Q362k3399m740O864m686R002L0145p462j9118
$$ -12996 -3251 1666 -2940 -21873 -13511 -36910 -41650 -34786 -39472 -30470 -325 -7787 -26905
24556b6905J8912J141K2015J4809M845m236R303K488J239l5984l0809J2014L228
$$ -26905 -7993 -6852 15163 29972 34817 30581 39884 42372 43611 7627 -23182 -11168 -7940
24543g940m365j6460r057J4448K1981Q332j842P984o045j280p681k1025K2452
$$ -7940 -12305 -28765 -37822 -23374 -1393 6939 5097 13081 7036 5756 -1925 -22950 -498
24530d98Q471J102n247j6983L090K1158j0783l858J5344L3047j721q797p342K868
$$ -498 7973 9075 3828 -13155 -10065 11093 310 -3548 11796 44843 43122 34325 26983 29851
24516B9851k0187q388J4185Q334Q030l3824l5349k358K2092K2025Q458j8505k718
$$ 29851 9664 1276 15461 23795 31825 -1999 -37348 -39706 -17614 4411 12869 -5636 -8354
24503h354k498J5501K5556J1925j3673k9559Q143j2020j8859M809L9000K2873
$$ -8354 -10852 4649 30205 42130 28457 -1102 7041 -4979 -23838 -19029 19971 42844
24491D2844j1950l3045j6378j4426J1530q431M524J2343L6614J8062O077r668
$$ 42844 30894 -2151 -18529 -32955 -21425 -29856 -25332 -12989 23625 41687 47764 38096
24479C8096k0739k6847j7264J9169L2156L895k15k8698j6888k1114r393J0764
$$ 38096 17357 -9490 -26754 -7585 24571 28466 28251 -447 -17335 -38449 -47842 -37078
24467c7078K0432P790J261j6768j294K3232K1003j7427k1403N759K8142j1240
$$ -37078 -16646 -8856 -7595 -24363 -25657 -2425 18578 1151 -20252 -14493 13649 2409
24455B409o20k146p007J2124O257Q497k0298k1092J215j2126K921r113J0274J9217
$$ 2409 1789 -357 -7364 4760 11017 19514 -784 -21876 -20661 -32787 -29866 -38979 -28705 -9488
24441i488N729j0059p169J161p814k6468K5486K5461J6508l1475p965L453L984
$$ -9488 -3759 -13818 -20987 -19826 -27640 -54108 -28622 -3161 13347 -18128 -26093 -22640 -18656
24428a8656m423p135k0159k5923P129O611j994J6634J219K0005L1749N901m0864
$$ -18656 -23079 -30214 -50373 -76296 -69167 -62556 -64550 -47916 -46697 -26692 5057 10958 -29906
24415b9906k3536J7977j899j0318J4097K6198K3709J6432l2301j5455K5984K7153
$$ -29906 -53442 -35465 -37364 -47682 -33585 -7387 16322 32754 453 -15002 10982 38135
24403C8135M631k4416r359N41M802j0448k0639L79j4217k759J5076J2906J1867
$$ 38135 42766 18350 8991 9532 14334 3886 -16753 -16374 -30591 -33350 -18274 -5368 6499
24390F499J5252j0738m2342m0348J4611K7023M1923J3118k5000j6826J4285j4523
$$ 6499 21751 11013 -31329 -71677 -57066 -30043 11880 24998 -2 -16828 -2543 -17066
24378a7066J909o108J4983K0485M685j5662q295p852j1993J4686J3251K852N243
$$ -17066 -15157 -21265 -6282 14203 18888 3226 -5069 -12921 -24914 -10228 3023 5875 11118
24365A1118j8105j663P530M399J4330j4390j7218O731J1149J106J8787J7561r409
$$ 11118 -6987 -8650 -1120 3279 17609 3219 -13999 -7268 3881 4987 23774 41335 31926
24352C1926J4934j5859o847R672j6764j4443m794j1062J2851r113J6101n522j9986
$$ 31926 46860 31001 24154 33826 17062 2619 -2175 -13237 -386 -9499 6602 1080 -18906
24339a8906L429p607j0681J1386P94P791r595K0Q397K4206J2336j150j5606j9794
$$ -18906 -15477 -23084 -33765 -22379 -21585 -13794 -23389 -23369 -14972 9234 21570 20420 4814 -14980
24325a4980J5020p642m579p933j250j4886j6810J6369K6644J0185K964K0086j2003
$$ -14980 40 -7602 -12181 -20114 -21364 -36250 -53060 -36691 -10047 138 3102 23188 11185
24312A1185j8185J4454L447Q806k5214j8430K0706K079J2568K0281J9905k203
$$ 11185 -7000 7454 10901 19707 -5507 -23937 -3231 -1152 11416 31697 51602 49399
24300D9399j5408j3781j9249j7225j983j1369k6707k0254j3541J2732L0740L6708
$$ 49399 33991 20210 961 -16264 -18247 -29616 -56323 -76577 -90118 -77386 -46646 -9938
24288i938L8716n816j9759j4794j438j5670N719j2428J1090J6309P514q359M492
$$ -9938 28778 22962 3203 -11591 -13029 -28699 -22980 -35408 -24318 -8009 -495 -8854 -4362
24275d362j6599k4603J9724K4592J684L237o579j7255N152l953P489N979K1796
$$ -4362 -20961 -45564 -25840 -1248 436 3673 -2906 -20161 -15009 -18962 -11473 -5494 16302
24262A6302Q758m0286q859j4856k2299n232L2016J6077q524j1256J4214p226J1993
$$ 16302 25060 -15226 -24085 -38941 -61240 -66472 -34456 -18379 -26903 -38159 -23945 -31171 -19178
24249a9178J5483O722R36j5123J626J714j660M846O110j3545m284m964n979K6643
$$ -19178 -3695 3027 3963 -11160 -9534 -7820 -9480 -4634 1476 -12069 -16353 -21317 -27296 -653
24235f53L8279J1197P29j5706j2141k466k968L08j8123j3489J3433j9189L764
$$ -653 37626 48823 49552 33846 21705 19239 16271 16579 -1544 -15033 -1600 -20789 -17025
24222a7025j394k218l878k0579R856r315L01j2664Q317L5861N7649q077l2266
$$ -17025 -18419 -20637 -24515 -45094 -35238 -44553 -44252 -56916 -48599 -12738 44911 36834 4568
24209D568P825l184k2265j0115o876M721K7514J254k0440j2177p50J5813J5524
$$ 4568 12393 9209 -13056 -23171 -30047 -25326 2188 3442 -16998 -29175 -29925 -14112 1412
24196A412K0347j6535j1440j8533l1199K219P807L823K8080J4487k0299N771p480
$$ 1412 21759 5224 -6216 -24749 -55948 -53729 -45922 -42099 -14019 468 -19831 -14060 -21540
24183b1540J9409P998j792o671p942O7K1031J2130Q267L138k7534k7554j7840
$$ -21540 -2131 5867 4075 -2596 -10538 -10471 10560 22690 30957 34095 6561 -20993 -38833
24170c8833l529l400K1157L3786j2005j9121q588J307K0819K6586j5754N639m857
$$ -38833 -42362 -45762 -24605 9181 -2824 -21945 -30533 -29226 -8407 18179 2425 8064 3207
24157C207p428J990J3415R82k9062j4278J3042J7455J6214J7572J6680j2514L956
$$ 3207 -4221 -2231 11184 12166 -16896 -31174 -18132 -677 15537 33109 49789 37275 41231
24144D1231m2j7962k6857q306M248M3593K4183n703k4032n1230j6496l426K1951
$$ 41231 41189 23227 -3630 -11936 -7688 35905 60088 54385 30353 -20877 -37373 -40799 -18848
24131a8848K2076j9898j5484J6062J4672K4795k9496J7043r361K0019N551j4400
$$ -18848 3228 -16670 -32154 -16092 -1420 23375 -6121 10922 1561 21580 27131 12731
24119A2731l3350j465M88k0104m652J1338N01k664m862o056J3884K3138J4375
$$ 12731 -20619 -22084 -21596 -41700 -46352 -35014 -34513 -37177 -42039 -48095 -34211 -11073 3302
24106C302j5410R201q230j0085q517K3166L1485R316j6335J23j1205k1156l8322
$$ 3302 -12108 -2907 -11137 -21222 -29739 -6573 24912 34228 17893 18016 6811 -14345 -52667
24093e2667k376L3037K3294M152J0894J1665k4380N805J4492O921R758o457Q901
$$ -52667 -55043 -22006 1288 5440 16334 27999 3619 9424 23916 30837 40595 34138 43039
24080D3039K6651p129k2678p359j6208k3740l1803K7356J7297K7811L259o931
$$ 43039 69690 62561 39883 32524 16316 -7424 -39227 -11871 5426 33237 36496 29565
24068B9565j6384k9214N995R205k1443r685P091M411m903J4910Q979J0859k6001
$$ 29565 13181 -16033 -10038 -833 -22276 -31961 -24870 -20459 -25362 -10452 -1473 9386 -16615
24055a6615k7483R527K9169J0707Q679K368R123J232j1342N282J7271j557j0442
$$ -16615 -44098 -34571 -5402 5305 13984 16352 25475 26707 15365 20647 37918 36361 25919
24042B5919k950K7195q828n4216l823K5223K2973J1987j9840l2057k270L9187
$$ 25919 22969 50164 41336 -12880 -16703 8520 31493 43480 23640 -8417 -10687 28500
24030B8500l424k4299O988l784j1585J9455j4121k0636K4881l549r146K51J3024
$$ 28500 25076 777 7765 3981 -7604 11851 -2270 -22906 1975 -1574 -10720 -10469 2555
24017B555j0450j7984J5121J1698j2654l900m118K4309J999j6243l374j8815R812
$$ 2555 -7895 -25879 -10758 940 -11714 -15614 -19732 4577 6576 -9667 -13041 -31856 -22044
24004b2044K2896n98N133j2044J885Q101J7623n596j5298k830m596K379J4337
$$ -22044 852 254 5387 -6657 -4772 3329 20952 15356 58 -2772 -7368 -4989 9348
23991I348m898j6929o314J0635J7328J3319m362J3452L21j8154L17N379p067j8794
$$ 9348 4450 -12479 -18793 -8158 9170 22489 18127 31579 31900 13746 14063 19442 12375 -6419
23977f419j0643O384R316P328n456J0863k5492l0241L5326J9276j0555m850J71
$$ -6419 -17062 -10678 -1362 5966 510 11373 -14119 -44360 -9034 10242 -313 -5163 -4992
23964d992m142Q847K7346j2229O612K2696K4510k6412j0577q05J867K756j2969
$$ -4992 -9134 -287 27059 14830 21442 44138 68648 42236 31659 30854 32721 35477 22508
23951B2508p388R482q290j3110Q492p7p189J1193k0103k8422K6486J5792j0549
$$ 22508 15120 24602 16312 3202 11694 11617 4428 15621 -4482 -32904 -6418 9374 -1175
23938a175p035L0746J0390j1329K548J1607L21k4819L747J0361j744k3598k0917
$$ -1175 -8210 22536 32926 21597 24145 35752 36073 11254 15001 25362 23618 20 -20897
23925b0897m823R916K5451J60M561j8787r834r345j3243J7868J2174O239j131
$$ -20897 -25720 -15804 9647 9807 14368 -4419 -14253 -23598 -36841 -18973 -6799 -560 -1691
23912a691n66K9294P654j0830j9477k9293j277J9499J1155K15J1743K4534p564
$$ -1691 -2257 27037 34691 23861 4384 -24909 -26186 -6687 4468 4683 16426 40960 33396
23899C3396k1288j8225M730K3412J5467q541k8942r842k1509M988N942J1969O132
$$ 33396 12108 -6117 -1387 22025 37492 28951 9 -9833 -31342 -26354 -20412 -8443 -2311
23886b311N938M934m221m238J2023K661m275k7031j4244O719j40R210J9479j1622
$$ -2311 3627 8561 4340 102 12125 14786 10511 -16520 -30764 -24045 -24185 -14975 4504 -7118
23872g118J7K4413k9080j0461R724j9282M067K6826J6906R343k701k8128L834
$$ -7118 -7101 17312 -11768 -22229 -12505 -31787 -27720 -894 16012 25355 22654 -5474 -1640
23859a640j6282j5222O972K4629R400j6651j0624J4415j5931l85J6441L0639K4
$$ -1640 -17922 -33144 -26172 -1543 7857 -8794 -19418 -5003 -20934 -21319 -4878 25761 25785
23846B5785o698R017j5154j2431j7463l675J9067M899k4461N742n470J0168K7041
$$ 25785 19087 28104 12950 519 -16944 -20619 -1552 3347 -21114 -15372 -20842 -10674 16367
23833A6367q61m846j8703L8044j9913n976n392j7632P284L0961j8563j6154J0746
$$ 16367 15506 10660 -8043 30001 10088 4112 -1280 -18912 -11628 19333 770 -15384 -4638
23820d638J5164J9094j4248k7652Q139m615j2132K1270m177J7733P919k0420k1983
$$ -4638 10526 29620 15372 -12280 -4141 -8756 -20888 382 -3795 13938 21857 1437 -20546
23807b0546o047l838J1699J6180n168j3954l357p29J008N930K3618j2436J1595
$$ -20546 -26593 -30431 -18732 -2552 -7720 -21674 -25031 -25760 -24752 -18822 4796 -7640 3955
23794C955K3505o56m9108j3042K2174M0009J405k4757j1202r943Q678K341l118
$$ 3955 27460 26804 -22304 -35346 -13172 26837 28242 3485 -7717 -17660 -8982 -6641 -9759
23781i759j062k3052l625q626j7498L7596K9808J838N104o141N113J6763O845
$$ -9759 -10821 -33873 -37498 -46124 -63622 -26026 3782 5620 10724 4583 9696 26459 33304
23768C3304l576J381K3012j6632K9k1174p552o10k6898M474J5586j964j0600j714
$$ 33304 29728 31109 54121 37489 37518 16344 8792 8182 -18716 -14242 1344 -620 -11220 -12934
23754a2934M496M161j1410P865j4859o362R569k420J5532K5333K2484R59j7338
$$ -12934 -8438 -4277 -15687 -7822 -22681 -29043 -19474 -21894 -6362 18971 41455 42414 25076
23741B5076j6595L647j4390j789n68k845J8404K0062j5193o343J920j678o654
$$ 25076 8481 12128 -2262 -4051 -4619 -7464 10940 31002 15809 9466 11386 9708 3054
23728C054n800m870K7712j966l519R871k3786k3454L737J7047n136k3024j386
$$ 3054 -2746 -7616 20096 18130 14611 24482 696 -22758 -19021 -1974 -7110 -30134 -31520
23715c1520K5032J4547l241j1452k8311J1261j230L435L185J1576o321o803j3266
$$ -31520 -6488 8059 4818 -6634 -34945 -23684 -24914 -21479 -18294 -6718 -13039 -19842 -33108
23702c3108J7757J0968N121M283K0135k2596J0768K8215J1352j3308q667k2708
$$ -33108 -15351 -4383 738 5021 25156 2560 13328 41543 52895 39587 30920 8212
23690H212m946J5126K1860j246l4k593r019j0382j5018m750o576J9136R764P73
$$ 8212 3266 18392 40252 39006 38972 36379 27360 16978 1960 -2790 -9366 9770 19534 20307
23676B0307O932j5172k2690l4768J6698J9634n686j258N645P648K93R631m384
$$ 20307 27239 12067 -10623 -45391 -28693 -9059 -14745 -16003 -10358 -2710 -2417 7214 2830
23663B830M744J7337Q624r703l691j9790j9978L351R880M636k1298O59L9492k1
$$ 2830 7574 24911 33535 23832 20141 351 -19627 -16276 -6396 -1760 -23058 -22399 17093 17072
23649A7072j0033j9901l788K9014J8829J7123j4240j6980K1651k283j292J8753
$$ 17072 7039 -12862 -16650 12364 31193 48316 34076 17096 38747 36464 35172 53925
23637E3925K0349j4721k4959l6039j4898m386L831O233n88J2687J1954k3442j2747
$$ 53925 74274 59553 34594 -1445 -16343 -20729 -16898 -10665 -11253 1434 13388 -10054 -22801
23624b2801P070P725L081j0042k7148m0310J2562J1454M5435J4204j4319J5618
$$ -22801 -15731 -8006 -4925 -14967 -42115 -82425 -69863 -58409 -12974 1230 -13089 2529
23612B529R698J8127l187K652J0475j2998l192J2967K3966q032q870k0822k2203
$$ 2529 12227 30354 27167 29819 40294 27296 24104 37071 61037 53005 44135 23313 1110
23599A110j0154L22o604q686K6363M0248k0018l9247m530J7222o129k3235P783
$$ 1110 -9044 -8722 -15326 -24012 2351 42599 22581 -16666 -21196 -3974 -10103 -33338 -25555
23586b5555K367L940P94o069j4233J1811J0984J2336Q58J2373O497R417j2763
$$ -25555 -23188 -19248 -18454 -24523 -38756 -26945 -15961 -3625 -2767 9606 16103 25520 12757
23573A2757J9723J759l4294k798R209k6466j2003J2428J4145J3274J439j2995
$$ 12757 32480 34239 -55 -2853 6356 -20110 -32113 -19685 -5540 7734 9173 -3822
23561c822M271M188p166o971q041j0168K3079J6991O899n589m884l112j3441k3640
$$ -3822 449 4637 -2529 -9500 -17541 -27709 -4630 12361 19260 13671 8787 5675 -7766 -31406
23547c1406J797L5752L298k4705j0831J181m248K1538J1757J5421O992j4913K023
$$ -31406 -29609 6143 9441 -15264 -26095 -24914 -29162 -7624 4133 19554 26546 11633 13656
23534A3656O152q884M328j411P353K4965j3762k8052K878L2209k5486l7489J0368
$$ 13656 19808 10924 15252 13841 21194 46159 32397 4345 7223 39432 13946 -23543 -13175
23521a3175J8007m908j6824j4073k317K791P1J2962J2650m214J1805K2611Q16
$$ -13175 4832 -76 -16900 -30973 -33290 -30499 -30428 -17466 -4816 -9030 2775 25386 26202
23508B6202p734O791j0813q651j1119J9081L3280Q629k1698k1995J5715J1571
$$ 26202 18468 25259 14446 5795 -5324 13757 47037 55666 33968 11973 27688 39259
23496C9259j6392j7503j0189J15j2365P828j4174K5950j269J723M170p217J7571
$$ 39259 22867 5364 -4825 -4710 -17075 -9247 -23421 2529 1260 2983 7153 -64 17507
23483A7507Q204J0061j9744j8353j156k1897j843P604N639L0438J4110J582j8575
$$ 17507 25711 35772 16028 -2325 -3481 -25378 -27221 -19617 -13978 16460 30570 32152 13577
23470A3577K547J4460R075N269j4828o794o130k3873K9449O344k7047O466M172
$$ 13577 16124 30584 39659 44928 30100 23306 17176 -6697 22752 29096 2049 8515 12687
23457A2687K3803k777k7239l9169L3357M2249j4778j3260M452O595k656l938p026
$$ 12687 36490 33713 6474 -32695 662 42911 28133 14873 19325 25920 23264 19326 12300
23444A2300q138q522j952J7595j8303r340M553J200j1750K8807L8327M699j8112
$$ 12300 4162 -4360 -6312 11283 -7020 -16360 -11807 -10607 -22357 6450 44777 49476 31364
23431C1364j0494r843o612N223J8550R408j9386j3788j9136K0060L7386j283o265
$$ 31364 20870 11027 4415 9638 28188 37596 18210 4422 -14714 5346 42732 41449 35184
23418C5184n008k7765l699J3308l532j3564Q695L0363j1437n634J4654o141J0426
$$ 35184 30176 2411 -1288 12020 8488 -5076 3619 33982 22545 16911 31565 25424 35850
23405C5850l641m18j5363j4728L699J306q176o134j0066K0392J3602R354k1160
$$ 35850 32209 31791 16428 1700 5399 6705 -1471 -7605 -17671 2721 16323 25677 4517
23392D517j9448j5826l323l891J4042K4904P775q538j8462K5915j4456j3397J9068
$$ 4517 -14931 -30757 -34080 -37971 -23929 975 8750 212 -18250 7665 -6791 -20188 -1120
23379a120J5059J5852k5195o824j464P890j0870K875J5887j938j400k136J9642
$$ -1120 13939 29791 4596 -2228 -3692 4198 -6672 -3797 12090 10152 8752 6616 26258
23366B6258j4579j8473J60j9054R484J6260P114J6743j0014J7389J0735l372l1442
$$ 26258 11679 -6794 -6634 -25688 -16204 56 7170 23913 13899 31288 42023 38651 7209
23353G209k1650K8173L209j7448O180K0845K3470j0469j5430R820n017k7026q147
$$ 7209 -14441 13732 16941 -507 5673 26518 49988 39519 24089 33909 28892 1866 -6281
23340f281p516J3719L304M488k7292M878J1635N627l856j2012R981Q397o656j6466
$$ -6281 -13797 -78 3226 7714 -19578 -14700 -3065 2562 -1294 -13306 -3325 5072 -1584 -18050
23326a8050k3263L8233J6481N900j2057Q678K2356P588l5532m188j6455J2437
$$ -18050 -41313 -3080 13401 19301 7244 15922 38278 45866 10334 6146 -10309 2128
23314B128K7024j3937j0233J2850P461q031k728K2492N069o235J0777K3274j4764
$$ 2128 29152 15215 4982 17832 25293 17262 14534 37026 42095 35860 46637 69911 55147
23301E5147l1322j3925J0761j2568j0423n948J249j0868L297K0400O50j6717n518
$$ 55147 23825 9900 20661 8093 -2330 -8278 -7029 -17897 -14600 5800 6450 -10267 -15785
23288a5785j95o89n434J8146K4238J8498M518j363m2308j6440N592K9466r542
$$ -15785 -15980 -16669 -22103 -3957 20281 38779 43297 41934 -374 -16814 -11222 18244 8702
23275H702k5656m370J5436J0754o820k574j007n85J0186k813o405o954j667J0487
$$ 8702 -16954 -21324 -5888 4866 -1954 -4528 -5535 -6120 4066 1253 -5152 -12106 -13773 -3286
23261c286J4375n880m741q474l98J7518q596J0364J4431j1142j0496r02K530r622
$$ -3286 11089 5209 468 -8006 -8404 9114 518 10882 25313 14171 3675 2773 5303 -4319
23247d319J6542K8587n267r566l813k2689Q935K4631J1416l104l2162j0287J0748
$$ -4319 12223 40810 35543 25977 22164 -525 8410 33041 44457 41353 9191 -1096 9652
23234I652j134n79J214L108k253p031j0616P864R891N143j2252j327m204k5649
$$ 9652 8518 7939 9153 12261 10008 2977 -7639 225 10116 15259 3007 1680 -2524 -28173
23220b8173j5890j0595O532K6281j091k0258M2509L0736j5442j9078O554O109
$$ -28173 -44063 -54658 -48126 -21845 -22936 -43194 -685 30051 14609 -4469 2085 8194
23208H194j8159J8060J0182J2228j4384J4612L048j3916j2699m524M861j1839
$$ 8194 -9965 8095 18277 30505 16121 30733 33781 19865 7166 2642 7503 -4336
23196d336j3714o768K1017l535j8789J637N391R873K9229Q563k639J4279K3319
$$ -4336 -18050 -24818 -3801 -7336 -26125 -24488 -19097 -9224 20005 28568 25929 40208 63527
23183F3527j5328r283N39j2199Q073R657p195j5985n941O485J1987j5657k6804
$$ 63527 48199 38916 39455 27256 35329 44986 37791 21806 15865 22350 34337 18680 -8124
23170h124m943j0331q72J6155K75k7336Q43O492j4498n258j820J0686M1449K9626
$$ -8124 -13067 -23398 -24270 -8115 -7840 -35176 -34333 -27841 -42339 -47597 -49417 -38731 2718 32344
23156C2344J6400q303j7413j3703q353J0244J0597N233r069p635j0997n657o514
$$ 32344 48744 40441 23028 9325 972 11216 21813 27046 17977 10342 -655 -6312 -12826
23143a2826J6232J545j4596L5927K1484q656J4359r691r876j3262k7691Q366L0140
$$ -12826 3406 4951 -9645 26282 47766 39110 53469 43778 33902 20640 -7051 1315 31455
23130C1455J1571j658k2544l700j8889k6868m326J5332k596L63J0445j289M766
$$ 31455 43026 41368 18824 15124 -3765 -30633 -34959 -19627 -22223 -21860 -11415 -12704 -7938
23117g938P712n202m456J3001r123J0615J8407j6013J5084K038j2556J895J1120
$$ -7938 -226 -5428 -9884 3117 -6006 4609 23016 7003 22087 24125 11569 13464 24584
23104B4584n994k2187n933m684K1653Q227K0530K825k4853l5497R816O943j1150
$$ 24584 18590 -3597 -9530 -14214 7439 15666 36196 39021 14168 -21329 -11513 -4570 -15720
23091a5720k3902N603K9385J3089M971l844j26p390J7442K6463N098j620o182
$$ -15720 -39622 -34019 -4634 8455 13426 9582 9456 2066 19508 45971 51069 49449 43267
23078D3267k1920N451O972n441j4374j3671L022j6536K0608l681o637J6788J1909
$$ 43267 21347 26798 33770 28329 13955 284 3306 -13230 7378 3697 -2940 13848 25757
23065B5757K09j4832j1787J7694M7069K5818M1072N7745M1836J0468k5158j9666
$$ 25757 25966 11134 -653 17041 64110 89928 131000 188745 230581 241049 215891 196225
23053A96225l4927m6724k6825k7602k8732k4454j1400j9535L5752N994J1653k4105
$$ 196225 161298 114574 87749 60147 31415 6961 -4439 -23974 11778 17772 29425 5320
23041E320j246O538J0798P595l3780m032K0997J3085J173j9083j5778k289M13
$$ 5320 4074 10612 21410 29005 -4775 -8807 12190 25275 26448 7365 -8413 -10702 -10289
23028a0289J8073J4614K6724k607m7714k7583j988j522K0022R716o703r870J7571
$$ -10289 7784 22398 49122 46515 -1199 -28782 -30770 -32292 -12270 -2554 -9257 -19127 -1556
23015a556J1737K5292m835j4088K9253q84k4042N167k0828j6240R712J3313l845
$$ -1556 10181 35473 30638 16550 45803 44919 20877 26044 5216 -11024 -1312 12001 8156
23002H156j3451J5006K3104m691j4147J200o838p231j5739M679K3464o884r70
$$ 8156 -5295 9711 32815 28124 13977 15177 8339 1108 -14631 -9952 13512 6628 5658
22989E658L3739j7912k2589J3071l329O274N821Q636j7331J1183J4305o22j3735
$$ 5658 39397 21485 -1104 11967 8638 14912 20733 29369 12038 23221 37526 36904 23169
22976B3169l185J7940J1116j4848k3777K6323j5156l9534j634J3245j727K4579
$$ 23169 19984 37924 49040 34192 10415 36738 21582 -17952 -19586 -6341 -8068 16511
22964A6511K6650Q199J3827k852j6525J0222N3j5816m3095k2262l177K5871J3742
$$ 16511 43161 51360 65187 62335 45810 56032 56085 40269 -2826 -25088 -28265 -2394 11348
22951A1348L5727J3575m5115k3219K0438K1750J0409j591l9988j3503J3819J6098
$$ 11348 47075 60650 15535 -7684 12754 34504 44913 43322 3334 -10169 3650 19748
22939A9748O540p998l5494J3377L8418q494k4328N620j7552q154K1250K7574K5780
$$ 19748 26288 18290 -17204 -3827 34591 26097 1769 7389 -10163 -18317 2933 30507 56287
22926E6287P776q885P158j7709p923N435Q571l633m969K3564J0872j5275j281
$$ 56287 64063 55178 62336 44627 36704 42139 50710 47077 42108 65672 76544 61269 59988
22913E9988L2823K9467N4607M1830O0525R2859J55217K15707L07202K78653J59218
$$ 59988 92811 122278 176885 218715 279240 372099 527316 743023 1050225 1328878 1488096
22902A488096n0916k39545k70664k19179j62369j05967l0004J6973K8575L9365
$$ 1488096 1437180 1197635 926971 707792 545423 439456 409452 426425 455000 494365
22892D94365J728m5059r8590r9220p4634n1346l1022o498j3729p088Q175j5368
$$ 494365 496093 451034 352444 253224 178590 127244 96222 89724 75995 68907 77082 61714
22880F1714N949j8239r062k3440M93P819N968J6457l597j155k7603j2235J1266
$$ 61714 67663 49424 40362 16922 17415 25234 31202 47659 44062 42907 15304 3069 14335
22867A4335J8974q28k651K4206q127J0886K7994j2187Q304L742k9331j1380O183
$$ 14335 33309 32481 29830 54036 45909 56795 84789 72602 80906 84648 55317 43937 50120
22854E0120J980r731k6264q882R35j3358j130J14j2802J0712K3582K47J4718J7370
$$ 50120 52100 42369 16105 7223 8158 -5200 -6330 -6216 -19018 -8306 15276 15523 30241 47611
22840D7611m509k0479J4279J947k4116P30L356Q457J0858p630Q399K1275j203
$$ 47611 43102 22623 36902 38849 14733 15463 18819 27276 38134 30504 38903 60178 58975
22827E8975j3239J8275J0823r142k5220k5084k0346M730Q508j6724m6517K9137
$$ 58975 45736 64011 74834 65692 40472 15388 -4958 -228 8280 -8444 -54961 -25824
22815b5824N3711J8731k3579j2086L2131k2634o320J2428L298L152N683K8575
$$ -25824 27887 46618 23039 10953 43084 20450 14130 26558 29856 33008 38691 67266
22803F7266m66K422J1797j2864k0912k016j1412j244R47n460K787J1607k4731
$$ 67266 66800 69222 81019 68155 47243 45227 33815 32571 33518 28058 30845 42452 17721
22790A7721j3956j265J8084L875o247m0864q514L264J2149L1386K1246j799J1359
$$ 17721 3765 2500 20584 24459 18212 -22652 -31166 -27902 -15753 15633 36879 35080 46439
22777D6439j5011j6630k5694M68J7146j0622p836K0546Q27j0821K020p205O707
$$ 46439 31428 14798 -10896 -10428 6718 -3904 -11740 8806 9633 -1188 832 -6373 334
22764C34j895K9081P174J807l884l4815j1060K678J5846J4546k289K5037J9615
$$ 334 -1561 27520 34694 36501 32617 -2198 -13258 -10580 5266 19812 17523 42560 62175
22751F2175r558k0704J5884L7864K14p830J3109R728k8901j2262m128j5766q479
$$ 62175 52617 31913 47797 85661 85875 78045 91154 100882 71981 59719 55591 39825 31346
22738C1346n473o596j6784j4609R875K9054p263l79j6348R312K2290K1513J3665
$$ 31346 25873 19277 2493 -12116 -2241 26813 19550 19171 2823 12135 34425 55938 69603
22725F9603j3554k4931k5111r915J4932J0142Q272J3372R688J487j8236n272j1080
$$ 69603 56049 31118 6007 -3908 11024 21166 29438 42810 52498 53985 35749 30477 19397
22712A9397J7247L123M122q093J1046r761l7889J5301k3028j8258O281K860j332
$$ 19397 36644 39767 43889 35796 46842 37081 -808 14493 -8535 -26793 -20512 -17652 -18984
22699a8984O786O74M2252J7913j3413k3319q185P134j0568J7536N076k6919J3004
$$ -18984 -12198 -11524 30728 48641 35228 11909 3724 10858 290 17826 22902 -4017 8987
22686H987L3466J8197p676q655j5544j2196l219k3073J9064n782j290j454k507
$$ 8987 42453 60650 52974 44319 28775 16579 13360 -9713 9351 3569 2279 825 -1682
22673a682q66K0527L7348J7940M382K8927J7982l8500k1960k0797J653J7297l138
$$ -1682 -2548 17979 55327 73267 77649 106576 124558 86058 64098 43301 44954 62251 59113
22660E9113p708N479K6950q517m277L6703L2081j0709m3813n6624l0506J4484
$$ 59113 51405 56884 83834 75317 71040 107743 139824 129115 85302 28678 -1828 12656
22648A2656L5144K1005J3198k9309J519j7941j6562k3017l431J8368K4242o175
$$ 12656 47800 68805 82003 52694 54213 36272 19710 -3307 -6738 11630 35872 29697
22636B9697J203n407q674P34l091K6296K232O546j6955j8150J550J9834J646L167
$$ 29697 30900 25493 16819 17553 14462 40758 42990 49536 32581 14431 15981 35815 37461 40628
22622D0628J2324J2424l19p189j0522Q587L1691L4738L2923J9497l445p228K0763
$$ 40628 52952 65376 65057 57868 47346 55933 87624 122362 155285 174782 171337 164109 184872
22609A84872j3746m5475m7594j8436J0412l475j9827o310L306K4319k2860l0298
$$ 184872 171126 125651 78057 59621 70033 66558 46731 40421 43727 68046 45186 14888
22597A4888J1717K892J2673M1975j3295j2852M936J3131O854r942l4180r09j3605
$$ 14888 26605 29497 42170 84145 70850 57998 62934 76065 82919 72977 38797 37888 24283
22584B4283J9321k5104j7806M2957K2033J4692J3330K640j756L524j6867P795
$$ 24283 43604 18500 694 43651 65684 80376 93706 96346 94590 98114 81247 89042
22572H9042O145o195J502J0625j1241k8289m240M478J4231J9614K0751p252j1783
$$ 89042 95187 88992 90494 101119 89878 61589 57349 61827 76058 95672 116423 109171 97388
22559I7388k8122j0956k1722J6369N3755L8128K4811n332j9937j572k5760k3615
$$ 97388 69266 58310 36588 52957 106712 144840 169651 164319 144382 142810 117050 93435
22547I3435j4110P344R03k9200j7552j218p696J5404j6716k2590m516j1616j3889
$$ 93435 79325 86669 87572 58372 40820 39602 31906 47310 30594 8004 3488 -8128 -22017
22534b2017M8884M0536R092M1329M0781n483k4313j8571k6087q927m650M1791
$$ -22017 26867 67403 76495 117824 158605 153122 128809 110238 84151 75224 70574 112365
22522A12365K7572J4087K2798K6454M1619L8911L6596L3340k1635m0653k7353
$$ 112365 139937 154024 176822 203276 244895 283806 320402 353742 332107 291454 264101
22511B64101n6902l7973j9412j5701J753K059k5447j5343Q723L2220j8131J6989
$$ 264101 207199 169226 149814 134113 135866 137925 112478 97135 105858 138078 119947 136936
22499A36936J9972Q621l666n173j5387J044K0478Q204P4572O5231J14295J48398
$$ 136936 156908 165529 161863 156690 141303 142347 162825 171029 245601 310832 425127 573525
22487E73525J80751J27277O2951n5544r1017j43243j43666j10013j01668o6856
$$ 573525 754276 881553 944504 888960 797943 654700 511034 401021 299353 232497
22477B32497n6180j3221L324r838k6473k370L2841j351k501L0291J8948J499r210
$$ 232497 176317 163096 166420 156582 130109 127739 160580 159229 156728 187019 205967 207466 198256
22464A98256P134K0184k893j0996l0750K7997K0303j318N549l3754k9747Q556
$$ 198256 205390 225574 222681 211685 180935 208932 229235 227917 233466 199712 169965 178521
22452A78521L6950N413K6000L1553l613K5367J2387J1218Q677J6522K0802L5162
$$ 178521 215471 220884 246884 278437 274824 300191 312578 323796 332473 348995 369797 404959
22440D04959L4881L0988M7234J02396J87503L09434L40980K65473J31911j01147
$$ 404959 439840 470828 518062 620458 807961 1117395 1458375 1723848 1855759 1754612
22430A754612k85302k94667k41676j61337j22605j11538q2025l4499P754l0526
$$ 1754612 1469310 1174643 932967 771630 649025 537487 455462 420963 428717 398191
22420C98191o401q882j0678J8627L4034O4475L7854J5333l989J8420R614K8756
$$ 398191 391790 382908 372230 390857 424891 489366 527220 542553 538564 556984 566598 595354
22408E95354J8555Q719K0022L1496M6313L620J0147L9179K7490L3941M1404M3429
$$ 595354 613909 622628 642650 674146 720459 724079 734226 773405 800895 834836 876240 919669
22396I19669J12926J67013J59509O4791j27k0448M3961J34693J26356J05757J14062
$$ 919669 1032595 1199608 1359117 1423908 1423781 1403333 1447294 1581987 1708343 1814100 1928162
22385A928162J34244J37045J84662K07059K22556K29797K62621L34480L77043
$$ 1928162 2062406 2199451 2384113 2591172 2813728 3043525 3306146 3640626 4017669
22376D017669M06142N27906P28914R41748J214838J584623K101552K835785L816365
$$ 4017669 4423811 4951717 5680631 6622379 7837217 9421840 11523392 14359177 18175542
22367A8175542N012568O624449R456935J5053413K6148975M4702121O2395985
$$ 18175542 23188110 29812559 39269494 54322907 80471882 125174003 187569988
22360A87569988N9908543L3827608o517797m3252595n7188294n2218677l8699128
$$ 187569988 247478531 281306139 274788342 231535747 174347453 122128776 83429648
22353H3429648k5562933j6475679j0721301p225176n136910l846729k895478k180996
$$ 83429648 57866715 41391036 30669735 23444559 18307649 14460920 11565442 9384446
22345I384446j678393j341130j043433q18855o64340n32384l68596l16932k93049
$$ 9384446 7706053 6364923 5321490 4502635 3838295 3305911 2937315 2620383 2327334
22336B327334k26851j48796j49800j39339j19199j04911r2488q1988o6442j7216
$$ 2327334 2100483 1951687 1801887 1662548 1543349 1438438 1345950 1263962 1197520 1180304
22326A180304J5372n324k0736L2338P936m8626p9173q3303q0547j03401j06310
$$ 1180304 1195676 1190352 1169616 1201954 1209890 1161264 1082091 998788 918241 814840 708530
22315G08530p0361l9508l5672k1464p342m1107l7503l5305l0915m2772m5739M242
$$ 708530 638169 598661 562989 541525 534183 493076 455573 420268 389353 346581 300842 305084
22303C05084K4586q062j2413k1878j6414L1648M6628Q396L01J246k2182O827M3574
$$ 305084 329670 321608 309195 287317 270903 302551 349179 357575 357876 359122 336940 343767 387341
22290C87341L2438Q1111J17200J93954L00258L14392K10726K5738k02878k97307
$$ 387341 419779 500890 618090 812044 1112302 1426694 1637420 1663158 1460280 1162973
22280A162973l30122k63838j78268j05389o0537k5073k3407l9283j7034Q55K7155
$$ 1162973 832851 569013 390745 285356 224819 199746 176339 137056 120022 120877 148032
22269A48032P976l9500l5908j9643J2770K2971K3576p214j7851J574M285j0150
$$ 148032 156008 116508 80600 60957 73727 96698 120274 113060 95209 96783 101068 90918
22257I0918k3724o819j0217K7501q8l7584J156K0823Q446o598J4978J2523J4333
$$ 90918 67194 60375 50158 77659 77571 39987 41143 61966 70412 63814 78792 91315 105648
22244A05648J6p587J336Q218l5686K0761L9749L0983L7778j1963k4180j3878k1187
$$ 105648 105664 98077 99413 107631 71945 92706 132455 163438 201216 189253 165073 151195 130008
22231A30008j7816n116k3196j4107l540j0762k4140n63J4087M621j105o051n605
$$ 130008 112192 107076 83880 69773 66233 55471 31331 30768 44855 49476 48371 42320 36715
22218C6715K0424j0786l521K3514q02j1870j0681j6112L268J4461l259l7885m9937
$$ 36715 57139 46353 42832 66346 65544 53674 42993 26881 30149 44610 41351 3466 -46471
22205d6471n6363o1685n7961k4938J0599N5595N3393L3907K545o148K6272K1495
$$ -46471 -102834 -164519 -222480 -247418 -236819 -181224 -127831 -93924 -91379 -97527 -71255 -49760
22193d9760J9455L124R160m117n834j3741r317M1951o883j5301m735K4636J6510
$$ -49760 -30305 -27181 -18021 -22138 -27972 -41713 -51030 -9079 -15962 -31263 -35998 -11362 5148
22180E148K6507j6861j4349J5016r1o238j4177j1706j2904p504j405L509J5746
$$ 5148 31655 14794 445 15461 15370 9132 -5045 -16751 -29655 -37159 -38564 -35055 -19309
22167a9309O974j9990k2156o641K2844K1003j7830k0108K8856L1577J0644r082
$$ -19309 -12335 -32325 -54481 -61122 -38278 -17275 -35105 -55213 -26357 5220 15864 6782
22155F782k1369k82J4472P382J132L150K0242k254N956j4326m988k0773J431j6839
$$ 6782 -14587 -14869 -397 6985 8117 11267 31509 29255 35211 20885 15897 -4876 -3445 -20284
22141b0284k3367j150K0575J7887j7646j7311L005J4079J9064j4115l9527j4979
$$ -20284 -43651 -44801 -24226 -6339 -23985 -41296 -38291 -24212 -5148 -19263 -58790 -73769
22129g3769j0002K7477L784k0449J3083l431K6056L9617K0637p428j2565J6185
$$ -73769 -83771 -56294 -52510 -72959 -59876 -63307 -37251 2366 23003 15575 3010 19195
22117A9195j3693J8435K0727R612p691J6512j836q922L816M180J1123k3066k7877
$$ 19195 5502 23937 44664 54276 46585 63097 61261 52339 56155 60335 71458 48392 20515
22104B0515n249o962j5749K581j133J2522M237j7624p030k2554J5632N952r920
$$ 20515 15266 8304 -7445 -4864 -5997 6525 10762 -6862 -13892 -36446 -20814 -14862 -24782
22091b4782j4643j8685k112L2044O011j2676Q609r589N429J5586N111J0434J9093
$$ -24782 -39425 -58110 -60222 -28178 -22167 -34843 -26234 -35823 -30394 -14808 -9697 737 19830
22078A9830K0984k5726j9111J4884J9226m644P104j9747R770J7501Q211l3721
$$ 19830 40814 15088 -4023 10861 30087 25443 32547 12800 22570 40071 48282 14561
22066A4561k7818N545k9375j8494J5688J5798J7748j1630o954R229J8578R492
$$ 14561 -13257 -7712 -37087 -55581 -39893 -24095 -6347 -17977 -24931 -15702 2876 12368
22054A2368j1989k7629j5981k6045J0546Q711j404J9960q746o688J0524J0016
$$ 12368 379 -27250 -43231 -69276 -58730 -50019 -51423 -31463 -40209 -46897 -36373 -26357
22042b6357K5219n17l27J2937J6409l0477Q85j9617m920K3910L0531k1363k5700
$$ -26357 -1138 -1655 -1982 10955 27364 -3113 -2228 -21845 -26765 -2855 27676 6313 -19387
22029a9387N303Q626R560J380r970J7597J17k4117k8521J8702K5884j5204l4616
$$ -19387 -14084 -5458 4102 5482 -4488 13109 13226 -10891 -39412 -20710 5174 -10030 -44646
22016d4646P711Q948J4188j3021K1487K3j801p963j8043O283Q846J0621J309J2509
$$ -44646 -36935 -27987 -13799 -26820 -5333 -5310 -7111 -15074 -33117 -26834 -17988 -7367 -6058 6451
22002F451J6757j3723j1312R531K6959O226J1j0319j6948p425K7475o145j6808
$$ 6451 23208 9485 -1827 7704 34663 40889 40900 30581 13633 6208 33683 27538 10730
21989A0730j2397j851j3206L1813L3048n267j0858k9640k0653K2503p165j7722
$$ 10730 -1667 -3518 -16724 15089 48137 42870 32012 2372 -18281 4222 -2943 -20665
21977b0665N400L7482j0466j1843P391o235q930j9122k2196J256J3871M070p360
$$ -20665 -15265 22217 11751 -92 7299 1064 -7866 -26988 -49184 -47928 -34057 -29987 -37347
21964c7347j156o03K3384R708m520j2605l131K5006K5002j6778k5690m713J3623
$$ -37347 -38503 -39106 -15722 -6014 -10534 -23139 -26270 -1264 23738 6960 -18730 -23443 -9820
21951i820o312M822j9198R722J0159m565m328N181K2989k6204k9373k5975q696
$$ -9820 -16132 -11310 -30508 -20786 -10627 -15192 -19520 -14339 8650 -17554 -46927 -72902 -81598
21938h1598L0314P974N243R433K0150M8772J1515j2344j7954k2211J1429K236
$$ -81598 -51284 -43310 -38067 -28634 -8484 40288 51803 39459 21505 -706 10723 12959
21926A2959j6206K888J5711k2723j0920Q554l05J2313q518l2823o995R943L843
$$ 12959 -3247 -359 15352 -7371 -18291 -9737 -10042 2271 -6247 -39070 -46065 -36122 -32279
21913c2279J739N770o106n640m059M041k0918O662J5301J1658K9394k3000L910
$$ -32279 -30540 -24770 -30876 -36516 -40575 -36534 -57452 -50790 -35489 -23831 5563 -17437 -13527
21900a3527j629N427n726k9688R493O91q821j2722J2991K690K086K651L385J3369
$$ -13527 -15156 -9729 -15455 -45143 -35650 -34959 -43780 -56502 -43511 -40821 -38735 -36084 -32699 -19330
21886a9330p213o260r132L712J6897K4885J7019J8023J4531j1425q464k2357l4156
$$ -19330 -26543 -32803 -41935 -38223 -21326 3559 20578 38601 53132 41707 33243 10886 -23270
21873b3270j092Q098K3711k734P08j5716O195J2233p899R941k91J3157j884j9907
$$ -23270 -24362 -16264 7447 4713 5421 -10295 -4100 8133 234 10175 9884 23041 21157 1250
21859A250j7628j1760O099O271r016L4419J6352J554j4006k8690L38Q287K516
$$ 1250 -16378 -28138 -22039 -15768 -24784 9635 25987 27541 13535 -15155 -14817 -6530 -4014
21846d014j7308j9373q216j5939J1692Q922K2507N455L833q030j4311L244Q682
$$ -4014 -21322 -40695 -48911 -64850 -53158 -44236 -21729 -16274 -12441 -20471 -34782 -31538 -22856
21833b2856R218J9124j5483n012K905j641N223K9918K2696O890l0508m035j1035
$$ -22856 -13638 5486 -9997 -15009 -12104 -13745 -8522 21396 44092 50982 20474 16439 5404
21820E404Q978L561J0621L070L249J6776M1296N6164M0741L7784R9293J73595
$$ 5404 14382 17943 28564 31634 34883 51659 92955 149119 189860 227644 326937 500532
21808E00532K73126L18665K64479J09142j30288k74100k81627k38701j61861p9996
$$ 500532 773658 1092323 1356802 1465944 1335656 1061556 779929 541228 379367 299371
21798B99371p4487q7021m1255k1624j6356n740n854L714J6280j3521l0349J4686
$$ 299371 224884 137863 96608 74984 58628 52888 47034 50748 67028 53507 23158 37844
21786C7844N382l0985l8226P408J6304J7151l2387k1003O842J8270M157j816J4106
$$ 37844 43226 12241 -25985 -18577 -2273 14878 -17509 -38512 -31670 -13400 -9243 -11059 3047
21773C047J441k3299N4K7585K323K304K631J9415j2688j2171j1768p991J2293
$$ 3047 4488 -18811 -18757 8828 11151 13455 16086 35501 22813 10642 -1126 -9117 3176
21760C176P73R097K7617J7404k100m2558k9609R890J1080j2976j5377J208J3517
$$ 3176 3949 13046 40663 58067 55967 13409 -16200 -6310 4770 -8206 -23583 -22375 -8858
21747h858J0825Q712J84j2010k4450J1340M018j651l686l2349J7328K5701L1207
$$ -8858 1967 10679 10863 -1147 -25597 -14257 -10239 -11890 -15576 -47925 -30597 -4896 26311
21734B6311N390j3794j8969j0883k37O013K0470K1255p293j7191j5510j1376j5434
$$ 26311 31701 17907 -1062 -11945 -12182 -6169 14301 35556 28263 11072 -4438 -15814 -31248
21721c1248N783L0120K2201k5887j3517j9830j983K0247j7134j4457J6431K6308
$$ -31248 -25465 4655 26856 969 -12548 -32378 -34361 -14114 -31248 -45705 -29274 -2966
21709b966k5163M681O807J8477K6481J6552j445o926j9055j788p78r90L277O688
$$ -2966 -28129 -23448 -16641 1836 28317 44869 43424 36498 17443 15655 14877 13887 17164 23852
21695B3852J2585k095k8751k4513j3517L2634K0021K329j9622k3326j7077J3437
$$ 23852 36437 34342 5591 -18922 -32439 195 20216 22545 2923 -20403 -37480 -24043
21683b4043J61j2849J7922K3314j5265O934J4195m57m129j3762j5215N55M244
$$ -24043 -23882 -36731 -18809 4505 -10760 -3826 10369 9912 5783 -7979 -23194 -22639 -18395
21670a8395k4310k059j931K0526n042j5681Q742L653K6020J7790j8084J5345k446
$$ -18395 -42705 -44764 -46695 -26169 -31211 -46892 -38150 -34497 -8477 9313 -8771 6574 4128
21657D128j5456N473P029J1077J4722m323j8434n017j3648J8563L0253j8470j4296
$$ 4128 -11328 -5855 1174 12251 26973 22650 4216 -801 -14449 4114 34367 15897 1601
21644A601J6022J649j3349j3599R370L610j7516j2218J3573J7036j5854l6616
$$ 1601 17623 19272 5923 -7676 1694 5304 -12212 -24430 -10857 6179 -9675 -46291
21632d6291r207K1586K5986O817P874j7878j4402j8207N246J7278O530K468p366
$$ -46291 -55498 -33912 -7926 -1109 6765 -11113 -25515 -43722 -38476 -21198 -14668 -12200 -19566
21619a9566j7487R140J19m927j863K7223R472k5213J229O919O081J5366j3475
$$ -19566 -37053 -27913 -27794 -32721 -34584 -7361 2111 -23102 -21873 -14954 -8873 6493 -6982
21606f982K674J3046j3057j2166J4855K016j7554j7972j0081J9930j3590K2988
$$ -6982 -4308 8738 -4319 -16485 -1630 386 -17168 -35140 -45221 -25291 -38881 -15893
21594a5893K5304J9555m5j2356k1307R125O610P288L891R742M628j0240r579l889
$$ -15893 9411 28966 28921 16565 -4742 4383 10993 18281 22172 31914 36542 26302 16723 12834
21580A2834K6572L2096j0938l2852j8251L958j1748P255p769L296P265J512O909
$$ 12834 39406 71502 60564 27712 9461 13419 1671 8926 1157 4453 11718 13230 20139
21567B0139q3n913k0225k5216Q488J7142J7921M929J5466P549r664j1071j2599
$$ 20139 20056 14143 -6082 -31298 -22810 -5668 12253 17182 32648 40197 30533 19462 6863
21554F863r014k4370k9264j4831J0863J8605j0359J2166J59N14J5217K9423q209
$$ 6863 -2151 -26521 -55785 -70616 -59753 -41148 -51507 -39341 -39182 -38668 -23451 5972 -2237
21541b237j3987k997k7576R58J7287K279k0559M601N825M1757J3382P994J2233
$$ -2237 -16224 -19221 -46797 -45839 -28552 -26273 -46832 -42231 -36406 5351 18733 26727 38960
21528C8960L654j1587J543j596J0437j1226k8853j050J6302M534k3426l590j5147
$$ 38960 42614 31027 32570 30974 41411 30185 1332 282 16584 21118 -2308 -5898 -21045
21515b1045K5544m744r007k7542j3134Q703l765K0100J8644n483O777J2317J6741
$$ -21045 4499 -245 -9252 -36794 -49928 -41225 -44990 -24890 -6246 -11729 -4952 7365 24106
21502B4106o096k1159k5142k5812J3482K6772p822q724q608J841J583j752L498
$$ 24106 18010 -3149 -28291 -54103 -40621 -13849 -21671 -30395 -39003 -37162 -35579 -37331 -33833
21489c3833K0810L076Q139j2971p421k7335k5840J1622Q771M203L1070j7368K698
$$ -33833 -13023 -9947 -1808 -14779 -22200 -49535 -75375 -63753 -54982 -50779 -19709 -37077 -34379
21476c4379J8678o689K110m62J0131J658O057R819k3471J1692m887k0665J461
$$ -34379 -15701 -22390 -20280 -20742 -10611 -8953 -2896 6923 -16548 -4856 -9743 -30408 -28947
21463b8947N0845J4618j8870l435k817J1060j7431r780J4213J0503Q476k5679
$$ -28947 21898 36516 17646 14211 11394 22454 5023 -4757 9456 19959 28435 2756
21451B756k8636J1689K9534K1972r603j7292m258j756J1459N638j153J7045Q529
$$ 2756 -25880 -14191 15343 37315 27712 10420 6162 4406 15865 21503 20350 37395 45924
21438D5924J0476N646J1233k634l0106p54k164m378j2843l0124k0060m057L5495
$$ 45924 56400 62046 73279 70645 40539 39785 37621 33243 20400 -9724 -29784 -33841 1654
21425A654j4070N80N481J9500K620J3388K144j6908j1235q75J2689M224l1413
$$ 1654 -12416 -11836 -6355 13145 15765 29153 31297 14389 3154 2279 14968 19192 -12221
21412a2221p915l889n610L298K4196j4822j6305J5448J8544J0538j7235j0896
$$ -12221 -20136 -24025 -29635 -26337 -2141 -16963 -33268 -17820 724 11262 -5973 -16869
21400a6869K7001J1078j9479j0697o974o680k0410j4510j83j594o819K2792Q18
$$ -16869 10132 21210 1731 -8966 -15940 -22620 -43030 -57540 -57723 -59317 -66136 -43344 -42526
21387d2526l1524k160K5166J8612K5657M588J282P284J2919J1861l1088k4509
$$ -42526 -74050 -76210 -51044 -32432 -6775 -2187 -905 6379 19298 31159 71 -24438
21375b4438K697J8301O002p464l069j0576j4548K272M469n761j2258K70K4962
$$ -24438 -21741 -3440 2562 -4902 -7971 -18547 -33095 -30823 -26354 -32115 -44373 -44103 -19141
21362a9141M490l758o227J7868R230j9489k8292J494j1255o971P545L7253J5609
$$ -19141 -14651 -18409 -24636 -6768 2462 -17027 -45319 -43825 -55080 -62051 -54506 -17253 -1644
21349a644k6655k1770N333K8592M072J3074q278o154k1786j9213m305Q045j0462
$$ -1644 -28299 -50069 -44736 -16144 -12072 1002 -7276 -13430 -35216 -54429 -58734 -50689 -61151
21336f1151M347K6216K5840R61j0571k4859m579O2416R895J946p908j5151j3962
$$ -61151 -56804 -30588 -4748 -3787 -14358 -39217 -43796 18620 28515 30461 22553 7402 -6560
21323f560m918O208J925J502J3694J8904l5734k2464l1922K958K2791J3952r600
$$ -6560 -11478 -5270 -3345 -1843 11851 30755 -4979 -27443 -59365 -56407 -33616 -19664 -29264
21310b9264j3689P688K0716j4217J2066m685k1179K916J5707m049k3045m519J9396
$$ -29264 -42953 -35265 -14549 -28766 -16700 -21385 -42564 -39648 -23941 -27990 -51035 -55554 -36158
21297c6158J5785j5377J1375J567k0662j9046j2103N850k0091k3221K9365R583
$$ -36158 -20373 -35750 -24375 -22808 -43470 -62516 -74619 -68769 -88860 -112081 -82716 -73133
21285g3133L6590O886o360k6217K3593O603k004q745l897j9384M843K4757J5371
$$ -73133 -36543 -29657 -36017 -62234 -38641 -32038 -34042 -42787 -46684 -66068 -61225 -36468 -21097
21272b1097J7154K2416M24j0201Q166J0118j1794J2982p385j1309m0691j1249
$$ -21097 -3943 18473 18897 8696 16862 26980 15186 28168 20783 9474 -31217 -42466
21260d2466O560J3230k0025L773J5112J6591L0131j859l3503L302J4488j0880
$$ -42466 -35906 -22676 -42701 -38928 -23816 -7225 22906 21047 -12456 -9154 5334 -5546
21248e546j7822J525r47J1267k9997J82K5929J3389J923p38Q146r711l2146j4699
$$ -5546 -23368 -21843 -22790 -11523 -41520 -41338 -15409 -2020 -97 -835 7311 -2400 -34546 -49245
21234d9245K2282Q04J1741O917p91Q182j3663j7021O739m179k2344P189M1781
$$ -49245 -26963 -26159 -14418 -7501 -8292 -110 -13773 -30794 -24055 -28234 -50578 -43389 -1608
21221a608j233J0035j5600k9464L340J4462n915k9799J3860L0351K5277n361j6070
$$ -1608 -2841 7194 -8406 -37870 -34530 -20068 -25983 -55782 -41922 -11571 13706 8345 -7725
21208g725o25N077k521l829L0248Q211j2850j1739j995j4717l369J2054K3102
$$ -7725 -8350 -3273 -5794 -9623 20625 28836 15986 4247 2252 -12465 -15834 -3780 19322
21195A9322J4268l7409L188J4631J170j3529n085j810L226J2551j3141K583q805
$$ 19322 33590 -3819 -631 14000 15170 1641 -3444 -5254 -2028 10523 -2618 -35 -8840
21182h840j155J1110J6924n306J2283o891J830O198J1321j6619k0121q772J1235
$$ -8840 -9995 1115 18039 12733 25016 18125 19955 26153 37474 20855 734 -8038 3197
21169C197J8855j6012N707O728O638j7869j3349L266K684K708K4005K123k9376
$$ 3197 22052 6040 11747 18475 25113 7244 -6105 -2839 -155 2553 26558 28681 -695
21156f95j8484R987M2656k2120m5351r887P325J468L540j1533N923K7044K229
$$ -695 -19179 -9192 33464 11344 -34007 -43894 -36569 -35101 -31561 -43094 -37171 -10127 -7898
21143g898k8119o462J2069R329k2173k1521r951M550M238K2264L9220R806j1100
$$ -7898 -36017 -42479 -30410 -21081 -43254 -64775 -74726 -70176 -65938 -43674 -4454 5352 -5748
21130e748K3983J074K672l587k2059j4455N325j366j8598m336J2252M0772R659
$$ -5748 18235 19309 21981 18394 -3665 -18120 -12795 -14161 -32759 -37095 -24843 15929 25588
21117B5588j7843J0686j7k807J9762j4240l6116K597O461k1726o082k775l0348
$$ 25588 7745 18431 18414 15607 35369 21129 -14987 -12390 -5929 -27655 -33737 -36512 -66860
21104f6860l25J6160J5421N236K928O247K1555J4192j0280j3798M203K9417j6153
$$ -66860 -67185 -51025 -35604 -30368 -27440 -21193 362 14554 4274 -9524 -5321 24096 7943
21091G943k6051J1095M0638j114k1629n371m975n958k475m271j0676j0461m307
$$ 7943 -18108 -7013 33625 32511 10882 5511 536 -5422 -7897 -12168 -22844 -33305 -37612
21078c7612K3474J6966n361N630k8957k5169J0443J7364J2875k589j5380r828
$$ -37612 -14138 2828 -2533 3097 -25860 -51029 -40586 -23222 -10347 -12936 -28316 -38144
21066c8144m737Q710j1704K0069j1090p730R196K617p354j0515K0577k194J5036
$$ -38144 -42881 -34171 -45875 -25806 -36896 -44626 -35430 -32813 -40167 -50682 -30105 -32299 -17263
21053a7263J779L921J1861j4451J0684r361r16K334p950k1106K1569j1525P245
$$ -17263 -15484 -11563 298 -14153 -3469 -12830 -13746 -11412 -19362 -40468 -18899 -30424 -23179
21040b3179J4891J982J88j8317q03k3462j7415J3346J0456J324K4677J9576J4624
$$ -23179 -8288 -6306 -6118 -24435 -25238 -48700 -66115 -52769 -42313 -40989 -16312 3264 17888
21027A7888k0182l846K3663N157l9548j7810R892J9054O510j6761j3908M812r476
$$ 17888 -2294 -6140 17523 22680 -16868 -34678 -24786 -5732 778 -15983 -29891 -25079 -34555
21014c4555k3768J2778M1232P315l8854p878J1713P610M304R461P52M224k1167
$$ -34555 -58323 -45545 -4313 3002 -35852 -43730 -32017 -24407 -20103 -10642 -9890 -5666 -26833
21001b6833p971j3124k9501J9235L6096j9175k7576J8934K6339M3866L140L755
$$ -26833 -34804 -47928 -77429 -58194 -22098 -41273 -68849 -49915 -23576 20290 23430 27185
20989B7185k6959k5832L859o743k4419K8409L7693J2293q008m270K1957j3964
$$ 27185 226 -25606 -21747 -28490 -52909 -24500 13193 25486 17478 13208 35165 21201
20977B1201j9094k6127j7247L921P852Q531K836N032k647j5807R214J6586k7191
$$ 21201 2107 -24020 -41267 -37346 -29494 -20963 -18127 -13095 -15742 -31549 -22335 -5749 -32940
20964c2940r065K5985R172O349j6705m921K0918k690M922J162j5640j1038L117
$$ -32940 -42005 -16020 -6848 -499 -17204 -22125 -1207 -3897 1025 2187 -13453 -24491 -21374
20951b1374j575j6035k4395J7219K3638K1775j5979k3013K0668m465m071R179
$$ -21374 -22949 -38984 -63379 -46160 -22522 -747 -16726 -39739 -19071 -23536 -27607 -18428
20939a8428j106k774J446O300j2737J0341j1864J7979O382K1609n490j453k1956
$$ -18428 -19534 -22308 -20862 -14562 -27299 -16958 -28822 -10843 -4461 17148 11658 10205 -11751
20926a1751j4109o940k7981R745M7674M668N210j7888l776J2190j9668J5593N246
$$ -11751 -25860 -32800 -60781 -51036 -3362 1306 6516 -11372 -15148 -2958 -22626 -7033 -1787
20913a787M943o413J1227N016j3133j5778j722k7475k2656R462K0404J8641K2912
$$ -1787 3156 -3257 7970 12986 -147 -15925 -17647 -45122 -67778 -58316 -37912 -19271 3641
20900C641O211K627J1470J096R239q281l8177k8863L795j675J642J5839q16j5621
$$ 3641 9852 12479 23949 25045 34284 26003 -12174 -41037 -37242 -38917 -37275 -21436 -22252 -37873
20886c7873k2512L7075M2817K6847j4137k1494r207j5947k1840j7016j854M588
$$ -37873 -60385 -23310 19507 46354 32217 10723 1516 -14431 -36271 -53287 -55141 -50553
20874e0553O045J6644K4247r630j7441m278k1752j9715K4272M2282J2870j2032
$$ -50553 -44508 -27864 -3617 -13247 -30688 -34966 -56718 -76433 -52161 -9879 2991 -9041
20862i041J7337r394j2190j1449q259Q895K1642O080j1460J3171P008k6288K4053
$$ -9041 8296 -1098 -13288 -24737 -32996 -24101 -2459 3621 -7839 5332 12340 -13948 10105
20849A0105K858q763j4004o220K7319K268j6162l0870j3764J5524N966K344J1419
$$ 10105 12963 4200 -9804 -16024 11295 13563 -2599 -33469 -47233 -31709 -25743 -23399 -11980
20836a1980K2925J3131p174m4175j8855L0384j309J4402j2196j019J7700k199
$$ -11980 10945 24076 16902 -27273 -46128 -15744 -17053 -2651 -14847 -15866 1834 -365
20824c65j8662M694k2909j2327J9167m112j7854L0461L4825J7630o248m5443k6735
$$ -365 -19027 -14333 -37242 -49569 -30402 -34514 -52368 -21907 12918 30548 24300 -21143 -47878
20811d7878K6817J5190o428O467q648q735J5592J0818k180j5834K1530O705o101
$$ -47878 -21061 -5871 -12299 -5832 -14480 -23215 -7623 3195 1015 -14819 6711 13416 7315
20798G315o700O771j140l3874k4283j5106j916o6M331J2616K0543j2747k2867
$$ 7315 615 7386 6246 -27628 -51911 -67017 -68933 -68999 -64668 -52052 -31509 -44256 -67123
20785f7123M0680J1957j2309j373r542J5974K1184N641R795O169L977k016q511
$$ -67123 -26443 -14486 -26795 -28168 -37710 -21736 -552 5089 14884 21053 25030 23014 14503
20772A4503J7345J2021k1682l6057l5285Q973j0270r342L6667J7526Q393j1889
$$ 14503 31848 43869 22187 -13870 -49155 -40182 -50452 -59794 -23127 -5601 2792 -9097
20760i097j148k2543R659R701M070K0432J5822N647k1231j1887J108r741O433
$$ -9097 -10245 -32788 -23129 -13428 -9358 11074 26896 32543 11312 -575 533 -9208 -2775
20747b775j207Q49O674q206J4748M436l0452l1961J6480M6714l410k4618j4182
$$ -2775 -3982 -3133 3541 -4665 10083 14519 -15933 -47894 -31414 15300 11890 -12728 -26910
20734b6910K280J6228j8091R533J1497L742K0250k700j2690j1570J3390J0314
$$ -26910 -24630 -8402 -26493 -16960 -5463 -1721 18529 15829 3139 -8431 4959 15273
20722A5273K846n515p940L82O031j0265Q034k1900j4300K7628L70j9611L210K0459
$$ 15273 18119 12604 4664 5046 11077 812 8846 -13054 -27354 274 644 -18967 -15757 4702
20708D702L1889k2620l6523R332l357J9335L584J2883M91R859j0901j2845K706
$$ 4702 36591 13971 -22552 -13220 -16577 2758 6342 19225 19716 29575 18674 5829 8535
20695H535M575k2546j2663n124O168k4278j5878L757J0764j1744J9204K8045P072
$$ 8535 13110 -9436 -22099 -27223 -21055 -45333 -61211 -57454 -46690 -58434 -39230 -11185 -4113
20682d113j6089k432J1965l544K64R138K4007P180j5929j1574m1026j8125K5999
$$ -4113 -20202 -22634 -10669 -14213 -13949 -4811 19196 26376 10447 -1127 -42153 -60278 -34279
20669c4279K3086j3775r249N754Q937m388r384l104j766J1567K3461k5138j9870
$$ -34279 -11193 -24968 -34217 -28463 -19526 -23914 -33298 -36402 -38168 -26601 -3140 -28278 -48148
20656d8148K3105J0507j1819O536J676l780k574k1316j3866j6597M556j355Q950
$$ -48148 -25043 -14536 -26355 -19819 -18143 -21923 -24497 -45813 -59679 -76276 -71720 -73075 -64125
20643f4125J9433J7698R470k3129J7726L8086J4941l735j1872k707k1252q187
$$ -64125 -44692 -26994 -17524 -40653 -22927 15159 30100 26365 14493 11786 -9466 -17653
20631a7653J02r433J1512K764j4497J0863J5507j6432m229M526P109l859J1081
$$ -17653 -17551 -26984 -15472 -12708 -27205 -16342 -835 -17267 -21496 -16970 -9861 -13720 -2639
20618b639J0739o451l7769k6833O32l578O536o815J1172L5891M0003J0400j5575
$$ -2639 8100 1649 -36120 -62953 -62321 -65899 -59363 -66178 -55006 -19115 20888 31288 15713
20605A5713j2320K5123L1680n351m151j7984k70j3349j0270J4396J9258j1935
$$ 15713 3393 28516 60196 54845 50694 32710 32440 19091 8821 23217 42475 30540
20593C0540k832j5123k6248j3165k586J0244j4796q609l765J3279O041J0492r694
$$ 30540 27708 12585 -13663 -26828 -29414 -19170 -33966 -42575 -46340 -33061 -27020 -16528 -26222
20580b6222k2299J3721J6261r964J0585j3454K0272L0264k771j1500J6916Q397
$$ -26222 -48521 -34800 -18539 -28503 -17918 -31372 -11100 19164 16393 4893 21809 30206
20568C0206J3977k5552k1909m428l350j39L066J1346J5502r324n835k6304j8007
$$ 30206 44183 18631 -3278 -7706 -11056 -11195 -8129 3217 18719 9395 3560 -22744 -40751
20555d0751K9729K4806N089j269Q321k9011J3570K1340j4388m537O914j649k5924
$$ -40751 -11022 13784 18873 17604 25925 -3086 10484 31824 17436 12899 19813 18164 -7760
20542g760k1668K534L0937J0422J7570R608m0597l4471o405K5836j918L7j9772
$$ -7760 -29428 -26894 4043 14465 32035 41643 1046 -33425 -39830 -13994 -15912 -15875 -35647
20529c5647m699J9863O896J9688j2914m293J2061M359m041q506N884Q935o21j9888
$$ -35647 -40346 -20483 -13587 6101 -6813 -11106 955 5314 1273 -7233 -1349 7586 6965 -12923
20515a2923K118j3753J6937J764J8289L602j392J168J7167j4179l4120n941K0601
$$ -12923 -10805 -24558 -7621 -5857 12432 16034 14642 15810 32977 18798 -15322 -21263 -662
20502f62q770q108J2576M729j7558k0173j4985N41J5736K3819j2047q367Q793
$$ -662 -9432 -17540 -4964 -235 -17793 -37966 -52951 -52410 -36674 -12855 -24902 -33269 -24476
20489b4476O002l877N1683K1226j7342l9800m6290J8617J05P17K1970K3648j3574
$$ -24476 -18474 -22351 29332 50558 33216 -6584 -52874 -34257 -34152 -33435 -11465 12183 -1391
20476a391j6941o196k743J6374o606J7003n15k0752k3167j1786Q922k007O643
$$ -1391 -18332 -24528 -27271 -10897 -17503 -500 -1015 -21767 -44934 -56720 -47798 -49805 -43162
20463d3162M6768K4127j5952k5076k5321J3355j6708j189L8878K5199k3688k3802
$$ -43162 3606 27733 11781 -13295 -38616 -25261 -41969 -43158 -4280 20919 -2769 -26571
20451b6571j612K0749L60P869L5423L1492k957j9169k2172l013L184o884j3720
$$ -26571 -28183 -7434 -7074 795 36218 67710 64753 45584 23412 20399 23583 16699 2979
20438B979R453L812j0138k0973j5153J6176P018L89j52o08m946k6843j1712K7003
$$ 2979 12432 16244 6106 -14867 -30020 -13844 -6826 -6437 -6589 -7197 -12143 -38986 -50698 -23695
20424b3695K9153J8234J0053q834l829K9102J6885k3628k4700j5365j3308J8248
$$ -23695 5458 23692 33745 24911 21082 50184 67069 43441 18741 3376 -9932 8316
20412H316J6786M999k7312P684j509K601j3871o993P250n013K691J7469j3981
$$ 8316 25102 30101 2789 10473 8964 11565 -2306 -9299 -2049 -7062 -4371 13098 -883
20399h83k763P593q117N571j343J5422M677j580j1374j6510j8711J2976m6P544
$$ -883 -3646 3947 -4170 1401 58 15480 20157 18577 7203 -9307 -28018 -15042 -15088 -7544
20385g544l87K1622R246m224p659j1979j81m43J2895O140j6335m1666q820k991
$$ -7544 -7931 13691 22937 18713 11054 -925 -1106 -1549 11346 17486 1151 -40515 -49335 -52326
20371e2326j3297M391J9897J5022J0502m659m647O121J5747J986p272k8709l132
$$ -52326 -65623 -61232 -41335 -26313 -15811 -20470 -25117 -18996 -3249 -1263 -8535 -37244 -40376
20358d0376J2185K1385j8703L298K4070Q441M691q025j9010L180L152j1900k959
$$ -40376 -28191 -6806 -25509 -22211 1859 10300 14991 6966 -12044 -8864 -5712 -17612 -20571
20345b0571r020L250J6910N074j0909J3897O386l5774k4060P436m385j2394O162
$$ -20571 -29591 -26341 -9431 -4357 -15266 -1369 5017 -30757 -54817 -47381 -51766 -64160 -57998
20332e7998M4362J8500j1049j4488k1312N632L6941j310j90q562J134k251q493
$$ -57998 -13636 4864 -6185 -20673 -41985 -36353 588 -722 -912 -9474 -8340 -10591 -19084
20319a9084l542m304K4879J9130J317k1965j6014J8611j090k4684P418r095j0190
$$ -19084 -22626 -26930 -2051 17079 18396 -3569 -19583 -972 -2062 -26746 -19328 -28423 -38613
20306c8613J1028J7433K1641m512k0438l744n001O235K178j3338j7737J8834J6118
$$ -38613 -27585 -10152 11489 6977 -13461 -17205 -22206 -15971 -13793 -27131 -44868 -26034 -9916
20293i916J1828n285J618j996N286K774r205k1129j1611R8J310p086J2343l132
$$ -9916 1912 -3373 -1755 -3751 1535 4309 -4896 -26025 -37636 -37538 -36228 -43314 -30971 -34103
20279c4103o780J3427Q752J3109k1600j8879k6219O298K1410K4350k314o409O925
$$ -34103 -40883 -27456 -18704 -5595 -27195 -46074 -72293 -65995 -44585 -20235 -22549 -28958 -22033
20266b2033J7049n67l4283r592Q601M6922J4612j833K9179J0898q954n747N712
$$ -22033 -4984 -5551 -39834 -49426 -40825 6097 20709 18876 48055 58953 49999 44252 49964
20253D9964o552j9813J413j7509k3465j1542j731J3402R316j6682J0351J352R174
$$ 49964 43412 23599 25012 7503 -15962 -27504 -29235 -15833 -6517 -23199 -12848 -11496 -2322
20240b322L172p947j7315L08J6429l086j0420q94J6469O09j3707q582R574J677
$$ -2322 850 -7097 -24412 -24104 -7675 -10761 -21181 -22075 -5606 -4997 -18704 -27286 -17712 -16035
20226a6035j134j2222j5466R478J1167k0917J6915R43J6656J8164P974k6429j0039
$$ -16035 -17169 -29391 -44857 -35379 -24212 -45129 -28214 -27271 -10615 7549 15523 -10906 -20945
20213b0945j6600l146K0995K6235p322n865j4980J9967j4730j7125J4013J2776
$$ -20945 -37545 -40691 -19696 6539 -783 -6648 -21628 -1661 -16391 -33516 -19503 -6727
20201f727J2717k8743k6686R946K7165J6164M851J4545j7753j957j4181j3650
$$ -6727 5990 -22753 -49439 -39493 -12328 3836 8687 23232 5479 3522 -10659 -24309
20189b4309k0665P067O818R365J3102R34m72m548J2102L716j8818l0919P553P02
$$ -24309 -44974 -37907 -31089 -21724 -8622 -7688 -8160 -12708 -606 3110 -15708 -46627 -39074 -38372
20175c8372o776L547k0241p076N652k413J2373K742J6095K2667n033K0063J5571
$$ -38372 -45148 -41601 -61842 -68918 -63266 -65679 -53306 -50564 -34469 -11802 -16835 3228 18799
20162A8799J451m426J7298J2346j0181l0771j9565J4072M992j109J1740J4546
$$ 18799 20250 15824 33122 45468 35287 4516 -15049 -977 4015 2906 14646 29192
20150B9192k0679m0100j2377K3531J4557m042j1444k7890j4799K5502K2176J7704
$$ 29192 8513 -31587 -43964 -20433 -5876 -9918 -21362 -49252 -64051 -38549 -16373 1331
20138A331Q80m154l517j5684j6633K4576J8363p537K404k4226p958J1609o338
$$ 1331 2211 -1943 -5460 -21144 -37777 -13201 5162 -2375 29 -24197 -32155 -20546 -26884
20125b6884J2090K2547O273j4945o645J7443j520R667K310J1905j1845R734l5673
$$ -26884 -14794 7753 14026 -919 -7564 9879 8359 18026 20336 32241 20396 30130 -5543
20112e543k5091j2026K652L0252M807r206K766K3370R11l6691q516L965J2147
$$ -5543 -30634 -42660 -40008 -9756 -4949 -14155 -11389 11981 12892 -23799 -32315 -28350 -16203
20099a6203p708O454M880J1296J0476n96j7178L907L263J4169J467J3539j6905
$$ -16203 -23911 -17457 -12577 -1281 9195 8599 -8579 -4672 -1409 12760 14227 27766 10861
20086A0861k7944K5105K6152k1622l7340o126n070J5066L8000j082k1278p190
$$ 10861 -17083 8022 34174 12552 -24788 -30914 -35984 -20918 17082 16000 -5278 -12468
20074a2468K1743J2559J869p27j2002k424j598j8020j5269j7883R918J915O526
$$ -12468 9275 21834 23703 22976 10974 8550 6952 -11068 -26337 -44220 -34302 -32387 -25861
20061b5861K1259l698J5159J9982k9936j8615O896k855N872J1938j200j6276J445
$$ -25861 -4602 -8300 6859 26841 -3095 -21710 -14814 -17669 -11797 141 -1059 -17335 -15890
20048a5890J0637J3396m672k8000O137J3096r408Q080q699L006J0348J1261K363
$$ -15890 -5253 8143 3471 -24529 -18392 -5296 -14704 -6624 -15323 -12317 -1969 9292 11655
20035A1655L563j1833k053L181R406o529k6266j9862J8575M8387k518l0093k5252
$$ 11655 15218 3385 1332 4513 13919 7390 -18876 -38738 -20163 28224 25706 -4387 -29639
20022b9639L753J3082J2999o474k1468o884J9136K2930q385O589J1620Q226K4703
$$ -29639 -25886 -12804 195 -6279 -27747 -34631 -15495 7435 -950 5639 17259 25485 50188
20009E0188j0671p148l7648K41l985J3977N883j1129R868p873k7567j1605J7464
$$ 50188 39517 32369 -5279 -5038 -9023 4954 10837 -292 9576 1703 -25864 -37469 -20005
19996b0005J3883K5630o775j9067K5852R772m1155m473J018n099K791j4792O457
$$ -20005 -6122 19508 12733 -6334 19518 29290 -11865 -16338 -15320 -20419 -17628 -32420 -25963
19983b5963k428j120R340n273N336j0013K137j0878J2373K1267K786j1998O730
$$ -25963 -28391 -29511 -20171 -25444 -20108 -30121 -27984 -38862 -26489 -5222 -2436 -14434 -7704
19970g704K8000M2283Q444L835K0018q440k5405k2733p650k6896l469K7104J0306
$$ -7704 20296 62579 71023 74858 94876 86436 61031 38298 30648 3752 283 27387 37693
19957C7693k21j6432k1143l0107j1610Q908l851J458J0017N651m632K3802N427
$$ 37693 37472 21040 -103 -30210 -41820 -32912 -36763 -35305 -25288 -19637 -24269 -467 4960
19944D960j7726j7556j1846J3823l424l851J966N558L94J0906J1838j3572l8228
$$ 4960 -12766 -30322 -42168 -28345 -31769 -35620 -33654 -28096 -27702 -16796 -4958 -18530 -56758
19931e6758J2244N8910K2122j3964o90j0721k3M865J2961j252j7729N57j7014
$$ -56758 -44514 14396 36518 22554 21864 11143 11120 15985 28946 27694 9965 10522 -6492
19918f492R27r49l857k588m55o070J0976r128k9956j8265K3630L6812N3566O757
$$ -6492 -5565 -6514 -10371 -12959 -13414 -19484 -8508 -17636 -47592 -65857 -42227 -5415 48151 54908
19904E4908j8121j1445k3936K363L517n103K7625l050P865j823l9814M531Q801
$$ 54908 36787 25342 1406 3769 7286 2183 29808 26758 34623 32800 -7014 -2483 6318
19891F318j4304P191K4814k2208q094L615L468Q41L619j9005j2070J5542M434
$$ 6318 -7986 -795 24019 1811 -6283 -2668 800 1641 5260 -13745 -25815 -10273 -5839
19878e839j2590K4455J1760N563J7322Q773k4077L935J1788k3846k3726j3269
$$ -5839 -18429 6026 17786 23349 40671 49444 25367 29302 41090 17244 -6482 -19751
19866a9751J0303r40o43j6963l204J556P266n206j819K2391P115q274K362N257
$$ -19751 -9448 -10388 -11031 -27994 -31198 -29642 -22376 -27582 -29401 -7010 105 -8169 -5807 -550
19852e50N357m650K1634J1107j4834j2006r195J6274k3806l9010n889P960N572
$$ -550 4807 157 21791 32898 18064 6058 -3137 13137 -10669 -49679 -55568 -47608 -42036
19839d2036J1164m338J582L0417J6659j8438k4897j467K0231j0471O625j1721
$$ -42036 -30872 -35210 -33628 -3211 13448 -4990 -29887 -31354 -11123 -21594 -14969 -26690
19827b6690R033L274J3879j1948k9640j426J2935L9580r725p189j4278p099R789
$$ -26690 -17657 -14383 -504 -12452 -42092 -43518 -30583 8997 -728 -7917 -22195 -29294 -19505
19814a9505J3847J5094k0284j3785K9249J7952j3608N265P658l7498l7065J7570
$$ -19505 -5658 9436 -10848 -24633 4616 22568 8960 14225 21883 -15615 -52680 -35110
19802c5110P529J9774M33j0038P544K061J417N715J599K2760K5141j3439k2168
$$ -35110 -27581 -7807 -7374 -17412 -9868 -7807 -6390 -675 924 23684 48825 35386 13218
19789A3218L547o274J985n669J119q389P628R001k2560j9660K7533P618K5116
$$ 13218 16765 10491 12476 6807 7926 -463 7165 16166 -6394 -26054 1479 9097 34213
19776C4213R499j2940k3323J3165j0753J7716j593L38J3350M189j3420j2789K6146
$$ 34213 43712 30772 7449 20614 9861 27577 25984 26322 39672 43861 30441 17652 43798
19763D3798j4932k6141q005O846j2795Q055p009k124L057K453J5329J0695M682
$$ 43798 28866 2725 -5280 1566 -11229 -3174 -10183 -12307 -9250 -6797 8532 19227 23909
19750B3909j0260l3816k6384r779M9833Q229k545j427L766J9405K4205M570L857
$$ 23909 13649 -20167 -46551 -56330 -6497 1732 -813 -2240 1526 20931 45136 49706 53563
19737E3563N605p9j5454K478k682j6761j1996k7567j7337J908L009O890J6734
$$ 53563 59168 59089 43635 46113 43431 26670 14674 -12893 -30230 -28322 -25313 -18423 -1689
19724a689M425j7355Q555J856O623n609k2489J909J5454J7779r104k3987J8960
$$ -1689 2736 -14619 -6064 -4208 2415 -3194 -25683 -23774 -8320 9459 355 -23632 -4672
19711d672n145j2222J0588L1949l235m301j5504j557J1763K4777K5411k3649m732
$$ -4672 -9817 -22039 -11451 20498 17263 12962 -2542 -4099 7664 32441 57852 34203 29471
19698B9471k9250k7133j279J8124J1420k351L109J1782n478r649Q71O031p791
$$ 29471 221 -26912 -28191 -10067 1353 -998 2111 13893 8415 -1234 -363 5668 -2123
19685b123j312m131M248L9412J534j9769K1756j6692k2436k7776J6927J7383N132
$$ -2123 -3435 -7566 -3318 36094 37628 17859 39615 22923 487 -27289 -10362 7021 12153
19672A2153n765R075J376k1762j2087K9942N634j3828k0983m1728j7334J3679
$$ 12153 6388 15463 16839 -4923 -17010 12932 18566 4738 -16245 -57973 -75307 -61628
19660f1628K1181K828l009j2344J4839q009Q8K5834P177M703M427j6670k1754
$$ -61628 -40447 -37619 -40628 -52972 -38133 -46142 -46054 -20220 -13043 -8340 -3913 -20583 -42337
19647d2337k0217N481K0296K2441Q257J4031j647l8497k1174J0549Q081K7463
$$ -42337 -62554 -57073 -36777 -14336 -6079 7952 6305 -32192 -53366 -42817 -34736 -7273
19635g273L2802Q709j3359J0281k823j7075O150K01k3687K269j55j9095L2275
$$ -7273 25529 34238 20879 31160 28337 11262 17412 17613 -6074 -3805 -3960 -23055 9220
19622I220k920j9652j9785p413J8588K3736J8952J0896J2809P862K521P752j8053
$$ 9220 6300 -13352 -33137 -40550 -21962 1774 20726 31622 44431 52293 54814 62566 44513
19609D4513k4870o065k059J7682m781j6465Q197m764k6727j147K0676K1608l484
$$ 44513 19643 13578 11519 29201 24420 7955 16152 11388 -15339 -16486 4190 25798 22314
19596B2314j6916j153j3812m449l652J2066p531J4962O192J3029K1100L7854K95
$$ 22314 5398 4245 -9567 -14016 -17668 -5602 -13133 1829 8021 21050 42150 80004 80299
19583H0299l6830k1383L228n252k804J5388J1005O394o445o600k1996k82m097
$$ 80299 43469 22086 25314 20062 17258 32646 43651 50045 43600 37000 15004 14722 10625
19570A0625q09L779K28J2209J3854k1446K525l3309j4143K527j823O978J0219
$$ 10625 9816 13595 13823 26032 39886 18440 20965 -12344 -26487 -23960 -25783 -18805 -8586
19557h586J9631j1473k644k115l89K7723P651J9296O782j4173l602n741K236q710
$$ -8586 11045 -428 -3072 -5187 -5576 22147 29798 49094 55876 41703 38101 32360 34596 25886
19543B5886J236M685l20j6083k4316J7208M949j5368j3970l750j2342R682K7892
$$ 25886 27122 31807 31487 15404 -8912 8296 13245 -2123 -16093 -19843 -32185 -22503 5389
19530E389K354l202k835m446l1904j5859q93M7538L3276p915l527K6610j0952
$$ 5389 7743 4541 1706 -2740 -34644 -50503 -51396 -3858 29418 21503 17976 44586 33634
19517C3634q428k602j8165j2272l8693o192J9035K1208R343R666m62o356K0599
$$ 33634 25206 22604 4439 -7833 -46526 -52718 -33683 -12475 -3132 6534 6072 -284 20315
19504B0315n696o973K406J0497k5582k5144K9634l844m067L769j9J3691O503k2378
$$ 20315 14619 7646 10052 20549 -5033 -30177 -543 -4387 -8454 -4685 -4704 8987 15490 -6888
19490f888k918K718J6951P549L3448j6334k1423m483J1352J5616j0086p904j9967
$$ -6888 -9806 -7088 9863 17412 50860 34526 13103 8620 19972 35588 25502 17598 -2369
19477b369m458k4871PN557J8069J4180J4938P007r963k1563J1252Q473q622K1100
$$ -2369 -6827 -31698 -31691 -26134 -8065 6115 21053 28060 18097 -3466 7786 16259 7637 28737
19463B8737j0552l1753R26J0836M752k5899o013j040R78n74r165p376L968K2494
$$ 28737 18185 -13568 -12642 -1806 2946 -22953 -28966 -30006 -29028 -29602 -38767 -46143 -42175 -19681
19449a9681J5634J4990J5294n386Q318J4002K809o621o13k7373l0713J395j9558
$$ -19681 -4047 10943 26237 20851 29169 43171 45980 39359 38746 11373 -19340 -17945 -37503
19436c7503k8668K5772J4848K100K0991J7877P339J2556M764M70m789j6745j845
$$ -37503 -66171 -40399 -25551 -23451 -2460 15417 22756 35312 40076 40546 35757 19012 17167
19423A7167K9813j1674k4027K035R889q186p749j059R093K6598J2283m968J1160
$$ 17167 46980 35306 11279 13314 23203 15017 7268 6209 15302 41900 54183 49215 60375
19410F0375k8690q751J0091l328j2075k2161J3256k335k009l881k157J9003O579
$$ 60375 31685 22934 33025 29697 17622 -4539 8717 6382 4373 492 -1665 17338 23917
19397B3917J200q943J2950Q362N616j2736L693J2611k6201k5079r994j1386j5205
$$ 23917 25117 16174 29124 37486 43102 30366 34059 46670 20469 -4610 -14604 -25990 -41195
19384d1195L3585J0012j044o009q707n048n588M0665J8535K402K1540j8617Q330
$$ -41195 -7610 2402 1358 -4651 -13358 -18406 -23994 16671 35206 37608 59148 40531 48861
19371D8861o79k6061O386Q969j5753R428k933j445j2971j447k0261j7008J0509
$$ 48861 48182 22121 28507 37476 21723 31151 28218 26773 13802 12355 -7906 -24914 -14405
19358a4405K779o829K898J8581R643j1537p246J1283L236J4379K297J6290j0673
$$ -14405 -11626 -18455 -15557 3024 12667 1130 -6116 5167 8403 22782 25079 41369 30696
19345C0696K143O464J6k1945m0992J259J0868J5974l745J9235O768m732J6791
$$ 30696 32839 39303 39319 17374 -23618 -22359 -11491 4483 738 19973 26741 22009 38800
19332C8800j126m0180o885K4023M2254k1192r616j2978N836J6835P152L0729j7439
$$ 38800 37674 -2506 -9391 14632 56886 35694 26078 13100 18936 35771 42923 73652 56213
19319E6213k5508N05k0791l5916P915L627k300p21K0947j0637k0966m766K1727
$$ 56213 30705 31210 10419 -25497 -17582 -13955 -16255 -16976 3971 -6666 -27632 -32398 -10671
19306a0671K2477K1786J268j5809J1336K6840k7115k1723L829l749M836Q06M672
$$ -10671 11806 33592 34860 19051 30387 57227 30112 8389 12218 8469 13305 14111 18783
19293A8783n860k9585j5181K13J2920J1860L45J0071k231m34J1077j0274j3328
$$ 18783 12923 -16662 -31843 -31630 -18710 -6850 -6505 3566 1335 901 11978 1704 -11624
19280a1624P866J0675M488p041j4469J3743J6378o994n619n809K1248R733m384
$$ -11624 -3758 6917 11405 4364 -10105 3638 20016 13022 7403 1594 22842 32575 28191
19267B8191j5559J943J1871O210m338J2696J3586j1359j4020j6749J1790j0847
$$ 28191 12632 14575 26446 32656 28318 41014 54600 43241 29221 12472 24262 13415
19255A3415L352j172J6734J5726J5439M811l6845k6745Q136J465P49N116p28o771
$$ 13415 16767 15595 32329 48055 63494 68305 31460 4715 12851 14316 15065 20181 19453 12682
19241A2682J400N62l2570K969J1771l566J3396l952j6038J3442Q051K6794M160
$$ 12682 14082 14644 -17926 -14957 -3186 -6752 6644 2692 -13346 96 8147 34941 39101
19228C9101L228M270Q66l6225j6773J8402M1805L3994l3635q910J3914p687k1201
$$ 39101 42329 46599 47465 11240 -5533 12869 54674 88668 55033 46123 60037 52350 31149
19215C1149j8821O436J758q80Q555j1808J0993K1950P211M673j1229l7211k7645
$$ 31149 12328 18764 20522 19642 28197 16389 27382 49332 56543 61216 49987 12776 -14869
19202a4869K2630R264N268l535J818Q337j2040j5859p192Q072P125j9195l3489
$$ -14869 7761 17025 22293 18758 20576 28913 16873 1014 -6178 1894 9019 -10176 -43665
19189d3665r079J3308L3449K3963j6699l3058j883j3336L4905J6964J7495K7334
$$ -43665 -52744 -39436 -5987 17976 1277 -31781 -33664 -47000 -12095 4869 22364 49698
19177D9698L927k260n080l944M753M034j9570r577r308L607K350J939j4769J0159
$$ 49698 53625 51365 46285 42341 47094 51128 31558 21981 12673 16280 18630 20569 5800 15959
19163A5959O227M383N381j1296j4980k6997j6651K220L2833J5447J4999j1013
$$ 15959 22186 26569 31950 20654 5674 -21323 -37974 -35754 -2921 12526 27525 16512
19151A6512k5137M6063L2826j513o914j3812r049R921j032j1831m024j900P178
$$ 16512 -8625 37438 70264 68751 61837 48025 38976 48897 47865 36034 32010 30110 37288
19138C7288M768J9101K1158Q426k466K93q094j5386K3250J0294k1235k780J8622
$$ 37288 42056 61157 82315 90741 88275 88568 80474 65088 88338 98632 77397 74617 93239
19125I3239M9937K0978j3099L818K813j343l9895k2887m189R586q834J6637k3199
$$ 93239 143176 164154 151055 154873 157686 156343 116448 93561 89372 98958 90124 106761 83562
19112H3562m021P011j6074k9229P512k53J603K844m071j0278j2643K5L219m323
$$ 83562 79541 86552 70478 41249 48761 48508 50111 52955 48884 38606 25963 25988 29207 24884
19098B4884k9126J383J4044L067M148K5490J5746j3042N879l992m819o01K125
$$ 24884 -4242 -2859 11185 14252 18400 43890 59636 46594 52473 48481 43662 43061 45186
19085D5186L1648K3592J085J1353L851r56L4880N1467o392n3795l1912L819n272
$$ 45186 76834 100426 101511 112864 116715 115759 150639 202106 195714 141919 110007 113826 108554
19072A08554k3726j2617P319K3849K8625J5894q181j9010N448q494k2762m3661
$$ 108554 84828 72211 79530 103379 132004 147898 139717 120707 126155 117661 94899 51238
19060E1238k6245Q717k02K6506J6219j1717J2815J0989k0932j6918k2169j9553
$$ 51238 24993 33710 33508 60014 76233 64516 77331 88320 67388 50470 28301 8748
19048H748N005n948J8042K9944R590l853l985J3489j5882k722m68k1967k7451
$$ 8748 13753 7805 25847 55791 65381 61528 57543 71032 55150 52428 51960 29993 2542
19035B542q667K3701K7266k5732j5269J5472N1774K7997j7781j650j9709J437
$$ 2542 -6125 17576 44842 19110 3841 19313 71087 99084 81303 79653 59944 61381
19023F1381p705n118O523L301n337J341r729j6940M73j3222k2968j6903J5426
$$ 61381 53676 48558 55081 58382 53045 54386 44657 27717 28190 14968 -8000 -24903 -9477
19010i477J1037K9180K1959j3630j3089M005m747J6546J3462m859R614j018L567
$$ -9477 1560 30740 52699 39069 25980 29985 25238 41784 55246 50387 60001 58983 62550
18997F2550J9222N04K644l816r640P911k1388j9743l876k889L7211M67l537j8334
$$ 62550 81772 82276 84920 81104 71464 79375 57987 38244 34368 31479 68690 69157 65620 47286
18983D7286k0669q404j3400K7783N688j5909j4545K2921K4188k2060j6289n116
$$ 47286 26617 18213 4813 32596 38284 22375 7830 30751 54939 32879 16590 11474
18971A1474j6766J1160Q183j4137k4261L133J0300j085J7659L7591N7j559j6050
$$ 11474 -5292 5868 14051 -86 -24347 -21214 -10914 -11999 5660 43251 43308 41749 25699
18958B5699j1407k4112j0402J1638K986K5690L1816M771j1140j0686M670l462
$$ 25699 14292 -9820 -20222 -8584 -5598 20092 51908 56679 45539 34853 39523 36061
18946C6061k038j7372j4572j615J7677j0000j5754J0279R062M787K494J6287J1793
$$ 36061 34023 16651 2079 464 18141 8141 -7613 2666 11728 16515 19009 35296 47089
18933D7089M102K0963L586J7814R504j0472k0746J8723P443j0198O072k518M81
$$ 47089 51191 72154 75740 93554 103058 92586 71840 90563 98006 87808 93880 91362 91843
18920I1843l4771l3347l285K2752J37M050K7102l50j0139J3354J5693p874j0739
$$ 91843 57072 23725 20440 43192 43329 47379 74481 74131 63992 77346 93039 85165 74426
18907G4426k0542j5596k0139L1711J4087K482J4160n310l683j6850m026k340k5969
$$ 74426 53884 38288 18149 49860 63947 66429 80589 75279 71596 54746 50720 48380 22411
18894B2411p746K8050J3136J1638j8002j9036K6090K9351K564k9547k0669k2488
$$ 22411 14665 42715 55851 67489 49487 30451 56541 85892 88456 58909 38240 15752
18882A5752Q577J9431O660K8576j3488p235l233J1705N119j1847L653M849j5984
$$ 15752 24329 43760 50420 78996 65508 58273 55040 66745 71864 60017 63670 68519 52535
18869E2535N444J140q982J5988M2859K5039L1488K9367N4375L0278K7879j5065
$$ 52535 57979 59119 50137 66125 108984 134023 165511 194878 249253 279531 307410 292345
18857B92345j4358r359k1588l5652m4233j6798k0890j2002J0013J0939j325J1190
$$ 292345 277987 268628 247040 211388 167155 150357 129467 117465 127478 138417 137092 148282
18845A48282J9463K5630j6079l9059Q445L5700N8302M5477M4622N8399L0553j4972
$$ 148282 167745 193375 177296 138237 146682 182382 240684 286161 330783 389182 419735 404763
18833D04763l4376n61K9457R485J4190J6529K4600K2453K2619N775J6028R56l899
$$ 404763 370387 369826 399283 408768 422958 439487 464087 486540 509159 514934 530962 531918 528019
18820E28019P188l101j0861K2792K5526L9788N3857O0628N2787M0635K5779l3074
$$ 528019 535207 532106 521245 544037 569563 609351 663208 723836 776623 817258 843037 809963
18808H09963k0990m5976q3009q8649r6022j01497o8170m6101l9603n2050k8894
$$ 809963 788973 742997 659988 571339 475317 373820 305650 259549 219946 167896 139002
18797A39002k6935l853J1177K3824O456q473l0375M439J7416p814j1245j2549
$$ 139002 112067 108214 119391 143215 149671 141198 110823 115262 132678 124864 113619 101070
18785A01070K1055J0964j0652j9711O762K4530j6820l0397j0878K8350M6224K2051
$$ 101070 122125 133089 122437 102726 109488 134018 117198 86801 75923 104273 150497 172548
18773A72548Q177q638J898N074J3294P0304Q5452P9727N4808J1985l1820q885
$$ 172548 180725 172087 173985 179059 192353 262657 348109 427836 482644 494629 462809 453924
18761D53924P898o661K730j8841m7080o6095k5952l4387l1223k7810l0812j7405
$$ 453924 461822 455161 457891 439050 391970 325875 299923 265536 234313 206503 175691 158286
18749A58286j2775r765p144R495K6490m041l4737n2151j5670L2992K9131J4854
$$ 158286 145511 135746 128602 138097 164587 160546 125809 73658 57988 90980 120111 134965
18737A34965l5587m294L307r647k0555j8455J0615Q204M055J9073K3954Q978p155
$$ 134965 99378 95084 98391 88744 68189 49734 60349 68553 72608 91681 115635 124613 117458
18724A17458n806r155j7871j2074k8862J7579K2191K3764N488R264L5100Q553
$$ 117458 111652 102497 84626 72552 43690 61269 83460 107224 112712 121976 157076 165629
18712A65629j3283r580R875L5791N601J3298N044p942k3358j2423R256k6960j3005
$$ 165629 152346 142766 152641 188432 194033 207331 212375 204433 181075 168652 177908 150948 137943
18699A37943P125q592n071J1778L294O878m828k889K8448N1700j0193N045K2020
$$ 137943 145068 136476 131405 143183 146477 153355 148527 145638 174086 225786 215593 220638 242658
18686B42658K6566L2635O1782N2237K6164M517K7140K4917j3226K5105L5806K4722
$$ 242658 269224 301859 363641 415878 442042 446559 473699 498616 485390 510495 546301 571023
18674E71023J4593l84N189m0328l8676l9323K874J6710P220k4158m5090l2496
$$ 571023 585616 585232 590421 550093 511417 472094 474968 491678 498898 474740 429650 397154
18662C97154j7892k4103m3794k7976m7068k0849Q982o440K9139J3351r688p527
$$ 397154 379262 355159 311365 283389 236321 215472 224454 218014 247153 260504 250816 243289
18650B43289o490K170O536K0063K538K2054J1220j5111J479m0279k2461M6339
$$ 243289 236799 238969 245505 265568 268106 290160 301380 286269 287748 247469 225008 271347
18638B71347M6990L3300J9536K284K36p506L4922M1951K5205J1788J1213l939
$$ 271347 318337 351637 371173 373457 373693 366187 401109 443060 468265 480053 491266 487327
18626D87327k0825k1407m8455k8144J4004K2010L85l0732m6211l8387j8566l5925
$$ 487327 466502 445095 396640 368496 382500 404510 404895 374163 327952 289565 270999 235074
18614B35074l5594M865j6204p508J2510J650J3838j8389l2814j533J404J1853
$$ 235074 199480 204345 188141 180633 193143 194793 208631 190242 157428 155895 157299 169152
18602A69152R100o830p957J9677k1042M763L1685K4880L5086M2966J8473J2010
$$ 169152 178252 171422 163465 183142 162100 166863 198548 223428 258514 301480 319953 331963
18590C31963K5380J5377o955k1361k7957n0847J2933J5215J1464K2867p976l5541
$$ 331963 357343 372720 365765 344404 316447 265600 278533 293748 305212 328079 320103 284562
18578B84562k6135J4449N009j7011J6080R051K5761Q908p31k82n729j5901L1281
$$ 284562 258427 272876 277885 260874 276954 286005 311766 320674 319943 319661 313932 298031 329312
18565C29312K3458j3892l3286j9966J7256q769R25k22q53K1187q96p57J7448J3700
$$ 329312 352770 338878 305592 285626 302882 294113 295038 294816 293963 315150 314254 313497 330945 344645
18551C44645K297J6787K4960N797l5339l8643j3890r721J4421Q201L7269L0200
$$ 344645 346942 363729 388689 394486 359147 320504 306614 296893 311314 319515 356784 386984
18539C86984k1243k2761q503l1527j5487k4734J2598J4316J5543K0592L4871P653
$$ 386984 365741 342980 334477 302950 287463 262729 275327 289643 305186 325778 360649 368302
18527C68302k735k7649l8896l738P185L4911K8035J4461L5116M2711J3819K5q696
$$ 368302 365567 337918 299022 295284 302469 337380 365415 379876 414992 457703 471522 471547 462851
18514D62851J1397L5756K1451O66k0059j8012k0108j2358m665L762J0235K1608
$$ 462851 474248 510004 531455 532121 512062 494050 473942 461584 456919 460681 470916 492524
18502D92524K0345J1971j5600l7205j8095k2776k9352l4047k0007j2135J8974
$$ 492524 512869 524840 509240 472035 453940 431164 401812 367765 347758 335623 354597
18491C54597j1115j4794Q450L1747K1506J4024L517J1322J572k1732K555R115
$$ 354597 343482 328688 337138 368885 390391 404415 407932 419254 420826 399094 401649 410764
18479D10764j041J3092K3322N7239L8683N2360M7437K8445M0826L3661K7691M8484
$$ 410764 409723 422815 446137 503376 542059 594419 641856 670301 711127 744788 772479 820963
18467H20963M9674L9428K316k7951k0926p568l9678k7541k78K0378K909j9365
$$ 820963 870637 910065 912381 884430 863504 855936 816258 788717 788439 808817 811726 792361
18455G92361j6701j3194q191o159K560J568j5699l4956m2791l3917l9336l8420
$$ 792361 775660 762466 754275 748116 750676 752244 736545 701589 658798 624881 585545 547125
18443E47125j0345K7843J9622J7452J5391K6658K6929j0813k7341l964j4934j5784
$$ 547125 536780 564623 584245 601697 617088 643746 670675 659862 632521 628557 613623 597839
18431E97839l3250k9093m2133n2685j0331K8133L841N123j2133K3481N470J2966
$$ 597839 564589 535496 493363 440678 430347 458480 462321 467444 455311 478792 484262 497228
18419D97228N713K6176J8379J2975J5791K7735Q664J3434K0013J571k4820J9338
$$ 497228 502941 529117 547496 560471 576262 603997 612661 626095 646108 647679 622859 642197
18407F42197J9304L4223K9334K142L3578N6200L5029L2348N398L774N26K3715
$$ 642197 661501 695724 725058 727200 760778 816978 852007 884355 889753 893527 894053 917768
18395I17768K2803J4562J5192J2804N1026M2030O0556Q6937J05486R0635J08790
$$ 917768 940571 955133 970325 983129 1034155 1076185 1136741 1223678 1329164 1419799 1528589
18384A528589P7612M6375L750j1141j4812k4839P24N6005P5381O5228P8089J35466
$$ 1528589 1606201 1652576 1656326 1645185 1630373 1605534 1606258 1662263 1737644 1802872 1880961 2016427
18372B016427K04658K49149L32207M10051N11669P06060R86845J397218K097453
$$ 2016427 2221085 2470234 2802441 3212492 3724161 4430221 5417066 6814284 8911737
18363H911737L306469N046576O388942O528924N863530L486759K64165k656847
$$ 8911737 12218206 17264782 23653724 30182648 36046178 39532937 39797102 37140255
18355C7140255n234925o195133n637249m246386k774271j628064p64864j10443
$$ 37140255 31905330 25710197 20072948 15826562 13052291 11424227 10659363 10548920
18347A0548920M45250J093526J922054L164803M896237O969643Q575948Q857437
$$ 10548920 10994170 12087696 14009750 17174553 22070790 29040433 37616381 46473818
18339D6473818P566201N157163K056617j087379l061330k750632l58624K789475
$$ 46473818 54040019 59197182 61253799 60166420 57105090 54354458 53995834 56785309
18331E6785309N105507N745128M841829K660539n9962j964418j899043k08216
$$ 56785309 61890816 67635944 72477773 75138312 75078350 73113932 71214889 71006673
18323G1006673J765507K936507K909192J646929l97890j531550M7475M905431
$$ 71006673 72772180 75708687 78617879 80264808 79866918 78335368 78382843 83288274
18315H3288274J1438033J5834310J5981493J3123110P112377K02697o752390j2708897
$$ 83288274 94726307 110560617 126542110 139665220 146777597 146980294 140227904 127519007
18307A27519007j5820531j6890386j6025568j4750785j3557107j1589763r152732
$$ 127519007 111698476 94808090 78782522 64031737 50474630 38884867 29732135
18300B9732135o703756m771034l429523k457978j757421j318036j049407q47466
$$ 29732135 23028379 18257345 14827822 12369844 10612423 9294387 8244980 7397514
18292G397514o84537n21955l45709k07422o2571J9978K5932m1268j20307k15428
$$ 7397514 6712977 6191022 5845313 5637891 5575320 5595298 5621230 5579962 5459655 5244227
18282E244227k75628k66439k24258j72298q7846l0466P1024J49199K13300L41732
$$ 5244227 4968599 4702160 4477902 4305604 4217758 4187292 4258316 4407515 4620815 4962547
18272D962547N12809P73639J019050J407688K000292K939405M437043P069076
$$ 4962547 5475356 6248995 7268045 8675733 10676025 13615430 18052473 25121549
18264B5121549J1049355J4650573J4964581J2623404P261650m3256o260569j1335072
$$ 25121549 36170904 50821477 65786058 78409462 85671112 85627856 79367287 68032215
18256F8032215j4074943j3515414j1076611p988289n425815l672545k521124j826385
$$ 68032215 53957272 40441858 29365247 21376958 15951143 12278598 9757474 7931089
18248G931089j377782j070723q47046o87608n39962m04283k81037j73542j21745
$$ 7931089 6553307 5482584 4635538 3947930 3407968 3003685 2722648 2549106 2427361
18239B427361o4669N8762Q7081M0032j0925p5083j57608k08445k11125j75372
$$ 2427361 2362692 2421454 2508535 2548567 2537642 2462559 2304951 2096506 1885381 1710009
18229A710009j08025p2723m7779l2222n5644m6698q9117q2431o889O359p722l5197
$$ 1710009 1601984 1529261 1481482 1449260 1393616 1346918 1257801 1175370 1168481 1174840 1167118 1131921
18217A131921j7604k3201k9739j6818J1620k5445l8395J0120Q709j9021K0551
$$ 1131921 1114317 1091116 1061377 1044559 1056179 1030734 992339 1002459 1011168 992147 1012698
18206A012698K9249L8349J5394j7428J9887J5893M4471M7591J3858M9881M9601
$$ 1012698 1041947 1080296 1095690 1078262 1098149 1114042 1158513 1206104 1219962 1269843 1319444
18195A319444L4790M5791J03128J31804J27376J23672J28206J21305J29501J45632
$$ 1319444 1354234 1400025 1503153 1634957 1762333 1886005 2014211 2135516 2265017 2410649
18185B410649K00153K42612K29412K02724K27288L14808M27646M72047N65197
$$ 2410649 2610802 2853414 3082826 3285550 3512838 3827646 4255292 4727339 5292536
18176E292536O99164R10193J252772J778058K702555M293496O873352R917210
$$ 5292536 5991700 6901893 8154665 9932723 12635278 16928774 23802126 33719336
18168C3719336J0481412O276508L20350k991527k306390J790815Q009345J3958406
$$ 33719336 44200748 50477256 50797606 47806079 45499689 47290504 55299849 69258255
18160F9258255J4916607Q545716j687652j0394548j3567201j1585986o611674
$$ 69258255 84174862 92720578 91032926 80638378 67071177 55485191 48873517
18153D8873517n79207M303509M358823j163723p331341j0246319r707958p426525
$$ 48873517 48294310 52597819 56956642 55792919 48461578 38215259 28507301 21080776
18145B1080776n149415l380225k204508j451804j042155q02492n98275m09966
$$ 21080776 15931361 12551136 10346628 8894824 7852669 7050177 6451902 6041936
18137F041936k71562j56451j20276q7632k0918J1057M8086J60902L32933N18185
$$ 6041936 5770374 5613923 5493647 5406015 5385097 5396154 5444240 5605142 5938075 6456260
18127F456260P56352J147601J789436K920658M796182O892338O972643L623541
$$ 6456260 7212612 8360213 10149649 13070307 17866489 24758827 31731470 35355011
18119C5355011n85300k715393k054039P87612M690640Q293489R385722O952889
$$ 35355011 34769711 32054318 30000279 30787891 35478531 43772020 53157742 60110631
18111F0110631K598642L20303L779009R710843N075482n179244r566447j0837612
$$ 60110631 62709273 63029576 66808585 76519428 81594910 76415666 66849219 56011607
18103E6011607j0520289j0200398r051185p057663n005831l369084k249504j546432
$$ 56011607 45491318 35290920 26239735 19182072 14176241 10807157 8557653 7011221
18095G011221j085919p31329n13454l67324k38077j85634j68778j71056k42845
$$ 7011221 5925302 5193973 4680519 4313195 4075118 3889484 3720706 3549650 3306805
18086C306805k93682l11440l00995k85409k04392j60271j20954q9172j18028q5202
$$ 3306805 3013123 2701683 2400688 2115279 1910887 1750616 1629662 1540490 1422462 1337260
18076A337260m3684m9528m2053j6072m2225o3797m1879l4165k0074j8982k0991
$$ 1337260 1293576 1244048 1201995 1185923 1143698 1079901 1038022 1003857 983783 964801 943810
18065I43810n282K9155L7199j5235j032j179j4706l33J4123K4111M1548N7039
$$ 943810 938528 967683 1004882 989647 988615 987436 972730 972397 986520 1010631 1052179 1109218
18053A109218O7165J03272J38869J37566J38766J72943J95272K39107L28647L62811
$$ 1109218 1176383 1279655 1418524 1556090 1694856 1867799 2063071 2302178 2630825 2993636
18043B993636L48907L13919K46910J95900J71851K19130K38639K82569L18669
$$ 2993636 3342543 3656462 3903372 4099272 4271123 4490253 4728892 5011461 5330130
18034E330130M11124O00850R20011J442117K284375L650742N609066P720305Q732849
$$ 5330130 5741254 6342104 7262115 8704232 10988607 14639349 20248415 27968720 36701569
18025C6701569P283939L423549q97640l416712l117851o98631K155746L446394
$$ 36701569 43985508 47409057 46511417 43094705 39976854 39278223 41433969 44880363
18017D4880363J994047j269096m304572n474354m563688k212711R27564L955813
$$ 44880363 46874410 45605314 41300742 35826388 31262700 29049989 29977553 33933366
18009C3933366N570290M659763J512361j961961l780302l146288p79981J681182
$$ 33933366 39503656 44163419 45675780 43713819 39933517 36787229 36007248 37688430
18001C7688430K425348P00596k533062n301128o411065n962831m699006l295120
$$ 37688430 40113778 40814374 38281312 32980184 26569119 20606288 15907282 12612162
17993A2612162k143307j379101r44196o87066o02924n26102m71981l54047j96367
$$ 12612162 10468855 9089754 8145558 7458492 6855568 6329466 5857485 5503438 5307071
17984E307071n2610P9323K51803M44893P81700J278349J984977L081220M538100
$$ 5307071 5254461 5333784 5585587 6030480 6812180 8090529 10075506 13156726 17694826
17975A7694826N818458N876263L943309Q76802j702460k511048j340473P86803
$$ 17694826 23513284 29389547 33332856 34209658 32507198 29996150 28655677 29442480
17967B9442480K414594K332483L14854k338305l982159m021564k743366p51662
$$ 29442480 31857074 34189557 34504411 32166106 28183947 24162383 21419017 20667355
17959B0667355J558979L510791M183482K892195K37888k095524k797979j764483
$$ 20667355 22226334 25737125 29920607 32812802 33050690 30955166 28157187 26392704
17951B6392704K06704J735502J599285l77451k950138m627225n000168m324208
$$ 26392704 26599408 28334910 29934195 29556744 26606606 21979381 16979213 12655005
17943A2655005l249762k332802j619881j081373p55095n73135m33745l50870k63148
$$ 12655005 9405243 7072441 5452560 4371187 3616092 3042957 2609212 2258342 1995194
17934A995194j98221j33528j08064j11166j00080j03003j04070o2801o1913o2557
$$ 1995194 1796973 1663445 1555381 1444215 1344135 1241132 1137062 1074261 1012348 949791
17924I49791m2364o4475o9826p2313l5512k2013l8941m2851k093k646j3942j4327
$$ 949791 907427 842952 773126 700813 665301 643288 604347 561496 559403 556757 542815 528488
17912E28488o407j6426k6079j2501j6035o532j6933K739l8154l0234j4612J3997
$$ 528488 522081 505655 479576 467075 451040 444508 427575 430314 392160 361926 347314 361311
17900C61311l276k7604l3175k8799l0426j9445l307R696n109k713M077j637j7659
$$ 361311 358035 330431 297256 268457 238031 218586 215279 224975 219866 217153 221230 219593 201934
17887B01934J8635Q747j866J1036J1823Q0R472p515j398j0935j2839P955K9081
$$ 201934 220569 229316 227450 238486 250309 250389 259861 252346 250948 240013 227174 235129 264210
17874B64210j5025n5319k1730L395J551j0152j3422J0082J5190j2202R091J2640
$$ 264210 249185 193866 172136 175531 177082 166930 153508 163590 178780 166578 175669 188309
17862A88309M989m112j4749R643k488p795m736M376K837J5457l4442j4534J0905
$$ 188309 193298 189186 174437 184080 181592 173797 169061 173437 176274 191731 157289 142755 153660
17849A53660j4778j1850M881l23j4502K5261L1214O1169J04726Q3844J04256R1558
$$ 153660 138882 127032 131913 131590 117088 142349 173563 234732 339458 423302 527558 619116
17837F19116R7488N1364K2798r545m9140m4101n7008o6943l8171o5043j3281M5655
$$ 619116 716604 767968 790766 781221 732081 687980 630972 564029 525858 460815 447534 493189
17825D93189P003J4936J4328M031n304p81k4833r093K620l2435j1838j5346p7551
$$ 493189 500192 515128 529456 533487 528183 527402 502569 493476 496096 463661 451823 436477 358926
17812C58926p9270j7346m025L1470K0962J8922j0243l8153j8431K1080r286m9036
$$ 358926 279656 262310 258285 289755 310717 329639 319396 281243 262812 283892 274606 225570
17800B25570j223J2888K6279J0607J148J2965J6472L7479M8883L6588J5782m481
$$ 225570 224347 237235 263514 274121 275269 288234 304706 342185 391068 427656 443438 438957
17788D38957k080J4501k086l5353m1548l3341l4216n3174m5501m1958q611j3112
$$ 438957 436877 451378 449292 413939 372391 339050 304834 251660 206159 164201 155590 142478
17776A42478k6509n252j7755j0766l973k4674p715J2311K4068M371O516o246K7798
$$ 142478 115969 110717 92962 82196 78223 53549 45834 58145 82213 86584 93100 86854 114652
17763A14652K9955l615k4207l9578O24J6424m331k1271j7483J8121K7418J7707
$$ 114652 144607 140992 116785 77207 77831 94255 89924 68653 51170 69291 96709 114416
17751A14416J5496j8774J8174K8553J4775l848j5037J9472J6644J9037J9337M2398
$$ 114416 129912 111138 129312 157865 172640 168792 153755 173227 189871 208908 228245 270643
17739B70643K7942J5392k5125n3068k7962k4715k9223j6977j7071k5419j4216
$$ 270643 298585 313977 288852 235784 207822 183107 153884 136907 119836 94417 80201
17728H0201j8176Q582j5460r311K0227J0944k9033N072K487o170J17L9518p991
$$ 80201 62025 70607 55147 45836 66063 77007 47974 53046 55533 49363 49480 88998 81007
17715H1007J2882j5947k5511L066N390N04M440k169J5338l554j5290K0454q783
$$ 81007 93889 77942 52431 55497 60887 61391 65831 63662 79000 75446 60156 80610 71827
17702G1827m0483r373J6078J3926j175R630K0590n348l806P450l0632k2557K9056
$$ 71827 31344 21971 38049 51975 50800 60430 81020 75672 71866 79316 48684 26127 55183
17689E5183K7335K4238J14k2129P914K1041J799j9490j1619l1854k5891K9492
$$ 55183 82518 106756 106870 84741 92655 113696 115495 96005 84386 52532 26641 56133
17677E6133M0266M584r47j5565j8415k7871J2785J6302m307m469L926l1291j7005
$$ 56133 96399 100983 100036 84471 66056 38185 50970 67272 62965 58496 62422 31131 14126
17664A4126P728n630Q335J0051P532K1020L3797K6734Q904K0816L6373M4932K854
$$ 14126 21854 16224 24559 34610 42142 63162 96959 123693 132597 153413 189786 234718 237572
17651B37572k8999J8395J8519m605J3751N0034N2937M6698l332l8138n4077j7666
$$ 237572 208573 226968 245487 240882 254633 304667 357604 404302 400970 362832 308755 291089
17639B91089j0699k6421N132Q035k0265m5172m9144j8982K51n779l812r529j9308
$$ 291089 280390 253969 259101 267136 246871 201699 152555 133573 133824 128045 124233 114704 95396
17626I5396M879j8100J7443R804k2386k1453J3797M4819M707k3579k219j097Q034
$$ 95396 100275 82175 99618 109422 87036 65583 79380 124199 128906 105327 103108 102011 110045
17613A10045J9003R107O746l429K9970M2062O0500O1462M1018J2033j4010m15
$$ 110045 129048 138155 144901 141472 171442 213504 274004 335466 376484 388517 374507 374092
17601C74092L6060K4560K750J8348N7846Q3208O1135O2876Q7745Q7231Q5652J12255
$$ 374092 410152 434712 437462 455810 513656 596864 657999 720875 808620 895851 981503 1093758
17589A093758P8802K5642q176j5337k4042j3206J9046P2770Q5334O6336P3518
$$ 1093758 1172560 1198202 1190026 1174689 1150647 1137441 1156487 1229257 1314591 1380927 1454445
17578A454445M4418P8062P7038K1907R848k3796j3313j7873k561j3806j151j4491
$$ 1454445 1498863 1576925 1653963 1675870 1685718 1661922 1648609 1630736 1628175 1614369 1613218 1598727
17566A598727r652K936n5075p5102o0076j04013j33465j59774j48442j34102j14515
$$ 1598727 1589075 1592011 1536936 1461834 1401758 1297745 1164280 1004506 856064 721962 607447
17555F07447j10144q5973o8809m3385p3717l1587j5256l8493P635J6637l9664
$$ 607447 497303 411330 342521 299136 225419 193832 178576 140083 147718 164355 124691
17544A24691J854P976P686k7708m8931Q099L5404P273m014P346L8908R776J6490
$$ 124691 126545 134521 142207 114499 65568 73667 109071 116344 112330 119676 158584 168360 184850
17531A84850L5347R691L3610N3028Q6535J06585P2068M4850J26115J30139J43788
$$ 184850 220197 229888 263498 316526 403061 509646 581714 626564 752679 882818 1026606
17520A026606J16595Q0596N5524M5317j0079j870l932k0625n8696q8670p8143
$$ 1026606 1143201 1223797 1279321 1324638 1314559 1312689 1308757 1288132 1229436 1140766 1062623
17509A062623m7221m0879l0245k5448J9472L1776L4118J4702J6945o714m2761
$$ 1062623 1015402 974523 944278 918830 938302 970078 1004196 1018898 1035843 1029129 986368
17498I86368n3546m2076o2193r0931j33608o6765p9781q2249o0934n4269o6286
$$ 986368 932822 890746 828553 737622 604014 537249 457468 375219 314285 260016 193730
17487A93730l8608N950K9602j1760l787O572J9695L237Q440n196L8370N4404L2972
$$ 193730 155122 161072 190674 178914 175127 181699 201394 204631 213071 207875 246245 300649 333621
17474C33621L6656R7810J11800R6628Q0742J01603Q6699M2630M2627K2328J1430
$$ 333621 370277 468087 579887 676515 757257 858860 945559 988189 1030816 1053144 1064574
17463A064574j3566l5069k9968m4396l1974l4882l5657m5597n5018P606N4332
$$ 1064574 1051008 1015939 985971 941575 909601 874719 839062 793465 738447 746053 800385
17452H00385N6988M6181J1416j7252j8195l037j8191k7652m0571m0334P70j3153
$$ 800385 857373 903554 914970 897718 879523 876486 858295 830643 790072 749738 750508 737355
17440G37355p2787q9214j06272r3748p0948n1498m6492l5111j4876j2594J3340
$$ 737355 664568 575354 469082 375334 304386 252888 206396 171285 156409 143815 157155
17429A57155l3029k2733k213J3618L3097j621k0132j2311N670P574L496j5167
$$ 157155 124126 101393 99180 112798 145895 144274 124142 111831 117501 125075 128571 113404
17417A13404J3896J3631J0008J5792J4493K1593N6662P1937N5867P6383Q6833
$$ 113404 127300 140931 150939 166731 181224 202817 259479 331416 387283 463666 550499
17406E50499J07227J25971Q4280Q8134O2352Q0364P1799N9874O0913O2133K2569
$$ 550499 657726 783697 867977 956111 1018463 1098827 1170626 1230500 1291413 1353546 1376115
17395A376115k2663j8328n1388q6641o6493m1656l2355p8295j13136j10484r8479
$$ 1376115 1353452 1335124 1283736 1197095 1130602 1088946 1056591 978296 865160 754676 656197
17384F56197p1757p3271p0434p3652o5036m5543n4407k3772J0671j9956k154J2003
$$ 656197 584440 511169 440735 367083 302047 256504 202097 178325 188996 169040 166886 178889
17372A78889l1976j0594K5144L2095m867k6883J1487K6892L3793K1027O1851O8111
$$ 178889 146913 136319 161463 193558 188691 161808 173295 200187 233980 255007 316858 384969
17360C84969P1303Q3438J03496J01362P5207K8826O5556L2996P1980P3423L8416
$$ 384969 456272 539710 643206 744568 819775 848601 914157 947153 1019133 1092556 1130972
17349A130972R647L611l205l0073p1926o1852o6624p2642o1932o2203r2319j14543
$$ 1130972 1140619 1144230 1141025 1110952 1039026 977174 910550 837908 775976 713773 621454 506911
17337E06911q0265p2408q1897l7504m3708j6935j2496l37n969j3661j1094j3755
$$ 506911 426646 354238 272341 234837 191129 174194 161698 161361 155392 141731 130637 116882
17325A16882k6866k1064K1053J1600j7062j7610j3855m60J3152J474p296l188
$$ 116882 90016 68952 90005 101605 84543 66933 53078 52618 65770 67244 59948 56760
17313E6760O864j4387k669r455o832l268K2490K020j158J8366j835k3076l405
$$ 56760 63624 49237 46568 37113 30281 27013 49503 51523 50365 68731 66896 43820 40415
17300D0415j4293j3170J1759J6596K4866O62k0431j151j8206J036N14K6706L8328
$$ 40415 26122 12952 24711 41307 66173 66835 46404 45253 27047 28083 28597 55303 93631
17287I3631N760j1583l321j5750J2149K554j2474j6213Q68J6791j4304l2472k7298
$$ 93631 99391 87808 84487 68737 80886 83440 70966 54753 55621 72412 58108 25636 -1662
17274a662K1014J2272l588J0443P566k9860j4132n548Q780q157J097K9307K1680
$$ -1662 19352 31624 28036 38479 46045 16185 2053 -3495 5285 -2872 -1775 27532 49212
17261D9212j9965j8550K953N244r315q655j9546k1718k2630O563K5569q06j0793
$$ 49212 29247 10697 13650 18894 9579 924 -18622 -40340 -62970 -56407 -30838 -31644 -42437
17248d2437k4611k705J4728j1176l77K2433J4166K284N836r038O557K96K963j7037
$$ -42437 -67048 -69753 -55025 -66201 -66578 -44145 -29979 -27695 -21859 -30897 -24340 -24044 -21081 -38118
17234c8118k1733j852n312K1211o364j409Q676Q131J818k812j1578L704R689J0735
$$ -38118 -59851 -61703 -67015 -45804 -52168 -53577 -44901 -36770 -34952 -37764 -49342 -45638 -35949 -25214
17220b5214J1527K7073o344k263L929p93k7227j7397j0699L04j2717K4179k009
$$ -25214 -13687 13386 7042 4779 8708 7915 -19312 -36709 -47408 -47104 -59821 -35642 -37651
17207c7651j4505O392J554M174R106K6916R869j6786J5673j6611r326J7931J1229
$$ -37651 -52156 -45764 -44210 -40036 -30930 -4014 5855 -10931 4742 -11869 -21195 -3264 7965
17194G965k470l3732J478L955J4281K461k4131j5568J6247Q798j8388R95j519
$$ 7965 5495 -28237 -26759 -22804 -8523 -6062 -30193 -45761 -29514 -20716 -39104 -38109 -39628
17181c9628l1560n007j1163M945J8202Q403K5420J965r676j580L1269K1852k640
$$ -39628 -71188 -76195 -87358 -82413 -64211 -55808 -30388 -28423 -38099 -39679 -8410 13442 10802
17168A0802m6623J7147j115m834l752J077k1318J2063K7090M855M349p914j9284
$$ 10802 -35821 -18674 -19789 -24623 -28375 -27298 -48616 -36553 -9463 -4608 -259 -8173 -27457
17155b7457N178L138m713j3555K2729Q710l2242j3434K4995J4701j3870j9008
$$ -27457 -22279 -19141 -23854 -37409 -14680 -5970 -38212 -51646 -26651 -11950 -25820 -44828
17143d4828J2344J7926j1552M384J9332k2750m0198K4942K6240K138j3557j2335
$$ -44828 -32484 -14558 -26110 -21726 -2394 -25144 -65342 -40400 -14160 -12022 -25579 -37914
17131c7914k166l399j7055j8871j2182K9106J0522M698r742J1336l686l457L894
$$ -37914 -40080 -43479 -60534 -79405 -91587 -62481 -51959 -47261 -57003 -45667 -49353 -52810 -48916
17118d8916L2145J3619J8930n236o843j4177j4675j4939P4o284K4101K9665Q468
$$ -48916 -16771 -3152 15778 10542 3699 -10478 -25153 -40092 -40018 -46302 -22201 7464 15932
17105A5932J1010J0224l4720l5929j4122j3513K7270K6293n780K0734L175l0298
$$ 15932 26942 37166 2446 -33483 -47605 -61118 -33848 -7555 -13335 7399 10574 -19724
17093a9724J197L275j7214O011L922K6391M0299O680k5972j5381j7567O62J4046
$$ -19724 -18527 -15252 -32466 -26455 -22533 3858 44157 50837 24865 9484 -8083 -7421 6625
17080F625j0431m406K3993l5459K3163j7761m1259J3699K6407j103o573j2545
$$ 6625 -3806 -8212 15781 -19678 3485 -14276 -55535 -41836 -15429 -16532 -23105 -35650
17068c5650p078K2790M964P055r408j4782m699q156P311N611m792Q527l0830n302
$$ -35650 -42728 -19938 -14974 -7919 -17327 -32109 -36808 -44964 -37653 -32042 -36834 -28307 -59137 -64439
17054f4439J0275j3792J4075L5380j9456p072K3743L8263L019j2243p807q71K234
$$ -64439 -54164 -67956 -53881 -18501 -37957 -45029 -21286 16977 19996 7753 -54 -925 1309
17041A309j8280j2775r066K0704J0492J0009k3798p436K5873K4400K1643j6437
$$ 1309 -16971 -29746 -38812 -18108 -7616 2393 -21405 -28841 -2968 21432 43075 26638
17029B6638j6712k2169k1393n655m893J0372M820l034J312J6708O99J8507k4546
$$ 26638 9926 -12243 -33636 -39291 -44184 -33812 -28992 -32026 -30714 -14006 -13307 5200 -19346
17016a9346j4353J2582K1580j958j7270J1201J8533R623j8156l6680K506J9395
$$ -19346 -33699 -21117 463 -1495 -18765 -7564 10969 20592 2436 -34244 -31738 -12343
17004a2343K359K0822M570J6203l5157j5925j836q412K951j2741l1850n994J7903
$$ -12343 -9984 10838 15408 31611 -3546 -19471 -21307 -29719 -26768 -39509 -71359 -77353 -59450
16991e9450K78J9555J7749j8091J2777J3974m545k758k4414n878R023K3016N517
$$ -59450 -59172 -39617 -21868 -39959 -27182 -13208 -17753 -20511 -44925 -50803 -41780 -18764 -13247
16978a3247J1681K0528j5521k2054j3513r00J3409n319J527J9512Q274N04J614
$$ -13247 -1566 18962 3441 -18613 -32126 -33026 -19617 -24936 -23409 -3897 4377 4881 6495
16965F495K1780r586k2448k0564J9043k698j6964J9935j1803j8153N372J0822
$$ 6495 28275 18689 -3759 -24323 -5280 -7978 -24942 -5007 -16810 -34963 -29591 -18769
16953a8769J1558J7200K0676q202k354J7073m184j0257j239l6504j8035Q919J4091
$$ -18769 -7211 9989 30665 22463 20109 37182 32998 22741 21502 -15002 -33037 -24118 -10027
16940a0027J5083O690K797j2094Q238k947L734l343k7359Q84J2712K1380J3493
$$ -10027 5056 11746 14543 2449 10687 7740 11474 8131 -19228 -18344 -5632 15748 29241
16927B9241M6101m953N881m3107j6499j5046n469O732k650L542k4838n315l979
$$ 29241 75342 70389 76270 33163 16664 1618 -3851 2881 231 3773 -21065 -26380 -30359
16914c0359m112J0406L405M65j044j4040O063K0094J7159J6157l1555R891L40
$$ -30359 -34471 -24065 -20660 -20195 -21239 -35279 -29216 -9122 8037 24194 -7361 2530 2870
16901B870j1853o027j996K1956k3833j8439j5747j672n715Q713J9647K1457o649
$$ 2870 -8983 -15010 -17006 4950 -18883 -37322 -53069 -54741 -60456 -51743 -32096 -10639 -17288
16888a7288k7780K1440K6859p829J995O579n792q981p628k954j4874J0069j1480
$$ -17288 -45068 -23628 3231 -4598 -2603 3976 -1816 -10797 -18425 -21379 -36253 -26184 -37664
16875c7664j5529J4849M110q288j4620k529J5753J7216K3333J0475r363J193k1182
$$ -37664 -53193 -38344 -34234 -42522 -57142 -59671 -43918 -26702 -3369 7106 -2257 -1064 -22246
16862b2246k0768K8134J7714j7571L970J6027M555j9188k9298k908J0244J6989
$$ -22246 -43014 -14880 2834 -14737 -10767 5260 9815 -9373 -38671 -41579 -31335 -14346
16850a4346J1882j4778p462K315j390o38k4448k9698J3196J1067j4414O488K2745
$$ -14346 -2464 -17242 -24704 -22389 -23779 -24417 -48865 -78563 -65367 -54300 -68714 -62226 -39481
16837c9481J4808L075j5915N285K7427L184j0400j283k0936l880J0233N899j2496
$$ -39481 -24673 -21598 -37513 -32228 -4801 -1617 -12017 -13300 -34236 -38116 -27883 -21984 -34480
16824c4480Q730Q50L995J7469L1747N949l5825l1223K237J4490l131L1128J865
$$ -34480 -25750 -24900 -20905 -3436 28311 34260 -1565 -32788 -30551 -16061 -19192 11936 13801
16811A3801j5114Q026o561j323o927k5261n051R724j7503j8304L4709K4201K497
$$ 13801 -1313 6713 152 -1171 -8098 -33359 -38410 -28686 -46189 -64493 -29784 -5583 -3086
16798c086k5663k4820R49P434L4155O159j069o0K0676K073Q15L870J9600m028
$$ -3086 -28749 -53569 -52620 -45186 -11031 -4872 -5941 -6001 14675 16748 17563 21433 41033 37005
16784C7005K40k3654L4030L7892k3898j8084n940j15J0822j0463J6324J4579J98
$$ 37005 37245 13591 47621 85513 61615 43531 37591 37476 48298 37835 54159 68738 68936
16771F8936l2295j1984J2481K791O223Q970J4604p502j0556Q163r077j3373l1228
$$ 68936 36641 24657 37138 39929 46152 55122 69726 62224 51668 59831 50754 37381 6153
16758F153j830J0551M686K0038J4429j3631k0742n6124k4458o173K6025K4928
$$ 6153 4323 14874 19560 39598 54027 40396 19654 -36470 -60928 -67101 -41076 -16148
16746a6148K510J8286K216K954j4925Q82j7308k6159Q59J8770M256j7405J7490
$$ -16148 -13638 4648 6864 9818 -5107 -4225 -21533 -47692 -46833 -28063 -23807 -41212 -23722
16733b3722K1616k66J7158l627k0614R684Q571k2035k2185J7922L1550l1724K137
$$ -23722 -2106 -2372 14786 11159 -9455 229 8800 -13235 -35420 -17498 14052 -17672 -15535
16720a5535J4207K0316j4785j4165k7348R643J9358p913k1571l2525j0740K6267
$$ -15535 -1328 18988 4203 -9962 -37310 -27667 -8309 -16222 -37793 -70318 -81058 -54791
16708e4791L2657N68k65O76n599j7483R808j3187j1667J770N929K2423J511j4768
$$ -54791 -22134 -21566 -21831 -21155 -26754 -44237 -34429 -47616 -59283 -57513 -51584 -29161 -27650 -42418
16694d2418L0080j571L574J1609k945l785J3275j5877j0094n417k8217J1991K0003
$$ -42418 -12338 -13909 -10335 1274 -1671 -5456 7819 -8058 -18152 -23569 -51786 -39795 -19792
16681a9792P889j1836l68p870O058k068j7158Q457J1613j1432J2378j2189p973
$$ -19792 -11903 -23739 -24107 -31977 -25919 -27987 -45145 -36688 -25075 -36507 -24129 -36318 -44291
16668d4291K0048p807j3422J316J3572p366j2149Q577J1958L1334j8128j6650
$$ -44291 -24243 -32050 -45472 -44156 -30584 -37950 -50099 -41522 -29564 1770 -16358 -33008
16656c3008J6007N424P498O32p97m466k3342l538m522J986J5200p482L225Q23
$$ -33008 -17001 -11577 -4079 -3447 -4244 -8710 -32052 -35590 -40112 -38126 -22926 -30408 -27183 -26360
16642b6360j4515K5068J3853l0525k304M573l530j4076j3985O448J223M589R930
$$ -26360 -40875 -15807 -1954 -32479 -34783 -30210 -33740 -47816 -61801 -55353 -54130 -49541 -39611
16629c9611J000j02p664q839K1062J4332o191J0227J2822j7440j4834m335K1785
$$ -39611 -38611 -38713 -46377 -55216 -34154 -19822 -26013 -15786 -2964 -20404 -35238 -39573 -17788
16616a7788j5240k4825P465J8437K5660N181k0379j3591j2862r619J769Q255K4235
$$ -17788 -33028 -57853 -50388 -31951 -6291 -1110 -21489 -35080 -47942 -57561 -55792 -47537 -23302
16603b3302J615L917k37N447J6703M160j3441j925J0632K6989M387j3462k6535
$$ -23302 -21687 -17770 -18007 -12560 4143 8303 -5138 -7063 3569 30558 34945 21483 -5052
16590e052k446j09j0880j769M50J2629K8887K1790J343j7811k4502k0408J0043
$$ -5052 -7498 -7607 -18487 -20256 -19806 -7177 21710 43500 44843 27032 2530 -17878 -7835
16577g835J6883j9776j3999k053q159p992J5827J6437k1470l841O63O762m226
$$ -7835 9048 -10728 -24727 -26780 -34939 -42931 -27104 -10667 -32137 -35978 -35315 -28553 -32779
16564c2779L084K0930K5691l7751k7177J3942K0535j053l0687J6103p109j1483
$$ -32779 -29695 -8765 16926 -20825 -48002 -34060 -13525 -14578 -45265 -29162 -36271 -47754
16552d7754Q798p951J8668j8164p97M7852J2222l2237k6351r333J4146L3440k1175
$$ -47754 -38956 -46907 -28239 -46403 -47200 652 12874 -19363 -45714 -55047 -40901 -7461 -28636
16539b8636r587L405K2012o469K219j7804j4701m996N961k596O173J8308R811
$$ -28636 -38223 -34818 -12806 -19275 -17056 -34860 -49561 -54557 -48596 -51192 -45019 -26711 -16900
16526a6900J747P258j6056n941p613J3572K1124n345J6972J6459O399j2648j0944
$$ -16900 -15153 -7895 -23951 -29892 -37505 -23933 -2809 -8154 8818 25277 31676 19028 8084
$$ [...]
##END NTUPLES=NMR SPECTRUM
##END=
