##TITLE=Analysis number 309003
Compound Code cc 34009
Book Reference 436/30
Project Code adrs
Chemist Name williamk
##JCAMPDX= 6.0         $$ Bruker NMR JCAMP-DX V2.0
##DATA TYPE= NMR SPECTRUM
##DATA CLASS= NTUPLES
##ORIGIN= Bruker BioSpin GmbH
##OWNER= NMR
$$ XWIN-NMR		Version 3.5
$$ Thu May 26 12:36:52 2005 GMT Daylight Time (UT+1h)  MAYBRIDGE\NMR@NMR_250MHZ
##.OBSERVE FREQUENCY= 250.131544655141
##.OBSERVE NUCLEUS= ^1H
##.ACQUISITION MODE= SIMULTANEOUS (DQD)
##.ACQUISITION SCHEME= undefined
##.AVERAGES= 16
##.DIGITISER RES= 18
##SPECTROMETER/DATA SYSTEM= dpx250
##.PULSE SEQUENCE= zg30
##.SOLVENT NAME= CDCl3
##.SHIFT REFERENCE= (INTERNAL, CDCl3, 0, 16.522)
##AUDIT TRAIL= $$ (NUMBER, WHEN, WHO, WHERE, WHAT)
$$ ##TITLE= Audit trail, XWIN-NMR		Version 3.5
$$ ##JCAMPDX= 5.01
$$ ##ORIGIN= Bruker BioSpin GmbH
$$ ##OWNER= NMR
$$ C:\u/data/dgb/nmr/ADRS/3580/pdata/1/auditp.txt
$$ ##AUDIT TRAIL=  $$ (NUMBER, WHEN, WHO, WHERE, WHAT)
(   1,<2005-05-26 12:36:21.29 +100>,<MAYBRIDGE\NMR>,<NMR_250MHZ>,
      <created by zg, POWCHK disabled, PULCHK disabled
       configuration hash MD5:
       62 19 C7 07 E1 42 D1 B7 37 6C 3D D0 77 39 F9 E6
       data hash MD5: 64K
       73 80 FA 1D 5C 0B C7 0C 57 D8 DC E6 98 77 D7 4F>)
(   2,<2005-05-26 12:36:36.76 +100>,<MAYBRIDGE\NMR>,<NMR_250MHZ>,
      <Start of raw data processing
       ef LB = 0.3 FT_mod = 6 PKNL = 1 SI = 32K 
       data hash MD5: 32K
       B7 B7 C8 D8 D3 C4 71 32 28 47 B6 9F 66 AD DC CE>)
(   3,<2005-05-26 12:36:39.59 +100>,<MAYBRIDGE\NMR>,<NMR_250MHZ>,
      <apk 
       data hash MD5: 32K
       83 01 12 00 99 5D 28 B2 C7 66 B7 8E F6 AD 25 02>)
(   4,<2005-05-26 12:36:41.01 +100>,<MAYBRIDGE\NMR>,<NMR_250MHZ>,
      <abs ABSG = 5 
       data hash MD5: 32K
       DE 81 91 14 A5 D6 F1 04 41 1F 72 F8 61 44 ED 8D>)
$$ ##END=
$$ 
$$ hash MD5
$$ C4 3B F0 F6 04 BC 2B C1 B9 0E D3 46 C4 21 7C 77
##$RELAX= 
##$RELAX= 
##$RELAX= 
##$RELAX= 
##$RELAX= 
##$RELAX= 
##$RELAX= 
$$ Bruker specific parameters
$$ --------------------------
##$DU= <C:\u>
##$EXPNO= 3580
##$NAME= <ADRS>
##$PROCNO= 1
##$TYPE= <nmr>
##$USER= <dgb>
##$AMP= (0..31)
100 100 100 100 100 100 100 100 100 100 100 100 100 100 100 100 100 100 
100 100 100 100 100 100 100 100 100 100 100 100 100 100 
##$AQSEQ= 0
##$AQ_mod= 3
##$AUNM= <au_zg>
##$AUTOPOS= <24 >
##$BF1= 250.13
##$BF2= 250.13
##$BF3= 250.13
##$BF4= 250.13
##$BF5= 500.13
##$BF6= 500.13
##$BF7= 500.13
##$BF8= 500.13
##$BYTORDA= 1
##$CFDGTYP= 0
##$CFRGTYP= 5
##$CHEMSTR= <none>
##$CNST= (0..31)
1 1 145 1 1 1 1 1 1 1 1 1 1 1 1 1 1 1 1 1 1 1 1 1 1 1 1 1 1 1 1 1 
##$CPDPRG= <>
##$CPDPRG1= <>
##$CPDPRG2= <>
##$CPDPRG3= <>
##$CPDPRG4= <mlev>
##$CPDPRG5= <mlev>
##$CPDPRG6= <mlev>
##$CPDPRG7= <mlev>
##$CPDPRG8= <mlev>
##$CPDPRGB= <>
##$CPDPRGT= <>
##$D= (0..31)
0 1 0 0 0 0 0 0 0 0.06 0 0 0 0 0 0 0.0002 0 0 0 0 0 0 0 0 0 0 0 0 0 0 
0 
##$DATE= 1117107380
##$DBL= (0..7)
120 120 120 120 120 120 120 120 
##$DBP= (0..7)
150 150 150 150 150 150 150 150 
##$DBP07= 0
##$DBPNAM0= <>
##$DBPNAM1= <>
$$ [...]
##$SUBNAM7= <"">
##$SUBNAM8= <"">
##$SUBNAM9= <"">
##$SW= 20.6930455092707
##$SWIBOX= (0..15)
0 0 3 0 0 0 0 0 0 0 0 0 0 0 0 0 
##$SW_h= 5175.983436853
##$TD= 65536
##$TD0= 1
##$TE= 294.16
##$TE2= 300
##$TE3= 300
##$TEG= 300
##$TL= (0..7)
0 120 120 120 120 120 120 120 
##$TP= (0..7)
150 150 150 150 150 150 150 150 
##$TP07= 0
##$TPNAME0= <>
##$TPNAME1= <>
##$TPNAME2= <>
##$TPNAME3= <>
##$TPNAME4= <>
##$TPNAME5= <>
##$TPNAME6= <>
##$TPNAME7= <>
##$TPOAL= (0..7)
0.5 0.5 0.5 0.5 0.5 0.5 0.5 0.5 
##$TPOFFS= (0..7)
0 0 0 0 0 0 0 0 
##$TUNHIN= 0
##$TUNHOUT= 0
##$TUNXOUT= 0
##$USERA1= <user>
##$USERA2= <user>
##$USERA3= <user>
##$USERA4= <user>
##$USERA5= <user>
##$V9= 5
##$VALIST= <valist>
##$VCLIST= <CCCCCCCCCCCCCCC>
##$VD= 0
##$VDLIST= <DDDDDDDDDDDDDDD>
##$VPLIST= <PPPPPPPPPPPPPPP>
##$VTLIST= <TTTTTTTTTTTTTTT>
##$WBST= 1024
##$WBSW= 4
##$XGAIN= (0..3)
0 0 0 0 
##$XL= 0
##$YL= 0
##$YMAX_a= 361994
##$YMIN_a= -461880
##$ZGOPTNS= <>
##$ZL1= 120
##$ZL2= 120
##$ZL3= 120
##$ZL4= 120
##$ABSF1= 16.522
##$ABSF2= -4.171173
##$ABSG= 5
##$ABSL= 3
##$ALPHA= 0
##$AQORDER= 0
##$ASSFAC= 0
##$ASSFACI= 0
##$ASSFACX= 0
##$ASSWID= 0
##$AUNMP= <proc_1d>
##$AZFE= 0.1
##$AZFW= 0.1
##$BCFW= 0
##$BC_mod= 0
##$BYTORDP= 0
##$COROFFS= 0
##$CY= 12.5
##$DATMOD= 1
##$DC= 0
##$DFILT= <>
##$DTYPP= 0
##$F1P= 14.0000005364418
##$F2P= -0.99999901652339
##$FCOR= 0.5
##$FTSIZE= 32768
##$FT_mod= 6
##$GAMMA= 0
##$GB= 0
##$INTBC= 1
##$INTSCL= 1
##$ISEN= 128
##$LB= 0.3
##$LEV0= 0
##$LPBIN= 0
##$MAXI= 10000
##$MC2= 0
##$MEAN= 0
##$ME_mod= 0
##$MI= 0
##$NCOEF= 0
##$NC_proc= -6
##$NLEV= 6
##$NOISF1= 0
##$NOISF2= 0
##$NSP= 0
##$NTH_PI= 0
##$NZP= 0
##$OFFSET= 16.522
##$PC= 1
##$PHC0= -76.19374
##$PHC1= 9.014012
##$PH_mod= 1
##$PKNL= yes
##$PPARMOD= 0
##$PSCAL= 4
##$PSIGN= 0
##$REVERSE= no
##$SF= 250.13
##$SI= 32768
##$SIGF1= 0
##$SIGF2= 0
##$SINO= 400
##$SIOLD= 32768
##$SREGLST= <1H.CDCl3>
##$SSB= 0
##$STSI= 32768
##$STSR= 0
##$SW_p= 5175.98343685301
##$SYMM= 0
##$S_DEV= 0
##$TDeff= 65536
##$TDoff= 0
##$TI= <Analysis number 999999
Compound Code 99
Book Reference 9
Project Code 9>
##$TILT= no
##$TM1= 0
##$TM2= 0
##$TOPLEV= 0
##$USERP1= <user>
##$USERP2= <user>
##$USERP3= <user>
##$USERP4= <user>
##$USERP5= <user>
##$WDW= 1
##$XDIM= 32768
##$YMAX_p= 542526906
##$YMIN_p= -406955
$$ End of Bruker specific parameters
$$ ---------------------------------
##NTUPLES= NMR SPECTRUM
##VAR_NAME=  FREQUENCY,     SPECTRUM/REAL,   SPECTRUM/IMAG
##SYMBOL=    X,             R,               I
##VAR_TYPE=  INDEPENDENT,   DEPENDENT,       DEPENDENT
##VAR_FORM=  AFFN,          ASDF,            ASDF
##VAR_DIM=   32768,         32768,           32768
##UNITS=     HZ,            ARBITRARY UNITS, ARBITRARY UNITS
##FACTOR=    0.157963299565203, 1,           1
##FIRST=     4132.6476996994, 0,             0
##LAST=      -1043.33573715361, 0,           0
##MIN=       -1043.33573715361, -406955,     0
##MAX=       4132.6476996994, 542526906,     0
$$ Real data points
##PAGE= N=1
##DATA TABLE= (X++(R..R)), XYDATA
$$ [...]
16902H58701j4904J3525K9931l3629J27414j0859j97092q6712K1962j45752j04495
$$ 858701 843797 857322 887253 853624 981038 970179 773087 686375 708337 562585 458090
16891D58090o4060J9505k0301q3758j37378j56518j27077j56519J5956K3500N5680
$$ 458090 394030 413535 393234 309476 172098 15580 -111497 -268016 -252060 -228560 -172880
16880a72880P8384R337k4887Q5485J2962N8340N5754n0776o7743o620R8938r0227
$$ -172880 -94496 -85159 -110046 -24561 -11599 46741 102495 51719 -16024 -22644 76294 -13933
16868a3933J9729M5984J41302J11886K0417j8555P2879J10798Q0852M3989p238
$$ -13933 5796 51780 193082 304968 325385 306830 379709 490507 571359 615348 608110
16857F08110Q9707Q6619j85658O776P4267m5121K4337O9080L2945k02226j18517
$$ 608110 697817 784436 598778 605554 679821 634700 659037 728117 761062 558836 440319
16846D40319n8882R3183j35283j14246J4723q1994r0422n8392Q4551n8825j83126
$$ 440319 381437 474620 339337 225091 239814 157820 67398 9006 93557 34732 -148394
16835a48394k6273M8250R7318P5448j26772r6582p4463L7251L3001L0184o8023
$$ -148394 -174667 -126417 -29099 46349 -80423 -177005 -251468 -214217 -181216 -151032 -219055
16824b19055O5359J85872J19081j1077K7853m9245o5921j4351P0350j1797K4697
$$ -219055 -153696 32176 151257 140180 168033 118788 52867 38516 108866 97069 121766
16813A21766J1845L8636j42029j57855o8137J14788j4234k9022J7608k4336k078
$$ 121766 133611 172247 30218 -127637 -195774 -80986 -95220 -124242 -106634 -130970 -133048
16802a33048j4833J00119N9555r1972L1081L3108j07366l0839j6474J9668N6523
$$ -133048 -147881 -47762 11793 -80179 -49098 -15990 -123356 -154195 -170669 -151001 -94478
16791i4478O472Q4929L1163Q8633r3082p9023k5286j9806j12971J8133J02216
$$ -94478 -88006 -3077 28086 116719 23637 -55386 -80672 -100478 -213449 -195316 -93100
16780i3100j69555j7024O8434K2865P3401J18819q1471n6121N7855n0226j4774
$$ -93100 -262655 -279679 -211245 -188380 -114979 3840 -77631 -133752 -75897 -126123 -140897
16769a40897M4854M6652m4114m3968m2023L8091p6350J6806R2092K8191P346K8324
$$ -140897 -96043 -49391 -93505 -137473 -179496 -141405 -217755 -200949 -108857 -80666 -73320 -44996
16757d4996K7738J6054k1719M965p5728o3235r495K7519K135Q8283L5167J4039
$$ -44996 -17258 -1204 -22923 -17958 -93686 -156921 -166416 -138897 -136762 -48479 -13312 727
16745G27J1699m114k3001q3635m6895o6415l725j8908p2060k047J1623o2804L4850
$$ 727 12426 8312 -14689 -98324 -145219 -211634 -215359 -234267 -306327 -308374 -296751 -359555 -324705
16732c24705K06868L0876J05079K1041l521j1485j7285k4434r895l1841r6856
$$ -324705 -117837 -86961 18118 39159 35638 24153 6868 -17566 -27461 -59302 -156158
16721a56158k8158N2747J0275L1730R8162K2461j12651m1683j04300P7972J61451
$$ -156158 -184316 -131569 -121294 -89564 8598 31059 -81592 -123275 -227575 -149603 11848
16710A1848l3436j42188L5210K51957m0630j04315n6224Q5559j07199q3960l171
$$ 11848 -21588 -163776 -128566 123391 82761 -21554 -77778 7781 -99418 -183378 -186549
16699a86549J20738J15895p97j23262j48244j3545J60217L0940o5247j565j3463
$$ -186549 -65811 50084 49287 -73975 -222219 -235764 -75547 -44607 -109854 -111419 -124882
16688a24882q6542J3273l6565m2139N6654L8786J5518P335J60017O8767j58530
$$ -124882 -211424 -198151 -234716 -276855 -220201 -181415 -165897 -158562 1455 70222 -88308
16677h8308o1449L5775J6106j1774m9291K8779M9319j22488N4394N7026p8006
$$ -88308 -149757 -113982 -97876 -109650 -158941 -130162 -80843 -203331 -148937 -91911 -169917
16666a69917J13528J20016l2221k2468k0596n6083J9862q0374o1244N9965P8413
$$ -169917 -56389 63627 31406 8938 -11658 -67741 -47879 -128253 -189497 -129532 -51119
16655e1119N1559O0233N2629m3256j07543M605L6478k6019J0893J01009K0449
$$ -51119 440 60673 113302 70046 -37497 -32892 3586 -22433 -11540 89469 109918
16644A09918j7317K0336m3322m8010r6662n7094M5989L9478o2676m8930J644o0296
$$ 109918 92601 112937 69615 21605 -75057 -132151 -86162 -46684 -109360 -158290 -156646 -216942
16632b16942q1731Q5590N4992k8707L556N786j8545R1136j6572p7697J5849J0321
$$ -216942 -298673 -213083 -158091 -186798 -183242 -177456 -196001 -104865 -121437 -199134 -183285 -172964
16620a72964O9589j8838j8270J22708J3310m9033n473K8259l3875k7384l8842
$$ -172964 -103375 -122213 -140483 -17775 -4465 -53498 -58971 -30712 -64587 -91971 -130813
16609a30813O130k9057q364p692P9527Q2901O819k1853q2597j51450n2880J10306
$$ -130813 -124683 -153740 -162104 -169796 -90269 -7368 -549 -22402 -104999 -256449 -309329 -199023
16597a99023K3275L0790P4310K2406l3442M2613L6070P8810j8367J1972q7563
$$ -199023 -175748 -144958 -70648 -48242 -81684 -39071 -3001 75809 57442 69414 -18149
16586a8149p2671j5067N7502j7950l9804o3174R8171k6064n914M597J910j09949
$$ -18149 -90820 -105887 -48385 -66335 -106139 -169313 -71142 -97206 -103120 -98523 -96613 -206562
16574b06562J0469P0440J99720J12440K001m9577m5953m5221m4425L8265J746
$$ -206562 -196093 -125653 74067 186507 188508 138931 92978 47757 3332 41597 43343
16563D3343p0755p3175j19400j5251Q6514Q739l5981K7318k2889q2283R601P2182
$$ 43343 -27412 -100587 -219987 -235238 -148724 -139985 -175966 -148648 -171537 -253820 -244219 -172037
16551a72037N7531K1150p1289j3612J36240J64168k7654n0806J17153j26947j51278
$$ -172037 -114506 -93356 -164645 -178257 -42017 122151 94497 43691 160844 33897 -117381
16540a17381q5959O7671R8880l8327k6888l0377o021j3091K2857O2036J19080
$$ -117381 -203340 -135669 -36789 -75116 -102004 -132381 -138402 -151493 -128636 -66600 52480
16529E2480K5484n7345p7823Q111q3939m7138O4233P1152L775R3762k2629J250
$$ 52480 77964 20619 -57204 -49093 -133032 -180170 -115937 -44785 -41010 52752 30123 31373
16517C1373n2980r3090p3674J21390J87153m0541q5337j43755m1226j0211M5445
$$ 31373 -21607 -114697 -188371 -66981 120172 79631 -5706 -149461 -190687 -200898 -155453
16506a55453J15609J4569j169l2179n3122J4098J14151J0272r5435Q283m1812
$$ -155453 -39844 -25275 -26444 -58623 -111745 -97647 16504 26776 -68659 -60376 -102188
16495a02188K0017Q9520R684j3506l6149J79Q2690L930l6284K4980P7420j03223
$$ -102188 -82171 7349 17033 3527 -32622 -32443 50247 54177 17893 42873 120293 17070
16483A7070n0302K2111o1885n4277L0793M5398N6825n9527j17495R62L3811q4330
$$ 17070 -33232 -11121 -73006 -127283 -96490 -51092 5733 -53794 -171289 -170327 -136516 -220846
16471b20846N643j7279O5242m604j5134K3232M0195l2035Q665M3309k8379p3349
$$ -220846 -215203 -232482 -167240 -171844 -186978 -163746 -123551 -155586 -146921 -103612 -131991 -205340
16459b05340N8324Q207N0000r5781m7650J09524J09455l0003j10476l7824j6517
$$ -205340 -147016 -138809 -88809 -184590 -232240 -122716 -13261 -43264 -153740 -191564 -208081
16448b08081n7232L4559J07421n864o3340m7315M5699M7979p549J17238J43222
$$ -208081 -265313 -230754 -123333 -129197 -192537 -239852 -194153 -146174 -153723 -36485 106737
16437A06737k8504j40611Q1275P3182r2349n4276K0618J21281K6500j4137n7170
$$ 106737 78233 -62378 18897 92079 -270 -54546 -33928 87353 113853 99716 42546
16426D2546j36663k4345J05552Q1700q3017L0778M0693k7690O6675K2446r930
$$ 42546 -94117 -118462 -12910 68790 -14227 16551 57244 29554 96229 118675 108745
16415A08745p4918j17939k8722M1477Q1554j7949o3305j9765K372p1107m3547
$$ 108745 33827 -84112 -112834 -71357 10197 -7752 -71057 -90822 -88450 -159557 -203104
16404b03104P5666Q6472K3193j3079m4574n0851r8035J36941J7407n7249q4764
$$ -203104 -127438 -40966 -17773 -30852 -75426 -126277 -224312 -87371 -69964 -127213 -211977
16393b11977N9334j5038J61953J1575k0854j6950l1616r87K3805Q0839k7071q6783
$$ -211977 -152643 -167681 -5728 5847 -15007 -31957 -63573 -64560 -40755 40084 13013 -73770
16381g3770k4186P0855J3690M6714J3342k5153j22148q8248J3891j2245r9483
$$ -73770 -97956 -27101 -13411 33303 46645 21492 -100656 -188904 -175013 -187258 -286741
16370b86741J08662J03266R3660n6201l9613k8007n4933j5270K3266K4294q7697
$$ -286741 -178079 -74813 18847 -37354 -76967 -104974 -159907 -175177 -151911 -127617 -215314
16359b15314K0910k7599O0748j0750J1688n6219q9305O670O1453J05014R5276
$$ -215314 -194404 -222003 -161255 -172005 -160317 -216536 -305841 -299171 -237718 -132704 -37428
16348c7428K0085l279n3281P752p7008J2075J906O6072J19983K4406k0806k4653
$$ -37428 -17343 -20622 -73903 -66151 -143159 -131084 -129178 -63106 56877 81283 60477 35824
16336C5824r6715k6152L2059P5300J1846r2194l0238M176m8205o9745n2569L2541
$$ 35824 -60891 -87043 -54984 20316 32162 -60032 -90270 -86094 -134299 -204044 -256613 -224072
16324b24072M7345R7130K407J1511J6355J8166L3114n8699o7864r7363J5864K3332
$$ -224072 -176727 -79597 -77190 -65679 -49324 -31158 1956 -56743 -124607 -221970 -206106 -182774
16312a82774p9880K8587O1078K0514q659k398K8418P8155P4567p8561j81636K9534
$$ -182774 -262654 -234067 -172989 -152475 -161134 -163532 -135114 -56959 17608 -60953 -242589 -213055
16300b13055P3263O3764Q680n1223J0371J5037p3646k3172j333j1045J39926Q6902
$$ -213055 -139792 -76028 -67348 -118571 -108200 -93163 -166809 -189981 -191314 -202359 -62433 24469
16288B4469j18378r711P7454P7198k394j26824m7326k8679J2015N5689N1247K3899
$$ 24469 -93909 -103620 -26166 51032 48638 -78186 -125512 -154191 -142176 -86487 -35240 -11341
16276a1341j2450M9495N894P8975O3948r1932j19743k140J27586q9708j32844
$$ -11341 -23791 25704 31598 110573 174521 82589 -37154 -39294 88292 -1416 -134260
16265a34260N513J9912n2891N4154M3011l5124p0715R4610o7345j4276M6482m0225
$$ -134260 -128747 -108835 -161726 -107572 -64561 -99685 -170400 -75790 -143135 -157411 -110929 -151154
16253a51154n2474J7284n6358J5299R3475J31253r151n342M242j27345n1740O4909
$$ -151154 -203628 -186344 -242702 -227403 -133928 -2675 -11826 -17168 -12926 -140271 -192011 -127102
16241a27102J66486N0292q714o186L949N1164O978J1784k8005q7439o3874p12
$$ -127102 39384 89676 80962 74776 78725 129889 136867 148651 120646 33207 -30667 -31379
16229c1379p0086J1475L8070J48645k9441r173n3379o9905J6358n2470J5462J22395
$$ -31379 -101465 -89990 -51920 96725 67284 58111 4732 -65173 -48815 -101285 -85823 36572
16217C6572J5305j40196q8838P7317J12331k0618r4491K2000J35865Q0486N6219
$$ 36572 51877 -88319 -177157 -99840 12491 -8127 -102618 -80618 55247 135733 191952
16206A91952p7246N056k6451m0671J4235r8127O9590r70m1805q6808n7948m5134
$$ 191952 114706 119762 93311 52640 66875 -31252 38338 37368 -4437 -91245 -149193 -194327
16194a94327L9076Q7660M9339r0026L1531m2169o5607j9542k9076j5573l591J1432
$$ -194327 -155251 -67591 -18252 -108278 -76747 -118916 -184523 -204065 -233141 -248714 -252305 -240873
16182b40873P454J57235O1311p1609J1357L6041r1474J819P9451N2277j4010p2439
$$ -240873 -233419 -76184 -14873 -86482 -75125 -39084 -130558 -128739 -49288 2989 -11021 -83460
16170h3460n5999j4240J23646m9014j05159R1825N5064k10593K442J30047K9854
$$ -83460 -139459 -153699 -30053 -79067 -184226 -92401 -37337 -247930 -245488 -115441 -85587
16159h5587o7631n614l5179r5698R2709J07297J2093k9474q3754N5225K4474l0297
$$ -85587 -153218 -158832 -194011 -289709 -197000 -89703 -77610 -107084 -190838 -135613 -111139 -141436
16147a41436j08443m6280l5937k1018n3841J14086Q0919L1810J6278O113r918
$$ -141436 -249879 -296159 -332096 -353114 -406955 -292869 -211950 -180140 -163862 -157749 -167667
16136a67667o0223L2114J23228J00760m6978j33356P494K0840k8563o2770m55
$$ -167667 -227890 -195776 -72548 28212 -18766 -152122 -144628 -123788 -152351 -215121 -215576
16125b15576P0208K0821L7809N6166N2267K4086j34953j24425m7150M9783R2125
$$ -215576 -145368 -124547 -86738 -30572 21695 45781 -89172 -213597 -260747 -210964 -118839
16114a18839M0411m0207k7262L4384j9050p6511j19925L4277J86233J14255r7764
$$ -118839 -78428 -118635 -145897 -111513 -130563 -207074 -326999 -292722 -106489 7766 -89998
16103h9998j00017n7929k2187j487N9022P680j7242N1628J06017J432m2124m6503
$$ -89998 -190015 -247944 -270131 -271618 -212596 -204916 -222158 -170530 -64513 -63081 -105205 -151708
16091a51708R5113N855j0818j9715o8648J4829o1026J44730J52427r7904k2639
$$ -151708 -56595 -50740 -61558 -81273 -149921 -135092 -196118 -51388 101039 3135 -19504
16080a9504r0821j01450q709J07521J27094l9594M7672r989o7199o0455O4700
$$ -19504 -110325 -211775 -220484 -112963 14131 -25463 22209 12220 -54979 -115434 -50734
16069e0734m8835Q2232Q7066l7352L574q3529l1420l5173m5015r864J02633M8872
$$ -50734 -99569 -17337 69729 32377 35951 -47578 -78998 -114171 -159186 -169050 -66417 -17545
16057a7545M602q5942j02766O2971L4312o4342J4495l5714L8890N5360P502m5437
$$ -17545 -12943 -98885 -201651 -138680 -104368 -168710 -154215 -189929 -151039 -95679 -88177 -133614
16045a33614j6621k9866P4356R5312j2587j4241j4105l0734n3064O1231j7683
$$ -133614 -150235 -180101 -105745 -10433 -23020 -37261 -51366 -82100 -135164 -73933 -91616
16034i1616n1482K5224P3990N1253l6006O1240N8113j7457o495m0667p0357m7813
$$ -91616 -143098 -117874 -43884 7369 -28637 32603 90716 73259 66764 26097 -44260 -92073
16022i2073J03931O5638p9115j1548Q4725P9133q0020j8135o3796n8617Q7307
$$ -92073 11858 77496 -1619 -13167 71558 150691 70671 52536 -11260 -69877 17430
16011A7430p6144O2053K10042l7812p4206l3437j13618J11542P8875Q1058o6429
$$ 17430 -58714 3339 213381 175569 101363 67926 -45692 65850 144725 225783 159354
16000A59354j8108k9316p7496j27223j02102K3491P3648Q8560q6536j17479J09211
$$ 159354 141246 111930 34434 -92789 -194891 -171400 -97752 -9192 -95728 -213207 -103996
15989a03996M6113M1033p243N4100j5566K4185K7924j7205L0558n8739r7272k558
$$ -103996 -57883 -16850 -24093 30007 14441 38626 66550 49345 79903 21164 -76108 -78666
15977g8666J9327M9818Q7509p757j34539q7546O5909K4775J09912K3457j03354
$$ -78666 -59339 -9521 77988 70231 -64308 -151854 -85945 -61170 48742 72199 -31155
15966c1155j99070j44182l0823K21836K51558P423k5016l6751j42726N9482Q4913
$$ -31155 -230225 -374407 -405230 -183394 68164 75587 50571 13820 -128906 -69424 15489
15955A5489k800o4801n9991M3900J00150N3389j05295j6614P6675K2453J5984
$$ 15489 12689 -52112 -112103 -68203 31947 85336 -19959 -36573 40102 62555 78539
15944G8539k6060l6187j41510j8364J12577J2636j3744j354j1369m4088n7553
$$ 78539 52479 16292 -125218 -143582 -31005 -18369 -32113 -33467 -44836 -88924 -146477
15933a46477m3966J3715j7484m3797J28338k6398j0965M4779J48632K9456n3072
$$ -146477 -190443 -176728 -194212 -238009 -109671 -136069 -147034 -102255 46377 75833 22761
15922B2761j29681m2884l4602L267N1014L2793J7091Q9016o764j7685K1489L4306
$$ 22761 -106920 -149804 -184406 -181139 -130125 -97332 -80241 8775 2011 -15674 5815 40121
15910D0121P4310o3299j48038r1421l7258M5612j1842N945j11025Q6956P1174
$$ 40121 114431 51132 -96906 -188327 -225585 -179973 -191815 -185870 -296895 -209939 -138765
15899a38765J0355L6900k6879O512O4713j9443j5935K2720j4531k4293J8250M034
$$ -138765 -128410 -91510 -118389 -111877 -47164 -66607 -82542 -59822 -74353 -98646 -80396 -76362
15887g6362N3460j6641m6930J0117k1349M6590m3817m2744J30212O4252M8912
$$ -76362 -22902 -39543 -86473 -76356 -97705 -51115 -94932 -137676 -7464 56788 105700
15876A05700n5117l7692j2422P5349O666o9820M349j4421k1602j9361J00833R2063
$$ 105700 50583 12891 469 75818 82484 12664 17013 2592 -19010 -38371 62462 154525
15864A54525L0306K8352L6790q4075j23462k504j24198j03596N9393P3758L3667
$$ 154525 184831 213183 249973 165898 42436 39932 -84266 -187862 -128469 -54711 -21044
15853b1044j9474n7553M0820J16996J1437m2700r2863n0636m5298l5873N9033
$$ -21044 -40518 -98071 -57251 59745 71182 28482 -64381 -115017 -160315 -196188 -137155
15842a37155J66624K9470l1664J6251m3243L2567q2905p3582L6400Q3907m3274
$$ -137155 29469 58939 27275 43526 283 32850 -50055 -123637 -87237 -3330 -46604
15831d6604m1864j3744J4449N7017k074k7228q3185m7623R4917J07626l9146p4524
$$ -46604 -88468 -102212 -87763 -30746 -32820 -60048 -143233 -190856 -95939 11687 -27459 -101983
15819a01983r1316j65L6022k1343k9100Q5241L6622m0636j9736k3072M9530J42816
$$ -101983 -193299 -193464 -157442 -178785 -207885 -122644 -86022 -126658 -146394 -169466 -119936 22880
15807B2880P5422L9650N2859o424M5014o2017j4769r2878j47313P2664Q6282Q8114
$$ 22880 98302 137952 190811 184387 229401 167384 152615 59737 -87576 -14912 71370 159484
15795A59484j01785p1528O6764m093l9608j6223n9002j161P3353M5163r215J3082
$$ 159484 57699 -13829 52935 48842 9234 -6989 -65991 -67152 6201 51364 42149 55231
15783E5231n5340k6391R8592O5272j01468q4351j17720r7115R3567J53744J27370
$$ 55231 -109 -26500 72092 137364 35896 -48455 -166175 -263290 -169723 -15979 111391
15772A11391Q4695p7906j61909m7299J9613n0297N8030N9588l5444l2680j02084
$$ 111391 196086 118180 -43729 -91028 -71415 -121712 -63682 -4094 -39538 -72218 -174302
15761a74302j6723J06404K4741p3839N3213m8868k5802l4900o979J5662P6702
$$ -174302 -191025 -84621 -59880 -133719 -80506 -129374 -155176 -190076 -197055 -181393 -104691
15750a04691N6504L3587P5566o4279l6697O3825J6639j5712o5670o954k330k5167
$$ -104691 -48187 -14600 60966 -3313 -40010 23815 40454 24742 -40928 -47882 -50212 -75379
15738g5379k0593K6252k4359L5213J6871Q701O9933l9316M4925o6741k1787N2483
$$ -75379 -95972 -69720 -94079 -58866 -41995 -33294 36639 -2677 42248 -24493 -46280 6203
15726F203p972M5686q3439k7902J26786L6198k4841J5991n0115K5928j1716j2972
$$ 6203 -1769 43917 -39522 -67424 59362 95560 70719 86710 36595 62523 50807 37835
15714C7835k2186j38008l2231K28117Q6418p9902p1620j59686L4740R1627j1592
$$ 37835 15649 -122359 -154590 73527 159945 80043 8423 -151263 -116523 -24896 -36488
15703c6488p232n5607o0273K6753p4166O8320L0472k2020M2690J550K3252j7213
$$ -36488 -43720 -99327 -159600 -132847 -207013 -138693 -108221 -130241 -87551 -86001 -62749 -79962
15691g9962J9409J4287o3571J7166N713j22662p9367R4950P5468J5940Q646K2415
$$ -79962 -60553 -46266 -109837 -92671 -86958 -209620 -288987 -194037 -118569 -102629 -93983 -71568
15679g1568J53431L0926k3442o0302R496M0359k6405K9133p8109k401M2821q7506
$$ -71568 81863 112789 89347 29045 38541 78900 52495 81628 3519 1118 43939 -43567
15667d3567k7405k6923R9341k6191o6859n1043N8472l5799K6917R0619J08539
$$ -43567 -70972 -97895 1446 -24745 -91604 -142647 -84175 -119974 -93057 -2438 106101
15656A06101j2262q9692o9872L0153Q9221J8054o2228l1599j518M7937N6478n9750
$$ 106101 93839 4147 -65725 -35572 53649 71703 9475 -22124 -23642 24295 80773 21023
15644B1023o3924j322p4143p3370J25865R8748j15329n8290m936O0407M4047p7344
$$ 21023 -42901 -44223 -118366 -191736 -65871 32877 -82452 -140742 -145678 -85271 -41224 -118568
15632a18568L96n5792J5631L1110K5800l1517L4175l0136J11672O560J9139j8958
$$ -118568 -118172 -173964 -158333 -127223 -101423 -132940 -98765 -128901 -17229 -10669 8470 -10488
15620a0488q6604J3766j7279k7846o9069p1323r9164J09342J78595P1908L6908
$$ -10488 -97092 -83326 -100605 -128451 -197520 -268843 -368007 -258665 -80070 -8162 28746
15609B8746L4771Q495n3410m4682J153O8966J07826r47o3403p4053K447J6265
$$ 28746 63517 72012 18602 -26080 -24927 44039 151865 150918 87515 13462 15909 32174
15597C2174r6070K7605Q1229n2504o3796K2341n6638Q322M9822k8302n069p150
$$ 32174 -63896 -36291 44938 -7566 -71362 -49021 -105659 -97337 -47515 -75817 -80886 -88036
15585h8036J674M5175j21642P9024J3649m8474n930L4094L8121p1973K0093J599
$$ -88036 -86362 -41187 -162829 -83805 -70156 -118630 -124560 -90466 -52345 -124318 -104225 -102626
15573a02626q8058P056P4327J00984P5137M6664p2077o6656M8249j2068j3597
$$ -102626 -190684 -183628 -109301 -8317 66820 113484 41407 -25249 23000 10932 -2665
15562b665n9657Q2534m7733m2293M3161K7740o320n2236r5728M444k151M8334
$$ -2665 -62322 20212 -27521 -69814 -26653 1087 -5233 -57469 -153197 -148753 -150904 -102570
15550a02570J7127P6850P5309j30617o4032N202N7650j4540n2699Q490L3388l1064
$$ -102570 -85443 -8593 66716 -63901 -127933 -122731 -65081 -79621 -132320 -123830 -90442 -121506
15538a21506j255o4033K6674M9227K9470L5391J30133L2656M4791k7066k21478
$$ -121506 -122761 -186794 -160120 -110893 -81423 -46032 84101 116757 161548 134482 -86996
15527h6996n4982M1871J0745l5846n090L5294J7616K3069n4798K2073O3767O0627
$$ -86996 -141978 -100107 -89362 -125208 -130298 -95004 -77388 -54319 -109117 -87044 -23277 37350
15515C7350K195k3204N849L0050k5937j10083r346L1114M5707O3310K1757j15630
$$ 37350 39545 16341 22190 52240 26303 -83780 -93126 -62012 -16305 47005 68762 -46868
15503d6868l1566p6341J7085L2439K302N9507m2200j50271m3277R5238J79769
$$ -46868 -78434 -154775 -137690 -105251 -102949 -43442 -85642 -235913 -279190 -183952 -4183
15492d183K6440K4112j5286j66619k0355M2610j3569K7165k528p0523k3552J315
$$ -4183 22257 46369 31083 -135536 -155891 -113281 -126850 -99685 -102213 -172736 -196288 -194973
15480a94973R4608O3418m4606K3840K5133k2399K1689j6353q7699j5416P7081
$$ -194973 -100365 -36947 -81553 -57713 -32580 -54979 -33290 -49643 -137342 -152758 -75677
15469g5677J3350R652K9574k3289J4387Q5395k1874M326j5300O653p807L597k9904
$$ -75677 -62327 -52675 -23101 -46390 -32003 53392 31518 35844 20544 27197 19390 22987 -6917
15456f917j21061M88p6191L8738R8689J7953O2757o6269l0086P7228J6899K5279
$$ -6917 -127978 -127490 -203681 -164943 -66254 -48301 14456 -51813 -81899 -4671 12228 37507
15444C7507Q2611k2571n6867J7587M5565M5288O2776o2562j29856n3119o0613
$$ 37507 120118 97547 40680 58267 103832 149120 211896 149334 19478 -33641 -94254
15433i4254p6760J05186N4618j0806m7110q2695k8130L9973j39852N7363N1316
$$ -94254 -171014 -65828 -11210 -22016 -69126 -151821 -179951 -139978 -279830 -222467 -171151
15422a71151R8176L0764K1998m6721j8581J51770L1207j02057j23021n9871l9622
$$ -171151 -72975 -42211 -20213 -66934 -85515 66255 97462 -4595 -127616 -187487 -227109
15411b27109j54372j9322R6224J20723P7603p9578M241O9071J13844J28766m5097
$$ -227109 -381481 -400803 -304579 -183856 -106253 -185831 -181590 -112519 1325 130091 84994
15400H4994r6369J0461o6731q2278m2420J06317M4700r3898q6779L4699J10168
$$ 84994 -11375 -914 -67645 -149923 -192343 -86026 -41326 -135224 -222003 -187304 -77136
15389g7136M477k8206L0987K46070P1932j13317j35711n6767r484n2635m261J14471
$$ -77136 -72659 -100865 -69878 176192 248124 134807 -904 -57671 -67155 -119790 -124051 -9580
15377i580J3036k1008P5940N660Q8628N5421j62828m4057J1754l7957j0161m3577
$$ -9580 3456 -17552 58388 64048 152676 208097 45269 1212 12966 -24991 -35152 -78729
15365g8729j025K5414M5901n1339J96j2398L2629J42841j01807p6464n2160l2597
$$ -78729 -79754 -54340 -8439 -59778 -59582 -71980 -39351 103490 1683 -74781 -126941 -159538
15353a59538j0060j248K6306j6834j15395q2169L7920K1434N3358O716K4484N1661
$$ -159538 -169598 -170846 -144540 -161374 -276769 -358938 -321018 -299584 -246226 -239510 -215026 -163365
15341a63365L9257L203N531Q6975L7161J17168j8095k5463P5271n3816m4031L4645
$$ -163365 -124108 -120905 -115374 -28399 8762 125930 107835 82372 157643 103827 59796 94441
15329I4441r1053j07940n0913P657O2859m1304K302j2858K8024P6701P3233M6782
$$ 94441 3388 -104552 -155465 -147808 -84949 -126253 -123951 -136809 -108785 -32084 41149 87931
15317H7931J7999o0947N6584j61179j58083J3537N341J15551R9452j966l3404
$$ 87931 105930 44983 101567 -59612 -217695 -204158 -198817 -83266 16186 14220 -19184
15306a9184J1261n0731j4393P7456J02952m7480O112j55855p65J30671L6694p1052
$$ -19184 -7923 -58654 -73047 4409 107361 59881 65993 -89862 -90627 40044 76738 5686
15294E686o1785J2771m0994j6830L4960J9959J2300L2947k1406k7069q3097q7508
$$ 5686 -56099 -43328 -84322 -101152 -66192 -46233 -33933 -986 -22392 -49461 -132558 -220066
15282b20066J20063K41265j2034j32528n8145K1784J2006p0426Q3338J00198J8589
$$ -220066 -100003 141262 129228 -3300 -61445 -39661 -27655 -98081 -14743 85455 104044
15271A04044q5949p9680o8745J02433J08661r6227o9467R691L939m2440j7690
$$ 104044 18095 -61585 -130330 -27897 80764 -15463 -84930 -75239 -71300 -113740 -131430
15260a31430o381M3886L553j05356K2798J41602Q0295k5141l0199J9420N583J13840
$$ -131430 -137811 -93925 -90372 -195728 -172930 -31328 48967 23826 -6373 13047 18630 132470
15248A32470N2543p3600M054j45451j93010J19800J14346J1341J04472Q1482n7147
$$ 132470 185013 111413 115467 -29984 -222994 -103194 11152 22493 126965 208447 151300
15237A51300r9732o9956m7637m1003K9606l0022K4600k0996J5853R4288M9909
$$ 151300 51568 -18388 -66025 -107028 -77422 -107444 -82844 -103840 -87987 6301 56210
15226E6210L8617r340j23071o0904j5343J35923O2590o0247l9831l1687j1765
$$ 56210 94827 85487 -37584 -98488 -113831 22092 84682 24435 -15396 -47083 -58848
15215e8848j0010Q0148M0762n8154m3203J459N7924J5325N6125O1584o0507r3637
$$ -58848 -68858 11290 52052 -6102 -49305 -47846 10078 25403 81528 143112 82605 -11032
15203a1032m9273m2728K4367k6261K7116Q9013o467p4665k8402l1940J22116j6497
$$ -11032 -60305 -103033 -78666 -104927 -77811 11202 4735 -69930 -98332 -130272 -8156 -24653
15191b4653P1897k3949P7297L889Q0660M3945m7168k0224o7658k5525j5795R4919
$$ -24653 47244 23295 100592 104481 185141 229086 181918 161694 94036 68511 52716 147635
15179A47635M0372l9590O2843o1339o0931m0261m5295p5848j8982O4952N8885
$$ 147635 188007 148417 211260 149921 88990 48729 3434 -72414 -91396 -26444 32441
15168C2441q48j32415J174o0247K6820N0470j4684n3929L1288J19471r7150m4783
$$ 32441 31593 -100822 -99648 -159895 -133075 -82605 -97289 -151218 -119930 -459 -97609 -142392
15156a42392j0005M6214J2668L8142k278M8809J5583r531r891j69069m8071P6193
$$ -142392 -152397 -106183 -93515 -55373 -57651 -8842 6741 -2790 -12681 -181750 -229821 -153628
15144a53628J1333J71877J56970j230k5178k27464Q366J33647k2610O4616J5999
$$ -153628 -142295 29582 186552 185322 160144 -67320 -58954 74693 52083 116699 132698
15133A32698j7019K6594k4482j1880L3170L1510P5637N0480m5218j37086n0063
$$ 132698 115679 142273 117791 105911 139081 170591 246228 296708 251490 114404 64341
15122F4341l1645O0209J1925j5397j17772l8179L241J21008Q320m2460q8967J6904
$$ 64341 32696 92905 104830 89433 -28339 -66518 -63277 57731 66051 23591 -65376 -48472
15110d8472P180P7069l2697K8946j3561o5728k9772K052p9751q899R2034N7945
$$ -48472 -41292 35777 3080 32026 18465 -47263 -77035 -74983 -154734 -163633 -71599 -13654
15098a3654j5193K8342n5542n0084k9962O0039j8635l681J2676O5117J03952n3564
$$ -13654 -28847 -505 -56047 -106131 -136093 -76054 -94689 -98370 -85694 -20577 83375 29811
15086B9811l5352R2503n0221j05377J9799J4698K3039K4215o9825j17391O0230
$$ 29811 -5541 86962 36741 -68636 -48837 -34139 -11100 13115 -56710 -174101 -113871
15075a13871J05816k186N0612q0631O0554r38J9994j1249m2476q3211P0911N9392
$$ -113871 -8055 -10241 40371 -40260 20294 19356 39350 28101 -14375 -97586 -26675 32717
15063C2717O5305J06456J7854K9797j08913n1003p6932k4968M2428K0869j19338
$$ 32717 98022 204478 222332 252129 143216 92213 15281 -9687 32741 53610 -65728
15052f5728r1054k9720R7125K0652j01618M9327J18396Q2751n2087r432K1620
$$ -65728 -156782 -186502 -89377 -68725 -170343 -121016 -2620 80131 28044 18612 40232
15041D0232j21449q0883J9467N8685K2119O1106n2664o4223P0614K5356M754K3290
$$ 40232 -81217 -162100 -142633 -83948 -61829 -723 -53387 -117610 -46996 -21640 -16886 6404
15029F404R0780R4691m596r3685l5335j5963m1303K6932J30689M877j01469j5836
$$ 6404 97184 191875 187279 93594 58259 42296 993 27925 158614 163491 62022 46186
15017D6186O660P2170p8178j84841o2641M5806R6036J40237l7177j5636l1277
$$ 46186 52846 125016 46838 -138003 -200644 -154838 -58802 81435 44258 28622 -2655
15006b655m3927l2835P741J0677M1857P2330n5381q0635r8194N037O8784J29898
$$ -2655 -46582 -79417 -71676 -60999 -19142 53188 -2193 -82828 -181022 -175985 -107201 22697
14994B2697J210R0779L5740M180l9874k4273K9607Q334n1640n4398o7102m6510
$$ 22697 23907 114686 150426 154606 114732 90459 120066 128400 76760 22362 -44740 -91250
14982i1250k7317K4461P1920O6395K6239R76k1564N0930R5876J274o0557q5125
$$ -91250 -118567 -94106 -22186 44209 70448 71424 49860 100790 196666 197940 137383 52258
14970E2258l5156q915r5239J2010j5864j04525O171R4736K7646o344L0416J02599
$$ 52258 17102 8187 -87052 -75042 -90906 -195431 -189260 -94524 -66878 -73222 -42806 59793
14958E9793j5441q8574l6751O2778n6446l9788J40430J18199p6589k7691O9710
$$ 59793 44352 -44222 -80973 -18195 -74641 -114429 26001 144200 67611 39920 109630
14947A09630P5753J275l6077l2857M5248q3667m3639K631n0670n1079M8939p3172
$$ 109630 185383 186658 150581 117724 162972 79305 35666 38297 -12373 -63452 -14513 -87685
14935h7685j34565P1803P0905Q0340Q2828n2942P4769m728j8320q6123K4261L4949
$$ -87685 -222250 -150447 -79542 798 83626 30684 105453 100725 82405 -3718 20543 55492
14923E5492p7082J9728Q146j14774j09370Q4096O6606O3363O3896L5438K6161
$$ 55492 -21590 -1862 6284 -108490 -217860 -133764 -67158 -3795 60101 95539 121700
14912A21700n4703o4469r2377M6248K0384Q3843j5283j5514N773r435j428k0098
$$ 121700 66997 2528 -89849 -43601 -23217 60626 45343 29829 35602 26167 24739 4641
14900D641K0606Q1044q0147q2204o7488r146Q6849N3790P147l6004L2885M9821
$$ 4641 25247 106291 26144 -56060 -123548 -132694 -45845 7945 15092 -20912 11973 61794
14888F1794N5285o5048j28570o603N9805J1485j16280n8476L4646O2587R832j5983
$$ 61794 117079 52031 -76539 -83142 -23337 -11852 -128132 -186608 -151962 -89375 -79543 -95526
14876i5526R425L8798J24369l899l844N1516K1919r8112Q826k616m7604R476M8195
$$ -95526 -86101 -47303 77066 73167 69323 120839 142758 44646 53472 50856 3252 12728 60923
14863F0923N784m7709O6009o976r9785p2137k5409K7458R5822N1468m1194k4405
$$ 60923 66707 18998 85007 78031 -21754 -93891 -119300 -91842 3980 55448 14254 -10151
14851a0151L242P2380J49151R8186r0773j26366r3959j29270n9071Q3393j12833
$$ -10151 -6909 65471 214622 312808 222035 95669 1710 -127560 -186631 -103238 -216071
14840b16071m4455J26332J23317M56q2119K9229Q378m3897M4838k3590R98J2394
$$ -216071 -260526 -134194 -10877 -10421 -92540 -63311 -54933 -98830 -53992 -77582 -76584 -64190
14828f4190O336O765l1322j57675N1452J06378J4862p5825n5764j1667K4225k2115
$$ -64190 -57854 -51089 -82411 -240086 -188634 -82256 -67394 -143219 -198983 -210650 -186425 -208540
14816b08540J1041L0055r0122M4394j9734o7520P1708P9001M0907R0556q3134
$$ -208540 -197499 -167444 -257566 -213172 -232906 -300426 -228718 -149717 -108810 -18254 -101388
14805a01388p7049J02926R4445l8599j63683k3283l9015M3334O356O0404J40618
$$ -101388 -178437 -75511 18934 -19665 -183348 -206631 -245646 -202312 -195956 -135552 5066
14794E066J8333l1653j5900K3991J34348j7528j05912o4802Q2162L5443o143j37500
$$ 5066 23399 -8254 -24154 -163 134185 116657 10745 -54057 28105 63548 57405 -80095
14782h0095p0281j03901P581K3254J04760M1106j30368j3265J38762J02950q7840
$$ -80095 -150376 -254277 -246696 -223442 -118682 -77576 -207944 -221209 -82447 20503 -67337
14771f7337J1389L9764J07106N6226l8958n5315O2089R9435n9584k5956k1889
$$ -67337 -55948 -16184 90922 147148 108190 52875 114964 214399 154815 128859 106970
14760A06970m7481J2810R6155p44n1921m6846O6168M8413j89295j58503J32238
$$ 106970 59489 72299 168454 167710 115789 68943 135111 183524 -5771 -164274 -32036
14749c2036M1699o1470j08414L7290J53858J4670k6513j457l5700N2808O5010
$$ -32036 9663 -51807 -160221 -122931 30927 45597 19084 17627 -18073 34735 99745
14738I9745L5557l7767o2447l883P5318m5607j28276k0385L6238q394p1527J9453
$$ 99745 135302 97535 35088 31205 106523 60916 -67360 -87745 -51507 -59901 -131428 -111975
14726a11975J13088l8271o3024J7891J26761J25361n6725j02463n6077N1366l1550
$$ -111975 1113 -37158 -100182 -82291 44470 169831 113106 10643 -45434 5932 -25618
14715b5618j5160k8823K0411O0263K2008K6958J5556j27828m1129K7210L9079
$$ -25618 -40778 -69601 -49190 11073 33081 60039 75595 -52233 -93362 -66152 -27073
14704b7073M1432L462j01343p0967j02084J17730J93915o1910j37636n8795p295
$$ -27073 14359 17821 -83522 -154489 -256573 -138843 55072 -6838 -144474 -203269 -210564
14693b10564l1951L2506J23271j8742J01725J83286j5535m1066q90p3880p8166
$$ -210564 -242515 -210009 -86738 -105480 -3755 179531 163996 122930 122040 48160 -30006
14682c0006k2750R9125O4719O072j20650M0923R6608L8443o9921n223O2246m3769
$$ -30006 -52756 46369 111088 117160 -3490 37433 134041 172484 102563 97340 159586 115817
14670A15817o8881j52639o0054Q7005R1839Q4682M1322p8323m7203J358o2476
$$ 115817 46936 -105703 -165757 -78752 13087 97769 139091 60768 13565 14923 -47553
14659d7553j09687j10256R1666J63381J02514l7478j72145N6755J21006l4030
$$ -47553 -157240 -267496 -175830 -12449 90065 52587 -119558 -62803 58203 24173
14649B4173k3645Q5254M2364M2895k6716J9551J0737K1204j4151j57647j36720
$$ 24173 528 85782 128146 171041 144325 163876 174613 195817 181666 24019 -112701
14638a12701j5691n1027J4203J66984Q2252O453l4013l9704L7557k7228k6858
$$ -112701 -128392 -179419 -165216 1768 84020 90473 56460 16756 54313 27085 227
14627B27O3858Q7737M2991j1695J0555p6098m3729N8033P6414L800n4207j67898
$$ 227 64085 151822 194813 183118 193673 117575 73846 131879 208293 212093 157886 -10012
14615a0012p3475r6464k3709O9895N0774N2270r418j35233J4513J32021K3329
$$ -10012 -83487 -179951 -203660 -133765 -82991 -30721 -40139 -175372 -160859 -28838 -5509
14604e509j51689m8228n0903P2355J89032L8184q2619m4786Q9149n5572q4599
$$ -5509 -157198 -205426 -256329 -183974 5058 43242 -39377 -84163 4986 -50586 -135185
14593a35185N4749L0643j6943L6132J6989M3350P063k1593n1296M2279j559M9486
$$ -135185 -80436 -49793 -66736 -30604 -13615 29735 36798 15205 -36091 6188 4629 54115
14581E4115J11395J01588l8018k7028n5711l2597O796j26916r8381q669K9115
$$ 54115 165510 267098 229080 202052 146341 113744 120540 -6376 -104757 -113426 -84311
14570h4311M7640L7812j9323q5786J05131R8046j07901m4988n5119l6122M9979
$$ -84311 -36671 1141 -18182 -103968 1163 99209 -8692 -53680 -108799 -144921 -94942
14559i4942J09057n5128p0885k5456O7103J4965Q9827J2150p5513l7152J02841
$$ -94942 14115 -41013 -111898 -137354 -70251 -55286 34541 46691 -28822 -65974 36867
14548C6867N0120N2171Q9702r4685j52045K8833n5852m4072K37180J24411l9084
$$ 36867 86987 139158 228860 134175 -17870 10963 -44889 -88961 148219 272630 233546
14537B33546K8051q1148j4147l628p549l5277J8386L9603j02092j25074n7553
$$ 233546 261597 180449 166302 162674 155125 119848 138234 177837 75745 -49329 -106882
14526a06882J60442N4338J4165l1820j39088M0908J35710o7077q4383o313k7570
$$ -106882 53560 107898 122063 90243 -48845 -7937 127773 60696 -23687 -30000 -57570
14515e7570M89O7771J2640p0321m9519L4467L1309Q9380m4938j3917o3224N652
$$ -57570 -57081 10690 23330 -46991 -96510 -62043 -30734 58646 13708 -209 -63433 -57781
14503e7781j8868N9595K098K2877k2261l6938j1662M4985l6921j04084q339L0656
$$ -57781 -76649 -17054 -14956 7921 -14340 -51278 -62940 -17955 -54876 -158960 -167299 -136643
14491a36643J33407J40004k6246Q162O0664j9624K8122j7403o0175J862l3909
$$ -136643 -3236 136768 110522 118684 179348 159724 187846 170443 110268 112130 78221
14480G8221q3877p8194j3703k2301N4609O6630N7987N1874o4096p9400M8803q831
$$ 78221 -5656 -83850 -97553 -119854 -65245 1385 59372 111246 47150 -32250 16553 7722
14468G722P5434K3265r1318j8806R0969j062l6359M9486J7920o0203j34256o3787
$$ 7722 83156 106421 15103 -3703 87266 86204 49845 99331 117251 57048 -77208 -140995
14456a40995J61756J95708l3824j24457M7790N9438n8570k3041O0654l3162L7379
$$ -140995 20761 216469 182645 58188 105978 165416 106846 83805 144459 111297 148676
14445A48676P5212M0685j0160J3950L6321J1047M5616k8976n4312m3981m0034
$$ 148676 223888 264573 254413 268363 304684 315731 361347 332371 278059 234078 194044
14434A94044m8563j39728o723J06240L7839P2568J51283J3254J8231q5470n1987
$$ 194044 145481 5753 -970 105270 143109 215677 366960 380214 398445 312975 260988
14423B60988j9426p7178J5311R4510J41977j09824l9594p2583n2856K8546N2895
$$ 260988 241562 164384 179695 274205 416182 306358 266764 194181 141325 169871 222766
14412B22766N2005R6849J15172J16782L6749R7949Q4227R3271M6414L0706L1712
$$ 222766 274771 371620 486792 603574 640323 738272 822499 915770 962184 992890 1024602
14401A024602J28682K00670p525j4023Q6802J45865J95395J60405M5796k9896
$$ 1024602 1153284 1353954 1346429 1332406 1419208 1565073 1760468 1920873 1966669 1936773
14391A936773p6712j00375J44694Q2223N9318k8487j27235M941k300J3164L9956
$$ 1936773 1860061 1759686 1904380 1986603 2045921 2017434 1890199 1895140 1892840 1906004 1945960
14380A945960p8630j06679p0647r4721j35405k9802j8722o892j64367j2836L0981
$$ 1945960 1867330 1760651 1690004 1595283 1459878 1430076 1411354 1404462 1240095 1227259 1258240
14369A258240k3744j48216p6039n7417r4440j04984l3594p1452p5681p9472m849
$$ 1258240 1234496 1086280 1010241 952824 858384 753400 719806 648354 572673 493201 488352
14358D88352M2368k2643l8764j25109L8854O3829r23k4201r3285j00502l0449
$$ 488352 530720 508077 469313 344204 383058 446887 445964 421763 328478 227976 197527
14347A97527K2715L3674K3880j3202l0579k7360j12503l6468l828o8177j4431
$$ 197527 220242 253916 277796 264594 234015 206655 94152 57684 53856 -14321 -28752
14336b8752M5353l654J03207M2448L4140m1127O8452P2242j6097k7104m1882o1769
$$ -28752 16601 12947 116154 158602 192742 151615 220067 292309 276212 249108 207226 145457
14324A45457K7843N9627k5237J4516l0872j44048o6045L6442l4019N7346K0584
$$ 145457 173300 232927 207690 222206 191334 47286 -18759 17683 -16336 41010 61594
14313F1594o7583r773L3046j10721j19464Q5486P5508N0476n6056M5785q1465
$$ 61594 -5989 -15762 17284 -93437 -212901 -127415 -51907 -1431 -57487 -11702 -93167
14302i3167p53j0381K6885M6950L1997N7581m2119r6737q6355L554N3703L4147
$$ -93167 -93920 -104301 -77416 -30466 1531 59112 16993 -79744 -166099 -162545 -108842 -74695
14290g4695j08168J7884J0761P8857J2743Q7099O0220l0482j2092k8124p7129
$$ -74695 -182863 -164979 -154218 -75361 -62618 24481 84701 54219 42127 14003 -63126
14279f3126p6397P0742J36975Q0025n1059O017O039R3391O4734q559j82142J4646
$$ -63126 -139523 -68781 68194 148219 97160 103177 109216 202607 267341 258782 76640 91286
14267I1286J26947p0238q6036P6182M6815l1914M715R8017K6287p512j7837l9215
$$ 91286 218233 147995 61959 138141 184956 153042 157757 255774 282061 274549 256712 217497
14255B17497K7075J2868M8637K3912J3926n7057k1262J5795R091L7262k1889k0087
$$ 217497 244572 257440 306077 329989 343915 286858 265596 281391 290482 327744 305855 285768
14243B85768q6449j9389Q3180m1134J00900J12574N5194o5342l9764k4125n741
$$ 285768 199319 179930 263110 221976 322876 435450 490644 425302 385538 361413 355672
14232C55672n2813M211j4931n6166K3813L0090n1524j6172o6673P7276q350j5399
$$ 355672 302859 307070 292139 235973 259786 289876 238352 222180 155507 232783 224433 209034
14220B09034M4523j7617j15279O5090J1030O2277O3203q0268K9590J09046Q9492
$$ 209034 253557 235940 120661 185751 196781 259058 322261 241993 271583 380629 470121
14209D70121k6082n134P2371J0819n5316L6462p615l9520n6688L8052L5458J11405
$$ 470121 444039 438905 511276 522095 466779 503241 495626 456106 399418 437470 472928 584333
14197E84333K2918q9660j8280M5422J05361J43867P3450M318j11975j49127n9799
$$ 584333 607251 517591 499311 544733 650094 793961 867411 871729 759754 610627 550828
14186E50828M4014L1218q5760M550J6041L3278J04655L787r8844o8259L5784M2620
$$ 550828 594842 626060 540300 544850 560891 594169 698824 702611 603767 535508 571292 613912
14174F13912k2578j3364j06299l3547n9427Q9730m8367m6648J7038j51521k0104
$$ 613912 591334 577970 471671 438124 378697 468427 420060 373412 390450 238929 218825
14163B18825P3973m7738K2106K1941j5460k952N172m0758J556o6375m3345K9110
$$ 218825 292798 245060 267166 289107 273647 270695 275867 235109 236665 170290 126945 156055
14151A56055J42281L1532k8692Q138r6174l6912R3326l7017K0963R4686K0863
$$ 156055 298336 329868 301176 309314 213140 176228 269554 232537 253500 348186 369049
14140C69049o8394M7191J0920R2928q5368L5251j114k6596k6936m1263j01599
$$ 369049 300655 347846 358766 451694 366326 401577 400463 373867 346931 305668 204069
14129B04069N9450R5889L0182p8752Q0766P0224j373l8745j01210Q331j3227n1476
$$ 204069 263519 359408 389590 310838 391604 461828 460455 421710 320500 328831 315604 264128
14117B64128K4557M1718J11916Q2858k5091o045P1137p8951N9912K0882j985L7362
$$ 264128 288685 330403 442319 525177 500086 494041 565178 486227 546139 567021 565036 602398
14105F02398j13755n1396P3309j9073o255m4746O6521k0235l4704P7658M1064
$$ 602398 488643 437247 510556 491483 485228 440482 507003 486768 452064 529722 570786
14094E70786n2949k3382L2440m4774j00891J7607q4078J4328N5897P5497R326
$$ 570786 517837 494455 526895 482121 381230 398837 314759 329087 384984 460481 469807
14083D69807J52199K5148p0155O8799m301j6921o97O4287L3085P2481L2342m6815
$$ 469807 622006 647154 576999 645798 641497 624576 623879 688166 721251 793732 826074 779259
14071G79259k3841O3905J26851j8003j5597q133n1588J7891O9406n2202l5664
$$ 779259 755418 819323 946174 928171 912574 904441 852853 870744 940150 887948 852284
14060H52284L9011o605N45L4470J41978K03281N6666K390K9878n4557J32980R1940
$$ 852284 891295 884690 885235 919705 1061683 1264964 1321630 1324020 1353898 1299341 1432321 1524261
14048A524261Q6429L2726l6439R4770K7882N7225J05631P1105J44107K6804l5324
$$ 1524261 1610690 1643416 1606977 1701747 1729629 1786854 1892485 1963590 2107697 2134501 2099177
14037B099177l9901Q7587R8361J22380M5177j4127J11586M2275P26j9085P2782
$$ 2099177 2059276 2146863 2245224 2367604 2412781 2398654 2510240 2552515 2553241 2534156 2606938
14026B606938J11169O3455J05004N973j02563M2148M5405n9722R4871K06072O9945
$$ 2606938 2718107 2781562 2886566 2892539 2789976 2832124 2877529 2817807 2912678 3118750 3188695
14015C188695J00956Q6844O3425M7123J07639K22587K09167J55960R4995J87052
$$ 3188695 3289651 3376495 3439920 3487043 3594682 3817269 4026436 4182396 4277391 4464443
14005D464443J95107J40749K27523L16270K93359K93196L90349L16188K77995
$$ 4464443 4659550 4800299 5027822 5344092 5637451 5930647 6320996 6637184 6915179
13996F915179L52921M69456M53120M97638N63082O79579P14878P02086P50247
$$ 6915179 7268100 7737556 8190676 8688314 9251396 9930975 10645853 11347939 12098186
13987A2098186P95113R31432R14555J022082J164493J228039J449550J516573
$$ 12098186 12893299 13824731 14739286 15761368 16925861 18153900 19603450 21120023
13979B1120023J608047J821835K052458K191154K607662K861106K962497L372502
$$ 21120023 22728070 24549905 26602363 28793517 31401179 34262285 37224782 40597284
13971D0597284L807089M115664M607419N137613N748662O279559O825905P532185
$$ 40597284 44404373 48520037 53127456 58265069 64013731 70293290 77119195 84651380
13963H4651380Q215668Q994023R704204J0526609J1289781J1905866J2536039
$$ 84651380 92867048 101861071 111565275 122091884 133381665 145287531 157823570
13956A57823570J3002275J3532253J3775989J3837695J3806984J3630943J3258676
$$ 157823570 170825845 184358098 198134087 211971782 225778766 239409709 252668385
13949B52668385J2577571J1780588J0934712R863492Q881470P867149O662971
$$ 252668385 265245956 277026544 287961256 297824748 306706218 314573367 321236338
13942C21236338N546370M396745L319037K229545J323358K92680o76949j738652
$$ 321236338 326782708 331179453 334498490 336728035 338051393 338344073 337667124 335928472
13934C35928472k794898l753650m801640n929471p061950q192980r240016j0441936
$$ 335928472 333133574 329379924 324578284 318648813 311586863 303393883 294153867 283711931
13926B83711931j1259657j2122804j2954014j3442792j3689726j3930042j3826560
$$ 283711931 272452274 260329470 247375456 233932664 220242938 206312896 192486336
13919A92486336j3599341j3316801j2940433j2424543j1724370j0967014j0159353
$$ 192486336 178886995 165570194 152629761 140205218 128480848 117513834 107354481
13912A07354481r580830q808582p898151p219920o657862o028700n370179m923895
$$ 107354481 97773651 88965069 81066918 73846998 67189136 61160436 55790257 50866362
13904E0866362m364503l990827l654297l299708k934905k567324k363497k104890
$$ 50866362 46501859 42511032 38856735 35557027 32622122 30054798 27691301 25586411
13896B5586411j897315j807791j677759j522903j453908j201662j063642r47692
$$ 25586411 23689096 21881305 20203546 18680643 17226735 16025073 14961431 14013739
13888A4013739r85544q33562p87951o97924p20485o26763n97559m78706l95543
$$ 14013739 13028195 12194633 11406682 10708758 9988273 9361510 8763951 8285245 7889702
13879G889702l47599l70381m07284l26590l46272m23185l10472k44562j99371
$$ 7889702 7542103 7171722 6764438 6437848 6091576 5668391 5357919 5113357 4913986
13870D913986j59328k87846k21951j34526j07500l2950j08232j39202j76945k03361
$$ 4913986 4754658 4466812 4244861 4110335 4002835 3969885 3861653 3722451 3545506 3342145
13860C342145j19841j62782j42614N297p4871j46982j2445j27534j37885r3403
$$ 3342145 3222304 3059522 2916908 2922205 2847334 2700352 2687907 2560373 2422488 2329085
13850B329085l4130m5191m776j4428k22866q3593Q506p4455o7556m8986p6343
$$ 2329085 2294955 2249764 2244988 2230560 2007694 1924101 1932607 1858152 1790596 1741610 1665267
13839A665267n5818o7625k9583N734q3851j8937N9162R1947p9173j21181o5921
$$ 1665267 1609449 1541824 1512241 1517975 1434124 1415187 1474349 1566296 1487123 1365942 1300021
13828A300021Q068P9760L9162j17292n6993k2217j53259o6830P832o9491R4417
$$ 1300021 1308089 1387849 1427011 1309719 1252726 1230509 1077250 1010420 1018252 948761 1043178
13817A043178J47298O4434p6912j4719p169j70950l0834q5638m092j9194k4106
$$ 1043178 1190476 1254910 1177998 1163279 1156110 985160 954326 868688 864596 845402 821296
13806H21296l7601o1192k1737m8126k433m14Q8719O6506l8741m5082l8745n4588
$$ 821296 783695 722503 700766 652640 650207 649793 738512 805018 766277 721195 682450 627862
13794F27862L1707L9008j4130q4310j07792l6300q2045J5380M3182m8324O5849
$$ 627862 659569 698577 684447 600137 492345 456045 374000 389380 432562 384238 450087
13783D50087j35K756k5710j4388k0861N5805j3597j9125j04934J45871Q689j1581
$$ 450087 449952 452708 426998 412610 391749 447554 433957 414832 309898 455769 464458 452877
13771D52877m3846m0282r582n4552q759R1783K5801k9050p8912q2144L6341Q4395
$$ 452877 409031 368749 359167 304615 295856 387639 413440 384390 305478 223334 259675 344070
13759C44070n2157j1474J25761m2843m3389k5537L348m5748O3082N2040j17177
$$ 344070 291913 280439 406200 363357 319968 294431 297779 252031 315113 367153 249976
13748B49976n7006k7096p8064m6144M0800o5410M1015M6685R9028l8571q1139
$$ 249976 192970 165874 87810 41666 82466 17056 58071 104756 203784 165213 84074
13737H4074L9467L9527J1118m8265n850Q4691k4471o5530m4358o1729m6252j3173
$$ 84074 123541 163068 174186 125921 120071 204762 180291 114761 70403 8674 -37578 -50751
13725e0751k4839N632J7896o2828n236O0152l942R0680R4110k6889j46564k2836
$$ -50751 -75590 -69958 -52062 -114890 -120126 -59974 -63916 26764 120874 93985 -52579 -75415
13713g5415J61660P5911O6145m9705m3876J3918n2571q960K1542r678Q1486j0093
$$ -75415 86245 162156 228301 178596 134720 148638 96067 87107 108649 98971 180457 170364
13701A70364j81881j20936N6562M6479Q2836N6103j08633o9430N3257P9919p6059
$$ 170364 -11517 -132453 -75891 -29412 53424 109527 894 -68536 -15279 64640 -11419
13690a1419l3048J047R2783M3013m1810p2446P4716n5124o2999M1107j04726K612
$$ -11419 -44467 -43420 49363 92376 50566 -21880 52836 -2288 -65287 -24180 -128906 -126294
13678a26294L8014n3173l9659r6476J31685J6317J2471J3945r7926R6126Q2400
$$ -126294 -88280 -141453 -181112 -277588 -145903 -129586 -117115 -103170 -201096 -104970 -22570
13667b2570q1627q8061K0445J4891J9185K3626o8622l7558k4235O6038J38381
$$ -22570 -104197 -192258 -171813 -156922 -137737 -114111 -182733 -220291 -244526 -178488 -40107
13656d0107L9730N245K2020L9981k7102k1612K3597o0118k0066Q7431J2351q2113
$$ -40107 -377 4868 26888 66869 39767 18155 41752 -18366 -38432 48999 61350 -20763
13644b0763l3772Q2510n0146m9834j7054n5859M9322n129K0929o64j46144O966
$$ -20763 -54535 27975 -22171 -72005 -89059 -144918 -95596 -100725 -79796 -80460 -226604 -219638
13632b19638P6229j4232R7860J29640p3153m3440j4147o8228Q869N8505L5669
$$ -219638 -143409 -157641 -59781 69859 -3294 -46734 -60881 -129109 -120240 -61735 -26066
13621b6066k11968j00084J448O4632K01101K38820R871j23029j14283k4548L7021
$$ -26066 -238034 -338118 -336670 -272038 -70937 167883 177754 54725 -59558 -84106 -47085
13610d7085M2591N7706M6320O1457m2037r3209l4061O6513K3731K4053J9762M743
$$ -47085 -4494 53212 99532 160989 118952 25743 -8318 58195 81926 105979 125741 130484
13598A30484n4663J8384L3161j427k4978J07824N1173j349j00763j8778l7362
$$ 130484 75821 94205 127366 125939 100961 208785 259958 258609 157846 139068 101706
13587A01706K9875K2776J27681Q3429J11739p9401J2718K2434n1234j8670K3220
$$ 101706 131581 154357 282038 365467 477206 397805 410523 432957 381723 363053 386273
13576C86273j0441n0392j3535K216R0963m6783q5036o1523n9875q2395j64983
$$ 386273 375832 325440 311905 314121 405084 358301 273265 211742 151867 69472 -95511
13565i5511m9769J35858L5217q4636L246J0235N8233Q9155L4682l9566K1949j9294
$$ -95511 -145280 -9422 25795 -58841 -55595 -45360 12873 102028 136710 97144 119093 99799
13553I9799o9086M4470O5109J24450l3975n9429k17551j23378R3368J02638j8496
$$ 99799 30713 75183 140292 264742 230767 171338 -46213 -169591 -76223 26415 7919
13542G919J2417J72173p5532j07197l5630o4488j311P045M2582J3160O1857m266
$$ 7919 20336 192509 116977 9780 -25850 -90338 -91649 -84604 -42022 -28862 32995 28729
13530B8729L3440m9298k0956R1368j7203l3986Q0421K9209K4186j6297J2289N3050
$$ 28729 62169 12871 -8085 83283 66080 32094 112515 141724 165910 149613 161902 214952
13518B14952P1322Q992l2666k4274M7523J46739L8775L2722o9243O0109K6210
$$ 214952 286274 295266 262600 238326 285849 432588 471363 504085 434842 494951 521161
13507E21161J22469R2835J2811q5934L6324J25390K33909Q6177L9681Q3069O4004
$$ 521161 643630 736465 749276 663342 699666 825056 1058965 1145142 1184823 1267892 1331896
13496A331896N2615J67493J48494Q9499j6076M8115k1158J5427l8097J15611p4527
$$ 1331896 1384511 1552004 1700498 1789997 1773921 1822036 1800878 1816305 1778208 1893819 1819292
13485A819292j03076k5140O1664K4373O8514Q0451k4060j70438j32047N6502P864
$$ 1819292 1716216 1691076 1752740 1777113 1845627 1926078 1902018 1731580 1599533 1656035 1663899
13474A663899q3114L7263l366m797j69021p4798l0821q1988j30155p4324K4382
$$ 1663899 1580785 1618048 1614682 1609885 1440864 1366066 1335245 1253257 1123102 1048778 1073160
13463A073160n9718j85251j17067p2525m1465j8495m5987q7435n2911j27389r304
$$ 1073160 1013442 828191 711124 638599 597134 578639 532652 445217 392306 264917 255613
13452B55613O1125K8136q5479p0218L4398K5913j49592m7296l5352q0902N6177
$$ 255613 316738 344874 259395 189177 223575 249488 99896 52600 17248 -63654 -7477
13441g477J20705l990m5985K5854J4964n9354j8517J15937J07371o5674N4995
$$ -7477 113228 109238 63253 89107 104071 44717 26200 142137 249508 183834 238829
13430B38829m0715j49158l7301R0918l3508j20452j21365l0971R6781q959J0543
$$ 238829 198114 48956 11655 102573 69065 -51387 -172752 -203723 -106942 -115901 -105358
13419a05358M2724O1392P015j06K6196l2346K1079K708r4368l1190M3415R918
$$ -105358 -62634 -1242 5773 5667 31863 -483 20596 23304 -71064 -102254 -58839 -48921
13407d8921j4443K9566J9721n4989q012N6603k7080J3585l4926n4800j616J9054
$$ -48921 -63364 -33798 -14077 -69066 -77078 -20475 -47555 -33970 -68896 -123696 -125312 -106258
13395a06258k4376O636P894j1888O8862J69839J14406m412j46355m0298K4079
$$ -106258 -130634 -123998 -116104 -127992 -59130 110709 225115 220703 74348 34050 58129
13384E8129n5926J3751N1259L5151n3895j5547m7208K3690N9185j15449k4990
$$ 58129 2203 15954 67213 102364 48469 32922 -14286 9404 68589 -46860 -71850
13373g1850J33330J1346p7256j02848m725O7933N9648l3518m7328M0196N4762
$$ -71850 61480 72826 -4430 -107278 -112003 -44070 15578 -17940 -65268 -25072 29690
13362B9690M7302n7001p2909m0604N4541P5693J0649K0828j1488p0512K9266k1143
$$ 29690 76992 19991 -52918 -93522 -38981 36712 47361 68189 56701 -13811 15455 -5688
13350e688p6537l066M9421L3459P6953j22255n9581L2274n1710J987R2786O7997
$$ -5688 -82225 -85291 -35870 -2411 74542 -47713 -107294 -75020 -126730 -124743 -31957 36040
13338C6040J24820J04815r1846j81594L7622M5238m8461L1861N2778m265r3504
$$ 36040 160860 265675 173829 -7765 29857 75095 26634 58495 111273 107008 13504
13327A3504P918o8042l394L2943p3442j0962o3493j14579Q7021Q2472m6543l5735
$$ 13504 21422 -46620 -50014 -17071 -90513 -101475 -164968 -279547 -192526 -110054 -156597 -192332
13315a92332N3202r8561n8559N3592J29322m639m5962K28K9803J7568o5777L5977
$$ -192332 -139130 -237691 -296250 -242658 -113336 -117975 -163937 -163709 -133906 -116338 -182115 -146138
13303a46138J20292J61749l1192p3764p5951l4130O0117P3690N4648o2335j08691
$$ -146138 -25846 135903 104711 30947 -45004 -79134 -19017 54673 109321 46986 -61705
13292f1705P5385k9308j20300j12604M6164K6110M9252j7239N4647N2578J4100
$$ -61705 13680 -15628 -135928 -248532 -202368 -176258 -127006 -144245 -89598 -37020 -22920
13281b2920j04338J2191O7429O519l2044m6205l7071N5147J12332J0944L582j0172
$$ -22920 -127258 -115067 -47638 -41119 -73163 -119368 -156439 -101292 11040 21984 25566 15394
13269A5394M4985o4666j2559J48370m6447q0650J11717j4282m1162k607m5755
$$ 15394 60379 -4287 -16846 131524 85077 4427 116144 101862 60700 58093 12338
13258A2338k460M5561N5561N7591R1263j03985j23566M741n3065o2278M7015j3659
$$ 12338 9878 55439 111000 168591 259854 155869 32303 37044 -16021 -78299 -31284 -44943
13246d4943N5365j19863p7189N0216K17386J8303o2068l6076n620k0917K9298
$$ -44943 10422 -109441 -186630 -136414 80972 99275 37207 1131 -4489 -25406 3892
13235C892o2377j40699q44L2839K0765p197J863R6358L2214P444J1965M4205r3581
$$ 3892 -58485 -199184 -200028 -167189 -146424 -153621 -151758 -55400 -23186 -15742 -3777 40428 -53153
13222e3153m5092r6259J445R6540R6863K9732J2184q772K2126m5905j23247k7025
$$ -53153 -98245 -194504 -193059 -96519 344 30076 42260 33488 55614 9709 -113538 -140563
13210a40563K7675R195J00534m1800o5317R2193P0667j1044K9047n1380N4960
$$ -140563 -112888 -103693 -3159 -44959 -110276 -18083 52584 41540 70587 19207 74167
13199G4167n5723o6738O7918m6380k4612O4594m0463l3576p1951n0075J7545N9567
$$ 74167 18444 -48294 19624 -26756 -51368 13226 -27237 -60813 -132764 -182839 -165294 -105727
13187a05727K7861l1539m0472K8206J06155o3273n2439q3001R0484J52129m4177
$$ -105727 -77866 -109405 -149877 -121671 -15516 -78789 -131228 -214229 -123745 28384 -15793
13176a5793j13710J3805j3617m1916J7498R3319L2665j9054N53J5312P6104K5389
$$ -15793 -129503 -115698 -129315 -171231 -153733 -60414 -27749 -46803 -46250 -30938 45166 70555
13164G0555m109l1566K8912l4447j1838R2479J469p2161r8756K8172L3724J9747
$$ 70555 66446 34880 63792 29345 17507 109986 111455 39294 -59462 -31290 2434 22181
13152B2181R5603o0506o4985P091J0176P1124j7542l2711m8171R8498N5932m5334
$$ 22181 117784 57278 -7707 -616 9560 80684 63142 30431 -17740 80758 136690 91356
13140I1356k6839q4165Q6602N0904q7148m1270J3822p5503m657L0416l9572k14980
$$ 91356 64517 -19648 66954 117858 30710 -10560 3262 -72241 -76898 -46482 -86054 -301034
13128c01034L9604J60570Q6828j5054m314o4268K2747R1783K6592j37186k4102
$$ -301034 -261430 -100860 -14032 -29086 -33400 -97668 -74921 16862 43454 -93732 -117834
13117a17834J32223O5892j30632j33538K3600J56441J9591n902m7126J3049L1036
$$ -117834 14389 80281 -50351 -183889 -160289 -3848 15743 9841 -37285 -24236 6800
13106F800P2227m0333K7394n6617j08504j0043R5523L3693j8225K9457N4839q3499
$$ 6800 79027 38694 66088 9471 -99033 -109076 -13553 20140 1915 31372 86211 2712
13094B712j5239j9395r678j6183l6248J5667r0099N7678K5465O5685O1323L8124
$$ 2712 -12527 -31922 -41600 -57783 -94031 -78364 -168463 -110785 -85320 -19635 41688 79812
13082G9812j6524n2482M2085o8916n2020P1683O6724Q1848q5737j34470m2070
$$ 79812 63288 10806 52891 -16025 -68045 3638 70362 152210 66473 -67997 -110067
13071a10067j5511p1984m2299o1770J1382J25674J35698R1711L0781n1440n1678
$$ -110067 -125578 -197562 -239861 -301631 -290249 -164575 -28877 62834 93615 42175 -9503
13060i503K0627k9743r3894l5982O1519R3752k5494o3494K8304n8899j13200p335
$$ -9503 11124 -18619 -112513 -148495 -86976 6776 -18718 -82212 -53908 -112807 -226007 -233342
13048b33342R2273M3066m0926K0171K087J7155J6803m0672N7784J00110N0720
$$ -233342 -141069 -98003 -138929 -118758 -116671 -99516 -82713 -123385 -65601 34509 85229
13037H5229l1323m6007l9896O3273J1432j2458J00926K8480M5835K5222j8746
$$ 85229 53906 7899 -31997 31276 42708 30250 131176 159656 205491 230713 211967
13026B11967m550M2851J7002k7906m0529O502l5622M3766j715n1051P6314l9138
$$ 211967 207417 250268 267270 239364 198835 205337 169715 213481 211766 160715 237029 197891
13014A97891k45809q7166R9666O8002J07537J0790j17312n2648k9985R708J3375
$$ 197891 -47918 -135084 -35418 32584 140121 150911 33599 -19049 -49034 -39326 -25951
13003b5951m8936L9020k9135P2431M1382N2387R2703P7427K2107m3317l9744J060
$$ -25951 -74887 -35867 -65002 7429 48811 101198 193901 271328 293435 250118 210374 211434
12991B11434J1547k487q4235r0222O4142j2373j33515m7786J10454O8252o792
$$ 211434 222981 220494 136259 46037 110179 97806 -35709 -83495 26959 95211 88419
12980H8419J1070K4796j06113o4518J4588K0214Q6277m8965L1534l6298k9679
$$ 88419 99489 124285 18172 -46346 -31758 -11544 74733 25768 57302 21004 -8675
12969h675r7402j1012k8003j7061K2009J4010l5145M6841Q3590l401J6789L0364
$$ -8675 -106077 -117089 -145092 -162153 -140144 -126134 -161279 -114438 -30848 -34249 -17460 12904
12957A2904Q5096m3292j9638j08565m4406J07993K8928j130K6740J5093K1758
$$ 12904 98000 54708 35070 -73495 -117901 -9908 19020 17890 44630 59723 81481
12946H1481N0290L7683j8452o8506L0950K00316P6597O5064K5402L7081k7712
$$ 81481 131771 169454 151002 82496 113446 313762 390359 455423 480825 517906 490194
12935D90194j91154p0471Q107n0022J5222J3787l0740k6366J8899j23711j91652
$$ 490194 299040 228569 236676 186654 201876 215663 184923 158557 177456 53745 -137907
12924a37907K8687J44581M9562J22265Q1515o7780N2082K8149p2444j41607p1446
$$ -137907 -109220 35361 84923 207188 288703 220923 273005 301154 228710 87103 15657
12913A5657O6918N2036J32730l326r2686K4357L180j11761l4979N3577l04J19433
$$ 15657 82575 134611 267341 264015 171329 195686 198866 87105 52126 105703 105399 224832
12901B24832N5440L5192J25198J75923J57021P3006N6026r7058j86990j29918
$$ 224832 280272 315464 440662 616585 773606 846612 902638 805580 618590 488672
12891D88672j39577k31408L5728k6128Q876O412Q3117p4437k0801k739n0288O772
$$ 488672 349095 117687 153415 127287 136163 142575 225692 151255 130454 127715 77427 84199
12879H4199P2133q4491q7294M4801m664K2346l0280j10384J67639M5830p1034
$$ 84199 156332 71841 -15453 29348 24684 47030 16750 -93634 74005 119835 48801
12868D8801J5051J69218R4054n6303m4717J5320J2837N0739R1257J284N6326K1912
$$ 48801 63852 233070 327124 270821 226104 241424 254261 305000 396257 397541 453867 475779
12856D75779N6420K33315Q4791j48630j62255o5573k3949j72412m7774P0726K8394
$$ 475779 532199 765514 850305 701675 539420 473847 449898 277486 229712 300438 328832
12845C28832J1544r6194q7362l9311k1712o9330l8221k4688L5421R580n115K4122
$$ 328832 340376 244182 156820 117509 95797 26467 -11754 -36442 -1021 8559 3444 27566
12833B7566O5319m336l280J09706k0056l6524M3291l2697r886m1981L5141J44481
$$ 27566 92885 88549 85269 194975 174919 138395 181686 148989 139103 97122 132263 276744
12821B76744O2861n7923n8546p1428j79952k4434P9655M8202O475L1887m012K4471
$$ 276744 339605 281682 223136 151708 -28244 -52678 26977 75179 81654 113541 109529 134000
12809A34000o9914k3715j22453N0202n2262M017M6203J4679L1087J1103Q3642
$$ 134000 64086 40371 -82082 -31880 -84142 -80125 -33922 -19243 11844 22947 106589
12798A06589Q2833p3250j01304o2265N1242l7045L6155J3118R0097K204l3039
$$ 106589 189422 116172 14868 -47397 3845 -33200 2955 16073 106170 108374 75335
12787G5335J551j6623K6014J28147m6291j44205O6668N0285L6963q7158r5201
$$ 75335 76886 60263 86277 214424 168133 23928 90596 140881 177844 90686 -4515
12776d515q2838L1549j0029K3282P4990K44937J7740K8914m235K7710q8691j00194
$$ -4515 -87353 -55804 -65833 -42551 32439 277376 295116 324030 319795 347505 258814 158620
12764A58620j37432q675p8800R5216P5692O3211l1578K4550j0099m7626l0671
$$ 158620 21188 12513 -66287 28929 104621 167832 136254 160804 150705 103079 72408
12753G2408J8138p2902j04855P8036M4120L0981K0844n8632J7902M7361m7668
$$ 72408 90546 17644 -87211 -9175 34945 65926 86770 28138 46040 93401 45733
12742D5733q3877n6625P9147M5182R697P8144J51102p4988n1933K4882k6227k2925
$$ 45733 -38144 -94769 -15622 29560 39257 117401 268503 193515 141582 166464 140237 117312
12730A17312J7583n2575M9801J07308N9130L0719N8673l8791O0323Q2198j9196
$$ 117312 134895 82320 132121 239429 298559 329278 387951 349160 409483 491681 472485
12719D72485J6406K19156N7078K2958r6222j00558n6873m9698q9501K5033o6495
$$ 472485 488891 708047 765125 788083 691861 591303 534430 484732 395231 420264 353769
12708C53769j200N3811j0136l5835j5053m8264Q438K9394O246P2079m4914q3612
$$ 353769 352569 406380 396244 360409 345356 297092 305530 334924 341170 413249 368335 284723
12696B84723r838P4936P8753M7238O8987N1147J10762O0180o8777K4605J66286
$$ 284723 274885 349821 428574 475812 544799 595946 706708 766888 698111 722716 889002
12685H89002J52405Q5098q7145j32680J8001M1381P1903k8263K849k5970l4432
$$ 889002 1041407 1126505 1039360 906680 924681 966062 1037965 1009702 1012551 986581 952149
12674I52149j7059p0770j33767k16169o8041J8310J6778j1122J05039N2810j602
$$ 952149 935090 864320 730553 514384 446343 464653 481431 470309 575348 628158 626556
12663F26556j9309J5522L156K9523L1998m776p3255l287m0558l9492O9261P4645
$$ 626556 607247 622769 625925 655448 687446 682670 609415 606128 565570 526078 595339 669984
12651F69984k2790j2502P2175J4050J5688R8221N4469O1251k2617p3572K7381
$$ 669984 647194 634692 706867 720917 736605 834826 889295 950546 927929 854357 881738
12640H81738N7189o1730j08635k09426j85963j1354L6662o2428m6740L0798O5785
$$ 881738 938927 877197 768562 559136 373173 361819 398481 336053 289313 320111 385896
12629C85896j7109m3053K5193k7128j39190Q8481k6524m3113J55038J59564J09605
$$ 385896 368787 325734 350927 323799 184609 273090 246566 203453 358491 518055 627660
12618F27660O7708k3249q9559L0438L1898m5711J56771o959P5708L4761J15604
$$ 627660 695368 672119 582560 612998 644896 599185 755956 748997 824705 859466 975070
12607I75070J37331O5392r2011l3268k6164o1930J22193P040l465k126o3833P6627
$$ 975070 1112401 1177793 1085782 1052514 1026350 964420 1086613 1093653 1090188 1088062 1024229 1100856
12595A100856R7075J96948L10437K38215K35657K31865Q6276M25L8866L24172
$$ 1100856 1197931 1394879 1705316 1943531 2179188 2411053 2497329 2497754 2536620 2860792
12585B860792P04212J023693J593280J961256J625387P27281m57177r20121q16669
$$ 2860792 3565004 4588697 6181977 8143233 9768620 10495901 10038724 9118603 8301934
12576H301934l17845k64940m00180p02168q83436o32607l35160o1674K72364N20355
$$ 8301934 7984089 7719149 7318969 6616801 5733365 5100758 4765598 4703924 4976288 5496643
12566E496643O07606N94297P7119k60892j17030J22793J39284J64408J48241M19212
$$ 5496643 6104249 6698546 6775665 6514773 6397743 6520536 6659820 6824228 6972469 7391681
12556G391681Q57807Q75711M80085O1054m76876n04017k47283J40596M66338P33271
$$ 7391681 8249488 9125199 9605284 9666338 9189462 8685445 8438162 8578758 9045096 9778367
12546I778367Q19751Q01903R39040J168021J822079K834832L933777L789588J701510
$$ 9778367 10598118 11400021 12339061 13507082 15329161 18163993 22097770 25887358 27588868
12537B7588868j451281l552658l612681k613489j611781j169711j136086j161740
$$ 27588868 26137587 22584929 18972248 16358759 14746978 13577267 12441181 11279441
12529A1279441j055847p70354n50172n1049L36023M99616L61211k05160p61685
$$ 11279441 10223594 9453240 8903068 8852019 9188042 9687658 10048869 9843709 9082024
12520I082024q54220p07188m28522j90798j13108n2662P3289J73875J3111l02561
$$ 9082024 8227804 7520616 7092094 6901296 6788188 6735526 6808815 6982690 6995801 6693240
12510F693240o16931n85513n25652l12530J67633M69257O68800P51874P49580
$$ 6693240 6076309 5490796 4965144 4652614 4820247 5289504 5958304 6710178 7459758
12501G459758M93487J91550M11871J059275J261663N53149p13842j939094k139991
$$ 7459758 7953245 8144795 8556666 9615941 10877604 11430753 10716911 8777817 6637826
12492F637826j757693j086852n74903k18357n7213O8854j65787l59280l67735
$$ 6637826 4880133 3793281 3218378 3000021 2942808 3011662 2845875 2486595 2118860
12483B118860l34001j73208r9550p1159j1287m0126Q5490n6537n9103o3054M7484
$$ 2118860 1784859 1611651 1512101 1440942 1429655 1389529 1475019 1418482 1359379 1296325 1343809
12472A343809M4617M0233J15482n9469j84571j16249M0842l737q3635j6089m7197
$$ 1343809 1388426 1428659 1544141 1484672 1300101 1183852 1224694 1220957 1137322 1121233 1074036
12461A074036M3307J882j8412q194j5093o6499J17455J48399J05756J84967J75427
$$ 1074036 1117343 1119225 1100813 1092619 1077526 1011027 1128482 1276881 1382637 1567604 1743031
12450A743031K49295k4265R271J14261O6960K5662q6515j21251n6116p8781o815
$$ 1743031 1992326 1968061 1977332 2091593 2158553 2184215 2097700 1976449 1920333 1841552 1834737
12439A834737k4402r993R5568k7999p5808k724j4793l1875l6110Q9029J57766
$$ 1834737 1810335 1800342 1895910 1867911 1792103 1789379 1774586 1742711 1706601 1795630 1953396
12428A953396R3930Q3324J48792k8005L6369Q8772J43070Q6559J8070P444N0019
$$ 1953396 2047326 2130650 2279442 2251437 2287806 2376578 2519648 2606207 2624277 2631721 2681740
12417B681740J91212L12741J33471K22811K84029J81797K00254J38383j0831q1883
$$ 2681740 2872952 3185693 3319164 3541975 3826004 4007801 4208055 4346438 4335607 4253724
12407D253724r6179k42043l29640k64604m7752j17932k25471j98135o0217j4898
$$ 4253724 4157545 3915502 3585862 3321258 3273506 3155574 2930103 2731968 2671751 2656853
12397B656853l2065j38262j35461l7953k3875o4786l2445k3880o9071m2988k8839
$$ 2656853 2624788 2486526 2351065 2313112 2289237 2224451 2192006 2168126 2099055 2056067 2027228
12386B027228l9453o6021Q0715M5780P9689l9061r8269K7195P3634J1361M4473
$$ 2027228 1987775 1921754 2002469 2048249 2127938 2088877 1990608 2017803 2091437 2102798 2147271
12375B147271J14840N5324p8796j11271k8448j49588j49193k39348j88882r2324
$$ 2147271 2262111 2317435 2238639 2127368 2098920 1949332 1800139 1560791 1371909 1279585
12365A279585k08201j65239n9362N2796p1748r997k0842O3091M2678J3329o0447
$$ 1279585 1071384 906145 846783 899579 827831 817834 796992 860083 902761 916090 855643
12354H55643j49241j69868M701L6534J688J19501Q5115n0120q3362p8970R1020
$$ 855643 706402 536534 541235 577769 579457 698958 784073 733953 650591 571621 662641
12343F62641P9186L2962j29779o7985J3839q1937j0888L7974j7780o2863k218
$$ 662641 741827 774789 645010 577025 590864 508927 498039 536013 518233 455370 453152
12332D53152J11804J5167k4768j02802l2079J8239n0132L1587J9585q2122p6479
$$ 453152 564956 580123 555355 452553 420474 438713 388581 420168 439753 357631 281152
12321B81152r90J3094j4711k7249k961o2723O1654R3247n606o1598k4368p608
$$ 281152 280162 293256 278545 251296 248335 185612 247266 340513 334907 273309 248941 241333
12309B41333m718r088N3585L401K2211o91j83962j6882J63873R1839L5368Q944
$$ 241333 236615 227527 281112 284513 306724 306033 122071 105189 269062 360901 396269 405213
12297D05213k7369o1551n9529j8282J06348Q6837L309L6592K9156n2229j54097
$$ 405213 377844 316293 256764 238482 344830 431667 434976 471568 500724 448495 294398
12286B94398l4842Q243J04008P1195j8573J29557K8292j33497M6308O0509r4877
$$ 294398 259556 267799 371807 443002 424429 553986 582278 448781 495089 555598 460721
12275D60721j5453L3393Q7207K2294M2390n5778q472J476r690k5563j22200n1661
$$ 460721 445268 478661 565868 588162 630552 574774 566302 567778 558088 532525 410325 358664
12263C58664O9351J57062J10489p0881j64327r7614L0975L0578m0380o3481K2480
$$ 358664 428015 585077 695566 624685 460358 362744 393719 424297 383917 320436 342916
12252C42916N040r095p784r4573K0792K9696j6468k9983Q3356p3481j6338M4697
$$ 342916 347956 338861 331077 236504 257296 286992 270524 240541 323897 250416 234078 278775
12240B78775j451O027Q9590q801l3443P2118M4813L5080Q3979m3985o2236N1655
$$ 278775 277324 283351 372941 364140 330697 402815 447628 482708 566687 522702 460466 512121
12228E12121l3059j5690M2985k2049K4229N2481R7392j0411o0394n9100l686M917
$$ 512121 479062 463372 506357 484308 508537 561018 658410 647999 587605 528505 524819 529736
12216E29736j6412p349q3517j12233L8348N1903k5513j146O7164o44j2294k8496
$$ 529736 513324 505975 422458 310225 348573 400476 374963 373817 440981 440337 428043 399547
12204C99547k7102m3206j30816j5495Q9214R9659L2333k640l5751L420O8056R1130
$$ 399547 372445 329239 198423 182928 272142 371801 404134 401494 365743 369163 437219 528349
12192E28349J5321r0915k1970m6158q456p5211o8259R2783J55849J5865l1305
$$ 528349 543670 452755 430785 384627 376171 300960 232701 325484 481333 497198 465893
12181D65893q5223o6760o7302l8499N7778l3057o2085J28780N5845k3117j47193
$$ 465893 380670 313910 246608 208109 265887 232830 170745 299525 355370 332253 185060
12170A85060r8731O3692k1949r1779K3544O3668N8771J19305Q5008L1639l3689
$$ 185060 86329 150021 128072 36293 59837 123505 182276 301581 386589 418228 384539
12159C84539j07091o0951p0866Q4213j783K9389j8456l1530M7806n2399M0494
$$ 384539 277448 216497 145631 229844 228061 257450 238994 207464 255270 202871 243365
12148B43365J3225M4947n2938K8144J8044o0015R448L5851L8247m9681l6694o7928
$$ 243365 256590 301537 248599 276743 294787 234772 244220 280071 318318 268637 231943 164015
12136A64015j00437o6132Q9404O9291O831m4172M8388J33230K4079k6045j22766
$$ 164015 63578 -2554 86850 156141 162972 118800 167188 300418 324497 298452 175686
12125A75686l5066j17869j7779n4360P5974J28762L0369j5300Q7708Q8106O6380
$$ 175686 140620 22751 4972 -49388 26586 155348 185717 170417 258125 346231 412611
12114D12611r3276m7713k2308o7352o7842N1244L805J60181r025p6492J22724
$$ 412611 319335 271622 249314 181962 114120 165364 169169 329350 320325 243833 366557
12103C66557N3636p5717o2644n1645P7761l2046N8561k6767Q4885L8402l7166
$$ 366557 420193 344476 281832 230187 307948 275902 334463 307696 392581 430983 393817
12092C93817k3667J3578m5507J6960j3038k6261O0085J29763Q3747R6338J21633
$$ 393817 370150 383728 338221 355181 342143 315882 375967 505730 589477 685815 807448
12081H07448L0757M4143J55071K34900L02353K73126J83850K47620J47616n4573
$$ 807448 838205 882348 1037419 1272319 1574672 1847798 2031648 2279268 2426884 2372311
12071B372311r9452P66j53805k29936k12378r0967j57853j38849o4023Q503K6030
$$ 2372311 2272859 2273625 2119820 1889884 1677506 1586539 1428686 1289837 1225814 1234317 1260347
12060A260347J0175K3755O1312j034K2847J9502M3602M5095J41520K19622J46701
$$ 1260347 1270522 1294277 1355589 1354555 1377402 1396904 1440506 1485601 1627121 1846743 1993444
12049A993444J00550R2556O7534J77358J30369J20835J90757J71818J26843p2684
$$ 1993444 2093994 2186550 2254084 2431442 2561811 2682646 2873403 3045221 3172064 3099380
12039C099380j8783o0473j23161o0847l5344j22511l00051l3475j46067k34669
$$ 3099380 3080597 3020124 2896963 2836116 2800772 2678261 2378210 2344735 2198668 1963999
12029A963999k50590j13662L5119k0425p9435q4802o4292P454m7524j05736Q006
$$ 1963999 1713409 1599747 1634866 1614441 1535006 1450204 1385912 1393366 1345842 1240106 1248112
12018A248112O2037N3983K9602j01962j13130J2210J13044J60907K27224J68157
$$ 1248112 1310149 1364132 1393734 1291772 1178642 1190852 1303896 1464803 1692027 1860184
12008A860184K10206L45962K49437J556q4588n6862m4162k43210k99552l32510
$$ 1860184 2070390 2416352 2665789 2667345 2582757 2525895 2481733 2238523 1938971 1606461
11998A606461k44860k29346j49221j54381l6349j18801k16591j48677p8990k5927
$$ 1606461 1361601 1132255 983034 828653 792304 673503 456912 308235 229245 203318
11988B03318N0304N702O2151N9739K755j2840j7463q5634P2582L8600M8220l1575
$$ 203318 253622 259324 321475 381214 383969 371129 353666 268032 340614 379214 427434 395859
11976C95859J5956M8290k5542p0478J7614J13100K9962q4156L0315j3521K8350
$$ 395859 411815 460105 434563 364085 381699 494799 524761 440605 470920 457399 485749
11965D85749R285o7721j22115p7044o6871M2802R1042L4663J959m8428k8128O7601
$$ 485749 495034 427313 305198 228154 161283 204085 295127 329790 331749 283321 255193 322794
11953C22794R137J03397M9410n5974j44989J09992k4755l4843L0911N4179R3727
$$ 322794 331931 435328 484738 428764 283775 393767 369012 334169 365080 419259 512986
11942E12986Q9606j10492k9632L9355l7420k4459O5815l6559k7174j2564M4726
$$ 512986 602592 492100 462468 501823 464403 439944 505759 469200 442026 429462 474188
11931D74188n0270m5321O701j6180q0509K1005J2898p9469M2109R7448R9896m9794
$$ 474188 423918 378597 385298 369118 288609 309614 322512 243043 285152 382600 482496 432702
11919D32702p7205P3667K04693J55153J37206P6724O6608N0967J3381j22909o5936
$$ 432702 355497 429164 633857 789010 926216 1002940 1069548 1120515 1133896 1010987 945051
11908I45051N6657J9171n0192o3866P2771J24839K8728L3476r5643l8224L3043
$$ 945051 1001708 1020879 970687 906821 979592 1104431 1133159 1166635 1070992 1032768 1065811
11897A065811K315q4962J1759R832k7301r2539j06728l8355O8713P8764N1851
$$ 1065811 1068126 983164 994923 1004755 977454 884915 778187 739832 808545 887309 939160
11886I39160K6874p9935l4868K8868l7274J8346j8775n0600R8727K2262m6201
$$ 939160 966034 886099 851231 880099 842825 861171 842396 791796 890523 912785 866584
11875H66584k874j9913N175P0697K8047l7554M9016N4752m0214k3972J5211R9526
$$ 866584 863710 843797 848972 919669 947716 910162 959178 1013930 973716 949744 964955 1064481
11863A064481K0065q8629k2651M7713L0527j4285n011L6743j10402M647M8492
$$ 1064481 1084546 995917 973266 1020979 1051506 1037221 1032210 1068953 958551 963198 1011690
11852A011690m4116j46614m4491R3416J18644o3507j47476m1493M3311k538j3146
$$ 1011690 967574 820960 776469 869885 988529 925022 777546 736053 779364 776826 763680
11841G63680k0892o8264q5406P8892J81750J4332R6635j6672m0855l6831J3519
$$ 763680 742788 674524 589118 668010 849760 864092 960727 944055 903200 866369 879888
11830H79888M8515r3006k3481K4570M8609R0443P4476p6557j45549L6797K7017
$$ 879888 928403 835397 811916 836486 885095 975538 1050014 973457 827908 864705 891722
11819H91722l2560K7292o762o1014K044O2856J07985Q3381j69109J8166J5533
$$ 891722 859162 886454 879692 818678 820722 883578 991563 1074944 905835 924001 939534
11808I39534k3651k8523o874K1856o3754r4325n6954O2937K9533P8378Q4170Q2097
$$ 939534 915883 887360 880486 902342 838588 744263 687309 750246 779779 858157 942327 1024424
11796A024424m6344o0909L0372M8713J6128J04292J8554Q8318L8520j6786P8873
$$ 1024424 978080 917171 947543 996256 1012384 1116676 1135230 1223548 1262068 1245282 1324155
11785A324155J3452j6074O0450J05498L5504p0679L6508J13622r5914K2717J07603
$$ 1324155 1337607 1321533 1381983 1487481 1522985 1452306 1488814 1602436 1506522 1529239 1636842
11774A636842Q4379J05417M2502q5019L0166m5942O9436K176k9980P6285j22530
$$ 1636842 1721221 1826638 1869140 1784121 1814287 1768345 1837781 1839957 1809977 1886262 1763732
11763A763732j72483N2316J5670j17136K528J03299N5832P363q5417m9925L4422
$$ 1763732 1591249 1643565 1659235 1542099 1544627 1647926 1703758 1711121 1625704 1575779 1610201
11752A610201J07088O644M634o1014O1735m302o000P8971P748J6620J3813K9483
$$ 1610201 1717289 1723933 1728567 1667553 1729288 1724986 1718986 1797957 1805705 1822325 1836138 1865621
11740A865621J0979O9122L7661K6618J6269n5161p2419k8995n6658m384j5151
$$ 1865621 1876600 1945722 1983383 2010001 2026270 1971109 1898690 1869695 1813037 1808653 1793502
11729A793502p0417j12593L0827J44033N7108j2049r25L6254J03678J69507P8899
$$ 1793502 1723085 1610492 1641319 1785352 1842460 1830411 1829486 1865740 1969418 2138925 2217824
11718B217824N278k378J14636R1396l1190n5115L5291J05491J55246O2064Q8811
$$ 2217824 2223102 2220724 2335360 2426756 2395566 2340451 2375742 2481233 2636479 2698543 2787354
11707B787354O9604K29359K67301K17221J64154M0102J64618M0802Q0062R9923
$$ 2787354 2856958 3086317 3353618 3570839 3734993 3775095 3939713 3980515 4060577 4160500
11697D160500P5010J01379J53615K24129K14706K02418J62834J12344K20007L48702
$$ 4160500 4235510 4336889 4490504 4714633 4929339 5131757 5294591 5406935 5626942 5975644
11687E975644M33846L14318L73374N17974N96118O19263O71478Q10135Q43599
$$ 5975644 6409490 6723808 7097182 7615156 8211274 8830537 9502015 10312150 11155749
11678A1155749R43715R72391J163700J529075J664457J949843K308745K775429
$$ 11155749 12099464 13071855 14235555 15764630 17429087 19378930 21687675 24463104
11670B4463104L184045L615840M054525M819935N437674O461504P664063R164303
$$ 24463104 27647149 31262989 35317514 40137449 45575123 52036627 59700690 68864993
11662F8864993J1173079J3523533J6284437J9857032K4473763L0603500L8071206
$$ 68864993 80038072 93561605 109846042 129703074 154176837 184780337 222851543
11655B22851543M5414628M9415270M6850598L6432104J9673084R50087j5202986
$$ 222851543 268266171 317681441 364532039 400964143 420637227 421587314 406384328
11648D06384328k6567194l2318233l3287368l1129027k7166509k2365263j7015417
$$ 406384328 379817134 347498901 314211533 283082506 255915997 233550734 216535317
11641B16535317j1748816p020038k923985O2564K222260L508390M676898O259059
$$ 216535317 204786501 197766463 194842478 194905042 197127302 200635692 205312590 211571649
11633B11571649Q491538J1202124J4464128J8458656K2406294K5999985K8102024
$$ 211571649 220063187 231265311 245729439 264188095 286594389 312594374 340696398
11626C40696398K8798687K8137217K6088666K3743818K1909411K0858081J9378833
$$ 340696398 369495085 397632302 423720968 447464786 469374197 490232278 509611111
11619E09611111J5897936R141225o33415j1443618k0348669k5215516k6138558
$$ 509611111 525509047 534650272 534016857 522573239 502224570 477009054 450870496
11612D50870496k4552847k2075844k0015600j8973474j9204342k0050492k0420814
$$ 450870496 426317649 404241805 384226205 365252731 346048389 325997897 305577083
11605C05577083k0025243j8960222j7572905j6189319j4671782j3163593j1542236
$$ 305577083 285551840 266591618 249018713 232829394 218157612 204994019 193451783
11598A93451783r962154p871259n504114k937000l6271L394774P275559J1948266
$$ 193451783 183489629 175618370 170114256 167177256 167140985 170535759 177811318 189759584
11590A89759584J7850566K5371888L4233656M3597459N1385703N5949555N4994328
$$ 189759584 207610150 232982038 267215694 310813153 362198856 418148411 473142739
11583D73142739M5083845K4300322n308855l6897985o1153607p1994843o9883732
$$ 473142739 518226584 542526906 537218051 500320066 439166459 367171616 297287884
11576B97287884o0086683m7731777l6368064k7447153k1032591j6459232j2962128
$$ 297287884 237201201 189469424 153101360 125654207 104621616 88162384 75200256
11569G5200256j0361083q503448p036467n780801m914253m291951l784084l388026
$$ 75200256 64839173 56335725 49299258 43518457 38604204 34312253 30528169 27140143
11561B7140143k983442k630073k273472j952125j597539j205463r85984j040743
$$ 27140143 24156701 21526628 19253156 17301031 15703492 14498029 13512045 12471302
11553A2471302p19816o28621q12676o24380m31510m05579m52696m56758l76620
$$ 12471302 11751486 11122865 10310189 9685809 9254299 8848720 8396024 7939266 7562646
11544G562646l83571l39361k82518l88921l37788k21064j06998r1283k50885j72016
$$ 7562646 7179075 6839714 6557196 6168275 5830487 5609423 5502425 5411142 5160257 4988241
11534D988241r4516j62688l10142j45737q4255p7979k05754j36071p697n7625
$$ 4988241 4893725 4731037 4420895 4275158 4190903 4112924 3907170 3771099 3763402 3705777
11524C705777q7480k6829m9168j6705p621l426L206q9796n5127j83172k10570
$$ 3705777 3618297 3591468 3542300 3525595 3517974 3514548 3517754 3427958 3372831 3189659 2979089
11513B979089j1666j11036l5762J781q5275n53l2835j13864n1190n1218N4843
$$ 2979089 2967423 2856387 2820625 2822406 2737131 2736578 2703743 2589879 2538689 2487471 2542314
11502B542314o2444j31804j11282J04052J30056L2274q914l7051K7736O1889j36820
$$ 2542314 2479870 2348066 2236784 2340836 2470892 2503166 2494252 2457201 2484937 2546826 2410006
11491B410006j3613j41342p3606q1813j29213k8527R6742J18988J6192l5815r113
$$ 2410006 2396393 2255051 2181445 2099632 1970419 1941892 2038634 2157622 2173814 2137999 2128886
11480B128886q277k2108q3547r5156p3648j00609k4749q893J17040J24320P4321
$$ 2128886 2120609 2098501 2014954 1919798 1846150 1745541 1720792 1711899 1828939 1953259 2027580
11469B027580L2285K2963N360O0609r786O4001j1883J8477l6500n046o2265J16531
$$ 2027580 2059865 2082828 2088188 2148797 2139011 2203012 2191129 2209606 2173106 2168060 2105795 2222326
11457B222326J52634l1103k1672p0372r0917j66457j1616o6934r7678j33258j29418
$$ 2222326 2374960 2343857 2322185 2251813 2160896 1994439 1982823 1915889 1818211 1684953 1555535
11446A555535K8187j55890k19879Q84j17800p7239j6950N7792L3883q6931P6774
$$ 1555535 1583722 1427832 1207953 1208837 1091037 1013798 996848 1054640 1088523 1001592 1078366
11435A078366J60377K2820j7408j26349j11847q0368O5894j13620L0438M9685
$$ 1078366 1238743 1261563 1244155 1117806 1005959 925591 991485 877865 908303 957988
11425I57988K3382q7833N9457O4584J388m949n8506P3093K5183r4864k12711k4127
$$ 957988 981370 893537 952994 1017578 1018966 1014017 955511 1028604 1053787 958923 746212 722085
11413G22085L4309r6438R450J22414N7832J5768j9522j01618j9153l6714k8236
$$ 722085 756394 659956 669406 791820 849652 865420 845898 744280 725127 688413 660177
11402F60177M5407k2893m6025P6080O5072l2408J1132o5034o7101M6599j10389
$$ 660177 705584 682691 636666 712746 777818 745410 756542 691508 624407 671006 560617
11391E60617J1923M4694K03996J36619j8766j08543q7989l6472q9212j23313j62722
$$ 560617 572540 617234 821230 957849 939083 830540 742551 706079 616867 493554 330832
11380C30832n1672N2116Q4472L57P3555J59323m7434k1679j8954k7924J072R068
$$ 330832 279160 331276 415748 416105 489660 648983 601549 579870 560916 532992 534064 543132
11368E43132j0845R177o077k361J7805O2163J1823j42710j32123K1614L7362J9788
$$ 543132 532287 541464 535387 533026 550831 612994 624817 482107 349984 371598 408960 428748
11356D28748k6230m9292M7678N1419O2526p2077j9730j8774j36418j48934J2302
$$ 428748 402518 353226 400904 452323 514849 442772 423042 404268 267850 118916 131218
11345A31218L3455O5550R1315J7115q719m0301J0248k0001j875N9511j46920j19996
$$ 131218 164673 230223 321538 338653 329934 289633 299881 279880 278005 337516 190596 70600
11333G0600n5481J4614P7604P755l7150m0034J751Q060o5579r2790n8388m650
$$ 70600 15119 29733 107337 115092 77942 37908 39659 47719 -17860 -110650 -169038 -173688
11321a73688o2096k4408M6922K07138J77385r7777K5499O6128M8777m8087m0196
$$ -173688 -235784 -260192 -213270 -6132 171253 73476 98975 165103 213880 165793 125597
11310A25597L1166J0034q3694O560K2593J0008m7410K8219L8119k7799R5885o7184
$$ 125597 156763 166797 83103 89663 112256 122264 74854 103073 141192 113393 209278 142094
11298A42094j14662r640L1308J749j2129q4464k3159P7J36231K0390j7678Q750
$$ 142094 27432 17792 49100 50849 38720 -45744 -68903 -68826 67405 87795 70117 78867
11286G8867k0080N2349J09804L2483K5211O7297L5099r634l821m5074r280K5446
$$ 78867 58787 111136 220940 253423 278634 345931 381030 371396 367575 322501 313221 338667
11274C38667K8621J583N0126K7414m4605m3685k3263l4838M663k4753r3865j427
$$ 338667 367288 368871 418997 446411 401806 358121 334858 300020 304683 279930 186065 184638
11262A84638Q5722l136j37816m9034J61597K0661o0104K7613P1919J8949l1623
$$ 184638 270360 267224 129408 80374 241971 262632 202528 230141 302060 321009 289386
11251B89386K2376M561N6672K14408J77602Q6015o9679n0525J03417p6612o2211
$$ 289386 311762 316323 372995 587403 765005 851020 781341 730816 834233 757621 695410
11240F95410k2841J2434n9192L857K3797O3904j7949P0880K50036J25691L6486
$$ 695410 672569 685003 625811 629668 653465 717369 699420 770300 1020336 1146027 1182513
11229A182513J61754K06404J21723J63750J46011J77875J58808Q4541O3842k3434
$$ 1182513 1344267 1550671 1672394 1836144 1982155 2160030 2318838 2403379 2467221 2443787
11219B443787j16267k93197k02879j88852j15105M8679r6496j22944n4766o4956
$$ 2443787 2327520 2034323 1831444 1642592 1527487 1576166 1479670 1356726 1301960 1237004
11209A237004k9701O710Q0468J17912M130K1047R6321K08909P1676L9031N5686
$$ 1237004 1207303 1214013 1294481 1412393 1416523 1437570 1533891 1742800 1814476 1853507 1909193
11198A909193P6803J71848J60211J78218j6539l418J18151K57564J46946J58235
$$ 1909193 1985996 2157844 2318055 2496273 2479734 2476316 2594467 2852031 2998977 3157212
11188C157212Q513l6260j47580k33462j86749j57689r8125j42682j22118j35429
$$ 3157212 3165725 3129465 2981885 2748423 2561674 2403985 2305860 2163178 2041060 1905631
11178A905631o0430j36225j37412j5798r6621m2773j99984j63819j2690M5476
$$ 1905631 1845201 1708976 1571564 1555766 1459145 1416372 1216388 1052569 1039879 1085355
11168A085355N620j03619M9933J13013j2189Q1732Q3806j2654R6883K65427K56620
$$ 1085355 1090975 987356 1037289 1150302 1138113 1219845 1303651 1290997 1387880 1653307 1909927
11157A909927J53139K78636K93684K12972Q1737O9788p6479l66066m17759l24252
$$ 1909927 2063066 2341702 2635386 2848358 2930095 2999883 2923404 2557338 2139579 1815327
11147A815327k05585k44693l44798k13864j2029q9125j05277p6502n8610N2622
$$ 1815327 1609742 1365049 1020251 806387 794358 705233 599956 523454 464844 517466
11137E17466j4452o4027K7108q4253j45444n1262K4072l5921P278L0628J05765
$$ 517466 503014 438987 466095 381842 236398 185136 209208 173287 180565 211193 316958
11126C16958K8108m3331l5392q514q8548K1749M2756M9840n7231j13120L7432
$$ 316958 345066 301735 266343 257829 169281 191030 233786 283626 226395 113275 150707
11115A50707M5744r656K0928R1199Q2945Q9506M7757K057j06579O0882n8231r952
$$ 150707 196451 186795 207723 298922 381867 471373 519130 521187 414608 475490 417259 407307
11103D07307m3280k3366Q3043K8058l3948r5973j58535j40793m5630N7044N9325
$$ 407307 364027 340661 423704 451762 417814 321841 163306 22513 -23117 33927 93252
11092I3252n095j1969r5294k9432J7051j430p0073K3220J51073J31043L2497j04836
$$ 93252 88157 76188 -19106 -48538 -31487 -32917 -102990 -79770 71303 202346 234843 130007
11080A30007p7385p4596n7172O9471m0242L9290Q3841J57515j4654r7701J1457
$$ 130007 52622 -21974 -79146 -9675 -49917 -10627 73214 230729 216075 118374 129831
11069A29831L772l9506L4045P1478r6881l0452O2450j3424q3230j2758N303r67
$$ 129831 133603 94097 128142 199620 102739 72287 134737 121313 38083 25325 30628 29661
11057B9661J2045O5050L8139o0603m2697J8539j1112r7718j08779K0082O6679
$$ 29661 41706 106756 144895 84292 41595 60134 49022 -48696 -157475 -137393 -70714
11046g0714J03881N8659l0636j02720N6476J03237o0857j416k2765p227L4856
$$ -70714 33167 91826 61190 -41530 14946 118183 57326 55910 33145 25918 60774
11035F0774M3935o9768J07848m3086n3945M7080K6077M6850o3456l4541j910j10718
$$ 60774 104709 34941 142789 99703 45758 92838 118915 165765 102309 67768 65858 -44860
11023d4860m0905P5551R3068M701J0987J2401j268L2984J3662p0097J2922Q2290
$$ -44860 -85765 -10214 82854 87555 98542 110943 109675 142659 156321 86224 99146 181436
11011A81436j7823o3581l061M738n8294l6569M8060J6182Q2700k6307m0722q6487
$$ 181436 163613 100032 96971 101709 43415 6846 54906 71088 153788 127481 86759 272
10999B72r6437k1131o693M570K5955J75338J18630O7225j87439l1588j7940K8994
$$ 272 -96165 -117296 -123989 -119419 -93464 81874 200504 267729 80290 48702 30762 59756
10987E9756J16936p6220n2983N7384k8770M822P7689N4716j7453l5033J3422k7072
$$ 59756 176692 100472 47489 104873 76103 80925 158614 213330 195877 160844 174266 147194
10975A47194l6459Q9500k7373r8301R033j45678J29950P4353o4925J3530o0783
$$ 147194 110735 200235 172862 74561 83594 -62084 67866 142219 77294 90824 30041
10964C0041m3429j4675K8474N2592M9925J7360j06185l0242j056J00070N6146
$$ 30041 -13388 -28063 411 53003 102928 120288 14103 -16139 -17195 82875 139021
10953A39021P8564J3167n0255K5724m4792j22907l9591L8611k341K1693p8171
$$ 139021 217585 230752 180497 206221 161429 38522 -1069 37542 35201 56894 -21277
10942b1277r2208j3297O7656J30519J01607Q4167r2948k1758o6896k7315j2776
$$ -21277 -113485 -126782 -59126 71393 173000 257167 164219 142461 75565 48250 35474
10931C5474J7111N1760J4268q9414q992J13769J13181o9199q0781O3159q0119
$$ 35474 52585 104345 118613 29199 20207 133976 247157 177958 97177 160336 80217
10920H0217j39239j9856N0144Q2433K2089n1671K3189M274k5112n7627J1050P6496
$$ 80217 -59022 -78878 -28734 53699 75788 24117 47306 51580 26468 -31159 -20109 56387
10908E6387J0829p1007J233Q7428Q288K7925k9836J9694m7602j6667M0674j1407
$$ 56387 67216 -3791 -2558 84870 93158 121083 91247 110941 63339 46672 87346 75939
10896G5939m1449n5942j12952Q8551J18830N7521P0943o121m6850M2698n0549
$$ 75939 34490 -21452 -134404 -45853 72977 130498 201441 195320 148470 191168 140619
10885A40619j33593n0699O8730O3754L2687j06520J02408P6377o2048j49691O1710
$$ 140619 7026 -43673 25057 88811 121498 14978 117386 193763 131715 -17976 43734
10874D3734R7192n580o7774l1846J3750R8972r741o1205j14939n5215J33034K9642
$$ 43734 140926 135346 67572 35726 49476 148448 138707 77502 -37437 -92652 40382 70024
10862G0024j6250Q3415j22870l0691J0029M6014L5632k9281n782O687p7933K1684
$$ 70024 53774 137189 14319 -16372 -6343 39671 75303 46022 40240 46927 -31006 -9322
10850i322Q3760N4921k3897p2742q2173n9162K5018N0406R4738o4370l1894n9086
$$ -9322 74438 129359 105462 32720 -49453 -108615 -83597 -33191 61547 -2823 -34717 -93803
10838i3803P0262N9794K4790L752J5476o970P4379n258n9752o0529k0256p5806
$$ -93803 -23541 36253 61043 64795 80271 73301 147680 142422 82670 22141 1885 -73921
10826g3921n8272O1354N6605N9343n8208L7032L5974k6243m2345r5629l5437q820
$$ -73921 -132193 -70839 -14234 45109 -13099 23933 59907 33664 -8681 -104310 -139747 -148567
10814a48567m2596J7317Q4674P8384O1463R2992o0541o3499Q1206O3891j19697
$$ -148567 -191163 -173846 -89172 -10788 50675 143667 83126 19627 100833 164724 45027
10803D5027j727p1497n2981M0736L2900j5602j52553j3261l550L7556R0988L2753
$$ 45027 43300 -28197 -81178 -40442 -7542 -23144 -175697 -188958 -192508 -154952 -63964 -31211
10791c1211j3647M6070J055J4271k0244l4245k0753J44334K17700J06830r9674
$$ -31211 -44858 1212 2267 16538 -3706 -37951 -58704 85630 303330 410160 310486
10780C10486j02303m1188j056q5098n7815O14j6295O7126P4296L4081j1089N8423
$$ 310486 208183 166995 165939 80841 23026 23640 7345 74471 148767 182848 171759 230182
10768B30182M2634l1822j3431j13163r8378j8593P5448J18809R0258m7884J6213
$$ 230182 272816 240994 227563 114400 16022 -2571 72877 191686 281944 234060 250273
10757B50273N3882K9264q6645o9217K0050k2956o7549M3199O5318N5248N3046
$$ 250273 304155 333419 246774 177557 197607 174651 107102 150301 215619 270867 323913
10746C23913K5455j23343j2751l4393o316K4910K26m7598Q2233K0162p2168n3494
$$ 323913 349368 226025 213274 178881 172565 197475 197701 150103 232336 252498 180330 126836
10734A26836J3766o787J7935K4536r9086r9037J51931L0450M6513M4869O3238
$$ 126836 140602 133815 151750 176286 77200 -21837 130094 160544 207057 251926 315164
10723C15164N5738j14952p011K4310m538M4157k2154m8920r1082q858J7671j67543
$$ 315164 370902 255950 248939 273249 268711 312868 290714 241794 150712 141854 159525 -8018
10711h018k5124K4444J01322J50027R3403N3461k2575j31869m0692l5697K8321
$$ -8018 -33142 -8698 92624 242651 336054 389515 366940 235071 194379 158682 187003
10700A87003r3565q3737J8426P4521O8048L2115Q9045p8673k1472R3686K8423
$$ 187003 93438 9701 28127 102648 170696 202811 291856 213183 191711 285397 313820
10689C13820j2472j03688m6664m4629L0528L2532j00730n7162J30662J10326j56073
$$ 313820 301348 197660 150996 106367 136895 169427 68697 11535 142197 252523 96450
10678I6450n228L2432J8954k0856q9079j10302L8195K4679P0276Q8258r3788j58416
$$ 96450 91222 123654 142608 121752 32673 -77629 -39434 -14755 55521 143779 49991 -108425
10666a08425o9571J41195O0280O3916M8561r066R3383n8365m364J09705n3532
$$ -108425 -177996 -36801 23479 87395 135956 126890 220273 161908 157544 267249 213717
10655B13717k00788m7949l251j22243P1339J10463J77217Q6920k7192n8226q163
$$ 213717 12929 -35020 -38271 -160514 -89175 21288 198505 285425 258233 200007 191844
10644A91844m7242K5628N4486P3939m5421j48093N3801l0759J0419J15028l7640
$$ 191844 144602 170230 224716 298655 253234 105141 158942 128183 138602 253630 215990
10633B15990l8972l6452r640J08425N5585q9450k1031J5806j0995Q0356n7943
$$ 215990 177018 140566 130926 239351 294936 205486 184455 200261 189266 269622 211679
10622B11679K7857o9248l1862J13046J887l5085j47980m622O5837m0114j74825
$$ 211679 239536 170288 138426 251472 253359 218274 70294 65672 131509 91395 -83430
10611h3430P8532J53710N3919M4614k6141p0026N4806j9975K1347n0232l6803
$$ -83430 -4898 148812 202731 247345 221204 151178 205984 186009 207356 157124 120321
10600A20321M7235k7727r8188j14175k2175J33574N9339j01882j3260M7668k421
$$ 120321 167556 139829 41641 -72534 -94709 38865 98204 -3678 -16938 30730 28309
10589B8309P198M149R1496R2940O7926q0765j47759J4099N6086K8243Q5519l3486
$$ 28309 35507 39656 131152 224092 292018 211253 63494 77593 133679 161922 247441 213955
10577B13955j36675j05709J08456R8237l5021L7692q1208n2955J05399P8317k2386
$$ 213955 77280 -28429 80027 178264 143243 180935 99727 46772 152171 230488 208102
10566B08102J1356K0530l7567M4951m1451m2405K3082L6506k1229K884N4060n5500
$$ 208102 219458 239988 202421 247372 205921 163516 186598 223104 201875 204759 258819 203319
10554B03319m5218o5193j02410J4527L2164O4460m2201o9590M4784n560o3994
$$ 203319 158101 92908 -9502 5025 37189 101649 59448 -10142 34642 29082 -34912
10543c4912K2173M840L2521J6157n5208r0993L5640L3311J20138L7504n6841J593
$$ -34912 -12739 -7899 24622 40779 -14429 -105422 -69782 -36471 83667 121171 64330 65923
10531F5923Q1485J06533O6447j30833o4814R0286K155P029K6768k1632j50442
$$ 65923 147408 253941 320388 189555 124741 215027 217182 224211 250979 229347 78905
10520G8905l5138J15143O2579q3653j17398p562R3471M6333m8818K0550J25843
$$ 78905 43767 158910 221489 137836 20438 12876 106347 152680 103862 124412 250255
10509B50255l5403q0480j06355K1080j0572q4171l4840M6652L3698K1781K4578
$$ 250255 214852 134372 28017 49097 38525 -45646 -80486 -33834 -136 21645 46223
10498D6223K0089J1642M7392M9387N2935k2434k8081n4421J8408M8568n2455m7704
$$ 46223 66312 77954 125346 174733 227668 205234 177153 122732 141140 189708 137253 89549
10486H9549L6609r3050l6506j0641K5292k6931M8889M8840J5673n4579M7448K1695
$$ 89549 126158 33108 -3398 -14039 11253 -15678 33211 82051 97724 43145 90593 112288
10474A12288l0658j002O2168M8944j38095m6565Q880p404M9218o2805p5218l0110
$$ 112288 81630 80628 142796 191740 53645 7080 15960 8556 57774 -5031 -80249 -110359
10462a10359O1053Q4198J13609K8646o8081l0202L9211J9486O4484O7228n7499
$$ -110359 -49306 34892 148501 177147 109066 78864 118075 137561 202045 269273 211774
10451B11774j75466o2832P3165o8475m8476n5326R2042J73316R2192p7019j02327
$$ 211774 36308 -26524 46641 -21834 -70310 -125636 -33594 139722 231914 154895 52568
10440E2568M9329k8912p1507j5638J26787j6445k0597n7995K3762P4048K2522
$$ 52568 101897 72985 1478 -14160 112627 96182 75585 17590 41352 115400 137922
10429A37922O9512L4048j3433o3585l909n9762j8073J00969r8522m9719n9052
$$ 137922 207434 241482 228049 164464 160555 100793 82720 183689 85167 35448 -23604
10418b3604P2804R0439O0222j35311J3923P9914k8796p2152M5150J5637N2312
$$ -23604 49200 139639 199861 64550 78473 158387 129591 57439 102589 118226 170538
10407A70538M9691N2137j15969L7466M0575l0336R791j04901n5186J08948P1459
$$ 170538 220229 272366 156397 193863 234438 204102 213893 108992 53806 162754 234213
10396B34213k605k9255J9781l0698j56308j36446L5161J4090M7948J14704Q2345
$$ 234213 231608 202353 222134 191436 35128 -101318 -66157 -52067 -4119 110585 192930
10385A92930l326n0666j69913P1718O982j00499J96151P0212q2957n2451M6124
$$ 192930 189604 138938 -30975 40743 47725 -52774 143377 213589 130632 78181 124305
10374A24305L1496K2710q6253J8112R9444M5319J3978N9547j8968p2522P1981
$$ 124305 155801 178511 92258 110370 209814 255133 269111 328658 309690 237168 309149
10363C09149k4155j41736o0851J65610Q4406K1605R2694J5285K0164l8226r2675
$$ 309149 284994 143258 82407 248017 332423 354028 446722 462007 482171 443945 351270
10352C51270k7244Q0692K5959r36K7814k1638j15779j1573Q4664k1217L3442m8774
$$ 351270 324026 404718 430677 429741 457555 435917 320138 308565 393229 372012 405454 356680
10340C56680j23298L2206j3167K0595j37885L1654Q3965p0802n4457k8925L2766
$$ 356680 233382 265588 252421 273016 135131 166785 250750 179948 125491 96566 129332
10329A29332l38N6205O3450P884M0248j43492j40831N5294j5229J25534J59593
$$ 129332 128994 185199 248649 256533 296781 153289 12458 67752 52523 178057 337650
10318C37650M9321p9971J03937Q954M0439j4958p3850q8439Q5789P8371o5840
$$ 337650 386971 307000 410937 419891 460330 445372 371522 283083 368872 447243 381403
10307C81403J5358J7513p5461j26956P8501O1983r6225q5895J6357Q3873R7385
$$ 381403 396761 414274 338813 211857 290358 352341 256116 170221 186578 270451 367836
10296C67836L112M120J1217p1445R0129R4826l1024J2968k7287j19219O0897K738
$$ 367836 370948 375068 386285 314840 404969 499795 468771 481739 454452 335233 396130 398868
10284C98868J4674M5531K1632Q211N9270K5329n96J44489J011l8892o9120M6976
$$ 398868 413542 459073 480705 488916 548186 573515 572919 717408 718419 679527 610407 657383
10272F57383K1523j45316K7417J65398M0817j59704r3074P4947p598o5217j492
$$ 657383 678906 533590 561007 726405 767222 607518 514444 589391 581793 516576 515084
10261E15084M4040Q7382P6468P723j08443j12492p2543M7616N3786m739n115L2988
$$ 515084 559124 646506 722974 730697 622254 509762 437219 484835 538621 533882 528767 561755
10249E61755j5651p0526m6586K4715Q2099K6049r911k5122J17708K983Q529q9999
$$ 561755 546104 475578 428992 453707 535806 561855 551944 526822 644530 647513 656042 566043
10237E66043L837J08935m2593o8378j28491m134P1461O7938m7797k5024N4236
$$ 566043 569880 678815 636222 567844 439353 435219 506680 574618 526821 501797 556033
10226E56033k3807l3868J07081K0238p1872k14940p0977O8944J29507j5062o6759
$$ 556033 532226 498358 605439 625677 553805 338865 267888 336832 466339 451277 384518
10215C84518J17587r198p3284j22418N6349L0778J0190P8419O4542M0437J28426
$$ 384518 502105 492907 419623 297205 353554 384332 394522 472941 537483 577920 706346
10204G06346r927o6219K2363L5563r6283m7458n6344L9410J11168k7739r4680
$$ 706346 696419 630200 652563 688126 591843 544385 488041 527451 638619 610880 516200
10193E16200o4327o0567P0091J58540J06630k3999q7130p2247n0013P2765o4047
$$ 516200 451873 391306 461397 619937 726567 702568 615438 543191 493178 565943 501896
10182E01896p5295j00646o0813J11692K4912M0424j06741o6447N8115J11034j3825
$$ 501896 426601 325955 265142 376834 401746 442170 335429 268982 327097 438131 424306
10171D24306Q4126m8139j12304r4579j1063M1763J11261O9283q98K8216L0250
$$ 424306 508432 460293 347989 253410 242347 284110 395371 464654 463756 491972 522222
10160E22222o1822l7318p2952j11231M04p707K113J21510J5453J17273p2991j27618
$$ 522222 460400 423082 350130 238899 239303 231596 233709 355219 370672 487945 414954 287336
10148B87336l5666J8848R298r2723q877J9457K9708P7942Q5367K6307P3097k6898
$$ 287336 251670 270518 279816 187093 178216 197673 227381 305323 390690 416997 490094 463196
10136D63196m4739k6575n4040J8362j3194N6788O6348n6202j21906O9717R9857
$$ 463196 418457 391882 337842 356204 343010 399798 466146 409944 288038 357755 457612
10125D57612Q326o7408m1877n2521j19793J1331J19405N7824J7671j4481l1366
$$ 457612 465938 398530 356653 304132 184339 195670 315075 372899 390570 376089 344723
10114C44723m860p5077k2508k6904O9359J6898j6478K6211O6998K9719k5308k7037
$$ 344723 339863 264786 242278 215374 284733 301631 285153 311364 378362 408081 382773 355736
10102C55736Q4209J09385l9504N3562J3882q7414m1909L4840r311l2386J7787
$$ 355736 439945 549330 509826 563388 577270 489856 447947 482787 473476 441090 458877
10091D58877l2779J01199P7843l9271p5603p0414l1270o5279q0125M6407R3919
$$ 458877 426098 527297 605140 565869 490266 419852 388582 323303 243178 289585 383504
10080C83504M0203N1525m7288M227p7247j1490L4388J18371Q9739n2566j24416
$$ 383504 423707 475232 427944 432171 354924 343434 377822 496193 585932 533366 408950
10069D08950m9325J02913k7463R5742M2136j07096p7811L5100O6905l8056j5180
$$ 408950 359625 462538 435075 530817 572953 465857 388046 423146 490051 451995 436815
10058D36815J02706q3118j3751n0502n4625Q1753J41636J07383o4945j19882j08518
$$ 436815 539521 456403 442652 392150 337525 419278 560914 668297 603352 483470 374952
10047C74952K1781L6282o6025j13350R9956O9922N9572k0358j12737L8219O9636
$$ 374952 396733 433015 366990 253640 353596 423518 483090 462732 349995 388214 457850
10036D57850J5455l8514j9119m5602j2311l5889P0186N4743j3399n9382n4992
$$ 457850 473305 434791 415672 370070 357759 321870 392056 446799 433400 374018 319026
10025C19026k1040j23854j68815l5398J43464J05263n0360N4460J04838p944K6985
$$ 319026 297986 174132 5317 -30081 113383 218646 168286 222746 327584 319640 346625
10014C46625P2267o5296r5725n5466M647Q3658p550K528R8472r016k8271j4000
$$ 346625 418892 353596 257871 202405 207052 290710 283160 285688 384160 375144 346873 332873
10002C32873P0855k9871q0851j03443K6129P1832J13786N3986l4968p0131K5599
$$ 332873 403728 373857 293006 189563 215692 287524 401310 455296 420328 350197 375796
9991C75796K0036j02713p6879J9320J1297O8808R4260o9698l1833p3076K9756
$$ 375796 395832 293119 216240 235560 246857 315665 409925 340227 308394 235318 265074
9980B65074J50490P6089J3497l5473n3334m0484p0974o3607L8506j36176o5740
$$ 265074 415564 491653 505150 469677 416343 375859 304885 241278 279784 143608 77868
9969G7868J34652K4042p3398j0679M3337j5451n3241L9557J62905L4809j13805
$$ 77868 212520 236562 163164 152485 195822 180371 127130 166687 329592 364401 250596
9958B50596J676k640R5246N8261l0639N5298O6325j00457j10636L8374O4878K5729
$$ 250596 252272 249632 344878 403139 372500 427798 494123 393666 283030 321404 386282 412011
9946D12011M8669K5455J4053j28248k3828o3910k2789N058n9234N2688L2864L6
$$ 412011 460680 486135 500188 371940 348112 284202 261413 266471 207237 259925 292789 292825
9934B92825N3645o6209M2508M4887o8887j3052n5875q96L6898k9535M7879m989
$$ 292825 346470 280261 322769 367656 298769 285717 229842 228946 265844 236309 284188 279199
9922B79199K2723L9054j7811K5021J1449n6352L17J28911M7715m775L781j37729
$$ 279199 301922 340976 323165 348186 359635 303283 303600 432511 480226 475451 479232 341503
9910C41503m0185N168M3291R1246j01974J0118J059p1365J9726O4552N8750K0334
$$ 341503 301318 306486 349777 441023 339049 349167 350226 278861 298587 363139 421889 442223
9898D42223M1281N2051j60976r1858P6902L6528J48704N07r2096j0567k3434j9666
$$ 442223 483504 535555 374579 282721 359623 396151 544855 545362 453266 442699 419265 399599
9886C99599O5213o968p3802R112N2193l273o5804r3282o0024P7990K4926o3342
$$ 399599 464812 457844 384042 393154 445347 442074 376270 282988 222964 300954 325880 262538
9874B62538P3260J67226j8232r723K9362l0658l6439l6212L009R814m0847j33823
$$ 262538 335798 503024 484792 475069 504431 473773 437334 401122 404131 413945 373098 239275
9862B39275n2848O8730N1303l965j75m3560k5378L333J11440L1058J1250N5943
$$ 239275 186427 255157 306460 302495 302320 258760 233382 236715 348155 379213 390463 446406
9850D46406l5655m3961R5948L1869N7981o4948n2723k1806L8199j7170r0595p0312
$$ 446406 410751 366790 462738 494607 552588 487640 434917 413111 451310 434140 343545 273233
9838B73233R1920p081n6313K3330J2289k2489O0251O6904k8986o564j6322P4204
$$ 273233 365153 358072 301759 325089 337378 314889 375140 442044 413058 406494 390172 464376
9826D64376j3950L0512L7923k373R3110K0968j59849m4267l1371l8075P7527J8002
$$ 464376 450426 480938 518861 516488 609598 630566 470717 426450 395079 357004 434531 452533
9814D52533K6675Q1224r2469j1597k3598n0922N3629O5679j7157J57587O9576
$$ 452533 479208 560432 467963 456366 432768 381846 435475 501154 483997 641584 711160
9803G11160j64468j06248J40405J28238J03654J6766j0119K9850q3292q1301J7892
$$ 711160 546692 440444 580849 709087 812741 829507 819388 849238 765946 684645 702537
9792G02537J82292J42315p480P7810J22753N0873J9115j09872j27467j01800J6125
$$ 702537 884829 1027144 1019664 1097474 1220227 1271100 1290215 1180343 1052876 951076 967201
9781I67201k9380p6626k7476M4336Q6168j24109R767m7777N7694r3953n3373R6230
$$ 967201 937821 861195 833719 878055 964223 840114 849881 802104 859798 765845 712472 808702
9769H08702J6281K6138Q6527K0742R7017P5718j0425O3887J79799J65559l8542
$$ 808702 824983 851121 937648 958390 1055407 1131125 1120700 1184587 1364386 1529945 1491403
9758A491403L4214O2738O4451k1253M4016N1449N6231j8698R302q3659o7546p5705
$$ 1491403 1525617 1588355 1652806 1631553 1675569 1727018 1783249 1764551 1773853 1690194 1622648 1546943
9746A546943K7702P9424R203N4289j8249q7345m1167J8090l7550k4982N9184j18958
$$ 1546943 1574645 1654069 1663272 1717561 1699312 1611967 1570800 1588890 1551340 1526358 1585542 1466584
9734A466584r1965O2130K2389K407L7117K7317k6331P6193N1758k0711l814k1842
$$ 1466584 1374619 1436749 1459138 1461545 1498662 1525979 1499648 1575841 1627599 1606888 1603074 1581232
9722A581232J42808L01351K43491K43554R2396L1860P4156L5261o7995j22996
$$ 1581232 1724040 2025391 2268882 2512436 2604832 2636692 2710848 2746109 2678114 2555118
9712B555118j60641j44010j16230l0908n4277j84984j35543k7339o4044j825J5525
$$ 2555118 2394477 2250467 2134237 2103329 2049052 1864068 1728525 1701186 1637142 1635317 1650842
9701A650842m1213o6270N0909J94125L0479j35353k1079J06140M2436j7943p189
$$ 1650842 1609629 1543359 1594268 1788393 1818872 1683519 1662440 1768580 1811016 1793073 1785884
9690A785884l4814l9821n5069J9706j7396N8653J45479K6748P4257O8745J9675
$$ 1785884 1751070 1711249 1656180 1675886 1658490 1717143 1862622 1889370 1963627 2032372 2052047
9679B052047N4857M0614K3610m4815m0405j4096j13232j89927j01006j07442K4454
$$ 2052047 2106904 2147518 2171128 2126313 2085908 2071812 1958580 1768653 1667647 1560205 1584659
9668A584659K334m1912j5019k194k7343r3540p4894j5587m1350l2375J06369R1275
$$ 1584659 1586993 1545081 1530062 1527868 1500525 1406985 1332091 1316504 1275154 1242779 1349148 1440423
9656A440423L7347J1333j13896m7682J19412P3973J65450P4435k0910P012M5749
$$ 1440423 1477770 1489103 1375207 1327525 1446937 1520910 1686360 1760795 1739885 1746897 1792646
9645A792646L8960L9360N8083P5956J0095r9663L4899l0681r7434r1319p4902
$$ 1792646 1831606 1870966 1929049 2005005 2015100 1915437 1950336 1919655 1822221 1730902 1656000
9634A656000k8941J18994J85831J88805J67038Q4545J2843j8302r6607j01858
$$ 1656000 1627059 1746053 1931884 2120689 2287727 2372272 2385115 2366813 2270206 2168348
9624B168348j12161j38357j36859J2336J16049J35756l0771O0212Q3428J18484
$$ 2168348 2056187 1917830 1780971 1793307 1909356 2045112 2014341 2074553 2157981 2276465
9614B276465l068p8005r9877K6458N9649R0274J95055J10106J74533O0390m1610
$$ 2276465 2273397 2195392 2095515 2121973 2181622 2271896 2466951 2577057 2751590 2811980 2770370
9603B770370p9093J03719K10622L62615L46682M37914M91951M18149J16310M3717
$$ 2770370 2691277 2794996 3005618 3368233 3714915 4152829 4644780 5062929 5179239 5222956
9593E222956L0291J18412K08954M01439O88652J236221J774621K126829J785104
$$ 5222956 5253247 5371659 5580613 5982052 6670704 7906925 9681546 11808375 13593479
9584A3593479Q07444m62184j050093r99197q34603p37748p87772q50387o29290
$$ 13593479 14400923 13938739 12888646 11889449 11054846 10317098 9529326 8678939 8049649
9575H049649l01679J32937M51075P93560J048822J288878J275572J303224J395691
$$ 8049649 7747970 7880907 8331982 9125542 10174364 11463242 12738814 14042038 15437729
9566A5437729J174253R33231M95654q8587j19620p1978j68910k58892j76447M1057
$$ 15437729 16611982 17545213 18040867 17952280 17832660 17760682 17591772 17332880 17156433 17197490
9556A7197490K98428K92494J61713J21635K13116L24245Q71578J408321K050832
$$ 17197490 17495918 17788412 17950125 18071760 18284876 18609121 19480699 20889020 22939852
9547B2939852K997216M117762N617495O711126N472100K138410j846941m228609
$$ 22939852 25937068 30054830 35672325 42383451 47855551 49993961 48147020 43918411
9539D3918411m345802l231099j921866q39624K7765N88385J054769J484427J673457
$$ 43918411 39572609 36341510 34419644 33580020 33607785 34196170 35250939 36735366 38408823
9530C8408823J585179J554012J504047J750650J952017K277689K210952K125226
$$ 38408823 39994002 41548014 43052061 44802711 46754728 49032417 51243369 53368595
9522E3368595K113396K028515J577643J040303P08243M95072L09775L63252L44699
$$ 53368595 55481991 57510506 59088149 60128452 60836695 61331767 61641542 62004794 62349493
9513F2349493N51710R09344J318918J796205K101732K396280K763448L048094
$$ 62349493 62901203 63810547 65129465 66925670 69027402 71423682 74187130 77235224
9505G7235224L193275L284720L648690L993036L829835K865962J595880Q34213
$$ 77235224 80428499 83713219 87361909 91354945 95184780 98050742 99646622 100480835
9497A00480835J047459J472677J755787J768703J746446J582536J480060J005035
$$ 100480835 101528294 103000971 104756758 106525461 108271907 109854443 111334503 112339538
9489A12339538M60373k2289n76661j024780j492904j681859k106308k382958k522199
$$ 112339538 112799911 112777622 112200961 111176181 109683277 108001418 105895110 103512152 100989953
9480A00989953k642158k736507k815943k709390k738859k657760k535357k529322
$$ 100989953 98347795 95611288 92795345 90085955 87347096 84689336 82153979 79624657
9472G9624657k517128k341131k184290k034872j878063j913339j770093j567434
$$ 79624657 77107529 74766398 72582108 70547236 68669173 66755834 64985741 63418307
9464F3418307j541791j598416j545255j378637j337414j412117j446154j388439
$$ 63418307 61876516 60278100 58732845 57354208 56016794 54604677 53158523 51770084
9456E1770084j301223j358193j405161j468816j589683j542764j542808j546872
$$ 51770084 50468861 49110668 47705507 46236691 44647008 43104244 41561436 40014564
9448D0014564j510496j406865j460080j402678j316077j226048j204792j187090
$$ 40014564 38504068 37097203 35637123 34234445 32918368 31692320 30487528 29300438
9440B9300438j166602j104040j094218q97855r15288q37398q82922q21735p11767
$$ 29300438 28133836 27029796 25935578 25037723 24122435 23285037 22402115 21580380 20868613
9431B0868613p11412o25522p65593o70340n50351n26376n28886l93713l07260
$$ 20868613 20157201 19531679 18766086 18095746 17545395 17019019 16490133 16096420 15789160
9422A5789160j37640k58142k16505k87772j08051m7765l5266k05184k58334n4095
$$ 15789160 15651520 15393378 15176873 14889101 14781050 14733285 14698019 14492835 14234501 14180406
9412A4180406J31152J60576J02242L17546N14256O71974Q45752J131550J489357
$$ 14180406 14311558 14472134 14574376 14891922 15406178 16078152 16923904 18055454 19544811
9403A9544811J723732K139464K886457L208315L379117L619062M218568M938761
$$ 19544811 21268543 23408007 26294464 29502779 32881896 36500958 40719526 45658287
9395D5658287N856410O702793P094883P257923P116488O242399M216863J412834
$$ 45658287 51514697 58217490 65312373 72570296 79686784 85929183 90146046 91558880
9387I1558880j881675m694142o466105o903735o428599n188167l852978k622397
$$ 91558880 89677205 84983063 78516958 71613223 65184624 59996457 56143479 53521082
9379E3521082j425998K4409J413020K815977L609568M193197M561700M824480
$$ 53521082 52095084 52119493 53532513 56348490 59958058 64151255 68712955 73537435
9371G3537435N054440N443524O174599P008253P707814Q446328Q897985R390419
$$ 73537435 78591875 84035399 90209998 97218251 104926065 113372393 122270378 131660797
9363A31660797R530452R164434R031553Q998552Q950681Q632777P761323O860555
$$ 131660797 141191249 150355683 159387236 168385788 177336469 185969246 193730569 200591124
9355B00591124N579759L835684K000640n6311k016812l792386m773643m751465
$$ 200591124 206170883 210006567 212007207 211950896 209934084 206141698 201368055 196616590
9347A96616590l805391k397261q72019K85556P67642Q50534J216857J734085J773848
$$ 196616590 192811199 190413938 189541919 189827475 190595117 191445651 192662508 194396593 196170441
9338A96170441J338159R73201Q73743J666586L327590M563718M853490M335494
$$ 196170441 197508600 198481801 199355544 201022130 204349720 208913438 213766928 218102422
9330B18102422L671728L333042M546503O805331J0208630J4546922J8909661K2114705
$$ 218102422 221774150 225107192 229653695 236459026 246667656 261214578 280124239 302238944
9322C02238944K3356662K2604643J9957259J5061514P549268j582047j0804048
$$ 302238944 325595606 348200249 368157508 383219022 390768290 389186243 378382195
9315C78382195j7725719k1128439k1793998k1178521j9909476j7973118j4926146
$$ 378382195 360656476 339528037 317734039 296555518 276646042 258672924 243746778
9308B43746778j0727327o206797j855016K175630N123842O465707O025294L918727
$$ 243746778 233019451 226812654 224957638 227133268 232257110 238722817 244748111 248666838
9300B48666838J140013r12416j727396j228183l00576O43282J425043K480255
$$ 248666838 249806851 248894435 247167039 245938856 245638280 246281562 247706605 250186860
9292B50186860L791751N179748O704576Q137821R114157R073828P761459N553610
$$ 250186860 253978611 259158359 265862935 274000756 283114913 292188741 299950200 305503810
9284C05503810K494865j334348n812774j0596604j4937688j7618445j7458933
$$ 305503810 307998675 306664327 300851553 290254949 275317261 257698816 240239883
9277B40239883j5114027j1605854p472829l606755r29484J54062k0996r49611
$$ 240239883 225125856 213520002 206047173 202440418 201510934 201664996 201644000 200694389
9269B00694389k382892m046113o004264p879808r462974j0570822j0544603r598682
$$ 200694389 198311497 194265384 188261120 180381312 170918338 160347516 149802913 140204231
9261A40204231p846355n492218k896148m59054J651833L626639M854729N295667
$$ 140204231 132357876 126865658 123969510 123510456 125162289 128788928 133643657 138939324
9253A38939324N446865M973104L850856J639103j238917m548417p763670r667790
$$ 138939324 144386189 149359293 153210149 154849252 153610335 149061918 141298248 131630458
9245A31630458r815416q598406p052906n183000l953157l455187l684642m869174
$$ 131630458 121815042 113216636 106163730 100980730 97027573 93572386 89887744 85018570
9237H5018570o149239p158219p377133o845786n877385m797632l884733l160543
$$ 85018570 78869331 71711112 64333979 57488193 51610808 46813176 42928443 39767900
9229C9767900k578070k439702k366727k364079k397775k184296j946508j571715
$$ 39767900 37189830 34750128 32383401 30019322 27621547 25437251 23490743 21919028
9221B1919028j327425j051077r21823p13538p37248q21822q62208o54827m80322
$$ 21919028 20591603 19540526 18618703 17905165 17167917 16346095 15483887 14829060 14348738
9212A4348738k61841o0128J34301M50081P40882J064293J191325J317212J496075
$$ 14348738 14086897 14026769 14161070 14611151 15352033 16416326 17607651 18924863 20420938
9203B0420938J644486J629020J091337M97186k52854n84388l38074J66293P92824
$$ 20420938 22065424 23694444 24785781 25282967 25030113 24445725 24107651 24273944 25066768
9194B5066768J480221J916332K547850L136569L580731M176985M532248M284295
$$ 25066768 26546989 28463321 31011171 34147740 37728471 41905456 46437704 50721999
9186E0721999L719587K702579J558889P76142M43460L88029K15829L09282O25696
$$ 50721999 54441586 57144165 58703054 59479196 59922656 60310685 60526514 60835796 61461492
9177F1461492J043126K118980L492352N086487O712780P641933P318591N687479
$$ 61461492 62504618 64623598 68115950 73202437 79915217 87557150 94875741 100563220
9169A00563220K833227o80570l863070n793072n725418m105870j740397P88373
$$ 100563220 103396447 102715877 98852807 93059735 87334317 83228447 81488050 82276423
9161H2276423K831110M148819M542922L738793J949127l25844k182148l100108
$$ 82276423 85107533 89256352 93799274 97538067 99487194 99161350 96979202 93879094
9153I3879094k844192k202379j321066l18747P39655K046398L811839N666974
$$ 93879094 91034902 88832523 87511457 87192710 87932365 89978763 93790602 99457576
9145I9457576P410345Q835388R940622J0442607J0386140Q742269N947753K306883
$$ 99457576 106867921 115703309 125643931 136086538 146472678 155214947 161162700 163469583
9137A63469583j090833l133582l482422k689804j204585j19825M27446k52249
$$ 163469583 162378750 159245168 155762746 153072942 151868357 151748532 152175978 151923729
9129A51923729j560980k569300l320859m276394n705724o848306p436473p533409
$$ 151923729 150362749 147793449 144472590 140196196 134490472 127642166 120205693 112672284
9121A12672284o613690n165993l019288j202107Q2503Q96262J138274J322696
$$ 112672284 106058594 100892601 97873313 96671206 96753709 97649971 98788245 100110941
9113A00110941K119605L685241N854644Q566142J0705316J1737247J0637032P602906
$$ 100110941 102230546 105915787 111770431 120336573 131041889 142779136 153416168 161019074
9105A61019074L680161l21967l652704n887726o694058o401133n249566l677417
$$ 161019074 164699235 164377268 160724564 154836838 148142780 141741647 136492081 132814664
9097A32814664k422138j827877j895599k260802k783188l348176l910603m300052
$$ 132814664 130392526 128564649 126669050 124408248 121625060 118276884 114366281 110066229
9089A10066229m411845m022068l103477j900057j048108j053564j999157l828314
$$ 110066229 105654384 101632316 98528839 96628782 95580674 94527110 92527953 88699639
9081H8699639n238651n924679n543066m200849k163998j88508J679783K891153
$$ 88699639 83460988 77536309 71993243 67792394 65628396 65439888 67119671 70010824
9073G0010824L295379K891269J712587p4501j881924l156847l544505l056796
$$ 70010824 73306203 76197472 77910059 77835558 75953634 72796787 69252282 66195486
9065F6195486j975756r43895j49663O04281J224238J727339K070629J946963J022788
$$ 66195486 64219730 63275835 63126172 63730453 64954691 66682030 68752659 70699622 71722410
9056G1722410m50657k410123m632727o098002o751647o810112o139414m950708
$$ 71722410 71271753 68861630 64228903 58130901 51379254 44569142 38429728 33479020
9048C3479020l934522l189730k762068k246446j672231r71907l98410K99391J223839
$$ 33479020 29544498 26354768 23592700 21346254 19674023 18702116 18303706 18603097 19826936
9039A9826936K271155K973995L078995J962825j33353k334553l516903l603523
$$ 19826936 22098091 25072086 28151081 30113906 29980553 27646000 24129097 20525574
9031B0525574k754293j497420m28732M38401J507423K157703K329914J576937
$$ 20525574 17771281 16273861 15845129 16283530 17790953 19948656 22278570 23855507
9023B3855507J50767j580895k901870l321915k953297k287789j631118j191268
$$ 23855507 24006274 22425379 19523509 16201594 13248297 10960508 9329390 8138122
9015H138122r88298p74456o33917n30683m45951l16773k13964j55180m7306j31990
$$ 8138122 7149824 6375368 5741451 5210768 4764817 4448044 4234080 4078900 4031594 3899604
9005C899604j49097J6492n8373j06000j54442j04772o0547j82782k25658j38466
$$ 3899604 3750507 3766999 3708626 3602626 3448184 3343412 3282865 3100083 2874425 2735959
8995B735959L834j5455K3592M1746M2989M8970k6536r4013j58832J43559J54191
$$ 2735959 2739793 2724338 2747930 2789676 2832665 2881635 2855099 2761086 2602254 2745813 2900004
8984B900004O7875m5564n9529m2043J27234J14120N7920j4203O9843k4756J5861
$$ 2900004 2967879 2922315 2862786 2820743 2947977 3062097 3120017 3105814 3175657 3150901 3166762
8973C166762r4639j57502p9193j7974M5218M2919n7349q1167R526K7932m5372
$$ 3166762 3072123 2914621 2835428 2817454 2862672 2905591 2848242 2767075 2776601 2804533 2759161
8962B759161l8212k2893M4056P7126J57227J28818J3691k0382J6231J0850k5065
$$ 2759161 2720949 2698056 2742112 2819238 2976465 3105283 3118974 3098592 3114823 3125673 3100608
8951C100608J5407J42791r317Q7789J070N351M3780p4354J7874M7150k8638m822
$$ 3100608 3116015 3258806 3249489 3337278 3338348 3343699 3387479 3313125 3330999 3378149 3349511 3344689
8939C344689J07335o2728j57882j04895K4199J19798p8852J7721l5478m4836q3967
$$ 3344689 3452024 3389296 3231414 3126519 3150718 3270516 3191664 3209385 3173907 3129071 3045104
8928C045104M3667P4865k8505l5756n854j81717r7741k5391o0109L2979n7984
$$ 3045104 3088771 3163636 3135131 3099375 3093521 2911804 2814063 2788672 2728563 2761542 2703558
8917B703558K5029Q2256K8711n6908K5268K54133J24737J38579J70381K18008
$$ 2703558 2728587 2810843 2839554 2782646 2807914 3062047 3186784 3325363 3495744 3713752
8907C713752K34585Q2700j16015r7362j94556k65921j35557n9580j69701j52306
$$ 3713752 3948337 4031037 3915022 3817660 3623104 3357183 3221626 3162046 2992345 2840039
8897B840039n3512m0705k3787j52606m7240k8712M4962J04847p4535j06140Q375
$$ 2840039 2786527 2745822 2722035 2569429 2522189 2493477 2538439 2643286 2568751 2462611 2470986
8886B470986J0451j1809n411k9918n2633m0207n4880M7734j8829M2241P4664n5773
$$ 2470986 2481437 2469628 2464217 2434299 2381666 2341459 2286579 2334313 2315484 2357725 2432389 2376616
8874B376616j12612q5498L3126J04775K2873j42474j3475O6579R108k01023N9548
$$ 2376616 2264004 2178506 2211632 2316407 2339280 2196806 2183331 2249910 2259018 2057995 2117543
8863B117543l123o4543J2993q9390j2326o7521K994j3640n6899j03143J8061j32466
$$ 2117543 2114420 2049877 2062870 1973480 1961154 1893633 1896627 1882987 1826088 1722945 1741006 1608540
8851A608540p1772K8671J14899Q2381o8027n9995K7149L5959N5738L8069O2144
$$ 1608540 1536768 1565439 1680338 1762719 1694692 1634697 1661846 1697805 1753543 1791612 1853756
8840A853756j45319K0543j456k7539m3552j7040K9548K8832J5098n7577k5303
$$ 1853756 1708437 1728980 1727524 1699985 1656433 1639393 1668941 1697773 1712871 1655294 1629991
8829A629991J5563J6709r9182l2646l9502n3578j35122n9731N8864K770o6712
$$ 1629991 1645554 1662263 1563081 1530435 1490933 1437355 1302233 1242502 1301366 1304136 1237424
8818A237424Q5620o3149L0364O825m4139j29953r9353J595J07247J60461J0042
$$ 1237424 1323044 1259895 1290259 1297084 1252945 1122992 1023639 1025234 1132481 1292942 1302984
8807A302984K8514J8516p6208p2292K0326L269M1305J32369P4106L0001k4991
$$ 1302984 1331498 1350014 1273806 1201514 1221840 1225109 1266414 1398783 1472889 1502890 1477899
8796A477899K4008M4749J4183p8563j11774r1996L9000J03834O3630L0320J6818
$$ 1477899 1501907 1546656 1560839 1482276 1370502 1278506 1317506 1421340 1484970 1515290 1532108
8785A532108m3054n4191r2672N4832J64269R7060J4247O3978M4850M01J7505p5394
$$ 1532108 1489054 1434863 1342191 1397023 1561292 1658352 1672599 1736577 1781427 1781828 1799333 1723939
8773A723939q1314r5809k2074M4956J19143m577j26002n0958O7140M9068L9365
$$ 1723939 1642625 1546816 1524742 1569698 1688841 1684264 1558262 1507304 1574444 1623512 1662877
8762A662877O4751q0776l7257j0256M2468J21188J15834k692J01573l2822j18840
$$ 1662877 1727628 1646852 1609595 1599339 1641807 1762995 1878829 1876137 1977710 1944888 1826048
8751A826048r1663K1437J5689N2704K8206O8591j5288j9118o4575J39764J03513
$$ 1826048 1734385 1755822 1771511 1824215 1852421 1921012 1905724 1886606 1822031 1961795 2065308
8740B065308K5921Q153J11618l7768k00466j03119M4331J86007O1601j3183o3914
$$ 2065308 2091229 2099382 2211000 2173232 1972766 1869647 1913978 2099985 2161586 2148403 2084489
8729B084489P7242R7138M697p9792r3866k421m340q7587L5507O1340j24716l4832
$$ 2084489 2161731 2258869 2263566 2183774 2089908 2087487 2083147 1995560 2031067 2092407 1967691 1932859
8717A932859K0272k7286P3846J29826o3261j4350R5592K6919J535j3888J84820
$$ 1932859 1953131 1925845 1999691 2129517 2066256 2051906 2147498 2174417 2175952 2162064 2346884
8706B346884R0816Q7047K35352J56993J0381j21509r4459j26228r2384p0173k9365
$$ 2346884 2437700 2524747 2760099 2917092 2927473 2805964 2711505 2585277 2492893 2422720 2393355
8695B393355r5113j36023o6255o7534k3414L9313N881J31771L3167m1293k4437
$$ 2393355 2298242 2162219 2095964 2028430 2005016 2044329 2050210 2181981 2215148 2173855 2149418
8684B149418O2549Q7188J10753J48304K8719m2213j49777q8799j4382m783n9796
$$ 2149418 2211967 2299155 2409908 2558212 2586931 2544718 2394941 2306142 2291760 2286977 2227181
8673B227181n2177Q9600L5916O2597P7512J66386J03538l3714r1537o3671k6359
$$ 2227181 2175004 2264604 2300520 2363117 2440629 2607015 2710553 2676839 2585302 2521631 2495272
8662B495272J7814j3451n4003n0503p28j28722J9961Q1955P3011K753k4155n1885
$$ 2495272 2513086 2499635 2445632 2395129 2394401 2265679 2285640 2367595 2440606 2443359 2419204 2367319
8650B367319L9985q3754j88906p5726J6308O2728n7713q4549m6234p6837Q129
$$ 2367319 2407304 2323550 2134644 2058918 2075226 2137954 2080241 1995692 1949458 1872621 1880750
8639A880750M1045J5215J05735N0769K2341L7531K6175R5564K623P04M9826l5740
$$ 1880750 1921795 1937010 2042745 2093514 2115855 2153386 2179561 2275125 2277748 2278452 2328278 2292538
8627B292538k5112l9937j9487n9076r7010J4054J29558P0503j00553M9087P0819
$$ 2292538 2267426 2227489 2208002 2148926 2051916 2065970 2195528 2266031 2165478 2214565 2285384
8616B285384J06725O0469M6915L0998Q5487M6360Q8180L9715K71756L03135J08447
$$ 2285384 2392109 2452578 2499493 2530491 2615978 2662338 2750518 2790233 3061989 3365124 3473571
8605C473571P1208J40523Q2308K4917j57469l05215l02272k92433k65230k47753
$$ 3473571 3544779 3685302 3767610 3792527 3635058 3329843 3027571 2735138 2469908 2222155
8595B222155j41589q8521j51151r2258k56885j06874k3365M7135j4258j5248J30226
$$ 2222155 2080566 1992045 1840894 1748636 1491751 1384877 1361512 1408647 1394389 1379141 1509367
8584A509367j02770j7091J4551k3011q2816j03025o3788O001J08088j1726m8094
$$ 1509367 1406597 1389506 1404057 1381046 1298230 1195205 1131417 1137418 1245506 1233780 1185686
8573A185686m8718o8790m2794K5068M0298O7238J2895J8349K926n0351k0679q2935
$$ 1185686 1136968 1068178 1025384 1050452 1090750 1157988 1170883 1189232 1192158 1141807 1121128 1038193
8561A038193O7652j2713p9759k456Q6438m7172O6640J2117k8704M2551Q2790j74036
$$ 1038193 1105845 1093132 1013373 1010917 1097355 1050183 1116823 1128940 1100236 1142787 1225577 1051541
8549A051541q1251j53456K3663J2720K3657L3959o7055n1114O8551R9869J01756
$$ 1051541 970290 816834 840497 853217 876874 910833 843778 792664 861215 961084 1062840
8538A062840P5636P6115k13l6630j28533q8098j5695Q1145J05441j2505j25231
$$ 1062840 1138476 1214591 1214378 1177748 1049215 961117 945422 1026567 1132008 1119503 994272
8527I94272O184n1113j08N0571j20680n8981l4849J81262R0202r5393j28259n0820
$$ 994272 1000456 949343 949235 999806 879126 820145 785296 966558 1056760 961367 833108 782288
8515G82288j6354R800r3757K7772J93829J32777L9250J6754o0719m9643m6156
$$ 782288 765934 775734 681977 709749 903578 1036355 1075605 1092359 1031640 981997 935841
8504I35841N4832O4741j27951j68071k6218M9138O1784P8989M3326N0554l929
$$ 935841 990673 1055414 927463 759392 733174 782312 844096 923085 966411 1016965 1013036
8493A013036N4357J15733N5854m6945k3484j30793l2536o3250r5624j16710l053
$$ 1013036 1067393 1183126 1238980 1192035 1168551 1037758 1005222 941972 846348 729638 726585
8482G26585p5614l6707J52629J46745J9581k4755p7891n388k7648N896o3941n1656
$$ 726585 650971 614264 766893 913638 933219 908464 830573 825185 797537 803433 739492 687836
8470F87836O5607J339o2305m58o082r0569r1036N0019J19525J27293q419o8487
$$ 687836 753443 754782 692477 692019 685937 595368 504332 554351 673876 801169 792750 724263
8458G24263l1655P3876Q369q089O787P3553l3815m5688L179l27j8662M8681q3924
$$ 724263 692608 766484 774853 766764 773551 847104 813289 767601 770780 770453 751791 800472 716548
8445G16548j11480j0993l6088M0852J08092k7640o4348j10793p3546l96M4450
$$ 716548 605068 594075 557987 598839 706931 679291 614943 504150 430604 430208 474658
8434D74658J37534L2461k0528j2204R509K9630M3308K7923K760J9073j590o3075
$$ 474658 612192 644653 624125 611921 621430 651060 694368 722291 725051 744124 742534 679459
8422F79459N0497N2021M0592p3834o2085j2147r7231L9734Q9613p4925N6359O845
$$ 679459 729956 781977 822569 748735 686650 674503 577272 617006 706619 631694 688053 694898
8410F94898P6548j9534j00521o8784r5567m3121J04273j8203M3538l1337o9298
$$ 694898 771446 751912 651391 582607 487040 443919 548192 529989 573527 542190 472892
8399D72892j5082M1815r3733l267j0084J15859M4250r790j05329R8771k6340J4708
$$ 472892 457810 499625 405892 402625 392541 508400 552650 542860 437531 536302 509962 524670
8387E24670p510p482J0214J18427P3519j6925j05725l7812j5563p1306O9632r78
$$ 524670 517160 509678 519892 638319 711838 694913 589188 551376 535813 464507 534139 533161
8375E33161m7874o649M0366J13114M5697O7492M5929R056o1895o8209p0413r367
$$ 533161 485287 478638 519004 632118 677815 745307 791236 800292 738397 670188 599775 590408
8363E90408r1189l0262j4010Q3192J64106o3840j18470p6022m8999N2531N3597
$$ 590408 499219 468957 454947 538139 702245 638405 519935 443913 394914 447445 501042
8352E01042q992K7209O0005q8000q1368k5617L6021K193k8843R3177L4430K3105
$$ 501042 492050 519259 579264 491264 409896 384279 420300 422493 393650 486827 521257 544362
8340E44362q4775l9745K4497R5018J9943J4525r6464j2376J03383J4334M6095
$$ 544362 459587 419842 444339 539357 559300 573825 477361 464985 568368 582702 628797
8329F28797m124j21681l1091p1313L8823k5522m3461K5770k1212M2164M1280k2372
$$ 628797 624673 502992 471901 400588 439411 413889 370428 396198 374986 417150 458430 436058
8317D36058j08728j4263L9001L6185N5586J11762j77m7345j7351l2612p3282K7265
$$ 436058 327330 313067 352068 388253 443839 555601 555424 508079 490728 458116 384834 412099
8305D12099N7943J30539L8260j4960l5235K9335J1488p0244O7147O8719r5046
$$ 412099 470042 600581 638841 623881 588646 617981 629469 559225 626372 695091 600045
8294F00045k0888l7847n8447K5230J979J26987P5823o7979j55363l976N2278p860
$$ 600045 579157 541310 482863 508093 510072 637059 712882 644903 489540 485564 537842 529982
8282E29982N1540J7122J3832p6552l2437O6411q041q9300n2740J03622J19149
$$ 529982 581522 598644 612476 535924 503487 569898 561857 472557 419817 523439 642588
8271F42588m8746j06735Q3840L4736j65339j28297o5301k7162J45734J25414q5525
$$ 642588 593842 487107 570947 605683 440344 312047 246746 219584 365318 490732 405207
8260D05207j04028P812R5353N4092O5910J3706O4009J5341N9097k3447q3812k1794
$$ 405207 301179 308991 404344 458436 524346 538052 602061 617402 676499 653052 569240 547446
8248E47446J0650M6861P9009k118l1081L904L1565Q6813M7099j09008j08965M7225
$$ 547446 558096 604957 683966 681848 650767 654671 686236 773049 820148 711140 602175 649400
8236F49400P6136P2611m0352o6180M2394N034k0808j07037N514P3832J30076R419
$$ 649400 725536 798147 757795 691615 734009 739043 718235 611198 616712 690544 820620 830039
8224H30039n0398n9229q8086p6287J1110K1879N4422o8454k8792K3862R3944J22200
$$ 830039 779641 720412 632326 556039 567149 589028 643450 574996 546204 570066 664010 786210
8212G86210N8208N1057J27102K9138P8754J50751J23030j3176j49252j08307O9917
$$ 786210 844418 895475 1022577 1051715 1130469 1281220 1404250 1391074 1241822 1133515 1203432
8201A203432n6908p3955n7878m1389M6216M8900r5562J39338N8581m6953n0957
$$ 1203432 1146524 1072569 1014691 973302 1019518 1068418 972856 1112194 1170775 1123822 1072865
8190A072865j50867j20109p7773K4382P3133Q9596K7912j01214n9479L6573m844
$$ 1072865 921998 801889 724116 748498 821631 911227 939139 837925 778446 815019 810175
8179H10175l1287r616M393n2910l4890l2169p6749J22527K07540R4490K5960l3376
$$ 810175 778888 769272 773665 720755 685865 653696 576947 699474 907014 1001504 1027464 994088
8167I94088Q034L911M9255Q3699K78533K76558K19678K84135J17862J9919k06274
$$ 994088 1002122 1006033 1055288 1138987 1417520 1694078 1913756 2197891 2315753 2335672 2129398
8156B129398k65312k50155k32649j18536p6199l4388M548N884o954L4376N7937
$$ 2129398 1864086 1613931 1381282 1262746 1186547 1152159 1156707 1162591 1155637 1190013 1247950
8145A247950J6906N584L6146m2336k7585J50570J08553K7107M2960n6523N553
$$ 1247950 1264856 1270440 1306586 1264250 1236665 1387235 1495788 1522895 1565855 1509332 1514885
8134A514885j4472K8413p6534R4791R4018j591j15012r6439m1523p9167k5369
$$ 1514885 1500413 1528826 1452292 1547083 1641101 1639510 1524498 1428059 1386536 1307369 1282000
8123A282000r6442j24816M6833M4654K3956K4105J13291J01797J12550J3848O042
$$ 1282000 1185558 1060742 1107575 1152229 1176185 1200290 1313581 1415378 1527928 1541776 1547818
8112A547818N933o919J41862J15970P6873j3132R1711O6582M0528O623K3320K3615
$$ 1547818 1553751 1546832 1688694 1804664 1881537 1868405 1960116 2026698 2067226 2073849 2097169 2120784
8100B120784O7780L3622j5054J0718M2446j5069J01410K9536k9509r991j4452
$$ 2120784 2188564 2222186 2207132 2217850 2260296 2245227 2346637 2376173 2346664 2336673 2322221
8089B322221j3129J07756J51195N5051M8359l7767p3134k113n7126j38114m3131
$$ 2322221 2309092 2416848 2568043 2623094 2671453 2633686 2560552 2558439 2501313 2363199 2320068
8078B320068J04666J07448k5316L753O6250J9502j8377m2586n6078K8350Q6861
$$ 2320068 2424734 2532182 2506866 2510619 2576869 2596371 2577994 2535408 2479330 2507680 2594541
8067B594541M676J9631p7727m4060O9849J86322J21111R7829r5922N1698J70443
$$ 2594541 2599217 2618848 2541121 2497061 2566910 2753232 2874343 2972172 2876250 2927948 3098391
8056C098391R8540J49990M7567r8934n7697j2655j08714j34263j53247K8382J09424
$$ 3098391 3196931 3346921 3394488 3295554 3237857 3225202 3116488 2982225 2828978 2857360 2966784
8045B966784O1683K2721K4326j7828N7644Q7231J4590m0407O396l964n1568o7571
$$ 2966784 3028467 3051188 3075514 3057686 3115330 3202561 3217151 3176744 3183140 3179176 3127608 3060037
8033C060037J06119J304p1972P6171L8873N5911J12463M9074R3333j5429j11087
$$ 3060037 3166156 3167460 3095488 3171659 3210532 3266443 3378906 3427980 3521313 3505884 3394797
8022C394797k08278l57982l11540k31821j16197o5032m6049n5439P9871J09478
$$ 3394797 3186519 2828537 2516997 2285176 2168979 2103947 2057898 2002459 2082330 2191808
8012B191808J4714J30294O8116j46914q8630o6607j01483m1281r0334j38305o2181
$$ 2191808 2206522 2336816 2404932 2258018 2169388 2102781 2001298 1960017 1869683 1731378 1669197
8001A669197j5316K6120J16359K4198q1290j31004p2604m3161q52P6663R82P3368
$$ 1669197 1653881 1680001 1796360 1820558 1739268 1608264 1535660 1492499 1491647 1568310 1569292 1642660
7989A642660N8727L1426k29490k42417m090J36752R1448R1962J02745J08523r7230
$$ 1642660 1701387 1732813 1503323 1260906 1256816 1393568 1485016 1576978 1679723 1788246 1691016
7978A691016L3073p5254n501r9046r8862j17211m5529r9583m981k9687n976m0072
$$ 1691016 1724089 1648835 1643334 1544288 1445426 1328215 1282686 1183103 1178122 1148435 1142459 1102387
7966A102387j10203L3923P723M3591O0056l6352j62858j5463n2841j97779l7216
$$ 1102387 992184 1026107 1033830 1077421 1137477 1101125 938267 922804 869963 672184 634968
7955F34968j0103J22872N1856l7857M3208K9188q0086r2094p8522N4027J66227
$$ 634968 624865 747737 799593 761736 804944 834132 754046 661952 583430 637457 803684
7944H03684o017j27468r803J6959J5319L0184r1932o2282K3710N4880k2389M2126
$$ 803684 797667 670199 660396 677355 692674 722858 630926 568644 592354 647234 624845 666971
7932F66971O042L2241P8916J0890l0885J7552m1149q1754p561n3833J1130L5780
$$ 666971 673013 705254 784170 795060 764175 781727 740578 658824 651263 597430 608560 644340
7920F44340n243q0633j1062K3677j0450k05l2385L0458m1678J0060n2170o5645
$$ 644340 639097 558464 547402 571079 560629 560424 528039 558497 516819 526879 474709 409064
7908D09064O5235J19942K4209j0001k5010p3505j8944r2565p704k3713l8505j9585
$$ 409064 474299 594241 618450 608449 583439 509934 490990 398425 390721 367008 328503 308918
7896C08918j8381N1104O9389N0147o2254J4163L5810J4556k5423j16019o2868
$$ 308918 290537 341641 411030 461177 398923 413086 448896 463452 438029 322010 259142
7885B59142L7364J13050Q4069l6057k9440n57n4208q6257L796L8890n8382P2559
$$ 259142 296506 409556 493625 457568 428128 427571 373363 287106 290902 329792 271410 343969
7873C43969J32763o9083j05664l573K0308j91072O541J29811N6296l1176J36282
$$ 343969 476732 407649 301985 298412 318720 127648 134189 264000 320296 289120 425402
7862D25402n7337j08056J1596Q4287n9972r0269q9574P9270P1332O3569P0858
$$ 425402 368065 260009 271605 355892 295920 205651 116077 195347 266679 330248 401106
7851D01106P2451L6510J2056k4878j06525m1983l6642j56575m0545j640K2095
$$ 401106 473557 510067 522123 497245 390720 348737 312095 155520 114975 113335 135430
7840A35430O1106L5581q826Q4501K0450o4132k1771J34696J5371n2274l0835q3725
$$ 135430 196536 232117 223291 307792 328242 264110 242339 377035 392406 340132 309297 225572
7828B25572j36658n6545q2980M1568Q3276J09687K8553l5188J18738P8891o4049
$$ 225572 88914 32369 -50611 -9043 74233 183920 212473 177285 296023 374914 310865
7817C10865j32762n460M2096o3638n5637M7553M5900m8428l7983j02687N0754
$$ 310865 178103 172643 214739 151101 95464 143017 188917 140489 102506 -181 50573
7806E0573K15119J03633p0650l1618m8764j01438m7799K8925L6201l2341K0896
$$ 50573 265692 369325 298675 267057 218293 116855 69056 97981 134182 101841 122737
7795A22737J7541o3972j3741J5314K8438P3615J4642L4536o346m6210o6650l9552
$$ 122737 140278 76306 62565 77879 106317 179932 194574 229110 222764 176554 109904 70352
7783G0352l4796Q8469p397m2673k1490O1309J4298M5051n9625q686J9755O3363
$$ 70352 35556 124025 116628 73955 52465 113774 128072 173123 113498 104812 124567 187930
7771A87930P8672n8929P8279k4937m9198o9468n6289j6818N5777k2229k0568J6332
$$ 187930 266602 207673 285952 261015 211817 142349 86060 69242 125019 102790 82222 98554
7759I8554M9010l5143l7565R5890P7275q1864o5154p9065M9938M4660P6474J1318
$$ 98554 147564 112421 74856 170746 248021 166157 101003 21938 71876 116536 193010 204328
7747B04328K5866m0508j36556k7435N6339N8370J40043N9304r4527j31423n2524
$$ 204328 230194 189686 53130 25695 82034 140404 280447 339751 245224 113801 61277
7736F1277l4868N8433k1624o0595J3090R2585Q4838N9147O5649m6939j25407r5902
$$ 61277 26409 84842 63218 2623 15713 108298 193136 252283 317932 270993 145586 49684
7724D9684n7407M4752M3540p9497j7405M4824J12940P2170j7420j27985q6156
$$ 49684 -7723 37029 80569 1072 -16333 28491 141431 213601 196181 68196 -17960
7713a7960P5946L9349n0302j2713Q1980J4689m5017R4j9474l2575J2029M1601
$$ -17960 57986 97335 47033 34320 116300 130989 85972 86066 66592 34017 46046 87647
7701H7647M7052L9915J1330o0843L1512O9760n1352n2337J5165N4712N3035p6228
$$ 87647 134699 174614 185944 125101 156613 226373 175021 122684 137849 192561 245596 169368
7689A69368j07415l5606n0910O7054M3989M49n0345K7145P1916o2937j883O6434
$$ 169368 61953 26347 -24563 42491 86480 86929 36584 63729 135645 72708 70825 137259
7677A37259K414J12068K0988k322q4409L9327j00799l8318j29019l1276M3479
$$ 137259 139673 251741 272729 270407 185998 225325 124526 86208 -42811 -74087 -30608
7666c0608m9904J32458J15953l8503o1379N5718n3292q552J2919P3654K7317l8830
$$ -30608 -80512 51946 167899 129396 68017 123735 70443 61891 74810 148464 175781 136951
7654A36951j32378L1678L6478O7076p8571o1128J6023J29997J7718J7045O240
$$ 136951 4573 36251 72729 139805 61234 106 16129 146126 163844 180889 187129
7643A87129O4568k426j2390r0671j17581J19776J07457L5976o8908N5264L832
$$ 187129 251697 249271 236881 146210 28629 148405 255862 291838 222930 278194 282026
7632B82026r1202j27196n5885J17313J04274P896O481O9268n0091k31359J0124
$$ 282026 190824 63628 7743 125056 229330 237226 243707 312975 262884 31525 41649
7621D1649O3521k8804q8015P725k1812j30N2628R9922j5163p4896N9779R6045
$$ 41649 105170 76366 -11649 -3924 -25736 -25866 26762 126684 111521 36625 96404 192449
7609A92449J2922n3772p2531K5449O778j5695O7383J09889n2961l6055p7269L5119
$$ 192449 205371 151599 79068 104517 111295 95600 162983 272872 219911 183856 106587 141706
7597A41706O1677q0390j25736j1894J89680J4449r7161j6723K7548k3008k6464
$$ 141706 203383 122993 -2743 -14637 175043 189492 92331 75608 103156 80148 53684
7586E3684Q2433m277j06348p0714L8352Q2006k1861Q686Q520R1467Q7070k1741
$$ 53684 136117 131840 25492 -45222 -6870 75136 53275 61961 70481 161948 249018 227277
7574B27277p6106J2041j096j36687j07753j5473P6627M3882N4767M1644r548j997
$$ 227277 151171 163212 162116 25429 -82324 -97797 -21170 22712 77479 119123 109575 107578
7562A07578n5997N3396J353J1865p0666k6525N9828p0355p4574L2349r3194p041
$$ 107578 51581 104977 106330 118195 47529 21004 80832 10477 -64097 -31748 -124942 -131983
7550a31983N3783N4013R6100j3590k8670o5857M7704M1292j5559P8533N5754j28890
$$ -131983 -78200 -24187 71913 58323 29653 -36204 11500 52792 37233 115766 171520 42630
7538D2630m2607n589K5116m4707K3650k2577R4846O480j23083j31668R4669J78219
$$ 42630 23 -5566 19550 -25157 -1507 -24084 70762 77242 -45841 -177509 -82840 95379
7526I5379Q5452m151q5599j32649m2963p876j4692K2043O2541o314n2972k4561
$$ 95379 180831 176680 91081 -41568 -84531 -92407 -107099 -85056 -22515 -28829 -81801 -106362
7514a06362n906m7876J01176J33468O0434r836p9691o0406M5763K9106j4036j26133
$$ -106362 -112268 -160144 -58968 74500 134934 125098 45407 -14999 30764 59870 45834 -80299
7502h0299L7481Q0496j2194k0822J1554O1805j9032j3393j1848r3282q2205K6520
$$ -80299 -42818 37678 25484 4662 16216 78021 58989 45596 33748 -59534 -141739 -115219
7490a15219Q90K9352O6799m349N7753J85105J42383j18735j81479j37940j8281
$$ -115219 -114329 -84977 -18178 -22527 35226 220331 362714 243979 62500 -75440 -93721
7479i3721R4839J22893J3596r3910j5140Q516l955K7660m4918P930K5766q8248
$$ -93721 1118 124011 137607 43697 28557 37073 33118 60778 15860 23790 49556 -38692
7467c8692J04985K7478P5105n8545P264j6969j15364p1450j6557J3579j943m7163
$$ -38692 66293 93771 168876 110331 117595 100626 -14738 -86188 -102745 -89166 -91109 -138272
7455a38272Q3360O3603J8697K7366M8168q6024j14325k834j1127O2682Q2530J1985
$$ -138272 -54912 8691 27388 54754 102922 16898 -97427 -100261 -111388 -48706 33824 45809
7443D5809j7578R11n7516R2564L0133J1240p1770M9667L2911L7833N734m3482
$$ 45809 28231 29142 -28374 64190 94323 105563 33793 83460 116371 154204 159938 116456
7431A16456J8402j2228K412m1720l6942l8023m566q9320M9854L6386l7735L4235
$$ 116456 134858 122630 125042 83322 46380 8357 3791 -85529 -35675 711 -37024 -2789
7419b789L2349R879K5629l7991j9636R966Q1190J5636K0879o3829M3725N9427
$$ -2789 29560 39439 65068 27077 7441 17407 98597 114233 135112 71283 115008 174435
7407A74435j9050q0278J8741l015P8543J5781j2402O851k9482j20406j03872M8485
$$ 174435 155385 75107 93848 90833 169376 185157 172755 179606 150124 29718 -74154 -25669
7395b5669K3790L6475L5516n6286K0347j8168J5946Q1863j23867j72542k5028
$$ -25669 -1879 34596 70112 13826 34173 16005 31951 113814 -10053 -182595 -207623
7384b07623Q6548R7898J14018j11553k564P1120O6092R3099n9395q8793j7779
$$ -207623 -121075 -23177 90841 -20712 -23276 47844 113936 207035 147640 58847 41068
7373D1068R4381m1334N9259q157j07157k3119q1192Q384j4664N853N7663n5205
$$ 41068 135449 94115 153374 145217 38060 14941 -66251 -57867 -72531 -66678 -9015 -64220
7361f4220k4293l6459L1192r2958J8992J40682p9054k2438l0916k5925K7950J776
$$ -64220 -88513 -124972 -93780 -186738 -167746 -27064 -106118 -128556 -159472 -185397 -157447 -155671
7349a55671O3249L5884P1138J38395M0547l2942j580m1623L018m724P0886n7633
$$ -155671 -92422 -56538 14600 152995 193542 160600 159020 117397 120415 115691 186577 128944
7337A28944j17708m700n3117L8663O0179j9605k416M6725O7391n4344q0321l4247
$$ 128944 11236 6536 -46581 -7918 52261 32656 30240 76965 144356 90012 9691 -24556
7325b4556j483p7943P404L4820j9826k929j0005K4542J47452O4054p999j2502
$$ -24556 -26039 -103982 -96578 -61758 -81584 -84513 -94518 -69976 77476 141530 133531 121029
7313A21029n3234q485P6174l5716O9644m5352N41r5157n9454o3778L7050J317
$$ 121029 67795 59310 135484 99768 169412 124060 124601 29444 -30010 -93788 -56738 -55421
7301e5421j8774N9576J06215L0199o4158L980O4274j03798n5630L5790J90151
$$ -55421 -74195 -14619 91596 121795 57637 61617 125891 22093 -33537 2253 192404
7290A92404L7489k3075j5123j25161j11921n6038j7429J32282R5445l1360j58159
$$ 192404 229893 206818 191695 66534 -45387 -101425 -118854 13428 108873 77513 -80646
7279h0646K4771K3417n999m7888M7493J31555j2810K6051K7171m6720k3260m3550
$$ -80646 -55875 -32458 -38457 -86345 -38852 92703 79893 105944 133115 86395 63135 19585
7267A9585O9672K4408L7991p5120j19402N2724J0347m0633l267l0361j10466p144
$$ 19585 89257 113665 151656 76536 -42866 9858 20205 -20428 -23695 -54056 -164522 -171666
7255a71666Q5542J48447Q6180j49308q8342K221N7250J17712n6737K4355O3777
$$ -171666 -86124 62323 148503 -805 -89147 -86926 -29676 88036 31299 55654 119431
7244A19431K0965K6420j4446J4359l7273n4562Q182K7653l9949k3346K3748N6441
$$ 119431 140396 166816 152370 166729 129456 74894 83076 110729 70780 47434 71182 127623
7232A27623M2077n5116o7278L1370O677l7797m1709k8696J9890P4314k0399r6399
$$ 127623 169700 114584 47306 78676 85353 47556 5847 -22849 -2959 71355 50956 -45443
7220d5443j5922n95P7492q367k2860n2463j6514K8778M3412O2075P4568K9659
$$ -45443 -61365 -61960 15532 7165 -15695 -68158 -84672 -55894 -12482 49593 124161 153820
7208A53820J2698M1163n9174r8210N4604J08334J39476p4737j397J3219o4139
$$ 153820 166518 207681 148507 50297 104901 213235 352711 277974 276577 289796 225657
7197B25657m5586r0482j74514K579J41246M0194N4333K8285M4796o3116r6005
$$ 225657 180071 89589 -84925 -82346 58900 99094 153427 181712 226508 163392 67387
7186F7387p5697P9750J64774N32p7046p9090l9788M4752o5227J1861n4156L3986
$$ 67387 -8310 71440 236214 236746 159700 80610 40822 85574 20347 32208 -21948 12038
7174A2038k8066j0212o6202J26272O4465m357j3699o7305j5154n9075N0137R0669
$$ 12038 -16028 -26240 -92442 33830 98295 93938 80239 12934 -2220 -61295 -11158 79511
7162G9511k4118J18753J30143L6261r0177o2301k4918l7190k4887j9782P5112
$$ 79511 55393 174146 304289 340550 250373 188072 163154 125964 101077 81295 156407
7151A56407o6480k01758k5138J65065J07706K8943j25838n0291k3307J10190L7568
$$ 156407 89927 -111831 -136969 28096 135802 164745 38907 -11384 -34691 75499 113067
7140A13067m3924q6439j04774L08J10993O1014p8200j24921j0523J37641K8600
$$ 113067 69143 -17296 -122070 -121762 -10769 50245 -27955 -152876 -163399 -25758 2842
7129B842J0918j08543n738r3544K9163J07336l7993r187p763N4510K4482n0063
$$ 2842 13760 -94783 -100521 -194065 -164902 -57566 -95559 -104746 -112509 -57999 -33517 -83580
7117h3580K0414k0145M2499M9497L7233L3857j4256j11659m7305m4690k8780L1394
$$ -83580 -63166 -83311 -40812 8685 45918 79775 65519 -46140 -93445 -138135 -166915 -135521
7105a35521j2815Q6932O1844l9198K6918m9608K3418N6826m0467O6893O0923l2896
$$ -135521 -148336 -61404 440 -38758 -11840 -61448 -38030 18796 -21671 45222 106145 73249
7093G3249M7005Q5043q2341p7480p8085Q234j0171o4474r8083J57405J63456o2287
$$ 73249 120254 205297 122956 45476 -32609 -24375 -34546 -99020 -197103 -39698 123758 61471
7081F1471n7954m7610K2781K4926j11017r284L9123L7032m2052J4301N2875j2617
$$ 61471 3517 -44093 -21312 3614 -107403 -116687 -77564 -40532 -82584 -68283 -15408 -28025
7069b8025o3410O1250l9181Q16J36584M2687j5022n9585l1788o4897R5159J15382
$$ -28025 -91435 -30185 -69366 -68550 68034 110721 95699 36114 4326 -60571 34588 149970
7057A49970n0191j07124o4337J03603N3391n5468j19208m7381M8834M5315N7418
$$ 149970 99779 -7345 -71682 31921 85312 29844 -89364 -136745 -87911 -42596 14822
7046A4822k9190o990M2269J5116N5171N0974o2292p5612J2494j06035m0517L9091
$$ 14822 -14368 -21358 20911 36027 91198 142172 79880 4268 16762 -89273 -129790 -90699
7034i0699m8863j5724P6566N7425j6469q5444j479R379J14246M4792L0962N07
$$ -90699 -139562 -155286 -78720 -21295 -37764 -123208 -124687 -115308 -1062 43730 74692 75199
7022G5199K227l7670r8271N9855N3159o614J3714k1043m3375J2921K1516Q2879
$$ 75199 77426 39756 -58515 1340 54499 47885 61599 40556 -2819 10102 31618 114497
7010A14497P4281j78934O130N0722n7154r0156j12929J7603J04354J69221J02628
$$ 114497 188778 9844 15974 66696 9542 -80614 -193543 -175940 -71586 97635 200263
6999B00263J774l0438o0621N5390o9668q1763q9144M3950M4873m7369O0845k2686
$$ 200263 202037 171599 110978 166368 96700 14937 -74207 -30257 14616 -32753 28092 5406
6987E406o8570M3862l5287J3638j3968j1982M8680p6160r1798J36967J29265L3347
$$ 5406 -63164 -19302 -54589 -40951 -54919 -66901 -18221 -94381 -186179 -49212 80053 113400
6975A13400j9986Q0996J0684l8288L1142J13939P322m6732j4465M8408Q3131j4092
$$ 113400 93414 174410 185094 146806 177948 291887 299209 252477 238012 286420 369551 355459
6963C55459q5555m9240l6930K9814K1892P5910Q055j40687p0999j682l8605j1048
$$ 355459 269904 220664 183734 213548 235440 311350 319405 178718 107719 106037 67432 56384
6951E6384N5915r8951q5543N3531Q0291P0332m9673j27411r587M3041r4186m2733
$$ 56384 112299 13348 -72195 -18664 61627 131959 82286 -45125 -54712 -11671 -105857 -148590
6939a48590J16411J14639K6683r5743o8974m3882n2660j47367M2284J06436Q7352
$$ -148590 -32179 82460 109143 13400 -55574 -99456 -152116 -299483 -257199 -150763 -63411
6928f3411j5830l409n1558M9121J5515K0128q81J04052N4198n916l0577m8966
$$ -63411 -79241 -82650 -134208 -85087 -69572 -49444 -50325 53727 107925 102009 71432 22466
6916B2466n6213m2528Q5807P2778o0145m2850k7868J8328J03665P1950Q3598J35560
$$ 22466 -33747 -76275 9532 82310 22165 -20685 -48553 -30225 73440 145390 228988 364548
6904C64548K7137q2974o9512K407m3583p8661l3335m0266n0000J52945P4515N3782
$$ 364548 391685 308711 239199 241606 198023 119362 86027 45761 -4239 148706 223221 277003
6892B77003j4870j26496L4025r8608j05374o4260N2224K9002K2834K8818k2351
$$ 277003 262133 135637 169662 71054 -34320 -98580 -46356 -17354 5480 34298 11947
6881A1947L8307k2694l0354k0529k752O150j63407k5605J12179L2406Q5966J58787
$$ 11947 50254 27560 -2794 -23323 -26075 -19925 -183332 -208937 -96758 -64352 21614 180401
6869A80401K2843l4298r1338q9138j2201M1006l0667p1747m6887Q7479J69417
$$ 180401 203244 168946 77608 -11530 -23731 17275 -13392 -85139 -132026 -44547 124870
6858A24870m0566M5112R9635L6852o0157J3114L6239J02595k0048K4920J36979
$$ 124870 84304 129416 229051 265903 205746 218860 255099 357694 337646 362566 499545
6847D99545n0693j8802P1903j32864k62918r2590K9250k3394J4374M6676J0050
$$ 499545 448852 430050 501953 369089 106171 13581 42831 19437 33811 80487 90537
6836I0537j2929r3893l9938p1748K5071k7983M7509J22546Q8133N5642l0171n2129
$$ 90537 77608 -16285 -56223 -127971 -102900 -130883 -83374 39172 127305 182947 152776 100647
6824A00647q3104Q9224J16853J01096p4273j35937j19353P0955J21237n6031j19770
$$ 100647 17543 106767 223620 324716 250443 114506 -4847 66108 187345 131314 11544
6813A1544m3192k6534K3808k4246O7972m4982q4352M4061K5096J09023O152m6271
$$ 11544 -31648 -58182 -34374 -58620 9352 -35630 -119982 -75921 -50825 58198 64350 18079
6801A8079n6999l8479R6700N7580K3188J05812K6297j6414K3497K5175J4383j01231
$$ 18079 -38920 -77399 19301 76881 100069 205881 232178 215764 239261 264436 278819 177588
6789A77588o2705j52101n9193M9021R9857K864l5163K3522k4936o0259Q081l7018
$$ 177588 114883 -37218 -96411 -47390 52467 55331 20168 43690 18754 -41505 -33424 -70442
6777g0442j2843j245l2231k6023o8117L0451J50051J53168J05085k4075n7815
$$ -70442 -83285 -84530 -116761 -142784 -210901 -180450 -30399 122769 227854 203779 145964
6766A45964j3683M7100o7424m5654k0913j2772J5688M6724J5748K996J62426J5658
$$ 145964 132281 179381 111957 66303 45390 32618 48306 95030 110778 113774 276200 291858
6754B91858n1578m1794j21900j14644J9669J01258J31324k98j29524o3130R8879
$$ 291858 240280 198486 76586 -38058 -18389 82869 214193 213895 84371 21241 120120
6743A20120N2621Q9079J4221o3703O8550N2202k8790m5230L1630J59670J41558
$$ 120120 172741 261820 276041 212338 280888 333090 304300 259070 290700 450370 591928
6732E91928R8840J64003O8408n3716j78452j83678j25750p7369r1879j10792M753
$$ 591928 690768 854771 923179 869463 691011 507333 381583 304214 212335 101543 106296
6721A06296M7205j8679o4971j25750J8594Q8680O1015k1222o8288j19914j469
$$ 106296 153501 134822 69851 -55899 -37305 51375 112390 91168 22880 -97034 -98503
6710i8503M6458K1356Q9844K8845Q1603j06599r8851M7779n287n9008L3092K3225
$$ -98503 -52045 -30689 59155 88000 169603 63004 -35847 11932 6645 -52363 -19271 3954
6698C954L974R4179n9552m1603M4599J05023N5113o682q5401j05993k5365j14017
$$ 3954 7928 102107 42555 952 45551 150574 205687 199005 113604 7611 -17754 -131771
6686a31771R4567M1274l6272K0832J20743m868j01650n2898j02130N3345L5893
$$ -131771 -37204 4070 -32202 -11370 109373 104505 2855 -50043 -152173 -98828 -62935
6675f2935r4696q9566N1386K3901R9649P3067j5077p2060M8166J21688o7591M2346
$$ -62935 -157631 -247197 -195811 -171910 -72261 806 -14271 -86331 -38165 83523 15932 58278
6663E8278j9408k6438P6901N8532m7080J3289k6765p8587O6556j083K7082m5807
$$ 58278 38870 12432 89333 147865 100785 114074 87309 8722 75278 74195 101277 55470
6651E5470o8941M738P9241M1044j19047o9566Q8358L3334L2431o322n1202j1822
$$ 55470 -13471 -8733 70508 111552 -7495 -77061 11297 44631 77062 70740 19538 7716
6639G716l4067l2790j35274K7380J23437p3871j01819r853J63929P0946M687J22392
$$ 7716 -26351 -59141 -194415 -167035 -43598 -117469 -219288 -229141 -65212 5734 10421 132813
6627A32813O884j03583k8505L3162j9091m1417l3414p2185N9188J26878O0295
$$ 132813 139697 36114 7609 40771 21680 -19737 -53151 -125336 -66148 60730 121025
6616A21025N6584p2249j15230m441N2760j26807P47q998j60635N800J14189J06336
$$ 121025 177609 105360 -9870 -14311 38449 -88358 -87611 -96609 -257244 -251444 -137255 -30919
6604c0919K3911J075J8970j5990m6047N9214N8150j19317l5220J19134Q675M114
$$ -30919 -7008 -5933 13037 -2953 -49000 10214 68364 -50953 -86173 32961 41636 45750
6592D5750l5713N975p6747O524P1882p5062m2846n8911p377k8563M3269P601J49289
$$ 45750 10037 16012 -60735 -54211 17671 -57391 -100237 -159148 -166525 -195088 -151819 -144218 5071
6579E071l8168j660k253m3215K6721J3132Q785M1754j4237M3230k137o677P7724
$$ 5071 -33097 -34757 -37010 -80225 -53504 -40372 -31587 10167 -4070 39160 37023 30346 108070
6566A08070m7505q5058l9775p45O1602j3026k70N4164M3414l1018l0736J60790
$$ 108070 60565 -24493 -64268 -65013 -3411 -16437 -16707 37457 80871 49853 19117 179907
6554A79907M288n5258m0159o1929m9312m2280J0239J27471n1960m7902N2098n2802
$$ 179907 184195 128937 88778 26849 -22463 -64743 -54504 72967 21007 -26895 25203 -27599
6542b7599n8447Q0374R2380l7960n1071n0104n6533j7123P7141j3183n7092R2016
$$ -27599 -86046 -5672 86708 48748 -2323 -52427 -108960 -126083 -48942 -62125 -119217 -27201
6530b7201r272N3444M0296M7849l5323l0514K6275R0193J9772p7198l1718Q6009
$$ -27201 -36473 16971 57267 105116 69793 39279 65554 155747 175519 98321 66603 152612
6518A52612Q715l2014k2917K639O9581j219Q764k4120n4952r04k4384P8684m4072
$$ 152612 161327 129313 106396 109035 178616 177397 186161 162041 107089 106185 81801 160485 116413
6505A16413j2674J3450o1969j27687o2017L2867j7130N952R5453Q636o471N24
$$ 116413 103739 117189 55220 -72467 -134484 -101617 -118747 -112795 -17342 -8706 -15177 -14653
6493a4653p4461M2692P1526j37440m0183J81815P8468l5460r2463n0007l2593
$$ -14653 -89114 -46422 25104 -112336 -152519 29296 107764 72304 -20159 -70166 -102759
6482a02759P440m8267Q6642j4750j9765P6099K2878J3791J05872J4430R864j8944
$$ -102759 -95319 -143586 -56944 -71694 -91459 -15360 7518 21309 127181 141611 151475 132531
6470A32531m6103J5385j3302m5021o7337j06293k8026R3815M6290N4924J06908
$$ 132531 86428 101813 88511 43490 -23847 -130140 -158166 -64351 -18061 36863 143771
6459A43771j4889q7123k2383j02911r6067Q7008M2932R6402n4160j19659n7378
$$ 143771 128882 41759 19376 -83535 -179602 -92594 -49662 46740 -7420 -127079 -184457
$$ [...]
##END NTUPLES=NMR SPECTRUM
##END=
