##TITLE=Analysis number 308374
Compound Code cc 34809
Book Reference 39/157
Project Code adrs
Chemist Name evam
##JCAMPDX= 6.0         $$ Bruker NMR JCAMP-DX V2.0
##DATA TYPE= NMR SPECTRUM
##DATA CLASS= NTUPLES
##ORIGIN= Bruker BioSpin GmbH
##OWNER= NMR
$$ XWIN-NMR		Version 3.5
$$ Tue May 24 11:49:34 2005 GMT Daylight Time (UT+1h)  MAYBRIDGE\NMR@NMR_250MHZ
##.OBSERVE FREQUENCY= 250.131544655141
##.OBSERVE NUCLEUS= ^1H
##.ACQUISITION MODE= SIMULTANEOUS (DQD)
##.ACQUISITION SCHEME= undefined
##.AVERAGES= 16
##.DIGITISER RES= 18
##SPECTROMETER/DATA SYSTEM= dpx250
##.PULSE SEQUENCE= zg30
##.SOLVENT NAME= DMSO
##.SHIFT REFERENCE= (INTERNAL, DMSO, 0, 16.522)
##AUDIT TRAIL= $$ (NUMBER, WHEN, WHO, WHERE, WHAT)
$$ ##TITLE= Audit trail, XWIN-NMR		Version 3.5
$$ ##JCAMPDX= 5.01
$$ ##ORIGIN= Bruker BioSpin GmbH
$$ ##OWNER= NMR
$$ C:\u/data/dgb/nmr/ADRS/3370/pdata/1/auditp.txt
$$ ##AUDIT TRAIL=  $$ (NUMBER, WHEN, WHO, WHERE, WHAT)
(   1,<2005-05-24 11:49:13.29 +100>,<MAYBRIDGE\NMR>,<NMR_250MHZ>,
      <created by zg, POWCHK disabled, PULCHK disabled
       configuration hash MD5:
       62 19 C7 07 E1 42 D1 B7 37 6C 3D D0 77 39 F9 E6
       data hash MD5: 64K
       94 95 E8 C8 82 77 BF A8 37 E4 E3 E4 90 5A 4B 70>)
(   2,<2005-05-24 11:49:25.48 +100>,<MAYBRIDGE\NMR>,<NMR_250MHZ>,
      <Start of raw data processing
       ef LB = 0.3 FT_mod = 6 PKNL = 1 SI = 32K 
       data hash MD5: 32K
       DB D4 82 72 CB E9 9D CD 73 7F B2 0B 2C 7E BF C0>)
(   3,<2005-05-24 11:49:27.23 +100>,<MAYBRIDGE\NMR>,<NMR_250MHZ>,
      <apk 
       data hash MD5: 32K
       F5 CD 2A 4F 8A 96 03 33 0C 55 EC 36 44 18 72 F3>)
(   4,<2005-05-24 11:49:28.02 +100>,<MAYBRIDGE\NMR>,<NMR_250MHZ>,
      <abs ABSG = 5 
       data hash MD5: 32K
       CB 47 38 20 21 66 DD 80 D3 83 12 F8 74 8B C7 88>)
$$ ##END=
$$ 
$$ hash MD5
$$ 0D 70 26 4E 6F 19 DE 27 F4 E9 AB 9D 9D B1 2E 97
##$RELAX= 
##$RELAX= 
##$RELAX= 
##$RELAX= 
##$RELAX= 
##$RELAX= 
##$RELAX= 
$$ Bruker specific parameters
$$ --------------------------
##$DU= <C:\u>
##$EXPNO= 3370
##$NAME= <ADRS>
##$PROCNO= 1
##$TYPE= <nmr>
##$USER= <dgb>
##$AMP= (0..31)
100 100 100 100 100 100 100 100 100 100 100 100 100 100 100 100 100 100 
100 100 100 100 100 100 100 100 100 100 100 100 100 100 
##$AQSEQ= 0
##$AQ_mod= 3
##$AUNM= <au_zg>
##$AUTOPOS= <22 >
##$BF1= 250.13
##$BF2= 250.13
##$BF3= 250.13
##$BF4= 250.13
##$BF5= 500.13
##$BF6= 500.13
##$BF7= 500.13
##$BF8= 500.13
##$BYTORDA= 1
##$CFDGTYP= 0
##$CFRGTYP= 5
##$CHEMSTR= <none>
##$CNST= (0..31)
1 1 145 1 1 1 1 1 1 1 1 1 1 1 1 1 1 1 1 1 1 1 1 1 1 1 1 1 1 1 1 1 
##$CPDPRG= <>
##$CPDPRG1= <>
##$CPDPRG2= <>
##$CPDPRG3= <>
##$CPDPRG4= <mlev>
##$CPDPRG5= <mlev>
##$CPDPRG6= <mlev>
##$CPDPRG7= <mlev>
##$CPDPRG8= <mlev>
##$CPDPRGB= <>
##$CPDPRGT= <>
##$D= (0..31)
0 1 0 0 0 0 0 0 0 0.06 0 0 0 0 0 0 0.0002 0 0 0 0 0 0 0 0 0 0 0 0 0 0 
0 
##$DATE= 1116931752
##$DBL= (0..7)
120 120 120 120 120 120 120 120 
##$DBP= (0..7)
150 150 150 150 150 150 150 150 
##$DBP07= 0
##$DBPNAM0= <>
##$DBPNAM1= <>
$$ [...]
##$SUBNAM7= <"">
##$SUBNAM8= <"">
##$SUBNAM9= <"">
##$SW= 20.6930455092707
##$SWIBOX= (0..15)
0 0 3 0 0 0 0 0 0 0 0 0 0 0 0 0 
##$SW_h= 5175.983436853
##$TD= 65536
##$TD0= 1
##$TE= 295.16
##$TE2= 300
##$TE3= 300
##$TEG= 300
##$TL= (0..7)
0 120 120 120 120 120 120 120 
##$TP= (0..7)
150 150 150 150 150 150 150 150 
##$TP07= 0
##$TPNAME0= <>
##$TPNAME1= <>
##$TPNAME2= <>
##$TPNAME3= <>
##$TPNAME4= <>
##$TPNAME5= <>
##$TPNAME6= <>
##$TPNAME7= <>
##$TPOAL= (0..7)
0.5 0.5 0.5 0.5 0.5 0.5 0.5 0.5 
##$TPOFFS= (0..7)
0 0 0 0 0 0 0 0 
##$TUNHIN= 0
##$TUNHOUT= 0
##$TUNXOUT= 0
##$USERA1= <user>
##$USERA2= <user>
##$USERA3= <user>
##$USERA4= <user>
##$USERA5= <user>
##$V9= 5
##$VALIST= <valist>
##$VCLIST= <CCCCCCCCCCCCCCC>
##$VD= 0
##$VDLIST= <DDDDDDDDDDDDDDD>
##$VPLIST= <PPPPPPPPPPPPPPP>
##$VTLIST= <TTTTTTTTTTTTTTT>
##$WBST= 1024
##$WBSW= 4
##$XGAIN= (0..3)
0 0 0 0 
##$XL= 0
##$YL= 0
##$YMAX_a= 451404
##$YMIN_a= -552521
##$ZGOPTNS= <>
##$ZL1= 120
##$ZL2= 120
##$ZL3= 120
##$ZL4= 120
##$ABSF1= 16.522
##$ABSF2= -4.171173
##$ABSG= 5
##$ABSL= 3
##$ALPHA= 0
##$AQORDER= 0
##$ASSFAC= 0
##$ASSFACI= 0
##$ASSFACX= 0
##$ASSWID= 0
##$AUNMP= <proc_1d>
##$AZFE= 0.1
##$AZFW= 0.1
##$BCFW= 0
##$BC_mod= 0
##$BYTORDP= 0
##$COROFFS= 0
##$CY= 12.5
##$DATMOD= 1
##$DC= 0
##$DFILT= <>
##$DTYPP= 0
##$F1P= 14.0000005364418
##$F2P= -0.99999901652339
##$FCOR= 0.5
##$FTSIZE= 32768
##$FT_mod= 6
##$GAMMA= 0
##$GB= 0
##$INTBC= 1
##$INTSCL= 1
##$ISEN= 128
##$LB= 0.3
##$LEV0= 0
##$LPBIN= 0
##$MAXI= 10000
##$MC2= 0
##$MEAN= 0
##$ME_mod= 0
##$MI= 0
##$NCOEF= 0
##$NC_proc= -2
##$NLEV= 6
##$NOISF1= 0
##$NOISF2= 0
##$NSP= 0
##$NTH_PI= 0
##$NZP= 0
##$OFFSET= 16.522
##$PC= 1
##$PHC0= -86.23335
##$PHC1= 6.84444
##$PH_mod= 1
##$PKNL= yes
##$PPARMOD= 0
##$PSCAL= 4
##$PSIGN= 0
##$REVERSE= no
##$SF= 250.13
##$SI= 32768
##$SIGF1= 0
##$SIGF2= 0
##$SINO= 400
##$SIOLD= 32768
##$SREGLST= <1H.DMSO>
##$SSB= 0
##$STSI= 32768
##$STSR= 0
##$SW_p= 5175.98343685301
##$SYMM= 0
##$S_DEV= 0
##$TDeff= 65536
##$TDoff= 0
##$TI= <Analysis number 999999
Compound Code 99
Book Reference 9
Project Code 9>
##$TILT= no
##$TM1= 0
##$TM2= 0
##$TOPLEV= 0
##$USERP1= <user>
##$USERP2= <user>
##$USERP3= <user>
##$USERP4= <user>
##$USERP5= <user>
##$WDW= 1
##$XDIM= 32768
##$YMAX_p= 301980076
##$YMIN_p= -361262
$$ End of Bruker specific parameters
$$ ---------------------------------
##NTUPLES= NMR SPECTRUM
##VAR_NAME=  FREQUENCY,     SPECTRUM/REAL,   SPECTRUM/IMAG
##SYMBOL=    X,             R,               I
##VAR_TYPE=  INDEPENDENT,   DEPENDENT,       DEPENDENT
##VAR_FORM=  AFFN,          ASDF,            ASDF
##VAR_DIM=   32768,         32768,           32768
##UNITS=     HZ,            ARBITRARY UNITS, ARBITRARY UNITS
##FACTOR=    0.157963299565203, 1,           1
##FIRST=     4132.6476996994, 0,             0
##LAST=      -1043.33573715361, 0,           0
##MIN=       -1043.33573715361, -361262,     0
##MAX=       4132.6476996994, 301980076,     0
$$ Real data points
##PAGE= N=1
##DATA TABLE= (X++(R..R)), XYDATA
$$ [...]
17176a4772J1494j384J2923o410L716J3590m109m668k0468n157q35l277J2373
17163f984l554N053k861r29k981J338J42J369J343k76j08k371j0406o237N432
17148b2030N135nj534L694L923q40M935r76O153L467N984q532L21R241J0544p69
17132A8711L885O71O326M03j4537j1610l37J46j4065J4254n32j0662j518r37N51
17117i251P387K198P060q207m202N908k771N878K829m805K342O874L001n951j445
17102F845n644O190N691L553q090k529j3363n620m252J2917O286k4247P68Q253
17088a3242l379n771p774n943R71P473P681p52m04K284J1062m323m819l904k858
17073b3698J44L407r56r07m829J2684R13j652l647n417N837L01J2998l86r708
$$ plain form
17176 -14772 -3278 -4662 8261 1851 5567 19157 15048 10380 -10088 -15245 -16080 -19357 -6984
17163 -6984 -10538 -5485 -8346 -9275 -12256 -10918 -10776 -9407 -8064 -8340 -8448 -10819 -21225 -27462 -22030
17148 -22030 -16895 -16900 -18434 -14740 -10817 -11657 -6722 -7698 -1545 1922 7906 -626 -305 8936 19480 18711
17132 18711 22596 23267 29593 29996 15459 3849 3512 3658 -10407 3847 3315 -7347 -8865 -9802 -9251
17117 -9251 -1864 334 7394 -813 -5015 893 -1878 4000 6829 2024 4366 11240 14241 8290 6845
17102 6845 1201 7391 13082 16635 8545 6016 -7347 -12967 -17219 -4302 1984 -22263 -21495 -13242
17088 -13242 -16621 -22392 -30166 -36109 -35138 -27665 -19984 -20736 -21140 -18856 -7794 -12117 -16936 -20840 -23698
17073 -23698 -23554 -20147 -21103 -22010 -26839 -14155 -13242 -14894 -18541 -23958 -18121 -17820 -4822 -5208 -14916
17058a4916j1079j0148n379J4083J4993R084P173K650m041J909l593p174r371
17045a5809L924J3090J324j968n827o019K615l965j0333j1616J957l111K5050
17032a0688R856k162o597r190k560J030L095j279K27K5093J1420k1439k6187m808
17018c4189J4656O192j028J0813l934l505N115o246q301q154J4942J3994Q975
17005I330j3366j7427L467L487m812p682Q019J0328M510N39j6978m609m507P098
16991b2603L506J550l245N266L346L297R857P97l426l117M603J0927p238q069
16977d549j555K86J0882L185j1434q553n389k22m014O35N35o626P451M660m278
16962a8986J703J1466J2164m027q646m963n151M355J0794N278j1383j0254J1541
$$ plain form
17058 -14916 -25995 -36143 -41522 -27439 -12446 -3362 3811 6461 2420 4329 736 -6438 -15809
17045 -15809 -11885 1205 2529 561 -5266 -11285 -8670 -12635 -22968 -34584 -32627 -35738 -10688
17032 -10688 -832 -2994 -9591 -18781 -21341 -20311 -17216 -18495 -18268 6825 18245 -3194 -29381 -34189
17018 -34189 -19533 -13341 -14369 -3556 -7490 -10995 -5880 -12126 -20427 -28581 -13639 355 9330
17005 9330 -4036 -21463 -17996 -14509 -19321 -27003 -18984 -8656 -4146 -3607 -20585 -25194 -29701 -22603
16991 -22603 -19097 -17547 -20792 -15526 -12180 -8883 974 1771 -1655 -4772 -169 10758 3520 -4549
16977 -4549 -6104 -5818 5064 8249 -3185 -11738 -17127 -17349 -21363 -20728 -20193 -26819 -19368 -14708 -18986
16962 -18986 -17283 -5817 6347 2320 -6326 -11289 -16440 -12085 -1291 3987 -7396 -17650 -6109
16949f109L646N531J1566r008j0676l797k051n823J0084J8085l885j987j341k838
16935A397o044n513m979k736R130M78Q058P806l083k68p936o090M259J578o6j2402
16919a6411k205m959P734l136o594o85P983J253L426J3279O563j3905k3945K999
16905b8603J7918N605P289m330k251J3324K0329j1269r515q407L37o54q637k598
16891a1462j689J493K809P703r93P384j616o148K255p424l70N722m088r012j2848
16876b8284J197J3683N232R886P550k850n324m477O197K614L066J3871K244o977
16862A7628m681p83J26n213m894j782m914o495M217p382P449p626r739K221J5359
16847f509J7680j3175l15J3942R514N619l212j232q080j0537p657l652K381P1
$$ plain form
16949 -6109 -2463 3068 14634 5626 -5050 -8847 -10898 -16721 -6637 11448 7563 5576 4235 1397
16935 1397 -4647 -10160 -15139 -17875 -8745 -8267 -209 7597 4514 4246 -3690 -9780 -5521 -3943 -4009 -16411
16919 -16411 -18616 -23575 -15841 -18977 -25571 -26256 -18273 -17020 -13594 -315 6248 -7657 -31602 -28603
16905 -28603 -10685 -5080 2209 -2121 -4372 8952 29281 18012 8497 90 427 -227 -8864 -11462
16891 -11462 -13151 -11658 -8849 -1146 -2139 5245 3629 -2519 -264 -7688 -8058 -2336 -6424 -15436 -28284
16876 -28284 -27087 -13404 -8172 1714 9264 6414 1090 -3387 2810 5424 8490 22361 24605 17628
16862 17628 12947 12164 12290 7077 2183 401 -4513 -11008 -6791 -14173 -6724 -14350 -24089 -21868 -6509
16847 -6509 11171 -2004 -2319 11623 21137 26756 23544 22312 14232 3695 -3962 -7614 -5233 -5162
16833e162j11K465N35P037l360j5526j2432n310J0216J3580J0267R97M303n810
16819A689r292L611P127l722R105M126p279l329l586k058o317Q83Q600L970j952
16804A576n903q781j1535l614o164J2665J1877J4464J654r939M302r586l494K270
16790a0208m047j9887k782J3967m000P962k404n668J8022P473K011Q794p179q481
16776f427k809j361j1121L770P760L343j591K33j1714m737q80J2798M140k87l794
16761a2677n07l61l026K328k651M382l14M418l515l903K302P090R180j296j2648
16746a1198r196m377J357O563m310L821L24r054r255L568N262J2546J6215m479
16732b213l347N278l039l156M849L296l716q956p921o693k034k960M563J9030
$$ plain form
16833 -5162 -5273 -2808 -2273 4764 1404 -14122 -26554 -31864 -21648 -8068 2199 3196 7499 1689
16819 1689 -7603 -3992 3135 -587 8518 12644 5365 2036 -1550 -3608 -9925 -9042 -442 3528 1576
16804 1576 -4327 -13108 -24643 -28257 -34421 -21756 -9879 4585 6239 -3700 602 -8984 -12478 -10208
16790 -10208 -14255 -34142 -36924 -22957 -26957 -18995 -21399 -27067 -9045 -1572 439 9233 2054 -6427
16776 -6427 -9236 -10597 -21718 -17948 -10188 -6845 -8436 -8203 -19917 -24654 -25534 -12736 -8596 -8883 -12677
16761 -12677 -13184 -13545 -16571 -14243 -16894 -12512 -12826 -8408 -11923 -15826 -13524 -6434 2746 1450 -11198
16746 -11198 -20394 -24771 -23414 -16851 -21161 -17340 -17016 -26070 -35325 -31757 -26495 -13949 2266 -2213
16732 -2213 -5560 -282 -3321 -6477 -1628 1668 -2048 -11004 -18925 -25618 -27652 -30612 -26049 -7019
16718g019K885Q95N886o420n810J2892J8062q814p691r096M411j071r3n564m114
16703a0661N301j3724q538R061P635L271j447J4818L857n079m2n886j1226k26
16689a2886K826J7406k176p294j1313p674o201L900n852R582M258M353l871N062
16675i880m131Q46k711O869N985q936n198O983j794J0030K526R26q485r891J1393
16660e468J971J384O663j1762p203N804J6584J8372p276j1890j5408m458P155
16647e532M355j90m71N654R154p755j1770p740J508L604k627L158l897o309K634
16632a6224n331P190O880j78p593l082m860J3593J3640k329J0064q941n064L447
16618A212R717q09j0036j8258J0680K677j78j538j631J444j3774o668M140J7883
$$ plain form
16718 -7019 -4134 -3239 2647 -3773 -9583 3309 21371 12557 4866 -4230 181 -890 -983 -6547 -10661
16703 -10661 -5360 -19084 -27622 -18561 -10926 -7655 -9102 5716 9573 4494 4452 -1434 -12660 -12886
16689 -12886 -10060 7346 5170 -2124 -13437 -21111 -27312 -23412 -29264 -19682 -15424 -11071 -14942 -9880
16675 -9880 -14011 -13165 -15876 -9007 -3022 -11958 -17156 -10173 -11967 -1937 589 1515 -6970 -16861 -5468
16660 -5468 -3497 -2113 4550 -7212 -14415 -8611 7973 26345 19069 7179 -8229 -12687 -5532
16647 -5532 -1177 -1367 -1838 3816 12970 5215 -6555 -14295 -12787 -9183 -11810 -8652 -12549 -18858 -16224
16632 -16224 -21555 -14365 -7485 -7663 -15256 -18338 -23198 -9605 4035 1706 11770 2829 -2235 1212
16618 1212 10929 10120 84 -18174 -7494 -4817 -4995 -6533 -8164 -6720 -20494 -27162 -23022 -5139
16604e139J9700n826o611j3642M66O910K795R431k907M865Q855l64k237n230l923
16589G143l742j4256o526m936J0119J8690Q682K087j2689r227Q518P672M40o184
16575E791j470l167n182p623M641o170j1405K99J0486O351r429R755O877n761
16561f007L011p810P60n046j506M4m946Q584J4398K340k031O354r597n427l684
16546a0563N808K719M629l011k0251K066J6130l251n677k895M582O872R144L235
16532I537j2232j2997J1603J4403k590n409n26K772m089r512P511k333q951Q356
16518d457J6359O754r394q378j0290j7606n486L559L105L397m57J865n292J190
16504b5131N307K76J3785M799N241N942j3368p596R226K947k905J366l052n604
$$ plain form
16604 -5139 14561 8735 2124 -11518 -11052 -4142 -1347 8084 5177 10042 18897 18533 16296 11066 7143
16589 7143 3401 -10855 -17381 -22317 -12198 6492 15174 17261 4572 -4655 3863 11535 11975 5791
16575 5791 4321 1154 -4028 -11651 -7010 -13180 -24585 -24286 -13800 -7449 -16878 -7123 -246 -6007
16561 -6007 -2996 -10806 -10046 -15092 -16598 -16554 -21500 -12916 1482 3822 1791 8145 -1452 -6879 -10563
16546 -10563 -4755 -2036 2593 -418 -20669 -18603 -2473 -5724 -11401 -14296 -9714 -2842 6302 9537
16532 9537 -2695 -15692 -4089 10314 7724 2315 1789 4561 472 -9040 -1529 -3862 -12813 -4457
16518 -4457 11902 18656 9262 884 -9406 -27012 -32498 -28939 -25834 -22437 -22894 -21029 -26321 -25131
16504 -25131 -19824 -19548 -5763 -964 4277 10219 -3149 -10745 -1519 1428 -1477 -111 -3163 -8767
16490h767j0515l247J932L004L190p69M478n139m433K471q60k340M331R065m871
16475a2470m87J839P52K03j240k255P37N29R528O474J80j2161j2106k26K709K1352
16459C358K243M928J3454J0691j7992q582Q04n108l054m435J0681N600j0448j8056
16445a5916n864l704J2209K0982R02l864j1587K281O694O463n652K788L674m104
16431E302m208j7409k017J1017k800n655r337J1982J4251L75N997O193L156r492
16417G355o747o21l078j6184m160J3179J5550j6276L354R646N988n884j4470p409
16403a9757L883M356J099J6134Q805J777N389L35j5683J648N073J296J930O35
16389A6920j0463n339o635j5585L132J2299J0458j925L670j4040n336j2814k664
$$ plain form
16490 -8767 -19282 -22529 -20597 -17593 -14403 -15172 -10694 -15833 -20266 -17795 -18655 -20995 -16664 -7599 -12470
16475 -12470 -12957 -11118 -10366 -10163 -11403 -13658 -12921 -12392 -2864 3610 3790 -8371 -20477 -20703 -17994 3358
16459 3358 5601 10529 23983 34674 16682 8100 8904 3796 742 -3693 6988 12588 2140 -15916
16445 -15916 -21780 -25484 -13275 7707 8609 4745 -6842 -4561 2133 8596 2944 5732 9406 5302
16431 5302 1094 -16315 -18332 -7315 -10115 -15770 -25107 -13125 1126 1501 7498 13691 16847 7355
16417 7355 608 -13 -3091 -19275 -23435 -10256 5294 -10982 -7628 2018 8006 2122 -12348 -19757
16403 -19757 -15874 -11518 -10419 5715 14520 16297 21686 22021 6338 7986 13059 14355 16285 16920
16389 16920 6457 1118 -5517 -21102 -17970 -5671 4787 2862 6532 -7508 -12844 -25658 -28322
16376b8322R037J5665j400O300N370J561j3989r390O164J2665m360j245p380l183
16362a2507R193O179J486n796j545j434N108K195J2776p3m447o105j2863q828
16348a6661M637Q596J1022r806j1342Q28l618k045j205k963M807k102R007M703
16334f142n822o977j837M172k501J0482R019M869m624j090j4428j73m419l344
16320b2815J578R966j865j3434R443P012M657J2053p270P81P290J5343l784j0443
16306H512j8525k958M938J0831k716m126p448o280m308P005M533L806J134J682
16292c920l637J2430l398k226Q75j949j3263o785J083j1007J092J4089R390J7268
16278A0042P118N098j4542j3413p203J628M481K124M314j4751j4698J1225J3045
$$ plain form
16376 -28322 -19285 -3620 -5020 1280 6650 8211 -5778 -15168 -9004 3661 -699 -1944 -9324 -12507
16362 -12507 -3314 2865 4351 -1445 -2990 -4424 684 2879 15655 15582 11135 5030 -7833 -16661
16348 -16661 -12024 -3428 7594 -2212 -13554 -12726 -16344 -18389 -19594 -22557 -17750 -19852 -10845 -6142
16334 -6142 -11964 -18941 -20778 -16606 -19107 -8625 394 5263 639 -451 -14879 -15052 -19471 -22815
16320 -22815 -21237 -11271 -13136 -26570 -17127 -10115 -5458 6595 -675 106 7396 22739 18955 8512
16306 8512 -10013 -12971 -8033 2798 82 -4044 -11492 -17772 -22080 -15075 -10542 -6736 -5602 -3920
16292 -3920 -7557 4873 1475 -751 124 -1825 -15088 -21873 -20790 -31797 -30705 -16616 -7226 10042
16278 10042 17160 22258 7716 -5697 -12900 -11272 -6791 -4667 -353 -15104 -29802 -18577 -5532
16265e532R002R976k79k869q611K509q563j1972k553k220l281L571J5183J0937
16251E298j830j1102P661r167l436J1169J1155m575M875Q004j683j258j1658j9230
16237a5777J529J3969J956J1603K580n444m63P312o76j4404o607M39J4257J1724
16223B1998n999j1043j1708j3429K426J3412L125k060p460O700n101j276j460
16210a1875N892L608n613j5231M751J0386L489J4246j770q621o873o015n432j0694
16196b9752p987k669Q840K9735Q512o648j0284Pl910o723J7844q702r101K0710
16182a28J7121m392q515o763q798m502P07J1336N905l619m538o013K490R85J459
16167g265p105O499K448J0458R95j5553n995p23O815R506R821L231p65L495o301
$$ plain form
16265 -5532 3470 13446 13167 10298 1687 4196 -4367 -16339 -18892 -21112 -24393 -20822 -5639 5298
16251 5298 3468 -7634 27 -9140 -12576 -1407 9748 5173 10048 18052 16369 15111 3453 -15777
16237 -15777 -14248 -279 1677 13280 15860 10416 9953 17265 16589 2185 -4422 -3983 10274 21998
16223 21998 15999 4956 -6752 -20181 -17755 -4343 -1218 -3278 -10738 -4038 -9139 -10415 -11875
16210 -11875 -5983 -2375 -7988 -23219 -18468 -8082 -4593 9653 7883 -738 -7611 -13626 -19058 -29752
16196 -29752 -37739 -40408 -31568 -1833 6679 31 -10253 -10246 -14156 -20879 -3035 -11737 -20838 -128
16182 -128 16993 12601 4086 -2677 -11475 -15977 -15270 -3934 1971 -1648 -6186 -12199 -9709 -8724 -7265
16167 -7265 -14370 -7871 -5423 5035 6030 -9523 -15518 -16241 -9426 80 9901 13132 12367 15862 9561
16152I561q414M668Q639o722j4386j790M998O05M667k934m649j484P801n73N44
16137E31p424l543q053k575m780P02K5n339J3875o900j224J3452K077L088N497
16122e91J2361r323K690Q581J4366L248j5231j0621O427q12L514M060j1295j3380
16108f006L621l978r984l528J798m038N487J3650O666k19Q089M321q74R57K117
16093A8079Q79o689m825l389l823j8351j826j577J562K921Q522N016m659j646
16079i806l750l971p311R177K4160J2452j5892K488j082L542K959k0220n36K309
16065e481O547j1449p72L369o469k263p013O626Q383P085O164l75j6615m232K442
16050a4053J1251O814j0361m26r13K893L282k478m636l407o674J564J5464m803
$$ plain form
16152 9561 1147 5815 14454 7732 -6654 -8444 -3446 -2841 1826 -1108 -5757 -7241 560 -13 531
16137 531 -6893 -10436 -18489 -21064 -25844 -25142 -25117 -30456 -16581 -23481 -24705 -11253 -9176 -6088 -591
16122 -591 11770 2447 5137 13718 28084 31332 16101 5480 11907 11095 14609 18669 7374 -6006
16108 -6006 -2385 -6363 -16347 -19875 -18077 -22115 -16628 -2978 3688 3469 11558 15879 15005 15962 18079
16093 18079 18958 12269 7444 4055 232 -18119 -19945 -21522 -19960 -17039 -8517 -3501 -8160 -9806
16079 -9806 -13556 -17527 -24838 -15661 8499 20951 5059 7547 6465 10007 12966 -7254 -7790 -5481
16065 -5481 1066 -10383 -11155 -7786 -14255 -16518 -23531 -16905 -8522 -1437 4727 4352 -12263 -16495 -14053
16050 -14053 -2802 4012 -6349 -6775 -7688 -4795 -1513 -3991 -8627 -12034 -18708 -17144 -1680 -6483
16036f483j805O9j830P165Q60O43O404O874O573m686j0743m651Q628K4j3762j3504
16020b0224R953J0814m185N683J1550N393J128j1221j6196j5132o802J43J7678
16007a1418R144O144R435k905J559j544j6250q092L474k245k486M4L685K563R103
15992B11L333q91n919J903q757p691J1077M917P096N621k177q495n94K074j7475
15977a5767j383K684m300O099N898r67j681J729M618Q059O078j2427k279J790
15963a849k609M286k546j2874r938J4687P918l512J1672j0451j1260O342L321
15950f813P547M540p565P561J3646Q690j0565k0008j4609k683n739L54P770J2189
15936e685R730J251j845o300j4647J0674Q421n769j1866J3516R616l780o179K237
$$ plain form
16036 -6483 -8288 -8219 -10049 -2884 -2024 -1381 5023 11897 18470 13784 3041 -1610 7018 7042 -6720 -20224
16020 -20224 -10271 543 -3642 2041 13591 18984 20112 8891 -7305 -22437 -29239 -29096 -11418
16007 -11418 -2274 3870 13305 10400 11959 10415 -5835 -13927 -10453 -12698 -15184 -15140 -11455 -8892 211
15992 211 3544 2653 -3266 -1363 -10120 -17811 -6734 -1817 5279 10900 8723 228 -366 1708 -15767
15977 -15767 -17150 -14466 -18766 -12667 -6769 -7736 -9417 -7688 -3070 4989 11067 -1360 -3639 -1849
15963 -1849 -4458 -172 -2718 -15592 -25530 -10843 -2925 -6437 5235 -5216 -16476 -10134 -6813
15950 -6813 734 5274 -2291 5270 18916 27606 17041 -2967 -17576 -20259 -25998 -25644 -17874 -5685
15936 -5685 4045 5296 3451 -2849 -17496 -6822 1599 -4170 -16036 -2520 7096 3316 -2863 -626
15922f26n244q68j577L491J0108p048n14J6534r7j1276k442q105k410J2595m612
15907b091k122j3386n946J549m028m095P495O723J4142k320p88l41j948K352q720
15892a3524j3458l434j72O329O661R651L866K429K149n180M937O675m726n514
15878c311Q368J0739r641j453r003p390K1071N153q611j4592L070J1147L469J416
15864A0432L951m340j3803j0451J4989J1255k0643R727k170j3352j1753k508L3
15851b8633R883J1152o129K476k764P218O661K027O869m236p837n442j0882J1259
15837h378Q718K808q279M99Q064O842M532L173j1412j7158r954l367j5949J753
15823c8108O379Q289Q802P541L871J0941k079o147M399K538j4018m650k954j1803
$$ plain form
15922 -626 -5870 -6738 -8315 -4824 5284 -1764 -2278 14256 14159 2883 441 -7664 -10074 2521 -2091
15907 -2091 -4213 -17599 -23545 -21996 -26024 -30119 -22624 -15901 -1759 -4079 -4867 -5208 -7156 -4804 -13524
15892 -13524 -26982 -30416 -30588 -24259 -17598 -7947 -4081 -1652 497 -4683 254 6929 2203 -3311
15878 -3311 5057 15796 6155 4702 -4301 -11691 9380 14533 5922 -8670 -5600 5547 9016 10432
15864 10432 14383 10043 -3760 -14211 778 12033 -8610 1117 -1053 -14405 -26158 -28666 -28633
15851 -28633 -18750 -7598 -13727 -11251 -14015 -6797 -136 1891 8760 4524 -3313 -8755 -19637 -8378
15837 -8378 340 3148 -5131 -4632 3432 10274 14806 17979 6567 -10591 -20545 -23912 -39861 -38108
15823 -38108 -31729 -23440 -14638 -7097 -3226 7715 5636 -511 3888 6426 -7592 -12242 -15196 -26999
15809b6999p468K2822R899O713m113P500M05J5354k562j754l74Q091K462j6508
15795A3468q461j594k910J0476n313o618J237L243R608R301J664L101J0894k73
15781C7823o583j0176j6212j1534R303J1136L681n057k813j2126J3599m558k222
15768D261O930Q735q297q647l72p527J627J4896J2422k390j079Q801P469J5639
15754E2468K9334M0206P5369J33684K49803K78783Q9340j21235k91176k07078
15744C29498j17228p7340l8740k0626k1870k3200j3658r427k335J958N386P173
15732A9591O715p970j3813j5438p477J1795J2064k25j4857o849k696M043J1445
15719c672J3038j1850p126m93L936l791K908o912O045J5452L016j294N331K424
$$ plain form
15809 -26999 -34467 -11645 -1746 4967 854 8354 8759 24113 21551 19797 19423 27514 29976 13468
15795 13468 5007 3413 503 10979 5666 -952 285 3528 13136 22437 24101 27202 38096 37823
15781 37823 31240 21064 4852 -6682 2621 13757 17438 12381 9568 -2558 11041 6483 4261
15768 4261 11191 19926 11629 2982 2610 -4917 -3290 11606 24028 21638 20559 29360 36829 52468
15754 52468 81802 122008 197377 331061 580864 859647 948987 827752 536576 329498
15744 329498 212270 134930 96190 75564 53694 30494 16836 7409 5074 7032 12418 19591
15732 19591 26306 18336 4523 -10915 -18392 -6597 5467 5242 -9615 -16464 -19160 -15117 -3672
15719 -3672 9366 -2484 -9610 -10103 -6167 -9958 -7050 -13962 -7917 7535 10551 9257 14588 17012
15705A7012j173j4368j8763l890R680J0461j889j55l292q104j2192o792M248J6824
15691a2393K306j0739M064R455L918j1638j569J3040P731K95p459j161M037J6018
15677A5905J3329P180k0391k2736j5506O356J5114J3469p434j847l479l560M459
15664H59L175m729k902L731J488j453n62k263J0889l733o920m820J248L513m635
15649g114P457J1987j924j0604o356L353J084k579m143J2710k188m003m261Q032
15635A451m895L468M542n499O74o932k12J9716J2905j9166j0075q42J1666l369
15621C432j6510P062N263K980Q753j150j2576J2432J3215J0065j5383j3556j3415
15608i388M81R607J4013j0795O145R590Q698q94N68K192q379j3431l341J0067
$$ plain form
15705 17012 15839 1471 -17292 -21182 -11502 -1041 -2930 -3085 -6377 -14481 -26673 -33465 -29217 -12393
15691 -12393 -10087 -20826 -16762 -7307 -3389 -15027 -16596 -3556 4175 4470 -2989 -4150 -113 15905
15677 15905 29234 36414 16023 -6713 -22219 -15863 -749 12720 5286 3439 -40 -3600 859
15664 859 4034 -695 -3597 134 1622 169 -393 -2656 8233 4500 -2420 -7240 -5992 -2479 -7114
15649 -7114 343 12330 10406 -198 -6554 -3201 -2117 -4696 -8839 3871 1683 -2320 -6581 1451
15635 1451 -3444 24 4566 -933 -259 -7191 -7403 12313 25218 6052 -4023 -4865 6801 3432
15621 3432 -13078 -6016 -753 2227 10980 9830 -2746 9686 22901 32966 17583 4027 -9388
15608 -9388 -8907 700 14713 3918 10063 19653 28351 27457 28025 30217 21838 8407 5066 15133
15594A5133L130j0322j1520m498P969J0421k193m867J1353J5691n620l811j0800
15581A0066l281K231m008j5063p475n985l193J5981O660P585J908j3859n039J4912
15567A440J0403m606l42K939j676j867J201Q972J714k767k693k979q596p070J291
15552d636J1229J8793k078k4566j9670J6068L529J444J2054P109o289r457l098
15539D32k961N115k628m069J213o556P41P979N232Q156N610o568K825l347j7227
15524f053j883N93j0265r22J1373M587q882N452L400n904J0118L021o666J3398
15510A1367R521L429k521o324j1755m095J2326M725o587p123p289r852m237k790
15496b1205M274j054J3183j0462n715J1490J884J5524Q756Q055o948k0575m617
$$ plain form
15594 15133 18263 7941 -3579 -8077 -108 10313 8120 3253 14606 30297 24677 20866 10066
15581 10066 6785 9016 5008 -10055 -17530 -23515 -26708 -10727 -4067 3518 5426 -8433 -13472 1440
15567 1440 11843 7237 6895 9834 8158 6291 7492 16464 18178 15411 12718 9739 1143 -5927 -4636
15552 -4636 6593 25386 23308 -1258 -20928 -4860 -1331 113 12167 19276 12987 3530 432
15539 432 -2529 2586 -42 -4111 -2898 -9454 -8713 -734 4498 12654 18264 11696 14521 11174 -6053
15524 -6053 -7936 -7343 -17608 -18530 -7157 -2570 -11452 -6000 -2600 -8504 1614 4635 -2031 11367
15510 11367 20888 24317 21796 15472 3717 -378 11948 16673 10086 2963 -4326 -14178 -18415 -21205
15496 -21205 -16931 -17985 -4802 -15264 -20979 -9489 -7605 7919 16675 24730 17782 -2793 -7410
15483g410N277M391o805l401O393j251J1131M301R772Q349K593o562j479q626
15469A6673j4858j387P734O932L292m014q548j6411j9064k3368j3712J0001M375
15456e2355J3641J6849J7363K9j177m169K554K36n272j1277K155J1583k047l547
15442a5434k962N720J1323J5136L841K115p613j9684j6793J1178l901k327P066
15429a2335J0351N972p445j3101K236L988o445r763j3312J0602o78J2531J5410
15416a989m464q880N438P619N93L812O21j0869K521Q487R438N272j0653j7014
15402a0068J083K719p229J810J003o14K679l542m412R560M081j208K151N216K269
15387E498J177N524N128m328L842J0057o857J263q428m531M556L583n99J3040
$$ plain form
15483 -7410 -2133 2258 -4547 -7948 -1555 -2806 8325 12626 22398 30747 33340 26778 25299 16673
15469 16673 1815 428 8162 15094 18386 14372 5824 -10587 -29651 -53019 -66731 -56730 -52355
15456 -52355 -38714 -21865 -4502 -4473 -5650 -9819 -7265 -7029 -12301 -23578 -21423 -9840 -11887 -15434
15442 -15434 -18396 -12676 -1353 13783 17624 19739 12126 -7558 -24351 -13173 -17074 -19401 -12335
15429 -12335 -1984 3988 -3457 -16558 -14322 -10334 -16779 -26542 -39854 -29252 -29930 -17399 -1989
15416 -1989 -6453 -15333 -9895 -2276 -1683 2129 2750 -8119 -5598 2889 12327 17599 6946 -10068
15402 -10068 -8985 -6266 -13495 -11685 -10682 -11296 -8617 -12159 -16571 -7011 -2930 -4138 -1987 3229 5498
15387 5498 6675 12199 17327 12999 16841 26898 20041 21304 12876 8345 12901 16484 15885 28925
15373B8925J0742J6292k622j2774j3116j0460P50J561N029K779m576l828J043
15360A9745p885n373j3671k684N998r59m53O30J479J789J3920L825m75j3564q519
15345f197r399l119O989O436N065J2999J1968J1263r517j37J4730J2716k341k934
15331D8522k730j2286l819p79j7494J342L274j2146o840J760l453o625J0281l362
15317d355j645k326J3005m74j2751p202j1437k941O487Q402J6003m576O936M165
15303G291J0588K682R961O961l513P894Q86K535L809l261q797r84j1997l789n611
15288A4655p239q764l411l309J4676J8252R327k29j6174p789L496K932J4403K715
15274C3541j0401j675O112O009n435m409l646J2819r039j2387O41J082R60O743
$$ plain form
15373 28925 39667 55959 53337 40563 27447 16987 17737 19298 24327 27106 22530 18702 19745
15360 19745 11860 6487 -7184 -9868 -3870 -4829 -5282 -4652 -3173 -1384 12536 16361 15886 2322 -6197
15345 -6197 -15596 -18715 -11726 -5290 -225 12774 24742 36005 26488 26351 41081 53797 51456 48522
15331 48522 45792 33506 29687 28908 11414 12756 16030 3884 -2956 -1196 -4649 -11274 -993 -4355
15317 -4355 -6000 -8326 4679 4205 -8546 -15748 -27185 -30126 -23639 -15237 766 -3810 3126 7291
15303 7291 17879 20561 30522 37483 33970 41864 42750 45285 49094 45833 37036 36052 24055 20266 14655
15288 14655 7416 -1348 -4759 -8068 6608 24860 34187 33958 17784 9995 13491 16423 30826 33541
15274 33541 23140 21465 27577 33586 28151 23742 20096 32915 23876 11489 12130 13212 14172 20915
15260B0915n103o378j1688K400P651P55L234J098p36j8920l0033l466K2865M0682
15246B3276L9021K2761j881k1614j6314K399J389J0483n164j6994n746j0584J0659
15233C1691l982M858K798O0Q123K862r922M898O842K991L28r014j573N431j62
15218D6229O875o13j2251j5632j2838R174Q462J9135J4886O928N666o482l50L81
15204F9570J5255K7862N048n420j2273j3407O75K948P407q080N219N543J7612
15191A17959J5251O623J0257J2350j998k641Q82J3336J1861J686O460J3164K4955
15178B30145K8424J4916K998K8309M8910M8307M4676P0657P9294P8312R9250J30963
15166I05161J78752K36897L25512M35593N46803P65147J131319J866355L133185
$$ plain form
15260 20915 15812 9434 -2254 146 7797 8552 11786 12884 12148 -6772 -36805 -40271 -17406 23276
15246 23276 62297 85058 83177 61563 45249 47648 49037 59520 54356 37362 31616 21032 31691
15233 31691 27709 32567 35365 35425 43548 46410 36488 41386 48228 51219 51547 42533 40960 46391 46229
15218 46229 53104 52491 40240 24608 11770 20944 29406 48541 63427 70355 76021 69539 69189 69570
15204 69570 84825 112687 117735 112315 100042 86635 87310 90258 97665 89585 94804 100347 117959
15191 117959 133210 139833 150090 162440 160442 157801 158683 172019 183880 185566 192026 205190 230145
15178 230145 258569 273485 276483 304792 353702 402009 446685 517342 596636 674948 774198 905161
15166 905161 1083913 1320810 1646322 2081915 2628718 3393865 4525184 6391539 9524724
15157I524724M930345O098376M327600J94556m028402n696606m622800l091409
15149G636384j964498j271948q30835n89005m30261l21521k49899j83067j23781
15140A671569r2424p2113m7758j7248J816K9110P1006J20213J53363K07323K79853
15129B304710L96674N55811P58534J027822J355249J976495L210293N554537R351122
15120B6491247J3598233J4113870N332212o087804j4560882j4008166q628425
15113A6250285m983194k975542j868887j252583q89918o61415n21013l96993l30292
15104B370448k79964j90752j41437j10452p7095m5507j1503J5841N4032Q1430
15094A665041J23472K02907K83921L88002N18775P21717J030171J579998K604542
$$ plain form
15157 9524724 14455069 20553445 24881045 25075601 21047199 15350593 10727793 7636384
15149 7636384 5671886 4399938 3569103 2980098 2549837 2228316 1978417 1795350 1671569
15140 1671569 1579145 1507032 1459274 1442026 1443842 1472952 1543958 1664171 1817534 2024857 2304710
15129 2304710 2701384 3257195 4015729 5043551 6398800 8375295 11585588 17140125 26491247
15120 26491247 40089480 54203350 59535562 53447758 38886876 24878710 16250285
15113 16250285 11267091 8291549 6422662 5170079 4280161 3618746 3097733 2700740 2370448
15104 2370448 2090484 1899732 1758295 1647843 1570748 1525241 1513738 1529579 1583611 1665041
15094 1665041 1788513 1991420 2275341 2663343 3182118 3903835 4934006 6514004 9118546
15085I118546M259846O174706O310323K884398k093729o003814o327237m522689
15077I800350k897236j825224j188825p92301n85690m39856l35375k75871k16792
15068A243180j83312j43861j16352q7114o2241n4295n2604n8397n1621l3250l4229
15057C65904k2389k5495k6163j0109j7438j8402k4486k1543l177J4594P290j7667
15045B00919n166j6900n915p378j9080q447m029j985L388j6835o284P067J2538
15032A31893q524o730j8292j6956n052J4432N256o828J0922p661M504L003j848
15019I8119M636p436j6630j0378l883o751N15L539J921j3357o327J7338P237j4198
15005E4345o08J433n500K535r26L787O284m927n90j902P972j964j7710j0152l311
$$ plain form
15085 9118546 13378392 19553098 25863421 28747819 26654090 20650276 14323039 9800350
15077 9800350 6903114 5077890 3889065 3096764 2511074 2071218 1735843 1459972 1243180
15068 1243180 1059868 916007 799655 712541 650300 596005 543401 485004 433383 400133 365904
15057 365904 343515 318020 291857 281748 264310 245908 221422 199879 196702 211296 218586 200919
15045 200919 195753 178853 172938 165560 146480 138033 134004 132019 135407 118572 112288 119355 131893
15032 131893 123369 116639 98347 81391 76339 90771 96027 89199 100121 92460 96964 99967 98119
15019 98119 102755 95319 78689 68311 64428 57677 58192 61731 63652 50295 43968 61306 68543 54345
15005 54345 53737 55170 49670 52205 51279 55066 61350 56423 55833 53931 61903 59939 42229 32077 28766
14990B8766k698J3833K5937J3305n2N053m980j8360j4217j405J0864L117j2915
14977D6248k1352K946J0390N502J4560K30j0202p117M902J57p288k681r358r57
14963B5980J3468M792n647L2J1965N844n76q126j0275L610M28m492p402q51j2018
14948A6732n219M551J1858M623N65K093j812N141l959n536q421j536O690L213
14934B8983q806k4825P647J6114R980K1941m251r06O082O299n529j6925j173l212
14920C1419K249k278r74n427j5659l066J422J382k942Q048O769M223L852N668
14906C4686r467q858m313N039o337K055J0804p13n805J904Q722J659o369p115
14892A5892k42o33K119J4326J3145j0034n644R99P92r916M734R979r068K772m200
$$ plain form
14990 28766 26068 39901 65838 79143 79091 84144 79164 60804 46587 45182 56046 59163 46248
14977 46248 24896 27842 38232 43734 58294 58524 48322 41205 46107 46264 38976 36295 26937 25980
14963 25980 39448 44240 38593 38625 50590 56434 55858 47732 37457 41067 41495 37003 29601 28750 16732
14948 16732 11513 16064 27922 32545 33110 35203 33391 38532 34573 29037 20616 19080 25770 28983
14934 28983 20177 -4648 2999 19113 29093 51034 46783 45877 51959 58258 52729 35804 34631 31419
14920 31419 33668 31390 30416 24989 9330 6264 7686 9068 6126 14174 20943 25166 29018 34686
14906 34686 25219 16361 12048 17087 10750 12805 23609 22896 17091 18995 27717 29376 23007 15892
14892 15892 15650 15017 17136 31462 44607 34573 28929 29928 30720 20804 25538 35517 26449 29221 25021
14877B5021j5712o2M120p408o432P1P572l679K315o73J5679L61l457K611N22l906
14861A6943O920l178j2463r481J0251k175k291j893J0708m355Q167J3175J4045
14848D4373l185L607m397j4057m158n502N050M289O040l097k0086M96L698M237
14834A7308R141k83j3024P81J5572R241J2055j5913J011Q440J33O092R594Q377
14820F8525L904J1702R432Q201j1928p653j1985j3326k2422q828Q39r147p844
14807I470R123M359j324M519l698m879k725q524O078O612r812R428P209p097m912
14792A3827N486N729n329L794r479Q729K4923Q805K4206L6441M5846M0403j1787
14779A91594k5870k1355k1168k3948l5569l1218k2285j5558J3866M291m443j0170
$$ plain form
14877 25021 9309 9247 13367 5959 -473 -402 7170 3491 5806 5133 20812 21173 17716 20327 20849 16943
14861 16943 23863 20685 8222 -1259 8992 6817 4526 2633 13341 8986 17153 30328 44373
14848 44373 41188 44795 40398 26341 22183 16681 21731 26020 32060 28963 8877 9373 13071 17308
14834 17308 26449 26166 13142 13923 29495 38736 50791 34878 35889 44329 44462 50554 60148 68525
14820 68525 72429 84131 93563 101764 89836 82183 70198 56872 34450 25622 26461 17314 9470
14807 9470 18593 22952 21628 26147 22449 17570 14845 6321 12399 19011 9199 18627 25836 18739 13827
14792 13827 19313 25042 19713 23507 14028 22757 47680 56485 80691 117132 162978 203381 191594
14779 191594 165724 144369 123201 99253 63684 32466 10181 -5377 8489 12780 8337 -1833
14767a833J583M595J3007n064j1070J130J6411J885p793P73q887j6245j88J1717
14753B1J1915P811M595J3072J0642N386J1993K1874J4484l096n545k2849j6184
14740E4119m809J533j3762j6365j2340j0672k617r085j001N072J0637j567n482
14727f339R400Q435m902n084j4661k246j84J8911j172p194p439j4211n11P363
14713a9834l281J6L812O628J7300M489J268N274m725o972m597p706k689m017m452
14698a9486p048l986j925K1387R679J05j0677J099l809k186J868K74p15l945N900
14683a3465J1856k297L684j126k588r317m328q163M913J4105J1953P835J298j3380
14669I80m742m778m515J1671J3915J0247j1375r439r786q904J1562R801P648j0516
$$ plain form
14767 -1833 -250 4345 17352 12288 1218 2348 18759 20644 12851 13624 4737 -11508 -11696 21
14753 21 11936 19747 24342 37414 48056 53442 65435 87309 101793 98697 93152 70303 54119
14740 54119 49310 50843 37081 20716 8376 -2296 -4913 -13998 -14999 -9927 710 -857 -6339
14727 -6339 3061 11496 6594 1510 -13151 -15397 -15581 3330 2158 -5036 -12475 -26686 -27197 -19834
14713 -19834 -23115 -23099 -19287 -12659 4641 9130 10398 15672 10947 3975 -622 -8328 -11017 -15034 -19486
14698 -19486 -26534 -30520 -32445 -11058 -1379 -1274 -11951 -10852 -14661 -16847 -14979 -14705 -15420 -19365 -13465
14683 -13465 -1609 -3906 -222 -1348 -3936 -13253 -17581 -25744 -20831 -6726 5227 13062 14360 980
14669 980 -3762 -8540 -13055 -1384 12531 22778 11403 1964 -7822 -16726 -5164 4637 12285 1769
14655A769M10j779o34O358j829Q342O165R208n460l914p378l66J2979l362M084
14640B4593j62J2111J0234j8548k128L395L117m930q161o444p060l06N035Q084
14626A8830j483l450R900Q30n877m817n655k425M344j959K28n865m227l730J1715
14611F359K5638q171j3996Q877j1212k750N032q135n972Q07n214k22M389n240
14597i810L32O475l82j1606l380M07q203Q050J6735N005j635K570j629p755q175
14582a3001k886K334K754q442L943Q370O62M615J6629k649q442K092O326J5378
14568B7683K006j8555k780o05K371J1354N583j0356j3492l468P352Q010J1164
14555B6267n336r038l048L127j966j2672p299N91q61L851l975k817L751J441L592
$$ plain form
14655 1769 2179 400 -234 6124 4295 12637 18802 28010 22550 18636 11258 10892 23871 20509 24593
14640 24593 24431 36542 46776 28228 26100 29495 32612 27682 19521 13077 6017 5711 10746 18830
14626 18830 17347 13897 23797 24627 18750 13933 8278 5853 10197 8238 8466 2601 -1626 -5356 6359
14611 6359 31997 23826 9830 18707 7495 4745 9777 1642 -4330 -3523 -8737 -8959 -4570 -9810
14597 -9810 -9478 -3003 -3385 -14991 -18371 -17964 -26167 -18117 -1382 3623 1988 4558 2929 -4826 -13001
14582 -13001 -15887 -13553 -10799 -19241 -15298 -6928 -6266 -1651 14978 12329 3887 5979 12305 27683
14568 27683 29689 11134 8354 7749 10120 21474 27057 16701 3209 -259 7093 15103 26267
14555 26267 20931 11893 8845 11972 10006 -2666 -9965 -9374 -10235 -6384 -10359 -13176 -9425 -7984 -4392
14540d392P212O293j1323p795o052J7293J1702m413j727o015m023l889O011J0036
14526H918R067n61q168L97M290J260j0800L096r072o304L987o78P535J2660M681
14511B0308l414J99j2988K77K788K576j7388o981P566J0650L878j0669R281M963
14497A1046m18O735r410o325J3695P0o736J024L422M68L786o922o433L756K561
14482A0319l939j3091K138O569K615J340j3529l668J6109k181n391j793k822K27
14468g097M904O077j759k036K665J4318Q371R127j0669m467o402q301o970j4641
14454a6880J362P473K044o883Q069K5686O400k051k8435j3757L079O974N829J2532
14440A1442j608j0742k726N373J5816j809l079K425m17j190j3369J086J574N599
$$ plain form
14540 -4392 2820 9113 -2210 -10005 -16057 1236 12938 8525 6798 783 -3240 -7129 -1118 8918
14526 8918 17985 17424 9256 9653 13943 15203 4403 7499 -1573 -7877 -3890 -4568 2967 15627 20308
14511 20308 16894 17093 4105 4382 7170 9746 -7642 -14623 -7057 3593 7471 -3198 6083 11046
14497 11046 10628 17363 7953 1628 15323 15393 8657 9681 13103 13571 17357 10435 4002 7758 10319
14482 10319 6380 -6711 -4573 1996 4611 5951 -7578 -11246 4863 2682 -2709 -4502 -7324 -7097
14468 -7097 -2193 3884 2125 89 2754 17072 25443 34570 23901 19434 13032 4731 -2239 -16880
14454 -16880 -15518 -8045 -6001 -12884 -4815 20871 27271 25220 -3215 -16972 -13893 -6919 -1090 11442
14440 11442 9834 -908 -3634 1739 17555 15746 12667 15092 14675 13485 116 1202 2776 8375
14426H375M844R051R377J1355j7987j1850k53L453q026M881m836p446o382m645
14412a0089r981J373J5249r34j691O165k926L347J1293J150j047j629Q086k011
14398A6355j3184j79l535j827Q258J985q025j189l56k172K561J3196P007o280
14384A2615r771l581j9j2213n235J4280Q814Q368p3K448R266p646j3500k685k824
14369a756J6502N066Q816J71p453l563o38r860Q377j501p302N261N726J5382j865
14354C1363m007O112N279j0630J2213j131l553J0171J5723J2874K4339J4711K1901
14341A35365K5676L3157K7754K5808K0628N488K247J1225m694j2309j9752j6802
14329B33791k2398k3679j5270r584k6039k5846k3930q944j7394K556o853n880
$$ plain form
14426 8375 13219 22270 31647 43002 25015 13165 12912 16365 8339 13220 8384 938 -5444 -10089
14412 -10089 -20070 -18697 -3448 -4382 -6073 92 -2834 513 11806 12956 11909 10280 18366 16355
14398 16355 3171 2992 -543 -2370 5888 7873 -152 -1341 -1697 -3869 -1308 11888 18895 12615
14384 12615 2844 -737 -756 -12969 -18204 -3924 4890 13258 13185 15633 24899 17253 3753 1068 -1756
14369 -1756 14746 19812 28628 28799 21346 17783 17145 7285 15662 14161 6859 12120 17846 33228 31363
14354 31363 27356 33468 38747 28117 40330 39199 35646 45817 61540 74414 98753 113464 135365
14341 135365 161041 194198 221952 247760 268388 273876 276123 287348 282654 270345 250593 233791
14329 233791 211393 187714 172444 162860 136821 110975 87045 78101 60707 63263 56410 50530
14317E0530M306N849m926J7012R764M78m248R432N038P645K6241J0062K4194K2620
14303A83997K5771K1956J8196M065L665J6662n930k2217j1270j3415j9872k6844
14291A74764l2259l3386j8445o293j2666k5544p789j4767p516N254J0516J4083
14279D5952j858p964K822j4518J220K416K996n317m307j1210N451J4969J648p196
14265B5104K072R491n515p327L176K663K382n392N916J4580j268m94M033j199
14251D8222k588Q168l924R643J655o525M807j78j4050k0852l381l145k0305q896
14237a1349l051j4324k456O817m36o412j1996j8580N2K5220J8384N380r29q289
14223b1969O098m642J746M263k531N330L01J2159Q902m46p218n72N858J882j2386
$$ plain form
14317 50530 54836 60685 55759 72771 82535 83013 78765 88197 93235 100880 127121 137183 161377 183997
14303 183997 209768 231724 249920 253985 257650 274312 268382 246165 234895 221480 201608 174764
14291 174764 142505 109119 90674 84381 71715 46171 38382 23615 16099 21353 31869 45952
14279 45952 44094 36130 38952 24434 25654 28070 31066 25749 21442 10232 15683 30652 32300 25104
14265 25104 27176 36667 31152 23825 27001 29664 32046 26654 32570 47150 45882 45388 49421 48222
14251 48222 45634 53802 49878 59521 61176 54651 59458 59280 45230 24378 20997 17852 -2453 -11349
14237 -11349 -14400 -28724 -31180 -24363 -24799 -31211 -43207 -61787 -61735 -36515 -18131 -12751 -13680 -21969
14223 -21969 -15871 -20513 -18767 -14504 -17035 -11705 -11404 755 9657 9211 1993 1421 7279 9161 -3225
14208c225K195J0591R951m648K574n03k2504k0149j4436j4145p683l33M205L890
14194e4220J304K24N659p390K254J8117R389l827J0092j032J816K144P81k334
14180a7023j0968n390K108r875k236J769J7582J004r393R913K1634J903J2046
14167A3074l719o713J4436K11k028J521j9874k609O090R679L810Q011N063J0376
14153C7328K289M612n530K01k611N391j2443k0835M830J9326J2288K443j1161
14140C6128m598P262L751k421j8065o421J295O372k311R309M065j4269J297J2156
14126C3550n177n90l329J0J0505J1570n573q056j894n09J2429r11o663O424J2275
14111E4061jj7481j604K370Q459l285q028r814o727o424m676j982J0554Q069N45
$$ plain form
14208 -3225 -1030 9561 19512 14864 17438 16935 -5569 -25718 -40154 -54299 -61982 -62315 -58110 -54220
14194 -54220 -52916 -52692 -47033 -54423 -52169 -34052 -24663 -28490 -18398 -19430 -17614 -15470 -14689 -17023
14180 -17023 -27991 -33381 -31273 -41148 -43384 -41615 -24033 -23029 -32422 -22509 -875 1028 13074
14167 13074 9355 2642 17078 17289 15261 16782 -3092 -5701 389 10068 13878 21889 26952 37328
14153 37328 39617 44229 38699 38900 36289 41680 29237 8402 13232 32558 44846 47289 36128
14140 36128 31530 38792 42543 40122 22057 15636 16931 23303 20992 30301 34366 20097 21394 33550
14126 33550 28373 27783 24454 24464 34969 46539 40966 32910 31016 30507 42936 42025 35362 41786 54061
14111 54061 54060 36579 34975 37345 45804 42519 34491 24677 17950 11526 6850 4868 15422 23491 24036
14096B4036j4140J652K122M566l577M741r985n717k418K640J883j0820o273K370
14082h920J0429J456O452M001Q550P006r50P627O923R274J853J873l561j2371
14068C9642n092R80P131J452K094j0029q550l294M611L820L592l343o166k0607
14054F241q950l454J8442K3085Q028r674j3222O096N1j9913n35J753j300j999
14040D649J4695O351n849p79N719J815k275Q211K74k810J6Q636j1900M240n884
14025B5109k155M769Q859P162O446Q256Q365J369o23J1893L810j4046J641K286
14011G3141n795J5108l422n217L114n476j1656J557J5999J378o692n08p900j2597
13997E1034r980J176n753J0408J0001j530K4724J035q684r990Q008J5110N772
$$ plain form
14096 24036 9896 11548 13670 18236 14659 19400 9415 3698 1280 3920 5803 -5017 -11290 -8920
14082 -8920 1509 2965 9417 13418 21968 28974 28024 35651 42574 51848 53701 55574 52013 39642
14068 39642 34550 35530 42661 44113 46207 36178 27628 24334 28945 32765 36357 33014 26848 6241
14054 6241 -2709 -6163 12279 35364 43392 33718 20496 26592 26643 6730 6195 7948 6648 4649
14040 4649 19344 25695 19846 19067 24786 26601 24326 32537 32811 30001 30017 38653 26753 30993 25109
14025 25109 22954 27723 36582 43744 50190 58446 66811 68180 67557 79450 83260 69214 70855 73141
14011 73141 67346 82454 79032 73815 76929 71453 59797 61354 77353 78731 72039 71531 63631 51034
13997 51034 41054 42230 36477 46885 56886 55356 80080 81115 72431 62441 70449 85559 91331
13984I1331J138L513J0301J2361J1800R875r235m79r790N733R428r114j575J3797
13970A39084R820k198k836N102J0704J4972m373p688K144R973N728J3143Q300
13957B01875L232n14L368J2572J0129R595J7785J2943Q793O659J4965P125Q391
13944C16918J013k281J8143K5381J1237J4433J5026O358K9328K3623K3271L0435
13932E12885K6317M2469K7694K8202L0742L7437O2027O0639M4997O4291O4522
13921A002222P4493R0521J11677J16792J31582J53399J80265K34843K78117L28757
13911B702668L82577M54869N65958O88946Q67357J134048J540216K163864L004583
13902A3505086M004705M896129N544549N824041N802577N528613M944765M079070
$$ plain form
13984 91331 92469 95982 106283 118644 130444 140319 131084 130605 120815 126548 135976 126862 125287 139084
13970 139084 148904 146706 143870 148972 159676 174648 170275 162587 164731 174704 180432 193575 201875
13957 201875 205107 204593 207961 220533 230662 240257 258042 270985 279778 286437 301402 308527 316918
13944 316918 317931 315650 333793 359174 370411 384844 399870 406228 435556 459179 482450 512885
13932 512885 539202 581671 609365 637567 668309 705746 767773 828412 873409 937700 1002222
13921 1002222 1076715 1167236 1278913 1395705 1527287 1680686 1860951 2095794 2373911 2702668
13911 2702668 3085245 3540114 4106072 4795018 5662375 6796423 8336639 10500503 13505086
13902 13505086 17509791 22405920 27950469 33774510 39577087 45105700 50050465 54129535
13894E4129535K665699Q07207j149139k948194m179654m954693n378225n561238
13886C3431298n554465n196445m509173l605061k680102j921123j361087r65440
13878G638402o96711m66036k92350j46875M510J36041L03119N26410P99740J180372
13868H986622J711164K449214L348748M266933M949974N333887N417413N276905
13860D1740860M844250M085548K870164J164816o91706k434857l711929m558713
13852D3308433n141648n421253n479519n181317m583622l753523k856856k106140
13844H784555j552524j175246q96038o97779n96003m94866m02636l48230l08340
13835B312893k47501k02097j80753j55885j14906r3227r2492p2118n3538p5225
$$ plain form
13894 54129535 56795234 57602441 56453302 53505108 49325454 44370761 38992536 33431298
13886 33431298 27876833 22680388 18171215 14566154 11886052 9964929 8603842 7638402
13878 7638402 6941691 6475655 6183305 6036430 6040940 6176981 6480100 7006510 7806250 8986622
13868 8986622 10697786 13147000 16495748 20762681 25712655 31046542 36463955 41740860
13860 41740860 46585110 50670658 53540822 54705638 54013932 51579075 47867146 43308433
13852 43308433 38166785 32745532 27266013 22084696 17501074 13747551 10890695 8784555
13844 8784555 7232031 6056785 5160747 4462968 3866965 3372099 2969463 2621233 2312893
13835 2312893 2065392 1863295 1682542 1526657 1411751 1318524 1226032 1153914 1100376 1025151
13825A025151o0884m8167m3375n3944n0225l6502l8400k8647k3431k3613l0658
13814E87305k1577k2037q540k0031k4534k0761j3252j3947n867q075j8856n5k3358
13801C86415k4399j5197j2861J166L892J595j0481l752r074o113j1111j5340q049
13788B76691o344K167j1546j9364j3398p032j7273n514k013m80K900O920j5202
13775A90512M65J3035q001o488p729n111j0324n303K0497K2177J0306P398q003
13762B13431n86M826L278K122N236J4284j0252l301j402m521q834K7N369k93o886
13747B12498j064J1792L450l70L507O388l81n105j2116k4075r517k620j1170l138
13733A68079j065O610M514J5802M117L157K9797M0516L1874K5257K4495K5318
$$ plain form
13825 1025151 964267 916100 872725 818781 768556 732054 693654 665007 641576 617963 587305
13814 587305 565728 543691 535151 515120 490586 469825 456573 442626 436759 428684 409828 409773 386415
13801 386415 362016 346819 333958 335124 339016 340611 330130 326378 317304 311191 300080 284740 276691
13788 276691 270347 272514 260968 241604 228206 221174 203901 198387 196374 195894 198794 205714 190512
13775 190512 190977 204012 196011 189523 181794 176683 166359 161056 181553 203730 214036 221434 213431
13762 213431 212845 217671 220949 223071 228307 242591 232339 229038 227636 223115 214281 214308 219677 219384 212498
13747 212498 211434 223226 226676 226306 229813 236201 235820 230715 218599 194524 185007 182387 171217 168079
13733 168079 167014 173624 178138 193940 198057 201214 231011 271527 303401 328658 353153 378471
13721C78471J3052q509k1523j8590k2920l6486k8842k2067j4912q794K166J2582
13709B23628P371P694K425N826o966j4401r835q33r835j5863o908j2360q516k633
13695A58794J598N610n455n832j0671J4234J7925R944J6905K2795J1999l912j6596
13682B17338q009k4877l2504l3287j5221J855r309j1348K389q729q897L166l970
13669F8597L01L030o45p969L434l38J6802K5k0420j1557R505J6671k810r823r892
13654E4911P87j3341j2410J0596J8930l177q962j382p525o345M992P304J0158
13641E4536L78j0797j670O757R040m210Q930k789k652K20k387j9900o866Q278
13627C6868k329j3150K59Q10J9915Q166M21N202j4012j5338k2898n442J2517J1657
$$ plain form
13721 378471 391523 383014 361491 342901 319981 283495 254653 232586 217674 208880 211046 223628
13709 223628 230999 238693 241118 246944 239978 225577 215742 214909 205074 189211 182303 169943 161427 158794
13695 158794 160392 166002 160547 154715 144044 158278 176203 186147 203052 225847 237846 233934 217338
13682 217338 209329 184452 151948 118661 103440 105295 95986 84638 87027 78298 69401 72567 68597
13669 68597 68898 71928 71283 63314 66748 66410 83212 83237 62817 51260 60765 77436 74626 64803 54911
13654 54911 55698 42357 29947 40543 59473 56296 47334 45952 38427 32082 37074 44378 54536
13641 54536 54914 44117 42447 49204 58244 54034 62964 60175 57523 57743 55356 35456 28590 36868
13627 36868 34539 21389 21648 22458 42373 50539 50960 56162 42150 26812 3914 -1528 10989 22646
13613B2646m364l725J596N535R738O398L025k69o988o090J6934N385o598K338
13599D5561l01q700K25l285j224J309J724Q763O756n788j0098j3950o32P235L298
13584C0893P931j795R6M749n259p383o200O655J1777Q881J730j0317m106K106
13570C9758J1358N970j1864j879Q578O152N657N076R483n575Q280J4250J1617
13557A06861j2688n619k720l564p085q203k3403r881k938M967j3178k570p178
13544A2801n030R196N197J279j0121j3634J996R067Q266o310r610P436J3368o002
13530A7899N207J1956L177P408K0698l204j107N807J4327L55J573O971J4011l927
13516A01151j2587j1425j6980j4790j6116j1981j5976p378m26n990r636p35J836
$$ plain form
13613 22646 18282 14557 16153 21688 31426 37824 40849 40580 33592 27502 44436 49821 43223 45561
13599 45561 45260 36560 36785 33500 32276 33585 35309 44072 50828 45040 34942 20992 20360 27595 30893
13584 30893 38824 37029 37125 41874 36615 29232 23032 29687 41464 50345 52075 41758 37652 39758
13570 39758 51116 57086 45222 43343 51921 58073 63730 68806 78289 72714 80994 95244 106861
13557 106861 94173 88554 85834 82270 75185 66982 43579 33698 30760 35727 22549 19979 12801
13544 12801 7771 16967 22164 23443 13322 -312 1684 10751 19017 12707 3097 10533 23901 17899
13530 17899 23106 35062 38239 45647 66345 63141 62034 67841 82168 82523 84096 91067 105078 101151
13516 101151 88564 77139 60159 45369 29253 17272 1296 -6082 -6508 -12498 -22134 -22869 -21033
13503b1033P469p813J1450L072R09P808p39L869m855J4664J3487l380j4549k0072
13489i713o063N117L802J4555K895N955k003K527Q540q097r487n376l324m215
13475d887Q141J3469k802J078O244M81j8252J0732Q66j631M269j3056p362J6127
13461A3417L694P292O237J4287k727J1444J0936J5362K0260L3541L5609K1511
13449A90863K0464K7891K7794J8481J4137p487j8811k9250k1659j7213k6495l3462
13437A45253k2964n575k0521q586p204j0240n955jn473j3814j0289O025Q021j2105
13423C6572o231j141J5008J0039J5249K3028K9583K2542J4148J0888Q37J9609
13411A90131L8397K6979J3392n530j9757j0064k722k5216k8116k2511k3266k8315
$$ plain form
13503 -21033 -13564 -21377 -9927 -6855 -5946 1862 1123 4992 137 14801 28288 24908 10359 -9713
13489 -9713 -15776 -10659 -6857 7698 10593 16548 14545 17072 25612 17515 8028 2652 -672 -4887
13475 -4887 3254 16723 13921 14999 21243 21724 3472 14204 15070 13439 17708 4652 -2710 13417
13461 13417 17111 24403 30640 44927 42200 53644 64580 79942 100202 133743 169352 190863
13449 190863 211327 239218 267012 285493 299630 292143 273332 244082 222423 205210 178715 145253
13437 145253 122289 116714 96193 87607 80403 70163 64208 64207 58734 44920 34631 40656 48677 36572
13423 36572 30341 29200 44208 54247 69496 92524 122107 144649 158797 169685 170522 190131
13411 190131 228528 255507 268899 263369 243612 233548 230826 205610 177494 154983 131717 103402
13399A03402j8291m387j3600q98k828n418j3830l567O161J817r890j931L889j9590
13385B1039O068l749k4600O065K3610P78n795n54j7861j9909q942J6257K2393
13372A4800M268n539l413Q044N51j4177p718N86M285q51L681J625j617O346M450
13357A5321n487j738j150M784m822j303J1934J0203O007j0320j6650R552O048
13344B2379j4888o840J2034O027o816j5559r17M145L591N770L27N641r448j2653
13330g207J8512J1560m318p344M313l965R91j247J91l925J1380K040j7938O673
13316I716O145L696j899N173P510j0819m012l935p924J922K040J398M672n764
13302G919j0537j0974k021Q157J381j0201K685L126N524N882M476J2486M726l310
$$ plain form
13399 103402 85111 80724 67124 66226 63398 57980 44150 40583 46744 48561 38671 36740 40629 21039
13385 21039 27107 23358 -1242 4823 28433 29211 23416 22862 5001 -14908 -23850 -7593 14800
13372 14800 19068 13529 10116 18160 18711 4534 -3184 -2598 1687 836 4517 6142 4525 10871 15321
13357 15321 9834 8096 6946 11730 6908 5605 17539 27742 33749 23429 6779 16331 22379
13344 22379 7491 651 12685 18712 11896 -3663 -4580 -435 3156 8926 9253 14894 5446 -7207
13330 -7207 11305 22865 18547 11203 15516 11551 12542 11295 11486 7561 18941 20981 3043 9716
13316 9716 15861 19557 17658 22831 30341 19522 15510 11575 3651 5573 7613 9011 13683 7919
13302 7919 -2618 -13592 -15613 -7456 -6075 -16276 -13591 -10465 -4941 941 5417 17903 22629 19319
13288A9319K410R076l860j0011j3265j612o093k286l116j616N550j0775j6234
13275c2513O538J3096L579K269Q34P328L811J0861j1082o378J7168l233m495r338
13261a555j3113j5307k965J5453R387K2957J2005L263o572r865j3651j3748n006
13248a8717J8169J5389m220j186Q642J34k193m532p044o911P16K576N112M950
13234A0885p722P47n799O79M771K1922Q621j5700l300L551j0654n922n634j056
13220d611k760o831o523J3578J0073J1583o539j801n668K959J714j3834j1660
13207b0320N505J6500P698J12o997p726J900m583l821P531o037m08L750K825M054
13192a7k449n968m357P630J3096O231R61K016J2134l400j1356L354n417j3890
$$ plain form
13288 19319 21729 30805 26945 16934 3669 2057 -4036 -6322 -9438 -11054 -5504 -16279 -32513
13275 -32513 -25975 -12879 -9300 -7031 -6197 1131 4942 15803 4721 -1657 15511 12278 7783 -1555
13261 -1555 -14668 -29975 -32940 -17487 -8100 14857 26862 30125 23553 13688 37 -13711 -18717
13248 -18717 -548 14841 10621 9435 18077 18211 16018 11486 4442 -2469 -1753 823 5935 10885
13234 10885 3163 3910 -1889 -1210 3561 25483 34104 18404 15104 18655 8001 2079 -3555 -4611
13220 -4611 -7371 -14202 -20725 -7147 2926 14509 7970 6169 501 3460 5174 -8660 -20320
13207 -20320 -14815 1685 9383 9495 2498 -5228 -3328 -7911 -11732 -4201 -10238 -10646 -6896 -4071 -17
13192 -17 -2466 -8434 -12791 -5161 7935 14166 15127 17143 29277 25877 14521 17875 12458 -1432
13178a432r90O217P329j1692R26K961K662J3133j5320j5194l398J6660M406P902
13164A4170n357p824k998l890m725R631J2644k205r871o325N966Q844l951j91
13150C918l389k09K299N417N879k09p056N42N338k257j2889l749R360L146P904
13135A4045P502L155J284k576j7481p516r557j4966o95N966j1413J0422J0367
13122a1463N736O000o620j1175J8876J592N101J798j067p673o718j145J4109L817
13108A1168q564n153k994j824J73j4060o180J1970R631K0743K592r896R785o975
13094A0416j9097o874J4160J5831j378q475o072q706R258J9394K183n678N93n251
13080A0304N5q061n64j3494R019m577r93o257O287J3787L196k1584j6093O329
$$ plain form
13178 -1432 -2422 3795 11124 -568 358 3319 5981 19114 3794 -11400 -14798 1862 6268 14170
13164 14170 8813 989 -2009 -5899 -10624 -993 11651 9446 -425 -6750 -784 8060 4109 3918
13150 3918 529 320 2619 8036 13915 13706 6650 7192 12530 10273 -2616 -6365 2995 6141 14045
13135 14045 21547 24702 25986 23410 5929 -1587 -11144 -26110 -26805 -20839 -32252 -21830 -11463
13122 -11463 -5727 273 -6347 -17522 1354 2946 8047 9845 8778 1105 -5613 -6758 7351 11168
13108 11168 2604 -2549 -5543 -7367 -7194 -21254 -27434 -15464 -5833 14910 17502 7606 17391 10416
13094 10416 -8681 -15555 -1395 14436 13058 4583 -1489 -10195 -937 18457 20640 14962 15555 10304
13080 10304 10359 2298 1734 -11760 -2741 -7318 -8311 -14568 -8281 5506 8702 -12882 -28975 -22646
13066b2646J67j623J2626K636J2834K346o879P176k468n410O76L369j036j5209
13052a3441L41M964J3282K626j1156q154l716l523J2103Q935J000o53n321j820
13038d533J367k214k65p510j808Q517P786n668l869M410M587K537l066p149K679
13023d199J2831j0759r661M638R518L71j2089j0187J3875J2845l072J425o34n413
13009e11N100m91M507J5112q77j5744j6599p150M208O866O481J190r908m328M325
12994g819N369J932J4984j3991j3170r642N339J1841J0664J1328m90P28m159j2037
12980H77K108m165J479k754M705l593j1298J2749m199P48m688p542P413J2519
12966D359L345l17P189q176K196P109P518J9J3135r425J2885J087n831j0394n839
$$ plain form
13066 -22646 -22479 -24102 -11476 -8840 3994 6340 -539 6637 4169 -1241 -565 2804 1768 -13441
13052 -13441 -13100 -8136 5146 7772 -3384 -11538 -15254 -18777 -6674 2261 3261 2608 -2713 -4533
13038 -4533 -3166 -5380 -5645 -13155 -14963 -6446 1340 -4328 -8197 -3787 800 3337 271 -6878 -4199
13023 -4199 8632 -2127 -11788 -7150 2368 2739 -9350 -19537 -5662 7183 4111 5536 4902 -511
13009 -511 4589 4098 8605 23717 22840 7096 -9503 -16653 -12445 -5579 902 2092 -7816 -12144 -7819
12994 -7819 -2450 -518 14466 475 -12695 -22337 -16998 -5157 5507 16835 16345 17073 12914 877
12980 877 2985 -1180 299 -2455 2250 -1343 -12641 108 -4091 -3343 -8031 -15573 -8160 4359
12966 4359 7704 7387 14576 6400 8596 15705 23223 23242 36377 26952 39837 40924 35093 24699 18860
12951A8860j2191o626J5806o31r900Q832J0005o560j4734L724J1466o204k228
12938I619j728L636K334j0419L976K053O19N112q396n006J0943l157l015k47j261
12923E063m640n391l703k751m242J189n362J1091K216j0961N227L649k207o156
12909a6978M135K5074O514j5354l379J221j1284L284M144q692j0577p665P983
12896b1574J1382J3751j422K035k164p420n224j3737R507k296p662J45O643M954
12882a3082Q255J8570P279j0726k5628j3707J5383Q772j4835K084K226J3274L522
12869A387m920o664k957J992J319K221N214K101j0221o327q674J1118J5681l285
12855b015k955J607p494j2543J055J3497Q522O334n959o281J0100J919N60L262
$$ plain form
12951 18860 6669 43 15849 15218 5318 14150 24155 17595 2861 6585 18051 11847 9619
12938 9619 7891 11527 13861 3442 7418 9471 10090 15202 6806 1800 12743 9586 6571 6324 5063
12923 5063 423 -4968 -8671 -11422 -15664 -14475 -19837 -8746 -6530 -17491 -12264 -8615 -10822 -16978
12909 -16978 -12843 12231 18745 3391 12 1233 -10051 -6767 -2623 -11315 -21892 -29557 -21574
12896 -21574 -10192 3559 2137 4172 2008 -5412 -10636 -24373 -14866 -17162 -24824 -24679 -18036 -13082
12882 -13082 -4827 13743 21022 10296 -15332 -29039 -13656 -4884 -19719 -17635 -15409 -2135 1387
12869 1387 -3533 -10197 -13154 -11162 -9843 -7622 -2408 -307 -10528 -16855 -25529 -14411 1270 -2015
12855 -2015 -4970 -3363 -10857 -23400 -22345 -8848 -326 6008 49 -6232 3868 5787 6347 9609
12841I609m843j824N773n822q303n817O89O637m96r948L214J943q10P023K941
12826c4o722P665l852N168r171l101J3560R48O080O822j2740j7918l038L596O572
12811f165j795N199J2074K364o129j6052j0759j697J3150L417m337n729J0204
12798f255N45p86L557O544k579o052P727p836k149M651p278r358J4125N248J3367
12783A3471J1915j2263j2301j2958J0168M603j3690L339N463j378J6404J20p531
12770E362k752P90n482K630R712P80p229N366r1j3776L156J2806J0074k433m506
12755A4407q123K20l82o893q752L492N784r840j0576L77J8403j10q025Q850J1294
12740A0126m921p653m825j429O332J6668O155M661j1029j0244n084n586P939p67
$$ plain form
12841 9609 4766 2942 8715 2893 -5410 -11227 -10538 -3901 -4397 -14345 -11131 -9188 -9998 -2975 -34
12826 -34 -6756 909 -2943 2225 -6946 -10047 3513 4461 10541 17363 4623 -13295 -16333 -12737 -6165
12811 -6165 -7960 -2761 9313 11677 5548 -10504 -21263 -22960 -9810 -6393 -10730 -16459 -6255
12798 -6255 -5710 -6496 -2939 3605 1026 -5026 2701 -5135 -7284 -2633 -9911 -19269 -5144 104 13471
12783 13471 25386 13123 822 -12136 -1968 2635 -11055 -7716 -2253 -3631 12773 12893 5362
12770 5362 2610 3400 -2082 548 10260 11040 3811 9177 9086 -4690 -1534 11272 21346 18913 14407
12755 14407 6284 6504 6122 -771 -9523 -6031 -247 -10087 -20663 -20286 -1883 -1993 -10018 -1168 10126
12740 10126 5205 -2448 -7273 -8702 -2370 14298 20453 25114 14085 3841 -1243 -6829 1110 343
12726C43J849L671l054O870k676j7009N266Q230O518l755M00j1439m801K445o399
12711a3541J943J449j0442N75N464r713R866J1891M601M203P597j6331j775J4471
12697A0258k936m753J065O247r17O113J9325J9136q389k4501j3571l250q137o654
12683a0964J0917J1973l317j1493R78k939j1038J0494R215m046K440Q278j2022
12670a524q403k596J8353O471l557M150l746Q386p05r98P516n567q717o923Q628
12655A0768p919q820k605K708M382m646n668M658l954j002P170j999J734N591
12641C98P896M989J607n802M189l408j043q371o950L419R978R427N778j0759J432
12626A2780n56o025J4859o831p860R644m465r579Q818J3190j6907k9717O974J6764
$$ plain form
12726 343 2192 5863 2809 9679 7003 -10006 -4740 3490 10008 6253 6653 -4786 -9587 -7142 -13541
12711 -13541 -11598 -10149 -20591 -20016 -14552 -24265 -14399 -2508 2093 6296 13893 -2438 -4213 10258
12697 10258 7322 2569 3634 9881 8964 15077 34402 53538 45149 20648 7077 3827 -4310 -10964
12683 -10964 -47 11926 8609 -2884 -1906 -4845 -15883 -5389 3826 -220 2220 10498 -1524
12670 -1524 -9927 -12523 5830 12301 8744 12894 9148 17534 16829 15831 23347 17780 9063 2140 10768
12655 10768 2849 -5971 -8576 -5868 -1486 -6132 -11800 -7142 -11096 -12098 -4928 -6927 -5193 398
12641 398 8294 13283 14890 9088 13277 9869 8826 455 -6495 -3076 6902 16329 22107 11348 12780
12626 12780 12224 6199 21058 14227 6367 16011 11546 1967 10785 23975 7068 -22649 -15675 1089
12612A089K817k778N814J1291J42q51j5009j0409J738O427p659n66n87M46M886
12597c209R46l521j5190l515L82L224J5149R013J1396J0852j0162j8003J1453
12584H815M695q199n968o35k022J985j3432L038K493J290O549J2536m219K28j5830
12569h676p91k774o235O330k548M166L640M726K609r181m937L264q259J1573k04
12554g297j601K956r987r147L137K1236J4863o037k490O226J059o194k879P100
12540A0945L158Q38P133r286j6760m5P173M072J7232l169j0433N712n101m313
12526G156j1263j0416m831Q037l29l003J3207P7J0344R682n850o645J184o569
12512G81o871j371R766N92m87M712r607j554J0895J1565r328m880N162j1283r016
$$ plain form
12612 1089 3906 1128 6942 18233 18375 17524 2515 -7894 -6156 271 -7388 -7954 -8541 -8095 -3209
12597 -3209 -2263 -5784 -20974 -24489 -24107 -20883 -5734 3279 14675 25527 15365 -2638 8815
12584 8815 13510 5311 -657 -1292 -3314 -1329 -14761 -11723 -9230 -7940 -1391 11145 6926 7154 -8676
12569 -8676 -9467 -12241 -18476 -12146 -14694 -10528 -6888 -2162 447 -8734 -13671 -10407 -18666 -7093 -7297
12554 -7297 -8898 -5942 -15929 -25076 -21939 -703 14160 8123 5633 11859 12918 6724 3845 10945
12540 10945 14103 14941 22074 12788 -3972 -4017 3156 7228 24460 21291 10858 16570 11469 7156
12526 7156 -4107 -14523 -19354 -11317 -11646 -14649 -1442 -1365 8979 18661 12811 6166 7350 781
12512 781 -6090 -7461 2305 2897 2410 7122 -2485 -4039 6856 18421 9093 4213 9375 -1908 -10924
12497a0924j01O122k008m414J864J9652m308l338m300m099j929M175j319K858
12483b069J4349J3443R867q618n139m745j3472K11l884q78J5498R788j3672j9645
12469h966k361j7840P017K0197r530k54R003J7135O37j4742j4234p715m656L608
12455b2701J5709R390j0417q408M644J2407r011n587J7N116K907o816L724P517
12441a509L223o110l355J9540J1378l517o251o134j6892j6481N269J4492J4688
12428H341L587j7664j7134J4794K819k000Q851m64r794k573O343L621Q174N920
12414A2821l353q966l774j987J86M757M813N753r479r967N725J0821Q726p749
12400H327o842O017Q397J624m416m999j0167j853j351j5649q336Q361J7587O297
$$ plain form
12497 -10924 -11025 -4903 -6911 -11325 -9461 10191 5883 2545 -1755 -5854 -7783 -3608 -4927 -2069
12483 -2069 12280 25723 35590 26972 21833 17088 3616 3827 -57 -935 14563 24351 10679 -8966
12469 -8966 -11327 -29167 -22150 -1953 -11483 -11737 -2734 14401 15038 296 -13938 -21653 -26309 -22701
12455 -22701 -6992 2398 -8019 -16427 -11783 624 -8387 -13974 -13957 -8841 -5934 -12750 -9026 -1509
12441 -1509 1714 -4396 -7751 11789 23167 19650 13399 7265 -9627 -26108 -20839 -6347 8341
12428 8341 11928 -5736 -22870 -8076 -5257 -7257 1594 1130 -8664 -11237 -4894 -1273 6901 12821
12414 12821 9468 502 -3272 -5259 -5073 -316 4497 10250 771 -9196 -3471 7350 16076 8327
12400 8327 1485 7502 15899 17523 13107 8108 -2059 -3912 -5263 -20912 -29248 -20887 -3300 2997
12386B997j983Q047k460j9970K977L563J0172P07M531Q235o379j4378N116J4019
12372A5194j1330p410N25q862M380J2746N53j4222R90N243L166Q716j0814n602
12358f727o995q901J1245N976l604P683K053J3454j0318N045J3082Q24p196p976
12344G645j0361P57O019J850Q195M405o933j5227K703P560L206J4758p33n592
12330A8252r646n273n544L442j3378l41J2430R685J1173k457q589L363O628r544
12316A0201r807K792m367J3929R124P740n922p968L066o07L93P153O50o06p292
12301A8479j157J1779L779P73L771R366n460j5359j11O366J2136M721k42j59K1871
12286G0553n782n093J2463L1897L4485L3341N6401N8403R9540J86041L55149O85971
$$ plain form
12386 2997 1014 9061 6601 -13369 -10392 -6829 3343 4050 8581 16816 10437 -3941 1175 15194
12372 15194 3864 -3546 -3021 -11883 -7503 5243 5796 -8426 -7436 -2193 973 9689 -1125 -6727
12358 -6727 -13722 -22623 -11378 -5402 -9006 -1323 730 14184 3866 8911 21993 22817 15621 7645
12344 7645 -2716 -1959 4060 5910 14105 18510 11577 -3650 -947 6613 9819 24577 23844 18252
12330 18252 8606 3333 -2211 1231 -12147 -12488 -58 9627 20800 18343 9754 13117 19745 10201
12316 10201 394 3186 -1181 12748 21872 29612 23690 15722 18788 18181 18574 25727 26377 25771 18479
12301 18479 17322 29101 32880 33653 37424 46790 41330 25971 25860 32226 44362 49083 48841 48682 70553
12286 70553 64771 59678 72141 104038 138523 171864 228265 286668 386208 572249 927398 1613369
12274A613369R69265N27585j27864q13747q74051n07892k68445j54593q7348p6021
12264B00258o6092m0574j2518j4775M068q607j4380j5261j8248j3941o690K167
12252d593J6707J0033r64m585k497j0113N25N699n341L081l202P318J72M506n216
12237A1530K685P534Q774j0281p872M061L255j1144o661P008L45n169R715Q995
12223B2775j1484R64q67m005j948M685j0784q74N729K479l571N126J0281l307
12209A5199m658k653o261N629j4056q033J1348R9O253R235n113K230L902q57l072
12194I192J543n808Q415J1605M436k093M364o056J455N386P966k563j7131r892
12180A0819N33j2106L938Q808L836n206o168l977N713P177p426j34J0203k292
$$ plain form
12274 1613369 2582634 3110219 2982355 2168608 1294557 786665 518220 363627 276279 200258
12264 200258 134166 93592 81074 66299 70367 61760 47380 32119 13871 -70 -6760 -4593
12252 -4593 12114 22147 21183 16598 14101 3988 4513 10212 4871 7952 4750 12068 12240 16746 11530
12237 11530 14215 21749 30523 20242 12370 16431 19686 8542 1881 8889 9234 4065 13780 22775
12223 22775 11291 12255 11388 7383 5435 10120 -664 -1538 4191 6670 3099 8225 18506 15199
12209 15199 10541 7888 1627 7256 -6800 -14833 -3485 -3386 2867 12102 6989 9219 13121 12264 9192
12194 9192 10735 4927 13342 24947 29383 27290 31654 25598 27053 32439 40405 37842 20711 10819
12180 10819 11352 -754 3184 11992 15828 10622 4454 477 6190 13367 5941 5807 16010 13718
12166A3718q703R259M339k921O330n901p801q828L250o567k755N844L292R82K31
12151C769r53o325p25P609L950k189p087L154J5370k152l693r345r139K1392R161
12136B2797j9170j533l97n41J4019j2683j7414N266J0607J563o924L886J5082
12123A4558L116j6095m75N2j3305j8050J2717O320J4828N547o589O849K257o694
12109E036j365R864Q596j543j0414o798j3333O258Q539P332r410k860R969J1791
12095B1662K701j3168o655l856N821p755N812J1964J482o307j353m100P232K34
12081A3714j3009n239k841L187j082K010O161J744l094J272K190q001j3631M622
12067a1997J665Q694J2699p924k3748j3478j6148K6622L9211L7084J4570j0959
$$ plain form
12166 13718 5015 14274 18613 15692 22022 16121 8320 -508 2742 -3825 -6580 -736 2556 3538 3769
12151 3769 2816 -3509 -4234 3375 7325 5136 -1951 1203 16573 14421 10728 1383 -7756 13636 22797
12136 22797 3627 2094 1697 1156 15175 2492 -14922 -9656 951 2514 -4410 -524 14558
12123 14558 17674 1579 1104 1156 -12149 -30199 -17482 -11162 3666 9213 2624 9473 11730 5036
12109 5036 3671 13535 22131 20588 10174 3376 -9957 -3699 4840 12172 2762 -98 9871 21662
12095 21662 24363 11195 4540 684 6505 -1250 4562 16526 18008 11701 10348 6248 13480 13714
12081 13714 705 -4534 -7375 -4188 -5270 -3260 2901 4645 1551 2823 5013 -2988 -16619 -11997
12067 -11997 -10332 -1638 11061 3137 -20611 -34089 -50237 -23615 15596 52680 67250 56291
12055E6291k7334j6911O705J2440J916O638J850j6070p350Q189J2877j1997j2084
12042A5160o471m69N895k626O488p222j3703o924Q530J1490j638J0429J969J782
12028B2690J6742o925j1554l321L443J3134o827k421l14r382O418P972J1358m964
12014C6049j585J0762m615o996l209k300r80j152O163Q72J0300L273q378o527
12000C1677L91K680n806N207J2504J205n74J4921N228k0369L539k445k1310J683
11986B8531J2259O252J6692J2819J7275O170J802Q48K746N945M062o839p154j486
11972I9922M181k25J0981K1888R533m370K490J8208Q645J1485J3196J6499J6579
11959B29012K4418L0481K7920L3666L2533J6369J8978L4772M0154M8558N6019
$$ plain form
12055 56291 28957 12046 18751 31191 33107 39745 41595 25525 18175 26364 39241 27244 15160
12042 15160 8689 8220 14115 11489 17977 10755 -2948 -9872 -1342 10148 8510 18939 20908 22690
12028 22690 39432 32507 20953 17632 21075 34209 27382 24961 24647 15265 21683 29655 41013 36049
12014 36049 34464 45226 40611 33615 30406 28106 27126 25974 32137 33009 43309 46582 38204 31677
12000 31677 32068 34748 28942 34149 46653 47858 47284 62205 67433 47064 50603 48158 26848 28531
11986 28531 40790 47042 63734 76553 93828 99998 101800 102648 105394 111339 115401 108562 101408 99922
11972 99922 104103 103878 114859 136747 146280 141910 144400 162608 171253 182738 195934 212433 229012
11959 229012 253430 283911 311831 345497 378030 394399 413377 448149 488303 536861 592880
11948E92880N4220O2512Q8708J28565J60138J98564K29258L05970M21133N80442
11938B822390Q23762J206883J895308L154918N404957Q871290J1451470Q245861
11930D3876839M97445p631681j1127335q653835n465160l391220k177970j444797
11922D482286r98181p14153n10632l75008k95124k35511j87654j41032j21469
11913I03522r6424r1377q2275o9834n3438n0711l6441l3636m2258j6198j2372
11902C18558j4000k953p131n049r309j1693j8476k2880r619p449j7578k0283j0041
11889A62097r682m552p755j4678j4589l23o577j4380M409J0810J856p194J6538
11876A15980k5469j4874j98j0419k077O395K164P29n504M393J270R098k955k389
$$ plain form
11948 592880 647100 709612 798320 926885 1087023 1285587 1514845 1820815 2241948 2822390
11938 2822390 3646152 4853035 6748343 9903261 15308218 24179508 35630978 43876839
11930 43876839 44374284 36742603 25615268 16961433 11496273 8105053 5927083 4482286
11922 4482286 3484105 2769952 2259320 1884312 1589188 1353677 1166023 1024991 903522
11913 903522 807098 715721 633446 563612 510174 459463 423022 389386 347128 330930 318558
11902 318558 304558 301605 294474 289425 280116 268423 249947 227067 217448 209999 192421 172138 162097
11889 162097 152415 147863 140108 125430 110841 110518 103941 89561 93970 104780 106636 99442 115980
11876 115980 90511 75637 75439 65020 62943 69338 71502 72231 66727 71120 72390 81488 78533 76144
11862G6144L351N261j8229k5380n781l766P211J468o044j240K777K512O830N973
11848E1087N203q060J0786J3780P12r957k751j5647o222R631j226j8310q251P676
11834B8451J4031Mj1841K701K4735j583k1302j369N605n750o893j7173m65J5410
11820B4561l47l825P751Q637k557n703o355j915j3187j56J408m439P437J2841
11806B4151l088j688j5366j6463J7893K9553J5666O754o800j0657k148j0015n226
11793B2566J197k675R57q178M406O016Q294J144q524n976j887m74n517q392o70
11778B287M551J4233N342j7018q473j504K468N816l72q195j0523J5644J6655m931
11764A5980Q733Q722j5577M792o343j1707Q4n824o232P710q151n249o12J3027
$$ plain form
11862 76144 79495 84756 66527 41147 35366 31600 38811 40279 34235 32995 35772 38284 45114 51087
11848 51087 56290 48230 59016 72796 73508 63551 60800 45153 38931 48562 47336 29026 20775 28451
11834 28451 42482 42486 30645 33346 58081 56498 35196 33827 39432 33682 26789 9616 9151 24561
11820 24561 24214 20389 28140 36777 34220 28517 22162 20247 7060 6904 8312 3873 11310 24151
11806 24151 21063 19375 4009 -12454 5439 34992 50658 57412 50612 39955 37807 27792 22566
11793 22566 23763 21088 22045 13867 18273 24289 32583 33727 25203 19227 17340 16866 11349 2957 2287
11778 2287 6838 21071 26413 9395 922 -582 1886 7702 7330 -865 -11388 4256 20911 15980
11764 15980 24713 33435 17858 22650 16307 4600 4684 -1140 -7372 338 -7813 -13062 -13674 -647
11750f47J1585P186m627j5724N526K805J1527k405p887J2371K5673J5568R641
11737G0592j6389j5736j8760j1877j1023L275O997m035n325L883J9062M76k3053
11724a913j2672K677j486J3970J0475O352k627q726j1995k719o102N164j940N137
11710f405J1160J1428J821K005K720k3856j1937O177N052N231Q293l951L518J320
11696A2576L659L623Q595m253j3066L181R378o119L02J1187o889j1101j3282j0466
11682a2675R435J1154L935j768M173J1489J1991M020n365j0250j3791j8981L42
11669f291J7717L282J975J024j0269j9383m565o069J3978N394L548j0168l457
11656a3284M873p628j599j580P064Q19P990P38p5N660K3065J5074j2333o385L86
$$ plain form
11750 -647 10938 18124 13497 -2227 3299 6104 17631 15226 7339 19710 45383 60951 70592
11737 70592 54203 38467 19707 7830 -3193 82 7079 3044 -2281 1602 20664 21140 -1913
11724 -1913 -14585 -11908 -13394 576 11051 17403 14776 6050 -5945 -8664 -14766 -9602 -11542 -6405
11710 -6405 4755 16183 18004 20009 22729 -1127 -13064 -6887 -1835 3396 11689 7738 11256 12576
11696 12576 16235 19858 28453 24200 11134 14315 23693 17574 17876 29063 22174 11073 -2209 -12675
11682 -12675 -3240 7914 11849 10081 14254 25743 37734 41754 36389 26139 12348 -6633 -6291
11669 -6291 11426 14708 16683 17707 7438 -11945 -16510 -22579 -8601 -3207 341 -9827 -13284
11656 -13284 -8411 -16039 -17638 -19218 -12154 -11335 -3345 -2607 -2682 2978 26043 41117 28784 22399 22785
11641B2785l797J799j0229m620K036J1301p53j4347o315m755K0068N200p151L102
11627A4324j650m894n31L881R057r672o74M859p304M447J955k388j1647M28J3741
11612A3932K584j966q73M270M578N79k0292o352k439M659J0430P76J0009J2740
11598C2635n848n228l338m490N228J0584J4603J2239P017n112k1375l3389p513
11585c987O155O329o102p740j750q355n187K812J0826m854L245k565l989J1524
11571c638R308q211o639J052R131k738j573j331n715l722J1583J5653L207m114
11557A2253m456p342q727J053j012j535n059n362J0710M380j858J57p862J2656
11543b004N09J0716R181o61Q583p978r846j768o761q369j8744l313J2609Q102
$$ plain form
11641 22785 18988 20787 10558 5938 7974 19275 18522 4175 -2140 -6895 13173 18373 11222 14324
11627 14324 12674 7780 7249 11130 20187 10515 9841 14700 7396 11843 13798 11410 -237 191 13932
11612 13932 16516 14550 13677 17947 22525 23104 2812 -3540 -5979 -1320 9110 9886 19895 32635
11598 32635 26787 21559 18221 13731 18959 29543 44146 56385 63402 58290 36915 3526 -3987
11585 -3987 2168 8497 2395 -5345 -7095 -15450 -20637 -17825 -6999 -11853 -8608 -11173 -15162 -3638
11571 -3638 5670 -2541 -9180 -8128 1003 -1735 -3308 -4639 -10354 -14076 -2493 13160 16367 12253
11557 12253 7797 455 -8272 -7219 -8231 -9766 -14825 -20187 -9477 -5097 -6955 -6798 -14660 -2004
11543 -2004 -1495 9221 18402 17741 26324 18346 8500 6732 -29 -8398 -27142 -30455 -17846 -9744
11529i744M156M754Q867m99n327J596n674J932j48P07j2985n887L089J2821k430
11514d772n480R411r57m021m311n407j2635O325K2610J0993M720n516j1707P52
11500EM485n338M478l355K728R886m790P864o928m985q626k840J176K739j88n389
11484i078n880J415M415L306M09P449K906K301J861Q481J35o573N429r649k324
11469D603K7089J467j1067j6533M09M108N980P619o461j8250L975P285j555o533
11455B136p552k53O907n720K339J2040J3168j357n671j246j193J467j190J5440
11441B9315m574m195j1606J188J4532P443n78L698k469J57n572P62l012j226q273
11426A5590N0K983j2847l862K824O15N57r16M309N482r358j129n63m658n64R648
$$ plain form
11529 -9744 -5588 -834 8033 7534 2207 3803 -1871 61 -87 620 -12365 -18252 -15163 -2342 -4772
11514 -4772 -10252 -841 -1798 -5819 -10130 -15537 -28172 -21847 763 11756 16476 10960 -747 5
11500 5 4490 -848 3630 275 3003 12889 8099 15963 9035 4050 -4576 -7416 -6240 -3501 -3689 -9078
11484 -9078 -14958 -13543 -9128 -5822 -5413 2036 4942 7243 9104 17585 17720 11147 16576 6927 4603
11469 4603 31692 33159 22092 5559 5968 10076 16056 23675 17214 -1036 2939 10224 8669 2136
11455 2136 -5416 -5669 1238 -4482 -2143 9897 23065 21708 16037 14791 13598 15065 13875 29315
11441 29315 24741 20546 8940 10128 24660 32103 31525 35223 32754 32911 27339 28101 25089 23863 15590
11426 15590 15640 18623 5776 1914 4738 5353 5910 4994 9303 14785 5427 4298 3735 -923 -1487 8161
11410H161j153j1r514M945P179O689M55o704o712k656N262L431n833k132m765
11395c358J0455L043j5459k266J775r68J6266J5945k658p464q493j2263j39J3530
11381G946q204J514k244j3377p854O532M998l24J5151P065k878M947J477q886
11367E863J868K688n076K955n205M828m390J39j692k192o402Q219K900L739N283
11352A3525j532J626O589M444M556p476J0372J2666o808q630j4781N889N367n217
11338B0590J0597K6o874j7813l020J4512O76o591j821N182P715o442j0274n342
11324A121J5114n375q30k630j0618j5303O725J01o917M63k38J5984J80j368P260
11309C669j0598m021J0195J6911m433n53j8073r157J2013J7221R822l757l876
$$ plain form
11410 8161 7008 6997 -2517 2428 9607 16296 16751 10047 3335 679 5941 9372 3539 1407 -3358
11395 -3358 7097 10140 -5319 -7585 -5810 -6778 9488 25433 22775 15311 6818 -5445 -5584 7946
11381 7946 -258 1256 -988 -14365 -22219 -15687 -10689 -11013 4138 11203 8325 13272 14749 5863
11367 5863 7731 10419 5343 8298 3093 7921 3531 3670 1978 -214 -6616 1603 4503 8242 13525
11352 13525 11993 13619 20208 24652 29208 21732 32104 44770 37962 29332 14551 20440 25807 20590
11338 20590 31187 31213 24339 6526 3506 18018 18694 12103 10282 15464 23179 16737 6463 1121
11324 1121 16235 10860 10030 7400 -3218 -18521 -11796 -11695 -18612 -18149 -18387 -2403 -2223 -3591 3669
11309 3669 -6929 -10950 -755 16156 11723 11170 -6903 -16060 -4047 13174 22996 19239 15363
11296A5363M761j482p334j0290k705J847K62R532n821O248J1337L759j147m273
11282B0057j152j3856J770Q227O903m771O874J028n851L903N231q157N053Q878
11268C4137J4276K0538l458r965n333Q369n772J6989J1340o709O508K2861J1530
11255A15311P916J4991K7530O2773N0791R7127J58442K42210L05518K99761J47109
11244A529479o5442k65906l04172k40217j78323j20457q1864m5293l9645l6238
11234A51922l8403k1320K97m847k0696O13J0957n030j6896J159O374l858k843
11221E7429r41P097L02q793q241J273R053O121j264r921p071L828P758r511J1844
11206E8963p451r685m632M17p09j034J3736j447N912o657n825R384J8580J2457
$$ plain form
11296 15363 20124 18642 11308 1018 -1687 160 422 9954 4133 10381 21718 25477 24330 20057
11282 20057 18905 5049 6819 15046 21949 17178 24052 25080 19229 23132 28363 20206 25259 34137
11268 34137 48413 68951 65493 55528 50195 58564 52792 69781 81121 74412 80920 103781 115311
11255 115311 123227 138218 165748 228521 279312 376439 534881 777091 1082609 1382370 1529479
11244 1529479 1464037 1198131 893959 653742 475419 354962 273098 227805 188160 151922
11234 151922 113519 92199 92496 87649 66953 67566 78523 73493 56597 57756 64130 60272 57429
11221 57429 56488 63585 63887 55094 46853 48126 57179 63300 62036 52115 45044 48872 56630 47119 58963
11206 58963 51512 41827 37195 37612 36903 35869 49605 48158 54070 47413 41588 50972 69552 82009
11192H2009l103K265P699J1968N683j0971K890N624m882o152j649J4091J1628
11179A17100R763K335l7450p2290j18243j24863j05646l1968L0164N2856M7254
11168b30988M8387K8933J9354K2865J7590Q143J1518q80R585J3285Q40O567J7400
11155b7401J80N852o30r913n457m344J855J353K325P735J5920M17r765j0273l136
11140c5282l17N348K1989K9957P581n442k2372j0294j301J2001J1542J4396n968
11127B1838k475n937j2346k05P634N668K307l720K313j072N123n342q490j2690
11113g394m60P310N521J111J4008R623j646n132O958R404Q10K306q96n725K028
11098C7826p409n047R597J0382K8848K8141N968L195J3249J2430K5683P961k215
$$ plain form
11192 82009 78906 81171 88870 100838 106521 95550 98440 104064 99182 93030 91381 105472 117100
11179 117100 126863 129198 91748 19458 -98785 -223648 -329294 -361262 -331098 -278242 -230988
11168 -230988 -182601 -153668 -134314 -111449 -93859 -85716 -74198 -75078 -65493 -52208 -51368 -44801 -27401
11155 -27401 -27221 -21369 -21999 -31912 -37369 -41713 -39858 -38505 -36180 -28445 -12525 -12108 -21873 -32146 -35282
11140 -35282 -35599 -30251 -8262 21695 29276 23834 1462 -8832 -10133 1868 13410 27806 21838
11127 21838 19363 13426 1080 875 8509 14177 16484 12764 15077 14005 19128 13786 5296 -7394
11113 -7394 -7854 -544 4977 6088 20096 29719 28073 22941 29899 39303 40113 42419 41523 35798 37826
11098 37826 30417 25370 34967 45349 74197 102338 108306 111501 124750 137180 162863 170824 168609
11085A68609P20j150j2483j5291k9659k2791q392j0208j4697p484l714J870m086
11072D1244k965N879j7q039L753J6923k385o010j721j413p158q67J1020p295j8999
11057B1950j0130J5697J0377P559L090L604k450j7027O869R851R597N677J952
11044F6616N519Q531l400J539L923J375j030r516j270R011M883j0468n406N734
11030G6041L657j2471j8813k0590j652j1752Q109P702J625J1740L0172L1684L2676
11017A38128J3802r819n092J38J1954m183O909J5503J1190p17k885j2595k7024
11004A35309q015j673o288j2072M585n739k75n851j2458J398O281R843O092r797
10990A01340j57L915n959j0019Q63n637k348j3632r667J970o654j6378N37q390
$$ plain form
11085 168609 169329 168179 155696 140405 110746 87955 79563 69355 54658 47174 43460 45330 41244
11072 41244 38279 44158 44141 36102 39855 56778 54393 48383 46662 45249 38091 37224 48244 40949 21950
11057 21950 11820 27517 37894 45453 48543 52147 49697 32670 39539 49390 58987 64664 66616
11044 66616 72135 80666 77266 78805 82728 84103 83073 73557 72287 81298 86181 75713 70307 76041
11030 76041 79698 67227 48414 27824 26172 14420 22529 30231 31856 43596 73768 105452 138128
11017 138128 151930 142111 137019 137157 149111 144928 151837 167340 178530 177813 174928 162333 135309
11004 135309 127294 125621 119333 107261 111846 106107 105832 99981 87523 88921 95202 105045 111137 101340
10990 101340 101183 105098 99139 89120 89983 84346 81998 68366 58699 60669 54015 37637 38174 29784
10976B9784o320J4411P454j765J405mP595Q09r799j1596m3553p7233p1477m3371
10962b03660J9726J12159J69757J53401P9286l5907r1369o2643N107K7305R761
10951A82923M230j0752j5993j993m763N442R029r630j0961l700j441j3698J2205
10938A40898M888J1255O508j0890j1042L903j19l030P868R577K2199P025p585
10925A81455r973o274L055P293O973K917j8868j1298P257J3502J8848j998J7472
10912B10361J4529J1983J8470J2585J2560j0299J4361J3904J4860K0761K0512
10901C54587R775J5057J8630J0316J6606K6246K5665N681K0402J6117K1517K2009
10889E62608J5274K9192L3302L8415L7854M7357L5673M9663P1657P6087P8453
$$ plain form
10976 29784 23464 37875 45329 43564 44969 44965 52560 53369 43570 31974 -11579 -88812 -160289 -203660
10962 -203660 -183934 -71775 97982 251383 330669 294762 203393 140750 145857 173162 182923
10951 182923 187153 176401 160408 158415 153652 159094 168123 158493 147532 143832 142391 128693 140898
10938 140898 145786 157041 163549 152659 141617 145520 145401 142371 150239 159816 182015 189040 181455
10925 181455 171482 165208 168263 175556 182529 185446 166578 155280 162537 176039 194887 192889 210361
10912 210361 224890 236873 255343 267928 280488 270189 284550 298454 313314 334075 354587
10901 354587 364362 379419 398049 408365 424971 451217 476882 482563 502965 519082 540599 562608
10889 562608 577882 607074 640376 678791 716645 764002 799675 849338 920995 997082 1075535
10878A075535Q6569J35206J85293K35471K89558K73108J44479j6632j78325j93920
10868B036342j23487p5132l445M4569P9925J00826J33236J85846K26361K99434
10858B904475M02353N09453O00843N54860L38153J00806p668J02280K69524M48075
10848F223154O20359Q32922J065827J344884J696629K187935K860037L829740
10840B0661487N207750P257174J0497608J5942128K5146590L9937851N9714389
10833A84364977P1197746M6417353j089263m7882314o8663397n5372066l7560139
10826I1412897k4797203j6646933j1531919q241372o018761m424948l295003k532361
10818A3924397j973344j555193j243147j027387q69493p31009n86046m51074k81201
$$ plain form
10878 1075535 1162104 1297310 1482603 1718074 2007632 2280740 2425219 2408587 2230262 2036342
10868 2036342 1912855 1837723 1834278 1878847 1958772 2059598 2192834 2378680 2605041 2904475
10858 2904475 3306828 3816281 4417124 4971984 5310137 5410943 5403275 5505555 5775079 6223154
10848 6223154 6843513 7676435 8742262 10087146 11783775 13971710 16831747 20661487
10840 20661487 25869237 33126411 43624019 59566147 84712737 124650588 184364977
10833 184364977 255562723 301980076 300890813 253008499 184345102 128973036 91412897
10826 91412897 66615694 49968761 38436842 30195470 24176709 19751761 16456758 13924397
10818 13924397 11951053 10395860 9152713 8125326 7255833 6524824 5938778 5487704 5206503
10809E206503j17519K1910k3229k37262m62745n60655m73615l50253k69115k21429
10799B512591j74671j42155j27910j17555j25146j17774j12804j00257r9854r2923
10789A301542n2672k9548m2073m5538n8002o1213l8669l2208l6976j7844l8195
10778H48604k7675j4392j1764j1100j3922k9174k8381l0365l6463j7063j2732
10767F15573j8497n957r032j2567k0591k6896j5342j5971K154j3868j6807m922
10755D57277j3676j9762j3068q658j8771m708M520k228J3413q948k1553j7860
10743C45978j5146J0146q788j9463j4834n499K66j8237l188N790M172J0404Q446
10730C00047j9272J146j1423k3672n990l250k3552j1642k353j3105j9263q760
$$ plain form
10809 5206503 5088984 5110894 5087665 4850403 4387658 3827003 3353388 3003135 2734020 2512591
10799 2512591 2337920 2195765 2067855 1950300 1825154 1707380 1594576 1494319 1394465 1301542
10789 1301542 1248870 1219322 1177249 1131711 1073709 1012496 973827 941619 904643 886799 848604
10778 848604 820929 806537 794773 783673 769751 740577 712196 681831 645368 628305 615573
10767 615573 597076 591119 582087 569520 548929 522033 506691 490720 492874 479006 462199 457277
10755 457277 443601 423839 410771 402113 383342 378634 383154 380926 394339 385391 363838 345978
10743 345978 330832 340978 332190 312727 297893 292394 292660 274423 271235 277025 281197 291601 300047
10730 300047 280775 281921 270498 246826 240836 237586 214034 202392 200039 186934 167671 158911
10718A58911j911P257J6742N917L13j5543r650m713m20K5367J1805m1006m5483
10705A07586k9340L0880Q6791R5960J00156M6589j181l4118n1407m5197k9086
10694B77633k5394k1714O220J440j3274P418j0731j0699M98J0177m427j9053k6303
10681A71791j6400L779J0560j1324j3234k1180j3877n09O679P638P616l243n848
10668A22448J5867J3016j3999j645l930K462j7284k617o200P03m976p894l873
10655I2078O300O268K2918N338o058O378P239M712J8504L6139L3853L6684J4018
10642B84371J4829O879J2560K232P660J2376J6711J1117j877J150J4807K7653
10630D10468M4471M7754L2208J4505K1999O0033P6288R3307J30158J89705K46468
$$ plain form
10718 158911 157000 164257 180999 186916 187229 171686 162036 157323 156903 182270 194075 153069 107586
10705 107586 78246 109126 195917 291877 392033 438622 437441 403323 351916 306719 277633
10694 277633 252239 230525 236745 238185 224911 232329 221598 210899 211397 221574 217147 198094 171791
10681 171791 155391 159170 169730 158406 145172 123992 110115 109606 116285 123923 131539 128296 122448
10668 122448 138315 151331 137332 135687 131757 134219 116935 114318 108118 108821 103845 95951 92078
10655 92078 98378 104646 127564 132902 126844 133222 140461 145173 163677 199816 233669 270353 284371
10642 284371 299200 306079 318639 320871 328531 340907 357618 368735 366858 368008 382815 410468
10630 410468 454939 502693 534901 549406 571405 631438 707726 801033 931191 1120896 1367364
10619A367364L39430M73522O52459Q81990J096831J158784R65603N16786Q5l55379
10609G097475m15337k25623Q7397N08250J028239J659664K225666K372220J759145
10600A6097096N26086p71271j515092j491451j004780l04385M43456J284773K187728
10591A5452160K887065K904229J801744j03090j949516k873139k734407k041070
10583A3343976j222188m09861L57479J066632J547411J467916O24852o96255j858674
10574A4221288k327940k102289j558602r87807m94148q9173K54339M13853L14902
10565G644423o1489n75033r88397j143266j055334q62169o43157m78164l57763
10556A479651k58655j84875j34330j08049q5156n5532m9496m8026m6090m7917
$$ plain form
10619 1367364 1706794 2180316 2832775 3714765 4811596 5970380 6935983 7452769 7452854 7097475
10609 7097475 6682138 6456515 6543912 7052162 8080401 9740065 11965731 14337951 16097096
10600 16097096 16623182 15851911 14336819 12845368 11840588 11536203 11979659 13264432 15452160
10591 15452160 18339225 21243454 23045198 22942108 20992592 18119453 15385046 13343976
10583 13343976 12121788 11711927 12069406 13136038 14683449 16151365 16776217 16079962 14221288
10574 14221288 11893348 9791059 8232457 7244650 6750502 6661329 6915668 7329521 7644423
10565 7644423 7582934 7007901 6019504 4876238 3820904 2958735 2315578 1837414 1479651
10556 1479651 1220996 1036121 901791 793742 708586 653054 603558 555532 509442 461525
10546D61525k7623m1407k2876j2085k6246k8884k1004j3525l193j9501j5515k902
10534B26764j1802o053m223j9960j0340k6279r179P947j876J4269J2947j2688
10522A59527k892J6266J8346K744j1066j3036r763m522J5430R826p932m827o794
10509A61307M8N916J1224P356N583J1570j023p385O343O006R853K393O589K6283
10495B52063M4318L8034M9451N8902K6385o0425j02523j20991j03483n6192k4336
10484A203r704k5936j2388J5259K972J4359K5153P53p986l424J533N424J2903
10471B0121L989n38J134o349J3959l863j5070N103J0452k96M901m870n902O320
10457B9091Q250R460q82n849j4503j981j841l382l814J0686J2761R173j518o368
$$ plain form
10546 461525 433902 392495 369619 357534 331288 302404 281400 267875 264682 245181 229666 226764
10534 226764 214962 208909 204686 184726 174386 148107 138928 146875 144999 159268 172215 159527
10522 159527 156635 172901 191247 193991 182925 169889 160126 155604 171034 180860 172928 168101 161307
10509 161307 161355 167271 178495 185851 191434 203004 201981 194596 200939 206945 216798 219191 225780 252063
10495 252063 296381 334415 383866 442768 469153 408728 306205 185214 81731 25539 1203
10484 1203 -8501 -34437 -46825 -31566 -28594 -14235 10918 11671 3685 261 1794 7218 20121
10471 20121 24110 23572 24706 18357 32316 28453 13383 18486 28938 28642 33543 28673 22771 29091
10457 29091 37341 46801 45919 40070 25567 23586 21745 18363 14549 25235 37996 47169 45651 39283
10443C9283j7684l354J195K4806J4089o704P058k979N70N059p794L963O215k324
10429F1399p96P445n354n190J0031P418K5348L3421L6206L7296M7275P3055J29664
10416D57218J87245K62300L14414K37902M3404j63903l00949k86839k05010j55564
10406C90218r1067n2065m0325l5586j7088k4299k9609j7286r138R979J1147m468
10394I0413l686J2348q748n231j9662o159o2l531P617J4146m930j5566o093J061
10380E1917j91p083k342K184P121o515r655N157J1040R222o30p412K969j3770
10366D2012n311n833p753L474N197K272q79P917Q128p633J2845l00j3942k1569
10352A8625O75K323O953R920Q187M117k178j0513j9139J3185J6558Q024J0329
$$ plain form
10443 39283 21599 18245 19440 44246 58335 51631 58689 55710 56280 61339 53545 57508 63723 61399
10429 61399 60603 68048 62694 57504 67535 74953 100301 133722 169928 207224 254499 327554 457218
10416 457218 644463 906763 1221177 1459079 1502483 1338580 1037631 750792 545782 390218
10406 390218 299151 247086 206761 171175 154087 129788 100179 82893 73755 83734 94881 90413
10394 90413 86727 99075 90327 85096 65434 59275 59213 55682 63299 77445 72515 56949 50856 51917
10380 51917 51726 44643 42301 44485 51606 45091 35436 40593 51633 60855 60225 52813 55782 42012
10366 42012 36701 30868 23115 26589 31786 34058 33179 41096 49224 41591 54436 54136 40194 18625
10352 18625 19300 21623 28576 38496 46683 50800 48622 38109 18970 32155 48713 56737 67066
10339F7066o123o033l154n610j1646j5542j9478O236L338P740M546l734J1792
10326B9398K0503m391j2540n400J42J2109j0223r739m243J560L192L021J524K648
10312B7561l688q812j2603N44K911P079Q272K780j472p591K586P81M98k672P832
10297B4006J1027r20q893j4661O491O727j600Q760m494r016k987N437q121r652
10283B104J896J5856q691p149J2276Q926J48R64K2233M358j1191l849r135L328
10269C2074N859N754j7306p412k661M637l274L945J3681J6637L762n700j6398
10256C3598j580l239J809J537l662K226m512m414l937q238q546J890K628l171
10242B389k226R82l953J7511O442J309j155J1849l070k2616R46r733J429k452
$$ plain form
10339 67066 60943 54910 51756 46146 34500 18958 -520 5716 9054 16794 21340 17606 29398
10326 29398 49901 45510 32970 27570 27712 39821 29598 19859 15616 17176 20368 23389 24913 27561
10312 27561 23873 15061 2458 3002 5913 12992 21264 24044 22572 14981 17567 18348 18846 16174 24006
10297 24006 35033 34113 25220 10559 17050 23777 22177 30937 26443 17427 14440 19877 11756 2104
10283 2104 4000 19856 11165 4016 16292 25218 25366 26330 48563 52921 41730 37881 28746 32074
10269 32074 37933 43687 26381 18969 16308 20945 17671 21616 35297 51934 55696 49996 33598
10256 33598 32018 28779 30588 32125 28463 30689 26177 21763 17826 9588 1042 2932 5560 2389
10242 2389 163 1145 -2808 14703 21145 22454 21299 33148 30078 7462 8408 -1325 104 -2348
10228b348n306M39K3163J1382o383k279k243r618R498r412p694J5828N775K029
10214B2831n155K066J082Q273j5814j1251O339n551o515l220l559J0081R381Q453
10200A7441n804p705r265j0777L50Q755N413r222K062J3185o487j484K1075J2997
10186C0534j1288k983o096k4164r147J6518K0473J5260O499l178J9849l466r483
10173C9328j46N436q683l346N181J4224K1901J7846J942J735M201J037j4679j9334
10159F6643p940O757N159J4834J7403L2834O822l0r652k0538j1886j3956K719
10146H9169N029n380p940K172J927M585J613j1333q153m880K386r023r833N262
10132E5601M711l912j5339N103J3363J0976l630q014o302j2809J67p931n970P333
$$ plain form
10228 -2348 -7654 -7215 15948 27330 20947 18668 16425 6807 16305 6893 -801 15027 20802 22831
10214 22831 17676 19742 20824 29097 13283 2032 8371 2820 -3695 -6915 -10474 -393 8988 17441
10200 17441 11637 3932 -5333 -16110 -15760 -7005 -1592 -10814 -8752 4433 -2054 -3538 17537 30534
10186 30534 19246 16263 10167 -13997 -23144 -6626 13847 29107 35606 32428 52277 48811 39328
10173 39328 39182 44618 35935 32589 37770 51994 73895 91741 93683 95418 99619 100656 85977 66643
10159 66643 58703 65460 70619 85453 102856 135690 142512 142482 132830 112292 100406 86450 89169
10146 89169 94198 88818 80878 83050 84977 89562 91175 79842 71689 66809 69195 60172 50339 55601
10132 55601 60312 56400 41061 46164 59527 70503 66873 58859 52557 39748 39915 31984 26014 33347
10118C3347O283p578p745j0661r419l676K796J4481R394j192l29K577L579l146
10104B8711n995q481j5548r895J1174J0145J5927J2045L774j0202j2075o41j14
10091A8825j6072m945m312J5797R364j16K811j3800p546R028P288O8j815j869
10077A2706o097j0662J023N723R567p139q426l310Q977O403K327J1992J459m167
10063B0376M931m089k99K236r26j669j7033p012j804J711J0070J2565J932k3473
10049b484l198N895N039L577p118q264R487O60J3181J3048n031j7703l34L613
10035A0368R900p391n248O034R734j646m701j8619m46J9933K371j2746j194q358
10021b009j1018P30L553J6813M211L154Q46l900j754p801p870p165p951K495N780
$$ plain form
10118 33347 39630 32052 24307 13646 4227 551 3347 17828 27222 26030 25701 28278 31857 28711
10104 28711 22716 14235 -1313 -11208 -34 10111 26038 38083 41857 31655 19580 18939 18825
10091 18825 2753 -2192 -6504 9293 18657 18541 21352 7552 6 9034 16322 16390 14575 12706
10077 12706 6609 -4053 -3030 2693 12260 5121 -3305 -6615 2362 8765 11092 23084 24543 20376
10063 20376 25307 21218 20919 23155 22229 20560 3527 -3485 -5289 -3578 6492 19057 20989 -2484
10049 -2484 -5682 213 5252 8829 1711 -6553 2934 3594 16775 29823 24792 7089 6755 10368
10035 10368 20268 12877 7629 13663 23397 21751 17050 -1569 -2015 17918 20289 7543 6349 -2009
10021 -2009 -13027 -12297 -8744 8069 12280 15434 16280 12380 10626 2825 -5045 -12210 -20161 -17666 -11886
10006a1886l793M340N036J494L124N746K318j1298k261P389J915j037n481K450
9992a944n237j1379p275J3223Q966O852J3659j942m777M060p979n967J06m739
9978d373j137L722J2232L558m499p184J804M387j085l573j1436m225J4632Q761
9964A1584J0353j4136j0800o9J883Q114j4061k723R725J8512l942l161N98j7599
9950e722j9927M986J6035J6494r369p286L145O176n542o286j199r57p949J4560
9936b841M940l651J0697J0422m677r055P513K159K142n939q268k838J0299O719
9922A7622j972j5489j099P093k860n249O983K829j6512p377M516N62N030p580
9908a3503k628J8812m072q910r48K315J0251J2650k58l946r256n38j543J0467
$$ plain form
10006 -11886 -15679 -11339 -6303 -4809 -1685 4061 6379 -4919 -7180 209 2124 1087 -4394 -1944
9992 -1944 -7181 -18560 -25835 -12612 -3646 3206 16865 14923 10146 14206 6227 260 366 -4373
9978 -4373 -5510 -1788 10444 14002 9503 2319 4123 8510 7425 3852 -7584 -11809 2823 11584
9964 11584 21937 7801 -2999 -3068 -1185 6929 -7132 -9855 -130 18382 14440 11279 11877 -5722
9950 -5722 -25649 -20663 -4628 11866 2497 -4789 -1644 4532 -1010 -7296 -8495 -9452 -17401 -2841
9936 -2841 2099 -1552 9145 19567 14890 5835 13348 15507 17649 11710 3442 604 10903 17622
9922 17622 15650 161 -938 6155 3295 -1954 5029 7858 -8654 -16031 -11515 -10953 -5923 -13503
9908 -13503 -16131 2681 -1391 -10301 -11249 -8934 1317 13967 13709 9763 507 -31 -1574 8893
9894H893K147o917l409l614j6862K0499K4970k45j0027n380j661k658k271o928
9880c463R461N453J0096n757r059L78N4j1241m770j3261J4870J1184M871J277
9866A0093n160q769J5266K777m423n065J1336K478j6947n060j916P644j947n646
9852e339J396Q257j1612M712J3949J855O84r653n00K343M53R13P196P388p85N166
9836B6423j1198k0136p635L636J5559M781N283m1o76K04l233L739q732J091J6722
9821B5787O165p134j2096j0032l832n627r70J0430m697Q022J6511K45L966l247
9807B3491r648j0803k482k504m761l861O887O091K772O8K184o111o361R439O281
9792A0682k484P12l459Q158J0720l684o089o5L884q766J0317j440l922K297M725
$$ plain form
9894 8893 11040 4123 714 -2900 -19762 737 25707 25462 15435 10055 8394 5736 3465 -3463
9880 -3463 5998 11451 21547 15790 6731 7109 7163 -4078 -8848 -22109 -7239 3945 8816 10093
9866 10093 4933 -3836 11430 14207 9784 4719 16055 18533 1586 -3474 -5390 2254 307 -5339
9852 -5339 -3943 4314 -7298 -2586 11363 13218 13902 4249 3749 6092 6545 7458 14654 22042 21257 26423
9836 26423 15225 -4911 -12546 -8910 6649 11430 16713 16672 15996 16200 12967 16706 7974 9065 25787
9821 25787 31952 24818 12722 2690 -1142 -6769 -7739 2691 -2006 6016 22527 22772 26738 23491
9807 23491 13843 3040 558 -1946 -6707 -10568 -3681 2410 5182 5250 7434 1323 -5038 4401 10682
9792 10682 8198 8910 5451 13609 24329 20645 14556 14491 18375 9609 19926 18486 14564 16861 21586
9777B1586J30j2199j1121n642K084Q490M864j6277o968k633J3518Q680K777J401
9763H690q560n422R383O629l257m42M967j6806p271P841J7011R079J723P950j858
9748B9657j6894j0554R42J2291J0395j4429p585m217k460N27P513q141J204J5827
9734A4076L480j0104l489J903j1454L159O043L106j2087j0630k040O382J3113
9721A458N74L966J0178m201q295q993O663K4332J017j1321Q303o462P2L819M707
9706B5817k400j8307o104p874J0985K1054M990P85m000M621N908J078o408k0450
9692I695j0396L771R146k129J931j55l01r09j4823p356Q568L013R96K045J4111
9677A7207R917P322J1617J6101K5732R104K210j4006j7450r740r478k0486k9434
$$ plain form
9777 21586 21716 9517 -1604 -7246 -5162 3328 8192 -8085 -15053 -17686 -4168 4512 7289 8690
9763 8690 130 -5292 4091 10720 7463 7021 11988 -4818 -12089 -4248 12763 21842 23565 31515 29657
9748 29657 12763 2209 3151 15442 25837 11408 3823 -394 -2854 -2327 5186 -2955 -1751 14076
9734 14076 17556 7452 3963 5866 -5588 -2429 3614 6720 -5367 -15997 -18037 -11655 1458
9721 1458 2032 5998 16176 11975 3680 -5313 1350 25682 26699 15378 23681 17219 17291 21110 25817
9706 25817 23417 5110 -994 -8868 2117 23171 28161 28946 24946 29567 35475 36553 30145 9695
9692 9695 -701 3070 12216 10087 12018 11863 11562 10653 -4170 -11526 -2958 55 1051 3096 17207
9677 17207 27124 34446 46063 62164 87896 97000 99210 85204 67754 58014 48536 28050 -1384
9664a384P340n353p214M519O086K564P295k512j0784n923O06J4173K815N369K979
9649B0576q295n389P310n730L149j604L339N31n474L697p590P27m307J1170J3044
9634B5154j041j5824k1399M331L35j450l281R57M861J0379P196M493J838r03M152
9619A9798o706m162q216k705J6524l815l390l794k481P112m379j0299L303n662
9605h872O47m398J465L148O15m787M939P67l272J454K65K688q824O737J781L334
9589b313M60J643P686p136J0936J1915j9535j0148J8302R745k540l790j733m984
9575H508J2916l054Q445R53j3663K363n673K530J3667O261o47n602m147p819n737
9560I301r892j0201K758r022m882J8987n134n069o3J3190K366j2665q054N459
$$ plain form
9664 -1384 5956 603 -6611 -2092 3994 6558 13853 11341 557 -5366 -4760 9413 12228 17597 20576
9649 20576 12281 6892 14202 8472 11621 10017 13356 13887 8413 12110 4520 5247 940 12110 25154
9634 25154 24113 8289 -13110 -8779 -8444 -9894 -13175 -12218 -7357 3022 10218 14711 16549 15646 19798
9619 19798 13092 8930 714 -1991 14533 10718 7328 3534 1053 8165 3786 -6513 -3210 -8872
9605 -8872 -8225 -12623 -11158 -8010 -7395 -12182 -7243 -6476 -9748 -8294 -8029 -5341 -14165 -7428 -5647 -2313
9589 -2313 -1853 -210 7476 340 11276 23191 3656 -6492 11810 21555 19015 15225 13492 8508
9575 8508 21424 18370 26815 27768 14105 16468 10795 13325 26992 33253 32606 27004 22857 15038 9301
9560 9301 -591 -10792 -8034 -17056 -21938 -2951 -8085 -13154 -13217 -27 2339 -10326 -18380 -12921
9546a2921n624M634J2213M007k591J2332N195k32J012N72p873k648P571o882p81
9531G984m244k063O809j542q395M539L543k077J4319J2044j5336j2775j076J3648
9517A5378o328j0207L498M87K04k746j0194J1563J0306j1284j1702m114J9519
9504D380O077m770j269Q791L684L29j1448l668P07j2730o637J4479J820k067L363
9489A041K631N523n096k054k282Q203l308l073o372p808K121P552j977l324N317
9474b906m275n060Q182J151m239j1181n725J0014M129K655j582J0300m417q995
9460a1949J247q337r600J091N523J3903k846p730Q329J6160l159r688J2238K2191
9446B7373Q67j4686N709j6218o049N711p593m684m620K516N164L441N967L94k618
$$ plain form
9546 -12921 -18545 -13911 -1698 2309 -282 12050 17245 17013 18025 18597 10724 8076 15647 8765 7984
9531 7984 3740 1677 8486 6944 -1451 3088 6631 4554 18873 30917 15581 2806 1730 15378
9517 15378 9050 -1157 2341 2828 3032 286 -9908 1655 11961 677 -11025 -15139 4380
9504 4380 10457 5687 4418 13209 16893 17222 5774 2106 2813 -9917 -16554 -2075 -255 -2322 1041
9489 1041 3672 9195 4099 2045 -237 7966 4658 1585 -4787 -12595 -10474 -2922 -4899 -8223 -2906
9474 -2906 -7181 -12241 -4059 -2908 -7147 -18328 -24053 -14039 -9910 -7255 -8837 1463 -2954 -11949
9460 -11949 -10702 -19039 -28639 -27548 -22025 -8122 -10968 -18698 -10369 5791 2632 -7056 5182 27373
9446 27373 28240 13554 19263 3045 -3004 2707 -4886 -9570 -14190 -11674 -6510 -3069 2898 3292 674
9431F74N131J847l143q112J675m026q151p955J6143Q800L533M265L745M872o519
9416A2779p496l05j851N085j0065K161N35n089j6144l37N844k805N489j928M320
9401i807M112k482R071O008q624L485m221M248j0109k907j062M001O237R235J827
9386I012n989j8685J1905J0856L222Q100n531k203n04j2979o82o908N683K347
9372b356K668J504j738j058O129M955l259k667o226L368m029r181K257M562J621
9357c450K346p373m638N938J5156m558o390j0145l003J782M200Q249j476P587
9343D225N171K761j582n280K722R552n337j4499q273O341J629k652O706L764n735
9328d87j108N485k462k2696r133R39O181r844l237Q004J6057O045O696o76n948
$$ plain form
9431 674 5805 7652 4509 -3603 -1928 -5954 -14105 -22060 -5917 2883 6416 10681 14426 19298 12779
9416 12779 5283 4978 3127 8212 -1853 308 843 -4246 -20390 -20727 -14883 -17688 -12199 -14127 -9807
9401 -9807 -5695 -8177 894 6902 -1722 1763 -2458 1790 -8319 -11226 -12288 -8287 -2050 7185 9012
9386 9012 3023 -15662 -3757 7099 10321 18421 12890 10687 10183 -2796 -3478 -10386 -4703 -2356
9372 -2356 312 1816 78 -980 5149 10104 6845 4178 -2048 1320 -2709 -11890 -9633 -5071 -3450
9357 -3450 -1104 -8477 -13115 -7177 7979 3421 -2969 -13114 -16117 -14335 -10135 -1886 -3362 4225
9343 4225 9396 12157 10575 5295 8017 17569 12232 -2267 -10540 -4199 -2570 -5222 1484 5248 -487
9328 -487 -1595 3890 1428 -21268 -30401 -29462 -23281 -33125 -36362 -28358 -12301 -6256 440 -236 -6184
9313f184N51L838r222k645J872l296K07m193k244Q219J5444P309n014q760R832
9298E714Q874j976j1247R79j267L11J3562L868o48r956m24j2073N05J0211Q768
9283A5201j6578j3543n11R206O111N167k588p503q061J120L982o180J902Q316
9269c959k829j1816L324R152p8j7006n308O352k875q767k436P975O574L668J784
9254a6245N682R228o730L361N089j0982k994m90J6742R142j2608Q739j792m008
9240B134r3M135j6662M144K1731M854m801j0167J256p492j471q088M58l134Q962
9225d234r374r268J5795J7827j484M953J0284L000o42n187o055O812Q790j3686
9211A7531r125k995J573o711j2848N30p676J795N055L691q013k886R671K864l479
$$ plain form
9313 -6184 -5633 -1795 -11017 -13662 -11790 -15086 -14879 -19072 -21316 -13097 2347 9656 4642 -4118 5714
9298 5714 14588 12612 1365 2344 1077 1388 14950 18818 18170 8214 7790 -4283 -3778 6433 15201
9283 15201 -1377 -14920 -15431 -6225 -114 5053 2465 -5038 -13099 -11979 -7997 -14177 -12275 -3959
9269 -3959 -6788 -18604 -15280 -6128 -6206 -23212 -28520 -22168 -25043 -33810 -36246 -28271 -21697 -18029 -16245
9254 -16245 -10563 -1335 -8065 -4704 385 -10597 -13591 -14081 2661 11803 -805 7934 6142 2134
9240 2134 2041 6176 -10486 -6342 15389 20243 15442 5275 6531 -961 -2432 -10520 -10062 -13196 -4234
9225 -4234 -13608 -22876 -7081 10746 9262 14215 24499 27499 26857 21670 15615 22427 31217 17531
9211 17531 8406 5411 6984 273 -12575 -12045 -19721 -17926 -12871 -9180 -17193 -20079 -10408 -7544 -11023
9196a1023m549R490O092r746m155K199m7Q236M191N752j807p211q34J497J632
9181b83Q124M343k744j678m173j0035j09k167O050O42R166l504M104J7058K105
9166B6899j6017O210J3963p767k5035j3044M151o561k519Q583M20Q199k402L27
9152d593J0398N16o749q97J4068M025o27j967n143r155j5640l500Q864O111J8359
9137A4070P906K839n22j699j1012q911k340L410J43N80Q077r829q916P188p77
9122B07j0869O43j115Q255J0954j0785l520J2870j669r753M3o55n083j3724k428
9107b6629J4291J6318m874j3712n159n775J1679J0827p101q562J4340K659j8727
9094b0425o160J2473J4993K763j0331Q504K605o349j0627K366K488J1067K850
$$ plain form
9196 -11023 -15572 -6082 10 -9736 -13891 -11692 -11739 -3503 688 6440 4633 -2578 -3412 -1915 -283
9181 -283 7841 12184 9440 7762 3589 -6446 -6555 -8722 -2672 -2030 7136 3632 7736 24794 26899
9166 26899 10882 17092 31055 23288 -1747 -14791 -10640 -17201 -19720 -11137 -10717 -2518 -4920 -4593
9152 -4593 5805 6321 -428 -1325 12743 16768 16141 14174 9031 -124 -15764 -19264 -10400 -4289 14070
9137 14070 21976 24815 24293 22594 11582 2671 331 3741 3884 4464 12541 2712 -6204 984 207
9122 207 -10662 -10019 -11134 -2879 8075 -2710 -6230 6640 4971 -4782 -4739 -5394 -10477 -24201 -26629
9107 -26629 -12338 3980 -894 -14606 -19765 -25540 -13861 -3034 -10135 -18697 -4357 -1698 -20425
9094 -20425 -26585 -14112 881 3644 -6687 1817 4422 -1927 -12554 -10188 -7700 3367 6217
9081F217p480J291M529k685o823j729j1459k932j695P471L455O697k533l059k178
9066a2913j130J955K357j792o343J8491R674r02q964J6053j133k2436j6926l019
9052b7028J6100R641O949L745j731O34n501j2309P092l431j287j0614j0089R76
9038b6853Q371J7724P295k062K856j892j3809L232m409o334J7395n895q752l411
9024a6544m108n88Q346P565J477R514m033r254L694n813K80P860k961P683J6247
9009A9365r702k710J1622m535p911p326J840L500n20p485m909N586P401l037m121
8994b942L307l803L552l760o742O046Q929J0869K49r586p89L154m50n837O984
8979I181J789j0281k685j232O373R247j031N432l965k0307k491R803J619l382
$$ plain form
9081 6217 -1263 28 4557 1872 -4951 -6680 -18139 -21071 -22766 -15295 -11840 -5143 -7676 -10735 -12913
9066 -12913 -14043 -12088 -9731 -11523 -17866 625 10299 9397 433 16486 15353 -7083 -24009 -27028
9052 -27028 -10928 -1287 5662 9407 7676 8310 2809 -9500 -2408 -5839 -7126 -17740 -27829 -26853
9038 -26853 -18482 -758 6537 4475 7331 5439 -8370 -5138 -9547 -15881 1514 -4381 -13133 -16544
9024 -16544 -20652 -21240 -12894 -5329 -3852 5662 1629 -7625 -3931 -9744 -9464 -1604 -4565 3118 19365
9009 19365 9663 6953 18575 14040 6129 -1197 643 4143 3623 -3862 -8771 -3185 4216 1179 -2942
8994 -2942 365 -3438 114 -3646 -10388 -4342 4587 15456 15705 6119 5330 8484 8034 2197 9181
8979 9181 10970 689 -1996 -3228 3145 12392 11361 16793 12828 -7479 -9970 -167 1452 -1930
8965a930q544J6630j455q069J1621J517j7852q136J2966J1497o183j1973n021
8952a4932M903Q778O406l000j4754k907J179K507R905J0448J248r90K116l616
8938G291q255k513k921r246p373P25M663J1064o929l291j2129j817M804N48J294
8923b4085M640M032r917L252J0258J0224J2665R996l969J714n108j2168o274o702
8909a1442R061L302K45N654k11L00n270r837k55M312L346J1243r948n14P295m268
8893C013K660n811O770L178K406J345j838k765R546R195K853j7816k880p453P583
8878I986P604j541k3792k756M291j492O872J0158p478K153J0353J0296l562j6966
8864D126q024K276O449n103n084j2230Q8J6676Q502k194j5046m132n469j947J2914
$$ plain form
8965 -1930 -10474 6156 4701 -3368 8253 9770 -8082 -16218 -3252 8245 2062 -9911 -14932
8952 -14932 -10029 -1251 5155 2155 -12599 -15506 -14327 -11820 -1915 8533 9781 8791 10907 7291
8938 7291 -964 -3477 -6398 -15644 -23017 -22292 -17629 -6565 -13494 -16785 -28914 -30731 -25927 -25379 -24085
8923 -24085 -19445 -15413 -25330 -22078 -11820 -1596 11069 21065 17096 18810 13702 1534 -4740 -11442
8909 -11442 -2381 921 1166 6820 6609 6909 1639 -8198 -8453 -4141 -795 10448 500 -14 7281 3013
8893 3013 5673 -138 6632 9810 12216 13561 11723 8958 18504 27699 30552 12736 9856 2403 9986
8878 9986 17590 16049 -7743 -10499 -6208 -7700 -828 9330 1852 4005 14358 24654 21092 4126
8864 4126 -3898 -1622 4827 -276 -5360 -17590 -17502 -826 7676 5482 -9564 -13696 -19165 -21112 -8198
8849h198j44q427J844J2344K88m996r45j093L401k56P743M024N546l7k908j3816
8833e630j5347m61Q298r66p709m623K146K4352Q574J7342l547q820j5801m298
8819f490K563L099L005j777R278R644r486j4301J859J1304J1010j1037N319n548
8805H442m593j832p206K23J2828Q857j477j2947o978j150j1687N900R725k703
8791d598k10Q114J2540K645K87K085J7953K125k923L548j348l8K522M484k3097
8776B4089k4448j0585J4400J4748K368k908K216j295o746K784o748O616K70k2087
8762g326J039P012J6167P740O565j4185r598N416R483O868j003N654Q010n535
8748C6307j3629o117j3223l407k472l201J1135m300R49O144J216N89k690o061
$$ plain form
8849 -8198 -8342 -16769 -14925 -2581 -2293 -7289 -8234 -9327 -5926 -6182 1561 5585 11131 11094 8186 -5630
8833 -5630 -20977 -21438 -13140 -14106 -21815 -26438 -24292 60 8634 25976 22429 13609 -2192 -6490
8819 -6490 -3927 -828 2177 400 9678 19322 9836 -4465 -2606 8698 19708 8671 13990 8442
8805 8442 3849 2017 -5189 -4966 7862 16719 15242 2295 -4683 -5833 -17520 -11620 -1895 -4598
8791 -4598 -4808 3306 15846 18491 18778 20863 38816 40941 38018 41566 40218 40180 42702 47186 24089
8776 24089 -359 -10944 3456 18204 20572 17664 19880 18585 11839 14623 7875 14491 14761 -7326
8762 -7326 -6287 725 16892 24632 31197 17012 7414 12830 22313 29181 28178 33832 41842 36307
8748 36307 22678 16561 3338 -69 -2541 -5742 5393 1093 2042 8186 9402 9991 7301 1240
8734A240k083J0814m106j5800q842P447M848O870l259r945M939J0117R836n244
8720F832q645p167j62K595m155j0282J960J2345J6587p359j505K962r534n69j3304
8705a9401M066M909q42M536n119p658N115J0292K17O992J738M846o823o393j506
8690e031M864p675n893J163N005Q663P564M585o235J237r22O48P153p801p398
8675g3m050K068k712n87N325k630M57M318N23m461J052k63l580o460N485J4885
8659I297p35J362M977N889Q86j2543j2633j0853l139P213M272j316L912P771j761
8644B599P895j922L349k751m943P4P505R423k4314m776k788o57j724m57R250J0597
8628F360n159L293o421K545J0782l68L223k67q487o53M016p950J4413L65j1678
$$ plain form
8734 1240 -843 9971 5865 -9935 -18777 -11330 -6482 388 -2871 -12816 -7877 2240 12076 6832
8720 6832 -1813 -8980 -9142 -6547 -10702 -20984 -19024 -6679 9908 2549 1044 4006 -5528 -6097 -19401
8705 -19401 -15335 -10426 -11268 -6732 -11851 -19509 -14394 -4102 -3885 3107 4845 9691 2868 -3525 -5031
8690 -5031 -167 -7842 -13735 -12572 -7567 1096 8660 13245 7010 8247 7325 7973 15126 7325 -73
8675 -73 -4123 -2055 -4767 -5354 -29 -2659 -2202 2116 2639 -1822 -770 -1033 -4613 -11073 -5588 9297
8659 9297 8562 9924 14901 20790 21676 9133 -3500 -14353 -17492 -10279 -6007 -7323 -3411 4360 2599
8644 2599 10494 8572 11921 9170 4227 4301 11806 21229 -3085 -7861 -10649 -11306 -13030 -13487 -4237 6360
8628 6360 1201 4494 -1927 618 11400 11032 14255 13988 5501 4848 8864 914 15327 15692 4014
8613D014m86J1563R806n978j1848o404j664N349M669l700j2698j1496N495J4656
8599A278J5343j79p404K373l928J607M460K697Q578q476j0709R019k286j5062
8585b689l690J3414m001K536l572N813J0185K98m972j7292o625j934P101N094
8571c34N441J473O222r712j2442M881K891j466k667O133p645j0376K001J4386
8557a214R880J3513m898M280p774j6799l892P963J422j1951j9771o263J9729J4889
8543h86j720o290R807m139n682K836K763R27O670j118L471l30p541l187Q455r298
8527e262n191O216M14q750l315q803j73L128L725J4106Q280r3o2j226j7279n53
8511a4838M653J2231M907j189K166Q74R914k235o240K945L26l152O110J0904p174
$$ plain form
8613 4014 3528 15091 24897 18919 7071 667 -997 4352 9021 5321 -7377 -18873 -13378 1278
8599 1278 16621 16442 9038 11411 7483 9090 13550 16247 24825 16349 5640 14659 12373 -2689
8585 -2689 -6379 7035 3034 5570 1998 7811 17996 18294 13322 -3970 -10595 -12529 -5428 -334
8571 -334 5107 6580 12802 3090 -9352 -4471 -1580 -3046 -5713 420 -7225 -17601 -15600 -1214
8557 -1214 8666 22179 17281 21561 13787 -3012 -6904 1059 2481 -9470 -29241 -35504 -15775 -886
8543 -886 -2606 -8896 911 -3228 -8910 -6074 -3311 -2384 4286 3168 6639 6309 -1232 -4419 4036 -5262
8527 -5262 -10453 -4237 -3823 -12573 -15888 -24691 -24864 -21736 -18011 -3905 4375 4282 4220 2994 -14285 -14838
8511 -14838 -10185 2046 6953 5764 7930 8804 18718 16483 10243 13188 13514 10362 16472 27376 20202
8496B0202j0315l17L573j2728j3173Q152n36K424J0325p18j386K264n878j1765
8482i876q378J8276J2130j105r079l887R36K086n491J5529J2531M09j2001r591
8468B489o307J3727j64N501p234j0695J854O883j391Q736j154p028N447p541l045
8453G8P688q837p805N498J1416o729j474n158j2309P613J1182o771m565K188m940
8438a2925m56j076J3720M287k338o77N692j1487K213K974k14j0377P579J1351
8424H266J4648n397J377N048o737r189q068n376O5N891m924l424Q304O147o138
8409D93o693j449O618n677N391R062J6896J377j1313j2500j435n121j2526N384
8395a1493J6597J0510r058j6940M375O975Q841O85O200r864p800j647n64j874
$$ plain form
8496 20202 9887 9570 13143 415 -12758 -4606 -5142 -2718 7607 6889 5503 7767 1889 -9876
8482 -9876 -18254 22 12152 11047 1968 -1919 -983 1103 -4388 11141 23672 24081 12080 2489
8468 2489 -3818 9909 9745 15246 8012 -2683 -829 6054 4663 13399 12245 5217 10664 3123 78
8453 78 7766 -1071 -8876 -3378 8038 1309 -165 -5323 -17632 -10019 1163 -5608 -10173 -7985 -12925
8438 -12925 -13381 -14457 -737 3550 1212 535 6227 -5260 -3047 -73 -287 -10664 -3085 8266
8424 8266 22914 17517 18894 23942 17205 8016 -52 -5428 -5363 528 -4396 -7820 484 6631 493
8409 493 -6200 -7649 -1031 -6708 -1317 7745 24641 26018 14705 2205 770 -4351 -16877 -11493
8395 -11493 5104 15614 6556 -10384 -6009 966 9807 10492 16692 6828 -972 -2619 -3183 -5057
8381e057L62N891Q860q367K857j3214j14J6028q80j5117r6n849J2757M46O02J6752
8365A5861l649j3343l86L174k754K797P068l087n668q359K21N068O34L382L341
8350D300j5943P89K3241L933r325q106O949l187m184J4302L591M955O59j0993
8336A0981M177l337j1582r176k318P577J350j0971k958O254r899n177J8395J3078
8322F394L613j1341p607l259O542R119J247k817k765J266N818L58K283j2084m199
8307g432J170m884J714K40N572M43j941j0441j6683Q713O329J2946R537l50R867
8292A4800P085j0349j3521j3216j172L057J0879J5161L983j1379j0511j0589j6701
8279c2473N574J7431P765l571n585K635m78p237k212j953J0351N139j895n637
$$ plain form
8381 -5057 -4695 1196 10056 1689 4546 -8668 -8782 7246 6366 -8751 -8847 -14696 -1939 -1493 -891 15861
8365 15861 12212 -1131 -1517 1657 -1097 1700 8768 5681 13 -8346 -8125 -3057 -2423 959 4300
8350 4300 -11643 -10854 12387 16320 6995 -1111 5838 2651 -1533 12769 16360 21315 21974 10981
8336 10981 15158 11821 239 -8937 -11255 -3678 -2328 -13299 -16257 -10003 -19902 -25079 -6684 6394
8322 6394 10007 -1334 -8941 -12200 -5658 3461 4708 1891 -874 392 6210 6568 8851 -3233 -7432
8307 -7432 -6262 -11146 -9432 -9192 -3620 -3177 -5118 -15559 -32242 -23529 -17200 -4254 5283 4933 14800
8292 14800 21885 11536 -1985 -15201 -16373 -13316 -2437 12724 16707 5328 -5183 -15772 -32473
8279 -32473 -26899 -9468 -1703 -5274 -10859 -8224 -8702 -15939 -18151 -20104 -9753 -4614 -6509 -12146
8265a2146M52L823l741K52K6P702L247k48J566j6423j5348k003R591O771M468
8250a2011K348Q444Q771o838J998J322q607L463J75N332L696r439o008J2059P463
8235A2168O195j438L247p013k579l462p474M391J539n354l726j649Q006j2837
8221i986o653R845K75n731l190K514R112m035r830J1569R109o46K528K821L866
8206A1568J1611j0899j2124r601L838R51L55L403Q652K456M096q808l853j334
8192C11Q99m195j1707K615J0346L760N721L269K370n65p305o607o883n339n38
8177a3848m499J4018P568M401k877l48M849j2162l482P48j1321j1311j2121K2857
8163a7528L1662j24K769o20p189m73l045p364q037M140P221l279Q809m556j8768
$$ plain form
8265 -12146 -11694 -7871 -11612 -11360 -11334 -3632 -385 -633 933 -15490 -30838 -32841 -23250 -16479 -12011
8250 -12011 -9663 -1219 7552 714 2712 4034 -4573 -1110 -935 4397 8093 -1346 -7354 4705 12168
8235 12168 18363 16925 20172 13159 10580 7118 -356 4035 5574 220 -3506 -5155 2851 -9986
8221 -9986 -16639 -6794 -6519 -12250 -15440 -12926 -3814 -7849 -17679 -6110 2999 2353 4881 7702 11568
8206 11568 23179 12280 156 -9445 -5607 -4656 -4301 -898 7754 10210 14306 5498 1645 311
8192 311 1210 -2985 -14692 -12077 -1731 2029 7750 11019 13389 12824 5519 -1088 -7971 -13310 -13848
8177 -13848 -18347 -4329 3239 7640 4763 4415 9264 -2898 -6380 -5632 -16953 -28264 -40385 -17528
8163 -17528 14134 14010 16779 16159 8970 8497 5452 -1912 -9949 -5809 1412 -1867 6942 2386 -16382
8148a6382j744J213J2627Q718j2630k000M689M225j563N359P573K383k862l53
8134I253r01k337m391o125Q733J0892M683n519j6306j0326M918M124R710Q878
8120A5286N486o668o458l787k19k295l268r108j089R543Q098k406N223N643J087
8105A5068K335q646j1194p984k644p941k29R411J5777L963m879K50O649l318n308
8090A310m77J831j05L526J214J2563j103q227n203J27j0003j1046J221L231J0652
8075d89O203o166q357J089p282N515l120L55O495o675j171M237l520m029L472
8060a3443L86J615r225m697J9630m042P833j729o466R910Q392P293l687j150K5077
8045C5697j675j4937n709M114q871l997o033j2256J3146L124j1056l305L240M079
$$ plain form
8148 -16382 -18126 -16913 -4286 4432 -8198 -10198 -5509 -1284 -2847 2512 10085 12468 9606 9253
8134 9253 8352 6015 1624 -4501 4232 15124 19807 14288 -2018 -12344 -7426 -3302 6408 15286
8120 15286 20772 14104 7646 3859 3640 1345 -1923 -11031 -12120 -2577 5521 3115 8338 13981 15068
8105 15068 17403 8757 -2437 -10421 -13065 -21006 -21235 -11824 3953 7916 3037 3287 9936 6618 1310
8090 1310 833 2664 2559 6085 7299 19862 18759 10532 5329 5456 -4547 -15593 -14372 -11141 -489
8075 -489 5714 -452 -8809 -7720 -15002 -9487 -12607 -12252 -5757 -12432 -13603 -9366 -12886 -16915 -13443
8060 -13443 -13057 -11442 -20667 -25364 -5734 -9776 -1943 -3672 -10138 -228 8164 15457 11770 10620 35697
8045 35697 34022 19085 13376 17490 8619 4622 -1411 -13667 -521 2603 -8453 -11758 -8518 -4439
8031d439N702j5441M117L826L781n564K295J2152n239j7401N48O553N102P490
8017C482J2057p84K817j9433j1644L265J0999K72K085l894o773q214K109K3407
8003I751J5315j2712q073k936j077N006p932p481O876o311l966J473J651j0714
7989b1130k607Q154R636O979J1588l234m719j0189j0968N526J4428j1392p257
7976a5185o386L529O916J1668Q313n566j700o402p224L812M299j687n08Q08J0255
7961D942K809P371K901m750j2134M69P819j1505o135R358M254o599J560L332Q543
7946A2235O115l580M927j0334j3161m455j872M11J358m941p698L473J677K164
7932a3681R866P619j0065k975r318o048n8J5J7659J3323k361r337Q666M707m230
$$ plain form
8031 -4439 1263 -14178 -10061 -6235 -2454 -8018 -5723 6429 1190 -16211 -15663 -9110 -4008 3482
8017 3482 15539 14755 17572 -1861 -13505 -10240 759 1031 3116 -778 -7551 -15765 -13656 9751
8003 9751 25066 12354 4281 1345 268 5274 -2658 -10139 -3263 -9574 -13540 -12067 -10416 -21130
7989 -21130 -23737 -15583 -5947 1032 12620 9386 4667 -5522 -16490 -10964 3464 -7928 -15185
7976 -15185 -21571 -18042 -11126 542 8855 3289 1589 -4813 -12037 -8225 -3926 -5613 -6121 -5313 4942
7961 4942 7751 15122 18023 13273 1139 1608 9427 -2078 -8213 1145 5399 -1200 360 3692 12235
7946 12235 18350 14770 19697 9363 -3798 -8253 -10125 -9714 -8356 -13297 -20995 -17522 -15845 -13681
7932 -13681 -3815 3804 -6261 -9236 -18554 -24602 -24660 -24645 -6986 6337 3976 -5361 3305 8012 3782
7917C782m279o754J811J235k048M147J82L279j5534j3318R665J9778P598j4294
7903d750n320L078j2L338j0220j0302K30K39P889K1890J6914r159o873p617j1741
7888a2416P240K57j0386J304J1398R362j2697q129l544M126J097P081k348q212
7874a5867M371J6506P573K99j2795L64k431P913j4346q036P802Q673M854o830
7860a950p305K589Q161J20l212L380P89j1017m194J6114L473m805l335m015l133
7845h340R077j710J3553j37m920n635j3530j2586Q70L747J455J1178Q769O398
7831H189K440p431M131n289L869j064O279m196m358M507R691m841j2529q855k479
7816a1936n176M817J8038M828j2227J700r168O632k760K325O76J4674J3637m061
$$ plain form
7917 3782 -497 -7251 -5440 -4205 -6253 -2106 -1924 1355 -14179 -27497 -17832 1946 9544 -4750
7903 -4750 -10070 -6992 -7004 -3666 -13886 -24188 -23958 -23719 -15830 6060 22974 13815 6942 -675 -12416
7888 -12416 -5176 -4919 -15305 -14001 -2603 6759 -5938 -14067 -17611 -13485 -12388 -5307 -7655 -15867
7874 -15867 -11496 5010 12583 12882 87 451 -1980 5933 -8413 -16449 -8647 26 4880 -1950
7860 -1950 -9255 -6666 1495 1615 -1597 1783 2572 -8445 -12639 3475 6948 2143 -1192 -5207 -8340
7845 -8340 737 -973 12580 12443 7523 1888 -11642 -24228 -23358 -19611 -18156 -6978 1791 8189
7831 8189 10629 3198 7329 2040 5909 4845 11124 6928 2570 7077 16768 11927 -602 -9457 -11936
7816 -11936 -17112 -12295 5743 10571 -1656 44 -9124 -2492 -5252 -2927 -2251 12423 26060 21999
7802B1999o563l422M526l183j5017O51q29O35j459l97K790L320j005j8194j469
7787a7617Q040l482j924j929M501M607k636o360k446j620P970R867J1182K463
7773A0616K394m541l842m022R78J2639R800k105j145r870R430L378j012j1527
7759A1171q269Q42O587L450o238j7462j2178q913R073J017k267Q961L916L441
7745f869J1022K214r231J395j456L046m406k0559J794q099O817M3q86J550J046
7730b2579N318K241R610J4224q6r857p624L285R444Q830K809n833p376o310n30
7715d434M444L003q355l257m849j543K142J4222M831J0422o842n410j3200q640
7701a7466N507k183j004M811r796Q767O23J3568R57L26N874k905o239m79L455
$$ plain form
7802 21999 15436 12014 16540 13357 -1660 -1009 -1838 -1203 -2662 -3059 -269 3051 2046 -16148 -17617
7787 -17617 -9577 -13059 -14983 -16912 -12411 -7804 -10440 -16800 -19246 -20866 -12896 -3029 8153 10616
7773 10616 13010 8469 4627 605 1583 14222 24022 21917 20772 10902 20332 23710 22698 11171
7759 11171 2902 3744 10331 13781 7543 -9919 -22097 -31010 -21937 -20920 -23187 -14226 -10310 -6869
7745 -6869 4153 6367 -2864 -1469 -2925 121 -4285 -24844 -23050 -31149 -24332 -24289 -25175 -23625 -22579
7730 -22579 -17261 -15020 -5410 8814 8728 -1129 -8753 -5468 3976 12806 15615 9782 2406 -3904 -4434
7715 -4434 10 3013 -5342 -8599 -13448 -14991 -12849 1373 6204 16626 9784 4374 -8826 -17466
7701 -17466 -11959 -14142 -15146 -10335 -20131 -11364 -10741 2827 3784 4110 9984 7079 840 361 3816
7686C816L304k537j1919J0550J0630J2283q808j1453N569kK284j0528l875Q797
7672H111J372n257j2280j831p938R702J0431J5161m430o515j5340l865M837J429
7658f413N15M947j435k77j2369K975J9065j876j0827L5L061m749j0642j0429M797
7643b3622J7868j2880m81J0356K27k407O050m440m933m979K876J1836K0994Q138
7629B4603q539k655j635k0134j9580Q312K9849P892P06o911j4454j323O913j04
7615B940k533O470Q387J2037j597L43j0651j4145o260j444p803j457P05M030N296
7600e682P192J49L130J0374j0809j0232j1141R013Q181m09M562k096j2891P277
7586c382J0500m994n968O488P17j4874n585R077p7o04j044j106O167k791O276
$$ plain form
7686 3816 7120 4583 -7336 3214 13844 26127 17319 5866 11435 11433 13717 3189 -686 8111
7672 8111 9483 4226 -8054 -9885 -17823 -8121 2310 17471 13041 6526 -8814 -12679 -7842 -6413
7658 -6413 -5898 -951 -2386 -2663 -15032 -12057 7008 5132 -5695 -5660 -2599 -7348 -17990 -28419 -23622
7643 -23622 -5754 -18634 -19115 -8759 -8532 -10939 -4889 -9329 -14262 -19241 -16365 -4529 16465 24603
7629 24603 16064 13409 11774 -8360 -27940 -19628 10221 18113 18819 11908 -2546 -3869 3044 2940
7615 2940 407 6877 15264 27301 25704 26047 15396 1251 -5009 -6453 -14256 -15713 -15008 -10978 -5682
7600 -5682 1510 1659 4789 15163 4354 -5878 -17019 -8006 175 -234 4328 2232 -10659 -3382
7586 -3382 7118 2124 -3844 2644 3361 -11513 -17098 -8021 -8098 -8702 -9746 -10852 -4685 -7476 -1200
7571a200L722k290j3048k050J2174J1299l33P08p143j535J6446J1457j5369q426
7557D412J815k870N890p972K41l934K220K066L202k85j391k826l868q26j5961
7542b0087L307K209k144K508M880n818k765p187M347L560J66R675J3120j654K382
7527F499J0189o671k549k044j83p607k617N374q436j1889j530J2975K786j912
7513g615o873R569M760K236L992O745k578q556J2830rQ150j3954k2527q612J5913
7498f529J0568R316j968q709O065o240j746p885r845K373J1921J588n338J2079
7484E650M302l882n23j682j7131o05Q664K771J8628p338j0951n356K754J5766
7470A1067o84j1958q173J1444m091o806L949J0997Q158M724m658q183J975O774
$$ plain form
7571 -1200 2522 232 -12816 -14866 -2692 8607 8274 8982 1839 304 16750 28207 12838 4412
7557 4412 6227 3357 9247 1275 1516 -2418 -198 1868 5070 4785 3394 568 -3300 -4126 -20087
7542 -20087 -16780 -14571 -16715 -14207 -9327 -15145 -17910 -25097 -20750 -17190 -17024 -7349 5771 4117 6499
7527 6499 16688 10017 7468 5424 5241 -2366 -4983 391 -8045 -19934 -21464 -8489 -5703 -7615
7513 -7615 -14488 -4919 -159 2077 6069 12814 10236 1680 14510 14501 22651 8697 -13830 -22442 -6529
7498 -6529 4039 13355 11387 2678 8743 2503 757 -7128 -16973 -14600 -2679 -1091 -6429 5650
7484 5650 9952 6070 5547 3865 -13266 -13871 -5207 -2436 16192 8854 -2097 -7453 -4699 11067
7470 11067 10383 -1575 -9748 1696 -2395 -9201 -5252 5745 13903 18627 13969 5786 7761 14535
7456A4535N1o618j066O383l56q332j1743k771m996n459O187J1866m19J872j3490
7441a4356Q53R446J3103R081K166r202L580K032L168r834p969o031j794j1243
7427a7000O487Q332Q935R567k42j9037j0293n511O967N593L826j780j077j470
7413f703k59O128j1538j769K220k554j4691l603J8109J7864J2420j2908n83k75
7399A858j4804p371N577N203j4331J1083N857j2681j370Q879r32j37K034J730
7385i405J4383L663j298j2152q233Q69M968k523Q191Q498q337L825K350o539j3416
7370a5156j624P056N7j866Q49J0280r198Q531O907j3868R515K105o571l227n838
7355a2048J783l392J754j143P841J6226n425p642r606n414Q095N329k972J8709
$$ plain form
7456 14535 14586 7968 6902 13285 12929 4597 -7146 -9917 -14913 -20372 -14185 -2319 -2738 -866 -14356
7441 -14356 -13503 -4057 9046 18127 20293 11091 14671 16703 19871 10037 2068 -3963 -5757 -17000
7427 -17000 -10513 -2181 6754 16321 16079 -2958 -13251 -18762 -11795 -6202 -2376 -4156 -5233 -6703
7413 -6703 -6962 -834 -12372 -14141 -11921 -14475 -29166 -32769 -14660 3204 15624 2716 2133 1858
7399 1858 -12946 -20317 -14740 -9537 -23868 -12785 -6928 -19609 -20979 -12100 -13032 -13169 -11135 -9405
7385 -9405 4978 8641 7343 -4809 -13042 -12173 -7205 -9728 -1537 6961 -1376 2449 4799 -1740 -15156
7370 -15156 -16780 -9724 -9667 -11533 -10684 -404 -9602 -1071 5836 -8032 1483 3588 -2983 -6210 -12048
7355 -12048 -10265 -13657 -11903 -13046 -5205 11021 5596 -2046 -11652 -17066 -8971 -3642 -6614 12095
7341A2095r0m572r612o763n93O440K569r448m681o068L06P23l618N10K91N523
7325a6988Q777r909N784N179l694K773Q558L581K861L302m072N803r238j3764
7311a1047n716R26M877k36P577N631L373j2131m18o121P973R009m838o608Q907
7296A158N485j5562j605J3959O314K663j34j2424l906K125P190O212J71j1563
7282H3j2254j583l021M995j787O274P854l790j100K966k08j409J45q455J184J1937
7266A831L175p975l396J3943J0281j8665l57R804p408r649N253O544n338R497
7252G540r811m515m07J0073J1521l429p344j0230p365j849r965l011P900N139
7238a5753J0628L621J3599o790j8403J2644R193J547R63p569l085p13N101J5961
$$ plain form
7341 12095 12005 7433 -2179 -8942 -9535 -3095 -526 -9974 -14655 -20723 -20417 -19694 -23312 -22802 -22511 -16988
7325 -16988 -8211 -18120 -12336 -7157 -10851 -8078 480 4061 6922 10224 6152 11955 2717 -11047
7311 -11047 -16763 -15837 -10960 -11196 -3619 2012 5385 -6746 -7164 -13285 -5312 3697 -1141 -7749 1158
7296 1158 6643 -8919 -10524 3435 9749 12412 12278 -146 -4052 -1927 5263 11475 11646 83
7282 83 -12171 -13754 -16775 -11780 -13567 -7293 561 -3229 -4329 -1363 -1571 -2980 -2835 -11290 -10106 1831
7266 1831 5006 -2969 -6365 7578 17859 -806 -1163 8641 1233 -8416 -3163 3381 -1957 7540
7252 7540 -2271 -6786 -7193 2880 14401 10972 3628 -6602 -13967 -15816 -25781 -28792 -20892 -15753
7238 -15753 -5125 -1504 12095 5305 -13098 -454 8739 10286 11249 3680 595 -118 4983 20944
7224B0944J1110k2911p026j775R14m167j0573K788Q12q375O906K393J116n387
7210a3231l229R033J454n8J1943O509N5m489j3276n979R376P828k0127j8873K507
7195c0557O969K051k268J3502J0805p670l249j332l831K64p276m466R544J062
7181a6452m000J2583O683n348L739j393q628l876k893N878L39J1547n008m486
7167a1315J6730P859o97m572J882O107N297n153J100r576M0o129k102o548l242
7152a0319j979P102R492K789l465o545m162l287K287P757L023P645J2115o711
7138A5742q055m716R287l697j3135K216O07J478j145O528m538p988r86q58J0206
7123I46m854J906K842R234Q362L185j466m429q255P88j7297r419J839p92K18K92
$$ plain form
7224 20944 32054 9143 2117 342 1256 -2911 -13484 -10696 -9884 -18259 -11353 -8960 -7844 -13231
7210 -13231 -16460 -7427 -5973 -6031 5912 12421 12476 7987 -5289 -11268 -1892 5936 -14191 -33064 -30557
7195 -30557 -23588 -21537 -23805 -10303 502 -7168 -10417 -11749 -15580 -15316 -22592 -27058 -17514 -16452
7181 -16452 -20452 -7869 -1186 -6534 -2795 -4188 -12816 -16692 -19585 -13707 -13368 -1821 -6829 -11315
7167 -11315 5415 13274 12577 8005 9887 15994 21291 16138 17238 7662 7702 1573 -529 -7077 -10319
7152 -10319 -12298 -5196 4296 7085 3620 -2925 -7087 -10374 -8087 -330 2693 10338 22453 15742
7138 15742 7687 2971 12258 8561 -4574 -2358 -1751 -273 -1418 5110 572 -7416 -8402 -9260 946
7123 946 -3908 -2002 840 10074 18436 21621 20155 15726 7471 8259 -9038 -18457 -16618 -17410 -17192 -16900
7107a6900P949M230m80k1125n002M237J5587J4344K862p72l692n965K184M650
7093B107M068j362n926j923o162m875j324Q340m426J773K056J806l487r152k629
7078b1116J812J3241m64n105P53O168l77j0566p205J10J9588K083j691o976l68
7063a0113r829P232O934j505O762j2949K491M204L131o943r361l007J5768o103
7049a3288n164J4535M583o116P906L531m040m17J2956M40j4495m23n356j1731
7035a7079j907N83O240M613j960P676J319J70o397K1158n620r707P24m52l026
7020c665M596J1659N055j429J1478j2319q895k388l603J2074n179j0989k531M700
7006a436O001M659j4740p625Q102Q587m933k821J1905m022p118m760J5935Q507
$$ plain form
7107 -16900 -8951 -4721 -5201 -26326 -31328 -27091 -11504 2840 5702 4930 1238 -4727 -2543 2107
7093 2107 6175 4813 -1113 -3036 -9198 -14073 -15397 -7057 -11483 -9710 -7654 -5848 -9335 -18487 -21116
7078 -21116 -19304 -6063 -6527 -11632 -10879 -4711 -5088 -15654 -22859 -22749 -3161 -1078 -2769 -9745 -10113
7063 -10113 -19942 -12710 -5776 -7281 -519 -13468 -10977 -6773 -3642 -10585 -19946 -22953 -7185 -13288
7049 -13288 -18452 -3917 666 -5450 2456 5987 1947 1530 14486 14926 431 8 -5348 -17079
7035 -17079 -18986 -18403 -12163 -7550 -9510 -1834 -515 -345 -6742 14416 8796 -911 -187 -639 -3665
7020 -3665 931 12590 17645 16216 27694 15375 6480 4092 489 12563 7384 -3605 -6136 -1436
7006 -1436 4565 9224 -5516 -13141 -5039 3548 -1385 -4206 7699 3677 -3441 -8201 7734 16241
6992A6241l151N778o545Q51k568j0445K811j6135M493M516n587l17n224K083J5311
6977B112Q207m675n345j557J666q6R066M090j0408n725r642N167j463M85L350
6962d758j404J3727l392Q677J1578o049j0089r781J2316m938q715j360L914M863
6948D589k135n240M867K579R376p364j8791o668J314j1814L237J1553l149jk372
6933b0019R628q826k105M049L928q34Q379O399k142K736r815n099P74N439J2012
6918D504M631j054l158K932Q999p848r987n305P608L417o870m159j982m95Q288
6903d79P525n418o769j3733p5J4791M690Q69j395o166P183m451M132N607m80r818
6887c987n175Q082l636p64O78r22Q70J1824J486j8706L965K533M504P752P179
$$ plain form
6992 16241 13090 18868 12323 13174 10606 161 2972 -13163 -8670 -4154 -9741 -10058 -15282 -13199 2112
6977 2112 10319 5644 299 -1258 408 322 9388 13478 3070 -2655 -12297 -7130 -8593 -8108 -4758
6962 -4758 -6162 7565 4173 12850 24428 18379 8290 -1491 10825 5887 -2828 -4188 -274 4589
6948 4589 2454 -2786 2081 4660 14036 6672 -12119 -18787 -17473 -29287 -26050 -14497 -17646 -17647 -20019
6933 -20019 -10391 -19217 -21322 -17273 -13345 -14179 -5800 599 -1543 1193 -8622 -13721 -12947 -7508 4504
6918 4504 9135 8081 4923 7855 16854 9006 -981 -6286 1322 4739 -2131 -6290 -8272 -8767 -479
6903 -479 7046 1628 -5141 -18874 -18949 -4158 532 1401 6 -6160 1023 -3428 704 6311 5831 -3987
6887 -3987 -9162 -1080 -4716 -5480 -4802 -5724 -4854 6970 8456 -10250 -6285 -3752 752 8504 15683
6872A5683j5469j0705J0868Q063m474j3428L184o176N898m484K675O611N838p918
6858c834q004j1103L31P423R7N312P921J985j1575p633O202j283L375L397J0595
6843C206n975L407N843K073k542K507p43k61M36j1365l707M528J7025k218q081
6828D133N051O896R560K356j5254n97J832R28J897PO167o325k225j0285P092J698
6812A2931k3674p287J3754o817n759J220L133J2140n869n825m280J0685O039l621
6798c230M928n46l235j2086K008K068J4070O363o661J390r078P37q914k35Q752
6783c669K315N33p278M849N407l524p004n778P413Q140n674j6031L657J6523N364
6768E243O491J0632p277j340j1165k111q341j1015J1459j679j4210o521K0518
$$ plain form
6872 15683 214 -10491 377 8440 3966 -9462 -6278 -12454 -6556 -11040 -8365 -1754 4084 -3834
6858 -3834 -11838 -22941 -22610 -15187 -15090 -9778 -1857 128 -11447 -19080 -12878 -14161 -10786 -7389 3206
6843 3206 -2769 638 6481 8554 6012 8519 7776 7515 7951 -3414 -7121 -2593 14432 12214 4133
6828 4133 9184 16080 25640 27996 12742 12145 13977 14905 16802 16809 22976 16651 14426 4141 11233 12931
6812 12931 -10743 -18030 -4276 -11093 -16852 -15632 -12499 -359 -6228 -12053 -16333 -5648 391 -3230
6798 -3230 1698 1152 -2083 -14169 -12161 -10093 3977 10340 3679 5069 -4009 -3272 -12186 -12421 -3669
6783 -3669 -1354 -821 -8099 -3250 2157 -1367 -8371 -14149 -6736 1404 -4270 -20301 -16644 -121 5243
6768 5243 11734 22366 15089 13749 2584 473 -7868 -18883 -7424 -9103 -23313 -29834 -9316
6755i316J0747m487p088o372p280O642R060J3988L52j8649j6445K226O813N624
6741a4185j251N792J3507m17k4K610l244j5016o920J128R892N856j678O746J2196
6726A4992r94j553q089M587M90j664K256M593n565l698k811n374o512L741M236
6711a365p31j7389o485M428K0522R827o755l801R686M651r429q937O760J2105
6697A3087l670p670q055L513N915n039j8585K919N761J2149R333j1043L689P86
6683C090k262j958O160M16R35Q013p666k1883q880O685O527k529J8957J5909L113
6668B4627j481n153m334j9694M325R342R09m394J692n538l318J686O549L645N550
6653A4413o742L182j2673r605L335O500J653Q529N38K523q99J488m409j16k371
$$ plain form
6755 -9316 1431 -3056 -10144 -16516 -23796 -17154 -8094 5894 6246 -12403 -28848 -26622 -19809 -14185
6741 -14185 -15436 -9644 3863 3446 3422 6032 2788 -12228 -19148 -18020 -8128 -2272 -3950 2796 14992
6726 14992 13998 12445 4356 8943 9433 7769 10025 14618 9053 5355 2544 -2830 -9342 -5601 -1365
6711 -1365 -2096 -19485 -25970 -21542 -1020 8807 2052 -1749 7937 12588 3159 -5778 982 13087
6697 13087 9417 1747 -6308 -2795 3120 -1919 -20504 -17585 -11824 325 9658 -1385 2304 3090
6683 3090 828 -1130 5030 5446 6381 14394 6728 -15155 -24035 -17350 -10823 -13352 5605 21514 24627
6668 24627 23146 17993 13659 -6035 -1710 7632 8541 4147 5839 301 -3017 -1331 5218 8863 14413
6653 14413 7671 10853 -1820 -11425 -8090 -1590 63 8592 9130 11653 10754 12242 7833 7717 5346
6638E346k051O696M156k784j7439N404M64l365O16N885P704O160j2367J670k827
6623C268q966n693%o665M2N476O401L278N642P93J148j3513j3338k195o69R298
6607a5693K777K512n523o622J713J2427p389j958J1347J5737R094k650o003p47
6593I022k088J0313L744Q525l411L7j3167j8836q793R808P594j5N502J1060l078
6578A6217n488q562J3123J557o94j6498j1953M343K547l335K296l526K991J5126
6564H144m715k355r240m060j679L355j903l800J3111k649R52J0762n412L792j680
6549B623o259J158J2312J3056k550r959j1557L52J1668o779j0413J1918n668j0525
6535a0623j1076K089M200P170J2833Q295r160P786R679o013q085r227j1593m649
$$ plain form
6638 5346 3295 9991 14147 11363 -6076 -672 -208 -3573 -2957 2928 10632 16792 4425 6095 3268
6623 3268 -5698 -11391 -11391 -18056 -18014 -12538 -6137 -2859 2783 3576 4724 -8789 -22127 -24322 -24991 -15693
6607 -15693 -12916 -10404 -15927 -22549 -20836 -8409 -15798 -17756 -6409 9328 18422 15772 9769 9022
6593 9022 6934 17247 20991 29516 26105 26142 12975 -5861 -14654 -4846 2748 2733 8235 19295 16217
6578 16217 10729 2167 15290 16847 16153 -345 -12298 -7955 -5408 -8743 -6447 -9973 -6982 8144
6564 8144 3429 1074 -8166 -12226 -13905 -10550 -12453 -16253 -3142 -5791 -4839 5923 511 4303 2623
6549 2623 -3636 -2478 9834 22890 20340 10381 -1176 -824 10844 4065 -6348 5570 -98 -10623
6535 -10623 -21699 -19610 -15410 -8240 4593 12888 3728 11514 21193 15180 7095 -2132 -13725 -18374
6521a8374J2720N333N690K311j9321K831L383J2096K806j0931N984J1525k723
6508A3330n609N169p983M82P974j690p154O676j1404j3425J245M404O079J5409
6494A3503M828j5484L837j1135k085M222J4414m916j6927n040K646J783J884K232
6480f238K709M281Q657k729n048j7554l577K3308M169l633q960m542m743M873
6466i027Q666N303Q412o19j0159p265j8765m368J6777P757O36j2059k376O304
6452a0783N563J3219j224l840j2391k442J7323P230J477k501M848j0146j0090
6439c757Q11P623k314J0544P924M292n704q772j0391R0K086k418k98j517l636
6424e437N513J1588j3096q438J733j492O597P790Q350R46n159l228N371L728o023
$$ plain form
6521 -18374 -5654 -321 5369 7680 -11641 -8810 -5427 6669 9475 -1456 4528 16053 13330
6508 13330 7721 12890 4907 5389 13363 11673 4519 11195 -209 -13634 -12389 -7985 -1906 13503
6494 13503 18331 2847 6684 -4451 -6536 -2314 12100 7184 -9743 -14783 -12137 -10354 -8470 -6238
6480 -6238 -3529 752 9409 6680 1632 -15922 -19499 3809 7978 4345 -4615 -9157 -13900 -9027
6466 -9027 -361 4942 13354 12735 2576 -4689 -23454 -27822 -11045 -3288 -2652 -14711 -17087 -10783
6452 -10783 -5220 7999 6775 2935 -9456 -11898 5425 12655 14132 11631 16479 6333 -3757
6439 -3757 -2946 4677 2363 12907 20831 25123 19419 10647 256 346 2432 14 -284 -1801 -5437
6424 -5437 76 11664 -1432 -9870 -8137 -9629 -3032 4758 13108 14054 8895 5667 11038 14766 8743
6409H743n56j2602k748J144j4702J6242K6468Q642j6916j3992P303O524p422j1084
6395d956m046N149J0088J2094j2817j1444j816p80k554R431O223K507k273o542
6381a736l24o767m096J1640K373P8J145j2800o768j730J3922M301n772Q829p575
6366e280j0908j2765J649N746k395O718P541O929q193r159q505J161O071J4113
6352g277R781R557R408Q01j0340j124q436j6764n357J0851o815m595l378J8347
6338e341K921q073O465K793j1436r93K838k013L657L903n823l472M641L792J1200
6323E059O632j9962o681o658p127P458M379J8157R230k105m584q883J3353l234
6309E034r812R507l947K254o608P516J5121j3687j8629k334K346j632J769J9068
$$ plain form
6409 8743 8187 -4415 -7163 -6019 -20721 -4479 21989 30631 13715 -277 7026 13550 6128 -4956
6395 -4956 -9002 -3853 6235 18329 5512 -5932 -7748 -8528 -11082 -1651 4572 7079 4806 -1736
6381 -1736 -2060 -8827 -12923 -1283 1090 1168 2313 -10487 -17255 -18985 -5063 -762 -6534 2295 -5280
6366 -5280 -16188 -28953 -27304 -21558 -23953 -17235 -9694 -2765 -10958 -20117 -28622 -27461 -21390 -7277
6352 -7277 2504 12061 21469 22270 11930 10806 2370 -14394 -19751 -8900 -15715 -20310 -23688 -5341
6338 -5341 -2420 -10493 -4028 -1235 -12671 -13664 -10826 -12839 -9182 -5279 -11102 -14574 -9933 -6141 5059
6323 5059 11691 -8271 -14952 -21610 -28737 -21279 -16900 1257 10487 8382 3798 -5085 8268 5034
6309 5034 -4778 4729 782 3036 -3572 3944 19065 5378 -13251 -15585 -13239 -14871 -13102 5966
6295E966j646j4124o667J0965J1901o539p388n708O093P061N613L052P654K397
6281A8630q793o904j1559q41Q435q75r247O572N611R540J4112m644j1575n972
6267B490k808M613N513q637l043Q952K03Q891m842j1388l276L609j0979K616j235
6252i321n625L961k412r161R869N082J4356J2352K765k07j0003j2212M804J181
6238E429m329q290O858J5631m68j3168j2953j580N088k002N399P100n479j3469
6224a6233L060Q57j3890Q017J696K772O925O207Q234l402q653l231p975r987n484
6209c1087J3027J5800j0567l285K703J1338Q817j5173j2262R593M944J0656J732
6196F236J1348R749j6100j1942j0789R208Q774Q833m79j1348j2525J725M967m728
$$ plain form
6295 5966 4320 -9804 -16471 -5506 6395 -144 -7532 -13240 -7147 -86 5527 8579 16233 18630
6281 18630 9837 2933 -8626 -9467 -1032 -1907 -11154 -4582 1029 10569 24681 20037 8462 2490
6267 2490 -318 4295 9808 1171 -1872 7080 7283 16174 11332 -56 -3332 277 -10702 -8086 -9321
6252 -9321 -14946 -10985 -13397 -22558 -12689 -7607 6749 19101 21866 21659 11656 -556 4248 5429
6238 5429 1100 -7190 -332 15299 14831 1663 -11290 -12870 -7782 -9784 -4385 2715 -2764 -16233
6224 -16233 -13173 -12316 -26206 -18189 -16493 -13721 -6796 -589 7645 4243 -4410 -7641 -15616 -25603 -31087
6209 -31087 -18060 -2260 -12827 -16112 -13409 -2071 6746 -8427 -20689 -11096 -6152 4504 6236
6196 6236 17584 27333 11233 -709 -11498 -2290 6484 15317 14838 3490 -9035 -7310 -2343 -7071
6182g071N034Q368O416L754j7291j1438o420M354O293R605P49J0823J1566L017
6168B7759k3974j8805J376p895M997Q090l042J1812J3245K81P62o255q435L861
6154C777j139n179k782k465o451j102P06M61p81k169J926j027J2734K522p228
6139h197O376j3820Q547J840r193j746J4854k942o319O506J616R51l293J6067
6125A1247p169j4640j5070q524R495N796O375l336P727N851K982J914o553j2905
6111a6810L736N841j645j933l74J0470Q667N990P723j2198j3657N786J5008L159
6097A9763j8699j5749M464J5019l033j2904M644L791J616P883q62l636p939q814
6083a4456O762k240j513J0313J4773M435r232j2605j2752j202J2178J1323R602
$$ plain form
6182 -7071 -2037 6331 12747 16501 -790 -12228 -18648 -14294 -8001 1604 2353 13176 24742 27759
6168 27759 3785 -15020 -13644 -21539 -16542 -8452 -11494 318 13563 13844 14606 8351 -84 3777
6154 3777 2638 -2541 -5323 -7788 -14239 -15341 -14635 -14174 -14955 -17124 -15198 -16225 -3491 -969 -8197
6139 -8197 -1821 -15641 -7094 -5254 -14447 -16193 -1339 -4281 -10600 -4094 -2478 -1527 -4820 11247
6125 11247 4078 -10562 -25632 -34156 -24661 -18865 -12490 -15826 -8099 -2248 734 2648 -3905 -16810
6111 -16810 -13074 -7233 -8878 -10811 -11185 -715 7952 13942 21665 9467 -4190 1596 16604 19763
6097 19763 1064 -14685 -10221 4798 1765 -11139 -6495 -2704 -1088 6795 5933 2297 -5642 -14456
6083 -14456 -7694 -9934 -11447 -1134 13639 18074 8842 -3763 -16515 -17717 -5539 5784 15386
6070A5386j989k0210j1050m23N318J9603q291N76P584L702K209o672q351j627
6056d235P65j096j1606oQ232O718N718j3357L307J7343j089j8497j0355O528Q412
6041c218o65r367N936P909j1774j3116p162K729J4949K268M504L059L496n392
6027e844J882M826j0579j4018M144N033j0966o453J0578k173m706J408J0147M152
6013a2569P782N018M473j438J3644J8472j2005k7428j2831J217J1668J29m582
6000h450L629l90J00N320n213o827l803L142L280J0367J3509j2990p951K482k73
5985d068r25P363j877o212J448l154K043j210P79J4365J4268j283P325j1967J84
5970A7079k253M443J710j0476l708q811J775l731Q863M713o587P0N990m585J725
$$ plain form
6070 15386 13397 -6813 -17863 -18286 -12968 6635 -1656 -1080 6504 10206 12415 5743 -2608 -4235
6056 -4235 -3470 -4566 -16172 -16178 -7946 -1228 4490 -8867 -5560 11783 10694 -7803 -18158 -11630 -3218
6041 -3218 -3883 -13250 -7314 595 -11179 -24295 -31457 -28728 -13779 -11511 -7007 -3948 -452 -5844
6027 -5844 -3962 864 -9715 -23733 -19589 -14556 -25522 -31975 -21397 -23570 -28276 -26868 -16721 -12569
6013 -12569 -4787 231 4704 3266 16910 35382 23377 -4051 -16882 -15665 -3997 -3868 -8450
6000 -8450 -4821 -5211 -5111 209 -5004 -11831 -15634 -12492 -9212 1155 14664 1674 -6277 -3795 -4068
5985 -4068 -4993 2370 493 -5719 -4271 -7425 -5382 -6592 -5813 8552 22820 21537 28862 16895 17079
5970 17079 14826 19269 20979 10503 6795 -2016 -241 -3972 4891 9604 3017 3087 9077 4492 6217
5955F217J0042j0333j4957K28j493M662O201O094P25r464q98P559l178o362J3311
5940H354J0807q53k2072j2024J941J659l259K3291J5189L081j3883r00k96o22
5926A0413k5123j5152P068J9350l616j0800J4280J3066J4182k170j1223j1233
5914i58n76Q871O15j1129m796k715n897M708M077J1897J5057k689m627L102R671
5899B4611K948k0969j9926j1138k643J6065R068m317L022M437J3730j0026j1418
5886f556o70p808p930l449r55M768J7575Q783n332L267o64j1379J77j926o646
5871a8745M2R904J7480K0524K48j0580Q83o549J397m177o669m992k0612J768O196
5856a3882J2628P335O123j717r357o180L538K3723K864o391m043o089r19J900
$$ plain form
5955 6217 16259 5926 -9031 -8803 -10296 -5634 567 6661 7386 -2078 -2976 4583 1405 -4957 8354
5940 8354 19161 18308 -3764 -15788 -13847 -12188 -15447 7844 23033 26114 12231 11331 11035 10413
5926 10413 -14710 -29862 -22794 -3444 -7060 -17860 -3580 9486 23668 21498 10275 -958
5914 -958 -1534 7337 7952 -3177 -7973 -10688 -16585 -11877 -7800 4097 19154 16465 11838 14940 24611
5899 24611 27559 6590 -13336 -24474 -27117 -11052 -1984 -6301 -3279 1158 14888 4862 -6556
5886 -6556 -7226 -15034 -22964 -26413 -27368 -22600 -5025 3758 -1574 1693 1029 -10350 -10173 -12099 -18745
5871 -18745 -18703 -8799 8681 29205 29453 18873 19756 13207 14604 10427 3758 -1234 -21846 -20078 -13882
5856 -13882 -1254 6081 12204 10487 1130 -5050 -1512 22211 25075 18684 14641 8552 7633 9533
5842I533l751r961o987L130k775l596N407j0359J2719o41k282M477J0978Q918
5828A4810j2951j1430o559J808L923o611R01M059J1670P987q398m726O960R489
5814A0932M946j2865O040Q517r750n140n045k661M586j0861j268P307Q028O04
5800C370L785r174l811P452k539j687q789m239J917K553k614l119M638j875J0127
5785d005J2352m422l042o203L980m96R133R101j8493p89J4881j3133j1051Q128
5771d059P725k312O132l307j575l633J407p964j0212j277N948q46K104N395j597
5756h071j011N98Q872L751P75o023M319Q40l365n800r08P435K695K28M875j844
5740G366K980N198L900k28j3916l698k572Q900l282M70j219J942j1062j5097q246
$$ plain form
5842 9533 5782 -4179 -11166 -8036 -10811 -14407 -9000 -19359 -6640 -7281 -9563 -5086 5892 14810
5828 14810 1859 -9571 -16130 -14322 -10399 -17010 -16109 -12050 -380 7607 -791 -5517 1443 10932
5814 10932 15878 3013 9053 17570 7820 2680 -2365 -5026 -440 -11301 -12569 -5262 2766 3370
5800 3370 7155 -2019 -5830 1622 -917 -2604 -11393 -15632 -13715 -11162 -13776 -16895 -12257 -14132 -4005
5785 -4005 8347 3925 883 -5320 -1340 -1836 7297 16398 -2095 -2884 11997 -1136 -12187 -4059
5771 -4059 3666 1354 7486 4179 2604 -1029 378 -7586 -17798 -19075 -13127 -13973 -11869 -6474 -8071
5756 -8071 -9082 -8484 388 4139 4914 -1109 3210 4050 685 -5115 -6023 1412 4107 4335 9210 7366
5740 7366 10346 15544 19444 19216 5300 1602 -970 7930 4648 5118 3899 5841 -5221 -20318 -28564
5725b8564K4268K4997L773p155n465O335o886j291L424O37j2809j0414P158R355
5711G363J3358J5626j2665q716J036L886r989J2064M866k445j1751N661O803k2780
5697B317k0248K082o108Q489J5118M331j3542q393p550p023J4154k630M670J6381
5683B048J2686n996m584j66n972o552O932M280n119K156K0662N222K72L806m070
5668B5605j8658j365k196n739j96J1704k945J2121Q57r594r025n148K502O738
5654D661p830j1982M016J3320L641L447l029O512L091L088O85j1931j7296l694
5640a3301Q821K917q620r8O955L759J4104j276m122p235M851j948n895m157R027
5625C782J4428j285n898j3646k552J2876N421k171N568j058j5416j3757R077P385
$$ plain form
5725 -28564 -4296 20701 24474 17319 11854 18189 11303 10012 13436 14073 1264 -9150 -1992 7363
5711 7363 20721 36347 23682 14966 16002 19888 9899 21963 26829 24384 12633 18294 25097 2317
5697 2317 -17931 -15849 -21957 -13468 1650 5981 -7561 -15954 -23504 -30527 -16373 -19003 -14333 2048
5683 2048 14734 8738 4154 3988 -1984 -8536 -1604 2676 -2443 -287 20375 25597 25869 29675 25605
5668 25605 6947 5582 3386 -2353 -2549 9155 6210 18331 19188 9594 569 -4579 -2077 4661
5654 4661 -3169 -15151 -11135 2185 5826 9273 6244 12756 15847 18935 19620 7689 -9607 -13301
5640 -13301 -4480 -1563 -10183 -10281 -3326 433 14537 13261 9139 1904 6755 4807 -1088 -5245 3782
5625 3782 18210 16925 11027 -2619 -5171 7705 13126 10955 16523 15465 49 -13708 -4631 2754
5611B754J286o395j3099n00N822P717J4423J075p206j1359j7114O539m377p797
5597b8231l608Q949J5515O644r774O245K38n321P397L874J0111l454K868q205
5583C248j981K162m86j856q704K843J030R790J091k01R381k183L701K845O453
5568B7133m33n057n096N688P737j137j0231j9341j47L134m2k737m229L661Q04
5553b93P2p905k15J8838m204l725m12L956m634k430j2291O016J905J815P262R78
5537D733N845n837j1814k308m072R488J5755Q401j2599j4141P490N004o464J367
5523H48K211j3908p712j751L6J0456J0150o191j6282J1093P475M93M087o985o622
5508a2602J2820P793p36M767n518rn711m335N894O382j066j4873n821J0490l282
$$ plain form
5611 2754 4040 -2355 -15454 -15954 -10132 -2415 12008 13083 5877 -5482 -22596 -16057 -20434 -28231
5597 -28231 -31839 -22890 -7375 -731 -10505 -4260 -4022 -9343 -1946 1928 12039 8585 11453 3248
5583 3248 1267 3429 2943 1087 -7617 -4774 -3744 6046 7137 6936 16317 14134 17835 20680 27133
5568 27133 26700 21643 16547 22235 29972 28835 18604 -737 -884 2250 2208 -529 -4758 -1097 -293
5553 -293 -221 -8126 -8341 10497 6293 2568 2156 6112 1478 -952 -13243 -7227 -5322 -3507 3755 4733
5537 4733 10578 4741 -7073 -9381 -13453 -3965 11790 20191 7592 -6549 941 5945 -519 848
5523 848 3059 -10849 -18561 -20312 -20276 -9820 330 -5861 -22143 -11050 -3575 -3082 1005 -5980 -12602
5508 -12602 218 8011 7275 12042 6524 6515 804 -3531 2363 8745 7679 -7194 -13015 -2525 -5807
5493e807j1863k582J349J2150J2333K620k83j2186J0484R067j3833q676J834J0675
5479E282n772J571M169j755n586l245M14l955J6206M097p119R1Q171q138n196
5464g65j309Q81R649J8009L803j4583n854q041k367O978l250J5681M261j5726
5450G367r609o961P864L156J1441j0205K936P252R221O161n694o697r665Q73j5073
5435g633o99N829L027l557j228o895O815O092j460p462j0303J2302M086m203r03
5420f192m763q27p060l431j142q480J9427J4084J1132m332j4305o820q207k350
5406b3266R055J0743m729j4020K866P049R106R315j5500q862J1933O023o995J3177
5392E895O603k026P50q568j8027j2470M984J5215j0164J137N430N507J7077o459
$$ plain form
5493 -5807 -17670 -20252 -18903 -6753 5580 8200 7917 -4269 6215 15282 1449 -7227 -5393 5282
5479 5282 -490 1081 5250 3495 -2091 -5336 -4922 -8877 7329 11426 4307 4398 12569 4431 -765
5464 -765 -2074 -1193 8456 26465 30268 15685 9831 1790 -577 6401 3151 18832 23093 7367
5450 7367 -2242 -9203 -1339 1817 13258 3053 5989 13241 22462 28623 22929 16232 6567 7440 -7633
5435 -7633 -8332 -2503 524 -3033 -4261 -11156 -4341 1751 291 -7171 -17474 -5172 -1086 -5289 -6192
5420 -6192 -10955 -11782 -18842 -22273 -23415 -31895 -12468 1616 12748 8416 -5889 -12709 -20916 -23266
5406 -23266 -14211 -3468 -8197 -22217 -19351 -12302 -3196 6119 -9381 -18243 -6310 -287 -7282 5895
5392 5895 12498 10472 11222 2654 -15373 -27843 -22859 -7644 -17808 -16671 -11241 -5734 11343 4884
5378D884L343M588m621P393r594J083l460K508J3072Q69k359K613L217q271m022
5363A1243n266o510J4077J0173j2375J519L861k71j6027j854M272P17q042J194
5349c289P144K821L687L585K569r777m63q269k40L073L029o00k297O76j039L482
5333D092j484o567M136R449j3672j0019Q308j586J78J1644M093q767l464N898
5319B239J920q536p590p467J8J8850O157p118P01m044K771Q149J2690l071k086
5304A3583j0753q002O762k913L177m041o926K240L888j0287P567R535K192J3702
5290A9724j266k3214K513R38j0977j0383J5379J705k846j4441m105J3261N298
5277h414m411j4162Q675J4129n359o769Q079R282j0877m56K685P770p56p296K143
$$ plain form
5378 4884 8227 12815 8194 15587 5993 7076 3616 6124 19196 20065 17706 20319 23536 15265 11243
5363 11243 5977 -533 13544 23717 11342 12861 16722 16451 424 -1430 2842 3559 -4483 -3289
5349 -3289 3855 6676 10363 13948 16517 6740 6277 -1992 -2232 841 3870 3270 973 1649 610 4092
5333 4092 2608 -3959 177 9626 -4046 -14065 -5757 -7343 -7165 4479 8572 -195 -3659 2239
5319 2239 4159 -4377 -11967 -19434 -19416 -566 5591 -1527 -826 -4870 -2099 6050 18740 15669 13583
5304 13583 2830 -5172 1590 -1323 1854 -2187 -9113 -6873 -2985 -13272 -5705 3830 6022 19724
5290 19724 18458 -4756 -2243 -1305 -12282 -22665 -7286 -5581 -8427 -22868 -26973 -13712 -8414
5277 -8414 -12825 -26987 -18312 -4183 -9542 -16311 -8232 1050 -9827 -10283 -7598 172 -584 -7880 -5737
5262e737J3838L378n734p464L826L117l097n931P994k01j3021r848O341K2119
5248I580l751O719o71r166j0095p720j480j409J2322J9742j1640j4728L916K478
5234e903j2418J239O969L142J1739Q821j7234P854Q76J454m542j0690p42R343
5220i2J1558r024n38K233m794K041n891o014l871L565j178L658J5752M64k802
5205E067q975P570J0959M783r779K814R850J33P38K886M071j5141j5973r397o358
5190a6752L00j699R389p00K637P189L530O26l239o977n787L988L291N76q250K151
5174i727o247l120M585J2392N388o221L809j831j4857R633O58L280P611q11K010
5159F552K624N603O416K788j6755r502J2565k322n85l238J417j483J794q011q9
$$ plain form
5262 -5737 8101 11479 5745 -1719 2107 5224 2127 -3804 4190 3989 -9032 -18880 -12539 9580
5248 9580 5829 12548 11877 2711 -7384 -15104 -16584 -17993 -5671 14071 2431 -12297 -8381 -5903
5234 -5903 -18321 -17082 -10113 -6971 4768 13589 -3645 4209 5085 6539 1997 -8693 -9435 -92
5220 -92 11466 2442 1904 4137 -657 1384 -4507 -10521 -14392 -10827 -12005 -8347 7405 7869 5067
5205 5067 -3908 3662 14621 19404 9625 12439 22289 22422 23160 26046 30117 14976 -997 -10394 -16752
5190 -16752 -16452 -18151 -8762 -9462 -6825 364 3894 4520 1281 -5696 -11483 -7495 -4204 -3628 -11878 -9727
5174 -9727 -15974 -19094 -14509 -2117 3271 -2950 859 -972 -15829 -6196 -5538 -2258 5353 4542 6552
5159 6552 9176 14779 21195 23983 7228 -2274 10291 7969 7384 4146 5563 4080 5874 -2137 -2226
5144b226l240k35N506l792j893L960Q313m345n361N663k872n863P104j44m438
5129c863j289P836J3433O473p912j3651n823j180j719j3066J946Q368L290L314
5115c843Q738p08l103j108j540j952O422n126R785J4060m220k809m388k2192j1559
5100b3543O861P455r487O157J4400p112m140J466J1745q04M425k054j1823m306
5086a0760P739N231q162K987J531O961Q567M620j3316L231j3529r704o81K238
5072a3047o143k632J5667J5196j0737m581K113p527K538N299K014m972L793L493
5058D74q083j1186J724J4101J4009n965j2284K925m381L59J2891l994M069Q522
5044A3181J0344m481n204k366q573m653k069K284M900J268J0243j83o715l291
$$ plain form
5144 -2226 -5466 -5701 -195 -3987 -5880 -1920 6393 2048 -3313 2350 -522 -6385 719 575 -3863
5129 -3863 -5152 2684 16117 22590 14678 1027 -4796 -5976 -7695 -20761 -18815 -10447 -7157 -3843
5115 -3843 4895 4187 1084 -24 -1564 -3516 2906 -2220 7565 21625 17405 14596 10208 -11984 -23543
5100 -23543 -16682 -9227 -18714 -12557 1843 -5269 -9409 -7943 3802 2998 7423 5369 -6454 -10760
5086 -10760 -3021 2210 -5952 -2965 -1434 5527 14094 18714 5398 8629 -4900 -14604 -15285 -13047
5072 -13047 -19190 -21822 -6155 9041 -1696 -6277 -4164 -11691 -9153 -3854 -1840 -6812 -3019 474
5058 474 -7609 -18795 -17071 -2970 11039 5074 -7210 -4285 -8666 -8307 4584 590 4659 13181
5044 13181 23525 19044 13840 11474 2901 -1752 -3821 -1537 3363 4631 14874 14691 7976 4685
5030D685n772m657K46K698M093r342k053k193o979N860M423J43J8K2341O209j0150
5014I570j1880j0222M961Q165J757M96j736P707L68J889N410R369r586M225k778
4999A7715r608R190j5627q544O05J5174R677l105r411l948p670J028q186L004
4985i706R716J0351j4848p71p302m39J5938J0493l551L880J1409O846q620p557
4971A5839o181N552o051r640k206L297k643n61L710K366l777O679n508q64J0120
4956A0132l288j239J8572j1237j0566P413m982M916j0365k142O517P332m747l786
4942B530k083j0914L036N779l204o276L451k814m058p14l493n674L953n32j554
4927b2567N903R066Q800O561p062q956J8573L263n059l366p883n355r92j237n891
$$ plain form
5030 4685 -1087 -5744 -5498 -2800 1293 -8049 -10102 -12295 -19274 -13414 -8991 -8848 -8830 13511 19720 9570
5014 9570 -2310 -12532 -7571 594 2351 2847 1111 8818 9186 11075 16485 25854 16268 20493 17715
4999 17715 8107 17297 1670 -6874 -6269 8905 18582 15477 6066 2118 -5552 -4524 -12710 -9706
4985 -9706 10 10361 -4487 -5258 -12560 -12999 2939 13432 9881 13761 25170 32016 23396 15839
4971 15839 9658 15210 9159 -481 -2687 610 -2033 -2594 1116 3482 -295 6384 876 12 10132
4956 10132 6844 5605 24177 12940 2374 9787 4805 9721 -644 -2786 3731 11063 6316 2530
4942 2530 447 -10467 -7431 -1652 -4856 -11132 -7681 -10495 -14553 -15267 -18760 -24434 -20481 -21013 -22567
4927 -22567 -16664 -7598 1202 7763 701 -8255 10318 13581 8522 5156 -2727 -8082 -9074 -10311 -16202
4912a6202L964J3080L354o497m31J2512j0389M491J387J510O57n344j883L603
4898C812o56P760o473p100j3400o460K751J2348R236J1185J414q451l189J5787
4884A8564j07j4578r978J350j2788j831J154K476o346n005N493J8735N802r081
4870f140o160j2145k399J3741P439K645K395n82o021l87K649P490q610p774R129
4855d730K457N256M351q906J758n4Q935J70j5613Q700r64j83R452o813m192J313
4839I37N498K769J845K392J3751L357n666j3395m652j241L275J0062k827K787
4825A8892o963j1163J33P65K159P698N613q508r518o29J7781M157k1973j0556
4811a2112N262R894L942j4915j9907o131J6460L928j945n579Q076N655K949M197
$$ plain form
4912 -16202 -12238 842 4196 -2301 -2732 9780 -609 3882 5269 6779 7436 2092 209 3812
4898 3812 3156 10916 4443 -2657 -16057 -22517 -19766 -7418 1818 13003 14417 5966 2777 18564
4884 18564 18457 3879 -6099 -4749 -17537 -19368 -18214 -15738 -22084 -27089 -21596 -2861 2941 -6140
4870 -6140 -12300 -24445 -26844 -13103 -5664 -3019 -624 -1206 -7227 -7614 -4965 2525 -6085 -13859 -4730
4855 -4730 -2273 2983 7334 -1572 186 132 9067 9237 -6376 2324 1360 1177 10629 3816 -376 937
4839 937 6435 9204 11049 13441 27192 30549 24883 11488 6836 5595 8870 18932 16105 18892
4825 18892 11929 766 899 1664 3823 11521 17134 8626 -892 -1521 16260 20417 -1556 -12112
4811 -12112 -6850 3044 6986 -7929 -27836 -33967 -17507 -13579 -15524 -21103 -13027 -7372 -4423 -226
4797b26j1193l063r390l163j513P180P582L469q960M60N737n256n060j606J408
4782b3594j515M508P271M050R856J3491n762r988j181J3502j107k366o223j1976
4768a1034L96j789N260j0463r565K392j48K702K454p510o568k188R464J1917Q656
4753f024Q401N022O03n222o439M535J0794L56q87j2447o936J548P581j176r873
4738a0164j1745J7312J721q980j2840N272J6581Q673J2851P94n228l831j2104
4725a688J064j0962k114M693J5392J9666J5350j0911p370l989p428j438j869j0407
4711b011j0746j2916j6604q23J9895J297K537J6125J0524P905M147j5972q511
4698e153j063m051j543Q1q671N9L246M889j370J3370J9255R149l37n834J697O51
$$ plain form
4797 -226 -11419 -14482 -23872 -27035 -28548 -21368 -13786 -10317 -19277 -18817 -13080 -18336 -23396 -25002 -23594
4782 -23594 -25109 -20601 -13330 -9280 576 14067 8305 -1683 -2864 10638 9531 7165 942 -11034
4768 -11034 -10638 -12427 -7167 -17630 -27195 -24803 -24951 -22249 -19795 -27305 -33873 -36061 -26597 -14680 -6024
4753 -6024 2377 7399 8002 2780 -3659 876 11670 12026 11139 -1308 -8244 -6696 885 -291 -10164
4738 -10164 -21909 -4597 -2876 -11856 -24696 -19424 -2843 5830 18681 19475 14247 10416 -1688
4725 -1688 -624 -11586 -13700 -9007 6385 26051 41401 30490 23120 19131 11703 10265 8396 -2011
4711 -2011 -12757 -25673 -42277 -43100 -23205 -21908 -19371 -3246 7278 15183 19330 3358 -5153
4698 -5153 -6216 -10267 -11810 -11729 -20400 -20341 -17095 -12206 -13576 -206 19049 28198 27861 22027 23724 24375
4682B4375l0k2366j6533q480J1167l315j0375j199J7014M708j1070o776p622M58
4668c0044J0352J0786J4065M652j381J0196r388p468k808j453j276N242m11J558
4654B622l372j3686N53P25N895J4669P989j0629M471Q343o478r308j4205K71K268
4639i872K176J0307K2368K412j2304q912N404n5r779l26l311q123k429k014Q385
4624f073L225j1131j530L754Q965J4199m029Q817J2855r249l232q476O999Q105
4610B3199j2744j575n770n224M015p398r715K408q68J5909J1850j0804k855J1621
4596A2049P747p693k8692j923J3649J2883J0459n866r251P928R954k527j6247
4583B470j0540M922R54o47j915Q946N451p149r258R70P079m483J5708K6615J883
$$ plain form
4682 24375 24345 1979 -14554 -23034 -11867 -15182 -25557 -26756 -9742 -5034 -16104 -22880 -30502 -30044
4668 -30044 -19692 -8906 5159 9811 8430 18626 9238 1770 -1038 -2491 -3767 1475 1064 2622
4654 2622 -750 -14436 -13883 -13158 -7263 7406 15395 4766 9237 17580 11102 1794 -12411 -12140 -9872
4639 -9872 -7696 2611 24979 27391 15087 6175 11579 11524 1745 1419 -1892 -10015 -12444 -14458 -6073
4624 -6073 -2848 -13979 -15509 -11755 -2790 11409 7380 16197 29052 19803 16571 8095 15094 23199
4610 23199 10455 8880 3110 -2114 1901 -5497 -15212 -12804 -13672 2237 14087 3283 428 12049
4596 12049 19796 12103 -16589 -18512 -4863 8020 18479 12613 3362 11290 21244 18717 2470
4583 2470 -8070 -3148 -2194 -2841 -4756 4190 9641 2492 -6766 -5796 1283 -3200 12508 39123 41006
4568D1006j1085p278r103m472P160N180o930r249o433n656N131R932m528m464
4554g89Q714J1610q218j2554q920k473Q040N326P544J180j1088%n561m579q421
4539b0189P377r58k399P564J0680M314q602l065J011J43J0927K152k336J553j6681
4524h509m276n497m87K905N102P684J4796o452j9057o257n12K1827J6885q623
4510I529J1834l45j4083r531r471m65P44L079K005j27j1713m34R348p362n773
4495b2765l608M5J1301J2093J2918R587q97p849k88M347J03j6916j1148K595L289
4480g193O056O413p174Q671l226p397K839Q099j0002j7575n495k558O180K4955
4466B593Q629J0467k571n929K447l263Q85n416j0277q326O701R647l072o327O38
$$ plain form
4568 41006 29921 22643 13540 9068 16228 21408 14478 5229 -1204 -6860 -1729 8203 3675 -789
4554 -789 7925 19535 11317 -1237 -10157 -12630 -4590 736 8280 9460 -1628 -1628 -7189 -11768 -20189
4539 -20189 -12812 -13770 -16169 -8605 2075 6389 -2213 -5278 -4267 -4124 6803 8955 6619 8172 -8509
4524 -8509 -12785 -18282 -18769 -15864 -10762 -3078 11718 5266 -13791 -20048 -20560 1267 18152 9529
4510 9529 21363 21018 6935 -2596 -12067 -12532 -11788 -8709 -6704 -6831 -18544 -18978 -9630 -16992 -22765
4495 -22765 -26373 -26328 -15027 -2934 9984 19571 18674 10825 10537 14884 14987 -1929 -13077 -10482 -7193
4480 -7193 -1137 5276 -1898 6773 3547 -3850 -1011 7088 -2914 -20489 -25984 -28542 -22362 2593
4466 2593 11222 21689 19118 13189 15636 12373 13258 7842 -2435 -10761 -4060 5587 2515 -3812 -3174
4451c174O302M66j0812j3529K967M106k80R533K603M512L837o622p1j0546l112
4436a3820O463l0J2295M478j2041Q029J3176k002j1023p7q348n124K7319L081
4422B2376p356l663k877m058j2648q30j8298j675O389J340m782J4993Q137O359
4408C407j1018n442j5115O95J9333P577m898r333j395J0830k523O729j448L909
4394A308j112o907l784R745J306P71n135q520M576J3846J575Q580M877j3063k9838
4379b1775o847J1164J5583Q03n824J628N600j1793j5012j836J2556N242j858p8
4365a2447O309J0380j043J0341j516K559j2278q482O280N04n167j62p610J505
4351a0827J3319r92r764j2039N376J1323J5221n061j6576l067N251Q116L70J8450
$$ plain form
4451 -3174 3128 3594 -7218 -20747 -17780 -13674 -13954 -4421 -1818 2694 6531 -91 -162 -10708 -13820
4436 -13820 -7357 -7387 4908 9386 -2655 5374 18550 16548 5525 5448 -2900 -8024 19295 22376
4422 22376 15020 11357 8480 4422 -8226 -9056 -27354 -29029 -22640 -21300 -26082 -11089 -2952 3407
4408 3407 -7611 -13053 -28168 -27473 -8140 -563 -5461 -14794 -16189 -5359 -7882 -1153 -2601 1308
4394 1308 196 -6711 -10495 -750 556 1327 -3808 -12328 -7752 6094 7669 16249 21126 8063 -21775
4379 -21775 -28622 -17458 -1875 -1072 -6896 -5268 332 -11461 -26473 -28309 -15753 -10511 -12369 -12447
4365 -12447 -6138 4242 3199 13540 12024 14583 2305 -6177 103 607 -4560 -4722 -12332 -10827
4351 -10827 2492 1500 -8264 -20303 -14927 -3604 11617 6556 -10020 -13087 -7836 280 650 19100
4337A9100j856q110n615K412L19P791m171j0921m295L270j121J612J221O368j736
4322D268j557j242l913p754M718J1084k413l222m255j077r30q800l967J0983k208
4307a0285N044J0609j564k858K860L661n045J456P300k734j4262M986N318m255
4293B31k825J147K610k051j945L103J3268n029n320p519M930P457L187j961k421
4278F862N1Q2j0140L047k395p87l618p540r475J3984N454j2403Q893Q31l052R012
4262a194M157j436r67P443J2835N13J318m529p049j7211n108K53j1561l816L198
4247b3154J0639m205j642n817p212m473R304J0169n647n868j2191L921q3N483
4233c0776N475J3286l921Q342M314n792L606J3580p288K179O149m787k3746q237
$$ plain form
4337 19100 17244 9134 3519 5931 6250 14041 9870 -1051 -5346 -2076 -3197 -1585 -364 6004 4268
4322 4268 2711 1469 -2444 -10198 -5480 5604 3191 -31 -4286 -5363 -6293 -15093 -19060 -8077 -10285
4307 -10285 -5241 5368 3804 946 3806 7467 2422 3878 11178 8444 -5818 -832 4486 231
4293 231 -2594 -1447 1163 -888 -2833 270 13538 8509 3189 -4330 600 8057 11244 9283 6862
4278 6862 6913 6995 -3145 -98 -2493 -3280 -6898 -14438 -23913 -9929 -4475 -16878 -7985 -7154 -10206 -1194
4262 -1194 2963 1527 560 8003 20838 21351 22669 18140 11091 -6120 -11228 -10975 -22536 -26352 -23154
4247 -23154 -12515 -16720 -18362 -24179 -31391 -35864 -26560 -16391 -22038 -27906 -40097 -36176 -36259 -30776
4233 -30776 -25301 -12015 -15936 -7594 -3280 -9072 -5466 8114 826 3005 9154 4367 -19379 -27616
4219b7616N836J1100J5875Q392p018m679j110K367j240q447n722r679K014J3374
4205f553R0N229N173n637k233j399J0012K865l26o61M151q486j2637N421J685
4190c306o435p271L602J4490L001m29j4262K08O949M121L182j5516J559J320J0845
$$ plain form
4219 -27616 -21780 -10680 5195 13587 6569 1890 780 3147 1907 -6540 -12262 -21941 -19927 -6553
4205 -6553 -6463 -1234 3939 -1698 -3931 -5330 4682 7547 7221 6560 10711 2225 -10412 -4991 -3306
4190 -3306 -9741 -17012 -13410 1080 4081 3652 -10610 -10402 -3453 668 3850 -11666 -10107 -8787 2058
$$ [...]
##END NTUPLES=NMR SPECTRUM
##END=
