##TITLE=Analysis number 307231
Compound Code cc 35110
Book Reference 403/142
Project Code adrs
Chemist Name carlr
##JCAMPDX= 6.0         $$ Bruker NMR JCAMP-DX V2.0
##DATA TYPE= NMR SPECTRUM
##DATA CLASS= NTUPLES
##ORIGIN= Bruker BioSpin GmbH
##OWNER= NMR
$$ XWIN-NMR		Version 3.5
$$ Mon Apr 25 15:33:35 2005 GMT Daylight Time (UT+1h)  MAYBRIDGE\NMR@NMR_250MHZ
##.OBSERVE FREQUENCY= 250.131544655141
##.OBSERVE NUCLEUS= ^1H
##.ACQUISITION MODE= SIMULTANEOUS (DQD)
##.ACQUISITION SCHEME= undefined
##.AVERAGES= 16
##.DIGITISER RES= 18
##SPECTROMETER/DATA SYSTEM= dpx250
##.PULSE SEQUENCE= zg30
##.SOLVENT NAME= CDCl3
##.SHIFT REFERENCE= (INTERNAL, CDCl3, 0, 16.4463)
##AUDIT TRAIL= $$ (NUMBER, WHEN, WHO, WHERE, WHAT)
$$ ##TITLE= Audit trail, XWIN-NMR		Version 3.5
$$ ##JCAMPDX= 5.01
$$ ##ORIGIN= Bruker BioSpin GmbH
$$ ##OWNER= NMR
$$ C:\u/data/dgb/nmr/ADRS/2190/pdata/1/auditp.txt
$$ ##AUDIT TRAIL=  $$ (NUMBER, WHEN, WHO, WHERE, WHAT)
(   1,<2005-04-25 15:33:16.08 +100>,<MAYBRIDGE\NMR>,<NMR_250MHZ>,
      <created by zg, POWCHK disabled, PULCHK disabled
       configuration hash MD5:
       62 19 C7 07 E1 42 D1 B7 37 6C 3D D0 77 39 F9 E6
       data hash MD5: 64K
       C0 40 3E 4E F0 F1 AE D7 6A C6 BA C7 3E 2B C6 CE>)
(   2,<2005-04-25 15:33:27.10 +100>,<MAYBRIDGE\NMR>,<NMR_250MHZ>,
      <Start of raw data processing
       ef LB = 0.3 FT_mod = 6 PKNL = 1 SI = 32K 
       data hash MD5: 32K
       18 28 FD BF 2D 2F 78 1B B5 4A D0 AE B7 4A C4 9B>)
(   3,<2005-04-25 15:33:29.01 +100>,<MAYBRIDGE\NMR>,<NMR_250MHZ>,
      <apk 
       data hash MD5: 32K
       6B EA 69 0C 43 D2 DD 36 75 D3 01 46 DF 31 FF 4C>)
(   4,<2005-04-25 15:33:29.66 +100>,<MAYBRIDGE\NMR>,<NMR_250MHZ>,
      <abs ABSG = 5 
       data hash MD5: 32K
       5F 13 55 FA B9 5B D6 EB 9F 8E 98 5B 5C 8F 3C 54>)
$$ ##END=
$$ 
$$ hash MD5
$$ EF F1 CE C4 FC F0 9F 5A B5 3F FD D3 B4 D4 84 E3
##$RELAX= 
##$RELAX= 
##$RELAX= 
##$RELAX= 
##$RELAX= 
##$RELAX= 
##$RELAX= 
$$ Bruker specific parameters
$$ --------------------------
##$DU= <C:\u>
##$EXPNO= 2190
##$NAME= <ADRS>
##$PROCNO= 1
##$TYPE= <nmr>
##$USER= <dgb>
##$AMP= (0..31)
100 100 100 100 100 100 100 100 100 100 100 100 100 100 100 100 100 100 
100 100 100 100 100 100 100 100 100 100 100 100 100 100 
##$AQSEQ= 0
##$AQ_mod= 3
##$AUNM= <au_zg>
##$AUTOPOS= <41 >
##$BF1= 250.13
##$BF2= 250.13
##$BF3= 250.13
##$BF4= 250.13
##$BF5= 500.13
##$BF6= 500.13
##$BF7= 500.13
##$BF8= 500.13
##$BYTORDA= 1
##$CFDGTYP= 0
##$CFRGTYP= 5
##$CHEMSTR= <none>
##$CNST= (0..31)
1 1 145 1 1 1 1 1 1 1 1 1 1 1 1 1 1 1 1 1 1 1 1 1 1 1 1 1 1 1 1 1 
##$CPDPRG= <>
##$CPDPRG1= <>
##$CPDPRG2= <>
##$CPDPRG3= <>
##$CPDPRG4= <mlev>
##$CPDPRG5= <mlev>
##$CPDPRG6= <mlev>
##$CPDPRG7= <mlev>
##$CPDPRG8= <mlev>
##$CPDPRGB= <>
##$CPDPRGT= <>
##$D= (0..31)
0 1 0 0 0 0 0 0 0 0.06 0 0 0 0 0 0 0.0002 0 0 0 0 0 0 0 0 0 0 0 0 0 0 
0 
##$DATE= 1114439595
##$DBL= (0..7)
120 120 120 120 120 120 120 120 
##$DBP= (0..7)
150 150 150 150 150 150 150 150 
##$DBP07= 0
##$DBPNAM0= <>
##$DBPNAM1= <>
$$ [...]
##$SUBNAM7= <"">
##$SUBNAM8= <"">
##$SUBNAM9= <"">
##$SW= 20.6930455092707
##$SWIBOX= (0..15)
0 0 3 0 0 0 0 0 0 0 0 0 0 0 0 0 
##$SW_h= 5175.983436853
##$TD= 65536
##$TD0= 1
##$TE= 296.16
##$TE2= 300
##$TE3= 300
##$TEG= 300
##$TL= (0..7)
0 120 120 120 120 120 120 120 
##$TP= (0..7)
150 150 150 150 150 150 150 150 
##$TP07= 0
##$TPNAME0= <>
##$TPNAME1= <>
##$TPNAME2= <>
##$TPNAME3= <>
##$TPNAME4= <>
##$TPNAME5= <>
##$TPNAME6= <>
##$TPNAME7= <>
##$TPOAL= (0..7)
0.5 0.5 0.5 0.5 0.5 0.5 0.5 0.5 
##$TPOFFS= (0..7)
0 0 0 0 0 0 0 0 
##$TUNHIN= 0
##$TUNHOUT= 0
##$TUNXOUT= 0
##$USERA1= <user>
##$USERA2= <user>
##$USERA3= <user>
##$USERA4= <user>
##$USERA5= <user>
##$V9= 5
##$VALIST= <valist>
##$VCLIST= <CCCCCCCCCCCCCCC>
##$VD= 0
##$VDLIST= <DDDDDDDDDDDDDDD>
##$VPLIST= <PPPPPPPPPPPPPPP>
##$VTLIST= <TTTTTTTTTTTTTTT>
##$WBST= 1024
##$WBSW= 4
##$XGAIN= (0..3)
0 0 0 0 
##$XL= 0
##$YL= 0
##$YMAX_a= 517931
##$YMIN_a= -344459
##$ZGOPTNS= <>
##$ZL1= 120
##$ZL2= 120
##$ZL3= 120
##$ZL4= 120
##$ABSF1= 16.44627
##$ABSF2= -4.246902
##$ABSG= 5
##$ABSL= 3
##$ALPHA= 0
##$AQORDER= 0
##$ASSFAC= 0
##$ASSFACI= 0
##$ASSFACX= 0
##$ASSWID= 0
##$AUNMP= <proc_1d>
##$AZFE= 0.1
##$AZFW= 0.1
##$BCFW= 0
##$BC_mod= 0
##$BYTORDP= 0
##$COROFFS= 0
##$CY= 12.5
##$DATMOD= 1
##$DC= 0
##$DFILT= <>
##$DTYPP= 0
##$F1P= 14.0000005364418
##$F2P= -0.99999901652339
##$FCOR= 0.5
##$FTSIZE= 32768
##$FT_mod= 6
##$GAMMA= 0
##$GB= 0
##$INTBC= 1
##$INTSCL= 1
##$ISEN= 128
##$LB= 0.3
##$LEV0= 0
##$LPBIN= 0
##$MAXI= 10000
##$MC2= 0
##$MEAN= 0
##$ME_mod= 0
##$MI= 0
##$NCOEF= 0
##$NC_proc= -5
##$NLEV= 6
##$NOISF1= 0
##$NOISF2= 0
##$NSP= 0
##$NTH_PI= 0
##$NZP= 0
##$OFFSET= 16.44627
##$PC= 1
##$PHC0= -75.09634
##$PHC1= 7.692747
##$PH_mod= 1
##$PKNL= yes
##$PPARMOD= 0
##$PSCAL= 4
##$PSIGN= 0
##$REVERSE= no
##$SF= 250.130018941484
##$SI= 32768
##$SIGF1= 0
##$SIGF2= 0
##$SINO= 400
##$SIOLD= 32768
##$SREGLST= <1H.CDCl3>
##$SSB= 0
##$STSI= 32768
##$STSR= 0
##$SW_p= 5175.98343685301
##$SYMM= 0
##$S_DEV= 0
##$TDeff= 65536
##$TDoff= 0
##$TI= <Analysis number 999999
Compound Code 99
Book Reference 9
Project Code 9>
##$TILT= no
##$TM1= 0
##$TM2= 0
##$TOPLEV= 0
##$USERP1= <user>
##$USERP2= <user>
##$USERP3= <user>
##$USERP4= <user>
##$USERP5= <user>
##$WDW= 1
##$XDIM= 32768
##$YMAX_p= 492132382
##$YMIN_p= -351996
$$ End of Bruker specific parameters
$$ ---------------------------------
##NTUPLES= NMR SPECTRUM
##VAR_NAME=  FREQUENCY,     SPECTRUM/REAL,   SPECTRUM/IMAG
##SYMBOL=    X,             R,               I
##VAR_TYPE=  INDEPENDENT,   DEPENDENT,       DEPENDENT
##VAR_FORM=  AFFN,          ASDF,            ASDF
##VAR_DIM=   32768,         32768,           32768
##UNITS=     HZ,            ARBITRARY UNITS, ARBITRARY UNITS
##FACTOR=    0.157963299565203, 1,           1
##FIRST=     4113.70582386875, 0,            0
##LAST=      -1062.27761298426, 0,           0
##MIN=       -1062.27761298426, -351996,     0
##MAX=       4113.70582386875, 492132382,    0
$$ Real data points
##PAGE= N=1
##DATA TABLE= (X++(R..R)), XYDATA
$$ [...]
24072a75724R768O049P3960Q3910j6738j7729N2916j6229k0461J08781j5580j6593
24060E6330k0790n7748o3818m1871Q7058O7120n1272j28825J6485N8123K097l8293
24048a15404N0384N9640N2599l3315n6947l0364K9761j1884m9881J3043L2099
24037f0269n6453r3759Q0519M7023J4249o581M5861J18281K8096m5449m92k7390
24025D3636L581k6429p0850q2434Q922J8837l8994j19280l0011O3348P0233j2936
24013a72377O684j6983K9510Q9392M4545L0163M9385r2009r3948m9089M2011J60743
24001B8027l5017p2551J0109N3857j8979K4545J99J256q766m0931P8322L3646
23989E3717O0361R3505l571p0725j34114L633N0802q076j10465m3962O255q162
$$ plain form
24072 -175724 -165956 -159907 -85947 -2037 -18775 -36504 16412 183 -20278 88503 72923 56330
24060 56330 35540 -22208 -86026 -127897 -40839 26281 -24991 -153816 -137331 -79208 -77111 -115404
24048 -115404 -65020 -5380 47219 13904 -43043 -73407 -43646 -55530 -105411 -92368 -60269
24037 -60269 -116722 -210481 -129962 -82939 -68690 -75271 -29410 88871 116967 71518 71026 43636
24025 43636 47217 20788 -50062 -132496 -123574 -104737 -143731 -263011 -293022 -229674 -159441 -172377
24013 -172377 -165693 -182676 -153166 -63774 -19229 10934 60319 -31690 -125638 -174727 -132716 28027
24001 28027 -6990 -79541 -69432 -15575 -34554 -10009 -9810 -8554 -17320 -58251 20071 53717
23989 53717 114078 207583 204012 133287 -827 2806 53608 45532 -64933 -108895 -102640 -110802
23977a10802J18706K3590j6387P0520L1995j3354r8869j88383p0451J13023O2745
23966g7667J06531J18227N4936q6481j18679l7860J1232M1168M2775Q5882j3454
23955A26610p1802n8599P164k1303N888J5845R1877O0633k4001m2779L1522p4915
23943D6140K0269N1439J0028p6582M596k0595j36143m5112J5310P42N0516K581
23931g6811k4323k9891k7338j9048M9576J13005K0869q2479K148P2997R4639m1221
23919E2123K4716Q4555Q2490M037r1719p191k8213n0854j05250J7000M8603M9992
23907H0289n3953p9228j4452n7855j14827Q9896J92530O4397p7511r9400n0546
23896a20660n8561l386K5974m0901Q7067J27430K1072K9463J2226k4551P1146
$$ plain form
23977 -110802 7904 31494 15107 85627 117622 104268 5399 -182984 -253435 -140412 -77667
23966 -77667 28864 147091 202027 115546 -3133 -40993 -29761 11407 54182 140064 126610
23955 126610 54808 -3791 3373 -17930 -12042 3803 95680 156313 132312 89533 121055 46140
23943 46140 66409 117848 127876 51294 55890 35295 -100848 -145960 -130650 -129908 -79392 -76811
23931 -76811 -101134 -131025 -158363 -177411 -127835 -14830 6039 -76440 -74292 -1295 93344 52123
23919 52123 76839 161394 243884 247921 156202 149011 120798 69944 -35306 -18306 30297 80289
23907 80289 26336 -52892 -67344 -125199 -240026 -150130 42400 106797 29286 -70114 -120660
23896 -120660 -179221 -182607 -156633 -197534 -110467 16963 38035 67498 79724 55173 126319
23885A26319J59246o7517j40847r2424l5963N163r626Q9070K7453r244q1137m4044
23873g3551m2567O7471L4977j1060K5352R682l735j14194m3121j13009R0595J01371
23861g1789l4502N0771l128L8596l1144j9204P2464m462j35921j8995J23496k854
23849c6672j00056N530n310P925J44112M1152p8895o3927O8168J8433R85l5068
23837c3623K2870M6321J8884n6676M6354k5555o0840o1660M9105K6916L6286J6724
23825B5106o0781o74N4001Q903M6582Q4277o8297r7363o9485l9169m3427L8903
23813a21424k1164l3209j9237j678K8720j6728k8454N0210P1168J4728K5843O0368
23801I143j6050M5575P6781n9272p2051j23338j1548R7545K1908k9130l0351L3660
$$ plain form
23885 126319 285565 218048 77201 -15223 -51186 -46023 -55649 33421 60874 51630 -29507 -73551
23873 -73551 -116118 -48647 -13670 -24730 622 10304 6569 -107625 -150746 -263755 -173160 -71789
23861 -71789 -106291 -55520 -58648 -20052 -51196 -70400 2064 -2398 -138319 -157314 -33818 -36672
23849 -36672 -136728 -131198 -136508 -128583 15529 56681 -22214 -86141 -17973 460 1445 -33623
23837 -33623 -10753 35568 54452 -2224 44130 18575 -42265 -103925 -54820 -27904 8382 25106
23825 25106 -35675 -36349 17652 26555 73137 157414 89117 -8246 -77731 -116900 -160327 -121424
23813 -121424 -142588 -175797 -195034 -196712 -167992 -184720 -213174 -162964 -91796 -77068 -51225 9143
23801 9143 -6907 38668 115449 56177 -15874 -139212 -150760 -53215 -31307 -60437 -90788 -57128
23789e7128k8046j1914q3373j15232J2074N6919J39108O4710K4097o8996k4464
23778i2245j5149L4190J07166M9383q5392K758K8669p172k1394k5885k6662j1656
23766f3389M7898O4852j0106M074O0235P3706K3364j00166p7333L9543M3333O6278
23754A72289l2512k6421o2201l18J4020r3739j3981J0595K5624o3339L6648J9451
23742a3884J0592O1845m091M2201p2716j49460M46P9323J160P5850Q8104p5887
23730D3483n3041p9645o9664J6520J25229J16304J8012n6235j05559j18854P9145
23719h4305J22589R4372j01120j00752L3627o7150O5857m900o2882L9286J06563
23708D1185l0635r2021M6419L6123N9324J21549j7698l0292p1217K5100M1956
$$ plain form
23789 -57128 -85174 -97088 -180461 -295693 -283619 -226700 -87592 -22882 1215 -67781 -92245
23778 -92245 -107394 -73204 33962 83345 -2047 711 29380 22208 814 -25071 -51733 -63389
23766 -63389 -15491 49361 39255 43329 103564 177270 200634 100468 23135 62678 106011 172289
23754 172289 139777 113356 51155 50837 64857 -28882 -42863 -32268 -6644 -69983 -33335 -13884
23742 -13884 -3292 58553 54462 96663 23947 -125513 -125067 -45744 -44584 31266 119370 43483
23730 43483 -9558 -89203 -158867 -142347 -17118 99186 117198 60963 -44596 -163450 -84305
23719 -84305 38284 132656 31536 -69216 -35589 -102739 -36882 -41782 -104664 -65378 41185
23708 41185 10550 -81471 -35052 1071 60395 181944 164246 133954 62737 87837 129793
23697A29793l7648K2252o6868j13426L9505P8263p3791p9687r615N7711K6535
23686b6976q2083j5244M8366M5034k7930Q3871m683n3260L2649J01845J4527j0574
23674A05542j0464p522P8609J1622r3437k24010r8610j6383J02472J30320l5820
23663e7681m900L8566j8831N9364j8361j9137p6126L6546j0406o6411l458J44799
23651C964J13353L0354j23169o8518J52990L3393n7883J14k5926k1434J7422J7626
23639G2286K6876j0084r1425K6799n2870j17246J3694L5726n4155J712k6709O2864
23627a12532M7894k0432J9946j6787j1676J7156M5520O5887O732l3787r5510j1159
23615i8748P7634O9025N2774o8123o3768J860K9404N9209P2949K0508q361o5395
$$ plain form
23697 129793 92145 114397 47529 -65897 -26392 51871 -21920 -101607 -111222 -53511 -26976
23686 -26976 -109059 -124303 -75937 -30903 -58833 25038 20355 -32905 -256 101589 116116 105542
23674 105542 95078 87556 166165 177787 84350 -139660 -238270 -254653 -152181 -21861 -57681
23663 -57681 -62581 -24015 -42846 16518 -1843 -20980 -97106 -60560 -70966 -137377 -140835 3964
23651 3964 117317 147671 24502 -44016 108974 142367 84484 84598 58672 37238 54660 72286
23639 72286 99162 89078 -2347 24452 -28418 -145664 -131970 -96244 -150399 -148687 -175396 -112532
23627 -112532 -64638 -85070 -65124 -81911 -93587 -76431 -30911 34976 41708 7921 -87589 -98748
23615 -98748 -21114 47911 100685 32562 -31206 -29346 58 59267 132216 152724 144363 78968
23603G8968k8121Q7073k1885j01054L8821l1545o1312J8798J26758J3240r4436
23592B5305o6298l133R2208L7683q5351N770n0084K5498J5299M1649j4308m5342
23580b1104L6163P0635R8262j138j05977q0527j7155J3299m211N469j04303k3346
23568a33933j0023M9695J5452l667J2463M1476Q3464k0750K95Q390j22425n7668
23556a37231j6708O8817L970nK97K8491O0357K4877J4909J1642N4704l7692m1505
23543C4923P3004l966K8245k4924l5007k9728o0356o452M2823l2117N1728L675
23531D1848j15683L8778L2163j221M3601l9792q651R268J7942L160l8960j3049
23519c0596M6052J532r2189k6444J06364N5298r0056j59004M1496Q8398M1526
$$ plain form
23603 78968 50847 137920 116035 14981 53802 22257 -39055 -20257 106501 119741 25305
23592 25305 -40993 -44126 48082 85765 414 6184 -43900 -18402 -3103 38546 24238 -21104
23580 -21104 15059 85694 183956 182818 76841 -3686 -20841 -7542 -11753 -6284 -110587 -133933
23568 -133933 -143956 -94261 -78809 -82476 -70013 -28537 54927 34177 34472 42862 -79563 -137231
23556 -137231 -153939 -85122 -81152 -81157 -80860 -52369 7988 32865 47774 59416 114120 76428 34923
23543 34923 107927 103961 132206 107282 72275 42547 -17809 -24261 18562 -13555 38173 41848
23531 41848 -73835 -35057 -2894 -4115 39486 -306 -8957 311 18253 21413 -17547 -30596
23519 -30596 15456 16988 -75201 -101645 4719 60017 -30039 -189043 -147547 -59149 -17623
23508a7623P5223N7240j6800j4296P09o9940n1329M4332L455p3787L1656L4073
23496B913N1936q0624m8024j5933j08291q9734K7551N1730L035P1558J33429l0208
23484c0662j9738L0882M7828m0001p3504L3220K1107O8870k6259j16621m9872
23473a54750Q2696o6974n787O2109o1510p9040K0647N7359l574l3892L5530P3148
23461g4038J00783P8137p2210r1081K7950p865l2300l9481k1393J6960R2396L4942
23449A2800M7180p920p2220m8580K1573O7469M3896p0879l0113O612m5785j7304
23437i3271R0580l5992o575Q2709O4993k2624j03442n753L1928N5329M7829l4050
23425G1661o4888L8828K3236j27281k8145J08968O4044n3344j12892n0189j2167
$$ plain form
23508 -17623 57600 114840 98040 83744 84453 14513 -36816 7516 10971 -62816 -31160 2913
23496 2913 54849 -25775 -73799 -89732 -198023 -287757 -260206 -208476 -205441 -133883 -454 -30662
23484 -30662 -50400 -19518 28310 -11691 -85195 -51975 -30868 38002 11743 -104878 -154750
23473 -154750 -72054 -139028 -144815 -82706 -144216 -223256 -202609 -145250 -148824 -182716 -147186 -74038
23461 -74038 26745 104882 32672 -58409 -30459 -38324 -70624 -110105 -131498 -114538 -22142 12800
23449 12800 59980 52060 -20160 -68740 -47167 20302 64198 -6681 -36794 -30182 -75967 -93271
23437 -93271 -2691 -38683 -45258 37451 102444 79820 -23622 -29375 2553 57882 105711 71661
23425 71661 6773 45601 68837 -58444 -86589 22379 86423 33079 -79813 -130002 -142169
23414a42169M0745M5069J7915n8889L626N357R9830q480J2990l0262o6995j07542
23402a88805N8063P4407O9183M364q0710N8087J64755j117j14818n3019M1566
23391C1956l1842N4989J9989K4476m1652o1554o299K6760m5766k1531Q1319M15
23379C1260K8849N6151l3490j04690j7696O3689o6676j4815M1973J6779O322k118
23367E538O9116j9138n2598o785L2070P4683j189n5115l2437M3368K4514K4327
23355A06354n4249n1262n602J13102K3368j0683L4095l0338q6362o0260q2096
23344a03933P1P20m1730L2804o3009j9676Q5946N4090N8555o102K3127O0863p2841
23331H885l3856K6136M1085m8634q8307K4383L7960j073P5676K7781p6753M7849
$$ plain form
23414 -142169 -101424 -56355 -38440 -97329 -93703 -88346 11484 3004 15994 -14268 -81263 -188805
23402 -188805 -130742 -56335 12848 17212 -63498 -5411 159344 158227 43409 -9610 31956
23391 31956 114 55103 75092 99568 57916 -3638 -9937 16823 -28943 -50474 30845 31260
23379 31260 60109 116260 82770 -21920 -39616 24073 -42603 -57418 -15445 1334 7656 5538
23367 5538 74654 55516 2918 -3867 28203 102886 101697 46582 14145 57513 82027 106354
23355 106354 52105 843 -4759 108343 131711 121028 155123 124785 38423 -21837 -103933
23344 -103933 -103862 -103142 -144872 -112068 -175077 -194753 -108807 -54717 3838 -2264 20863 81726 8885
23331 8885 -24971 1165 42250 -6384 -94691 -70308 -32348 -33421 42255 70036 -6717 41132
23319D1132J21195j19870k3272l1565K251N2734J865k9838m3252l1180P0394o1536
23307e0942n354N8926P4863o92j03207p3274k5915p6192J4497L5829l1602L0620
23295a52443J01787J90047o2951m2465m7322j14327l4429J8220L4041K1007k1038
23284a09873J27249M5003m4555k8090Q7749l5374j1728P9720J04051n1544o3504
23273I9104l0934k9286L4032N5795q725o9077M894j23742m7033O0545J31724L5835
23261A13132l8707o5999k8128n2576K3215Q9026l9691r6849o1398N7580Q209R336
23249h2850J4375m4084J02069N2502J6992p7081o9797l2247O5453k9540j2926
23238i7134L1282o8401p5445N7341Q7558Q3286K3655j4733m0074M1006o9359o889
$$ plain form
23319 41132 162327 42457 19185 -12380 -10129 42605 44470 14632 -28620 -59800 10594 -50942
23307 -50942 -56296 2630 77493 76801 -26406 -99680 -125595 -201787 -187290 -151461 -183063 -152443
23295 -152443 -50656 139391 76440 33975 -13347 -127674 -162103 -143883 -109842 -88835 -109873
23284 -109873 17376 62379 17824 -10266 77483 42109 30381 110101 214152 162608 99104
23273 99104 68170 38884 72916 128711 119986 50909 55803 -67939 -114972 -54427 77297 113132
23261 113132 74425 8426 -19702 -72278 -49063 39963 272 -96577 -157975 -100395 -92186 -82850
23249 -82850 -68475 -112559 -10490 42012 59004 -18077 -87874 -120121 -54668 -84208 -97134
23238 -97134 -65852 -134253 -209698 -152357 -64799 18487 42142 27409 -12665 28341 -41018 -47907
23226d7907K1499K7642O6602L7527n5152r4596L6626N8627o7586r1244P9993J00856
23214G2887K9582j0024p4032m4326l1235o8806k3582M5646O3483J45886K3008
23203A28487o0111p5295k1805K1433J8066J1072Q198N0855J3484M867m7882k3162
23191B8207M2312J27881l6988r6292j8370l9010k5380j9185L958j6999k797N3607
23179I44J2531L8473q031n5943k7318L859M9638K7288n3246j07204q1551J04075
23167i6485J52023M6121J0648J2505L5313j2292q8077r1847p5591p933j2115p0410
23155a98140L3229Q689Q1715N2076k8965j3867N6643K9103l908j5380M3695M6229
23143I1119K1003l4688n811L3742m3571P440p0906L4413R2501o6984l1842l0173
$$ plain form
23226 -47907 -26408 1234 67836 105363 50211 -44385 -7759 50868 -16718 -107962 -27969 72887
23214 72887 102469 92445 18413 -25913 -57148 -125954 -149536 -103890 -40407 105479 128487
23203 128487 68376 -6919 -28724 -7291 10775 21847 30045 80900 94384 99251 51369 28207
23191 28207 70519 198400 161412 65120 46750 7740 -17640 -36825 -32867 -49866 -52663 944
23179 944 13475 51948 43917 -12026 -39344 -35485 14153 41441 -11805 -119009 -200560 -96485
23167 -96485 55538 101659 112307 124812 160125 147833 59756 -32091 -107682 -115615 -127730 -198140
23155 -198140 -164911 -156222 -74507 -22431 -51396 -65263 -8620 20483 16575 1195 44890 91119
23143 91119 112122 77434 71623 105365 61794 69234 -1672 32741 125242 58258 26416 -3757
23131c757p6789o9101P7632J19354M0885m6108j0977M7847N4618J1112o7612r8680
23119b1576o4349k1350j5616R0538J01376J2268m0512M9881Q0436l2639l4258
23108A04199q2815l8473Q202O6357L4488J3682n7028r7444j9405L9774O691o3921
23096h5693o0775j2424O0722N1122K6858k6009m942J7486O0221K4668J38682Q2892
23084B72808j9861j04195r2205o0063M1982p2041j4089P4087j351n8618l5966
23073f9512k1985O7675m7078j8000M2535m4229r094J18282J22658O3797m4896
23062A60153m3444L1432m6531m2639o3142m4911R31p3058O36M4519J28320K9433
23050H1699l4242K069j1791m1977N4860J6764l6949J5189L3406J83r7901j33230
$$ plain form
23131 -3757 -80546 -149647 -72015 47339 88224 42116 31139 78986 133604 144716 77104 -21576
23119 -21576 -85925 -107275 -122891 -32353 69023 81291 40779 90660 171096 138457 104199
23108 104199 21384 -17089 -8887 57470 91958 105640 48612 -48832 -68237 -28463 -21772 -85693
23096 -85693 -146468 -158892 -98170 -47048 -20190 -46199 -51141 -33655 26566 51234 189916 272808
23084 272808 252947 148752 56547 -3516 38466 -33575 -47664 26423 25072 -33546 -69512
23073 -69512 -91497 -23822 -70900 -88900 -46365 -90594 -99688 18594 141252 205049 160153
23062 160153 116709 148141 101610 58971 -4171 -49082 -48151 -121209 -120573 -76054 52266 81699
23050 81699 47457 49526 37735 -4242 50618 67382 30433 45622 79028 79211 -18690 -151920
23038a51920M6397Q3319p3133k4260k2562M4975L0540P44J0867L2387l4313l734
23026f0693N0595Q4261M2661j0219J4571j8600j20513P9863J5966j03289l6443
23015f1840o6968L5648O3544L474J6029O4588K1308j41366q7093J2914M1982J8585
23003g9195L8721k5284Q3334Q3765m4683l1918o6546l8856o4772J1996K2487O8254
22991d2697R8399L360o4018r6089M2932J29632L8630J787o3022O676N2311N33
22979A08434M6060K1197n6942l3647o4971k5568j03991K4061J71253L9397j13598
22968A1685j25201n8927J10818N3697Q416J09297M3298o5288q9873j3947N5374
22957C9349L5702J2773m2954K9739m2203q9902o8249j9458M1417k6132q243j9332
$$ plain form
23038 -151920 -105523 -22204 -95337 -119597 -142159 -97184 -66644 -65900 -55033 -22646 -56959 -60693
23026 -60693 -10098 74163 116824 106605 121176 102576 -17937 61926 77892 -25397 -61840
23015 -61840 -128808 -93160 -29616 -26142 -10113 54475 75783 -65583 -152676 -139762 -97780 -79195
23003 -79195 -40474 -65758 17576 101341 56658 24740 -41806 -80662 -145434 -133438 -110951 -42697
22991 -42697 55702 59062 -4956 -101045 -58113 71519 110149 111936 48914 55590 107901 108434
22979 108434 154494 175691 118749 85102 20131 -5437 -109428 -85367 85886 125283 11685
22968 11685 -113516 -172443 -61625 -7928 488 109785 153083 87795 -2078 -16025 39349
22957 39349 75051 87824 44870 74609 32406 -57496 -125745 -145203 -103786 -129918 -138161 -157493
22945a57493Q7053Q1697o8714L3563O2864P0437Q4555l1303p0412r5614o9020
22934g2387J02021O3584L4189k4610q3499p2116J9908L8299L6470O617n4917Q155
22922A714K9606n2100k5679J15235R6497o9420j8733K2614l0433L9573k9120m8331
22910C1423N4983r7618N1737R3321k129p4692p7929J274p433L8807L4864j01896
22898e5288J2337L7271j931o2864k6867O462P4509O5331p2851O314J6607k6150
22886b7120r2169K824N4933L6954r7942J5228N1054k4554N8711O3817j6152l1933
22874f349l6775R667J6997j0233m5295k0738P8176J49670k6142q4700l6139j03455
22862a15316Q01J8890j1998O0371J17352M0444m4510J3619j1180J0500J1204M910
$$ plain form
22945 -157493 -70440 11257 -57457 -23894 38970 109407 193962 162659 92247 -3367 -72387
22934 -72387 29634 93218 127407 102797 19298 -52818 -32910 5389 41859 48476 -6441 1714
22922 1714 31320 -20780 -46459 68776 165273 95853 77120 99734 69301 108874 79754 31423
22910 31423 86406 -11212 40525 133846 131717 57025 -20904 -19630 -27063 11744 46608 -55288
22898 -55288 -42951 -5680 -7611 -70475 -97342 -90880 -16371 48960 -23891 -17577 -970 -27120
22886 -27120 -119289 -116465 -61532 -24578 -122520 -107292 -56238 -80792 -22081 41736 25584 -6349
22874 -6349 -43124 -33457 -16460 -26693 -71988 -92726 -14550 135120 108978 24278 -11861 -115316
22862 -115316 -114515 -95625 -107623 -47252 70100 110544 66034 79653 68473 78973 90177 95087
22850I5087n0128Q597N8332q5229n2045L9799K0794K3887J1910j3745p9783K7268
22838D744Q1173K8472j6498m4812n5314O1026L5462l5672o1554N0730L661m8356
22826C062M6454J6700m9206K0758j2959r4402q8920P7222j0210p477K1855J2735
22814f4388N8925Q6791o3433p3756o0208p6082O0558J14870N2499j1360m886l3889
22802a4359n8968l0164q6252N5220R6987L254O5438l4949j55064O7045J29912
22791C8100J08579K7377j26009l5803M6160m1906o5665K1364p3506m6804O630
22780a41483O188Q5297P2172P587m4566p0429k0278L5152K5459M5410o415n2794
22768e8700k8107Q2431J16399j9431j21198n2995M8066N4285n563J465L5595j19268
$$ plain form
22850 95087 44959 53556 111888 26659 -25386 14413 35207 59094 71004 57259 -22524 4744
22838 4744 85917 114389 97891 53079 -2235 58791 94253 58581 -2973 47757 51418 3062
22826 3062 49516 66216 17010 37768 24809 -69593 -158513 -81291 -91501 -98978 -77123 -64388
22814 -64388 -5463 81328 17895 -55861 -116069 -192151 -131593 -16723 35776 24416 19530 -14359
22802 -14359 -73327 -103491 -189743 -134523 -37536 -34282 31156 -3793 -158857 -91812 38100
22791 38100 146679 174056 48047 12244 58404 16498 -49167 -27803 -101309 -148113 -141483
22780 -141483 -135295 -49998 22174 29761 -14805 -85234 -105512 -70360 -44901 509 -5906 -58700
22768 -58700 -86807 -4376 112023 92592 -28606 -81601 -33535 20750 15187 16652 52247 -67021
22756f7021p3875j4920K4217R3917M568l3465k8229l7071l5796O1417M7958J8186
22744d0114O3150R810m6934k8812j249K0777K2353k0813K9028j9208p962l3625
22732e3599n5089r1358L8616M15N0036L7227J4497R431J5053k1696J7487J8487
22720b0493M2111Q923n3404M439L0429j3890K3780R0383k9514q8829l7351P003
22708c6413L7816P8839k4952j41489M393K9498R4334J15616N6991k9890K9169
22697B13912p957j10659r0629q9752j05799n0P8385L7227Q4123O75r45M2921k302
22684D9150J7528m1930n9029m2785K4544L6969m4079l3826l5672j24683j1599
22673b65412J25494N5042L0751K6490Q832L8968o516J1774p3142Q921o868j6320
$$ plain form
22756 -67021 -140896 -155816 -131599 -37682 -33114 -66579 -94808 -131879 -167675 -106258 -58300 -40114
22744 -40114 23036 32846 -14088 -42900 -44149 -23372 -1019 -21832 7196 -12012 -19974 -53599
22732 -53599 -108688 -200046 -161430 -161015 -110979 -73752 -59255 -49824 -34771 -56467 -38980 -20493
22720 -20493 21618 30541 -22863 -18424 12005 -1885 21895 112278 82764 -6065 -43416 -36413
22708 -36413 1403 80242 55290 -86199 -81806 -52308 42026 157642 214633 184743 213912
22697 213912 205955 95296 4667 -85085 -190884 -190934 -112549 -75322 8801 9476 8531 51452 49150
22684 49150 66678 24748 -34281 -77066 -52522 -15553 -59632 -93458 -129130 -253813 -265412
22673 -265412 -139918 -84876 -54125 -27635 -18803 20165 13649 25423 -47719 -38798 -45666 -61986
22661f1986m5258O8228J02779O3573l1255J5369r0004l4962k6777n9412M665J7129
22649g7911K1648j1858q2587K92Q3032P7274L3017J7882K3635k1977j9556r168
22637C3723k1148J2417l0450L5616L0817J0918j1286J0015o5770M3975M8303K6843
22625A23973j11053j52734l9760Q2273J10L7016K7878K4522M6763R0482K3854
22614A53324n3753J1501n5456m4073m3490m0382j526k0693O0920P0774J5936p754
22602D5328K6159j5852l4617L3756m5064k3629j12743r0023J4372R2059N749J8924
22590h5581J25101r645L6458q8242j56802K7291P0425k7705N8403Q2824o2732
22579c0205k9210N184J11807k6758l7762M7311J9254k9875j07267j01635J5617
$$ plain form
22661 -61986 -107244 -39016 63763 127336 96081 111450 21446 -13516 -40293 -99705 -95040 -77911
22649 -77911 -56263 -68121 -150708 -150416 -67384 9890 42907 60789 84424 62447 42891 33723
22637 33723 12575 24992 -5458 30158 60975 71893 60607 70622 4852 48827 97130 123973
22625 123973 12920 -139814 -179574 -97301 -97191 -60175 -32297 -7775 38988 129470 153324
22614 153324 99571 111072 55616 11543 -31947 -72329 -73855 -94548 -33628 37146 53082 45328
22602 45328 71487 55635 21018 54774 9710 -13919 -126662 -216685 -202313 -110254 -104505 -85581
22590 -85581 39520 29875 66333 -21909 -178711 -151420 -80995 -108700 -50297 32527 -30205
22579 -30205 -59415 -54231 57576 30818 -6944 40367 59621 29746 -77521 -179156 -163539
22568a63539Q0371P2275l0910o116K043r591N1580K2908n8739n2879M8975O6177
22556B2555L5748n316k0522k0431J22818N3460q9682r2869p3470M5252J8773n7759
22544f1443q5833o814L1952P9198L4646n6513l3809m22L5057L9399m4166m8510
22532a17258J2918j6839o5591Q2126J51958M3900j44630K6680K3109j27601P072
22521a24156J12119P6046O7295j5537m4115m790m2917J073j2167M3535K0139j8093
22509E8432N8993n1255m2007P0161k3747L1654p1525k7177K6186M83j5878P6352
22497I0672o5014l8929J9086Q460j2826k7224j4034R8231r1065k7234m69N5241
22485e105L5779K2403P5716L6086j07569o3864m900J0110J5870m5390R021M3018
$$ plain form
22568 -163539 -83168 -10893 -41803 -47919 -45876 -55467 -3887 19021 -39718 -92597 -43622 22555
22556 22555 58303 52987 32465 12034 134852 188312 98630 5761 -67709 -22457 -3684 -61443
22544 -61443 -147276 -154090 -122138 -42940 -8294 -64807 -98616 -99038 -63981 -24582 -68748 -117258
22532 -117258 -104340 -121179 -186770 -104644 47314 91214 -53416 -26736 -3627 -131228 -124156
22521 -124156 -12037 64009 131304 115767 71652 66862 23945 25018 12851 56386 76525 58432
22509 58432 117425 66170 24163 94324 70577 102231 30706 3529 29715 30198 14320 90672
22497 90672 25658 -13271 5815 14275 1449 -25775 -39809 58422 -32643 -59877 -60346 -5105
22485 -5105 30674 53077 128793 164879 57310 -6554 -11454 -1344 14526 -30864 -21843 21175
22473B1175K9262k4587o2994n3103k2766M5556J03515r235r5063m8723P964K980
22461a06019j9492J18545J18286L6616l4925o8106n5813J8567M4644K9517n0976
22450C0844J6734o8519L7635J02719K5667k2968m8487l665k4492n852j928o278
22438C1410l0808j06743L0941R6832K0476l4350k9727M9496Q5072P6958N3600
22427B43157o6644m2108p0497p2259K9361M9016n4242m4971Q684K9339j4710k9839
22415c5713O1494M5634l0642J4994q4231p6653q0428L4370N9997M6562j89N2895
22403H090l5882J9159m4733K9205M8812N57L1371k2723O969o043m7255p942M4387
22390B3972M1431P0554p244Q4719m7402p9546k6593J6603j4723L1024r205j03393
$$ plain form
22473 21175 50437 25850 -37144 -90247 -113013 -67457 36058 26823 -68240 -116963 -108999 -106019
22461 -106019 -125511 -6966 111320 147936 113011 44905 -10908 7659 52303 81820 30844
22450 30844 47578 -20941 16694 119413 145080 122112 73625 69960 45468 39616 37688 31410
22438 31410 602 -106141 -75200 21632 42108 7758 -21969 27527 112599 189557 243157
22427 243157 176513 134405 63908 -8351 21010 70026 15784 -29187 -20503 8836 -5874 -35713
22415 -35713 25781 71415 40773 55767 -28464 -105117 -185545 -151175 -91178 -44616 -44805 8090
22403 8090 -27792 -8633 -53366 -24161 24651 25208 56579 33856 40825 34782 -12473 -20415 23972
22390 23972 65403 135957 128713 213432 166030 86484 59891 76494 61771 92795 83590 -19803
22378a9803O0438k3328k2691l6665j4822M3610l0357m0732L7974K0170m5402Q3660
22366A2052J13247l3496n7576m5640q9386n9621N7280O4503k6846N6155L5786
22355B6458o0040M7259m052k18486l2108J60249R7210J9980J0796J30984J07082
22344B85332Q218j00060n6902m4062M5254j938l0482p3360k1319R4896N5425o6162
22332I4840r4193p2434P0583J7204J7023m6491N8620k998K8033q6695l4040O0895
22320A0347O2147K9065l0211M3052r9776q8961K6436M3273k1993O608j1236o0345
22308i1594l8224Q8845P2040J5500j3890j2398n8760j421R9685N3623l4428J2296
22296I1274m4110p3610r86K6771r3169k6944N6827M0082L1331L0753L9470n6332
$$ plain form
22378 -19803 40635 17307 -5384 -42049 -56871 -13261 -43618 -84350 -46376 -26206 -71608 12052
22366 12052 125299 91803 34227 -11413 -100799 -160420 -103140 -38637 -65483 -9328 26458
22355 26458 -33582 13677 9625 -208861 -240969 -80720 16490 36470 47266 178250 285332
22344 285332 293550 193490 136588 92526 137780 135842 105360 32000 10681 105577 161002 94840
22332 94840 647 -71787 -1204 16000 33023 -13468 45152 42154 70187 -16508 -50548 10347
22320 10347 72494 101559 71348 114400 14624 -74337 -47901 -4628 -26621 -20013 -31249 -91594
22308 -91594 -129818 -40973 31067 46567 32677 20279 -38481 -39902 59783 113406 78978 91274
22296 91274 47164 -26446 -27432 -661 -93830 -120774 -63947 -23865 7466 38219 77689 21357
22284B1357m3947q2467M7034j7068K6891m6547m8434J61561j0139J08356J08804
22273B25401l2731p4591l0987j5332p37O276r7322q9859M9197R4231m3064M066
22261e452K2539m2338L1066L7028m5163N7167M252l9208n9174k0654l383j316
22249f4636l4856M9805P1037N0912m3167K3145o7571j8817L9449k8528J8460j7248
22237b2015n7263n200P000J05411M6985m1497j8998j8838r830Q764k6784R804
22225b2461l4910J3966P4049l9619K6118r64k7300r042j1283K2309J28447M929
22213A24239l4328N9892k902q9419K4991N8751L8904L6609J2042q3379p7394q7674
22201a9668j66188O9535J51565m2603p4805k8102N4027R0942M6245M5446l1068
$$ plain form
22284 21357 -22590 -105057 -58023 -75091 -48200 -94747 -143181 18380 8241 116597 225401
22273 225401 192670 118079 87092 71760 71023 77299 -20023 -109882 -60685 33546 -9518 -5452
22261 -5452 17087 -25251 5815 42843 -2320 54847 59099 19891 -39283 -59937 -63320 -64636
22249 -64636 -99492 -49687 21350 72262 29095 52240 -15331 -34148 5301 -23227 -4767 -22015
22237 -22015 -79278 -84478 -77478 27933 74918 33421 14423 -4415 -14245 -5481 -32265 -22461
22225 -22461 -57371 -43405 30644 -8975 17143 16179 -11121 -20163 -31446 -9137 119310 124239
22213 124239 89911 149803 146901 57482 82473 141224 180128 216737 228779 145400 68006 -19668
22201 -19668 -185856 -116321 35244 -7359 -82164 -110266 -56239 34703 80948 126394 95326
22190I5326J279K1700o4384n5853J4811k3972l8055J7735N2860N1926o1509n3185
22178d1321J07776P3674R8668m4966j40252j34660j5129J8750l1297N0543k3980
22167h2194p7292l2079R3682L3570j0342M5018Q3419M7966m4809r3885N8220P840
22155B9114q9070k8496m9000k2486p1182R3899P8283m39k8422J16100J59786K093
22143A90180j00674n9755p2695K2548J836k1664J4803R5562L7438q3980k6220
22132b621o838j07994n3107J9676J20159J35105j4668j3091L2923j12824o6249
22121f9529q407q642J28698J09233k3321r9376j34633l470O2823M2565p0452K057
22109g2454O8672M0736j6094m132j6715j0652o3837M720J6851p904o4821o695
$$ plain form
22190 95326 96605 118305 53921 -1932 12879 -11093 -49148 -31413 21447 73373 11864 -41321
22178 -41321 66455 140129 238797 193831 53579 -81081 -96210 -77460 -108757 -58214 -82194
22167 -82194 -159486 -191565 -97883 -64313 -74655 -29637 53782 101748 56939 -36946 21274 29114
22155 29114 -59956 -88452 -137452 -159938 -231120 -137221 -58938 -59377 -87799 28301 188087 190180
22143 190180 89506 29751 -42944 -20396 -18560 -40224 -25421 70141 107579 23599 -2621
22132 -2621 -9459 -117453 -170560 -150884 -30725 104380 89712 76621 109544 -3280 -69529
22121 -69529 -77936 -86578 42120 151353 128032 28656 -105977 -109447 -46624 -4059 -74511 -72454
22109 -72454 -3782 36954 20860 16728 13 -10639 -74476 -69756 -52905 -60809 -125630 -132325
22097a32325K1420o3405m6441J2624R1401M4019J337r3727M6564Q8467p6446K6236
22085h0276j2759q238m3989J7893J09701Q636K2032O3970N1693r6218m6462Q0336
22073F6319n657k2548n9022K0204k2661j7238r032m0312k6716L7176R2609l7651
22061b4529k9971n3969J7630K8846J08947J1963j03230P4747J00749j8760J705
22050A14128k851M0129q0093j39365k528j5802L7256K4647P0736m0189m0658k9987
22038f4577m4418K5625M4815p4354l5238L5480P9555L1494j5791K6688N974m6195
22026c0942N9772J6088n4307N0696K5660j9374m1821m6892q7123n7069O1990K0298
22014a03024K0772l3366j3752J5008k8799l104R0946K2872k2450N7673R1574R696
$$ plain form
22097 -132325 -110905 -174310 -220751 -208127 -116726 -72707 -71370 -165097 -118533 -30066 -106512 -80276
22085 -80276 -93035 -101273 -145262 -127369 -17668 -9032 13000 76970 128663 32445 -14017 66319
22073 66319 60662 38114 -20908 -704 -23365 -40603 -49635 -89947 -116663 -79487 13122 -24529
22061 -24529 -54500 -108469 -90839 -61993 46954 58917 -44313 30434 131183 112423 114128
22050 114128 111277 151406 71313 -68052 -70580 -86382 -49126 -24479 46257 6068 -34590 -64577
22038 -64577 -108995 -83370 -38555 -112909 -148147 -112667 -33112 -1618 -17409 9279 15253 -30942
22026 -30942 28830 44918 -9389 41307 66967 47593 5772 -41120 -128243 -185312 -123322 -103024
22014 -103024 -82252 -115618 -129370 -114362 -143161 -146265 -55319 -32447 -54897 2776 94350 104046
22002A04046j7555l8053J7995k6874k9551L3768M622J01730n5602o4160k6034
21991D332k6209K9813m0972m7469Q9264J875q3006P6732J3387Q169K1353J6925
21979F4194K7203m0951l7087O223l0547k7499J6168n6409j14383K1069J11754
21968f0265k1066j36552m5480R6575J07039L8882O8877O0254o019m3648l3260
21957B5337J3255k3921j0023N9234k1212l1173N7377O45J5010J30140O5593r985
21945B70277q1066k2557n4440N8760P2025q4485j22357n5464L8519O7926J8153
21934A05291J6312q0775o2478L9625M1445J0864K3569m9267K7223N2616j35887
21923a1462m0775m762J2440J7790j2689K5892k4215j4272L5462K0507j0438K0285
$$ plain form
22002 104046 86491 48438 66433 39559 10008 43776 48398 150128 94526 30366 4332
21991 4332 -21877 7936 -33036 -80505 8759 10634 -72372 4360 17747 25916 47269 64194
21979 64194 91397 50446 13359 19582 -10965 -38464 -22296 -78705 -193088 -172019 -60265
21968 -60265 -81331 -217883 -263363 -166788 -59749 -20867 48010 108264 102245 58597 25337
21957 25337 38592 14671 4648 63882 42670 11497 68874 69519 84529 214669 280262 270277
21945 270277 189211 166654 112214 170974 242999 158514 36157 -19307 19212 87138 105291
21934 105291 121603 40828 -21650 17975 59420 70284 93853 44586 71809 124425 -11462
21923 -11462 -52237 -56999 -44559 -26769 -39458 -13566 -37781 -52053 -16591 3916 -6522 13763
21911A3763j3376p32o0741J5256j3069j9480P8386N0499K6009L7115o9084n1296
21899f750l2332J0544j43413n8340J44658P9246P3619q931N1638L6008n8735k569
21887H4643J3253j10200n3569j9538P6132N4428p1666k7950Q7189K507l8604n6301
21875e9676J3576M9020k958m2594m9783N4429Q4584k4843p0030N3036n3798N3093
21863D056K2913J09096o805l6495p5281q3059p1543J18466l1716J6871J1010o0460
21851h2947l781k6829r4611L274J36699Q6199M9343l8794j3697M0197L5305j1645
21839G8713n4311L3195m5586j57955l931J04901N5377Q1829L6915j212J2804o4476
21827G6263O0499n384o6362q9497l7012J7621J28287N1761J1228j8219K0349m9301
$$ plain form
21911 13763 387 -345 -61086 -45830 -58899 -78379 7 50506 76515 113630 44546 -6750
21899 -6750 -39082 -28538 -171951 -230291 -85633 -6387 67232 58301 109939 145947 87212 84643
21887 84643 97896 -12304 -65873 -85411 -9279 45149 -26517 -54467 32722 35229 -3375 -59676
21875 -59676 -46100 2920 -38 -42632 -92415 -37986 46598 21755 -48275 4761 -49037 4056
21863 4056 26969 136065 129260 92765 17484 -65575 -137118 -18652 -50368 -33497 -22487 -82947
21851 -82947 -86728 -113557 -208168 -204894 -68195 18004 67347 28553 14856 55053 90358 78713
21839 78713 24402 57597 12011 -145944 -149875 -44974 10403 92232 129147 127935 140739 76263
21827 76263 136762 131378 65016 -24481 -61493 -43872 84415 136176 147404 129185 149534 100233
21815A00233k02478N086O1362k2985k0728M5213N7987J4203m9683m1159L3322
21804a9627j3577O0356J3951m1769m0723J0475O585M9799L4973p3228O573J5774
21792I562q367O6249K0397l5601J5552n5085l1917j160L2682k5914o669K7146
21780F875M8043m0168j1413J00868N3439L0748p0267m4726j02589K6601J34621
21769A32032O5742j2346j8073q0747m8119K785j4874L4941m2303j37135j9434
21758a37531O7123K8630p530Q704J09499R4008q6887Q42O0343k4623m7256k6572
21746C8750R268o388n7962k8115L314L4960l6325J1861m7423r771Q8041J6475
21734A6685k3028N5o1303m1844K3172k9848Q6640M2175O3303n7956J696K5882
$$ plain form
21815 100233 -102245 -97159 -35797 -58782 -79510 -34297 23690 37893 -11790 -52949 -19627
21804 -19627 -33204 27152 41103 -666 -41389 -30914 -24329 25470 60443 -12785 -6212 9562
21792 9562 1195 67444 87841 52240 67792 12707 -19210 -20370 12312 -13602 -20271 6875
21780 6875 54918 14750 3337 104205 157644 188392 118125 73399 -29190 -2589 132032
21769 132032 197774 185428 167355 86608 38489 41274 26400 61341 19038 -118097 -137531
21758 -137531 -70408 -41778 -49308 -40604 68895 162903 76016 76858 137201 112578 65322 38750
21746 38750 48018 41630 -16332 -44447 -41133 -6173 -42498 -30637 -78060 -87831 210 16685
21734 16685 -6343 -6288 -67591 -109435 -86263 -116111 -29471 12704 76007 18051 19747 45629
21722D5629M1779J8788j38843K90M7067m4547n778N1610J18587L3209m3907q3411
21710D0473l4125O8933O8050L1934k278j12539r1785L788j5274k9592N6906L4037
21698A8528n1829o704Q339j3265P8000N028j09560o3836M3977P2810n7037j2404
21686h7953J1184R9966L8484m7025n5122K0111N1798L6589j4210R193J530K099
21674F6644o7087n1794l25R5133q0707j2013J08999Q9274m6942k6148Q879r3556
21662i643k4784n0356l7160l0197L4175P0352L2628M6701m2019J0789J2550j1778
21650A258M1517j3473j09929l1837R527l9980j3088N3933M3316m2742K8257P8678
21638E437l424j5586k3076j4781J10804J01403J3886q7448n0903p6379j19817
$$ plain form
21722 45629 87408 106196 -32647 -32357 14710 -29837 -35615 15995 134582 167791 123884 40473
21710 40473 6348 75281 143331 175265 172987 60448 -31337 -27549 -42823 -72415 -15509 18528
21698 18528 -33301 -40005 -31666 -44931 33069 38097 -71463 -135299 -91322 -18512 -75549 -87953
21686 -87953 -76769 23197 61681 14656 -40466 -20355 31443 68032 53822 63015 64545 66644
21674 66644 -443 -52237 -52562 42571 -38136 -50149 58850 148124 101182 75034 83913 -9643
21662 -9643 -34427 -84783 -121943 -152140 -117965 -47613 -14985 31716 -10303 486 13036 1258
21650 1258 42775 29302 -80627 -112464 -102937 -142917 -156005 -102072 -58756 -101498 -73241 5437
21638 5437 2013 -13573 -36649 -51430 59374 160777 174663 87215 36312 -40067 -159884
21627a59884N8723P3214n3274l010N2978P5787K5318l1567J0262j2202j3190L9368
21615F2523k7223p1042k213K3718N9627k7524p8686m467O6103P2656r5036p3049
21603i4613j7694m6334L6954m8284K4957M9635m9891L4893J17637Q1701k4854
21592F4107l9354m1527N506Q0245R738n9509n2158K815j0854L8957R153m5225
21580c8106J1150j1831m5001n6261k168j6685j1808k0020j8225N1915N1591J19592
21568A4143p8562n6275k0270M8066k1823M1958j6364L3156J22323R720o4427j34080
21556a22435O785P4592K8223p4453l0135P8755P7945R5738R9751j0226p2885j11357
21544D0298j23829o1358L7942P3500q7422J7303J03616M1459L9364R0584j8545
$$ plain form
21627 -159884 -101161 -27947 -81221 -84231 -31253 44534 69852 38285 48547 36345 23155 62523
21615 62523 35300 -35742 -37955 -14237 45390 17866 -60820 -65287 816 73472 -21564 -94613
21603 -94613 -112307 -158641 -121687 -169971 -145014 -95379 -145270 -110377 7260 88961 64107
21592 64107 24753 -16774 -11268 68977 78715 19206 -32952 -30137 -40991 -2034 7119 -38106
21580 -38106 -26956 -38787 -83788 -140049 -142217 -158902 -170710 -190730 -208955 -157040 -105449 14143
21568 14143 -64419 -120694 -140964 -92898 -114721 -72763 -89127 -55971 66352 76072 11645 -122435
21556 -122435 -115650 -41058 -12835 -87288 -117423 -38668 39277 135015 234766 224540 151655 40298
21544 40298 -83531 -144889 -106947 -33447 -120869 -103566 50 41509 80873 171457 152912
21533A52912o5630m2076Q7693N8056J3223j3085m7551l6413p1153j39425o0684
21522a64133K6288P423N0079J1239Q8149M2206M6356o5912j1936j7820K9704L829
21510D5472j18582o0967j1853m084J8091O8427O8478K5517j51931q357K4783M9124
21498e5882N1730O3570K8670P3444o8561q6058K5714Q1366K2709j3210q3873l3168
21486F451N3476K0511k3136N473K3471K2922Q5566k8441j9189o8600p9078l0261
21474c0835Q9811N4189r4121n7428j7417k0534n9540K978J18051P478j2190M9735
21462C0177l6049m2333j8120P6037J4536n4943O6762P5810k4034l9422n3240p5946
21450h0765M3061Q4140p9318l0931J5492k4585K6086k240P6887k179n0938l0716
$$ plain form
21533 152912 87282 45206 132899 190955 204178 191093 143542 107129 35976 -103449 -164133
21522 -164133 -137845 -130422 -80343 -69104 19045 61251 107607 41695 29759 11939 41643 45472
21510 45472 -73110 -134077 -145930 -150014 -131923 -63496 4982 30499 -121432 -129789 -105006 -55882
21498 -55882 -4152 59418 88088 161532 92971 6913 32627 113993 136702 123492 39619 6451
21486 6451 59927 80438 57302 62775 86246 109168 194734 166293 147104 78504 -574 -30835
21474 -30835 58976 113165 19044 -38384 -55801 -76335 -135875 -132897 -14846 -7368 -19558 30177
21462 30177 -5872 -48205 -66325 9712 24248 -30695 36067 111877 87843 48421 -4819 -80765
21450 -80765 -37704 46436 -32882 -63813 -48321 -72906 -46820 -49060 27827 25648 -25290 -56006
21438e6006K6507o5811m4123L9320P5165L3471p5611R219o704K5772j9945o4396
21426a23142m8838Q6347J28585k316r4679k6298j751K9257l1285N2624N6847O7579
21414I2930k0069o0442O6745J0234K3486p1019q875N2555L5360N5719M8308P697
21402B32629J3113M844l7869o628k6194p1865o4678j13999r616L9567J3641j4878
21390d1933K8917N8431m1905p3856m8204m105Q6183L6839Q369j6654n6917N2523
21378a2312J03284j341j18170J9155J58525L5605k2152M1759k854n6188q2420
21367F2891j8241r1j0522k7072M9087L8617m9754k5049M9634J3053M0746L3186
21355A56485l8259j06873l3163L5576L3624m4838j3662O2819l873j06358q0365
$$ plain form
21438 -56006 -29499 -95310 -139433 -100113 -24948 8523 -67088 -57869 -64573 -38801 -58746 -123142
21426 -123142 -171980 -85633 42952 40636 -54043 -80341 -82092 -52835 -84120 -31496 25351 92930
21414 92930 72861 12419 79164 89398 112884 41865 32990 85545 120905 176624 224932 232629
21402 232629 245742 250586 212717 206089 179895 108030 43352 -70647 -80263 -40696 -27055 -41933
21390 -41933 -13016 45415 3510 -70346 -118550 -122655 -36472 367 8736 -7918 -64835 -12312
21378 -12312 90972 89631 -28539 -9384 149141 184746 162594 204353 201499 145311 62891
21367 62891 44650 44559 34037 6965 56052 94669 44915 19866 69500 82553 123299 156485
21355 156485 118226 11353 -21810 13766 47390 2552 -11110 51709 47836 -58522 -138887
21344a38887P135N8026J64707k368n2221J4343R8046k4235k4363K3101o5056j9576
21332C8652p645j7234L1138L5253m126J8585o4906m0524m958N5183l1964n4044
21320d6590R8890k8007J6844p5419j26258O0335R8921J04610o3811m1285n921
21309g691j276N7260R706q883R7775k2993k5134l9865l1204P5762n0536o248M3308
21296H9981j5750K0628K5151j56371l5950M5130K3181J910L4185l530n3849r7168
21284a22452J04966P6111M537j8356l7337j9349L4702P6730L0948l5104p4736
21273B0660l7460q9094P7610P4706Q7440K7510n5350p4696K5602p4104l1453l2512
21261h1141M7997J30462o3454o2977L8130k2778q1010J057P4337N5975M2042K9788
$$ plain form
21344 -138887 -131752 -73726 90981 88613 36392 50735 148781 124546 100183 123284 58228 38652
21332 38652 31007 13773 44911 80164 76038 94623 29717 -10807 -15765 39418 7454 -46590
21320 -46590 52300 24293 41137 -34282 -160540 -100205 -1284 103326 39515 -1770 -7691
21309 -7691 -8967 48293 57999 49116 146891 123898 98764 58899 27695 103457 52921 46673 89981
21296 89981 74231 94859 120010 -36361 -72311 -27181 -4000 -2090 32095 28565 -25284 -122452
21284 -122452 -17486 58625 63162 44806 7469 -11880 22822 99552 130500 95396 20660
21273 20660 -16800 -105894 -28284 46422 133862 161372 106022 31326 56928 -17176 -48629 -81141
21261 -81141 -33144 97318 33864 -29113 9017 -13761 -94771 -93714 -19377 36598 78640 108428
21249A08428L1329K7216j4579j3182m5460k4792K5294n1632L6620L9179k4144
21238I4277k8394M0662k9297m7449n5879q7438J1075N7266J24265q042o118N9540
21226A24468L6438P951o4104J9011P9278o7585j46578P151K985K2120r0022o6782
21214a35669o1371N6050J19092m1600K2394K9613m6682N589l5531O5195P0197
21203D7277n526r1308L4775J27127N2745o0600N4060N5006q1283p4579l7015j31736
21191a11057J29681J46367N0134L1683K4593q9415p1106L6873q6328K1804n5661
21180B7568j6472m1618m6290J05131J44730k8999q9460o5743j7436l4055M6829
21169a5815N2892p592r0959N3857J8649p5175M3515Q0462J8324p0418j6837L468
$$ plain form
21249 108428 139757 166973 152394 139212 93752 68960 94254 42622 79242 118421 94277
21238 94277 65883 106545 77248 29799 -26080 -113518 -102443 -45177 79088 71046 64928 124468
21226 124468 160906 168857 104753 123764 203042 135457 -11121 -3970 -985 21135 -68887 -135669
21214 -135669 -197040 -140990 -21898 -63498 -41104 -11491 -58173 -52584 -88115 -22920 47277
21203 47277 41751 -49557 -14782 112345 165090 104490 158550 213556 132273 57694 20679 -111057
21191 -111057 18624 164991 215125 246808 271401 181986 110880 147753 61425 83229 27568
21180 27568 11096 -30522 -76812 28319 173049 144050 54590 -11153 -28589 -62644 -15815
21169 -15815 37077 29485 -61474 -7617 11032 -64143 -20628 59834 78158 7740 -9097 -5629
21157e629n2005M2624l9759J8067K8602k3108j2351m4350j9221k421O7000J19976
21145G7425m759l3726q5098m0463n1749K0007N9623L316M2904M2415M3632J3875
21133H7402q6063o5669Q3344j659K9428m7027n0251k9666l8538j4160j8360O7886
21121h3333J25143jl456n2648n4254k1797J2968N0670N5105n8203k6472L9464
21109a6814N1372j62012L8406O1694Q8292M3694m0881K1728k8711r6072o2715
21098a02019M1363Q5340J18721n257j05905o3505k7374J432L6072J01972K9975
21087A10815m7966K5310p976k4249N695n4419N576O1129L9889K1426J7082M1748
21075A94060K3131o8996m9188K8851j0626p3303k2096K1735o1479M4842O6304
$$ plain form
21157 -5629 -57634 -15010 -54769 -36702 -8100 -31208 -43559 -87909 -107130 -109551 -42551 77425
21145 77425 72666 38940 -46158 -86621 -138370 -118363 -58740 -55424 -12520 29895 73527 87402
21133 87402 1339 -64330 19014 17355 46783 -244 -50495 -80161 -118699 -132859 -151219 -83333
21121 -83333 41810 41809 38353 -14295 -68549 -90346 -77378 -26708 28397 -29806 -56278 -16814
21109 -16814 34558 -127454 -89048 -27354 60938 104632 63751 85479 56768 -39304 -102019
21098 -102019 -60656 24684 143405 138148 32243 -31262 -58636 -57204 -21132 80840 110815
21087 110815 62849 88159 80183 55934 61629 7210 12786 73915 113804 135230 152312 194060
21075 194060 217191 148195 99007 127858 117232 43929 21833 43568 -17911 26931 93235
21064I3235j9159J1590j5692j0840l648P2474J03587o1814n1770O870l1030L573
21052I7376O7268j03317j15722m9539N1000L7368J065M6824J1380L2438L504L0287
21040A09932K4838Q0491K080q9903o5077m3207J4315l4659Q2280m5107q2926Q1237
21028C4294P7222N4824l2392n6638j01755K1867M7722k141m796j72864l0154J12012
21016e2799K0031J25614K9150P424l783q822n7394k8321k1701l3804l7314J1544
21004e0175l1533L5010N2748j3394L0990M8795P523j424k8686k0000k9895l2531
20992c2572R639j2678M0649k2845m8390J06883R4340k5491j9964j1010N0131q1695
20980D6997j52604j4199L0829O2931M5020K579Q0624L3135n9619L212L7074m8553
$$ plain form
21064 93235 74076 85666 69974 59134 55486 127960 231547 169733 117963 124833 93803 97376
21052 97376 164644 61327 -54395 -103934 -52934 -15566 -14501 32323 43703 76141 79645 109932
21040 109932 134770 215261 217341 127438 62361 19154 33469 -1190 81090 35983 -46943 34294
21028 34294 111516 166340 133948 77310 -24445 -2578 45144 43003 38207 -134657 -164811 -52799
21016 -52799 -32768 92846 121996 129420 125637 116815 59421 31100 9399 -24405 -61719 -50175
21004 -50175 -81708 -46698 6050 -7344 23646 72441 79964 78540 49854 29854 -41 -32572
20992 -32572 -22933 -35611 5038 -17807 -66197 40686 135026 109535 89571 78561 128692 46997
20980 46997 -105607 -119806 -88977 -26046 18974 21553 102177 135312 75693 78905 115979 67426
20968F7426p7791j1901J21863j3205l2723j0400k7842l6515m6388Q522N5710R6988
20956I3744K880M9413L4922o7817L3670K9087j6423l7392M23J8614l5225R334
20944A15230R203n1057k6249L5523J5222m5062N9584k8774M4833M4484m4071K5296
20932A54162J6651J7583o5499j8023N3191N8400q8983r2136P051k353l684k9860
20920F500n4731K3334O4385Q8236k2076N2517k1185r9494p043J953O6206k2408
20908G6194k3302n044J5508J58569n4913q8049N9772k8902k6485M0220j8591J5871
20896A20848K1292j53031k0843L0284m5901R2194M2074k6201K0595r471j0719
20885F1121J7193M7004K9945r3126J15568J1926k01492Q693J04973P6422q4523
$$ plain form
20968 67426 -10365 -22266 99597 86392 53669 43269 15427 -21088 -67476 -58954 -3244 93744
20956 93744 96624 146037 180959 113142 146812 175899 159476 122084 122507 141121 105896 115230
20944 115230 124433 73376 47127 82650 97872 52810 112394 83620 128453 172937 128866 154162
20932 154162 170813 188396 122897 104874 158065 216465 127482 35346 42397 40044 36360 6500
20920 6500 -48231 -24897 39488 127724 105648 158165 136980 37486 30443 32396 98602 76194
20908 76194 52892 47848 63356 221925 167012 78963 138735 109833 83348 123568 104977 120848
20896 120848 142140 -10891 -31734 -1450 -47351 44843 86917 60716 81311 71840 61121
20885 61121 78314 125318 155263 62137 177705 189631 -11861 -3168 101805 178227 93704
20874I3704l5182P2664m2228m0458o3658L2371n594M2333M7721j106p7916L7296
20862E9947o66J34074q542j04053k1583O9826k056o0727q0245q307R1768p6859
20850g423K942K2746N541r3657L4151Q2292M3225M609l9957k0131Q9802k1729
20838A02411J15402k8271r2720J6196o7779k2035l8023O3024J7590m4510l5370
20827a4085L2627M1573L3357k5296J7600R0344j2824o2356n3904r671j6639M7728
20815F8454k8293L3965l9148k2423L6999R7340O099n4848m6469m970o769L9704
20803G9641l0681O9342q8245o5130K7615J0763L1544K8484M443m6435n9116Q6408
20791D8633Q9316l3998j4692l0327J16754M7126m5215J0499j04907p4600J34063
$$ plain form
20874 93704 58522 131186 88958 48500 -15158 17213 11619 53952 101673 100567 22651 59947
20862 59947 59281 193355 184813 80760 59177 129003 126947 66220 -14025 -22332 69436 -7423
20850 -7423 -4481 18265 23806 -69851 -35700 46592 89817 94426 54469 34338 124140 102411
20838 102411 217813 189542 96822 113018 45239 23204 -14819 48205 65795 21285 -14085
20827 -14085 18542 60115 93472 68176 85776 176120 163296 100940 47036 37365 20726 68454
20815 68454 40161 74126 34978 12555 49554 146894 152993 98145 51676 46706 39937 79641
20803 79641 48960 118302 30057 -35073 -7458 3305 34849 63333 67776 21341 -37775 48633
20791 48633 137949 103951 89259 58932 175686 222812 177597 188096 83189 8589 142652
20780A42652k1849j06791k5018N6148P8365K2272j06590N5965J37944L0185l0068
20769B33215l8790o295L4139J36518Q0667j16058j27299K5417l4670r8733n9288
20758B8823k4538P9005K9146K3739O0955M5064o6512l0610K1235P5443m7866q5031
20746A08853o629K4510L4016J7589M7643J093N5247J03158k5547N5005L5969O2711
20734E13618J992N4406J57089K09180M13724L68593K05423k2572N7676P9149N8213
20723B096491k0925j30600k99651l27366k20928j54954J5290Q6080R1813J08611
20713A243861L36630L73973K13504K050l0400K4373r259j45798l37534m24043
20703A247357k30807j23468j03782j00155K7976n5334r5490k806r7901j48800
$$ plain form
20780 142652 120803 14012 -11006 45142 123507 145779 39189 95154 233098 263283 233215
20769 233215 194425 188130 222269 358787 439454 323396 196097 221514 186844 88111 28823
20758 28823 4285 83290 112436 136175 197130 242194 175682 145072 166307 241750 193884 108853
20746 108853 102224 126734 160750 178339 225982 227075 282322 385480 359933 414938 450907 513618
20734 513618 515610 570016 727105 936285 1350009 1718602 1924025 1901453 1959129 2038278 2096491
20723 2096491 2075566 1944966 1645315 1317949 1097021 942067 957357 1043437 1135250 1243861
20713 1243861 1580491 1954464 2167968 2170018 2139618 2163991 2154732 2008934 1671400 1247357
20703 1247357 1016550 893082 789300 689145 717121 661787 566297 563491 465590 316790
20693C16790o1579j0055j7600Q760n5896N6577P8420q5213J0139J22014N508r2781
20681B75084J6803K7543j9924j25309p5410Q2102L3547m7465p5777n4026N8801
20670I5969j308l0605O1830O4728L5497K7836q239n9083l145m8752J21455L4574
20658B90757k895q5990j26702o0062l5739K2386Q369K5101n38L438O7607O8027
20646A73759M5203K2149o0448m4247P5272J5100k4611p9429K6225j3201q426j3680
20634A13666p0539j44366K2827J29284J06865j821P1918L2645r6269l8175m5700
20623H0335n8159j003j2867K1997J5865J8344J16402L0699n1664j4664j25953
20612A9332j22261L7716P090m5962M9226J77813j4283l5738k7465o1240r189N1131
$$ plain form
20693 316790 255211 245156 227556 236316 180420 236997 315417 230204 240343 362357 367865 275084
20681 275084 291887 319430 299506 174197 98787 180889 214436 166971 91194 37168 95969
20670 95969 94661 64056 125886 190614 226111 253947 245708 186625 183480 134728 256183 290757
20658 290757 287862 201872 75170 15108 -20631 1755 10124 35225 34687 38125 105732 173759
20646 173759 218962 241111 180663 136416 211688 226788 202177 122748 148973 135772 127346 113666
20634 113666 43127 -101239 -78412 50872 157737 155916 227834 260479 164210 126035 80335
20623 80335 22176 21173 8306 30303 46168 64512 180914 211613 159949 145285 19332
20612 19332 -102929 -65213 -58123 -104085 -54859 122954 108671 72933 45468 -15772 -24961 26170
20600B6170M4505n3674k373R4944O944l6353J5680o6107q7929l7826R4835L9110
20588C7926M3324J56517p923j91396n9599L080M4918J8055L7855N2613O0517L2520
20576B28407j32457n2198K0141P6483L8747j18506m2441K7226J19325P0223K0647
20565B55597N7860l9193p5506o9458j1337K1545L886j9024k0642K7536K5867M0948
20553A98079O2187L2474m4641p2554j24422k6269J32244J4883o7005L812J2866
20542A21654K0813J1957p74n369j7971O1653K3271K0404R0794q5615q3619k3950
20530A33248P5021N9192J7702k6165m9821j10555j29009P0522J11720M2437M6
20519A94338q1858P185j3790L667L8524m0384J6494O0130J7554N8562j2033r1368
$$ plain form
20600 26170 70675 17001 14628 109572 116516 80163 95843 29736 -58193 -96019 -1184 37926
20588 37926 81250 237767 229844 38448 -21151 -18071 26847 44902 82757 135370 195887 228407
20576 228407 95950 43752 63893 140376 179123 60617 18176 45402 164727 234950 255597
20565 255597 313457 274264 198758 129300 117963 139508 143394 124370 103728 131264 157131 198079
20553 198079 260266 292740 248099 175545 51123 24854 157098 171981 104976 108788 121654
20542 121654 142467 154424 153650 148281 130310 191963 215234 235638 326432 240817 157198 133248
20530 133248 208269 267461 285163 258998 209177 98622 -30387 40135 151855 194292 194338
20519 194338 112480 119665 105875 109542 148066 107682 124176 184306 201860 260422 248389 157021
20507A57021m4859J14405L8597m4060q8304n0550l414k9384K5594O3926K536M9721
20495A91229n2880j9384k0332L977J19476j5276l4785j47526j61811M3172R6417
20484B277J96487R2599p7787q436O4728J7404l5958k9226l9610J9314j7549q2104
20472A02139J560N3990N6670j756N5990j9279M5714L5644M3631Q3133K9609j83499
20460C03546j15693J4704P7080R3488J6770l9837r1867K430N52j16615N732n927
20448A44363q418M0034R676q0486J8450Q6595l6858q076l2294p352n3667r129
20436F2838R7196n889l7503j2476k5713m7438n6968l6762p2408P3583Q7163O0004
20424H5627K6929R359K2769n266n3557M8029Q0609N7313l1446j1443N7111K4288
$$ plain form
20507 157021 112162 226567 265164 221104 132800 82250 78836 49452 75046 138972 141508 191229
20495 191229 138349 118965 98633 102610 222086 206810 172025 24499 -137312 -94140 2277
20484 2277 198764 291363 213576 205140 269868 287272 251314 222088 182478 201792 184243 102139
20472 102139 103699 157689 214359 212603 268593 249314 295028 330672 374303 457436 487045 303546
20460 303546 187853 202557 279637 373125 389895 350058 258191 260621 261173 144558 150290 144363
20448 144363 135945 175979 185655 105169 123619 210214 173356 165280 132986 125634 71967 62838
20436 62838 160034 154145 116642 104166 78453 31015 -25953 -62715 -135123 -61540 25623 85627
20424 85627 112556 121915 144684 139418 85861 133890 214499 271812 240366 228923 286034 310322
20412C10322m8743j9568M3979N8045n6246N901Q151K1253J9517K3076n7801m2087
20400B65799O6515R4402J1084q6359k789p0752r5282J1017J18227J0632n0233
20389B72261k7015O9747P1052M4615L4456j9355m4008N6019Q1956n0352m6217
20378D43159J6345n6999L627J2180L9509l7654j27168p369M9903O0487Q3274M2243
20366E21537p9964n6915M9685N9036O6236O0729R2431j14763q9492k4004J3116
20355D97632Q5035M7467j0446m6588j2295p0225r5010j2699l3157L1056n7685
20344C23085N1230L2851p9909q6185K1561J09919k951j5306P1873O6800K9760
20333E22728r4105n7579k245J5837J4331o6132q6350M233J20518O096j1464l4401
$$ plain form
20412 310322 261579 242011 285990 344035 287789 293690 301841 323094 342611 365687 307886 265799
20400 265799 332314 426716 437800 351441 348652 277900 182618 193635 311862 322494 272261
20389 272261 245246 314993 386045 430660 465116 445761 401753 457772 539728 489376 443159
20378 443159 459504 402505 406132 418312 457821 420167 292999 285630 335533 396020 479294 521537
20366 521537 441573 384658 434343 493379 559615 620344 712775 598012 508520 484516 497632
20355 497632 582667 630134 619688 573100 560805 490580 395570 382871 349714 380770 323085
20344 323085 374315 407166 327257 241072 262633 372552 369601 354295 426168 492968 522728
20333 522728 428623 371044 368799 384636 398967 332835 246485 250718 371236 377332 365868 331467
20321C31467n6817J2937J32069K6950M4824R0794K5387M9153R0101o3973r2972
20310E89920k1657J0616P7425L8912l5249o3370l5386j00759n7709p7223J5592
20299C41112Q3627J07686m9317K2606J04037k4730J679J14341M8010m4497k1847
20288F82707j20675j17476k4264O1125P4584n9045K2397m6673J00909R8316L6486
20277G08391k0385k868p7606r3505N5648k5733m8504J16411M831l3570R213O5266
20265F57589J0104o5767N2555J3608l2476k5143o9551l6050R1039J54333Q6994
20254H37235N9652J115r7470P3069P8745O8175J7169M0392J03259M6193J0871
20243A238405q3574m8825o5780J1200O7515j25874l3097O0782R2204J46755O6103
$$ plain form
20321 331467 274650 287587 419656 446606 491430 582224 607611 656764 746865 682892 589920
20310 589920 568263 578879 656304 695216 659967 596597 561211 460452 402743 325520 341112
20299 341112 424739 532425 483108 505714 609751 585021 586700 701041 749051 704554 682707
20288 682707 562032 444556 420292 481417 556001 496956 519353 472680 573589 671905 708391
20277 708391 688006 685138 607532 514027 569675 543942 495438 611849 616680 583110 592323 657589
20265 657589 667693 601926 654481 668089 635613 610470 540919 504869 595908 750241 837235
20254 837235 896887 898002 800532 873601 952346 1020521 1037690 1078082 1181341 1227534 1238405
20243 1238405 1154831 1106006 1040226 1051426 1118941 993067 959970 1020752 1112956 1259711 1325814
20232A325814k3322K3419P6831N6497j1222q1592m0432l7993q1784j1735l7649
20221A156832k356M2662l9834L9864J22758n313l0279j3937l0528m636P9878P7788
20209A392899l2549M587J6204J15325J42285r213m4120K6547m7352j1246p3242
20198A480125k3325N8720N9641J59978O9368r8941l2532O1455J57429j602j10457
20187A779859N3064R4445M1404j9316l7081L4661L6638O5857P9863J52303Q548
20176B290245q4136P6567K02279J91957R1581J00679J10483R9960P8047J23614
20166C281276K0822O5946J51546l0758N4639J65385J27477K34584J86125J91390
20156D448432L60549M11063M91287O62651O44244Q55825Q54807Q38767P76447
$$ plain form
20232 1325814 1302492 1325911 1402742 1459239 1448017 1366425 1325993 1288000 1206216 1194481 1156832
20221 1156832 1154476 1197138 1157304 1197168 1319926 1314613 1284334 1270397 1239869 1235233 1315111 1392899
20209 1392899 1360350 1364937 1381141 1496466 1638751 1629538 1585418 1611965 1564613 1553367 1480125
20198 1480125 1456800 1515520 1575161 1735139 1804507 1705566 1673034 1734489 1891918 1890316 1779859
20187 1779859 1832923 1927368 1968772 1949456 1912375 1947036 1983674 2049531 2129394 2281697 2290245
20176 2290245 2206109 2282676 2484955 2676912 2768493 2869172 2979655 3079615 3157662 3281276
20166 3281276 3302098 3368044 3519590 3488832 3543471 3708856 3836333 4070917 4257042 4448432
20156 4448432 4808981 5220044 5711331 6373982 7018226 7874051 8728858 9567625 10344072
20147A0344072N47958M73378N98805N56842L59452K21286K20795L79957O85449
20138A4387994R25934J185184J660481K311277K818810L258448L731557M471611
20130C4751296N534363P244465R569313J3097710J8793199K8319054M3740740
20123A61050140O4923508P5788215M8368573R179839Q32422J6382932J8270377
20116C94796006j6415411m8792150n5601087m6932481l3449543j8974511o334492
20109A68296331O081838K0331820L8166752N9464668O6597375L4295006k267412
20102C90966378n927564J0735571Q310009k8684564n7958515o2188783n3166485
20095B02086047m0584661k8307834j9550006j4015256j0646612r393654r132931
$$ plain form
20147 10344072 10892030 11365408 11964213 12521055 12880507 13101793 13322588 13702545 14387994
20138 14387994 15313928 16499112 18159593 20470870 23289680 26548128 30279685 34751296
20130 34751296 40285659 47530124 57099437 70197147 88990346 117309400 161050140
20123 161050140 225973648 301761863 350130436 359310275 360142697 376525629 394796006
20116 394796006 378380595 329588445 273987358 227054877 193605334 174630823 168296331
20109 168296331 174378169 194709989 232876741 292341409 358938784 393233790 390966378
20102 390966378 385038814 395774385 404084394 375399830 317441315 255252532 202086047
20095 202086047 161501386 133193552 113643546 99628290 88981678 79588024 70455093
20088G0455093q673861q101859p298614o355518n395674m501669l621400k944570
20080B3561928k349801j877311j462819r79385r15234j033600j126349r36853
20072A2880576o98718p42115r98961j303263j022257q54306o60674m60562l81439
20063E758281n44392l21741k08200k93645k99192k48866l03485k17771p9757j51202
20053C090030j99212j67517k417L0748j60864l08478j95006n1580l2806m0134
20043A962764j09883l3603K0555m0871l6354l5307j12618r5399j03849n2824j9749
20032A342862o0923K4143n1193k27181j30819k6556q1052p044r8543R9903J13526
20021H97123M4146K7107k1374o5933o1023o827k9428o2604O2680L1399r669J5549
$$ plain form
20088 70455093 61781232 53679373 46380759 40025241 34629567 30127898 26506498 23561928
20080 23561928 21212127 19334816 17871997 16892612 15977378 14943778 13817429 12880576
20072 12880576 12181858 11439743 10440782 9137519 8115262 7260956 6600282 6139720 5758281
20063 5758281 5213889 4892148 4683948 4390303 4091111 3842245 3538760 3320989 3241232 3090030
20053 3090030 2890818 2723301 2720884 2751632 2590768 2282290 2087284 2035704 2002898 1962764
20043 1962764 1852881 1819278 1839833 1798962 1762608 1727301 1614683 1519284 1415435 1362611 1342862
20032 1342862 1281939 1306082 1254889 1027708 896889 870333 789281 782237 683694 783597 897123
20021 897123 941269 968376 947002 881069 820046 813219 783791 721187 783867 815266 805597 821146
20009H21146O5963R3752o663n0798j07424j1849K261j412L6271Q4500M8259J31514
19997A105520K673l6562j19127r0594m4938m7997r4825r3578O2158K0817J17398
19986G80945K1344Q3617J17911L3510N3135m1703l19k5609m2143n1278r4653k03315
19974F31442j4708j8299o1973p1690M9372O735m7768j0122R9484j7395o8661L6004
19962E12421R4212J6980p7406r4488n6192l900R133j8156r4137n5190k3411K3021
19950B32887J7940L6485R3165q5905m6818o7779m8K4783Q429L2060k1884j8457
19938B04858k6601J4565M232j5864j05229j09766j34597j1235M2000P8897j1269
19927g0009Q086J3112K5008L2703O673J14064M6517J9648K6929J1146K0173p107
$$ plain form
20009 821146 887109 980861 974198 923400 815976 804127 806388 804976 841247 925747 974006 1105520
19997 1105520 1108193 1071631 952504 861910 816972 768975 674150 580572 642730 663547 780945
19986 780945 802289 885906 1003817 1037327 1090462 1048759 1048440 1022831 980688 929410 834757 631442
19974 631442 616734 598435 536462 464772 514144 520879 473111 462989 562473 545078 476417 512421
19962 512421 606633 623613 546207 451719 395527 391627 400760 382604 288467 233277 209866 232887
19950 232887 250827 287312 380477 294572 247754 179975 179927 204710 213139 245199 223315 204858
19938 204858 178257 192822 197054 181190 75961 -33805 -168402 -179637 -137637 -58740 -70009
19927 -70009 -61923 -48811 -23803 8900 15573 129637 176154 195802 222731 233877 254050 246943
19915B46943r1343q4086K6822M4445n5466q8805n7413j40N9941Q2103J06152K7948
19903B17101n098r4515o6451P2610j3648q5666P8703q303j08209n2941O8274Q3482
19891H5339O3088K2215l9325k6948J396N1461r090K8872l4760M1991J7412l2903
19879A68748M3913r6102O9867P2596O8316K4395o445J0011j12325j38275p5807
19868B8892N1553r33J853N5034K6849K2882J6284O8116o5603m0249K6429N0936
19856B42043N9981j3164m3778l5898K8961o705K9049J1752K641L0509l4073o0949
19844B10369n0236k8545o484J6641O2651R0000l5212m9178J5918M2381M4293k27
19832C12371k3128k5437m3047l0123K5981N0529M9826J086l8219o4659L445p612
$$ plain form
19915 246943 155600 71514 98336 142781 87315 -1490 -58903 -59043 898 83001 189153 217101
19903 217101 212003 117488 51037 123647 109999 24333 103036 94733 -13476 -66417 1857 85339
19891 85339 148427 170642 131317 104369 105765 157226 148136 177008 142248 184239 201651 168748
19879 168748 212661 116559 186426 259022 327338 351733 345288 355299 242974 104699 28892
19868 28892 80445 79512 81365 136399 163248 186130 202414 270530 204927 164678 191107 242043
19856 242043 302024 288860 245082 209184 238145 231440 260489 272241 274882 305391 271318 210369
19844 210369 160133 131588 125104 141745 204396 294396 259184 210006 225924 268305 312598 312371
19832 312371 289243 263806 220759 190636 216617 267146 316972 318058 279839 215180 218625 211013
19820B11013l8878m4312j06721j1210P6856M1979N2936n5917o696n4252j4142
19809E0656J11939L7753o8422j9650k9243M012R3557P0717J25272o2672j24687
19798A89232p5327j0420Q4721l9395j6412j6330k0527O9114Q9224j2796m7066
19787A94018J6242J9997p726J7489k9520j4134L065J1738J4824l5840K7232k412
19775B14973l7502L7797k9016j2705O5050R4859J5833m2077l416j4708l9439K9211
19763B78860R824l9280p359k8959j7029l2817O5844O0614J8033M5205l7980m0789
19751B74167p5476k6059J7336q625K3097m1322j6190L8916R523n7799j3854O0099
19739A83813j2510M9424L5885J3306Q4838R6727n6933m8617O2907o2474o5647
$$ plain form
19820 211013 172135 127823 21102 9892 86748 128727 181663 125746 119050 64798 50656
19809 50656 162595 200348 131926 112276 83033 87045 180602 251319 376591 313919 189232
19798 189232 113905 103485 188206 148811 132399 116069 95542 164656 253880 241084 194018
19787 194018 210260 230257 222531 240020 210500 196366 199431 211169 225993 190153 217385 214973
19775 214973 177471 215268 186252 173547 238597 333456 349289 307212 303796 289088 249649 278860
19763 278860 288684 249404 242045 213086 196057 163240 229084 289698 307731 352936 314956 274167
19751 274167 198691 172632 189968 181343 204440 163118 146928 185844 195367 137568 123714 183813
19739 183813 171303 220727 256612 269918 354756 451483 394550 345933 408840 346366 280719
19728B80719k61P7857L5760N9491K29192K21650J51649L18201K99449J75668J11909
19717A961284l4713N0917J40497j17063l32143k08200k26050r4355p5555j38882
19707I25737j43254j30153n5243n037n6406p6684r0788q6537n5750l5174K6188
19696B16899m5989K7648m0990j67850J05115Q3136J2053n2023J1115L1829K2670
19685B03613L4999p1796j15958p0185N6848L4120Q3337J15259J4878M6844J10135
19674D42094P5574J93020J28354J48148L56575M83879L71993J53373k4920m2139
19664B285951P8062L56k57072l46120l15466k32377k77981o0624j13387j15571
19654F45771p8243m47J1600o2520M384L0218n4669q2828n4988n1393j4146l5399
$$ plain form
19728 280719 280458 358315 394075 453566 682758 904408 1056057 1374258 1673707 1849375 1961284
19717 1961284 1926571 1977488 2117985 2000922 1668779 1460579 1234529 1140174 1064619 925737
19707 925737 782483 652330 597087 592050 535644 458960 368172 281635 225885 190711 216899
19696 216899 170910 198558 157568 -10282 94833 177969 190022 137999 149114 180943 203613
19685 203613 238612 166816 50858 -19327 37521 71641 154978 270237 285115 331959 442094
19674 442094 517668 710688 839042 987190 1343765 1827644 2199637 2353010 2328090 2285951
19664 2285951 2364013 2364369 2107297 1761177 1445711 1213334 935353 874729 761342 645771
19654 645771 567528 567081 578681 516161 520545 550763 496094 413266 358278 306885 292739 257340
19642B57340r2125P2416J55988L3464l7416j21017q4733l6719J4694o6394k0548
19631G4950M5926J43393j8360j55919L407N3883P2476K6274k9745n3613N0053
19620B12725Q8578l9588R3227M8906p4374j24763j08325l0759p618j6014L2772
19609G4767M541L053L9385P4236K1957R869k0298o0718n6864Q4188M119M2755
19597B20990P368K773j19993R963O3430J05800Q1694j3699o6321l596J8075J045
19585C07529k9039m0729k7539J4063M0539K6501N6280l8762o1266M6431J063n1972
19573B43099k9600O9582j13634p0984M7019O9488Q4234M8416k2753j6387o2457
19562B46023K5566l784r4801o0021M7015l4661k9080P8956J8812k5595Q581j234
$$ plain form
19642 257340 165215 237631 393619 427083 389667 268650 183917 147198 161892 95498 74950
19631 74950 120876 264269 245909 89990 93397 147280 219756 246030 216285 162672 212725
19620 212725 301303 261715 354942 403848 329474 204711 96386 65627 58009 41995 74767
19609 74767 79308 82361 121746 195982 217939 227808 207510 146792 89928 174116 178235 220990
19597 220990 228358 231131 111138 121101 184531 290331 372025 358326 292005 288409 306484 307529
19585 307529 278490 237761 210222 224285 264824 291325 347605 308843 247577 294008 295071 243099
19573 243099 213499 283081 169447 98463 145482 214970 299204 347620 324867 308480 246023
19562 246023 271589 267805 173004 112983 159998 125337 96257 175213 194025 168430 177011 175777
19550A75777l7330l1001P042P1714Q1681M854o8849O1090O6600J8592L7282P4002
19538D61454l0628j17988p1902P0855Q2352N0138l7953m1533J9154j8020k5969
19527C39960J8168K3574n4412j8608J0008l6513J18070M5900m3591l4488P6250
19516D44318R6236m0020K734J00481J00107J65163J95731J90911K99764L77007
19506A932432J81996l3349j16584J37800J01644r1435l22528l05541k28100j16624
19496A139711l1450m5057J02223J46392K98671L67969L03092J31885p2813q8271
19486B252352R7968M1590k06651k64131k91895k51639j83713j50265l1374j22816
19476H89426j57572l2537m0718M4966J4614n57o3746j4134j6808j79241l8549
$$ plain form
19550 175777 138447 107446 114488 186202 267883 272737 203888 264978 331578 350170 387452 461454
19538 461454 430826 312838 240936 311791 394143 444281 406328 364795 383949 365929 339960
19527 339960 358128 381702 327290 308682 318690 282177 400247 446147 402556 368068 444318
19516 444318 540554 500534 503268 603749 703856 869019 1064750 1255661 1555425 1932432
19506 1932432 2114428 2081079 1964495 2102295 2203939 2112504 1789976 1484435 1256335 1139711
19496 1139711 1108261 1063204 1165427 1311819 1610490 1978459 2281551 2413436 2340623 2252352
19486 2252352 2350320 2391910 2185259 1921128 1629233 1377594 1193881 1043616 1012242 889426
19476 889426 731854 699317 658599 703565 718179 717622 653876 639742 622934 443693 405144
19465D05144j402N8303R4841j3630L7951N1768r9624l9813K5237M8058M7052J1334
19453F25219K7701L758j3174n7277Q1313K51138J91423J52737J80368K47004K17279
19442A907489J42815R2007N6772K25091J14135o724j94106l6455Q9732J78100
19432B568856M0460k9828n5367k7893n0184j34494r7549k36481k56274j60794
19422A560452o1546l0734r0430k25408j81011j22537n2342k5829n5691K2253k4506
19411G12671j08294k9621k830j7038k0806q1703J4479L432L2637K1860j8665J7085
19399E23207j2169N1678P2159O626q965l4431p5469O7790J0172L4014k4844j2863
19387E96905J6363p8315J5180R3997l7515o5116p658P9222l625k5982K1247k0492
$$ plain form
19465 405144 403742 462045 556886 543256 581207 632975 533351 493538 518775 566833 613885 625219
19453 625219 652920 656678 643504 586227 667540 918678 1110101 1262838 1443206 1690210 1907489
19442 1907489 2050304 2142311 2199083 2424174 2538309 2531585 2337479 2301024 2390756 2568856
19432 2568856 2609316 2579488 2524121 2496228 2446044 2311550 2214001 1977520 1721246 1560452
19422 1560452 1498906 1468172 1377742 1152334 971323 848786 796444 770615 714924 737177 712671
19411 712671 604377 574756 571926 554888 534082 452379 466858 470290 502927 524787 506122 523207
19399 523207 511038 562716 634875 641501 632536 598105 522636 590426 600598 634612 609768 596905
19387 596905 613268 534953 550133 644130 606615 541499 533841 613063 609438 583456 604703 584211
19375E84211l5189m3448k6398Q6581P5415p5816J8259J2173O229m4856J690l6254
19363E22597N903J05649l9442r6203Q2584J19113m0769k8119l970l8144O5766
19352F54965J03039o0789r4214j6794L9145j4078n9897J3795M0931Q618K6685
19341F41406n628k7680K6713n803J0050P7614j2679k5170m5918j16004o5471n3370
19329C98060P830n4287k3282J00065P3530k0203N1242N0099K9918k7648R9576
19318F84900J17771m5400j6792J05760J3388J6955Q6462K3405L0698J17203M7116
19307A181466l3126M976J01169M358l8141J6700k6891j17637m0881k635Q5407
19296A134765n4435k3652K26179J40470J10011M6949m4628j34734j17224K6048
$$ plain form
19375 584211 549022 505574 479176 565757 641172 565356 583615 595788 602017 557161 558851 522597
19363 522597 528500 634149 594707 498504 581088 700201 659432 631313 627343 589199 654965
19352 654965 758004 697215 603001 586207 625352 611274 551377 565172 606103 614721 641406
19341 641406 635778 608098 634811 629008 639058 716672 703993 678823 632905 516901 451430 398060
19329 398060 405890 351603 328321 428386 501916 481713 532955 583054 612972 585324 684900
19318 684900 802671 757271 740479 846239 859627 876582 963044 986449 1017147 1134350 1181466
19307 1181466 1148340 1153316 1254485 1258843 1220702 1237402 1210511 1092874 1051993 1049358 1134765
19296 1134765 1080330 1056678 1282857 1423327 1533338 1580287 1535659 1400925 1283701 1309749
19286A309749L1869q2645r5221o5336M1553K4307l4737j5059k5283L2803n4893
19275A067107Q8945N6668j1455L1814j2452l8671j9874m9912M7492P7032N2626
19264A289320K6761N057K2210J94557J31644R4366P2196P8301J018m1188M1815
19253A916057N6039k9458M4794P1114P1914L0828J15512K68209J63102J0780J60501
19242B879392K25243L62491K47915M0024l22385l90230l38018j59383k25489p5161
19232B244399J88867J24851J0267Q4026n941P7855R3175P6584o248O0528M5939
19221B994302N193n0162J04708Q4960J01833M7932P7847J47896J04073J03512
19211C722094K31399K05922J54653L44439M46130M40421M62988M37773N14209
$$ plain form
19286 1309749 1341618 1258973 1163752 1098416 1139969 1164276 1129539 1114480 1089197 1122000 1067107
19275 1067107 1156052 1212720 1201265 1233079 1220627 1181956 1162082 1112170 1159662 1236694 1289320
19264 1289320 1316081 1321138 1343348 1537905 1669549 1763915 1836111 1914412 1915430 1874242 1916057
19253 1916057 1972096 1942638 1987432 2058546 2130460 2161288 2276800 2545009 2708111 2718891 2879392
19242 2879392 3104635 3467126 3715041 3755065 3432680 3042450 2704432 2545049 2319560 2244399
19232 2244399 2433266 2558117 2568384 2652410 2646469 2724324 2817499 2894083 2887835 2948363 2994302
19221 2994302 2999495 2949333 3054041 3139001 3240834 3288766 3366613 3514509 3618582 3722094
19211 3722094 3953493 4159415 4314068 4658507 5104637 5545058 6008046 6445819 6960028
19202F960028P02035O03283M75410N87819N33098P78713J209268J527215J375488
19193A4752357J315737J352274J479790J808606K469513L434386M793838O676119
19185C8082620R515570J3923888K0847789L2319583M9833363O5995701N6135257
19178B86653771J8962056l787196K814981J9214124J2027775k3505853m9215277
19171B63164381n2525196m5011767l4364430k3953196j6113116j0676211p644018
19164G2876447p104044p246605p023883o226327n430910m390930l524143k657307
19156B9272298k165338j907035j715129j422813j263434j180997r44010o94446
19148A7979096l16112J11181L58402L66430N16263O73884Q14123J236461J755429
$$ plain form
19202 6960028 7662063 8265346 8740756 9328575 9861673 10640386 11849654 13376869 14752357
19193 14752357 16068094 17420368 18900158 20708764 23178277 26612663 31406501 38082620
19185 38082620 47598190 61522078 82369867 114689450 164522813 230518514 286653771
19178 286653771 305615827 301828631 304643612 323857736 335885511 312379658 263164381
19171 263164381 210639185 165627418 131262988 107309792 91196676 80520465 72876447
19164 72876447 65772403 58525798 51501915 45275588 39844678 35453748 31929605 29272298
19156 29272298 27106960 25199925 23484796 22061983 20798549 19617552 18673542 17979096
19148 17979096 17662984 17774165 18132567 18498997 19015260 19689144 20503267 21739728 23495157
19139B3495157K415411L367461M575032O259504Q264915J1548553J6857365K5190398
19131A01973796L8643700N9347904Q2007973P6449464L0384099n365110k564543
19124C80877283J8887468J7732894k1957194n7950874o5707930n7464972m5129010
19117A69287665l2403683k2404009j5595029j1180628r438034r582995r260371
19110E9422916q276732o946585n689807m698742l847863l297001k991012k661582
19102B1013592k249442j905578j872067j724492j477113j324091j077228r40865
19094H442716p82452o58000m75028m67813m69821m12448j52189j56377n7929j02834
19084D707825r4445j94308j29045o3459j13215r0896q2702l66877k31070j20513
$$ plain form
19139 23495157 25910568 29278029 33853061 40112565 48377480 59926033 76783398 101973796
19131 101973796 140617496 199965400 281973373 358422837 388806936 383441826 380877283
19124 380877283 399764751 417497645 395540451 337589577 271881647 214416675 169287665
19117 169287665 136883982 114479973 98884944 87704316 78266282 68683287 59422916
19110 59422916 51146184 44199599 38509792 33811050 29963187 26666186 23675174 21013592
19102 21013592 18764150 16858572 14986505 13262013 11784900 10460809 9383581 8442716
19094 8442716 7660264 7002264 6527236 6059423 5589602 5177154 5024965 4868588 4810659 4707825
19084 4707825 4613380 4419072 4290027 4226568 4113353 4022457 3939755 3572878 3341808 3221295
19074C221295q1516j18851j60307j84871j40322j0252n4755q2788j35567q2310
19064B169756n6642k2783j4729m733j49624n2105K05k8385p9393M0493K0315k0523
19052A801852M62p4079j28508q01K0897L929K7917o0890m0702K2147k8402l6765
19040A507057K9255r6849J01017J02425N417m8998o5657j48334r3938J2539R2000
19029A395934P3223l8401p7460P9455q764q723q0297l1602K0780j3754n7188m3471
19017A209732M9378K5864K8534L8669j4775o7683j6291N8582K6535Q5888L7513
19006A461946l9981M9708Q8786L3170p1098Q4089k4862o5044m2116j49857j04527
18995A220214n0650k6500K8715L9559J14278O1077k7890R0770P5956J3472N4105
$$ plain form
19074 3221295 3139779 3020928 2860621 2675750 2535428 2525176 2470421 2387633 2252066 2169756
19064 2169756 2113114 2090331 2075602 2070869 1921245 1869140 1869345 1840960 1761567 1802060 1822375 1801852
19052 1801852 1802314 1728235 1599727 1598926 1619823 1623752 1651669 1590779 1550077 1572224 1543822 1507057
19040 1507057 1536312 1439463 1540480 1642905 1648322 1599324 1533667 1385333 1291395 1303934 1395934
19029 1395934 1469157 1430756 1353296 1432751 1423987 1415264 1334967 1303365 1324145 1310391 1253203 1209732
19017 1209732 1259110 1284974 1313508 1352177 1337402 1269719 1253428 1312010 1338545 1424433 1461946
19006 1461946 1421965 1471673 1560459 1593629 1522531 1606620 1581758 1516714 1474598 1324741 1220214
18995 1220214 1169564 1143064 1171779 1211338 1325616 1386693 1358803 1449573 1525529 1539001 1593106
18984A593106j1025q8163J02637R8305J17155Q8250K2167K6714J6994J34785J64774
18973B265699L798q8788r8476j18028J3003l9693n2356L4587K4236Q463j4743
18962A937702N0682J7082m1414L6662J9674q1379k1494O5516O3371m0664Q9418
18951B095156L0683m3030L8505j17854K5460J55392L0673L9049p9016K0292Q4517
18940B279827q9824N3759J11463P7142J14696J34501J76186K80420J17932l5402
18930C220700J3268p4042r4421j4817M4964P5722N3509n7061p0933Q0399K1732
18919C199020J6591n4875K6019Q2945J00812J65447L4093L8172J64331J68067
18909C940622R0230R5093K77527J82714J95914J61150J50084K50549K15208K57886
$$ plain form
18984 1593106 1582081 1493918 1596555 1694860 1812015 1900265 1922432 1949146 1966140 2100925 2265699
18973 2265699 2269497 2180709 2082233 1964205 1977208 1937515 1885159 1919746 1943982 1952445 1937702
18962 1937702 1988384 2005466 1964052 2000714 2020388 1939009 1917515 1983031 2046402 2005738 2095156
18951 2095156 2125839 2082809 2121314 2003460 2028920 2184312 2214985 2254034 2175018 2195310 2279827
18940 2279827 2190003 2243762 2355225 2432367 2547063 2681564 2857750 3138170 3256102 3220700
18930 3220700 3233968 3159926 3065505 3050688 3095652 3171374 3224883 3167822 3096889 3177288 3199020
18919 3199020 3215611 3160736 3186755 3269700 3370512 3535959 3570052 3608224 3772555 3940622
18909 3940622 4030852 4125945 4403472 4586186 4782100 4943250 5093334 5343883 5559091 5816977
18899E816977K70749M10223M72955M44869M76833M06281L71070M56410N12343
18890I638710O69778N77099O75687P23182Q50826R12871P70896N86650P17118
18881A6122817N68322O36775P81805R31330J081575J277700J416862J553224J867483
18872B6237893K122877K363036K847814L387777M102532N135083O457139Q065984
18864F0720135J0345387J3719298J8354467K4753629L2928463M2021166M7842439
18857B50684984M4008803L1149293J9536200J5958245J4737420P878204k755302
18850C81197847p523150k428734Q328909J5418649J1527174J365372m806083n950302
18842C97129682j0270858k2834337l6715720m3933932m3353566l7902080l1007762
$$ plain form
18899 5816977 6087726 6497949 6970904 7415773 7892606 8298887 8669957 9126367 9638710
18890 9638710 10308488 10885587 11561274 12284456 13135282 14048153 14819049 15405699 16122817
18881 16122817 16691139 17327914 18109719 19041049 20122624 21400324 22817186 24370410 26237893
18872 26237893 28360770 30723806 33571620 36959397 41061929 46197012 52654151 60720135
18864 60720135 71065522 84784820 103139287 127892916 160821379 202842545 250684984
18857 250684984 294693787 325843080 345379280 361337525 376074945 383953149 381197847
18850 381197847 373674697 371245963 379574872 394993521 406520695 407886067 403079984 397129682
18842 397129682 386858824 364024487 327308767 283374835 240021269 202119189 171111427
18835A71111427k4324041j8924538j5070816j2732577j1211665r980530r054685
18828F9812575p952375o909729n863711n006587m282130l673880l295629k937940
18820B9890594k457151k168365j754940j542924j249614r94729q85225q68520
18812A7969126q76264q70768o90445o92642p34426o71682o33136m19010j28137
18803A2252616L0318j55962m07276l25050k61099q5705J8090j61775l32566m17956
18793A0153635m58987l34323j25656J1525O4912J3296l0336P239J65837K09288
18783I676430M23272M21024O14658R49943J143833J407171J764662K451056L278052
18774B2130101M073472N079784O542178R340136J3870022K1415056L3926735N3553922
$$ plain form
18835 171111427 146787386 127862848 112792032 100059455 88847790 78867260 69812575
18828 69812575 61860200 54950471 49086760 44080173 39798043 36124163 32828534 29890594
18820 29890594 27433443 25265078 23510138 21967214 20717600 19722871 18837646 17969126
18812 17969126 17092862 16222094 15531649 14839007 14104581 13432899 12799763 12380753 12252616
18803 12252616 12282934 12126972 11719696 11394646 11133547 11047842 11065932 10904157 10571591 10153635
18793 10153635 9694648 9360325 9234669 9246194 9311106 9324402 9294066 9301305 9467142 9676430
18783 9676430 10099702 10520726 11135384 12085327 13229160 14636331 16400993 18852049 22130101
18774 22130101 26203573 31283357 37825535 47165671 61035693 82450749 116377484 169931406
18766A69931406P2173275N0940461j0898712m7239728n2766047m5653336l2925489
18759A03561830k0041965j1829805o875588m401369m574325n522547n663432n217685
18751C9435114m521905l707669k944307k321596j852581j797809j628505j571231
18743A9089511j423208j130800q05727l79301j14435J04132K63748L79314P08192
18734A6691426P04415P05264Q99565J314844J751730K288735K646426L221720
18726C0224125M183886N620083P753494J1030091J5784883K2937544L4637823
18719A32171929N3551337Q2633909J08497189Q5377154K9900864j3478422o1793049
18712D16860911q5056539p6613911n7791882m0277313k5118855j6206230j2649541
$$ plain form
18766 169931406 242104681 293045142 282146430 234906702 182140655 136487319 103561830
18759 103561830 83519865 71690060 64814472 60413103 55838778 50316231 44652799 39435114
18751 39435114 34913209 31205540 28261233 25939637 24087056 22289247 20660742 19089511
18743 19089511 17666303 16535503 15729776 15350475 15236040 15340172 15603920 15983234 16691426
18734 16691426 17395841 18101105 19000670 20315514 22067244 24355979 27002405 30224125
18726 30224125 34408011 40028094 47781588 58811679 74596562 97534106 132171929
18719 132171929 185723266 268357175 376854364 462231518 492132382 478653960 416860911
18712 416860911 331804372 255190461 197398579 157121266 132002411 115796181 103146640
18705A03146640j0977679j0257125j0093445r409781q301129p050885n785002
18698D1271594m718023l906438l368636l122731k805170k566760k108611j566394
18690A7108831j151907p20555l90889j55293L4940O5702O7516J34337K6333M15089
18680A5434104P23178P94644R82645J053695J354362K023917L070165M450808
18672B9887518O257725R122514J3652540K0850096L2848974N1554750O9290524
18665B33464641M8695384j1533467m6553705n1356351m4298730l2207071j9883398
18658G6327303j2030824p319117m812981n063944n775456n696400n107621m331448
18650B6189512l643348l038717k451778k072666j634201j437660j301527j132408
$$ plain form
18705 103146640 92168961 81911836 71818391 62408610 54107481 47056596 41271594
18698 41271594 36553571 32647133 29278497 26155766 23350596 20783836 18675225 17108831
18690 17108831 15956924 15236369 14845480 14690187 14725127 14790829 14858345 14992682 15019015 15434104
18680 15434104 16157282 16951926 17934571 18988266 20342628 22366545 25436710 29887518
18672 29887518 36145243 45267757 58920297 79770393 112619367 164174117 233464641
18665 233464641 282160025 270626558 224072853 172716502 128417772 96210701 76327303
18658 76327303 64296479 56977362 52164381 47100437 41324981 35628581 30520960 26189512
18650 26189512 22546164 19507447 17055669 14983003 13348802 11911142 10609615 9477207
18642I477207r66506p81945n50797n31536m57499l44079q7324j23136j10821k44989
18632E278575k01405oK23189L62367J20607j2748m5230k24066m01734l56239k24067
18621D519243M941J31647J66982j27414l95133l64626l55714m26059m28485j75069
18611B550313j26231j38884o1558n3758j17128j20726j05749j05611j10919q7322
18601A522427m6328j7799q892O044m7065m791l70N8752q2672j9586l6908j6069
18589A306743L9006n2823j02412K0465j06939j46257j10609O2572L2289Q4208
18579A026243M6162N0892N8057J29285K50535J63099p5009q6199p2399r4005m0331
18568A356330J41219O2550q9110j48356j57937j51173l6486P7248L7473l4562
$$ plain form
18642 9477207 8510701 7728756 7177959 6646423 6188924 5844845 5757521 5634385 5523564 5278575
18632 5278575 5077170 5077164 5300353 5662720 5783327 5770579 5725349 5501283 5099549 4743310 4519243
18621 4519243 4524184 4655831 4822813 4695399 4300266 3935640 3579926 3153867 2725382 2550313
18611 2550313 2424082 2285198 2223640 2169882 2052754 1932028 1826279 1720668 1609749 1522427
18601 1522427 1476099 1458300 1449408 1455452 1408387 1403596 1403226 1461978 1379306 1359720 1322812 1306743
18589 1306743 1345749 1292926 1190514 1210979 1104040 957783 847174 909746 942035 1026243
18579 1026243 1072405 1123297 1181354 1310639 1561174 1724273 1649264 1563065 1490666 1396661 1356330
18568 1356330 1497549 1560099 1470989 1322633 1164696 1013523 977037 1054285 1091758 1057196
18558A057196j81351j24006p5755p3749o5180J4127L5221P8731J6241j9570k8312
18547F33593o3309k3099K039O7599j0012m577J14141l4694k1502n4687j751K4812
18535F28553j03939j18351q812O9348J28282j8310q3484l9163L2844P4764K6514
18524E88246Q713j2915Q109Q4399P2640O7311o4418p4475l6602O6298R7856j1603
18512G93559k940j0839j15583l6829m0383j35164j01763j016O186p620M776q567
18500C43817J7702M394j4964p1090O3240O0528J07403K943j2818Q0580J14993
18489F96728j02521j23585l7516J6380r035m0368M8584J10899P0614l3687L6969
18478F33462l8642p6429L4521O3425Q1981O3959j1718j13913o0121o5842J3563
$$ plain form
18558 1057196 875845 751839 676084 602335 537155 551282 586503 665234 681475 661905 633593
18547 633593 570284 547185 549224 616823 606811 602234 716375 681681 660179 605492 603741 628553
18535 628553 524614 406263 397451 466799 595081 576771 493287 454124 486968 561732 588246
18524 588246 596959 584044 592153 676552 749192 816503 752085 677610 641008 707306 805162 793559
18512 793559 790619 779780 664197 627368 586985 451821 350058 349042 355228 347608 352384 343817
18500 343817 361519 365913 350949 279859 343099 403627 511030 513973 501155 581735 696728
18489 696728 594207 470622 433106 449486 440451 400083 448667 559566 630180 596493 633462
18478 633462 594820 518391 552912 616337 698318 762277 750559 636646 576525 510683 524246
18467E24246M414n4046Q9383P9957m439m4205r495O0490Q1640R4802M5518M2822
18455I11087J15646O1427J07438K31898M07790O12244R67454R07831J61586n21414
18445C962987p90881o67965l79654k93895k40109j48746j3670N4327L6157M7111
18435A565662J22681J83598K31337L06958M85044Q81749J331008J347550J94682
18426F650269q14205j131815j131262p65782l44653k52364k06244j61694m6159
18417A796091o0977j22602k00173j02447n9866l2740k7704R7159P3991O4215O4392
18406A489339P5905O6639J04104J07446J55228K94485L73130N20120P55490J145893
18396E087779J780931K687864L551504K819751R95948N04272J048730R02837j128343
$$ plain form
18467 524246 528660 474614 563997 643954 639515 595310 585815 646305 727945 822747 868265 911087
18455 911087 1026733 1088160 1195598 1427496 1835286 2447530 3414984 4322815 4484401 3962987
18445 3962987 3172106 2504141 2124487 1830592 1590483 1441737 1428067 1482394 1518551 1565662
18435 1565662 1688343 1871941 2103278 2410236 2895280 3777029 5108037 6455587 6650269
18426 6650269 5836064 4704249 3572987 2807205 2462552 2210188 2003944 1842250 1796091
18417 1796091 1735114 1612512 1412339 1309892 1250026 1217286 1189582 1286741 1360732 1424947 1489339
18406 1489339 1565244 1631883 1735987 1843433 1998661 2293146 2666276 3186396 3941886 5087779
18396 5087779 6868710 9556574 13108078 15927829 16923777 17428049 18476779 19379616 18251273
18387A8251273k690493k989802k541250j929671j317651r26576o17584l88548
18379D849698l23498m28042m34713m27196k47981k64013k14922j52822j67393
18370B189118j16986j55637p2831m7680l1288r799j32069J8275J49924L8359Q8608
18359A917994J09198J75194L11066M87581O15814R91374J613099K273591J952515
18350A0447426q391j413999j658850j468190j236962o31143l31982j92690j15843
18341C389376j56474k16487j37299j34903j70823j71340j50379q2675k6145l593
18331B139258j80283o2115l2515k9065L5141j734M8340J67876J58778P4605K04281
18320B522567M72354P12683J009294J194303N62466k80269p14953p18587n72732
$$ plain form
18387 18251273 15560780 12570978 10029728 8100057 6782406 5855830 5238246 4849698
18379 4849698 4526200 4098158 3663445 3236249 2988268 2724255 2509333 2356511 2189118
18370 2189118 2072132 1916495 1843664 1795984 1764696 1754897 1622828 1641103 1791027 1829386 1917994
18359 1917994 2027192 2202386 2513452 3001033 3616847 4608221 6221320 8494911 10447426
18350 10447426 10439035 9025036 7366186 5897996 4661034 4029891 3697909 3505219 3389376
18341 3389376 3232902 3016415 2879116 2744213 2573390 2402050 2251671 2168996 2142851 2139258
18331 2139258 1958975 1896860 1864345 1835280 1870421 1868687 1917027 2084903 2243681 2318286 2522567
18320 2522567 2994921 3707604 4716898 5911201 6473667 6193398 5478445 4759858 4187126
18311D187126k28707n0128k1501k6412m251p9808j3540L330K3762m2089R0844
18300C838626K10157K11127J37345K37843M61186N12448O06160P94237P69848
18291G778977L82794J40103J22370L57363O01142Q47490P38196O31921P59433
18282A2359789R31041J006230J093853J216620J359790J676832K228894K968703
18274B4841752L972371N328711P049998R727139J4042602K0785656L1252729M8065821
18266A65066779P2954641Q7947886N4341601L032384r996847J0949701L0152211
18259D14448356K125341m7794706o7373003o3070323n1601377l7459762k5513015
18252A23761511j7423937j2036930r260019r049877r078730q246687p162077n843344
$$ plain form
18311 4187126 3958419 3908291 3886790 3860378 3856127 3776319 3762779 3766109 3789871 3747782 3838626
18300 3838626 4048783 4259910 4397255 4635098 5096284 5608732 6214892 7009129 7778977
18291 7778977 8161771 8301874 8424244 8781607 9382749 10230239 10968435 11600356 12359789
18282 12359789 13290830 14297060 15390913 16607533 17967323 19644155 21873049 24841752
18274 24841752 28814123 34142834 41192832 50919971 64962573 85748229 117000958 165066779
18266 165066779 238021420 325969306 380310907 383343291 373346444 384296145 414448356
18259 414448356 416573697 368778991 301405988 238335665 186734288 149274526 123761511
18252 123761511 106337574 94300644 85040625 75990748 66912018 58665331 51503254 45659910
18244D5659910m874907m295192l713705l039883k402621j937198j341942r09317
18236B3145145p25888q29659p58031l58878J17083M51997P73315J144993J593451
18227B4553528J749454K220901L211073M549551O232218Q296668J1361509J6857625
18219G9032527K6259560M1628685O3467541P1960663L6926465k770807q584665
18212C07919969R896972K0830023p710683m4308395n5077170m9370615l9564167
18205A42615934k8273816j9301270j3274932r361167p587751p416813p248312
18198E0151873o506406n646941n027499m417402l775359l048009k491206j961735
18190A7277316j669733j605802j522901j409965j210899r31135o97051n93183
$$ plain form
18244 45659910 40785003 36489811 32776106 29736223 27333602 25396404 24054462 23145145
18236 23145145 22419257 21589598 20831567 20472689 20589772 21041769 21815084 22960077 24553528
18227 24553528 26302982 28523883 31734956 36284507 42516725 50813393 62174902 79032527
18219 79032527 105292087 146920772 210388313 282348976 319275441 316504634 307919969
18212 307919969 317816941 338646964 330936281 286627886 231550716 182180101 142615934
18205 142615934 114342118 95040848 81765916 72404749 64816998 57400185 50151873
18198 50151873 43645467 37998526 32971027 28553625 24778266 21730257 19239051 17277316
18190 17277316 15607583 14001781 12478880 11068915 9858016 8926881 8229830 7636647
18182G636647l76074j24323q9658j64198m65872n59306o04234n18761m40542l06788
18172C986891l00583l54215k36851k26032j30145r5199p4994j67060p3285j11462
18162B217065o2984L7621N6560L9387p3999l3812j52587k7357M2292o0221m9795
18151A932170m6289j05647l2113R0092o7840k7208R9880R4142R3533P3046O1531
18140B165297K7475O1736R2356N7103M7964R0689J12071N3634J49487K67682J76567
18129C302061J20132J25721J27396J83848K76161M25802L82581O66249P59177
18120F369128R81469J281624J740426K389471L318648M947789P485087J1829650
18112D0343292J9511354L2020891M1088502J9581999j5164426k8679609k7603547
$$ plain form
18182 7636647 7260573 7136250 7046592 6882394 6416522 5857216 5252982 4734221 4293679 3986891
18172 3986891 3686308 3332093 3095242 2869210 2739065 2643866 2568872 2401812 2328527 2217065
18162 2217065 2154081 2191702 2248262 2287649 2213650 2179838 2027251 1999894 2042186 1981965 1932170
18151 1932170 1885881 1780234 1748121 1838213 1770373 1743165 1843045 1937187 2030720 2103766 2165297
18140 2165297 2192772 2254508 2346864 2403967 2451931 2542620 2654691 2708325 2857812 3125494 3302061
18129 3302061 3422193 3547914 3675310 3859158 4135319 4561121 4943702 5609951 6369128
18120 6369128 7350597 8632221 10372647 12762118 16080766 21028555 28513642 40343292
18112 40343292 59854646 91875537 132964039 152546038 137381612 108702003 81098456
18105H1098456k2764002j5111429q714726n003080k857645j957342k446693k809737
18097A9433802k714121k448247k038160j659630j382303j182958r92171q84259
18089F131953o91818o47628o38576n18863n36828l79557k56610k28639j86992
18080B046442k05286k63511j72124r7525l2451p4035o9879r317o7966j06583q9482
18069H58283p5071k2822k7126O0355q4533p4037q4574k6727J4876L4757J2066
18058E85447n7408j6809L5609p5034q7513N0109n4602m6705j04794K8892J02676
18047C59868m87j022j18259m6915o938L2934p2363k627J64127P9328r3834q909
18035B84903J0978N3268J6630J04779N8926J78j8783O1631K0067p3687L6447J84954
$$ plain form
18105 81098456 58334454 43223025 34508299 29505219 26647574 24690232 22243539 19433802
18097 19433802 16719681 14271434 12233274 10573644 9191341 8008383 7016212 6131953
18089 6131953 5440135 4792507 4153931 3635068 3098240 2718683 2462073 2233434 2046442
18080 2046442 1841156 1577645 1405521 1307996 1275545 1201510 1131631 1122314 1054348 947765 858283
18069 858283 783212 760390 733264 793619 709086 635049 550475 523748 538624 573381 585447
18058 585447 528039 511230 546839 471805 384292 434401 379799 333094 228300 257192 359868
18047 359868 359381 358359 240100 193185 186247 219181 146818 144191 308318 387646 293812 284903
18035 284903 295881 349149 365779 470558 529484 529662 510879 572510 592577 518890 555337 740291
18023G40291J78220P4435Q106j04529m1045R9574J2053j82105k14988j49272j24894
18012B95846J9977Q5615j4296o9151j0720L7373k8646J9921l1247k4877l7545
18001B42250p2546M6570N3107l9491o0763r8016q818J64397O7412P5236j4931
17990C54407n0947L5708k7598o5840j5941P5753m723n9468j8117k6467N6594O8788
17978C22149J294Q2541K28196K42158J15211o0135m6947o7608P8977L0808j14905
17967H11739j10213j43650q0952j06321r2089p8553L5817n529k6428n6436R032
17956A56417K8040r5482n6818N3422N9013m2103P443N8168P3870L2392n2774j05174
17944A16414J08540O1555m2754q679L580J0382P157o7850n2429K7260l5314R781
$$ plain form
18023 740291 918511 992946 1001052 896523 855478 955052 967105 785000 570012 420740 295846
18012 295846 315823 401438 387142 317991 307271 344644 315998 335919 304672 279795 242250
18001 242250 169704 216274 269381 229890 169127 71111 62293 226690 294102 369338 354407
17990 354407 303460 339168 311570 245730 229789 305542 300819 241351 223234 196767 253361 322149
17978 322149 323443 405984 634180 876338 991549 931414 884467 816859 895836 926644 811739
17967 811739 701526 557876 476924 370603 278514 199961 235778 230249 203821 147385 156417
17956 156417 184457 88975 32157 85579 144592 102489 109932 168100 241970 274362 221588 116414
17944 116414 224954 286509 243755 235076 238656 249038 256195 188345 135916 163176 127862 137643
17932A37643j0733J0781J4888n8500K8890m4162O4609Q2832j02464j14232M4579
17921E4131J2496p1857o8275O4879J42081n5516l4347N492K77j8916L3237K0382
17909H4064M1486l3007K405L8613j06466j03256O978M3775K7760j3934P7322J11255
17897A76995N5267l8610j36278M7221K7310q1723K1894J02843l4007J755Q572
17886A51239r0108m0370J4067L6355O8898K9904m9811P231j1600L6205K562o9430
17874H5142r5870M3334J7616n7682L4141K8126p4219k1868K0244j725J17065K4670
17862A18974n69j3265j52448k8764P5885K1481j2087K9985O1290J0642q2323p0544
17850d1743L9751l3719m4587j208R9571P3194Q544L9375o0868p9253o886L9917
$$ plain form
17932 137643 126910 137691 152579 94079 122969 78807 143416 226248 123784 9552 54131
17921 54131 66627 -5230 -73505 -8626 133455 77939 43592 49084 49361 30445 63682 84064
17909 84064 125550 92543 94948 133561 27095 -76161 -69183 -25408 2352 -11582 65740 176995
17897 176995 232262 193652 57374 104595 131905 50182 72076 174919 140912 142667 151239
17886 151239 61131 20761 34828 71183 140081 169985 120174 127405 115805 152010 154572 85142
17874 85142 -10728 32606 50222 -7460 26681 54807 -19412 -41280 -21036 -22761 94304 118974
17862 118974 118405 105140 -47308 -76072 -187 21294 9207 39192 100482 111124 28801 -41743
17850 -41743 -1992 -35711 -80298 -81506 18065 91259 99803 139178 78310 -943 -7829 32088
17838C2088N0243R8165q8048n9858J3534j9070N2609n7114R6470P7822K015p4087
17826A24769K4926K1355k8636n7809q9125l0594k92P3239l1126j6754l9444J6453
17814c3038J7365M6240R6348L9520o4454m5582N5952K2682L9396n3130j08898
17803A2401r264J194L2120M3573o362k3499K1548N7487L5758q3638j01063K1924
17791B179O488J11958n3881o2191j0370n2650L0668J24483n1663o475K8288N5727
17779A22561L9492j5984m3900J3683M2851m3144r5094r600j1004l0284k8952q96
17767f0271m5917N4303Q7229j676P1195N1013L6004K4001k2219r7328m5345p0452
17755a9463o5207N0653P8624n5695P5422p3664m2005K3759O882l9779K2853n3445
$$ plain form
17838 32088 82331 180496 92448 32590 46124 27054 79663 22549 119019 196841 198856 124769
17826 124769 149695 171050 142414 84605 -4520 -35114 -35406 37833 6707 -10047 -49491 -33038
17814 -33038 -15673 30567 126915 166435 101981 56399 112351 135033 174429 121299 12401
17803 12401 3137 4331 36451 80024 73662 50163 71711 129198 164956 81318 -19745 2179
17791 2179 8667 120625 66744 4553 -5817 -58467 -27799 96684 45021 38546 66834 122561
17779 122561 162053 146069 102169 115852 158703 115559 20465 10865 -139 -30423 -59375 -60271
17767 -60271 -106188 -51885 35344 33668 104863 155876 191880 215881 193662 96334 50989 -19463
17755 -19463 -84670 -34017 44607 -11088 64334 -9330 -51335 -27576 -20694 -60473 -37620 -91065
17743i1065N5420n2623Q2963L555j2271o631Q378m1531K1826N6454M1069K5264
17731I0808K1059l9171M6651l3987k0886m8486L2556R4064J17382k1601m5085
17720A93304L5367P5891J74175J34806J82552K78106L00575K88816J29641M773
17710A798006M111J49115N4698j04502k03465k70932l16557k81000j35008r5322
17700E99144q4829j8236p3678n1073k0409q0067p0012k5187L4218p7615p8105
17689E4151M2802j6275K0700N0869P407j24789o5858j0229P067j1193o0320J10087
17677D419J12738k3681j3460M6504L5928L5266K5626R3189R0277J50963J72221
17666G29990K93872L95661K93531Q6931l0063j3673R4460J600j54664j81910l12836
$$ plain form
17743 -91065 -35645 -88268 -5305 -1750 -14021 -20652 -12274 -53805 -31979 24475 65544 90808
17731 90808 111867 72696 119347 85360 64474 15988 48544 142608 259990 238389 193304
17720 193304 228671 304562 478737 613543 796095 1074201 1374776 1663592 1793233 1798006
17710 1798006 1802117 1951232 2005930 1901428 1697963 1427031 1110474 829474 694466 599144
17700 599144 514315 496079 422401 371328 350919 270852 200840 175653 209871 132256 54151
17689 54151 96953 80678 101378 152247 159654 34865 -30993 -41222 -34155 -45348 -105668 4419
17677 4419 117157 93476 80016 126520 162448 197714 223340 316529 406806 557769 729990
17666 729990 1023862 1419523 1713054 1799985 1769922 1756249 1850709 1852309 1697645 1515735 1202899
17655A202899k37689j48223j93931r1449m5353j01152o7464o2237j39839j30978
17645a5416N1377K9095P560P2929j27006q0899O8233N9290K5193L2044l4643l3875
17633E3882p3417m5845J8733P0606M929N2602O1695o2608n806M1607M8213K3032
17621A87623M3849k1667n7925q1023j14072n7528N4272K7655q786l8987K9495
17610c7094l363o5464n3293M3758N6868L5242P8493M5534q1528K0019J00685n8318
17598H1539j4770k4833j6899P0287j07465p0932p061J51213K2910k4120j9109
17587D0760P9151n4482n7426j18198L2032Q9243J609m6108l8568o1646J32859
17576g74J12474K9522q9524j23885N6084j8578m8310N3721m9741l3698O5793P840
$$ plain form
17655 1202899 965210 816987 623056 531607 486254 385102 317638 255401 115562 -15416
17645 -15416 35961 65056 72616 145545 18539 -62360 5873 65163 90356 122400 87757 53882
17633 53882 -19535 -65380 -46647 23959 28888 81490 143185 80577 74771 116378 164591 187623
17621 187623 231472 209805 151880 70857 -43215 -100743 -46471 -18816 -27602 -66589 -37094
17610 -37094 -40457 -105921 -159214 -115456 -58588 -23346 55147 100681 19153 39172 139857 81539
17598 81539 66769 41936 25037 95324 -12141 -83073 -90134 61079 83989 59869 40760
17587 40760 119911 65429 8003 -110195 -78163 11080 12689 -33419 -71987 -133633 -774
17576 -774 111700 141222 51698 -72187 -16103 -34681 -82991 -29270 -79011 -112709 -46916 -39076
17564c9076o2206p2479m8447O2889P2208Q1387k312p8900o8712J08108k8425L1917
17552d4048R1538m2303j3263l9959l2099L4994N9514j3974J8523J3276k2447L1010
17540D0762M6056p7285q4709p82Q5260J3761l2015p0568o5185N0279J9855J8866
17528e5705l7755J5105J53749L1220q1419L9574m4428j56811j2032L8128K9745
17517h0629N9741q985J1463n9036l1053R3165M5146l5745q6674r2702q007R5057
17505i8259k0335m3560R4756J1439J07109j1853q0062L346k2201o02k8410L3581
17493e5051R0501L3713M7061o3208j55735M0557l156N874Q5640j585n4950p3005
17481a03344n0600O6470Q9204k3339J1303n0079r209O3861J9514k6638M2555n9631
$$ plain form
17564 -39076 -101282 -173761 -222208 -159319 -87111 -5724 -8036 -86936 -155648 -47540 -75965 -44048
17552 -44048 47490 5187 -8076 -48035 -80134 -45140 14374 400 18923 32199 9752 40762
17540 40762 86818 9533 -75176 -75958 9302 23063 -8952 -79520 -144705 -94426 -74571 -55705
17528 -55705 -93460 -78355 75394 106614 25195 64769 20341 -136470 -148502 -110374 -80629
17517 -80629 -20888 -29873 -18410 -77446 -108499 -15334 29812 -5933 -92607 -185309 -193316 -98259
17505 -98259 -118594 -162154 -67398 -55959 51150 39297 -40765 -37419 -59620 -60222 -88632 -55051
17493 -55051 35450 69163 116224 53016 -102719 -62162 -65318 -59444 26196 24611 -30339 -103344
17481 -103344 -153944 -87474 1730 -21609 -10306 -60385 -69594 -5733 13781 -12857 29698 -29933
17469b9933J0806J5160K9635m6174L0501q464J9179k5202m037K801L8690L0967
17457F3929n7957k3215M6489J08965N3127n1139K8745N5071l2344j9213J6568
17446A89026l167J46556K85427K10449M7804l8260j99806j40175n9505r8711l0695
17435C08943R5815O5656m9645j18978p7332J1674q4797K8122J43782K3361q7288
17424B59313j7321L9627O2438N2177O7546N8701J13128J38978J82526K74244L16975
17413A548332K8610j39991j20532j86222p7367R3581O0798J27802K07441J89642
17403A732094O4395N7251n6597p5800n0454K9115J39829m0040j58754j59588j66244
17392A315207j34522p1593J4171O3260P9719J70545J44481l9356j35763k31432
$$ plain form
17469 -29933 -19127 -3967 25668 -20506 9995 1531 20710 -4492 -8529 -5728 32962 63929
17457 63929 5972 -17243 29246 138211 191338 140199 168944 224015 191671 172458 189026
17446 189026 185859 332415 617842 828291 876095 837835 638029 497854 438349 339638 308943
17435 308943 404758 470414 420769 301791 224459 236133 151336 179458 323240 346601 259313
17424 259313 241992 281619 344057 396234 463780 522481 635609 774587 957113 1231357 1548332
17413 1548332 1576942 1436951 1316419 1130197 1052830 1146411 1207209 1335011 1542452 1732094
17403 1732094 1796489 1853740 1797143 1721343 1670889 1700004 1839833 1799793 1641039 1481451 1315207
17392 1315207 1180685 1109092 1123263 1186523 1266242 1436787 1581268 1541912 1406149 1174717
17382A174717k05976j65435j16199k6720n2165j38486j1051n4478j1136o7631
17372C25440j9607n6645n8997q488lL713k3567N9642j7777l5946k3431J5979M0205
17359B00518j9091j07461r1724Q4237M1048J3899n562m1556J16835j0183l9500
17348A41460l8655k648q9792N659j051J5823K1938Q3702j01481K592K1229P1834
17336A30610J8725j06931j1975q2407K888N8611N920l0230J4647J29042K8652
17325A57552j6451N4664m6300k9080r694l8305j04799k5173N0577l9425o317M1315
17313a1436L3455Q2481l3229p8187l5568M3818R9664O1399j53890q8128l8153
17302a17774O3463J16844j5496l7926L3045j38448q2521j05172R2873R2782o5484
$$ plain form
17382 1174717 968741 803306 687107 660387 608222 469736 458685 404207 393071 325440
17372 325440 305833 249188 190191 181703 181700 185413 161846 221488 203711 167765 144334 160313 200518
17359 200518 181427 73966 -17758 66479 107527 121426 115864 74308 191143 180960 141460
17348 141460 102805 100157 10365 16024 14973 30796 52734 136436 34955 37547 58776 130610
17336 130610 149335 42404 30429 -51978 -49090 9521 15441 -14789 -142 128900 157552
17325 157552 141101 195765 149465 120385 110691 72386 -32413 -57586 -7009 -46434 -52751 -11436
17313 -11436 22019 104500 71271 -6916 -42484 1334 100998 162397 8507 -79621 -117774
17302 -117774 -54311 62533 47037 9111 42156 -96292 -178813 -283985 -191112 -98330 -163814
17291a63814R5449J81490R1953r7703o2019J8064l891r5566l1572j0539J39671
17280F1523P2481J4758Q973r6494q9885K9083p711K7464J5574M826p2295K5535
17268f168L8645k6885N9079J1105m7368K8461M042j4523j6280q444L5698n350
17256E2012k6975K1573k497l5116j2743j3738N7028Q4446J14479O5421l7106o8746
17244A98038m3947M5852K7178j10272o3347p7902l6286j8465J29098K7267L304
17233H0518j0388l8344O608m4631R900K8479J6797r824L2731k4173p8049m9771
17221h0147m8660Q4175R5835P5602K9774j2602j06250N2914k531n8721Q0407N5380
17209A65176P0049j3195m9230p5679m6804O1957k2399n2288j36152R0578P0991
$$ plain form
17291 -163814 -68365 113125 205078 107375 45356 63420 59529 -36037 -67609 -78148 61523
17280 61523 134004 148762 157735 61241 -28644 439 -7272 20192 35766 40592 -31703 -6168
17268 -6168 32477 5592 64671 75776 28408 56869 60911 46388 30108 21664 57362 52012
17256 52012 25037 46610 44113 8997 -3746 -17484 39544 123990 238469 303890 266784 198038
17244 198038 154091 199943 227121 116849 53502 -24400 -60686 -79151 49947 77214 80518
17233 80518 70130 31786 38394 -6237 3663 32142 48939 39115 71846 47673 -30376 -80147
17221 -80147 -128807 -44632 51203 126805 156579 143977 37727 90641 88110 29389 109796 165176
17209 165176 235225 222030 172800 97121 50317 112274 89875 37587 -98565 -7987 63004
17198F3004M4407R4928R453j16585j28887L6463J17307M7715m110m2518j10315
17187A0862K9053N6642o211K5910P626L3129m1287j95195r7000M1975J32978Q2562
17175H1044M2367M7095O527Q4520p8776l9503q7694r1631N7351O3847O5767L4182
17163A85096r5890j8166p7124K7746p6185P459k610K8210L4844k5573P5891J9966
17151H3664Q430N4361n7828Q444K4579j10181L8121P6499J1204J585m4261l441
17139I1176K5099K3740M2881l688J4385R5957R3688o2389l9725k9893O6187L9545
17127C56963k6281l4207m4403k5429k5765L8005p369J4487k7983O3213P748J1994
17115C00973o7918m4426l2016n1592P26O6695J63662K3979K684L4327J4959k2114
$$ plain form
17198 63004 107411 202339 211792 95207 -33680 2783 120090 167805 163695 121177 10862
17187 10862 39915 96557 90346 116256 123882 157011 115724 -79471 -176471 -134496 -1518 81044
17175 81044 123411 170506 177033 261553 182777 143274 55580 -36051 21300 85147 150914 185096
17163 185096 89206 71040 -6084 21662 -54523 -47064 -49674 -21464 13380 -12193 63698 83664
17151 83664 92094 146455 88627 97071 121650 11469 49590 126089 137293 138878 94617 91176
17139 91176 116275 140015 182896 179208 193593 289550 383238 320849 281124 251231 317418 356963
17127 356963 330682 296475 252072 226643 200878 238883 231514 246001 218018 281231 288979 300973
17115 300973 233055 188629 156613 105021 105747 172442 336104 360083 362767 397094 412053 389939
17103C89939J1406K2263o7010o5565n5826j7136N1853P0636P507P860M0526O3012
17091D59465P7491o3361p6242p9087o7443M4251j6857N7593k7539p700m8031m9146
17079B03394K2511N5671j5151M3836J30899k57m4927o3231J057Q526p4345K5178
17067B93161j6238j2975J09765J09965Q580J4776j7238o5337m6371n5752N4554
17056C76890K7324O2786N5551n9743o9149o1534K4334k60J08745j873m9600l2476
17044C80995J9192J33962L5325j4323J7967m9710r2554p9871P3043Q9192n6517
17033D56701m9532N8775o2356N8214M1747r1556p6686N1041k6745j1635L6583
17022C84551k1357p32j02171k2277J9499j0955J31064J39164r5422K7232N4539
$$ plain form
17103 389939 401345 423608 356598 291033 235207 218071 269924 340560 348067 355927 396453 459465
17091 459465 536956 473595 397353 318266 250823 295074 278217 335810 308271 300571 252540 203394
17079 203394 225905 281576 266425 310261 441160 440903 395976 332745 333802 342328 267983 293161
17067 293161 276923 263948 373713 483678 492258 507034 489796 424459 378088 322336 376890
17056 376890 404214 467000 522551 462808 393659 332125 356459 356199 464944 463071 413471 380995
17044 380995 400187 534149 569474 555151 573118 523408 430854 350983 424026 513218 456701
17033 456701 407169 465944 403588 461802 503549 411993 335307 386348 359603 347968 384551
17022 384551 363194 362462 260291 238014 257513 246558 377622 516786 421364 448596 503135
17011E03135r270N7418K2406o2721m0483m313j9279o5265Q9254N027l8996l5379
16999D01534k0138k5686r79n6341L0160P6652Q1036L0921o1209j059m2689N6224
16987D68426R2595J07236M3718K6989O569J09714Q8383N1320j6157j02618p7297
16976G98878R9990L6648K4136N7215K1620J3039O120J19114N1553j722n6052j04709
16964A065830m2258L0423K148j3854j004P6684P1559k5519j42304j743J1559J46717
16952A178238J27663k5758j36874o5801O0196j581K7269j2157k3265R531j13151
16941A024310n0845J9617O0106J8966R4496J12169K7172O1740K9128P8642N5846
16930A531347o9399m9124m1028m9542M9409Q1456M0628m2796k1700M1466J6472
$$ plain form
17011 503135 493865 551283 573689 510968 470485 466172 446893 381628 470882 475909 436913 401534
16999 401534 381396 355710 354731 298390 328550 405202 486238 517159 455950 454891 412202 468426
16987 468426 561021 668257 711975 738964 745533 855247 943630 994950 978793 876175 798878
16976 798878 898868 935516 959652 1016867 1038487 1051526 1057646 1176760 1228313 1226591 1170539 1065830
16964 1065830 1023572 1053995 1056143 1042289 1041285 1117969 1189528 1164009 1021705 1019962 1031521 1178238
16952 1178238 1305901 1280143 1143269 1077468 1137664 1136083 1163352 1151195 1127930 1137461 1024310
16941 1024310 973465 993082 1053188 1072154 1166650 1278819 1305991 1367731 1396859 1475501 1531347
16930 1531347 1461948 1412824 1371796 1322254 1371663 1453119 1493747 1450951 1429251 1470717 1487189
16919A487189K9931K0941Q1169N5809r676O5341J6675O9935J2990j0992Q9282
16908A908594P0209R609J17474J21513L0363J9586J02042J87836J18097k8011
16898B657312q9123L525J46653J81617K24720J49960J63657N9211K17714K67010
16888C982256K35686K14631L60323M48535L39181M28009M71128N33162M13617
16879G426528K83217L15924L57240N88440P38620Q48496J088482J304430J254794
16870A4206171J137497J016731J049891J374864J766689K421330K788022L449615
16862B9210810M480316N688295P613960J0531244J5049880K2072599L2888502
16855A27535606M7811992N9644957M6374890N346028k7055421l6421401l1395133
$$ plain form
16919 1487189 1517120 1538061 1619230 1675039 1665363 1730704 1747379 1817314 1830304 1819312 1908594
16908 1908594 1978803 1988412 2105886 2227399 2257762 2277348 2379390 2567226 2685323 2657312
16898 2657312 2568189 2571714 2718367 2899984 3124704 3274664 3438321 3497532 3715246 3982256
16888 3982256 4217942 4432573 4792896 5241431 5580612 6008621 6479749 7012911 7426528
16879 7426528 7709745 8025669 8382909 8971349 9709969 10558465 11646947 12951377 14206171
16870 14206171 15343668 16360399 17410290 18785154 20551843 22973173 25761195 29210810
16862 29210810 33691126 39379421 46993381 57524625 72574505 94647104 127535606
16855 127535606 175347598 234992555 281367445 286713473 259658052 223236651 191841518
16848A91841518j9051050l086058J3547864L1750249N0209827N5648682K9993793
16841C50854825p142317k2419006j4240905O943203K7108186J9717188j4271918
16834C46549256l8682021m3838775l7861424k5578370r932326O440875K4291186
16827B21388401M1559647M2591273J1027240k8761891m7534260m8428358m1125809
16820A50716243l0221972k0514275j3765949r378504p473054p404610p295728
16813E4662151o715678n838785m909256m244386l638379k976159k355218j907607
16805B2076683j924674j943308j919466j853855j638166j262572j047936p89008
16797I697698o26006n32227l77119k97523m91101n89499n31726n36012m46751
$$ plain form
16848 191841518 172790468 169704410 183252274 215002523 265212350 320861032 350854825
16841 350854825 343712508 321293502 307052597 313995800 341103986 360821174 346549256
16834 346549256 307867235 264028460 226167036 200588666 190656340 197097215 221388401
16827 221388401 262948048 305539321 316566561 287804670 240270410 191842052 150716243
16820 150716243 120494271 99979996 86214047 76835543 69362489 61957879 54662151
16813 54662151 47946473 42107688 37198432 32954046 29315667 26339508 23984290 22076683
16805 22076683 20152009 18208701 16289235 14435380 12797214 11534642 10486706 9697698
16797 9697698 9071692 8539465 8162346 7864823 7373722 6784223 6252497 5716485 5269734
16788E269734l38294l31373j83168k71185k33235j92337k05416j81816j70952
16779C161958k02116r0070p6548n007k2055j12909p0305j36402j80166k1697r2484
16768B152199k01244n9299L322m8775j5619o1329o2370j2662o0096j39079j69199
16757A325849j7229k816j7748n4742q8600k6086J52938J8615j49059j19111n9035
16746I62976n273q288p6046n9496l5981m5422Q0629O6071j9209K0714M8721L4258
16734I63654K515j2784P6520n0985r0486R845J03346o3734j41324N8830j3901
16723H41496o7974n4097O9261L4931m7592r5371J3010J20441M5898m5577k7402
16712G87024k4401j29968Q1127N9446l9390O6279M0820j01895n4665K121R7987
$$ plain form
16788 5269734 4931440 4600067 4416899 4145714 3912479 3720142 3514726 3332910 3161958
16779 3161958 2959842 2869772 2793224 2788217 2766162 2653253 2582948 2446546 2266380 2244683 2152199
16768 2152199 1950955 1891656 1894978 1846203 1830584 1769255 1706885 1694223 1634127 1495048 1325849
16757 1325849 1308620 1305804 1288056 1233314 1144714 1118628 1271566 1290181 1141122 1022011 962976
16746 962976 957703 949415 873369 813873 777892 732470 813099 879170 859961 880675 929396 963654
16734 963654 966169 953385 1029905 978920 888434 898279 1001625 937891 796567 855397 841496
16723 841496 773522 719425 788686 823617 776025 680654 693664 814105 860003 814426 787024
16712 787024 762623 632655 713782 773228 733838 800117 840937 739042 684377 686498 784485
16701G84485J4154o4968q9133M6473j4963o4423k02082k8131Q2871R4766q0256
16690D78793j7059P4296M2935p3536K5532m7263m606J0149M047o0539j99847j12347
16678A20555P3337m2253j860P0482n4665Q2741N6474o4171n7811j44008O4573
16667A03394M7174j15415o0682M2699K1599j2408k2607K0379N8892O6950q0319
16656F9656M5363P6364r8634k7463Q68m7559r8279J4892M4371J6379l5784j169
16644d0995K2074o396O1167n9004j2977J06893N6968n2300j01400L2433P1538
16633G8001J5513j06854m9464J04002J26l7375l3074L5653j5911K5277l782p6502
16621f4390o2978l6081O9885m1423N3722J39027J6835N0721p349l0927n6570o5731
$$ plain form
16701 784485 798639 733671 644538 691011 676048 611625 409543 381412 464283 559049 478793
16690 478793 461734 536030 578965 505429 530961 483698 479092 489241 493288 432749 232902 120555
16678 120555 193892 151639 149779 220261 165596 248337 304811 240640 182829 38821 103394
16667 103394 150568 35153 -25529 17170 38769 26361 3754 24133 83025 149975 69656
16656 69656 115019 191383 92749 65286 66154 18595 -79684 -64792 -20421 -4042 -39826 -40995
16644 -40995 -18921 -25317 35850 -23154 -36131 70762 127730 75430 -25970 6463 78001
16633 78001 93514 -13340 -62804 41198 41324 3949 -29125 6528 -9383 15894 12112 -64390
16621 -64390 -127368 -163449 -93564 -134987 -81265 57762 74597 125318 117969 87042 30472 -35259
16609c5259M229J00320m705j7273l6522n528m0925O8486L5010m7759L3398M6540
16597A00012L9546k8590j45775K5605J06166r79O5907K7218K0215l3377j3868
16586A62080K2543J8635l3755k5561M8650n6673k6044J14912N9304j40022r9061
16575D5008K0411Q7666j8236l0870j3204j45832m9021Q8352l3178M0761J77265
16564A69122M9909r3414J5344L4570l2827m2305n0127Q6168M4581k2166K2792
16553A81647l2916o4249j1971M9919n0038m2694J9454r6706q8211J7730m2788
16542a60823P753J00018R9006N1475K2693m8346L196p2106o7696o970k5938M9532
16530d8206O6766o580J3444m5002J10988J1261o2448k279K3197j9003O5569J02197
$$ plain form
16609 -35259 -31030 69290 64585 47312 10790 5262 -35663 32823 67833 20074 53472 100012
16597 100012 139558 110968 -34807 -9202 96964 95985 161892 189110 209325 175948 162080
16586 162080 184623 203258 169503 143942 192592 135919 109875 224787 284091 144069 45008
16575 45008 65419 153085 134849 103979 90775 -55057 -104078 -15726 -48904 -8143 169122
16564 169122 219031 125617 140961 175531 142704 100399 50272 136440 181021 158855 181647
16553 181647 148731 84482 72511 122430 72392 29698 49152 -47554 -135765 -118035 -160823
16542 -160823 -153070 -53052 45954 97429 120122 71776 74972 2866 -64830 -71800 -97738 -48206
16530 -48206 18560 11980 25424 -19578 91410 102671 40223 37944 61141 42138 107707 209904
16518B09904j7804o7885K0115p2979j56805j1419K2762J08825J05645J04865k3485
16507B21739n6867j12091j2020N8366J5114o0835k5652O7595l0279l5006l4344
16496d280M1118p2471q473m244J6570j8614j9802O6103K1245J2916O3737R519
16484A03324K3356m135p8125k7135L0927P518M1111k174M6973R494p4210l2647
16472D4277O4853j6821j07312L791l7115k4578j5871J3852O7181K889l6175L3935
16460g094j5204m2810O0389M3383n8114o3631J0872k616l1118k4026L3711J11947
16448A5689k5643q4601j7237J53071L695n0721N7386o403M6311R4325n3824l5687
16436I6361k901n7731k814J3885L0551m5573K6720N6228r4406P5418Q0466p9128
$$ plain form
16518 209904 192100 124215 144330 71351 -85454 -96873 -74111 34714 140359 245224 221739
16507 221739 164872 52781 40761 99127 114241 53406 27754 95349 65070 30064 -4280
16496 -4280 36838 -35633 -44106 -48350 -31780 -50394 -70196 -4093 17152 30068 93805 103324
16484 103324 126680 122545 44420 17285 48212 55730 96841 94667 141640 151134 76924 44277
16472 44277 109130 92309 -15003 -11212 -48327 -72905 -88776 -74924 -7743 -4854 -41029 -7094
16460 -7094 -22298 -65108 -4719 38664 -19450 -83081 -72209 -74825 -105943 -129969 -96258 15689
16448 15689 -9954 -94555 -111792 41279 44974 -5747 51639 45236 91547 185872 132048 96361
16436 96361 93460 35729 32915 46800 77351 31778 58498 114726 20320 95738 176204 97076
16424I7076l1647O0124n6035l5710J7070n6566k3623m83L6978Q1369K8861m3419
16412G3995q7548l43j8839K720L5432R0622M5252m7538r0192k8609Q9274J13290
16400A77516o8877m1938k6825L9850n9817l3480O1200J3324O980L5179J5028n4425
16388F3715r0096L0255J63137n1050j30552P815r763K9142l9370K80n0548O3747
16376a3288Q3797M6054Q9441n305j10040o8076n7598O0660J4598N9502J9885q2811
16364C6819j3361k5563J4599p2508k6760q4084L7972L9478R8112M3604J1145l6964
16352B2489O8973k411q6965k1659m6983J5741L8729K831L4904O8905O7141m3423
16340A18272o1809k3517L093l4352l8503J7256P961K6232l8195j9097J13868m326
$$ plain form
16424 97076 65429 125553 69518 33808 50878 -5688 -29311 -29794 7184 88553 117414 73995
16412 73995 -13553 -13896 -32735 -30015 5417 96039 141291 93753 3561 -25048 64226 177516
16400 177516 108639 66701 39876 79726 19909 -13571 47629 60953 67933 103112 118140 63715
16388 63715 -26381 3874 167011 115961 -14591 -6776 -16539 12603 -26767 -26487 -77035 -13288
16376 -13288 70509 116563 206004 200699 90659 22583 -35015 25645 40243 99745 119630 36819
16364 36819 23458 -2105 12494 -60014 -86774 -170858 -132886 -93408 4704 48308 59453 22489
16352 22489 91462 89051 2086 -19573 -66556 -50815 -12086 -9255 25649 94554 161695 118272
16340 118272 56463 32946 36039 1687 -36816 -19560 -11599 14633 -23562 -42659 71209 66883
16328F6883j7506p7719j14955n453O9906Q589O3713K3728l2008M8634L3922j0435
16316E7299P7892J0854L2604j04184m5428M3351J31351N7386m3681j13166j3718
16305I0560K0971n1032J9390K8724M6306Q1104m7529n4803K2991K6926K0447j0051
16293A94004M2441J69433O5350O1267R3342J46181L28075L92847M5628p8107j44239
16282A316222j26787j32363o0643j3998R5649J32617L00100K63954j4669r2425
16272A667657J5087O1769J15528K27569N3570j40419k76778l07548k34763j21792
16262A059880O6226J80700K08137J57455J47987k29449l42803j45951j14724j72482
16252H14976j86793r3277k7890p8578m3271L3901M829o1115r6626j08190j18828
$$ plain form
16328 66883 49377 -28342 -143297 -148750 -78844 -70255 -6542 17186 -14822 33812 67734 57299
16316 57299 135191 146045 178649 74465 29037 72388 203739 261125 217444 104278 90560
16305 90560 111531 60499 79889 108613 154919 236023 188494 133691 156682 183608 204055 194004
16293 194004 236445 405878 471228 532495 625837 772018 1100093 1492940 1538568 1460461 1316222
16282 1316222 1189435 1057072 996429 982431 1078080 1210697 1510797 1774751 1760082 1667657
16272 1667657 1682744 1744513 1860041 2087610 2141180 2000761 1723983 1416435 1181672 1059880
16262 1059880 1126106 1306806 1514943 1672398 1820385 1590936 1248133 1102182 987458 814976
16252 814976 628183 534906 507016 428438 385167 419068 423897 362782 266156 157966 39138
16241C9138l8809N6747L9542L7757K4315J6160j20731n172M7466J6637p9874L597
16229C6773J7148n7777L054N3433L2596m2070o4291j34500k1455M1352J9346P7644
16217c8747K7400j2928q8867j2995M6448k4552m5804P7796L371P9451Q643j7797
16205A419m1861k8630M4010J4868O1594j445j501L3284k1919J221m1673M2149
16193F1516j326o8091l2784j07831J8179J12021O556K218q2342m8779O7959O1459
16181a1245n0811p1799J3P9588o173o8445j6201J5568L4926J757P3305K886o2866
16168g9497K351J9151K5725m2909m1682L1800P713J3135M463j0911o5174L5512
16156a00323Q2025J1511p4429j3795R2624M9779M6295Q976p8233j668j1219M6333
$$ plain form
16241 39138 329 57076 96618 134375 158690 174850 54119 48947 96413 113050 33176 36773
16229 36773 53921 -3856 -802 52631 85227 43157 -21134 -155634 -177089 -135737 -116391 -38747
16217 -38747 -11347 -24275 -113142 -126137 -79689 -104241 -150045 -72249 -68878 10573 19216 1419
16205 1419 -40442 -69072 -25062 -10194 51400 49955 48454 81738 59819 61040 19367 61516
16193 61516 60190 -7901 -40685 -148516 -130337 -18316 -11760 -9542 -91884 -140663 -72704 -11245
16181 -11245 -62056 -133855 -133842 -54254 -60427 -128872 -145073 -129505 -94579 -92822 -19517 -16631 -79497
16168 -79497 -77146 -57995 -32270 -75179 -116861 -85061 -77348 -64213 -59750 -70661 -135835 -100323
16156 -100323 -18298 -6787 -81216 -95011 -2387 47392 93687 102663 24430 22762 11543 57876
16144E7876k2311q3834l7280R527R1987m4754p5041J0082m4884M3348P1540P4070
16132E0326K5636j4503K0012O244q1153p3430N2291L616P670m9870K828N3997
16120C664J2407j7520J4184m247J8742J4375r463M457k1430j2496N17l886N5503
16107E4807J7799n7827m5675n9348n1395M2046O2837K6727J7478K0609K6253r7788
16095d3477j2737r3561J06237M1619n0017K5702J8016P3697K7569L1317j22372
16084A993j37828q178J29184Q6492l3916l8432J630p0478N0871J3766k299P6698
16072F9503o411j02086n2094r364J2602Q440m5352n4560J02453L3175p3990j0954
16060a28638L6521N6089L3554K4212O2720J7988j23200m0757L9916M4917j05370
$$ plain form
16144 57876 35565 -48269 -85549 -76022 15965 -28789 -103830 -93748 -138632 -95284 -23744 50326
16132 50326 75962 61459 81471 87715 6562 -66868 -14577 -10961 -3291 -53161 -50333 3664
16120 3664 16071 -1449 12735 8488 27230 41605 32142 36599 15169 2673 3190 -696 54807
16107 54807 72606 14779 -30896 -90244 -141639 -99593 -36756 -10029 7449 28058 54311 -43477
16095 -43477 -56214 -149775 -43538 -1919 -51936 -26234 -8218 65479 93048 124365 1993
16084 1993 -135835 -144013 -14829 71663 37747 -685 945 -69533 -18662 -4896 -7195 69503
16072 69503 63092 -38994 -91088 -100452 -87850 -79410 -124762 -179322 -76869 -43694 -117684 -128638
16060 -128638 -92117 -36028 -2474 21738 84458 102446 -20754 -61511 -21595 23322 -82048
16049h2048M9734N5770k1126l1600k4216N3948K9021m0443j9352r4082J4439l7638
16037a47593j0884O0310J75942j6798k2119L2564j7106k1099m9516Q260K5316
16026A7277n964p299o6807n0445M0686M2310K8502j5522K5657L2424K1322n0371
16014A1770p4007j46394m3724O0116q6724k763J23785N9176J12709M4732M3201
16003A01877n0237j57207k1247M956P2565k387O3027L4917j9231L5952m2704p7941
15991e7660L2687n2970Q1758J5828p904l1078p3677l806P5684N7727N753q812
15979C3530n9212l3332M0641M5214R6207K1192r7707P571j0177m8380p7141n2013
15967a33607J7264k4867K3247N5999J8342m6624q2303P7199R4388K2904O053o7533
$$ plain form
16049 -82048 -32314 23456 2330 -29270 -53486 462 29483 -10960 -30312 -124394 -109955 -147593
16037 -147593 -158477 -98167 77775 60977 38858 71422 54316 33217 -16299 -8039 17277
16026 17277 11313 4014 -62793 -113238 -72552 -30242 -1740 -17262 8395 40819 62141 11770
16014 11770 -62237 -208631 -252355 -192239 -278963 -281726 -157941 -98765 13944 58676 101877
16003 101877 51640 -105567 -126814 -121858 -49293 -51680 11347 46264 27033 62985 20281 -57660
15991 -57660 -24973 -77943 3815 19643 11739 -19339 -93016 -96822 -21138 36589 42342 33530
15979 33530 -25682 -59014 -18373 26841 123048 144240 46533 54104 43927 -4453 -81594 -133607
15967 -133607 -116343 -141210 -117963 -61964 -43622 -90246 -172549 -95350 -962 21942 27995 -39538
15955c9538m546m7275J4259L2915N4585q0041N088L1212l6896l0736L2821Q7635
15943A9483K1047N5449L8005p1612N4480R0155K8165k9833k0431j21282n29P969
15931G1066j7463O4628M5036L1970k1257n8880k3939j9867o1215r4904j8750j0156
15919a13731n722N2918J3329j1377J32421N0551m8146j44068j0461J3864K5421
15908d5001n0468j0113k8465M3803M5193N0622M9178r144p9477L6033L3780L7261
15896G3202m9663n5312m6470p2385L4232P6606M8403K2499N210l3563L0472J3439
15884D6670O918j7396r0215o9710J6361K9803J5696N1430J7927L3758R9641K4869
15872A65752r9881j16660j07519K2127m8233m724J05944L882p0734M6823O8032
$$ plain form
15955 -39538 -44084 -91359 -77100 -44185 10400 -69641 -64553 -33341 -70237 -100973 -68152 19483
15943 19483 40530 95979 133984 62372 116852 207007 235172 205339 184908 63626 63097 71066
15931 71066 53603 118231 163267 195237 173980 115100 91161 71294 10079 -84825 -103575 -113731
15919 -113731 -119453 -66535 -53206 -64583 67838 118389 70243 -73825 -84286 -70422 -45001
15908 -45001 -95469 -105582 -134047 -90244 -45051 5571 54749 45605 -33872 2161 35941 73202
15896 73202 23539 -31773 -78243 -150628 -116396 -39790 8613 31112 36322 2759 33231 46670
15884 46670 53588 36192 -54023 -123733 -107372 -77569 -61873 -10443 7484 41242 140883 165752
15872 165752 65871 -50789 -158308 -136181 -184414 -189138 -83194 -79312 -150046 -103223 -35191
15861c5191O8403J9609n8183n0291J9942k8087P8407m5539j15645n8054J21031
15850h3598l1063l6021Q5542J31292J0555p4231j13196k2098J01555N4470J3758
15839C6965o0215j3882K5440n3663o1088L6768l6222N3274M7257l0445o4449k6111
15827a46371j4980j3190P0160J16579K5837j00012o4473L5476n98J2912J4826
15816f3834m4397L6095N3816J858R401j31348j8517O5642N4033k7596j8718k4407
15804a07972j5668J7446M8505Q6597J58739K0319r3024l1213M3352o328l5866
15793H4887l7317r4709p2847k4987o415K2144O5163N5829p3383K4418M3414N0928
15781C7125J9202n8738o9822m3025j03426K0496Q9092Q1007l847J4764q8538o9590
$$ plain form
15861 -35191 33212 52821 -5362 -55653 -35711 -63798 14609 -30930 -146575 -204629 -83598
15850 -83598 -114661 -150682 -65140 66152 76707 2476 -110720 -132818 -31263 23207 36965
15839 36965 -23250 -37132 -11692 -65355 -126443 -89675 -125897 -72623 -25366 -55811 -120260 -146371
15827 -146371 -161351 -174541 -104381 12198 38035 -61977 -126450 -90974 -91572 -78660 -63834
15816 -63834 -108231 -72136 -18320 -16462 -7061 -138409 -156926 -91284 -37251 -64847 -83565 -107972
15804 -107972 -123640 -106194 -57689 28908 187647 207966 114942 83729 127081 120753 84887
15793 84887 47570 -47139 -119986 -144973 -151388 -129244 -64081 -8252 -81635 -57217 -13803 37125
15781 37125 56327 -2411 -72233 -115258 -218684 -198188 -109096 -28089 -31936 -17172 -105710 -175300
15769a75300L7054M8822L8095O3730K8698J5227L3579j9824k287j8365N343n1436
15757C336j284k2459N3592L0132K5955M2217l4083J574K6246o4208p1954J5356
15745D420P6479P488J4180m2576j15383r0495j7088k4387J0723j7338J2882o063
15733a87158k3629Q0040N0432J14507N7929o071l8045K7224l0026q330j14305
15722g7432O3344L5306K0921n298j2431m2699m2731j23049n1586J37933R7642
15711h0l747P1348o6708n3177p9194r1556N5820P3004l5688j8904N81k5379O3514
15698a10166J5396j5413j1722L6053J1854K0029M051q1437J25332n0291j11138
15687a67452O2327O2854R6170q205o2572J3798l7746O2048M3686k5479l2333K6960
$$ plain form
15769 -175300 -138246 -89424 -51329 12401 41099 56326 89905 70081 67794 49429 54772 3336
15757 3336 2052 -20407 33185 63317 89272 131489 97406 98980 125226 61018 -10936 4420
15745 4420 80899 88387 102567 59991 -55392 -145887 -162975 -187362 -176639 -193977 -181095 -187158
15733 -187158 -210787 -130747 -80315 34192 92121 86050 48005 75229 45203 36873 -77432
15722 -77432 -14088 21218 42139 36841 24410 -18289 -61020 -184069 -235655 -97722 -80
15711 -80 -3827 67521 813 -52364 -131558 -223114 -167294 -94290 -129978 -148882 -148301 -173680 -110166
15698 -110166 -94770 -110183 -121905 -85852 -73998 -53969 -49918 -131355 -6023 -56314 -167452
15687 -167452 -105125 -42271 53899 45694 -16878 -3080 -40826 21222 64908 39429 7096 34056
15675C4056L0999J94l7133K2782l6192o6181n3272p1558j8027J32312Q0159m5859
15663b7720j3316n5090p75l5824J01166J10045J3104L5876p317m8319j17864l4938
15651h0972L3279k342Q821o0586L2868L0162l0907P4493Q7626l5453J2264K8997
15639I8250p1042o1822j8121J01112J25589M1440j08771j23773j02925L4372O3932
15628b1759P9567p536p7359m8151Q465j1583O774O6340P7944l0915p619K4366
15616E8534L032K633j16961n0111O209j719K467P6959J38900Q484m8173k9511
15604E0743p378N1249j0708q1749Q6839Q1166p0297o3921r3362n6474P4493O7714
15592B8315o9329k815J4803p0710k5211J4311L9252J37249k9052m3075j4325o3985
$$ plain form
15675 34056 65055 65249 28116 50898 14706 -51475 -104747 -176305 -194332 -62020 18139 -27720
15663 -27720 -41036 -96126 -96901 -132725 -31559 78486 91590 127466 120149 71830 -46034 -80972
15651 -80972 -47693 -50035 -41214 -101800 -68932 -38770 -69677 4816 92442 56989 69253 98250
15639 98250 27208 -34614 -52735 48377 173966 215406 106635 -17138 -120063 -85691 -21759
15628 -21759 57808 50272 -27087 -75238 -66773 -78356 -71582 -5242 72702 41787 34168 58534
15616 58534 61566 64199 -52762 -102873 -96664 -98383 -95916 -18957 119943 128427 80254 50743
15604 50743 43365 94614 83906 2157 88996 170162 99865 35944 -57418 -113892 -39399 28315
15592 28315 -41014 -43829 -29026 -99736 -124947 -110636 -71384 65865 36813 -6262 -20587 -84572
15580h4572J01831J9419j03645L3164o844K1291P4682j1396q0693j01848k6146
15569a64757P9649O9945j2633O7688k7752j4316L5911J20881J9931j15710m0642
15558A8195m0729p9871k8162J55079J08484J32L2981l6299n3059k1372r5074o7198
15546a06893R0834j0880M091p1542k6061k5446j7362K0830L0171j9850M9850j00977
15534a83235p8284R3463M0014o3840l4592O2328O3527J1139M3596j22834o576
15523a75294k4503l0465k2874N1269O8998l0287j065R7229Q8391M5710J5095m2295
15511C9909R65J1081r992o0658J075j8450l6607L7505m9598J5513P743O0206k876
15498d184K8158Q9834p7600k8411p3428r4068Q1141Q2087Q0434n45p5793k4005
$$ plain form
15580 -84572 17259 36678 -66967 -33803 -40647 -19356 55326 43930 -36763 -138611 -164757
15569 -164757 -85108 -15163 -27796 39892 12140 -2176 33735 154616 174547 58837 18195
15558 18195 -22534 -102405 -130567 24512 132996 133128 166109 129810 76751 55379 -39695 -106893
15546 -106893 -16059 -26939 -22848 -94390 -120451 -145897 -163259 -142429 -112258 -132108 -82258 -183235
15534 -183235 -261519 -168056 -128042 -191882 -226474 -164146 -100619 -89480 -45884 -168718 -175294
15523 -175294 -199797 -230262 -253136 -201867 -132869 -163156 -164221 -66992 21399 67109 82204 39909
15511 39909 40874 51955 41963 -18695 -17620 -36070 -72677 -35172 -84770 -69257 -61514 -1308 -4184
15498 -4184 23974 113808 36208 7797 -65631 -159699 -78558 3529 83963 83418 7625 -16380
15486a6380R4327P1812l8951l8939n0218L6412j30481r661M3553L7168p118J4950
15474F474j5353p1957J2531p4577r3111J2073J09979J8617o3657n1578J8123Q8450
15462a03986J23412P6109o207R2932n4783j01164N659N3585k3852q398N4572l728
15450A04151Q3924p3106N6601j6639j14356p1733j0589L1059j5829m5284J4774
15439e7027r550r165P5977J03076J854m292o5499q6003j22896P6853n001N6519
15427d5154O2300J14396n6802n2527J4165J37687r217j57586o7725j1J31156J39360
15415B10042J7158l884j42136q8047L5176O4097P8958o4625n3786j14391j7003
15404g8441M3153J9618P9406k7037P500P2401N7325m6845q6485q0422L6196k2335
$$ plain form
15486 -16380 77947 149759 110808 71869 21651 58063 -72418 -82079 -38526 -1358 -8476 6474
15474 6474 -8879 -80836 -68305 -142882 -235993 -223920 -113941 -95324 -158981 -210559 -192436 -103986
15462 -103986 19426 95535 89328 182260 127477 26313 31972 85557 61705 53307 107879 104151
15450 104151 188075 114969 171570 154931 40575 -31158 -41747 -10688 -26517 -71801 -57027
15439 -57027 -66577 -75742 235 103311 105165 100873 35374 -50629 -173525 -96672 -101673 -45154
15427 -45154 17146 131542 74740 22213 36378 174065 164848 7262 -60463 -60474 70682 210042
15415 210042 227200 223316 81180 -6867 28309 92406 171364 106739 52953 -61438 -78441
15404 -78441 -35288 -15670 63736 36699 44199 116600 173925 127080 40595 -39827 -3631 -25966
15392b5966M7003O557m5924j7418N833r641J288K3182j3184K0000J0719K3814
15380B6263l9779l206n0070o361J3892P3989P7583r206m6638m3925m1902L6940
15368a2420O689m1031n951L1753o2611n1775J9955N9693J235L0340P7778l6588
15356A7067m8227o7382n689M5198q0581o941K3467L0171L9229M641L4051j0976
15344b5972o6465O594n4246J33672J3356m0125K7444M8228O3786L2623M3141N749
15332A87785q2900r3723k8683n5643P363P1444p868l681m849L7806R6039o2045
15320F1045o3906n8178r4852Q0191Q6636J9010l5020p6999J4378N4470K4954K0198
15308C1927J3863r5768n9386O8026l5371l2825l6061M0841k1762q2456O0561N1591
$$ plain form
15392 -25966 21037 27594 -18330 -35748 -29915 -39556 -38268 -15086 -28270 -8270 2449 26263
15380 26263 -13516 -16722 -66792 -73153 -59261 14728 92311 83105 36467 -7458 -49360 -12420
15368 -12420 -5731 -46762 -52713 -20960 -83571 -135346 -115391 -55698 -54463 -24123 53655 17067
15356 17067 -31160 -98542 -104231 -59033 -139614 -146555 -123088 -92917 -53688 -49047 -14996 -25972
15344 -25972 -92437 -85843 -140089 -6417 6939 -33186 -5742 42486 106272 138895 182036 187785
15332 187785 104885 11162 -17521 -73164 -65801 5643 -2225 -5906 -10755 27051 123090 61045
15320 61045 -2861 -61039 -155891 -75700 10936 29946 -5074 -82073 -67695 -13225 11729 31927
15308 31927 45790 -49978 -109364 -41338 -76709 -109534 -145595 -104754 -126516 -208972 -148411 -96820
15296i6820j5036k9045Q6137N6251K1693p4211J1444O0732k3183P3809q140N074
15284F8705l239n9706J38K0769K6269P472N0749L1462m1107j00242r1036p466
15272i7232M915Q3131Q508o3863k054J3364J4166J06564k0788o4790p2144j125
15260i1348J2702P132l6496p710N0412o4832Q2500M6081N5606k9227q0689j2216
15248f8085K2751r440Q5130J02390j05486j5714K4474K4736o8281p1841o3857
15237a43223K6003O2226l8340L9681L0327P2719N6129J9610M5775L0062j78254
15226B2715j14193K7272n6793P5234J18833J0359n0236J934r883K1279P3126J1755
15214A31402J3691K285r680M9531J5689j0108m2845j9371j26388o6398q5977o3761
$$ plain form
15296 -96820 -111856 -140901 -54764 1487 23180 -51031 -39587 21145 -2038 71771 63631 68705
15284 68705 65466 5760 5898 26667 52936 60408 111157 142619 101512 1270 -89766 -97232
15272 -97232 -92317 -9186 -678 -64541 -66595 -53231 -39065 67499 46711 -18079 -90223 -91348
15260 -91348 -78646 -71514 -108010 -115720 -65308 -130140 -47640 -1559 54047 24820 -55869 -68085
15248 -68085 -45334 -54774 30356 132746 27260 11546 36020 60756 -7525 -79366 -143223
15237 -143223 -117220 -54994 -93334 -53653 -23326 49393 105522 125132 170907 200969 22715
15226 22715 -91478 -64206 -120999 -45765 73068 83427 33191 35125 25242 46521 119647 131402
15214 131402 145093 147378 137698 187229 202918 192810 149965 130594 4206 -62192 -148169 -211930
15202b11930R0508R7786P2121j0075q7222K0266K7614R789P5961J11062m4925
15191A50955j20921K4271J40088M1419k3239N8522M0040j28426q6921j29315o4760
15180i8287L6586O2858o470L31L4171L116o2923l2208L7721K6493k6015o7787
15168i2414J7580N496j9481N4225O8104J6352N9460p453K4701j4477K2821l346
15156A31568o0779n7590q4472o2148n4616K1810O2001J3716J05241n9897p9840
15145a25006j8537O580N0602O6843j115L2605K4162l3235j13069l5856Q7823P4787
15133A6584N563p4685Q6631M2551q0022j10280j7650P0219L6340K5719p7970r8176
15121a75176j1015J1657j6976n0397N1991N7690M3258M6907R1733L6478n8192
$$ plain form
15202 -211930 -121422 -23636 48485 38410 -48812 -28546 -932 8857 84818 195880 150955
15191 150955 30034 54305 194393 235812 212573 271095 311135 182709 95788 -33527 -98287
15180 -98287 -61701 1157 -5313 -4982 29189 32305 -30618 -62826 -25105 1388 -24627 -92414
15168 -92414 -74834 -69338 -88819 -34594 33510 49862 109322 101869 126570 112093 134914 131568
15156 131568 70789 13199 -71273 -133421 -188037 -166227 -104226 -90510 14731 -45166 -125006
15145 -125006 -143543 -136963 -86361 -19518 -20633 11972 36134 2899 -110170 -146026 -58203 16584
15133 16584 22147 -52538 34093 76644 -3378 -113658 -131308 -61089 -24749 970 -77000 -175176
15121 -175176 -186191 -174534 -191510 -241907 -189916 -132226 -88968 -42061 49672 86150 27958
15110B7958m8935L7380m3949K8483k5087r3017n1373R2261k4017R5501J27071
15099A22276M7631o3864r0798J4242J3783m9313j51637j13724J799J00678J31512
15088c7415O1153J6872M6961m0448p3363J2043O6986m562j03078k4883k8369l8973
15076a47076L2277K5656l8184Q2024j5704m6482J9197J2447M5200J2757l8639
15065e6527m488k7713L8576J26101J854r7l8004j2461J3727J2141q0683n9710
15053h7284K3545M464m028n4917k8785M8619j8616J6509K9484J3750J8758K0992
15041a7509M8978J299r898m6738O1047K9642l1996J6150l0893L3459K8346l696
15029G8191P3613K0276k4706o2067o0623J0882M0022o6414m9501K3440n7100N907
$$ plain form
15110 27958 -20977 16403 -27546 937 -24150 -117167 -168540 -76279 -100296 -4795 122276
15099 122276 169907 106043 15245 29487 43270 -6043 -157680 -271404 -269605 -168927 -37415
15088 -37415 23738 40610 87571 47123 -26240 -14197 52789 48227 -54851 -79734 -108103 -147076
15076 -147076 -114799 -89143 -127327 -45303 -61007 -107489 -88292 -75845 -30645 -17888 -56527
15065 -56527 -61015 -88728 -50152 75949 77803 77706 39702 27241 40968 53109 -27574 -87284
15053 -87284 -63739 -59275 -63303 -118220 -147005 -98386 -117002 -100493 -71009 -57259 -38501 -17509
15041 -17509 31469 32768 22870 -23868 37179 66821 34825 50975 20082 53541 81887 78191
15029 78191 151804 172080 147374 85307 24684 35566 75588 9174 -40327 -16887 -73987 -68080
15017f8080J00563k6073M6332M7696l3007j00576m3770M6424N3906M5317j5571
15006E3161k1203j8938O6197J10834M4625J1998J47355K53576L20192N03444O58811
14995B130052R90662Q44333j46175o69108p02828n60743n34393l56274j38676
14986H56850p0580l0978o0116n9886o1548n6394m4995p6467o6735l2036m9217
14975B47898j32471q8975k440k9609J6546M8336L7865r95L3953q0972j65056R44
14963a14976J09972j4556K2788R9304P503j40323j0124P3914J732m6812J2734
14952A156n6522j9057L9237j7117M5431J00414J26317l0505j11938k03388n9157
14941a85129O4577M1174Q3661r958J4186j415n0647P177r617j1672J10546p1065
$$ plain form
15017 -68080 32483 6410 52742 100438 67431 -33145 -76915 -30491 23415 68732 53161
15006 53161 31958 13020 79217 190051 234676 246674 394029 647605 967797 1471241 2130052
14995 2130052 3120714 3965047 3818872 3149764 2446936 1886193 1351800 995526 856850
14986 856850 786270 755292 695176 635290 573742 517348 472353 395886 329151 297115 247898
14975 247898 115427 26452 24012 -5597 10949 59285 97150 96155 130108 49136 -115920 -114976
14963 -114976 -5004 -19560 3228 102532 110035 -30288 -40412 33502 35234 -11578 1156
14952 1156 -55366 -74423 -35186 -52303 -6872 93542 219859 189354 77416 -125972 -185129
14941 -185129 -120552 -79378 4283 -5675 8511 7096 -43551 -36374 -45991 -57663 52883 -18182
14929a8182j77531q0510M9642J61842N5938J9820k5106o9055K5069Q914N7085
14918G926L3996L221r692L0893J8910O3557J0456j72208j39393J63688M8387r2524
14906c2783j3434Q995K2545P546j1641j8278o7654r9202K3313k2977j9809J54396
14894f8983J2749O4197Q024J8761K063m8429j5639r810l7084n2184m6996m101
14882a77432n054J15856L6188N1550j8156j4355O8946J4129P1791P2797j06651
14871A09609j20365K5108l2656j564J3667J10645l6251m2867k8898p8112J01877
14860B0193J18059l5485k455l3798q6194K3961R9978j8532l7182l9951k8581R6659
14848G6672P9124P8954n0836q0426j36842q8783o564J7326P6296K9965L6036Q1392
$$ plain form
14929 -18182 -195713 -276223 -226581 -64739 -8801 11019 -14087 -83142 -58073 -49159 7926
14918 7926 41922 45143 35451 66344 85254 148811 159267 -12941 -152334 11354 59741 -32783
14906 -32783 -46217 -37222 -14677 -7131 -18772 -37050 -104704 -203906 -180593 -203570 -223379 -68983
14894 -68983 -56234 7963 15987 34748 36811 -11618 -27257 -37067 -74151 -126335 -173331 -177432
14882 -177432 -182486 -66630 -30442 21108 2952 -11403 57543 71672 143463 216260 109609
14871 109609 -10756 14352 -18304 -19868 -6201 104444 68193 25326 -3572 -81684 20193
14860 20193 138252 102767 100312 66514 -19680 4281 104259 85727 48545 8594 -19987 76672
14848 76672 155796 234750 183914 103488 -33354 -122137 -128701 -111375 -35079 -5114 30922 112314
14836A12314k4616j5574p4391m1202j1060n7106L513J651K7792l4220o2023K589
14824a72333L3140k0492r507O8976P9778J12103J2113n3548n1785k0556p1911
14813i4022o9560Q210K8818Q8649J7816k6457o9736r2786k2614J41263J5914M9958
14801b4547P4379l1910m1593L9421l734R2636Q6737L408o7772p1793J1157J270
14789F7659k3384N4735n882j01836j9706k1103j4660j4613m179k5340M8395R9653
14777C9739J8374k7193m3344j2655k4254M8116k0402p5872j04926N3954J13855
14766c4608M4556O082R028K8326l2193r7493L5403k8487l7727N2747J14425K2089
14754H2148k0655P1421k6066n5281n8844K4386L7969p362r960K4517K4453J1993
$$ plain form
14836 112314 87698 72124 -2267 -43469 -54529 -111635 -108122 -106471 -78679 -112899 -174922 -172333
14824 -172333 -139193 -159685 -169192 -100216 -20438 91665 103778 50230 -1555 -22111 -94022
14813 -94022 -163582 -155372 -126554 -37905 -20089 -46546 -116282 -209068 -231682 -90419 -74505 -24547
14801 -24547 49832 17922 -23671 15750 12016 104652 191389 194797 127025 55232 66389 67659
14789 67659 44275 99010 93128 -8708 -28414 -49517 -64177 -78790 -82969 -108309 -59914 39739
14777 39739 58113 30920 -12424 -25079 -49333 -1217 -21619 -97491 -202417 -148463 -34608
14766 -34608 9948 16030 25058 53384 21191 -76302 -40899 -69386 -107113 -54366 60059 82148
14754 82148 61493 132914 106848 51567 -7277 17109 55078 47716 37756 62273 86726 98719
14742I8719l6663j15919M6583O8258P2007o4703m3733r9196j515J18487R6411
14731A38736Q3989n3152n9422J0523m3078l8116k7463k9177P113r3981J9125Q1483
14719c420o7310J2881N7096q252M317M2632N7525M7503l0975r1783o4811k2377
14707f6974N436J148n9276k2010O9650L5188j4457k029o0289o1558p836J8666
14695a64341O8002o422L2824r741l917J1086l846K3426j6101M5797K9057O37o7872
14682f1411q2679P8847n254Q302n7633p7052M8112R8088P5662P9743m0019k33898
14670a69192l3903M8094R7614J52272l4089r3120j942N9066o5263O8106R5102
14659A22745k3956o8682n2885K480R2852k2639l7493m9826J06342l2070m5515
$$ plain form
14742 98719 62056 -53863 -7280 60978 132985 68282 24549 -74647 -76162 42325 138736
14731 138736 222725 169573 110151 120674 77596 39480 12017 -17160 -10047 -104028 -84903 -3420
14719 -3420 -70730 -57849 -753 -9005 -4688 37944 95469 142972 111997 20214 -44597 -66974
14707 -66974 -61538 -60390 -119666 -141676 -72026 -36838 -51295 -53324 -113613 -175171 -183007 -164341
14695 -164341 -96339 -102761 -69937 -79678 -83595 -72509 -76355 -52929 -69030 -23233 5824 6461 -61411
14682 -61411 -144090 -65243 -70497 -62195 -119828 -196880 -148768 -50680 24982 104725 64706 -169192
14670 -169192 -203095 -155001 -57387 94885 60796 -32324 -34266 24800 -40463 27643 122745
14659 122745 98789 30107 -22778 -20298 72554 49915 12422 -37404 68938 36868 -8647
14648h647j8006k7048N601L6824O8928K5416m2o525l3814k2387m6334r8596o822
14635a31452J8493o8304J1961K8450k1830J06770J17685k9723l5848j2309l6612
14624e2719N692K8925p874K5413n7478q0207R0979J6859o0357j402L819M0508
14612d7842Q1291M8114P2892j20950j06855j2592L0632M385L1299K7543o3858
14601e5941K6073P2493M1905Q456L4829j3639k3071o2838o58K8095m3727k4102
14589a2125M2859k715q565l7239J83L7441r013K2407k3150J6215m479r0271p5376
14576a43828k6081N24M9313J71790L2917L9572m8787Q772k386j333r3356J6532
14564C649m233M3664O676K1034M9307k651k9111j5687l5378R7700n5076m5195
$$ plain form
14648 -8647 -26653 -53701 -48100 -11276 57652 83068 83026 76501 42687 20300 -26034 -124630 -131452
14635 -131452 -112959 -181263 -169302 -140852 -162682 -55912 61773 32050 -3798 -16107 -52719
14624 -52719 -47027 -18102 -25976 -563 -58041 -138248 -47269 -30410 -90767 -92169 -88350 -47842
14612 -47842 33449 81563 154455 33505 -73350 -85942 -55310 -50925 -19626 7917 -55941
14601 -55941 -29868 42625 84530 92986 127815 114176 91105 28267 27609 55704 11977 -12125
14589 -12125 30734 28019 19454 -17785 -17602 19839 10826 33233 10083 26298 21819 -68452 -143828
14576 -143828 -169909 -169385 -120072 51718 84635 124207 75420 84192 81806 80473 -12883 3649
14564 3649 -584 43080 49756 70790 120097 117446 88335 72648 37270 134970 79894 34699
14552C4699J2347m1742N7226L8769m3136m2856j6190p2461L3115L8656Q5570l6342
14540D7655n3731j9514K9888L6394o9314j489o1412k675J08045K9184l6883j0828
14528d680M9151J08016j5976m2041n9759j00853M6543R9247p1901L3928n6137
14517a4462o5516L1048L4328J654K4823L8288L3163k9850j511n2406P3679o55
14505G2583l3411K0556r9552J3762J03630J1038m9388j5792N2768J8147p7930
14494A6411r3152j11543O892p598l0671P8316L0725m3024P304Q7713R4195n2829
14482a7261m3555N040R3830N8473k3760o7926l5643O0440K9859o496k4531L1784
14470F0254m3338k7123L0283r9604n3379j3099M6446Q2927J4624o6094j4671J1780
$$ plain form
14552 34699 47046 5304 62530 101299 58163 15307 -883 -73344 -40229 -1573 83997 47655
14540 47655 -6076 -25590 4298 40692 -28622 -30111 -91523 -94198 13847 43031 6148 -4680
14528 -4680 44471 152487 136511 94470 34711 -66142 -19599 79648 7747 41675 -14462
14517 -14462 -79978 -48930 -14602 -12948 11875 50163 83326 53476 51965 -441 73238 72583
14505 72583 39172 59728 -39824 -26062 77568 88606 39218 23426 76194 94341 16411
14494 16411 -76741 -188284 -181392 -188990 -219661 -141345 -110620 -153644 -146340 -58627 35568 -17261
14482 -17261 -60816 -55776 38054 96527 72767 4841 -30802 29638 59497 53001 28470 60254
14470 60254 16916 -10207 20076 -79528 -132907 -146006 -99560 -16633 -2009 -68103 -82774 -70994
14458g0994P5426j0066L9987P2615l492J4248l443r9940l1205o3573L7431J04613
14446F1607O7153J3333o5746r5102K388M9870j7369M1255L3070l3521K8020p0526
14434A4432j1859L3095P6397n8164L2328J20898j6167k5450L8864l2471o6091
14423A05812m1685j15170j10238K2370J0249N347l6803K8800O3347J13690Q5592
14412A31311k2320l4753p768L1407J3505j53214k8264P8867O7999l9926m1363
14401d519J4003J1775P1983N158j08361m4835p89n1545P609R398J02297R0626
14389A02800n0238j48216p7876p2417J4323J17399K8556K7391l0548o6629N5755
14378i9700J01745l622Q939J6357o3138n8649J3531N7645K1531j3608q9706r408
$$ plain form
14458 -70994 4432 -5634 34353 106968 103476 117724 114281 14341 -16864 -80437 -43006 61607
14446 61607 128760 142093 76347 -18755 -16367 33503 16134 57389 90459 56938 84958 14432
14434 14432 2573 35668 112065 53901 86229 207127 190960 165510 204374 171903 105812
14423 105812 64127 -51043 -161281 -138911 -128662 -123315 -160118 -131318 -67971 45719 131311
14412 131311 108991 74238 66470 97877 111382 -41832 -70096 8771 76770 36844 -4519
14401 -4519 9484 21259 93242 98400 -9961 -54796 -55585 -107130 -99521 -90123 12174 102800
14389 102800 52562 -95654 -173530 -245947 -231624 -114225 -85669 -58278 -88826 -155455 -99700
14378 -99700 2045 -1577 7362 23719 -39419 -98068 -84537 -26892 -5361 -18969 -108675 -118083
14366a18083M063Q221L4005j3849N0508O9771M5128M4122j2188m1998l9354j93718
14354a63372j08389Q0816Q2935K6468K8074r3197o5104M2799k972k7687J04779
14343i4850K3211J19659P7049j1096p4954L0294J8281j5466K4091j4454P8685
14332A60450J933L220n8473j10661J5309l2125J0814k2559K0078L5184k5010L1032
14320B9192k8430K9918J1087p1240m6784k199P0139P38O9670j7171m6186l825
14308e091m0838k2772L6755R0421r452q3228n798n4434K3698K1911K2234M0192
14296A3598k830k5664R248P2537K0834N7214K622m6407m5218k6900K6318J32750
14284A88102k0622m5750j03396n7475K9001k0939L4045L8893n6488j8576K8996
$$ plain form
14366 -118083 -114020 -105799 -71794 -85643 -35135 34636 79764 123886 111698 69700 30346 -163372
14354 -163372 -271761 -190945 -108010 -81542 -53468 -146665 -211769 -168970 -171942 -199629 -94850
14343 -94850 -71639 48020 125069 113973 39019 69313 87594 72128 96219 81765 160450
14332 160450 162383 165603 107130 -3531 11778 -20347 -9533 -32092 -12014 23170 -1840 29192
14320 29192 762 30680 41767 -29473 -76257 -78456 -8317 -7579 62091 44920 -1266 -5091
14308 -5091 -45929 -68701 -31946 58475 49023 -34205 -40003 -94437 -70739 -48828 -26594 13598
14296 13598 10768 -14896 -5648 66889 87723 144937 147559 101152 55934 29034 55352 188102
14284 188102 167480 121730 18334 -39141 -10140 -31079 2966 41859 -14629 -33205 -4209
14273d209M9594O778k3813n0496j913K3043N2877L0781p947L771m1954L2453M176
14260G3141n4034p2618k3779M8317Q132J7862N9241j21221k9089j1097O7134J03818
14248F5807j7054o6442P030m8768J09964P9354M5958M396r8955r7014n953K5012
14236C335j6324k5648M1044O3809P3739L6788n9625N512o3465j21471j494L3972
14224b9828k1758K616M1873P1635J72k256m4693O8901j0628N149L0835k4390q089
14211G9539J7981N9856M2999k8965j9737l0590p4071q049j1928o5730l5111L6796
14199c7010j7768J6187Q190r2108j4234J00604O3813n260k0591l1008O8429O6418
14187A05662k5560M2316k0429q1249m7636j5880j00074M8474N6886l2144O721
$$ plain form
14273 -4209 45385 52163 28350 -22146 -24059 -1016 51861 82642 74695 78466 36512 68965 73141
14260 73141 19107 -53511 -77290 -28973 -20841 -2979 56262 -64959 -94048 -105145 -38011 65807
14248 65807 48753 -17689 -10659 -59427 50537 129891 175849 180245 81290 -15724 -21677 3335
14236 3335 -12989 -38637 2407 66216 139955 176743 117118 122630 59165 -62306 -63800 -29828
14224 -29828 -51586 -48970 -7097 64538 64710 62454 17761 86662 76034 81183 112018 87628 79539
14211 79539 97520 157376 200375 171410 151673 121083 47012 38963 27035 -38695 -73806 -37010
14199 -37010 -54778 -38591 -30401 -122509 -136743 -36139 27674 22414 1823 -29185 39244 105662
14187 105662 80102 122418 101989 20740 -26896 -42776 -142850 -94376 -37490 -69634 -62913
14176f2913O3892M3108j1375N22O7688l0413L7858m0731j48422n0295M7572L1419
14164e2090K0262O6066P2811k3730l1017k1016O7191k3809k5199k7207l8930L5340
14152A8672J4631j5933L1564n7871l3135M5080J2303Q6728l4196p3421N7573K9364
14140H1359M8489o0708l5904L5289J18003k0010p3407j02843j9786j7208j2462
14129e9188Q1756J2094M1721l5472q7451Q592J28649N2673j03426j23688r6061
14118a79801R5812l3442n324O8938M8407P0089J40777J969o2903K037n4032K97
14106I2824k5270m5153k4720p3566q5588n320J26611P5160P2799j8047n8942m4066
14094a3278J792L8031P9504P4331j9230n5336P5786K0783n8191p6281n0773m2306
$$ plain form
14176 -62913 979 44087 32712 33234 100922 70509 108367 67636 -80786 -131081 -83509 -52090
14164 -52090 -31828 34238 107049 83319 52302 31286 98477 74668 49469 22262 -16668 18672
14152 18672 33303 17370 48934 -8937 -42072 3008 15311 102039 67843 -5578 51995 81359
14140 81359 129848 69140 33236 68525 186528 166518 93111 -9732 -29518 -46726 -59188
14129 -59188 22568 34662 76383 40911 -46540 -37948 90701 143374 39948 -83740 -179801
14118 -179801 -83989 -117431 -122755 -53817 -5410 64679 205456 207425 144522 146559 92527 92824
14106 92824 67554 22401 -2319 -75885 -161473 -166793 -40182 34978 107777 89730 30788 -13278
14094 -13278 -11486 26545 106049 180380 161150 105814 181600 202383 144192 67911 17138 -25168
14082b5168o5647l7203R2618R8762p681m6789q673k598m7902J2404l8793K327
14070g4343M5964P3847k0908j13793n1492K0658K4569J21665Q5317M6610k7901
14059A30193k3860o1417j0990J5675n4974K8485o8820n1762k8591j6611j1207
14048a53879j4173R0573O5635K33K2142j4565o2732k1660J36002P726n4918j12370
14036a11986j17393J0796R7815O565j4415j9718R6737K6679m621l4508o8968L2385
14024a00632P0393j7683J1627M6254J01948M3568n0004p1763q6404L6505R9913
14013H3722k5238o4318q6189N8147l914N0321K3548R912l1424k232o5l3140p2358
14000i3228j31949N5392J77406L0288q6058m738k414l5102M7256P3714J0301j18024
$$ plain form
14082 -25168 -90815 -128018 -35400 63362 55681 8892 219 -2379 -50281 -37877 -76670 -74343
14070 -74343 -28379 45468 24560 -89233 -140725 -120067 -95498 26167 111484 158094 130193
14059 130193 106333 44916 33926 49601 -5373 23112 -45708 -97470 -126061 -142672 -153879
14048 -153879 -168052 -77479 -11844 -11611 10531 -4034 -66766 -88426 47576 55302 384 -111986
14036 -111986 -229379 -218583 -120768 -114203 -128618 -148336 -51599 -24920 -29541 -64049 -133017 -100632
14024 -100632 -30239 -47922 -36295 9959 111907 155475 105471 33708 -52696 -16191 83722
14013 83722 58484 -5834 -92023 -33876 -37790 12531 36079 45991 14567 12335 12270 -20870 -93228
14000 -93228 -225177 -169785 7621 37909 -48149 -52887 -55301 -90403 -43147 30567 40868 -77156
13988g7156k545L6055q0037K7080J9378R2044O7899O3420j09751o538Q8492m0466
13976G7875r9186L670l2177l4676M9070n0221n0061l3122J47336M9130o6287p548
13964d6197r248L720q6643J2377J1704o90J6946L6878M9658Q3298p3617K2185
13952B0371K9050j6813p3075p6311J357k0829j0546N5632L4469N2872N0065J403
13940D7645j43220l8716P4840K7075n088j907J5850j0951k5959M3454J39545K5386
13928A47954q0189n4704L774r6588o5079p7701P61R1353O3448k5591j0512P6824
13916b6250R7406K3556J2825p2814P275j5758m2772L5233J60805L344r3433q1529
13904G888k7569m4041K1635N7737o1677J7080O8269N910L0613q9165J5331J02834
$$ plain form
13988 -77156 -79701 -43646 -123683 -96603 -77225 14819 82718 146138 36387 29849 118341 77875
13976 77875 -21311 -17641 -49818 -84494 -35424 -85645 -135706 -168828 -21492 27638 -38649 -46197
13964 -46197 -55445 -51725 -138368 -125991 -114287 -114977 -98031 -61153 -11495 71803 -1814 20371
13952 20371 49421 32608 -40467 -116778 -115421 -136250 -146796 -91164 -56695 -3823 46242 47645
13940 47645 -95575 -134291 -59451 -32376 -37464 -39371 -23521 -34472 -60431 -16977 122568 147954
13928 147954 67765 13061 16835 -79753 -144832 -222533 -221772 -130419 -66971 -92562 -103074 -26250
13916 -26250 71156 94712 107537 34723 41998 26240 -16532 18701 179506 182850 89417 7888
13904 7888 -19681 -63722 -42087 15650 -46027 -28947 39322 45232 75845 -13320 2011 104845
13892A04845J3382j29749m3731J4004J11678N2923l9454j23996n1127P0953J9813
13881d59q2525k9203J50898J5985p6400M9151O18p3925N4552L4200l1715M6424
13869E7601O1140j03175j11175M0728Q3787N1986q4718K4710P072j00332Q349
13858f4027O8933J128L3364l9522M8318l6242q6253M6756O830k1366l0964K626
13846g0419J9609o2723k958N5327n086K9269Q638j0525Q0640l4870l9789m1777
13834g4664m5793P4307K0082l4406K3934K4868M571r5148n982M4619N1579Q2199
13822G0166k2619r9686n4949J0132P3772j296L3971o2988N892M5039N6535J03827
13810A57796r2767j8781K5723K7107p2344M1729k1270n8494L8064Q6520L2708
$$ plain form
13892 104845 118227 -11522 -55253 -41249 70429 123352 83898 -40098 -91225 -20272 -459
13881 -459 -82984 -112187 38711 54696 -21704 27447 28065 -45860 8692 42892 11177 57601
13869 57601 118741 15566 -95609 -54881 28906 80892 -3826 20884 27956 -72376 -64027
13858 -64027 4906 6034 39398 -124 48194 11952 -74301 -27545 -20715 -42081 -73045 -70419
13846 -70419 -50810 -113533 -116491 -61164 -66250 -36981 -28343 -38868 41772 6902 -32887 -74664
13834 -74664 -120457 -46150 -26068 -60474 -36540 -11672 -7101 -102249 -108231 -63612 -12033 70166
13822 70166 47547 -52139 -107088 -96956 -23184 -24480 9491 -53497 -47605 -2566 53969 157796
13810 157796 65029 46248 71971 99078 26734 68463 47193 -11301 26763 113283 145991
13799A45991M079j4755M713j5440j38926l0218O5599L356L673K6471J3109N602
13787G3254l6557m5955k3610r819n0408J032R0321k2950l0377j9457J4017J3091
13775d7418l5060o7883m2145N5222Q7165m0883O0916J35810k0800o1014p966l1806
13763a5862j56434k2126J04453M0586L6927l1028pO5003j4379k1615J5536n787
13751d733n047L516o0293l0967k3200J17823l6113K3814N7614N3357K1651q9949
13739B7473k5868K7734M1262N219l1616k6787n3842J3638N1780J1451k9557o2728
13727e1841m436N7565N478m5356M0353j1918l9515O2245M492j9108n9192J5220
13715d6013R1018K0088M5866j4341m6259P761m2454K7616L3156j3999j02022o1180
$$ plain form
13799 145991 150070 135315 140028 124588 -14338 -44556 21043 24399 28072 54543 67652 73254
13787 73254 36697 -9258 -32868 -42687 -93095 -92063 -1742 -24692 -55069 -74526 -60509 -47418
13775 -47418 -82478 -150361 -192506 -137284 -50119 -91002 -30086 105724 84924 23910 15944 -15862
13763 -15862 -172296 -194422 -89969 -49383 -12456 -43484 -43491 21512 7133 -14482 1054 -4733
13751 -4733 -9780 -6264 -66557 -97524 -120724 -2901 -39014 -15200 42414 95771 117422 27473
13739 27473 1605 29339 70601 75820 44204 17417 -36425 -22787 28993 40444 10887 -51841
13727 -51841 -56277 1288 6766 -38590 1763 -10155 -49670 12575 17067 -2041 -61233 -46013
13715 -46013 45005 65093 110959 96618 50359 58120 15666 43282 76438 62439 -39583 -100763
13703a00763l9778o4863N8646R3093Q4593K0931J2012L927K5842k6369l3359l7928
13691d016k9898o0764l9275K1372j2575j3252J35127P7523j6707o0594l0297k0514
13679e3870j6980K6259L9293R661N9033K2510k8238K5971l5925o1484P740R8514
13667I2484j4877n8384j58677n4120O5929j3046M721k0255M5995O4810K6102L1175
13655A1857m7387K3808N2949j00655j4288P137J08181m1408p8724o790j105J05320
13643A8895K8781M8204k6354r3205j11260R126Q2323K5764n8437k6744n2981m1479
13631a97367m7196R5603N0133N5302j1544j23676J6649N2875J6608m4557R5902
13620d1268L3436M7786p2664L4476Q7348K3682n562n0580J1779m9007O7620n21
$$ plain form
13703 -100763 -140541 -205404 -146758 -53665 30928 51859 63871 67798 93640 67271 33912 -4016
13691 -4016 -33914 -94678 -133953 -112581 -125156 -138408 -3281 74242 57535 -3059 -33356 -53870
13679 -53870 -70850 -44591 -5298 4363 63396 85906 57668 83639 47714 -13770 -6030 92484
13667 92484 77607 19223 -139454 -193574 -127645 -140691 -135970 -156225 -110230 -45420 -19318 11857
13655 11857 -35530 -11722 41227 -59428 -73716 -66579 41602 194 -78530 -85320 -86425 18895
13643 18895 47676 95880 69526 -23679 -134939 -125813 -43490 -17726 -76163 -102907 -155888 -197367
13631 -197367 -244563 -148960 -98827 -43525 -55069 -178745 -162096 -109221 -92613 -137170 -41268
13620 -41268 -7832 39954 -32710 1766 89114 112796 107234 56654 68433 19426 87046 86525
13608H6525r6805p5366N1719j3452K8454R0204k2442n0501L2241L4586p4381K1626
13596A2408l102l4456J6352q8949m1612k3400Q504K0153J3887L307n0392K3187
13584a44113K9586l5220k890R0425J6958K3246l1949j09833J10260J57866n1801
13573E2535L3687O2008L4228j05873j5406O1343Q4888k1389j55849p7946J5462
13562c2312M983R7612R3321j0055q1095M9828o2725j02554J3517J6889k3637n5730
13550i1958o5481L3827L0128l0652K0202J43438L4405n0455p453j12299j1245
13539a07543J3514n5510l941p069M7559J16022M9447j5230m9953M1766k6679j1372
13527h989j2310O3732m2020l7307J0842K8333m8040j3207K0248R6256N355j153
$$ plain form
13608 86525 -10280 -85646 -33927 -47379 -18925 71279 48837 -1664 30577 65163 -9218 12408
13596 12408 9306 -25150 -8798 -97747 -139359 -162759 -154255 -134102 -120215 -116908 -167300 -144113
13584 -144113 -114527 -149747 -152637 -62212 -45254 -22008 -53957 -163790 -53530 104336 52535
13573 52535 86222 148230 182458 76585 61179 122522 207410 186021 30172 -47774 -32312
13562 -32312 -27329 70283 163604 153549 72454 122282 59557 -42997 -29480 -12591 -36228 -91958
13550 -91958 -157439 -123612 -93484 -124136 -103934 39504 73909 23454 16001 -96298 -107543
13539 -107543 -94029 -149539 -153480 -160549 -112990 3032 52479 37249 -12704 29062 2383 -8989
13527 -8989 -21299 42433 413 -36894 -26052 2281 -45759 -58966 -38718 57538 62893 61740
13515F1740k3275L1962k7449p5068k8478p6240n5234M4185J25272Q3168j01709
13504d1126j07810N180J14082M8523j8127m0703P4413k9137k7315J2042N7984
13493D8006J3293j5088k0276l2300j68276m1983R2756O2699o5863L7017J3775
13482g6240J7551L3282M1306L7053n7014j0610N4010N7796p9601L96P2568J3629
13470A04126l9936k0829n7793N6161P587M6710n3378j0034J4569K020j6989m633
13458B7581K2204j0007l5800N6625L4211J4273k2056j24662l1703l1752N0020
13447e1066J17818P7214O3j19559k701o4311L0113Q1521j07735r6735J53158O0711
13435G8491k9683j5896k9640l2989m6892O653M2700J096M2422q3253o2987J7937
$$ plain form
13515 61740 38465 70427 42978 -32090 -60568 -136808 -192042 -147857 -22585 60583 -41126
13504 -41126 -148936 -143756 -29674 18849 722 -39981 34432 5295 -22020 -9978 48006
13493 48006 61299 46211 25935 -6365 -174641 -216624 -123868 -61169 -127032 -90015 -76240
13482 -76240 -58689 -25407 15899 52952 -4062 -14672 39338 97134 17533 17929 90497 104126
13470 104126 64190 43361 -14432 41729 49316 96026 42648 32614 47183 49203 32214 27581
13458 27581 49785 39778 3978 60603 94814 109087 87031 -37631 -69334 -101086 -51066
13447 -51066 66752 143966 144029 24470 21769 -42542 -12429 69092 -38643 -135378 17780 78491
13435 78491 48808 32912 3272 -29717 -76609 -69956 -27256 -26160 16262 -66991 -129978 -112041
13423a12041l9670M6176P592k5577m9891j4425O7912K93n6645j036Q1686R2521
13411c105J9817J5218N8272M3905r100n1690o5482p1876k2406R1921O3388J8904
13399H7766J3551Q4750J9437l9218j8466j838k6911j09512m9720L4630N1207l5198
13387A0478l2550L0744j5212k7928J05974L9983r7259n82j4513l6578m6242k893
13375h6578N4800J9857k8914k0085j0259r4607k4168K9077O4712m480j0390Lk5886
13362a36918O9068K5686j9159l449Q8387P6675j7305m4390K7285J9085j5093r5274
13350b5402J865K8572j1719l0099J6067o9645p1214j5606O4619J06794O0984L2763
$$ plain form
13423 -112041 -151711 -105535 -97943 -123520 -173411 -187836 -119924 -119631 -176276 -177312 -95626 -3105
13411 -3105 16712 31930 90202 134107 125007 73317 7835 -64041 -86447 5474 68862 87766
13399 87766 101317 186067 205504 166286 147820 145982 119071 9559 -40161 -5531 45676 10478
13387 10478 -22072 8672 -6540 -34468 71506 111489 14230 13648 -865 -37443 -83685 -86578
13375 -86578 -31778 -11921 -40835 -60920 -71179 -165786 -189954 -160877 -96165 -100645 -111035 -111032 -136918
13362 -136918 -67850 -42164 -61323 -64772 23615 100290 82985 38595 65880 84965 69872 -25402
13350 -25402 -23537 5035 -6684 -36783 -20716 -90361 -161575 -177181 -112562 -5768 55216 87979
$$ [...]
##END NTUPLES=NMR SPECTRUM
##END=
