##TITLE=Analysis number 307170
Compound Code cc 35614
Book Reference 433/33/3
Project Code adrs
Chemist Name victoriam
##JCAMPDX= 6.0         $$ Bruker NMR JCAMP-DX V2.0
##DATA TYPE= NMR SPECTRUM
##DATA CLASS= NTUPLES
##ORIGIN= Bruker BioSpin GmbH
##OWNER= NMR
$$ XWIN-NMR		Version 3.5
$$ Fri Apr 22 09:46:28 2005 GMT Daylight Time (UT+1h)  MAYBRIDGE\NMR@NMR_250MHZ
##.OBSERVE FREQUENCY= 250.131544655141
##.OBSERVE NUCLEUS= ^1H
##.ACQUISITION MODE= SIMULTANEOUS (DQD)
##.ACQUISITION SCHEME= undefined
##.AVERAGES= 16
##.DIGITISER RES= 18
##SPECTROMETER/DATA SYSTEM= dpx250
##.PULSE SEQUENCE= zg30
##.SOLVENT NAME= CDCl3
##.SHIFT REFERENCE= (INTERNAL, CDCl3, 0, 16.522)
##AUDIT TRAIL= $$ (NUMBER, WHEN, WHO, WHERE, WHAT)
$$ ##TITLE= Audit trail, XWIN-NMR		Version 3.5
$$ ##JCAMPDX= 5.01
$$ ##ORIGIN= Bruker BioSpin GmbH
$$ ##OWNER= NMR
$$ C:\u/data/dgb/nmr/ADRS/2050/pdata/1/auditp.txt
$$ ##AUDIT TRAIL=  $$ (NUMBER, WHEN, WHO, WHERE, WHAT)
(   1,<2005-04-22 09:46:08.49 +100>,<MAYBRIDGE\NMR>,<NMR_250MHZ>,
      <created by zg, POWCHK disabled, PULCHK disabled
       configuration hash MD5:
       62 19 C7 07 E1 42 D1 B7 37 6C 3D D0 77 39 F9 E6
       data hash MD5: 64K
       BE D6 DC CF AF 81 B6 1A 6C 33 80 03 03 61 6E CB>)
(   2,<2005-04-22 09:46:19.83 +100>,<MAYBRIDGE\NMR>,<NMR_250MHZ>,
      <Start of raw data processing
       ef LB = 0.3 FT_mod = 6 PKNL = 1 SI = 32K 
       data hash MD5: 32K
       A9 A8 EE B5 21 A6 3D 80 89 22 72 A5 06 06 10 82>)
(   3,<2005-04-22 09:46:21.62 +100>,<MAYBRIDGE\NMR>,<NMR_250MHZ>,
      <apk 
       data hash MD5: 32K
       C6 5A 24 AD 71 2D F9 BA 43 C8 04 DB 0C B6 F3 32>)
(   4,<2005-04-22 09:46:22.30 +100>,<MAYBRIDGE\NMR>,<NMR_250MHZ>,
      <abs ABSG = 5 
       data hash MD5: 32K
       BF 76 6D 45 7D EF 6F 53 FA 54 E3 6D 53 50 13 AA>)
$$ ##END=
$$ 
$$ hash MD5
$$ 46 D1 27 01 DB 2C 88 F2 41 8F 7D F3 44 3B D2 99
##$RELAX= 
##$RELAX= 
##$RELAX= 
##$RELAX= 
##$RELAX= 
##$RELAX= 
##$RELAX= 
$$ Bruker specific parameters
$$ --------------------------
##$DU= <C:\u>
##$EXPNO= 2050
##$NAME= <ADRS>
##$PROCNO= 1
##$TYPE= <nmr>
##$USER= <dgb>
##$AMP= (0..31)
100 100 100 100 100 100 100 100 100 100 100 100 100 100 100 100 100 100 
100 100 100 100 100 100 100 100 100 100 100 100 100 100 
##$AQSEQ= 0
##$AQ_mod= 3
##$AUNM= <au_zg>
##$AUTOPOS= <3 >
##$BF1= 250.13
##$BF2= 250.13
##$BF3= 250.13
##$BF4= 250.13
##$BF5= 500.13
##$BF6= 500.13
##$BF7= 500.13
##$BF8= 500.13
##$BYTORDA= 1
##$CFDGTYP= 0
##$CFRGTYP= 5
##$CHEMSTR= <none>
##$CNST= (0..31)
1 1 145 1 1 1 1 1 1 1 1 1 1 1 1 1 1 1 1 1 1 1 1 1 1 1 1 1 1 1 1 1 
##$CPDPRG= <>
##$CPDPRG1= <>
##$CPDPRG2= <>
##$CPDPRG3= <>
##$CPDPRG4= <mlev>
##$CPDPRG5= <mlev>
##$CPDPRG6= <mlev>
##$CPDPRG7= <mlev>
##$CPDPRG8= <mlev>
##$CPDPRGB= <>
##$CPDPRGT= <>
##$D= (0..31)
0 1 0 0 0 0 0 0 0 0.06 0 0 0 0 0 0 0.0002 0 0 0 0 0 0 0 0 0 0 0 0 0 0 
0 
##$DATE= 1114159567
##$DBL= (0..7)
120 120 120 120 120 120 120 120 
##$DBP= (0..7)
150 150 150 150 150 150 150 150 
##$DBP07= 0
##$DBPNAM0= <>
##$DBPNAM1= <>
$$ [...]
##$SUBNAM7= <"">
##$SUBNAM8= <"">
##$SUBNAM9= <"">
##$SW= 20.6930455092707
##$SWIBOX= (0..15)
0 0 3 0 0 0 0 0 0 0 0 0 0 0 0 0 
##$SW_h= 5175.983436853
##$TD= 65536
##$TD0= 1
##$TE= 295.16
##$TE2= 300
##$TE3= 300
##$TEG= 300
##$TL= (0..7)
0 120 120 120 120 120 120 120 
##$TP= (0..7)
150 150 150 150 150 150 150 150 
##$TP07= 0
##$TPNAME0= <>
##$TPNAME1= <>
##$TPNAME2= <>
##$TPNAME3= <>
##$TPNAME4= <>
##$TPNAME5= <>
##$TPNAME6= <>
##$TPNAME7= <>
##$TPOAL= (0..7)
0.5 0.5 0.5 0.5 0.5 0.5 0.5 0.5 
##$TPOFFS= (0..7)
0 0 0 0 0 0 0 0 
##$TUNHIN= 0
##$TUNHOUT= 0
##$TUNXOUT= 0
##$USERA1= <user>
##$USERA2= <user>
##$USERA3= <user>
##$USERA4= <user>
##$USERA5= <user>
##$V9= 5
##$VALIST= <valist>
##$VCLIST= <CCCCCCCCCCCCCCC>
##$VD= 0
##$VDLIST= <DDDDDDDDDDDDDDD>
##$VPLIST= <PPPPPPPPPPPPPPP>
##$VTLIST= <TTTTTTTTTTTTTTT>
##$WBST= 1024
##$WBSW= 4
##$XGAIN= (0..3)
0 0 0 0 
##$XL= 0
##$YL= 0
##$YMAX_a= 341607
##$YMIN_a= -235221
##$ZGOPTNS= <>
##$ZL1= 120
##$ZL2= 120
##$ZL3= 120
##$ZL4= 120
##$ABSF1= 16.522
##$ABSF2= -4.171173
##$ABSG= 5
##$ABSL= 3
##$ALPHA= 0
##$AQORDER= 0
##$ASSFAC= 0
##$ASSFACI= 0
##$ASSFACX= 0
##$ASSWID= 0
##$AUNMP= <proc_1d>
##$AZFE= 0.1
##$AZFW= 0.1
##$BCFW= 0
##$BC_mod= 0
##$BYTORDP= 0
##$COROFFS= 0
##$CY= 12.5
##$DATMOD= 1
##$DC= 0
##$DFILT= <>
##$DTYPP= 0
##$F1P= 14.0000005364418
##$F2P= -0.99999901652339
##$FCOR= 0.5
##$FTSIZE= 32768
##$FT_mod= 6
##$GAMMA= 0
##$GB= 0
##$INTBC= 1
##$INTSCL= 1
##$ISEN= 128
##$LB= 0.3
##$LEV0= 0
##$LPBIN= 0
##$MAXI= 10000
##$MC2= 0
##$MEAN= 0
##$ME_mod= 0
##$MI= 0
##$NCOEF= 0
##$NC_proc= -6
##$NLEV= 6
##$NOISF1= 0
##$NOISF2= 0
##$NSP= 0
##$NTH_PI= 0
##$NZP= 0
##$OFFSET= 16.522
##$PC= 1
##$PHC0= -61.25996
##$PHC1= -6.258375
##$PH_mod= 1
##$PKNL= yes
##$PPARMOD= 0
##$PSCAL= 4
##$PSIGN= 0
##$REVERSE= no
##$SF= 250.13
##$SI= 32768
##$SIGF1= 0
##$SIGF2= 0
##$SINO= 400
##$SIOLD= 32768
##$SREGLST= <1H.CDCl3>
##$SSB= 0
##$STSI= 32768
##$STSR= 0
##$SW_p= 5175.98343685301
##$SYMM= 0
##$S_DEV= 0
##$TDeff= 65536
##$TDoff= 0
##$TI= <Analysis number 999999
Compound Code 99
Book Reference 9
Project Code 9>
##$TILT= no
##$TM1= 0
##$TM2= 0
##$TOPLEV= 0
##$USERP1= <user>
##$USERP2= <user>
##$USERP3= <user>
##$USERP4= <user>
##$USERP5= <user>
##$WDW= 1
##$XDIM= 32768
##$YMAX_p= 253808269
##$YMIN_p= -1359596
$$ End of Bruker specific parameters
$$ ---------------------------------
##NTUPLES= NMR SPECTRUM
##VAR_NAME=  FREQUENCY,     SPECTRUM/REAL,   SPECTRUM/IMAG
##SYMBOL=    X,             R,               I
##VAR_TYPE=  INDEPENDENT,   DEPENDENT,       DEPENDENT
##VAR_FORM=  AFFN,          ASDF,            ASDF
##VAR_DIM=   32768,         32768,           32768
##UNITS=     HZ,            ARBITRARY UNITS, ARBITRARY UNITS
##FACTOR=    0.157963299565203, 1,           1
##FIRST=     4132.6476996994, 0,             0
##LAST=      -1043.33573715361, 0,           0
##MIN=       -1043.33573715361, -1359596,    0
##MAX=       4132.6476996994, 253808269,     0
$$ Real data points
##PAGE= N=1
##DATA TABLE= (X++(R..R)), XYDATA
$$ [...]
23325c55664M5020J9860K55627M6947k59633o9303R6688k6819p6645j58802o5995
23314e48719l9294J36011M43913L78080J97266p3663k15946j14847K250M747k30439
23303f0641m31474k0722K45459J59767m4498n8350J6576J52355j13240o8586K91639
23292F8285K0452P4750M2124l65829N6388K15456K06864q9752k61062j67731m445
23281b04500m3703J90607K27630K3964l85454j66003j28327M6950K22726K2449
23271a93661L0759o0920K68816K69707j9441K5516M18699J36194j58485m387k31192
23260D81605k26594j92107N8232j38789K74860O8571n097J07528j97894m41097
23250b10782J02548J78770n2978K22532L97k55976J73901k71587J1454n8583K84183
$$ y = [-355664, -310644, -290784, -35157, 11790, -247843, -317146, -220458, -247277, -323922, -482724, -548719, -588013, -452002, -8089, 369991, 567257, 493594, 277648, 162801, 165051, 169798, -60641, -492115, -512837, -267378, -107611, -152109, -210459, -193883, -41528, -154768, -223354, 68285, 88737, 163487, 205611, -160218, -103830, 111626, 318490, 228738, -32324, -200055, -204500, -248203, -57596, 170034, 193998, -191456, -357459, -485786, -438836, -216110, -193661, -162902, -223822, 44994, 314701, 295260, 320776, 739475, 875669, 717184, 712797, 481605, 255011, 62904, 121136, -17653, 257207, 325778, 320681, 428209, 230315, -210782, -108234, 70536, 17558, 240090, 240487, -15489, 158412, -113175, -101721, -160304, 123879]
23239A23879j7335j38119k38342o8996L70794L41633J12945m5598l0693j90728
23229B19440l66028L2671J26128J83993J73518K97128J01145j76814k44528q7140
23219B59513j51405J04162k49247l49909M0511O1937K3800L34608K3507j69018
23209g1541M3107q0670P771J42231K60912Q6991j45083j20830J46252j29566j45303
23198e729J18702n6217N3715j03593O0585j85552k3830K74820J12633k85337l26256
23187c66059n26753Q7254L66683L50205j51584N804K41992j82888j22158k50316
23177e47820L60209K31593m6856N2980O8424j46638j26446j66624J67593N86429
23167D32844j06842k73849Q1588J43046M3822m58901k25904J60147L12017J735
$$ y = [123879, 106544, -31575, -269917, -338913, 31881, 373514, 486459, 440861, 410168, 219440, -146588, -113917, 12211, 196204, 369722, 666850, 767995, 591181, 346653, 259513, 108108, 212270, -36977, -386886, -346375, -284438, -260638, 73970, 97477, -71541, -28434, -109104, -101333, 40898, 301810, 388801, 243718, 122888, 269140, 139574, -5729, 112973, 56756, 110471, 6878, 67463, -118089, -141919, 132901, 245534, -39803, -366059, -892812, -805558, -438875, -88670, -240254, -234450, 7542, -175346, -297504, -547820, -187611, 43982, -2874, 50106, 118530, -28108, -154554, -321178, -153585, 432844, 326002, 52153, 133741, 276787, 320609, -138292, -364196, -204049, 107968, 109703]
23157A09703k30172R6139L00772q3872J37465m6604j16376j09317J08618k06359
23147d0003k22493j30674J32274L25704j91195K84442j4379p5604k85762k89586
23137e07276L12590N02086p9081j35885P2708O5224J33916k24564k61760j40799
23127b62841O7773N996j87172J11690M8385k01643j7133N3832J42585P4089l3983
23116a98422K55445k46595k39896K0897j18905K29601M7442n9781K32629k02081
23106b79666j39354J93163L25942m7470n47544k6099k4964L0052k9348L14665
23096b30623L13030J58901j54893q6180l24996j71240L21349J16477L2488r15
23086b6602K98898m3757k69074m17901K09620J55671L24366m8724r8224J6109
$$ y = [109703, -120469, -24330, 276442, 192570, 330035, 283431, 167055, 57738, 166356, -40003, -262496, -393170, -260896, 64808, -126387, 158055, 143676, 68072, -217690, -507276, -194686, 307400, 228319, 92434, 165142, 230366, 364282, 139718, -122042, -262841, -195068, -189072, -376244, -264554, -216169, -417812, -434945, -381113, -238528, -164439, -198422, 57023, -189572, -429468, -408571, -527476, -297875, -250433, -310214, -77585, -279666, -419020, -225857, 100085, 52615, -494929, -521028, -545992, -515940, -545288, -230623, 82407, 241308, 86415, 235, -324761, -496001, -174652, -58175, -25687, -26602, 272296, 228539, -40535, -458436, -248816, -93145, 231221, 182497, 84273, 100382]
23076A00382M16361r0971l47263o2971Q2480q6097J21648j57257k25958L6572
23066b13074j33688J34991K37873j22931j42055M7284j02574j97199L84819k0326
23056a26880q9595K83572L7611J77115j40670n0768l18273n5847q7466q7117j7818
23045d76136K50626L42107J11634q5083R9435K97541k3129k19947o8140N4973
23035B83881J0068O6299J19212L18386J93809m09119j76364j01662p2526j39261
23025I2723q5944m0373J66143j7179j47040n9383j51308n8810L5084J65962q5020
23014a85145K53322J08153k98001m46136J50395j38314Q8439K21947O4431J34736
23004d6173Q8898J86181Q393j52437j69767k06124k14317j86746m0044j0640M03196
$$ y = [100382, 516743, 425772, 78509, 15538, 98018, 11921, 133569, -23688, -249646, -213074, -346762, -211771, 26102, -96829, -238884, -191600, -294174, -491373, -106554, -126880, -216475, 67097, 104708, 281823, 141153, 90385, -227888, -283735, -371201, -458318, -476136, -225510, 116597, 228231, 143148, 242583, 540124, 516995, 297048, 228908, 283881, 293949, 360248, 479460, 797846, 991655, 582536, 406172, 304510, 231984, 92723, 6779, -33594, 132549, 115370, -31670, -91053, -242361, -301171, -266087, -100125, -185145, 68177, 176330, -121671, -567807, -417412, -555726, -467287, -245340, -180909, -46173, 42725, 228906, 237299, 84862, -84905, -291029, -505346, -692092, -732136, -742776, -339580]
22993c39580P9777j31784r640O0874J47663L69503r6064m9127J11529J73803l1101
22982B85853j39337j49372l05607Q0572M8083K2071k61682r3857P4776L8306J05344
22971b94850q2502P849O216K66366L11635J2537j61831J3894j38785J49504j46593
22960e6560J31365J00990m11031j68595M0492L79796N04k98556J34653j41829
22950b88771J20271m06663m8491q2895J58552L25464L00977j63554l83742k79649
22940g48501K05816K81310L21354M72055J33453j25876l71058l12255j35340O3393
22930b15649r0092L69117J00963J3145l3612l35625L7492M7418o1975J46030K67758
22919B44970k72200k65417O1050N05988J99689l24155j99432K76587o7263k22187
$$ y = [-339580, -259803, -391587, -401227, -340353, -192690, 176813, 80749, 31622, 143151, 316954, 285853, 146516, -2856, -308463, -227891, -179808, -157737, -419419, -513276, -438500, -400194, -294850, -377352, -369503, -363287, -96921, 214714, 227251, 65420, 79314, -59471, 90033, -56560, 74805, 175795, -235236, -403831, -363339, 16457, 16961, -281595, -146942, -288771, -168500, -575163, -623654, -706549, -547997, -222533, 78444, -85110, -468852, -748501, -542685, -261375, 59979, 532034, 665487, 539611, 168553, -143702, -279042, -215649, -305741, 63376, 164339, 177484, 143872, -191753, -154261, -106843, -168818, -22788, 244970, -27230, -292647, -231597, 274391, 474080, 149925, -49507, 227080, 159817, -62370]
22909f2370k4660k8543q9424L36765j34020j52074L04812k12643q3129K2101k54142
22898c77327J10124K81766o1004l28791j94584k4410K19869Q0711p1840P6783
22888b88703j1846l1999j13216J38972l6061J20715j81243l02969K67637L51470
22878h7243J9786J31132l670J34509j84136o2260J77495J36289O8572j16945o1952
22867A51577j4308J41700O8909P7497K01952J27649l37932m56641K7864L8592
22857B6859j74682J46908L03473J51190j34263j45536J52936j28254k80913J19933
22847C7651M415j72965k62033j49410J71968M64519r0138j30000K67410p132q3574
22836E0711J50782k38577J30279l38466n7924J93569J68288O3517j79855k11147
$$ y = [-62370, -87030, -115573, -204997, 131768, -2252, -154326, 150486, -62157, -145286, -123185, -377327, -267203, 14563, -46441, -375232, -569816, -594226, -374357, -293646, -365486, -288703, -300549, -332548, -445764, -306792, -342853, -222138, -403381, -706350, -438713, -87243, -67457, 63675, 60005, 194514, 10378, -51882, 125613, 261902, 330474, 213529, 151577, 137269, 278969, 347878, 425375, 627327, 754976, 417044, -39597, -11733, 26859, -147823, -915, 302558, 453748, 319485, 173949, 326885, 198631, -82282, 37651, 42066, -130899, -392932, -542342, -370374, 94145, 4007, -125993, 141417, 134285, 50711, 201493, -37084, 93195, -245271, -303195, -109626, 58662, 122179, -57676, -268823]
22826b68823p9820J5200j69619k27391K2079j25252L66376m825j34553k08575
22816h15203j44393J78994R6695K99643J28969j47384P5731K53120L1869l0584
22806g2543R9536l72672o8710J10954J06434k01711k96515K98982K93498J89912
22796H7165l42135p9169J45054j44379j21557K66929M51448M1719k93863k33858
22786b22646j90605j24999j50129J88468K70646j63607j38029L38699J98979O9625
22776G6402O2059j76309j18052K4058K13064L4866j86170j33779J71718K88650
22766B56507M1488k13385p8577j04341J81613l0020m40355j45720l448Q9204k34941
22755f81975Q9025J62927j45835Q9904M23741k09197M7358L9544j46156m1010
$$ y = [-268823, -348643, -333443, -503062, -730453, -708374, -833626, -467250, -472075, -606628, -815203, -959596, -780602, -683907, -384264, -255295, -402679, -326948, -73828, -41959, -72543, 26993, -345679, -414389, -303435, -197001, -398712, -695227, -396245, -102747, 87165, -254970, -334139, -189085, -333464, -455021, -188092, 263356, 305075, 11212, -222646, -413251, -538250, -688379, -499911, -229265, -392872, -530901, -192202, 6777, 76402, 138461, -37848, -155900, -131842, 81222, 116088, -70082, -203861, -32143, 256507, 297995, 84610, 6033, -98308, 83305, 53285, -387070, -532790, -536238, -447034, -681975, -592950, -430023, -575858, -485954, -62213, -271410, -224052, -184508, -330664, -371674]
22745c71674j7730J33178J1922J76394J00360M9686J9272q390l47632k88430P9198
22734d63846N36758K25015j85803j0587K92106J15535l67733l41189N3310j69812
22724c16246o8115K33810k9479j70242K09810L41668L31672o7318r3550r6751
22714B75259k35044n4334J67739J19942L2740l33800j9800M16222L65150Q3494
22704H17568k22684j05613j07447l19258l12372J34709O0029J38252k886k76270
22694a95972q2573l50P5264j34708J20993O3714l97235o2053K30054k3467J78251
22683b28082P6920J93370K06982K7942J07038k51328j69411m8208J40073n8501
22673c205o8071l52909J26698j74207R8358o0178O6044p550J10416l29794Q907
$$ y = [-371674, -389404, -256226, -244304, -67910, 32450, 82136, 101408, 93018, -254614, -543044, -463846, 72912, 297927, 112124, 101537, 393643, 509178, 141445, -199744, -146434, -316246, -384361, -150551, -180030, -350272, -140462, 201206, 532878, 465560, 372010, 275259, 40215, -14119, 153620, 273562, 306302, -27498, -47298, 368924, 734074, 817568, 594884, 489271, 381824, 62566, -249806, -115097, -55068, 83184, 80298, -195972, -278545, -278895, -203631, -338339, -217346, -153632, -550867, -612920, -382866, -406333, -228082, -151162, 42208, 249190, 277132, 384170, 132842, -36569, -84777, 55296, -3205, -71276, -424185, -297487, -471694, -373336, -433514, -367470, -375020, -264604, -594398, -585491]
22662e85491M11780K43608N9277J91535q0146q5656k40059J54963j73255k6379
22652a29823Q6540j12081m16391n19K23489K21621K12742M0944k76224j50937
22642c00639J21756K17029K36160j37603J72454l0483k15000n817m6144r9392
22632h7679J26952J55765l29020r1492K18050k7328j46796L66117N7018j57227
22622H4360j4827r1160Q5580K1931l31978Q9126Q4994k63167J55822K83467l38670
22611b34522l4659l5242k5335j80782N3790j14028L104Q6488m9128J3183K41363
22600b75768K54606j07726j43098J31067k16435k05252J7514N16470r8073j71402
22590b98097j60289J13334j12586j10181j0474M99630o4503O9026m7009J65775
$$ y = [-585491, -173711, 69897, 129174, 320709, 240563, 154907, -85152, 69811, -103444, -129823, -43283, -155364, -571755, -572274, -348785, -127164, 85578, 126522, -149702, -300639, -178883, 38146, 274306, 136703, 309157, 278674, 63674, 57857, 11713, -87679, 39273, 195038, -133982, -225474, -7424, -34752, -181548, 184569, 241587, 84360, 69533, -21627, 63953, 85884, -246094, -156968, -71974, -335141, -179319, 104148, -234522, -269181, -304423, -329758, -510540, -456750, -570778, -567674, -481186, -530314, -517131, -275768, -21162, -128888, -271986, -140919, -357354, -562606, -545092, -28622, -126695, -298097, -458386, -345052, -457638, -567819, -578293, -78663, -143166, -74140, -121149, 44626]
22580D4626j18405o2001k35347m496J67732K97384N3688q385K11406J03706l4447
22569D15461k35851j41720j84542p4980j35637M0831K61143l33425N4528K76235
22559e7957L46028L9015q3869j82975l91364j20834K17062j05646j43597M11663
22549g2474j88064q6498J74978J96524o0073J590j95499k63737M859n9488K94376
22538b53506J72403m5662q5660M30020j09655m68189K93740o7911j97840J63063
22528a69197O6880J00205J73151r8337k81027j59742J79299o5218j49159J25503
22518b77642K57416P7334k05108l3890M05362J16674J40898P3277l36115k53658
22508c5452L8356j99031m41194O9213K98777j66820J8350l0585J29349l9048j5687
$$ y = [44626, -73779, -135780, -371127, -375623, -207891, 89493, 143181, 134796, 346202, 449908, 415461, 179610, 37890, -146652, -221632, -357269, -316438, -55295, -388720, -334192, -57957, 288071, 327086, 243217, 60242, -331122, -451956, -234894, -340540, -484137, -72474, -260538, -347036, -172058, 24466, -35607, -34017, -229516, -493253, -488394, -547882, -253506, -81103, -126765, -212425, 217595, 107940, -360249, -66509, -134420, -332260, -169197, -102317, -2112, 171039, 72702, -208325, -368067, -188768, -253986, -403145, -277642, -20226, 57108, -148000, -181890, 223472, 340146, 481044, 554321, 218206, -35452, 2904, -196127, -637321, -568108, -269331, -436151, -417801, -448386, -319037, -358085, -373772]
22497c73772j0015J57875K95263L5610j33371k06874k1197Q3133K14377r2054
22487e1025j1288k1937Q7489k5732o5647r1950l27918j80969m312j60073M9299
22476h04063O3924L40240J42033m7220L4973k70111r0348J09987j26240q3678
22466g30503J96080m21600l47050L55109J32596M1485K32881K13748j99928J74929
22456c52253K01008K6700J44052J98802k1782k91532k376j27405O310K52566O4713
22445I8803m92j96102p5987k15048L61047L99959M9048m62037k55479J42405N0583
22434a03300j25301K02757j78854k24009Q4279J36777j25662K06565r698L2860
22424a03586Q2772L06629J82042l7143n08379j64146J94743k37587n23321K063
$$ y = [-373772, -383787, -225912, 69351, 104961, -28410, -235284, -256481, -173348, 41029, -51025, -62313, -84250, 3239, -22493, -88140, -180090, -508008, -688977, -693289, -853362, -804063, -740139, -399899, -257866, -305086, -270113, -540224, -630572, -520585, -646825, -730503, -534423, -956023, -1303073, -947964, -815368, -773883, -541002, -327254, -527182, -352253, -151245, -124545, 19507, 218309, 196527, -95005, -97381, -224786, -218476, 34090, 98803, 98311, -97791, -173778, -388826, -27779, 372180, 421228, -40809, -296288, -153883, -103300, -228601, -25844, -204698, -428707, -344428, -207651, -333313, -126748, -136446, -103586, -20814, 285815, 467857, 430714, -77665, -241811, -47068, -284655, -807976, -805913]
22414h05913L64027M06996J86926J07525o7318r0368J41294j10214j37633K61368
22404B56690N27127l44026n99781k35639O3733L21504n2785l87725N2982K00365
22394a97555K12905j03733K89462L37235j36269l21512p6632K9049n3823q2996
22384a03869L5375j486j50986j29174m3025k15887L50584L03908O0226k2137j09901
22373b6372q8220k35582Q2639P6559L55268m46976m36658K41119J39180m9909
22363c88952l5609j23739L95677j26116j0092L9163l6998j4799K03947j29221
22353b26739o7871l34749k18959n5013K40548N68007L24853K40299p8359p9795
22343C12222j3479m01929m67109N5780j26959K44630L29634L32401K11895j7837
$$ y = [-805913, -441886, -34890, 152036, 259561, 192243, 101875, 243169, 132955, -4678, 256690, 783817, 439791, -159990, -395629, -331896, -10392, -63177, -450902, -397920, -197555, 15350, -88383, 201079, 538314, 402045, 80533, 3901, 32950, -20873, -103869, -68494, -69980, -220966, -350140, -393165, -609052, -258468, 45440, 105666, 83529, -26372, -114592, -350174, -267535, -190976, 164292, -282684, -719342, -478223, -339043, -388952, -424561, -548300, -152623, -278739, -288831, -249668, -286666, -301465, -97518, -226739, -294610, -629359, -848318, -903331, -662783, -94776, 230077, 470376, 392017, 312222, 298743, -103186, -570295, -514515, -641474, -396844, -67210, 265191, 477086, 459249]
22333D59249k74016J06985j10824Q527j57057k27682M5072J98038L6120J10941
22323A95353Q9568k1421K24793r5955k43159J72818Q3564j96388K55849M40461
22313I05483K02377j93049o93594l93567l3065K59218K8120j56252J30917K21503
22303B78091k38480J01764J52614J50340j77629R1462j40941l61710k29202Q7553
22293b86138r5394K22700J66976j00806Q1656k73882p3743J87510p420j82804
22283c61345L10727L69020J19065N5202J6244l29912k37143J44880j25977l70999
22273d10238P0337L76448J51015q7930k03592k35002l04356k68939L24940N45729
22263d1588L48068J1623l82685j54168k2251j54357L63958k20820j92305J51422
$$ y = [459249, 185233, 292218, 181394, 189921, 32864, -194818, -149746, 48292, 84412, 195353, 284921, 263500, 488293, 392338, 149179, 321997, 405561, 209173, 465022, 905483, 1107860, 914811, 221217, -172350, -205415, 53803, 81923, -74329, 56588, 278091, 39611, 141375, 293989, 444329, 266700, 358162, 217221, -144489, -373691, -286138, -381532, -158832, 8144, -92662, -11006, -284888, -358631, -171121, -178541, -361345, -50618, 318402, 437467, 492669, 508913, 179001, -58142, 86738, -39239, -410238, -339901, 36547, 187562, 99632, -103960, -338962, -643318, -912257, -587317, -41588, 306480, 318103, -64582, -218750, -241001, -395358, -31400, -252220, -444525, -293103]
22253b93103L49169K69190j51799M0901K46691j14936J07595L8206Q5137k84601
22243B92450j50910p1942j25518k55559q0058K4430k3054p3429J56212K41567
22233f5811r7974j00522K77219J36163p4266k04395J74057m23338o8762M03995
22223d3634K55354j60227j97681L9335q9975j63160J92132J73677l1902Q9305
22213F3224R5682J28471K80919J90664j23847l96538k16371l60779J9610L30809
22203A1844K03148q6711k23548L240J00671k59165l99807O9272M1736K25307J98057
22192a15956L27982m7693j37745l1741Q695q2595j52647K92032L4667P6506j39555
22181C1950j34715O3610l9630k29251l064J18908k69494q0857K12215K73783L3838
$$ y = [-293103, 56066, 325256, 173457, 214358, 461049, 346113, 453708, 491914, 577051, 292450, 141540, 69598, -55920, -311479, -391537, -367107, -390161, -463590, -307378, -65811, -163785, -264307, 12912, 149075, 74809, -129586, 44471, -378867, -447629, -43634, 211720, 51493, -146188, -106853, -196828, -359988, -167856, 5821, -26081, 63224, 158906, 287377, 568296, 758960, 635113, 238575, 22204, -338575, -318965, 11844, 214992, 128281, -95267, -92027, 8644, -250521, -650328, -581056, -539320, -314013, -115956, 212026, 164333, 26588, -5153, 3542, -79053, -231700, 60332, 94999, 171505, 31950, -102765, -39155, -78785, -308036, -311100, -192192, -461686, -542543, -330328, -56545, -22707]
22170b2707K02221k05465j56408J18636J43601j24545m5660l0976K05134K92527
22160C76358k0072j26712J8280K6480j43511j9704L8505J66923M9265k56133l8708
22149G0971r8142m4057K70435K26776m58621k27820P8575M1248k02676n1025J11393
22138b82943R8426L44889m81939l65932J64744J79369j29305L7405O99485L46582
22128F10781R8756k69034m42550j01531r0606O8472L41408j71206j81999J93802
22118E6293J23438P8010l02348p6545k79835l0706J56547j13072P2113J38000
22108a78105m7091J15710L96312J66823k356k6100J28822j38719l27953J8921
22098A06264K46096J10379r15j26132p5328j01856J37493k21444J6436q4910l16314
$$ y = [-22707, 179514, -25951, -182359, -63723, 79878, -44667, -90327, -121303, 83831, 376358, 356286, 229574, 247854, 274334, 130823, 111119, 149624, 316547, 365812, 109679, 70971, -27171, -71228, 199207, 425983, -32638, -260458, -181883, -140635, -343311, -394336, -282943, -184517, 160372, -321567, -687499, -522755, -343386, -472691, -435286, 264199, 610781, 709537, 440503, -2047, -103578, -194184, -125712, 215696, 44490, -137509, 56293, 179731, 257741, -44607, -121152, -400987, -431693, -275146, -388218, -316105, -178105, -225196, -109486, 286826, 453649, 451293, 425193, 554015, 415296, 87343, 106264, 352360, 462739, 461824, 335692, 260364, 158508, 296001, 74557, 90993, 6083, -310231]
22087c10231Q6450L8613J64548J42725r492M8872k50568k17947M0898j336m7906
22076c15374J37762J03026o781k26539l55709J13168M34223L35184j02403j97765
22066h1208k26232r6878p0814L13418M797n0166P0698K43156j9775j42673k04219
22055b59896k0788j17688k1127L19802K64386j71086j70208Q7923J0480l42236
22045d20438j18062K25010K15608N2333M5744J25602J02870K35360L05683O483
22035G76193k09474l18046j09124l19318J6348k30528K48772K07781j65402k79928
22025c82726N1524J41446J67569K65410J22565l1960j50018m71755j90391K54959
22015b23377K19774j49673J0199l0037n6565p248L4105j42191j82108M40800R3175
$$ y = [-310231, -223781, -185168, -20620, 122105, 112613, 161485, -89083, -307030, -266132, -267468, -315374, -177612, -74586, -81367, -307906, -663615, -550447, -116224, 218960, 116557, -81208, -307440, -404318, -475132, -161714, -156917, -207083, -136385, 106771, 86996, -55677, -259896, -280684, -398372, -419499, -99697, 164689, -6397, -176605, -88682, -78202, -420438, -538500, -313490, -97882, -45549, 195, 125797, 228667, 464027, 769710, 776193, 566719, 248673, 139549, -179769, -163421, -393949, -145177, 62604, -102798, -382726, -331202, -189756, -22187, 243223, 365788, 333828, 183810, -287945, -478336, -223377, -3603, -153276, -143077, -173114, -229679, -236927, -202822, -345013, -527121, -86321, 6854]
22004F854p7082j68439j60032l72467M45647K62680L2573L58522q3507J4738j73804
21993H5683r4337k16931p6274J73416r1774j8633J95790L36699K8700J74229j66945
21982C29623k22286j96714l13029j03257J05K35105l6071K04211k53356q7620
21972d43289Q8540K42740M65469J96973j54434j49054k23471N8230J45053k80949
21962e4192k23150J12746k57988K15437J58424k937k03130k6375j15522K89588
21952a07099J9065K16100k52247r5917J91624J98451P0222k23727R2706O91O978
21941A16847j20278j24305q9511J01525J76651J70818R3132n42521l07967j76219
21931g01828K78732L47621J0723r0806N1729l5534n9228K82979n9044O0676n2291
$$ y = [6854, -70228, -238667, -398699, -771166, -325519, -62839, -30266, 328256, 244749, 259487, 85683, -8654, -225585, -301859, -128443, -220217, -238850, -43060, 293639, 322339, 496568, 329623, 107337, -89377, -402406, -505663, -505558, -270453, -306524, -102313, -355669, -443289, -354749, -112009, 353460, 550433, 395999, 246945, 23474, 81704, 226757, -54192, -277342, -164596, -422584, -207147, -48723, -51660, -254790, -281165, -396687, -107099, -88034, 128066, -124181, -220098, -28474, 169977, 240199, 16472, 109178, 109869, 116847, -3431, -127736, -217247, -115722, 60929, 231747, 324879, -217642, -525609, -701828, -423096, -75475, -64752, -155558, -103829, -139363, -198591, 84388, 25344, 86020, 33729]
21920C3729j59688O9311P7696l0046J91681j77411l943j32862m4095K18337O9485
21909A12194j36304o6840j7518J18156r9233q472p0433J18179Q9244k48858j20721
21898c30606J31287k9013k29486J98440L21867L00708o1645j99271j57624K07250
21888A51907K4887l23115l23039R7193J50003J3462o5592K93615L12154o3520
21878B67955l9200J39348o7943j7468j59133l0273k8303L45221j01729l49254
21868d0779m3718r7126l3335n3414J58800j12815l5079j33866L42931J83801j70680
21857c5280j42460L5469N05383N346o0021j27216L225j33243j15736k51476k9328
21846c45337L04013r6676j14283J27039L99377j66952k22354j13043K9273J3697
$$ y = [33729, -125959, -56648, 21048, -8998, 182683, 5272, 1329, -131533, -175628, 42709, 112194, -24110, -90950, -108468, 9688, -89545, -98017, -168450, -50271, 38973, -209885, -330606, -199319, -228332, -457818, -259378, 62489, 363197, 301552, 102281, -55343, 151907, 176794, -146321, -469360, -372167, -222164, -208702, -274294, 19321, 331475, 267955, 228755, 368103, 300160, 282692, 123559, 93286, 64983, 410204, 308475, -40779, -84497, -181623, -214958, -268372, -109572, -222387, -257466, -391332, -48401, 135400, -35280, -177740, -142271, 363112, 368458, 308437, 181221, 184446, 51203, -64533, -316009, -345337, -41324, -138000, -252283, -125244, 274133, 107181, -115173, -228216, -198943, -185246]
21836a85246k41590q3009J74973M9764K99358K80742j41193j36364j91158l01808
21826d75531Q2330k54717j06964J0325K39386r796J57652L5420k01234J64884
21816c58245l3372p9220J24799o6796o3416m1425P0868J23647J36478R4661K18418
21805A26397J44074J16638q8616j23794k524k27600O8247k81356k04227k46166
21795g18927L41674M64768J55626J30791M5084k68662m38595K235k05l7331K41265
21784h2277K69890k60048l2083O9174l34017j18724L59577M468n9896O4469j49001
21773b68468m3992M27748n6006l80834j24398o5281M51488K75246j40754j21482
21763d6733K06977o089K78878J86657r0555j46560k11875K4426L9230l1155r3717
$$ y = [-185246, -426836, -509845, -334872, -285108, 14250, 294992, 153799, 17435, -173723, -475531, -393201, -647918, -754882, -744557, -505171, -514967, -357315, -321895, -523129, -358245, -391617, -470837, -346038, -412834, -476250, -517675, -446807, -323160, -186682, -92021, 126397, 270471, 387109, 298493, 174699, 172175, -55425, 12822, -268534, -472761, -718927, -377253, 87515, 243141, 373932, 419016, 150354, -288241, -286006, -286211, -323542, -82277, 187613, -72435, -104518, -35344, -369361, -488085, -128508, -124040, -183936, -119467, -268468, -312460, 115288, 59282, -321552, -445950, -511231, -59743, 215503, 74749, -46733, 160244, 154155, 433033, 619690, 529135, 382575, 170700, 195126, 234356, 203201, 109484]
21752A09484m2008K75274M7423l25929J05800j48837j5904M6020k26619k08714
21742c84010K1275R9220l8528O360j66827j10037J79871K04090K61638L48329
21732D21381M1266J25093j70270k10574k62166j41553O9702J240k88930m72564
21722h87375R2520K55457K45689J79071J03923P8354q1855l65539m3982k75600
21712f99337J18179K53136j8953L52070J74549P260J0818k46516q650J91847q5869
21701D8534O924j52449k37792L8945K76304j31553n56765J79034k2713j12531
21691f64062n7092J32680M26597L54125j74449o5100l8744K56082J40773J0831
21681C21641l82762j92750L8821K28678J62191N3533j55812M5654L74578M8751
$$ y = [109484, 67476, 342750, 390173, 64244, 170044, 21207, 5303, 51323, -175296, -384010, -362735, -263515, -302043, -295683, -462510, -572547, -392676, -188586, 73052, 421381, 462647, 587740, 417470, 206896, -55270, -196823, -127121, -125881, -414811, -887375, -794855, -539398, -293709, -114638, -10715, 67639, -14216, -379755, -423737, -699337, -581158, -328022, -346975, 5095, 179644, 186904, 197722, -48794, -57444, 134403, 48534, 55458, -96991, -334783, -295838, -19534, -151087, -707852, -528818, -551531, -664062, -721154, -588474, -161877, 192248, 17799, -47301, -86045, 170037, 310810, 321641, -61121, -253871, -215050, 13628, 175819, 229352, 73540, 119194, 493772, 542523]
21671E42523j40061l09111k02283r1644j55506j11835Q9248q9976j18513k11811
21661g98969m14359j46268L92733N44829L18706j07855k56675J64986l4780j30659
21651d68311J18679K83259k2623j19520k02741l8263J4951l5695j15339K64579
21641c21024J42576J25985q4305k56310r0672K79723K1665l42231j25736J88453
21631d61876J96584J1465j34226q9119k86483J50689K98794r8545J2876J5247
21621c84594k36742k71316J96481P0013L88773L65972J52859k27763j68056P4715
21611c9658J120j16460k33972j17847m7385J01670J31597J89321L5719q6925k16662
21600c99482J11850J37175R3711J48517j43889r1695K2786M6953O7800j25515
$$ y = [542523, 402462, 93351, -108932, -200576, -356082, -467917, -378669, -468645, -587158, -798969, -1213328, -1359596, -966863, -422034, -103328, -211183, -467858, -302872, -337652, -468311, -349632, -66373, -88996, -208516, -411257, -449520, -434569, -470264, -585603, -321024, -178448, -52463, -136768, -393078, -483750, -204027, -182362, -524593, -650329, -461876, -265292, -253827, -388053, -477172, -763655, -612966, -314172, -412717, -399841, -384594, -621336, -892652, -696171, -626158, -237385, 128587, 281446, 53683, -114373, -39658, -38538, -154998, -388970, -506817, -554202, -452532, -320935, -131614, -95895, -182820, -399482, -287632, -150457, -56746, 91771, -52118, -143813, -121027, -74074, -6274, -131789]
21590a31789j16736o93l9797M8287j82128J87625K59398R6461j29617l45017j89866
21579e43872R1513L26192N0746l09162J06087J78471n0220q6536l0594O2405p842
21568b12812J5403m6315k08825K02868J12651Q4816K04733j30461j70746J64101
21558A5413j05040P2830j31872j23026K8214p2757k59296n5090o3868J25902R6849
21547d71741m5017J58260J02129P05283J34221n41592m56294M6986l073R195j9825
21536c81468j19019k63862M59674K14752M6256p7982J0434J20381R9154j3205
21526I5115k07799j54733l10296J2920j10758R1770K66028P6792K59074K54520
21516B72633q1171k06353L5227k46674j89694J38820K06607o8515j4703k62267
$$ y = [-131789, -248525, -249218, -289015, -240728, -422856, -235231, 24167, 120628, -8989, -354006, -543872, -452359, -126167, -75421, -384583, -278496, -100025, -150245, -236781, -267375, -204970, -212812, -197409, -243724, -452549, -249681, -137030, -52214, 152519, 22058, -148688, 15413, -89627, -16797, -148669, -271695, -243481, -316238, -575534, -630624, -694492, -568590, -471741, -516758, -358498, -256369, 448914, 583135, 41543, -414751, -367765, -370838, -361643, -381468, -500487, -764349, -304675, -89923, -43667, -121649, -111215, 9166, 108320, 95115, -112684, -267417, -577713, -564793, -675551, -583781, -317753, -240961, 18113, 272633, 191462, -14891, 20336, -226338, -416032, -277212, -70605, -139120, -153823, -416090]
21506d16090j11131K15108J46481J74751k2400N5665j41170k6881j78100q9210
21496c92977J92908R2214R3158k04522j49407k15672Q4389P5002O6449J583p6974
21485d33849L50757K6441j99990L1049K86306K14938N6151j97611J49054K86108
21475E69354P2466p6137J62258p8004m52086l37775k70397N4606K93092K66843
21465B04220J08424k53480k30388m3699J77020M11246J308k09690j97980j00605
21455a33624J43750L12660j55177k33438K11141L29824k3151L3663K13580J3149
21445G12377m09424j20154j52273o7940j05899N4807Q1376k17378N1105n631j76869
21434c55903J31803J97091K59903p1788k08562k28800j86143o9680R4868K7011
$$ y = [-416090, -527221, -312113, -165632, 9119, -13281, 42384, -98786, -125667, -303767, -392977, -200069, -107855, -14697, -219219, -368626, -584298, -499909, -424907, -358458, -356875, -433849, -83092, -56651, -256641, -225592, 60714, 275652, 331803, 134192, 283246, 569354, 641820, 565683, 727941, 649937, 197851, -139924, -410321, -355715, -62623, 204220, 312644, 59164, -171224, -214923, -37903, 373343, 374651, 164961, -33019, -133624, 10126, 322786, 167609, -65829, 145312, 475136, 451985, 485648, 699228, 712377, 302953, 182799, 30526, -37414, -143313, -88506, -7130, -224508, -173403, -179034, -355903, -224100, -27009, 232894, 161106, -47456, -276256, -462399, -532079, -437211, -410200]
21424d10200m5655M99831L21759J0928j66226k92973n09047j80134J02785J86672
21414d82260P5052L20188J48551j99043k3221J46077M49877O6942k91950k21691
21404a1478j64367j34735q5494Q5318K36894K79038r8686k31215J7922k25545
21394c32348l48795J68757L53085j6810j01615J55045k46196K9175n7323O7381
21384c29644k88485L38182P7913l91229N6647J71850M0395m06929k58162L00991
21374f88471L99944K51067j75717L1773p9991J27792M4044j96790J70752k1725
21364a37322K79048R8479j843r6813N0065p0698j167m18913m57516J83219K43015
21353c30446J21986q2289l8989K37711K20300p8876k58379j58481M8895J3296
$$ y = [-410200, -455855, 43976, 365735, 376663, 210437, -82536, -591583, -771717, -668932, -482260, -407208, -87020, 61531, -137512, -160733, -14656, 435221, 502163, 210213, -11478, -175845, -310580, -396074, -310756, -73862, 205176, 106490, -124725, -106803, -332348, -681143, -512386, -159301, -176111, -277726, -122681, -368877, -339702, -397025, -329644, -618129, -279947, -202034, -593263, -536616, -364766, -324371, -731300, -989462, -688471, -288527, -37460, -213177, -181404, -261395, -133603, -89559, -286349, -115597, -137322, 141726, 240205, 238362, 141549, 191614, 120916, 119749, -299164, -756680, -573461, -330446, -208460, -290749, -329738, -92027, 128273, 49397, -208982, -367463, -318568, -305272]
21343c05272J69728J55499j13289j80050q7410L42599K18183j12223j98200j62849
21333b73284j95113L38300Q3355J53478J78591R1282j23019l30622m88877j23243
21323f89152K82094O9317j71242m07586q7715P9874M25139M61328J86180O7580
21313B15817k75040Q3946Q4162K49961P2850k53678l76126j10163L338q2567J53262
21302b34238k90514L74016K13542j97170J31932K85093j03623m1861j1928R21
21292A26170r8517R7145l4021j20146J57122p252j56593j93424j61236k55330
21282f46082q790L96555K37801k22639J93867L69345j36831O1704j40459k63310
21272a58839L5159J24825o2283j30884k47715L4205j64220L5144L615l3517J90496
$$ y = [-305272, -135544, 19955, -93334, -273384, -360794, -18195, 199988, 87765, -110435, -273284, -468397, -130097, -46742, 106736, 285327, 376609, 253590, -77032, -565909, -689152, -407058, -337741, -508983, -916569, -1004284, -924410, -499271, -37943, 148237, 215817, -59223, 24723, 108885, 358846, 431696, 178018, -198108, -308271, -304933, -387500, -234238, -524752, -150736, 62806, -134364, -2432, 282661, 179038, 137177, 125249, 126170, 27653, 124798, 90777, -29369, 127753, 120501, -36092, -229516, -390752, -646082, -654872, -258317, -20516, -243155, -49288, 320057, 183226, 244930, 104471, -158839, -123680, 1145, -61138, -192022, -439737, -405532, -569752, -534608, -530993, -564510, -374014]
21261c74014J42336L64301K63708l9795p3507K44583j72484l3405p376m315q480
21250C01552p7672l41109j49124K85760J83515l4382K52530N1028l46707Q4365
21240B09756J7459k72811j46372L66633j01927j48432J54395O1998k31141K94260
21230B03818O459j54831j98510M6788L7398k71962j51555m7974M08814M223J731
21219a15601l7450l6871J78252L6598j47187j17933K70166N2286k13360j52681
21209b83781J5845R3573m4198N8620k92375k97349o808K44563M8866J34758L35653
21198G367M63763k21282k25741k69449r68K63091l26687Q001J80151J61006K1029
21187F0281o495n5117P9995J07530L55260l74395q1550J19377j24984k54664j71777
$$ y = [-374014, -231678, 132623, 396331, 356536, 283029, 527612, 355128, 321723, 314347, 310032, 301552, 223880, -117229, -266353, 19407, 202922, 168540, 421070, 472098, 125391, 209756, 227215, -45596, -191968, 174665, 72738, -75694, 78701, 140699, -90442, 203818, 210277, 55446, -143064, -96276, -58878, -330840, -482395, -530369, -121555, -117332, -115601, -153051, -189922, -11670, 24928, -122259, -240192, 29974, 82260, -131100, -283781, -267936, -174363, -218561, -159941, -452316, -749665, -756473, -511910, -463044, -328286, 7367, 471130, 249848, 24107, -245342, -246310, 16781, -309906, -301905, -121754, 39252, 60281, 53786, -1331, 78664, 186194, 541454, 167059, 85509, 204886, 79902, -174762, -346539]
21176c46539k52237j84586K42525m497Q771r9412L93861M24974m1155P1343n6744
21165A56304m9090M2718m43998o1246J87541J99538O596l51909l8806j28618Q0777
21154d00193N4950K3786O1744K48742J02665l8253j28860J17625L12448p7099
21144B77555j67713k73118r3893j75604j75119J21674K0568Q7624k52315J63397
21134d66944M74663N7951m37610j33550K81472J89749J5229j01150j76714j34228
21124d31132n3301J0492Q1820k2304R6087L09944K24743J57398j61539r51l9672
21113A71585j07576M1192j37218j39113k91368j4573j0034J26812M5127J32820
21103a82346L43321J38668k29311m19930K1232L23927L69336R0291J75195k10049
$$ y = [-346539, -598776, -783362, -540837, -545334, -536563, -635975, -242114, 182860, 141705, 213048, 156304, 107214, 149932, -294066, -355312, -167771, 31767, 38363, -313546, -352352, -480970, -400193, -345243, -321457, -259713, -10971, 91694, 53441, -75419, 42206, 354654, 277555, 109842, -163276, -257169, -432773, -607892, -486218, -465650, -378026, -630341, -466944, 7719, 65670, -371940, -505490, -224018, -34269, -19040, -120190, -296904, -431132, -484433, -473941, -392121, -414425, -318338, -8394, 216349, 373747, 212208, 211257, 171585, 64009, 105201, -32017, -171130, -462498, -477071, -487105, -360293, -315166, -182346, 160975, 299643, 70332, -349598, -328366, -4439, 364897, 455188, 630383, 420334]
21093D20334j63375k72680o2716M2513j13884k47613l831n6495K14571L29857
21083H6681j01454l5920k55970q7460P0915M7582L90796p7436j92858K61474M9817
21072A56167k84654k87480J72401p063Q5153K46338k690l5601J31887m8770j64789
21061c9101R1135k31192J22111K47351L6065n9474k25007j57322R5225L15050
21051A94841K2843j05416K27105n7213l40775j05817j35199k67318O5991O653
21041d94305J48759M820J75687K30163Q2637k66385j65361r6853l39732M6817
21031f73753K47734m23077m3073J15400J15644J21013K53221J37844j5864O9115
21021i5796N3554q1002R1291J67704k2191k24110k98496j28612o1897j72461J90744
$$ y = [420334, 256959, -15721, -78437, -35924, -149808, -397421, -401252, -457747, -243176, 86681, -14773, -50693, -306663, -394123, -323208, -275626, 115170, 37734, -155124, 106350, 156167, -128487, -415967, -243566, -250629, -165476, 80862, 78172, 42571, 174458, 125688, -39101, 52034, -179158, -57047, 190304, 226369, 166895, -58112, -215434, -120209, 194841, 217684, 112268, 339373, 282160, -58615, -164432, -299631, -566949, -500958, -494305, -345546, -340726, -165039, 65124, 147761, -118624, -283985, -380838, -720570, -673753, -426019, -849096, -892169, -776769, -661125, -540112, -286891, -149047, -164911, -95796, -42242, -123244, -31953, 135751, 113560, -110550, -409046, -537658, -599555, -772016, -581272]
21010e81272N06143L2905j66914j17407k6279P8459l6044J68469K51302J00651
21000B10013r4522L31605J54854j29209k31934l94606j78904J21166k01846j64070
20990e77453q9054Q3175K65944K06191N8736j91356j93307j94361l55370K09467
20980g77388M24860p5370j78433l3805K9141J42737K22258O6147l7342K66771
20970D9576J50081K00463N7442r3678j13915N9206J35093l10742j21186J90821
20960B03161K11257k24749k25099K46922O4448p6108k42785P2171P2222j01246
20950A94j82026Q6108N7529k8378J81015Q3701j38793J78707R1359k95351l41417
20939c07352N2046K3158J44537J42612J29306j0003k863j15276k61017m6063n1160
$$ y = [-581272, -75129, -42224, -209138, -326545, -352824, -274365, -310409, -141940, 109362, 210013, 115491, 447096, 601950, 472741, 240807, -153799, -332703, -211537, -413383, -577453, -666507, -583332, -317388, -111197, -52461, -243817, -437124, -631485, -986855, -777388, -352528, -427898, -606331, -640136, -610995, -468258, -246000, -179853, -217195, 49576, 199657, 400120, 457562, 363884, 249969, 309175, 444268, 133526, 12340, 203161, 414418, 189669, -35430, 211492, 275940, 199832, -42953, 29218, 101440, 194, -181832, -95724, -38195, -66573, 114442, 198143, 59350, 238057, 329416, 34065, -307352, -255306, -232148, -87611, 55001, 184307, 174304, 171441, 56165, -204852, -250915, -302075]
20928c02075j11377K05736K22815K1900k42955j94936J31839K20786J30692K66914
20918C49339p7229j65921k16108p6190j69928j41567J85801J78409J06611K08365
20908A81582j13996j53864J05042j56497J34961K15042P3602k0353j18411q9741
20898E7367J91574J95441o5150j28409k81207J23016K33204O2019j08245J05219
20888C84829K07304p0529k78528J78619O9698k8531j79430q9314J19994K86870
20878F00982J47589J69788m9382l22996l65098J37289n0999m8154J22791L01034
20868F42844J07284Q3344l9172N8530n75688j05163L90892M1526M02447j2812
20858I94032j48936L40520M57515J548l23373j75062K07593J98448J82501J23362
$$ y = [-302075, -413452, -207716, 15099, 36999, -205956, -400892, -269053, -48267, 82425, 349339, 272110, 106189, -109919, -186109, -356037, -497604, -311803, -133394, -26783, 181582, 67586, -86278, 18764, -137733, -2772, 212270, 285872, 265519, 147108, 57367, 248941, 444382, 379232, 250823, -30384, 92632, 325836, 387855, 279610, 384829, 592133, 521604, 243076, 421695, 491393, 462862, 283432, 194118, 314112, 600982, 748571, 918359, 868977, 545981, 180883, 318172, 267173, 219019, 341810, 642844, 750128, 833472, 794300, 852830, 277142, 171979, 562871, 604397, 1006844, 994032, 845096, 1185616, 1643131, 1644679, 1321306, 1146244, 1353837, 1552285, 1734786, 1858148]
20848A858148k60636o84664m00288l12286L3395M56740L12752J65493j68612Q0085
20838A080127q1249m6182n481K67279K70361M636j84500K18989O2696k97927N9541
20827A348290O1727P0590k85691l70671n7113L00607J56681l64265k05678R8853
20817G53330J57571k86773l8147J49071m00218k8091J26068O633K06230J27780
20807G73454k07542j29486k1120k7979l49299j15076L29289J60228K43459J85080
20797H41008j41192p0278k17831K2983m8822j4210K17246N8744r4475J32753K67086
20786I53012q8775k37091k24560m12893l99544K89789M97013J21954k81881j14323
20776A02701M1241J24629m0488p4084o1541J17706j02303m74082R2789J98084
$$ y = [1858148, 1597512, 912848, 512560, 200274, 233669, 690409, 1003161, 1168654, 1000042, 1080127, 998878, 952696, 947215, 1214494, 1484855, 1489491, 1304991, 1523980, 1586676, 1288749, 1348290, 1410017, 1480607, 1194916, 824245, 767132, 1067739, 1224420, 860155, 654477, 753330, 910901, 624128, 585981, 735052, 334834, 306743, 432811, 439444, 645674, 773454, 565912, 436426, 415306, 387327, 38028, -77048, 252241, 412469, 655928, 841008, 699816, 629538, 411707, 434690, 385868, 371658, 588904, 647648, 553173, 685926, 953012, 864237, 627146, 402586, -10307, -409851, -120062, 376951, 498905, 217024, 102701, 143942, 268571, 228083, 153999, 92458, 210164, 107861, -366221, -273432, -75348]
20766g5348K85195l3276j88565N272O1978l16162j86122N14672P2148K79846m8355
20755C71283k58517O0503o8367j06505j9027j18806J72133K8490J16945K03950
20745C82082j96606k34004k8169k86447m4931N36915o6448l82473M76603J55470
20735C11992n3481k40943k71563j41186L45493L78425K40034l10124r6952k46490
20725h4795r1519n1652N54912M01745Q7270l22084m37826p1288J71984J04328
20715B61075k11783j62360J46281K46266k03266m0274P4330k08744J96110n0111
20705D7524m24068J10929K19476J22938K78159J4925j14958K10674K20065K02677
20695H88341j43745n16040m18288j81480J53797L27007k6431j80674N9868L17383
$$ y = [-75348, 209847, 176571, -11994, -6722, 55256, -260906, -447028, 67644, 139792, 419638, 371283, 112766, 173269, 104902, -1603, -20630, -139436, 32697, 61187, 178132, 382082, 185476, -48528, -76697, -363144, -408075, 128840, 62392, -320081, 156522, 311992, 258511, 17568, -253995, -395181, -49688, 328737, 568771, 258647, 161695, -84795, -176314, -227966, 326946, 728691, 815961, 493877, 56051, -15237, 156747, 261075, 49292, -113068, 33213, 279479, 76213, 35939, 110269, -98475, 97635, 47524, -376544, -265615, -46139, 76799, 354958, 369883, 254925, 465599, 685664, 888341, 744596, 228556, -189732, -371212, -217415, 109592, 83161, -97513, -37645, 279738]
20685B79738k09520k70427J86232M79588k05546l503N6257j22469j06408k017
20675H1925J96693n8967J18426J23040j59348M693J15298k63431k34033N1730
20665b3974J24032K4236O4088J40325L03865J8254m87168r9993M90356n479r2534
20654D56008j26945J34436O9211l2481j689l4912j58878J3655J19250k86881j30920
20643A9854L60400R2672j09036K1576O0970K29002J49528k07829J68785m06540
20633C79382j01226P092k2971Q4544k32371j48039k4005p7732j85403K45881M07147
20622C32299k17108l75623M2899M75622j3612k88739j24799K12829P7998P5871
20612A97637o613J79214j86637J8233r0074j29308P4029K71523K43813M44776
$$ y = [279738, 70218, -200209, -13977, 465611, 260065, 256562, 312819, 190350, 83942, 81925, 278618, 219651, 338077, 461117, 301769, 306462, 421760, 158329, -75704, -23974, 100058, 124294, 188382, 328707, 632572, 650826, 163658, 63665, 554021, 548542, 456008, 329063, 463499, 532710, 500229, 498540, 463628, 304750, 318405, 437655, 150774, 19854, 380254, 472926, 363890, 385466, 446436, 675438, 824966, 617137, 785922, 379382, 278156, 285248, 262277, 346821, 114450, -33589, -57594, -135326, -320729, -74848, 332299, 115191, -260432, -217533, 258089, 244477, -44262, -169061, 43768, 121766, 197637, 191024, 370238, 183601, 201834, 111760, -17548, 56481, 328004, 571817, 1016593]
20602A016593L560k71452o0586k7010J08593j4568M8310k39888k89880J46800
20592D20472J80679O6359Q6892Q1501r1834j99394r9779L881o78181P1337O00839
20581D42772J99790n9894j67663J00287L2619J21346M05004K75r7308j85983K18996
20570A010241J1607L72808N8378l63062l67073r4583O8773K20211L21623J18683
20560A357606j1319K65750m76012k53239O6799Q5547p0613M1864n26173k19191
20550B61019J30263K31745L47261J26996j5154j38054K21645r4755K26K7733J91285
20539A290210L46824J62206q1430O0209l11j15637J9962Q0614l2100j70922k39112
20528A320513j39104K49091Q1951k61777l4628J63771R2186J71884j33849K41650
$$ y = [1016593, 1020153, 748701, 688115, 661105, 769698, 755130, 803440, 563552, 273672, 420472, 601151, 667510, 754402, 835903, 744069, 544675, 444896, 448777, -229404, -158067, 442772, 642562, 582668, 415005, 515292, 547911, 669257, 1074261, 1074536, 977228, 791245, 1010241, 1021848, 1394656, 1453034, 1089972, 722899, 628316, 697089, 917300, 1238923, 1357606, 1346287, 1612037, 1136025, 882786, 949585, 1035132, 964519, 1006383, 480210, 261019, 391282, 623027, 970288, 1097284, 1082130, 944076, 1165721, 1070966, 1071192, 1098925, 1290210, 1637034, 1799240, 1717810, 1778019, 1777708, 1662071, 1682033, 1762647, 1730547, 1559625, 1320513, 1181409, 1430500, 1512451, 1250674, 1216046, 1379817, 1472003, 1643887, 1510038, 1751688]
20518A751688o4760l67900k07792j33417n8761j78940K90705J55856J17837Q7531
20508A392047J83078J91000k21838m2679J0707n8419j14156l23049L02164J81014
20498A499869j38130m54840M7666j08852k16041K54986J26541j57162j62392K72501
20488I64146J01948J70591K85051L9098k23464j53920j7188J01336J81453J09415
20478A558466J43789j62923J1399q5057l9830J67579L03815K26462K49414m01103
20468A972011l27762P6563m17051m75405K9120L50389L24190K04982K15990j65329
20458A787698j46083m18263K41504K28026L3870L52714m2551l8969j06544k96394
20448A595008j23372J66378L65656J99612o9443J39889j65952j20802J15827k2434
$$ y = [1751688, 1686928, 1319028, 1111236, 977819, 919058, 740118, 1030823, 1186679, 1304516, 1392047, 1575125, 1766125, 1544287, 1501608, 1512315, 1453896, 1339740, 1016691, 1318855, 1499869, 1361739, 906899, 954565, 845713, 629672, 884658, 1011199, 854037, 691645, 964146, 1066094, 1236685, 1521736, 1560834, 1337370, 1183450, 1166262, 1267598, 1449051, 1558466, 1702255, 1539332, 1550731, 1465674, 1425844, 1593423, 1897238, 2123700, 2373114, 1972011, 1644249, 1720812, 1303761, 828356, 857476, 1207865, 1532055, 1737037, 1953027, 1787698, 1641615, 1223352, 1464856, 1692882, 1726752, 2079466, 2036915, 1997946, 1891402, 1595008, 1471636, 1638014, 2003670, 2203282, 2133839, 2273728, 2107776, 1986974, 2102801, 2080367]
20438B080367K72208Q1024J01494j90353M057L76122l6731J51628L0193k52642
20428B617367K27905K99090k13087p0839J70529J75253J1442k45078k4898K93459
20418C241143J96464J8418M3843j387J23680P6347n3296J66165J25571P428k39937
20407C704439l14675M89627M36666M8380o7645m14109K39321P2194N2495n1722
20397D194971M56079L59764p3106n39400k95720L76747L00393M05607L38874j50252
20387E373957J8939L23135M87632m0239j15619L40123O61491j05398q6638j05798
20377F751585J05346L38909K48675M40304L61063J29286q1927j09061j32667P5004
20367H126517Q59208M96751K68743J39060j57610m8471L3934q1176L65144N45415
$$ y = [2080367, 2352575, 2433599, 2535093, 2344740, 2348797, 2724919, 2688188, 2839816, 2870009, 2617367, 2845272, 3144362, 2931275, 2860436, 3030965, 3206218, 3217660, 2972582, 2947684, 3241143, 3437607, 3456025, 3499868, 3498481, 3622161, 3698508, 3645212, 3811377, 3936948, 3944376, 3704439, 3389764, 3879391, 4316057, 4364437, 4296792, 3882683, 4122004, 4194198, 4246693, 4194971, 4651050, 5010814, 4937708, 4398308, 4102588, 4479335, 4779728, 5185335, 5524209, 5373957, 5392896, 5716031, 6203663, 6163424, 6047805, 6387928, 7049419, 6944021, 6857383, 6751585, 6856931, 7195840, 7444515, 7884819, 8245882, 8375168, 8293241, 8184180, 8051513, 8126517, 8985725, 9482476, 9751219, 9890279, 9732669, 9684198, 9718132, 9636956, 10002100, 10547515]
20357A0547515M73470K33072M75198O12125L11659O07807P43072N62039M03124
20348A4969081K88805N59230N37002P52077P72289J105910Q55162O90940R66797
20339B1497293J243439J109239J026735R58409R84703J641533J370003J266492
20331C1097846J521428K000878K063855K213970K241175K666676K789139K815421
20323D9410388L148727L635499L923004M644235N287034N812601O303121P400853
20315H9565462Q159546Q549919R863494J1094977J2116279J2675143J3442176
20308A65466996J3293692J2391899J1312515R986357Q051922O108573M091459
20301B30703413K153957N70815n28527r30079j214149j995362k128523k479743
$$ y = [10547515, 11020985, 11254057, 11729255, 12341380, 12653039, 13260846, 14003918, 14565957, 14969081, 15257886, 15817116, 16354118, 17106195, 17878484, 18984394, 19839556, 20530496, 21497293, 22740732, 23849971, 24876706, 25835115, 26819818, 28461351, 29831354, 31097846, 32619274, 34620152, 36684007, 38897977, 41139152, 43805828, 46594967, 49410388, 52559115, 56194614, 60117618, 64761853, 70048887, 75861488, 82164609, 89565462, 97725008, 106274927, 116138421, 127233398, 139349677, 152024820, 165466996, 178760688, 191152587, 202465102, 212451459, 220503381, 226611954, 230703413, 232857370, 233428185, 232899658, 231969579, 230755430, 228760068, 226631545, 224151802]
20293B24151802l585627m115610m348488m687448m897875m217048m187620l275867
20285A90836219j578333q01515Q26800K011976K912842L476389M540126N197032
20277B07421536N408070N455065M858261M878031M158581M036809M371864L871372
20269B44459589L383781K836052J801035K44118k239335m451828o752762q260813
20261B31019837j0305842j1804056j2097069j2484773j2106212j1789352j0964303
20254A49468230j0406099j0172090r156775q571377p699894o683853o127721n819906
20246H4830515n537670n245031m605805l751561l652878l491591l276816l051429
20238E2217734k726022k387663k257755k704421k439126j856675j490398j855690
$$ y = [224151802, 220566175, 216450565, 212102077, 207414629, 202516754, 198299706, 194112086, 190836219, 189257886, 188456371, 189283171, 191295147, 194207989, 197684378, 202224504, 207421536, 212829606, 218284671, 223142932, 228020963, 232179544, 236216353, 240588217, 244459589, 247843370, 250679422, 252480457, 252724575, 250485240, 246033412, 239280650, 231019837, 220713995, 208909939, 196812870, 184328097, 172221885, 160432533, 149468230, 139062131, 128890041, 119733266, 111161889, 103461995, 96778142, 90650421, 84830515, 79292845, 74047814, 69442009, 65690448, 62037570, 58545979, 55269163, 52217734, 49491712, 47104049, 44846294, 42141873, 39702747, 37846072, 36355674, 34499984]
20230C4499984j632439j539653j889299j297429j268780j033895r83122r71423
20222B3883944j110161q59870j276703r37364n42711m60200n78112m98376n74602
20213A7045845r16860o36177p24192o53976n37527o47428l34594j54030l03853
20204A2137208l72380o04474n38530k22707l58110m03727k19871k12439l24269
20195H880701k9020l56115l96954l52845j51009N3454k52086o671j82526l8634
20185G168295k8124k68447k95459K7496j62012k24241j70915j37426K69778k30533
20175E948412o4550l2770k54135l00476o3326R6136P9993J17165m11722k13404
20165D901323k02794J49219j10952k81268J54191R0308r7201j31399j48267J2862
$$ y = [34499984, 32867545, 31327892, 29438593, 28141164, 26872384, 25838489, 24855367, 23883944, 22773783, 21913913, 20637210, 19699846, 19157135, 18696935, 18118823, 17620447, 17045845, 16128985, 15492808, 14768616, 14114640, 13577113, 12929685, 12595091, 12441061, 12137208, 11764828, 11160354, 10621824, 10399117, 10041007, 9637280, 9417409, 9204970, 8880701, 8851681, 8495566, 8098612, 7745767, 7594758, 7648212, 7396126, 7389455, 7206929, 7168295, 7140171, 6871724, 6576265, 6603761, 6441749, 6217508, 6046593, 5909167, 6178945, 5948412, 5883862, 5851092, 5596957, 5296481, 5233155, 5329291, 5409284, 5526449, 5114727, 4901323, 4698529, 4847748, 4736796, 4455528, 4609719, 4700027, 4602826, 4471427, 4323160, 4336022]
20155D336022j38959m11332k70337L2814l5813J45845J02467k67468o2908R1770
20145C522101K55111J82203o6681K22494j07640k11739k14156j18458j72361K58522
20135C549396J56284J51153j08670M0975m676j25960j08724j98911J46053k98868
20125C198052j31754l05721j92857N1905p5153M67L71970K31781k74901p1808
20115B801981L4933j8883j70667K7985r061O5380k3107k68664K0621j81340k97191
20104A981987K175K7249K97233O9922j79734k64354J42212K90804j81577l18415
20094A867502j4285q8798k53668K8326L61332J41631j47998k79064j79921K78454
20084A713511P4112K25158k00648k40971l1129J23176J42159J18196j86399j80825
$$ y = [4336022, 4197063, 3785731, 3515394, 3548208, 3512395, 3658240, 3760707, 3493239, 3430331, 3522101, 3777212, 3959415, 3892734, 4115228, 4007588, 3795849, 3581693, 3463235, 3290874, 3549396, 3705680, 3856833, 3748163, 3789138, 3784462, 3658502, 3549778, 3350867, 3496920, 3198052, 3066298, 2760577, 2567720, 2619625, 2544472, 2544939, 2916909, 3148690, 2873789, 2801981, 2836914, 2818031, 2647364, 2675349, 2666288, 2731668, 2708561, 2439897, 2460518, 2279178, 1981987, 1984162, 2011411, 2308644, 2378566, 2198832, 1934478, 2076690, 2367494, 2185917, 1867502, 1853217, 1764419, 1510751, 1539077, 1900409, 2042040, 1894042, 1614978, 1435057, 1713511, 1787623, 2012781, 1812133, 1571162, 1540033, 1663209, 1805368, 1923564, 1737165, 1556340]
20074A556340J11867k52397q1719K07675l9604l6479J10913K45174j7096j95170
20064A609504N1016L09513j70529o34768l07712o6627K92980K36627k584K8835
20054A346255l4119l64145n6187N1580J16585q6936J39497M58276k4814r9852
20044A446140j58490m90881j08615K43909K48369j69493j74213o7305J67706N991
20034I43118j91586j90894k61872O6162j16332R0089M28534J43809Q0020J34987
20024A126035L9189l22041j91932K22157j41961l0471J92127J50051j43418l7195
20014H62541j01047j60370k54100K12394K01150K11845J56305k43334N1497N229
20004I42110j13404R4881M0727j68672j40317R26K35595K11972j67881r8491P9622
$$ y = [1556340, 1668207, 1415810, 1334091, 1541766, 1502162, 1465683, 1576596, 1821770, 1804674, 1609504, 1660520, 1970033, 1799504, 1164736, 857024, 790397, 1083377, 1320004, 1317420, 1346255, 1312136, 947991, 891804, 943384, 1059969, 973033, 1112530, 1570806, 1545992, 1446140, 1287650, 796769, 688154, 932063, 1180432, 1010939, 836726, 769421, 937127, 943118, 751532, 560638, 298766, 364928, 248596, 338685, 767219, 911028, 991048, 1126035, 1165224, 843183, 651251, 873408, 731447, 700976, 893103, 1043154, 899736, 862541, 761494, 601124, 347024, 559418, 760568, 972413, 1128718, 885384, 936881, 942110, 828706, 923587, 964314, 795642, 655325, 656251, 891846, 1103818, 935937, 837446, 917068]
19993I17068j37642J50223l84802k38252j97769M03628J05694L6835K79341P6385
19983A010709J37080j37449o44320J59483p25J06737j33132N32273J88993j1717
19973A207932m9675q2767K13236L94123K32646l20374m69985k1653O3535j45064
19963A021954j79258J96227L02941l90312N1452K40202O6034J48838n0412j32248
19953A275418l54086n38902J47931L79770K34084J44347j34678J15406j80405
19944A088885k35807k30819J27177L18040j46334k12793q9336l03116K46374k5641
19934E36630j04683j37927l18195k43995J77329J64352k74293J09474Q5137J48113
19924A41942K11451j17873j95620M5463K72335l3549R2408K50400K1747l56340
$$ y = [917068, 779426, 929649, 544847, 306595, 108826, 512454, 618148, 654983, 934324, 1010709, 1147789, 1010340, 366020, 525503, 524778, 631515, 498383, 1030656, 1219649, 1207932, 1158257, 1075490, 1288726, 1682849, 1915495, 1595121, 1125136, 1103483, 1167018, 1021954, 842696, 1038923, 1341864, 951552, 1003004, 1243206, 1309240, 1458078, 1407666, 1275418, 921332, 382430, 530361, 910131, 1144215, 1288562, 1153884, 1269290, 1088885, 853078, 622259, 749436, 1067476, 921142, 708349, 619013, 315897, 562271, 536630, 431947, 294020, -24175, -268170, -90841, 73511, -200782, -91308, -6171, 141942, 353393, 235520, 39900, 85363, 357698, 324149, 416557, 666957, 688704, 332364]
19914C32364k24962L49372J75970n870j56106r4967n9034K7749K61165J90164
19904G95845l73839k13022M07o3041K56106J08725r8066J56968J30406L81327
19894A081816Q3051k81677k69160Q1283K88443m4780j86242j13267p4637l18137
19884B46693m78146J24160J17117J26416p3334R6850O4692j81918K3242L01066
19874C66838j85331j54703L7932N9126N39066J99154l4473l68338j52766L07218
19864F13723m3404j88541n0233r5471P4872K39436j60762j62774R8745j64422
19854A61169k49696J63116R7866j2407K9369M69084K26966l60222n09024p3492
19844e7271K22863J56609k79223j76914K15889L27257r135j59695j47279N8257
$$ y = [332364, 107402, 456774, 632744, 626874, 470768, 375801, 316767, 344516, 605681, 795845, 422006, 208984, 209391, 146350, 402456, 511181, 413115, 570083, 700489, 1081816, 1164867, 883190, 614030, 695313, 983756, 938976, 752734, 639467, 564830, 246693, -231453, -107293, 9824, 136240, 62906, 159756, 224448, 42530, 65772, 366838, 181507, 26804, 64736, 123862, 662928, 862082, 827609, 459271, 306505, 613723, 570319, 381778, 331545, 236074, 310946, 550382, 389620, 226846, 325591, 161169, -88527, 74589, 172455, 160048, 189417, 658501, 885467, 525245, 16221, -57271, 165592, 322201, 42978, -133936, 81953, 409210, 400075, 240380, 93101, 151358]
19834A51358J75106L29975K11640j76171j02775J64719J319J5935l33519n14151
19824g6564j10451J93654K30881Q5750M00703k46875m59829M1357J76666l78657
19814a43365n2859N03851L84511q1133k53315J3197J77004O9216O8945q7259k52658
19803C46135j16683J4948N8905k09882q9373J95886L78913K29975M6426J3556
19793H68806p4632k64438k79420P0134N2243j15241m05396J98175L65119j25904
19783B89446J11192o4040m09L28392M65473j96948l21414J06720j56281l22698
19773B39433J9073J98356J67003m6444n0760P6461O8311J44712P4276j31223o3205
19762F95993j64151L7179n9947J25873k2899K46476m1948K7705q1766J44021K53039
$$ y = [151358, 326464, 656439, 868079, 691908, 589133, 753852, 755171, 771106, 437587, -76564, -187015, 6639, 237520, 323270, 723973, 477098, 17269, 58626, 235292, -143365, -196224, 307627, 692138, 611005, 357690, 370887, 547891, 617107, 686052, 598793, 346135, 229452, 244400, 303305, 93423, 4050, 199936, 578849, 808824, 855250, 868806, 794174, 529736, 250316, 320450, 372693, 257452, -147944, 50231, 415350, 289446, 400638, 336598, 336189, 664581, 1130054, 933106, 611692, 718412, 562131, 239433, 258506, 456862, 623865, 577421, 526661, 603122, 671433, 816145, 890421, 759198, 695993, 531842, 569021, 509074, 634947, 612048, 858524, 816576, 844281, 762515, 906536, 1159575]
19751A159575k1559n1681L6228n281k6861J3547J35595K64449l8407l55059k28444
19740H82102K24476J72744K890J83373J53244l15114L04114L89108r7712O276
19730A905501j27520j52987j65169k54403j697J5371k90506j37362L4336J19339
19720I44903P0014j35622N49013L94914p3219m0545L28398K6523k44152k74603
19710A545624M4849p158P3149J61306j47101J48335o3471O7974q6624k40200N5867
19699A552550J76872J06992K6108r6391l81476j81124P2770K7657K88462k1686
19689A570734k07474l47403l08229k4119j59102N4860K8952Q7270r3823J00351
19679G02017j51420J82774K27816J27810j17498j66544l25195l45230l07158N8376
$$ y = [1159575, 1138016, 1086335, 1122563, 1117282, 1090421, 1103968, 1239563, 1504012, 1465605, 1110546, 882102, 1106578, 1279322, 1282212, 1465585, 1618829, 1303715, 1607829, 1996937, 1899225, 1905501, 1777981, 1624994, 1459825, 1205422, 1203725, 1219096, 928590, 791228, 825564, 944903, 1014917, 879295, 1428308, 1823222, 1750003, 1709458, 2037856, 2064379, 1820227, 1545624, 1590473, 1583315, 1656464, 1817770, 1670669, 1819004, 1755533, 1823507, 1736883, 1496683, 1552550, 1729422, 1836414, 1862522, 1766131, 1384655, 1203531, 1276301, 1303958, 1592420, 1570734, 1363260, 1015857, 707628, 683509, 524407, 579267, 608219, 695489, 601666, 702017, 550597, 733371, 961187, 1088997, 971499, 804955, 479760, 134530, -172628, -114252]
19669a14252J72672L1799J25385L23166m7812k20386L805n259n6306K71580K33147
19658G17539j35991l34594j50982j07915p7832K99629P3507P5499K24992J27045
19648G10897n86741p7858J50270Q5164O1290J38279J67832L1145j50176l88219
19638A41883O6238k2342R136k24845k64531J17769R7782Q8440M3654J16460J87187
19627C56831R8218j3524L03112j35176j80048k09622J06772J26641J00200k00192
19617C53212J74056J85699l92062n07538l37711K41209L62436L88032j48280j69172
19607A49881j10576J56808Q1971J13911J95708j62282l42968j7249K62183n3591
19597B73796k09666K44803K37048O7760k22069o2908L8283K7820m51844k28747
$$ y = [-114252, 58420, 90219, 215604, 538770, 490958, 270572, 274377, 269118, 212812, 484392, 717539, 581548, 246954, 95972, -11943, -89775, 209854, 283361, 358860, 583852, 710897, 124156, 46298, 196568, 281732, 343022, 481301, 649133, 680278, 530102, 141883, 208121, 185779, 194915, -29930, -294461, -176692, -78910, 9530, 53184, 169644, 356831, 455049, 441525, 744637, 609461, 429413, 219791, 326563, 453204, 553404, 353212, 527268, 712967, 320905, -186633, -524344, -283135, 79301, 467333, 319053, 149881, 39305, 196113, 278084, 391995, 587703, 425421, 82453, 65204, 327387, 273796, 64130, 308933, 545981, 613741, 391672, 328764, 367047, 394867, -56977, -285724]
19587b85724p4487K78160K02159J30498j33457L02574R0920j91713j66255j42563
19577A0112k83105L9338K31111q18j66703R7250k9683l15J77669P4657J7557k68701
19565a01631J24532K44340k53100m56544O7644J97642J53066J14155J36809M00650
19555F27563K31031l0375k26092k70245l32634k14474n5826J06080M44358j15237
19545A64149l17459j88479p2776M7121j78600L45362j22810j07028j9106L13366
19535a36260M86165R9778m50J33585j02137m36956L24858N14832k58614J5190
19525F39991n8076k94252k68475k17772J06531k61146j61019R4828L43464K55417
19515A79491J50244r9750L26440Q7058m78889k89625O7526J33017j13368j04435
$$ y = [-285724, -360211, -82051, 120108, 250606, 117149, 419723, 510643, 318930, 152675, 10112, -272993, -233655, -2544, -3362, -170065, -72815, -102498, -102813, 74856, 149513, 167070, -101631, 22901, 267241, 14141, -442403, -374759, -177117, -24051, 90104, 226913, 627563, 858594, 828219, 602127, 331882, -752, -215226, -271052, -164972, 279386, 164149, -153310, -341789, -414565, -367444, -546044, -200682, -323492, -430520, -449626, -136260, 349905, 449683, 449233, 582818, 480681, 43725, 368583, 883415, 624801, 639991, 581915, 287663, 19188, -198584, -92053, -353199, -514218, -419390, -75926, 179491, 329735, 229985, 556425, 643483, 164594, -125031, -57505, 75512, -37856, -142291]
19505a42291J26909K65840J53082k02524J72782K1140k76373k73043j23183j20354
19495c98015J83882J20991j56905l4481j04019K54533J50202M88732Q5700j07702
19485D82918k43199J28574R9130j26983J718J27226J72981l51087l03772j69033
19475a81527l1008L4004L03629J62504J85232j87659n3765J97520k1367q2905
19465C24658l9467J33283j46276j68943P6910M73430J41690l84515m56459k9485
19455g5174K15814O0715l57130j73752J73268k7000k32089k6409J3383m117L02392
19444a30099J65631J40765K77773J16278j21548P3657J71307L30486k11181n33439
19434B79630k46630J93481j80152k4378q1686n0701q9260K24523K04920M8406
$$ y = [-142291, -15382, 250458, 403540, 201016, 373798, 394938, 118565, -154478, -277661, -398015, -214133, -93142, -250047, -284528, -388547, -134014, 16188, 504920, 590620, 482918, 239719, 368293, 467423, 340440, 342158, 469384, 642365, 291278, -12494, -181527, -212535, -178531, 125098, 287602, 472834, 285175, 231410, 428930, 407563, 324658, 285191, 418474, 272198, 103255, 180165, 653595, 795285, 410770, -45689, -75174, 140640, 201355, -155775, -329527, -156259, -183259, -415348, -441757, -428374, -432491, -130099, 35532, 176297, 454070, 570348, 448800, 522457, 693764, 1024250, 813069, 279630, 33000, 226481, 46329, 21951, -59735, -110436, -199696, 24827, 229747, 278153]
19424B78153j34035k72758j89955k46278r7853O04842K77805P6933N3773r1281
19414B59346k5974k46638m2041L804J58340J92209k77920m7608M47533J6617l53286
19403H4382Q3714R1922j7841M8893J1047k4554J80517J07691q7351Q0404k44108
19392C14716k18930J57906P6608P7509K0939K32707N4835j2885j2168J22336k23255
19381E90318n21740l3068j56308k56434k7590K19223j33970Q745j10058L55312
19371f5570M63177j33581o7631j06300L39071R8762m84673k6746L96814L34172
19361G47495N7787N5813J08156k53001m85861k77606K37169J70588Q4337M7083
19351D91960l81458m51661K48083P7280L2336k62018L16734m3811k11339R2898
$$ y = [278153, 144118, -128640, -318595, -564873, -662726, -57884, 219921, 296854, 350627, 259346, 233372, -13266, -55307, -51503, 106837, 299046, 21126, -26482, 421051, 437668, 84382, 168096, 260018, 242177, 291070, 302117, 277563, 458080, 565771, 478420, 558824, 314716, 95786, 253692, 330300, 407809, 428748, 661455, 716290, 703405, 691237, 813573, 590318, 68578, 35510, -120798, -377232, -404822, -185599, -319569, -310824, -420882, -65570, 397607, 264026, 196395, 90095, 429166, 527928, 43255, 16509, 413323, 747495, 805282, 861095, 969251, 716250, 230389, -47217, 189952, 360540, 444877, 491960, 110502, -341159, -93076, -15796, 16540, -245478, 71256, 27445, -183894, -90996]
19341i0996J48177J7112j72239j70897j2714K61379K94289r8181O9680j48072
19331I7538j50655M60419K1882k3054n8993j65945P9966j27360j23606m29509
19321d19317j43465J45874K61328M4211m97591m0591R7916K52112Q1606P9825
19311a38092J8846M0186j52866K89508O4030l42386r3866J06790K98502K68331
19301C58983J14351k48038k80209K09287k5406K24558J3370j31178J58384J89625
19291E83727m06047k23404j4346j91125j01080m61930n6140L93394M11640L39374
19281B74063J63501l42445l03544L55291K82201o9756K59862l7061j22620n17980
19271e8488m53485L9074K67684J78979Q9320L68962M16576j89695m03351k09248
$$ y = [-90996, 57181, 74293, -97946, -268843, -281557, -20178, 274111, 175930, 245610, 97538, -53117, 407302, 429184, 406130, 347137, 181192, 261158, 133798, 10192, -419317, -562782, -416908, -155580, -111369, -608960, -649551, -551635, -299523, -217917, -138092, -119246, -79060, -231926, 57582, 121612, -220774, -314640, -207850, 90652, 358983, 473334, 225296, -54913, 154374, 128968, 353526, 366896, 235718, 394102, 583727, 177680, -45724, -60070, -251195, -352275, -814205, -870345, -476951, -65311, 274063, 437564, 95119, -208425, 146866, 429067, 359311, 619173, 582112, 459492, -58488, -511973, -472899, -205215, -26236, 63084, 432046, 848622, 658927, 255576, 46328]
19261D6328K56465R3863O576J43145o876N5720j83165l4265Q1742j57711j75789
19250A26033J78344O1870k95364o073P4384M5308O0373k49114M2158k88320j18348
19239c68749M5684M51299M16080J63126n0355p6569j8963j14637k05792l0228
19229B10896k3104k22695Q6056J6677j26974j69027k0259N8587M2592K74255P4001
19218B01005P2420k7987j37387K9610j82523J12893L2629L3135k1183k12702q5968
19207a86058o6591m1539K68336K46770j05552K01230P9337j8870q4046l16720
19197b3703l42729M29257J47616L51261P2087k00950j92422K60090J36594j16965
19187E20136r2135J11993k88397j65625J53069k7960l85788j54073k70351J65941
$$ y = [46328, 302793, 396656, 403232, 546377, 539501, 595221, 412056, 377791, 459533, 301822, 126033, 304377, 366247, 70883, 64810, 139194, 184502, 244875, -4239, 37919, -250401, -368749, -323065, 128234, 544314, 707440, 657085, 580516, 561553, 446916, 241124, 210896, 187792, -34903, 51153, 67830, -59144, -228171, -248430, -189843, -147251, 127004, 201005, 273425, 245438, 108051, 137661, -44862, 68031, 100660, 133795, 112612, -100090, -186058, -252649, -294188, -25852, 220918, 115366, 316596, 395933, 377063, 293017, -23703, -366432, 62825, 210441, 561702, 633789, 432839, 240417, 500507, 637101, 520136, 428001, 539994, 251597, 85972, 239041, 211081, -174707, -328780, -599131, -433190]
19177d33190K92013K47160P6533k157k19452k7924J48991Q0327J01842K65539
19167E29682o4628p5028k07044p7308l49969R6326J53812k30394O8841K32819
19157G7109J933J24615k1435R7562j84395k07866Q8558M97493M34719k97131n82816
19146B8346k23204r4340K88977M82404K33224p1553P0790l70836j97323j16264
19136C0221L8387J54627m8334q8495J73030j55625J7275P8869L53576j18433l74444
19125F0654R550j35640J3349N39220N8426k03131j30225j19339J64686R1605o4690
19114B84465n10469k9520O7123m3721J80375K02960j3508n1122J65011Q4893K59880
19103E96367j80535J3072P4074k55684L8827K37393J46432p6267J08816O886m1654
$$ y = [-433190, -141177, 105983, 182516, 180359, -39093, -67017, 81974, 162301, 264143, 529682, 465054, 390026, 182982, 105674, -244295, -147969, 5843, -224551, -155710, 77109, 79042, 203657, 182222, 279784, 95389, -112477, -23919, 473574, 908293, 611162, 28346, -194858, -289198, -221, 482183, 715407, 643854, 714644, 343808, 146485, 30221, 68608, 223235, 174901, 86406, 259436, 103811, 121086, 199955, 553531, 435098, 60654, 70204, -65436, -52087, 487133, 545559, 342428, 212203, 92864, 257550, 349155, 284465, -226004, -255524, -188401, -232122, -51747, 151213, 137705, 86583, 251594, 336487, 596367, 415832, 428904, 502978, 247294, 286121, 523514, 669946, 593679, 702495, 709381, 667727]
19092F67727n553k30961l71633k31603L0077K21035r8444j62275k29929K40011
19082a71548J86956L21343P9089m6660n28666J22319j6882m5412j78316o4701
19072c42478R9650K48115l5186K80051R4349j11977P9553M9994M19105K05191
19062I86367P2523J38733J38107k05974m44734j69019j22343J17927m6767r2100
19052C72720J56024k17512r4491l3958l04374M1061K97813K8600J05109K83237
19042F34229J41650N1120n0258l05382J24965L2521J9896l42397k42024k0594
19032D3726J99308q1232K39159k24970k96361r2149k81085N4412M72849J31502
19022A65159L167r3785J50800L47636J71197k14898m40384p355k03960j35258
$$ y = [667727, 662174, 431213, 59580, -172023, -141946, 79089, -19355, -181630, -411559, -171548, 15408, 336751, 415840, 369180, -159486, -37167, -54049, -99461, -277777, -342478, -242828, 5287, -29899, 250152, 344501, 232524, 312077, 362071, 781176, 986367, 1058890, 1197623, 1335730, 1129756, 685022, 516003, 393660, 511587, 464820, 372720, 528744, 311232, 216741, 182783, -121591, -80530, 217283, 245883, 350992, 634229, 775879, 826999, 776741, 471359, 596324, 628845, 648741, 306344, 64320, 43726, 243034, 161802, 400961, 175991, -120370, -212519, -493604, -439192, 33657, 165159, 168326, 74541, 225341, 572977, 744174, 529276, 88892, 81537, -122423, -257681]
19012b57681j47810J48762J46083N70994J26552j44444J8626L18566r4675n9609
19002F25364L4144j24499k17029q9498j13492k46946K41692j24520K32814M9921
18992B67951M6456P7331J24172P681j42661j52214l54186K04957R8974K72153
18982D50614j90071m1025N38477J13590q711J23272j25070n7883L25310J44404
18972A272907K26324o1844L66242K32249m782O6647k48897j77275O3885K3962
18962A759418K62462J22480Q312n4505j04028K9035K96114M2236n86254j52881
18952A622389r7682P3732K0196R2048n5509j16371J70019m809q0243j24883j84306
18941A314581j97956J90393J87562k6285J49158J87916k43171l26025K70431M12954
$$ y = [-257681, -405491, -256729, -110646, 460348, 586900, 442456, 461082, 779648, 684973, 625364, 659508, 535009, 317980, 228482, 114990, -131956, 109736, -14784, 218030, 267951, 314407, 391738, 515910, 523591, 380930, 228716, -125470, 79487, 178461, 450614, 260543, 219518, 757995, 871585, 862874, 986146, 861076, 803193, 1128503, 1272907, 1499231, 1437387, 1803629, 2035878, 2031096, 2097743, 1848846, 1671571, 1735456, 1759418, 2021880, 2144360, 2152672, 2098167, 1994139, 2023174, 2319288, 2361524, 1775270, 1622389, 1524707, 1598439, 1618635, 1710683, 1655174, 1538803, 1708822, 1704013, 1623770, 1498887, 1314581, 1116625, 1307018, 1494580, 1468295, 1617453, 1805369, 1562198, 1236173, 1506604, 1919558]
18931A919558J34358N0722p3903k19708J14872J66257n2630l81395m16904l0428
18921A210799K12942L7994l25237j56619l4321L46738M1263L58362J67546k58833
18911A600634j60830j99888j64425O0152l34743k21920J65171j15959J06060J35100
18901H69352J23555P4884J96942j62535l0108L78223r5852j78616j33256j56192
18891H86397j5051j58763k11132j29913J1334K21426L10852p456o3748R7972k59099
18880F82819k60235J92503M2531J04832J71393j32477j8740q1129j26190l4738
18870E40569L52470m7999q7509j87517j08074K85609J14464k34771N6498j90607
18860D93133j26022K13445J16953k01703j05704L42677K98289K25821Q4324k57570
$$ y = [1919558, 2053916, 2104638, 2030735, 1811027, 1925899, 2092156, 2039526, 1658131, 1241227, 1210799, 1423741, 1461735, 1136498, 979879, 945558, 1292296, 1333559, 1691921, 1859467, 1600634, 1439804, 1239916, 1075491, 1135643, 800900, 578980, 744151, 628192, 734252, 869352, 992907, 1067791, 1264733, 1102198, 1072090, 1450313, 1354461, 1175845, 1042589, 886397, 871346, 712583, 501451, 371538, 382872, 604298, 915150, 907694, 843946, 941918, 682819, 422584, 615087, 657618, 762450, 933843, 801366, 782626, 701497, 575307, 540569, 893039, 845040, 757531, 570014, 461940, 747549, 862013, 627242, 683740, 493133, 367111, 580556, 697509, 495806, 390102, 732779, 1031068, 1256889, 1341213, 1083643]
18850A083643j77323j60729Q7199K13489J68558j13069l21705j32306J58695j70631
18840F35821l40584j71728K29010R3400J33007O5140j18152j42910K32687k25138
18830C90553k74672J43944L13804j5252j89091j98071j15873K54522R2371K52816
18820F55051K0514J1678j53724J14205K64346k02605k08897j60910N163k164l7140
18809C05517L47331q8190j50644l76089O4509J20203N7641J80433N81924k2618
18799A020017Q896P8133P4842M3498k8593j20960j51945R9547R444L5002k1895
18788A045986j68757j61839n9562j05451L2770J5998L84440l1203j6632J39051
18778A074801K29117J08048k60383l44330K33647L68591J21338K89289L59727
$$ y = [1083643, 906320, 745591, 832790, 1046279, 1214837, 1101768, 780063, 647757, 806452, 635821, 295237, 123509, 352519, 445919, 578926, 644066, 525914, 383004, 615691, 390553, 115881, 259825, 573629, 558377, 369286, 171215, 55342, 309864, 402235, 655051, 675565, 687243, 533519, 647724, 912070, 709465, 500568, 339658, 344821, 342657, 305517, 652848, 564658, 414014, 37925, 102434, 222637, 280278, 460711, 1042635, 1020017, 1028913, 1107046, 1181888, 1225386, 1196793, 1075833, 923888, 1023435, 1032879, 1067881, 1045986, 877229, 715390, 655828, 550377, 583147, 599145, 983585, 952382, 935750, 1074801, 1303918, 1411966, 1151583, 807253, 1040900, 1409491, 1530829, 1820118, 2179845]
18769B179845j65139J3812j85212k71440j80085j62980L21251K13471j47467m64146
18759A151910j49688J25960k8883l31493M9028j17536q8897L8659n5445k40963
18749C52652K25764M845o7661Q0106L53912K42165P7987K81993K81290j64256
18739A668797l37145k56632l64010j71791K04256J38748O1807K49072R484J77080
18729A379666J5976j49113P0088k66132N7431J36275j67465o7670J23355L59208
18719A491619J05770m18510O4254q0426r8832J33012M1537O54090J98161j09044
18709A981631m7448Q13K7470j9997J291K6422M8549j41289p6346k6380K84992
18698B059708r4134k34216L12801J55388m8935N9597L47006k89454j61257K52977
$$ y = [2179845, 2014706, 2028518, 1843306, 1571866, 1391781, 1228801, 1550052, 1763523, 1616056, 1151910, 1002222, 1128182, 1099299, 767806, 816834, 699298, 610401, 649060, 593615, 352652, 578416, 583261, 515600, 595706, 949618, 1191783, 1269770, 1551763, 1833053, 1668797, 1331652, 1075020, 711010, 539219, 743475, 882223, 944030, 1193102, 1202586, 1379666, 1395642, 1246529, 1316617, 1050485, 1107916, 1244191, 1076726, 1009056, 1132411, 1491619, 1597389, 1178879, 1243133, 1162707, 1063875, 1196887, 1238424, 1892514, 2090675, 1981631, 1934183, 1934996, 1962466, 1942469, 1943760, 1970182, 2018731, 1877442, 1801096, 1774716, 2059708, 1965574, 1731358, 2044159, 2199547, 2150612, 2210209, 2557215, 2267761, 2106504, 2359481]
18688B359481j01284l00386j1437J56242O7266O8767j37583k45393J30594N3799
18678B040066J50704Q8650Q6372k99332k16798R7236M9600K96146Q9123K53157
18668B634924K44266K59404o1293m24945m49065j56530L04025P4855P6171O57613
18658C159425P0619k91339m25229O2917J70430j38561j73117K47019j03196r9136
18648B479832j30799K1927J48089R716k68612j3592K01457k16165n4076j1471
18638B166306J48214L12248P9099J74650Q6320j2907r5391n22301j00353L46036
18628B581921m6374n2781N06328L36426m11183l84127N26950K77128l39789k25536
18618B768963K06207O3954l34286K13697K90478J13427M3001j68288j85232k45318
$$ y = [2359481, 2258197, 1957811, 1946374, 2102616, 2169882, 2238649, 2101066, 1855673, 1986267, 2040066, 2190770, 2279420, 2365792, 2066460, 1849662, 1946898, 1996498, 2292644, 2381767, 2634924, 2879190, 3138594, 3077301, 2652356, 2203291, 2046761, 2350786, 2425641, 2501812, 3159425, 3230044, 2938705, 2513476, 2576393, 2746823, 2608262, 2435145, 2682164, 2578968, 2479832, 2349033, 2370960, 2519049, 2528765, 2260153, 2246561, 2448018, 2231853, 2177777, 2166306, 2314520, 2626768, 2705867, 2880517, 2966837, 2953930, 2858539, 2336238, 2235885, 2581921, 2535547, 2482766, 2989094, 3325520, 2914337, 2530210, 3057160, 3334288, 2994499, 2768963, 2975170, 3039124, 2704838, 2918535, 3209013, 3322440, 3365441, 3197153, 3011921, 2766603]
18608B766603k43124j33220L11696L4678M5814p0473Q0810j8962K9335m7596n4974
18597B700587L5215J67643K29970l4718J75171L7405k57536J07565j19619J26318
18587C168001j91213j84000j59457J09527J20806K28767M09243K84668j41J78120
18577C964321J06520J86411J44801Q7932j87322L9849L2960M46295J28068k40049
18567D709786O5963O8386K97588K01935j56438j55892r0688K30040r1988n1609
18557E027083J54674J81325j27947J68624J7535p0476K30128K00989j21181N5646
18547E716400J12779K627J60951K19496n0227R9195J2338N49730j11268r6908
18537F615113Q2992J29877M7057L5306j5157J71251K85551K57397M49880M43127
$$ y = [2766603, 2523479, 2390259, 2701955, 2736633, 2782447, 2711974, 2792784, 2773822, 2803157, 2755561, 2700587, 2735802, 2903445, 3133415, 3098697, 3273868, 3311273, 3053737, 3161302, 3041683, 3168001, 2976788, 2792788, 2633331, 2742858, 2863664, 3092431, 3501674, 3786342, 3786201, 3964321, 4070841, 4257252, 4402053, 4489985, 4302663, 4342512, 4375472, 4821767, 4949835, 4709786, 4775749, 4844135, 5141723, 5343658, 5187220, 5031328, 4940640, 5170680, 5078692, 5027083, 5181757, 5363082, 5235135, 5403759, 5421294, 5350818, 5580946, 5781935, 5660754, 5716400, 5829179, 5831806, 5992757, 6212253, 6162026, 6261221, 6273559, 6823289, 6712021, 6615113, 6698105, 6827982, 6875039, 6910345, 6895188, 7066439, 7351990, 7609387, 8059267, 8502394]
18527H502394K56157o3807J19006j15455J51021N53311J95142J91942L47022O0203
18517A0196936j86728J72636L42308Q9582L34577J77923M36360P57669M42952
18508A2764215N68313L43872J22881J6801P6687K44603N02844R14944O59598L34592
18498A6549350L09544O03954P37496Q75620O24991Q85919P92686N13600O92869
18489B2586029J288598J156578J126064J226367J385308J447997J331637J842968
18481C3391546K395470K298717K487797K758923K949464L240814L239198L829551
18473E6591480M507297M863180N617411O247401O802699P273139Q455149J0105988
18465A10463744J1139589J2062811J3478283J4230823J4704344J4703504J4053235
$$ y = [8502394, 8758551, 8694744, 8813750, 8698295, 8849316, 9402627, 9597769, 9789711, 10136733, 10196936, 10010208, 10182844, 10525152, 10614734, 10949311, 11127234, 11563594, 12321263, 12764215, 13332528, 13676400, 13799281, 13816082, 13892769, 14137372, 14640216, 15555160, 16214758, 16549350, 16858894, 17462848, 18200344, 19075964, 19700955, 20586874, 21379560, 21893160, 22586029, 23874627, 25031205, 26157269, 27383636, 28768944, 30216941, 31548578, 33391546, 35787016, 38085733, 40573530, 43332453, 46281917, 49522731, 52761929, 56591480, 61098777, 65961957, 71579368, 77826769, 84629468, 91902607, 100357756, 110463744, 121603333, 133666144, 147144427, 161375250, 176079594, 190783098, 204836333]
18458B04836333J2808160J0901419Q714463O238709L694168J566254J3322o72799
18450B48100029j528025k361009k696789k449691k710074l806600m915834n312916
18442B22319091n848311o130501n666825m710763m027003k785292j391512M29866
18434A92188750J842052K893071L898928M953161M982050M770188M870090M635988
18426B25034278M335753L725885L700692L823364L797898L801045L198183J991130
18418B53408228M00041j867438m319471o467031r369677j1042433j2316790j2847206
18410A95578223j2839834j2585159j2374321j1653514j0867791r968052r089940
18403A16199612q414339p910414p047335o567086o199133n350397m851467m695409
$$ y = [204836333, 217644493, 228545912, 237260375, 243499084, 247193252, 248759506, 248772828, 248100029, 246572004, 244210995, 241514206, 239064515, 236354441, 232547841, 227632007, 222319091, 216470780, 210340279, 204673454, 199962691, 195935688, 193150396, 191758884, 192188750, 194030802, 196923873, 200822801, 205775962, 210758012, 215528200, 220398290, 225034278, 229370031, 233095916, 236796608, 240619972, 244417870, 248218915, 251417098, 253408228, 253808269, 251940831, 247621360, 241154329, 231784652, 220742219, 208425429, 195578223, 182738389, 170153230, 157778909, 146125395, 135257604, 125289552, 116199612, 107785273, 99874859, 92827524, 86260438, 80061305, 74710908, 69859441, 65164032]
18395F5164032l927317l832856l268020k876723l084946l128347k799269k672044
18387C9574510j982202k039935j782125j286236j240782j271062j307153j174107
18379B7490908j337069j095395r60674j217965r75428p62418p86270r89188r49974
18370A8416527p80339n60568n05745m18994j92022q28960p23426o52771m63195
18361A3290507j39882k11238k92282j22231m38889j50254k85635m19553l01481
18352A0929062n31791l0861n1546o89368l71572q3001k58608j65678j81213j77519
18342H387905j85464K7282K29014j50018k94972k66282p5283n71316l71577j80333
18332F548956M8180n1148j20232n5723k43959j15159K04747J87689l7997r9263
$$ y = [65164032, 61236715, 57403859, 54135839, 51259116, 48174170, 45045823, 42246554, 39574510, 37592308, 35552373, 33770248, 32484012, 31243230, 29972168, 28665015, 27490908, 26153839, 25058444, 24097770, 22879805, 21904377, 21141959, 20355689, 19366501, 18416527, 17636188, 17075620, 16569875, 16150881, 15958859, 15129899, 14406473, 13753702, 13290507, 13150625, 12939387, 12647105, 12524874, 12085985, 11935731, 11650096, 11230543, 10929062, 10397271, 10366410, 10314864, 9625496, 9253924, 9170923, 8912315, 8746637, 8565424, 8387905, 8202441, 8229723, 8458737, 8308719, 8013747, 7747465, 7672182, 7100866, 6729289, 6548956, 6597136, 6545988, 6425756, 6370033, 6126074, 6010915, 6215662, 6403351, 6365354, 6266091]
18322F266091P7717r1113l0943k05398m91210o029K20451P6211n2528j94639k35703
18311E332907j05420J75454Q3803p0825m12035J8027J65237j7148r5299M0864
18301E115565J94327R4543o3300j18362j14457J31537k95577j31954J98894K1224
18291E032440j89573j6861q9816J30145N02093l03903m81283J72085K47920r60
18281E002287k01610p0539K43439K77990K66389l95218j04251k75352M87916L09750
18271E540801M4529k6511o8647J9203J48536j30955j55191K4563J31575m5315
18261E482588J13310P2816j76298j99011r6984J18534L9326j44650j40589J35201
18251E204243M15672J30060j29936q7013K8463J45718k45880J99479J76485J19027
$$ y = [6266091, 6343808, 6252695, 6221752, 6016354, 5525144, 5519115, 5739566, 5815777, 5763249, 5568610, 5332907, 5227487, 5402941, 5486744, 5415919, 5003884, 5021911, 5187148, 5170000, 5074701, 5115565, 5309892, 5404435, 5341135, 5222773, 5108316, 5239853, 4944276, 4812322, 5011216, 5032440, 4842867, 4826006, 4736190, 4866335, 5368428, 5064525, 4583242, 4755327, 5003247, 5002287, 4800677, 4730138, 4973577, 5251567, 5517956, 5122738, 5018487, 4743135, 5231051, 5540801, 5585330, 5558819, 5490172, 5509375, 5657911, 5526956, 5371765, 5396328, 5527903, 5482588, 5595898, 5668714, 5492416, 5293405, 5196421, 5314955, 5354281, 5209631, 5069042, 5204243, 5619915, 5749975, 5620039, 5533026, 5561489, 5707207, 5461327, 5660806, 5837291, 5956318]
18241E956318L0528L98474M13062O7312r0743j36021R3510k98185j02954p4556
18231F256745n5493R4416K81243J02719J32678L33568R6561K86145L5025j31937
18221G431670K68191M06376j11783J3941M15092L86701p553l67250K87760L12065
18211I035210K92823m7512r7300J99146N34237J24260P4886K79576K60205J98857
18201A0854388J98292J57748J45180N33743N67579Q50928P10083L25042O84471
18192A5027454O15131N56277M00190P91335J151626J370490J436443J234399J577847
18183B4161192J873438K261223K324320K772631K953385L330947L368732L667358
18175D6713226L791202L874878L569001L340481K642591J777329L97821m16179
$$ y = [5956318, 5986846, 6385320, 6798382, 6865694, 6774951, 6638930, 6732440, 6434255, 6331301, 6256745, 6201252, 6295668, 6576911, 6679630, 6812308, 7145876, 7242437, 7528582, 7563607, 7431670, 7699861, 8106237, 7994454, 8008395, 8423487, 8810188, 8802635, 8435385, 8723145, 9035210, 9328033, 9280521, 9183221, 9382367, 9916604, 10040864, 10115750, 10395326, 10655531, 10854388, 11052680, 11210428, 11355608, 11889351, 12456930, 13307858, 14017941, 14342983, 15027454, 15642585, 16198862, 16599052, 17390387, 18542013, 19912503, 21348946, 22583345, 24161192, 26034630, 28295853, 30620173, 33392804, 36346189, 39677136, 43045868, 46713226, 50504428, 54379306, 57948307, 61288788, 63931379, 65708708, 66106529, 65690350]
18167F5690350q55281j624861k318506k455420k427753k459989k359683k111746
18159D9077111k260665j756903j241299j464281j139842j047119q60075k74142
18151C9032785j57494m7873j46416J72189K87962P79602P77792J295510J306421
18142D3300478J641856J433480K204657K590672K780883L324090L817029M155893
18134F5249038M696974N437565O803218P313391Q284935R095024R923008J0743082
18126A27546235J1289917J1478121J1420322J1368956J0922199R882611Q761648
18119B02670009P995735O988747O344951O200924N807601N457193M879285L803999
18111B50148444K012936q80329l548383o704764q894703j0855477j2641177j3700844
$$ y = [65690350, 64835069, 63210208, 60891702, 58436282, 56008529, 53548540, 51188857, 49077111, 46816446, 45059543, 43818244, 42353963, 41214121, 40167002, 39306927, 39032785, 38875291, 38827418, 38681002, 38853191, 39141153, 39920755, 40698547, 41994057, 43300478, 44942334, 46375814, 48580471, 51171143, 53952026, 57276116, 61093145, 65249038, 69946012, 75383577, 82186795, 89500186, 97785121, 106880145, 116803153, 127546235, 138836152, 150314273, 161734595, 173103551, 184025750, 193908361, 202670009, 210665744, 217654491, 223999442, 230200366, 236007967, 241465160, 246344445, 250148444, 252161380, 251281051, 247732668, 241027904, 232133201, 221277724, 208636547, 194935703]
18103A94935703j3901914j3086482j2274641j1877643j1029207j0136684q618116
18096A14011016p568722o681653o013151n063715m508014l754807l127941l129447
18088G4163566k692187j786050j018326p17549L23938N38145J044195J709298
18080G1565030J934422K538453L446095L538336L521633L649463L599642K723872
18072I6516946J582105Q16043m40446k300756k985659l767878m268635m709142
18064H0442578n097967m947741m633702m387323m534765m383584l770814l503367
18056D5183315k866868k694718k766703k373810k472811k414733j853026j173206
18048B6567440j477945j315958j465791j342306q14806r87652p33906r54095q72550
$$ y = [194935703, 181033789, 167947307, 155672666, 143795023, 132765816, 122629132, 114011016, 106442294, 99760641, 93747490, 88683775, 84175761, 80420954, 77293013, 74163566, 71471379, 69685329, 68667003, 67949454, 68273392, 68811537, 69855732, 71565030, 73499452, 76037905, 79484000, 83022336, 86543969, 90193432, 93793074, 96516946, 98099051, 98915094, 98474648, 96173892, 93188233, 89420355, 85151720, 80442578, 75344611, 70396870, 65763168, 61375845, 56841080, 52457496, 48686682, 45183315, 42316447, 39621729, 36855026, 34481216, 32008405, 29593672, 27740646, 26567440, 25089495, 23773537, 22307746, 20965440, 20150634, 19162982, 18429076, 17474981, 16602431]
18039A6602431p82624q56608p22969o03385k96946k02453m86131m72094o98985
18030A1480236m59900k04150l42236k81407m27538m04056n0840n3037l35807j96851
18020H724414k35178j85605k19006r4904m10638j06029K70878o54657m29247P3921
18010F733949j08673k16979m01894n71786m36610j58154K52807j01278j15930
18001D875452l8949j30179J70446K45853l32978n40414J40100l5235j35670o7976
17991D150450l3743O4861J61924R2333r3177m3431o2340j67660J0671L8852K17409
17980D336149J14797m136l32979M4458o5898j51806J29527k18284o0848J17125
17970C908105L05597K34482N6687P3500j43001l27877J60857k32739m4677q4302
$$ y = [16602431, 15819807, 14963199, 14240230, 13636845, 13339899, 13137446, 12651315, 12179221, 11480236, 11020336, 10816186, 10473950, 10192543, 9765005, 9360949, 9310109, 9257072, 8921265, 8724414, 8489236, 8303631, 8084625, 7989721, 7579083, 7473054, 7743932, 7089275, 6660028, 6733949, 6625276, 6408297, 6006403, 5434617, 4998007, 4839853, 5092660, 4991382, 4875452, 4836503, 4706324, 4876770, 5122623, 4789645, 4249231, 4389331, 4354096, 4218426, 4150450, 4116707, 4181568, 4343492, 4435825, 4342648, 4299217, 4236877, 4069217, 4079888, 4118740, 4336149, 4450946, 4446810, 4113831, 4158289, 4092391, 3940585, 4070112, 3851828, 3790980, 3908105, 4213702, 4448184, 4504871, 4578371, 4435370, 4107493, 4268350, 4035611, 3990934, 3906632]
17960C906632j89285l8226J93217K8312m1558j12990K52018M0807k14447K05563
17950D030043K68853l9023k38624j61321j2360Q3682J72716k21178j11154N83837
17940D355471J49649L01854j38519j82422J25715n9784J08584j63484k48336J42547
17930D391275k8303j75026k8887j83797J21815J09285J01392r5119J47282j68680
17920D191237J6325O8647L2137j96298j84433J11663l0724K12015J5109j06916
17910D128762K26001k35635j64729k32054j89256k42897n8655M0424K72340K88705
17900C833006O56524K086l11769J38011m7471j08114o7730j57995J92351j21643
17890D007256j14338o8457m0793J1328j69292m23647P3897K1903n5882J28308
$$ y = [3906632, 3717347, 3679121, 3872338, 3900650, 3859092, 3746102, 3998120, 4038927, 3824480, 4030043, 4298896, 4259873, 4021249, 3859928, 3847568, 3931250, 4103966, 3882788, 3771634, 4355471, 4505120, 4806974, 4668455, 4486033, 4611748, 4551964, 4660548, 4497064, 4248728, 4391275, 4362972, 4187946, 4159059, 3975262, 4097077, 4206362, 4307754, 4212635, 4359917, 4191237, 4207562, 4276209, 4308346, 4112048, 3927615, 4039278, 4008554, 4220569, 4235678, 4128762, 4354763, 4119128, 3954399, 3722345, 3533089, 3290192, 3231537, 3271961, 3544301, 3833006, 4489530, 4491616, 4179847, 4317858, 4270387, 4162273, 4094543, 3936548, 4128899, 4007256, 3892918, 3824461, 3783668, 3794996, 3625704, 3202057, 3275954, 3297857, 3241975, 3370283]
17880C370283K05526J06168O112J875L64576M62415l69338j64065J57882k61067
17870C880367j13581r9977K72276K6919k06722L232m38174j10896J96539L2056
17860C442039L69664K47098n256k95770k11296M7928K25014O26542L49847o1330
17850D734480K05562J77954Q3976m3948j37739K3990K73786l28236K59307m5167
17840E203965k24490J66481J26460M74863M5693J18232k0643j89730l2971M9680
17830E717540J48997L0812M4416M91124L26449k97840k05548M86971J31735K04447
17820G079103l3780J30488J27981j22299l5716L0888M24487L01589m9169M939
17810G858511L22087L96096O6294j69933J80075K96197K92844j61696L07453N02638
$$ y = [3370283, 3575809, 3681977, 3688089, 3689964, 4054540, 4516955, 4147617, 3983552, 4141434, 3880367, 3766786, 3666809, 3939085, 3966004, 3759282, 3762514, 3324340, 3213444, 3409983, 3442039, 3811703, 4058801, 4053545, 3757775, 3546479, 3594407, 3819421, 4445963, 4795810, 4734480, 4940042, 5117996, 5201972, 5158024, 5020285, 5044275, 5318061, 4989825, 5249132, 5203965, 4979475, 5145956, 5272416, 5747279, 5792972, 5911204, 5890561, 5700831, 5667860, 5717540, 5866537, 5897349, 5941765, 6432889, 6759338, 6461498, 6255950, 6742921, 6874656, 7079103, 7045323, 7175811, 7303792, 7181493, 7145777, 7176665, 7601152, 7902741, 7853572, 7858511, 8180598, 8576694, 8642988, 8473055, 8653130, 8949327, 9242171, 9080475, 9387928, 9890566]
17800I890566M79101L30104J67882O46544M66765M02119N75894R59348L82395
17791A4300718M52411P39591Q26496J282633R76565O64836J162698R49269J109234
17782B2464451J303200J124531J385993J740552K033533K071346K673843K980114
17774C7777563L122165L250438L501064M548371M730074M900276M942235N376648
17766G2148834N617620N565426N328211N373475N213601M603796M508507M044740
17758A12404210L747878L150539K475370J890638Q35964J69639k52722q22284
17750A23599232j882818k673334k761020l279146l733501m415717n034895n256611
17742I4562190n134966m906072m770577m727455m075692l385437l220284k744009
$$ y = [9890566, 10369667, 10699771, 10867653, 11514197, 11980962, 12383081, 12958975, 13918323, 14300718, 14753129, 15492720, 16319216, 17601849, 18578414, 19243250, 20405948, 21355217, 22464451, 23767651, 24892182, 26278175, 28018727, 30052260, 32123606, 34797449, 37777563, 40899728, 44150166, 47651230, 52199601, 56929675, 61829951, 66772186, 72148834, 77766454, 83331880, 88660091, 94033566, 99247167, 103850963, 108359470, 112404210, 116152088, 119302627, 121777997, 123668635, 124504599, 124674238, 124421516, 123599232, 121716414, 119043080, 116282060, 113002914, 109269413, 104853696, 99818801, 94562190, 89427224, 84521152, 79750575, 75023120, 70947428, 67561991, 64341707, 61597698]
17734F1597698k414778j978519j668876j414556j386839p39860L46971K02735
17726E2543976N71185R61094J485356J570166K410855K394792K835440L058543
17718F7831407L482785L418772L637138L767020L196376L275616L117956K886434
17710I4613504K467489J892536J591819J075564J075758L40417j30658r33154
17702A01993275j755237k193210k511451l317884l580293l692153l983792m355723
17694G6603532m841878m552915m229490m099052l768891l466100l594186l471099
17686D4579921k854959k518447k389053k163341j672596j826920j760181j453951
17678B7940473j384472j434402j089160q80053r90667j226625j244685p89538
$$ y = [61597698, 59182920, 57204401, 55535525, 54120969, 52734130, 51994270, 52341241, 52543976, 53115161, 54076255, 55561611, 57131777, 59542632, 61937424, 64772864, 67831407, 71314192, 74732964, 78370102, 82137122, 85333498, 88609114, 91727070, 94613504, 97080993, 98973529, 100565348, 101640912, 102716670, 103057087, 102926429, 101993275, 100238038, 98044828, 95533377, 92215493, 88635200, 84943047, 80959255, 76603532, 71761654, 67208739, 62979249, 58880197, 55111306, 51645206, 48051020, 44579921, 41724962, 39206515, 36817462, 34654121, 32981525, 31154605, 29394424, 27940473, 26556001, 25121599, 24032439, 23152386, 22161719, 20935094, 19690409, 18900871]
17670A8900871j42317n88897p34839l82814n65070m84398j33062m81032l91219
17661A4997223l6853l93741j44853K54282K84077m5115l63407l98520L8763k74523
17651A3917333j71882J35754l3313J05842K74761J86771j87837l4489R7242K04482
17641A4494664N88582K16033M67307M39750J85770K95668O79015N58814R9632
17632A8025235N43062P42127P77085L86235J022307J266374Q89532R72381J457527
17623B6081865J335116J544080J706700J946693K232742K389646K846869L304157
17615D3387868L587388L589793M225810M741968N339935N728483O356773O579266
17607H3537284P018764P101975O848100P181154O982526O263362N769919N022055
$$ y = [18900871, 18758554, 18169657, 17434818, 17052004, 16486934, 16002536, 15869474, 15388442, 14997223, 14960370, 14566629, 14421776, 14676058, 14960135, 14915020, 14551613, 14153093, 14191856, 13917333, 13745451, 13881205, 13847892, 13953734, 14228495, 14415266, 14227429, 14192940, 14290182, 14494664, 15083246, 15299279, 15766586, 16206336, 16392106, 16687774, 17366789, 17925603, 18025235, 18568297, 19310424, 20087509, 20473744, 21496051, 22762425, 23651957, 24624338, 26081865, 27416981, 28961061, 30667761, 32614454, 34847196, 37236842, 40083711, 43387868, 46975256, 50565049, 54790859, 59532827, 64872762, 70601245, 76958018, 83537284, 90556048, 97658023, 104506123, 111687277, 118669803, 124933165, 130703084, 135725139]
17599A35725139M847013N034942M980225N178135M983399M973049N174847M860859
17591A75757608M241803L009817J676732Q01549j36395j477222k446769l216274
17583A78210849l911906m040062l982719m067546m006420m361425m889794n107735
17575A43843242n834775o840093p178728p269735p433468p484117o859940o295539
17567H8646847o075604n870991n714418n063244m447191m255188l994558l251337
17559D9974316l183471l284927l002455k595540k656234j967335j492221j968636
17551B9823497j654946j292733j600633j483049j210598j535055j296808j139121
17543A8610554q69756q66639l48990o20965r27716j031748q78206k38646k49047
$$ y = [135725139, 140572152, 145607094, 150587319, 155765454, 160748853, 165721902, 170896749, 175757608, 179999411, 183009228, 184685960, 185487509, 185351114, 183873892, 181427123, 178210849, 174298943, 170258881, 166276162, 162208616, 158202196, 153840771, 148950977, 143843242, 138008467, 131168374, 123989646, 116719911, 109286443, 101802326, 94942386, 88646847, 82571243, 76700252, 70985834, 65922590, 61475399, 57220211, 53225653, 49974316, 46790845, 43505918, 40503463, 37907923, 35251689, 33284354, 31792133, 29823497, 28168551, 26875818, 25275185, 23792136, 22581538, 21046483, 19749675, 18610554, 17740798, 16874159, 16525169, 15904204, 14976488, 13944740, 13066534, 12827888, 12578841]
17534A2578841p82182m48516k56651n41149p67830q01317l15447k0807K25459
17525H870401k2960k01857k84316O782j82082l35582j74837o527m11633m47292
17515F810097k78496l14089n27545k01880n3278q1554k29171k697L66132p7748
17505E409771J37370j09814j02994o07274j28721Q1275k91953O6031K18282p5484
17495D596489k68284q9233j38981k2565L54461J15449l70899l84635Q8424k2589
17485C857637k30048L54251j09529k63446l59963j92176K32980N06262J17522
17476C913490K5522m84333r5812M71886K08992M054k7045m6021l16353l62122
17466C292258Q6731K5073K32179q2892j27226L64572J36572K53812L2495j28875
$$ y = [12578841, 11796659, 11348143, 11091492, 10550343, 9782513, 8981196, 8665749, 8644942, 8870401, 8847441, 8645584, 8361268, 8368050, 8185968, 7850386, 7675549, 7669022, 7257389, 6810097, 6531601, 6217512, 5689967, 5488087, 5434809, 5353255, 5124084, 5121387, 5487519, 5409771, 5547141, 5437327, 5334333, 4727059, 4598338, 4679613, 4387660, 4453691, 4671973, 4596489, 4328205, 4238972, 4099991, 4077426, 4431887, 4547336, 4176437, 3791802, 3880226, 3857637, 3627589, 3981840, 3872311, 3608865, 3248902, 3056726, 3289706, 3795968, 3913490, 3939012, 3454679, 3358867, 3830753, 4039745, 4043799, 4016754, 3970733, 3654380, 3292258, 3378989, 3404062, 3636241, 3553349, 3426123, 3790695, 3927267, 4181079, 4213574, 4084699]
17456D084699j8831j32976J60495J68611M13156N8820L38566K90268j40843k87961
17446D934004r0357K33581m72377j07533N0747J35137o8324J47325n7836m96546
17436D207821K49033K07529J39046j24551r9879j25863j9796L33416l00103j69886
17426D296767O991j11436J11801J50220l8655K13530L45069k32317J44480M0154
17416D926604K19298L6975l7495k56474j66236K63371J64553p1332K56975J69589
17406E505828J80320L72123K81712Q0322l1860o4614Q0372J09689J94028j0563
17396F697357K36642j8576P7969M23147M27745r020K0558n3047P6445M61610O01101
17385H941931P16585R7979K70625N68761K73760L54675P9274M59039O18513O13396
$$ y = [4084699, 4065868, 3932892, 4093387, 4261998, 4675154, 4733974, 5072540, 5362808, 5221965, 4934004, 4843647, 5077228, 4604851, 4497318, 4548065, 4683202, 4614878, 4762203, 4704367, 4207821, 4456854, 4664383, 4803429, 4678878, 4578999, 4453136, 4433340, 4766756, 4466653, 4296767, 4303758, 4192322, 4304123, 4454343, 4415688, 4629218, 4974287, 4741970, 4886450, 4926604, 5145902, 5182877, 5145382, 4888908, 4722672, 4986043, 5150596, 5079264, 5336239, 5505828, 5686148, 6058271, 6339983, 6420305, 6388445, 6323831, 6404203, 6513892, 6707920, 6697357, 6933999, 6915423, 6993392, 7416539, 7844284, 7835264, 7855822, 7802775, 7879220, 8340830, 8941931, 9658516, 9756495, 10027120, 10595881, 10869641, 11224316, 11303590, 11762629, 12381142, 12994538]
17375A2994538N43360O84731O57867Q73588R82593R54342P27402J025764J612686
17366B1056871J694599J375218J371236J642388K486421K188675K877206K876353
17358C7568967L386722L670838M075465M825468M669185N112695N468180N401007
17350G4178527N059493M550296L945102L318568K703822K211247K095306J649629
17342I9711990P91221L91904M07944N27788N80730M06174J80105k39022q97012
17333A01861822q51770p75851j493401j767005k379184k911380l147552l280255
17325H5255424m074572m327669l915378l347442l354386l094996k596889k701171
17317E7842921k159664j835764j581233j305285p76849m16975j98970Q31836J266364
$$ y = [12994538, 13537898, 14222629, 14880496, 15754084, 16736677, 17691019, 18418421, 19444185, 21056871, 22751470, 24126688, 25497924, 27140312, 29626733, 31815408, 34692614, 37568967, 40955689, 44626527, 48701992, 53527460, 58196645, 63309340, 68777520, 74178527, 79238020, 83788316, 87733418, 91051986, 93755808, 95967055, 98062361, 99711990, 100503211, 100895115, 101303059, 101830847, 102411577, 102817751, 102997856, 102758834, 101861822, 101010052, 100234201, 98740800, 96973795, 94594611, 91683231, 88535679, 85255424, 81180852, 76853183, 72937805, 69590363, 66235977, 63140981, 60544092, 57842921, 55683257, 53847493, 52266260, 50960975, 50184126, 49767151, 49568181, 50400017, 51666381]
17308E1666381J874029J896057K221480K471082K957173L740570L754059L589919
17300G4170750L312403L123752L054747K689002J891973J702521J396608O53901
17292I1995657N04378J78261K69374j85333k20786j38052m87553p76021l68454
17283I0771471j038149j512140j465292j893362k708918l345152l345744l428711
17275G2034003l769764m083291m076243l733663m030924l949559l851018l113610
17267D1425931k751953k579976k498098k348908k261439j863851j825878j802363
17259B3493465j428799j146367j299677j201077p03556q37550j090810o57065
17251A5128564m40031j032121r40711n05334o89860o45890n67209j9055l80954
$$ y = [51666381, 53540410, 55436467, 57657947, 60129029, 63086202, 66826772, 70580831, 74170750, 77483153, 80606905, 83661652, 86350654, 88242627, 89945148, 91341756, 91995657, 92500035, 92678296, 92947670, 92762337, 92541551, 92403499, 91915946, 91139925, 90771471, 89733322, 88221182, 86755890, 84862528, 82153610, 78808458, 75462714, 72034003, 68264239, 64180948, 60104705, 56371042, 52340118, 48390559, 44539541, 41425931, 38673978, 36094002, 33595904, 31246996, 28985557, 27121706, 25295828, 23493465, 22064666, 20918299, 19618622, 18417545, 17713989, 16876439, 15785629, 15128564, 14688533, 13656412, 12715701, 12210367, 11520507, 10874617, 10307408, 10288353, 9907399]
17242I907399o23812m28302l32574m1594l97893o15986k21789o40214k03361k79346
17232F122528k24250k63954j38571j38474l27500l49083l02750n249r4455o6935
17222D211307j6816j49833r7084j55763k76534O0408N6925K8035k307j59820j48144
17211C350374J70317j31143k05817j95295K74772J80623J43409Q0021Q3974j13140
17201C638095o9983k12820m5876k80641k3145R0768j64940l92008P3609o6701
17191B546358l80773n61121j50547r2983P221J83873K59842N1897J32137K2746
17181B018650l96282n2658M8177P4924R0139m3071M9411q0847k88385K2422M16173
17170A858653j6703j28290o2763M2284k31966O1599J30250k56644J41413k44847
$$ y = [9907399, 9283587, 8855285, 8522711, 8481117, 8083224, 7467238, 7245449, 6605235, 6401874, 6122528, 5898278, 5634324, 5495753, 5357279, 5029779, 4680696, 4377946, 4372697, 4278242, 4211307, 4194491, 4044658, 3947574, 3791811, 3515277, 3575685, 3632610, 3660645, 3658338, 3498518, 3350374, 3520691, 3389548, 3183731, 2988436, 3263208, 3443831, 3587240, 3667261, 3751235, 3638095, 3568112, 3355292, 3309416, 3028775, 3005630, 3096398, 2931458, 2539450, 2613059, 2546358, 2165585, 1604464, 1453917, 1360934, 1368155, 1552028, 1811870, 1863767, 1995904, 2018650, 1622368, 1569710, 1617887, 1692811, 1782950, 1739879, 1789290, 1708443, 1420058, 1442480, 1858653, 1841950, 1713660, 1650897, 1693181, 1461215, 1522814, 1653064, 1396420, 1537833, 1292986]
17160A292986l51443J24012l1056n8327n3344r2035J74864J00255K19203r1189
17150A233926p2477M3051J92762k7542k27081R5146K60422q9355J87621N3029
17140A649502k46098j75351l23982k95650q5119O00919j2080l40013J67042j44719
17130G94451J36998J74311J97273N8049j02133j93396P2233O7646O6262n1509
17120A220185Q376N1201P2099J5964K7710o45J20023K75711k16890J1512O6630
17109A651876k3258k73869R978J07858J03711K44687j54292J91707R6853m3992
17099A911259j41456k47836J36394K07022l28848r7728L48659R9650n4277l31076
17089A501763o74648j70090N48876k4053n4846K4586J06294K9239k46382m90225
$$ y = [1292986, 941543, 1065555, 1034499, 976172, 922828, 830793, 1005657, 1105912, 1325115, 1233926, 1161449, 1204500, 1397262, 1369720, 1142639, 1237785, 1498207, 1408852, 1596473, 1649502, 1403404, 1228053, 904071, 608421, 523302, 1124221, 1112141, 772128, 939170, 794451, 931449, 1105760, 1303033, 1361082, 1258949, 1065553, 1137786, 1205432, 1271694, 1220185, 1228561, 1279762, 1351861, 1367825, 1395535, 1394890, 1514913, 1790624, 1573734, 1585246, 1651876, 1628618, 1354749, 1364727, 1472585, 1576296, 1820983, 1666691, 1858398, 1955251, 1911259, 1769803, 1521967, 1658361, 1865383, 1536535, 1438807, 1787466, 1887116, 1832839, 1501763, 827115, 657025, 1205901, 1181848, 1127002, 1151588, 1257882, 1287121, 1040739, 550514]
17079E50514k93148J18676L77924K4694n00270j72800J22567J08786P024j00354
17069B43613P2555J54252k57896j58174L82929K62383j36155l65736j00262K30331
17059C27840j08269O408j37977J79835j4282J7346j97199k34284J93337r7713
17049f4958k05851M88046j1121k01369L54810j19654j50970k4910R535L49395
17039D22953K5999j15111n702q0417j23953j69107k49988j8191K37875L10708
17029B35066j46812k39341o8740o4848J0884J91862L43395j62661n0328O2653
17019A11130m4927Q0233l7846l7371j2954J68184m012J23858j68730l02586k26984
17008c52005K27759J37625o024J93645P2358j8482j94865k34026k90255k66374
$$ y = [550514, 257366, 376042, 753966, 778660, 278390, 105590, 228157, 336943, 343967, 243613, 316168, 470420, 212524, 54350, 437279, 699662, 563507, 197771, 97509, 327840, 219571, 225979, 88002, 267837, 253555, 270901, 73702, -160582, 32755, -64958, -270809, 217237, 206116, 4747, 359557, 239903, 88933, 64023, 73558, 422953, 448952, 333841, 328139, 247722, 123769, -45338, -295326, -313517, -75642, 235066, 88254, -151087, -219827, -284675, -273791, -81929, 261466, 98805, 48477, 111130, 66203, 146436, 108590, 71219, 58265, 226449, 222437, 346295, 177565, -125021, -352005, -124246, 13379, 7355, 201000, 273358, 254876, 60011, -174015, -464270, -730644]
16998g30644K97057L20958N9949L1468K22633O168K14728j45385p2981J6536l37016
16987a16529K8432L3251K13028j35394k61317q9501k9387J38725J14579j38098
16977b42211K7407L77832J68536O6206J30435R3719l03237j53376j94165K06981
16967A78127M74815P6537k81283M4649l0420J03194l5662K6118j25540k2567k51486
16956A56482K9979J91611P2145L82154J31519l79347m25403Q3954J34668J1044
16946C88806k38643j68441N4460L32927K18170j48585l40611j14596k2391K05471
16936A66567R4841M1379J74861m8500n2528k70266l60792J87935j1313K27561
16926A49745j29575j84030M8924q9506l300K64097L23515K0432l55890j06365
$$ y = [-730644, -433587, -112629, -52680, -21212, 201421, 207589, 422317, 276932, 203951, 220487, -116529, -88097, -54846, 158182, 22788, -238529, -328030, -357417, -218692, -104113, -242211, -214804, 163028, 331564, 397770, 528205, 621924, 318687, 165311, -28854, 178127, 652942, 729479, 448196, 492845, 462425, 565619, 529957, 556075, 430535, 407968, 156482, 186461, 378072, 450217, 832371, 963890, 584543, 159140, 243094, 377762, 388806, 150163, -18278, 36182, 369109, 587279, 438694, 98083, -16513, -38904, 166567, 261408, 302787, 477648, 429148, 376620, 106354, -254438, -66503, -77816, 149745, 20170, -163860, -114936, -204442, -207742, 56355, 379870, 400302, 44412, -61953]
16916f1953K11311K77479O3820J80948j00203n38296n79068L38121K24669j05225
16906h8397J6354L18321k77291k79277K14142L69029J82238j53198J1993L8213
16896C52127j42317j33134k61768j95822n3397j08923J65193L11189K58599L86904
16886E78651l48425k04439j77568j80328k15893L15325K83278j18147J33834K44750
16876C11038N6497j53350J39254k60785k21448n4268O5551K13005K95j59037L4767
16865b8481L58595J52189l54835r0116R2433l4839J43942N24o4137Q7156P1685
16854C34116l1738j15845k71327L86063L71180J13422k37941J81451K66136m58444
16844E37073k55967k21865l6001L58055L09709O2963M1908J24464J7650j69058
$$ y = [-61953, 149358, 426837, 490657, 671605, 571402, 33106, -545962, -207841, 16828, -88397, -72043, 246278, -31013, -310290, -96148, 272881, 455119, 301921, 313914, 352127, 209810, 76676, -185092, -380914, -434311, -543234, -378041, -66852, 191747, 578651, 230226, 25787, -151781, -332109, -548002, -232677, 50601, -67546, 66288, 311038, 367535, 214185, 353439, 92654, -128794, -183062, -117511, 95494, 95789, -63248, -28481, 330114, 482303, 127468, 37352, 129785, 94946, 238888, 239412, 175275, 262431, 334116, 302378, 186533, -84794, 301269, 672449, 785871, 547930, 729381, 995517, 537073, 281106, 59241, 23240, 381295, 691004, 753967, 795875, 920339, 937989, 768931]
16834G68931k59570l1014K49790J49042l23553k02396q8439k14649r3288K63114
16824B17968M06593J11706O5709J05818j7153k09187j62095k38003j83832K34709
16814C32233M10497j1782M7566j7402j19493k95452K9807L23362K35797l15715
16804F19418l99995l36627j32671j03248M03512J77971K63938j26851l05654J26294
16794A86087J83546J76318L29399l18119n52383J40994l2457Q35N98522J54832
16784H67574l36166n1331k6684j19532Q827Q8536L22501j22142m59748m29930
16774b58095K27854L43586N8008l9458K55439k12473k70000m6786k50551o8647
16764b61123J95876J8316J11954J15501m0415q584j91276q1402J25311O0445P9516
$$ y = [768931, 509361, 478347, 728137, 877179, 553626, 351230, 262791, 48142, -45146, 217968, 624561, 736267, 801976, 907794, 890641, 681454, 519359, 281356, 97524, 332233, 742730, 730948, 778514, 761112, 641619, 346167, 375974, 699336, 935133, 619418, 219423, -117204, -249875, -353123, 50389, 228360, 492298, 365447, 59793, 186087, 369633, 545951, 875350, 557231, 4848, 145842, 113385, 114220, 712742, 867574, 531408, 480077, 453393, 333861, 342688, 431224, 753725, 631583, 171835, -258095, -30241, 313345, 371353, 331895, 587334, 374861, 104861, 58075, -192476, -261123, -65247, -46931, 65023, 180524, 140109, 131525, -59751, -141153, -15842, 44603, 124119]
16753A24119J2928m1655r5413J15667j76845j14962P6026q3911l29301K8697M07244
16742g7406J48507r5741j88119l38730N0936N336L42667Q3133m31117J1119K03029
16731b86386j2097N4060K52381k15691j99747o8915R357K75920K91433N1779J04419
16720B56513L05752Q075n31328n31319L4373J78136l5909K04154Q4238P4201n0030
16709c144J39486k34066L269l2194j73009k3269L07j53060j2957L00081O2096
16698a26460j87872k04770O3825L76011n3719k27604K6920M55826K65652j43565
16688B44244p4174M9591l03367r2729L90041J66943J96993L05753k55920l20366
16678C07009l79396J72280o5072k49J06439L06206J09599L22887J17498m10901
$$ y = [124119, 137047, 95392, -21, 115646, -61199, -176161, -100135, -184046, -513347, -484650, -77406, 71101, -24640, -212759, -551489, -500553, -495217, -152550, -69417, -500534, -489415, -286386, -298483, -244423, 7958, -207733, -407480, -476395, -467038, -191118, 100315, 152094, 256513, 562265, 570340, 39012, -492307, -457934, -279798, -315707, -111553, -27315, 46886, -3144, 136342, -97724, -94455, -126649, -299658, -322927, -322620, -475680, -488637, -188556, -126460, -314332, -519102, -455277, -79266, -132985, -360589, -333669, 122157, 387809, 244244, 170070, 219661, -83706, -176435, 213606, 380549, 577542, 883295, 627375, 307009, -72387, 99893, 34821, 34572, 141011, 447217, 556816, 879703, 997201, 586300]
16668E86300L550J28907k37971l26679n3746q0445J55500K66105Q7259j64613
16658C64167j5479k15208p928L04700K08942k38452j62953l36544l9505J56118
16648A7858L4607J3515k0090P1350M3389q3337J9818j93225k86057j32356L04863
16637b09665K79086M4404l01993K2379K70609J17581p9814k71579J2498J74514
16627E8020N8185k37580K07460j17181k16921q8422J85190j02625m5075J80819
16617a18130j43732j53461o2767N0988K0495K11612K21641M33293m2730j94030
16607B23179l40193l06477j44742k85557L79944K97939J95149q6189k75692L8816
16597c03823K46700L3196j50176j60792j3005J003J33442j9265l7454o8362k4
$$ y = [586300, 589850, 718757, 480786, 154107, 100361, 19916, 175416, 441521, 528780, 364167, 348688, 133480, 125552, 430252, 639194, 400742, 237789, -98755, -138260, 17858, 52465, 65980, 45890, 117240, 160629, 77292, 97110, -96115, -382172, -514528, -209665, 69421, 113825, -188168, -165789, 104820, 222401, 142587, -128992, -116494, 58020, 116205, -121375, 86085, -31096, -248017, -336439, -151249, -253874, -298949, -118130, -261862, -415323, -478090, -427102, -406607, -194995, 26646, 459939, 417209, 223179, -117014, -423491, -568233, -853790, -473846, -175907, 19242, -66947, -342639, -303823, -57123, -23927, -174103, -334895, -347900, -346897, -213455, -232720, -270174, -338536, -338560]
16586c38560j08247P9894R8290J52372j03417j05406K2966J79292J48257j26796
16576a01355j70485l83201K89816l9352j06681K29137j24304j56447j07890K9773
16566f40989j56530J81382j01191n9736L34298L18773K71320L88098j22162k48395
16556A64868P9794o3555k02922j38676M9807k14750j64789k6683j65625m306J87322
16545d99515Q1829K38759M27278N5729l40765P6792L76998k56641m06270k24897
16535d70703J34624p5369K21534j647J3111K08631q7612M73927r7687l70561J05027
16524E3275P3238o3391j47746R3626J30982K42606q1328m5661K9530Q2953j172
16513C66912M5712k78631m3287K49102j17267j79562l33508J15133L01889o4753
$$ y = [-338560, -446807, -366913, -268623, -116251, -219668, -325074, -302108, -122816, 25441, -101355, -271840, -655041, -365225, -404577, -511258, -282121, -406425, -562872, -670762, -640989, -797519, -616137, -717328, -777064, -442766, -123993, 147327, 535425, 413263, 164868, 244662, 181107, -21815, -160491, -110684, -325434, -490223, -516906, -682531, -686837, -499515, -417686, -178927, 248351, 304080, -36685, 40107, 417105, 160464, -245806, -470703, -336079, -411448, -189914, -191561, -178450, 30181, -57431, 416496, 318809, -51752, 53275, 126513, 63122, -84624, 9002, 139984, 382590, 301262, 255601, 285131, 368084, 366912, 412624, 133993, 90706, 339808, 222541, 42979, -290529, -175396, 126493, 61740]
16503F1740j17510K6427J92361j69704O700j21582K7942K2485L63372L26443N233
16492F23907j83630j04673k51518q4913l0792l71081K29668K85508j36644j89302
16482b13470j81539p5836K88341J19915M3524K31940P9083O9844O9740o7692j48441
16471B15409k86897l24418K27088K81094q703R2218k20479k07712J5189O6567
16461a50644j6110K8465J75761l79446j71360P5520j53662l9004L63240O12593
16451C45353K11404j36579p1096j54037l2347k55711p9659J50662j67613k09659
16441c99282J80524K97639R1019L8132q7769o421r857J86234L60082k76966l70743
16430B592j35538M6248j13225r1755j37907J0631j00646J12502M41J67299N1865
$$ y = [61740, -55770, -29343, 163018, -6686, 14, -121568, -93626, -71141, 292231, 618674, 623907, 440277, 335604, 84086, -827, -31619, -402700, -173032, 112476, -24168, -213470, -395009, -470845, -182504, -62589, -19065, 212875, 291958, 361802, 431542, 363850, 215409, -71488, -395906, -168818, 112276, 103573, 195791, -24688, -232400, -217211, -150644, -166754, -138289, 37472, -341974, -513334, -437814, -591476, -630480, -267240, 345353, 556757, 420178, 349082, 195045, 162698, -93013, -172672, -22010, -189623, -399282, -218758, 78881, 169900, 208032, 120263, 113842, 103985, 290219, 650301, 373335, 2592, -132946, -86698, -199923, -291678, -429585, -418954, -519600, -407098, -406657, -239358, -187493]
16419a87493l79419j98765K91261K74901j44406r4401J19662J20212m0025r204
16409b47677J17003M55083l1358l79616l10753L12467q785j68835L18772R659
16399F5960q3326J26347m2974l91681N8799M68494j78518l84748j30413J72264
16389c19796J76278J63533J49589j89206n64926O0150Q8387j99627k18294j67180
16379a021092J94270N12901J90808n8995q692J1586P5298P5058L93806J33066
16369D98014K2108k87019l10625M2614m64731K7988r4717p2866R0676K37147K99901
16358a1510j21702m11023k69445Q6644J72090q1456J37962N42686K52488m93896
16348a97162m81272J6288K46493J46751N2757j52788j31831K06330J72573J04384
$$ y = [-187493, -566912, -765677, -474416, -199515, -343921, -438322, -318660, -198448, -238473, -247677, -130674, 324409, 293051, -86565, -397318, -84851, -93636, -262471, 56301, 65960, -17366, 108981, 66007, -325674, -266875, 201619, 23101, -361647, -492060, -319796, -143518, 20015, 169604, -19602, -584528, -524378, -435991, -635618, -853912, -1021092, -826822, -313921, -123113, -182108, -190800, -179214, -103916, -28858, 364948, 498014, 520122, 233103, -77522, -34908, -499639, -471651, -566368, -639234, -548558, -311411, -11510, -133212, -544235, -813680, -727036, -554946, -636402, -498440, 44246, 296734, -197162, -678434, -662146, -415653, -268902, -216145, -368933, -500764, -294434, -121861, -17477]
16338a7477j72688n6294L81845N5712j87404l51309l34274p172O7678M76088J61776
16327A6481K33937K26718p1138j0834K4467l6415o8444m2773r8799n12286m550
16316c43636J98630j08025j30528J61135M7497p0759j86323m377J97869n79N894
16305b33202l4823k61162n5982o9736l22405K7876J75932O32323L83557o4167
16295A78211P8965j46444k44486K5831J62349J76689j81544o6292J28837q4613
16285B7503J10071K21499n90865n9459J89598J02757j61033j61759K19069K3043
16275g9576j85809k19832O616M89983N45330o435J11604j81987k01619p8473k94583
16264i4781r254k65011o7202K25298J49432l07112j34082k05884k3964J68121
$$ y = [-17477, -190165, -246459, 135386, 191098, 3694, -347615, -681889, -689061, -621383, -145295, 16481, 250418, 477136, 405998, 395164, 419631, 383216, 314772, 271999, 173200, -339086, -343636, -145006, -253031, -383559, -222424, -174927, -245686, -432009, -436386, -238517, -239096, -233202, -268025, -529187, -585169, -654905, -977310, -949434, -773502, -141179, 242378, 178211, 257176, 110732, -133754, -107923, 54426, 231115, 49571, -16721, 112116, 27503, 137574, 359073, -231792, -291251, -101653, 1104, -159929, -321688, -102619, -79576, -265385, -485217, -478601, 11382, 556712, 550277, 661881, 479894, 278275, 199802, -94781, -104035, -369046, -436248, -210950, -61518, -368630, -502712, -708596, -732560, -564439]
16254e64439L09492L2708K89915J11369j81419j98454j33790J29748K37662j56085
16244a23293l52066K04437J4137j09448R9955r8581K77040K46758P0959N1202
16234B81100K898m3950l5317n7775J40869K17917j14308k43710m9871j0847l25211
16223b38205j42723L51594K17400K38703R3959k47496l28019R0493J52591q2482
16213A05815J8574n6566j00326Q4296P1281k0429k35524m40059K6925k64896J14609
16202f96300J14745J9821J06761O4163J92706j82725K86347J59413p3l3894J2017
16191D2981l81733J71982L37893j60694M3261J49149r0914P8730J39837k2502
16181C07990Q1803J90099k90939l38420k56679M26088K49144l14310k49799J119
$$ y = [-564439, -254947, -222239, 67676, 179045, -2374, -200828, -334618, -204870, 32792, -123293, -475359, -270922, -256785, -366233, -266278, -364859, -87819, 158939, 229898, 281100, 283998, 240048, 204731, 146956, 287825, 505742, 391434, 147724, 97853, 87006, -238205, -380928, -29334, 188066, 426769, 520728, 273232, -54787, 35706, 188297, 105815, 124389, 67823, -32503, 51793, 123074, 102645, -132879, -572938, -546013, -810909, -696300, -581555, -561734, -454973, -390810, -198104, -380829, -94482, 64931, 64858, 30964, 42981, -338752, -166770, 171123, 10429, 53690, 202839, 111925, 190655, 330492, 307990, 389793, 579892, 288953, -49467, -306146, 119942, 369086, 54776, -195023, -193904]
16171a93904L83898J53670K3663l13168k98639l10685r2610J18462K5945O4989
16161d38379j42871J33598J34093p9893Q8547j66219k29949r7589L905M59816
16151c34941L0885l2549o6671k3184L41921j07581J4280K97200M42466J72364
16141G34190J16605J40320m72910m01641O6476j84267p6871k07295K56280L40916
16131C11803J17859j22390P7182j03343l12064q8356l04137j0326K72001J84579
16121B2808j51078j77522J74658R2002K7170n0535J89441n8765J0372J02024k47506
16110f6931k96820l25932K1583M09496J74872j60696j16550J50350R6980J20807
16100G159J2378j39543j28028K01640j72445k52241j40957K15612J1995L06554
$$ y = [-193904, 189994, 343664, 367327, 54159, -244480, -555165, -647775, -529313, -503368, -438379, -581250, -447652, -313559, -393452, -304905, -471124, -701073, -798662, -794757, -334941, -304056, -336605, -403276, -426460, -84539, -192120, -177840, 119360, 561826, 734190, 850795, 991115, 518205, 116564, 183040, -1227, -78098, -285393, -29113, 311803, 429662, 307272, 384454, 281111, -30953, -119309, -423446, -433772, -161771, 22808, -128270, -305792, -131134, -39132, -11962, -62497, 126944, 68179, 78551, 180575, -66931, -363751, -689683, -668100, -258604, -83732, -244428, -360978, -210628, -113648, 7159, 19537, -120006, -248034, -46394, -218839, -471080, -612037, -396425, -384430, -77876]
16090g7876j76799N3093K36371R0348l68858o3394l7801k5582N0159P6068o1817
16079c06088J5570j82886k8984R2886J65352L02298m7073n27204N0024L09355
16069a56750O4884l0770j70108o0109j36812j63324M4793j11389J64554J83077
16059c71954o3633l0713j76839k37456r298K68273J51138p4061L7181M74567J32897
16048A00102o5862k42914N0073J8002J70812l52446l08326k65394j4364N26850
16038c83467K78065l808l90383J24878J22631J2614j01552N6820J99319K73205
16028A88322j78694L0976K24640J55086Q873j77162j72594j20358J14504J38694
16018B12287k02696o0613J3998k5102k03772P5622K59526L39009J57835k24656
$$ y = [-77876, -254675, -201582, 34789, 125137, -243721, -307115, -344916, -370498, -320339, -244271, -306088, -290518, -473404, -502388, -409502, -244150, 58148, 11075, -516129, -466105, -156750, -91866, -122636, -292744, -352853, -489665, -652989, -608196, -719585, -555031, -371954, -435587, -466300, -643139, -880595, -889893, -621620, -470482, -544543, -507362, -32795, 100102, 34240, -208674, -158601, -140599, 30213, -322233, -630559, -895953, -910317, -383467, -105402, -109210, -499593, -374715, -252084, -239470, -341022, -284202, -84883, 188322, 9628, 40604, 265244, 420330, 429203, 252041, 79447, -40911, 73593, 212287, 9591, -51022, -37024, -62126, -265898, -190276, 69250, 408259, 566094, 341438]
16008C41438m72697l05329j59140l9533J44325k34622Q9193L97089K4248n9833
15998b74861N5000n509j28050j34399j99585M6198J29345J16729q6021P7059n3772
15987d57866J6347L0010K47519R2843l34089L39797J72356K13870k97034j46002
15977a22249k57668j13461m3764J85971L27239L7272p540m0656J80225J95897
15967C41266P8282j83895j69117K48071L37678k15426m61398k21341J57508L09171
15957B20799j01194k87025q5262m2409l05600L23350o3997J3559L31131M0979
15947D4331j10174k34029k97857j2246P9917J44159j13752K01379L73923j81583
15937a05932L0702j41402j53883q6680M216J26823j05168K34289l106l5944M55799
$$ y = [341438, -131259, -436588, -595728, -635261, -490936, -725558, -636365, -239276, -215028, -274861, -219861, -225370, -353420, -487819, -687404, -641206, -511861, -395132, -481153, -404094, -457866, -441519, -411509, -163990, -71147, -405236, -65439, 106917, 320787, 23753, -122249, -379917, -493378, -537142, -351171, -23932, 13340, 5800, -34856, 145369, 341266, 419548, 235653, 66536, 314607, 652285, 436859, -24539, -245880, -88372, 220799, 119605, -167420, -252682, -295091, -600691, -277341, -341338, -327779, 3352, 44331, -65843, -299872, -597729, -609975, -530058, -385899, -499651, -298272, 75651, -105932, -75230, -216632, -370515, -457195, -452979, -326156, -431324, -197035, -200141, -236085, 219714]
15926B19714J91898k70707r9363J65705J66736M44979R3197l22842j68686m17771
15916B860R0887K11562K0309R6892k6401j75618J72914j66641m3487K7699k05082
15905E894J50551M2315P4647K53695j73918k85457j39578k05483j14068K12894
15895a78508J31105j56783j42860M0938K65299o2069j9952r2088l8343J82943
15885g0318q9134L26198j65302q815J6837k04762n0801L24028k4992k13657J11646
15874d9072K88208n9821j28117N817K61303j51959k95429j70647m79332L62558
15864d16491N49628J9677k35778O559k39620m26648j53831P2014J8090m315K69683
15853e41032P2612q1323j17922K80374J17044J24872O9863K61529k05318n9431
$$ y = [219714, 411612, 140905, 41542, 207247, 373983, 818962, 912159, 589317, 420631, 2860, 93747, 305309, 325618, 422510, 396109, 220491, 393405, 226764, 183277, 210976, 5894, 156445, 198760, 273407, 527102, 353184, 67727, -71851, -277334, -391402, -178508, -47403, -204186, -347046, -306108, -40809, -102878, -122830, -214918, -253261, -70318, -159452, 166746, 1444, -7371, 9466, -195296, -246097, 77931, 52939, -160718, -49072, 239136, 179315, 51198, 57015, 318318, 166359, -129070, -299717, -779049, -416491, 133137, 152814, -82964, -76405, -316025, -742673, -896504, -824490, -806400, -810715, -541032, -468420, -549743, -667665, -387291, -270247, -145375, -75512, 186017, -19301, -78732]
15843g8732L19087J64304o2320K1301j59075r3356p469J05247L22826k0600k5607
15832D85606j18779K87645r5158j22094l72299p541l11595O2757j25208J84691
15822a31975J04741K05956j45909m1557N3114J49704j55793K2758J44608k79357
15812g3710k70389m6840k06448l6409J6075J33580k6562j25163M76140J26617
15802c3109k0257j24211R2536p7472P476m5539p6708O488Q3586k7866l4886L76616
15790A26654r9982r8498L9512J14872L38361p4642P835j38860j88506m02065k82711
15779f58030j84322K20683M08052j7620l20022j48007M25043K25225J28682K92822
15769C72506j22560j78343j76203k09860J36431J17512Q3218j73911k07218J43888
$$ y = [-78732, 240355, 404659, 342339, 363640, 204565, 111209, 103740, 208987, 531813, 511213, 485606, 366827, 654472, 559314, 437220, 64921, 57380, -254215, -191458, -316666, -131975, -27234, 178722, 32813, -8744, 44370, 194074, 38281, 61039, 205647, -73710, -344099, -390939, -597387, -633796, -617721, -484141, -510703, -635866, -159726, -33109, -53366, -177577, -85041, -162513, -155037, -200576, -277284, -270796, -187210, -215076, -249962, 126654, 26672, -71826, -32314, 82558, 420919, 346277, 354112, 215252, 26746, -375319, -658030, -842352, -621669, -213617, -231237, -551259, -699266, -274223, -48998, 79684, 372506, 249946, 71603, -104600, -314460, -178029, -60517, 22701, -151210, -358428, -214540]
15759b14540K58071k55685m4779J85372m1830j38233j05779N5679J46874K7021
15749a27829q6845K25051l3184l65063k88280j36357L19447L73858J19116j65216
15739a65302n88066K24172L95723k15739n23625R1108M34305K63327R3277K43426
15729B52606M2672n51650k00563j58541K29890j55660L89102Q7561n8777K59472
15719A36112k44130j3663k28912l1683k8610N7225R5293P7100K16809J87748J22152
15708C45441L6342j9756k07025q6001R9861P2766p1041o7689J57391L6910M772
15697C01971j55582k45482j07058j78253k42572k3138q3749J58345K52250K09297
15687a13971k7026J93575P8185N7781k79476j59141p7842N60J20238J45913q0689
$$ y = [-214540, 43531, -212154, -256933, -71561, -113391, -251624, -357403, -301724, -154850, -127829, -214674, 10377, -22807, -387870, -676150, -812507, -493060, -119202, -86, -165302, -753368, -529196, -133473, -349212, -872837, -781729, -347424, -84097, 9180, 252606, 295278, -256372, -456935, -615476, -385586, -541246, -152144, -64583, -123360, 136112, -108018, -121681, -350593, -382276, -410886, -353661, -258368, -181268, 35541, 223289, 345441, 381783, 362027, 155002, 69001, 168862, 241628, 170587, 102898, 260289, 297199, 301971, 146389, -99093, -206151, -384404, -626976, -650114, -733863, -575518, -323268, -113971, -140997, 52578, 130763, 188544, -90932, -250073, -327915, -327355, -207117, -61204, -141893]
15676a41893Q2990j01971j19073J01470J68552m01262j05941k26279K91421P64113
15666C12127J01250m49062n05670J59478J84416J89311j99995j30544Q9961L20666
15656G1938p8601j35215J22511l99372l00440K26626N021j29541M1717K03732
15646c71624J48142K13897j87961j34555M3761j49394L2526J40545J83302J1008
15636g0353j6711J52922m3499l45900Q0451K1581J0793J80459M3199j79262P7187
15625h9133J3849n7082R1391P3584j89858L2211J94349l06676k65698k04500J19102
15614e88461K11638J11710k8680j75360j01986j79573l791P0716j45185o3331
15604h92303j29618K25645M13829j1430j22098Q4436M0881l48658J82246L56385
$$ y = [-141893, -58903, -160874, -279947, -178477, -9925, -411187, -517128, -743407, -451986, 312127, 413377, -35685, -541355, -381877, -197461, -8150, -208145, -338689, -248728, 71938, -6663, -141878, -19367, -418739, -719179, -492553, -487532, -617073, -575356, -371624, -223482, -9585, -197546, -332101, -288340, -437734, -405208, -264663, -81361, -70353, -87064, 65858, 22359, -323541, -243090, -221509, -210716, -30257, 12942, -166320, -89133, -75284, -132366, -40975, 32609, -157249, -125038, 69311, -237365, -503063, -707563, -588461, -376823, -265113, -293793, -469153, -571139, -750712, -754503, -683787, -828972, -892303, -1021921, -796276, -382447, -393877, -515975, -431539, -390658, -739316, -557070, -200685]
15594b00685J05497k7516j9321n3120M6046K90160m88542j08854J11665n7101
15584d01771Q5374L62937M5828q0913L8239r5632L65499L34733k60571n81233
15574a87510n00154r0708K68602K89834p0187n05310J9983O25229M25543K12303
15564D87625P8677l57351j40603J89524o8742k50194J89936J0017l91789j18025
15554c70925j50705M16572J03801r5731l5243p8601J21057n7635j77380r4841
15544d19631q848J13201K05773J20151j19387m5931j02240Q2670K52367J52268
15534B30393J37016p7607l10621J14880M7473r9856j51291p8757m85396N26323
15524a47443J47417j79772K78374Q9579j90482j83108l75147k20476J98161K08934
$$ y = [-200685, -95188, -122704, -142025, -195145, -149099, 141061, -347481, -456335, -344670, -401771, -316397, 46540, 92368, 11455, 49694, -45938, 319561, 654294, 393723, -187510, -687664, -778372, -509770, -219936, -290123, -795433, -775450, -150221, 275322, 487625, 566302, 208951, 68348, 257872, 189130, -61064, 128872, 138889, -252900, -370925, -521630, -105058, -1257, -96988, -132231, -210832, -89775, -147410, -324790, -419631, -428479, -315278, -109505, 10646, -108741, -154672, -256912, -174242, 78125, 230393, 367409, 289802, -20819, 94061, 141534, 41678, -109613, -188370, -673766, -147443, -26, -179798, 98576, 188155, -2327, -185435, -560582, -781058, -582897, -373963]
15514c73963K59006R1700k5992j67283K11470O1860j75155J85863j96961L239
15504a26216K95715K82599j23512l03226Q7442P7853j22607j62230j691j99849
15494b95722K9211K41227m4640J58076J03285J12599j09546n4155O3870k92420
15484h8215k83314k91661L14283J67069n3249j82982L45614M22859J5096J04375
15474D69875j67459k83945l38022P2353K14132k03427l03848K56034j9894j69844
15464d74045R7174M6628J69451L1346k58985Q689J40568N7426j88232k12310J39950
15453d42340L46601K03758O3478k15131j37791L24594j10522j56837j86164q225
15443c18579K83136K53701j890k75328K6903J01018q7780K13605J74131J76960
$$ y = [-373963, -114957, -23257, -49249, -216532, -5062, 56798, -118357, 67506, -129455, -126216, 169499, 452098, 328586, 25360, 112802, 190655, 68048, -94182, -95873, -295722, -266511, -25284, -69924, 88152, 191437, 304036, 194490, 140335, 204205, -88215, -371529, -663190, -348907, -181838, -235087, -418069, -72455, 350404, 365500, 469875, 302416, 18471, -319551, -247198, -33066, -236493, -540341, -284307, -304201, -474045, -376871, -330243, -160792, -129446, -388431, -379742, -239174, -181748, -369980, -582290, -442340, -95739, 108019, 171497, -43634, -181425, 143169, 32647, -124190, -310354, -318579, -35443, 218258, 216368, -58960, -32057, 68961, -18819, 194786, 368917, 545877]
15433E45877K02451k41014j85914p343l39756m87301m48135J49439M54876L77146
15423B0326J5881K49048K57959j54704m1495j55206j35129J62246j93648j84797
15413a59519J33388M0560l72519k54255L27726K23932l36205m97601j30930M21765
15403f03658J51088O8152K99703R3322L5707j3192k85015k37091L32656L26173
15393A67845j08641j62991j54892K16643K0293o8943L78890K56318j59545m13902
15383b8925k59891M90299K38673k85448j58462r0973k76836j9477J99722K67055
15373G5737K65127j40206p3008J11446R7301J20713Q7100j17709m20125k50873
15363b44497n4611j46658J66749k38974j23323R1974M35562J85153M1572J9994
$$ y = [545877, 748328, 507314, 321400, 314057, -25699, -513000, -961135, -811696, -356820, 20326, 36207, 285255, 543214, 388510, 347015, 191809, 56680, 218926, 25278, -159519, -26131, 14429, -358090, -612345, -284619, -60687, -396892, -894493, -1025423, -603658, -452570, -384418, -84715, 8607, 44314, 31122, -253893, -490984, -158328, 167845, 59204, -103787, -258679, -42036, -21743, -90686, 288204, 544522, 384977, -28925, -288816, 201483, 440156, 154708, -3754, -94727, -371563, -391040, -191318, 75737, 340864, 200658, 127650, 239096, 336397, 457110, 544210, 426501, 6376, -244497, -299108, -445766, -279017, -517991, -641314, -549340, -113778, 71375, 112947, 132941]
15353A32941J50606r2000M255k08198j28358r8370k13572J17979L66419J92272
15343B23974k83266k1756R4159J03663k58914n5668M77257l50393k69646k0778
15333c61368L67139L50920l6572k99307j28021K27900l06752j57010o0889J35178
15323b68782L6235j10025j36865j15511L10802K7737k40187J10094L16644K61844
15313A91986j49552j57536M7902J02086j06017j29672J01420p3969k79955k31292
15303f84599L73581L21340p5644l40896m947J17994j01976l3989K72118K2851
15293a34167k50424O7359J09735R2669k64920m7012J16297J0822J09794L37492
15283A47645J13485l56512n6186J59559k3742k87869m14182r6338N40561K2149
$$ y = [132941, 283547, 191547, 195802, -12396, -140754, -239124, -452696, -334717, 31702, 223974, -59292, -81048, 13111, 116774, -142140, -197808, 279449, -70944, -340590, -361368, 5771, 356691, 320119, 20812, -107209, 120691, -186061, -343071, -403960, -268782, -232547, -342572, -479437, -594948, -284146, -256409, -496596, -386502, -69858, 191986, 42434, -115102, -67200, 34886, -71131, -200803, -99383, -173352, -453307, -684599, -311018, 10322, -65322, -406218, -411165, -293171, -395147, -429136, -157018, -134167, -384591, -317232, -207497, -114828, -379748, -426760, -310463, -299641, -189847, 147645, 261130, -95382, -151568, 7991, -15751, -303620, -717802, -814140, -273579, -251430]
15273b51430n1981L15182N1879j05455J55985J2386J34824P8217Q6616j41286
15263B84937j47966R8475q9662k40800k95089K50078J00725M6740k24322m29610
15253f46494J9394K22914Q0938m1903O1260J64847P5428k29388J38152j4574j55279
15242c24705j1437K32974K21615l6254l45697l07286l04253J30264J13267J82824
15232d48688J92138J53275j11489k48685J47366J41972K1601J19039K69043J21841
15222C57413l16370k98028O2467K7801K11304r6469j40439K5437q3822O1093J18660
15211g0953n7989q0982K2258P4531K16977k833k39184m6436l81538J04623M64434
15200B908L54364R3377l7932k13446l30218K16145k80673k105J35266Q4746k78460
$$ y = [-251430, -303411, 11771, 63650, -41805, 114180, 126566, 261390, 339607, 426223, 284937, 136971, 235446, 145784, -95016, -390105, -140027, -39302, 7438, -216884, -646494, -627100, -404186, -323248, -365151, -303891, -139044, -63616, -293004, -154852, -169426, -324705, -336142, -103168, 118447, 82193, -263504, -570790, -875043, -744779, -631512, -448688, -256550, -103275, -214764, -463449, -316083, -174111, -152510, -33471, 235572, 357413, 41043, -256985, -194518, -166717, 44587, -51882, -192321, -166884, -250706, -189613, -70953, -128942, -209924, -187666, -113135, 103842, 101009, -138175, -184611, -566149, -461526, 2908, 357272, 450649, 412717, 199271, -130947, 85198, -195475, -197580, -62314, 22432, -256028]
15189b56028L55142K61344l73010J16361P3342l35043k59474o3656M3138J68570
15179b69314m6170Q7362P2565l9044Q297L01078l35282K1845N9529P1595J15598
15168D8059L03321J78008J14738j0292l21701k06465O9156J44227j33222p6191
15158A09638J2642K64086k25916J172K0418l05975k55876M41408J30503l535k86348
15147i7783M0971J89923J88186M5039J08237m28754l60174m5512m00983k85222
15137a046072M10646L8903K89728L06530M48256K08853j67976k15830j67336j04780
15127I22M5360j24217k18490J7285K7525K82246L61J2927K55558O4337N6753m49071
15115b8504n733O942l91607j01743R9043K04503r1217k4341J58271m1790j14588
$$ y = [-256028, 99114, 360458, -12552, 103809, 177151, -157892, -417366, -481022, -437884, -269314, -315484, -228122, -155557, -194601, -186304, 114774, -220508, -198663, -139134, -67539, 48059, 351380, 529388, 644126, 633834, 312133, 105668, 174824, 319051, 185829, 109638, 122280, 386366, 160450, 161622, 182040, -123935, -379811, 61597, 192100, 188565, -97783, -56812, 133111, 321297, 366336, 474573, 45819, -314355, -359867, -760850, -1046072, -635426, -596523, -306795, -265, 447991, 656844, 488868, 273038, 105702, 922, 46282, -77935, -296425, -279140, -251615, 30631, 30992, 43919, 299477, 363814, 420567, -28504, -34237, -27295, -418902, -520645, -421602, -217099, -308316, -332657, -174386, -216176, -330764]
15104c30764p1234o6817l0326k15679J57664q5145J38789J24546q6114l88784
15094h53864l7457K96251K04479J89416K67207j28505j48847K52262K28866j6733
15084B53075k07674l63000N0753J50571P3959j92928k5136J3340O2977m2944J28842
15073i8165K15217k04437k50350j52607L09527P4411m7580j8370p6725Q0992K48999
15062H0912J59385J63553l09620j13759O1155n1386l52420k76901J45472K34805
15052b58804K15373k36628n42189j05913J28632j25388l6453K46404M16437o0860
15042c59389o4914J31154J86905q9856o1853O8572K09470k42852l0172j34542
15032c87477l4709P1366K76508p6661j67273J16943N09568K60526K1568j50044
$$ y = [-330764, -401998, -468815, -499141, -714820, -557156, -642301, -503512, -378966, -465080, -853864, -891321, -595070, -390591, -201175, 66032, -62473, -211320, 40942, 269808, 253075, 45401, -317599, -266846, -116275, -42316, -235244, -260380, -247040, -184063, -227007, -98165, 117052, -87385, -337735, -490342, -180815, -106404, -153984, -172354, -249079, -168087, 80912, 240297, 403850, 94230, -19529, 41626, -9760, -362180, -639081, -493609, -258804, -43431, -280059, -822248, -928161, -799529, -924917, -961370, -714966, -298529, -359389, -424303, -293149, -106244, -196100, -257953, -189381, 20089, -222763, -252935, -387477, -422186, -350820, -74312, -150973, -318246, -201303, 308265, 568791, 590359, 440315]
15022D40315l25311J85087l5489j13224q4394j13388q4438J37974K304l67862
15012c58426M7831q0725K59650K97079J2227j3030N24478K72043K9113l64984
15002F25256l48522k79815j36444k04701j02007K31241L5812m4729L37207k81712
14992a68414j02293J56922N1408j12042j00292Q5472M9142K17592r5541j61737
14982a79783K09935M5285p1988l25466M1440J84956m45270J23418L33607j73680
14972b57546j38725M51118j20271M9214m55o9928k2788K76766L7380J1171k9360
14961A86576k24513O4245L52012J5950Q8562j8867r9376j64554n37029R720K28289
14950i8985J32418q6741q0938r7485O9626K36127K71477K36395J14045n68662
$$ y = [440315, 115004, 300091, 264602, 151378, 66984, -46404, -130842, 7132, 9436, -358426, -310595, -391320, -131670, 165409, 177636, 164606, 689084, 961127, 990240, 625256, 276734, -3081, -139525, -344226, -446233, -214992, -179180, -223909, 113298, -168414, -270707, -113785, -62377, -174419, -274711, -189239, -140097, 77495, -18046, -179783, 30152, 75437, 3449, -322017, -280577, -95621, -540891, -417473, -83866, -257546, -396271, 54847, -65424, -16210, -16665, -86593, -109381, 167385, 204765, 215936, 186576, -37937, 26308, 378320, 394270, 482832, 463965, 364589, 200035, -336994, -327274, -98985, 33433, -53308, -134246, -231731, -162105, 74022, 345499, 581894, 695939, 127277]
14940A27277q3706M2287N4075k04766k82119J63175k2320K9539J5058j3692J78850
14929C658J18067k58934k70550l34189J23104K74594L14977o7790l72036L10744
14919a58355L07185J87045n1642k81587j84429k60590l0162L27051J04563j27720
14909a68641k530Q2326L88989j38782k33752J88591R658j46915O2917J36907k8620
14898A50148k73835l55697k03958j39016N4739L58196j2058L20116j0725K72609
14888A60519j15635J61199J2972j59242r0881l62311J35517j59542l8034R6886
14878c58552j44958q4779L35050J34353J34082J08560n28n4809k08090j02813
14868b42484J5199M9125j2131o7069J61537L53394n2110m56459j43796r7173K11136
$$ y = [127277, 43571, 85858, 139933, -64833, -346952, -183777, -206097, -176558, -161500, -175192, 3658, 121725, -137209, -407759, -741948, -618844, -344250, -29273, -97063, -469099, -158355, 148830, 335875, 284233, 2646, -181783, -442373, -472535, -145484, -40921, -168641, -171171, -88845, 300144, 161362, -72390, 116201, 125859, -21056, 41861, 178768, 150148, -123687, -479384, -683342, -822358, -767619, -409423, -421481, -101365, -112090, 160519, 44884, 206083, 219055, 59813, -31068, -393379, -257862, -417404, -455438, -358552, -503510, -588289, -253239, -118886, 15196, 123756, 123228, 68419, -139671, -242484, -227285, -178160, -190291, -257360, -95823, 257571, 205461, -250998, -394794, -491967, -280831]
14857b80831L12514R8393j25054m2206K062J9395J06122Q3253J60864J23002k24862
14846B32652o5650k47737k24655J97416P8922k56693J85202O2934J45863j29140
14836b0886l27126k36723M3556k3426q0274K50766K84194J67317N835o0586p405
14825d758k714M3068k636R648J02553m5421P3069Q4339l09290q7731n5227k14886
14813d09986j17804K4974K67313j43219J72376K01267j09738J00480j23485R2911
14803d4911J87397l60266j19788j2510K53329K17960m0882r3926J2032k76147
14793b77712k75635O7020J1583L81233K40477L5080r1607J12595J56598J04946
14783D64578O9955l42944l16599o5178J28980L38273q467m8630M9919j38558j40964
$$ y = [-280831, 31683, 130076, 5022, -37184, -35122, -15727, 90395, 173648, 334512, 457514, 232652, 167002, -80735, -305390, -107974, -29052, -285745, -100543, -37609, 108254, -20886, -348012, -584735, -541179, -564605, -644879, -394113, -109919, 57398, 63233, 2647, -4758, -7472, 35596, 32960, 42608, 145161, 99740, 172809, 257148, -52142, -139873, -195100, -409986, -527790, -502816, -235503, -378722, -206346, -5079, -114817, -14337, -137822, -44911, 142486, -217780, -337568, -350078, -96749, 121211, 80329, -13597, -1565, -277712, -553347, -486327, -474744, -93511, 146966, 182046, 90439, 203034, 359632, 464578, 534533, 191589, -125010, -190188, -61208, 277065, 268598, 219968, 269887, 131329, -9635]
14772i635k00750J53794J3989j54087J77964p6125P0279l38279K1736J53954L34574
14761A47414k9285k74816j08653L06446K18280J90200k90944L1391j4397j19412
14751E6224m39463n673L22767j46385m47150j51388K00789N58038m5708j30724
14741b28673J3051j19961j49046N3787m7847J34644j4329o2835L35322K6594K41338
14730A82045j1135j14932j25398j16248l2443K08565K53867l29561j10077l3925
14720b29242k47630J21436N60858J94989k51847J5918l75358j79001L23562M65576
14710C99261k16725l54629k92399l1057N2728k30786J2709K36048K23386K01400
14700f4j24174l25833o8046J42421N218l74878j45527J02539P1757K37024J83007
$$ y = [-9635, -210385, -56591, -42602, -196689, -18725, -94850, -24571, -362850, -341114, -187160, 147414, 118129, -156687, -265340, 41106, 259386, 449586, 158642, 190033, 175636, 56224, -383239, -388912, -66145, -212530, -659680, -811068, -610279, -52241, -97949, -228673, -215622, -335583, -484629, -430842, -478689, -344045, -358374, -421209, -85887, -59293, 182045, 170910, 55978, -69420, -185668, -218111, -9546, 244321, -85240, -195317, -229242, -476872, -355436, 205422, 400411, 148564, 164482, -210876, -389877, -66315, 399261, 182536, -172093, -464492, -495549, -442821, -673607, -660898, -424850, -201464, -64, -124238, -450071, -518117, -375696, -370478, -745356, -890883, -788344, -716587, -479563, -296556]
14689b96556r5021k35149P603M06420R4428j20631J44849J04122l6579j60814
14679a87328J34104M98999N2610k54734j76615j16172P1951J47152j07187j58922
14669i6142m5403q3076J45676N85866k22504j71044n4850j68912q0304m3421R648
14658b24466P1516L81904K34716k15491r4712k59722q7034K49025R2766k85397
14648a36895P2576J45082j12309j85320p5666J54418j81305K71356J78094K9417
14638A59448k15882j06217K16531Q5213k21512k11017R5572O6456L5730J28534
14628C2856P7223J76248K5564l97790n11497k4574J39652M27344L21098j19184
14618A46940k20988L93523P1660l73843k71038J39769K37062k98620o8593K47172
$$ y = [-296556, -391577, -626726, -619123, -212703, -118275, -238906, -94057, 10065, -26514, -187328, -53224, 445775, 498385, 243651, 67036, -49136, 22815, 169967, 62780, -96142, -141545, -224621, -78945, 506921, 284417, 113373, 58523, -110389, -190693, -234114, -224466, -152950, 228954, 463670, 248179, 153467, -106255, -193289, 55736, 148502, -136895, -64319, 80763, -31546, -216866, -292532, -138114, -319419, -48063, 130031, 159448, -56434, -162651, 53880, 139093, -82419, -293436, -197864, -131408, -95678, 32856, 110079, 286327, 311891, -85899, -597396, -621970, -482318, -54974, 266124, 146940, -74048, 319475, 391135, 17292, -253746, -113977, 123085, -175535, -244128, 3044]
14608C044P5372n14721J23791L14339J08227k49463l235Q8205l017m3605r8291
14597a99354K49199K79259J42394J33087q0505l89434k08016l13492r9580j13114
14587e99556Q4253K07136J70110J43260n5057j95647J2225J21197R7068o0050
14577g5061m7962K72552J59364J95609J44202L3398k67745k9156K2054j26562
14567B80693J38315q2785j95174r7774j70367m1377l4273j02346L01869R9483
14557I6264j14114l1728j52480k18915j04024L92247M35066q2379k13465q173
14547a701j4312L3771Q1714L4225k62949J61892J84325l13903O70p2082j9361
14536a87711j72001k05933p0648K9073K75109K1369J19727O5248M5581l82713
$$ y = [3044, 78416, -436305, -312514, 1825, 110052, -139411, -142646, -54441, -57458, -101063, -199354, 49845, 329104, 471498, 604585, 524080, 134646, -73370, -386862, -486442, -599556, -515303, -308167, -138057, 5203, -49854, -245501, -233276, -112079, -15011, -75061, -123023, 149529, 308893, 504502, 648704, 682102, 414357, 385201, 407255, 280693, 419008, 336223, 141049, 43275, -127092, -168469, -202742, -305088, -3219, 96264, -17850, -49578, -202058, -420973, -524997, -132750, 302316, 219937, 6472, -1701, -16013, 17758, 99472, 133697, -129252, 32640, 216965, -96938, -96268, -168350, -187711, -359712, -565645, -636293, -607220, -332111, -310742, -191015, -125767, -80186, -462899]
14526d62899q7847N13389J26575j32349L2797j16044N2647L986j32718j49375
14516c51838O6737J515N9226M8682K53616R8687j36483J0558J38432J57696N5121
14505D01949k342j48166j27523l8143K97632Q7501l58563l51351J80963J8399
14495c9644j80034j17626J79935N07356M4124m26197l64618Q8786J26722M3188
14485a38008r5758j42686J16530r9602J89055M9453N8062N2582m50168J271K11182
14474b48087L79229K90634m10309j2539O19625J45751m40015j44607O8304m1763
14464B06223m78237J95930J30821n4931L86712P6423J62193M8406p9790j98146
14454C95604j83695j33332q8071K7412q9976K32805K7486j47924j51055k86l13178
$$ y = [-462899, -550746, -37357, 89218, -43131, -10334, -126378, -73731, -69745, -202463, -351838, -285101, -283586, -224360, -175678, 77938, 176625, 40142, 50700, 189132, 346828, 401949, 399607, 251441, 123918, 85775, 383407, 470908, 112345, -239006, -58043, -39644, -219678, -337304, -157369, 349987, 394111, -32086, -396704, -307918, -181196, -138008, -233766, -376452, -259922, -359524, -170469, -121016, -62954, -10372, -460540, -459269, -248087, 131142, 421776, 11467, -1072, 618553, 764304, 324289, 179682, 247986, 206223, -272014, -76084, 54737, -194, 386518, 462941, 625134, 673540, 593750, 395604, 211909, 78577, -9494, 17918, -72058, 160747, 188233, 40309, -110746, -111032, -424210]
14443d24210j07836J01426O2614j79901K56130N06805r8756k54683k67395j0745
14433d16551j8097K68260J71822O200j85772m20396J85063J87553K82240M8144
14423A08466j53812J51048j16405J47170J64085l0028j64535J04050J82627k20504
14413A72162j50947P3617j22207L5493j34187K68772L65828l08735k36086l53543
14403c89833k14163J94571J12497Q0l1834O6257R496K39855m4477p5855K53378
14392A19972K09733M5915J29926L1536k33106l92731j46757L78120K96446j51586
14382B87468k47126k81012j98158J51506K61520K78623L02259M6570l46623m9039
14372B05988p4415J83723J99059l38046l84792J73182j03942K19320K40500j06797
$$ y = [-424210, -532046, -430620, -368006, -547907, -291777, 215028, 116272, -138411, -405806, -416551, -434648, -166388, 5434, 11634, -174138, -594534, -409471, -221918, 60322, 108466, -45346, 105702, -10703, 136467, 300552, 270524, 105989, 210039, 392666, 172162, 21215, 94832, -27375, 8118, -126069, 142703, 508531, 199796, -36290, -389833, -603996, -409425, -296928, -296848, -328682, -262425, -252929, -13074, -57551, -133406, 119972, 329705, 375620, 505546, 537082, 303976, -88755, -235512, 142608, 439054, 287468, 40342, -240670, -438828, -287322, -25802, 252821, 555080, 601650, 255027, 205988, 131573, 315296, 514355, 176309, -208483, -35301, -139243, 80077, 320577, 213780]
14362B13780m7160j89161k59011p7600K71932Q4330r5264K14787j00797k83188
14352b67352k51834P6879o9317p410L36328K53035q8503j30344J30463k7796P0193
14341B4342J03091O6332l49367N2921O0501O9619K03121j21259J58339j86369
14331H1271m82922K76873r0736j47604o4898J51419K78810J69574P5363J55490
14321D02640k22877l47711k34013K91605L21792n9739O8720k74325O4424J19832
14311A30348m1059m49427j47421J30106L53682K24676j0065k69876J27469J26248
14301A74681j32334l23664o2936J06004J12333J73336M09769n6296l23135K6873
14291A04631L98511o6872l44056k73875J9925P3237L4457j93119J45252J99784
$$ y = [213780, 166620, -22541, -281552, -359152, -87220, -2890, -98154, 116633, 15836, -267352, -519186, -442307, -511624, -519034, -182706, 70329, -18174, -148518, -18055, -45851, 24342, 127433, 193765, -155602, -102681, -42180, 27439, 230560, 109301, 267640, 81271, -401651, -124778, -215514, -363118, -428016, -276597, 2213, 171787, 247150, 402640, 179763, -167948, -401961, -110356, 211436, 151697, 220417, -53908, 10516, 130348, 89289, -360138, -507559, -377453, -23771, 200905, 190840, -79036, 48433, 174681, 42347, -281317, -344253, -238249, -125916, 47420, 457189, 400893, 77758, 104631, 503142, 436270, 92214, -181661, -161736, -88499, -54042, -247161, -101909, 97875]
14281I7875P1453j76465r6277K78359J8303J40499j36515r8711j26920r045K76566
14270B39122L75065l7064j17494n390j14101k6523K27348o7133k44558J54066
14260C83338j88787r2361M6874k01308j00357o0309k36002R5771R004L21448Q5070
14249F2381Q0821K99745q0421j87197J75340m05118J41824L53017O8316J7767
14239E26475j98056O6826k15939m86307j01932k3303Q686j7482J30560N668m7238
14228c52042J9476J65400r5904L15090J74319j37644l305o2374R4014Q5100j48308
14217E3822M2471K59476Q5576J5314J94109j5057k62753k21379q9278l3408l92095
14206c63202m10058k06427K62846J64303J40927K51050J65821K11165n0028k1689
$$ y = [97875, 169328, -7137, -103414, 174945, 193248, 333747, 197232, 98521, -28399, -37444, 239122, 614187, 577123, 459629, 454239, 340138, 313615, 540963, 473830, 229272, 383338, 194551, 102190, 149064, -52244, -152601, -212910, -448912, -353141, -344137, -22689, 62381, 143202, 442947, 362526, 175329, 350669, -54449, 87375, 440392, 508708, 526475, 328419, 395245, 179306, -307001, -408933, -432236, -423550, -441032, -310472, -304804, -352042, -332566, -167166, -263070, 52020, 226339, 88695, 85390, 23016, 117030, 202130, 53822, 96293, 355769, 441345, 456659, 650768, 635711, 372958, 151579, 62301, 28893, -363202, -773260, -979687, -716841, -552538, -411611, -160561, 5260, 216425, 166397, 144708]
14196A44708K2804j01185j06866Q8724J36490k08130j3412N3653j53830M2220
14186i4824J63627J34073l98623j2610l6439k08820j96020M38172J18801K76668
14176A84005j4007m4153k70501m08770L21723J62956J20120j36672j06105k22608
14166d14012J59600L84111K3253n33411j86546j22644L21714J79410J14823K33204
14156A59502J04056l11745j86673J81446K07133j6051o5033K37664K97686k08736
14146C99249j244J69274k50613K6421q2215j30017l6527m17425j63754p0792L15396
14135b42247K60875J71585L41830j87027n30280n9597j1567k6471K17937L43638
14125B78676K40373o95183k98638j38237l57230M7549O43563M35285L8429J98074
$$ y = [144708, 167512, 66327, -40539, 48185, 184675, -23455, -36867, 16786, -137044, -94824, 68803, 202876, -195747, -208357, -244796, -453616, -649636, -211464, -92663, 184005, 169998, 125845, -144656, -553426, -231703, -68747, 51373, -85299, -191404, -414012, -254412, 129699, 152952, -380459, -567005, -689649, -367935, -188525, -73702, 159502, 263558, -48187, -234860, -53414, 153719, 137668, 72635, 310299, 607985, 399249, 398005, 567279, 316666, 343087, 260872, 130855, 94328, -323097, -486851, -557643, -242247, 18628, 190213, 532043, 345016, -185264, -244861, -256428, -282899, -64962, 278676, 519049, -176134, -474772, -613009, -970239, -922690, -279127, 156158, 194587, 392661]
14115C92661k99454l67365K61006N04962o8211l98726j27118M48043O2901m44354
14105c5655l16269J19563K37401N3717n3127J22282j49335j86121n1426K26569
14095c2401k19977m0867M74256M484k11722L66134J3565l3086l648p4491k70170
14084b7923j60845P3501Q8827K31295J00609J22681p9601P797k09589l30137k00646
14073c84031K15466J32110L45578L36507K35050j01299j74057l66419J43134J15673
14063D97712k8356p7689j00478j97180K2529J42552j3643m9488j94560l3272j76556
14052b08429l826L38389M3498N3192Q3057L83855K79553j56431K3575j73854j43967
14041E18612j38099j42326p955o4484N5618Q9395k45860l63003n26700p6757N29665
$$ y = [392661, 93207, -274158, -13152, 491810, 423599, 24873, -102245, 345798, 408699, -35655, -351924, -232361, 5040, 58757, 5630, 127912, -21423, -207544, -258970, -32401, -252378, -293245, 181011, 185495, -26227, 339907, 353472, 320386, 316738, 242247, -27923, -188768, -115267, -26440, 204855, 305464, 428145, 348544, 356341, 146752, -183385, -384031, -168565, -36455, 309123, 645630, 880680, 779381, 605324, 238905, 382039, 497712, 469356, 391667, 291189, 94009, 116538, 259090, 245447, 195959, 1399, -31873, -208429, -212255, 126134, 169632, 222824, 305881, 689736, 969289, 812858, 836433, 662579, 518612, 380513, 238187, 230232, 165748, 221366, 310761, 64901, -298102, -824802, -901559, -371894]
14030c71894L4156K14054M8542N8421j40963k33782J04176j1513J5147L28238
14020D4582m1976j23194r0464L0687M3517J93180K15341L34033j49833Q0762m76678
14009E9957l7417p3801j17308N5000J95187p6014m9150R5615r422J96718J55251
13998C94616O9330j90122l96495m0714J36j21323j45590j90329K49092O5862L85287
13987G9750J01045J57376n3991k00252O4197K69824O0659k27966k03643k56510
13977b09511j79192P9233O94956K64900k94758j69764j48250m37357j09789L7649
13967d71883M12365L21549J20050m7201j47661k60216k06063l60428L10914K92442
13957c6132J26457q3282j35913Q9367l1907J15429J99863J80644O2411n2383K02584
$$ y = [-371894, -337738, -123684, -75142, -16721, -157684, -391466, -287290, -298803, -283656, 44582, 2606, -120588, -211052, -180365, -136848, 56332, 271673, 605706, 455873, 536635, 59957, 22540, -51261, -168569, -113569, 81618, 5604, -43546, 52069, 42647, 239365, 394616, 463946, 273824, -122671, -163385, -163249, -284572, -430162, -620491, -371399, -305537, 79750, 180795, 338171, 284180, 83928, 148125, 417949, 478608, 250642, 46999, -209511, -388703, -309470, 385486, 650386, 355628, 185864, 37614, -399743, -509532, -471883, -59518, 262031, 382081, 334880, 187219, -72997, -279060, -639488, -328574, -36132, 90325, 7043, -128870, -39503, -71410, 44019, 243882, 424526, 486937, 434554, 637138]
13946F37138k07035r6894L1780k91584k1263K72194L77639k67885j69022M0534
13936C05602J07363j00813j05863q0568p2994K3491j00074j12720J68545L2667
13926F4636r906J17392r4542J49472M42533J97813J53612K01098k59956k38891
13916G23261l61128k14109J75658m2376r5974J0616J49654Q5535J2048K32785
13906F75970l19811l41125j24864m3593M59533J69163k80748j01497k9221J22085
13896A85892Q1346l2715k796L7314j50515j40059J92251k7940N50302K74948j71783
13885G96245k43742l6296k79390j04564R1851j77562K1303K20197o9756J4065
13875B32351o5285m9359J06135K15750Q6176l354j44814m0420k57854J28996M7713
$$ y = [637138, 430103, 333209, 364989, 73405, 52142, 324336, 701975, 434090, 265068, 305602, 412965, 312152, 206289, 125721, 52727, 76218, -23856, -136576, 31969, 64636, 54730, 172122, 77580, 227052, 669585, 867398, 1021010, 1222108, 962152, 723261, 362133, 148024, 323682, 281306, 185332, 195948, 345602, 431137, 443185, 675970, 356159, 15034, -109830, -153423, 306110, 475273, 194525, 93028, 63807, 185892, 267238, 234523, 231727, 269041, 118526, -21533, 170718, 142778, 693080, 968028, 796245, 552503, 516207, 236817, 132253, 224104, 46542, 67845, 288042, 218286, 232351, 167066, 117707, 223842, 439592, 525768, 522414, 377600, 337180, 79326, 208322, 256035]
13864B56035K8528k94193j94100K94682J53377j67152K78589J25896K4689Q489
13854E14840k45419J02447k03477j03465K11721J37363M5759k1990l19056Q6209
13844B04932L13543J37877k01720k71715J1727L73464L00561l12525l98697K78240
13834D35687J79179r7710L0672l65151j67881o5618K7916N902L2664J23945o2412
13823G7193m3706j3661J66385l13273j54629K02684M50423L10198L8596j97750
13813E22460q6006L24018j72582k40471l43062Q995J57014J07971J84162j45905
13803C16594K80457K51207k59198n81019j9271r0822J47752K89408P3822n774
13793D03156j19401l6780K27652j82237j141J08556j13859p5999J71688n9585
$$ y = [256035, 284563, -9630, -203730, 90952, 244329, 77177, 355766, 481662, 506351, 514840, 269421, 371868, 168391, 64926, 276647, 414010, 459769, 437779, 118723, 204932, 518475, 656352, 454632, 182917, 194644, 568108, 868669, 556144, 157447, 435687, 614866, 517156, 547828, 182677, 14796, -50822, -22906, -17004, 15660, 139605, 77193, 33487, 19826, 186211, -127062, -281691, -79007, 371416, 681614, 720210, 522460, 436454, 760472, 587890, 347419, 4357, 13352, 170366, 278337, 462499, 316594, 597051, 848258, 589060, 8041, -11230, -102052, 45700, 335108, 408930, 403156, 283755, 246975, 474627, 292390, 291249, 399805, 285946, 209947, 381635, 322050]
13783C22050r1173j70496N9800M32022Q6157j16402k95942k15636N7077p6074
13773h617l6625o198q6386k29594M90505L9740j63666j0627N8792Q8885K78917
13762D15126K5905j61793L09742k13053q1447K12760O1003l19106j45980J86911
13752B90068Q1850k53883m15738n6839O4642K66213J23140J42125M53151L19277
13742A014006l61036p2095j6283j16965J9050p2364L5164k12896j33783M1117
13732A23915l05277L4978K66607K21754k47417K1952j89688k52968j0821J89026
13722a47939K06537k5809K21231M3933Q4217Q8510R0840m26008m99435K57471
13712a06452J75294k00988J3558j02514J42415J81957j97344K29006K82559k27536
$$ y = [322050, 230877, 60381, 120181, 552203, 638360, 521958, 226016, 10380, 67457, -8617, -45242, -51440, -137826, -367420, 123085, 162825, -841, -11468, 47324, 136209, 415126, 441031, 279238, 588980, 375927, 294480, 507240, 568243, 249137, 103157, 290068, 371918, 118035, -297703, -354542, -289900, -23687, 99453, 241578, 694729, 1014006, 652970, 580875, 564592, 447627, 466677, 394313, 429477, 216581, 82798, 123915, -181362, -146384, 120223, 341977, 94560, 116512, -73176, -326144, -336965, -147939, 58598, 32789, 254020, 297953, 382170, 470680, 561520, 135512, -363923, -106452, 68842, -132146, -118588, -221102, -78687, 103270, -94074, 134932, 417491, 189955]
13702A89955J26892p1420R6135J31372k54912j40105R0989j51242j50949N23302
13692C90017N8495k33528J4169J86735k07619J7876L05120M06748P1571k19402
13682G90182j70469k55877k43482j51571O5213R2028L00445J60870k30585k14437
13672A42317N081N0053l56842J22317K48481K59902j67073k96913O8543m4404
13662C1462J90367O608o2137Q6857K21401l2611r6057M16066j24423J08421R5036
13651H40990n29308n18538M703J16025N84201K48192j76935j66499r9943r953
13641B92935l10618r854J24537j16651J17804J74174K05134O7413k82790l26673
13631f4589K40154L1292P4277J25710K31638k29754K2313k47498j32714K62829
$$ y = [189955, 316847, 245427, 341562, 472934, 218022, 77917, 168906, 17664, -133285, 390017, 448512, 214984, 229153, 415888, 208269, 226145, 531265, 938013, 1009584, 790182, 619713, 363836, 120354, -31217, 33996, 126024, 426469, 587339, 356754, 142317, 147398, 197451, -159391, -37074, 211407, 471309, 304236, 7323, 75866, 31462, 221829, 228437, 166300, 253157, 474558, 441947, 345890, 761956, 637533, 745954, 840990, 311682, -206856, -202153, -86128, 498073, 746265, 569330, 402831, 302888, 292935, -17683, -27537, 97000, -19651, 98153, 272327, 477461, 544874, 262084, -64589, 175565, 206857, 281134, 406844, 638482, 408728, 431041, 183543, 50829, 313658]
13621C13658n6259j53774K31762K53846j75063j50818j3223J58992l42881j74165
13611a07925K97502M2359Q0674K05891K05531J9740k76280j61693m1257K58645
13601E23187l5671m21860O6792K34663j62267J36603k8651r5486L20403N5197
$$ y = [313658, 257399, 103625, 335387, 589233, 414170, 263352, 250129, 409121, 66240, -107925, 189577, 231936, 312610, 518501, 724032, 743772, 467492, 305799, 264542, 523187, 487516, 65656, 132448, 367111, 204844, 341447, 312796, 217310, 537713, 592910]
$$ [...]
##END NTUPLES=NMR SPECTRUM
##END=
