##TITLE=Analysis number 311456
Compound Code cc 35901
Book Reference 419/138/2
Project Code adrs
Chemist Name anns
##JCAMPDX= 6.0         $$ Bruker NMR JCAMP-DX V2.0
##DATA TYPE= NMR SPECTRUM
##DATA CLASS= NTUPLES
##ORIGIN= Bruker BioSpin GmbH
##OWNER= NMR
$$ XWIN-NMR		Version 3.5
$$ Fri Jul  8 11:45:17 2005 GMT Daylight Time (UT+1h)  MAYBRIDGE\NMR@NMR_250MHZ
##.OBSERVE FREQUENCY= 250.131544655141
##.OBSERVE NUCLEUS= ^1H
##.ACQUISITION MODE= SIMULTANEOUS (DQD)
##.ACQUISITION SCHEME= undefined
##.AVERAGES= 16
##.DIGITISER RES= 18
##SPECTROMETER/DATA SYSTEM= dpx250
##.PULSE SEQUENCE= zg30
##.SOLVENT NAME= DMSO
##.SHIFT REFERENCE= (INTERNAL, DMSO, 0, 16.522)
##AUDIT TRAIL= $$ (NUMBER, WHEN, WHO, WHERE, WHAT)
$$ ##TITLE= Audit trail, XWIN-NMR		Version 3.5
$$ ##JCAMPDX= 5.01
$$ ##ORIGIN= Bruker BioSpin GmbH
$$ ##OWNER= NMR
$$ C:\u/data/dgb/nmr/ADRS/5510/pdata/1/auditp.txt
$$ ##AUDIT TRAIL=  $$ (NUMBER, WHEN, WHO, WHERE, WHAT)
(   1,<2005-07-08 11:44:40.82 +100>,<MAYBRIDGE\NMR>,<NMR_250MHZ>,
      <created by zg, POWCHK disabled, PULCHK disabled
       configuration hash MD5:
       62 19 C7 07 E1 42 D1 B7 37 6C 3D D0 77 39 F9 E6
       data hash MD5: 64K
       74 90 63 79 1B 57 E7 C7 2D 77 99 B6 BD 08 29 19>)
(   2,<2005-07-08 11:44:56.55 +100>,<MAYBRIDGE\NMR>,<NMR_250MHZ>,
      <Start of raw data processing
       ef LB = 0.3 FT_mod = 6 PKNL = 1 SI = 32K 
       data hash MD5: 32K
       1E 24 C6 72 87 39 F7 67 73 2F A9 36 A4 8B AE E8>)
(   3,<2005-07-08 11:45:02.11 +100>,<MAYBRIDGE\NMR>,<NMR_250MHZ>,
      <apk 
       data hash MD5: 32K
       76 AC 28 BB 2A EE F9 47 B8 A1 29 B3 D6 F4 D8 FE>)
(   4,<2005-07-08 11:45:03.77 +100>,<MAYBRIDGE\NMR>,<NMR_250MHZ>,
      <abs ABSG = 5 
       data hash MD5: 32K
       E5 57 3B 1C 94 05 1F 39 9B 31 A0 93 8E C2 8F 9E>)
$$ ##END=
$$ 
$$ hash MD5
$$ 59 94 EF 18 E3 54 A9 B7 92 B4 F4 AA 14 CA 91 02
##$RELAX= 
##$RELAX= 
##$RELAX= 
##$RELAX= 
##$RELAX= 
##$RELAX= 
##$RELAX= 
$$ Bruker specific parameters
$$ --------------------------
##$DU= <C:\u>
##$EXPNO= 5510
##$NAME= <ADRS>
##$PROCNO= 1
##$TYPE= <nmr>
##$USER= <dgb>
##$AMP= (0..31)
100 100 100 100 100 100 100 100 100 100 100 100 100 100 100 100 100 100 
100 100 100 100 100 100 100 100 100 100 100 100 100 100 
##$AQSEQ= 0
##$AQ_mod= 3
##$AUNM= <au_zg>
##$AUTOPOS= <21 >
##$BF1= 250.13
##$BF2= 250.13
##$BF3= 250.13
##$BF4= 250.13
##$BF5= 500.13
##$BF6= 500.13
##$BF7= 500.13
##$BF8= 500.13
##$BYTORDA= 1
##$CFDGTYP= 0
##$CFRGTYP= 5
##$CHEMSTR= <none>
##$CNST= (0..31)
1 1 145 1 1 1 1 1 1 1 1 1 1 1 1 1 1 1 1 1 1 1 1 1 1 1 1 1 1 1 1 1 
##$CPDPRG= <>
##$CPDPRG1= <>
##$CPDPRG2= <>
##$CPDPRG3= <>
##$CPDPRG4= <mlev>
##$CPDPRG5= <mlev>
##$CPDPRG6= <mlev>
##$CPDPRG7= <mlev>
##$CPDPRG8= <mlev>
##$CPDPRGB= <>
##$CPDPRGT= <>
##$D= (0..31)
0 1 0 0 0 0 0 0 0 0.06 0 0 0 0 0 0 0.0002 0 0 0 0 0 0 0 0 0 0 0 0 0 0 
0 
##$DATE= 1120819479
##$DBL= (0..7)
120 120 120 120 120 120 120 120 
##$DBP= (0..7)
150 150 150 150 150 150 150 150 
##$DBP07= 0
##$DBPNAM0= <>
##$DBPNAM1= <>
$$ [...]
##$SUBNAM7= <"">
##$SUBNAM8= <"">
##$SUBNAM9= <"">
##$SW= 20.6930455092707
##$SWIBOX= (0..15)
0 0 3 0 0 0 0 0 0 0 0 0 0 0 0 0 
##$SW_h= 5175.983436853
##$TD= 65536
##$TD0= 1
##$TE= 295.16
##$TE2= 300
##$TE3= 300
##$TEG= 300
##$TL= (0..7)
0 120 120 120 120 120 120 120 
##$TP= (0..7)
150 150 150 150 150 150 150 150 
##$TP07= 0
##$TPNAME0= <>
##$TPNAME1= <>
##$TPNAME2= <>
##$TPNAME3= <>
##$TPNAME4= <>
##$TPNAME5= <>
##$TPNAME6= <>
##$TPNAME7= <>
##$TPOAL= (0..7)
0.5 0.5 0.5 0.5 0.5 0.5 0.5 0.5 
##$TPOFFS= (0..7)
0 0 0 0 0 0 0 0 
##$TUNHIN= 0
##$TUNHOUT= 0
##$TUNXOUT= 0
##$USERA1= <user>
##$USERA2= <user>
##$USERA3= <user>
##$USERA4= <user>
##$USERA5= <user>
##$V9= 5
##$VALIST= <valist>
##$VCLIST= <CCCCCCCCCCCCCCC>
##$VD= 0
##$VDLIST= <DDDDDDDDDDDDDDD>
##$VPLIST= <PPPPPPPPPPPPPPP>
##$VTLIST= <TTTTTTTTTTTTTTT>
##$WBST= 1024
##$WBSW= 4
##$XGAIN= (0..3)
0 0 0 0 
##$XL= 0
##$YL= 0
##$YMAX_a= 350587
##$YMIN_a= -449488
##$ZGOPTNS= <>
##$ZL1= 120
##$ZL2= 120
##$ZL3= 120
##$ZL4= 120
##$ABSF1= 16.522
##$ABSF2= -4.171173
##$ABSG= 5
##$ABSL= 3
##$ALPHA= 0
##$AQORDER= 0
##$ASSFAC= 0
##$ASSFACI= 0
##$ASSFACX= 0
##$ASSWID= 0
##$AUNMP= <proc_1d>
##$AZFE= 0.1
##$AZFW= 0.1
##$BCFW= 0
##$BC_mod= 0
##$BYTORDP= 0
##$COROFFS= 0
##$CY= 12.5
##$DATMOD= 1
##$DC= 0
##$DFILT= <>
##$DTYPP= 0
##$F1P= 14.0000005364418
##$F2P= -0.99999901652339
##$FCOR= 0.5
##$FTSIZE= 32768
##$FT_mod= 6
##$GAMMA= 0
##$GB= 0
##$INTBC= 1
##$INTSCL= 1
##$ISEN= 128
##$LB= 0.3
##$LEV0= 0
##$LPBIN= 0
##$MAXI= 10000
##$MC2= 0
##$MEAN= 0
##$ME_mod= 0
##$MI= 0
##$NCOEF= 0
##$NC_proc= -6
##$NLEV= 6
##$NOISF1= 0
##$NOISF2= 0
##$NSP= 0
##$NTH_PI= 0
##$NZP= 0
##$OFFSET= 16.522
##$PC= 1
##$PHC0= -83.89637
##$PHC1= 3.672683
##$PH_mod= 1
##$PKNL= yes
##$PPARMOD= 0
##$PSCAL= 4
##$PSIGN= 0
##$REVERSE= no
##$SF= 250.13
##$SI= 32768
##$SIGF1= 0
##$SIGF2= 0
##$SINO= 400
##$SIOLD= 32768
##$SREGLST= <1H.DMSO>
##$SSB= 0
##$STSI= 32768
##$STSR= 0
##$SW_p= 5175.98343685301
##$SYMM= 0
##$S_DEV= 0
##$TDeff= 65536
##$TDoff= 0
##$TI= <Analysis number 999999
Compound Code 99
Book Reference 9
Project Code 9>
##$TILT= no
##$TM1= 0
##$TM2= 0
##$TOPLEV= 0
##$USERP1= <user>
##$USERP2= <user>
##$USERP3= <user>
##$USERP4= <user>
##$USERP5= <user>
##$WDW= 1
##$XDIM= 32768
##$YMAX_p= 363597366
##$YMIN_p= -1249366
$$ End of Bruker specific parameters
$$ ---------------------------------
##NTUPLES= NMR SPECTRUM
##VAR_NAME=  FREQUENCY,     SPECTRUM/REAL,   SPECTRUM/IMAG
##SYMBOL=    X,             R,               I
##VAR_TYPE=  INDEPENDENT,   DEPENDENT,       DEPENDENT
##VAR_FORM=  AFFN,          ASDF,            ASDF
##VAR_DIM=   32768,         32768,           32768
##UNITS=     HZ,            ARBITRARY UNITS, ARBITRARY UNITS
##FACTOR=    0.157963299565203, 1,           1
##FIRST=     4132.6476996994, 0,             0
##LAST=      -1043.33573715361, 0,           0
##MIN=       -1043.33573715361, -1249366,    0
##MAX=       4132.6476996994, 363597366,     0
$$ Real data points
##PAGE= N=1
##DATA TABLE= (X++(R..R)), XYDATA
$$ [...]
$$ plain form
15308 506776 366844 -88866 -42093 359282 462411 436674 523771 608577 356832 139659
15298 139659 390266 584578 488132 67195 134922 63744 246900 226112 281663 409801
15288 409801 453839 180594 100868 64493 194213 312931 799112 1128497 830172 598018
15278 598018 519534 226656 169983 405488 611527 474560 296851 81907 -176237 -13153
15268 -13153 232437 486260 886774 1051657 836570 602872 599341 578071 372306 359262
15258 359262 697002 633866 452129 477738 812245 879191 515118 344430 308911 492763
15248 492763 562611 471797 567876 822066 739079 860559 663023 584117 712820 884318
15238 884318 870698 703975 581379 470400 491223 551966 650488 547807 678004 813023
$$ packed form
15308E06776j39932m55710M6773M01375J03129k5737Q7097Q4806k51745k17173
15298A39659K50607J94312r6446m20937O7727p1178J83156k0788N5551J28138
15288D09801M4038k73245p9726l6375J29720J18718M86181L29385k98325k32154
15278E98018p8484k92878n6673K35505K06039j36967j77709k14944k58144J63084
15268a3153K45590K53823M00514J64883k15087k33698l531k1270k05765j3044
15258C59262L37740o3136j81737K5609L34507O6946l64073j70688l5519J83852
15248D92763O9848r0814R6079K54190q2987J21480j97536p8906J28703J71498
15238H84318j3620j66723j22596j10979K0823O0743R8522j02681J30197J35019
$$ plain form
15228 813023 726389 449918 182174 21011 326991 484916 313342 249750 352148 525637
15218 525637 712016 669705 731928 810411 670312 495385 406028 344045 378852 428901 161975
15207 161975 297113 198169 209672 113917 182974 527694 495573 769820 716291 332452 392217
15196 392217 641769 458430 503366 678017 804148 876172 777866 710657 501442 386115
15186 386115 558957 564543 186783 75949 258732 184825 204681 210339 234762 256626 214008
15175 214008 390443 61494 172316 604909 890952 961324 810367 676601 808979 1084606
15165 1084606 1174774 884386 568679 325038 502472 690700 680134 646780 719266 550902
15155 550902 615174 952238 964741 604802 169704 402869 602754 690624 473110 681557
$$ packed form
15228H13023q6634k76471k67744j61163L05980J57925j71574o3592J02398J73489
15218E25637J86379m2311O2223P8483j40099j74927q9357o1983L4807N0049k66926
15207A61975J35138r8944J1503r5755O9057L44720l2121K74247n3529l83839N9765
15196C92217K49552j83339M4936J74651J26131P2024r8306o7209k09215j15327
15186C86115J72842N586l77760j10834J82783p3907J9856N658K4423K1864m2618
15175B14008J76435l28949J10822M32593K86043P0372j50957j33766J32378K75627
15165A084606R0168k90388l15707k43641J77434J88228j0566l3354P2486j68364
15155E50902O4272L37064J2503l59939m35098K33165J99885Q7870k17514K08447
$$ plain form
15145 681557 882506 705887 415216 416245 452913 828880 983864 996023 981404 1033104 883201
15134 883201 865996 785710 468900 712274 911560 668622 552432 216746 372108 559624
15124 559624 544559 416845 436395 720835 619406 691950 738967 608174 668822 781609
15114 781609 716966 445571 500830 553366 495636 187729 239857 404316 474229 593886 488253
15103 488253 546561 662321 756876 813407 520056 234895 300025 449510 295244 306102
15093 306102 328053 152329 83020 404382 660578 758436 415650 440115 371756 128954
15083 128954 208309 79240 51424 387792 554025 778891 800891 682125 501054 363351
15073 363351 569522 983417 1021086 691835 519756 362105 558112 723560 924029 977761
$$ packed form
15145F81557K00949j76619k90671J029L6668L75967J54984J2159j4619N1700j49903
15134H83201j7205q0286l16810K43374J99286k42938j16190l35686J55362J87516
15124E59624j5065j27714J9550K84440j01429P2544M7017j30793O0648J12787
15114G81609o4643k71395N5259N2536n7730l07907N2128J64459O9913J19657j05633
15103D88253N8308J15760R4555N6531k93351k85161O5130J49485j54266J0858
15093C06102K1951j75724o9309L21362K56196R7858l42786K4465o8359k42802
15083A28954P9355j29069k7816L36368J66233K24866K2000j18766j81071j37703
15073C63351K06171M13895L7669l29251j72079j57651J96007J65448K00469N3732
$$ plain form
15063 977761 896536 696978 378121 426127 380858 347489 415049 324173 308615 228354 25413
15052 25413 48460 305071 295690 225989 392199 665564 830029 439882 75767 152270 391938
15041 391938 661821 593624 148296 -5323 59634 265839 445179 422599 296401 436057
15031 436057 528291 310293 139987 324772 563359 599496 473005 367420 293226 169741
15021 169741 169609 539994 823556 782209 546915 629434 673125 896088 989928 1249262 1137722
15010 1137722 681691 881507 904641 759747 763893 799724 734391 609539 849462 1010596
15000 1010596 1062062 470500 662437 959846 462815 383968 597276 1075389 888371 548225
14990 548225 435163 719755 687736 539288 430278 611907 534737 200094 171070 685704
$$ packed form
15063I77761q1225j99558l18857M8006m5269l3369O7560r0876j5558q0261k02941
15052B5413K3047K56611r381o9701J66210K73365J64465l90147l64115P6503K39668
15041C91938K69883o8197m45328j53619O4957K06205J79340k2580j26198J39656
15031D36057R2234k17998j70306J84785K38587L6137j26491j05585p4194j23485
15021A69741j32L70385K83562m1347k35294Q2519M3691K22963R3840K59334j11540
15010A137722m56031J99816K3134j44894M146L5831o5333j24852K39923J61134
15000A010596N1466n91562J91937K97409m97031p8847K13308M78113j87018l40146
14990E48225j13062K84592l2019j48448j09010J81629p7170l34643k9024N14634
$$ plain form
14980 685704 849216 804549 590852 521231 796437 803670 666999 741074 713535 744856 665100
14969 665100 761744 916371 1023867 1198571 1083586 814291 679390 617787 510330 442250
14959 442250 358968 512430 567663 603781 569082 513501 722888 1020494 1230595 1207095 657083
14948 657083 641362 695562 608249 629980 732689 647278 478250 676522 1067791 1169482
14938 1169482 1113056 1001585 735614 614265 950504 565884 274240 219786 297154 250965
14928 250965 354741 227537 180504 215938 529483 459423 318185 642531 1018553 1067550
14918 1067550 780801 516259 551571 838431 1249228 1180230 966204 862555 973813 1165942
14908 1165942 837504 954783 1367190 1133385 635142 648992 1173435 1364194 1023814 951506
$$ packed form
14980F85704J63512m4667k13697o9621K75206P233j36671P4075k7539L1321p9756
14969F65100R6644J54627J07496J74704j14985k69295j34901o1603j07457o8080
14959D42250q3282J53462N5233L6118l4699n5581K09387K97606K10101k3500n50012
14948F57083j5721N4200q7313K1731J02709q5411j69028J98272L91269J01691
14938A169482n6426j11471k65971j21349L36239l84620k91644n4454P7368m6189
14928B50965J03776j27204m7033L5434L13545p0060j41238L24346L76022M8997
14918A067550k86749k64542L5312K86860M10797o8998k14026j03649J11258J92129
14908A165942l28438J17279M12407k33805m98243J3850N24443J90759l40380p2308
$$ plain form
14898 951506 1062458 880144 592455 411885 445388 485022 292357 203365 230547 359977
14888 359977 757278 724592 745747 432089 275234 514157 1099226 1131425 1018911 641354
14878 641354 435739 197218 277465 575128 392802 348483 367295 430225 641283 727032
14868 727032 817472 789875 829838 1024034 811324 564967 580627 408730 562644 688074
14858 688074 540129 544745 850889 726936 602155 425033 535555 415534 299516 563940
14848 563940 590878 931917 1195346 1011357 954449 1125271 1142521 1150130 954947 633336
14838 633336 351522 433885 767013 827690 897880 813975 1052776 1005329 750519 494394
14828 494394 746839 981859 1329237 1104149 964508 776435 771048 972532 817500 744443
$$ packed form
14898I51506J10952j82314k87689j80570L3503L9634j92665q8992K7182J29430
14888C59977L97301l2686K1155l13658j56855K38923N85069L2199j12514l77557
14878F41354k05615k38521Q0247K97663j82326m4319J8812O2930K11058Q5749
14868G27032R0440k7597L9963J94196k12710k46357J5660j71897J53914J25430
14858F88074j47945M616L06144j23953j24781j77122J10522j20021j16018K64424
14848E63940K6938L41039K63429j83989n6908J70822J7250P609j95183l21611
14838F33336k81814Q2363L33128O0677P0190q3905K38801m7447k54810k56125
14828D94394K52445K35020L47378k25088j39641j88073n387K01484j55032p3057
$$ plain form
14818 744443 674356 549332 527231 753354 952406 839808 888619 954360 843500 407006
14808 407006 388958 560882 706598 882842 700864 767473 816568 852848 823344 832885 624390
14797 624390 544653 848763 1208260 1087619 699763 713189 615708 708449 912539 934890
14787 934890 728140 808366 1060996 1064263 726491 689729 849183 876151 875181 859991 622433
14776 622433 322001 210460 524387 726466 843161 836832 964024 1105846 893292 982015
14766 982015 1206272 1375896 1060724 818655 743783 765301 645835 830698 753004 557080
14756 557080 596868 541624 593018 688711 711833 815680 692532 912599 855176 1189270 1283021
14745 1283021 1267943 1265813 1141413 1364529 1426083 1484422 1285259 853452 578105 663231
$$ packed form
14818G44443p0087j25024k2101K26123J99052j12598M8811O5741j10860m36494
14808D07006j8048J71924J45716J76244j81978O6609M9095L6280k9504R541k08495
14797F24390p9737L04110L59497j20641l87856J3426r7481R2741K04090K2351
14787I34890k06750Q0226K52630L267l37772l6762J59454K6968r70j5190k37558
14776F22433l00432j11541L13927K02079J16695o329J27192J41822k12554Q8723
14766I82015K24257J69624l15172k42069p4872K1518j19466J84863p7694j95924
14756E57080L9788n5244N1394R5693K3122J03847j23148K20067n7423L34094R3751
14745A283021j5078k130j24400K23116O1554N8339j99163m31807k75347Q5126
$$ plain form
14735 663231 845056 907444 851855 1004783 904023 938349 881360 1047806 1107525 1007459
14725 1007459 1159926 1140027 1177303 882910 682123 820916 385059 347142 607089 807775
14715 807775 1220784 861166 695046 847755 803953 682714 915458 998755 677865 699089
14705 699089 748476 620065 994150 780312 925129 1087037 611253 552523 730741 984445
14695 984445 993406 879698 794233 674668 738579 1028662 940420 642218 603468 727614 557076
14684 557076 483006 577594 601608 833671 959651 1032488 996528 1085670 1026583 825981 816517
14673 816517 1154067 1351162 1425639 1144417 818755 560883 784615 716078 857936 961803
14663 961803 830550 825528 1144787 1295943 1136357 1345491 1286594 1333553 1470061 1229338
$$ packed form
14735F63231J81825O2388n5589J52928j00760L4326n6989J66446N9719j00066
14725A007459J52467j9899L7276k94393k00787J38793m35857l7917K59947K00686
14715H07775M13009l59618j66120J52709m3802j21239K32744Q3297l20890K1224
14705F99089M9387j28411L74085k13838J44817J61908m75784n8730J78218K53704
14695I84445Q961j13708q5465j19565O3911K90083q8242k98202l8750J24146j70538
14684E57076p4070R4588K4014K32063J25980P2837l5960Q9142n9087k00602r464
14673H16517L37550J97095P4477k81222l25662k57872K23732o8537J41858J03867
14663I61803j31253n022L19259J51156j59586K09134n8897M6959J36508k40723
$$ plain form
14653 1229338 722960 900328 1038334 971228 920510 880992 919269 695618 407551 187994
14643 187994 426060 610293 724593 614211 879944 794237 615955 221410 278940 510419
14633 510419 521823 328196 419325 560306 408641 305124 153357 182903 145719 561144
14623 561144 856164 891568 860679 683498 813936 847920 972581 1232970 1221300 1306122
14613 1306122 1439734 1157854 774546 777950 710701 823356 942543 1011064 859126 937646
14603 937646 698240 665711 689814 901130 947043 1090432 1075131 1154448 1149786 1602958 1953625
14592 1953625 1836759 1465965 1223351 1176000 1063037 1084036 1188056 1339037 1434233 1126706
14582 1126706 899501 1232930 1224310 888339 301572 35261 184049 311331 341002 539112
$$ packed form
14653A229338n06378J77368J38006o7106n0718l9518L8277k23651k88067k19557
14643A87994K38066J84233J14300j10382K65733q5707j78282l94545N7530K31479
14633E10419J1404j93627R1129J40981j51665j03517j51767K9546l7184M15425
14623E61144K95020L5404l0889j77181J30438L3984J24661K60389j1670Q4822
14613A306122J33612k81880l83308L404o7249J12655J19187O8521j51938P8520
14603I37646k39406l2529K4103K11316M5913J43389j5301P9317m662M53172L50667
14592A953625j16866l70794k42614m7351j12963K0999J04020J50981R5196l07527
14582A126706k27205L33429q620l35971n86767k66311J48788J27282K9671J98110
$$ plain form
14572 539112 808329 979802 1109180 1297036 1134500 1077658 1192764 966556 823462 968339
14562 968339 915353 992324 1136575 1129455 1020787 795926 834422 857868 1057977 1358992 1393838
14551 1393838 1460187 1395198 923491 678811 728284 813591 863996 1206567 1072311 1055923
14541 1055923 1288555 1386484 1272394 1289965 1220735 1021987 1094766 1314653 1037183 946626
14531 946626 909460 948815 931173 705059 556253 586898 632591 887486 936070 1078382 1264539
14520 1264539 1399114 1143671 1187451 1108057 964890 964658 1055509 911203 1083099 1393792
14510 1393792 1012321 856543 1132175 1327128 1177099 1040438 1187275 1840160 2236883
14501 2236883 1731122 953080 621880 529566 974573 846370 504915 450214 621019 414547
$$ packed form
14572E39112K69217J71473J29378J87856j62536n6842J15106k26208j43094J44877
14562I68339n2986P6971J44251p120j08668k24861L8496K3446K00109L01015L4846
14551A393838O6349o4989m71707k44680M9473Q5307N0405L42571j34256j6388
14541A055923K32632R7929j14090J7571o9230j98748P2779K19887k77470r0557
14531I46626l7166L9355j7642k26114j48806L0645M5693K54895M8584J42312J86157
14520A264539J34575k55443M3780p9394j43167k32R0851j44306J71896L10693
14510A393792l81471j55778K75632J94953j50029j36661J46837O52885L96723
14501B236883n05761p78042l31200r2314M45007j28203l41455n4701J70805k06472
$$ plain form
14491 414547 379919 137604 337765 200705 289062 685949 677824 881203 712840 410561
14481 410561 343868 859414 1015711 803939 790018 635854 647452 740242 816473 851475 891672
14470 891672 827329 885958 1105120 1196037 812842 732172 1071368 1507010 1540110 1251030
14460 1251030 1220472 1281730 1191642 1158969 1065466 746402 908860 1208100 1161862 1117896 947760
14449 947760 1164405 1340920 1343278 1226795 830179 833381 1027699 1094471 1004380 1249578 1378394
14438 1378394 1258917 865809 728546 954370 727732 577772 584780 747146 1170920 1029651
14428 1029651 1247040 1373407 1074227 981488 821723 739790 712583 678716 588717 540865
14418 540865 716255 932451 1039006 1013117 952734 1279232 942867 901700 1313648 1318448
$$ packed form
14491D14547l4628k42315K00161j37060Q8357L96887q125K03379j68363l02279
14481D10561o6693N15546J56297k11772j3921j54164J1598R2790P6231L5002M0197
14470H91672o4343N8629K19162R0917l83195q0670L39196M35642L3100k89080
14460A251030l0558O1258r0088l2673r3503l19064J62458K99240m6238m3966j70136
14449I47760K16645J76515K358j16483l96616L202J94318O6772r0091K45198J28816
14438A378394j19477l93108j37263K25824k26638j49960P008J62366M23774j41269
14428A029651K17389J26367k99180r2739j59765q1933k7207l3867q9999m7852
14418E40865J75390K16196J06555k5889o0383L26498l36365m1167M11948M800
$$ plain form
14408 1318448 1163654 1054759 706081 794549 889967 790485 700890 1141993 1253027 1290727
14398 1290727 1216546 994145 886211 752733 701037 1075924 1121461 942829 921906 919924
14388 919924 981064 1127961 1203574 1286716 1127889 1054194 1251965 1051768 700767 572964
14378 572964 460501 452467 907848 1111798 1302943 1256330 1230486 1493066 1352364 1324747
14368 1324747 1396876 1749310 1465176 1588416 1703521 1618255 1357469 1159723 1031489 1318206
14358 1318206 1732678 1797239 1631469 1327933 1239516 1120961 896039 860706 1066505 914643
14348 914643 663135 655655 1240163 1645279 1306863 1162473 809305 1008311 1161756 898365
14338 898365 700070 793665 1025781 1289930 1052653 1150730 1237642 1264347 1231829 1294597 1290740
$$ packed form
14408A318448j54794j08895l48678Q8468R5418r9482q9595M41103J11034L7700
14398A290727p4181k22401j07934j33478n1696L74887M5537j78632k0923j982
14388I19924O1140J46897P5613Q3142j58827p3695J97771k00197l51001j27803
14378E72964j12463q034M55381K03950J91145m6613k5844K62580j40702k7617
14368A324747P2129L52434k84134J23240J15105q5266k60786j97746j28234K86717
14358A318206M14472O4561j65770l03536q8417j18555k24922l5333K05799j51862
14348I14643k51508p480N84508M05116l38416j44390l53168J99006J53445k63391
14338H98365j98295R3595K32116K64149k37277R8077Q6912K6705l2518O2768l857
$$ plain form
14327 1290740 1094348 1108188 1300312 1228612 691910 558821 797499 1203739 1217178 1101690
14317 1101690 1230870 1487497 1767260 1460951 1329763 1516556 1653618 1747158 1578722 1226659
14307 1226659 1146063 1002930 1032683 843060 976807 936012 945321 857002 933624 1127296 1284497
14296 1284497 1161437 1003059 1021727 1062339 1201300 1190153 1198524 1112687 955948 985218 922981
14285 922981 1060312 1195598 1116996 1241284 1093909 954421 1030824 914564 1005675 1172138
14275 1172138 1178035 864876 950166 1250494 1344083 1533189 1825836 1715769 1686678 1814913
14265 1814913 1816464 1540576 1652238 1499912 1208930 1196037 1226733 1361780 1270850 1224162
14255 1224162 1163292 1154568 1148296 1002128 952834 981624 823675 953829 1188704 1323694 1374122
$$ packed form
14327A290740j96392J3840J92124p1700n36702j33089K38678M06240J3439j15488
14317A101690J29180K56627K79763l06309j31188J86793J37062R3540j68436l52063
14307A226659q0596j43133K9753j89623J33747m0795R309q8319P6622J93672J57201
14296A284497j23060j58378J8668M0612J38961j1147Q371q5837j56739K9270o2237
14285I22981J37331J35286p8602J24288j47375j39488P6403j16260R1111J66463
14275A172138N897l13159Q5290L00328R3589J89106K92647j10067k9091J28235
14265A814913J551k75888J11662j52326k90982j2893L0696J35047r0930m6688
14255A224162o0870q724o272j46168m9294K8790j57949J30154K34875J34990N0428
$$ plain form
14244 1374122 1607334 1845032 1839174 1656036 1492943 1550639 1355010 1468663 1473616 1335422
14234 1335422 1546686 1512504 1249203 1288039 1404406 1386775 1183597 1299511 1400761 1309093
14224 1309093 1676277 1771962 1565053 1382651 1693034 1723318 1148976 904686 707593 626620
14214 626620 476626 714918 962291 1055578 1313523 1246793 1189375 1242729 1265778 1341404 1482144
14203 1482144 1535765 1421771 1422124 1514952 1502143 1323941 1054902 1052082 1073452 877631 1056433
14192 1056433 1056210 1164094 1228659 1165052 1092259 973825 1002499 1109968 1447289 1448369 1379650
14181 1379650 1364792 1243414 1289458 1318066 1219262 1066902 1246564 1108084 946431 1021794
14171 1021794 1146440 1188819 1142868 1060107 993023 972329 1316755 1073622 838891 1061797
$$ packed form
14244A374122K33212K37698n858j83138j63093N7696j95629J13653M953j38194
14234A335422K11264l4182k63301L8836J16367j7631k03178J15914J01250r1668
14224A309093L67184R5685k06909j82402L10383L0284n74342k44290j97093q0973
14214F26620j49994K38292K47373R3287K57945o6730n7418N3354K3049P5626J40740
14203A482144N3621j13994L53R2828j2809j78202k69039k820K1370j95821J78802
14192A056433k23J07884O4565o3607p2793j18434K8674J07469L37321J080o8719
14181A379650j4858j21378M6044K8608r8804j52360J79662j38480j61653P5363
14171A021794J24646M2379m5951q2761o7084k0694L44426k43133k34731K22906
$$ plain form
14161 1061797 1282730 1700324 1841643 1653823 1340488 1586637 1827169 1973575 1995906 1972699
14151 1972699 1776487 1838786 1784545 1459963 1403242 1526086 1490652 1559943 1302134 1319052
14141 1319052 1212563 1164914 1371531 1465494 1672256 1738971 1635310 1294433 1241742 1390059
14131 1390059 1632372 1948935 1756760 1206728 885073 870406 901433 945423 1020189 731918
14121 731918 729366 1134200 1265759 1375787 1638064 1488653 1414262 1301803 1220478 1281885
14111 1281885 1158568 1008272 1299169 1394681 1224500 1049283 982732 862501 998995 1141282
14101 1141282 1357656 1363319 1391106 1539016 1384004 1402909 1505781 1495594 1249238 1306401
14091 1306401 1379616 1407579 1475911 1444762 1421037 998043 1017750 1281456 1636166 1932520
$$ packed form
14161A061797K20933M17594J41319j87820l13335K46149K40532J46406K2331k3207
14151A972699j96212O2299n4241l24582n6721J22844l5434O9291k57809J6918
14141A319052j06489m7649K06617R3963K06762O6715j03661l40877n2691J48317
14131A390059K42313L16563j92175n50032l21655j4667L1027M3990P4766k88271
14121G31918k552M04834J31559J10028K62277j49411p4391j12459q1325O1407
14111A281885j23317j50296K90897R5512j70181j75217o6551j20231J36494J42287
14101A141282K16374N663K7787J47910j55012J8905J02872j0187k46356N7163
14091A306401P3215K7963O8332l1149k3725m22994J9707K63706L54710K96354
$$ plain form
14081 1932520 1929895 1801834 1911788 1997990 2050405 1991170 1723122 1605501 1692810 1425595
14071 1425595 1247546 1313964 1499057 1729591 1651116 1359449 1210051 1104525 1399306 1620911
14061 1620911 1649341 1543100 1365785 1288686 1228487 1284308 1664172 1759877 1525187 1572609
14051 1572609 1320331 1363353 1447514 1423601 1361365 1421539 1177782 822720 1133073 1342169
14041 1342169 1497334 1467258 1293292 1229818 1536704 1681246 1474980 1558847 1725779 1482382
14031 1482382 1551901 1625313 1561497 1554500 1432395 1153999 1030548 1201293 1114386 1046312 1302620
14020 1302620 1372510 1504672 1734382 1769709 1644352 1629879 1483932 1422913 1387307 1497971
14010 1497971 1175280 1062949 1355593 1503540 1418957 1325987 1338827 1677844 1617010 1315152
$$ packed form
14081A932520k625j28061J09954Q6202N2415n9235k68048j17621Q7309k67215
14071A425595j78049O6418J85093K30534p8475k91667j49398j05526K94781K21605
14061A620911K8430j06241j77315p7099o0199N5821L79864R5705k34690M7422
14051A572609k52278M3022Q4161k3913o2236O0174k43757l55062L10353K09096
14041A342169J55165l0076j73966o3474L06886J44542k06266Q3867J66932k43397
14031A482382O9519P3412o3816o997j22105k78396j23451J70745q6907o8074K56308
14020A302620O9890J32162K29710L5327j25357j4473j45947o1019l5606J10664
14010A497971l22691j12331K92644J47947q4583r2970J2840L39017o0834l01858
$$ plain form
14000 1315152 1464138 1784730 1847893 1841447 1846847 1563771 1783245 1764065 1502255 1515002 1564910
13989 1564910 1562883 1463061 1359473 1273027 1430660 1515159 1387755 1381162 1388609 1445366 1589640
13978 1589640 1467280 1622043 1725600 1305329 1085202 1354683 1371296 1185085 863278 1012070
13968 1012070 1518227 1821767 1674411 1389990 1407081 1431261 1320620 1310909 1245959 1124793
13958 1124793 1440453 1492671 1557071 1326550 1018235 604670 694632 1110342 1422224 1692504
13948 1692504 1736580 1608541 1367071 1133940 1225392 1319804 1698058 1609368 1686896 2138944
13938 2138944 2100359 1746484 1422703 1488103 1456761 1459404 1497786 1589055 1604772 1461758 1295404
13927 1295404 1065971 970381 999165 1169801 1176857 1142460 1342229 1521461 1666611 1562403
$$ packed form
14000A315152J48986L20592O3163o446N400k83076K19474j9180k61810J2747M9908
13989A564910k027r9822j03588q6446J57633Q4499j27404o593P447N6757J44274
13978A589640j22360J54763J03557m20271k20127K69481J6613j86211l21807J48792
13968A012070N06157L03540j47356k84421J7091K4180j10641r711o4950j21166
13958A124793L15660N2218O4400k30521l08315m13565Q9962M15710L11882K70280
13948A692504M4076j28039k41470k33131R1452R4412L78254q8690P7528M52048
13938B138944l8585l53875l23781O5400l1342K643L8382R1269J5717j43014j66354
13927A295404k29433r5590K8784J70636P056l4397J99769J79232J45150j04208
$$ plain form
13917 1562403 1244406 1288330 1550020 1824404 1740963 1871104 1640853 1789556 1639356 1151505
13907 1151505 1267847 1037773 1062362 1413208 1551889 1602442 1372399 1435399 1449149 1353051
13897 1353051 1314994 1354443 1216547 1289661 1352679 1406641 1271858 1313868 1491982 1518800 1488048
13886 1488048 1707223 1914830 1887380 1771755 1777600 1977476 2084194 2046633 1872469 1715854
13876 1715854 1934411 2085962 2027600 1856400 1804656 1792850 1890765 1858574 1867861 2005412 1910801
13865 1910801 1901585 1899857 1772003 1561625 1288311 1379927 1424732 1318057 1425456 1424208 1227610
13854 1227610 1491544 1747488 2120122 2521938 2575965 2493585 2426784 2103129 1755368 1696110
13844 1696110 1681292 1647881 1499543 1318720 1127426 1311543 1473141 1554633 1516914 1484299
$$ packed form
13917A562403l17997M3924K61690K74384q3441J30141k30251J48703j50200m87851
13907A151505J16342k30074K4589L50846J38681N0553k30043O3000J3750r6098
13897A353051l8057L9449j37896P3114O3018N3962j34783M2010J78114K6818l0752
13886A488048K19175K07607k7450j15625N845J99876J06718l7561j74164j56615
13876A715854K18557J51551n8362j71200n1744j1806R7915l2191R287J37551r4611
13865A910801r216j728j27854k10378k73314R1616M4805j06675J07399j248j96598
13854A227610K63934K55944L72634M01816N4027q2380o6801l23655l47761n9258
13844A696110j4818l3411j48338j80823j91294J84117J61598Q1492l7719l2615
$$ plain form
13834 1484299 1730311 2022302 2160422 1976866 1989332 2366335 2341700 1972963 1770055 1592924
13824 1592924 1684957 2028616 2296212 2315487 2072147 2102550 2254176 2406029 2579702 2467598
13814 2467598 1960231 1683688 1721590 1475667 1444294 1449785 1811841 1948205 1998901 1806857
13804 1806857 1853698 1962024 1549802 1618733 1594712 1570451 1456775 1375896 1613924 1915775
13794 1915775 1907983 1697093 1608181 1704148 1789391 2042577 2072421 2023631 1801205 1718138 1946293
13783 1946293 1953285 1799527 1928826 2349901 2343365 1802816 1597126 1813048 1861539 2207174
13773 2207174 2234999 1921431 2018658 2378053 2215377 1929986 1534140 1422417 1348302 1245849
13763 1245849 1710797 2213770 2066121 1739854 1680049 1658155 1511204 1343724 1438090 1575552
$$ packed form
13834A484299K46012K91991J38120j83556J2466L77003k4635l68737k02908j77131
13824A592924R2033L43659K67596J9275k43340L0403J51626J51853J73673j12104
13814B467598n07367k76543L7902k45923l1373N491L62056J36364N0696j92044
13804A806857M6841J08326m12222O8931k4021k4261j13676q0879K38028L01851
13794A915775p792k10890q8912R5967Q5243K53186K9844m8790k22426q3067K28155
13783A946293O992j53758J29299M21075o536n40549k05690K15922M8491L45635
13773B207174K7825l13568R7227L59395j62676k85391l95846j11723p4115j02453
13763A245849M64948N02973j47649l26267n9805k1894j46951j67480R4366J37462
$$ plain form
13753 1575552 1649555 1716112 1652440 1741382 2250266 2306560 2038848 1952675 2015109 2039144 1763654
13742 1763654 1689195 1793638 1770048 2061553 1941916 1973460 1879548 2080353 2005030 1602645
13732 1602645 1702900 1776638 1252099 1345744 1221531 1341648 1620901 1785184 1996676 1947581
13722 1947581 2023641 2037143 1750006 1923755 2080964 1812761 1896307 2194424 2369737 2417717
13712 2417717 2576097 2337482 2159354 2072678 1833897 1999945 2331882 2338531 2415413 2350481
13702 2350481 1873254 1857950 1745185 1947390 1814113 1764574 1831248 1786087 1881782 2097077
13692 2097077 2217569 2383936 2367356 2182066 1917122 1747597 1589884 1515374 1702382 2039003
13682 2039003 2137671 1824541 1581087 1556221 1723803 1685652 1987865 2028944 1979700 1968868
$$ packed form
13753A575552P4003O6557o3672Q8942N08884N6294k67712q6173O2434K4035k75490
13742A763654p4459J04443k3590K91505j19637L1544r3912K00805p5323m02385
13732A602645J00255P3738n24539R3645j24213J20117K79253J64283K11492m9095
13722A947581P6060J3502k87137J73749J57209k68203Q3546K98117J75313M7980
13712B417717J58380k38615j78128q6676k38781J66048L31937O649P6882o4932
13702B350481m77227j5304j12765K02205j33277m9539O6674m5161R5695K15295
13692B097077J20492J66367j6580j85290k64944j69525j57713p4510J87008L36621
13682B039003R8668l13130k43454k4866J67582l8151L02213M1079m9244j0832
$$ plain form
13672 1968868 1596045 1576807 1797937 2004918 2144222 2232300 2119460 1921077 1904088 1565306
13662 1565306 1545774 1887228 2015730 2002528 1915485 1814927 1772806 1943687 2325215 2373898
13652 2373898 1939055 1916519 2357777 2852282 2757400 2837895 3000589 2735259 2391402 2258753
13642 2258753 2397560 2191965 2076760 2291424 2156973 2186064 2087384 2116989 2131610 1958682
13632 1958682 1859251 1883129 2083251 2085377 2139105 2480555 2078630 1647027 1536745 2118027
13622 2118027 2429722 2168632 2194386 2177173 2091665 1891061 1739953 2065871 1999784 1881323
13612 1881323 1654108 1919849 2286196 2363216 2307597 2313458 2387736 1997160 1516829 1501504
13602 1501504 2025675 2278184 2134457 2126802 2129304 2279096 2403475 2225743 2288467 2301329
$$ packed form
13672A968868l72823j9238K21130K06981J39304Q8078j12840j98383j6989l38782
13662A565306j9532L41454J28502j3202q7043j00558m2121J70881L81528M8683
13652B373898m34843k2536M41258M94505r4882Q0495J62694k65330l43857j32649
13642B258753J38807k05595j15205K14664j34451K9091r8680K9605J4621j72928
13632A958682r9431K3878K00122K126N3728L41450m01925m31603j10282N81282
13622B118027L11695k61090K5754j7213q5508k00604j51108L25918o6087j18461
13612A881323k27215K65741L66347P7020n5619N861P4278l90576m80331j5325
13602A501504N24171K52509j43727p655K502J49792J24379j77732O2724J2862
$$ plain form
13592 2301329 2291513 2232019 2153586 2302541 2103620 2244553 2225062 2359881 2297900 2316032 2367440
13581 2367440 2172496 2150278 1937139 1761013 1678708 1762698 2097082 2341128 2617633 2677730
13571 2677730 2486291 2315705 2179222 1932976 1649852 1768907 1996838 2267986 2080054
13562 2080054 1952194 2076702 2006805 1627409 1703600 1722087 1808579 1882062 2365775 2611851
13552 2611851 2445850 2268232 2460253 2711849 2798592 2395041 2257683 2487292 2706393 2481591
13542 2481591 2213550 2287574 2718184 2738718 2336488 1961730 1939137 2015026 2190584 2485860
13532 2485860 2509713 2473472 2167176 1817721 1625994 2249517 2449276 2352424 2080891 2091038
13522 2091038 2054674 2137223 2089969 2410339 2612416 2643410 2299447 2035425 2089911 2044985
$$ packed form
13592B301329r816n9494p8433J48955j98921J40933j9491J34819o1981J8132N1408
13581B367440j94944k2218k13139j76126q2305Q3990L34384K44046K76505O0097
13571B677730j91439j70586j36483k46246k83124J19055K27931K71148j87932
13562B080054j27860J24508o9897l79396P6191J8487Q6492P3483M83713K46076
13552B611851j66001j77618J92021K51596Q6743m03551j37358K29609K19101k24802
13542B481591k68041P4024M30610K0534m02230l74758k2593P5889J75558K95276
13532B485860K3853l6241l06296l49455j91727O23523J99759r6852k71533J0147
13522B091038l6364Q2549m7254L20370K02077L0994l43963k64022N4486m4926
$$ plain form
13512 2044985 2327425 2665787 2831179 2641217 2366656 2332010 2020481 1792153 1988698 2406576
13502 2406576 2656176 2777288 2800327 2766945 2536598 2713721 2926398 3111183 3449132 3268992
13492 3268992 2632490 2133532 2239050 2199274 2296588 2085766 1914278 2289995 2268995 2574458
13482 2574458 2588659 2371708 2268687 2029918 1689713 1678153 1908885 1889107 2231571 2352490
13472 2352490 2305836 2399384 2458737 2628487 2630608 2433219 2288368 2522108 2460085 2530763 2688800
13461 2688800 2831327 2756591 2740056 2925612 2582941 2333581 2347568 2556330 2619019 2712643
13451 2712643 2928064 2772617 2633512 2525114 2538501 2412974 2188232 1990521 2383946 2920951
13441 2920951 2824856 2800984 3001959 2921918 2625502 2386734 2340246 2335836 2576273 2558072 2651808
$$ packed form
13512B044985K82440L38362J65392j89962k74561l4646l11529k28328J96545M17878
13502B406576K49600J21112K3039l3382k30347J77123K12677J84785L37949j80140
13492C268992o36502m98958J05518l9776R7314k10822j71488L75717k1000L05463
13482B574458J4201k16951j03021k38769l40205j1560K30732j9778L42464J20919
13472B352490m6654R3548N9353J69750K121j97389j44851K33740o2023P0678J58037
13461B688800J42527p4736j6535J85556l42671k49360J3987K08762O2689R3624
13451B712643K15421j55447j39105j08398J3387j25527k24742j97711L93425N37005
13441B920951r6095k3872K00975q0041k96416k38768m6488m410K40437j8201R3736
$$ plain form
13430 2651808 2494273 2501917 2673092 2633172 2635935 2848608 2985486 2574633 2133276 1893719
13420 1893719 1935909 2241436 2153822 2125461 2431281 2660866 2494482 2471348 2534720 2439599
13410 2439599 2352619 2293114 2350821 2507570 2414123 2462912 2611946 2582129 2433360 2486793 2589919
13399 2589919 2612282 2886444 3026297 2945962 2867865 2556777 2555423 2636926 2380211 2208093
13389 2208093 2418784 2464454 2581426 2374045 2235607 2600992 2564535 2580075 2998026 2810510
13379 2810510 2612926 2574467 2392837 1983270 1943294 2178417 2461405 2264202 2299109 2270293
13369 2270293 2356885 2602122 2564874 2274445 2511682 2916685 2932524 2577342 2461406 2774570
13359 2774570 3031469 3284096 3331932 3184128 3172792 2757769 2399295 2545458 2334158 2727360
$$ packed form
13430B651808j57535P644J71175l9920K763K12673J36878m10853m41357k39557
13420A893719M2190L05527q7614k8361L05820K29585j66384k3134O3372r5121
13410B439599q6980n9505N7707J56749r3447M8789J49034k9817j48769N3433J03126
13399B589919K2363K74162J39853q0335p8097l11088j354Q1503k56715j72118
13389B208093K10691M5670J16972k07381j38438L65385l6457J5540M17951j87516
13379B810510j97584l8459j81630m09567l9976K35123K82988j97203L4907k8816
13369B270293Q6592K45237l7248k90429K37237M05003J5839l55182j15936L13164
13359B774570K56899K52627M7836j47804j1336m15023l58474J46163k11300L93202
$$ plain form
13349 2727360 2901271 2620708 2612163 2544719 2155456 2162292 2497780 2328363 2252690 2073946
13339 2073946 2308392 2484626 2921012 3302047 3501863 3175067 2982231 2912266 2738565 2740976
13329 2740976 2729804 2963173 2903060 3050076 3015474 2947248 3004575 2910651 2945145 3123819 3053109
13318 3053109 3003319 2940008 2720766 2441173 2446860 2756162 3053215 3502209 3324210 3308918
13308 3308918 3235528 2996760 2478207 2241030 2369694 2666175 2849231 2806283 2795141 2805687
13298 2805687 3091577 3174053 3030227 3108122 2779462 2802691 2932023 2860948 2711497 2558203
13288 2558203 2518314 2823852 2917819 3020105 3014211 2586444 2443291 2744037 2878747 2716013
13278 2716013 2774257 2657841 2741521 2664255 2482270 2810468 3104331 3240975 3090034 2979148
$$ packed form
13349B727360J73911k80563q545o7444l89263O836L35488j69417p5673j78744
13339B073946K34446J76234M36386L81035J99816l26796j92836o9965j73701K411
13329B740976j1172K33369o0113J47016l4602o8226N7327r3924L4494J78674p0710
13318C053109m9790o3311k19242k79593N687L09302K97053M48994j77999j5292
13308C308918p3390k38768n18553k37177J28664K96481J83056m2948j1142J0546
13298B805687K85890Q2476j43826P7895l28660K3229J29332p1075j49451j53294
13288B558203l9889L05538R3967J02286n894m27767j43153L00746J34710j62734
13278B716013N8244j16416Q3680p7266j81985L28198K93863J36644j50941j10886
$$ plain form
13268 2979148 3114997 3302129 3258338 3208973 3095214 3079465 3044381 2892127 3069918 2988313
13258 2988313 2941445 2868901 3000722 3249046 2908589 2805075 3022593 3089477 3272924 3190660
13248 3190660 3251321 3376006 3367263 3550031 3563448 3553427 3508053 3465264 3503306 3593279 3524772
13237 3524772 3231544 3059469 2796464 2672664 2957623 3042304 2764513 2800880 2777319 2999200
13227 2999200 2677269 2296769 2649253 2916461 3182621 3269228 3087222 2788497 2719786 2690333
13217 2690333 2561201 2602440 3036353 3359544 3089542 2864835 2854808 2755794 2805370 2761134
13207 2761134 2848208 2922005 3215486 3507610 3859324 3637571 3288602 3083785 3108417 3054550
13197 3054550 3243811 3078024 3136220 3361158 3036242 2992308 3136823 2980789 2980814 3001407 3158409
$$ packed form
13268B979148J35849J87132m3791m9365j13759j5749l5084j52254J77791q1605
13258B988313m6868p2544J31821K48324l40457j03514K17518O6884J83447q2264
13248C190660O0661J24685q743J82768J3417j0021m5374m2789L8042Q9973o8507
13237C524772k93228j72075k63005j23800K84959Q4681k77791L6367k3561K21881
13227B999200l21931l80500L52484K67208K66160Q6607j82006k98725o8711k9453
13217B690333j29132M1239M33913L23191k70002k24707j0027r9014M9576m4236
13207B761134Q7074P3797K93481K92124L51714k21753l48969k04817K4632n3867
13197C054550J89261j65787N8196K24938l24916m3934J44515j56034K5K0593J57002
$$ plain form
13186 3158409 2961462 2739565 2593756 3003649 3197691 3145821 2978708 2753727 2662390 2768571
13176 2768571 2482901 2308219 2525182 3043011 3145914 3033223 3336660 3419912 3425839 2982180
13166 2982180 3034237 3197040 3205362 3273446 3377954 3576542 3792120 3769844 3356093 2917825
13156 2917825 2727296 2500353 2700282 2998644 3102117 3287306 3163979 3358467 3783447
13147 3783447 3527348 3552016 3204253 3035122 2975358 3182967 3167780 3094611 3165100 3067142
13137 3067142 3350603 3621386 3434432 3430103 3664757 3628211 3497651 3712569 3844117 3780179
13127 3780179 3677034 3680588 3223410 3061715 3197801 3061231 3154591 3509635 3542160 3364190
13117 3364190 3225441 3299902 3344862 3323539 3231349 3012428 3383081 3652860 3793479 3580836
$$ packed form
13186C158409j96947k21897j45809M09893J94042n1870j67113k24981r1337J06181
13176B768571k85670j74682K16963N17829J02903j12691L03437Q3252N927m43659
13166B982180N2057J62803Q322O8084J04508J98588K15578k2276m13751m38268
13156B917825j90529k26943J99929K98362J03473J85189j23327J94488M24980
13147C783447k56099K4668l47763j69131n9764K07609j5187p3169P0489r7958
13137C067142K83461K70783j86954m329K34654l6546j30560K14918J31548o3938
13127C780179j03145L554m57178j61695J36086j36570R3360L55044L2525j77970
13117C364190j38749P4461M4960k1323r2190k18921L70653K69779J40619k12643
$$ plain form
13107 3580836 3564434 3619047 3731577 3757316 3778773 3977144 3837267 3468469 3319370 3290068
13097 3290068 3367417 3202251 3071907 3283735 3783849 3639742 3764650 3718810 3360955 3219977
13087 3219977 3429537 3764659 3690911 3507341 3382546 3197148 3417986 3642512 3568201 3310124
13077 3310124 3242637 3527892 3658075 3304969 3319684 3481117 3748625 3851882 3791258 3674795
13067 3674795 3165080 3004497 2985183 3080881 3315831 3497915 3807828 3822276 3837826 3527022
13057 3527022 3242354 3095612 3148328 3371014 3276957 3591422 3463654 3067639 2992980 3088862
13047 3088862 3240251 3537646 3615360 3406720 3490860 3570502 3647703 3409751 3361365 3378922
13037 3378922 3778104 4078742 4243923 4072026 3839166 3419141 3185659 3187147 3364195 3735236
$$ packed form
13107C580836j6402N4613J12530K5739K1457J98371j39877l68798j49099k9302
13097C290068P7349j65166j30344K11828N00114j44107J24908m5840l57855j40978
13087C219977K09560L35122p3748j83570j24795j85398K20838K24526p4311k58077
13077C310124o7487K85255J30183l53106J4715J61433K67508J03257o0624j16463
13067C674795n09715j60583j9314R5698K34950J82084L09913J4448J5550l10804
13057C527022k84668j46742N2716K22686r4057L14465j27768l96015p4659R5882
13047C088862J51389K97395P7714k08640Q4140P9642P7201k37952m8386J7557
13037C378922L99182L00638J65181j71897k32860m20025k33482J488J77048L71041
$$ plain form
13027 3735236 3958433 3843196 3833448 4188859 3835559 3686770 3977866 4130256 3936546 3802935
13017 3802935 3735919 3828830 3931484 4218946 4331055 4193618 4040405 3827534 3739168 3991870
13007 3991870 4285802 4533445 4426891 4223340 4134348 3996259 4168986 3996828 3893060 3716180
12997 3716180 3657869 3715124 3935382 3936814 3970446 3764650 3705806 3430879 3489744 3727019 3632150
12986 3632150 3407047 3260470 3082971 3218508 3479645 3551671 3742806 3531870 3404931 3489422
12976 3489422 3755047 4043037 3887884 3568704 3549145 3575004 3379875 3330387 3362974 3597637
12966 3597637 3900664 3775832 3752405 4045294 4092222 3978848 4282769 4378540 4119313 4077268
12956 4077268 4052693 3958007 3636830 3543017 3706330 3812646 3981841 3882236 4253185 4573955
$$ packed form
13027C735236K23197j15237r748L55411l53300j48789K91096J52390j93710j33611
13017C802935o7016R2911J02654K87462J12109j37437j53213k12871q8366K52702
13007C991870K93932K47643j06554k03551q8992j38089J72727j72158j03768j76880
12997C716180n8311N7255K20258J432L3632k05796n8844k74927N8865K37275r4869
12986C632150k25103j46577j77499J35537K61137P2026J91135k10936j26939Q4491
12976C489422K65625K87990j55153l19180j9559K5859j95129m9488L2587K34663
12966C597637L03027j24832k3427K92889M6928j13374L03921R5771k59227m2045
12956D077268k4575r4686l21177r3813J63313J06316J69195r9605L70949L20770
$$ plain form
12946 4573955 4569686 4199380 4157722 4325592 4382511 4184005 4148056 4216748 4140524 4040367 3848596
12935 3848596 3856863 3915132 4002100 4173374 4091496 4041085 4077146 4157466 4113572 4061230 4300933
12924 4300933 4223777 4038560 3985815 4142994 4588077 4563515 4645491 4591510 4310287 4171787
12914 4171787 3894061 3889719 3731092 3932566 4182309 4266109 4176551 4425617 4414525 4353226
12904 4353226 4099203 3874039 3917971 3745135 3582633 3725142 3640947 3404663 3605297 3655670
12894 3655670 3571590 3603791 3599664 3748368 3785539 3949009 3850806 3812319 3916556 4058615 4389293
12883 4389293 4344753 4205341 4203941 4008788 4141668 4137564 4185410 4080825 4134964 3994483 3977380
12872 3977380 4307496 4299571 4290360 4297195 4477616 4747346 4997940 4867392 4752020 4298055
$$ packed form
12946D573955m269l70306m1658J67870N6919j98506l5949O8692p6224j00157j91771
12935C848596Q267N8269Q6968J71274q1878n0411L6061Q0320m3894n2342K39703
12924D300933p7156j85217n2745J57179M45083k4562Q1976n3981k81223j38500
12914D171787k77726m342j58627K01474K49743Q3800q9558K49066j1092o1299
12904D353226k54023k25164M3932j72836j62502J42509q4195k36284K00634N0373
12894C655670q4080L2201m127J48704L7171J63470r8203l8487J04237J42059L30678
12883D389293m4540j39412j400j95153J32880m104M7846j04585N4139j40481j7103
12872C977380L30116p925r211O835J80421K69730K50594j30548j15372m53965
$$ plain form
12862 4298055 4227529 4201853 3997225 4120254 4539894 4583068 4619663 4455374 4199542 4108949
12852 4108949 4265070 4280893 4425760 4673150 4586893 4630673 4790689 4708308 4606940 4356073
12842 4356073 3996819 4325790 4354760 4260109 3978844 3434492 3722825 4367676 4545835 4609470
12832 4609470 4470641 4257902 4481850 4567475 4116761 4211197 4762141 4714819 4528847 4092620
12822 4092620 4054938 4245317 4736997 4992656 5054285 4946624 4845445 4749727 4575426 4709446
12812 4709446 4714285 4482693 4490355 4874833 4989857 4589746 4580141 4789812 4952798 4567918
12802 4567918 4365479 4239637 4491550 4833611 4648997 4542179 4657826 4942425 4879934 5001292
12792 5001292 5156672 5116537 4977604 5009587 4863624 4629354 4246540 4060088 4089841 4334988
$$ packed form
12862D298055p0526k5676k04628J23029M19640M3174L6595j64289k55832r0593
12852D108949J56121J5823J44867K47390q6257M3780J60016q2381j01368k50867
12842D356073l59254L28971K8970r4651k81265n44352K88333O44851J78159O3635
12832D609470j38829k12739K23948Q5625m50714R4436N50944m7322j85972m36227
12822D092620l7682J90379M91680K55659O1629j07661j01179r5718j74301J34020
12812D709446M839k31592P662L84478J15024m00111r605K09671J62986l84880
12802D567918k02439j25842K51913L42061j84614j06818J15647K84599o2491J21358
12792E001292J55380m0135j38933L1983j45963k34270l82814j86452K9753K45147
$$ plain form
12782 4334988 4241368 4131233 4207856 4223508 4306659 4772354 4779199 4632344 4395974 4471199 4635614
12771 4635614 4947963 5197861 5134142 4506322 4170435 4429151 4628494 4390217 4375949 4605926
12761 4605926 4479060 4328674 4153139 4370743 4586445 4367235 4432312 4519602 4688367 4686364
12751 4686364 4479652 4890003 5073951 4936260 5095699 5081589 4976061 4495671 4170415 4248707
12741 4248707 4272797 4233135 4496334 4381041 4376345 4474591 4295674 4355042 4322803 4231762 4349357
12730 4349357 4724242 4833481 4869622 4971624 5235846 5525850 5428500 5049122 4924666 5184907
12720 5184907 5628209 5562102 5339462 5132969 4986841 5155462 4955477 4487303 4441948 4557053
12710 4557053 4484879 4457157 4783058 4969219 5064880 4729952 4788376 4939452 4949512 4897949
$$ packed form
12782D334988r3620j10135P6623J5652Q3151M65695O845j46855k36370P5225J64415
12771D635614L12349K49898o3719o27820l35887K58716J99343k38277j4268K29977
12761D605926j26866j50386j75535K17604K15702k19210O5077Q7290J68765k003
12751D686364k06712M10351J83948j37691J59439j4110j05528m80390l25256P8292
12741D248707K4090l9662K63199j15293m696R8246j78917N9368l2239r1041J17595
12730D349357L74885J09239L6141J02002K64222K90004r7350l79378j24456K60241
12720E184907M43302o6107k22640k06493j46128J68621j99985m68174m5355J15105
12710D557053p2174k7722L25901J86161R5661l34928N8424J51076J0060n1563
$$ plain form
12700 4897949 4981684 4757323 4495868 4756123 4925600 4984193 5032700 5078463 4828848 4325102
12690 4325102 4378075 4807019 4904862 4542844 4328032 4557813 4647812 4926105 4911884 4617502
12680 4617502 4871794 5279879 5139453 5177567 5033372 4902181 5049116 5320164 5208504 5021548
12670 5021548 4995332 4924348 4578583 4653634 4813659 4394745 4430753 4733963 4948728 4972251
12660 4972251 4811170 4889714 4938059 5028527 4761888 4536242 4558978 4726435 4965169 4973956
12650 4973956 5403314 5503522 5458311 5308350 5374003 5224908 5047108 5130690 5131039 5239083
12640 5239083 5285263 5561091 5428335 5338163 5346795 4979727 5059545 5205107 5214889 5035678 4843800
12629 4843800 4825145 4739015 4721465 5009045 4993997 4543318 4556100 4402765 4254457 4620208
$$ packed form
12700D897949Q3735k24361k61455K60255J69477N8593M8507M5763k49615n03746
12690D325102N2973M28944R7843l62018k14812K29781Q9999K78293j4221k94382
12680D617502K54292M08085j40426L8114j44195j31191J46935K71048j11660j86956
12670E021548k6216p0984l45765P5051J60025m18914L6008L03210K14765K3523
12660D972251j61081P8544M8345R0468k66639k25646K2736J67457K38734Q787
12650D973956M29358J00208m5211j49961O5653j49095j77800Q3582L49J08044
12640E239083M6180K75828j32756r0172Q632l67068P9818J45562R782j79211j91878
12629D843800j8655q6130j7550K87580j5048m50679J2782j53335j48308L65751
$$ plain form
12619 4620208 4911111 4838080 4924922 4980715 4949555 4964705 5217538 5099176 5030815 5362109
12609 5362109 5775921 5775102 5734088 5644761 5468002 5132785 5105909 5233095 5422282 5342887 5323509
12598 5323509 5475076 5386617 5606246 5449163 5289961 5466075 5454073 5290607 5050486 4967925
12588 4967925 5224869 5257414 5253446 5139590 4945972 4629489 4743168 4872070 4961461 5244555
12578 5244555 5293626 5203778 5263471 4946753 4950484 5015134 5430155 5523336 5611631 5932749 5803308
12567 5803308 5468851 5232425 5256552 5241834 5192258 5172586 5291535 5253229 5343328 5370933 5384089
12556 5384089 5294979 5201671 5012946 5174443 5591143 5658194 5818082 5836982 5655553 5470702
12546 5470702 5645071 5734398 5740023 5695371 5673245 5527998 5568776 5683122 5808829 5737292 5852080
$$ packed form
12619D620208K90903p3031Q6842N5793l1160J5150K52833j18362o8361L31294
12609E362109M13812q19m1014q9327j76759l35217k6876J27186J89187p9395j9378
12598E323509J51567q8459K19629j57083j59202J76114j2002j63466k40121q2561
12588D967925K56944L2545l968j13856j93618l16483J13679J28902Q9391K83094
12578E244555M9071q9848N9693l16718L731O4650M15021R3181Q8295L21118j29441
12567E803308l34457k36426K4127j4718m9576j9672J18949l8306R0099K7605J3156
12556E384089q9110r3308j88725J61497M16700O7051J59888J8900j81429j84851
12546E470702J74369Q9327N625m4652k2126j45247M0778J14346J25707p1537J14788
$$ plain form
12535 5852080 5960666 6073917 6258998 6511223 6137142 5742797 5562455 5670506 5928694
12526 5928694 6297397 6438558 6157323 6309074 6214193 6254692 6153563 5748398 5702585 5937308
12516 5937308 6186998 6167120 6090368 6113810 5933051 5558937 5304358 5226912 5481921 5573936
12506 5573936 5605725 5709643 5900098 6069652 6345487 6337469 5952485 6122346 6293907 6123677
12496 6123677 6140932 6155080 5830956 5979565 5985447 6326067 6485154 6539954 6671872 6770515
12486 6770515 6466020 6170476 5785803 5711275 5993455 6272541 6425363 6276149 5820533 5887628
12476 5887628 5938007 6286678 6282654 6031946 5842742 5670177 5785404 5818075 6129413 6137483
12466 6137483 6058704 6238546 6095201 5734684 5729969 6155004 6116134 6479970 6581045 6423759
$$ packed form
12535E852080J08586J13251J85081K52225l74081l94345j80342J08051K58188
12526E928694L68703J41161k81235J51751r4881M0499j01129m05165m5813K34723
12516E937308K49690j9878p6752K3442j80759l74114k54579p7446K55009R2015
12506E573936L1789J03918J90455J69554K75835q018l84984J69861J71561j70230
12496F123677J7255J4148l24124J48609N882L40620J59087N4800J31918R8643
12486F770515l04495k95544l84673p4528K82180K79086J52822j49214m55616O7095
12476E887628N0379L48671m024k50708j89204j72565J15227L2671L11338Q070
12466F137483p8779J79842j43345l60517m715M25035l8870L63836J01075j57286
$$ plain form
12456 6423759 6373915 6685645 6730800 6444407 6096702 6170706 6270757 6360638 6525622 6292235
12446 6292235 5949578 6160446 6239603 6300334 6409942 6555453 6680444 6859629 7082178 6745434
12436 6745434 6667618 6371969 6191307 6321282 6496968 6483888 6670837 6889495 7181977 7033627
12426 7033627 6947665 7109744 7418679 7721900 7885794 7606086 7526840 7426268 7412419 7287458
12416 7287458 7055203 7445593 7346239 7245421 7277324 7436745 7521316 7412262 7498272 8154539
12406 8154539 8350714 8164642 7771049 7446661 7192626 7283668 7836073 7950616 7702723 7344056
12396 7344056 7090395 7058020 7262707 7016310 6960824 7040066 7391954 7752162 7864014 7944707
12386 7944707 7671399 7453275 7675541 7814923 8119488 7659849 7221606 7320701 7248830 7474934
$$ packed form
12456F423759m9844L11730M5155k86393l47705P4004J00051Q9881J64984k33387
12446F292235l42657K10868P9157O0731J09608J45511J24991J79185K22549l36744
12436F745434p7816k95649j80662J29975J75686j3080J86949K18658K92482j48350
12426G033627q5962J62079L08935L03221J63894k79708p9246j00572j3849j24961
12416G287458k32255L90390r9354j00818L1903J59421Q4571j09054Q6010O56267
12406H154539J96175j86072l93593l24388k54035R1042N52405J14543k47893l58667
12396G344056k53661l2375K04687k46397n5486P9242L51888L60208J11852Q0693
12386G944707k73308k18124K22266J39382L04565m59639m38243R9095p1871K26104
$$ plain form
12376 7474934 7327194 7506309 7749332 7843125 7758334 7456626 7565777 7580004 7533804 7691126
12366 7691126 7582350 7606489 7505457 7422449 7501142 7191688 7040261 7066783 7089236 7594556
12356 7594556 7800256 7792092 7831218 7940537 7737257 7557472 7490215 7525473 7443892 7409161 7241269
12345 7241269 7277753 7188122 7145456 7078723 7095118 6976870 6942590 6604496 6922980 6931648 6756953
12334 6756953 7069715 7324590 7162369 7117107 7277121 7011243 7102011 7454517 7622538 7287212
12324 7287212 7305181 7126078 7074701 6958262 7068430 7153763 7192694 7266453 7344493 7507089
12314 7507089 7323513 7471100 7495544 7358207 7238555 7126681 7100718 7183465 7676552 7870582
12304 7870582 7711171 7546962 7556186 7616112 7722271 7528912 7354688 7338564 7345884 7347631 7503983
$$ packed form
12376G474934j47740J79115K43023R3793q4791l01708J09151J4227m6200J57322
12366G691126j08776K4139j01032q3008P8693l09454j51427K6522K2453N05320
12356G594556K05700q164L9126J09319k03280j79785o7257L5258q1581l4731j67892
12345G241269L6484q9631m2666o6733J6395j18248l4280l38094L18484Q668j74695
12334F756953L12762K54875j62221m5262J60014k65878R0768L52506J68021l35326
12324G287212J7969j79103n1377j16439J10168Q5333L8931P3759P8040J62596
12314G507089j83576J47587K4444j37337j19652j11874k5963Q2747M93087J94030
12304G870582j59411j64209R224N9926J06159j93359j74224j6124P320J747J56352
$$ plain form
12293 7503983 7194658 7253608 7267699 7233035 7084133 7005254 7271102 7338144 7452864 7750668
12283 7750668 7999508 7793930 7479373 7364738 7377904 7579503 7813324 7673288 7329186 7275847
12273 7275847 7562062 7705504 7614981 7930912 8069816 8031987 8041241 8107638 8132521 7833883
12263 7833883 8093346 8161130 8448704 8339110 7968081 7967566 7969163 8024070 8202744 8194325 8168124
12252 8168124 8161946 8061260 8061141 7909150 7941318 7960853 8112523 8135398 8275638 8196457 8495559
12241 8495559 8697713 8599497 8450657 8220563 8291987 8527969 8660442 8586230 8522714 8441996
12231 8441996 8468819 8505193 8563538 8697548 8549649 8704416 8723236 8607235 8491355 8311531
12221 8311531 8453660 8552661 8552354 8856406 8438187 8325208 8775127 9034259 9125236 9128819 9172999
$$ packed form
12293G503983l09325N8950J4091l4664j48902p8879K65848O7042J14720K97804
12283G750668K48840k05578l14557j14635J3166K01599K33821j40036l44102n3339
12273G275847K86215J43442r0523L15931J38904l7829R254O6397K4883k98638
12263G833883K59463O7784K87574j09594l71029n15J597N4907J78674q419k6201
12252H168124o178j00686j19j51991L2168J9535J51670K2875J40240p9181K99102
12241H495559K02154r8216j48840k30094P1424K35982J32473p4212o3516q0718
12231H441996K6823L6374N8345J34010j47899J54767J8820j16001j15880j79824
12221H311531J42129R9001l07L04052m18219j12979M49919K59132R0977L583M4180
$$ plain form
12210 9172999 9257977 9208470 9307436 9309896 9118205 8860396 9200440 9375750 9675250 9619271
12200 9619271 9317727 9406886 9554732 9383004 9298750 9680860 9911410 9935821 9940792 9949895 9888517
12189 9888517 9792924 9987930 10061873 9875493 9764532 9802713 9627000 9721636 10301464 10207388
12179 10207388 9968355 9901939 9866445 10219539 10495603 10430403 10413738 10252752 10404681 10548038
12169 10548038 10508556 10718118 10993676 10877236 11027128 11392174 11607384 11288956 10920538
12160 10920538 10562166 10400653 10753210 10754757 10781426 10867331 10740123 10522939 10726000 11171846
12150 11171846 11409919 11271138 11345032 11240251 11082541 11258863 11323710 11457237 11637371 12115651
12140 12115651 12231508 11939989 11827434 11996710 11862145 11744248 11801383 11997112 12136652
$$ packed form
12210I172999Q4978m9507R8966K460j91691k57809L40044J75310K99500n5979
12200I619271l01544Q9159J47846j71728q4254L82110K30550K4411M971R103o1378
12189I888517r5593J95006P3943j86380j10961L8181j75713R4636N79828r4076
12179A0207388k39033o6416l5494L53094K76064o5200j6665j60986J51929J43357
12169A0548038l9482K09562K75558j16440J49892L65046K15210l18428l68418
12160A0920538l58372j61513L52557J547K6669Q5905j27208k17184K03061M45846
12150A1171846K38073j38781P3894j04781j57710J76322O4847J33527J80134M78280
12140A2115651J15857k91519j12555J69276j34565j17897N7135J95729J39540
$$ plain form
12131 12136652 12545517 12613564 12931904 13316552 13450265 13011971 12813737 13017297 13223249
12122 13223249 13110047 13424982 13583259 13198931 13137645 13584903 14152380 14280445 14459752
12113 14459752 14636866 14573726 14612913 14818862 15194216 15515690 15322379 15416277 15395913 15238388
12103 15238388 15456689 15571297 15488265 15931849 16254043 16426656 16691953 16734838 16830531 17250029
12093 17250029 17772362 17896933 17951293 17974349 18131911 18360043 18743654 19082400 19103504 19087663
12083 19087663 19179752 19795825 20345185 20554688 21020596 21184514 21534338 21774661 21811748 21993592
12073 21993592 22308195 22875215 23275738 23581348 23763034 24314579 24332140 24517805 24909014
12064 24909014 25724036 26485817 27076236 27606331 28531340 29177918 29373447 29586711 30063582
$$ packed form
12131A2136652M08865O8047L18340L84648J33713m38294j98234K03560K05952
12122A3223249j13202L14935J58277l84328o1286M47258N67477J28065J79307
12113A4459752J77114o3140L9187K05949L75354L21474j93311R3898k0364j57525
12103A5238388K18301J14608q3032M43584L22194J72613K65297M2885R5693M19498
12093A7250029N22333J24571N4360K3056J57562K28132L83611L38746K1104j5841
12083A9087663R2089O16073N49360K09503M65908J63918L49824K40323L7087J81844
12073B1993592L14603N67020M00523L05610J81686N51545J7561J85665L91209
12064B4909014Q15022P61781N90419N30095R25009O46578J95529K13264M76871
$$ plain form
12055 30063582 30621386 31227694 32087256 32600686 33242580 33885959 34881464 36002783 36655723
12046 36655723 37123955 37901279 38951920 40305444 41814362 43080123 44528148 46065491
12038 46065491 47145187 48398574 49758195 50960269 52346821 54211731 55940970 57935566
12030 57935566 59624149 61443066 64100509 66356824 69076095 71417968 73711653 76353687
12022 76353687 78951523 81582530 84069203 86757930 90009647 93493422 96819500 100212354
12014 100212354 103473031 106767155 110033310 113575167 116996623 120441639 123787115 127466475
12006 127466475 131313380 134691003 137812175 140892175 144350146 147893975 150928254 154162792
11998 154162792 157142847 159809279 162876980 165869400 168564602 171513891 174064784 176297900
$$ packed form
12055C0063582N57804O06308Q59562N13430O41894O43379R95505J121319O52940
12046C6655723M68232P77324J050641J353524J508918J265761J448025J537343
12038D6065491J079696J253387J359621J202074J386552J864910J729239J994596
12030E7935566J688583J818917K657443K256315K719271K341873K293685K642034
12022G6353687K597836K631007K486673K688727L251717L483775L326078L392854
12014A00212354L260677L294124L266155L541857L421456L445016L345476L679360
12006A27466475L846905L377623L121172L080000L457971L543829L034279L234538
11998A54162792K980055K666432L067701K992420K695202K949289K550893K233116
$$ plain form
11990 176297900 178817457 181445139 183929811 185966037 188041370 190383964 192792560 194928735
11982 194928735 196641143 197981738 199869302 201738374 203049968 204343543 205634975 207123909
11974 207123909 208579025 209624332 210224903 210613216 211153853 211623422 211984431 212009171 211714561
11965 211714561 211614720 210705192 210094959 209722359 209107141 208356324 207162653 205948120 204625054
11956 204625054 203458722 202641911 201355730 199684193 198043118 196898713 195339068 193243938
11948 193243938 191639710 190003042 188024107 185835449 183319248 180935613 178440055 176305781
11940 176305781 173820236 170751439 167975531 165175281 162289103 159323818 156084609 152623533
11932 152623533 149636734 146602632 142953004 139173139 136062500 132437193 128350329 124239505
$$ packed form
11990A76297900K519557K627682K484672K036226K075333K342594K408596K136175
11982A94928735J712408J340595J887564J869072J311594J293575J291432J488934
11974B07123909J455116J045307O00571L88313N40637M69569L61009K4740k94610
11965B11714561r9841r09528o10233l72600o15218p50817j193671j214533j323066
11956B04625054j166332q16811j286181j671537j641075j144405j559645k095130
11948A93243938j604228j636668j978935k188658k516201k383635k495558k134274
11940A76305781k485545l068797k775908k800250k886178k965285l239209l461076
11932A52623533k986799l034102l649628l779865l110639l625307m086864m110824
$$ plain form
11924 124239505 120695640 117370874 114101478 110621542 107190757 103748643 100143460 96954082
11916 96954082 93913917 90834370 87739471 84519177 81578071 78458503 76018543 73633950
11908 73633950 71278944 68766673 66367207 64369714 62730259 61143093 59460519 57358262
11900 57358262 55529491 53914445 52286519 50790749 49112060 47911598 46929951 45606585
11892 45606585 44327887 43150011 41632958 40393023 39640770 38850244 37629646 36582398
11884 36582398 35799987 35158397 34516265 33654927 32649213 32316621 31667537 30613727 29976048
11875 29976048 29521711 28899200 28301346 27558398 27156103 26660867 25913392 25242973 24806922
11866 24806922 24652696 24535408 24022809 23334588 22886133 22683467 22342972 21864103 21750317
$$ packed form
11924A24239505l543865l324766l269396l479936l430785l442114l605183l189378
11916I6954082l040165l079547l094899l220294k941106l119568k439960k384593
11908G3633950k355006k512271k399466j997493j639455j587166j682574k102257
11900E7358262j828771j615046j627926j495770j678689j200462r81647j323366
11892D5606585j278698j177876j517053j239935p52253p90526j220598j047248
11884C6582398p82411o41590o42132q61338j005714l32592o49084j053810o37679
11875B9976048m54337o22511n97854p42948m02295m95236p47475o70419m36051
11866B4806922j54226j17288n12599o88221m48455k02666l40495m78869j13786
$$ plain form
11857 21750317 21442286 21105567 21108127 20895830 20415184 20255944 20115292 19520872 19156231 18858927
11847 18858927 18641643 18674910 18607936 18368510 18078618 17881714 17469534 17172255 16906410 17023149
11837 17023149 17017708 16367905 16276367 16291810 16366326 16478126 16243351 15879260 15823007 15794666
11827 15794666 15767217 15601241 15488402 15487099 15456574 15090645 14946500 14779265 14628813 14436943
11817 14436943 14584811 14592076 14415312 14207958 14264890 14349286 14489573 14227332 13950685 13770330
11807 13770330 13525996 13560612 13593885 13775534 13803212 13499773 13615447 13412450 12954591 12835648
11797 12835648 12694540 12624816 12659772 12615018 12634676 12464228 12193615 12290076 12495602 12518760
11787 12518760 12283524 11956683 11732318 11756784 12065190 11780297 11593639 11739299 11692971 11150516
$$ packed form
11857B1750317l08031l36719K560k12297m80646j59240j40652n94420l64641k97304
11847A8858927k17284L3267o6974k39426k89892j96904m12180k97279k65845J16739
11837A7023149n441o49803r1538J5443P4516J11800k34775l64091n6253k8341
11827A5794666k7449j65976j12839j303l0525l65929j44145j67235j50452j91870
11817A4436943J47868P265j76764k07354N6932Q4396J40287k62241k76647j80355
11807A3770330k44334L4616L3273J81649K7678l03439J15674k02997m57859j18943
11797A2835648j41108o9724L4956m4754J9658j70448k70613R6461K05526K3158
11787A2518760k35236l26841k24365K4466L08406k84893j86658J45660m6328n42455
$$ plain form
11777 11150516 10929980 10890494 10747445 10573101 10540082 10460026 11012961 11000368 10779040 11061401
11767 11061401 11113928 10920856 10847485 10771651 10747788 10712410 10832686 10517080 10054561 9934132
11757 9934132 10162494 10162896 10031130 9838299 9906242 9696541 9565455 9748549 9501239 9595128
11747 9595128 9658789 9440020 9630424 9901473 9884451 9808690 9742197 9392084 9266683 9207778
11737 9207778 9398186 9338343 8879034 8847007 9067905 9092553 9036377 8951464 8848890 9254810
11727 9254810 9363208 8951873 8472958 8562895 8811651 8897803 9047073 8860408 8999848 8806419
11717 8806419 8667557 8551136 8565560 8370034 8483169 8494493 8334547 8913904 9414577 9190562
11707 9190562 8842963 8599040 8843141 8785787 8779810 8459191 8195755 8222362 8518516 8782981
$$ packed form
11777A1150516k20536l9486j43049j74344l3019q0056N52935j2593k21328K82361
11767A1061401N2527j93072p3371p5834k3863l5378J20276l15606m62519j20429
11757I934132K28362M02j31766j92831O7943k09701j31086J83094k47310R3889
11747I595128O3661k18769J90404K71049j7022p5761o6493l50113j25401n8905
11737I207778J90408n9843m59309l2027K20898K4648n6176q4913j02574M05920
11727I254810J08398m11335m78915Q9937K48756Q6152J49270j86665J39440j93429
11717H806419j38862j16421J4424j95526J13135J1324j59946N79357N00673k24015
11707I190562l47599k43923K44101n7354n977l20619k63436K6607K96154K64465
$$ plain form
11697 8782981 8956917 8866737 8812500 8667373 8267377 8481052 8420773 8541561 8567026 8695951
11687 8695951 8636399 8428349 8483960 8759503 8720172 7962193 7995778 8071996 8094467 8142987 8278029
11676 8278029 8078317 8066496 7813991 7722342 8024954 8054730 7971370 8168718 8230094 7882047
11666 7882047 8009402 7963226 7683921 7846994 8154830 8349174 8292330 8135190 8163602 7979117
11656 7979117 7969073 8156200 8223942 8338365 8291698 8053119 7681392 7698036 7928199 7845137
11646 7845137 7786662 7747313 7749336 7882106 7884799 7899585 8209408 8586671 8583078 8300851 8509593
11635 8509593 8469280 8313857 8211236 8188682 8571988 8519856 8300170 8355756 8114019 7759464
11625 7759464 7774147 7779251 7999215 8398379 8501189 8459422 8472418 8516378 8492657 8673179 8631707
$$ packed form
11697H782981J73936r0180n4237j45127l99996K13675o0279J20788K5465J28925
11687H695951n9552k08050N5611K75543l9331p57979L3585P6218K2471M8520J35042
11676H278029j99712j1821k52505r1649L02612K9776q3360J97348O1376l48047
11666G882047J27355m6176k79305J63073L07836J94344n6844j57140K8412j84485
11656G979117j0044J87127O7742J14423m6667k38579l71727J6644K30163q3062
11646G845137n8475l9349K023J32770K693J4786L09823L77263l593k82227K08742
11635H509593m0313j55423j02621k2554L83306n2132k19686N5586k41737l54555
11625G759464J4683N104K19964L99164J02810m1767J2996M3960k3721J80522m1472
$$ plain form
11614 8631707 8551765 8467101 8297514 8325788 8300704 8499755 8898809 9083005 9153507 9155343 9312350
11603 9312350 9168455 8869242 8880126 8795587 8836748 8823399 8953682 8802464 8736252 8398052
11593 8398052 8153591 8007423 8132997 8450150 8791832 9219538 9118540 9066602 9204707 9344025
11583 9344025 9208009 9206008 8693521 8528522 8884893 8990453 9024842 9289327 9701969 9923200
11573 9923200 10189149 9969098 9780676 9815566 9700472 9647478 9569319 9771166 9747985 9427670
11563 9427670 9167087 9356511 9572910 9938514 9891081 9853831 9834508 9764027 9990498 9987219
11553 9987219 9857793 10236189 10649652 10815968 10981223 10980249 10869303 10785882 10780200 10832541 10830572
11542 10830572 11151521 11568863 11414498 11465575 11430854 11365317 11593467 11772780 11974597 11884176
$$ packed form
11614H631707p9942q4664j69587K8274k5084J99051L99054J84196P0502J836J57007
11603I312350j43895k99213J0884q4539M1161j3349J30283j51218o6212l38200
11593H398052k44461j46168J25574L17153L41682M27706j00998n1938J38105J39318
11583I344025j36016k001n12487j64999L56371J05560L4389K64485M12642K21231
11573I923200K65949k20051j88422L4890j15094n2994p8159K01847k3181l20315
11563I427670k60583J89424K16399L65604m7433l7250j9323p0481K26471l279
11553I987219j29426L78396M13463J66316J65255r74j10946q3421n682N2341j969
11542A0830572L20949M17342j54365N1077l4721o5537K28150J79313K01817r0421
$$ plain form
11532 11884176 11818080 11990364 11938906 11966175 11926361 11750018 11832601 11843224 11967274 12260787
11522 12260787 12243297 12230716 12678857 12859753 12941063 13135383 13257897 13136645 13085728 12930048
11512 12930048 13103649 13273424 13288915 13389674 13848824 14070259 13927775 14161065 14654857
11503 14654857 14953184 14933668 15216960 15389446 15529469 15691464 15744836 15835046 15884319 16111746
11493 16111746 16156010 16189082 16072218 16113749 16217905 16331192 16514676 16864979 17347863 17858850
11483 17858850 18256943 18336231 18588826 18600973 18601121 18847525 19153876 19788466 20131992 20747116
11473 20747116 21293149 21433199 21456016 21754988 22011921 22052156 22312820 22996065 23291418 23736975
11463 23736975 23904767 24350930 24705487 25273184 25850488 26370982 27015279 27571186 28276519
$$ packed form
11532A1884176o6096J72284n1458K7269l9814j76343Q2583J0623J24050K93513
11522A2260787j7490j2581M48141J80896Q1310J94320J22514j21252n0917j55680
11512A2930048J73601J69775J5491J00759M59150K21435j42484K33290M93792
11503A4654857K98327j9516K83292J72486J40023J61995N3372R0210M9273K27427
11493A6111746M4264L3072j16864M1531J04156J13287J83484L50303M82884N10987
11483A7858850L98093P9288K52595J2147J48K46404L06351O34590L43526O15124
11473B0747116N46033J40050K2817K98972K56933M0235K60664O83245K95353M45557
11463B3736975J67792M46163L54557N67697N77304N20494O44297N55907P05333
$$ plain form
11454 28276519 28961702 29859968 30460121 31022471 31972615 32916501 34099420 34800243 35316680
11445 35316680 36249232 37497369 39095602 40037413 41251885 42829204 44230660 45475511
11437 45475511 47285343 49075313 50949125 52691015 54612734 56866983 58936179 60863140
11429 60863140 62970240 65304106 67566089 70152403 72854547 75898195 78698643 81526771
11421 81526771 85077903 88394649 91154218 93935604 97037385 100191424 103196591 106555136
11413 106555136 109579905 112499634 115391842 118109289 120670864 123417429 126077812 128855421
11405 128855421 131443587 134088709 136814532 139442770 142233322 145046535 148035419 150815059
11397 150815059 153582484 156076923 158731000 161247838 164197793 167317090 170211968 173152249
$$ packed form
11454B8276519O85183Q98266O00153N62350R50144R43886J182919P00823N16437
11445C5316680R32552J248137J598233R41811J214472J577319J401456J244851
11437D5475511J809832J789970J873812J741890J921719K254249K069196J926961
11429F0863140K107100K333866K261983K586314K702144L043648K800448K828128
11421H1526771L551132L316746K759569K781386L101781L154039L005167L358545
11413A06555136L024769K919729K892208K717447K561575K746565K660383K777609
11405A28855421K588166K645122K725823K628238K790552K813213K988884K779640
11397A50815059K767425K494439K654077K516838K949955L119297K894878K940281
$$ plain form
11389 173152249 176052912 178887081 181576136 184420756 186854371 189227571 191578666 193791505
11381 193791505 195361476 196955408 198864663 200291235 201566987 202734388 203571430 203994201
11373 203994201 204097790 204218760 204123494 204671055 204806319 204400038 203945074 203511194 203141372
11364 203141372 202975145 202474086 202160199 201561909 200689731 199919743 199512539 199013532 197954836
11355 197954836 196943934 195905996 194432112 192814166 191348194 190088501 188868872 187461974
11347 187461974 185475453 183413634 181196785 179117955 176669693 174113025 171497142 168939121
11339 168939121 166123998 163187061 160228351 157343613 154521378 151528094 148904001 146122864
11331 146122864 143258428 140462486 137975772 134985769 131754920 129152276 126344042 123230273
$$ packed form
11389A73152249K900663K834169K689055K844620K433615K373200K351095K212839
11381A93791505J569971J593932J909255J426572J275752J167401Q37042M22771
11373B03994201J03589J20970r5266N47561J35264m06281m54964m33880l69822
11364B03141372j66227n01059l13887n98290q72178p69988m07204m99007j058696
11355A97954836j010902j037938j473884j617946j465972j259693j219629j406898
11347A87461974j986521k061819k216849k078830k448262k556668k615883k558021
11339A68939121k815123k936937k958710k884738k822235k993284k624093k781137
11331A46122864k864436k795942k486714k990003l230849k602644k808234l113769
$$ plain form
11323 123230273 120575851 118022918 115280273 112754120 110030403 107074978 104153639 101170497
11315 101170497 98679293 96051713 93663022 91521708 89377052 86802631 84148686 81811987
11307 81811987 79270717 77026494 74779702 72677820 70913118 68848901 66606488 64703338
11299 64703338 62764161 60606262 58628448 57119729 55288356 53572673 51961484 50360245
11291 50360245 48724841 47056365 45371301 44128210 43133973 41956923 40456211 39246046
11283 39246046 37888425 36632312 35812988 35189571 34113583 32654591 31432407 30541765
11275 30541765 29746916 28799876 27967705 27545076 26724950 25726147 25249915 24618237 24193264
11266 24193264 23890342 23088973 22324944 21768367 21349802 20777663 20213827 19855789 19271477
$$ packed form
11323A23230273k654422k552933k742645k526153k723717k955425k921339k983142
11315A01170497k491204k627580k388691k141314k144656k574421k653945k336699
11307H1811987k541270k244223k246792k101882j764702k064217k242413j903150
11299F4703338j939177k157899j977814j508719j831373j715683j611189j601239
11291E0360245j635404j668476j685064j243091r94237j177050j500712j210165
11283C9246046j357621j256113q19324o23417j075988j458992j222184q90642
11275C0541765p94849r47040q32171m22629q20126r98803m76232o31678m24973
11266B4193264l02922q01369p64029n56577m18565n72139n63836l58038n84312
$$ plain form
11257 19271477 18605149 18214517 18065253 17579701 17173825 16760223 16290093 15945873 15700097
11248 15700097 15555296 15534965 15305468 14921148 14469632 14120998 14209815 13956665 13551643 13134461
11238 13134461 12945588 12958766 12776040 12291362 11987179 11920583 11981863 11840918 11433757 11454193
11228 11454193 11568479 11335670 11161997 11140986 11057289 11017975 10941428 10392401 10160176 10489541
11218 10489541 10514158 10361492 10393894 10351573 10347379 10272111 9904761 9866189 9918127 10025992 10257219
11207 10257219 10065674 10118811 10112920 10034045 9950772 9668465 9544242 9331065 9381155 9439446
11197 9439446 9387556 9236245 9193383 9150382 9338303 9394688 9254907 9174857 8981420 8820816
11187 8820816 8729769 8773263 8688431 8843882 8977624 9044057 8797956 8611348 8952096 9232909
$$ packed form
11257A9271477o66328l90632j49264m85552m05876m13602m70130l44220k45776
11248A5700097j44801k0331k29497l84320m51516l48634Q8817k53150m05022m17182
11238A3134461j88873J3178j82726m84678l04183o6596O1280j40945m07161K0436
11228A1454193J14286k32809j73673k1011q3697l9314p6547n49027k32225L29365
11218A0489541K4617j52666L2402m2321m194p5268l67350l8572N1938J07865K31227
11207A0257219j91545N3137n891p8875q3273k82307j24223k13177N0090N8291
11197I439446n1890j51311m2862m3001J87921N6385j39781q0050j93437j60604
11187H820816r1047M3494q4832J55451J33742O6433k46101j86608L40748K80813
$$ plain form
11177 9232909 9257507 8864658 8840691 8645009 8680068 8748130 8656860 8612908 8239741 8374557
11167 8374557 8526972 8410967 8453551 8527414 8333590 8160720 8327800 8406282 8198400 8210366
11157 8210366 8061728 7857938 7488977 6910112 7013522 7088603 7077786 7016681 7239101 7091863
11147 7091863 6858756 6789419 6963557 7169929 7266770 6987125 6816811 6784781 6824135 6653003
11137 6653003 6288418 6266984 6218637 6030898 6001952 6000915 6134669 6215240 6242331 6219339 6352703
11126 6352703 6175315 6269311 6369133 6203331 5770889 5689843 5518106 5621562 5963568 6138561
11116 6138561 5851490 5498369 5346982 5508985 5621806 5791098 5954937 5569906 5178423
11107 5178423 4918325 4850211 5069960 5426504 5559405 5250387 5165587 5203522 5112751 5110521
$$ packed form
11177I232909K4598l92849k3967j95682L5059O8062r1270m3952l73167J34816
11167H374557J52415j16005M2584P3863j93824j72870J67080P8482k07882J1966
11157H210366j48638k03790l68961n78865J03410P5081j0817o1105K22420j47238
11147G091863k33107o9337J74138K06372R6841k79645j70314l2030L9354j71132
11137F653003l64585k1434m8347j87739k8946j037J33754Q0571K7091k2992J33364
11126F352703j77388R3996R9822j65802m32442q1046j71737J03456L42006J74993
11116F138561k87071l53121j51387J62003J12821J69292J63839l85031l91483
11107E178423k60098o8114K19749L56544J32901l09018q4800L7935r0771k230
$$ plain form
11097 5110521 5029220 5133593 5102820 5043258 5064676 4861762 4823445 4954363 4905003 4655036
11087 4655036 4521067 4724369 4607204 4494867 4602987 4748610 4625829 4359279 4423460 4521412
11077 4521412 4376157 4304997 4359930 4608103 4537335 4580930 4375131 4295904 4555860 4622260
11067 4622260 4669642 4565949 4661027 4677452 4971692 5251420 4799192 4506106 4737520 4526537
11057 4526537 4526390 4671609 4771902 4568786 4512285 4382859 4487015 4833028 4850415 4833699
11047 4833699 4751710 4716858 4736647 5111104 5221464 5040445 4758665 4783056 5071922 5134963
11037 5134963 5380604 5570742 5451670 5279731 5660730 5768456 5766901 5802485 5597857 5578671
11027 5578671 5545210 5778356 5751151 5984717 6181529 6211086 6443395 6521049 6606175 6407914
$$ packed form
11097E110521q1301J04373l0773n9562K1418k02914l8317J30918m9360k49967
11087D655036j33969K03302j17165j12337J08120J45623j22781k66550O4181R7952
11077D521412j45255p1160N4933K48173p0768M3595k05799p9227K59956O6400
11067D622260M7382j03693R5078J6425K94240K79728m52228k93086K31414k10983
11057D526537j47J45219J00293k03116n6501j29426J04156L46013J7387j6716
11047D833699q1989l4852J9789L74457J10360j81019k81780K4391K88866O3041
11037E134963K45641J90138j19072j71939L80999J07726j555L5584k04628j9186
11027E578671l3461K33146k7205K33566J96812K9557K32309P7654Q5126j98261
$$ plain form
11017 6407914 6425682 6288273 6246147 6081156 5669860 5691622 6004698 6090777 5913861 5885530
11007 5885530 6203080 6232278 5776288 5716169 5518206 5441985 5472885 5550884 5562439 5333503
10997 5333503 5307566 5109203 5313278 5470234 5580980 5760858 5590950 5565244 5295379 5009071
10987 5009071 5209948 5395327 5222697 4964297 4739454 4798452 4763634 4824047 4921043 5155473
10977 5155473 5099538 4968491 5082228 4833785 4924454 4870053 4923872 4784736 4734354 4925445
10967 4925445 5459391 5668478 5393634 5196014 5201563 5361870 5349410 5395719 5366687 5173883
10957 5173883 5158039 5185656 5199149 5131000 5303113 5461840 5489426 5442904 5628451 5822319
10947 5822319 5473664 5339435 5411544 5417730 5083456 5142852 5325897 5386347 5441979 5112206
$$ packed form
11017F407914J7768j37409m2126j64991m11296K1762L13076Q6079j76916k8331
11007E885530L17550K9198m55990o0119j97963p6221L0900P7999J1555k28936
10997E333503k5937j98363K04075J56956J10746J79878j69908k5706k69865k86308
10987E009071K00877J85379j72630k58400k24843N8998l4818O0413R6996K34430
10977E155473n5935j31047J13737k48443R0669n4401N3819j39136n0382J91091
10967D925445N33946K09087k74844j97620N549J60307j2460M6309k9032j92804
10957E173883j5844K7617J3493o8149J72113J58727K7586m6522J85547J93868
10947E822319l48655j34229P2109O186l34274N9396J83045O0450N5632l29773
$$ plain form
10937 5112206 5031772 5101885 5107746 5351915 5117677 5377321 5897121 5675399 5580405 5468293
10927 5468293 5304912 5311189 5225488 5255711 5399073 5768119 5843344 5597950 5200582 5129434
10917 5129434 5422448 5593848 5811255 6304565 6198829 5862259 5648966 5689731 5881555 5912944
10907 5912944 5508679 5315148 5375037 5558932 5875280 5941140 6369360 6665875 6414250 6067674
10897 6067674 6094575 5692545 5926564 6071951 6014871 6213161 6412024 6175106 6038154 5957092
10887 5957092 5959713 5895930 5459314 5664170 5828049 5985482 6613076 6853437 6660453 6726324
10877 6726324 6665258 6409566 6624609 6808662 6835461 7214757 7316539 7068967 7025382 6857259
10867 6857259 6829105 6953833 6729512 6757924 6971657 6836281 6845331 7037573 7144970 7047124
$$ packed form
10937E112206q0434P0113N861K44169k34238K59644N19800k21722r4994j12112
10927E468293j63381O277q5701L0223J43362L69046P5225k45394l97368p1148
10917E129434K93014J71400K17407M93310j05736l36570k13293M0765J91824L1389
10907E912944m04265j93531N9889J83895L16348O5860M28220K96515k51625l46576
10897F067674K6901m02030K34019J45387n7080J98290J98863k36918j36952q1062
10887E957092K621o3783m36616K04856J63879J57433O27594K40361j92984O5871
10877F726324o1066k55692K15043J84053K6799L79296J01782k47572m3585j68123
10867F857259k8154J24728k24321K8412K13733j35376R050J92242J07397r7846
$$ plain form
10857 7047124 7048195 7270333 7581226 7757472 7894257 7953766 7852894 7870881 7926254 7968467
10847 7968467 7865925 8083891 8143100 8083907 7968491 8156174 8298804 8541314 8524559 8366170
10837 8366170 8416195 8675349 8880887 9103057 9100706 9184318 9294000 9406637 9762486 9740672
10827 9740672 9934680 10158858 10692161 10991892 10480698 10109750 10176824 10110996 10276147 10780444
10817 10780444 11130733 11421869 11464136 11733892 11944808 11832077 11672984 11916513 12329266
10808 12329266 12640692 12737066 12972372 13194860 13349004 13581543 13840262 13999435 14336327
10799 14336327 14753572 15017507 15321089 15588982 15841790 16003517 16622341 17197700 17723138
10790 17723138 18177512 18766396 19295094 20076265 20875204 21449552 21839526 22034933 22198573
$$ packed form
10857G047124J071K22138L10893J76246J36785N9509j00872J7987N5373M2213
10847G968467j02542K17966N9209n9193j15416J87683J42630K42510j6755j58389
10837H366170N0025K59154K05538K22170k351Q3612J09682J12637L55849k1814
10827I740672J94008K24178N33303K99731n11194l70948O7074o5828J65151N04297
10817A0780444L50289K91136M2267K69756K10916j12731j59093K43529M12753
10808A2329266L11426R6374K35306K22488J54144K32539K58719J59173L36892
10799A4336327M17245K63935L03582K67893K52808J61727O18824N75359N25438
10790A7723138M54374N88884N28698P81171P98939N74348L89974J95407J63640
$$ plain form
10781 22198573 22941245 23731951 24636596 25489886 26291233 27395667 28932763 30006411 30988152
10772 30988152 32319905 33971495 35407751 37028154 38963028 40862966 42892423 45131499
10764 45131499 47864700 50819192 54119338 57733520 61428406 65751687 70695219 76372060
10756 76372060 82473113 89216876 96338455 104236851 113026206 122911482 133653598 145582227
10748 145582227 158692413 172644395 187418795 202799580 218078143 233567934 248657585
10741 248657585 262804752 275252674 285706487 294120795 300151035 303251007 304727541
10734 304727541 304625417 302791453 299790159 296189898 292302435 288452620 284876386 281240900
10726 281240900 278102748 275152753 272859558 270415990 268077256 265744290 262891929 260087254
$$ packed form
10781B2198573P42672P90706R04645Q53290Q01347J104434J537096J073648R81741
10772C0988152J331753J651590J436256J620403J934874J899938K029457K239076
10764D5131499K733201K954492L300146L614182L694886M323281M943532N676841
10756G6372060O101053O743763P121579P898396Q789355R885276J0742116J1928629
10748A45582227J3110186J3951982J4774400J5380785J5278563J5489791J5089651
10741B48657585J4147167J2447922J0453813Q414308O030240L099972J476534
10734C04727541j02124j833964l001294l600261l887463l849815l576234l635486
10726B81240900l138152k949995k293195k443568k338734k332966k852361k804675
$$ plain form
10718 260087254 256744554 252874831 248855795 244566770 240360702 235610853 230067792 224428879
10710 224428879 218331471 212512742 206535286 199646530 192881604 186129390 179228767 172063456
10702 172063456 164405383 156763254 149502796 141940564 134428035 127269179 120551780 114086016
10694 114086016 107967362 102254550 96208632 90672370 85865553 80928447 76468071 72118154
10686 72118154 67865236 64033058 60594462 57618224 54910661 52061264 49313965 46938950
10678 46938950 44295251 42009057 39923982 38274232 36939419 35427348 33374405 31836065
10670 31836065 30799875 29543089 28784808 27694089 26664122 25704891 25243612 24362564 23589360
10661 23589360 22712215 22146813 21753053 21450061 20715427 19597451 18883340 18757283 18450576
$$ packed form
10718B60087254l342700l869723m019036m289025m206068m749849n543061n638913
10710B24428879o097408n818729n977456o888756o764926o752214o900623p165311
10702A72063456p658073p642129p260458p562232p512529p158856o717399o465764
10694A14086016o118654n712812o045918n536262m806817m937106m460376m349917
10686G2118154m252918l832178l438596k976238k707563k849397k747299k375015
10678D6938950k643699k286194k085075j649750j334813j512071k052943j538340
10670C1836065j036190j256786p58281j090719j029967r59231m61279q81048p73204
10661B3589360q77145n65402l93760l02992p34634j117976p14111j26057l06707
$$ plain form
10652 18450576 18009741 17902625 17696242 17606439 17491609 17227876 17074816 16923440 16777175
10643 16777175 16699287 16430536 16282076 16446532 16558068 16901220 16938904 17399068 17992595 18109888
10633 18109888 18847143 19480592 20302387 21185849 21867573 22825920 23760390 25216767 27146267
10624 27146267 29587124 32915935 36804083 41588001 48139818 56017295 65771565 77126860
10616 77126860 89600485 103435805 116568096 127010068 133668816 136416863 136967350 138075665
10608 138075665 141966827 150307984 163542525 182213151 204429407 227724226 249173024
10601 249173024 265047413 271426186 267064380 256214736 245509399 240896154 245008020
10594 245008020 258172762 278621508 303960447 330349649 352440445 363597366 359110402
$$ packed form
10652A8450576m40835j07116k06383q9803j14830k63733j53060j51376j46265
10643A6777175p7888k68751j48460J64456J11536L43152L7684M60164N93527J17293
10633A8109888P37255O33449Q21795Q83462O81724R58347R34470J456377J929500
10624B7146267K440857L328811L888148M783918O551817P877477R754270J1355295
10616G7126860J2473625J3835320J3132291J0441972O658748K748047N50487J108315
10608A38075665L891162Q341157J3234541J8670626K2216256K3294819K1448798
10601B49173024J5874389O378773m361806j0849644j0705337m613245M111866
10594B45008020J3164742K0448746K5338939K6389202K2090796J1156921m486964
$$ plain form
10587 359110402 339099224 309192507 280171786 259324048 248483508 246412626 251497968
10580 251497968 260774886 270766119 277814387 277585340 266452619 245031087 218661760 194231637
10572 194231637 175914176 163757431 156966687 153829695 153100242 152889638 151086603 145992894
10564 145992894 136698621 123695372 109150661 95386580 83737432 74043472 66432252
10557 66432252 60868767 56288007 52309180 49004475 46316346 44007061 41853828 39859492
10549 39859492 38009484 36282555 34995896 33502372 32237553 30676127 28966648 27656387
10541 27656387 25938101 24548257 23418381 22851524 22319914 21748856 20754549 19653342 18523579
10532 18523579 17524374 16498018 15743834 15073501 14486161 13768034 13201842 12387716 11692179
$$ packed form
10587C59110402k0011178k9906717k9020721k0847738j0840540k070882N085342
10580B51497968R276918R991233P048268k29047j1132721k1421532k6369327k4430123
10572A94231637j8317461j2156745o790744l136992p29453k10604j803035n093709
10564A45992894r294273j3003249j4544711j3764081j1649148r693960p611220
10557F6432252n563485m580760l978827l304705k688129k309285k153233j994336
10549C9859492j850008j726929j286659j493524j264819j561426j709479j310261
10541B7656387j718286j389844j129876n66857n31610n71058r94307j101207j129763
10532A8523579r99205j026356p54184o70333n87340p18127n66192q14126o95537
$$ plain form
10523 11692179 10909992 10328887 10086277 9741442 9379246 9189164 8950919 8457676 8338597
10514 8338597 8032480 7766660 7344168 6624970 6252247 5996837 5896197 6043916 6041296 5713329
10504 5713329 5191206 4987703 4638058 4387275 4442307 4432477 4176729 3990443 3876635 3544752
10494 3544752 3637331 3453848 3113261 3170035 3509406 3395895 3260148 2973615 2900233 2939519
10484 2939519 2644068 2631272 2970906 3242747 3339596 3248136 3143985 3043339 3030874 2958484
10474 2958484 2860155 2928324 3165812 3147133 2706243 2811788 2795578 2601311 2318748 2192848
10464 2192848 2196408 2362704 2576183 2583097 2444934 2463501 2437715 2519267 2287625 1955445 1821791
10453 1821791 1864124 2099104 2285808 2313258 2564946 2436663 1770074 1374222 1315169 1821089
$$ packed form
10523A1692179p82187n81105k42610l44835l62196j90082k38245m93243j19079
10514H338597l06117k65820m22492p19198l72723k55410j00640J47719k620l27967
10504E713329n22123k03503l49645k50783N5032r830k55748j86286j13808l31883
10494C544752R2579j83483l40587N6774L39371j13511j35747k86533p3382L9286
10484B939519k95451j2796L39634K71841R6849r1460j04151j00646j2465p2390
10474B958484r8329O8169K37488j8679m40890J05545j6210j94267k82563j25900
10464B192848L560J66296K13479O914j38163J8567k5786Q1552k31642l32180j33654
10453A821791M2333K34980J86704K7450K51688j28283o66589l95852n9053N05920
$$ plain form
10443 1821089 1940759 1405851 1413681 1637930 1929414 1965889 1816168 1904943 1878782 2056783
10433 2056783 2144801 1586394 1325413 1160788 1177232 1038904 906709 919992 1043378 1304531
10423 1304531 1539456 1258616 1427066 1827270 1800453 1710419 1564181 1289972 1212076 1273192
10413 1273192 1322151 1377846 1247920 1051405 1203237 1617201 1814311 1759831 1589818 1784437
10403 1784437 2113619 2296093 2270764 2206136 1873445 1782701 1725187 1833182 2173633 2143374
10393 2143374 1969608 1358330 1113176 1254010 1537828 1852687 1695578 1447538 1103603
10384 1103603 1310030 1474856 1314890 1067705 1128705 1337406 1457851 1404476 1289126 855335
10374 855335 868207 998551 1103319 1172216 1285747 1855732 2061934 1469454 991371 827679
$$ packed form
10443A821089J19670n34908P830K24249K91484L6475j49721Q8775k6161J78001
10433B056783Q8018n58407k60981j64625J6444j38328j32195J3283J23386K61153
10423A304531K34925k80840J68450M00204k6817r0034j46238k74209p7896O1116
10413A273192M8959N5695j29926j96515J51832M13964J97110n4480j70013J94619
10403A784437L29182J82474k5329o4628l32691r0744n7514J07995L40451l0259
10393B143374j73766o11278k45154J40834K83818L14859j57109k48040l43935
10384A103603K06427J64826j59966k47185O1000K08701J20445n3375j15350m33791
10374H55335J2872J30344J04768O8897J13531N69985K06202n92480m78083j63692
$$ plain form
10364 827679 1072561 1342711 1443022 816914 788986 1147582 1552030 1515255 1407807 1574260
10354 1574260 1638859 1591233 1447122 1229148 1180434 1103454 1208159 1399902 1287752 1192442
10344 1192442 1317400 1589461 1453125 1511842 1426097 1374669 1129803 1083684 1163495 1453385
10334 1453385 1591155 1685085 1503190 1184481 1258779 1314297 1066110 937255 930576 1062074
10324 1062074 1238024 1319125 1321879 1746342 1766904 1432894 1172466 1055995 1155138 1268011
10314 1268011 1435269 1396404 1160551 1200276 1714250 1850191 1566325 1846557 2176660 2446766
10304 2446766 2297838 1998210 1883043 1754687 1661140 1845752 2119917 2147279 1843501 1875833
10294 1875833 2358479 2479490 2374618 2399967 2238442 2129861 2118101 2153972 2243893 2165885
$$ packed form
10364H27679K44882K70150J00311o26108k7928L58596M04448l6775j07448J66453
10354A574260O4599m7626j44111k17974m8714p6980J04705J91743j12150r5310
10344A192442J24958K72061j36336N8717q5745n1428k44866m6119P9811K89890
10334A453385J37770R3930j81895l18709P4298N5518k48187j28855o679J31498
10324A062074J75950Q1101K754M24463K0562l34010k60428j16471R9143J12873
10314A268011J67258l8865k35853L9725N13974J35941k83866K80232L30103K70106
10304B446766j48928k99628j15167j28356r3547J84612K74165K7362l03778L2332
10294A875833M82646J21011j04872K5349j61525j08581j1760L5871Q9921p8008
$$ plain form
10284 2165885 2283381 2295521 2285144 2380163 2533166 2545951 2540462 2577570 2811324 2894382 2808496
10273 2808496 2780241 2958757 3004801 2997065 2844142 3057148 2778976 2473957 2531309 2357980
10263 2357980 2511121 2632657 2489050 2472573 2308830 2211040 2197991 1750908 1391269 980595
10253 980595 845126 1234887 1268884 831468 707124 1013894 1190677 1080272 976619 809250
10243 809250 945791 838639 781330 940242 1025337 1204418 976940 855366 1038583 859762
10233 859762 616729 567560 653856 662420 520731 542299 894629 918558 871546 656559 352086
10222 352086 426881 425514 173017 259757 598453 905389 975672 1073388 931719 856143 773281
10211 773281 837010 929630 842732 514377 188218 348718 501758 673956 514070 508099
$$ packed form
10284B165885J17496J2140j0377R5019J53003J2785n489L7108K33754Q3058q5886
10273B808496k8255J78516M6044p736j52923K13006k78172l05019N7352j73329
10263B357980J53141J21536j43607j6477j63743r7790j3049m47083l59639m10674
10253I80595j35469L89761L3997m37416j24344L06770J76783j10405j03653j67369
10243H09250J36541j07152n7309J58912Q5095J79081k27478j21574J83217j78821
10233H59762k43033m9169Q6296Q564j41689K1568L52330K3929m7012k14987l04473
10222C52086P4795j367k52497Q6740L38696L06936P0283R7716j41669p5576q2862
10211G73281O3729R2620q6898l28355l26159J60500J53040J72198j59886n971
$$ plain form
10201 508099 641949 1087479 995573 945624 837779 548187 488187 499254 281890 291505 153731
10190 153731 242631 237950 468843 821891 533644 415734 746132 680751 528827 589876
10180 589876 689898 893512 635216 444012 972409 1395237 1811128 1646684 1544209 1712100
10170 1712100 1855367 1922879 1783073 1765877 1915735 2214962 2314172 2028224 1615853 1617058
10160 1617058 1517473 1622370 1877835 1804242 1893345 1981506 2271006 2796872 3000688 2498294
10150 2498294 2368898 2263536 2444126 2264236 2274940 2349670 2059778 1718539 1721818 1612709
10140 1612709 1641285 1241111 1067496 1166941 1293772 1232169 1556707 1695482 1557845 1401440
10130 1401440 1259702 1085340 1009165 1084486 1032785 703508 304950 389620 674089 909504
$$ packed form
10201E08099J33850M45530r1906m9949j07845k89592o0000J1067k17364R615j37774
10190A53731Q8900m681K30893L53048k88247j17910L30398o5381j51924O1049
10180E89876J00022K03614k58296j91204N28397M22828M15891j64444j02475J67891
10170A712100J43267O7512j39806j7196J49858K99227R9210k85948m12371J205
10160A617058r9585J04897K55465p3593Q9103Q8161K89500N25866K03816n02394
10150B498294j29396j05362J80590j79890J0704P4730k89892l41239L279j09109
10140A612709K8576m00174j73615R9445J26831o1603L24538J38775j37637j56405
10130A401440j41738j74362p6175P5321n1701l29277l98558Q4670K84469K35415
$$ plain form
10120 909504 1030607 1055053 1075429 860339 537156 455447 623688 782312 934894 823570
10110 823570 863291 684431 506823 417196 246752 349762 621351 531454 532342 658340 374399
10099 374399 127946 374262 488406 419284 273634 409212 313090 488944 487116 343023
10089 343023 520071 511436 741440 844659 838103 748443 902778 928268 827867 648228 486293
10078 486293 649858 681992 590971 482168 97543 -77462 6884 445384 686853 565612
10068 565612 249736 208273 182645 427138 490333 442813 254319 104295 -204905 111350
10058 111350 341252 434631 -18479 -225014 -115908 301233 432840 287722 694999 1184768
10048 1184768 927931 706540 374537 271165 234886 395930 506586 593057 557969 275493
$$ packed form
10120I09504J21103K4446K0376k15090l23183q1709J68241J58624J52582j11324
10110H23570L9721j78860j77608q9627j70444J03010K71589q9897Q88J25998k83941
10099C74399k46453K46316J14144o9122j45650J35578r6122J75854j828j44093
10089C43023J77048q635K30004J03219o556q9660J54335K5490j00401j79639j61935
10078D86293J63565L2134r1021j08803l84625j75005Q4346M38500K41469j21241
10068E65612l15876m1463k5628K44493O3195m7520j88494j50024l09200L16255
10058A11350K29902R3379m53110k06535J09106M17141J31607j45118M07277M89769
10048A184768k56837k21391l32003j03372l6279J61044J10656Q6471l5088k82476
$$ plain form
10038 275493 258461 196119 53726 145013 568483 676562 531933 629747 828181 753645
10028 753645 480830 221660 382130 533939 539253 300463 438784 761957 637579 282759
10018 282759 185471 2478 -112122 3771 -80126 57314 -193926 9146 -28121 180050
10008 180050 435789 725506 776163 770300 987318 1207251 1074709 698808 288696 -42814
9998 -42814 -336039 27147 164191 80927 198617 -287961 -429397 41379 511274 752432
9988 752432 623903 438353 345972 30394 -129475 -206766 151924 205853 318671 124076
9978 124076 129081 235823 69333 -76908 -8799 267437 538315 535567 240355 89050 -72141
9967 -72141 -324593 31198 436195 469844 693703 738574 910939 1122419 1108642 864443
$$ packed form
10038B75493j7032o2342j42393R1287M23470J08079j44629R7814J98434p4536
10028G53645k72815k59170J60470J51809N314k38790J38321L23173j24378l54820
10018B82759r7288j82993j14600J15893q3897J37440k51240K03072l7267K08171
10008A80050K55739K89717N0657n863K17018K19933j32542l75901m10112l31510
9998d2814k93225L63186J37044q3264J17690m86578j41436M70776M69895K41158
9988G52432j28529j85550r2381l15578j59869p7291L58690N3929J12818j94595
9978A24076N005J06742j66490j46241O8109K76236K70878k748k95212j51305j61191
9967g2141k52452L55791M04997L3649K23859M4871J72365K11480j3777k44199
$$ plain form
9957 864443 753283 902384 932770 515291 290721 147849 232399 247586 710532 553471
9947 553471 804540 910693 628136 318670 287019 694033 970920 992615 1137209 1083354
9937 1083354 829759 746903 425778 481993 658277 704923 647408 502961 665331 978608
9927 978608 776672 837160 781962 1129261 1670318 1850287 2284145 2941592 3619308 4771804
9917 4771804 6290315 7439848 8227246 8122533 6796832 4846506 3206586 2538568 2246422
9908 2246422 1777132 1463795 1414025 1206518 792610 695442 752919 765437 990573 744130
9898 744130 780902 803140 960567 684002 323115 450793 489080 433911 412287 254613 188704
9887 188704 348049 485744 442301 273738 308776 340136 352145 467562 410334 477342 501012
$$ packed form
9957H64443j11160J49101L0386m17479k24570j42872Q4550J5187M62946j57061
9947E53471K51069J06153k82557l09466l1651M07014K76887K1695J44594n3855
9937A083354k53595q2856l21125N6215J76284M6646n7515j44447J62370L13277
9927I78608k01936O0488n5198L47299N41057J79969M33858O57447O77716J152496
9917D771804J518511J149533P87398j04713j325701j950326j639920o68018k92146
9908B246422m69290l13337m9770k07507m13908r7168N7477J2518K25136k46443
9898G44130L6772K2238J57427k76565l60887J27678L8287n5169k1624j57674o5909
9887A88704J59345J37695m3443j68563L5038L1360J2009J15417n7228O7008K3670
$$ plain form
9876 501012 423413 408653 537600 713733 530950 141406 250623 212113 146933 446512
9866 446512 389047 198592 27035 -190364 -116195 18513 64777 70108 190740 195602 237275
9855 237275 290693 420758 371712 31450 -201052 -60363 363320 521167 598701 543492
9845 543492 291702 99916 112614 38617 299442 400172 29201 -124455 -168999 -46787
9835 -46787 38647 33472 217551 239638 144749 22152 99004 347765 403357 24061 -249069
9824 -249069 -486231 -695999 -633061 -438091 -181632 -50872 309987 586975 858079 590266
9814 590266 407562 368426 587317 493076 471275 474758 495457 360553 442375 271986 -102227
9803 -102227 -202330 214877 251019 315591 35665 -97145 3361 167027 168973 -44910
$$ packed form
9876E01012p7599j4760J28947J76133j82783l89544J09217l8510o5180K99579
9866D46512n7465j90455j71557k17399P4169J34708M6264N331J20632M862M1673
9855B37275N3418J30065m9046l40262k32502J40689M23683J57847P7534n5209
9845E43492k51790j91786J2698p3997K60825J00730l70971j53656m4544J22212
9835d6787Q5434n175J84079K2087r4889j22597P6852K48761N5592l79296k73130
9824b49069k37162k09768O2938J94970K56459J30760L60859K76988K71104k67813
9814E90266j82704l9136K18891r4241k1801L483K0699j34904Q1822j70389l74213
9803a02227j00103M17207L6142O4572k79926j32810J00506J63666J946k13883
$$ plain form
9793 -44910 -126868 17583 160207 176880 189057 -6351 283512 505940 571543 651182 610060
9782 610060 480821 318104 163350 279202 366385 386258 155014 180066 -244092 -201682
9772 -201682 114171 -97001 -259011 -471044 -399219 -232796 -81156 274009 406921 599361
9762 599361 646007 511209 311489 135621 30523 277216 339343 297306 257356 162388 203662
9751 203662 306372 313342 124244 76636 222615 319476 146728 149377 306189 229818 363529
9740 363529 223828 70421 299893 277261 -4214 291492 136104 216211 455581 523790
9730 523790 100169 -56886 205859 168460 113438 343838 362576 331823 -198024 -444700
9720 -444700 111138 593344 494477 318426 65116 151842 396062 244952 145849 15632
$$ packed form
9793d4910q1958J44451J42624J6673J2177j95408K89863K22428O5603P9639m1122
9782F10060j29239j62717j54754J15852Q7183J9873k31244K5052m24158M2410
9772b01682L15853k11172j62010k12033P1825J66423J51640L55165J32912J92440
9762E99361M6646j34798j99720j75868j05098K46693O2127m2037l9950r4968M1274
9751B03662J02710O970j89098m7608J45979R6861j72748K649J56812p6371J33711
9740C63529j39701j53407K29472k2632k81475K95706j55388Q0107K39370O8209
9730E23790m23621j57055K62745l7399n5022K30400J8738l0753n29847k46676
9720d44700N55838M82206r8867j76051k53310Q6726K44220j51110r9103j30217
$$ plain form
9710 15632 -114198 -149085 79636 161163 287924 39010 -266779 -237446 167118 242817 264167
9699 264167 311594 437272 775795 868535 574499 282462 187198 180556 187964 101011 -355261
9688 -355261 -433287 -216010 -89358 69423 225777 349443 357159 244495 376254 182086
9678 182086 -134714 -238161 -325091 16805 122527 299374 294625 484415 332329 141677
9668 141677 -35745 65208 -107747 77942 -94596 -61816 6357 23368 202730 197552 328580
9657 328580 580240 549689 701183 696513 885219 983120 973463 902150 794779 754535 855856
9646 855856 774247 600952 853186 1114297 926604 820317 397229 215264 137739 422173
9636 422173 431603 124654 -32929 243788 380317 622539 555252 566644 576245 715136 700155
$$ packed form
9710A5632j29830l4887K28721Q1527J26761k48914l05789K9333M04564P5699K1350
9699B64167M7427J25678L38523R2740k94036k92037r5264o642P408q6953m56272
9688c55261p8026K17277J26652J58781J56354J23666P716j12664J31759j94168
9678A82086l16800j03447q6930L41896J05722J76847m749J89790j52086j90652
9668A41677j77422J00953j72955J85689j72538L2780O8173J7011J79362n178J31028
9657C28580K51660l0551J51494m670J88706R7901r657p1313j07371m0244J01321
9646H55856q1609j73295K52234K61111j87693j06287m23088j81965p7525K84434
9636D22173R430l06949j57583K76717J36529K42222o7287J1392R601J38891j4981
$$ plain form
9625 700155 468033 320276 489451 534789 319319 78482 -204447 -238026 -176860 -365730
9615 -365730 -429719 -304579 -127105 139595 250086 23158 -226489 249698 341311 -27309
9605 -27309 4024 -74611 -120703 -456136 -458770 -286964 -522736 -467520 -287057 -304607 -422562
9594 -422562 -475274 -382006 -171485 -94848 139120 148177 199787 189753 -112034 3481 172459
9583 172459 296223 314309 75437 278649 308648 328432 158020 149100 320948 301508 137930
9572 137930 -39142 -105400 127772 -26524 -172524 -98919 -17849 -85442 -24269 -223719 -265665
9561 -265665 -264251 -158196 -568221 -926992 -882856 -640963 -588328 -351924 -114028 21954
9551 21954 160388 167865 124424 40185 154367 -26038 -140787 93259 173174 316460 420835
$$ packed form
9625G00155k32122j47757J69175M5338k15470k40837k82929l3579O1166j88870
9615c65730o3989J25140J77474K66700J10491k26928k49647M76187R1613l68620
9605b7309L1333p8635m6092l35433k634J71806k35772N5216J80463j7550j17955
9594d22562n2712R3268K10521P6637K33968R057N1610j0034l01787J15515J68978
9583A72459J23764J8086k38872K03212K9999J9784j70412q920J71848j9440j63578
9572A37930j77072o6258K33172j54296j46000P3605Q1070o7593O1173j99450m1946
9561b65665J414J06055m10025l58771M4136K41893N2635K36404K37896J35982
9551B1954J38434P477m3441q4239J14182j80405j14749K34046P9915J43286J04375
$$ plain form
9540 420835 423521 545373 319603 249954 -12584 -161091 91542 608880 424642 130668
9530 130668 -287347 -369032 -59798 -249015 -118213 168358 239603 -70557 -90576 344570
9520 344570 434938 267334 175482 76681 -145514 -322680 -366740 -113295 -81920 -51547 101969
9509 101969 421158 446450 379539 216395 -79837 -42518 187459 454936 323702 227148
9499 227148 83422 -108848 -112918 160918 36668 -173828 -115060 60369 74201 -91128
9489 -91128 242331 775894 709063 386803 157885 58123 372672 295081 322498 633422 415180
9478 415180 278750 123323 390208 635435 887212 778033 511852 368716 364892 227948
9468 227948 124505 22890 -124829 -18241 -94026 -253950 216224 524038 543748 287140
$$ packed form
9540D20835K686J21852k25770o9649k62538j48507K52633N17338j84238k93974
9530A30668m18015q1685L09234j89217J30802K86571P1245l10160k0019M35146
9520C44570R0368j67604r1852r8801k22195j77166m4060K53445L1375L0373J53516
9509A01969L19189K5292o6911j63144k96232L7319K29977K67477j31234r6554
9499B27148j43726j92270m070K73836j24250k10496N8768J75429J3832j65329
9489i1128L33459N33563o6831l22260k28918r9762L14549p7591K7417L10924k18242
9478D15180j36430j55427K66885K45227K51777j09179k66181j43136l824j36944
9468B27948j03443j01615j47719J06588p5785j59924M70174L07814J9710k56608
$$ plain form
9458 287140 -421605 -610158 -533622 -178526 129046 252910 268319 254748 247790 249640 91829
9447 91829 -29562 147468 195828 -86074 -120735 136803 11547 -235418 -211575 -287573 -250279
9436 -250279 -79305 52652 38432 144750 110322 183521 460818 440753 85977 -80977
9426 -80977 365000 518530 357670 450416 581373 324243 319800 311306 58469 123514 -19668
9415 -19668 195412 18830 84272 449488 422713 58849 79375 171778 -159718 -103080 14469
9404 14469 104579 309912 261587 153696 -20681 -151211 471449 294970 -92722 277290
9394 277290 567288 597119 599338 664574 694052 242820 197735 333752 -48213 -226407 -343913
9383 -343913 -166381 -207756 -244059 -481672 -622651 -197012 48721 -208886 -174407 -196624
$$ packed form
9458B87140p08745j88553P6536L55096L07572J23864J5409j3571o958J850j57811
9447I1829j21391J77030M8360k81902l4661K57538j25256k46965K3843p5998L7294
9436b50279J70974J31957j4220J06318l4428P3199K77297k0065l54776j66954
9426h0977M45977J53530j60860R2746J30957k57130m443q494k52837O5045j43182
9415a9668K15080j76582O5442L65216k6775l63864K0526R2403l31496N6638J17549
9404A4469R0110K05333m8325j07891j74377j30530O22660j76479l87692L70012
9394B77290K89998K9831K219O5236K9478m51232m5085J36017l81965j78194j17506
9383c43913J77532m1375l6303k37613j40979M25639K45733k57607L4479k2217
$$ plain form
9373 -196624 -335489 -312491 -133122 -200707 -71399 -78562 -69296 69500 167350 165582 61123
9362 61123 98047 -14039 -215204 -250735 -254926 -266619 22709 415943 450895 298136 59360
9351 59360 183314 387978 286882 420799 650101 645390 563516 360509 25601 23482 170610
9340 170610 22840 -41918 -229780 -89350 208089 52755 49155 -67291 -141217 -170236 -365076
9329 -365076 -492605 -388230 -482215 -404464 -132296 482447 472153 320845 210458 127855
9319 127855 -19625 177273 563365 449389 110068 -123816 -179112 -167962 -409349 -681560
9309 -681560 -575520 -99617 350625 250637 122046 77593 90821 255506 328427 448545
9299 448545 299097 88797 -47225 -119002 -272841 -116596 -32474 -11146 127227 495914
$$ packed form
9373a96624j38865K2998J79369o7585J29308p163R266J38796R7850j768j04459
9362F1123L6924j12086k01165l5531m191j1693K89328L93234L4952j52759k38776
9351E9360J23954K04664j01096J33917K29302m711q1874k03007l34908k119J47128
9340A70610j47770o4758j87862J40430K97439j55334l600j16446p3926k9019j94840
9329c65076j27529J04375r3985P7751K72168O14743j0294j51308j10387q2603
9319A27855j47480J96898L86092j13976l39321k33884n5296J1150k41387k72211
9309f81560J06040M75903M50242r9988j28591m4453J3228J64685P2921J20118
9299D48545j49448k10300j36022p1777j53839J56245Q4122K1328J38373L68687
$$ plain form
9289 495914 681377 397560 79655 144062 628602 819639 653788 467016 368602 167227
9279 167227 78203 281460 438858 519904 326743 5522 90053 172527 326419 113670
9269 113670 -135630 -111661 -15277 44041 254334 199714 -216823 -363058 -446960 -279989 -381858
9258 -381858 -346076 -12268 535486 452636 -62209 159308 470894 211225 78154 -140855
9248 -140855 -155150 -29317 64750 30783 -108369 -248942 -441683 -514686 -127018 484167
9238 484167 628562 554480 56404 -482742 -476706 -235439 -141599 22260 132230 26006
9228 26006 203820 406803 343437 310688 288783 330431 206099 279214 243045 399230 270609
9217 270609 97674 106469 221835 384431 521787 338613 500804 539230 439047 330252
$$ packed form
9289D95914J85463k83817l17905O4407M84540J91037j65851j86772r8414k01375
9279A67227q9024K03257J57398Q1046j93161l21221Q4531Q2474J53892k12749
9269A13670k49300K3969R6384N9318K10293n4620m16537j46235q3902J66971j01869
9258c81858L5782L33808N47754q2850n14845K21517L11586k59669j33071k19009
9248a40855j4295J25833R4067l3967j39152j40573j92741p3003L87668O11185
9238D84167J44395p4082m98076n39146O036K41267R3840J63859J09970j06224
9228B6006J77814K02983o3366l2749k1905M1648j24332P3115l6169J56185j28621
9217B70609j72935Q795J15366J62596J37356j83174J62191L8426j00183j08795
$$ plain form
9207 330252 434044 335740 324826 103698 50519 -134385 -238107 -225693 43136 102813 -82587
9196 -82587 -117924 -90862 139817 155293 -218366 -412941 -237561 33862 358658 196286
9186 196286 -56413 38378 299542 140624 102720 34085 40768 132439 -6393 -130703 -307148
9175 -307148 8543 53528 140458 -200288 -445031 -266698 -91263 63074 289162 241018
9165 241018 -153622 -406114 -488758 113530 219129 324886 173990 38241 93336 187903
9155 187903 303671 16764 -38950 121061 361030 263401 339161 483613 595213 736678
9145 736678 802805 647935 470752 219816 109868 62040 78988 300429 249878 298039 -23226
9134 -23226 -155202 -71065 -110695 -141270 -191593 -100508 254689 8546 219913 237521 185176
$$ packed form
9207C30252J03792r8304j0914k21128n3179j84904j03722J2414K68829N9677j85400
9196h2587l5337K7062K30679J5476l73659j94575J75380K71423L24796j62372
9186A96286k52699R4791K61164j58918l7904o8635O683R1671j38832j24310j76445
9175c07148L15691M4985Q6930l40746k44743J78333J75435J54337K26088m8144
9165B41018l94640k52492q2644O02288J05599J05757j50896j35749N5095R4567
9155A87903J15768k86907n5714J60011K39969r7629P5760J44452J11600J41465
9145G36678O6127j54870j77183k50936j09948m7828J6948K21441n0551M8161l21265
9134b3226j31976Q4137l9630l0575n0323R1085L55197k46143K11367J7608n2345
$$ plain form
9123 185176 146707 83825 -24753 142969 145182 -40778 -17371 -257357 -608758 -344886 -158556
9112 -158556 -137168 -399020 -184538 -38759 -322080 -336433 -189628 123065 87968 -343526
9102 -343526 -218082 -64320 -11413 36655 434818 489696 467015 564335 218473 -55867 -96038
9091 -96038 -392804 -475658 -313487 -89018 253419 342684 348974 562654 327499 29051 -204693
9080 -204693 -228620 -208922 203628 170672 4654 -181860 -319727 -418104 -573691 -663703 -277005
9069 -277005 -172834 -204228 -39367 -39001 121248 293895 550851 454424 422047 319043 315678
9058 315678 347778 86166 -50748 -10373 -114162 -72352 268452 553236 523970 368716
9048 368716 376143 742207 590531 318813 216710 258379 451641 516886 339534 245249 123891
$$ packed form
9123A85176l8469o2882j08578J67722K213j85960K3407k39986l51401K63872J86330
9112a58556K1388k61852K14482J45779k83321j4353J46805L12693l5097m31494
9102c43526J25444J53762N2907M8068L98163N4878k2681R7320l45862k74340m0171
9091i6038k96766q2854J62171K24469L42437Q9265O290K13680k35155k98448k33744
9080b04693k3927J9698M12550l2956j66018j86514j37867r8377j55587r0012L86698
9069b77005J04171l1394J64861L66J60249J72647K56956r6427l2377j03004l365
9058C15678L2100k61612j36914M0375j03789M1810L40804K84784k9266j55254
9048C68716P427L66064j51676k71718j02103M1669J93262O5245j77352r4285j21358
$$ plain form
9037 123891 139793 7311 122233 -13643 -497389 -62768 -138503 54589 7447 -143442
9027 -143442 180724 398498 733551 665349 442238 607254 590753 137117 -102803 -117160
9017 -117160 35797 270465 74016 -299669 -593730 -557201 -505840 -341558 7856 129221
9007 129221 220325 305416 292571 288876 222543 236693 411218 736163 786945 675525 258520
8996 258520 -36561 -53652 31139 53883 -96499 -154541 -51190 123488 -28327 65121 192290
8985 192290 292746 249980 143337 -10108 295207 619757 465580 417530 200954 68257
8975 68257 114967 98968 -57419 -171208 -154769 44794 -157018 -397502 -109606 13761
8965 13761 295209 39737 -293283 -133380 -11551 -68942 -53657 114077 488809 683783
$$ packed form
9037A23891J5902j32482J14922j35876m83746M34621p5735J93092m7142j50889
9027a43442L24166K17774L35053o8202k23111J65016j6501m53636k39920j4357
9017a17160J52957K34668j96449l73685k94061L6529N1361J64282L49414J21365
9007A29221R1104Q5091j2845l695o6333J4150J74525L24945N0782j11420m17005
8996B58520k95081j7091Q4791K2744j50382n8042J03351J74678j51815R3448J27169
8985A92290J00456m2766j06643j53445L05315L24550j54177m8050k16576j32697
8975F8257M6710j5999j56387j13789J6439J99563k01812k40484K87896J23367
8965A3761K81448k55472l33020J59903J21829n7391J5285J67734L74732J94974
$$ plain form
8955 683783 594474 246817 112365 -4232 -173556 208694 287765 -79181 -309907 -401995
8945 -401995 -398212 29072 -310481 -117927 156577 329182 184878 44539 255600 400916
8935 400916 243871 233716 38476 171668 427211 479909 12993 -92312 170370 158444
8925 158444 246767 231203 472247 306011 108069 73225 -180558 -93793 59363 301198
8915 301198 672127 582416 375003 335687 341717 312024 223744 -160499 -286282 19053 372076
8904 372076 100669 132474 116565 114174 83622 -4007 800 321191 628397 200471 -34282
8893 -34282 151878 350201 161243 -120867 -227081 107095 336342 375249 545205 537562
8883 537562 360480 219139 -29071 -76289 -186063 -135682 -61317 -148303 -352561 -462334
$$ packed form
8955F83783q9309l47657j34452j16597j69324L82250P9071l66946k30726r2088
8945d01995L783M27284l39553J92554K74504J72605j44304j40339K11061J45316
8935D00916j57045j0155j95240J33192K55543N2698m66916j05305K62682j1926
8925A58444Q8323j5564K41044j66236j97942l4844k53783Q6765J53156K41835
8915C01198L70929q9711k07413l9316O030k9693q8280l84243j25783L05335L53023
8904C72076k71407L1805j5909k391l0552q7629M807L20391L07206m27926k34753
8893c4282J86160J98323j88958k82110j06214L34176K29247L8907J69956p643
8883E37562j77082j41341k48210m7218j09774N0381P4365q6986k04258j09773
$$ plain form
8873 -462334 -223514 -102359 -112105 -301400 -238550 -36698 17570 -46599 2389 -137783 -14429
8862 -14429 173235 361281 -17618 -205175 -101589 216409 348036 643435 463277 105958
8852 105958 154460 179805 161579 153120 -157824 -100772 192120 63710 -161833 -133804 249357
8841 249357 474380 1260 -123472 -131192 -153170 -90740 104371 120637 154298 120464 -224122
8830 -224122 -349708 -266336 -96363 -23428 -89378 2186 87061 -149606 -676582 -553199 -416136
8819 -416136 -273949 31492 78885 119789 -16206 42117 -120229 141480 209720 24026
8809 24026 -162171 -119247 40077 -54260 -30441 195981 204383 -135597 -206670 19200 65895
8798 65895 -430031 -606643 -263857 -154424 47745 107882 55155 225724 -139877 -386283
$$ packed form
8873d62334K38820J21155r746j89295O2850K01852N4268o4169M8988j40172J23354
8862a4429J87664J88046l78899j87557J03586L17998J31627K95399j80158l57319
8852A05958M8502K5345j8226q459l10944N7052K92892j28410k25543K8029L83161
8841B49357K25023m73120j24732p720k1978O2430J95111J6266L3661l3834l44586
8830b24122j25586Q3372J69973P2935o5950R1564Q4875k36667n26976J23383J37063
8819d16136J42187L05441M7393M0904j35995N8323j62346K61709O8240j85694
8809B4026j86197M2924J59324r4337K3819K26422Q402l39980p1073K25870M6695
8798F5895m95926j76612L42786J09433K02169O0137n2727J70569l65601k46406
$$ plain form
8788 -386283 -313761 -377167 -423219 -362399 -307131 -332539 -514346 -341300 -403355 -605499 -767305
8777 -767305 -665772 -419761 -161404 -126851 -189114 -225843 -145751 191117 606339 491144
8767 491144 358869 350283 386069 282905 71733 -33328 186596 584732 786194 539745
8757 539745 -152402 -161780 -133431 -35054 -130581 55994 272820 324282 -38285 -265550 74259
8746 74259 305710 72123 80073 428133 157065 -358307 -447559 -535981 -334566 -47248 151149
8735 151149 19244 -190663 -397684 -243521 144006 241201 112778 12600 -253788 -371099
8725 -371099 -369187 -347808 -322219 -207169 -28924 42799 -45132 205007 338895 328556 207756
8714 207756 -35089 -279603 -22592 -40271 -339953 -490495 -472196 -409756 -567467 -691345
$$ packed form
8788c86283P2522o3406m6052O0820N5268k5408j81807J73046o2055k02144j61806
8777g67305J01533K46011K58357L4553o2263l6729Q0092L36868M15222j15195
8767D91144j32275q586L5786j03164k11172j05061K19924L98136K01462k46449
8757E39745o92147r378K8349R8377r5527J86575K16826N1462l62567k27265L39809
8746G4259K31451k33587P950L48060k71068n15372q9252q8422K01415K87318J98397
8735A51149j31905k09907k07021J54163L87527R7195j28423j00178k66388j17311
8725c71099J912K1379K5589J15050J78245P1723q7931K50139J33888j0339j20800
8714B07756k42845k44514K57011j7679k99682j50542J8299O2440j57711j23878
$$ plain form
8704 -691345 -650101 -562310 -476413 -243131 -271303 -324280 -3082 310087 361433 247953 -39871
8693 -39871 -362708 -297946 -495841 -381420 -79162 12733 -156669 -405334 -382924 -289402 -294867
8682 -294867 -510769 -585652 -151719 5585 -411205 -340658 -26474 8930 196232 640020
8672 640020 462340 50295 53076 -103375 -229637 66813 289096 762411 841809 694126
8662 694126 296915 250570 198775 271784 338225 483997 478201 299128 300975 -154517 -370115
8651 -370115 -118495 263333 292477 208920 139829 221687 301864 321441 216062 37755 119524
8640 119524 248866 -11501 -127569 263989 472930 449574 156250 -157459 -62600 -4546
8630 -4546 -175636 -291228 -325868 -348423 -116713 142423 376926 343564 446054 210717 227943
$$ packed form
8704f91345M1244Q7791Q5897K33282k8172n2977L21198L13169N1346j13480k87824
8693c9871l22837O4762j97895J14421L02258R1895j69402k48665K2410R3522n465
8682b94867k15902p4883M33933J57304m16790P0547L14184L5404J87302M43788
8672F40020j77680m12045K781j56451j26262K96450K22283M73315P9398j47683
8662F94126l97211m6345n1795P3009O6441J45772n796j79073J847m55492k15598
8651c70115K51620L81828K9144q3557o9091Q1858Q0177J9577j05379j78307Q1769
8640A19524J29342k60367j16068L91558K08941k3356k93324l13709R4859N8054
8630d546j71090j15592l4640k2555K31710K59136K34503l3362J02490k35337J7226
$$ plain form
8619 227943 245959 76566 194283 264708 320490 217981 329404 222752 273990 207055 264899
8608 264899 486294 306819 57828 -268798 -304358 -227116 18895 342816 366474 240053
8598 240053 164449 149069 284267 558537 470513 163118 145019 1798 -182424 -103433 262772
8587 262772 199853 -159562 -199987 63954 24018 -292667 -25266 -114218 176296 164424 -192727
8576 -192727 -162520 78774 219949 248839 255812 128550 78780 -26480 -6311 315813 271118
8565 271118 459437 476357 537588 400971 493862 515747 387747 15510 -154475 128481
8555 128481 736089 831311 804319 508489 283532 -313373 -414843 -246943 -92001 65202
8545 65202 169847 296344 484331 543123 408517 422348 533047 385991 576936 730378
$$ packed form
8619B27943J8016j69393J17717P0425N5782j02509J11423j06652N1238o6935N7844
8608B64899K21395j79475k48991l26626l5560P7242K46011L23921K3658j26421
8598B40053p5604j5380J35198K74270q8024l07395j8099j43221j84222P8991L66205
8587B62772o2919l59415m0425K63941l9936l16685K67401q8952K90514j1872l57151
8576a92727L0207K41294J41175K8890O973j27262m9770j05260K0169L22124m4695
8565B71118J88319J6920O1231j36617R2891K1885j28000l72237j69985K82956
8555A28481O07608R5222k6992k95830k24957n96905j01470J67900J54942J57203
8545F5202J04645J26497J87987N8792j34606J3831J10699j47056J90945J53442
$$ plain form
8535 730378 426072 70833 46346 220834 418001 280445 -242515 -263055 -80116 137247
8525 137247 317042 203601 -79243 -291033 -177130 91926 89542 226361 118126 7558
8515 7558 -28834 174763 252937 192701 175539 80317 204638 416274 360170 323150 414240
8504 414240 375820 187266 158093 -123886 -180920 -203683 -116104 170027 171581 110009 303075
8493 303075 312296 176537 -35450 -30060 -10064 248537 552435 514989 376235 69768 -82353
8482 -82353 251438 149797 3584 174939 254398 288103 231540 -192516 -215796 -242352 -286529
8471 -286529 -323934 -322857 -276482 -326623 -150229 68727 325919 433978 222653 187079 503963
8460 503963 457875 197764 -34639 -80534 -282843 -135366 57863 95996 211941 249554
$$ packed form
8535G30378l04306l55239k4487J74488J97167j37556n22960k0540J82939K17363
8525A37247J79795j13441k82844k11790J13903K69056k384J36819j08235j10568
8515G558l6392K03597P8174o0236j7162r5222J24321K11636n6104l7020R1090
8504D14240l8420j88554k9173k81979n7034k2763Q7579K86131J554o1572J93066
8493C03075R221j35759k11987N390J9996K58601L03898l7446j38754l06467j52121
8482h2353L33791j01641j46213J71355P9459L3705n6563m24056k3280k6556m4177
8471b86529l7405J077M6375n0141J76394K18956K57192J08059k11325l5574L16884
8460E03963m6088k60111k32403m5895k02309J47477J93229L8133J15945L7613
$$ plain form
8450 249554 309068 140470 237752 437333 393513 222443 415919 417379 477642 511992 582718
8439 582718 124008 82060 71395 192855 254351 130223 307695 405310 283689 -3606
8429 -3606 -111866 -141341 -188179 -86964 -142618 -159850 -201810 -314465 17840 -161563 -319536
8418 -319536 -254904 -64311 40940 -32117 259704 203396 16758 -76480 -45014 247426 475548
8407 475548 443243 335396 -90951 102909 200938 109764 -58663 -39923 -160309 -623362
8397 -623362 -657581 -322742 38948 16976 -190550 -176270 -344619 -114817 -27510 291485
8387 291485 190868 -30598 87624 179365 191080 134127 -190335 -286813 -59112 112320
8377 112320 185506 580630 531692 315597 204520 297207 -55510 -403089 -680924 -863294
$$ packed form
8450B49554N9514j68598R7282J99581m3820j71070J93476J460O0263L4350P0726
8439E82718m58710m1948j0665J21460O1496j24128J77472R7615j21621k87295
8429c606j08260k9475m6838J01215n5654j7232m1960j12655L32305j79403j57973
8418c19536O4632J90593J05251p3057K91821n6308j86638r3238L1466K92440K28122
8407D75548l2305j07847m26347J93860R8029r1174j68427J8740j20386m63053
8397f23362l4219L34839L61690k1972k07526J4280j68349K29802Q7307L18995
8387B91485j00617k21466J18222R1741J1715n6953l24462r6478K27701J71432
8377A12320P3186L95124m8938k16095j11077R2687l52717l47579k77835j82370
$$ plain form
8367 -863294 -901392 -446164 75224 464260 290750 21313 104716 -177824 -246033 101966
8357 101966 1551 -264985 -377547 -360103 -253053 -135400 -40433 84654 36069 9610
8347 9610 71728 34489 273498 143227 -183717 -378138 -383426 -67205 398007 508389 267203
8336 267203 300021 243353 -10831 -138382 -233271 -78164 -4940 43058 181195 139097 -24845
8325 -24845 -73008 71792 52649 -96690 -235970 29995 93125 -90874 41895 199929
8315 199929 178875 38008 -461441 -785868 -597414 -408204 -182131 -17631 -62018 -100398
8305 -100398 -168057 -30967 -253223 -251594 -136962 42910 198643 109012 81566 -315576 -300866
8294 -300866 -251402 -523445 -377337 -379033 -138656 -53691 -33223 52927 -241650 -507120 -227800
$$ packed form
8367h63294l8098M55228N21388L89036j73510k69437Q3403k82540o8209L47999
8357A01966j00415k66536j12562J7444J07050J17653R4967J25087m8585k6459
8347I610O2118l7239K39009j30271l26944j94421n288L16221M65212J10382k41186
8336B67203L2818n6668k54184j27551r4889J55107P3224M7998J38137m2098j63942
8325b4845m8163J44800j9143j49339j39280K65965O3130j83999J32769J58034
8315A99929k1054j40867m99449l24427J88454J89210K26073J64500m4387l8380
8305a00398o7659J37090k22256J629J14632J79872J55733q9631k7446l97142J4710
8294c00866M9464k72043J46108j696K40377Q4965K0468Q6150k94577k65470K79320
$$ plain form
8283 -227800 -12314 82149 -35738 -148415 28934 142956 142434 111521 337378 142698 -7254
8272 -7254 -185590 -529345 -760361 -706494 -595980 -321939 -43429 -76350 81405 102295 -269443
8261 -269443 -329495 -187001 -156688 -257008 -132725 -130353 -320443 -270188 -69924 144749 371271
8250 371271 166491 207847 119691 -148996 -265299 -156647 -91999 -145831 -99370 -402007 -728719
8239 -728719 -744660 -417097 -261291 -295988 -235673 81549 27239 -68855 -81811 -273261 -362963
8228 -362963 -348142 -398064 -174128 91786 102349 132991 295265 110829 -116491 -17684 276286
8217 276286 298237 432252 161657 26307 91066 255767 188365 51143 -163433 167448
8207 167448 266131 55247 -80791 -105126 -357196 -692956 -779341 -648320 -255722 311351
$$ packed form
8283b27800K15486R4463j17887j12677J77349J14022n22l0913K25857j94680j49952
8272g254j78336l43755k31016N3867J10514K74041K78510l2921J57755K0890l71738
8261b69443o0052J42494L0313j00320J24283K372j90090N0255K00264K14673K26522
8250C71271k04780M1356q8156k68687j16303J08652O4648n3832M6461l02637l26712
8239g28719j5941L27563J55806l4697O0315L17222n4310r6094j2956j91450q9702
8228c62963J4821m9922K23936K65914J0563L0642J62274j84436k27320R8807K93970
8217B76286K1951J34015k70595j35350O4759J64701o7402j37222k14576L30881
8207A67448R8683k10884j36038k4335k52070l35760q6385J31021L92598N67073
$$ plain form
8197 311351 165044 345025 478283 -51237 -309522 -286140 221174 344222 107408 -201068
8187 -201068 18374 142377 193201 129774 30474 33306 227151 515802 372100 367913 117385
8176 117385 -44659 -17031 -57713 -112867 170677 202355 39610 16529 -131953 -184591 4328
8165 4328 -227678 -496664 -41115 275302 306835 253248 363336 480945 514616 570257 488248
8154 488248 377442 309324 89773 -120951 -187059 93711 137476 14342 -166934 -126279
8144 -126279 127775 99431 79373 53013 356367 405400 123804 136242 88901 111122 -114685
8133 -114685 -346599 -422539 -266554 -164890 -216176 -50846 111495 174314 56805 -130491
8123 -130491 -51155 72073 -49073 -264073 -370813 -571997 -376510 -201976 -19544 7333
$$ packed form
8197C11351j46307J79981J33258n29520k58285K3382N07314J23048k36814l08476
8187b01068K19442J24003N0824o3427r9300K832J93845K88651j43702m187k50528
8176A17385j62044K7628m0682n5154K83544L1678j62745k3081j48482n2638J88919
8165D328k32006k68986M55549L16417L1533n3587J10088J17609L3671N5641q2009
8154D88248j10806o8118k19551k10724o6108K80770M3765j23134j81276M0655
8144a26279K54054k8344k0058k6360L03354M9033k81596J2438m7341K2221k25807
8133a14685k31914p5940J55985J01664n1286J65330J62341O2819j17509j87296
8123a30491P9336J23228j21146k15000j06740k01184J95487J74534J82432K6877
$$ plain form
8113 7333 77080 -214496 -528662 -612129 -351053 -257105 -245951 -162806 -147613 -240284 -251062
8102 -251062 -5095 -4258 -78549 46874 80810 181545 251155 319610 246000 283782 184249
8091 184249 246545 221476 51215 -51200 -78160 -176293 -245022 -265417 -265865 -176694 83843
8080 83843 290051 135706 -250337 -596015 -313590 58445 41621 76293 -250590 -436427
8070 -436427 -262741 -202857 -406926 -338756 -80798 -144033 -300684 -485727 -450006 -332379
8060 -332379 -255114 -154087 -6723 74127 -202302 -163810 -267608 -200264 -194949 -172879 255889
8049 255889 62817 182868 367229 80152 -95794 -87872 -44654 208139 293572 219655 161421
8038 161421 115641 -252598 -263775 -101676 -125150 154695 84209 35224 101749 80114 -200912
$$ packed form
8113G333O9747k91576l14166q3467K61076R3948J1154Q3145J5193r2671j0778
8102b51062K45967Q37p4291J25423L3936J00735O9610O8455p3610L7782r9533
8091A84249O2296k5069j70261j02415k6960r8133o8729k0395m48Q9171K60537
8080H3843K06208j54345l86043l45678K82425L72035j6824L4672l26883j85837
8070d36427J73686N9884k04069O8170K57958o3235j56651j85043L5721J17627
8060c32379P7265J01027J47364Q0850k76429L8492j03798O7344N315K2070M28768
8049B55889j93072J20051J84361k87077j75946P922M3218K52793Q5433p3917n8234
8038A61421m5780l68239j1177J62099k3474K79845p0486m8985O6525k1635k81026
$$ plain form
8027 -200912 -60306 -283827 -533403 -221932 12580 275653 129868 66766 41335 31030
8017 31030 -131354 -208096 60645 482466 429887 26821 -408411 -157826 85140 200041
8007 200041 249313 277636 196066 -209572 -274123 -205331 -18230 73011 247966 434268 603057
7996 603057 322003 194990 13854 -301671 -357684 -161107 6588 69902 94275 75873
7986 75873 203006 22111 -54497 208211 255634 132342 57794 -132241 -285584 -142262
7976 -142262 191015 343179 342579 154632 26236 -185910 -285352 -284077 -164853 60743 241489
7965 241489 96304 223141 431663 390702 181145 213171 340890 218020 134189 -73808
7955 -73808 66979 107340 22869 142903 141471 26634 66583 -297764 -255722 -386631 -384468
$$ packed form
8027b00912J40606k23521k49576L11471K34512K63073j45785o3102k5431j0305
8017C1030j62384p6742K68741M21821n2579m03066m35232K50585K42966J14901
8007B00041M9272K8323q1570m05638o4551O8792J87101R1241J74955J86302J68789
7996F03057k81054j27013j81136l15525n6013J96577J67695O3314K4373j8402
7986G5873J27133j80895p6608K62708M7423j23292p4548j90035j53343J43322
7976a42262L33277J52164o00j87947j28396k12146r9442J275J19224K25596J80746
7965B41489j45185J26837K08522m0961k09557L2026J27719j22870q3831k07997
7955g3808J40787M0361q4471J20034j432j14837L9949l64347M2042j30909K163
$$ plain form
7944 -384468 -16271 -38893 142997 95517 -333726 -426957 -600619 -266349 -43040 136434
7934 136434 275689 50665 -52103 209185 417180 219628 -205827 -72438 -38874 -114631
7924 -114631 -223353 -264563 -153607 40723 8813 308135 349018 411428 282084 -2697
7914 -2697 15393 -94852 191329 502180 189031 -16823 350562 245701 -15670 140732
7904 140732 101130 63383 212104 228650 96311 27781 41489 281619 415583 389705 232459
7893 232459 374737 524902 363523 240384 300318 230856 304011 327099 327070 420517 335172
7882 335172 359006 360913 176102 247989 -134333 -301577 -343884 -495980 -547739 -327244 -161959
7871 -161959 131406 38155 -113814 61145 -48216 -143720 -98945 81146 44908 -116776
$$ packed form
7944c84468L68197k2622J81890m7480m29243r3231j73662L34270K23309J79474
7934A36434J39255k25024j02768K61288K07995j97552m25455J33389L3564p5757
7924a14631j08722m1210J10956J94330l1910K99322M0883O2410j29344k84781
7914b697J8090j10245K86181L10851l13149k05854L67385j04861k61371J56402
7904A40732l9602l7747J48721J6546j32339o8530J3708K40130J33964k5878j57246
7893B32459J42278J50165j61379j23139N9934o9462P3155K3088k9R3447q5345
7882C35172K3834J907j84811P1887l82322j67244m2307j52096n1759K20495J65285
7871a61959K93365r3251j51969J74959j09361r5504M4775J80091l6238j61684
$$ plain form
7861 -116776 -265124 -288679 -59833 161891 -181826 -220268 -380197 -360639 -259297 -339656
7851 -339656 223395 508972 221510 -218888 -574068 -651134 -584276 -395305 264797 570194
7841 570194 254304 417541 125530 -48281 -29422 -183672 -134637 -230969 -577183 -605644
7831 -605644 -589578 -438551 -239894 -34957 33748 3131 -9763 -82460 -40709 -67235 356606
7820 356606 717951 430321 119233 -75083 -190841 -448421 -579919 -342475 -173009 -78969
7810 -78969 68644 312594 -58054 -538127 -548705 -308911 -386981 -413079 11440 459830
7800 459830 259272 -155021 92599 405863 440397 411205 64158 -87414 -5231 46884
7790 46884 -128 3266 14844 -196786 -184782 -120452 51736 406859 225246 -199866 52501
$$ packed form
7861a16776j48348k3555K28846K21724l43717l8442j59929J9558J01342q0359
7851c39656N63051K85577k87462m40398l55180p7066O6858J88971O60102L05397
7841E70194l15890J63237k92011j73811J8859j54250M9035r6332l46214k8461
7831f05644J6066J51027J98657K04937O8705l0617j2894p2697M1751k6526M23841
7820C56606L61345k87630l11088j94316j15758k57580j31498K37444J69466R4040
7810g8969J47613K43950l70648m80073j0578K39794p8070k6098M24519M48390
7800D59830k00558m14293K47620L13264L4534k9192l47047j51572Q2183N2115
7790D6884m7012L394J1578k11630J2004O4330J72188L55123j81613m25112K52367
$$ plain form
7779 52501 119567 17043 121402 455316 580435 152715 -222091 26653 -84504 -378892
7769 -378892 -368142 75985 226282 231522 319279 88161 -171613 -182450 191484 382910 228716
7758 228716 -41163 193155 179089 -73259 -122362 -131262 -82569 -6514 243872 222948 20970
7747 20970 -336474 -234766 -821 98737 -79635 -268268 -266874 -86431 35422 71285 451016
7736 451016 239637 -456884 -670466 -530673 -431215 -346440 -345207 -497423 -363320 27958
7726 27958 -109466 -404319 -361364 -189348 -301170 -249967 -157414 -260287 -241881 -293764 85892
7715 85892 117325 142742 -21825 -170160 -341046 -232465 1102 102000 122591 360915
7705 360915 483507 473841 494165 301824 -18934 -53459 77798 -96899 -132719 -291305 -13835
$$ packed form
7779E2501O7066j02524J04359L33914J25119m27720l74806K48744j11157k94388
7769c78892J0750M44127J50297N240Q7757k31118k59774j0837L73934J91426j54194
7758B28716k69879K34318j4066k52348m9103q900M8693P6055K50386k0924k01978
7747B0970l57444J01708K33945R9558j78372j88633J394J80443J21853L5863L79731
7736D51016k11379o96521k13582J39793R9458Q4775J233j52216J34103L91278
7726B7958j37424k94853M2955J72016j11822N1203R2553j02873J8406n1883L79656
7715H5892L1433K5417j64567j48335j70886J08581K33567J00898K0591K38324
7705C60915J22592r666K0324j92341l20758l4525J31257j74697l5820j58586K77470
$$ plain form
7694 -13835 -12481 105244 240887 77351 -93572 -381161 -257479 -300119 25547 2543 4674
7683 4674 -26671 -31157 221502 381895 248183 82012 202553 87753 26031 -196149 -188071
7672 -188071 -410553 -447671 -345210 -557411 -806154 -524359 -375182 -46097 122111 342990
7662 342990 225964 -122705 -376866 -66475 239873 165650 389268 488424 235812 -70045
7652 -70045 116934 130649 75176 28945 -165397 -89692 153139 241734 -16785 102011 -61635
7641 -61635 -502964 -411283 -352927 -147791 -53853 -176350 -485255 32712 286388 212986 122608
7630 122608 140357 36275 -164185 -47784 -258373 -315365 31815 282295 126206 377486
7620 377486 443888 27018 -129126 -255041 -413751 -587174 -651988 -435011 -400556 -66744
$$ packed form
7694a3835J354J17725J35643j63536j70923k87589J23682m2640L25666k3004K131
7683D674l1345m486K52659J60393j33712j66171J20541j14800o1722k22180Q078
7672a88071k22482l7118J02461k12201k48743K81795J49177L29085J68208K20879
7662C42990j17026l48669k54161L10391L06348p4223K23618R9156k52612l05857
7652g0045J86979J3715n5473m6231j94342P5705K42831Q8595k58519J18796j63646
7641f1635m41329R1681N8356K05136R3938j22497l08905N17967K53676p3402r0378
7630A22608J7749j04082k00460J16401k10589n6992L47180K50480j56089K51280
7620C77486O6402m16870j56144j25915j58710j73423o4814K16977L4455L33812
$$ plain form
7610 -66744 326570 297986 47344 147255 146730 -136699 -510731 -610175 -304962 -514140 -146989
7599 -146989 286250 483547 468704 466697 267388 199533 -76361 -284377 -311781 -490348 -464615
7588 -464615 -150011 12181 -119223 -143077 -290271 -364385 -100063 -110867 -209774 -278093 -443714
7577 -443714 -454168 -429812 -394942 83838 -7164 -28882 -199286 -484732 -877965 -844331 -638036
7566 -638036 -760092 -636708 -135121 -283709 -405027 -395009 -343896 -273617 -444216 -285060
7556 -285060 -1133 230962 461861 571419 520457 167949 27091 27349 -94329 2334 -269350
7545 -269350 -21368 -117916 -118126 150204 223228 -162093 -628254 -225506 -248953 -157455 213139
7534 213139 311112 -327230 -420208 -424047 -268926 -182438 -152442 -29765 3059 3346 33392 102404
$$ packed form
7610f6744L93314k8584k50642R9911n25k83429l74032r9444L05213k09178L67151
7599a46989M33239J97297j4843k007j99309o7855k75894k08016k7404j78567K5733
7588d64615L14604J62192j31404k3854j47194p4114K64322j0804r8907o8319j65621
7577d43714j0454K4356L4870M78780r1002k1718j70404k85446l93233L3634K06295
7566f38036j22056J23384N01587j48588j21318J0018N1113P0279j70599J59156
7556b85060K83927K32095K30899J09558n0962l52508j40858K58j21678R6663k71684
7545b69350K47982r6548k10K68330P3024l85321m66161M02748k3447R1498L70594
7534B13139R7973o38342r2978l839J55121Q6488K9996J22677L2824K87L0046O9012
$$ plain form
7522 102404 165155 411281 223689 -364061 -540458 -625273 -162782 149999 -150557 -517900
7512 -517900 -325176 -60551 14357 -9340 -455448 -677091 -125104 353342 146306 126929
7502 126929 139276 -347752 -204525 433972 498572 343063 -62177 -442013 -443369 -438117 -418676
7491 -418676 -369578 -494451 -497396 -281856 -163566 -323334 -402153 -258849 -126747 -268400
7481 -268400 -399440 -538792 -305750 -87470 314153 600338 720681 390046 445564 74416
7471 74416 -426689 -592438 -523430 -492107 -223308 -160627 -309139 -623997 -438873 -171559
7461 -171559 22756 258394 591253 558257 573777 569074 428860 524417 507444 271388 254497
7450 254497 252083 84135 29421 -344779 -247540 82896 144061 67726 -58152 -103731 -268564
$$ packed form
7522A02404O2751K46126j87592n87750j76397q4815M62491L12781l00556l67343
7512e17900J92724K64625P4908k3697m46108k21643N51987M78446k07036j9377
7502A26929J2347m87028J43227O38497O4600j55509m05240l79836j356N252J9441
7491d18676M9098j24873k945K15540J18290j59768p8819J43304J32102j41653
7481b68400j31040j39352K33042K18280M01623K86185J20343l30635N5518l71148
7471G4416n01105j65749O9008L1323K68799O2681j48512l14858J85124K67314
7461a71559J94315K35638L32859l2996J5520m703j40214R5557j6973k36056j6891
7450B54497k414j67948n4714l74200R7239L30436O1165p6335j25878m5579j64833
$$ plain form
7439 -268564 -130599 -17695 -327330 295096 564701 620656 650468 511824 152447 -160704
7429 -160704 -159992 116208 19190 -235934 -232048 -112084 -50042 -185128 -597990 -548768 -391390
7418 -391390 -305792 -226350 144748 353637 453506 407460 387648 174380 -148691 -294182 -67022
7407 -67022 60777 65811 -138738 -256541 -483145 -212367 -70751 -285240 -27219 56437
7397 56437 10444 -85135 55889 262287 348773 223235 321244 291759 231573 -238546 -683625
7386 -683625 -820341 -890682 -849138 -481437 -287296 -235377 117737 44672 -405734 -731727
7376 -731727 -652682 -634037 -804995 -667508 -442146 -257390 -186455 -291030 -345037 -305844 -432876
7365 -432876 -237693 -289457 -406389 -386936 -310120 -325697 -306971 -303626 -165225 85785 -172286
$$ packed form
7439b68564J37965J12904l09635O22426K69605N5955K9812j38644l59377l13151
7429a60704P12K76200r7018k55124L886J19964O2042j35086m12862M9222J57378
7418c91390Q5598P9442L71098K08889R9869m6046j9812k13268l23071j45491K27160
7407f7022J27799N034k04549j17803k26604K70778J41616k14489K58021Q3656
7397E6437m5993r5579J41024K06398Q6486j25538R8009k9485o0186m70119m45079
7386f83625j36716p0341M1544L67701J94141N1919L53114p3065m50406l25993
7376g31727P9045J8645j70958J37487K25362J84756P0935j04575n4007L9193j27032
7365d32876J95183n1764j16932J9453P6816j5577J8726L345J38401K51010k58071
$$ plain form
7354 -172286 -76487 313182 248988 263726 386026 386918 328633 191489 124145 79302 278986
7343 278986 323916 235604 -17403 -112590 -469023 -446436 -447778 -320356 -89128 154341 -72461
7332 -72461 -361228 -637174 -606250 -697817 -693579 -363027 -43950 -19660 -195298 -114153 80910
7321 80910 137516 388707 331197 110611 192658 425673 449193 79380 168953 223201 163954
7310 163954 34087 -449326 -373492 -434803 -174156 108577 77940 66137 59708 24740 -29844
7299 -29844 -134179 -50494 49593 25885 -116952 139104 538476 172035 -146868 -112428
7289 -112428 -244912 -518732 -625197 -251685 90694 134587 313504 469769 365403 269568
7279 269568 46442 -182084 -218860 -89623 136706 112128 94933 373104 381619 150275 -480595
$$ packed form
7354a72286R5799L89669o4194J4738J22300Q92n8285j37144o7344m4843J99684
7343B78986M4930q8312k53007r5187l56433K2587j342J27422K31228K43469k26802
7332g2461k88767k75946L0924r1567M238L30552L19077K4290j75638Q1145J95063
7321H0910N6606K51191n7510k20586Q2047K33015K3520l69813Q9573N4248n9247
7310A63954j29867m83413P5834o1311K60647K82733l0637j1803o429l4968n4584
7299b9844j04335Q3685J00087k3708j42837K56056L99372l66441l18903L4440
7289a12428j32484k73820j06465L73512L42379M3893J78917J56265j04366r5835
7279B69568k23126k28526l6776J29237K26329k4578j7195K78171Q515k31344o30870
$$ plain form
7268 -480595 -708866 -501104 -214648 -212376 -226779 -45452 -25271 -236363 -257749 -504483 -685053
7257 -685053 -407632 8395 -109803 -65274 211381 407541 477628 336983 505252 428363
7247 428363 205091 70871 -134154 -184166 93368 136892 152777 66406 -10319 -134473 -223456
7236 -223456 -207241 -45760 86204 83795 -120806 -215463 -50980 20287 -117005 53131 231116
7225 231116 427693 428711 399692 246042 -162989 -174414 -283098 -431780 -568187 -297461
7215 -297461 20086 331114 534318 700048 364967 26950 -29431 174956 285721 657828
7205 657828 882398 772241 317572 90803 339248 471985 414387 -24577 -21381 84426
7195 84426 8099 -137052 -248640 -443275 -734742 -648513 -195681 -356693 -119181 294311
$$ packed form
7268d80595k28271K07762K86456K272j4403J81327K0181k11092k1386k46734j80570
7257f85053K77421M16027j18198M4529K76655J96160P0087j40645J68269p6889
7247D28363k23272j34220k05025n0012K77534M3524J5885q6371p6725j24154q8983
7236b23456J6215J61481J31964k409k04601r4657J64483P1267j37292J70136J77985
7225B31116J96577J018k9019j53650m09031j1425j08684j48682j36407K70726
7215b97461L17547L11028K03204J65730l35081l38017n6381K04387J10765L72107
7205F57828K24570j10157m54669k26769K48445J32737n7598m38964L196J05807
7195H4426p6327j45151j11588j94635k91467Q6229M52832j61012K37512M13492
$$ plain form
7185 294311 138357 -227613 -612269 -824222 -624481 -408707 -317705 -296683 -419759 -389297
7175 -389297 -459356 -372171 -151715 32982 -177811 -142909 -345007 -494353 -283044 -301975
7165 -301975 -273629 -152341 127411 284708 362670 265923 25287 -351803 -443399 -263992
7155 -263992 -78985 214369 59855 -36586 161797 238228 59243 59078 -382752 -448018 -231001
7144 -231001 -150762 -351120 -427096 -467491 -355900 -229456 -134424 -325615 -392517 -405713 -527006
7133 -527006 -932128 -979188 -396546 98691 388585 126523 -138257 -271861 -248945 -375704
7123 -375704 -517209 -580019 -342736 -184553 -316093 -247523 176463 363752 412600 384640
7113 384640 101744 136535 107225 31986 -87110 340817 275540 183733 136105 6890 34608
$$ packed form
7185B94311j55954l65970l84656k11953J99741K15774R1002K1022j23076L0462
7175c89297p0059Q7185K20456J84697k10793L4902k02098j49346K11309j8931
7165c01975K8346J21288K79752J57297P7962r6747k40636l77090r1596J79407
7155b63992J85007K93354j54514r6441J98383P6431j78985j65m41830o5266K17017
7144b31001Q0239k00358p5976m0395J11591J26444R5032j91191o6902j3196j21293
7133e27006m05122m7060N82642M95237K89894k62062k64780j33604K2916j26759
7123c75704j41505o2810K37283J58183j31540O8570M23986J87289M8848k7960
7113C84640k82896L4791k9310p5239j19096M27927o5277r1807m7628j29215K7718
$$ plain form
7102 34608 4602 80572 156979 -191509 -132020 25786 59371 -237206 -414882 -395796 -489061
7091 -489061 -362416 -211642 6877 40128 272864 516846 482304 277055 158069 227651
7081 227651 26131 -231175 -517254 -565002 -504982 -395117 -377245 -224141 -83653 -165383
7071 -165383 -143511 -341463 -456655 -349183 -589126 -707258 -515117 -305420 -213849 -646242
7061 -646242 -475000 -184126 -70681 -81760 -206056 -327466 -342143 -38825 271347 279153
7051 279153 84928 -24615 -101810 -295330 -214136 -77171 331791 215214 82961 -90093
7041 -90093 -456299 -406440 -240689 -150410 39760 197953 134265 199969 295798 -6745 208149
7030 208149 284246 -203117 -479777 -460128 -341327 -407784 -442669 -327370 -314458 -168694 -201758
$$ packed form
7102C4608l0006P5970P6407l48488N9489J57806L3585k96577j77676J9086r3265
7091d89061J26645J50774K18519L3251K32736K43982l4542k05249j18986O9582
7081B27651k01520k57306k86079m7748O0020J09865J7872J53104J40488q1730
7071a65383K1872j97952j15192J07472k39943j18132J92141K09697R1571m32393
7061f46242J71242K90874J13445j1079j24296j21410j4677L03318L10172P806
7051B79153j94225j09543p7195j93520Q1194J36965M08962j16577j32253j73054
7041i0093l66206M9859J65751R0279J90170J58193o3688O5704R5829l02543K14894
7030B08149P6097m87363k76660J9649J18801o6457l4885J15299J2912J45764l3064
$$ plain form
7019 -201758 -239179 -196439 -330825 -200371 257614 341784 395224 356775 24652 74632 90516
7008 90516 224947 -295015 -836154 -762793 -452513 -347166 -417873 -442923 154512 350650
6998 350650 24442 -342653 -505281 -109663 -171451 -124738 88611 334971 131102 -299995
6988 -299995 -300420 -606327 -788339 -624713 -358896 -120024 136616 -50396 -26341 301269
6978 301269 35945 120429 286754 470203 523470 386447 -115101 -545563 -844408 -835646
6968 -835646 -643862 -380618 -266102 -514838 -444298 -389974 -184407 -114228 -177951 -114791 -67108
6957 -67108 38305 493273 304702 2754 248664 296876 392361 245038 -21602 108315
6947 108315 -406 9515 40004 169781 23866 -414178 -514900 -188070 -324621 -543461
$$ packed form
7019b01758l7421M2740j34386J30454M57985Q4170N3440l8449l32123M9980J5884
7008I0516J34431n19962n41139P3361L10280J05347p0707k5050N97435J96138
6998C50650l26208l67095j62628L95618o1788M6713K13349K46360k03869m31097
6988b99995m25l05907j82012J63626K65817K38872K56640j87012K4055L27610
6978C01269k65324Q4484J66325J83449N3267j37023n01548m30462k98845Q762
6968h35646J91784K63244J14516k48736P0540N4324K05567P0179o3723O3160M7683
6957f7108J05413M54968j88571l01948K45910M8212R5485j47323k66640J29917
6947A08315j08721R921L0489J29777j45915m38044j00722L26830j36551k18840
$$ plain form
6937 -543461 -315602 -666899 -748455 -420624 -112995 -64843 -216481 -336694 -253129 123015
6927 123015 370546 562608 344508 264702 291768 144520 -44999 -363637 -339244 108565
6917 108565 410582 412349 43956 -380409 -742761 -496522 -319090 -158843 -406329 -957265
6907 -957265 -864033 -330533 -54730 -197438 -214210 -109138 -12636 95242 450600 327464
6897 327464 72474 273109 514001 567794 362739 117587 -125524 -91249 113398 164414
6887 164414 -100618 28668 124820 26596 -316037 -173250 -231795 -349613 -211524 -179702
6877 -179702 -402483 -739028 -563040 -173762 204736 172866 74366 -168905 -515772 -516410 -818509
6866 -818509 -876400 -754513 -929084 -1064174 -1013890 -841291 -798654 -708847 -73862 142568
$$ packed form
6937e43461K27859l51297q1556L27831L07629M8152j51638j20213Q3565L76144
6927A23015K47531J92062k18100p9806K7066j47248j89519l18638K4393M47809
6917A08565L02017J767l68393m24365l62352K46239J77432J60247k47486n50936
6907i57265R3232N33500K75803j42708j6772J05072R6502J07878L55358j23136
6897C27464k54990K00635K40892N3793k05055k45152k43111L4275K04647N1016
6887A64414k65032J29286R6152r8224l42633J42787n8545j17818J38089L1822
6877a79702k22781l36545J75988L89278L78498l1870r8500k43271l46867o38l02099
6866h18509n7891J21887j74571j35090N0284J72599M2637Q9807O34985K16430
$$ plain form
6856 142568 100514 -11913 -30234 -90370 -239940 -340036 -429039 50959 497333 540563 101952
6845 101952 36156 130148 130327 290925 297704 79337 54521 -79225 -134645 -42422 -142193 -92489
6833 -92489 -188476 -199290 -112336 -305602 -109645 -64603 -217194 199447 3233 -321357 -391559
6822 -391559 -290865 -448669 -310229 91536 5958 -284310 -262552 -123992 62876 13950
6812 13950 -349019 -538947 -472416 -478133 -458415 -47723 -104043 11481 -322856 -162947 -168191
6801 -168191 -203312 -116637 151385 102340 126735 88261 217560 230123 392702 222888 159674
6790 159674 419351 168863 14777 -107244 -55137 -190056 3763 146792 238540 349403
6780 349403 -51000 242664 173684 -211646 -121504 47136 -31452 113695 305804 474498
$$ packed form
6856A42568m2054j12427j8321o0136j49570j00096q9003M79998M46374M3230m38611
6845A01952o5796R3992J79J60598O779k18367k4816j33746n5420R2223r9771M9704
6833i2489r5987j0814Q6954j93266J95957M5042j52591M16641j96214l24590p0202
6822c91559J00694j57804J38440M01765q5578k90268K1758J38560J86868m8926
6812A3950l62969j89928O6531n717J9718M10692n6320J15524l34337J59909n244
6801a68191l5121Q6675K68022m9045K4395l8474J29299J2563J62579j69814o3214
6790A59674K59677k50488j54086j22021N2107j34919J93819J43029R1748J10863
6780C49403m00403K93664o8980l85330R0142J68640p8588J45147J92109J68694
$$ plain form
6770 474498 273724 71334 -57049 -21177 164002 550359 485643 279013 -198942 -261614
6760 -261614 -164489 135661 148203 -126712 -174000 150942 402152 74978 5175 283778
6750 283778 411415 236263 37177 -48152 112394 68829 -28578 -30759 -119173 -211913 -62922
6739 -62922 -20540 -15807 94671 178846 229054 9674 -363223 -767301 -721942 -713309 -610125
6728 -610125 -648314 -422999 -154616 8199 71257 261586 361589 451539 305077 252948
6718 252948 382739 576581 489464 514836 299173 33216 -284247 -79308 216946 200757
6708 200757 194376 303801 269384 232418 19272 55653 -174197 -259590 -163009 -37284 -29294
6697 -29294 31474 400295 540805 405149 350427 2001 -169167 214967 370358 425907
$$ packed form
6770D74498k00774k02390j28383L5872J85179L86357o4716k06630m77955o2672
6760b61614R7125L00150J2542k74915m7288L24942K51210l27174o9803K78603
6750B83778J27637j75152j99086q5329J60546m3565r7407k181q8414r2740J48991
6739f2922M2382M733J10478Q4175N0208k19380l72897m04078M5359Q633J03184
6728f10125l8189K25315K68383J62815O3058J90329J00003Q9950j46462n2129
6718B52948J29791J93842q7117K5372k15663k65957l17463K04939K96254j6189
6708B00757o381J09425l4417l6966k13146L6381k29850q5393R6581J25725P990
6697b9294O0768L68821J40510j35656n4722l48426j71168L84134J55391N5549
$$ plain form
6687 425907 365213 115553 -37152 -146944 -61703 144671 -130322 -26260 -307576 -375017
6677 -375017 -350452 -194638 77493 255723 -50690 -39628 57802 230996 374333 226521
6667 226521 310905 94471 -299691 -284195 -127916 171105 253930 424137 599855 439489
6657 439489 304238 53966 230495 195579 -187454 -344915 -420184 -748357 -707413 -575672
6647 -575672 -494503 -566812 -435099 -300007 117442 394485 574112 483289 239310 87620
6637 87620 142048 -85577 -284060 -189453 193062 329570 -7322 -102296 -99159 -303306 -120729
6626 -120729 12022 194686 402550 306824 339020 -132429 -260027 -138992 -82654 -64193
6616 -64193 162710 212810 59125 -56202 31921 -43739 -90027 -18733 105969 329371 328393
$$ packed form
6687D25907o0694k49660j52705j09792Q5241K06374k74993J04062k81316o7441
6677c75017K4565J55814K72131J78230l06413J1062R7430J73194J43337j47812
6667B26521Q4384k16434l94162J5496J56279K99021Q2825J70207J75718j60366
6657D39489j35251k50272J76529l4916l83033j57461p5269l28173M0944J31741
6647e75672Q1169p2309J31713J35092M17449K77043J79627r0823k43979j51690
6637H7620N4428k27625j98483R4607L82515J36508l36892r4974L137k04147J82577
6626a20729J32751J82664K07864r5726L2196m71449j27598J21035N6338J8461
6616f4193K26903N0100j53685j15327Q8123p5660m6288P1294J24702K23402r78
$$ plain form
6605 328393 -36866 -142035 46576 128315 203682 113564 -406763 -413184 -194130 -106611 246313
6594 246313 397804 426102 232866 93069 226479 198290 -2588 239176 281374 47020
6584 47020 168890 182421 127279 30297 6735 -5250 227833 380030 112644 201602 -7751
6573 -7751 -391556 -420012 -505605 -199037 113194 170810 221968 68559 -117934 -307595 -195790
6562 -195790 125849 362322 425987 433190 172855 320471 365368 -63969 -134473 138049 66313
6551 66313 -346727 -553912 -798960 -836710 -919612 -482494 -25605 -180982 -297237 49705
6541 49705 -133769 -259356 107927 -71558 -24570 81566 -238428 -313318 -243786 -377976
6531 -377976 -128574 -192968 -205700 -145066 -418130 -357942 -312561 -214216 -66831 -110498 -452273
$$ packed form
6605C28393l65259j05169J88611Q1739P5367r0118n20327o421K19054Q7519L52924
6594B46313J51491K8298j93236j39797J33410k8189k00878K41764M2198k34354
6584D7020J21870J3531n5142r6982k3562j1985K33083J52197k67386Q8958k09353
6573g751l83805k8456q5593L06568L12231N7616N1158j53409j86493j89661J11805
6562a95790L21639K36473O3665P203k60335J47616M4897m29337p0504K72522p1736
6551F6313m13040k07185k45048l7750q2902M37118M56889j55377j16255L46942
6541D9705j83474j25587L67283j79485M6988J06136l19994p4890O9532j34190
6531c77976K49402o4394j2732O0634k73064O0188M5381R8345J47385m3667l41775
$$ plain form
6520 -452273 -433384 -566352 -652021 -525181 -432481 -65442 306530 221809 366818 366323 167606
6509 167606 -36287 78920 4929 -15021 -155421 -244136 -496446 -721903 -609932 -394905
6499 -394905 -44033 -180344 -557551 -730915 -598635 -498117 -24777 92998 -493 -87181
6489 -87181 -380192 -214545 -39961 44337 161087 229254 252410 330529 366557 56867 -221621
6478 -221621 -668131 -711294 -404080 -209023 -507538 -583632 -456977 -444326 -341722 -294320
6468 -294320 -246684 -252765 1358 -86856 -278064 -431085 -449720 -437136 -288084 -241559 -275461
6457 -275461 -122655 -121150 -11621 25377 -180394 -328848 -51614 43105 -283080 -270343 -245980
6446 -245980 -79149 -239694 -76187 365162 165136 -127267 -330977 -235310 -109989 -78429
$$ packed form
6520d52273J8889j32968q5669J26840R2700L67039L71972q4721J45009m95j98717
6509A67606k03893J15207p3991j9950j40400q8715k52310k25457J11971K15027
6499c94905L50872j36311l77207j73364J32280J00518M73340J17775r3491q6688
6489h7181k93011J65647J74584Q4298J16750O8167K3156P8119L6028l09690k78488
6478b21621m46510m3163L07214J95057k98515p6094J26655J2651J02604M7402
6468b94320M7636o081K54123q8214j91208j53021j8635J2584J49052M6525l3902
6457b75461J52806J505J09529L6998k05771j48454K77234R4719l26185J2737K4363
6446b45980J66831j60545J63507M41349k00026k92403k03710R5667J25321L1560
$$ plain form
6436 -78429 -233351 -660647 -701220 -524658 -312680 -449766 -473097 -353236 -180393 -294259
6426 -294259 78778 116877 81446 127008 -59983 -150754 -141188 -108214 -285995 -271407 -88563
6415 -88563 254122 84781 -136018 3053 -83095 -224036 -131369 88299 -97335 -126248
6405 -126248 -28637 -194409 -257077 -194714 -68924 216014 148160 -203147 -39076 26491 80793
6394 80793 169678 270664 116644 -98394 65862 72565 -66478 -379653 -466054 -411658 -269195
6383 -269195 -198225 -356840 -359167 -71785 100630 399903 258675 396443 493813 262801
6373 262801 118770 -216516 -185792 115219 351612 313012 144014 -232774 -333003 -659550
6363 -659550 -805267 -666323 -270347 156875 -127276 -466451 -501486 -654674 -719930 -827367
$$ packed form
6436g8429j54922m27296m0573J76562K11978j37086k3331J19861J72843j13866
6426b94259L73037L8099l5431M5562j86991r0771R566L2974j77781J4588J82844
6415h8563L42685j69341k20799J39071q6148j40941R2667K19668j85634k8913
6405a26248R7611j65772o2668O2363J25790K84938o7854l51307J64071O5567N4302
6394H0793Q8885J00986j54020k15038J64256O703j39043l13175q6401N4396J42463
6383b69195P0970j58615k327K87382J72415K99273j41228J37768R7370k31012
6373B62801j44031l35286L0724L01011K36393l8600j68998l76788j00229l26547
6363f59550j45717J38944L95976M27222k84151l39175l5035j53188o5256j07437
$$ plain form
6353 -827367 -411148 214572 197905 185903 -268679 -223722 -350611 -347135 -67764 -127070 -259104
6342 -259104 -169777 192496 320813 23535 -252263 -363139 -95322 -133449 -141674 -262410
6332 -262410 -256389 -126067 -223883 -24913 -234651 -169648 52029 -280022 -518355 -186041
6322 -186041 -163687 -220593 -21678 352286 201834 -72203 -222591 -332679 -376925 -107311
6312 -107311 -303920 -362650 -439032 -240384 34484 168981 -344393 -829637 -751924 -656486
6302 -656486 -405546 -232473 91659 150635 100335 227194 86612 -85807 54401 190622
6292 190622 363006 621931 643494 459751 360190 113229 289607 185939 -36550 -201050
6282 -201050 -166188 -428212 -586550 -571718 -350023 -636705 -595691 -436447 -272882 -201179
$$ packed form
6353h27367M16219O25720j6667j2002m54582M4957j26889L476K79371n9306j32034
6342b59104Q9327L62273J28317k97278k75798j10876K67817l8127q225j20736
6332b62410O021J30322r7816J98970k09738O5003K21677l32051k38333L32314
6322a86041K2354n6906J98915L73964j50452k74037j50388j10088m4246K69614
6312a07311j96609n8730p6382J98648K74868J34497n13374m85244P7713R5438
6302f56486K50940J73073L24132N8976n0300J26859j40582j72419J40208J36221
6292A90622J72384K58925K1563j83743r9561k46961J76378j03668k22489j64500
6282b01050L4862k62024j58338J4832K21695k86682M1014J59244J63565P1703
$$ plain form
6272 -201179 -278832 -351140 -455954 -386015 -264383 -153477 99516 193384 357499 480328
6262 480328 432593 434022 289518 162315 42816 133057 283178 201383 183731 327262 433679
6251 433679 359318 12954 -209040 -233915 -421935 -117043 -217010 -250392 -151700 -42151 -340198
6240 -340198 -758757 -395938 -67571 180858 190467 80977 -241521 -230041 47064 254598
6230 254598 192335 75475 -191404 -151999 -27105 115710 -56440 -170264 -44285 -185758
6220 -185758 -98367 -235251 -59745 -102387 -285316 -313573 -191869 -413085 -501649 -731561
6210 -731561 -666706 -712727 -710573 -461993 -554134 -571573 -573422 -603036 -632334 -571086 -679214 -735208
6198 -735208 -468722 -219310 78917 57245 -480694 -529163 -56480 206727 201394 26850
$$ packed form
6272b01179p7653p2308j04814O9939J21632J10906K52993R3868J64115J22829
6262D80328m7735J429j44504j27203j19499R0241J50121q1795j7652J43531J06417
6251D33679p4361l46364k21994k4875j88020L04892r9967l3382R8692J09549k98047
6240c40198m18559L62819L28367K48429R609j09490l22498J1480K77105K07534
6230B54598o2263j16860k66879L9405J24894J42815j72150j13824J25979j41473
6220a85758Q7391j36884J75506m2642j82929k8257J21704k21216q8564k29912
6210g31561O4855m6021K154K48580r2141j7439j849k9614k9298O1248j08128n5994
6198g35208K66486K49412K98227k1672n37939m8469M72683K63207n333j74544
$$ plain form
6188 26850 17273 15046 -255614 -269295 -200962 -336602 -261943 -95053 -220090 -501973 -355941
6177 -355941 -66404 253988 195513 44936 311617 218160 284145 330489 50775 -154813
6167 -154813 -139209 -237853 -170779 -260134 -114267 -113354 -47040 101439 102319 260394 95716 -203285
6155 -203285 -325948 -22621 79955 -193417 -216030 54514 191740 278329 80176 1356
6145 1356 -61149 -783 -24423 -156806 -67736 179676 151449 439396 581351 470898 378227
6134 378227 70514 -92036 -225431 -113440 -70617 -91478 162481 264165 -8001 -11905
6124 -11905 111567 127521 -25071 -362229 -328907 -27304 96746 110290 -76255 -411492
6114 -411492 -621916 -202752 -51449 -74024 2595 -155689 -391374 -113454 159044 544761
$$ packed form
6188B6850r577k227k70660j3681O8333j35640P4659J66890j25037k81883J46032
6177c55941K89537L20392n8475j50577K66681r3457O5985M6344k79714k05588
6167a54813J5604r8644O7074q9355J45867R13O6314J48479Q80J58075j64678k99001
6155b03285j22663L03327J02576k73372k2613K70544J37226Q6589j98153p8820
6145A356o2505O0366k3640j32383Q9070K47412k8227K87947J41955j10453r2671
6134C78227l07713j62550j33395J11991M2823k0861K53959J01684k72166l904
6124a1905J23472J5954j52592l37158L3322L01603J24050J3544j86545l35237
6114d11492k10424M19164J51303k2575P6619j58284k35685K77920K72498L85717
$$ plain form
6104 544761 1058646 957316 442139 27753 -103465 314293 408818 685519 729968 665688
6094 665688 528575 485828 576632 314619 38470 -50424 -56051 -219615 -134145 -41869 -61507
6083 -61507 -558744 -542009 -173116 205464 490461 349463 243327 163152 176381 217946 8936
6072 8936 -147752 -133018 160687 129773 221 -11545 23566 -69601 -179565 -32334 128562
6061 128562 358017 357163 432035 197107 -91325 -312873 -283636 -18197 -91621 -316969 -176345
6050 -176345 20654 65170 437029 981945 632878 753665 501467 302989 261929 11804
6040 11804 281060 365756 169358 68830 119342 -88480 10497 72122 -123271 125581 524396
6029 524396 330923 266697 245803 163201 314154 323630 588844 707814 410566 -9769 -86850
$$ packed form
6104E44761N13885j01330n15177m14386j31218M17758R4525K76701M4449o4280
6094F65688j37113m2747R0804k62013k76149q8894n627j63564Q5470R2276j9638
6083f1507m97237J6735L68893L78580K84997j40998j06136q0175J3229M1565k09010
6072H936j56688J4734K93705l0914j29552j1766L5111r3167j09964J47231J60896
6061A28562K29455q54P4872k34928k88432k21548K9237K65439p3424k25348J40624
6050a76345J96999M4516L71859N44916l49067J20787k52198j98478m1060k50125
6040A1804K69256Q4696j96398j00528N0512k07822R8977O1625j95393K48852L98815
6029E24396j93473o4226k0894q2602J50953R476K65214J18970k97248m20335p7081
$$ plain form
6018 -86850 -311576 -529977 -275666 -65264 -44101 92718 467560 307604 234028 581710
6008 581710 516500 181850 82475 32577 126774 145866 2153 2304 -39802 263174 424696
5997 424696 130675 67268 -4405 -34670 -199780 -91353 177597 259472 -108277 -341318
5987 -341318 -417074 -462542 -405188 -178202 -128244 -246316 -330790 -226560 -142 297245 328278
5976 328278 459123 592405 305978 142381 77110 -115076 -333541 -381106 -397150 -369712
5966 -369712 -256411 -45600 -55446 74639 -75498 -178474 216299 374885 222718 49951
5956 49951 -54823 -238355 -504377 -802356 -938806 -864437 -697591 -753945 -350180 -195811
5946 -195811 -163007 -374443 -564061 -404411 -125581 -81110 -86598 -48259 154251 61781 -25305
$$ packed form
6018h6850k24726k18401K54311K10402K1163J36819L74842j59956p3576L47682
6008E81710o5210l34650r9375m9898R4197J9092j43713J51m2106L02976J61522
5997D24696k94021o3407p1673l0265j65110J08427K68950Q1875l67749k33041
5987c41318p5756m5468N7354K26986M9958j18072q4474J04230K26418K97387L1033
5976C28278J30845J33282k86427j63597o5271j92186k18465m7565j6044K7438
5966c69712J13301K10811r846J30085j50137j02976L94773J58586j52167j72767
5956D9951j04774j83532k66022k97979j36450P4369J66846n6354M03765J54369
5946a95811L2804k11436j89618J59650K78830M4471n488L8339K02510r2470q7086
$$ plain form
5935 -25305 73583 268992 393291 285938 218612 193514 115116 33275 148672 153718 156496
5924 156496 171409 -55039 135923 94790 53012 -157593 140307 38305 27479 -155533
5914 -155533 -295562 -511165 -291679 69424 180317 242438 163886 -98153 -225959 -337874
5904 -337874 -440534 -396618 -294384 -335274 151391 304721 378206 355883 -17398 -425575
5894 -425575 -652263 -39228 385165 253560 169181 204640 410669 631400 542460 359003
5884 359003 228393 -121910 -227638 16444 163513 475347 499022 292640 99181 88741
5874 88741 -79957 -98221 -48493 163588 417006 568983 163650 -58394 -219556 -134199
5864 -134199 -242203 -362625 -394729 -193253 120328 45966 -202379 -297584 -172323 132803
$$ packed form
5935b5305R8888J95409J24299j07353o7326k5098p8398q1841J15397N046K778
5924A56496J4913k26448J90962m1133m1778k10605K97900j02002j0826j83012
5914a55533j40029k15603K19486L61103J10893O2121p8552k62039j27806j11915
5904c37874j02660M3916J02234m0890M86665J53330P3485k2323l73281m08177
5894d25575k26688O13035M24393j31605q4379L5459K06029K20731q8940j83457
5884C59003j30610l50303j05728K44082J47069L11834K3675k06382j93459j0440
5874H8741j68698j8264M9728K12081K53418J51977m05333k22044j61162Q5357
5864a34199j08004j20422l2104K01476L13581p4362k48345r5205J25261L05126
$$ plain form
5854 132803 238029 -91081 -211513 -262059 -156966 -46669 -435203 -337510 -430822 -371631
5844 -371631 -420432 -236443 -203044 -116675 -225171 -215806 -309701 -162345 -224248 -443829 -412744
5833 -412744 -452422 -512126 -573587 -774372 -920687 -946244 -507476 -276365 -259820 -303623 -322152
5822 -322152 -458632 -501876 -102955 209411 273027 136131 -112876 -259119 -248945 -194156
5812 -194156 -124109 78603 445117 471826 405191 336746 352638 573308 327810 -33471 41560
5801 41560 137736 188935 28700 -333775 -597415 -335398 -97964 -159364 117675 249393
5791 249393 -139233 -266217 -181673 -489223 -697430 -492305 -6725 -35749 -203040 -270377
5781 -270377 -469713 -548481 -422427 -84460 -40651 -147301 -197331 -151002 26793 267117
$$ packed form
5854A32803J05226l29110j20432n0546J05093J10297l88534R7693r3312N9191
5844c71631m8801J83989L3399Q6369j08496R365r3895J47356o1903k19581L1085
5833d12744l9678n9704o1461k00785j46315k5557M38768K31111J6545m3803j8529
5822c22152j36480m3244L98921L12366O3616j36896k49007j46243J0174N4789
5812a94156P0047K02712L66514K6709o6635o8445J5892K20670k45498l61281P5031
5801D1560R6176N1199j60235l62475k63640K62017K37434o1400K77039J31718
5791B49393l88626j26984Q4544l07550k08207K05125M85580k9024j67291o7337
5781b70377j99336p8768J26054L37967M3809j06650n0030M6329J77795K40324
$$ plain form
5771 267117 114438 -149381 -193770 124827 356332 293136 241555 161094 361432 528394
5761 528394 407376 302414 278056 220447 55085 131266 -161592 -471817 -326548 -161788
5751 -161788 -228567 -123455 -198959 -404583 -299885 -10180 -66425 -286193 -279927 78871 110666
5740 110666 121036 -144606 -31428 8693 -106453 -206204 1830 188887 150988 152268 -57771
5729 -57771 -39539 17099 126218 277863 -22655 -337452 -216989 -248859 -304024 -449362 -589960
5718 -589960 -271430 18711 -44451 316092 80145 -243260 -432594 -504459 -356326 -180172
5708 -180172 -51460 -52422 -52197 -111035 -267099 -336374 -383121 -128685 115236 92328 73633 216190
5696 216190 -97134 -436064 -306967 -270285 -420748 -382845 -224788 263395 420810 194191
$$ packed form
5771B67117j52679k63819m4389L18597K31505o3196n1581q0461K00338J66962
5761E28394j21018j04962k4358n7609j65362P6181k92858l10225J45269J64760
5751a61788o6779J05112p5504k05624J04698K89705n6245k19768O266L58798L1795
5740A10666J0370k65642J13178M0121j15146r9751K08034J87057l7899J280k10039
5729e7771J8232N6638J09119J51645l00518l14797J20463l1870n5165j45338j40598
5718e89960L18530K90141o3162L60543k35947l23405j89334p1865J48133J76154
5708a80172J28712r62K25n8838j56064o9275m6747K54436K43921k2908j8695J42557
5696B16190l13324l38930J29097L6682j50463L7903J58057M88183J57415k26619
$$ plain form
5686 194191 77458 15489 300132 267365 179589 -283457 -390766 -336011 -421775 -514970 -263717
5675 -263717 -283202 -286738 -305980 5999 391559 315685 364523 -98315 -358309 -93072 -76113
5664 -76113 -298144 -324070 -413588 -262582 -182167 100298 77333 60292 -32869 4823 186403
5653 186403 166761 321149 519797 152777 -47114 12455 -253731 -467480 -408022 -267843
5643 -267843 -226606 -441923 -475519 -165004 36731 523930 810922 677695 337197 -71506
5633 -71506 -351292 -502094 -325591 -215872 65721 209787 111204 163979 10275 -151859
5623 -151859 -270023 -304574 -430318 -210140 -31534 -57850 -116178 -66095 -22661 225719 136567
5612 136567 -50172 11052 374509 692693 648711 845919 613449 465387 195715 -72390
$$ packed form
5686A94191j16733o1969K84643l2767q7776m63046j07309N4755q5764r3195K51253
5675b63717j9485l536j9242L11979L85560p5874M8838m62838k59994K65237J6959
5664g6113k22031k5926q9518J51006Q0415K82465k2965j7041r3161L7692J81580
5653A86403j9642J54388J98648l67020j99891N9569k66186k13749N9458J40179
5643b67843M1237k15317l3596L10515K01735M87199K86992j33227l40498m08703
5633g1506k79786j50802J76503J09719K81593J44066r8583N2775j53704j62134
5623a51859j18164l4551j25744K20178J78606k6316n8328N0083M3434K48380q9152
5612A36567j86739O1224L63457L18184m3982J97208k32470j48062k69672k68105
$$ plain form
5602 -72390 -126022 1344 -8986 48425 -89604 -135891 -13494 -230373 -87078 33144 8693
$$ packed form
5602g2390n3632J27366j0330N7411j38029m6287J22397k16879J43295J20222k4451
$$ [...]
##END NTUPLES=NMR SPECTRUM
##END=
