##TITLE=Analysis number 311694
Compound Code cc 44301
Book Reference 431/125/4
Project Code qc-cat
Chemist Name janea
##JCAMPDX= 6.0         $$ Bruker NMR JCAMP-DX V2.0
##DATA TYPE= NMR SPECTRUM
##DATA CLASS= NTUPLES
##ORIGIN= Bruker BioSpin GmbH
##OWNER= NMR
$$ XWIN-NMR		Version 3.5
$$ Fri Jul 15 11:47:19 2005 GMT Daylight Time (UT+1h)  MAYBRIDGE\NMR@NMR_250MHZ
##.OBSERVE FREQUENCY= 250.131544655141
##.OBSERVE NUCLEUS= ^1H
##.ACQUISITION MODE= SIMULTANEOUS (DQD)
##.ACQUISITION SCHEME= undefined
##.AVERAGES= 16
##.DIGITISER RES= 18
##SPECTROMETER/DATA SYSTEM= dpx250
##.PULSE SEQUENCE= zg30
##.SOLVENT NAME= DMSO
##.SHIFT REFERENCE= (INTERNAL, DMSO, 0, 16.522)
##AUDIT TRAIL= $$ (NUMBER, WHEN, WHO, WHERE, WHAT)
$$ ##TITLE= Audit trail, XWIN-NMR		Version 3.5
$$ ##JCAMPDX= 5.01
$$ ##ORIGIN= Bruker BioSpin GmbH
$$ ##OWNER= NMR
$$ C:\u/data/dgb/nmr/ADRS/5890/pdata/1/auditp.txt
$$ ##AUDIT TRAIL=  $$ (NUMBER, WHEN, WHO, WHERE, WHAT)
(   1,<2005-07-15 11:46:49.86 +100>,<MAYBRIDGE\NMR>,<NMR_250MHZ>,
      <created by zg, POWCHK disabled, PULCHK disabled
       configuration hash MD5:
       62 19 C7 07 E1 42 D1 B7 37 6C 3D D0 77 39 F9 E6
       data hash MD5: 64K
       B5 FD BB 08 62 3A AC FB D0 4E F5 E6 04 56 F0 A6>)
(   2,<2005-07-15 11:47:06.66 +100>,<MAYBRIDGE\NMR>,<NMR_250MHZ>,
      <Start of raw data processing
       ef LB = 0.3 FT_mod = 6 PKNL = 1 SI = 32K 
       data hash MD5: 32K
       C6 40 4E 03 96 C6 F8 84 C6 8F ED BC 07 97 ED A2>)
(   3,<2005-07-15 11:47:08.57 +100>,<MAYBRIDGE\NMR>,<NMR_250MHZ>,
      <apk 
       data hash MD5: 32K
       D2 C7 2A F4 EA 9A BA 08 EE 04 55 79 66 46 67 16>)
(   4,<2005-07-15 11:47:09.27 +100>,<MAYBRIDGE\NMR>,<NMR_250MHZ>,
      <abs ABSG = 5 
       data hash MD5: 32K
       8D B1 65 59 A5 AA F7 00 A5 64 B1 9F 0C 1F 97 D1>)
$$ ##END=
$$ 
$$ hash MD5
$$ BE CA A5 49 F7 2B B1 81 71 43 E3 23 FB 9F 03 45
##$RELAX= 
##$RELAX= 
##$RELAX= 
##$RELAX= 
##$RELAX= 
##$RELAX= 
##$RELAX= 
$$ Bruker specific parameters
$$ --------------------------
##$DU= <C:\u>
##$EXPNO= 5890
##$NAME= <ADRS>
##$PROCNO= 1
##$TYPE= <nmr>
##$USER= <dgb>
##$AMP= (0..31)
100 100 100 100 100 100 100 100 100 100 100 100 100 100 100 100 100 100 
100 100 100 100 100 100 100 100 100 100 100 100 100 100 
##$AQSEQ= 0
##$AQ_mod= 3
##$AUNM= <au_zg>
##$AUTOPOS= <16 >
##$BF1= 250.13
##$BF2= 250.13
##$BF3= 250.13
##$BF4= 250.13
##$BF5= 500.13
##$BF6= 500.13
##$BF7= 500.13
##$BF8= 500.13
##$BYTORDA= 1
##$CFDGTYP= 0
##$CFRGTYP= 5
##$CHEMSTR= <none>
##$CNST= (0..31)
1 1 145 1 1 1 1 1 1 1 1 1 1 1 1 1 1 1 1 1 1 1 1 1 1 1 1 1 1 1 1 1 
##$CPDPRG= <>
##$CPDPRG1= <>
##$CPDPRG2= <>
##$CPDPRG3= <>
##$CPDPRG4= <mlev>
##$CPDPRG5= <mlev>
##$CPDPRG6= <mlev>
##$CPDPRG7= <mlev>
##$CPDPRG8= <mlev>
##$CPDPRGB= <>
##$CPDPRGT= <>
##$D= (0..31)
0 1 0 0 0 0 0 0 0 0.06 0 0 0 0 0 0 0.0002 0 0 0 0 0 0 0 0 0 0 0 0 0 0 
0 
##$DATE= 1121424408
##$DBL= (0..7)
120 120 120 120 120 120 120 120 
##$DBP= (0..7)
150 150 150 150 150 150 150 150 
##$DBP07= 0
##$DBPNAM0= <>
##$DBPNAM1= <>
$$ [...]
##$SUBNAM7= <"">
##$SUBNAM8= <"">
##$SUBNAM9= <"">
##$SW= 20.6930455092707
##$SWIBOX= (0..15)
0 0 3 0 0 0 0 0 0 0 0 0 0 0 0 0 
##$SW_h= 5175.983436853
##$TD= 65536
##$TD0= 1
##$TE= 295.16
##$TE2= 300
##$TE3= 300
##$TEG= 300
##$TL= (0..7)
0 120 120 120 120 120 120 120 
##$TP= (0..7)
150 150 150 150 150 150 150 150 
##$TP07= 0
##$TPNAME0= <>
##$TPNAME1= <>
##$TPNAME2= <>
##$TPNAME3= <>
##$TPNAME4= <>
##$TPNAME5= <>
##$TPNAME6= <>
##$TPNAME7= <>
##$TPOAL= (0..7)
0.5 0.5 0.5 0.5 0.5 0.5 0.5 0.5 
##$TPOFFS= (0..7)
0 0 0 0 0 0 0 0 
##$TUNHIN= 0
##$TUNHOUT= 0
##$TUNXOUT= 0
##$USERA1= <user>
##$USERA2= <user>
##$USERA3= <user>
##$USERA4= <user>
##$USERA5= <user>
##$V9= 5
##$VALIST= <valist>
##$VCLIST= <CCCCCCCCCCCCCCC>
##$VD= 0
##$VDLIST= <DDDDDDDDDDDDDDD>
##$VPLIST= <PPPPPPPPPPPPPPP>
##$VTLIST= <TTTTTTTTTTTTTTT>
##$WBST= 1024
##$WBSW= 4
##$XGAIN= (0..3)
0 0 0 0 
##$XL= 0
##$YL= 0
##$YMAX_a= 391763
##$YMIN_a= -333341
##$ZGOPTNS= <>
##$ZL1= 120
##$ZL2= 120
##$ZL3= 120
##$ZL4= 120
##$ABSF1= 16.522
##$ABSF2= -4.171173
##$ABSG= 5
##$ABSL= 3
##$ALPHA= 0
##$AQORDER= 0
##$ASSFAC= 0
##$ASSFACI= 0
##$ASSFACX= 0
##$ASSWID= 0
##$AUNMP= <proc_1d>
##$AZFE= 0.1
##$AZFW= 0.1
##$BCFW= 0
##$BC_mod= 0
##$BYTORDP= 0
##$COROFFS= 0
##$CY= 12.5
##$DATMOD= 1
##$DC= 0
##$DFILT= <>
##$DTYPP= 0
##$F1P= 14.0000005364418
##$F2P= -0.99999901652339
##$FCOR= 0.5
##$FTSIZE= 32768
##$FT_mod= 6
##$GAMMA= 0
##$GB= 0
##$INTBC= 1
##$INTSCL= 1
##$ISEN= 128
##$LB= 0.3
##$LEV0= 0
##$LPBIN= 0
##$MAXI= 10000
##$MC2= 0
##$MEAN= 0
##$ME_mod= 0
##$MI= 0
##$NCOEF= 0
##$NC_proc= -4
##$NLEV= 6
##$NOISF1= 0
##$NOISF2= 0
##$NSP= 0
##$NTH_PI= 0
##$NZP= 0
##$OFFSET= 16.522
##$PC= 1
##$PHC0= -91.44642
##$PHC1= 22.60144
##$PH_mod= 1
##$PKNL= yes
##$PPARMOD= 0
##$PSCAL= 4
##$PSIGN= 0
##$REVERSE= no
##$SF= 250.13
##$SI= 32768
##$SIGF1= 0
##$SIGF2= 0
##$SINO= 400
##$SIOLD= 32768
##$SREGLST= <1H.DMSO>
##$SSB= 0
##$STSI= 32768
##$STSR= 0
##$SW_p= 5175.98343685301
##$SYMM= 0
##$S_DEV= 0
##$TDeff= 65536
##$TDoff= 0
##$TI= <Analysis number 999999
Compound Code 99
Book Reference 9
Project Code 9>
##$TILT= no
##$TM1= 0
##$TM2= 0
##$TOPLEV= 0
##$USERP1= <user>
##$USERP2= <user>
##$USERP3= <user>
##$USERP4= <user>
##$USERP5= <user>
##$WDW= 1
##$XDIM= 32768
##$YMAX_p= 501924365
##$YMIN_p= -329786
$$ End of Bruker specific parameters
$$ ---------------------------------
##NTUPLES= NMR SPECTRUM
##VAR_NAME=  FREQUENCY,     SPECTRUM/REAL,   SPECTRUM/IMAG
##SYMBOL=    X,             R,               I
##VAR_TYPE=  INDEPENDENT,   DEPENDENT,       DEPENDENT
##VAR_FORM=  AFFN,          ASDF,            ASDF
##VAR_DIM=   32768,         32768,           32768
##UNITS=     HZ,            ARBITRARY UNITS, ARBITRARY UNITS
##FACTOR=    0.157963299565203, 1,           1
##FIRST=     4132.6476996994, 0,             0
##LAST=      -1043.33573715361, 0,           0
##MIN=       -1043.33573715361, -329786,     0
##MAX=       4132.6476996994, 501924365,     0
$$ Real data points
##PAGE= N=1
##DATA TABLE= (X++(R..R)), XYDATA
$$ [...]
26790D25952l7420L6496M6816Q1056Q0148q5444n4033o7377O7241M8413J0625
26779E52473n2969O655n5648L3822L3812J2762L7280q5185j00148R3078J17141
26768E93073o0047l2871q126k4179J7850L5850K7714o5780m368Q1129N8976r2809
26756E26412k68K4697P572P0041p4847j11032L6557J00457J27897l4628k2119
26745F50739l5969L6735M5587n97j1346o7636k3043j5151M811o268R213M0823
26733F27898l5562N9045O7094O421j25771n1510p6827k8803K0428J0222L3550
26722E06185k26l6601L506O6343M4623J9805L198m4728l7324n5947j30694j17
26710C38023N0305J1713P0972J0202o1435j3513L5463P4668j4074K983L2265J9257
$$ plain form
26790 425952 388532 425028 471844 552900 633048 547604 493571 426194 493435 541848 552473
26779 552473 499504 506159 450511 484333 518145 530907 568187 483002 382854 475932 593073
26768 593073 533026 500155 492029 467850 485700 521550 549264 483484 479116 560245 619221 526412
26756 526412 526144 550841 558413 628454 553607 442575 479132 579589 707486 672858 650739
26745 650739 614770 651505 697092 696495 685149 617513 594470 579319 584130 577862 587075 627898
26733 627898 592336 651381 718475 724896 599125 547615 470788 441985 462413 472635 506185
26722 506185 505959 469358 472864 539207 583830 603635 606833 562105 524781 468834 338140 338023
26710 338023 388328 400041 471013 481215 419780 406267 441730 516398 502324 505307 537572 556829
26698E56829N3385l9553n2878J3352l97n2852m5132J4570J9688O1979J837q1175
26686D49653k2449J1837M8193l7481J2404M4747o0876K2187J05519L3885o9398
26675E38221j27839j9578N6613J8384K2634j1525j8668o079L1419O3124J1636
26664E58342K455n736p3414L341l249P2300M9889k3635n8981j11836l3741N5021
26652D30756L3180j51l7628k5997j2549Q23K9725o268m8969L1691L9974k465K7867
26639D59989L2512P5179Q1679q3716q9916K5942N2899p263k8874K9607o3660k8818
26627D55560q2683N4573j134j07667O5535Q3662m3415r6589n6739K5469O3032
26616C59604M1839K8788J4834J18124O8397j594j25712q5286j5391O4632M2566
$$ plain form
26698 556829 610214 570661 517783 531135 530738 477886 432754 447324 467012 528991 530828 449653
26686 449653 427204 439041 487234 449753 462157 506904 446028 468215 573734 607619 538221
26675 538221 410382 390804 447417 465801 488435 476910 458242 452163 483582 546706 558342
26664 558342 560797 555061 481647 484988 481739 554039 603928 580293 521312 409476 375735 430756
26652 430756 463936 463785 426157 400160 387611 388434 418159 411891 362922 394613 434587 432122 459989
26639 459989 492501 567680 649359 565643 475727 501669 554568 547305 518431 548038 484378 455560
26627 455560 372877 427450 426316 318649 384184 467846 424431 327842 271103 296572 359604
26616 359604 401443 430231 445065 563189 631586 629992 504280 418994 403603 468235 510801
26605E10801L364k1399m1754n6593j7034M2652l638o6257P2225j5031j7593k5918
26593C63825K9311n8096p018K3292O173m2549Q7105L8615k9774j6738O1726j6644
26581D39228q4341l4177K4393J4657N0756J7126j48q153L7146j774R211l5494
26569D28430k7764n0122J4326J28834O5096j15697j5470J8336n7750j265M9137
26558D36091k0407r899M1442K913K9711L0225K2453m5578o146o4061n6539K0482
26546C80687K2527k2493n6306J7857K0177K7725K0870Q896l3218k5405l790N3611
26534D11138L196M2399p6104n9981k1054K6195r014K8367P083L3092L0311k073
26522D13555j2839K0740l7612j16266m060J9639L5714J7970L050o115m0383l592
$$ plain form
26605 510801 514165 492766 451012 394419 377385 420037 416399 350142 422367 407336 389743 363825
26593 363825 393136 335040 328022 351314 357487 314938 402043 440658 410884 394146 455872 439228
26581 439228 354887 320710 345103 359760 410516 427642 427494 419341 456487 454713 463924 428430
26569 428430 400666 350544 364870 493704 558800 443103 427633 445969 388219 386954 436091
26558 436091 415684 405785 447227 450140 479851 510076 532529 486951 480805 416744 360205 380687
26546 380687 403214 380721 324415 342272 362449 390174 411044 419940 386722 361317 357527 411138
26534 411138 414334 456733 380629 320648 299594 325789 316775 345142 352225 385317 415628 413555
26522 413555 400716 421456 383844 267578 263518 283157 318871 336841 339891 333776 293393 289801
26510B89801O2490j4374o858j7888j1885j0023k6415l6427n2256L7214Q8554Q1154
26498C83087j1895L2850j8341n9942M3119M0566j4907l4109j30544j8065l2981
26487A78838M9858N0010k1218K2717K7875J7088k4632p0457m6658R512R1607p3806
26475B10734m1175J5901O9457K4274k2832M9730N6049j4319l1678o7602l1810
26464B16729J6627O1726k8477n1886l320l5138n635J12772Q2301q883j15408k5515
26452B15893K3579P1014l897j6898j8706l0825L7285M6966n401p7967N1335J10055
26440D02433m500j2825R072q6410m4799o0698k9289j7537J8353J1214O3399J28482
26428C76895k1843n9664o11o2019L7307K2865J1175K4638o2248l2172M2262m421
$$ plain form
26510 289801 352291 337917 331059 313171 301286 291263 264848 228421 176165 213379 301933 383087
26498 383087 371192 404042 385701 325759 368878 409444 394537 360428 229884 211819 178838
26487 178838 228696 278706 257488 280205 308080 325168 300536 230079 183421 192933 284540 210734
26475 210734 169559 185460 254917 279191 256359 306089 362138 347819 316141 248539 216729
26464 216729 233356 295082 266605 214719 211399 176261 170626 283398 365699 356816 241408 215893
26452 215893 239472 310486 306589 289691 270985 240160 277445 324411 319010 241043 292378 402433
26440 402433 397933 385108 394180 307770 262971 202273 172984 155447 173800 185014 248413 376895
26428 376895 355052 295388 294777 232758 270065 292930 304105 328743 266495 234323 276585 272164
26416B72164l9284M8478L1114r057N2097K3936L5040l5187J5594n453p3021m6587
26404B69834l879j4585m905j2681n4950R082O1112L4845Q8154L2011R227j1870
26392D01395M50q6597o3678J3550P0446J1604j09539J8907k697o2253J7082J48433
26380C57103L5684K0155j7458o9060q755R8434K8808j29796l8192M425k2122O132
26368B65358o5103k591j8397j3487n9998P5665O8601p49m9439N2905M6489k6095
26356B73159j17317J0769O5015J25213K7558l0348L8067m9439j70261r6853N3565
26345A29128J09745J9895J0454J7396m5332Q400r203l1312Q641L7642n7551J3850
26333B11753M1882O2758N459n108j05901N567O0195J3537n4833j07035l1285j5778
$$ plain form
26416 272164 232880 281358 312472 303415 355512 379448 414488 379301 394895 389442 316421 269834
26404 269834 265955 251370 246465 233784 178834 187916 249028 283873 372027 404038 413265 401395
26392 401395 401845 315248 251570 265120 335566 347170 237631 256538 253841 191588 208670 357103
26380 357103 392787 412942 395484 326424 317669 416103 444911 315115 276923 281348 259226 265358
26368 265358 200255 197664 179267 165780 105782 181447 250048 249299 199860 252765 299254 273159
26356 273159 155842 166611 231626 356839 384397 354049 392116 342677 172416 75563 129128
26345 129128 238873 258768 269222 286618 241286 249686 240483 209171 217812 255454 197903 211753
26333 211753 253635 316393 321852 316744 210843 216410 276605 290142 235309 128274 96989 81211
26321H1211L2718O3018j7165k8350N7149L7161q594l2074j5826J199J3653N537
26309A89637L2018L4636K8468K6904o9711j24293M3453L9431J0683N4390j0539
26298B55077n3988o8166N086J0683K6335J2165k6131M525m362k1200m0206j7874
26286H1944L3708J23488J8858M0499Q406j01104p0788K0743N0255k5069q4392
26275I6548P6315K2340m1249k9027N2747N3924K7792K415j7632o369O3491p0635
26263B30660p3653j5947r138J2368R2432l59P2169J2206k8663n8946l6131J3748
26251B10746J8680j2627K422K4282n3136J8376N5917M4229m4635j2689P000M8114
26239C06679q317p4944J6895j7686j196J7932k0754M049J0058J5284n5288j8576
$$ plain form
26321 81211 113929 176947 159782 131432 188581 225742 217148 185074 169248 170447 184100 189637
26309 189637 221655 256291 284759 311663 241952 117659 161112 200543 211226 265616 255077
26298 255077 201089 132923 138009 148692 175027 187192 161061 165586 161224 140024 99818 81944
26286 81944 115652 239140 257998 298497 306903 205799 135011 155754 206009 180940 96548
26275 96548 172863 195203 153954 124927 177674 231598 259390 261805 244173 237804 301295 230660
26263 230660 157007 141060 131922 144290 236722 236363 308532 320738 292075 233129 196998 210746
26251 210746 229426 216799 219221 243503 190367 208743 264660 308889 264254 251565 258565 306679
26239 306679 298362 223418 240313 222627 221431 239363 218609 222658 232716 248000 192712 174136
26227A74136n7343K4308M504j3596k9368P1951Q3008J6915l9733q0952n5184r0768
26215G878m0795P5824J56914M8774L6345j7548j0004r566k7199k4759P836n4817
26203A48883o0852J9439p38J5910K2074P5260L4059N9734Q3476n4274J7220L6365
26191C96556m8784j18170k0640K473n5064o2203j03486L1932j2471o28N6830K3334
26179H9679J03201J16566K5667L214n6300J3533O5447j1239p6879o395K8339m413
26167B90420r205n6240j02808k9137R635m0394J2731J8396l3371k6921M3550O8142
26155A44798R8146p6532l4631P879P784P579J1044k640N1194j0084l4293N4311
26143B24555N874L2384n0668j02374L0278l4666l5081K4762L4004J3428J941m1480
$$ plain form
26227 174136 116793 141101 145605 132009 102641 174592 257600 274515 234782 153830 98646 7878
26215 7878 -32917 42907 199821 248595 284940 267392 257388 247822 220623 195864 203700 148883
26203 148883 88031 107470 106732 122642 144716 219976 254035 313769 397245 342971 360191 396556
26191 396556 347772 229602 208962 211435 156371 94168 -9318 22614 10143 9515 66345 89679
26179 89679 192880 309446 335113 338327 282027 295560 361007 349768 272889 266494 294833 290420
26167 290420 281215 224975 122167 93030 102665 62271 75002 93398 60027 33106 76656 144798
26155 144798 242944 166412 131781 139660 147444 155023 166067 163427 214621 204537 170244 224555
26143 224555 230429 262813 212145 109771 140049 105383 70302 95064 129068 142496 144437 102957
26131A02957o7000K2292K5593k7625M3323N1468O9662J3551N5891l1705j7671
26120B40736m8074J3113N541p9182k9453m003O4172Q217o9031l9985O0291L8462
26108A60804R56M1185q8399l7249m0122J6950L1206r580K9570N043o4723l9539
26096F102L1357J21565K2375j8099k1602j1076K5269L3917k9066j25464m2739
26085g461R9034N4558k7223p3942L2436Q7804P6030K310l8256l2710k710n4360
26073A15510o0419p8073j809J35408L3603l1646j2406k5187o8826K2343m0076
26062a1578q0762N83J07789P4167K8328K4644l1594m5270P4548J3485K8474j101
26050A81713m7052m6212L7639j5614q4806N5683N0027k3050j4071K552N9686K2049
$$ plain form
26131 102957 35957 58249 83842 56217 99540 151008 220670 234221 290112 258407 240736
26120 240736 192662 205775 211316 132134 102681 98678 162850 171067 102036 62051 122342 160804
26108 160804 161760 202945 114546 77297 37175 54125 85331 75751 105321 110364 45641 6102
26096 6102 37459 159024 181399 163300 141698 130622 155891 189808 160742 35278 -7461
26085 -7461 91573 146131 118908 44966 77402 165206 241236 243546 205290 172580 169870 115510
26073 115510 55091 -22982 -24791 110617 144220 112574 100168 74981 6155 28498 -11578
26062 -11578 -92340 -91757 16032 90199 118527 143171 111577 66307 140855 154340 182814 181713
26050 181713 134661 88449 126088 110474 25668 81351 131378 108328 94257 96809 156495 178544
26038A78544q857O675M1168L5760N8754m7495r0643n2093l5971J9638j4988n267
26026H5225M0200L8808J9079K6578L1362N1572q9808l2642m2361J6907R4811k248
26014B37483o1942l7340l6806k2031R7791J9857l6788k4471p7558J4478N2173
26003A24846P1751J2027m482q6829O1287M2000r643j7104k8801p4858J0503o898
25991I3799L5250N2413O987K6665K8908m7317p0298L4177N242P677k3175r659
25979A40669J011m6181j4427m9170L0695J30780L4641j0752o313N43o2246K0674
25967A69924J3321n1175o1333J3858q811K8057l437o2665J0875J3192q692M7413
25955A00527k1504m695k6219p1382k4781L4987R6432P0426l8698k5215M5608J9731
$$ plain form
26038 178544 169687 176362 217530 253290 312044 264549 173906 121813 85842 105480 90492 85225
26026 85225 125425 164233 183312 209890 241252 292824 203016 170374 128013 144920 239731 237483
26014 237483 175541 138201 101395 79364 177155 197012 160224 135753 58195 72673 124846
26003 124846 196597 208624 204142 117313 178600 220600 210957 193853 165052 90194 100697 93799
25991 93799 129049 181462 188449 215114 244022 196705 126407 160584 165826 173503 150328 140669
25979 140669 141680 95499 81072 31902 62597 193377 228018 217266 210953 211496 149250 169924
25967 169924 183245 132070 70737 84595 75784 103841 100404 37739 48614 61806 53114 100527
25955 100527 79023 74328 48109 -23273 -48054 -13067 83365 153791 115093 89878 135486 155217
25943A55217j6057r912M0306N5060j537n3640n9307J0687M9259N9463j3717n187
25931B10635n2991m6664k6158j7386m9472R8108P8380m4581j2952l3882k8413
25920G4624l3832l8657o7443l9961K4163J26593Q4673N2833J0450K9753l5453
25909A87743n2150K0320m3112n0568J1607R0829L6033m4189n1914n2177K6501
25898G8923J31846j9320m6501n4230L3234N4829J1948j753m4598k8893m7555J1584
25886G9514j2446k5629l0205J359Q2724n9747p9461Q7464j9093n0874J15067L3977
25874A22650j3033m355K6985m1393l936k5004K5281K7911j1256O058l3309l4584
25862D2015k2476k3909K6970M4660J9938q83k283N1497N5500J0120k6188m6902
$$ plain form
25943 155217 139160 129248 169554 224614 223077 169437 110130 120817 170076 229539 215822 210635
25931 210635 157644 110980 84822 67436 17964 116072 194452 149871 136919 103037 74624
25920 74624 40792 2135 -65308 -105269 -81106 45487 130160 182993 193443 223196 187743
25909 187743 135593 155913 112801 62233 73840 164669 200702 156513 104599 52422 78923
25898 78923 210769 191449 144948 90718 123952 178781 190729 188976 144378 115485 67930 79514
25886 79514 67068 41439 11234 12593 95317 35570 -43891 43573 24480 -26394 88673 122650
25874 122650 109617 105262 132247 90854 86918 61914 87195 115106 103850 109908 76599 42015
25862 42015 19539 -4370 22600 67260 87198 86315 84032 135529 191029 201149 174961 128059
25850A28059n3817J5768M988j2886N5129L2208l3194m0124j4566j5073k4296K7438
25838F9634j0638m2665k2351K4038m420L9585K3390p0012m595M5386j7243r716
25826B0393R7073J8949K8557P5942M7376L525p3162k7995l52q2032N4068m9974
25814A12368K0911J6201k3041o2268p3360r853j9583j8952M3118N5609n9771j2903
25802c1524N1333j3034l5862l0345Q0254k6163o2479r15Q5919J1100l1347N0544
25790D7481j7490P589l8202n138j5978P312k318K4796K9117J7623O6276M5599
25778A66667n399p7078j404O8069K4036o1392n2536r179J5755p8193l0393N8421
25766A7374N9802K1058K4293j00434j479N5005R1649o4491K6804q8935k9566O7835
$$ plain form
25850 128059 74242 90010 94998 82112 137241 169449 136255 96131 81565 66492 42196 69634
25838 69634 58996 16331 -6020 18018 13598 53183 76573 6561 1966 47352 30109 20393
25826 20393 117466 136415 164972 240914 288290 291815 218653 190658 190306 108274 162342 112368
25814 112368 133279 149480 126439 64171 -9189 -19042 -38625 -57577 -14459 41150 -18621 -31524
25802 -31524 19809 6775 -29087 -59432 20822 -5341 -67820 -68735 17184 28284 -3063 47481
25790 47481 29991 37580 -622 -5760 -21738 -14426 -16744 8052 37169 54792 121068 166667
25778 166667 161268 84190 82786 150855 174891 113499 60963 51784 67539 -10654 -41047 17374
25766 17374 77176 98234 122527 22093 20614 75619 167268 102777 129581 40646 11080 78915
25754G8915K2588Q5251J08448r1796n2913j0931p2382j3725J3622l3278K1095
25743E4894N7325J8114Q101o798P855n1566j3509m6867l9107J7827J7162K6182
25731D9613M2051k0598k2884K7584L6766n409k9751o0917K5906O0011O0277M2187
25719B04836p2102j03596k1605l2604K4692K1374N3272r035j2511k6701m4186
25708a8166j6674j0150M0247N4602M6680K4091o7062L4227Q746m6049O938O5523
25696A22953K0576m1572k443l0387k0489k2678o0892N6590o673m5974K9148J1517
25684I676J756o3720L0410Q9197j2547j4565m6812k1696R6339Q4606K3412m5822
25672A30234k8643k6154L2218k2916m4101k3302L1492m1928o1451k800O0581O5361
$$ plain form
25754 78915 101503 186754 295202 203406 150493 139562 67180 53455 67077 33799 54894
25743 54894 112219 130333 138434 131636 139491 87925 74416 27549 -11558 6269 23431 49613
25731 49613 91664 71066 48182 75766 112532 107123 77372 16455 42361 102372 162649 204836
25719 204836 132734 29138 7533 -25071 -379 20995 74267 65232 52721 26020 -18166
25708 -18166 -34840 -44990 -4743 49859 96539 120630 53568 87795 96541 50492 57430 122953
25696 122953 143529 101957 99514 69127 48638 25960 -34932 21658 14985 -30989 -1841 9676
25684 9676 11432 -52288 -21878 67319 54772 40207 -6605 -28301 68038 152644 176056 130234
25672 130234 101591 75437 107655 84739 40638 17336 48828 6900 -54551 -57351 3230 68591
25660F8591Q6188K3042l7488m8431m8213m570M1903o005q0251m229L9948J8703
25648D9188K2585N5191Q41o6188J8438l3857K0894l0753q771n9769K2399n272
25636a5074L9393l0741l2916o273M4966j1329Q3579j732L3949k2829K4123p674
25624I7442l3260k4204l5006J0613L3212J3942L8927O7319L5949J5918q1643p9586
25612E9623L1201p3336m0156j3231O5131m6116q8683J7053L6798O3222Q0503L0879
25600A22888J1819o0826J4806k6335l2228K7122k2912K2299P1484N7611K2685
25589B08413l3321o7177n2102r942%N5855o90J5482l5812q4031k5262M4726J50514
25576A66653P7990n5663j7672Q48N196l0278j5411n6059K1512M1978m9681k7089
$$ plain form
25660 68591 154779 177821 140333 91902 43689 39119 81022 75017 -5234 -9463 30485 49188
25648 49188 71773 126964 127805 61617 80055 46198 67092 36339 27568 -32201 -9802 -15074
25636 -15074 24319 -6422 -39338 -45611 -645 -11974 71605 69873 103822 80993 105116 97442
25624 97442 64182 39978 4972 15585 48797 62739 101666 168985 204934 220852 139209 59623
25612 59623 90824 17488 -22668 -35899 29232 -16884 -105567 -88514 -51716 11506 92009 122888
25600 122888 134707 73881 88687 62352 30124 57246 34334 56633 128117 185728 208413
25589 208413 175092 107915 55813 45871 45871 101726 101036 116518 80706 -3325 -28587 16139 166653
25576 166653 244643 188980 171308 172156 177352 147074 131663 75604 97116 139094 89413 62324
25564F2324k9167m6491J9744P2618L9531L0267l6660K6537n3123M4890r8018j34827
25552a02375N4387J8757l7566M9227K3611J3281m6693J4230J16851K8722k6553
25541A05879j8300L9113l8309j6985L1351J9050P1210L8459k3870j09236M0017
25530A38379N9306o854o9095j07125p3807M3026R3863M9406j3229K1197J8045
25519A53112l6894l5071J2368O218n7482p7469L48O9273L7970m981M4230N420
25507A17042j32793j05802O0814J01561j6035M3984M5928M3889l783r076j2847
25496A32882k7970p6669o82j8248k0899j416m1569N8856J09451J05206M9128r4028
25484A74042j63435k3171K6316J1979M4578L2690K9877j10055l025O7405j9355
$$ plain form
25564 62324 33157 -13334 6410 79028 118559 148826 112166 138703 85580 130470 32452 -102375
25552 -102375 -47988 -29231 -66797 -17570 6041 19322 -27371 -13141 103710 132432 105879
25541 105879 87579 126692 88383 71398 102749 121799 193009 231468 207598 98362 138379
25530 138379 197685 190831 121736 14611 -59196 -16170 77693 127099 113870 135067 153112
25519 153112 116218 81147 93515 99733 42251 -35218 -34870 34403 72373 67392 111622 117042
25507 117042 -15751 -121553 -60739 40822 24787 68771 114699 158588 154805 145729 132882
25496 132882 104912 28243 27561 9313 -11586 -13002 -54571 4285 113736 218942 268070 174042
25484 174042 10607 -12564 13752 25731 70309 102999 132876 22821 19796 87201 67846
25473F7846L967O7749n9255m6707q2976k7058J5503O2553N7946M680O0351N066
25461A29665m5638l0693l6695J9543J2143r123m5930J1494O5136M6680O1486n9153
25449A18915M229J5823m1519n9050k1604J5352l0257J8467K394O3596l7878m898
25437D3570m2342m0600m2134L017j2612L701L0212J9561k2818J12750N1499K9834
25425A33638M4257l9762j8260j9017J2970p5187l5568j3421J02474J0710P40o7357
25413C6217j04556j7627K9926m3435j3149J8155R3854J36830J21454p0328j39179
25402D8162p1719R205L5684j8270L4427L9888K4002K1213R369k8363m8258L2651
25390H7991J9354J5627L1158j4902k0775k6615L3481J2157p4611j8971l0845j0977
$$ plain form
25473 67846 71813 139562 80307 33600 -49376 -76434 -60931 1622 59568 64248 124599 129665
25461 129665 84027 53334 16639 36182 48325 39202 -6728 4766 69902 116582 178068 118915
25449 118915 123144 138967 97448 38398 16794 32146 1889 20356 22750 86346 48468 43570
25437 43570 1228 -39372 -81506 -78489 -91101 -87400 -57188 -37627 -60445 52305 103804 133638
25425 133638 177895 138133 119873 100856 113826 38639 3071 -10350 92124 102834 103574 36217
25413 36217 -68339 -85966 -56040 -99475 -112624 -94469 -615 136215 257669 187341 48162
25402 48162 -23557 -14352 21332 3062 37489 77377 101379 122592 131961 103598 55340 87991
25390 87991 107345 122972 154130 139228 118453 91838 125319 137476 62865 43894 13049 2072
25378B072O4609M751o3910n1545j7701L1128R6369O8986R633o90r96j02992j12962
25365g3248k7991k395m6124O0268M5572Q4888Q105j0198P4418L0592N4051j09360
25353H8578m5534M6641N7744m7549j0996N1437l6442j6360J6379N956k7699q0834
25341A321l0405n6657j5971P9912N26K6753j1046K8826K7777n3105j7002O4594
25329D5523J25460N2952o7002j08639m2416K4145n270N3216O4998m2286j40764
25318d0083k3942L3543j0463l1268k9570K4805N8951j6378j7852j2066P4179Q7044
25306I6900O0308k5262M54p4181M459Q9013r4452q4469N7185P7594K4252o0722
25294G1079o8640J3195J08201k9326n0382L2021n9225p728m8534n5566M9368O590
$$ plain form
25378 2072 66681 71432 7522 -44023 -61724 -30596 65773 134759 144392 143702 142706 39714 -73248
25365 -73248 -101239 -103634 -149758 -89490 -43918 40970 49075 38877 113295 143887 197938 88578
25353 88578 43044 89685 147429 99880 88884 140321 103879 87519 103898 109854 82155 1321
25341 1321 -29084 -85741 -101712 -21800 -21274 5479 -5567 23259 51036 -2069 -19071 45523
25329 45523 170983 223935 156933 48294 5878 30023 24753 77969 142967 100681 -40083
25318 -40083 -64025 -30482 -40945 -72213 -101783 -76978 -18027 -34405 -52257 -64323 9856 96900
25306 96900 157208 131946 132400 58219 62678 151691 57239 -27230 29955 107549 131801 71079
25294 71079 2439 15634 123835 94509 44127 76148 16923 9195 -39339 -94905 -45537 -38947
25282c8947n0249q639O5716L4089p2179j3386L7770K4168N2772K4565k1608M42
25270C4514J8240m6798K9753L7231O0010j7753n9718j7579K2085m0053m3106k683
25258b5857L4643k9580L4040J2020M3947m1427l4704K3494N6171n5133J6818O0818
25246I5250j1442N954L6169N0724j3238r4419q0267r8480O0718J17057N0205k9318
25234H8913p1358o013j08580J0226O7649J8015j076R758J9014K334J506n2485
25222b2097m9316m9316j9006k5405q2505J09147J51919k9531K4177N4871J6052
25211G8990l9511k7188n198L8162J28306j99p6252m1488l1416n051p4828j0928
25199f6601O4656J00449J4326p2897j9852K3131K7003l9796K631J5610r5855j3216
$$ plain form
25282 -38947 -89196 -97835 -32119 1970 -70209 -83595 -45825 -21657 31115 55680 34072 34514
25270 34514 52754 5956 35709 72940 132950 115197 55479 37900 59985 19932 -23174 -25857
25258 -25857 8786 -20794 13246 25266 69213 27786 -6918 16576 72747 17614 34432 95250
25246 95250 83808 89762 125931 176655 163417 68998 -11269 -109749 -49031 68026 118231 88913
25234 88913 17555 11542 -97038 -86812 -19163 -1148 -2224 7534 26548 28882 30388 -22097
25222 -22097 -71413 -120729 -139735 -165140 -247645 -138498 13421 -16110 8067 62938 78990
25211 78990 39479 12291 7093 45255 173561 173362 97110 55622 24206 19155 -55673 -66601
25199 -66601 -1945 98504 112830 39933 20081 43212 70215 30419 33050 48660 -47195 -60411
25187f0411O3192M533J9933j2117q5389O0701N9544k9327n0798J9073l5439O293
25175d0212K7724j4076R049P8751O3390l4270o3218l3009L4555p651n9340m7307
25163h5614J0556j5119J2799O5762O0961L3156j2288N702j9527J2343n4775J1080
25151B5036j4813n5860O537P5294N6572o5806n688l708n109M6856p8494j05501
25139a24684l8425J5219o90K4490O2008o2475J5353L7613Q465Q4715Q78n390R359
25126B6436L6363J1401o0120j35783l788k3843m2701J18617Q546m5255l3441k7177
25114a70745J0251Q7482J14114J11799j4510j12247N3086Q6182m8426p5576k3680
25103A7730N9158j687j4058l1588j03264m4518M2620l2371j7162M2937j41l4222
$$ plain form
25187 -60411 2781 7314 27247 15130 -70259 -9558 49986 20659 -30139 -11066 -46505 -40212
25175 -40212 -12488 -26564 -17515 61236 124626 90356 27138 -5871 28684 21033 -38307 -85614
25163 -85614 -75058 -90177 -77378 -11616 49345 82501 70213 75915 56388 68731 13956 25036
25151 25036 10223 -45637 -39100 36194 92766 26960 21272 17564 12455 59311 -19183 -124684
25139 -124684 -163109 -147890 -148580 -124090 -62082 -124557 -109204 -71591 -63126 21589 22467 17077 26436
25126 26436 62799 74200 14080 -121703 -125491 -149334 -192035 -73418 -64872 -110127 -143568 -170745
25114 -170745 -160494 -73012 41102 152901 138391 26144 79230 165412 116986 41410 17730
25103 17730 76888 75201 61143 29555 -73709 -118227 -75607 -107978 -125140 -82203 -82344 -116566
25091a16566M5359J29868P7806n9935l8047j5545k3474o4297J9236M1894L7458
25080C3757M2339O5204o789j3439j8081o805l351M0929m2864o5738j5687k0753
25068a1278J9436j1296l3231j4221K4225R1501Q2906j5487m3125n465k2346k3988
25056C7631N1828m1050j6633j9848J1624Q294k5126K2781K5921n5557p8502O9988
25044h649P7199m1636p0303k4156M3017L1556o81K1138N6054K3343l6701p2236
25032b055o566O5595n6361j02386O6198R4054k5255n6298J9138J5271L2478k6560
25020A7253L3755L2178n3940k3522q5647l311N6598K8789k5833M4251m0134k4503
25008d4066M7500K9853J4162m5169j2532M5838M8841r378l9983k942n2376m4151
$$ plain form
25091 -116566 -71207 58661 136467 76532 38485 22940 -534 -64831 -45595 -3701 33757
25080 33757 76096 141300 134511 121072 102991 96186 92835 133764 90900 25162 9475 -11278
25068 -11278 8158 -3138 -36369 -50590 -26365 65136 148042 132555 89430 83965 61619 37631
25056 37631 89459 48409 31776 11928 23552 31846 6720 29501 55422 -135 -78637 -8649
25044 -8649 68550 26914 -43389 -67545 -24528 7028 6347 27485 83539 106882 70181 -2055
25032 -2055 -8621 56974 613 -101773 -35575 58479 33224 -23074 -3936 11335 43813 17253
25020 17253 51008 83186 29246 5724 -79923 -83234 -26636 2153 -23680 20571 -19563 -44066
25008 -44066 3434 33287 47449 2280 -10252 35586 84427 75049 35066 32124 -20252 -64403
24996f4403m2422k1951J30537J49078o7603m6458j8662j05555l6465K9318j718
24985i6304P0815P7086o2140o12j0455M5854k3167j2770L9806n5314n6863m4966
24973a29030L5343N4655K0427L3024L8537K1293k3478k0903m78K2369j4486M98
24961C7771j3037j8278o6149l3815K9826J02932N6243J4709l1415l9858j00217
24950f1288k0930K1443K0562O7584l974j6049j3524M0929j9454q1950j3489R8621
24938A8481Q2844K9939n3141p1725l9783o129M3712M1879j9955k5936K445j4046
24926a1415o4101l5147J6413J56796R6367M1030J7344n4220m0818l3539n3319
24915C5391P614J2429l9218M370j9663M690m4377k9421M9861n7090J3792J7701
$$ plain form
24996 -64403 -106825 -128776 1761 150839 83236 36778 18116 -87439 -123904 -94586 -96304
24985 -96304 -25489 51597 -10543 -11155 -21610 24244 1077 -11693 28113 -27201 -84064 -129030
24973 -129030 -93687 -39032 -18605 14419 52956 74249 50771 29868 29390 51759 37273 37771
24961 37771 24734 6456 -59693 -93508 -63682 39250 95493 110202 78787 38929 -61288
24950 -61288 -82218 -60775 -40213 27371 23397 7348 -6176 34753 15299 -66651 -80140 18481
24938 18481 101325 131264 78123 6398 -33385 -39514 4198 46077 26122 186 2631 -11415
24926 -11415 -75516 -110663 -94250 62546 158913 199943 217287 163067 122249 88710 35391
24915 35391 43005 55434 16216 20586 923 5613 -38764 -68185 -18324 -75414 -61622 -43921
24903d3921n2548R263J00205N4405N0674k6038m7821l1026J6666J21760O0575
24892B12194j04236n3774Q5778n177n8868o5079k9356l9778l5956j3349L1325
24881g6276N441l6126O053P5850J14292q7348K2732k6286j8549K6579j4522n4802
24869f2962l2454n963N4671R244l2074P4049J3259m9654l7749j1562K3430l7618
24857i5383j6071j061M4302K3955m1286J4897P0700j5759k9216L7844L4786n9260
24845c1552K4925M1491K0681p3477o976M7887o4482n7959M5522k498n5827J4077
24833i8188N9359N0148K3846n8330k9608O559M0187N3381L6133J7891q3470k4187
24821f279K614k4892n309n073o3784L3437K0502k6976j0762N3539P3283q850j8893
$$ plain form
24903 -43921 -96469 -87206 12999 67404 118078 92040 44219 13193 29859 151619 212194
24892 212194 107958 54184 139962 134785 75917 10838 -18518 -58296 -94252 -107601 -76276
24881 -76276 -70835 -106961 -100908 -25058 89234 1886 24618 -1668 -20217 6362 -8160 -62962
24869 -62962 -95416 -101379 -46708 -37464 -69538 4511 17770 -31884 -69633 -81195 -57765 -95383
24857 -95383 -111454 -112515 -68213 -44258 -85544 -70647 53 -15706 -44922 -7078 27708 -31552
24845 -31552 -6627 34864 55545 -17932 -24908 22979 -41503 -99462 -53940 -56438 -112265 -98188
24833 -98188 -38829 11319 35165 -23165 -52773 -46214 -6027 47354 83487 101378 17908 -6279
24821 -6279 -3665 -28557 -33866 -38939 -102723 -69286 -48784 -75760 -86522 -32983 40300 31450 12557
24808A2557k6559O0700N6234k2412m7821m4750k8748k6124K1029O5426k7823q6224
24796i4515L0048l248M227j00855K5941M9735N3344k6980R517K9497n9753o4746
24784a47788k8138M8189O0526m9968J7286L9939j9883K1243M8950l8946n3817
24773a02407L3170Q6713O4153o6519n4867N1797K1051k5724O4855n2491o8675
24762d8944p4141O5970L2490O7643m7615N279R3383j7421j07009n7161N5394Q4654
24750E2522p4673l458k3724l1443j6553J9028J2788P4146K5205K3190J1163P903
24738G6094l0885M9620l9238L4906l522n7187N59k3570k2421K4138R651m3205
24726b5060k7629j0913j9222m7643J2028k1556l070P1088N6394l330l9318l6306
$$ plain form
24808 12557 -14002 46698 102932 80520 32699 -12051 -40799 -66923 -45894 19532 -8291 -94515
24796 -94515 -64467 -67715 -63488 -164343 -138402 -88667 -35323 -62303 -52786 -23289 -83042 -147788
24784 -147788 -175926 -127737 -67211 -117179 -99893 -59954 -79837 -58594 -9644 -48590 -102407
24773 -102407 -69237 17476 81629 15110 -39757 12040 33091 7367 72222 19731 -48944
24762 -48944 -123085 -57115 -24625 43018 -4597 682 94065 76644 -30365 -87526 -32132 52522
24750 52522 -22151 -25609 -49333 -80776 -97329 -78301 -65513 8633 33838 57028 68191 76094
24738 76094 45209 94829 55591 90497 86975 29788 30347 6777 -15644 8494 18145 -25060
24726 -25060 -52689 -63602 -82824 -130467 -118439 -139995 -143065 -71977 -15583 -18913 -58231 -94537
24714i4537m972N2488M612q0965J8155J1138m089N2917J1352n4521K3823R0544
24702B5945n796o5395k6173M9751K9076M5281R188L1788k0410n2662Q331M240
24690C3164k4696n606p0871o0139L3488J3371N8897N8810N4470R735r7746J6892
24678A9769j0473k8227K5192j2826m8217j3573L1043l7273l3513k2470L330n9050
24666a86288O1283O9380J4924j0722o36l9023K0264j4106j5242J0656O2137P2766
24654D5393n8026M918K0629R079l1301m1965N9826Q6443j5940j3297j7821n1955
24642d017j9622m7732p8538j6009J42019J00471J4086k993q2778n2214R744K3570
24630a4013O6402m9381m8655N0597j863l800o0207q2620L8298K4424p361J9790
$$ plain form
24714 -94537 -99509 -47021 -42409 -123374 -105219 -94081 -98170 -45253 -33901 -88422 -64599 25945
24702 25945 20149 -45246 -71419 -21668 7408 52689 61877 93665 73255 20593 28924 33164
24690 33164 8468 2862 -68009 -128148 -94660 -81289 -22392 36418 90888 100623 2877 19769
24678 19769 9296 -18931 6261 -6565 -54782 -68355 -37312 -74585 -108098 -130568 -127238 -186288
24666 -186288 -125005 -55625 -40701 -51423 -52059 -91082 -70818 -84924 -100166 -89510 -27373 45393
24654 45393 -12633 -7715 12914 21993 -9308 -51273 8553 94996 79056 65759 47938 -4017
24642 -4017 -23639 -71371 -149909 -165918 -23899 76572 90658 87665 4887 -47327 -37583 -14013
24630 -14013 52389 3008 -45647 4950 3087 -713 -60920 -143540 -105242 -80818 -88179 -68389
24618f8389L339O7500j683r1901j82M2584J6360n4720J4290M5634M8619M6885
24606F8336K5884O641P5632k5666n5542n3246N1026l068p6581l3778L3114P293
24594B0045n3699J3440m0233Q499R0035J2446k9084L1653n3005m7535O279O8208
24582B7049L6601q9449k2454J0923l9913L5396M6884K8329L5577L5850Q7l3349
24570G1531q667Q692n1336n7746J8329N3098j0399q5360l1476J6662K2002R2131
24558C7461m7948J5824M0373r255k9739J8620J00275q2134j13120O5839P3206
24547F9402K804j8007R242j8380M5630l1366j28636j4514Q2432J163N4803L7401
24535I1974o1614p5707l3323N6096m4544M4908O8729K1284j0980o8344m6579j7787
$$ plain form
24618 -68389 -65050 2450 767 -91134 -91316 -48732 -32372 -87092 -72802 -27168 21451 68336
24606 68336 94220 100861 176493 150827 95285 42039 93065 89997 13416 -20362 12752 20045
24594 20045 -33654 -20214 -60447 -51948 38087 50533 21449 53102 97 -47438 -41159 27049
24582 27049 63650 -25799 -48253 -37330 -77243 -41847 5037 33366 68943 104793 104880 71531
24570 71531 62864 71556 20220 -37526 -19197 33901 23502 -61858 -93334 -76672 -54670 37461
24558 37461 -10487 5337 45710 36455 6716 25336 125611 43477 -69643 -3804 69402
24547 69402 72206 54199 63441 45061 90691 59325 -69311 -83825 -1393 -230 54573 91974
24535 91974 30360 -45347 -78670 -22574 -67118 -22210 46519 67803 56823 -11521 -58100 -75887
24523g5887K1192P9095j2083k4328n6659J903p26l5446l7110O1469L931O4794
24511i855k2611l6683M1437M1054J9034j0537j5613p059j00007o9080P3564O880
24499h9476n2872M3557J25035J2661m84O813K3320q505p1371o5500m5293r099
24487a31214K8124L4463m3291P8790R4451L0532k1362j0825O9078j4932o7984
24476D5830p3413J8336j5752n7473M5656K5143q9447l3767l6700P1207Q2964j7797
24464c5213j9192K8693N7509m6585o50N8865m275k4364N9098J4675k5235J0238
24452G3564m5518k4478l5532N3169N1409n2907N112k5815p7331p3894Q1879n896
24440g6238r652k243M0967k6539o3259M1401N9379M1038n0211m8814K5817J3415
$$ plain form
24523 -75887 -54695 24400 12317 -12011 -68670 -66767 -67493 -102939 -140049 -78580 -74649 -9855
24511 -9855 -32466 -69149 -27712 13342 32376 21839 6226 -833 -100840 -169920 -96356 -89476
24499 -89476 -142348 -98791 26244 38905 38421 45234 68554 60049 -11322 -76822 -122115 -131214
24487 -131214 -103090 -68627 -111918 -33128 61323 91855 70493 59668 128746 113814 45830
24476 45830 -27583 -9247 -24999 -82472 -36816 -11673 -101120 -134887 -171587 -100380 -17416 -35213
24464 -35213 -54405 -25712 31797 -14788 -15438 43427 39152 14788 73886 88561 63326 73564
24452 73564 28046 3568 -31964 21205 72614 19707 24819 -996 -78327 -152221 -70342 -76238
24440 -76238 -85890 -88133 -47166 -73705 -136964 -95563 -36184 4854 -45357 -94171 -68354 -54939
24428e4939N5543N9548j242n7184J5554L3730K080j5908K2746Q370M2886n9190
24416E1994j18543N5746L9524K393q149n9673j07792l2193O2977k2455J01388
24405c4783J00421l6138p1006O7653L6945M410p5862j43526m2637M7224M7316
24394i9983p826K0752M3557n3764q1554p647N8185L9933m5781l7939l244O9578
24382a05733N2246L2181q6708N8150N4590r617q8k9087m9775J3759o416R785l9724
24369a06437N0608k6487P170K7420j6475M439L1694l7593r836M534n9402K2938
24357a07427N2592P363l2780J4642j3400l9104l7554M9350J9737Q7250M2930m9129
24345e530q1525q058q9223m9855O9916L5374J0149J5222M9304L5226j4167k7455
$$ plain form
24428 -54939 604 60152 58910 1726 17280 51010 53090 37182 59928 68298 111184 51994
24416 51994 -66549 -10803 28721 31114 22965 -36708 -144500 -176693 -113716 -136171 -34783
24405 -34783 65638 29500 -41506 26147 63092 67502 -8360 -151886 -194523 -147299 -99983
24394 -99983 -107809 -87057 -43500 -97264 -178818 -186465 -128280 -88347 -134128 -172067 -175311 -105733
24382 -105733 -53487 -21306 -108014 -49864 4726 -4891 -4979 -34066 -83841 -70082 -76498 -66713 -106437
24369 -106437 -55829 -82316 -75146 -47726 -64201 -59762 -28068 -65661 -75497 -70963 -130365 -107427
24357 -107427 -54835 -47472 -80252 -65610 -79010 -118114 -155668 -106318 -86581 669 43599 -5530
24345 -5530 -87055 -95113 -184336 -234191 -164275 -128901 -118752 -103530 -54226 -19000 -33167 -60622
24333f0622J8086r329M8154P5299k6210O358k3366l5821l7924K8288m497m7469
24321f9053P0741k0390q3172O5971O9773j4624j14833m9938J0779N7981j541l0726
24309a09032M583N9237r372p8607M2225N5823J5568j2249L5978J1518Q053J5410
24297C9135m4889o8603K1764L7401k8156J6214J5996k1736l1427N3472O5267j4014
24285D0424k8740O282o0105l7443j5111o1603J1807J1168R6619P5665q8209n7461
24273a06707l0053p031R6511Q3985j9433K1392K793K5533l1101l8862O314K8072
24261C1413l5323J2656M9060o0570K6776N7468p1846m8354j5989J0226k2508o7659
24249a34650o78J55262P45m3198L6176K7075n5997l3639k4509n2639j1856j195
$$ plain form
24333 -60622 -42536 -51865 -3711 71588 45378 51736 28370 -7451 -45375 -17087 -21584 -69053
24321 -69053 1688 -18702 -101874 -35903 33870 19246 -95587 -145525 -134746 -76765 -78306 -109032
24309 -109032 -104449 -45212 -54584 -133191 -90966 -35143 -19575 -31824 4154 15672 23725 39135
24297 39135 -5754 -74357 -52593 -15192 -43348 -27134 -11138 -32874 -64301 -10829 54438 40424
24285 40424 11684 17966 -42139 -79582 -94693 -156296 -144489 -133321 -36702 38963 -49246 -106707
24273 -106707 -136760 -143791 -47280 36705 17272 38664 41457 66990 35889 -2973 3341 31413
24261 31413 -3910 8746 57806 -2764 24012 81480 9634 -38720 -54709 -44483 -66991 -134650
24249 -134650 -135328 19934 20679 -22519 13657 40732 -15265 -48904 -73413 -126052 -137908 -139103
24237a39103P9143K2922m1193o5929M4124L6375n0392P5930J07128P8225l7336
24226A09894q8811j0949K6130L3939m668j7395m0187p3586L2447L1734m5789k8378
24214g5619K1042L4893P8866l325j26186j889N0699M0570k6703j634L7539n9641
24202c1388N7341O0740R113p9310j04590l4823K8438L0450n5118q015N8466M4303
24190b4393L8309k724l5064j0199l5778k8053K3347N8624N2409k7478o4670j18182
24178a73852K1057J38694O5617n0204r0566o1866K0383P4415j037L314k0606M2113
24166c2538j7909o035O579l878j615L2393j4874L1269M3273L8616K2410q9379
24154H312j7155k472l7639J5929j00971n5234L8703J747J9404L3351P4455J3072
$$ plain form
24237 -139103 -59960 -37038 -78231 -144160 -100036 -63661 -114053 -38123 69005 147230 109894
24226 109894 21083 10134 36264 70203 65535 48140 7953 -65633 -33186 -1452 -47241 -75619
24214 -75619 -54577 -19684 59182 55857 -70329 -72218 -21519 19051 -7652 -9286 28253 -31388
24202 -31388 25953 86693 95806 16496 -88094 -122917 -94479 -64029 -119147 -127162 -68696 -24393
24190 -24393 13916 11192 -23872 -34071 -69849 -97902 -74555 -15931 36478 9000 -55670 -173852
24178 -173852 -152795 -14101 51516 1312 -89254 -151120 -130737 -56322 -57359 -54045 -74651 -32538
24166 -32538 -50447 -56482 -49903 -53781 -55396 -23003 -37877 -6608 36665 75281 97691 8312
24154 8312 -8843 -11315 -48954 -33025 -133996 -189230 -150527 -148780 -129376 -96025 -21570 -8498
24142h498p3146J9858O7704p1086r1420j3920P6003M7025K3208r8037j01956J0628
24130b13637k1203M9481J26982L3234j01721k8934J6664L4915M4292n794j6409
24119h2130n792m4415k481J620m327n754K4421K5530q1310p9511P566Q4768R9592
24106f2223N2973n8390L9051M9303N46K5183l6795j12058o31O3614j5050N4498
24094B1l2004k891q839m4356K0563o115j1875j449L4718L3934k8065l8394L9231
24081d5521q144n468j6770O9221O3582o8990n1366J202P1549N6852k3942o4658
24069b2453m5310j0656o7023m5686k6265j1052N6606L0631M6330K5198l4870J6520
24057h8030j9545j4986k9206P7697N5169o3269M146M8464n5312N3651J20049M8786
$$ plain form
24142 -8498 -81644 -61786 5918 -65168 -156588 -170508 -94505 -47480 -24272 -122309 -224265 -213637
24130 -213637 -234840 -185359 -58377 -25143 -126864 -155798 -139134 -104219 -59927 -65721 -82130
24119 -82130 -87922 -132337 -134818 -133198 -137525 -143279 -118858 -93328 -174638 -254149 -246583 -161815 -62223
24106 -62223 -9250 -67640 -28589 20714 21260 46443 9648 -102410 -103041 -39427 -54477 21
24094 21 -31983 -34874 -43713 -88069 -67506 -73621 -85496 -86945 -52227 -18293 -46358 -84752 -45521
24081 -45521 -53665 -59133 -75903 -6682 56900 -12090 -63456 -62254 9295 66147 42205 -22453
24069 -22453 -67763 -78419 -145442 -191128 -217393 -228445 -171839 -141208 -94878 -69680 -104550 -88030
24057 -88030 -107575 -122561 -151767 -74070 -18901 -82170 -78024 -29560 -84872 -31221 88828 137614
24045A37614J6254k5451k4672r8680n6731k5276K4722K9423R063M5588J7235r7959
24033d8870o4766M5879k0277m5263R0763P4018k8978p9984m8607O9671M3016j180
24021a4578l2231P4804Q6122J7436q8410k0973r369j27502m8300R5737N0336O5166
24009D8238j7504m2698k0838k4960l9768o4913Q32J68747L7962j5151m2372m5371
23997e7796J3861J0222k4417j7990J04328R7751q0943o6497J2901J7235J6566
23986B5221M2154j4935n7436j5799K1680R684m8896p9355Q4163J4923J9472j19961
23974a19085m0373K6185K8827P5670L6038m6482J8828k8913l7962K1787k549j4546
23962h2575n3137L8349J01720J10413R041l0827o8106q4932O4148k1799m0242
$$ plain form
24045 137614 153868 128417 103745 5065 -51666 -76942 -52220 -22797 -13734 31854 49089 -48870
24033 -48870 -113636 -67757 -88034 -133297 -42534 31484 2506 -77478 -126085 -56414 -13398 -14578
24021 -14578 -46809 27995 114117 131553 43143 22170 12801 -114701 -163001 -67264 -16928 48238
24009 48238 30734 -11964 -32802 -57762 -97530 -162443 -161611 7136 45098 29947 -12425 -57796
23997 -57796 -43935 -33713 -58130 -76120 28208 125959 45016 -21481 -8580 8655 25221
23986 25221 67375 52440 -4996 -20795 885 10569 -38327 -117682 -33519 -18596 876 -119085
23974 -119085 -159458 -133273 -104446 -28776 7262 -39220 -20392 -49305 -87267 -65480 -68029 -82575
23962 -82575 -135712 -97363 4357 114770 123811 92984 24878 -60054 4094 -17705 -57947
23951e7947m5334M2627P3781k5063p4167K0547O9453J3669q512l4061j4183L6926
23939b264M7308M272M1872l5268o2378p4903k4850K5256K9448N034K848j284m2356
23926h7265J4150P8602R044m6261k1260j8704K0675Q972l3417P129M6361k0435
23914d2409j0577M9561L6852N562J9473j7086N5877n4515n4082j36019j9962J2703
23902a54622Q556K5937J8319q9944K1267Q4243J17346n869n3934m7800M6872R084
23890b0545o7021k9231K2444r4j3756J695p4835r3456M764R9674L6262M4985J0257
23877g8857J0152Q1476L1653J6540J792q246p2714m6910N1086M3178k7965l1535
23865c0350O161N9150p678j04314n2255n1513M6222L7597l1092N6536n6683p6176
$$ plain form
23951 -57947 -103281 -60654 13127 -11936 -86103 -65556 3897 17566 9054 -25007 -39190 -2264
23939 -2264 45044 49316 91188 55920 -6458 -81361 -106211 -80955 -51507 -46473 -43625 -44909 -87265
23926 -87265 -73115 5487 14531 -31730 -52990 -71694 -51019 -42047 -75464 -68335 -21974 -42409
23914 -42409 -52986 -3425 33427 38989 58462 41376 97253 42738 -11344 -147363 -167325 -154622
23902 -154622 -146066 -120129 -101810 -191754 -170487 -86244 31102 25233 -28701 -76501 -29629 -20545
23890 -20545 -87566 -116797 -94353 -94447 -108203 -106508 -181343 -274799 -270035 -170361 -134099 -89114 -78857
23877 -78857 -68705 12771 44424 60964 62756 54510 -18204 -65114 -14028 29150 1185 -30350
23865 -30350 -24189 34961 27283 -77031 -129286 -180799 -134577 -96980 -128072 -71536 -128219 -204395
23853b04395O8395n1615K5117K2140o1338L0187L6301j8043p835m4478L5463R7479
23841g2622M0140o7186K8857k923K4930J103J6362J7771j1334K8531p669j2876
23829a6916l3656o5209k0149m2395L1598M4799K7374K6639j770p066J1304K8869
23817a6578j1643m9790n707l280k3468J23435K4058j9318j1139r419k0081k2259
23805d5189P2389k2227n0786M7362p2087j2282j0446j1299n8054j1909J0853K0789
23793a42886J7730L7560Q5494K7735j05934k6875P9535q3877n674O7494J03514
23782E3816N2594k3615o6404p6341r1552j8609Q3347K3733m4034K0218L5551l8172
23770h9468N0025j31k012M7534n909q4297n6709l1588m9126J1504P1779N7256
$$ plain form
23853 -204395 -136000 -187615 -162498 -140358 -201696 -171509 -135208 -153251 -161086 -205564 -170101 -72622
23841 -72622 -32482 -99668 -70811 -73734 -48804 -47701 -31339 -13568 -24902 3629 -4040 -16916
23829 -16916 -50572 -115781 -135930 -178325 -146727 -101928 -74554 -47915 -49685 -56751 -45447 -16578
23817 -16578 -28221 -78011 -83718 -86998 -110466 12969 37027 17709 6570 -2849 -22930 -45189
23805 -45189 27200 4973 -45813 1549 -70538 -82820 -93266 -104565 -162619 -174528 -163675 -142886
23793 -142886 -125156 -87596 -2102 25633 -80301 -107176 -27641 -111518 -117192 -49698 53816
23782 53816 106410 82795 16391 -59950 -151502 -170111 -86764 -63031 -107065 -86847 -51296 -89468
23770 -89468 -39443 -39574 -41586 5948 39 -84258 -140967 -172555 -221681 -210177 -138398 -81142
23758h1142M014L6428J5924J5218q5212o6782K0391Q5475r094K1721L1193o5795
23746g7661P839O7298m7313n2832l3751N2340q705J06757K7210n5987j08836L6622
23734h7019j3422j3367O467P5948J0457n5110O8667K890k1111m9959M6279J3349
23722a5931q5190k8415N6879L4855N3148j2521k2962J639M341k9055k2652k0993
23710h6857o5185J7162J04458n7310m6789O7292P2421O4445L4658P5989k3557
23699A56727l8767j42875N2081Q0219k9575o3476j055l0572p2919j3934K7445
23688g6701N9376n9318l9339R6200J10548j26938k5967M7932N6190n3871j3989
23677b5877k0515k2042O6775P9688M0456l369o724j5380j18515n6892p097P2720
$$ plain form
23758 -81142 -77128 -40700 -24776 -9558 -94770 -161552 -141161 -55686 -64780 -43059 -11866 -77661
23746 -77661 -69822 -2524 -49837 -102669 -136420 -84080 -92785 13972 41182 -14805 -123641 -87019
23734 -87019 -100441 -113808 -107341 -31393 -20936 -76046 -7379 -4489 -25600 -75559 -29280 -15931
23722 -15931 -101121 -129536 -72657 -37802 15346 2825 -20137 -18498 -14157 -43212 -65864 -86857
23710 -86857 -152042 -134880 -30422 -87732 -134521 -67229 5192 69637 104295 180284 156727
23699 156727 117960 -24915 27166 107385 77810 14334 13279 -17293 -90212 -104146 -76701
23688 -76701 -17325 -76643 -115982 -19782 90766 -36172 -62139 -14207 41983 -11888 -25877
23677 -25877 -46392 -68434 -1659 78029 118485 115116 108392 93012 -25503 -82395 -89492 -16772
23665a6772n654j6738J6388o40l9532J9108n3608j02001K9826P7248P8988O5156
23653E1769n3918K3846j07220o1776O345j5939l7131M276Q1884K2276J0740L5815
23641c9033M7131r0864o2968J3871M565j0043R0996J09598j27702q5933L1588
23630a18794J7189J6099P9502q9443k8470O021m6413M4641P9667O3076k9676N9429
23618E2828K143m9988l8405j2059M4247O2893r732j7074n0379m8384l4098r384
23606a07392n8757l8735J12118R4303M5159M536k7884m4064p8762k0682K0269
23595i9891l551j3255N2643m9262J9070N6896j9048M9763M2701k6407o8827m0219
23583i9387L5239l4331k462K2427j4732M5154L7473q7391k2280Q0870j3791k245
$$ plain form
23665 -16772 -22426 -39164 -22776 -23416 -62948 -43840 -97448 -199449 -169623 -92375 -13387 51769
23653 51769 -2149 21697 -85523 -147299 -140954 -156893 -194024 -189748 -107864 -85588 -74848 -39033
23641 -39033 8098 -82766 -145734 -131863 -127298 -137341 -46345 63253 -64449 -150382 -118794
23630 -118794 -101605 -85506 -6004 -95447 -123917 -117896 -164309 -119668 -40001 23075 -6601 52828
23618 52828 54971 4983 -33422 -45481 -1234 61659 51927 34853 -15526 -63910 -98008 -107392
23606 -107392 -166149 -204884 -92766 1537 46696 51232 23348 -20716 -99478 -120160 -99891
23595 -99891 -103442 -116697 -64054 -113316 -94246 -37350 -56398 -6635 36066 9659 -59168 -99387
23583 -99387 -64148 -98479 -100941 -78514 -93246 -48092 -10619 -98010 -120290 -39420 -53211 -55456
23571e5456M9757k0088q763k2666o2418p8247M745L9018L0668O5562R9944O7493
23559A09549k9339r7311K4673j1059j1586K8664l6672k8684O2219p7979j9289
23548h6814N6121N6241J9275J8005o724J2117k954r006n9257l0990Q8541j4807
23536C9748l2338p8755j08036N6590J19107j6999l7878Q823O2121M0173m1090
23525A1466K7513k1658j1498k0482k8044l7354K2744j1664o2904n654N3698Q1865
23513a972K4951K6725k6109n2680M6336J0107m5342L3187L151o9375L9018r893
23501b1896l6026K1879R8116O783q4352N6474K4051m0040n3221l1284j3146k2379
23489i5041r7106L0597M7087O5077p466P1860M4088r1224n8453K0453K7914K8113
$$ plain form
23571 -55456 -5699 -25787 -34550 -57216 -119634 -197881 -193136 -154118 -123450 -57888 42056 109549
23559 109549 80210 -17101 7572 -3487 -15073 13591 -23081 -51765 10454 -67525 -86814
23548 -86814 -30693 25548 44823 62828 56104 68221 65267 56261 -2996 -33986 54555 39748
23536 39748 7410 -71345 -179381 -122791 -3684 -20683 -58561 -49738 12383 52556 11466
23525 11466 38979 17321 5823 -14659 -42703 -80057 -57313 -68977 -131881 -137535 -83837 -1972
23513 -1972 22979 49704 23595 -29085 17251 27358 -17984 15203 18354 -51021 -12003 -21896
23501 -21896 -57922 -36043 62073 68856 -15496 40978 65029 24989 -28232 -59516 -72662 -95041
23489 -95041 -192147 -161550 -114463 -49386 -56852 15008 59096 -32128 -90581 -70128 -42214 -14101
23477a4101M1233n174o0620j5757K7572k5522j9575j8618k241l8383M7797P809
23465g5580k6519R28j0977O3974P5289P1401L9787J634m8494n0419n043m8238
23453a2257Q766j9553j50762l6140N2857J02693K4919K6479J4987o0221j7410
23442f5642k4651K1789J2019J9120l1681p156O6638l5452q4122L3867k809l0622
23430a28702J8531R2991K6715l2056r996L6101k7841q3088J9986O8236o678k3883
23418d9684k4886N6554L3643l7514j9429k2283N2104p0268p5494J6642L2076j4834
23406a23373l4787J1085k6989J4196J0501O4382P5173J3016n697r420k8175Q8312
23394D8224J8194o6387r5876l4106K423J5525R2700K6402m6423K8364m5166j203
$$ plain form
23477 -14101 27132 21958 -38662 -54419 -26847 -52369 -71944 -90562 -92803 -131186 -83389 -75580
23465 -75580 -102099 -101171 -112148 -48174 27115 98516 138303 139937 91443 41024 35981 -12257
23453 -12257 -3491 -23044 -173806 -209946 -157089 -54396 -29477 -2998 11989 -48232 -65642
23442 -65642 -90293 -68504 -56485 -37365 -69046 -76202 -9564 -45016 -129138 -95271 -98080 -128702
23430 -128702 -110171 -17180 9535 -22521 -32517 3584 -24257 -107345 -87359 -19123 -25801 -49684
23418 -49684 -74570 -18016 15627 -21887 -41316 -63599 -11495 -81763 -157257 -140615 -108539 -123373
23406 -123373 -158160 -147075 -174064 -159868 -149367 -84985 -9812 3204 -2493 -11913 -40088 48224
23394 48224 66418 31 -95845 -129951 -127528 -112003 -19303 7099 -39324 -10960 -56126 -57329
23382e7329k5577R145m0856n7038m5954L1784k6027K181P1420J39827L6669r3188
23370e4943o9918J2303O0761K3578j6914K4967P4068J688j18214J8032L8858M569
23358a165M585n2781j6879k0427J4386K9868J4541M8836K4964p5916r5706p253
23346a32947K5381R9194j2141n9961P2091N1318q8494n7251r280M914l9895N9081
23334h7990M7310n4939l4393O7117J31106l0635J8979k2558L658n0789N3912J5556
23322E6334O7325o4079n1600N2096Q0415O0312k1424q0598m1847o6849l5237N7943
23310A2791L0246j4547o2501K1850j079L6561K6107l1263L4756q874l3455J1729
23298B2321l6221n8079L3263L2931L0909M0149n9778j7254L1907n0463k5742k6554
$$ plain form
23382 -57329 -82906 -73761 -114617 -171655 -217609 -185825 -211852 -209671 -138251 1576 38245 -54943
23370 -54943 -124861 -112558 -51797 -28219 -45133 -20166 53902 55590 -62624 -44592 -5734 -1165
23358 -1165 3420 -49361 -66240 -86667 -72281 -42413 -27872 20964 45928 -29988 -125694 -132947
23346 -132947 -107566 -8372 -20513 -80474 -8383 42935 -45559 -102810 -112090 -107176 -147071 -87990
23334 -87990 -40680 -95619 -130012 -62895 68211 37576 56555 33997 37655 -13134 40778 56334
23322 56334 123659 59580 7980 60076 140491 200803 179379 98781 56934 -9915 -45152 12791
23310 12791 43037 28490 -34011 -12161 -13240 23321 49428 18165 52921 44047 10592 22321
23298 22321 -13900 -71979 -38716 -5785 25124 65273 5495 -11759 20148 -30315 -56057 -82611
23286h2611M2856k8851l3343n4647J3383L8722L7648l4738l9788L1981j4071k8642
23274a52101j1522P7098O5036n2597l6540j0205m7291Q8721R6755K6071j0819
23263C2606j42076q2700R707Q3360R9067O2227o7094n6033r108J9465M1798j1376
23251b0157J440K0466m0334k2445l6690l8183J2587L732N9829j0878j29456P7903
23239a22186J08675K008O071l5175j01036o0541L1720K0274J051J7037Q5522L5478
23227a1102R441j43473o3223N1665L650k181J23866M8929N5456m6093j04692L9034
23215c8723o0182J804M0515j4374O652j7662O60K4779M3945J1023j1042l0654
23203d3259l1260P0180l6811p9074M0171M2588L6729m7850j8033l177N598M6539
$$ plain form
23286 -82611 -39755 -68606 -101949 -156596 -143213 -104491 -66843 -101581 -141369 -109388 -123459 -152101
23274 -152101 -163623 -86525 -21489 -74086 -110626 -120831 -168122 -79401 17354 43425 32606
23263 32606 -109470 -192170 -182463 -99103 -36 62191 -4903 -60936 -70044 -50579 -8781 -20157
23251 -20157 -18717 1749 -38585 -61030 -97720 -135903 -123316 -119584 -59755 -70633 -200089 -122186
23239 -122186 -13511 -11503 -5432 -40607 -141643 -202184 -170464 -150190 -149139 -132102 -46580 -11102
23227 -11102 -1661 -145134 -208357 -156692 -153042 -155223 -31357 17572 73028 26935 -77757 -38723
23215 -38723 -98905 -97101 -56586 -70960 -64308 -81970 -81310 -56531 -12586 -1563 -12605 -43259
23203 -43259 -74519 -4339 -41150 -120224 -80053 -37465 -736 -48586 -66619 -69796 -64198 -17659
23191a7659p929j1088n531j9142L1987j5032J4663r233J5094M4589l6292j1277
23179b6850m6368o4089k6062p1027N1645N4694M0993P2576R323j31864j15202
23168b52231j5405K1269N4260P5777N7536o8938n8918Q8634Q9378k0461l1372
23157f0471n2288m7333P6449L7544L7635l1961l8127O4673M193K6281M6822j9544
23145D3873k5445O1543n132p5537j9940L8182k0684p8058r6049n4484m1594N5794
23133b17531J37633J1953j9852l5100J4041N5090L7936m8191K1500N932J552k7639
23121f2676M7496R567n1733m8391N5819N0160M0657K192J547L333n0023Q270J5732
23108B1950m6066N2287n2664K0512O132n9531O343N0693O740p2701k3869l8163
$$ plain form
23191 -17659 -25588 -36676 -42207 -61349 -29362 -44394 -29731 -38964 -23870 20719 -15573 -26850
23179 -26850 -73218 -137307 -163369 -234396 -182751 -128057 -87064 -14488 -5165 -137029 -252231
23168 -252231 -267636 -246367 -192107 -116330 -58794 -127732 -186650 -98016 -8638 -29099 -60471
23157 -60471 -112759 -160092 -83643 -46099 -8464 -40425 -78552 -13879 -9686 16595 63417 43873
23145 43873 18428 79971 74839 -698 -20638 17544 -3140 -81198 -177247 -231731 -273325 -217531
23133 -217531 -79898 -67945 -87797 -122897 -108856 -53766 -15830 -64021 -42521 -36589 -35037 -62676
23121 -62676 -15180 -5613 -57346 -105737 -49918 242 40899 43091 44638 47971 -2052 6218 21950
23108 21950 -24116 28171 -24493 -3981 2151 -57380 -51037 -344 6396 -66305 -90174 -128337
23096a28337l233L5651l1767Q28Q1342k9155k3088o3416J6147r210p0943n8663
23084b83844K5380J20700N7243p2630n2783L8418L2391K4261Q6151M8763m3992
23073a9942l6115L2831o7841n4158J8884N0759R135n8822L6346N1703K1485m2045
23061e7780j7620K3381r3514n9109J4385P1784L5041K447m6802q871P779K1828
23049a07051M9202J4478K5481J0658k5985J528L9910N9791l8464j00749j4080
23038h5281M0073J567J2273L0057P8451O6714j0591r0624m4501m5208k2545N1050
23026a8565k7942m1194K2959k4940m3033l1194j9103k4762K4066O4526L5350M7263
23014c6569J13793K5152o3497n8940K4968j9270M0144j00617o3570l4146K5505
$$ plain form
23096 -128337 -131570 -95919 -127686 -126858 -45516 -74671 -97759 -161175 -145028 -154238 -225181 -283844
23084 -283844 -258464 -137764 -80521 -153151 -205934 -167516 -135125 -110864 -24713 24050 -19942
23073 -19942 -56057 -23226 -91067 -145225 -126341 -75582 -66447 -125269 -88923 -37220 -15735 -57780
23061 -57780 -75400 -52019 -145533 -204642 -190257 -118473 -83432 -80985 -127787 -136658 -128879 -107051
23049 -107051 -57849 -43371 -17890 -7232 -33217 -31689 8221 68012 29548 -71201 -85281
23038 -85281 -45208 -43641 -31368 -1311 77140 143854 133263 42639 -1862 -47070 -69615 -18565
23026 -18565 -46507 -87701 -64742 -89682 -132715 -163909 -183012 -207774 -183708 -119182 -83832 -36569
23014 -36569 77224 102376 38879 -20061 4907 -14363 25781 -74836 -138406 -172552 -147047
23003a47047R2436j5117K2275P1688M6765j11919o4106l5207J8070J04178n7792
22992g5776l7346l293L8378j1690O8515P1084n4409j6220L2627K88j8602O8964
22980F2520N8160l5597J9099L7307o7598o9158l202j0414j5577o7843o189N5582
22968d2910J6449M212l9825q972K3773j437R0550K3656J926J886p475n7257j18531
22955a13955N207J8587M975P0389L8147P6397L8328n6371l2273k0515j02587l9857
22943a13528l2546k9026K5552p4774L2631Q1025J15266L6137R949J9086k1502
22932D8270m6035q6604J6211j3820J8768l7087l3635M4452J03525l6855K3329
22921E19j4119p7778N06J0839N4594J8480l6591q4625Q2458P1467r7806q5512
$$ plain form
23003 -147047 -54611 -69728 -47453 24235 71000 -40919 -105025 -140232 -122162 -17984 -75776
22992 -75776 -113122 -116415 -78037 -89727 -21212 49872 -4537 -20757 11870 12158 -6444 62520
22980 62520 120680 85083 104182 141489 73891 4733 1531 -8883 -24460 -92303 -98492 -42910
22968 -42910 -26461 -22249 -62074 -71046 -47273 -48710 41840 65496 67422 69308 61833 4576 -113955
22955 -113955 -108748 -90161 -85186 -14797 23350 99747 138075 81704 49431 28916 -73671 -113528
22943 -113528 -146074 -175100 -149548 -224322 -191691 -110666 4600 40737 50686 69772 48270
22932 48270 2235 -84369 -68158 -81978 -63210 -100297 -133932 -89480 14045 -22810 519
22921 519 -13600 -91378 -90872 -80033 -25439 -6959 -43550 -128175 -45717 25750 -72056 -157568
22909a57568M2854K8903J5463o0270O2798J05587N9943l2019p5444J7350j9068
22898a1471L3502j8012O8840O7978l0973q8122k4290M459J3123N7402j02945o8858
22886i9367l4455j6243O9295o5330n4544K3213J4949o4204q1393N99N3888O8746
22874a84846K9649J4814K3478N614L4111K7232J4384m9577n3095L3579P4973P1120
22862D1436O0977p4618n8991n9942O1637M7539N2046Q492n9550L84j235m6918
22850b8743o8210R24M6866L2665P3293m8529p1151m255k1448m3411J8163L8821
22838g5015M8422Q559j9911M832O7272K1115l5807l1849j0630J11030K2609M5297
22826A55924m5666j17906R197O711q5858j4009J17989l5158p2726J8508J5476
$$ plain form
22909 -157568 -114714 -85811 -70348 -130618 -67820 37767 97710 65691 -9753 7597 -11471
22898 -11471 22031 4019 72859 140837 109864 21742 -2548 1911 15034 72436 -30509 -99367
22886 -99367 -133822 -150065 -80770 -146100 -200644 -177431 -162482 -226686 -308079 -307480 -253592 -184846
22874 -184846 -155197 -140383 -116905 -111291 -77180 -49948 -35564 -85141 -138236 -104657 -29684 41436
22862 41436 102413 27795 -31196 -91138 -29501 18038 70084 78576 19026 19410 18175 -28743
22850 -28743 -96953 -96029 -49163 -16498 56795 8266 -62885 -67140 -88588 -131999 -113836 -75015
22838 -75015 -26593 -18034 -37945 -33113 34159 55274 19467 -12382 -23012 88018 110627 155924
22826 155924 110258 -7648 1549 8260 -77598 -91607 26382 -8776 -81502 -62994 -47518
22815d7518l954M9174N564m5989L0709n1495o3749q467P3822J381j0923m0464
22803a11909o45M7972J3372l2052m4452o693q900o6916n911M4079P0112L6558
22791f5385r3719j5809M6084P803K6148J02589N3995m6871j20094n0986J5642
22780a40603R2084M2116N6133K1966j4745m6190j22277p9473J2831N6432P1950
22769d9776O5682P645N5434k8441J5465R0701J3432j36271j03860O484P3537m0902
22757c0870n9491j01411N8737L6320n591j4392K0336R6948N183N6773K1502n4961
22745B9083j04271n4594j1430Q922J0319L1608K0833k0658j2477L509o6092J2862
22733a52386L5904N4191J983r0390j21620L7756N9860R300k9215P7337J03785
$$ plain form
22815 -47518 -51472 -2298 3266 -42723 -12014 -63509 -127258 -135725 -61903 -60522 -71445 -111909
22803 -111909 -112554 -64582 -51210 -83262 -127714 -134407 -143307 -210223 -216134 -172055 -101943 -65385
22791 -65385 -159104 -174913 -128829 -121026 -94878 7711 61706 14835 -105259 -156245 -140603
22780 -140603 -48519 -6403 49730 71696 56951 10761 -111516 -190989 -178158 -121726 -49776
22769 -49776 15906 23551 78985 50544 66009 156710 170142 33871 -69989 -63505 10032 -30870
22757 -30870 -90361 -191772 -133035 -96715 -102306 -116698 -96362 586 5769 62542 84044 29083
22745 29083 -75188 -129782 -141212 -132290 -121971 -90363 -69530 -90188 -102665 -99156 -165248 -152386
22733 -152386 -116482 -62291 -60308 -150698 -272318 -234562 -174702 -165402 -194617 -117280 -13495
22722a3495J5528K773P048K0424l1615p427M6645J8012J6259j7177p2966J6228
22710B37K4914j3420j32974j7877N5090N4599l1196m4305M4514N3551k7966p7778
22698a12611l0651J8166O1520M1619M971O7880N4386K5405M19j33303o2484Q251
22686e6432j1819L1688L0617N4427J8459q7917p7662k442l2987o3643q319J9796
22674a86234O5766j5487N8471M3932N0993q5469J2189K270n0382n3033q285Q978
22662a56291O6184N5712N8162O197l0962J0679L5033J37l1223J7277N2817K6253
22650A09975m875k7959k4368l7239j8403p1825k204j0133j2952m8786K707L1774
22638a14288K7165o9317m5717L4040P6433J2021m5124R3132J8884l6074K363M9475
$$ plain form
22722 -13495 2033 4806 11854 32278 663 -6764 39881 57893 74152 56975 -15991 237
22710 237 25151 11731 -121243 -139120 -84030 -29431 -60627 -104932 -60418 -6867 -34833 -112611
22698 -112611 -143262 -125096 -63576 -21957 -16986 50894 105280 130685 131104 -2199 -64683 -56432
22686 -56432 -68251 -36563 -5946 48481 66940 -20977 -98639 -101081 -134068 -197711 -206030 -186234
22674 -186234 -120468 -135955 -77484 -33552 17441 -68028 -55839 -53569 -103951 -156984 -165269 -156291
22662 -156291 -90107 -34395 23767 29964 -998 9681 44714 44851 13628 30905 83722 109975
22650 109975 105100 77141 52773 15534 -2869 -74694 -76898 -87031 -99983 -148769 -146062 -114288
22638 -114288 -87123 -156440 -202157 -168117 -91684 -79663 -124787 -31655 -12771 -48845 -46482 2993
22626B993L1093R935q0427j01973J4597j8577M6425K6542p975j05046j2007M5283
22614a49137Q09m7587m080Q7392J01501K3884o8121q2307K8360M3489M6534M6032
22602B6769l1801K0138O2993k2166j6965p1284j48882m1107P295k865J00740J05537
22590a1598L5423n8637k0837l0940k8419R1308P3224P759m4677r8888K1701j223
22578f5804J443m623O350j3032k5431R830J01679N1845o9653R9534J319j05743
22566a2286r3204q8277j323J8025J04548M3858K4545k3782n9284K9831j1932J2833
22554e6448l4853j2010K2543k2092l0322J388j5296J9370p418M9410L1895m847
22542e8680J6725J19880J949k823j29284j02162K4939L6721j7513J1645N5083
$$ plain form
22626 2993 34086 44021 -36406 -138379 -123782 -142359 -95934 -69392 -77367 -182413 -194420 -149137
22614 -149137 -148328 -195915 -199995 -112603 -11102 12782 -55339 -137646 -109286 -65797 -19263 26769
22602 26769 -5032 15106 78099 55933 38968 -32316 -181198 -222305 -215010 -217875 -117135 -11598
22590 -11598 23825 -34812 -55649 -86589 -115008 -23700 49524 57283 12606 -86282 -64581 -65804
22578 -65804 -64361 -68984 -62634 -75666 -101097 -91267 10412 62257 -7396 92138 93457 -12286
22566 -12286 -105490 -193767 -195090 -177065 -72517 -28659 -4114 -27896 -87180 -57349 -69281 -56448
22554 -56448 -91301 -103311 -80768 -102860 -133182 -131794 -147090 -127720 -135138 -85728 -53833 -58680
22542 -58680 -41955 77925 79874 77051 -52233 -154395 -129456 -92735 -110248 -98603 -43520
22531d3520N4600m6773j01595k0933K8240k2953o0540M7227P5358k5249l4598
22520a50736K1213J13345r05q717q9M7786k7369p255K1735n6425k0367L349j7033
22507h1468J8202M0265N6489K688l6655p209M1434q4999k3333j0087K0330L4458
22495b9885k0489j5039L981m1990m9367j5967J16941J4372P503K0343m2629p0779
22483a23005J7926l8647P1809l2172J5424k0488j9090N0817P9478N177r0055l5955
22471a18781p5776N0544K7098j9520k583K2159P2492k270M4832q7205k3944L6786
22459g6168P6704M0941k2499p1543o0528N9674J7487K9389k51m0592j18171o0712
22447b26269L2733K9250J414o632N4112L1551N8534q592j3133l404J5222n6321
$$ plain form
22531 -43520 11080 -35693 -137288 -158221 -129981 -152934 -213474 -166247 -90889 -116138 -150736
22520 -150736 -129523 -16178 -17083 -25800 -25889 21897 -5472 -12727 9008 -47417 -67784 -64435 -81468
22507 -81468 -63266 -23001 33488 36176 -479 -7688 33746 -51253 -74586 -84673 -64343 -29885
22495 -29885 -50374 -65413 -61432 -103422 -152789 -168756 -51815 -37443 -29940 -9597 -52226 -123005
22483 -123005 -105079 -143726 -71917 -104089 -88665 -109153 -128243 -77426 2052 7229 -82826 -118781
22471 -118781 -194557 -144013 -116915 -136435 -139018 -116859 -44367 -46637 -1805 -89010 -112954 -76168
22459 -76168 536 41477 18978 -52565 -113093 -53419 -35932 -6543 -6794 -47386 -165557 -226269
22447 -226269 -193536 -164286 -162872 -169504 -115392 -83841 -25307 -33899 -47032 -50436 -35214 -91535
22435i1535q75K2190j0095J4129l3834m7336O1760N9101j060M0662k5758r588
22423b2239q626o6248m0522P0801O9061l2894j6603m853N573j1091K226N118K2866
22410b7431P272o3133N0656P2531k4473J4547j28064o8615N3238M4001l8528M8955
22398e9044L8462R255l0354L7017j00503L5330L7477L5878K9414o4638Q060J4731
22386h915q451j07807M7612J19666L4332J5694r669r6810q9623k5856l2668O3645
22374i8850K7186P4450l4585q1895j4005j2724K5873N3549j4381L4933N7562K1561
22362C8674K3546l871o3899o1268O622j1178J3020K6265O4434m6256Q298M7812
22350D2199o1086n4668m0727j0258J9086J2595M1053Q5316L806m4900m561M1289
$$ plain form
22435 -91535 -92410 -70220 -80315 -66186 -100020 -147356 -85596 -26495 -27555 13107 -12651 -22239
22423 -22239 -30865 -97113 -137635 -66834 2227 -30667 -47270 -52123 -46550 -57641 -55415 -50297 -27431
22410 -27431 -20159 -83292 -32636 39895 15422 29969 -98095 -166710 -113472 -69471 -107999 -59044
22398 -59044 -20582 -11327 -41681 -4664 -105167 -69837 -32360 3518 32932 -31706 -23646 -8915
22386 -8915 -17366 -125173 -77561 42105 76437 92131 82462 -14348 -103971 -129827 -162495 -98850
22374 -98850 -71664 2786 -31799 -113694 -127699 -140423 -114550 -61001 -75382 -40449 17113 38674
22362 38674 62220 58349 -5550 -66818 -60196 -71374 -58354 -32089 32345 -13911 -5613 42199
22350 42199 -18887 -73555 -114282 -124540 -105454 -92859 -51806 33510 37316 -7584 -12145 29144
22338B9144J250j5425j3608l5766N8925k1265j4524J3129K0178k9758n113N150
22326g683k8611p4272n2100R409L1684n4122k3665o0027M5344J40676K5915J5627
22314c1825L8389j2561L4354j3888k7399l0175j9522M0170J00980k8094m8191
22303B238k2345q034M5418J5432L1j291p8523l7561o2737q89P7312K8210N9444
22290A6705J194n0382k7669k3401K7855N5502n9841k7574k7226L2953N2107l581
22278c3358Q582O3771L2461k8930p1461q2638L4205O5153l8984K0454j6512k1942
22266f9199P1692N5955N9363K5316r354r0459n3738J4358R459j2118M8017l9686
22254I606q8613L2580K9365m5159O7348Q508j04425r5222J5396O0986M7025L7081
$$ plain form
22338 29144 30394 14969 1361 -34405 24520 3255 -11269 1860 22038 -7720 -12833 -7683
22326 -7683 -36294 -110566 -162666 -153257 -121573 -175695 -199360 -259387 -214043 -73367 -47452 -31825
22314 -31825 6564 -5997 28357 14469 -12930 -43105 -62627 -22457 78523 50429 2238
22303 2238 -20107 -28141 17277 32709 32740 31449 -47074 -84635 -147372 -148261 -70949 -42739 16705
22290 16705 17899 -32483 -60152 -83553 -55698 -196 -60037 -87611 -114837 -81884 -29777 -33358
22278 -33358 -24776 38995 71456 42526 -28935 -111573 -77368 -12215 -51199 -30745 -47257 -69199
22266 -69199 2493 58448 117811 143127 133773 43314 -10424 3934 13393 1275 49292 9606
22254 9606 -79007 -46427 -17062 -62221 5127 13635 -90790 -186012 -170616 -109630 -62605 -25524
22242b5524m046j00424j8409k798P8695J15129l8435j38169o1595L9740J17348
22231c8488N7189k0080k0412L0770K8055l769j1984L1859J1390m0258O0794n0460
22219C4606j3791n050j52526l7330P9296K0875m3051M1224J3899q5124m2572N0514
22207a39030o2514Q698O7251M3503J0275k1946M9405K9272p5999p622M9982j0766
22195e9491O2034N8291l5391j8825k7161q1970J27513J46603o3715k8961k3382
22184E5545l6033m3234q8549K9011j3153l9394k4138q049O2475K3873l312l6806
22172a21764O2586L7108j6692J6464k7450j13558k2244J00453k1006J5494M1622
22161d8987l1856J6346O2395K4930j2889j3592o5604K7020J12680k8698l7247
$$ plain form
22242 -25524 -29570 -129994 -148403 -151201 -72506 42623 4188 -133981 -195576 -155836 -38488
22231 -38488 18701 -1379 -21791 8979 37034 33265 21281 53140 64530 24272 85066 34606
22219 34606 20815 15765 -136761 -174091 -94795 -73920 -116971 -75747 -61848 -146972 -189544 -139030
22207 -139030 -201544 -192846 -125595 -82092 -71817 -93763 -44358 -15086 -91085 -98707 -48725 -59491
22195 -59491 2543 60834 25443 6618 -20543 -102513 25000 171603 107888 78927 55545
22184 55545 19512 -23722 -112271 -83260 -96413 -135807 -159945 -167994 -105519 -81646 -84958 -121764
22172 -121764 -59178 -22070 -38762 -22298 -49748 -163306 -185550 -85097 -106103 -90609 -48987
22161 -48987 -80843 -64497 -2102 22828 9939 -3653 -69257 -42237 70443 41745 4498
22150D498l8934k1742n0448O1392L0345N4039p0346M5108K8432m794j0438M74
22138B7586N8147o1341k3667J9203K1637K1991k0364m2738l2958j3357N079J1768
22126b9014m2558k7702R647M5376j9516n7691J1154O2023n0532Q55j0670o4606
22114a73234l3572O5575R5352k8302m0971K2962P375K6742N1310K1918q469l9911
22102c3225q5221p0808k2304M1873N1540J27482k4044j9000J581k3563n7541Q1962
22090c1268L7632L9269k8526L8995m4882q4464J5783k7135l8766J3670k9381j14056
22078b53129K1747R7810R9761j07612m733J08376j7780r1011K039l293o2786J3775
22066a96836J01662P0871N8843o0822l7833L1350O8138n5229k449o3645n0538
$$ plain form
22150 4498 -34436 -56178 -106626 -45234 -14889 39150 -31196 13912 42344 37550 27112 27586
22138 27586 85733 24392 725 19928 41565 63556 43192 454 -32504 -45861 -40782 -29014
22126 -29014 -71572 -99274 -89627 -44251 -63767 -121458 -110304 -48281 -98813 -97958 -108628 -173234
22114 -173234 -206806 -141231 -45879 -74181 -115152 -92190 -84815 -58073 -6763 15155 6686 -33225
22102 -33225 -118446 -189254 -211558 -169685 -118145 9337 -14707 -33707 -32126 -55689 -113230 -31268
22090 -31268 6364 45633 17107 56102 11220 -73244 -57461 -84596 -123362 -109692 -139073 -253129
22078 -253129 -231382 -133572 -33811 -141423 -146156 -37780 -55560 -146571 -144532 -147825 -210611 -196836
22066 -196836 -95174 -24303 34540 -26282 -64115 -32765 35373 -19856 -22305 -85950 -136488
22055a36488L3880o3988L1172P9984M8860l9873k3491N1076m462p9848J8679L4930
22043d9569o5680L272j8481M7892O708m133J3859J7145j1418j2908j2008o3726
22031a49047r5053p256J55492N8723J3093L382m6335M5499M902o0945M0196Q2468
22019D5119R3126m519q2789j3515k6031L148o307o666J17304k9011p2901N3382
22007G0340O4634m2103o3640j23484l4182k46L2107O7118J1264J7629o166J8905
21995A2176N2039J4281m1159p3224m4827J1056j2682P726N0474j7753L301l9013
21983g7605j8446N3859L7510k8298o951P3260R009j09233j6575j2900q0495m8172
21971b25037N7549L2168m909N4063P2502K1921n103j6540j7189n7830N5298M1648
$$ plain form
22055 -136488 -102608 -166596 -135424 -55440 -6580 -46453 -69944 -18868 -23330 -103178 -84499 -49569
22043 -49569 -115249 -111977 -130458 -82566 -75858 -79991 -66132 -48987 -60405 -73313 -85321 -149047
22031 -149047 -244100 -251356 -95864 -37141 -24048 -20666 -67001 -21502 -16600 -77545 -37349 45119
22019 45119 138245 133726 50937 37422 11391 14539 8232 1566 118870 89859 16958 70340
22007 70340 134974 92871 29231 -94253 -128435 -128681 -96574 -29456 -18192 -563 -6729 12176
21995 12176 64215 78496 37337 -35887 -80714 -69658 -82340 -74614 -24140 -41893 -38592 -77605
21983 -77605 -96051 -42192 -4682 -32980 -39931 33329 42338 -66895 -83470 -96370 -176865 -225037
21971 -225037 -167488 -135320 -140229 -86166 -13664 8257 3154 -13386 -30575 -88405 -33107 8541
21959H541o2661p0557j9942N8453M997J278j4461p0671M4548P1958M1772J00572
21947I3827M309J5944q668l5272r27q9995o688M4195n9774n7807K6842N7462J580
21934a4972l8832K6192M7137Q4638Q7793J1923q4271l7800o0944l1792j9552M1719
21922A1239O5524r019n91J2014k089p3897j8020K3712L8224K3836P231P1865O7726
21909B17755K2387K2066Q5208O3175O2956N5432j9779J08310J11678j109p5612
21898F52467l9185k7051p4638j41762p8909P028j41067q524k7033k6722m7949
21887D6655K556M1955O6309l9027l6406O1697K4404m6257K480l5581n0253L1101
21875F9633N314k7643Q957j11817r6920P5338R0580O2667L7412m0662p7212k8580
$$ plain form
21959 8541 -54120 -124677 -144619 -86166 -81169 -79891 -94352 -165023 -120475 -48517 -6745 93827
21947 93827 98136 114080 105412 70140 69213 -20782 -27470 16725 -43049 -100856 -74014 -16552 -14972
21934 -14972 -53804 -27612 19525 104163 191956 203879 119608 81808 20864 -10928 -30480 11239
21922 11239 76763 67744 67153 79167 77078 3181 -14839 8873 47097 70933 78164 150029 217755
21909 217755 240142 262208 347416 410591 473547 528979 509200 617510 729188 728079 652467
21898 652467 613282 586231 511593 369831 290922 297950 156883 148359 121326 94604 46655
21887 46655 49211 91166 157475 118448 82042 143739 168143 121886 124366 88785 38532 69633
21875 69633 74947 47304 56261 -55556 -152476 -77138 13442 76109 113521 72859 -4353 -32933
21863c2933k2850M7893R267Q496r2180J4086R4244P7968P2312o3107l7681l8317
21851C7198k8499N8392j3912M1841l7163j0567K7566K1850r046j9961m8435n660
21839A3604J6500L611J5024l7436l0763l0790l0846j5523n5797Q5216O859k3032
21827h3373J3010P588J9652N4315l5687J2218J2759k847l822n1239M9888R5284
21815H7746N6447N2303J7456q5765j7390J21939l6023M3411Q8395j3583O6097
21804C81033J82176K20256J90335Q3619p5615j41995k6621r7035r2637j13539
21794E09977j51988j71380M244L5280K6805L547K8656M0779R3336P2234J87192
21783F78682J92359J54871J50629k6856j15205j05272j90449j70547j7640j35796
$$ plain form
21863 -32933 -55783 -7890 1377 9873 -82307 -68221 26023 103991 176303 113196 75515 37198
21851 37198 8699 67091 53179 95020 57857 47290 74856 96706 87660 67699 19264 13604
21839 13604 30104 33715 48739 11303 -19460 -50250 -81096 -96619 -152416 -67200 -60341 -83373
21827 -83373 -70363 -62775 -43123 11192 -24495 -12277 482 -2365 -6187 -57426 -7538 87746
21815 87746 144193 196496 213952 128187 110797 232736 196713 240124 328519 314936 381033
21804 381033 563209 783465 973800 1057419 981804 839809 813188 716153 623516 509977
21794 509977 357989 186609 190853 226133 252938 256485 285141 325920 419256 491490 678682
21783 678682 871041 1025912 1176541 1149685 1034480 929208 738759 568212 550572 414776
21773D14776q3184M1207J6236j07803o8549q2480o8871o831J8529J35478O5662
21762B74170l9533n6252l2701k9420L0880q530l8088l9089k0040l4011J0105O0625
21750G8116P5276l6339r7097r7290p1771J09696L7192m1251O208L6311l7052O1086
21738B3085M1580r1278j17856J3403N7586p052J4193O2909o2637l6741P5639M2483
21726A5314k3261J9341p7170k846O3827l8423K8635O7717n9039n7186J7316M7106
21714A331J45K1844K3138K6857M0061m3905o338j6032k3182j9642n2172j6281
21702f4176n7808M5271k5649m6798N2250n463N8188k3928l9764J6724J46195O8236
21690A23278q5031k2408M5301j4095J2326P5130n5295L493Q0700j5826j19570
$$ plain form
21773 414776 331592 372799 389035 281232 212683 130203 61332 54501 73030 208508 274170
21762 274170 234637 178385 145684 116264 147144 138614 100526 61437 41397 7386 17491 78116
21750 78116 153392 117053 19956 -77334 -149105 -39409 -2217 -43468 -37260 -949 -38001 23085
21738 23085 64665 -26613 -144469 -131066 -73480 -80532 -66339 -3430 -66067 -102808 -27169 15314
21726 15314 -7947 11394 -65776 -68622 -4795 -43218 -14583 53134 -5905 -63091 -45775 1331
21714 1331 1476 23320 46458 73315 113376 69471 63133 47101 23919 4277 -47895 -64176
21702 -64176 -121984 -76713 -102362 -149160 -96910 -102373 -44185 -68113 -107877 -91153 55042 123278
21690 123278 38247 15839 61140 47045 59371 134501 79206 82699 163399 147573 28003
21679B8003j1998k5526p1785o445N1139N1971O981O934n5945k9236j7825N7527
21667a6205r134j6860K5765k4455L6567K6669l0126j9999K2278m2240J524j1525
21655e7741K0603j9557q962j666O7211P198J4932o5020m4824O3505l6428R1542
21643C0793P8321j17481k0924k5705K1456r407m7291m308P5464K9237L1498R3043
21631A34696j00254n3741l5432N139M5480j5320j54k0007n008k796l7755k5950
21619a11102N4755J1223m6772k506k098m7406L999O087k5096N8294P198o6154
21607a59578M235O3170M0147P8084L9382l3782o9399q5181l3547J0845R608J214
21595a34802J2590R1240k7861m6337J11232M9245m4439k3263R196k6913k3917
$$ plain form
21679 28003 16005 -9521 -81306 -87751 -36612 15359 22340 29274 -26671 -55907 -73732 -16205
21667 -16205 -25339 -42199 -16434 -40889 -4322 22347 -7779 -27778 -5500 -47740 -46216 -57741
21655 -57741 -37138 -56695 -65657 -67323 -112 7086 22018 -43002 -87826 -24321 -60749 30793
21643 30793 109114 -8367 -29291 -54996 -33540 -42947 -90238 -94546 -19082 10155 41653 134696
21631 134696 34442 -19299 -54731 -49592 -4112 -19432 -19586 -39593 -44601 -47397 -85152 -111102
21619 -111102 -56347 -45124 -91896 -94402 -96500 -143906 -139907 -133820 -158916 -100622 -93424 -159578
21607 -159578 -155343 -92173 -52026 26058 65440 31658 -37741 -122922 -156469 -145624 -136016 -134802
21595 -134802 -122212 -30972 -58833 -105170 6062 55307 10868 -12395 -3199 -30112 -54029
21584e4029n5858P5224M6959O5391q635r197K8475K9379k7607n7632m980K9567
21572E7057l911l6862k3052j9320J652m623p1834r1759L3687J16278N7034l376
21560A0971j6834p637j4440L9059K6406J2777N868o1798K5387J03017R78k1768
21548A01986N9344J682k2228p0111r563N1019L5009N518P564p8316k1589M7431
21536A07746J3311n4035J6302j3888J4839K0514N2240n8414n7333o0143o6034
21525h4895R102L7213n943p287N9470Q7235J1514j10392m0305J2376L4412j6995
21513a4495k4550O7975o599O6181l7296p8563J1799J7878l9897k0151M4716L0712
21501A7710R674K4743M065r727J7635r7450k6700K5586J9756j5924N4825K746
$$ plain form
21584 -54029 -109887 -34663 12296 77687 69052 59855 88330 117709 90102 32470 27490 57057
21572 57057 53146 16284 -6768 -26088 -24436 -29059 -100893 -192652 -158965 -42687 14347 10971
21560 10971 -5863 -13500 -27940 11119 37525 50302 56170 -5628 19759 122776 123754 101986
21548 101986 161330 163012 140784 70673 61110 112129 147138 152656 160220 81904 60315 107746
21536 107746 121057 67022 83324 69436 84275 104789 157029 98615 41282 -18861 -84895
21525 -84895 -75793 -38580 -44523 -51810 7660 94895 106409 -3983 -44288 -31912 2500 -14495
21513 -14495 -39045 28930 22331 88512 51216 -27347 -15548 2330 -37567 -57718 -13002 17710
21501 17710 27384 52127 56192 46465 64100 -33350 -60050 -34464 -14708 -30632 24193 26939
21489B6939m4101N2793K0520k743M2711j2606J86m5453k2403r4673q719N8180
21477b9369N9445J4728N6120K0969L8369J9944j0854J525n9268m102M0721M1057
21465A89285k0038J4327m7111j1793r866K7268l8388M5492O3770j733Q058L3170
21453B52441l0997j898o5029j7697K5703n8737k2101K3973m6592L5995R6853L9316
21441B31230K1708r7306K355K0838P5174N3382M7801K8432k5201m8186N684k2393
21429B93518L4720l9018l7737L4399J7385r325o6673j6989P8292n6518M9813J12372
21417C94239m7638J9654O2342J07540O377J2253O082k7380l42j3646j9116j15314
21405C85051n1165J0533m0962j13086j097M4859P2123N0699M9180m4301p5304
$$ plain form
21489 26939 -17162 35631 56151 53408 96119 83513 83699 38246 15843 -78830 -87549 -29369
21477 -29369 30076 44804 100924 121893 160262 180206 169352 170877 111609 107507 148228 189285
21465 189285 169247 183574 136463 124670 114804 142072 103684 149176 212946 211213 219271 252441
21453 252441 221444 219546 154517 136820 162523 103786 81685 105658 59066 95061 191914 231230
21441 231230 252938 155632 157987 178825 253999 307381 355182 383614 358413 310227 315911 293518
21429 293518 328238 289220 251483 285882 303267 293942 227269 210280 288572 232054 281867 394239
21417 394239 346601 366255 428597 536137 542514 554767 560849 533469 533127 519481 500365 385051
21405 385051 333886 344419 303457 190371 189274 234133 306256 356955 406135 361834 286530
21394B86530N2811P7639P7575O1658J06061l7096j121k589l3811L8089K1670r9496
21382E47920P80N3077M0647n1423n7161m8406l2692L1795Q4358Q3979P5573m9595
21370F78852m4007k1289n6750k8115p6943k2542r871P109l3823m8097Q8147N1488
21358D84159j0156J02576P6594N0094P2141Q2814Q2448N6557J19078J72065K02440
21347A490810J62441J30573P2874M1906Q254K4046j2024p4942j23057k93117k66096
21336A161668j62224j28774n4516p2697J8307Q3971n7223Q0645Q069k6494M5634
21325H96366L6994M4872N4520J1875L8193j5357L4539J3156N018Q1818J45966
21314A347960j9055m775Q2451J2517Q4970J22251L7158J09231J10795J50823J89047
$$ plain form
21394 286530 339341 416980 494555 556213 662274 625178 624057 621468 587657 625746 647416 547920
21382 547920 548700 601777 642424 591001 533840 485434 452742 484537 568895 652874 728447 678852
21370 678852 634845 613556 556806 528691 451748 429206 419335 426444 392621 344524 432671 484159
21358 484159 474003 576579 653173 703267 775408 858222 940670 997227 1116305 1288370 1490810
21347 1490810 1653251 1783824 1856698 1898604 1906858 1930904 1918880 1843938 1720881 1427764 1161668
21336 1161668 999444 870670 816154 743457 761764 845735 788512 869157 877226 850732 896366
21325 896366 933360 978232 1032752 1044627 1082820 1067463 1102002 1115158 1120176 1201994 1347960
21314 1347960 1328905 1324130 1406581 1419098 1504068 1626319 1663477 1772708 1883503 2034326 2223373
21303B223373J89649J29210J63668J57599Q2665o8829j40973j1681L8747R7759
21293B861187J43036K51373J92512K36715K88364K91278M37814N54563K76133
21284E532975O1324l2217n443o0923k2726M9557K15690L02419M60609O15998O90389
21273G807652Q00245R67909J229955J608557K074418K532267L289952M324106
21265B4635061N628906P516029J0289801J4126405J9396338K5966062L2641185
21258A40199787L5834320L0958840J6348638m198392k3797159l5299262l5936558
21251A24110214k9037001k0416973j3721408r404337o777897m972978l636123
21244C6143497k658679j828512j248803q34330l83473j12916R2338K85917M90230
$$ plain form
21303 2223373 2413022 2542232 2705900 2863499 2946164 2877335 2736362 2724681 2763428 2861187
21293 2861187 3004223 3255596 3448108 3684823 3973187 4264465 4702279 5256842 5532975
21284 5532975 5594299 5562082 5556639 5495716 5472990 5522547 5738237 6040656 6501265 7117263 7807652
21273 7807652 8607897 9575806 10805761 12414318 14488736 17021003 20310955 24635061
21265 24635061 30263967 37779996 48069797 62196202 81592540 107558602 140199787
21258 140199787 176034107 206992947 223341585 219143193 195346034 160046772 124110214
21251 124110214 95073213 74656240 60934832 51530495 44752598 39779620 36143497
21244 36143497 33484818 31656306 30407503 29573173 29189700 29076784 29169122 29455039 29945269
21235B9945269N62985P56678Q73639J116743J451901K007367K886199L949157
21227D3549938N285576P273770R884299J3402129J8648257K6709102L8485387
21220A63238458N5111690P4619935Q7906735P8857487M2190060j1928213o3809428
21213D26186724r2620445q8537636o4999650m1770930k6654999j8093223j3034181
21206H0475660r863640p612958n842702m508136l506148k779419k231232j749601
21198D2381824j152343o74138l82990o5880q7978l46504r88226j746680k221085
21189C4716000k352627k207892j976329j840094j649498j521542j481934j389814
21181B0296270j364503j292362j280861j095219r73191r64659r05750p89583n93003
$$ plain form
21235 29945269 30508254 31264932 32138571 33255314 34707215 36714582 39600781 43549938
21227 43549938 48835514 56109284 65993583 79395712 98043969 124753071 163238458
21220 163238458 218350148 292970083 380876818 459734305 501924365 489996152 426186724
21213 426186724 333566279 245028643 180028993 138258063 111603064 93509841 80475660
21206 80475660 70612020 62999062 57156360 52648224 49142076 46362657 44131425 42381824
21198 42381824 41229481 40555343 40172353 40106473 40018495 39671991 38683765 36937085 34716000
21189 34716000 32363373 30155481 28179152 26339058 24689560 23168018 21686084 20296270
21181 20296270 18931767 17639405 16358544 15263325 14290134 13325475 12419725 11630142 11037139
21172A1037139m53691n26936m50727m61652m99646n51085m47331m23180m56120
21163F766771l31168l27328k98389l07105k75278l23663k36002k39355k09320
21154D219163r3034j28308j63937j61056j32656j73065q4376q9668j00739p9059
21144C013265j24320j19131j43170j35418p9162o6883o3171p8169l0681k2288
21134B150872k3863J2964N922j19855o7380p4017l5920j88349j33150o9202n8476
21123A399546o6467o4504l7800n9729n4780j05025m2603L884q3316p214r673J0810
21111H83129M4665k4322K931J96j8393j0392Q1388K6559j61654o9860J2114K7444
21099G93805P3225J13923R5661O0808P259N1979J54435Q9744r0020m3261K0656
$$ plain form
21172 11037139 10583448 10056512 9605785 9144133 8644487 8093402 7646071 7222891 6766771
21163 6766771 6435603 6108275 5809886 5502781 5227503 4903840 4667838 4428483 4219163
21154 4219163 4126129 3997821 3833884 3672828 3540172 3367107 3282731 3193063 3092324 3013265
21144 3013265 2888945 2769814 2626644 2491226 2412064 2345181 2282010 2203841 2173160 2150872
21134 2150872 2127009 2139973 2145895 2026040 1958660 1884643 1848723 1660374 1527224 1458022 1399546
21123 1399546 1333079 1268575 1230775 1171046 1116266 1011241 968638 972522 889206 881992 872319 883129
21111 883129 927794 903472 906403 906599 888206 877814 959202 985761 824107 754247 766361 793805
21099 793805 867030 980953 1076614 1137422 1144681 1196660 1351095 1440839 1350819 1307558 1328214
21088A328214R342j06811j64515j57421j31584r0394K4110M8420m105k821o8272
21077F84163o0977o8992m9416L9505j7818M054P9567M7749k2819j3882M4247k1333
21065F44048j5027q185j30746j85266j20737k9015P223m472P4771J30414Q8455
21054D51463J05994m3001p7820o350j0402j4087M0361R0226O1630m6025r3678
21043D58311m5533J0646J1783L9639k8001j6623k6762O749k4781r826P7700O02
21031D53904q7812n5757O6002L1789n8873Q201J9307k8904n2022L9176L9605m5697
21019C28919q9227J2141L07m9553m7011j1593K5695n85J9988k1251l030m5847
21007A18953n8360N208J51193J24571K2161p1799m9729m5296K2785N913k9691
$$ plain form
21088 1328214 1337556 1230745 1066230 908809 777225 686831 710941 759361 755256 752435 684163
21077 684163 623186 554194 504778 544283 526465 530519 610086 657835 635016 621134 665381 644048
21065 644048 629021 620836 490090 304824 184087 155072 162295 157823 232594 363008 451463
21054 451463 557457 514456 436636 430286 419884 405797 446158 536384 598014 551989 458311
21043 458311 412778 423424 435207 474846 446845 430222 403460 410209 385428 375602 453302 453904
21031 453904 366092 310335 376337 408126 349253 357454 376761 347857 295835 335011 374616 328919
21019 328919 239692 251833 252140 202587 155576 143983 169678 169093 189081 167830 164800 118953
21007 118953 60593 65801 216994 341565 363726 291927 242198 196902 219687 225600 195909
20996A95909o3198o7312n2763j6797M5682r70l0640K5514M3379q2056L9445R5506
20984A31699k3059j1600j3923K7917l4383j8526q697k5853j3568J06800M622K8968
20972A50397N9638N9106q058j36134j04514M7941J8030N6910L332O4416L2725
20961B43789k808O876l310n8997o9725k5916j0823N4473k657O9406m7507o5605
20949H7196k4071k1249P8806Q5243K1800j03567l6086L0517L2087N6242K4742
20938B31660r0715m308l9582j5394j3847J1369l155j1214l745n3762N6025N0330
20926A13662J4183q713n327q403q125j5880k3319o2616m9401J19337P4853J3651
20914A53902k064J3968L1011n7477K5775J38703Q335j70781p4380L3597p3989
$$ plain form
20996 195909 132711 65399 12636 -4161 41521 40551 9911 35425 78804 -3252 36193 131699
20984 131699 108640 97040 83117 111034 76651 58125 49428 23575 10007 116807 121429 150397
20972 150397 210035 269141 261083 124949 20435 68376 86406 143316 146648 211064 243789
20961 243789 240981 247857 244547 185550 115825 89909 79086 133559 130902 200308 152801 87196
20949 87196 63125 41876 120682 205925 227725 124158 88072 118589 150676 206918 231660
20938 231660 140945 136637 97055 81661 67814 79183 76028 64814 61069 7307 63332 113662
20926 113662 127845 119132 113805 105402 97277 81397 58078 -4538 -53939 65398 140251 153902
20914 153902 151838 165806 196817 139340 165115 303818 312153 141372 66992 100589 26600
20903B6600l2142o6664O6196Q1509M585r034L7859J4047n6576j6722K8347j7410
20891F0595j5075N5312j72n0717l6290j0307O769p0071l1570M9979K8079J632
20879a1836K6520N5279j9020o8932j16944M8282L6136q03o7280N1571J13738R4169
20867A40880k2347L3288j7392k3114L8943j1942Q13K8963O201l593q9133L2272
20855A13839K9643o2227j2721J0099Q2456j3085l1790p9630j02584M0126O9220
20844D3346o3470o931L3838J32863L5465k9906j4611j27842o0361N8145O1285
20833F1821O0054l9935L1961P6090K102Q170j13982n1297M5450J0757k0564M1830
20821A12457J1734k8421n6668J0468J11197j8256M8167o0678j68136j1749L1142
$$ plain form
20903 26600 -5542 -72206 -6010 75499 80084 71050 108909 122956 66380 49658 78005 60595
20891 60595 45520 100832 100660 49943 13653 3346 10115 -59956 -91526 -41547 -13468 -11836
20879 -11836 14684 69963 50943 -17989 -134933 -86651 -50515 -51318 -118598 -67027 46711 140880
20867 140880 118533 151821 134429 111315 150258 138316 139129 168092 174293 170700 81567 113839
20855 113839 143482 81255 68534 78633 161089 148004 116214 36584 -66000 -25874 43346
20844 43346 -20124 -27055 6783 139646 175111 145205 130594 2752 -57609 536 61821
20833 61821 121875 81940 113901 189991 192093 200263 86281 34984 80434 91191 70627 112457
20821 112457 124191 95770 39102 49570 160767 142511 190678 130000 -38136 -49885 -18743
20810a8743k9334j4495N4937K6058K0123n749O235m3081o9607O1273K5116n1722
20798c8989k614j8696k407j8352m7152J9817L9667p221j13116o8914N113R1012
20786a61852J28655J31935Q7263l1677p7922j2557P7477n4712o1195K0459M2254
20775H8128m3952J67M923j335l1613j906j5626K5611K204Q0849l8180m8834j1501
20762H935K7172M8847L132m9526n9319k745m4345j827k5517J5634j9627r0376
20750a89562j2569Q707N3911M7755k5878J6984K3158R8825n549o6636L3108N2180
20738C4434k6988m0823n550j4714j3965r9337n5796J59902k2700o4360K7921Q8905
20726c3071k0944j9698J6245L1203l1128j3828p1152n9289N7130J0825L0729O7033
$$ plain form
20810 -18743 -48077 -62572 -7635 18423 38546 32797 39032 -4049 -73656 -12383 12733 -38989
20798 -38989 -41603 -60299 -62706 -81058 -128210 -108393 -68726 -75947 -189063 -257977 -252864 -161852
20786 -161852 -33197 98738 186001 154324 76402 63845 141322 86610 25415 45874 88128
20775 88128 44176 44343 49266 47931 16318 14412 -1214 24397 26601 107450 69270 20436 8935
20762 8935 36107 84954 88086 38560 -20759 -23504 -67849 -69676 -95193 -79559 -99186 -189562
20750 -189562 -202131 -193424 -139513 -91758 -117636 -100652 -77494 21331 15782 -50854 -17746 34434
20738 34434 7446 -33377 -38927 -53641 -67606 -166943 -222739 -62837 -85537 -149897 -121976 -33071
20726 -33071 -54015 -73713 -57468 -26265 -57393 -71221 -142373 -201662 -144532 -133707 -102978 -35945
20714c5945P0099J44698o724j19504n6479P9912M2943l9770l4391l9505K679k1330
20702a3317L3031L7443M7902n8050p1603O959J0928N3162j7316m3377J693r8587
20690a11132l817O8238J6811j7244l0832k3134j4503R0463J44395P6094o1489
20679A33850j35237J8182O0265k0488L16O647o137p508O676L9431R52l4672p9775
20666a7498r24m0463J5082J3880N420R634J162Q7846J8097L9029n4726L7202l740
20653A10001k8392k3959K8246J89399J29083J52594K16424K26434P2546J73270
20643A245646J56959q8494j40370j41737j74251k71420j57399p672l2513N2468
20633D41217P1521L9540O4940P124j3482N6303J58433R0860J47329O1763K9986
$$ plain form
20714 -35945 34154 178852 172128 52624 -3855 76057 119000 79230 44839 5334 8013 -13317
20702 -13317 19714 57157 105059 47009 -24594 -17635 -6707 46455 29139 -14238 -12545 -111132
20690 -111132 -114949 -46711 -29900 -47144 -77976 -101110 -115613 -25150 119245 195339 133850
20679 133850 -1387 16795 77060 56572 56888 63535 57398 49890 56566 95997 96949 62277 -17498
20666 -17498 -18422 -58885 -43803 -29923 -24503 -14869 -13707 74139 92236 131265 76539 113741 110001
20653 110001 81609 57650 85896 275295 404378 556972 773396 999830 1072376 1245646
20643 1245646 1402605 1314111 1173741 1032004 857753 586333 428934 421262 388749 441217
20633 441217 512738 552278 617218 624342 610860 667163 825596 916456 1063785 1125548 1155534
20622A155534O30n0393j99122k68315r5596n3443l7856K001J3476M0230o874m1920
20610D58352p283Q9562J7903P2891R2112k2779L1096J0635r1059l4167n7222l2140
20598E27901q5317m8749p8859k09225k2005J06497K8582J5581n593m7269J2645
20587A94189k0143j8048Q7910j9635r4809j564j7231n6503K4745N6262m4374n0843
20575C9956j4597K7946N403m0864J6003J0630J1631O552m2223n0074r8712j17467
20563b45816M4557J49930K3902k73j4839o1109M9193j512j1879J5913K762k6579
20551g5750p4613j5362l8290m384N6773J40369L6902n6383K1299K7415K9315J2558
20539E9849K0492m0597l3834l8052j6504J5744j06459k664l5556J118Q1693K6154
$$ plain form
20622 1155534 1156164 1105771 906649 638334 542738 489295 451439 453440 466916 507146 500272 458352
20610 458352 451069 540631 558534 631425 723537 700758 731854 742489 651430 617263 560041 527901
20598 527901 442584 393835 314976 105751 83746 190243 218825 234406 228813 181544 194189
20587 194189 174046 155998 243908 224273 129464 127900 110669 54166 78911 135173 90799 39956
20575 39956 25359 53305 58708 17844 33847 44477 56108 62660 20437 -29637 -128349 -245816
20563 -245816 -201259 -51329 -27427 -27700 -42539 -103648 -54455 -55967 -67846 -51933 -49171 -75750
20551 -75750 -150363 -165725 -204015 -208399 -151626 -11257 25645 -30738 -9439 17976 47291 59849
20539 59849 80341 39744 5910 -32142 -48646 -32902 -139361 -142025 -177581 -176463 -94770 -68616
20527f8616n6192N8990M2477n1712m7416J5436L4328N8713N0113K5855l4434r9415
20515g1873l6989L3353M5779j8328l1368n529K2851L3467m1801N831L1552j4919
20503d7974j7685n433M9215L3989J1204k7074L6991P4160M5338n2474j46404q9833
20491a35980k356N797l1647L3295L9746k7295N5918Q7881m299q1007p816q0082
20479a47845K2753l831J0515P0872M5732K2666l6944j6285N863j9440Q3066J223
20467C8345l3180m829m1665l2371l6207M2131k6736N161j7593P1071o240r2789
20455a34902l3675J1942k8589J3637O9896L9597n529p9963L361J04442K4626K0681
20443E524Q932R850j1977r8040m0104N4187J11493q979J2501K7955k8890r7907
$$ plain form
20527 -68616 -124808 -65818 -23341 -75053 -122469 -107033 -72705 -13992 36121 61976 27542 -71873
20515 -71873 -108862 -75509 -29730 -48058 -79426 -84955 -62104 -28637 -70438 -64607 -33055 -47974
20503 -47974 -65659 -71092 -21877 12112 23316 -3758 33233 107393 152731 100257 -46147 -135980
20491 -135980 -138336 -132539 -164186 -130891 -91145 -118440 -62522 25359 21060 -59947 -67763 -147845
20479 -147845 -125092 -128923 -118408 -47536 -1804 20862 -16082 -32367 -26504 -45944 37122 38345
20467 38345 5165 336 -41329 -73700 -109907 -67776 -94512 -89351 -106944 -35873 -42113 -134902
20455 -134902 -168577 -156635 -185224 -171587 -101691 -62094 -67623 -147586 -144225 -39783 -15157 5524
20443 5524 14456 24306 12329 -85711 -125815 -71628 39865 30886 43387 71342 42452 -55455
20431e5455j4488J9181o67j3632M279p7849M811L8249J8911M6721r993o304n7234
20418a03470r4795N8917l566P3099J07910l2576n8263J9388j9125K475R813k6846
20406f7039q7996J7846J12404N9876O450j01090j3097M0657L9553k4260j7853
20395c4549l3377m2065O432M2269J3546m6686j9754P932N5421j2290N6997K9307
20383B3183o8956o0k9496l4163N5633p821o3628j1714R4576L5220l6309n7973
20371a01508q217n142L8268J57257o313m1126l718N3722K2188l4956l5938l4522
20359ej04295l9609o8856K8108Q1399j084o245N3655n4329K1701R9627O3448m146
20346F9369j5973o7631o4914l3590k8579O3462J02287l6255L2370J3870q250J1093
$$ plain form
20431 -55455 -69943 -50762 -51429 -65061 -60782 -138631 -133820 -95571 -76660 -29939 -39932 -46236 -103470
20418 -103470 -198265 -139348 -142914 -69815 38095 5519 -52744 -33356 -52481 -50006 -40193 -67039
20406 -67039 -155035 -137189 -24785 35091 41541 -59549 -72646 -31989 7564 -16696 -34549
20395 -34549 -67926 -109991 -103559 -61290 -47744 -94430 -114184 -106252 -50831 -63121 -6124 23183
20383 23183 -45773 -45833 -75329 -109492 -53859 -61680 -125308 -137022 -42446 -7226 -43535 -101508
20371 -101508 -109725 -114867 -76599 80658 74345 33219 29501 83223 105411 70455 34517 -5
20359 -5 -104300 -143909 -212765 -184657 -103258 -104342 -110587 -56932 -111261 -89560 10067 73515 69369
20346 69369 53396 -14235 -79149 -112739 -141318 -77856 24431 -11824 20546 34416 26166 37259
20334C7259o4783l8632l5835N3248m5595m3629Q5926j3474J8226L2k0399r9854
20322a67510n0649Q2186J17689M2336k1837k9595k8254N0218K0238j0428q0452
20311g6058m5003n5054m2053Q7179k654r083J1249k1601R27n4574K292P6166J8782
20298a09485L1444L5059L1593o9647K8831K7532j2685o4605m5816k4368L7851
20287a34296M6313O5118Q1556O373l9483J1778J3752P61p6993q994k5530R250
20275e0395o9408p7060k1373p9333N5168M7983L3793N2481N2196k0122j020O0629
20263a6461j3152L3580q073j15911m2186R4733j7212n4337R434K7169Q9952K0003
20251G539L0053J9301o7385l2264o8323l4002N4014j1433o834N2585P0619N8479
$$ plain form
20334 37259 -27524 -66156 -101991 -48743 -94338 -137967 -52041 -65515 -47289 -47257 -67656 -167510
20322 -167510 -218159 -135973 -18284 24052 2215 -27380 -55634 -5416 14822 4394 -76058
20311 -76058 -121061 -176115 -218168 -130989 -133643 -142726 -131477 -153078 -152151 -206725 -204433 -128267 -109485
20298 -109485 -78041 -42982 -11389 -81036 -52205 -24673 -37358 -101963 -147779 -172147 -134296
20287 -134296 -87983 -22865 58691 65064 25581 37359 51111 51872 -25121 -34115 -59645 -50395
20275 -50395 -119803 -196863 -218236 -297569 -242401 -194418 -160625 -108144 -55948 -76070 -77090 -16461
20263 -16461 -29613 3967 -4106 -120017 -162203 -67470 -84682 -139019 -129585 -102416 -12464 7539
20251 7539 37592 56893 -10492 -42756 -111079 -145081 -91067 -102500 -109334 -56749 13870 72349
20239G2349j0673j521K1693J0100k7671N6056j1929N2127j69078j21596l0832
20228a60975N3879Q2595m4320K7566O8889p5794j21736M3722P7852N580L4646
20217h096J9322j18577m6772L1436P0823O1170P8379l2134j03575K9782l1411
20206d9653j5817o6312L8671J17084j5968m4917o7383n3812k2759J1402J299k0342
20194a88507m9012K3567P5865Q7139M902o2682K7850O011O221L365R527J5756
20182c9998K3417M7412j1705n4478l0006N7739n7203M3944l462r575P1431K034
20170C9550p7796q3311l3767J16580K8555n990o5924l2105P8115J5804l9814k7306
20158h7409l5099k1351O7544j11175l5825J17298M9410k8462L0135J8855k4599
$$ plain form
20239 72349 61676 60155 81848 91948 64277 120333 108404 160531 -8547 -130143 -160975
20228 -160975 -107096 -24501 -68821 -41255 27634 -48160 -169896 -126174 -48322 -42742 -8096
20217 -8096 11226 -107351 -154123 -122687 -51864 9306 87685 55551 -48024 -18242 -49653
20206 -49653 -65470 -131782 -93111 23973 8005 -36912 -104295 -158107 -180866 -169464 -168165 -188507
20194 -188507 -237519 -213952 -138087 -50948 -46046 -108728 -80878 -74867 -68646 -65281 -55754 -39998
20182 -39998 -16581 30831 19126 -35352 -65358 -7619 -64822 -20878 -24340 -33915 37516 39550
20170 39550 -38246 -121557 -155324 -38744 -10189 -16179 -82103 -114208 -36093 -20289 -60103 -87409
20158 -87409 -122508 -143859 -76315 -187490 -223315 -106017 -56607 -85069 -54934 -36079 -60678
20147f0678l3023J0541M8329k8627q1652J957k6788k3367N2547p5087n4455N2088
20135b18215K8315R0347k3771j11311k6799j4576P889P0396N1366R2999O011L2307
20123a5042m2541l2908J8876j4441o5108K1479O6031K1106j1767k5186j1909N8863
20111c2547R723k5865l4757j5509p752O1214j5842k9001o7056K8731M9228o7268
20099a46701m0143O7852J61024K5548k9904n0137m4573o8174L8304M6605l565
20088d3864k5037p2850j3319M54j3210j0761J9504l4118l7562L7395M7068K3752
20076a22548O9604M3370j03212k8391O0314N900M9896L013l5121l5746p9475M7553
20064a24843K0187k8896Q9046m8097l3609N5497l1509k4604n6978O4761N1120
$$ plain form
20147 -60678 -93701 -83160 -34831 -63458 -145110 -143153 -169941 -193308 -140761 -215848 -270303 -218215
20135 -218215 -189900 -99553 -123324 -234635 -261434 -276010 -268121 -197725 -146359 -53360 -47349 -15042
20123 -15042 -57583 -90491 -71615 -86056 -151164 -129685 -63654 -42548 -54315 -79501 -91410 -32547
20111 -32547 -22824 -48689 -83446 -98955 -106707 -45493 -61335 -90336 -157392 -128661 -79433 -146701
20099 -146701 -186844 -118992 42032 67580 37676 -12461 -57034 -125208 -86904 -40299 -43864
20088 -43864 -68901 -141751 -155070 -154616 -167826 -178587 -159083 -193201 -230763 -193368 -146300 -122548
20076 -122548 -52944 -9574 -112786 -141177 -80863 -74963 -25067 -22054 -57175 -92921 -172396 -124843
20064 -124843 -104656 -133552 -44506 -92603 -126212 -70715 -102224 -126828 -183806 -119045 -67925
20053f7925l0103q6271j14871L4551k582P7441N2469r631Q980M9925M692m6236
20041a29561l9546R0897M7293m8324n5577K2942q185p085n3744p677L1314m748
20029a62001M3939M7115l7549l0172K5383m0396K242j8818J5449p997J6823J8044
20017a27938M0822R6505K7633K9861j24420j427K5409K9275j36821q1452l955
20006b26508N1026m2755O9756L1766O325J2891m2038m6289M976K0818k2713m8359
19994b31104J35213N2912r8489l8355l1550m7155O0736j9746J6911N2328L3549
19983a14750m9378k7232M723O321M8476M2267K777P0400P4463k5536m7406o0742
19971g5617J7458K4129j7817N3432Q1660l7248l809J08508J03927M6454l8837
$$ plain form
20053 -67925 -98028 -184299 -299170 -264619 -267201 -189760 -137291 -146922 -137942 -88017 -83325 -129561
20041 -129561 -169107 -78210 -30917 -79241 -134818 -111876 -120061 -127146 -180890 -188567 -157253 -162001
20029 -162001 -118062 -70947 -108496 -138668 -113285 -153681 -151439 -170257 -154808 -162805 -145982 -127938
20017 -127938 -87116 9389 37022 66883 -57537 -58964 -33555 -4280 -141101 -222553 -226508
20006 -226508 -175482 -218237 -148481 -116715 -110390 -97499 -139537 -185826 -180850 -160032 -182745 -231104
19994 -231104 -95891 -42979 -141468 -179823 -211373 -258528 -197792 -217538 -200627 -148299 -114750
19983 -114750 -164128 -191360 -186637 -180316 -131840 -89573 -86796 -16396 58067 32531 -14875 -75617
19971 -75617 -58159 -34030 -51847 1585 83245 45997 42188 150696 254623 301077 262240
19960B62240k7378L3219L6036j07878p2868k1889l2215J62853J02369J04J4608
19949C49201M7717K3094j29244j7896l4080J9286L1088J2620p3914j6052m4432
19938A67388o1736n9169J2260K8296K5170m9354r1001m9445J0400L7014q7P5974
19926D5710K898k0916O0302Q5009M3735m4923j2774l3333p058r21n5116q98J59888
19913B21603O3285r146j0519K4992J0343J38390N0463M9376L6746j5738K1784
19902E81579R272o6344n3816j02257O248j8650j0854N5980M8202m0930n9055l4417
19890C14958J0643n7255o2553k6261m2814j12298Q74n1956l9651q4229j0058L7333
19878a23267M7538L1076N4983L4987p0148j11044k0294L915K2662P8615k9354
$$ plain form
19960 262240 234862 268081 304117 196239 123371 101482 69267 232120 334489 334593 349201
19949 349201 396918 420012 290768 272872 238792 258078 289166 301786 227872 211820 167388
19938 167388 105652 46483 58743 87039 112209 62855 -28146 -77591 -67191 -30177 -30264 45710
19926 45710 48608 27692 87994 173003 216738 171815 159041 125708 118650 117729 62613 61715 221603
19913 221603 284888 275742 265223 290215 300558 438948 489411 538787 575533 559795 581579
19902 581579 590851 524507 470691 368434 374682 356032 345178 401158 449360 408430 349375 314958
19890 314958 325601 268346 205793 179532 136718 24420 25294 -26662 -66313 -150542 -160600 -123267
19878 -123267 -75729 -44653 10330 45317 -24831 -135875 -156169 -152254 -129592 -50977 -80331
19867h0331p980k4722r3329j198J4097J8427P6314m0604j6717K6933R2286K4923
19855a1901M3948M1637n6258n0232o533O680M3890q5686k0657O8318J7571N4361
19843D5138o3878r3721p1295L787L8962J7314J2135m2191j8241Q7971N6292N2278
19831B4551N324l9628n5265o1478k08r161J1170L8323L0882N1131p5863J7689
19819f2533J1081M0352L1042p3996p0003p2152r544r450l3009M5161O4141O2074
19807g6836M6361K7530k0665j5351j8610l923M8929Q276j21885j3109J2330o7433
19795a94386j5537N1966M2671L6101O505p3351k5826k4660m3222J08550L8034
19784i3155j8150r892M343k5007J3245L7936l6684L4595J14250O6902L2010J0892
$$ plain form
19867 -80331 -88311 -113033 -206362 -207560 -193463 -175036 -98722 -139326 -156043 -129110 -36824 -11901
19855 -11901 32047 73684 17426 -32806 -39339 -32659 11231 -74455 -95112 -26794 -9223 45138
19843 45138 -18740 -112461 -183756 -179969 -141007 -123693 -111558 -153749 -171990 -84019 -27727 24551
19831 24551 29875 -9753 -65018 -126496 -126704 -135865 -124695 -86372 -55490 -4359 -80222 -62533
19819 -62533 -51452 -11100 19942 -54054 -124057 -196209 -205753 -215203 -248212 -203051 -138910 -76836
19807 -76836 -30475 -2945 -23610 -38961 -57571 -61494 -12565 -4289 -126174 -139283 -126953 -194386
19795 -194386 -209923 -157957 -115286 -79185 -72680 -146031 -171857 -196517 -239739 -131189 -93155
19784 -93155 -111305 -121197 -116854 -141861 -128616 -90680 -127364 -92769 21481 88383 120393 131285
19772A31285K8385Q1064l0306o9532J4890M9174N2794M5306J2284J7558N2030
19761C84932j1267p1033l0701P9284Q5661l0059o8629J6691j1292j42302m3000
19750A58285K3910m1929p4701R1542J5180n1714j6660m9078l8076Q0642L635m2250
19738E8786l5107p6299r6702J8899j844M7422P7720j4919L1025L3584P209M9975
19726I9749M9396O7733O5675L21L6533J967K7420P8909k4007r217J08881M3139
19714E46499R3082K8318k9091K112k8043p1805o3431M4995n5766p1545n1693J8089
19702C61721N7518M0438p1870r0997p2050j2282o4435n3435k0573K5750K1911
19691A21696m6274o4146l9087j1473L1461j00978k4502N9370l2749l0824J3139
$$ plain form
19772 131285 159670 240734 210428 140896 155786 204960 257754 303060 315344 332902 384932
19761 384932 373665 302632 271931 351215 436876 406817 338188 354879 343587 201285 158285
19750 158285 182195 140266 65565 157107 172287 120573 103913 54835 16759 97401 101036 58786
19738 58786 23679 -52620 -149322 -130423 -132267 -84845 -7125 -22044 8981 42565 49774 99749
19726 99749 149145 216878 282553 282874 319407 321374 348794 427703 403696 394479 503360 546499
19714 546499 639581 667899 638808 640920 612877 541072 477641 522636 466870 395325 343632 361721
19702 361721 419239 459677 387807 296810 224760 212478 148043 94608 74035 99785 121696
19691 121696 75422 11276 -27811 -39284 -7823 -108801 -133303 -73933 -106682 -137506 -124367
19680a24367P7434j1347p0933M7459L6170J8448O1670J7805p8731Q06J7215k489
19668a0860J2064j5030Q067p03o7221K9349O8870J7447q1746k6458K8237R587
19656b8397r3658p318p473k6557k3206N5768j1258K8892O9976l2270k3038N5201
19644d3338L2826o424l2352K1904M5173K7803N700j17445n1453M2776p864P2752
19632i942J2344R328l3710m7404J218l6218Q7413J2839n8813k9718m6575o6543
19620b05781J7246L866K6773K4690J8524K2617k1492k1591j4201M5645K834N1349
19608d9521j5154L3546o0034J8853M3561o939j8166k352L8776L1159J5461N5157
19596H4347O4649l8295n3414k6714L2221K0178J9523m6182o5352J055J7530j0142
$$ plain form
19680 -124367 -46933 -58280 -129213 -81754 -45584 -27136 34534 52339 -26392 -25586 -8371 -10860
19668 -10860 1204 -13826 -5759 -6462 -73683 -44334 24536 41983 -39763 -66221 -37984 -28397
19656 -28397 -122055 -129373 -136846 -163403 -186609 -130841 -142099 -113207 -43231 -75501 -98539 -43338
19644 -43338 -10512 -16936 -49288 -27384 17789 45592 51292 -66153 -117606 -74830 -82694 -9942
19632 -9942 2402 11730 -21980 -69384 -68166 -104384 -16971 -4132 -62945 -92663 -139238 -205781
19620 -205781 -188535 -184669 -157896 -133206 -114682 -92065 -113557 -135148 -149349 -103704 -100870 -49521
19608 -49521 -64675 -31129 -91163 -72310 -28749 -35688 -53854 -56206 -17430 13729 29190 84347
19596 84347 148996 110701 57287 30573 62794 82972 102495 56313 -9039 -7984 9546 -596
19584e96m1263P5754L3360j4134l8119l9588N8033M6263K0268R6278O0720N35
19572B57511m5098L7728K5373J1459n8187j6625J3686q125K8608r6999p4583L5163
19560A09911o5115j60619j05888m9423J21212L0706j0089N1319K607K2022R3650
19549D0293Q4439R0800L0350J2945O701q8151j5506j550L0853p3910j06110O599
19537A7753K3170M8906O7149l0115N4382N0441Q6336R550O279O5553K7224n1881
19525C74747O0679L0493l6002J0307L1430N8431K7198k30K1871r83j9674q2908
19513D75359K9896L2439m5468l8733l3279r1636p978q5883j4475N7642N6816k8095
19501C06605m086M8173K8688L7591N7770k4489L1048O0508J2833r6323m1467Q6895
$$ plain form
19584 -596 -41859 33895 67255 53121 15002 -24586 33447 79710 99978 196256 256976 257511
19572 257511 212413 250141 275514 286973 228786 212161 225847 217722 246330 149331 74748 109911
19560 109911 44796 -115823 -221711 -271134 -149922 -119216 -129305 -77986 -75379 -53357 40293
19549 40293 124732 215532 245882 258827 265528 177377 161871 160321 191174 117264 11154 17753
19537 17753 40923 89829 156978 126863 181245 231686 318022 327572 333851 399404 426628 374747
19525 374747 435426 465919 429917 440224 471654 530085 557283 557053 578924 577941 558267 475359
19513 475359 505255 537694 492226 453493 420214 328578 320600 234717 220242 277884 334700 306605
19501 306605 302519 350692 379380 416971 474741 450252 481300 541808 554641 458318 416851 503746
19489E03746Q2594M3655j4538N6820O7600k4453L7186J53518J58543N1278j528
19478A114421L4838Q5522J11730J47093J23262K28937K32714K59223J76369J78153
19468B692262K95098K34369K74745L37554L93422L92532O05404Q05916J050351
19459G081653J422179J846862K244119K436619K353911J986896J626839J470655
19451B2469733J890555L006428M894697P397979J0663248J4324665J6903562J6353745
19443I7904612J1687812N030154j713892o478071q714870r621423j0419344j0412830
19435F7262148q293427m779938j611036Q2816j9006j386358l293213n018051n592226
19426C7351709n107150m069912k954609k090862j343172q66377m79678l24362
$$ plain form
19489 503746 586340 629995 615457 672277 739877 715424 752610 906128 1064671 1115949 1114421
19478 1114421 1149259 1234781 1346511 1493604 1616866 1845803 2078517 2337740 2514109 2692262
19468 2692262 2987360 3221729 3496474 3834028 4227450 4619982 5225386 6031302 7081653
19459 7081653 8503832 10350694 12594813 15031432 17385343 19372239 20999078 22469733
19451 22469733 24360288 27366716 32261413 39659392 50322640 64647305 81550867 97904612
19443 97904612 109592424 114622578 112908686 106430615 97715745 88094322 77674978 67262148
19435 67262148 58968721 54188783 52577747 52660563 52641557 51255199 47961986 42943935 37351709
19426 37351709 32244559 28174647 25220038 23129176 21786004 20919627 20439949 20115587
19418B0115587l35597q4580J2354J0006r229Q4247K11387N48575R37136J516581
19408B3006467K236731L271387M493513N720855O749765P118381O064406L958882
19400F2620387J642471P7251M20058K589528O397982J1347014J6968357K2383085
19392A24446133K5671711K5609087K1677754J2776180j15838j3165392k3803839
19385A73095796k9550955k8114069k1652907j4430726q851113m874867k733756
19378F2887403k150170k934117m198769n344973n604882m863374l784416k831487
19370C1175215k217514j623015j201613q41294p79761p92471q74918j071597j152225
19361B0620807j145596j141546j177873j162808r72838q64089p92675o60284n38295
$$ plain form
19418 20115587 19779990 19695410 19707764 19717770 19708541 19792788 20004175 20552750 21489886 23006467
19408 23006467 25243198 28514585 33008098 38728953 45478718 52597099 58661505 62620387
19400 62620387 64262858 64340109 64760167 67349695 73747677 85094691 102063048 124446133
19392 124446133 150117844 175726931 197404685 210180865 210065027 196899635 173095796
19385 173095796 143544841 115430772 93777865 79347139 70496026 65621159 62887403
19378 62887403 60737233 57803116 53604347 48259374 42654492 37791118 34006702 31175215
19370 31175215 28957701 27334686 26133073 25291779 24512018 23719547 22844629 21773032 20620807
19361 20620807 19475211 18333665 17155792 15992984 15020146 14156057 13363382 12703098 12164803
19352A2164803o18505n93988m29238l01373l11412l49671m51553l65203l74571
19343H369289m14005l94721m79153m51181m34922l15108k72749j86451k54131
19334E166868k21725j68563j65167k45341k76759j98953l8979P385l6933r5404
19324C726429n6340j20938q9067o9165q6176j23667q1354p4477n6001j6539j69387
19313B783318j89009q1084j15127k7925L1691q2829o2275j0848p6169j85457r9624
19302A884662J02081l5337k844J03566M1340l7800m8369J8347P4743P2698k5428
19291B147659M631J7130P2254J19491O2716N1755M5342J56683J51541J68012K84802
19280C282016L00209K36903J88063K54577L79509M37785M63579N24963N55790
$$ plain form
19352 12164803 11546298 10952310 10523072 10221699 9910287 9560616 9109063 8743860 8369289
19343 8369289 7955284 7560563 7081410 6630229 6195307 5880199 5607450 5420999 5166868
19334 5166868 4945143 4776580 4611413 4366072 4089313 3890360 3851381 3858766 3821833 3726429
19324 3726429 3670089 3549151 3460084 3390919 3304743 3181076 3099722 3025245 2969244 2952705 2783318
19313 2783318 2594309 2513225 2398098 2370173 2401864 2319035 2256760 2245912 2169743 1984286 1884662
19302 1884662 1986743 1951406 1948562 2052128 2093468 2055668 2007299 2025646 2100389 2173087 2147659
19291 2147659 2152290 2169420 2241674 2361165 2423881 2475636 2520978 2677661 2829202 2997214 3282016
19280 3282016 3582225 3819128 4007191 4261768 4641277 5079062 5542641 6067604 6623394
19271F623394N90840O65636Q24479R51552J216677J467735J935903K559881L463825
19262B0299922M535854N289375N439805N021234M091153L352674L896939O064893
19254E7991849R705015J4882442K0957749K6491643K8969407K5557038J6368423
19247B00923566L813791r422683j9082993k3528654k4119605k1495258j6349195
19240I0738969j0511530n664156k163482o1463N49449n80727k900677n224317
19232F4182066o766468o952320n993504m539759l256835k303914j568819j079216
19224C1721231q98044q28718q75870r65502p60792o86143n85256l54327j23370
19215B5643209J10015L20203Q51016J509325K332777L365345M298765M915977
$$ plain form
19271 6623394 7214234 7879870 8704349 9655901 10872578 12340313 14276216 16836097 20299922
19262 20299922 24835776 30125151 35564956 40586190 44677343 48030017 51926956 57991849
19254 57991849 67696864 82579306 103537055 130028698 158998105 184555143 200923566
19247 200923566 204737357 195314674 176231681 152703027 128583422 107088164 90738969
19240 90738969 80227439 74563283 72399801 72338338 72887787 72307060 69406383 64182066
19232 64182066 57415598 50463278 44469774 39930015 36673180 34369266 32800447 31721231
19224 31721231 30823187 29994469 29118599 28153097 27392305 26706162 26120906 25766579 25643209
19215 25643209 25753224 26073427 26924443 28433768 30766545 34131890 38430655 43346632
19207D3346632M851653L679178J958983N30115K07799J520765M317692P590283
19199F8003100J0444394J1613463J0921639R275181O943273L219307k223731q584533
19191A09612093j4417251j7234498j5506263j1333856p357543m679763k776754
19184C6306165j637969j197751j173153j706930k309502k559091k486706k110445
19176B1124618j534769j141835q22669p34951n84682o04988o65069o74691p91381
19167A3569583p73807p72533p39922o91036o79219n83288m60050m31463m11096
19158H027169l73150l74560m04948l75413m13648l20449k27796k28782k25534
19149E082889l04365k67821j22222j31413k35386j39438r3688o4894j63083j70030
$$ plain form
19207 43346632 48198285 51877463 53836446 54366561 54574360 56095125 60412817 68003100
19199 68003100 78447494 90060957 100982596 110257777 117201050 120420357 118196626 109612093
19191 109612093 95194842 77960344 62454081 51120225 43762682 39082919 36306165
19184 36306165 34668196 33470445 32297292 30590362 28280860 25721769 23235063 21124618
19176 21124618 19589849 18448014 17625345 16890394 16305712 15700724 15035655 14360964 13569583
19167 13569583 12795776 12023243 11283321 10592285 9913066 9329778 8869728 8438265 8027169
19158 8027169 7654019 7279459 6874511 6499098 6085450 5765001 5537205 5308423 5082889
19149 5082889 4778524 4510703 4388481 4257068 4021682 3882244 3788556 3723662 3560579 3390549
19139C390549q5273J8557M2440o3956j28455j60554p3775j7436j2937r3248j06235
19128B709677l4378r2410j24123l6449J8225k8247q655L8016L4205j29771j78390
19117B167700m2301j8177m8510J520K5351K0730M3413J35156J25014R4836P6946
19106B581678J30305K7987n7401j56434j35047j14579j24220j68305j57431j51545
19096A675008j8012K3731R158p2043j227j6948n1689j02676m7588J2368O3753
19085A473835M1484l2937m6589l2889M1851O6302p9724q6409q4949j7648N2219
19074A294546J5185j1405n9963k036o914n8015O8012R9024K4784O179l1871p8933
19062A258593L780P2912k367q6792J7904J05194N5872R1277J25410J26796L0565
$$ plain form
19139 3390549 3305276 3323833 3366273 3302317 3173862 3013308 2939533 2922097 2909160 2815912 2709677
19128 2709677 2675299 2582889 2458766 2422317 2440542 2412295 2403640 2441656 2475861 2346090 2167700
19117 2167700 2125399 2107222 2058712 2060232 2085583 2106313 2149726 2284882 2409896 2504732 2581678
19106 2581678 2711983 2739970 2682569 2526135 2391088 2276509 2152289 1983984 1826553 1675008
19096 1675008 1656996 1680727 1689885 1617842 1616615 1599667 1547978 1445302 1397714 1410082 1473835
19085 1473835 1515319 1482382 1435793 1402904 1444755 1511057 1431333 1344924 1259975 1242327 1294546
19074 1294546 1309731 1298326 1238363 1236327 1229413 1171398 1239410 1338434 1363218 1369397 1337526 1258593
19062 1258593 1262373 1335285 1332918 1246126 1264030 1369224 1425096 1516373 1641783 1768579 1799144
19051A799144N318o7083j55093p1897j38495j25691j72299r5078k4942o4168J9393
19040I09109l2268l3673o666M7871r838j9042k2052O932j59L7742K6221M6880
19028I51057o2465m7485q4111n727n2469o3957l885j280Q5547Q5463r665m6749
19016G44274j21740j7339m4344m119k0884j4493O7908L4946j6426l4495N0265
19005F23553j2172k8531k0850k0002J5886j4678k2334J7900J2643K9306o2390
18994E18331l7555N8225j0831k9361K0121J4697R149N686j184m2633j32780o6004
18982C05861M5363m630M8026R5876p857o9284J8153J0324j02419L846M3174M8282
18970D34715k4682k7690N1959J6345l7949N854L7179P430m4264o0447k57o224
$$ plain form
19051 1799144 1804462 1737379 1582286 1510389 1371894 1246203 1073904 978826 953884 889716 909109
19040 909109 876841 843168 836502 884373 874535 855493 833441 840373 840214 877956 904177 951057
19028 951057 888592 841107 756996 751269 698800 634843 630958 629678 715225 800688 791023 744274
19016 744274 622534 605195 560851 556732 535848 521355 589263 624209 607783 573288 623553
19005 623553 611381 582850 562000 541998 557884 543206 520872 538772 551415 580721 518331
18994 518331 480776 539001 528170 498809 518930 533627 542776 548462 547278 504645 371865 305861
18982 305861 351224 346594 394620 490496 482639 413355 431508 441832 339413 343259 386433 434715
18970 434715 410033 382343 434302 450647 412698 418552 455731 463161 418897 358450 358193 351969
18958C51969n787P6447L8844N3644J8886r0208M2976J507M3958O9647J0061l7524
18946E74420p7002j3804j2593j9312l9124N3107O4862o416l7743J6780m2647j04066
18934C56462N3724R1732P2192k3163l1105P2260N8376M2628J063K1221K7933m7721
18922F95602j669o2073O923O7040j0667J4980K6720Q4279J09887N0655k3918l3500
18910I24259p051J4593j21852j29929m3665K3954M224j4180M6364k6217l5398
18899F35102N408j4173j31491r4579J33585M463o6553l2938k5196n3921O6442
18888D26149M3754k7484j2441M2433N6373j5741m6144o9061L5657J01891N5242
18877E90628M4128R34l5523J3607M1839L5462P5107k2741j28619O1130J2135O5972
$$ plain form
18958 351969 346182 422629 461473 515117 534003 443795 486771 488278 532236 601883 611944 574420
18946 574420 497418 483614 471021 451709 412585 465692 530554 524138 486395 503175 460528 356462
18934 356462 410186 501918 574110 550947 519842 592102 650478 693106 694169 715390 743323 695602
18922 695602 693933 631860 638783 705823 695156 710136 736856 821135 931022 981677 957759 924259
18910 924259 917208 931801 809949 680020 636355 660309 664533 650353 696717 670500 635102
18899 635102 640510 626337 494846 400267 533852 538315 471762 438824 413628 359707 426149
18888 426149 469903 442419 429978 472411 528784 513043 466899 397838 433495 535386 590628
18877 590628 634756 635690 600167 613774 655613 691075 766182 743441 614822 675952 688087 754059
18865G54059R1592j7024o2416n5563p5682J8868K6842Q2193M2107N71n5220n8070
18853F92257n5686k6049q5608n6223j7981l6336J2749o137l1919N9127j1064n2185
18841C84945p1554p3372L548R6828L7585k3170o9347o1184P984K3047N1595l4071
18829B72834R486K8836m2407k3635J2301J03803L107j8796J768m245m6706K5239
18817C21585L2955J07887J00871Q453j76730K6335J6301l8343l6348M6526q9390
18806C20102j36335M0408O9430j0766p7691l7743o2124N0616J46569L3251j25377
18795B10340k3717k4012l9196Q9193P9099l4431O5227P1023p0750n5565m2009
18784B25202p662K8988p7153L6794M9611J6494L6564l5869k2922k2022m1037n189
$$ plain form
18865 754059 845651 828627 766211 710648 634966 653834 680676 762869 804976 805547 750327 692257
18853 692257 636571 610522 524914 468691 450710 414374 427123 420986 389067 448194 437130 384945
18841 384945 313391 240019 243567 340395 377980 354810 285463 224279 232263 255310 306905 272834
18829 272834 282320 311156 268749 245114 257415 361218 364325 345529 347297 343052 296346 321585
18817 321585 354540 462427 563298 571751 395021 421356 437657 399314 362966 409492 320102
18806 320102 183767 224175 293605 282839 205148 167405 105281 155897 302466 335717 210340
18795 210340 186623 162611 123415 212608 291707 257276 322503 393526 322776 267211 225202
18784 225202 217540 246528 169375 206169 255780 272274 308838 272969 250047 228025 186988 181799
18772A81799n789N1340J04258m4809j07422K6816K2088n4486q9620Q5573M5873
18761B15621M8428k7734n397O7670K2416m1173p1839k1605Q1728P5754J5474j6008
18749C43335j3442l6095M0066N8376L4548K516J8247L6731K084O2008L8436l6923
18737E49887m037M3102K9434O2730l4073l1352Q3893L8165L3932j4688k9037r0748
18725F37208p2207L520K0280L1502o5862l3467r364o1434r6413O094P8716j7326
18713D21247k5815k3135j03148q9159J2705J0229R4857N8116j679K8869k490k0542
18701C60055k824k3958j00171N0847J23951m31p6684J2125R5000J69019J40863
18690G47792J4425j49015j4244J9638K5375p1771L6625P7118l8361n1191P246
$$ plain form
18772 181799 176010 227350 331608 286799 179377 206193 228281 173795 84175 169748 215621
18761 215621 264049 236315 230918 298588 321004 279831 207992 186387 268115 343869 359343 343335
18749 343335 329893 293798 333864 392240 426788 429304 447551 484282 486366 548374 586810 549887
18737 549887 545850 588952 618386 681116 647043 615691 699584 737749 771681 756993 727956 637208
18725 637208 565001 568521 588801 620303 554441 520974 511610 450176 353763 359857 438573 421247
18713 421247 395432 372297 269149 179990 192695 202924 297781 355897 354218 383087 380597 360055
18701 360055 357231 333273 233102 283949 407900 407469 330785 342910 437910 606929 747792
18690 747792 762217 613202 598958 618596 643971 572200 608825 685943 647582 596391 603637
18679F03637o0225O328M6717O6371M6437m0641k4288L2896Q191j09218j79593
18668C96612k188Q906r4183n7192j4849j7596L5102L5195M4849j3305o0062l2180
18656B29109l6700k7492L1175O2636p3016m1794K0396M064O7969M4391k2140j9189
18644B39409O757J4804o6166m7297l3120l7692J656o0709o6157L210Q5013J10613
18632A50321L5740N8292O2746K2984m2939m14J9960n4656p1468k3889O659l2069
18620A31267N182M7548j5610K3932j5133j7780o764k1573m1070P3503L1227o7255
18608A27474l2864p3462M2034L8366M9704J4803O254k9569n617l6737l2123M4506
18596A12769n522n8355J9222M5764L9710n8924L3410M8702J4923j8841j4050O6882
$$ plain form
18679 603637 543412 549740 596457 662828 709265 668624 644336 677232 685423 576205 396612
18668 396612 394424 403330 309147 251955 237106 219510 254612 289807 334656 321351 261289 229109
18656 229109 192409 164917 196092 258728 185712 143918 164314 168378 236347 280738 258598 239409
18644 239409 246166 260970 194804 147507 114387 76695 78351 17642 -48515 -45305 39708 150321
18632 150321 186061 244353 307099 330083 287144 286730 306690 252034 180566 156677 163336 131267
18620 131267 136449 183997 168387 192319 177186 159406 152642 131069 89999 163502 194729 127474
18608 127474 94610 21148 63182 101548 151252 166055 172309 142740 137123 100386 68263 112769
18596 112769 107247 48892 68114 113878 153588 94664 128074 176776 191699 172858 158808 225690
18584B25690l9618j724l2156K2332J8706M8885M3057k710j15531j54921p178k0275
18572a5443l6824M4453P6562K5316M5635l2569j0586J16679K4466n7487m7377
18561A32825o2101M6302O2991j1937k1892l6077k9253J9838k4153J6183M8667
18550A41393L0029m7236Q100J5721J2482k8516o400L1961o8340q6081m067P5822
18538G4868P8583M2196k6126o9646l6968j0133L6569N1094N8684n0151l6921o1916
18526E0133j00826M0918R1315k5319j6664M1897M4614p0241R232L1345r2203K4141
18514B8342P9439j3524r557k0409l406J7249Q1770j0583p6300q043L5093Q956
18502A09027j4224j8581m9385M0478J12271j6139o8168r063L7555o0545n773J8833
$$ plain form
18584 225690 186072 184348 152192 174524 193230 242115 285172 282462 166931 12010 4832 -15443
18572 -15443 -52267 -7814 68748 94064 139699 107130 96544 213223 237689 180202 132825
18561 132825 70724 117026 180017 168080 146188 110111 80858 100696 76543 92726 141393
18550 141393 171422 124186 132286 148007 160489 131973 125573 157534 89194 3113 -954 74868
18538 74868 153451 195647 169521 99875 62907 52774 89343 140437 199121 148970 112049 50133
18526 50133 -50693 -9775 81540 56221 39557 81454 126068 55827 65059 96404 4201 28342
18514 28342 107781 94257 84700 64291 60885 78134 159904 149321 73021 64978 100071 109027
18502 109027 94803 76222 26837 67315 179586 163447 95279 86216 123771 63226 57453 76286
18490G6286L025l3937j5327n5895Q44N7962l9366m6997m9872N6405Q5930L3942
18478G3000L0275p418k1306M6276M288j03320m2893K1960k6414J669K7806O6153
18466G0076N9431N626l1185M1758J4579J3008Q674p7806k0030J809O6397m4140
18454A08197l6992K0842M9004j8585q7153m9127N1201j7523j1816Q607K274j6369
18442B560J9418M7438k3357k3836m8211l3887M2439N4766Q7937M3466k5918N7286
18430B00101o0252n2420m351R3757r373J2359M340L776q3424j31625l0191P7808
18418B0505k5553L0650K7618k455N3984P3753p4784p3610J00048J4169j1201l8388
18406I4736R426j2320n1465o9707N511r579k4883m164L8677Q0211L8079m8001
$$ plain form
18490 76286 79311 45374 30047 -25848 -25004 32958 -6408 -53405 -103277 -46872 39058 73000
18478 73000 103275 95857 74551 120827 125115 21795 -21098 862 -25552 -23883 3923 70076
18466 70076 129507 135133 103948 145706 160285 173293 181967 104161 84131 85940 152337 108197
18454 108197 71205 92047 141051 122466 35313 -13814 37387 19864 8048 16655 18929 2560
18442 2560 21978 69416 46059 22223 -25988 -59875 -17436 37330 125267 168733 142815 200101
18430 200101 139849 87429 83078 176835 167462 179821 184161 187937 104513 -27112 -57303 20505
18418 20505 -5048 25602 53220 50765 104749 178502 103718 30108 130156 144325 133124 94736
18406 94736 104162 91842 40377 -29330 -23819 -33398 -58281 -62445 -23768 56443 94522 46521
18394D6521J1895R810N1950O8439r7852O420K1967L4014J0029m938m6622l7550
18382G4083m5553K8498M9065P515j8905N004n1810o9771m2361J3290K2929P0624
18370D2608L9618j4952n4543J8697K9599m3390P9874O2284k0784j25578o7146
18359e3713P6557P475K0669M0737J6027j2394l8068N1180m37n5371P493L907N1116
18346A15178j1245q7728j5506n3280K1643O5142N3984L7168q6277n4156M4699
18335B9622J02527q3017j00620L3835R2747L3464P2244K4729k3825j6499j08424
18324E6783m8090P2304N2301j08116j07182L5583Q6808N9174R795j4015l6091
18313E9254J469R8809o3077q7941J8386m2497J0949M4270O4448K4789k8019j4074
$$ plain form
18394 46521 58416 68226 120176 188615 90763 97183 119150 153164 163193 158255 111633 74083
18382 74083 28530 57028 106093 113608 94703 99707 47897 -21874 -64235 -50945 -28016 42608
18370 42608 82226 67274 12731 31428 61027 17637 97511 159795 139011 13433 -53713
18359 -53713 22844 30319 50988 91725 107752 95358 57290 108470 108033 52662 60155 64062 115178
18346 115178 103933 16205 699 -52581 -30938 34204 88188 125356 39079 -15077 29622
18335 29622 132149 49132 -51488 -17653 75094 108558 180802 205531 181706 165207 56783
18324 56783 8693 80997 133298 25182 -82000 -46417 40391 99565 109360 95345 59254
18313 59254 60723 159532 96455 8514 26900 -15597 -4648 39622 104070 128859 100840 86766
18301H6766L8592k693k2403j8581J7528k5221m0725L3533k8105j8143M5596k5087
18289D1057q09j660M7093K6571J3373M7884K5590k9961m8238K2890O5003r559
18277A99234m5043j8573j0956q477K5304o4038l7592n2358J6209k7752R40K9147
18265F045M8462M3553o9571m1438N3657L5922J8707K4971L727M5938o400J7546
18253A81119p0278o4587n8810l425M5916m1459l7620Q7538J4862P555q211p6978
18241b4378M5369J01659J3585R973L2208N0834o6395m5410p4684R4N0419r6137
18229b863K7850P302j8621j3331p278M0041J18396m483m8494Q089N4667M263n62
18216A64976k9199J2708m4471j8311m4512P2118J0110r178K5547J2973q9967J5624
$$ plain form
18301 86766 125358 122665 100262 81681 99209 73988 33263 66796 38691 20548 66144 41057
18289 41057 40248 38588 85681 112252 125625 173509 199099 169138 120900 143790 208793 199234
18277 199234 154191 135618 124662 116185 141489 77451 39859 -12499 3710 -24042 -23102 6045
18265 6045 54507 98060 28489 -12949 40708 76630 95337 120308 124035 169973 163573 181119
18253 181119 110841 46254 -12556 -15981 29935 -11524 -49144 38394 53256 60811 52600 -24378
18241 -24378 20991 122650 136235 146208 178416 229250 162855 117445 42761 42855 93274 -2863
18229 -2863 24987 32289 13668 337 -6941 33100 151496 147013 98519 106608 161275 165538 164976
18216 164976 135777 148485 104014 85703 41191 113309 123419 114241 139788 152761 62794 78418
18204G8418J769l4374M6330R7655K9915q840L5101r1660q631l21p328m1631j7880
18191G8523n9078K1548K1863n2170q953o102l3853o907l2942q4523M7395j6557
18179a31756J05967R5148L0165M2442J9360m4123o0058m4183k3847M6988J8052
18168E4155O2270k8403m6985j2663N3757O5961J8329j2483o7793r1645j1832L6622
18156A9290J5723o5237k8314O6774P6351J005q0914k254o088K4204N782k37O6102
18143I2187O9513k6682j07885n6780L4399P2205n0951k129O8397o2155k4111j1493
18131e485l3857m2862R0030L7641K3687N6696k1669p0758L1232n9215j8579L8773
18119B5634M0196O588J0646l2553O16r7293K1994K3990J1226N085k1204Q5326
$$ plain form
18204 78418 80187 45813 92143 189798 219713 210873 245974 154314 145683 145362 138034 96403 78523
18191 78523 19445 40993 62856 10686 1733 -4369 -38222 -45129 -78071 -162594 -115199 -131756
18179 -131756 -25789 69359 99524 141966 161326 117203 57145 12962 -10885 36103 54155
18168 54155 116425 88022 41037 28374 82131 148092 166421 153938 86145 -5500 -17332 19290
18156 19290 35013 -30224 -58538 8236 84587 85592 4678 2424 -3664 20540 26322 26085 92187
18143 92187 161700 135018 27133 -29647 4752 76957 26006 23877 92274 30119 6008 -5485
18131 -5485 -39342 -82204 7826 45467 69154 125850 104181 33423 64655 5440 -13139 25634
18119 25634 65830 72418 83064 50511 51127 -46166 -24172 -182 11044 16129 -5075 80251
18107H0251p175o2970j7576R322R536O3201q14R275j9974m697j3153K5582L9627
18094A10435q2298k6606m9789k9095L4689P6885J5458L8663J04704K9555r8210
18083A24391m9821l053m0684q1435o9820o4439k9509J17723Q1919l2467j8314
18072f5509l4167R2908O1790R77j22554l9498M2808l6868l7495J9701j5310L5933
18060i7284O6156n42L9410J7358k1294L0744O9261O0975k9370j5050K635m7192
18048G5807n4499l7780J0878Q694j1951K492P442M5028J8208M9037N932l7136
18036H2152p0149O208k9960K130M8000p8559p2179O1042L6589K4210L5613o001
18024C9096R27L0865j12823l2024L7223L4274M2101n775n6876l2349k4572m0083
$$ plain form
18107 80251 73076 10106 -7470 1852 11388 74589 73775 83050 63076 58379 45226 70808 110435
18094 110435 28137 1531 -48258 -77353 -42664 34221 49679 88342 193046 222601 124391
18083 124391 74570 71517 30833 -50602 -120422 -184861 -214370 -96647 -14728 -47195 -65509
18072 -65509 -99676 -6768 55022 55999 -66555 -106053 -63245 -100113 -137608 -117907 -133217 -97284
18060 -97284 -31128 -31670 7740 25098 3804 34548 103809 164784 135414 120364 122999 75807
18048 75807 21308 -16472 -5594 3100 -8851 -6359 1083 46111 64319 113356 119288 82152
18036 82152 12003 18211 -11749 -9619 38381 -40178 -112357 -51315 -14726 9484 45097 39096
18024 39096 40023 70888 -41935 -73959 -36736 -2462 39639 33864 -23012 -55361 -79933 -120016
18012a20016L4329j5793l1838K6371O8157Q7590m134k9820l5405Q0192L4364K4421
18000A18418l0940n4652j0264K9324K3415r9299o0090K0447N1916l8192J392l6306
17988h4831K1145O0420O9529J5567r9367r111j7273j5003K7153m8411P7298M4286
17976D1402L571K2225J3326K7775l461j6178k2009q8396n2035j2445L876M373
17964g7976p860q1826K9614Q0666P6418k0141q1363n040j816r429O9855M1078
17952A2180Q2887P1210N0551N608o8834k4256k923j5715n0499K2422Q1J2852j169
17939I4395n5309l704N1630M7879l204L2686j6682R150p2305r329Q38P295j0197
17926G3143m1454k7893n1279M2812j8555n0192m4169J2241R1335J24129M0057
$$ plain form
18012 -120016 -85687 -101480 -133318 -106947 -38790 48800 44666 14846 -20559 59633 93997 118418
18000 118418 87478 32826 22562 51886 75301 -23998 -84088 -63641 -11725 -49917 -48525 -84831
17988 -84831 -63686 -3266 66263 81830 -17537 -26648 -43921 -58924 -31771 -80182 -2884 41402
17976 41402 44973 67198 80524 108299 104838 88660 66651 -21745 -73780 -86225 -82349 -77976
17964 -77976 -85836 -167662 -138048 -57382 19036 -1105 -82468 -87508 -89324 -98753 -28898 12180
17952 12180 95067 166277 216828 222436 153602 129346 126423 110708 60209 82631 82712 95564 94395
17939 94395 39086 35382 87012 134891 131687 164373 147691 156841 84536 75207 76045 83340 73143
17926 73143 31689 3796 -47483 -4671 -23226 -73418 -117587 -105346 -14011 110118 150175
17915A50175m8214j04180k420P2344P1790j9730l0180m3558j35273j166J0851
17904g9561o575J03456L6140J3171l2055j0921K0741O393j01833k4438Q7150M5190
17892E6858l2598l9670K1511O018L766P5412J9346R044n5143k5607L0346q050
17880F1233j8515J8117p0035m2809R6506O4372j5029L4251l3050l9136O3378p8717
17868D0566m3283O835K7132K416j8622N866n0668P8032M6008k8540k2141N1929
17856I5530k9692n1961j0321k6326p3936O1065M5805n9837l4979J27247M6241
17845H8836n0870q1960J1643k0507j0115K2463M4715P7740K5797m4716j775R176
17833G0427o4208n1250K5336M2810j1716K459m177q322l926K4668m7157l2594
$$ plain form
17915 150175 101961 -2219 -4639 67705 139495 119765 89585 46027 -89246 -90412 -79561
17904 -79561 -86136 17320 53460 66631 34576 23655 44396 50789 -51044 -75482 11668 56858
17892 56858 24260 -15410 6101 12119 15885 91297 110643 119687 64544 38937 69283 61233
17880 61233 42718 60835 -9200 -52009 44497 108869 93840 128091 95041 55905 119283 40566
17868 40566 -2717 4118 31250 33666 15044 20910 -29758 48274 94282 65742 43601 95530
17856 95530 65838 13877 3556 -22770 -96706 -35641 10164 -49673 -84652 42595 88836
17845 88836 37966 -43994 -32351 -52858 -62973 -40510 4205 81945 107742 63026 61251 70427
17833 70427 6219 -45031 -19695 23115 11399 13858 9681 1359 -2567 22101 -25056 -57650
17821e7650J36088L160k2428J9326K5391o8540k0009M9231m961L438O0833n2712
17809G1167r3314p2697l231R6499J36812M3899n4683m9333o211l843o332m207
17797E4526o8337n387O5174O0786r1627n2466M558P3442l8370l8030l1217R288
17785e7660j1999o227m027M5801K6384j4447j7851q866J22301J3518m4271R460
17773E2116J9045m5686j32723J0551M4385L8686K4750P8537N0013k2506Q4166
17762B01334o3692j05602j2620R8124N3000m3258K9945n8701j04731l5872J8667
17751b3406l2931p615L4320N3348q251q9255K64Q2335J3417k7440l8144K0565
17739b2793Q3604k4525l976l5827q3225N9413P3935J3051k8615l4546P3965M246
$$ plain form
17821 -57650 78438 81598 59170 78496 103887 35347 15338 64569 59608 63046 123879 71167
17809 71167 -22147 -94844 -98075 -1576 135236 179135 124452 75119 68908 65065 58733 54526
17797 54526 -13811 -19198 45976 106762 15135 -37331 -32773 40669 2299 -35731 -66948 -57660
17785 -57660 -69659 -75886 -79913 -34112 -7728 -22175 -40026 -48892 73409 86927 42656 52116
17773 52116 71161 25475 -107248 -96697 -52312 -13626 11124 89661 139674 117168 201334
17762 201334 137642 32040 19420 117544 170544 127286 157231 98530 -6201 -42073 -23406
17751 -23406 -56337 -63952 -29632 23716 15465 -73790 -73526 8809 22226 -5214 -43358 -22793
17739 -22793 60811 36286 32310 -3517 -86742 -27329 46606 59657 31042 -3504 70461 74707
17727G4707j08190l4171j08209K7746J19563L4003m7469l8467j0248q065j9412
17716a18212K1685j8153K1401L1111P1860J2023N5507N6304m9418p4981L310j9044
17704f607J880p006m6250K7195j4398N4458N1593O6475P2432m6662q1902n3956
17692A7252Q74o7482l8176K1802L8336K5407r99q954L0586k1392J9540N9459L6436
17679A12689n597k5027P133p319l3582n5609l0978M8926J3336o87L5984O5981
17667A25250N3826p7502J4193L7778L2964P701o0102r786N5003q0509j00576m2058
17655d3818L9089M3110O4918j657J3459O299O1963k0042m840j0701r3681n6164
17643b065l4625J1265J165j7423K8975j852M3954k7457M4947l5125N218K1398
$$ plain form
17727 74707 -33483 -67654 -175863 -148117 -28554 5449 -42020 -80487 -90735 -98800 -118212
17716 -118212 -96527 -114680 -93279 -62168 9692 21715 77222 133526 84108 9127 12437 -6607
17704 -6607 -4727 -11733 -57983 -30788 -45186 9272 60865 127340 199772 153110 71208 17252
17692 17252 18126 -49356 -87532 -65730 -27394 -1987 -2986 -11940 18646 -2746 16794 76253 112689
17679 112689 107092 82065 89198 81879 48297 -7312 -38290 10636 23972 23285 59269 125250
17667 125250 179076 101574 115767 153545 186509 194210 134108 124322 179325 98816 -1760 -43818
17655 -43818 -4729 38381 103299 101642 115101 121400 183363 163321 158481 147780 54099 -2065
17643 -2065 -36690 -25425 -24260 -41683 -12708 -14560 29394 1937 46884 11759 16977 38375
17631C8375j0239o8921K4569Q8999L3563n6848Q6907l050r3247o2021N887Q8460
17619G2434k7495L0441l9588m5226K9121L2006J2416q5459l1470m381l8422K9909
17607f5714L5102J6263P097j7812N0702P610k7101J6166l7608l8868M3815k6108
17595c6456j863Q5474J34480o533l7976o8096l7818m1696l5100j360l0500Q0074
17583B630O2773m4554p9646n1798J7279L2650l1609q7833K114O8795K5456P7814
17571e929M0041L3223J0856J606p6024r7134J07081J04168m487n0781n0013K4198
17559C6805k125n3524M638M4307P4000n0090n2957O9652m3453p2762k0227M9878
17547a5858P944p4354q780M85K8339M1261O5461L361M499m0652j5587M728j1029
$$ plain form
17631 38375 28136 -40785 -16216 72783 106346 49498 136405 133355 40108 -21913 -16026 72434
17619 72434 44939 75380 35792 -9434 19687 51693 64109 -21350 -52820 -57201 -95623 -65714
17607 -65714 -30612 -14349 -7252 -25064 25638 33248 6147 22313 -15295 -54163 -10348 -36456
17595 -36456 -38319 47155 181635 175102 137126 69030 31212 -10484 -45584 -46944 -77444 2630
17583 2630 65403 20849 -58797 -110595 -93316 -60666 -92275 -180108 -177994 -109199 -83743 -5929
17571 -5929 34112 67335 78191 79797 3773 -93361 13720 117888 113401 62620 12607 36805
17559 36805 34680 -18844 -14206 30101 104101 54011 1054 70706 27253 -45509 -65736 -15858
17547 -15858 -7914 -82268 -91048 -90563 -62224 -20963 44498 47859 52358 11706 -3881 847 -10182
17534a0182m0295J0502P5943J8883N5792n7305K299K9540n6324n0298k8494K3915
17522b6024O4290K1219j6610N5816l8032m7676k7316K1026n7856J05553M8459
17511A02849o0810r840l3595l4003l4056J0715J01060L2497R210Q2393P809j04435
17499F9794j8183L8898M8663p0268j00958M6247O412k1644k3472O211J265j9719
17487c6754P6039M8072j3225m2470K2225N4763n8121n6168O263K5339m0810j22650
17475a37497P383L2679O522N8310j7774l1123m6130J4425N5359j9343N2571j6547
17463d1165l408k874j0578K7425m7131j9445j885K8809J11917M6721r3030r5145
17451i9789K8211Q4023M5197K1207K7325k4745n556r0226o467L4182q041n69j5173
$$ plain form
17534 -10182 -50477 -39975 35968 54851 110643 53338 55637 85177 28853 -21445 -49939 -26024
17522 -26024 38266 59485 42875 98691 60659 12983 -14333 6693 -51163 54390 102849
17511 102849 42039 32199 -1396 -35399 -69455 -58740 42320 74817 84027 166420 174229 69794
17499 69794 51611 90509 139172 68904 -32054 14193 20605 -1039 -24511 -18300 -17035 -36754
17487 -36754 39285 87357 74132 31662 53887 108650 50529 -5639 624 25963 -14847 -137497
17475 -137497 -130114 -97435 -90913 -32603 -50377 -81500 -127630 -113205 -57846 -77189 -24618 -41165
17463 -41165 -44573 -47447 -58025 -30600 -77731 -97176 -99061 -70252 41665 88386 -4644 -99789
17451 -99789 -71578 12445 57642 78849 106174 81429 75873 -14353 -20820 13362 5321 4752 -10421
17438a0421k7291O1500J01356L4898o1649J4656j8806p0791J7221P183j0420m5891
17426h455k200p589l0475n5323J6935M0296k9588K5053j705K5097L3721n0842
17414d5075m4497m7096m3156J00040P2363m5253l2563K217L3893L2497k7839J0957
17402c3512J1467l2956j1286O374N540J05866J3727k6836l1612j25670r5056J5245
17390a98709P9205J07514k3486J0392p75K1602k5573J0840l219j422O948P7669
17378F0986m5772k4874q4178N5253J22487K3876K5226J9580J7188J1851m4602
17367A37021n0458o354N9010l9381j17409n1621L4252N2279m624l1348L8605l8574
17355a8602j0825j1124n2926P6058Q855M1368q800n8658J6369r429p0049J40314
$$ plain form
17438 -10421 -37712 23788 125144 160042 98393 113049 94243 23452 40673 47856 37436 -8455
17426 -8455 -10655 -18244 -48719 -104042 -87107 -46811 -76399 -51346 -53051 -27954 5767 -45075
17414 -45075 -89572 -136668 -179824 -79784 -7421 -52674 -85237 -83020 -49127 -16630 -44469 -33512
17402 -33512 -22045 -55001 -66287 -59913 -54373 51493 65220 38384 6772 -118898 -213954 -198709
17390 -198709 -119504 -11990 -35476 -25084 -25859 -4257 -29830 -18990 -22209 -23631 -16683 60986
17378 60986 15214 -9660 -93838 -38585 83902 107778 133004 152584 169772 181623 137021
17367 137021 86563 80209 139219 99838 -17571 -69192 -34940 17339 12715 -18633 19972 -18602
17355 -18602 -29427 -40551 -93477 -17419 -8564 32804 24004 -34654 -18285 -27714 -97763 42551
17343D2551O1167n9081j9338m5011r6934j6023J7761J9359l3790p0817J14082
17332h6074L6816n7399j0187N8842m3586n1532k3793n4150P1545M4933N5027N9752
17320A94K3192l9542M6514P391l0161m0886l6281O9002L4639l1132o7704M5584
17308a9190K3838n4463L4779L5433O7176j2142m3761l8097L5158N956O0896q515
17296H7068j6054m1575m6067n6415M9379N9394q593m4386l2509K42Q6332K1106
17284E7922l6886J7673j631k7940m5150k8725o0996M5714L2049M326Q2546K3959
17272F2861K080o3584p6800m2632q154o2611j1722N2168Q5764m949j01117J868
17260a66828l499L0532P7576M1638N000k3622K3589N5407L6527l7623k7098N6525
$$ plain form
17343 42551 103718 44637 25299 -19712 -116646 -132669 -114908 -95549 -129339 -200156 -86074
17332 -86074 -49258 -106657 -116844 -58002 -101588 -153120 -176913 -231063 -159518 -114585 -59558 194
17320 194 23386 -16156 30358 37749 7588 -33298 -69579 -577 34062 2930 -64774 -19190
17308 -19190 4648 -49815 -15036 20397 87573 75431 31670 -6427 28731 34687 95583 87068
17296 87068 71014 29439 -16628 -73043 -23664 35730 27137 -17249 -49758 -49516 36816 57922
17284 57922 21036 38709 37078 9138 -36012 -64737 -125733 -80019 -47970 -43644 38902 62861
17272 62861 64941 1357 -75443 -118075 -126229 -188840 -200562 -148394 -62630 -67579 -168696 -166828
17260 -166828 -170327 -139795 -62219 -20581 -15581 -39203 -15614 39793 76320 38697 11599 68124
17248F8124N928j6041k3423p446K202m0046M3633m1711L5522L9236n1658q5855
17236g1535L2782K0066K3213q0107M6647M5339L6188J06046L4942l8361m3209
17225A12011p1488q3172M1575k158R247l828p1605m096N8517M4688l8387J0128
17213A432N0504L5340M9389M4922k2129m1433n3091J5293j19056L375K3415p1211
17201h3250P027l5589M1011q5802j7772P9544Q3989J0878j5106l029K3132r5203
17189i0170k5958J15360Q5495k70p6513j7988l3469M6407P761l5974m1275J8303
17177d8291O9624K9518k1632m9018L6978n2083m2280N9301J9616L322K5740k6207
17165D588n2356Q619L9244k3859r332Q9335M9714L6880N383o7931m3208Q2941
$$ plain form
17248 68124 74052 58011 34588 27142 29344 -10702 32931 -8780 26742 65978 14320 -71535
17236 -71535 -38753 -18687 4526 -75581 -28934 16405 52593 158639 193581 155220 112011
17225 112011 40523 -42649 -1074 -3232 6015 2187 -69418 -73514 -14997 29691 -8696 1432
17213 1432 51936 87276 136665 181587 159458 118025 64934 80227 -38829 -35454 -12039 -83250
17201 -83250 -76223 -111812 -70801 -156603 -174375 -94831 -10842 36 -15070 -18099 5033 -90170
17189 -90170 -116128 -768 84727 84457 7944 -10044 -43513 2894 10655 -25319 -66594 -48291
17177 -48291 21333 50851 29219 -19799 17179 -34904 -77184 -17883 1733 5055 30795 4588
17165 4588 -47768 -39149 95 -23764 -33096 56239 105953 142833 148216 80285 37077 120018
17153A20018J76j39815j17175l4475O3763M9291Q7144L8490l1309L7886K0884
17142I4878q163m8572j0510N5194o6650R127Q944o7388k7167j2864P5155o418
17130d434q1075k5508l6625L5999N2058J2884l3508n501N1624L9496M3847K9360
17118G8617r472j2361j2476n1750R852O1987k8919m4583N2554J5562j7112J8074
17106E9973J9992K22o7332k9912L7463j0126J1802J3973o7604n4373o8192K6982
17094a27132L0865r623n6957K486L5353O2723Q7338J0464J2959p5374j8182P3168
17082B8088J281l2392n1290K854R6465j5103N670j2820K198m9103J0890J9558
17070F296N5803P2805k1527O3953p5739j64433l5640N0025K4597K8962P5943Q939
$$ plain form
17153 120018 120194 -19621 -136796 -171271 -107508 -58217 28927 67417 36108 73994 94878
17142 94878 86715 38143 27633 82827 16177 25304 34248 -33140 -60307 -73171 1984 -4434
17130 -4434 -85509 -111017 -147642 -111643 -59585 -46701 -80209 -85710 -34086 5410 49257 78617
17118 78617 69145 56784 44308 -7442 2410 64397 35478 -9105 43449 59011 41899 59973
17106 59973 79965 80187 12855 -17057 20406 10280 22082 36055 -31549 -85922 -154114 -127132
17094 -127132 -96267 -105890 -162847 -160361 -125008 -62285 25053 35517 48476 -26898 -45080 28088
17082 28088 29369 -3023 -54313 -51459 45006 29903 35573 22753 24951 -24152 -13262 6296
17070 6296 62099 134904 113377 177330 101591 -62842 -98482 -48457 -23860 5102 81045 89984
17058H9984r902k6898r309l5484K2545J6291n3134l6166l9687M2636J06530m241
17046F3165O130l8782m6939P451O3341L9222l1212K1871n2671L0856q1022j04597
17034a23187Q2372J50531m7303j48660m9321L7479N4595l8152p2644j1894Q6918
17023g9266Q3749M9003m6993Q718Q018K5689k4554m8254J6861P0775k8867p1531
17011c6652n3990O1221K4167P6077N2235p3653j5618M1669K0983k1286q8294q1985
16999i5126k3298O4527L5917o9848p1963M644J6192M2858M0805j9313j1177K8862
16987e6920j1391r277j176P6836N0157m5683q557L0878L3287k1055n386q448M859
16974B8124K6808J02433L1403k5449n7169j33306q7656J0862l8995k6417K4665
$$ plain form
17058 89984 80082 53184 43875 8391 30936 47227 -5907 -42073 -81760 -39124 67406 63165
17046 63165 69295 30513 -16426 -8975 54366 93588 62376 84247 31576 62432 -18590 -123187
17034 -123187 -40815 109716 62413 -86247 -135568 -98089 -43494 -81646 -154290 -166184 -79266
17023 -79266 4483 53486 6493 15211 23229 48918 24364 -23890 -7029 63746 34879 -36652
17011 -36652 -90642 -29421 -5254 70823 123058 49405 33787 75456 96439 75153 -13141 -95126
16999 -95126 -118424 -53897 -17980 -87828 -159791 -155147 -138955 -96097 -55292 -74605 -85782 -56920
16987 -56920 -68311 -77588 -78764 -1928 48229 2546 -6011 24867 58154 37099 31713 23265 28124
16974 28124 54932 157365 188768 163319 106150 -27156 -114812 -103950 -142945 -169362 -144697
16963a44697K8205M9193J04887m3932n5032M6193k3266n1035O1N2349M637k3533
16951e5970K7406j7712n0867L9543J22617O1853n4167k3751j598j2867j6994l2717
16939a5224o6663P2006l289J6741k1863m6247k5546K719m1020J2532J15226J6666
16927A6038o6766n1039K725R9856N8077p3044l9957K042p279J6254o307k7620
16915g7020K3440L2262j8202j2376j0677o0565m1968L6469L7745N9515K1753k5230
16903c4854r934P500r603L9017P6119j5106l7598q051J4640o9448O2470j5270
16891a18l5700J5637L1191J08438j1169o3897K9718M0856j2931j29179j5903m8889
16879i1946O1791N2538M8625j025j7058l3557K0451L970m3697n4115p643N3660
$$ plain form
16963 -144697 -116492 -67299 37588 -6344 -61376 -15183 -38449 -89484 -89423 -37074 -32437 -55970
16951 -55970 -28564 -46276 -97143 -57600 65017 126870 72703 48952 47354 34487 17493 -15224
16939 -15224 -81887 -9881 -13170 3571 -18292 -64539 -90085 -87366 -128386 -115854 -628 16038
16927 16038 -50728 -101767 -99042 814 58891 -14153 -54110 -52068 -59347 -43093 -49400 -77020
16915 -77020 -53580 -21318 -39520 -51896 -62573 -123138 -165106 -128637 -90892 -31377 -9624 -34854
16903 -34854 -44788 -37288 -46891 -7874 68245 53139 15541 7490 22130 -47318 15152 -118
16891 -118 -35818 -20181 11010 119448 108279 44382 74100 114956 102025 -27154 -43057 -91946
16879 -91946 -30155 22383 71008 69983 52925 19368 39819 43789 92 -54023 -61666 -8006
16867h006M8940k6982l3693j3731K9754O0742k3679O1110K3567k0110j19143j5669
16855c6900K8821n0882l0917J2042J0395p17k9172j1282l5529L9318J6845L7634
16843e0344K0419N0407J5032r992L7326R23m2224J3052K9938k376q3480o4488
16831h5807r98q38J3967O9572r734r5059k3814J14287j2277k6547J9386O4126
16819B6264j07773j9689R740L3087Q8872R4800p4280r8031j1055o540Q114J1093
16807d5398N894K1223k1085r67J2476j2871n6322p0617k1906O1793K5020L9426
16795f3334o0600J9949N0638j8894J705L9804j8582J2897o212m2249Q566K7576
16783d8736l0992q352Q782J12149q887j27122j3265Q5015N827m920m5037l0340
$$ plain form
16867 -8006 40934 13952 -19741 -33472 -3718 57024 33345 94455 118022 97912 -21231 -36900
16855 -36900 -8079 -58961 -89878 -77836 -67441 -68158 -97330 -108612 -144141 -104823 -87978 -50344
16843 -50344 -29925 20482 35514 25522 62848 63771 21547 34599 64537 62161 -21319 -85807
16831 -85807 -86805 -87643 -73676 -4104 -13838 -108897 -132711 -18424 -30701 -57248 -37862 26264
16819 26264 -81509 -101198 -91458 -58371 30501 125301 51021 -47010 -58065 -64605 -56491 -45398
16807 -45398 -39504 -18281 -39366 -40333 -27857 -40728 -97050 -167667 -189573 -127780 -102760 -63334
16795 -63334 -123934 -103985 -53347 -72241 -70536 -30732 -49314 -36417 -42629 -84878 -76312 -48736
16783 -48736 -79728 -88080 -79298 32851 23964 -103158 -116423 -31408 -25581 -30501 -75538 -105878
16771a05878N6373L3560O6507p8380m9913M0905N9925L7518J1671N456r382q4750
16759a6388j12033l6611j2460n4412M0876J26975J20217j3812n2218J3656L3292
16748C7082K0009M1513J3761J0053q716L0315j9351j7285n3101l4915n053K8408
16736D2720q8702k0312J48243K8106j30403q477m3200k108R377M2175M1184L4265
16724E2868l4619j00691j8398L5046L4992L8349N2629O1178l3741n5327m0421
16713h135J7442P536N848p1860j15178m5453L9941K8190P1943R7098o261m7787
16701b6676L5097l2450Q641l0351o4103J4327j0925k8762N2726R3720J01716L208
16689A16168p4494r6243l9757K3251r66n851O8255l595q5511K5718q073P9752
$$ plain form
16771 -105878 -49505 -15945 50562 -27818 -77731 -36826 23099 60617 72288 77744 68362 -16388
16759 -16388 -128421 -165032 -177492 -231904 -191028 -64053 56164 42352 -9866 3790 37082
16748 37082 57091 98604 112365 122418 113702 144017 124666 107381 54280 19365 14312 42720
16736 42720 -45982 -66294 81949 110055 -20348 -28825 -72025 -74133 -64756 -22581 18603 52868
16724 52868 18249 -82442 -100840 -65794 -30802 7547 60176 121354 87613 32286 -8135
16713 -8135 9307 16843 22691 -49169 -164347 -209800 -169859 -141669 -69726 27372 21111 -26676
16701 -26676 8421 -24029 -15388 -45739 -109842 -95515 -106440 -135202 -82476 11244 112960 116168
16689 116168 41674 -54569 -94326 -71075 -72041 -77892 -9637 -13232 -98743 -73025 -81098 -1346
16677a346N7039P8153j4155n7362O1255R053q8956m7674N4816P6108k1090k4729
16665H1112J2120j708j19589r6302q660Q9580J84626M4566m5791o4347n7831K7569
16653D5345J3321k0215p3478J8978m712m6222j7481J13125P3944M784q8098l2742
16641a3451j34778o0986R624R5457M7298J0969M6753J18377R052p9655j4943K6447
16629F0164m6513j01793m1227L624O9991N847M4506J02025J5756m0150j0402m1667
16617B0161o5127P4985O5792M2496J1230p1419n1576l2101J435O5285o354p043
16605D7764K6155m59q0224n3722o3853j9442L4461m4568K984N4207K51o9774j9760
16592a85980P5034R4222l1313l2081k7191R0975O7717k2912l7648M931M0711q435
$$ plain form
16677 -1346 55693 133846 119691 62329 123584 132637 43681 -3993 50823 126931 105841 81112
16665 81112 93232 91524 -28065 -124367 -133027 -43447 141179 185745 139954 75607 17776 45345
16653 45345 58666 38451 -35027 -16049 -20761 -66983 -84464 28661 102605 107389 19291 -13451
16641 -13451 -148229 -209215 -199591 -104134 -56836 -45867 886 119263 128315 48660 33717 60164
16629 60164 13651 -88142 -129369 -125745 -55754 -49907 -5401 96624 112380 72230 61828 20161
16617 20161 -44966 30019 95811 138307 149537 78118 26542 -5559 -4124 61161 54807 47764
16605 47764 73919 73460 -6764 -60486 -124339 -143781 -109320 -153888 -150904 -96697 -96446 -166220 -185980
16592 -185980 -110946 -16724 -48037 -80118 -107309 -16334 51383 28471 -9177 -4246 36465 28030
16580B8030m2117q6598m8318j00079K3023L4666P1264J22262L2938m4892j06780
16569a16601o2677K87Q071R985N0671K6033M4896J13679K6050J7876J5675k0821
16557A13124o0478J2903K7563l3208Q571j2476q6254k0614J5379L6314J7963L4550
16545E3337r298M8189j1182k4909p0553j0765L7629o4567N3064J16182L0260m4455
16533A02932p9992j9907k3954q1643j9884L026r780R6456P4945l2254J903n2381
16521d0533l7464M8238P3873k0050k9888N916o2163N123J0996Q552l055M3782
16509C327j2119m9168L071N7153J7486Q835m5605j21686n5811R7825O2478Q7922
16497E3708j4309m7405J6430M9973K7089j08296o767l3310M6096J8293k6238k7842
$$ plain form
16580 28030 -14087 -100685 -149003 -249082 -226059 -191393 -120129 2133 35071 -9821 -116601
16569 -116601 -179278 -178991 -170920 -160935 -110264 -84231 -39335 74344 100394 118270 133945 113124
16557 113124 52646 65549 93112 59904 68475 55999 -30255 -50869 -35490 824 18787 53337
16545 53337 44039 92228 81046 56137 -14416 -25181 12448 -52119 945 117127 147387 102932
16533 102932 22940 3033 -20921 -102564 -122448 -119422 -129202 -32746 42199 9945 11848 -40533
16521 -40533 -77997 -29759 44114 24064 -5824 92 -62071 -56948 -45952 -37400 -40455 3327
16509 3327 -8792 -57960 -54889 2264 19750 28585 -17020 -138706 -194517 -96692 -34214 53708
16497 53708 39399 -8006 8424 58397 85486 -22810 -29577 -62887 -16791 1502 -24736 -52578
16485e2578L2712r194m5538r8806J6031R128M4621k1755L2231N9480J3889l9561
16473e9340K585J1716O339N620n2217p3970J8185J30921M2370n1340J9639L431
16461C939l479J7205l9m0260j01507k9202j9127O2799O2222K7572j6460j9826
16449e6163L4043J1069n212p471L1970o9217o1975L0307J07602O0932L6470p6017
16437C6338l2681M6372L9287n6178o9328j0264K4809p6493R5485K8845j1590L7680
16425E2282J721q351l5451j1279o4763p4576J7169J55197N6995k314n2280O323
16413D0673k4210k2182n4186p425j8919K5103k4523m0192k7165K8646N5134J5063
16401e4183R7852N2052k4895O272K346O7042k3539k5235p5359l3875j2515K1495
$$ plain form
16485 -52578 -19866 -29060 -74598 -173404 -157373 -148245 -103624 -125379 -93148 -33668 -19779 -59340
16473 -59340 -56755 -45039 -38700 -33080 -85297 -159267 -141082 -10161 32209 -19131 508 3939
16461 3939 460 17665 17626 -22634 -124141 -153343 -172470 -109671 -47449 -19877 -36337 -56163
16449 -56163 -22120 -11051 -16263 -23734 8236 -60981 -122956 -92649 14953 75885 112355 36338
16437 36338 3657 50029 89316 33138 -36190 -46454 -21645 -98138 -2653 26192 14602 52282
16425 52282 54003 45652 10201 -1078 -65841 -140417 -123248 31949 88944 86630 34350 40673
16413 40673 16463 -5719 -59905 -67330 -86249 -61146 -85669 -125861 -153026 -124380 -69246 -54183
16401 -54183 43669 95721 70826 77098 79444 146486 122947 97712 22353 -11522 -24037 -2542
16389b542N7570N7774K2460r7262j00950q8924K320j0386J7418L2785K4450o257
16377i1544L0624N5975O856k8937o7265N2512r63p9660o5479Q5022J25095k563
16365A9673J2587Q216M4698M3540l1311o5183n0613o6985l5455K2841N1018J2120
16353c4854l147K9221J42215Q8008n4750n5107j723r7545l9435j4058j0520L1653
16341b0042K3183n1140J4287O8842l3355K8543k6383l3280m4575n4363J08505
16330a9778J04477j8895j04960J553M3842j1690j8268q930L0701m160m9921K7788
16318b8241P9181Q873J6602l335r065r6920j25041p459J4574m469l600K3991Q1474
16305e3435O2470j15727K4083O3755M3695N4925K9578q5718J6209n5217k2908
$$ plain form
16389 -2542 55028 112802 135262 38000 -62950 -151874 -149554 -159940 -142522 -109737 -85287 -91544
16377 -91544 -60920 -4945 1911 -27026 -94291 -41779 -42742 -122402 -187881 -102859 22236 19673
16365 19673 32260 40476 85174 128714 97403 32220 -18393 -85378 -120833 -97992 -46974 -34854
16353 -34854 -38001 -8780 133435 221443 166693 111586 109863 12318 -27117 -41175 -51695 -20042
16341 -20042 3141 -47999 -33712 35130 1775 30318 3935 -29345 -73920 -128283 -19778
16330 -19778 84699 65804 -39156 -37603 6239 -5451 -23719 -32649 -1948 -6108 -56029 -28241
16318 -28241 50940 59813 76415 73080 64015 -32905 -157946 -165405 -150831 -155300 -158900 -134909 -53435
16305 -53435 9035 -106692 -82609 -18854 24841 79766 109344 23626 39835 -15382 -38290
16294c8290O6069l9376q012J07132l4444M1340O1332K1829m1007j16642M2115
16283F2046r592k253o37L9692k6520o2663r0091l3714j9680L8374P5099K5755
16271d184p5115k5630K161k8721l2421P3337Q7782m0524l7445N8084L4653K204
16259A4181n9753K9892N0936m0663R811N827n0900J2202L1864k551o8037l8218
16247a05409Q7887L8563j0020o9364p0039k3400K2276L3829R3496P709M0213L6003
16235H1744M2805n7494m5847j9435q1981M458N8328l291J8158Q082J0256J7070
16223C2853K007m9628N996o4481l0147M6574n973N8857k079l1490K1582j0004
16211b5933l456m1790M4389J5115M7193n5043j31002n8304M4330N0734m712j3417
$$ plain form
16294 -38290 27779 -11597 -19609 87523 53079 94419 155751 177580 136573 19931 62046
16283 62046 52454 50201 49564 89256 62736 73 -90018 -123732 -143412 -105038 -29939 -4184
16271 -4184 -79299 -104929 -102768 -131489 -163910 -90573 -2791 -43315 -80760 -22676 11977 14181
16259 14181 -45572 -15680 35256 -5407 4404 10231 -40669 -28467 3397 846 -67191 -105409
16247 -105409 -17522 21041 11021 -58343 -128382 -151782 -129506 -95677 -2181 5528 45741 81744
16235 81744 124549 67055 21208 1773 -80208 -75750 -17422 -20713 -2555 5527 15783 32853
16223 32853 34860 -14768 -8772 -73253 -103400 -56826 -62799 -3942 -6021 -37511 -15929 -25933
16211 -25933 -29389 -71179 -26790 -11675 35518 -19525 -150527 -208831 -164501 -113767 -118479 -131896
16199a31896m2128o6807O3521L7262l4779P372K4327l9961L6466J1347j8292L2451
16187a21117j3737K3181J03595L9452L235N6404J4824j34333k8680K984J6643
16176c7549p0064l3689L6485P384o04K7523P0502P7131Q207Q392P528P139j01490
16163F895j26467P7662k2975M2135K0351k2305m0542K0244L7848k8135n9244R8975
16151D442L7930j01547J1424N1862J3990l1210j9211l8882j5418o5912m1969J3720
16139a80781L8867K0967N1487p922K0747j0314J05073Q1444p1807j09271N537
16128e5973j2713K4997j5193r1222O3028L8511K4418j1732r3719R023P4261p322
16116e3636J9996Q1425l5701p0384J1472k9766o8929m9017L3506L6545m1247l9264
$$ plain form
16199 -131896 -174024 -240831 -177310 -140048 -174827 -167455 -143128 -183089 -146623 -135276 -153568 -121117
16187 -121117 -134854 -111673 -8078 31374 34609 91013 105837 -28496 -57176 -54192 -37549
16176 -37549 -107613 -141302 -104817 -97433 -98037 -70514 -12 77119 85326 93718 101246 108385 6895
16163 6895 -119572 -41910 -64885 -22750 -2399 -24704 -65246 -45002 -7154 -35289 -94533 4442
16151 4442 42372 -59175 -47751 4111 18101 -13109 -32320 -71202 -86620 -152532 -194501 -180781
16139 -180781 -141914 -120947 -69460 -77382 -56635 -66949 38124 119568 47761 -61510 -55973
16128 -55973 -68686 -43689 -58882 -150104 -87076 -48565 -24147 -35879 -129598 -120575 -46314 -53636
16116 -53636 -33640 47785 12084 -58300 -46828 -76594 -145523 -194540 -161034 -124489 -165736 -205000
16104b05000J4253L5829O8223L641J0461J2879L4649O7404L8186o2752l3833n5791
16092g1851K7428K3570K1204J01747J8208r3648l1498O8002Q8499j0706o3534
16081G7421k5900j6858j2302J0812J0876p9137J4509N4163O5343N4842j8609l5402
16069I9758q315m4885l0501k1840j8764J4272n5376N7428M3367J5534k1983J5114
16057D3809j0693K2565K3968m0420j8532k7568L253m4399K9100k27j5312o1055
16045i5511k7499K8678P8362P116n2030n8168M5341L6110n2601o4278L2853J18579
16033c048K1969j0094r0163L703k2845L7887J2723K1707K3118k9177l8951l1383
16021a04554Q011Q0964m4788J4579N277J9173J6590l3604M8308m8734J8405j6381
$$ plain form
16104 -205000 -190747 -154918 -86695 -83054 -72593 -59714 -25065 42339 80525 17773 -16060 -71851
16092 -71851 -44423 -20853 351 102098 120306 26658 -4840 63162 151661 140955 77421
16081 77421 51521 34663 22361 33173 44049 -35088 -20579 33584 98927 153769 135160 99758
16069 99758 91443 46558 16057 -5783 -24547 -10275 -65651 -8223 35144 50678 28695 43809
16057 43809 33116 55681 79649 39229 20697 -6871 -3618 -48017 -18917 -19144 -34456 -95511
16045 -95511 -123010 -94332 -15970 -8854 -60884 -119052 -73711 -37601 -90202 -154480 -121627 -3048
16033 -3048 18921 8827 -81336 -77633 -100478 -62591 -49868 -28161 -5043 -34220 -73171 -104554
16021 -104554 -96543 -15579 -60367 -45788 -40511 -21338 -4748 -38352 9956 -38778 -20373 -36754
16009c6754k1204M7991m0710m3437N9129J9013r2161p0993n3893O160J2944P6266
15997a37649O4233Q204P4015J6804l1327n5245K4012k7812o2065J6473J7033p526
15985a00850Q8474P8951K6348q3970j7563K7397K5781P9008m3542n7265L329K2726
15973D8824K2758n0206j09772p4049M1948r449k7242J03691J10051K04o3834p6846
15961h3922q472m1313n4393O0957R5174J8647r2684K4077O5897j2176n4387j431
15949h4026R1449M162o169n8244j2160j3215L562R1522K056j3489N0139J8083
15937G3670j7127l3049K7217M2139m3221l3483l9375j01318M2236O0055L9171
15926A6915n6027L4135J0m3728R4047M322r5837j5631K554M7524K1333N003K843
$$ plain form
16009 -36754 -57958 -9967 -50677 -94114 -34985 -15972 -108133 -179126 -233019 -226859 -213915 -137649
15997 -137649 -73416 -65212 8803 25607 -5720 -60965 -36953 -64765 -126830 -110357 -93324 -100850
15985 -100850 -12376 66575 92923 8953 -8610 18787 44568 123576 80034 22769 26098 48824
15973 48824 71582 21376 -88396 -162445 -120497 -129946 -157188 -53497 56554 56758 -7076 -83922
15961 -83922 -92394 -133707 -188100 -127143 -31969 -13322 -106006 -81929 -16032 -28208 -82595 -84026
15949 -84026 7423 11585 5416 -52828 -64988 -78203 -74641 16881 18937 5448 55587 73670
15937 73670 56543 23494 50711 92850 49629 16146 -23229 -124547 -82311 -22256 16915
15926 16915 -39112 -4977 -4967 -48695 45352 49674 -46163 -61794 -59240 -11716 9617 14620 17463
15913A7463K8304q7679l2756R6816k7241j27403r0929N5270r71K7213R5733J09608
15901F3428L4456j17532n1540m613R922n1117Q8346k0693j02662P4448K0188n1552
15889a08921L5507K506P7450N8203n6696L06l1202J5487k0045m8842O7850J6258
15877G861m891M8907L8845q1095m7862K6711O9606J0203j6011q5358j6054p8769
15865a27907j5343O0582R0866j4495m7842j8455m0021n6843J5162P2264k2672
15854a04704L58R557K2513K526J4870L6855m2996M2443k896k6927O540K3713m2603
15841f0751N6381J2494k792k6219j5649p4089J9711L1718K582m6518j80K5077
15829g8235O3486J7426L358p5004n2727l0244L0385o8013m224l3078J0416M619
$$ plain form
15913 17463 45767 -41912 -74668 22148 -5093 -132496 -223425 -168155 -169126 -141913 -46180 63428
15901 63428 97884 -19648 -71188 -75801 -65879 -116996 -28650 -49343 -152005 -77557 -57369 -108921
15889 -108921 -73414 -70908 6542 64745 8049 8355 -22847 -7360 -27405 -76247 -8397 7861
15877 7861 2970 51877 90722 9627 -38235 -11524 58082 68285 52274 -33084 -49138 -127907
15865 -127907 -143250 -82668 8198 -6297 -54139 -72594 -112615 -169458 -154296 -82032 -104704
15854 -104704 -104346 -94789 -72276 -69750 -54880 -18025 -61021 -18578 -21474 -48401 -41861 -18148 -60751
15841 -60751 -4370 8124 5332 -20887 -36536 -110625 -90914 -59196 -56614 -103132 -103312 -78235
15829 -78235 -14749 2677 6035 -68969 -121696 -151940 -121555 -189568 -193792 -226870 -216454 -211835
15817b11835j7799J2866J01689Q3350N4843k7743K7523K2645o970p4211O421O2138
15805C2917p3475J0094j7500n1696m3152o0410K4007P0575j0505K4518j1325K6633
15793g9319J6420k7241k633k9193L3463Q9676K2410j2328m786N4420l2438j29588
15781a01137O3621m249j14828k5876O5514Q3357L9464j9756M2770o8245K4504
15770a4861P6627o1584m8560p585n36M9111M8933K4761m9081n7448N2160k522
15758I415r491n3703k9097P5647m341q6231N6436R985J7807K9519L5799N7641
15746A09386j3520j50293m3675P1723J10863J2486R286l1903n8829p0927L6242
$$ plain form
15817 -211835 -229634 -216768 -115079 -31729 23114 -4629 22894 45539 38569 -35642 -29221 32917
15805 32917 -40558 -30464 -47964 -99660 -142812 -203222 -179215 -108640 -119145 -94627 -105952 -79319
15793 -79319 -62899 -90140 -92773 -121966 -88503 1173 23583 11255 6469 60889 28451 -101137
15781 -101137 -37516 -41765 -156593 -182469 -116955 -33598 5866 -13890 28880 -39365 -14861
15770 -14861 61766 182 -48378 -55963 -56499 -7388 41545 66306 17225 -40223 11937 9415
15758 9415 -76 -53779 -82876 -7229 -11570 -97801 -41365 -31380 -13573 15946 51745 109386
15746 109386 95866 -54427 -98102 -26379 84484 96970 106256 74353 15524 -55403 -19161
$$ [...]
##END NTUPLES=NMR SPECTRUM
##END=
