##TITLE=Analysis number 310543
Compound Code cc 44304
Book Reference 433/101/1
Project Code adrs
Chemist Name victoriam
##JCAMPDX= 6.0         $$ Bruker NMR JCAMP-DX V2.0
##DATA TYPE= NMR SPECTRUM
##DATA CLASS= NTUPLES
##ORIGIN= Bruker BioSpin GmbH
##OWNER= NMR
$$ XWIN-NMR		Version 3.5
$$ Tue Jun 21 11:12:33 2005 GMT Daylight Time (UT+1h)  MAYBRIDGE\NMR@NMR_250MHZ
##.OBSERVE FREQUENCY= 250.131544655141
##.OBSERVE NUCLEUS= ^1H
##.ACQUISITION MODE= SIMULTANEOUS (DQD)
##.ACQUISITION SCHEME= undefined
##.AVERAGES= 16
##.DIGITISER RES= 18
##SPECTROMETER/DATA SYSTEM= dpx250
##.PULSE SEQUENCE= zg30
##.SOLVENT NAME= CDCl3
##.SHIFT REFERENCE= (INTERNAL, CDCl3, 0, 16.522)
##AUDIT TRAIL= $$ (NUMBER, WHEN, WHO, WHERE, WHAT)
$$ ##TITLE= Audit trail, XWIN-NMR		Version 3.5
$$ ##JCAMPDX= 5.01
$$ ##ORIGIN= Bruker BioSpin GmbH
$$ ##OWNER= NMR
$$ C:\u/data/dgb/nmr/ADRS/4350/pdata/1/auditp.txt
$$ ##AUDIT TRAIL=  $$ (NUMBER, WHEN, WHO, WHERE, WHAT)
(   1,<2005-06-21 11:12:12.38 +100>,<MAYBRIDGE\NMR>,<NMR_250MHZ>,
      <created by zg, POWCHK disabled, PULCHK disabled
       configuration hash MD5:
       62 19 C7 07 E1 42 D1 B7 37 6C 3D D0 77 39 F9 E6
       data hash MD5: 64K
       32 0B 84 E3 6A 99 24 61 DA 9C 25 86 E7 E1 BD 56>)
(   2,<2005-06-21 11:12:25.58 +100>,<MAYBRIDGE\NMR>,<NMR_250MHZ>,
      <Start of raw data processing
       ef LB = 0.3 FT_mod = 6 PKNL = 1 SI = 32K 
       data hash MD5: 32K
       44 69 36 AB 21 29 90 C5 20 20 4C A7 47 50 94 5F>)
(   3,<2005-06-21 11:12:27.50 +100>,<MAYBRIDGE\NMR>,<NMR_250MHZ>,
      <apk 
       data hash MD5: 32K
       BE 9A D0 4F 3C 96 B3 73 50 AC 66 12 80 7C 73 BA>)
(   4,<2005-06-21 11:12:28.30 +100>,<MAYBRIDGE\NMR>,<NMR_250MHZ>,
      <abs ABSG = 5 
       data hash MD5: 32K
       EF D4 71 F9 A2 52 0F 22 83 C1 3A C9 29 22 BD 6E>)
$$ ##END=
$$ 
$$ hash MD5
$$ 46 0A B6 C3 D5 D4 7C 88 1F 89 2B EA F1 F5 1E 70
##$RELAX= 
##$RELAX= 
##$RELAX= 
##$RELAX= 
##$RELAX= 
##$RELAX= 
##$RELAX= 
$$ Bruker specific parameters
$$ --------------------------
##$DU= <C:\u>
##$EXPNO= 4350
##$NAME= <ADRS>
##$PROCNO= 1
##$TYPE= <nmr>
##$USER= <dgb>
##$AMP= (0..31)
100 100 100 100 100 100 100 100 100 100 100 100 100 100 100 100 100 100 
100 100 100 100 100 100 100 100 100 100 100 100 100 100 
##$AQSEQ= 0
##$AQ_mod= 3
##$AUNM= <au_zg>
##$AUTOPOS= <13 >
##$BF1= 250.13
##$BF2= 250.13
##$BF3= 250.13
##$BF4= 250.13
##$BF5= 500.13
##$BF6= 500.13
##$BF7= 500.13
##$BF8= 500.13
##$BYTORDA= 1
##$CFDGTYP= 0
##$CFRGTYP= 5
##$CHEMSTR= <none>
##$CNST= (0..31)
1 1 145 1 1 1 1 1 1 1 1 1 1 1 1 1 1 1 1 1 1 1 1 1 1 1 1 1 1 1 1 1 
##$CPDPRG= <>
##$CPDPRG1= <>
##$CPDPRG2= <>
##$CPDPRG3= <>
##$CPDPRG4= <mlev>
##$CPDPRG5= <mlev>
##$CPDPRG6= <mlev>
##$CPDPRG7= <mlev>
##$CPDPRG8= <mlev>
##$CPDPRGB= <>
##$CPDPRGT= <>
##$D= (0..31)
0 1 0 0 0 0 0 0 0 0.06 0 0 0 0 0 0 0.0002 0 0 0 0 0 0 0 0 0 0 0 0 0 0 
0 
##$DATE= 1119348731
##$DBL= (0..7)
120 120 120 120 120 120 120 120 
##$DBP= (0..7)
150 150 150 150 150 150 150 150 
##$DBP07= 0
##$DBPNAM0= <>
##$DBPNAM1= <>
$$ [...]
##$SUBNAM7= <"">
##$SUBNAM8= <"">
##$SUBNAM9= <"">
##$SW= 20.6930455092707
##$SWIBOX= (0..15)
0 0 3 0 0 0 0 0 0 0 0 0 0 0 0 0 
##$SW_h= 5175.983436853
##$TD= 65536
##$TD0= 1
##$TE= 295.16
##$TE2= 300
##$TE3= 300
##$TEG= 300
##$TL= (0..7)
0 120 120 120 120 120 120 120 
##$TP= (0..7)
150 150 150 150 150 150 150 150 
##$TP07= 0
##$TPNAME0= <>
##$TPNAME1= <>
##$TPNAME2= <>
##$TPNAME3= <>
##$TPNAME4= <>
##$TPNAME5= <>
##$TPNAME6= <>
##$TPNAME7= <>
##$TPOAL= (0..7)
0.5 0.5 0.5 0.5 0.5 0.5 0.5 0.5 
##$TPOFFS= (0..7)
0 0 0 0 0 0 0 0 
##$TUNHIN= 0
##$TUNHOUT= 0
##$TUNXOUT= 0
##$USERA1= <user>
##$USERA2= <user>
##$USERA3= <user>
##$USERA4= <user>
##$USERA5= <user>
##$V9= 5
##$VALIST= <valist>
##$VCLIST= <CCCCCCCCCCCCCCC>
##$VD= 0
##$VDLIST= <DDDDDDDDDDDDDDD>
##$VPLIST= <PPPPPPPPPPPPPPP>
##$VTLIST= <TTTTTTTTTTTTTTT>
##$WBST= 1024
##$WBSW= 4
##$XGAIN= (0..3)
0 0 0 0 
##$XL= 0
##$YL= 0
##$YMAX_a= 364038
##$YMIN_a= -213675
##$ZGOPTNS= <>
##$ZL1= 120
##$ZL2= 120
##$ZL3= 120
##$ZL4= 120
##$ABSF1= 16.522
##$ABSF2= -4.171173
##$ABSG= 5
##$ABSL= 3
##$ALPHA= 0
##$AQORDER= 0
##$ASSFAC= 0
##$ASSFACI= 0
##$ASSFACX= 0
##$ASSWID= 0
##$AUNMP= <proc_1d>
##$AZFE= 0.1
##$AZFW= 0.1
##$BCFW= 0
##$BC_mod= 0
##$BYTORDP= 0
##$COROFFS= 0
##$CY= 12.5
##$DATMOD= 1
##$DC= 0
##$DFILT= <>
##$DTYPP= 0
##$F1P= 14.0000005364418
##$F2P= -0.99999901652339
##$FCOR= 0.5
##$FTSIZE= 32768
##$FT_mod= 6
##$GAMMA= 0
##$GB= 0
##$INTBC= 1
##$INTSCL= 1
##$ISEN= 128
##$LB= 0.3
##$LEV0= 0
##$LPBIN= 0
##$MAXI= 10000
##$MC2= 0
##$MEAN= 0
##$ME_mod= 0
##$MI= 0
##$NCOEF= 0
##$NC_proc= -4
##$NLEV= 6
##$NOISF1= 0
##$NOISF2= 0
##$NSP= 0
##$NTH_PI= 0
##$NZP= 0
##$OFFSET= 16.522
##$PC= 1
##$PHC0= -78.93948
##$PHC1= 24.95646
##$PH_mod= 1
##$PKNL= yes
##$PPARMOD= 0
##$PSCAL= 4
##$PSIGN= 0
##$REVERSE= no
##$SF= 250.13
##$SI= 32768
##$SIGF1= 0
##$SIGF2= 0
##$SINO= 400
##$SIOLD= 32768
##$SREGLST= <1H.CDCl3>
##$SSB= 0
##$STSI= 32768
##$STSR= 0
##$SW_p= 5175.98343685301
##$SYMM= 0
##$S_DEV= 0
##$TDeff= 65536
##$TDoff= 0
##$TI= <Analysis number 999999
Compound Code 99
Book Reference 9
Project Code 9>
##$TILT= no
##$TM1= 0
##$TM2= 0
##$TOPLEV= 0
##$USERP1= <user>
##$USERP2= <user>
##$USERP3= <user>
##$USERP4= <user>
##$USERP5= <user>
##$WDW= 1
##$XDIM= 32768
##$YMAX_p= 370126072
##$YMIN_p= -374040
$$ End of Bruker specific parameters
$$ ---------------------------------
##NTUPLES= NMR SPECTRUM
##VAR_NAME=  FREQUENCY,     SPECTRUM/REAL,   SPECTRUM/IMAG
##SYMBOL=    X,             R,               I
##VAR_TYPE=  INDEPENDENT,   DEPENDENT,       DEPENDENT
##VAR_FORM=  AFFN,          ASDF,            ASDF
##VAR_DIM=   32768,         32768,           32768
##UNITS=     HZ,            ARBITRARY UNITS, ARBITRARY UNITS
##FACTOR=    0.157963299565203, 1,           1
##FIRST=     4132.6476996994, 0,             0
##LAST=      -1043.33573715361, 0,           0
##MIN=       -1043.33573715361, -374040,     0
##MAX=       4132.6476996994, 370126072,     0
$$ Real data points
##PAGE= N=1
##DATA TABLE= (X++(R..R)), XYDATA
$$ [...]
26348a76192J09087J07219j8114j34310l9272L2605K5679J7931P0764o5923K3761
$$ -176192 -67105 40114 22000 -112310 -151582 -118977 -93298 -75367 -4603 -70526 -46765
26337d6765L4846l828K5539R2110M6460o382k0348j04437l7239J40562Q016k0026
$$ -46765 -11919 -15747 9792 101902 148362 141980 121632 17195 -20044 120518 128534 108508
26325A08508j15295j3671J12763m045q1119l6816l158l5850J3852L9651o7005
$$ 108508 -6787 -20458 92305 88260 7141 -29675 -32833 -68683 -54831 -15180 -82185
26314h2185J5627K8899o6322O116K3885L8505J4934n7235q0135M6073J8871J7406
$$ -82185 -66558 -37659 -103981 -97865 -73980 -35475 -20541 -77776 -157911 -111838 -92967 -75561
26302g5561j01188j0839J2623O4289J28572k6763o9556M1369M2376r826J2747
$$ -75561 -176749 -187588 -174965 -110676 17896 -8867 -78423 -37054 5322 -4504 8243
26291H243K4020n3830M1296P1103R7396j3665n7323k1486m0122r023k5116J2088
$$ 8243 32263 -21567 19729 90832 188228 174563 117240 95754 55632 46609 21493 33581
26279C3581L9580M2130j01468j8435L2291j2535j05032L5005N0169m5985l3423
$$ 33581 73161 115291 13823 -4612 27679 15144 -89888 -54883 -4714 -50699 -84122
26268h4122L180L4928K1182K0960R5092L6191q3778l1593n5404l110o8835J9533
$$ -84122 -80942 -46014 -24832 -3872 91220 127411 43633 12040 -43364 -46474 -115309 -95776
26256i5776L9375J4899j4998p2246R0331O7151l7571L964o6317M7573P9797q724
$$ -95776 -56401 -41502 -56500 -128746 -38415 28736 -8835 -4871 -71188 -23615 56182 47458
26244D7458j74815r9130O2925M0080L2117q9671q0483N9808P1340J22434P0001
$$ 47458 -127357 -226487 -163562 -123482 -91365 -181036 -261519 -201711 -130371 -7937 62064
26233F2064p3000l3770K3184n0833n3088K120J9775O7374Q5054l5041j3385o6211
$$ 62064 -10936 -44706 -21522 -72355 -125443 -123323 -103548 -36174 48880 13839 454 -65757
26221f5757O582K8710q9733q8033O1910N3013k0882L3292n997m2289n4892N5887
$$ -65757 -59175 -30465 -120198 -208231 -146321 -93308 -114190 -80898 -86895 -129184 -184076 -128189
26209a28189N5488r574J00216O1044l0071k4311o0909M5525k9745N5045m7579
$$ -128189 -72701 -82275 17941 78985 48914 24603 -36306 9219 -20526 34519 -13060
26198a3060l6937P2166K5214o7721O293J7857R4368m2511k0806q3937r9066J15626
$$ -13060 -49997 22169 47383 -20338 -14045 3812 98180 55669 34863 -49074 -148140 -32514
26186c2514J13663o5580m8433K9629N8944n0259N448J0553j0034j5445q885m9261
$$ -32514 81149 15569 -32864 -3235 55709 5450 10898 21451 11417 -4028 -12913 -62174
26174f2174k3785j8695J23651P1945k7850q0158j02477j44726j09771N8974J05671
$$ -62174 -85959 -104654 18997 90942 63092 -17066 -119543 -264269 -374040 -315066 -209395
26163b09395J57689L1858j0044m2214o6755o2028K9908j9245o9930q1536m503
$$ -209395 -51706 -19848 -29892 -72106 -138861 -200889 -170981 -190226 -260156 -341692 -346195
26152c46195Q7694Q7979l4705L8550J21161O7907R923K6514J2338L2407p7683
$$ -346195 -258501 -170522 -205227 -166677 -45516 22391 32314 58828 71166 103573 25890
26141B5890j8902o996Q9442q8932m964j9875J5525M1781m135m3397o3753R6022
$$ 25890 6988 -8 89434 502 -4462 -24337 -8812 32969 28834 -14563 -78316 17706
26129A7706L8921K0033l8276o5902Q6169j0543j2657j3342M9417Q3532j33852
$$ 17706 56627 76660 38384 -27518 58651 48108 35451 22109 71526 155058 21206
26118B1206j04931K2126J03161M9576o0001j05387J0051N234O3894L7493k2067
$$ 21206 -83725 -61599 41562 91138 31137 -74250 -64199 -58965 4929 42422 20355
26107B0355n7951J4836l4207Q8596L9748l4596j01647L0978M238r4886J1059P9461
$$ 20355 -37596 -22760 -56967 31629 71377 36781 -64866 -33888 -29650 -124536 -113477 -34016
26095c4016P0975q2686n0439l8319l6876l5697R4499J31356N8858l1424q0723
$$ -34016 36959 -45727 -96166 -134485 -171361 -207058 -112559 18797 77655 46231 -34492
26084c4492J2979K0292m6330J0885k0289N3091q259q003m8334O9417J70292l4754
$$ -34492 -21513 -1221 -47551 -36666 -56955 -3864 -12123 -20126 -68460 957 171249 136495
26072A36495K9950k9952j40649m5852J8180J8299k1436R667j4077l2693N8585
$$ 136495 166445 136493 -4156 -50008 -31828 -13529 -34965 -25298 -39375 -72068 -13483
26061a3483K09845j3787j09282n9199J6479L7337J58783K3113j49608o4662L0258
$$ -13483 196362 182575 73293 14094 30573 67910 226693 249806 100198 35536 65794
26050F5794p5188p5583m9551j6681L0128J66410N3516L1177Q7962m156K0610k0897
$$ 65794 -9394 -84977 -134528 -151209 -121081 45329 98845 130022 217984 213828 234438 213541
26038B13541n6050j5437J9971q632p3616q0340k7550p302n323K7764j0913j6561
$$ 213541 157491 142054 162025 153393 79777 -563 -28113 -35415 -40738 -12974 -23887 -40448
26026d0448n9537n8625K4225O0413l1278O4721o0632m5726O2648J10413R0881
$$ -40448 -99985 -158610 -134385 -73972 -105250 -40529 -101161 -146887 -84239 26174 117055
26015A17055n7288j73167k5182o738J03143L6216M4860m8455j946M8491J0150
$$ 117055 59767 -113400 -138582 -145320 -42177 -5961 38899 -9556 -11502 36989 47139
26004D7139l5357l1707Q528L6282P6027n2598q9255J6038J8815R666K8916N1907
$$ 47139 11782 -19925 -11397 24885 100912 48314 -40941 -24903 -6088 3578 32494 84401
25992H4401R382n9293j04716k8110k3286O5420K5661l959l7419j911r0310O942
$$ 84401 93783 34490 -70226 -98336 -121622 -56202 -30541 -34500 -71919 -73830 -164140 -157198
25980a57198N5267J8876m4277N6416J64981N4104n5666m4770r275k8469q248M268
$$ -157198 -101931 -83055 -127332 -70916 94065 148169 92503 47733 38458 9989 1741 6009
25968F009N6948N5039O9771j13155r8554j05177M2358N5987j9909K4319R371M1559
$$ 6009 62957 117996 187767 74612 -23942 -129119 -86761 -30774 -50683 -26364 -16993 24566
25956B4566P7295J9885N0643l4480Q936L2984l4331l6774r5121l2301N3120k1120
$$ 24566 101861 121746 172389 137909 146845 179829 145498 108724 13603 -18698 34422 13302
25944A3302l1479J7377l7988N1677N3866k5309M1098r5556m853J916J2146J04090
$$ 13302 -18177 -800 -38788 12889 66755 41446 82544 -13012 -17865 -15949 -3803 100287
25932A00287j4386j63081j47700M8430R8052Q0518L7336O0017J9719M5655L6150
$$ 100287 85901 -77180 -224880 -176450 -78398 2120 39456 99473 119192 164847 200997
25921B00997q719p4368j57348k08221l8714Q2138L6464p1321J51507J11108m6406
$$ 200997 192278 117910 -39438 -247659 -286373 -204235 -167771 -239092 -87585 23523 -22883
25910b2883O819M4834L9860L32k9157J8848P513o1803n8575o602n22O1118M9774
$$ -22883 -16064 28770 68630 68962 39805 58653 66166 4363 -54212 -60814 -61336 -218 49556
25897D9556m7658o3812l5886r69k0788J9160K6237M2735J337l4937j8305l4631
$$ 49556 1898 -61914 -97800 -98769 -119557 -100397 -74160 -31425 -30088 -65025 -83330 -117961
25885a17961Q4393J15830M1686o0937j7534K9431P707o344M804L1023o5128k3666
$$ -117961 -33568 82262 123948 63011 45477 74908 82615 76271 81075 112098 46970 23304
25873B3304Q6679o4978j5695J4571M3165m1277l2608O9638k6160r2973M6286k796
$$ 23304 109983 45005 29310 43881 87046 45769 13161 82799 56639 -36334 9952 7156
25861G156P357j6727j08880k7595N452k9581K5541J05286O3648J6879l6442p1525
$$ 7156 14513 -2214 -111094 -138689 -133237 -162818 -137277 -31991 31657 48536 12094 -59431
25849e9431k1061J6929p319K6012K2260q8751l470Q0546Q0181N489n1523m1823
$$ -59431 -80492 -63563 -70882 -44870 -22610 -111361 -114831 -34285 45896 51385 -138 -41961
25837d1961q6455J9807L335k5062o8685p5876J03769O3765Q7398J22448o6368
$$ -41961 -128416 -108609 -105274 -130336 -199021 -274897 -171128 -107363 -19965 102483 36115
25826C6115p7231n6608k5068O6651l2979m3312M9845K6596n4252l5245N8847L7272
$$ 36115 -41116 -97724 -122792 -56141 -89120 -132432 -82587 -55991 -110243 -145488 -86641 -49369
25814d9369O3738Q7970k7978k4112N3423K3833j03778q2517J09843L3320j11694
$$ -49369 14369 102339 74361 50249 103672 127505 23727 -58790 51053 84373 -27321
25803b7321K7087Q7869j1062K0918j05839m3205M6450o0517p3010P8317o7996
$$ -27321 -234 87635 76573 97491 -8348 -51553 -5103 -65620 -138630 -60313 -128309
25792a28309K7779J15693P637l4085L4820P4177M4691L2961L364j75718n5380
$$ -128309 -100530 15163 22800 -11285 23535 97712 142403 175364 178728 3010 -52370
25781e2370K3040J5219J506m6020l3977j8754Q0670M3317l302j9152K3007q2073
$$ -52370 -29330 -14111 -12605 -58625 -92602 -111356 -30686 12631 9329 -9823 13184 -68889
25769f8889N8689K6490L7644N3531n5811K3567Q800L3817l6409J08507m1151r1575
$$ -68889 -10200 16290 53934 107465 51654 75221 84021 117838 81429 189936 148785 57210
25757E7210J1075o6294j01418j008n951J6975n5252m867M5902M7840K3849O7598
$$ 57210 68285 1991 -99427 -100435 -106386 -89411 -144663 -149530 -103628 -55788 -31939 35659
25745C5659j034o8417r9447P1038R5081q810J6784m0217j561O618q973n6072j2321
$$ 35659 34625 -33792 -133239 -62201 32880 24070 40854 637 -924 5694 -3279 -59351 -71672
25732g1672K4297Q5314k5323o2284r0050m2037J42732N8077p2679m6399Q5408
$$ -71672 -47375 37939 12616 -49668 -139718 -181755 -39023 19054 -53625 -100024 -14616
25721a4616O4282j22361L8225J17695Q508p1445p1544K9342L9982R8523K3294
$$ -14616 49666 -72695 -34470 83225 91733 20288 -51256 -21914 18068 116591 139885
25710A39885j00236j50294o1372R097k945J34200j0039k2019M1377L2430N8134
$$ 139885 39649 -110645 -172017 -162920 -165865 -31665 -41704 -63723 -22346 10084 68218
25699F8218N7074q39j39371j21678M1063M2600O2633J568p3515o773J37231k1794
$$ 68218 125292 124453 -14918 -136596 -95533 -52933 9700 11268 -62247 -69020 68211 46417
25687D6417J8520N2641l5318o6696p0011l8723q36M2560k3517o1731J04436M8854
$$ 46417 64937 117578 82260 15564 -54447 -93170 -94006 -51446 -74963 -136694 -32258 16596
25675A6596l6113n3186O4495N1280o5436o9348O5556M6767O8411l6983j2450O8492
$$ 16596 -19517 -72703 -8208 43072 -22364 -91712 -26156 20611 89022 52039 39589 108081
25663A08081o3687o4900k5528o3581J39529O612r8252j3120j025j3759K7157R5087
$$ 108081 44394 -20506 -46034 -109615 29914 36526 -61726 -74846 -75871 -89630 -62473 32614
25651C2614Q6382L0356j5630n4081n0514l723m6827K9988O9438p7402k1819N3721
$$ 32614 118996 149352 133722 79641 29127 25404 -21423 8565 78003 601 -21218 32503
25639C2503n070k8622n8885N474N7946N5307m8604j3723Q266K353j7710L0462
$$ 32503 27433 -1189 -60074 -54600 3346 58653 10049 -3674 4592 6945 -10765 19697
25627A9697p4139k4589R1348L9589p7342r3511q1899J59431P2975o7614k7331
$$ 19697 -54442 -79031 12317 51906 -25436 -118947 -200846 -41415 31560 -36054 -63385
25616f3385M1611J733O915J55392N5643o5783q7701l021N6733O89P5805l2681
$$ -63385 -21774 -20041 -13126 142266 197909 132126 44425 41404 98137 98826 174631 141950
25604A41950K2457k2425j55608L5460O5853J6030k0540o172k6624q5054J2086
$$ 141950 164407 141982 -13626 21834 87687 103717 83177 77005 50381 -34673 -22587
25593b2587n2111q4257l344O3043k9883M6904K1312M9625l9165Q4739L6047n9665
$$ -22587 -74698 -158955 -162299 -99256 -129139 -82235 -60923 -11298 -50463 34276 70323 10658
25581A0658j5013o1827q1983M7921O2541J38504o0708O456J00474m9167m9846
$$ 10658 -4355 -66182 -148165 -100244 -37703 100801 40093 46549 147023 97856 48010
25570D8010j75637j5635j21589K4224J34680N7152O7805o2548j55514O8054J15227
$$ 48010 -127627 -143262 -264851 -240627 -105947 -48795 19010 -43538 -199052 -130998 -15771
25559a5771L3242O0698o3956k843N517j11511J4672J00041o9917m4018l0300O2217
$$ -15771 17471 78169 14213 11370 16887 -94624 -79952 20089 -49828 -93846 -124146 -61929
25547f1929L1100P3120j6168n1380p8296j0571k0462q3400j2363P0365N1229J3546
$$ -61929 -30829 42291 26123 -25257 -103553 -114124 -134586 -217986 -230349 -159984 -108755 -95209
25535i5209O2525Q9351m9869j54301k2282J02204p1932J1309n6536M5654J1615
$$ -95209 -32684 56667 6798 -147503 -169785 -67581 -139513 -128204 -184740 -139086 -127471
25524a27471L598M0422L4489j08435k7245k5469J63O1014J45373M9440n5810k5812
$$ -127471 -123873 -83451 -48962 -157397 -184642 -210111 -209948 -148934 -3561 45879 -9931 -35743
25512c5743N1714O8407N448m4720q3814k9101J4540J11128J3507q0274o5041k0739
$$ -35743 15971 84378 89826 45106 -38708 -67809 -53269 57859 71366 -8908 -73949 -94688
25500i4688M4706K0155j0287J41O5452j0201r473r5060L1332J63433j1652r5102
$$ -94688 -49982 -29827 -40114 -39973 25479 15278 5805 -89255 -57923 105510 93858 -1244
25488a244J3996m8083k7485L9745P3748M3145J6225j653N644K990j26693j3021
$$ -1244 12752 -35331 -62816 -23071 50677 93822 110047 108394 114038 117028 -9665 -22686
25476b2686P998j08736m2773l0487J5880N6042N695J4849J32921o8192p3070j14054
$$ -22686 -14688 -123424 -166197 -196684 -180804 -124762 -119067 -104218 28703 -39489 -112559 -226613
25464b26613j2740P3744J83849J35662L4011k8722j26567j4366o9098J779L6248
$$ -226613 -239353 -165609 18240 153902 187913 159191 32624 18258 -50840 -49061 -12813
25453a2813K8029o531J81J2456K0477N7450J5803j28983p8705N0024N994j0494
$$ -12813 15216 8685 8866 21322 41799 99249 115052 -13931 -92636 -42612 -36618 -47112
25441d7112K8610J3356O782q941l0264J6974j4832J794J5230M8769L0377j42374
$$ -47112 -18502 -5146 1636 -7305 -37569 -20595 -35427 -33633 -18403 30366 60743 -81631
25429h1631K2966k866M701n8296r2009O0111O083L6666N5078l2827j4027l3828
$$ -81631 -58665 -61531 -56830 -115126 -207135 -147024 -140941 -104275 -49197 -82024 -96051 -129879
25417a29879m2365Q0202J19681Q9062q9964j18932n243q108j697o8896j8423J92742
$$ -129879 -172244 -92042 27639 116701 26737 -92195 -97438 -105546 -107243 -176139 -194562 -1820
25405a820J97381J0802N0746N2947j00824q3533p6544m7212N0558m1790m8568
$$ -1820 195561 206363 257109 310056 209232 125699 49155 1943 52501 10711 -37857
25394c7857k3633j5020L5580P0163n0002Q04L6334Q2051K6342k988l4377l8995
$$ -37857 -61490 -76510 -40930 29233 -20769 -19965 16369 98420 124762 121774 87397 48402
25382D8402L4389n987n021p8376p3481l2316O7935O5744J1128K3648k9108k4675
$$ 48402 82791 76804 71783 -6593 -80074 -112390 -44455 21289 32417 56065 26957 2282
25370B282m8859r5570q0387Q4995J23950J7673o0727p0893r570K6026L1077N4431
$$ 2282 -46577 -142147 -222534 -137539 -13589 4084 -56643 -127536 -137106 -111080 -80003 -25572
25358b5572P5874O811q6137p152M1424k6557J1429l8751K5386p6750K9578L6029
$$ -25572 50302 57113 -29024 -36176 5248 -21309 -9880 -48631 -23245 -99995 -70417 -34388
25346c4388M9364L0266o4346j15052L4710P1235n208m1911j7192P1791p766o1602
$$ -34388 14976 45242 -19104 -134156 -99446 -28211 -33419 -75330 -92522 -20731 -28497 -90099
25334i0099O8973J75275j4350m1822K4796n5861p9375k780n6075o485L3759Q0485
$$ -90099 -21126 154149 139799 97977 122773 66912 -12463 -15243 -71318 -77803 -44044 36441
25322C6441K0117o2670O0219M1289N4513O4903n8511j02667l3614m1452k8720
$$ 36441 56558 -6112 54107 95396 149909 214812 156301 53634 20020 -21432 -50152
25311e0152J8301M2382O969J9542J0091m8060r2487k0539N0198O2844O7949p1565
$$ -50152 -31851 10531 17500 37042 47133 -927 -93414 -113953 -63755 -911 67038 -4527
25299d527j04921m9895J2773L5561J01548l131l1099j861p7720o7107M3319Q8972
$$ -4527 -109448 -159343 -146570 -111009 -9461 -12592 -43691 -45552 -123272 -190379 -147060 -58088
25287e8088Q0378p1309n8476N2173Q1505m9753j9842M5561O5075R1032l7833k5581
$$ -58088 22290 -49019 -107495 -55322 26183 -23570 -43412 2149 67224 158256 120423 94842
25275I4842q3267N8027m1111j18380n2311P0698P0510O527k4304K0234O4185K1875
$$ 94842 11575 69602 28491 -89889 -142200 -71502 -992 5535 -18769 1465 65650 87525
25263H7525k4105q7160o0108L780O1684n159q0687J5124P617O1096J02058M7450
$$ 87525 63420 -23740 -83848 -80068 -18384 -23543 -104230 -89106 -81489 -20393 81665 129115
25251A29115Q521q2225l0941l2467o0223R2724l7101P3182K611r5615p3779j5578
$$ 129115 137636 55411 24470 -7997 -68220 24504 -12597 60585 63196 -32419 -106198 -121776
25239a21776J1401M0241l1912L999J4484j01793Q2196Q9067O161L1592k6266K4063
$$ -121776 -110375 -70134 -102046 -98047 -83563 -185356 -103160 -14093 -7932 23660 -2606 21457
25227B1457J6886j65852K4920P8672m0825m684p0940J0145J24847J7340K2714
$$ 21457 38343 -127509 -102589 -23917 -64742 -69426 -140366 -130221 -5374 11966 34680
25216C4680o9266k8474k1361j7760N0496m0187o710M0312O0270J6224L2264J8004
$$ 34680 -34586 -63060 -84421 -102181 -51685 -91872 -98582 -58270 2000 18224 50488 68492
25204F8492m907n5585j45739J3386Q5225K8552J152L4453K7521N315m9962p4032
$$ 68492 63585 8000 -137739 -124353 -39128 -10576 -9424 25029 52550 57865 7903 -66129
25192f6129K7654J6849j3650J229m9608j1818l6661M0403J11020P5215N1269J6972
$$ -66129 -38475 -21626 -35276 -34047 -83655 -95473 -132134 -91731 19289 94504 145773 162745
25180A62745j21980j00466J998J9480L8528l149o401K9767r8785o5987M5613N9722
$$ 162745 40765 -59701 -57703 -38223 305 -2844 -9245 20522 -78263 -144250 -98637 -38915
25168c8915J7887R31K4544p5730p2655l6164K084M7401L9884N0569p2834j4402
$$ -38915 -21028 -20097 4447 -71283 -143938 -180102 -178018 -130617 -90733 -40164 -112998 -127400
25156a27400P0867Q9435p4130J9582L0615m7541M8680N7716m9000l4468m6333
$$ -127400 -56533 32902 -41228 -21646 8969 -38572 10108 67824 18824 -15644 -61977
25145f1977J26422J51313L3272m7614r5404m6034o7239l3934J14390M3087n7736
$$ -61977 64445 215758 249030 201416 106012 59978 -7261 -41195 73195 116282 58546
25134E8546N0295l3096r3409j31897P1189p1291l2284P6783k425K7779K5229J09300
$$ 58546 108841 75745 -17664 -149561 -78372 -149663 -181947 -105164 -107589 -79810 -54581 54719
25122E4719R4568o6013j1945K1975n3786k5408k6701K1670j241m2567K1694J47149
$$ 54719 149287 83274 71329 93304 39518 14110 -12591 9079 7838 -34729 -13035 134114
25110A34114O5881o5746k10228m9032M0360P5454n0553p2730J3990P697L7939
$$ 134114 199995 134249 -75979 -125011 -84651 -9197 -59750 -132480 -118490 -110793 -72854
25099g2854L8983O6444J5224k0134q7316p1967j4840l170M3803n6942n3580l6030
$$ -72854 -33871 32573 47797 27663 -59653 -131620 -146460 -149630 -105827 -162769 -216349 -252379
25087b52379K1038J72146O2304N3229n284K6456q71r3619n7901m7560n389M1428
$$ -252379 -231341 -59195 3109 56338 51054 77510 76639 -16980 -74881 -122441 -127830 -86402
25075h6402n619N9522m5940j3494K266L0309n0618Q23Q1795k0179r585M0372N6842
$$ -86402 -92021 -32499 -78439 -91933 -89667 -59358 -109976 -109153 -27358 -47537 -57122 -16750 40092
25062D0092K7339N9810l773L0165n5651j9911j08631K6389r764n1273L2569J6172
$$ 40092 67431 127241 123468 153633 97982 78071 -30560 -4171 -13935 -65208 -32639 -16467
25050a6467j6835m4631J5852J6225r4620P1082N8257J4865j0729K0942l0387Q607
$$ -16467 -33302 -77933 -62081 -45856 -140476 -69394 -11137 3728 -7001 13941 -16446 -7839
25038g839M3729M0129l005k3747n6454L6005l9370l6262n6356J9165l6134k168
$$ -7839 35890 76019 73014 49267 -7187 28818 -10552 -46814 -103170 -84005 -120139 -122307
25026a22307k6006l2427K3617P4513K9173k036M6565K5475j12498o3814J06139
$$ -122307 -148313 -180740 -157123 -82610 -53437 -55473 -8908 16567 -95931 -159745 -53606
25015e3606L0671J071j7821j2275K4066l5182j6461N0576L3522k6531j3920N793
$$ -53606 -22935 -21864 -39685 -51960 -27894 -63076 -79537 -28961 4561 -21970 -35890 -30097
25003c0097J3535p7852m3172J34791o3052k4327K3872J23583j4574n7728p0038
$$ -30097 -16562 -94414 -137586 -2795 -65847 -90174 -66302 57281 42707 -15021 -85059
24992h5059p996M7519P3245K0716P749l9589q2122k9149p5871m8671J00004J02986
$$ -85059 -93055 -45536 27709 48425 56174 16585 -65537 -94686 -170557 -219228 -119224 -16238
24980a6238m5858o8261J00594O4671p5087r2345j362O8424J6553R799K6095j029
$$ -16238 -62096 -130357 -29763 34908 -40179 -132524 -133886 -65462 -48909 -39110 -13015 -14044
24968a4044l5832o1933J3190P3760k0521J4968K8018R7014j9704j8692o8549k1308
$$ -14044 -49876 -111809 -98619 -24859 -45380 -30412 -2394 94620 74916 56224 -12325 -33633
24956c3633l1167P8788L7419n8358L8401Q0638q9594o7960L4620L0676J29716
$$ -33633 -64800 13988 51407 -6951 31450 112088 22494 -45466 -10846 19830 149546
24945A49546P5379o4068n6221M3076j35459j00155q088J2232R7405J5068P0645
$$ 149546 224925 160857 104636 147712 12253 -87902 -95990 -83758 13647 28715 99360
24934I9360O9871o1636n4516n5520O4183k3777r1713N343J15905Q7058p4901j50141
$$ 99360 169231 107595 53079 -2441 61742 37965 -53748 -48405 67500 154558 79657 -70484
24922g0484n7124O3784J32105L9807j07831k079n1666k018n2260L1395M8090J21916
$$ -70484 -127608 -63824 68281 108088 257 -1822 -53488 -55506 -107766 -76371 -28281 93635
24910I3635Q6682l2927j16121n0301R5920J29050l2207q5578l5704m5453M985
$$ 93635 180317 147390 31269 -19032 76888 205938 173731 88153 52449 6996 11981
24899A1981n319r499r2762l154m2551M2484N0674n2955J04595j3072j4895K4140
$$ 11981 6662 -2837 -95599 -98753 -141304 -98820 -48146 -101101 3494 -9578 -24473 -333
24887c33R082K9447K4060p7069j13611p0241k9308J11171k3814P3782J44384k1218
$$ -333 8749 38196 62256 -14813 -128424 -198665 -227973 -116802 -140616 -66834 77550 56332
24875E6332j07345Q1220J48840J4889r9667l0566p3534m9249k4748k3283m8483
$$ 56332 -51013 30207 179047 193936 94269 63703 -9831 -59080 -83828 -107111 -155594
24864a55594L472J31556N9922n1957q1758Q727k4653L0564K8319Q4961M4635j02131
$$ -155594 -152122 -20566 39356 -12601 -94359 -85632 -110285 -79721 -51402 33559 78194 -23937
24852b3937N0206L0313k2742O7518O9130o559j41111l0541r535J04384O813q5333
$$ -23937 26269 56582 33840 101358 170488 163929 22818 -7723 -17258 87126 93939 8606
24840H606K7251k8968k3494N7800Q1160r281k5615m5890n7370P7626O7205L0160
$$ 8606 35857 6889 -16605 41195 122355 113074 87459 41569 -15801 61825 129030 159190
24828A59190r3732q5131r254M2572j2960j01994j30631o2330J50322O8930r463
$$ 159190 65458 -19673 -28927 13645 685 -101309 -231940 -294270 -143948 -75018 -84481
24817h4481P6086J35738O3779j24783p0808j12886r0858K0176L2472N5013Q2043
$$ -84481 -8395 127343 191122 66339 -4469 -117355 -208213 -188037 -155565 -100552 -18509
24806a8509M0272J9371j8501n6087q2851N200L0035Q5575P1714r0748M3647Q601
$$ -18509 21763 41134 22633 -33454 -116305 -111105 -81070 4505 76219 -14529 29118 37719
24794C7719J0169m0055q936L9237m5530o4570J6062l1789q4497k8490K254P7114
$$ 37719 47888 7833 -1103 38134 -7396 -71966 -55904 -87693 -172190 -200680 -198426 -121312
24782a21312J54453M8774R482j2777K4546j0255J4873r632k0962n561j31319O296
$$ -121312 33141 81915 91397 78620 103166 92911 107784 98152 77190 71629 -59690 -53394
24770e3394M8484K7139J14767N6536j31846j78144o3139P0333P9090L3891j624
$$ -53394 -4910 22229 136996 193532 61686 -116458 -179597 -109264 -30174 3717 2093
24759B093j00597N4718L6598m4347J7577O3795l2365p1304j3207L1978l601L4700
$$ 2093 -98504 -43786 -7188 -51535 -33958 29837 -2528 -73832 -87039 -55061 -58662 -23962
24747b3962L4908L8075n0449O3811j05636m3080j7605J908j01376N2498Q0811
$$ -23962 10946 49021 -1428 62383 -43253 -86333 -103938 -102030 -203406 -150908 -70097
24736g0097J24059J8301j06406o7070N5076m1791j12216O724R8606O2993K7880
$$ -70097 53962 72263 -34143 -101213 -46137 -87928 -200144 -193420 -94814 -31821 -3941
24725c941k4670j4294L5432Q8731k818o2282k9210R1959L081M5378n9501k219
$$ -3941 -28611 -42905 -7473 81258 78440 16158 -13052 78907 81988 127366 67865 65646
24713F5646N2300l0826k9424N2647k6511j4981n0494j33701m0756K5469P7765
$$ 65646 117946 87120 57696 110343 83832 68851 18357 -115344 -156100 -130631 -52866
24702e2866J3054q6367o539K5932J21203P3911o5098j24016L4957J12407m7136
$$ -52866 -39812 -126179 -132718 -106786 14417 88328 23230 -100786 -65829 46578 -558
24691e58r5700K6866O0493P140P8560l0087j00907k5641K7544Q8325J3662n6732
$$ -558 -96258 -69392 -8899 -1759 76801 46714 -54193 -79834 -52290 36035 49697 -7035
24679g035n2018K5623M0710p4734j8674J35724j8628j1926L8194j6848o9546j5444
$$ -7035 -59053 -33430 7280 -67454 -86128 49596 30968 19042 57236 40388 -29158 -44602
24667d4602R8208N2107m5618q1626l5958M3342j4731N264j4113n5308P248K8816
$$ -44602 53606 105713 60095 -21531 -57489 -14147 -28878 -23614 -37727 -93035 -85787 -56971
24655e6971K4129o3795l3486O6551N3296m2263J02038N6284Q467K27r9005j02385
$$ -56971 -32842 -96637 -130123 -63572 -10276 -52539 49499 105783 114250 114477 15472 -86913
24643h6913P2766N8292N1259R711n4694j0842O7096l263p6917L3980O439j7669
$$ -86913 -14147 44145 95404 105115 50421 39579 106675 103412 26495 60475 66914 49245
24631D9245o1224N2757N5396l7418m7770J2056K0560K9546K0690o6553n9981j5075
$$ 49245 -11979 40778 96174 58756 10986 23042 43602 73148 93838 27285 -32696 -47771
24619d7771n3217q4237n6622L339J26739Q0772L7531k4498k8675N7541O1940n9270
$$ -47771 -100988 -185225 -241847 -238508 -111769 -30997 6534 -17964 -46639 10902 72842 13572
24607A3572J4790K8184q0234m7314m1744N1378N7383K1805m973P374M0894K1090
$$ 13572 28362 56546 -23688 -71002 -112746 -61368 -3985 17820 12847 20221 61115 82205
24595H2205J7368n1751n2098k5289r4508N1876K2893J24263J37284o3603j33884
$$ 82205 99573 47822 -4276 -29565 -124073 -72197 -49304 74959 212243 148640 14756
24584A4756j08345L0769Q1n272K6034L4563k3870q9165N645P6659J10507J3054
$$ 14756 -93589 -62820 -62739 -68011 -41977 -7414 -31284 -120449 -114804 -38145 72362 85416
24572H5416J1401q577m6506l8875o3375k3027j1764N867O0147R386o1016L1657
$$ 85416 96817 88240 41734 2859 -60516 -83543 -95307 -89440 -29293 -19907 -80923 -49266
24560d9266o049q8117m1809O4330L8880O5739J944N4125L8808k017N2609N8767
$$ -49266 -55315 -143432 -185241 -120911 -82031 -16292 -14348 39777 78585 76568 129177 187944
24548A87944K1079l3198K142p900o4662r7732j00810n1156m3747M5235O5430K017
$$ 187944 209023 175825 177967 170067 105405 7673 -93137 -144293 -188040 -142805 -77375 -75358
24536g5358K8217P8268J691n1940N0626k0330l6823n597k812m8471J02707L0844
$$ -75358 -47141 31127 32818 -19122 31504 11174 -25649 -31246 -34058 -82529 20178 51022
24524E1022m246n732K4336j3187m4571l9897r668J057p1860J5376k5122J09349
$$ 51022 46776 41044 65380 52193 7622 -32275 -41943 -40886 -112746 -97370 -122492 -13143
24512a3143M5837l7383l0145M2109Q0685j7482k7115k8808O8859J8347r214n0028
$$ -13143 32694 -4689 -34834 7275 87960 70478 43363 14555 83414 101761 92547 42519
24500D2519r9446j9253J3835J35193K2322o2801j04834o0426K1959o5301l0533
$$ 42519 -56927 -76180 -62345 72848 95170 32369 -72465 -132891 -110932 -176233 -206766
24489b06766J17258Q7452q1273p2031Q7872J61917k8527r6424m8362O843K927
$$ -206766 -89508 -2056 -83329 -155360 -67488 94429 65902 -30522 -78884 -72041 -69114
24478f9114P3528P2897q708J04864k3082q8309K5500k7144p0669O2m9531L7424
$$ -69114 4414 77311 68603 173467 150385 62076 87576 60432 -10237 -10175 -59706 -22282
24466b2282R0014L5905l9143n296p9586m0724P91K7415L5733L5453n7272K21N1718
$$ -22282 67732 103637 64494 59198 -20388 -61112 -60321 -32906 2827 38280 -18992 -18771 32947
24453C2947j2002k6614l6754K5711K3180k8443j12889P2428K3636r2871R2996
$$ 32947 20945 -5669 -42423 -16712 6468 -21975 -134864 -62436 -38800 -131671 -38675
24442c8675Q0477l0223k9639K9232L6598l5464N053p2876l9111r785p255j2912
$$ -38675 41802 11579 -18060 11172 47770 12306 17359 -55517 -94628 -104413 -111668 -124580
24430a24580J12534N8330o168L1787n6640o9667O8963o087o9195J08284m074N0806
$$ -124580 -12046 46284 40116 71903 15263 -54404 14559 8472 -60723 47561 43487 94293
24418I4293j7475m7066M779j0470L2043J17780N5041J5297j28993j05084J21974
$$ 94293 76818 29752 34531 24061 56104 173884 228925 244222 115229 10145 132119
24407A32119O0424j45811r3838K7597l9434J5537Q2720P6805j22736l9974n1123
$$ 132119 192543 46732 -47106 -19509 -58943 -43406 39314 116119 -6617 -46591 -97714
24396i7714O0894L4623n6327n0733l8308M8045R7398M3009p7843M1720k8772M0208
$$ -97714 -36820 -2197 -58524 -109257 -147565 -99520 -2122 40887 -36956 4764 -24008 16200
24384A6200j7875n151N4534o6968N5022N4922M2523J3562j6687m3911k3586l6377
$$ 16200 -1675 -6826 47708 -19260 35762 90684 133207 146769 130082 86171 62585 26208
24372B6208m5769M6076P155o9941l7812p6934k9061L5205R1246N2983L3842K0423
$$ 26208 -19561 26515 33670 -36271 -74083 -151017 -180078 -144873 -53627 -644 33198 53621
24360E3621j6857j51239K748k6366k0381L7414m6271j1925j2709M8932N3413J28875
$$ 53621 36764 -114475 -111727 -138093 -158474 -121060 -167331 -179256 -191965 -143033 -89620 39255
24348C9255p6396L3439K4680o9778M6064L2119m4616k9831K2490r728K8279J23559
$$ 39255 -37141 -3702 20978 -48800 -2736 29383 -15233 -45064 -22574 -32302 -4023 119536
24336A19536l1414L7331m4920q4307k6952r0220J7629P2647O1618K2227o1395
$$ 119536 88122 125453 80533 -3774 -30726 -120946 -103317 -30670 30948 53175 -8220
24325h220o271J39709M231k8444j02868p5503K5396J9072J6343Q334J8561N2785
$$ -8220 -14491 125218 129449 101005 -1863 -77366 -51970 -32898 -16555 -8221 10340 63125
24313F3125N0726N5138j04806j02627n4060l5118l5528J12836L1116l0527j9819
$$ 63125 113851 168989 64183 -38444 -92504 -127622 -163150 -50314 -19198 -49725 -69544
24302f9544M3662r0080L2758J8929p3340n6069L4502J23139J7645j05659p2030
$$ -69544 -25882 -115962 -83204 -64275 -137615 -193684 -159182 -36043 -18398 -124057 -196087
24291a96087j2825K0147R623J9402O1469P2281k2202M9810M6504P6248m9876q2880
$$ -196087 -208912 -188765 -179142 -159740 -98271 -25990 -48192 1618 48122 124370 74494 -8386
24279h386K8884m468J894L7062L6172K923N1627m4349p4471p0571m110P257o0711
$$ -8386 20498 16030 17924 54986 91158 94081 145708 101359 26888 -43683 -47793 -40536 -101247
24266a01247j0418k3884r351q980O3063P9708N1421p6865J5503O6382r641Q439
$$ -101247 -111665 -135549 -144900 -153880 -90817 -11109 40312 -36553 -21050 45332 35691 44130
24254D4130M7531l3526q7596n1780l0675j3631j9126n989K6313J36048L74q1439
$$ 44130 91661 58135 -29461 -81241 -111916 -125547 -144673 -150662 -124349 11699 12073 -69366
24242f9366q3468K8142J10388M3524j1592o1763n9450k2560M4335Q5913m5250
$$ -69366 -152834 -124692 -14304 29220 17628 -44135 -103585 -126145 -81810 4103 -41147
24231d1147n202N963O5193J3147l4535k7097P9162j1272j02652o7462M3990K6546
$$ -41147 -46349 -40386 24807 37954 3419 -23678 55484 44212 -58440 -125902 -81912 -55366
24219e5366N5916O7825n5375j37975l209O7943n5579j9108k5186K4211K2132L1860
$$ -55366 550 68375 13000 -124975 -128184 -60241 -115820 -134928 -160114 -135903 -113771 -81911
24207h1911K6457L3195M1905n3604p1249M3284k0483j4656j7251O2945M1548P02
$$ -81911 -55454 -22259 19646 -33958 -105207 -61923 -82406 -97062 -114313 -51368 -9820 -9118
24195i118n6749M5740O5651k2648p6114p7507L0316N4786N7945K163j39816P6221
$$ -9118 -65867 -20127 45524 22876 -53238 -130745 -100429 -45643 12302 14465 -125351 -49130
24183d9130J09576L4763o7153j77307k0340O8191M7050P1311l2732j6501K5316
$$ -49130 60446 95209 28056 -149251 -169591 -101400 -54350 16961 -15771 -32272 -6956
24172f956K7448p9787N795j0996j9773K7913m4102r3947J1182Q8058N0283m8805
$$ -6956 20492 -59295 -53500 -64496 -84269 -56356 -100458 -194405 -183223 -95165 -44882 -93687
24160i3687P471Q6914L3115l0953M956o6264m2889k220N5240L4976j6820j22227
$$ -93687 -86216 698 33813 2860 7816 -58448 -101337 -103557 -48317 -13341 -30161 -152388
24148a52388M8751J53587l9326m5300K6437o7312J8594Q2830Q7296M2811N9521
$$ -152388 -103637 49950 10624 -34676 -8239 -75551 -56957 25873 113169 155980 215501
24137B15501j24554n6948K3222K9871q3085j25l695P5489Q4687q4999j00287n5477
$$ 215501 90947 33999 57221 87092 4007 3882 187 75676 160363 75364 -24923 -80400
24125h0400j3101L6322Q5612J1465j4036L5835P2848P8240k7909j24223l5302
$$ -80400 -93501 -57179 28433 39898 25862 61697 134545 212785 184876 60653 25351
24114B5351r8411q0815K5432M1150O2655O1063P4884K0519J477o9840m5014m3036
$$ 25351 -73060 -153875 -128443 -87293 -24638 36425 111309 131828 133305 63465 18451 -24585
24102b4585m0770L3398p8792k6109l5363Q129m551J7406Q6223N1500m380J624
$$ -24585 -65355 -31957 -110749 -136858 -172221 -164092 -168643 -151237 -65014 -13514 -17894 -16270
24090a6270o7236o1092J36822N3595n5140l7619k0147L325Q9704O1862O6836N1703
$$ -16270 -83506 -144598 -7776 45819 -9321 -46940 -67087 -63762 25942 87804 154640 206343
24078B06343n2525k8609J3680n9475m0763l6535k4483o1291p0650K641j4863j808
$$ 206343 153818 125209 138889 79414 38651 2116 -22367 -83658 -154308 -151667 -166530 -168338
24066a68338N4860N3095O3116P9971O537o0712r2193j00699p4743M9549R7254
$$ -168338 -113478 -60383 2733 82704 89241 28529 -63664 -164363 -239106 -189557 -92303
24055i2303L5405m8479O66P7071N0257q761K3319Q3656r5579q3326J00222J23050
$$ -92303 -56898 -105377 -104711 -27640 22617 13856 37175 120831 25252 -58074 42148 165198
24043A65198q184l0389k7801R7520r5251o403k0436K6287n9575j45794n6646O9206
$$ 165198 157014 126625 98824 196344 101093 94690 74254 100541 40966 -104828 -161474 -92268
24031i2268n011K9634L8769J9233o1392j6476J681l0401P4495p121p900j2546
$$ -92268 -97279 -67645 -28876 -9643 -71035 -87511 -85830 -116231 -41736 -48857 -56757 -69303
24019f9303O9359O2524k3349l4126j9153P8047O2305l950k4694l8388l6121n2456
$$ -69303 56 62580 39231 5105 -14048 63999 126304 122354 97660 59272 23151 -29305
24007b9305o0635K2020m717J2293n3820j1595o9410k5603J04336J17219J8235
$$ -29305 -89940 -67920 -72637 -60344 -114164 -125759 -195169 -220772 -116436 783 19018
23996A9018o7248K3870N1977R327l6284N9227l9509l8756r7294o0881M1280P5492
$$ 19018 -48230 -24360 27617 36944 660 59887 20378 -18378 -115672 -176553 -135273 -59781
23984e9781J52026J42012o3249l5063j09987j0089L149j47489j2325K5752J07026
$$ -59781 92245 234257 171008 135945 25958 15869 19018 -128471 -140796 -115044 -8018
23973h018P2110J4704o1627l8993l772Q7893j9727j28521Q1377J52791M5863j6167
$$ -8018 64092 78796 17169 -21824 -25596 62297 42570 -85951 -4574 148217 194080 177913
23961A77913p8977q6087j2125Q7962n1582o2138P4054L0083l0244k8289n5659
$$ 177913 98936 12849 724 88686 37104 -25034 49020 79103 48859 20570 -35089
23950c5089K5106N9364l3935J44M6841k7735p6857O2086j8183P5895N8834m0064
$$ -35089 -9983 49381 15446 15590 62431 34696 -42161 19925 1742 77637 136471 96407
23938I6407l1790Q7784L9421q8670o1066j1834J5391j0346k450k0760k888k7489
$$ 96407 64617 152401 191822 103152 42086 30252 45643 35297 32847 12087 9199 -18290
23926a8290n5341q3647Q3883J32717K0562l7840J7095l1228j7239L0268L089j7191
$$ -18290 -73631 -157278 -73395 59322 79884 42044 59139 27911 10672 40940 44029 26838
23914B6838M1475j1690m4216L3814k709j5779M2340K2873j04601k1028J08265
$$ 26838 68313 56623 12407 46221 43512 27733 70073 92946 -11655 -32683 75582
23903G5582j25647j20220N6853P348J9921j7623J7645j2836J03749L811P916J674
$$ 75582 -50065 -170285 -113432 -106084 -86163 -103786 -86141 -98977 4772 8583 16499 18173
23891A8173O8001j1542n6111L6528j3893l7197j42843M2967J34012J3194j7380
$$ 18173 86174 74632 18521 55049 41156 3959 -138884 -95917 38095 51289 33909
23880C3909j6964O9614j03193J4060Q3626J28737K5119j90046j73327K011l3795
$$ 33909 16945 86559 -16634 -2574 81052 209789 234908 44862 -128465 -126454 -160249
23869a60249j0763K2296O8023J5894M4720n7306J2499j12694J5809J61737j623
$$ -160249 -171012 -148716 -80693 -64799 -20079 -77385 -64886 -177580 -161771 -34 -1657
23858a657j18215j22179J6857J01955O0821O1145n3764n0520J00963M3093m5392
$$ -1657 -119872 -242051 -225194 -123239 -62418 -1273 -55037 -105557 -4594 38499 -6893
23847f893M118l5657J25700K5195j29518k5805l407P2328N536p4940r4097m3553
$$ -6893 -2775 -38432 87268 112463 -17055 -42860 -46267 26061 31597 -43343 -137440 -180993
23835a80993L8735P4777P7145n6562l8057l647k3888j7745K6307P9834M6177n2629
$$ -180993 -142258 -67481 9664 -46898 -84955 -88602 -112490 -130235 -103928 -24094 22083 -30546
23823c0546r630j0457m9365K476K8571N9126k3592J6259R9684J9438N328j5270
$$ -30546 -40176 -50633 -99998 -97522 -68951 -9825 -33417 -17158 82526 101964 107292 92022
23811I2022j54362J3277O8272L8272m7521n9671n0011L3183J17293r178o5239
$$ 92022 -62340 -49063 19209 57481 9960 -49711 -99722 -66539 50754 41576 -23663
23800b3663j21244k4608K3320k0093K638O1700j2537J10345Q0688p075J246j1895
$$ -23663 -144907 -169515 -146195 -166288 -163650 -101950 -114487 -4142 76546 69471 70717 58822
23788E8822k0965o3584j66071l6496K3712L8148m382n789K4891L1483j9455J8735
$$ 58822 37857 -25727 -191798 -228294 -204582 -166434 -170816 -176605 -151714 -120231 -139686 -120951
23776a20951K2705L6042N5353J028k8090L4303O5775P0422l7086q5718L2083K3768
$$ -120951 -98246 -62204 -6851 -5823 -33913 390 66165 136587 99501 13783 45866 69634
23764F9634N2759K0557M2446p1574p6016Q3270N2555o8916j12506j5661O349Q1019
$$ 69634 122393 142950 185396 113822 37806 121076 173631 104715 -7791 -23452 -17103 63916
23752F3916R8850K6323P9885k0091n0488Q9974j5406j6027n8699p7937j00324
$$ 63916 162766 189089 268974 248883 198395 288369 272963 256936 198237 120300 19976
23741A9976k6886o2167J1255N6916O3543n1745O535N5293J04068O8971p9630p2093
$$ 19976 -6910 -69077 -57822 -906 62637 10892 17427 72720 176788 245759 166129 94036
23729I4036l3241j10261J1356p7210o2504M8930K8514J00305p5862k9476M8488
$$ 94036 60795 -49466 -38110 -115320 -177824 -128894 -100380 -75 -75937 -105413 -56925
23718e6925k8290p0630J31674R3632L2826m3869J11926j14523j44694n5749N6876
$$ -56925 -85215 -155845 -24171 69461 102287 58418 170344 55821 -88873 -144622 -87746
23707h7746J17243j5907j6233m3157j14748k1420O3534J07098k0887o863j7739
$$ -87746 29497 13590 -2643 -45800 -160548 -181968 -118434 -11336 -32223 -39086 -56825
23696e6825Q6781q9834m3559L2690J48774p398L3410j23184j13309J6325L4198
$$ -56825 29956 -59878 -103437 -70747 78027 70629 104039 -19145 -132454 -116129 -81931
23685h1931Q292K2637k2314J20126k4088M825R3o2391p6304K1451J0218K5771
$$ -81931 -73639 -51002 -73316 46810 22722 27547 27640 -34751 -111055 -89604 -79386 -53615
23673e3615O1556l9954L5410j774Q929l1947j7292J1242k9226p8269m9529j5560
$$ -53615 7941 -32013 3397 1623 10552 -21395 -38687 -27445 -56671 -134940 -184469 -200029
23661b00029P9678N9957n9805K3105J6995l1996P3107J14319O4964J1199J2147
$$ -200029 -120351 -60394 -120199 -97094 -80099 -112095 -38988 75331 140295 151494 163641
23650A63641j03114r2914n4415j6668j2415P0153N8952r788j061l7782r2747l8245
$$ 163641 60527 -32387 -86802 -103470 -115885 -45732 13220 3432 2371 -35411 -128158 -166403
23638a66403J05659P7140q1216N7931R6995K8391R6000P4885l1021p3814j2822
$$ -166403 -60744 16396 -64820 -6889 90106 118497 214497 289382 258361 184547 171725
23627A71725o2626p7078l6981o708J0792L7967R336m5520l1783N498j06249j44223
$$ 171725 109099 32021 -4960 -11668 -876 37091 46427 907 -30876 -25378 -131627 -275850
23615b75850K9690J52202N4237L9681n905N431R4822N7767j42788j07129n3064
$$ -275850 -246160 -93958 -39721 -40 -5945 -514 94308 152075 9287 -97842 -150906
23604a50906K8470N4446J1481k981Q9363R3876r5068j39931o0917J42846L0941
$$ -150906 -122436 -67990 -56509 -59490 29873 123749 28681 -111250 -172167 -29321 1620
23593A620o0778o7194J53676P4032l2524N332O267M537J1472q1871j05758K4908
$$ 1620 -59158 -126352 27324 101356 68832 74164 80431 84968 96440 14569 -91189 -66281
23581f6281L0057P3854K7939M2617J5384p611L462m020M2981r9098n5091o055
$$ -66281 -36224 37630 65569 108186 123570 115959 119421 115401 158382 59284 4193 -1862
23569a862r959K6887n3135l1122J1789k3065O6463p5753j431L5527k3108K7271
$$ -1862 -11821 15066 -38069 -69191 -57402 -80467 -14004 -89757 -91188 -55661 -78769 -51498
23557e1498k5333K7550k6933q3696J0410K9125O5502N322Q444j9453J05059M9374
$$ -51498 -76831 -49281 -76214 -159910 -149500 -120375 -54873 -49551 -41107 -60560 44499 93873
23545I3873L1617o9654J7024l1988J8499R988m8067q691O4856k1649m4656n0119
$$ 93873 125490 55836 72860 40872 59371 69359 21292 12601 77457 55808 11152 -38967
23533c8967j8179j5510L1475M1401O0028q694k6852n1451n2962N7831l057o2307
$$ -38967 -57146 -72656 -41181 220 60248 51554 24702 -26749 -79711 -21880 -24937 -87244
23521h7244n745J07287O6022m1787L4402K9044K9279m0384P1868k0019j28086
$$ -87244 -92989 14298 80320 38533 72935 101979 131258 90874 162742 142723 14637
23510A4637P270J5129J1468Q4942l099k0367O5310p1243p5323p9022l5887O523
$$ 14637 21907 37036 48504 133446 130347 109980 175290 104047 28724 -50298 -86185 -79662
23498g9662k0801O3451k2247K1787P5679k8475n2839M50n9854J9067M3890N0398
$$ -79662 -100463 -37012 -59259 -37472 38207 9732 -43107 -42657 -102511 -83444 -39554 10844
23486A0844J39124l7017q9406K8356K6187N3034L2266j17417q1722j4861j01900
$$ 10844 149968 112951 23545 51901 78088 131122 163388 45971 -35751 -50612 -152512
23475a52512k7750R0917J06299M5961K3432N15J6629o4286p386l4745k5689K4222
$$ -152512 -180262 -89345 16954 62915 86347 86862 103491 39205 31819 -2926 -28615 -4393
23463d393M2720Q2660M7231p1533q5073K7519o6280m8931O111M5053m369L799
$$ -4393 38327 120987 168218 96685 11612 39131 -27149 -76080 -69969 -24916 -29285 -25486
23451b5486Q5883J1885o5937l6671j6380n0625j1281Q5152K0405L1401M1136Q5786
$$ -25486 60397 72282 6345 -30326 -46706 -97331 -108612 -23460 -3055 28346 69482 155268
23439A55268k9747k4184K2213j0514q6981n4419J1964M2818J00123n5464k2483
$$ 155268 125521 101337 123550 113036 26055 -28364 -16400 26418 126541 71077 48594
23428D8594j5572K7655M5962j2694J8513L3789l8112M1680r912J1847r2534K6173
$$ 48594 33022 60677 106639 93945 112458 146247 108135 149815 139903 151750 59216 85389
23416H5389L6231j087k4469p0280n2716m3364N9262k5798j6947L8320O5312k5491
$$ 85389 121620 120533 96064 25784 -26932 -70296 -11034 -36832 -53779 -15459 49853 24362
23404B4362K7950j3935k1400J9713K6267m5651J00453j3691K7471j8386o5709
$$ 24362 52312 38377 16977 36690 62957 17306 117759 104068 131539 113153 47444
23393D7444j01947K5300k965J3779M0015N9201N529j472j30800M1746J14261l74
$$ 47444 -54503 -29203 -32168 -18389 21626 80827 86356 84884 -45916 -4170 110091 109717
23381A09717m8396N3793m6754r0950M0107K1371J2112l7788L8996n7349j01629
$$ 109717 61321 115114 68360 -22590 17517 38888 51000 13212 52208 -5141 -106770
23370a06770M7186R3980K5135J505o627q7273K0495j8732j7119P4954N770J9435
$$ -106770 -59584 34396 59531 61036 54409 -32864 -12369 -31101 -48220 26734 32504 51939
23358E1939k6862L353k7974j2459o968p983P7842M8902J8190o1995J2699P3309
$$ 51939 25077 28430 456 -12003 -18971 -26954 50888 99790 117980 55985 68684 141993
23346A41993O726o5991p3930r8146p930P5465P7089l184o9630n6540j7947j0639
$$ 141993 148719 82728 8798 -89348 -97278 -21813 55276 52092 -17538 -74078 -92025 -102664
23334a02664n910j005R9867l8607j1962K4141m7429j205K5114j1453N6838j2058
$$ -102664 -108574 -109579 -9712 -48319 -60281 -36140 -83569 -84774 -59660 -71113 -14275 -26333
23322b6333r2057J9530J5440J1560L9164L9796O7489o3033q5414N4089R3478m2324
$$ -26333 -118390 -98860 -83420 -71860 -32696 7100 74589 11556 -73858 -19769 73709 31385
23310C1385N1499j106o3075J9055o7379o0728N1157Q3605n3824k2593j22350q8015
$$ 31385 82884 81778 18703 37758 -29621 -90349 -39192 44413 -9411 -32004 -154354 -242369
23298b42369J4042O5035Q3982O1847O1441j7697n362M5735k055j05984j35041
$$ -242369 -228327 -163292 -79310 -17463 43978 26281 20919 66654 64599 -41385 -176426
23287a76426j04595P239R6750J13771N9582K5896K1357m4202P1288P4321m6216
$$ -176426 -281021 -273782 -177032 -63261 -3679 22217 43574 -628 70660 144981 98765
23276I8765m6832J3240O3820M5457K7707n1430k4033k8578K3132q5516m7766j1628
$$ 98765 51933 65173 128993 174450 202157 150727 126694 98116 121248 35732 -12034 -23662
23264b3662k5131l7326Q5637Q908k3797k7699P2916K1991k6326N4853j23868r1836
$$ -23662 -48793 -86119 -482 8426 -15371 -43070 29846 51837 25511 80364 -43504 -135340
23252a35340l4459n783J40400J10285j0287J2944l1845j8626l081N953J0683J6442
$$ -135340 -169799 -175582 -35182 75103 64816 77760 45915 27289 24208 30161 40844 57286
23240E7286J4861n645K6873M6637L3J12123n9189j51160n9590L7016J02511N7765
$$ 57286 72147 66502 93375 140012 140045 252168 192979 41819 -17771 19245 121756 179521
23228A79521j2823q8115N537k686K9691L4678j36876m098j1953j3223l0350Q041
$$ 179521 166698 78583 84120 81434 111125 145803 8927 4829 -7124 -20347 -50697 -42656
23216d2656j4707N0090M9436k476m976p9039Q7766L0023N0466k5715l8890m3405
$$ -42656 -57363 -7273 42163 39687 34711 -44328 43438 73461 123927 98212 59322 15917
23204A5917Q6097K8830m0419L6622j00067l9834Q3565N3994M1858N8154K0010
$$ 15917 102014 130844 90425 127047 26980 -12854 70711 124705 166563 224717 244727
23193B44727Q2496M1973n3433q1978r0766j39876n788Q3525L8399J5617Q1578
$$ 244727 327223 369196 315763 233785 143019 3143 -2645 80880 119279 134896 216474
23182B16474j06570j10297j42573Q5955O1260J3100J34455r374Q1588k8838n9797
$$ 216474 109904 -393 -142966 -57011 4249 17349 151804 142430 224018 195180 135383
23171A35383P4801Q9603M1033J22184J90752J36191Q5903J42236J48471L9194
$$ 135383 210184 299787 340820 463004 653756 789947 875850 1018086 1166557 1205751
23161A205751j53998k22233j04464j10896o6250r4601o2774j14088o6011o5413
$$ 1205751 1051753 829520 725056 614160 547910 453309 390535 276447 210436 145023
23151A45023p0502K0384J57302M7197j06752n5363n1134R6717K5202r0430j16826
$$ 145023 74521 94905 252207 299404 192652 137289 86155 182872 208074 117644 818
23140H18q4217N4988n077N6453J00067J07423p9202j30613q0928j9059J5598n4337
$$ 818 -83399 -28411 -33488 22965 123032 230455 151253 20640 -60288 -79347 -63749 -118086
23128a18086O3112J42221O6765q4027o8805Q0100m0369j02265L8037q157P6827
$$ -118086 -54974 87247 154012 69985 1180 81280 40911 -61354 -23317 -31474 45353
23117D5353M1182K375M0756j4184n7735J7059J17678m861j08475j20758r064P2341
$$ 45353 86535 88910 129666 115482 57747 74806 192484 187623 79148 -41610 -50674 21667
23105B1667k13M1724k6399N1738L9971m7178J978J07071K2219p3714l9774M3397
$$ 21667 21454 63178 36779 88517 128488 81310 83288 190359 212578 138864 99090 142487
23093A42487M3556P6970k5714l0773k3418o7375p2950O2981J03872m384o2572
$$ 142487 186043 263013 237299 206526 183108 115733 42783 105764 209636 205252 142680
23082A42680O507m020j9883M7268l5061o9030l3617r4640k9348M1918K450k377
$$ 142680 149187 145167 125284 172552 137491 68461 34844 -59796 -89144 -47226 -44776 -47153
23070d7153M5071R4861m0658q6460K4657N549o1324M2776q093L9111J2138J08046
$$ -47153 -2082 92779 52121 -34339 -9682 -4133 -65457 -22681 -30774 8337 20475 128521
23058A28521O713M7028p5973l6352o2154o7486J31271J0251J165q1002o2177L1102
$$ 128521 135234 182262 106289 69937 7783 -59703 71568 81819 82984 1982 -60195 -29093
23046b9093L7219j3894m3369L0040N551R8967m0351o963M8823j25893r2538P6318
$$ -29093 8126 -5768 -49137 -19097 -13546 85421 45070 38107 86930 -38963 -131501 -55183
23034e5183M3767q0R0437k0802K6275l3067n2174j9609M7411J813m1419J2577
$$ -55183 -11416 -11496 78941 58139 84414 51347 -827 -20436 26975 28788 -12631 -54
23022e4K7009M183K8433r5002J6880Q5333j1173l1848N784L9706M9559q119p4858
$$ -54 26955 31138 59571 -35431 -18551 66782 55609 23761 29545 69251 118810 110691 35833
23009C5833r661J0082r5367q8176Q6057P9088k6892p1155J11679L3909k6329k2302
$$ 35833 26172 36254 -59113 -147289 -61232 17856 -9036 -80191 31488 65397 39068 16766
22997A6766O4475m4691k7462j9246n5683o1102n1385j7360N9334K2723L8059J49268
$$ 16766 81241 36550 9088 -10158 -65841 -126943 -178328 -195688 -136354 -113631 -75572 73696
22985G3696M792m2866o6462p1458O1405O8853L4878R0793l0879l5224n8089M2375
$$ 73696 78488 35622 -30840 -102298 -40893 27960 62838 153631 122752 87528 29439 71814
22973G1814J18695m0721j9858J4727l5283N300L2600o7549p9803j3493o3086J4081
$$ 71814 190509 149788 129930 144657 109374 114674 147274 79725 -78 -13571 -76657 -62576
22961f2576L3563J704L1437j3384O468P5150k4223j4882l3156L3390J39533J18679
$$ -62576 -29013 -27309 4128 -9256 -2788 72362 48139 33257 101 33491 173024 291703
22949B91703j7071o4414k6247j8258k6973m8814o7725L388L6644L0082j7203l1689
$$ 291703 274632 210218 183971 165713 138740 89926 22201 25589 62233 92315 75112 43423
22937D3423o214j8824j5337j5088j65472J071L5701J12832L2231L4068j7108M7921
$$ 43423 37209 18385 3048 -12040 -177512 -176441 -140740 -27908 4323 38391 21283 69204
22925F9204J2869J10239Q3614n7461j1213j2453p6284K196P5188P085q8566j2479
$$ 69204 82073 192312 275926 218465 207252 194799 118515 120711 195899 202984 114418 101939
22913A01939R0938L3028J7277l5116o0601L5858q0981p3153j1597j8319j4388
$$ 101939 192877 225905 243182 208066 147465 183323 102342 29189 17592 -727 -15115
22902a5115J9366p622L476J95789J8322j34021j773N6028M0202J4324j1936k660
$$ -15115 4251 -3371 105 195894 214216 80195 78422 134450 174652 188976 177040 174380
22890A74380k2758o0097Q4184m9128p1243M1011J7369k6437l8883j7882L6468
$$ 174380 151622 91525 175709 126581 55338 96349 113718 87281 48398 30516 66984
22879F6984k5214o2674L7687K07723P3137j784J0308p3245p329n8309p8539J6565
$$ 66984 41770 -20904 16783 224506 297643 295859 306167 232922 225593 167284 88745 105310
22867A05310J57755K7587n8614N358N216Q7884M1391L1967q3255j28824r7599
$$ 105310 263065 290652 232038 237396 242612 330496 371887 403854 320599 191775 94176
22856I4176K1738J2282J4686J0986k922L849n0815j00570J05357K31974m6733
$$ 94176 115914 128196 142882 153868 150946 154795 103980 3410 108767 340741 294008
22845B94008j81463n8147J15999N9205j00347j9471k2227M0942j2351j358o0154
$$ 294008 112545 54398 170397 229602 129255 109784 87557 128499 116148 114790 54636
22834E4636k4643N8767j01581m6352J9606j26465R932J10320O0481Q6909j3289
$$ 54636 29993 88760 -12821 -59173 -39567 -166032 -156100 -45780 14701 101610 88321
22823H8321N0603M9335m5412K5098Q6821k0441l7791k2603q1656O1093m0053p1381
$$ 88321 138924 188259 142847 167945 254766 234325 196534 173931 92275 153368 113315 41934
22811D1934K46j35616l9477J9644N5002Q5992j7272Q361J45451O4475l7241j52683
$$ 41934 42180 -93436 -132913 -113269 -58267 27725 10453 18814 164265 228740 191499 38816
22799C8816m7411l7413O9497J19443R7109J9103p8989k8326K0693l5004R961J2897
$$ 38816 -8595 -46008 23489 142932 240041 259144 180155 151829 172522 137518 147479 160376
22787A60376o5225k9176k9338M6443k7695K3449l4179n0603P3221O9869M6698
$$ 160376 95151 65975 36637 83080 55385 78834 44655 -5948 67273 137142 183840
22776A83840L0270r0459k0710r046k5841J27731m1668R987K567L5624j2408K7950
$$ 183840 214110 123651 102941 93895 68054 195785 154117 164104 166671 202295 189887 217837
22764B17837m6971j2228r2939J8912N2220o809R9234L3805j9937K620r2026m7454
$$ 217837 170866 158638 65699 84611 136831 130022 229256 263061 243124 245744 153718 106264
22752A06264J9770J9714L6592j7847M7543N1382r8743l6799M7672R7524J4900
$$ 106264 126034 145748 182340 164493 212036 263418 164675 127876 175548 273072 287972
22741B87972l2098m7962Q0692j7322l0029L5912L9277q09l8169o7151p5822o6255
$$ 287972 255874 207912 288604 271282 241253 277165 316442 315633 277464 210313 134491 68236
22729F8236J7248N8243M4765n9728K0085J05581J18162L6681k2601J3663K465
$$ 68236 85484 143727 188492 128764 148849 254430 372592 409273 386672 400335 402800
22718D02800p9237r6477r4189O0610J4041O9749L4128m2117O1396K2704j4329
$$ 402800 323563 227086 132897 193507 207548 277297 311425 269308 330704 353408 339079
22707C39079J7847P2050P3176R0225r3663o1185K1106J02077J7467l8626j0013
$$ 339079 356926 428976 502152 592377 498714 437529 458635 560712 578179 539553 529540
22696E29540j1280P9262J63851J72024K20090R8798P6968J45850J37624K3252
$$ 529540 518260 597522 761373 933397 1153487 1252285 1329253 1475103 1612727 1635979
22686A635979j58581j19970j41200j15565j24289r1163o6335L542L1400J03769
$$ 1635979 1477398 1357428 1216228 1100663 976374 885211 818876 822418 853818 957587
22676I57587K5409j1611j18414k780j8881K6948k1389k8913P5428N2262J3220
$$ 957587 982996 971385 852971 850191 831310 858258 836869 807956 883384 935646 948866
22665I48866Q239L8334P3344n848K1905K46719J5075n4425j9559L2045N83k3138
$$ 948866 957105 995439 1068783 1062935 1084840 1331559 1346634 1292209 1272650 1304695 1305278 1282140
22653A282140Q8966J38702O4910n4105M1244M9370J09222j6630N6151P1215P6725
$$ 1282140 1371106 1509808 1574718 1520613 1561857 1611227 1720449 1703819 1759970 1831185 1907910
22642A907910L7890N1533J97613J07083J66319J61117J26986J71076L06257L20473
$$ 1907910 1945800 1997333 2194946 2302029 2468348 2629465 2756451 2927527 3233784 3554257
22632C554257L30389L06821L89228O07503O55240Q34812J088832J341997J572236
$$ 3554257 3884646 4191467 4580695 5188198 5843438 6678250 7767082 9109079 10681315
22623A0681315K014000K699342L673330M795710O691203R566585J3855616J9829497
$$ 10681315 12695315 15394657 19067987 23863697 30554900 40121485 53977101 73806598
22615G3806598K5695031K8193188K6207377J9906427P285145p805347j7856752
$$ 73806598 99501629 127694817 153902194 173808621 181093766 173288419 155431667
22608A55431667k4321390k7079924k3752789j8441425j3995400j0237681p164995
$$ 155431667 131110277 104030353 80277564 61836139 47840739 37603058 30438063
22601C0438063n095106l841695k860950k044782j421661j119360r38281o26070
$$ 30438063 25342957 21501262 18640312 16595530 15173869 14054509 13116228 12490158
22593A2490158n05534k97385q5972K14446N30456M11712K85883J36398k38968
$$ 12490158 11984624 11687239 11601267 11815713 12346169 12757881 13043764 13180162 12941194
22584A2941194n79590p75636q70605o87604n12629m26765l07344j88313k00290
$$ 12941194 12361604 11585968 10715363 10027759 9515130 9088365 8781021 8592708 8392418
22575H392418k30152j69255l49482l50916l35508m35324l97546m20210l99767
$$ 8392418 8162266 7993011 7643529 7292613 6957105 6521781 6124235 5704025 5304258
22566E304258j64467j70733k74721k76540k60219k98218j45486j20388k04452
$$ 5304258 5139791 4969058 4694337 4417797 4157578 3859360 3713874 3593486 3389034
22557C389034j51259j25222j18946j42456j32113j59032k34565j10335j41204
$$ 3389034 3237775 3112553 2993607 2851151 2719038 2560006 2325441 2215106 2073902
22548B073902j63288j80472n4687q3830j13076p9899m3599o717J4643l2810J17218
$$ 2073902 1910614 1730142 1675455 1591625 1478549 1398650 1355051 1348334 1362977 1330167 1447385
22537A447385J16557L4332J61239P0308K5432m4318j76455j07948j71350j92977
$$ 1447385 1563942 1598274 1759513 1829821 1855253 1810935 1634480 1526532 1355182 1162205
22527A162205r0385r1425j53938r6824l9095o8317r0756k6581J0223m5878J4934
$$ 1162205 1071820 980395 826457 729633 690538 622221 531465 504884 515107 469229 484163
22516D84163r8815J4548j7257K3797l2514j4243l2273n8379L6590m6007N241m6383
$$ 484163 385348 399896 382639 406436 373922 359679 327406 269027 305617 259610 264851 218468
22504B18468j7086M2334J2694r1180K2692R4106k4461r145M3666j8113j19184
$$ 218468 201382 243716 256410 165230 187922 282028 257567 248422 292088 273975 154791
22493A54791N4974Q3002n8488J32125L1894k8139J9068K8444R801r2485j13041
$$ 154791 209765 292767 234279 366404 398298 370159 389227 417671 427472 334987 221946
22482B21946j09620L6391n2232q2200l9143K2454n1430p2166L0168O8407P3263
$$ 221946 112326 148717 96485 14285 -24858 -2404 -53834 -126000 -95832 -27425 45838
22471D5838J912J7794j8938j006P4379l2498q1928l3031q564J18382p375j13916
$$ 45838 47750 65544 46606 45600 119979 87481 5553 -27478 -36042 82340 74965 -38951
22459c8951L0739J42555Q5804j4833j30626j02258K5629K9404P03J902Q058o5828
$$ -38951 -8212 134343 220147 205314 74688 -27570 -1941 27463 28166 30068 38126 -27702
22447b7702m3302M0219l5125k9562J39193J22584j2881n3928L1410j1409m4676
$$ -27702 -71004 -30785 -65910 -95472 43721 166305 153424 99496 130906 119497 74821
22436G4821M8904p5015l6589M2592J17645N3872K0427m3057j3429p9063m3120
$$ 74821 123725 48710 12121 54713 172358 226230 246657 203600 190171 111108 67988
22425F7988J3506j09112k268P1216k8436p5568L4969N8748O2336n8847j2232J8606
$$ 67988 81494 -27618 -29886 41330 12894 -62674 -27705 31043 93379 34532 22300 40906
22413D0906P8909j1956P428r6873j03377n6809J17755l7782K1887R4761o9143
$$ 40906 119815 107859 115287 18414 -84963 -141772 -24017 -61799 -39912 54849 -14294
22402a4294l8288m0395K4892N803J1391k0553j5873R3746M1307m3845N5824J38719
$$ -14294 -52582 -92977 -68085 -62282 -50891 -71444 -87317 6429 47736 3891 59715 198434
22390A98434m8036j05922j327J03543J08427p5486n9709p6204l5121k7038o489
$$ 198434 150398 44476 43149 146692 255119 179633 119924 43720 8599 -18439 -24928
22379b4928o3800O0015q129q600m8527R880Q211J9108Q0275o4781m1912n2115
$$ -24928 -88728 -28713 -36842 -45442 -93969 -84089 -75878 -56770 23505 -41276 -83188 -135303
22367a35303r0240M6029O4871q696P2179J14686p444j23653j08979K4523O5968
$$ -135303 -225543 -179514 -114643 -123339 -51160 63526 56082 -67571 -176550 -152027 -86059
22356h6059q9877m2270O8541J15205N6252K5986m0020J8239N9577k8675o4652
$$ -86059 -175936 -218206 -149665 -34460 21792 47778 7758 25997 85574 56899 -7753
22345g753o3385k8614o4664K1370Q4385K6742N9222Q2543p4534q3512k3990P0689
$$ -7753 -71138 -99752 -164416 -143046 -58661 -31919 27303 109846 35312 -48200 -72190 -1501
22333a501m0657p6909L0174O0754K6009J02234r1256n8168R7143k9375j08786
$$ -1501 -42158 -119067 -88893 -28139 -2130 100104 8848 -49320 47823 18448 -90338
22322i0338K7006K3404L38K6408J34296O9839j11884j21615K0940N3141j4744
$$ -90338 -63332 -39928 -39590 -13182 121114 190953 79069 -42546 -21606 31535 16791
22311A6791m2085q920N2217N547M7574l6091k328m4311j8773Q467m8871L4153
$$ 16791 -25294 -34214 18003 23550 71124 35033 32705 -11606 -30379 -21912 -70783 -36630
22299c6630l1017n5830q8364l2090o1797L9814J14555M3759K9530J385N7070j00716
$$ -36630 -67647 -123477 -211841 -243931 -305728 -265914 -151359 -107600 -78070 -76685 -19615 -120331
22287a20331k5759k1613L2010M5564J16763P9767r1694r8776o2332m9213j6861
$$ -120331 -146090 -167703 -135693 -90129 26634 106401 14707 -84069 -146401 -195614 -212475
22276b12475L4921l6541K4207J27669N2746n542k5950n8152M3513J26905K820
$$ -212475 -177554 -214095 -189888 -62219 -9473 -15015 -40965 -99117 -55604 71301 74121
22265G4121j27883n1839R0551k3865j27703J30003M9393K3473L3927M686r8770
$$ 74121 -53762 -105601 -15050 -38915 -166618 -36615 12778 36251 70178 74864 -23906
22254b3906Q4655R5628l8277r9197k7577m3108m9577k9810O0841P3872J0370n6759
$$ -23906 60749 156377 118100 18903 -8674 -51782 -101359 -131169 -70328 3544 13914 -42845
22242d2845k5251P6661J22930r1339o7491q5435j805J00474M8953k3878k9032
$$ -42845 -68096 8565 131495 40156 -27335 -112770 -114575 -14101 34852 10974 -18058
22231a8058Q1942N1238j0883J6450j965l6858Q869j33217o7034J6905P6676P9386
$$ -18058 63884 115122 104239 120689 118724 81866 90735 -42482 -109516 -92611 -15935 63451
22219F3451N49l7259L8349o868l6653j4274q0442k2633P3186l095Q799j9963r0157
$$ 63451 64000 26741 65090 58222 21569 7295 -73147 -95780 -22594 -25689 -16890 -36853 -127010
22206a27010j6821p1433k395K7721j0685M0354P6617O8162N9002n6448j9899N1296
$$ -127010 -143831 -215264 -217659 -189938 -200623 -160269 -83652 -15490 43512 -12936 -32835 18461
22194A8461J05966n0730p0177m4052L244K7448o8612R215J3773l9341J11974Q2922
$$ 18461 124427 73697 3520 -40532 -37288 -9840 -78452 -69237 -55464 -94805 17169 100091
22182A00091j09868j08466K3520K2199L2783n0100j17058l6272J10930J06564
$$ 100091 -9777 -118243 -94723 -72524 -39741 -89841 -206899 -243171 -132241 -25677
22172b5677o0299L187N7375Q300P020k5731O7336J0780m2039k0007p806R600R1750
$$ -25677 -85976 -82789 -25414 -17114 -10094 -35825 31511 42291 252 -19755 -27561 -17961 73789
22159G3789P403N7262k0152j17358L9786K2218o8451k4565M6668p3429j17137
$$ 73789 81192 138454 118302 944 40730 62948 -5503 -30068 16600 -56829 -173966
22148a73966P804K491j2007N7650K4333r4937M911J23990J8085p3394k6456N4535
$$ -173966 -166162 -163671 -175678 -118028 -93695 -188632 -183721 -59731 -41646 -115040 -141496 -86961
22136h6961N9007K5485J1917m241K096j16926k0919J03576n1577o441M3405j5575
$$ -86961 -27954 -2469 9448 5207 7303 -109623 -130542 -26966 -78543 -84984 -41579 -57154
22124e7154m0687R2540J19712R8056n8436k1873m1735l8022L269L8084r4940j2236
$$ -57154 -97841 -5301 114411 212467 154031 132158 90423 52401 55670 93754 -1186 -13422
22112a3422J7225N1243J2870m7478k8690l417K5511Q0679N0040l3922r780j3960
$$ -13422 3803 55046 67916 20438 -8252 -11669 13842 94521 144561 110639 100859 86899
22100H6899r7822m2328p1851L1021J6619R9734k7110o3081K2068P4106p0173k2360
$$ 86899 -10923 -53251 -125102 -94081 -77462 22272 -4838 -67919 -45851 28255 -41918 -64278
22088f4278l9892J15780Q4267n4464p0824n841m3928n7396k1852M5707Q2112m1226
$$ -64278 -104170 11610 95877 41413 -29411 -35252 -79180 -136576 -158428 -112721 -30609 -71835
22076g1835L2609l6028j5162p334J8336M3663j40276J1802J41905J24827p7283
$$ -71835 -39226 -75254 -90416 -97750 -79414 -35751 -176027 -164225 -22320 102507 25224
22065B5224p7278P6924M2258J58364M0938n8212M8784j26833M5668R5440J33128
$$ 25224 -52054 24870 67128 225492 266430 208218 257002 130169 175837 271277 404405
22054D04405J05449J25257R2027J65118L4998o4209l4025j81081k08589k7458
$$ 404405 509854 635111 727138 892256 927254 863045 829020 647939 439350 411892
22044D11892o0974j65735l0675L0891j14106k2326R852q0115J895J3637K5356
$$ 411892 350918 185183 154508 185399 71293 48967 58819 -21296 -19401 -5764 19592
22033A9592M5118j8808j4221R2924p6395l8400k3481k1272O0614K6453J4574O7177
$$ 19592 64710 45902 31681 124605 48210 9810 -13671 -34943 25671 52124 66698 133875
22021A33875J6223j34355j43632L1841m3437j0670K2717p5361p011Q3380J70904
$$ 133875 150098 15743 -127889 -96048 -139485 -150155 -127438 -202799 -209810 -126430 44474
22010D4474O8681k6072l4508j5885M4322j3988o7096P338j3359N873J5284r0220
$$ 44474 113155 87083 52575 36690 81012 67024 -72 7266 -6093 -220 15064 -75156
21998g5156j4751k214R1610M1897l4474L734M9784n5904j31906k3455Q5960N5433
$$ -75156 -89907 -92121 -511 41386 6912 10646 60430 4526 -127380 -150835 -64875 -9442
21986i442k0544l4746L4559M0297J6665O6775j7934o7817j3706P5474o5748l6853
$$ -9442 -29986 -64732 -30173 10124 26789 93564 75630 7813 -5893 69581 3833 -33020
21974c3020r4507J0733R3066N5660R1174J1816Q5034l0589j2362l1316j65857
$$ -33020 -127527 -116794 -23728 31932 123106 134922 219956 189367 177005 145689 -20168
21963b0168q4628J456N9002l528J185K8597M9465M8139N196P9293J1307J16461
$$ -20168 -104796 -103340 -44338 -47866 -46681 -18084 31381 79520 84716 164009 175316 291777
21951B91777M4386J30553J23498J31064K674j5504J6620q9049j54039m8835q5409
$$ 291777 336163 466716 590214 721278 723952 708448 725068 636019 481980 433145 347736
21940C47736j38618j15630J5725R8521L6492K4088m3615K3978N9037k9170m2770
$$ 347736 209118 93488 109213 207734 244226 268314 224699 248677 307714 278544 235774
21929B35774j18648r9638J6828o517r0267M8635J5454j46596r2126M340J80736
$$ 235774 117126 17488 34316 27799 -62468 -13833 1621 -144975 -237101 -232761 -52025
21918e2025J49581L5451k7184q9657O0688J2151J6673N1881P1345m625p8167j19103
$$ -52025 97556 133007 105823 16166 76854 89005 105678 157559 228904 224279 146112 27009
21906B7009j01717Q0562J12789O6299l6520N4278l2501j05397o4846o1303l9761
$$ 27009 -74708 5854 118643 184942 148422 202700 170199 64802 -44 -61347 -101108
21895a01108k8534K0891m9478n2303O1228j8816n8405o2010J02884J04036J09669
$$ -101108 -129642 -108751 -158229 -210532 -149304 -168120 -226525 -288535 -185651 -81615 28054
21884B8054J3914j23638m7133N9479L0118P065J4687R651M7566M3142j8581J5961
$$ 28054 41968 -81670 -128803 -69324 -39206 -32141 -17454 -7803 39763 82905 64324 80285
21872H0285p0165q0402j8375P1958J03046m6970j3346j8284K484K8577q8916r4429
$$ 80285 10120 -70282 -88657 -16699 86347 39377 26031 7747 10231 38808 -50108 -144537
21860a44537Q6816Q1011N5148k5764N5093n007j21366n4761k3338O837J03599
$$ -144537 -57721 23290 78438 52674 107767 102760 -18606 -73367 -96705 -89868 13731
21849A3731K9667p3207N9192J2283j00398K28j667j051J8225l4795R2962P8948
$$ 13731 43398 -29809 29383 41666 -58732 -58504 -60171 -61222 -42997 -77792 15170 94118
21837I4118M7752q9263q8810n0510J9268O8315P6640J3487r2190J0842m8051j2505
$$ 94118 141870 52607 -36203 -86713 -67445 870 77510 90997 -1193 9649 -38402 -50907
21825e0907m4015K0137R5245p3413n8888j0447O8595P9141K5135K4156N6671j976
$$ -50907 -94922 -74785 20460 -52953 -111841 -122288 -53693 25448 50583 74739 131410 129434
21813A29434k6391n8711o7432R0061o8455j28139j7571M7858j0857j33865k7269
$$ 129434 103043 44332 -23100 66961 -1494 -129633 -147204 -99346 -110203 -244068 -271337
21802b71337L1483M9764J07628N1830j6514J8207N1880P6312l8107n6910q2946
$$ -271337 -239854 -190090 -82462 -30632 -47146 -28939 22941 99253 61146 4236 -78710
21791g8710N0497K9654j071j7992r2386J3732O6796k1264N0599R4731q8590m3739
$$ -78710 -28213 1441 370 -17622 -110008 -96276 -29480 -50744 -145 94586 5996 -37743
21779c7743J7875J14139J05979o3007j09997l9843P104J0463l4781N8182j5879
$$ -37743 -19868 94271 200250 137243 27246 -12597 -5493 4970 -29811 28371 12492
21768A2492q5193r527p599n7118j9338q8468P1583J91010l44J8888n5183r7265
$$ 12492 -72701 -82228 -89827 -146945 -166283 -254751 -183168 7842 7498 26386 -28797 -126062
21756a26062q746J1704O0262J11811j6225M8717M074O852j00808j3770L8059K9657
$$ -126062 -134808 -123104 -62842 48969 32744 81461 85535 92387 -8421 -22191 15868 45525
21744D5525J782j07388k9287P4532k2789j38429R9123L7173j6665J1152k014q134
$$ 45525 47307 -60081 -89368 -14836 -37625 -176054 -76931 -39758 -56423 -45271 -47285 -55419
21732e5419J39928J5078j07140K6224O3547J1098K9056M0179K6874j15627j13686
$$ -55419 84509 99587 -7553 18671 82218 93316 122372 162551 189425 73798 -39888
21721c9888Q949L4373P236N7755r859n2048j0966M0794r0321m7171k7069n0454
$$ -39888 -30939 3434 10670 68425 58566 6518 -4448 36346 -53975 -101146 -128215 -178669
21709a78669M9045K3154n2640p924J15900N5296n2934o653K0703K4882N2559r2984
$$ -178669 -129624 -106470 -159110 -167034 -51134 4162 -48772 -55425 -34722 -9840 42719 -50265
21697e0265K335J12156n411O0392N8577j39433q0243N2090O4509L2246n64R123
$$ -50265 -47930 64226 58815 119207 177784 38351 -41892 10198 74707 106953 106389 115512
21685A15512j941j8825J0616P2213p1226m1605K3339n2426J08662k0442n6927
$$ 115512 113571 94746 105362 177575 106349 64744 88083 35657 144319 123877 66950
21674F6950p9920K7394M3207r2427j13034l4400O8661L807M5655N8013J1921p026
$$ 66950 -12970 14424 57631 -34796 -147830 -182230 -113569 -109762 -64107 -6094 5827 -1199
21662a199k9327K2828m5456q2245j5719R6981J5551j45406O837K6833J14958P5359
$$ -1199 -30526 -7698 -53154 -135399 -151118 -54137 -38586 -183992 -177155 -150322 -35364 39995
21650C9995L7763M544R485l7624N777M0498j2135K9229j6901q8019r7959n4014
$$ 39995 77758 82302 91787 54163 59940 100438 88303 117532 100631 12612 -85347 -139361
21638a39361O2576N9036L0085j3306k4175m0462j9053J6004K0237l7930k3776
$$ -139361 -76785 -17749 12336 -970 -25145 -65607 -84660 -68656 -48419 -86349 -110125
21627a10125j4582J75095R0931L290j16659n2951M6680R4979j5905k6940j06155
$$ -110125 -124707 50388 141319 144609 27950 -25001 21679 116658 100753 73813 -32342
21616c2342J4609j6763k5655l1087L1374Q8717M6536R528m8146j4849R1634K8096
$$ -32342 -17733 -34496 -60151 -91238 -59864 28853 75389 84917 36771 21922 113556 141652
21604A41652q4519n9839K2056j02804m9310O9142P7355Q3521o1981j1336n7881
$$ 141652 57133 -2706 19350 -83454 -132764 -63622 13733 97254 35273 23937 -33944
21593c3944N1681P8003J20094J1484l7303j53780l3506o5730m46J48020k2797
$$ -33944 17737 95740 215834 227318 190015 36235 2729 -63001 -63447 84573 61776
21582F1776j9394j4156K6219N7131M9708K2918j7255K1801j3442n1657m0023m4024
$$ 61776 42382 28226 54445 111576 161284 184202 166947 188748 175306 123649 83626 39602
21570C9602K6464k4924m657P1183j088l2017n0638o3975O426R690Q0652J17104
$$ 39602 66066 41142 36485 107668 106580 74563 23925 -40050 -33624 -23934 56718 173822
21558A73822P4859M7909p1717Q9104j26148o0419L7304n3499j6842l0858q2102
$$ 173822 248681 296590 224873 313977 187829 127410 164714 111215 94373 63515 -18587
21547a8587P9975R2477R21K4972N2557k4215j21049q5437K7990P6040N574J7606
$$ -18587 61388 153865 154786 179758 232315 208100 87051 1614 29604 105644 111218 128824
21535A28824O876p0288n6042n9180M755R2528Q6183J3132m2416q0236K1204J08124
$$ 128824 135700 65412 9370 -49810 -45055 47473 133656 146788 104372 24136 45340 153464
21523A53464K5707l4024Q148k8551m6155j3050r9697o442l5512M7075O3099J66117
$$ 153464 179171 145147 153295 124744 78589 65539 -34158 -40600 -76112 -29037 34062 200179
21511B00179k514l9501q7302l6657j9936p4760l7119M911m0274J21259M8921J8981
$$ 200179 197665 158164 70862 34205 14269 -60491 -97610 -92699 -132973 -11714 37207 56188
21499E6188o489M2997N6115K5345K3552J6388n4583j06684J2725N4330k149N3074
$$ 56188 49699 92696 148811 174156 197708 214096 159513 52829 65554 119884 117735 170809
21487A70809Q8509o3628p0494l0805l0961j19970J14354L5231L6056N6967K5143
$$ 170809 259318 195690 125196 94391 63430 -56540 57814 93045 129101 186068 211211
21476B11211j9206m2750N3004j1487N5693Q740K1168P6191J21985K6702p1420
$$ 211211 192005 149255 202259 190772 246465 255205 276373 352564 474549 501251 429831
21465D29831N3908K00249J41860Q1028P2555o5570j85879j45155p9193o9612o5014
$$ 429831 483739 683988 825848 906876 979431 913861 727982 582827 503634 434022 369008
21454C69008j392k0503k247K8900M5227O3177J6077j3491P8620J93110J19350
$$ 369008 367616 347113 344866 373766 418993 482170 498247 484756 563376 756486 875836
21443H75836K17141M7890p6029r6971j19235m7759p4805o2745j04627p7756J0969
$$ 875836 1092977 1140867 1064838 967867 848632 800873 726068 663323 558696 480940 491909
21432D91909J15958j5496j39258o7754P1294O8127M0799j21809j36637r5505K118
$$ 491909 607867 592371 453113 385359 456653 524780 565579 443770 307133 211628 213746
21421B13746N6767N8343K4282J26557Q6125n6007j51861j05544J1768J43453K13768
$$ 213746 270513 328856 353138 479695 565820 509813 357952 252408 264176 407629 621397
21410F21397J52771l3842m7146o3023k4264Q4132N1229j26326j47471M8154P6171
$$ 621397 774168 740326 693180 630157 605893 690025 741254 614928 467457 515611 591782
21399E91782q04l5962j900O0615r666n6558J309J7378L1650R870M4997N032J2258
$$ 591782 590978 555016 553116 613731 604065 547507 548816 566194 597844 607714 652711 657743 670001
21386F70001n9126P1040M6403L0282j3639L5604J15102k5111j48359k4921Q2921
$$ 670001 610875 681915 728318 758600 744961 780565 895667 870556 722197 697276 780197
21375G80197J9439N5730J02883O4302n5131J4844M3106N8892o9375m1457l3268
$$ 780197 799636 855366 958249 1022551 967420 982264 1025370 1084262 1014887 973430 940162
21364I40162o9506J25303J26131J59259N4506r5099j6603j1482Q1568J37970N5372
$$ 940162 870656 995959 1122090 1281349 1335855 1240756 1224153 1212671 1294239 1432209 1487581
21353A487581M2863J71083J77229K1758m7093Q4334K00182J68891J1633K1389
$$ 1487581 1530444 1701527 1878756 1900514 1853421 1937755 2137937 2306828 2318461 2339850
21343B339850o3280l6007j3798K8526R2960J63161K11048J59262L08887L40279
$$ 2339850 2276570 2240563 2226765 2255291 2348251 2511412 2722460 2881722 3190609 3530888
21333C530888K88473K17831K31521J99054K18820J81008J49732O1436J20337J66656
$$ 3530888 3819361 4037192 4268713 4467767 4686587 4867595 5017327 5078763 5199100 5365756
21323E365756K38673L41061N16035O51584O99879Q02387R91485J119338J317590
$$ 5365756 5604429 5945490 6461525 7113109 7812988 8615375 9606860 10726198 12043788
21314A2043788J734635K165118K573039L270306M282757N499119O943951Q784096
$$ 12043788 13778423 15943541 18516580 21786886 26069643 31568762 38512713 47296809
21306D7296809J1264841J4363529J7041935J8359388J6473899J0124267R82254
$$ 47296809 58561650 72925179 89967114 108326502 124800401 134924668 135906922
21299A35906922p863174j3802512j6104593j5854901j4168242j1787302r414660
$$ 135906922 128043748 114241236 98136643 82281742 68113500 56326198 46911538
21292D6911538p394141n806781m637404l623406k783732k196831j924027j565589
$$ 46911538 39517397 33710616 29073212 25449806 22666074 20469243 18545216 16979627
21284A6979627j289126j109533p82923p69087o21706m96660m31298l83548k57241
$$ 16979627 15690501 14580968 13798045 13028958 12407252 11910592 11479294 11095746 10838505
21275A0838505j88103j85733j25310r3650p55j26509k88739k11378j99662k31619
$$ 10838505 10650402 10464669 10339359 10245709 10244954 10118445 9829706 9618328 9418666 9187047
21265I187047l16861k30467k60475k97270k77184k88788k67771k40476l03268
$$ 9187047 8870186 8639719 8379244 8081974 7804790 7516002 7248231 7007755 6704487
21256F704487j44193k28309k76038k69824l12027l99283l53232j90304k03095
$$ 6704487 6560294 6331985 6055947 5786123 5474096 5074813 4721581 4531277 4328182
21247D328182k79369k66935m7607j19105k40336j97543k44648j80424j73881o9909
$$ 4328182 4048813 3781878 3734271 3615166 3374830 3177287 2932639 2752215 2578334 2508425
21237B508425q5703o2150r5817j30630r9714o1523r9109j71773q2707P6377l6322
$$ 2508425 2422722 2360572 2264755 2134125 2034411 1972888 1873779 1702006 1619299 1695676 1659354
21226A659354j05022l7724m9824j26490j81270j41118P5529J13026l7556j17615
$$ 1659354 1554332 1516608 1466784 1340294 1159024 1017906 1093435 1206461 1168905 1051290
21216A051290j6939j29308q7659M4130K9266m4902J7979j6006p3551P9979n2892
$$ 1051290 1034351 905043 817384 861514 890780 845878 863857 847851 774300 854279 801387
21205H01387q1018L3548N6325q0998j0431J5072k5204q2051m3125L5734l4738
$$ 801387 720369 753917 810242 729244 718813 733885 708681 626630 583505 619239 584501
21194E84501j53380j0774Q0364R862L9543J977N56N6800L4854m8625N862N7198
$$ 584501 431121 420347 500711 510573 550116 552093 552649 609449 644303 595678 601540 658738
21182F58738N0808N2861M985r3742o4114j4160M2797l8750l4977K6431j10830
$$ 658738 709546 762407 767392 673650 609536 595376 638173 599423 564446 590877 480047
21171D80047j32626n0001M7062n745L3441j4098P1332k6027j17053o7548k6523
$$ 480047 347421 297420 344482 338737 372178 358080 429412 403385 286332 218784 192261
21160A92261Q593o1619q418n612J08730o663p9480J8080m723O0116O1121n7443
$$ 192261 200854 139235 130817 125205 233935 227272 147792 165872 161149 221265 282386 224943
21148B24943J9616Q2486Q0626m0690p6535M8127M3520L0208j6141P2214J28854
$$ 224943 244559 327045 407671 366981 290446 338573 382093 412301 396160 468374 597228
21137E97228L8329L7452L3069M1156k6708j91648j84888L0192j2583m3852j8258
$$ 597228 635557 673009 706078 747234 720526 528878 343990 374182 361599 317747 299489
21126B99489O3885J5070J2002L2059j2619p4111q7823Q3251J2486M2700Q7712
$$ 299489 363374 378444 390446 422505 409886 335775 247952 331203 343689 386389 474101
21115D74101j35684j39839k6360O7769N1377m9284K3328m8415P0803L1000J6300
$$ 474101 338417 198578 172218 239987 291364 242080 265408 216993 287796 318796 335096
21104C35096k1235k3350K3067k7902j04224j1492l9685j01951J5368N1992O2145
$$ 335096 313861 290511 313578 285676 181452 169960 130275 28324 43692 95684 157829
21093A57829j252L233P8859q0430Q0049O9991j6572k5163p5930J2265Q0980J04712
$$ 157829 156577 159810 238669 158239 238288 308279 291707 266544 190614 202879 283859 388571
21081C88571m7041k5353M9149l9662j01175o4087K5916o208o0314k6490m0566
$$ 388571 341530 316177 365326 325664 224489 160402 186318 180110 119796 93306 52740
21070E2740O6290Q7351Q3665l1098p2221O700J24139J20629l1132K5152m7974
$$ 52740 119030 206381 290046 258948 186727 193427 317566 438195 407063 432215 384241
21059C84241n2821n5410j02157o0565j3003L4557N96O458R6691m5354n3400q6381
$$ 384241 331420 276010 173853 113288 100285 134842 135438 141896 238587 193233 139833 53452
21047E3452J01106K7701n5349M0368J4373j07012k4329j1539l6444N2017N7051
$$ 53452 154558 182259 126910 167278 181651 74639 50310 38771 2327 54344 111395
21036A11395k5546p148K0361N035L6039L7879M0268J5811n3419o9760q365N5440
$$ 111395 85849 78701 99062 104097 140136 178015 218283 234094 180675 110915 102550 157990
21024A57990M25Q3718L9448O4514Q9948o8701R294k9041K1723k653P0143J04329
$$ 157990 158415 242133 281581 346095 436043 367342 376636 347595 369318 366665 436808 541137
21012E41137K7354k2093n610j4048P7730o0075m8507O369r6546j1985N1695j5269
$$ 541137 568491 546398 540788 526740 604470 544395 495888 502257 405711 393726 445421 430152
21000D30152j7809k7618K5746L586n2325J7623Q0229P1120q7372o6694k9971M7809
$$ 430152 412343 384725 410471 414057 361732 379355 459584 530704 443332 376638 346667 394476
20988C94476J485j086J1276l7418M305J2917o33K7533O0805R9280Q9188J6347
$$ 394476 395961 394875 406151 368733 373038 385955 385322 412855 473660 572940 662128 678475
20976F78475q2134n5130M4332L9880J8442R9818R8838J38157K8557K5663j19028
$$ 678475 596341 541211 585543 625423 643865 743683 842521 980678 1009235 1034898 915870
20965I15870Q8951P8062p2917p7899J8781R4194Q3328J1488q685J4925l5723N7675
$$ 915870 1004821 1082883 1009966 932067 950848 1045042 1128370 1139858 1131173 1146098 1110375 1168050
20953A168050L8768N6024p486O6488K5969l2751J9858Q2373k9736j8880L5704
$$ 1168050 1206818 1262842 1255356 1321844 1347813 1315062 1334920 1417293 1387557 1368677 1404381
20942A404381J1217Q8105O7582k7418m4301J7110m5708J00765Q5392R6161J09541
$$ 1404381 1415598 1503703 1571285 1543867 1499566 1516676 1470968 1571733 1657125 1753286 1862827
20931A862827N5513K3499J73475J77590J06360L2424Q9104J35851J77210J15347
$$ 1862827 1918340 1941839 2115314 2292904 2399264 2431688 2520792 2656643 2833853 2949200
20921B949200J66512J69297K04664K94292M17891O59870O30186L11109J06014
$$ 2949200 3115712 3285009 3489673 3783965 4201856 4861726 5491912 5803021 5909035
20912E909035J25887J48403J37076L38895M53551M80694N55573O03252N88984
$$ 5909035 6034922 6183325 6320401 6659296 7112847 7593541 8149114 8752366 9341350
20903I341350Q57815P96553P90337P15255P98058J038232J431751J801804K371646
$$ 9341350 10199165 10995718 11786055 12501310 13299368 14337600 15769351 17571155 19942801
20894A9942801L249040M173735N282885O902270R113836J2350845J6741035K3209838
$$ 19942801 23191841 27365576 32648461 39550731 48664567 61015412 77756447 100966285
20886A00966285L3050907M7399541O3822629P0723906N0414731L748073l9032078
$$ 100966285 134017192 181416733 245239362 315963268 366377999 370126072 331093994
20879C31093994n5923627n4678753m8364636l8831510k8350223k0188695j4800853
$$ 331093994 275170367 220491614 172126978 133295468 104945245 84756550 69955697
20872F9955697j1165684q399936o565634m882848l590326k834506k202543j685798
$$ 69955697 58790013 50390077 43824443 38941595 35351269 32516763 30314220 28628422
20864B8628422j272270j059125o86545n72058n75165p51237r06894r55417p84826
$$ 28628422 27356152 26297027 25610482 25038424 24463259 23712022 22805128 21849711 21064885
20855B1064885p96894p47500n40888k91413j57725l6435J07530J2467p5330l04100
$$ 21064885 20267991 19520491 18979603 18688190 18530465 18494030 18601560 18614027 18538697 18234597
20845A8234597m59797o81916p88269p66211q04119q21605p92410p58348n70238
$$ 18234597 17774800 17092884 16304615 15538404 14734285 13912680 13120270 12361922 11791684
20836A1791684o22954o14252o14521n97891n19930l93451l97231l38504k87387
$$ 11791684 11168730 10554478 9939957 9342066 8822136 8428685 8031454 7692950 7405563
20827G405563l44082m10663l19994l05600l57411l07171j74174k63011k52638
$$ 7405563 7061481 6650818 6330824 6025224 5667813 5360642 5186468 4923457 4670819
20818D670819k01794k68593k28082j25892j26410k21123k08689j13720j55057
$$ 4670819 4469025 4200432 3972350 3846458 3720048 3498925 3290236 3176516 3021459
20809C021459r6664j89442j04160K7824n7903j86530j55102j05556j14362q2406
$$ 3021459 2924795 2735353 2631193 2659017 2601114 2414584 2259482 2153926 2039564 1957158
20799A957158n6100m1354q8637k1460j64323o2802j47893j30355K2092R22j1294
$$ 1957158 1901058 1859704 1771067 1749607 1585284 1522482 1374589 1244234 1266326 1267248 1255954
20788A255954P8151j11228p0370M6380p7794o1083j23677j17439q5740j17015
$$ 1255954 1334105 1222877 1152507 1198887 1121093 1060010 936333 818894 733154 616139
20778F16139r741M7187o3161r371K13659J13295m9341q1063R97m8454j21974M012
$$ 616139 606398 653585 590424 581053 794712 908007 858666 777603 778600 730146 608172 612184
20766F12184Q3590n9891K7794J30738P1796O5026J4970N9431N2926j9090k9577
$$ 612184 695774 635883 663677 794415 866211 931237 946207 1005638 1058564 1039474 1009897
20755A009897j32216j21717l4278j22286J0940o3165r7064j09466k4554m0970
$$ 1009897 877681 755964 721686 599400 610340 547175 450111 340645 316091 275121
20745B75121k5463L188P3489M7899j5098k7755j00679M3668P010j4312k123J9742
$$ 275121 249658 252846 326335 374234 359136 331381 230702 274370 281380 267068 264945 284687
20733B84687k3062r2301O3719Q3703R541k0184l271O2518l1805N009m3105K5063
$$ 284687 261625 169324 233043 316746 326287 306103 302832 365350 333545 338554 295449 320512
20721C20512l1851n9425j0441Q745N5563Q7399K9456n297j8694q1641O999l5479
$$ 320512 288661 229236 218795 227540 283103 370502 399958 394661 375967 294326 301325 265846
20709B65846L3367M3852o3762Q7700K4908o3477q994O2329J31245O2302j08696
$$ 265846 299213 343065 279303 367003 391911 328434 319440 381769 513014 575316 466620
20698D66620j11714J2294J18585M3031j24244n4240N7863M2176O1437P2526n5415
$$ 466620 354906 367200 485785 528816 404572 350332 408195 450371 511808 584334 528919
20687E28919o4811m7657k0170N9441o6974j2443q6442q2864p9936J306J73167
$$ 528919 464108 416451 396281 455722 388748 376305 289863 206999 127063 128369 301536
20676C01536Q8517L2487m2034k2204k7839j02673j3135J19685l1732m0207k2573
$$ 301536 390053 422540 380506 358302 330463 227790 214655 334340 302608 262401 239828
20665B39828J6380r235L4040J1292N8788m5593K1466N6101l665o1141m585P2678
$$ 239828 256208 246973 281013 292305 351093 305500 326966 383067 379402 318261 313676 386354
20653C86354R9763Q5261j2567n0461Q2829J40786n6652k5870K9693n0434r0630
$$ 386354 486117 571378 558811 508350 591179 731965 675313 649443 679136 628702 538072
20642E38072j08065j0086j21503r9690j0091N1688L722n9599O3265L1792k6290
$$ 538072 430007 419921 298418 198728 188637 240325 244047 184448 247713 279505 253215
20631B53215j11442j12519k9736K0466K6307K3263K7885L1835o1154j7784J7767
$$ 253215 141773 29254 -482 19984 46291 69554 97439 129274 68120 50336 68103
20620F8103l5906l174Q0522P1285L4634j5164j56211k21309o0696R8539K4290
$$ 68103 32197 29023 109545 180830 215464 200300 44089 -177220 -237916 -139377 -115087
20609a15087n4025J8426J43324L7060j7072o6944l5574O1850J7415L2576Q772
$$ -115087 -169112 -150686 -7362 29698 12626 -54318 -89892 -28042 -10627 21949 30721
20598C0721j7056n7564l385N9965M7794M252j7152p8275J0495m6128j29707l4453
$$ 30721 13665 -43899 -47284 12681 60475 64727 47575 -30700 -20205 -66333 -196040 -230493
20586b30493J23709N6607J6931j1667m0688K6834L492O5893N6755L679l3099l5261
$$ -230493 -106784 -50177 -33246 -44913 -85601 -58767 -55275 10618 67373 71052 37953 2692
20574B692k3719k4509O6077J22257j3368j11996J1918M9892n2549o2108P0627
$$ 2692 -21027 -45536 20541 142798 129430 17434 29352 79244 26695 -35413 35214
20563C5214L6749o1016n0883O8934N0997l1174m176n0097n4030j08756O0702r2085
$$ 35214 71963 10947 -39936 28998 79995 48821 44645 -5452 -59482 -168238 -107536 -199621
20551a99621q9068O4357O1594K521o9047O3551J46133M8574j7998J9376o3902
$$ -199621 -288689 -224332 -162738 -160217 -229264 -165713 -19580 28994 10996 30372 -33530
20540c3530O0780R5118l5522r0183J9742k1607l8865p0530Q245N3308o1026K4817
$$ -33530 27250 122368 86846 -3337 16405 -5202 -44067 -114597 -106352 -53044 -114070 -89253
20528h9253K4211N5361m8401k3374j4919R8342j4831m7138m7525J7564L7901k1273
$$ -89253 -65042 -9681 -58082 -81456 -96375 1967 -12864 -60002 -107527 -89963 -52062 -73335
20516g3335l3156M5920K9973J1306m2202M5801p9379M509K1619R4357j9483p8712
$$ -73335 -106491 -60571 -30598 -19292 -61494 -15693 -95072 -90563 -68944 25413 5930 -72782
20504g2782m3711j037N7681L7066l5885J3300jN3927l1230l3510M9635Q2050M0952
$$ -72782 -116493 -117530 -59849 -22783 -58668 -45368 -45369 8558 -22672 -56182 -6547 75503 116455
20491A16455j38190l8865o241L112L5831m5820k60L5694l7697J0948N48j30862
$$ 116455 -21735 -60600 -66841 -63729 -27898 -73718 -73978 -38284 -75981 -65033 -64485 -195347
20479a95347q2620M2629R0510L1880J08048N095o2739J4791O8591L7683L2247
$$ -195347 -277967 -235338 -144828 -112948 -4900 195 -62544 -47753 20838 58521 90768
20468I0768k7171j56949M1312J07387L6541J7594k0403q0549p6719M4774Q641
$$ 90768 63597 -93352 -52040 55347 91888 109482 89079 8530 -68189 -23415 -14774
20457a4774n3676n3865J11033j969L2809n3458j01020N4251j0960l2147K0528
$$ -14774 -68450 -122315 -11282 -13251 19558 -33900 -134920 -80669 -91629 -123776 -103248
20446a03248L4977M1994P7317p4679K61O3262p8204P3553R2924O0929N924n2950
$$ -103248 -68271 -26277 51040 -23639 -23378 39884 -38320 35233 128157 189086 195010 142060
20434A42060j4986j6028j11251p5534K3051r068k3971p4477k4158K8423O5938
$$ 142060 127074 111046 -205 -75739 -52688 -61756 -85727 -160204 -184362 -155939 -90001
20423i0001j2345M3487P9453J1255J4584J777L2928j08784l2272L9438M64j61546
$$ -90001 -102346 -58859 20594 31849 46433 48210 81138 -27646 -59918 -20480 -20016 -181562
20411a81562q9797N6048J5563m1374M2494J13473L8529m5783M2688l3147p3530
$$ -181562 -271359 -215311 -199748 -241122 -198628 -85155 -46626 -92409 -49721 -82868 -156398
20400a56398Q4842j0482k0956j2091O408k0586J8242J127R0383O0341j36349p1997
$$ -156398 -71556 -82038 -102994 -115085 -108677 -129263 -111021 -109894 -19511 40830 -95519 -167516
20388a67516M1168j9182Q7872J3506l2606L0075O2671K7483p4128p1386p4224
$$ -167516 -126348 -145530 -57658 -44152 -76758 -46683 15988 43471 -30657 -102043 -176267
20377a76267K4374Q3228m5979K5883j3766L5650J33429O0020Q887k0508m901m9185
$$ -176267 -151893 -68665 -114644 -88761 -102527 -66877 66552 126572 135459 114951 110050 60865
20365F0865q3801m6760Q8510N3270q917o1294J8178K6537r0916j03294J82098
$$ 60865 -22936 -69696 18814 72084 63167 1873 20051 46588 -44328 -147622 34476
20354C4476L6898m8793o9240p2073J05805J13756n1231l1240r8298j22977k3698
$$ 34476 71374 22581 -46659 -118732 -12927 100829 49598 18358 -79940 -202917 -226615
20343b26615K4556P6679J23066k4585n3286P0180Q1484k1646m2601j2586o7859
$$ -226615 -202059 -125380 -2314 -26899 -80185 -10005 71479 49833 7232 -5354 -73213
20332g3213J6058J37880o7387n0872m193o446l6011Q8922P7414K0714O7729l9100
$$ -73213 -57155 80725 13338 -37534 -41727 -48173 -84184 4738 82152 102866 170595 131495
20320A31495M6743L5691O7771J79894J99143J14879J35567Q7523j02109k08236
$$ 131495 178238 213929 281700 461594 660737 775616 911183 998706 896597 688361
20310F88361k40911j33053n9107O8582q5819M572P1947o6603R080J04315j2851
$$ 688361 447450 314397 255290 323872 238053 242625 314572 247969 257049 361364 348513
20299C48513J442L9949R1565J21362J68996J06921p2818j91217j62404j11996
$$ 348513 349955 389904 481469 602831 771827 878748 805930 614713 452309 340313
20289C40313n2570j37864L2866J0675P3174n7830n3336l4793n6650N6217N0639
$$ 340313 287743 149879 182745 193420 266594 208764 155428 120635 63985 120202 170841
20278A70841P1259o7500l7740J0283l2117q9446o6430K1795K3031J30286M0300
$$ 170841 242100 174600 136860 147143 115026 25580 -40850 -19055 3976 134262 174562
20267A74562r5073n2815O9131M2l9016J2683N9956j8172M0350J9485j06676L9632
$$ 174562 79489 26674 95805 95847 56831 69514 129470 111298 151648 171133 64457 104089
20255A04089J455j8614j12432m9305n4617m146m903j22374j198J06817M6008m7930
$$ 104089 105544 86930 -25502 -74807 -129424 -133570 -138473 -260847 -262045 -155228 -109220 -157150
20243a57150K482N2431q404J6507J293l1113k0974J4104L5874M1968N3573p963
$$ -157150 -154668 -102237 -110641 -94134 -92841 -123954 -144928 -130824 -94950 -52982 591 -7372
20231g372L9022M4986j3074n2507l7127j06247o36J30815O3720o9757O9694M0214
$$ -7372 31650 76636 63562 11055 -26072 -132319 -132955 -2140 61580 -8177 61517 101731
20219A01731j48488q3375J5755p6936m0223J35410J3185m7479J2215o711O8874
$$ 101731 -46757 -130132 -114377 -191313 -231536 -96126 -82941 -130420 -118205 -124916 -56042
20208e6042R6411Q3338l1450r4631q3687J8362O8522p5959m0946p4999k8026M0929
$$ -56042 40369 123707 92257 -2374 -86061 -67699 823 -75136 -116082 -191081 -219107 -178178
20196a78178P1354K2825p9815l075L5091k5474L0333L6244l8247L4810l4115Q145
$$ -178178 -106824 -83999 -163814 -166889 -131798 -157272 -126939 -90695 -128942 -94132 -128247 -120102
20184a20102j1966k7305R2185j6650n8891O0828K3521q4010N0671O0808m7458
$$ -120102 -132068 -159373 -67188 -83838 -142729 -81901 -58380 -142390 -91719 -30911 -78369
20173g8369N9394Q5314k2487j26288j6291o758O4964m1696l321R9185j2270P263
$$ -78369 -18975 66339 43852 -82436 -98727 -105485 -40521 -82217 -85538 13647 1377 8640
20161H640n9278k1172l006N9536J7852J44500o8744j64724q4035N8502O1680L824
$$ 8640 -50638 -71810 -74816 -15280 2572 147072 78328 -86396 -170431 -111929 -50249 -46425
20149d6425k9063k5836R8762K9413l7417N1906m9372l3397k381M2451L7187m4985
$$ -46425 -75488 -101324 -2562 26851 -10566 41340 -8032 -41429 -43810 -1359 35828 -9157
20137i157Q345k9907O409M4033k9544k815o8773j68293O492J3538L6006M7414
$$ -9157 -812 -30719 -24310 19723 -9821 -12636 -81409 -249702 -243210 -229672 -193666 -146252
20125a46252J1526J33554L4083j57824n5243P3149m4932o5522J07289Q6357m7141
$$ -146252 -134726 -1172 32911 -124913 -180156 -107007 -151939 -217461 -110172 -23815 -70956
20114g0956O3291Q6797n9916n5513M9301k8061j05598O0911J02777k0870k9254
$$ -70956 -7665 79132 19216 -36297 13004 -15057 -120655 -59744 43033 22163 -7091
20103g091M1894k0435M8662L4223j14147K9190o758j09279n2544K5823N5724J08201
$$ -7091 34803 14368 63030 97253 -16894 12296 5538 -103741 -156285 -130462 -74738 33463
20091C3463l3283m1240p8380q9019K3745P1514J7601j9275j2946L5567r258J47685
$$ 33463 180 -41060 -119440 -208459 -184714 -113200 -95599 -114874 -127820 -92253 -101511 46174
20079D6174M5707L8747n0544p5852p0223p6568J9818m6669l6063O0634k96k3919
$$ 46174 91881 130628 80084 4232 -65991 -142559 -122741 -169410 -205473 -144839 -145135 -169054
20067a69054J6221j1055M9964l5459r780n001o6515O6662Q1067R4094M9846o3326
$$ -169054 -152833 -163888 -113924 -149383 -159163 -164164 -230679 -164017 -82950 11144 60990 -2336
20055b336j01205k7086n7584n1269N1533R2320R1378M8323P2640k8779j5552J8930
$$ -2336 -103541 -130627 -188211 -239480 -187947 -95627 -4249 44074 116714 87935 72383 91313
20043I1313K221p335l4621l8866q5037r5572o4611O2167J18493j8549o6963M9518
$$ 91313 93534 86199 51578 12712 -72325 -167897 -232508 -170341 -51848 -70397 -137360 -87842
20031h7842N3793j6251M1819R124m6251q4503J9408j1012J10886J72151j07841
$$ -87842 -34049 -50300 -8481 643 -45608 -130111 -110703 -121715 -10829 161322 53481
20020E3481r2396O0898n3957n200j8281m8610l0152n7383L2050M5014k3885J17670
$$ 53481 -38915 21983 -31974 -37174 -55455 -104065 -134217 -191600 -159550 -114536 -138421 -20751
20008b0751R078J5310L149j2870n3936p9029p0102J60326J254K975m2951J6356
$$ -20751 -11673 3637 6786 -6084 -60020 -139049 -209151 -48825 -47571 -44596 -87547 -71191
19996g1191k7267r405m6004J5158m464N9388J16648K1240j9091j03326o8158o5874
$$ -71191 -98458 -107863 -153867 -138709 -143173 -83785 32863 54103 35012 -68314 -136472 -202346
19984b02346j3240L5414l1454n8219Q9974Q6272O5942L7701k2413j62949o589
$$ -202346 -215586 -180172 -211626 -269845 -179871 -93599 -27657 10044 -12369 -175318 -181907
19973a81907J01586R0292Q1019N6949L0247j32515r7593n6591l1910l9168K0148
$$ -181907 -80321 9971 90990 147939 178186 45671 -51922 -108513 -140423 -179591 -159443
19962a59443Q1277K0046K5687O7093L2875m4382j54187N0052J40532M194n4083
$$ -159443 -78166 -58120 -32433 34660 67535 23153 -131034 -80982 59550 63744 9661
19951I661k30L318k6760j1147m081o3521p3888n109J21517K3096o7483J8545J45537
$$ 9661 9431 12749 -14011 -25158 -29239 -92760 -166648 -171757 -50240 -27144 -94627 -76082 69455
19938F9455N3325l1844J859J8465o974j00639r5519J1850j931R506n661k572n756
$$ 69455 122780 90936 92795 111260 104286 3647 -91872 -80022 -81953 -72447 -78108 -80680 -86436
19925h6436J18506J03931o7759n5250o4138M2486O8293L3586k228n0055j31077
$$ -86436 32070 136001 68242 12992 -51146 -8660 59633 93219 90991 40936 -90141
19914i0141p3538M6335Q0081l7372j1981J0505o2556L381L8281K2115p8527L6712
$$ -90141 -163679 -117344 -37263 -74635 -86616 -76111 -138667 -135286 -97005 -74890 -153417 -116705
19902a16705J09281J49498J24381p893J334L638q482p2351q9562j9044N1559R7989
$$ -116705 -7424 142074 266455 258562 259896 263534 255052 182701 93139 74095 125654 223643
19890B23643J22049p0326m7946n6479M3588j1382M7065N8383P841q9967n1584
$$ 223643 345692 275366 227420 170941 214529 203147 250212 308595 316436 226469 174885
19879A74885n3713o4702k461K8849J2825l5451k2726m5245Q5033J20388L5937
$$ 174885 121172 56470 54009 82858 95683 60232 37506 -7739 77294 197682 233619
19868B33619l3926n6711q7762n1485k960l295O8053J14339R7896q2555M866Q1157
$$ 233619 199693 142982 55220 3735 775 -2520 65533 179872 277768 195213 200079 281236
19856B81236m6440m3170J7226k1296L1319R5149m9439o8317k1189J2665O6703
$$ 281236 234796 191626 208852 187556 218875 314024 264585 196268 175079 187744 254447
19845B54447J11056N7339n346J0174l2099P4534r8616o7047N3312N2453l4211
$$ 254447 365503 422842 417496 427670 395571 470105 371489 304442 357754 410207 375996
19834C75996l5195J6559l8483p4018l4834o5686j06763K3349O0439j750j20051
$$ 375996 340801 357360 318877 244859 210025 144339 37576 60925 121364 119614 -437
19823d37o0345N0090R901k1518k8419m6752O3491N3469l925l0875K3206J24535
$$ -437 -60782 -10692 -791 -22309 -50728 -97480 -33989 19480 15555 -15320 7886 132421
19811A32421j3093o8467n8452n6726M8496N812J407N1333K7987m7242p2280P0349
$$ 132421 119328 50861 -7591 -64317 -15821 -10009 -8602 42731 70718 23476 -48804 21545
19799B1545M2479r3903o7623k638n0177O5668j6242J611Q6812l6621N4761K2630
$$ 21545 64024 -29879 -97502 -100140 -150317 -84649 -100891 -99280 -12468 -49089 5672 28302
19787B8302m8101l160r046N1399J35971J4227o1649L072r3931q2560P8425l718
$$ 28302 -19799 -22959 -32005 19394 155365 169592 107943 111015 17084 -65476 12949 9231
19775I231j09825k2073J52941N9245n9118j09043j25870O3360O4724m4709p2007
$$ 9231 -100594 -122667 30274 89519 30401 -78642 -204512 -141152 -76428 -121137 -193144
19764a93144l8008R1178J1538k3535K7535R0544R7416r2419k77983L3216J33538
$$ -193144 -231152 -139974 -128436 -151971 -124436 -33892 63524 -28895 -306878 -273662 -140124
19753a40124J04456L8856n8894r6957K9798Q3732J06434L645n4480k7174L8901
$$ -140124 -35668 3188 -55706 -152663 -122865 -39133 67301 70946 16466 -10708 28193
19742B8193K4521m5773k5038j4296r7785M535M9704j2685j4286j0825l1761q2258
$$ 28193 52714 6941 -18097 -32393 -130178 -125643 -75939 -88624 -102910 -113735 -145496 -227754
19730b27754N5607p643o3267O6647J5037R592O6021M5536k8449K3905l7542p0767
$$ -227754 -172147 -179790 -243057 -176410 -161373 -151781 -85760 -40224 -68673 -44768 -82310 -153077
19718a53077q7697J34984O4685r0737L4670j6145M7579R0213j4364o7287L8981
$$ -153077 -240774 -105790 -41105 -131842 -97172 -113317 -65738 24475 10111 -57176 -18195
19707a8195L7517O584J0133n4750p1719o3766j9882J620O9075q947p827K9251
$$ -18195 19322 25906 36039 -18711 -90430 -154196 -174078 -172458 -103383 -112330 -120157 -90906
19695i0906P2803J20359Q0184L701m2515L333j02492q7516n2007l5065M0130R4398
$$ -90906 -18103 102256 182440 186141 143626 146959 44467 -43049 -95056 -130121 -89991 4407
19683D407O16l0370J5458N47N011o1830N5884J14958K1953J7312l0839m6801P855
$$ 4407 5023 -25347 -9889 -9342 -4331 -66161 -10277 104681 126634 143946 113107 66306 74161
19670G4161n8589q056j5396M2189o398L8048L8277j03206p8740J4375R0349L014
$$ 74161 15572 7516 -7880 34309 27911 65959 104236 1030 -77710 -63335 27014 30028
19658C0028j6505p068J2494O653o7730J4809O0640J03489O788K6929p2463p7167
$$ 30028 13523 6455 18949 25602 -42128 -27319 33321 136810 143598 170527 98064 20897
19646B0897j7665k7066n8542L9259O5890J0486l3669M5659M3389P2050M2029r579
$$ 20897 3232 -23834 -82376 -43117 22773 33259 -410 45249 88638 160688 202717 193138
19634A93138K3213J59051J3681m5904l8014p9937l9035N9120L2925j20039j23466
$$ 193138 216351 375402 389083 343179 305165 225228 186193 245313 278238 158199 34733
19623C4733o3177M010q8119l5873N8038P986J03024R2738L5281j6259N3311l6055
$$ 34733 -28444 -24434 -112553 -148426 -90388 -82402 20622 113360 148641 132382 185693 149638
19611A49638j08477k4011k1544N2014j7429k850q3062Q5431j5102n411J08702
$$ 149638 41161 17150 -4394 47620 30191 27341 -55721 29710 14608 9197 117899
19600A17899N9017m7347R6324K0196m0963Q396m8334l7892p7237J1038j3763k5707
$$ 117899 176916 129569 225893 246089 205126 213522 165188 127296 50059 61097 47334 21627
19588B1627k380J9906j6189L1177J144Q6674L2804J26637O6298n0997q6550l7444
$$ 21627 19247 39153 22964 54141 55285 141959 174763 301400 367698 316701 230151 192707
19576A92707N5544l7654j5543k3737l8541k347M318r012L4697j0759J5852J1179
$$ 192707 248251 210597 195054 171317 132776 130429 134747 125735 160432 149673 165525 176704
19564A76704o9087p8172j3050r936M15Q1536N0094j10564J7079R2709J35892k2346
$$ 176704 107617 29445 16395 6459 6874 88410 138504 27940 45019 137728 273620 251274
19552B51274j07735J406J676o4221O2129k6257L549r8389O6491n505k8378j2463
$$ 251274 143539 144945 146621 82400 144529 118272 121821 23432 89923 84418 56040 43577
19540D3577l4430L2621P8023K2673J000l6682r6384p7239M1506l7684m3107J42043
$$ 43577 9147 41768 119791 142464 143464 106782 10398 -66841 -25335 -63019 -106126 35917
19528C5917O7182j65437q2448K0584n4781q1574Q4394J40782n0685k4749M1087
$$ 35917 103099 -62338 -144786 -124202 -178983 -260557 -176163 -35381 -86066 -110815 -69728
19517f9728N1371L1535J02269K2259M0471j8051n8861j2231O5126R2995l5872
$$ -69728 -18357 13178 115447 137706 178177 160126 101265 89034 154160 247155 211283
19506B11283j03048j7119n9369m0024J8814l7787j68717P8980J94231Q3787m4675
$$ 211283 108235 91116 31747 -8277 10537 -27250 -195967 -116987 77244 161031 116356
19495A16356l8608M873L9039J3839k0872o8584q1895k9214L6662L5809N2253M0032
$$ 116356 77748 82621 121660 135499 114627 46043 -35852 -65066 -28404 7405 59658 99690
19483I9690M0015L2978j7014L5056m1364p09Q016M3244J1110L3787p589L9962
$$ 99690 139705 172683 155669 190725 149361 148652 156668 199912 211022 244809 237220 277182
19471B77182l0514l0150L2668j1332P8586K4931q4264n5286J4860O7697j885J09914
$$ 277182 246668 216518 249186 237854 316440 341371 257107 201821 216681 284378 282493 392407
19459C92407J00933O0494L0313K0588K8979l88K0161n1185m3426O2986j4940k2280
$$ 392407 493340 553834 584147 604735 633714 633326 653487 602302 558876 621862 606922 584642
19447E84642M1265J5118j695J1482q3524k8498N5163k1934n1302J8293j6138J1895
$$ 584642 625907 641025 639330 650812 567288 538790 593953 572019 520717 539010 522872 534767
19435E34767o6569K0196K18080M8686L6238O7531K731j57507j6756Q7637J23824
$$ 534767 468198 488394 706474 755160 791398 858929 861660 704153 687397 775034 898858
19424H98858K5429N9959J21704J35737J09091J76165J48900R6458O9894J67828
$$ 898858 924287 984246 1105950 1241687 1350778 1526943 1675843 1772301 1842195 2010023
19414B010023K68008K82342K55687L15217L00318K03195J82056J80051J71349
$$ 2010023 2278031 2560373 2816060 3131277 3431595 3634790 3816846 3996897 4168246
19405D168246J32919K52588L78842O53314P03917R39770J263597J645775J969619
$$ 4168246 4301165 4553753 4932595 5585909 6289826 7229596 8493193 10138968 12108587
19396A2108587K857206L305958K398774J026175K49955Q55581K015815L842874
$$ 12108587 14965793 18271751 20670525 21696700 21946655 22802236 24818051 28660925
19388B8660925O723517J0840140J6459250K1969949K1390845J0578201j479974
$$ 28660925 35384442 46224582 62683832 84653781 106044626 116622827 115142853
19381A15142853m221326m713976r799768j4049453j3075785r923829o729476l129687
$$ 115142853 110921527 106207551 96407783 82358330 69282545 59358716 52629240 49499553
19373D9499553K78469K037205N13413l384382n881063o024248n440619m678917
$$ 49499553 49778022 51815227 52328640 48944258 43063195 37038947 31598328 26919411
19365B6919411l752413k759096j895001j227356q53089n34547l21929l39818q3534
$$ 26919411 23166998 20407902 18512901 17285545 16432456 15897909 15575980 15236162 15152628
19356A5152628j8197o0612o0799N0521K35386N59217Q56427J418286K105739K884897
$$ 15152628 15134431 15073819 15013020 15063541 15298927 15858144 16714571 18132857 20238596 23123493
19346B3123493M159088N824191P447849P939228N545111J013253k011293k002054
$$ 23123493 27282581 33106772 40554621 48493849 54038960 55052213 53040920 51038866
19338E1038866j59594K815131P105501J2733951J7996226J9703088J7220447J5512194
$$ 51038866 50879272 53694403 60799904 73533855 91530081 111233169 128453616 143965810
19330A43965810J4210036K684457j5875237k4575873k2427254j9052156j5111090
$$ 143965810 158175846 160860303 144985066 120409193 97981939 78929783 63818693
19323F3818693j0271080o107042k931174j102672j231237l005562m304791m040728
$$ 63818693 53547613 47440571 44509397 43406725 42175488 39169926 34865135 30824407
19315C0824407l521072l033438k474315j849577j225771p54581l21842j07775
$$ 30824407 27303335 24269897 21795582 19946005 18720234 17965653 17643811 17536036
19307A7536036k81147m75679n19656n06644p51072p56117q10590p65112n45645
$$ 17536036 17254889 16779210 16259554 15752910 15001838 14245721 13435131 12670019 12124374
19298A2124374m37496j95740j11353j57717k95401m63919l68734m20876n79777
$$ 12124374 11686878 11491138 11379785 11222068 10926667 10462748 10094014 9673138 9093361
19289I093361n88472l79881m31559l51567l12636k71780l10760k10814l14405
$$ 9093361 8504889 8125008 7693449 7341882 7029246 6757466 6446706 6235892 5921487
19280E921487l38504l60618k11161j44457j49775k15868k44330j26369l3375k9606
$$ 5921487 5582983 5222365 5011204 4866747 4716972 4501104 4256774 4130405 4097030 4067424
19270D067424r5971J6902P2130J82276k7863j99921n5749L8871q8809l4227q539
$$ 4067424 3971453 3988355 4060485 4242761 4214898 4014977 3959228 3998099 3909290 3875063 3866524
19259C866524J12070L40968N24898N37212M58196L49509J01723m51696p25656
$$ 3866524 3978594 4319562 4844460 5381672 5839868 6189377 6291100 5839404 5113748
19250E113748o66004p05018m54085k99673k47241k41038j42372j45167j20043
$$ 5113748 4447744 3742726 3288641 2988968 2741727 2500689 2358317 2213150 2093107
19241B093107j17785j53572q7743j87826k30245k6525l3416j5260L4959r0025
$$ 2093107 1975322 1821750 1734007 1546181 1315936 1289411 1255995 1240735 1275694 1185669
19231A185669o7511p483K7868q0060J7649n4396k8408L7348j03077p3047N0309
$$ 1185669 1118158 1110675 1138543 1058483 1076132 1021736 993328 1030676 927599 854552 904861
19220I04861Q5377J47784l2729m3385n5871n9725M3249J19904j1783l874j09935
$$ 904861 990238 1138022 1105293 1061908 1006037 946312 989561 1109465 1097682 1093808 983873
19209I83873L046P5132L3237L2597j36095j52683q4198J2331j5057n8176K2782
$$ 983873 986919 1062051 1095288 1127885 991790 839107 754909 767240 752183 694007 716789
19198G16789j9122R8o8537k2803J37269J40626n9879j8344n5412q1775r6251N780
$$ 716789 697667 697765 629228 606425 743694 884320 824441 806097 750685 668910 572659 578439
19186E78439O089J287l0328L375m0045j7578l6922j6578Q2160m4425r697L0963
$$ 578439 584528 585815 555487 558862 518817 501239 464317 447739 529899 485474 475777 506740
19174E06740K939j02535k4531J7840m1546m1292J725l4346n512k6119n8736o1150
$$ 506740 509679 407144 382613 400453 358907 317615 319340 284994 279482 253363 194627 133477
19162A33477K6770J46588L5736o8383p2206r47M9905J10847P7511j9462j2726
$$ 133477 160247 306835 342571 274188 201982 201035 250940 361787 439298 419836 407110
19151D07110L628J20437J4770K9334o4874n6879J5769J2400j61150l0662m507
$$ 407110 410738 531175 545945 575279 510405 453526 469295 481695 320545 289883 285376
19140B85376O7690K8191l5222K9039l0316Q0277j3786J3607m1804n8003q2825
$$ 285376 353066 381257 346035 375074 344758 425035 411249 424856 383052 325049 242224
19129B42224J15425K1311r8277K1226k3061J8824k047j03389m1846k4390N8517
$$ 242224 357649 378960 280683 301909 278848 297672 295625 192236 150390 126000 184517
19118A84517P0156P4800j69q0410o903K8433N4242J3052m2834l0797j2192l911
$$ 184517 254673 329473 329304 248894 241991 270424 324666 337718 294884 264087 251895 247984
19106B47984j2483r128j17658k0002Q187Q0331r522m7858J666Q4088N3593O6122
$$ 247984 235501 226373 108715 88713 96900 177231 167709 119851 121517 205605 259198 325320
19094C25320K9860p7226p5766o2994l1855L5877J8183J03345K7839r7151l3282
$$ 325320 355180 277954 202188 139194 107339 143216 161399 264744 292583 195432 162150
19083A62150L4210r501J2438L1195m3172J6923N8500J09392O4830M7089k5114
$$ 162150 196360 186859 199297 230492 187320 204243 262743 372135 436965 484054 458940
19072D58940j41397o8130n3784o5828N8859N0627k0465M1213J2890n036k9988
$$ 458940 317543 249413 195629 129801 188660 239287 218822 260035 272925 267889 237901
19061B37901M693N85L0870p5926l0039K3107M2095j4601q8021L3702J9005k7529
$$ 237901 242594 243179 274049 198123 168084 191191 233286 218685 130664 164366 183371 155842
19049A55842O5515K3109n932P7260L0060J2087K5548Q9482J2027m9693n7181n5400
$$ 155842 221357 244466 238534 315794 345854 357941 383489 472971 484998 435305 378124 322724
19037C22724M5725L9180q974J30762J43814Q4596r6078m6546j8466O1000L2572
$$ 322724 368449 407629 398655 529417 673231 757827 661749 615203 596737 657737 690309
19026F90309L7503m5314j0200N0370m8852j6389o6568j9906K888l2589N981J00823
$$ 690309 727812 682498 672298 722668 673816 657427 590859 570953 573841 541252 547233 648056
19014F48056J27539Q1714N3140J27n2561j47592Q4915J96354J22178J04858J97307
$$ 648056 775595 857309 910449 910576 858015 710423 795338 991692 1113870 1218728 1416035
19003A416035M5522o2774Q5788J64014J14239K10178M21732N91011O37221N72545
$$ 1416035 1461557 1398783 1484571 1648585 1762824 1973002 2394734 2985745 3622966 4195511
18993D195511M56229L30019J32345l58089m68732l33022m50277m54715k52416
$$ 4195511 4651740 4981759 5114104 4756015 4287283 3954261 3503984 3049269 2796853
18984B796853p0920J15977O9982k737J6520j8398m2988j29715m580j28327k676
$$ 2796853 2725933 2841910 2911892 2909155 2925675 2907277 2864289 2734574 2729994 2601667 2598991
18973B598991N1365K21858L05346K54214K75341K73180L27325M04400K70457M08066
$$ 2598991 2650356 2872214 3177560 3431774 3707115 3980295 4307620 4712020 4982477 5390543
18963E390543M99515O47026R06671J207407J607327K225874K989742L763273L970284
$$ 5390543 5890058 6537084 7443755 8651162 10258489 12484363 15474105 19237378 23207662
18954B3207662L425398K906566K380190K191545L477289N828524R627908J5015046
$$ 23207662 26633060 29539626 31919816 34111361 37588650 43417174 53045082 68060128
18946F8060128K0322932K1706798J8094754J3226066O611615m682382j2361397
$$ 68060128 88383060 110089858 128184612 141410678 148022293 143339911 130978514
18939A30978514j3694481j5276550j5875652j2886207q459521m648601j465051
$$ 130978514 117284033 102007483 86131831 73245624 64786103 60137502 58672451
18932E8672451k06532q27442k096535l949445n866811o284976n520709m503174
$$ 58672451 58465919 57638477 55541942 51592497 45725686 39440710 33920001 29416827
18924B9416827l571788k722377j962470j402024j059352p70902n61386l41344
$$ 29416827 25845039 23122662 21160192 19758168 18698816 17927914 17366528 17025184
18916A7025184k50462r8552k2325J25320K72831M76372P68396J073241J491034
$$ 17025184 16774722 16676170 16653845 16779165 17051996 17528368 18296764 19370005 20861039
18907B0861039K320007L338939M476565N585218N507799M352192K836043J336734
$$ 20861039 23181046 26519985 30996550 36581768 42089567 46441759 49277802 50614536
18899E0614536O3047O62943L200244O592093R264674J0602755J1341975J2314877
$$ 50614536 50677583 51340526 54540770 61132863 70397537 81000292 92342267 104657144
18891A04657144J0129834L624902k515819o949858j2838729j6593047j4623303
$$ 104657144 114786978 118411880 115896061 108946203 96107474 79514427 64891124
18884F4891124j1374698q688421n829493l386972j996947j657194j809860k143504
$$ 64891124 53516426 44828005 38998512 35611540 33614593 31957399 30147539 28004035
18876B8004035k703676k672582k305758j980978j578604j224383j001547p19932
$$ 28004035 25300359 22627777 20322019 18341041 16762437 15538054 14536507 13816575
18868A3816575o12727m17183m67026l85363k90908l62623m07748l89338l06885
$$ 13816575 13203848 12786665 12319639 11934276 11643368 11280745 10872997 10483659 10176774
18859A0176774l23236k46152j52598j08305j55943n1387j22918k63198l62592
$$ 10176774 9853538 9607386 9454788 9346483 9190540 9139153 9016235 8753037 8390445
18850H390445l49258n51801m31776m44186k78958k54289k74743k13162j45334
$$ 8390445 8041187 7489386 7057610 6613424 6334466 6080177 5805434 5592272 5446938
18841E446938k11830l08950k67063k42484k28598j74669j12562r2487j94889k04826
$$ 5446938 5235108 4926158 4659095 4416611 4188013 4013344 3900782 3808295 3613406 3408580
18831C408580k26954o7873r0553k09529n591N053r2935l9918j67252j31153j03239
$$ 3408580 3181626 3113753 3023200 2813671 2808080 2813133 2720198 2680280 2513028 2381875 2278636
18820B278636j6675J1992N9222N0337l1745r6554o1930r2641j29217r4321j06344
$$ 2278636 2261961 2273953 2333175 2383512 2351767 2255213 2193283 2100642 1971425 1877104 1770760
18809A770760j3001M7380q9741n8975l9556q3094k1629q2543j45433j54721m9723
$$ 1770760 1757759 1805139 1715398 1656423 1616867 1533773 1512144 1429601 1284168 1129447 1079724
18798A079724N9104n3317P0895n9272n7812P769j29114r4500P5455N9120o6691
$$ 1079724 1138828 1085511 1156406 1097134 1039322 1047091 917977 823477 898932 958052 891361
18787H91361K1523K5646r2887O615o3171p9244M8974P1136Q5023j7243k5545m0167
$$ 891361 912884 938530 845643 852258 789087 709843 758817 829953 914976 897733 872188 832021
18775H32021L9869R1878Q9000L9837L5548j7272P3697K72886J59184J48081m6468
$$ 832021 871890 963768 1052768 1092605 1128153 1110881 1184578 1457464 1616648 1764729 1718261
18764A718261k13918q0875j25045j70727j57574J8731J1257k0020q7884q4407
$$ 1718261 1504343 1423468 1298423 1127696 970122 988853 1000110 980090 892206 807799
18754H07799R4547O692j10429p2791R3221l5592L0183M7151j0777r9806l7188
$$ 807799 902346 909038 798609 725818 819039 783447 813630 860781 850004 750198 713010
18743G13010l7523k9247Q2442l44k0438M5816M7975j02662j95318o201Q3482m6719
$$ 713010 675487 646240 728682 728338 707900 753716 801691 699029 503711 497510 580992 534273
18731E34273L9470P7510K8542L7285m9879p0169j7345L0080J3782K198p3378q1401
$$ 534273 573743 651253 679795 717080 667201 597032 579687 609767 623549 625747 552369 470968
18719D70968L1537L8398m9056Q4000K1057J9795M2026j24571L8117L9306l7521
$$ 470968 502505 540903 491847 575847 596904 616699 658725 534154 572271 611577 574056
18708E74056k9834m411O8064K3056j11029l0090L4382l6671L9723L2704r142J9684
$$ 574056 544222 539811 607875 630931 519902 489812 524194 487523 527246 559950 550808 570492
18696E70492L5251m1982p3654K8854o0827k7159P4967n9249m8092k2299J4263
$$ 570492 605743 563761 490107 518961 458134 430975 505942 446693 398601 376302 390565
18685C90565M5508K5174j7908N0590o5175j18570P3623M9430o1792o2933P3756
$$ 390565 436073 461247 443339 493929 428754 310184 383807 433237 371445 308512 382268
18674C82268J8800N8884M5069n9007q9119j745n6876k2467m1952M8707m2137M6115
$$ 382268 401068 459952 505021 446014 356895 355150 298274 275807 233855 282562 240425 286540
18662B86540J36214p7398J0445O8669r018m8274q1086Q330Q8875n1878j3090k5367
$$ 286540 422754 345356 355801 424470 415452 367178 286092 294422 383297 331419 318329 292962
18650B92962k9093P0659q5787o4223J9858P4842J61401k9781q3163j25066O4979
$$ 292962 263869 334528 248741 184518 204376 279218 440619 410838 327675 202609 267588
18639B67588k6369l84M7951K5l8850l3355k4898J08867L6993k0027k297j03781
$$ 267588 241219 240835 288786 288811 249961 216606 191708 300575 337568 317541 315244 211463
18627B11463M6895n8782r7900k2112J39201J01516J3309j60532j9885R2095N7765
$$ 211463 258358 199576 101676 79564 218765 320281 333590 173058 153173 245268 303033
18616C03033p1900L0689K6185K0813r492l1054M9405J00359m9558j04792K6103
$$ 303033 231133 261822 288007 308820 299328 268274 317679 418038 368480 263688 289791
18605B89791M2307p6045L6496N4085N0129m0175j17833l5398l6050m903J2947
$$ 289791 332098 256053 292549 346634 396763 356588 238755 203357 167307 162404 175351
18594A75351J14546p983m2824p4282M6355M3481O4651J13229M3709r4273r7074
$$ 175351 289897 281914 239090 164808 211163 254644 319295 432524 476233 381960 284886
18583B84886M9654r150p1456m4510j0830l299N5835Q5029p1802q6141n3666j28110
$$ 284886 334540 325390 253934 209424 198594 195295 251130 336159 264357 178216 124550 -3560
18571c560J17360K07354L1390l4740j06911l9654l2314N711N7741J23457m2452
$$ -3560 113800 321154 352544 317804 210893 171239 138925 144636 202377 325834 283382
18560B83382n0841r8953l559N7978J5483R7426j750j5807M2446l5680q234q6953
$$ 283382 232541 133588 130029 188007 203490 300916 299166 283359 325805 290125 281891 194938
18548A94938p8561M2085N5594J8851M4448Q6388l0834l2906j0795M7404m8002
$$ 194938 116377 158462 214056 232907 277355 363743 332909 300003 289208 336612 288610
18537B88610r9866l0774Q8908N7185j42901p3752P407Q6472M9329J15069O357
$$ 288610 188744 157970 246878 304063 161162 87410 94817 181289 230618 345687 352044
18526C52044n6551k9432l6962m7427J0022P1916M1123p6794q1680q7013L5093
$$ 352044 295493 266061 229099 181672 191694 263610 304733 227939 146259 59246 94339
18515I4339J20497j0599Q3727j4496j2870N4951p7573p8355O4998N1824K4711
$$ 94339 214836 204237 287964 273468 260598 315549 237976 159621 224619 276443 301154
18504C01154j5468o0289Q0953M3233p6163k8604m3753m5768j0106Q5622q791j9654
$$ 301154 285686 225397 306350 349583 273420 244816 201063 155295 145189 230811 222020 202366
18492B02366J0414j4014p9288P5532L18q799N1037K7222k5658m1500n7657q1576
$$ 202366 212780 198766 119478 195010 195328 186529 237566 264788 239130 197630 139973 58397
18480E8397N8252k2436Q69J9310L2892j11695N6872Q6177r969R4744M6055j00760
$$ 58397 116649 94213 95082 114392 147284 35589 92461 178638 168669 263413 309468 208708
18468B08708K2475O3676k724l4040k0496q2281k8765N5298M7966O325Q8039K633
$$ 208708 231183 294859 292135 258095 237599 155318 126553 181851 229817 236142 324181 326814
18456C26814K2600O2428M1201j01588K942k9679n0464O5146j1219j00232m5278
$$ 326814 349414 411842 453043 351455 354397 324718 274254 339400 328181 227949 182671
18445A82671l4098J0154J68800J4660l7448R1448J08705J16011J08737J18545
$$ 182671 148573 158727 327527 342187 304739 396187 504892 620903 729640 848185
18435H48185k6570p3312r9026k9678j12779L0637R5283O8007N6593R5806K9342
$$ 848185 821615 748303 649277 619599 506820 537457 632740 700747 757340 853146 882488
18424H82488k3355j40570j13306n2349p5287m9687l2115Q480m5750M04j5504j6447
$$ 882488 859133 718563 605257 552908 477621 427934 395819 404299 358549 358953 343449 327002
18412C27002l795L724o1988R4296j8277m9599R8024N723j22616l3065O9538Q5089
$$ 327002 323207 326931 264943 359239 340962 291363 389387 395110 272494 239429 308967 394056
18400C94056j31729n5472M3589k276n268Q8244J70174L7991l9083n657M5129L6072
$$ 394056 262327 206855 250444 248168 242900 331144 501318 539309 500226 494569 539698 575770
18388E75770P2831k2908O7626N8238R441M8570l5348j74356j24335m0852L5640
$$ 575770 648601 625693 693319 751557 760998 809568 774220 599864 475529 434677 470317
18377D70317r074O3640K7188J6781J54486P9748j0240j8103q9719o7664J44268
$$ 470317 461243 524883 552071 568852 723338 803086 792846 774743 685024 617360 761628
18366G61628L3436l8611r7586j50468J7175M011j6723N8713N5360j49418j40047
$$ 761628 795064 756453 658867 508399 525574 529585 512862 571575 626935 477517 337470
18355C37470K1728L5580p4839j02825J9428r1648l2737L7051J3198k6589q7405
$$ 337470 359198 394778 319939 217114 236542 144894 112157 149208 162406 135817 48412
18344D8412M6604J25802R0534N667l6209j870N9113K3382m0196j17503L2529O107
$$ 48412 95016 220818 311352 317019 280810 278940 338053 361435 321239 203736 236265 242372
18332B42372k9277L4893k3707m962K7941k2392l500O7743J3064O1455K204k0331
$$ 242372 213095 247988 224281 219319 247260 224868 221368 289111 302175 363630 365834 345503
18320C45503k3719l4160q2771q3762L0141j203j3353L330K9702l3439N2519J4099
$$ 345503 321784 287624 204853 121091 151232 150029 136676 140006 169708 136269 188788 202887
18308B02887j9635J6332q1410J0768m9685j22454J14345M1969l6699J4371J14479
$$ 202887 183252 199584 118174 128942 79257 -43197 71148 113117 76418 90789 205268
18297B05268p9764J6610j30518p695L1404n6362J388M4570R6585L4136k9476k9847
$$ 205268 125504 142114 11596 3901 35305 -21057 -19669 24901 121486 155622 126146 96299
18285I6299m1573O1918K6282j3754n0580N3432m9631o2925K9265M4760R3468O9456
$$ 96299 54726 116644 142926 129172 78592 132024 82393 19468 48733 93493 186961 256417
18273B56417m4625o0932j1514O1074r4466nN1546K8574m919j17977R848K008o7876
$$ 256417 211792 150860 139346 200420 105954 105949 157495 186069 181150 63173 73021 75029 7153
18260G153L7695j1081k8281m867N394N407P8295R382j0439k808O58J03932m3234
$$ 7153 44848 33767 5486 619 6013 11420 89715 99097 88658 85850 86508 190440 147206
18247A47206r7656k9621n6395k8059J08998N7329M0687j1014M9010N6138P8278
$$ 147206 49550 19929 -36466 -64525 44473 101802 142489 131475 180485 236623 314901
18236C14901K4646m007J003p0174j16019L4678J36747Q5892J7408r2220j48465
$$ 314901 339547 335540 336543 266369 150350 185028 321775 407667 425075 332855 184390
18225A84390j5177P1983N3430j5375q920o85N941j10340j04395k1039L5562m0139
$$ 184390 169213 241196 294626 279251 270331 269646 275587 165247 60852 39813 75375 35236
18213C5236K7295N8393J6088j0661j1753N7052O750M2053J8872Q2140J02048J4380
$$ 35236 62531 120924 137012 126351 114598 171650 178400 220453 239325 321465 423513 437893
18201D37893k0098o1059N9985J15261J0772p983n500k5786n3433m7506O4885j8917
$$ 437893 417795 356736 416721 531982 542754 534771 529271 503485 450052 402546 467431 448514
18189D48514R233L7253p2355J6803P864N5021K1106l0335q1355O5176N0783O2603
$$ 448514 457747 495000 422645 439448 447312 502333 523439 493104 411749 476925 527708 590311
18177E90311j1371K4567N7895p2032j59059K1064j9674p5588l18K29964r720K4336
$$ 590311 578940 603507 661402 589370 430311 451375 431701 356113 355795 585759 576039 600375
18165F00375l6491L2675o850J936k9767L2438k307j4540R0449K9480M4897N0350
$$ 600375 563884 596559 589709 591645 561878 594316 592009 577469 667918 697398 742295 792645
18153G92645j9652j04231L7656O2689J32588O3848j5778L7768K3027M4891l1422
$$ 792645 772993 668762 706418 769107 901695 965543 949765 987533 1010560 1055451 1024029
18142A024029o3805M6039m1732k3520K6771P0945P1867J21310M2147M5888Q8586
$$ 1024029 960224 1006263 964531 941011 967782 1038727 1110594 1231904 1274051 1319939 1408525
18131A408525P3179J20458O8132J07226Q0730J98944K78800L97493M55714N23891
$$ 1408525 1481704 1602162 1670294 1777520 1858250 2057194 2335994 2733487 3189201 3713092
18121C713092N19050P26935J173163J486758J734505K367196L448239N048621
$$ 3713092 4232142 4959077 6132240 7618998 9353503 11720699 15168938 20217559
18113B0217559P189175J0869627J7069993K7244808L7712304L0842315j654388
$$ 20217559 27406734 38276361 55346354 82591162 120303466 151145781 149491393
18106A49491393k7816849k4883209k1439363j9876647j4048785r128418o089401
$$ 149491393 121674544 96791335 75351972 55475325 41426540 32298122 26208721
18099B6208721m438824l264873k475920j990578j529347j150559q83849o73000
$$ 26208721 21769897 18505024 16029104 14038526 12509179 11358620 10474771 9801771
18091I801771m96845n38179m00183l97918m08104k90004k27821p9659k6610p1614
$$ 9801771 9304926 8766747 8366564 7968646 7560542 7270538 7042717 6963058 6936448 6864834
18081F864834j12896r4765J4985M0040l6364m5649M374Q8635J07201Q7146P6786
$$ 6864834 6751938 6657173 6672158 6712198 6675834 6630185 6634559 6723194 6830395 6917541 6994327
18070F994327M0783j8546j86910j05196j03506q0395K7108K1482o4829k87634
$$ 6994327 7035110 7016564 6829654 6724458 6620952 6540557 6567665 6589147 6524318 6236684
18060F236684l16123k24908k73745k58064j60536j66117j29674k93632l19840
$$ 6236684 5920561 5695653 5421908 5163844 5003308 4837191 4707517 4413885 4094045
18051D094045j50549j53991k08142k66524j30096j26851j50051r8251k2400j43731
$$ 4094045 3943496 3789505 3581363 3314839 3184743 3057892 2907841 2809590 2787190 2643459
18041B643459n6709j29193P233M1126N4672p3280j05570q4572r2310j37522j43399
$$ 2643459 2586750 2457557 2464790 2505916 2560588 2487308 2381738 2297166 2204856 2067334 1923935
18030A923935r3921p8938j40102j27382l3854o8521L872j7563j23j18993j31513
$$ 1923935 1830014 1751076 1610974 1483592 1449738 1381217 1385089 1367526 1367403 1248410 1116897
18019A116897j14520o3858J03933J09340o6030p1044p1126o1106P346k6166q8971
$$ 1116897 1002377 938519 1042452 1151792 1085762 1014718 943592 882486 889832 863666 774695
18008G74695m2212l2275L9148M9540J7587J39561R9850j02018N0369K6708j49736
$$ 774695 732483 700208 739356 788896 806483 946044 1045894 943876 994245 1020953 871217
17997H71217p7017J07121L318m2565p9698J3006k4803o6378k4945o3496R7699
$$ 871217 794200 901321 904639 862074 782376 795382 770579 704201 679256 615760 713459
17986G13459M2720j4682J5393j9266n8981p4198l2435m7675j5124J3276k1728
$$ 713459 756179 741497 756890 737624 678643 604445 572010 524335 509211 522487 500759
17975E00759K5898K3729m5156q9315k5266J0632k3197P4318K7677j2683J3698
$$ 500759 526657 550386 505230 415915 390649 401281 378084 452402 480079 467396 481094
17964D81094n5630n3638J42220P4672j04857p1222J2963K2911j0020L7050q6399
$$ 481094 425464 371826 514046 588718 483861 412639 425602 448513 438493 475543 389144
17953C89144N0113K3678M7806M5117r2791J3885M6859k4584j925m3033j6739J20555
$$ 389144 439257 462935 510741 555858 463067 476952 523811 499227 497302 454269 437530 558085
17941E58085n4635m3912R080M4903N9304J9176m7272k0191n3589p2164J07272
$$ 558085 503450 459538 468618 513521 572825 592001 544729 524538 470949 398785 506057
17930E06057q239Q1022K8134j1146O127L2551j3303o584o8421j7879J8251j55480
$$ 506057 497818 578840 606974 595828 601955 634506 621203 614619 546198 528319 546570 391090
17918C91090p0584M7969Q1659J01902J9906l0022q8012J962K8836R490K5097Q8187
$$ 391090 320506 368475 450134 552036 571942 541920 453908 455870 484706 494196 519293 607480
17906F07480k0872q8138N0792r3742O0683J5747M177L7314N652l4284M170p5701
$$ 607480 586608 498470 549262 455520 516203 531950 536127 573441 579093 544809 548979 473278
17894D73278k4668L4239L0627q9878n9941R6328J6759J1237J3658m856m5722j16419
$$ 473278 448610 482849 513476 423598 363657 459985 476744 487981 501639 496783 451061 334642
17882C34642j57708j29588l0056j9017R5337N2833M1055J26111k1176n1177M1386
$$ 334642 176934 47346 17290 -1727 93610 146443 187498 313609 292433 241256 282642
17871B82642K9322l8246j16990J4533N2757P3001O7670M4288Q6980K5863o2027
$$ 282642 311964 273718 156728 171261 224018 297019 364689 408977 495957 521820 459793
17860D59793J7938M5256K5812O4598Q3065L805n8023K0260N9021O610r0161m8443
$$ 459793 477731 522987 548799 613397 696462 700267 642244 662504 721525 728135 637974 589531
17848E89531M7361r244k6361O358l3225k9678l3400J08619Q8097j2772p0205l7565
$$ 589531 636892 627648 601287 607645 574420 544742 511342 619961 708058 695286 625081 587516
17836E87516R9488j8779N7055m9081q9871k2431l2527j26919M2606J26767P9622
$$ 587516 687004 668225 725280 676199 586328 563897 531370 404451 447057 573824 653446
17825F53446q2957j05793r519M3362m3586r9481J4144J03310M3576m0886L1628
$$ 653446 570489 464696 455177 498539 454953 355472 369616 472926 516502 475616 507244
17814E07244Q6765Q9250O5759Q2597J04193K5433p480K732P9575P0893N4001J7943
$$ 507244 594009 683259 749018 831615 935808 961241 953761 956493 1036068 1106961 1160962 1178905
17802A178905N424m7914l3317N0422m0373p0368r6109p529m716O0680L7219r8326
$$ 1178905 1184329 1136415 1103098 1153520 1113147 1042779 946670 939141 934425 995105 1032324 933998
17790I33998J3069o7161o1396j6081M0586M991o1706j38308m2786N63O152n0496
$$ 933998 947067 879906 818510 802429 843015 848006 786300 647992 605206 605769 611921 561425
17778E61425n2756j64116j10202J18759K59606l5687l7750n6993k1877L7076K9867
$$ 561425 508669 344553 234351 353110 612716 577029 539279 482286 460409 497485 527352
17767E27352L228J36932P7249j0287j638q5542r9077K4953K8147P0753O238j1853
$$ 527352 530580 667512 744761 734474 732836 647294 548217 573170 601317 672070 678308 666455
17755F66455j940q1366l0358L6828J0235l5094l7304R5064K2701Q3624o3880J0170
$$ 666455 664515 583149 552791 589619 599854 564760 527456 622520 645221 728845 664965 675135
17743F75135j9010r2063k4730L4296q4084j12164j9l6902j327k7531l9566O205
$$ 675135 656125 564062 539332 573628 489544 377380 377361 340459 339132 311601 272035 278240
17731B78240l1038q7846J19632J9753q6578l0780N1926k7678j1844k184P9125
$$ 278240 247202 159356 278988 298741 212163 181383 233309 205631 193787 191603 270728
17720B70728K7965K4849o1299p8332J2819l5488j9998p2780l9176J82885M5872
$$ 270728 298693 323542 262243 183911 196730 161242 141244 68464 29288 212173 258045
17709B58045p6681m2909k6898q2459O6227P1767j3424L7010L649L295m3727M6785
$$ 258045 181364 138455 111557 29098 95325 167092 153668 190678 194327 197622 153895 200680
17697B00680O6334m5696k9105P1865m5977k8340l6856l3362j218r430J9118M134
$$ 200680 267014 221318 192213 264078 218101 189761 152905 119543 118325 108895 128013 132147
17685A32147Q3397N8580p6879j03009K470p256l5377j024l1678K8373L3893O138
$$ 132147 215544 274124 197245 94236 96706 89450 54073 53049 21371 49744 83637 89775
17673H9775k0252m773m1729M8178N8708K1890n154p0150j44356k1904K07571l5356
$$ 89775 69523 64750 23021 71199 129907 151797 146643 76493 -67863 -89767 117804 82448
17661H2448K659M8004k8477l2185l2185n104R9629N9863q2751j1497r245l3003
$$ 82448 85107 133111 104634 72449 40264 35160 134789 194652 111901 100404 91159 58156
17649E8156J19040k409k3174N3686O5026n6855r9535q2885N5420L3294O38l109
$$ 58156 177196 174787 151613 205299 270325 213470 113935 31050 86470 119764 120402 117293
17637A17293K0748n359L3524N5418L297m503M8511n0993j7628j12560r528K4417
$$ 117293 138041 132682 166206 221624 224921 220418 268929 217936 200308 87748 78220 102637
17625A02637k6194L7046n9861o7668K9739M9293K4889q7251j66309J9002P6514
$$ 102637 76443 113489 53628 -14040 15699 64992 89881 2630 -163679 -144677 -68163
17614f8163Q3164j39809R820O2536O9363j766J7828n3521P7676p5917j03723k4087
$$ -68163 15001 -124808 -114988 -52452 16911 15145 32973 -20548 57128 -18789 -122512 -146599
17602a46599N6152P3243O9019P2724l0927J5602L4622L9768P8215k9696p1124
$$ -146599 -90447 -17204 51815 124539 93612 109214 143836 183604 261819 232123 160999
17591A60999r8937j06365j5393J05124P1355o4697j46831P3805L2276J3485J07791
$$ 160999 62062 -44303 -59696 45428 116783 52086 -94745 -20940 11336 24821 132612
17580A32612K0306J6478j7466p4935p8202j778J35208Q3979J31507R5144m8733
$$ 132612 152918 169396 151930 76995 -1207 -2985 132223 216202 347709 442853 394120
17569C94120p3874r5303j03835n0543k1418J783O4176j0367J5092n7580l7710
$$ 394120 320246 224943 121108 70565 49147 50930 115106 104739 119831 62251 24541
17558B4541K3984n1981k8356m3308K9270J06123N0083n4200r067m0150N6585O6494
$$ 24541 48525 -3456 -31812 -75120 -45850 60273 110356 56156 47089 6939 63524 130018
17546A30018J4832m2972M9782J758L1260k1825p466n6945k01075K949J30081O2198
$$ 130018 144850 101878 151660 153418 184678 162853 155387 98442 -102633 -99684 30397 92595
17534I2595M2302j11232m4976N0089L172j6960k8191L7999j479k6618j3846L8587
$$ 92595 134897 23665 -21311 28778 31950 14990 -13201 24798 23319 -3299 -17145 21442
17522B1442J08970P6624j13002j46606M6850J13173j0409n5649o5578L567K9946
$$ 21442 130412 207036 94034 -52572 -5722 107451 97042 41393 -24185 -20618 9328
17511I328L2272L2558p4q732L8991J7021J31354J04857p8547j44117k7602L0655
$$ 9328 41600 74158 74084 65352 104343 121364 252718 357575 279028 134911 107309 137964
17499A37964m0330l045n2848j19801K188j2249n6093j533R2660L1895M0671N3084
$$ 137964 97634 94589 41741 -78060 -75872 -88121 -144214 -145747 -53087 -21192 19479 72563
17487G2563k1255m3358J3105o539l281r746O4993J4457r702p2294r9847m445r7833
$$ 72563 51308 7950 21055 14516 11235 1489 66482 80939 71237 -1057 -100904 -105349 -203182
17474b03182N84J20558P1405n9691j0045Q1417R0830M5188M3281o2112O1065O5924
$$ -203182 -202598 -82040 -10635 -70326 -80371 1046 91876 137064 180345 118233 179298 245222
17462B45222n0744n1081l6191l5046J9080q2468j20066J35971J02157L507J9068
$$ 245222 194478 143397 107206 72160 91240 8772 -111294 24677 126834 130341 149409
17451A49409Q4905K5986k3749P3115N9033O176q767J14219K28489J93217J03188
$$ 149409 234314 260300 236551 309666 368699 374875 366108 480327 708816 902033 1005221
17440A005221j06956j58648j63917n9302j27240k08306j27343L2l873K7374m1954
$$ 1005221 898265 739617 575700 516398 389158 180852 53509 53541 49668 77042 35088
17429C5088J3492P5195L5514K5100N4493j4384o7668m4326M026j02957n2876K3392
$$ 35088 48580 123775 159289 184389 238882 224498 156830 112504 116530 13573 -39303 -15911
17417a5911k5531O9748l3810K3789R9066n3457m6084K3772K1937k396L9440J6192
$$ -15911 -41442 28306 -5504 18285 117351 63894 17810 41582 63519 61123 100563 116755
17405A16755L8720j6243L9547m478q216m0131o3142j26641R213L6343M4939Q75
$$ 116755 155475 139232 178779 174301 166085 125954 62812 -63829 -54616 -18273 26666 27541
17393B7541K4222L7913J7398L0982M2051m3517j0151k2522j38763m5193J00567
$$ 27541 51763 89676 107074 138056 180107 136590 126439 103917 -34846 -80039 20528
17382B0528J07787R830k8351m4054l5921j05405k5745M2549K5979J26373M6552
$$ 20528 128315 138145 109794 65740 29819 -75586 -101331 -58782 -32803 93570 140122
17371A40122j35665l5315o5282R929R1488J00966K7773p53M402l1762q4473J08278
$$ 140122 4457 -30858 -96140 -86211 5277 106243 134016 133263 137665 105903 21430 129708
17359A29708R5433l2477j35883n1299J9951J50740O9411k0512k522r9252q3699
$$ 129708 225141 192664 56781 5482 25433 176173 245584 225072 222550 123298 39599
17348C9599k6357j04209n3149l9454J17931Q4650P9963R1606k3467j25712j34032
$$ 39599 13242 -90967 -144116 -183570 -65639 19011 98974 190580 167113 41401 -92631
17337i2631j7700L1196N1796m7518J7583J18789p4008l8612m5663N094P6604K3259
$$ -92631 -110331 -79135 -27339 -74857 -57274 61515 -12493 -51105 -96768 -91674 -15070 8189
17325H189r8088N5488J36652j0186k048J1882M8096K1861j11113Q004l1508n4455
$$ 8189 -89899 -34411 102241 92055 90007 101889 149985 171846 60733 68737 37229 -17226
17313a7226J1426L8097j9830J6167j2352J9952l8408Q4730O925j3201o4313j07564
$$ -17226 -5800 32297 12467 28634 16282 36234 -2174 82556 89481 76280 11967 -95597
17301i5597J5075O6293J73905J05646k6556n6732L6935n0286j27639q169P6483
$$ -95597 -80522 -14229 159676 265322 238766 182034 218969 168683 41044 32875 109358
17290A09358K6052L8160O7238O016j5826j04364K34J860R1953J06088Q1797N6271
$$ 109358 135410 173570 240808 246824 230998 126634 126868 128728 220681 326769 408566 464837
17278D64837M1115O5615L9357K4865J4777m7850J37864R0973P1589K3547m5590
$$ 464837 505952 571567 610924 635789 650566 602716 740580 831553 903142 926689 881099
17267H81099q1510j6583M1505o2530j17994j98274n9168j3384k7295l5357K7595
$$ 881099 799589 783006 824511 761981 643987 445713 386545 373161 345866 310509 338104
17256C38104j2236P2280J50116J78318P2583J17916P3178J9414o7152m9663J1657
$$ 338104 325868 398148 548264 726582 799165 917081 990259 1009673 942521 892858 904515
17245I04515N3655n159k0740N5504Q106m1994o1840m6558j00524m6710M1103o8232
$$ 904515 958170 953011 932271 987775 995881 953887 892047 845489 744965 698255 739358 671126
17233F71126q8989j6889R9004K5317j0020o2387r927J47662K363n1019l5765P5718
$$ 671126 582137 565248 664252 689569 679549 617162 607235 754897 757260 706241 670476 746194
17221G46194R344o0934n7717O849q5971j2078o5432j85592q274J38847J6088o0768
$$ 746194 755538 694604 636887 643736 557765 545687 480255 294663 286389 425236 441324 380556
17209C80556P274J2799J5877J6663P6894J13834M1964N3976l0399M3432J74535
$$ 380556 387830 400629 416506 433169 510063 623897 665861 719837 689438 732870 907405
17198I07405n3550l9465K1050j67322r399R5644n7637o8649p0626j04431k9732
$$ 907405 853855 814390 835440 668118 658719 754363 696726 628077 557451 453020 423288
17187D23288r7853j41812q9554L4759P039j7382p9397J1030J16285Q6469j4633
$$ 423288 325435 183623 94069 128828 135867 118485 39088 50118 166403 252872 238239
17176B38239j15493n2326N310R3609l1620p7136M8278l2544O34N4721O5756l6863
$$ 238239 122746 70420 75730 169339 137719 60583 108861 76317 76951 131672 197428 160565
17164A60565l9180l9097O2846o819q3286j7936P724m8924R0090J7228K416L3725
$$ 160565 121385 82288 145134 138315 55029 37093 44817 -4107 85983 103211 105627 139352
17152A39352j5315O6468K5095j46684K900O4773o1900k5186k3117k4051P9031
$$ 139352 124037 190505 215600 68916 71816 136589 74689 49503 26386 2335 81366
17141H1366k5662o4235N4211N0317n8311O019l7184j5110L7484J5069j0055L4069
$$ 81366 55704 -8531 45680 95997 37686 43705 6521 -8589 28895 43964 33909 67978
17129F7978J7289N3475Q257k991o7708m4300J643O0192m2638J6758m4750o8347
$$ 67978 85267 138742 146999 144008 76300 32000 33643 93835 51197 67955 23205 -45142
17117d5142n5763p38R3317P5800M2220P803Q595o0267n6940J35771o5738k3221
$$ -45142 -100905 -101643 -8326 67474 109694 117497 126092 65825 8885 144656 78918 55697
17105E5697L8074l0311k9554k4040l6409j8201Q1128J23844q3354q2806M5696
$$ 55697 93771 63460 33906 9866 -26543 -44744 36384 160228 76874 -5932 39764
17094C9764m0885K1835K0391L4689M744q6341r6375q1476M2598L2639m0027k376
$$ 39764 -1121 20714 41105 75794 80538 -5803 -102178 -183654 -141056 -108417 -148444 -150820
17082a50820J75527P4216j6336o7504o1461k4308M7762J8442K4192N2199J8623
$$ -150820 24707 98923 82587 15083 -46378 -70686 -22924 -4482 19710 71909 90532
17071I0532L211o5479M6340N0393O9286j02952j60118j561J0507Q5394m73q7987
$$ 90532 93743 28264 74604 124997 194283 91331 -68787 -70348 -59841 25553 25080 -62907
17059f2907j069j3515q1848j4225J19308J8804Q822K7255P5491O0571K3720L2943
$$ -62907 -63976 -77491 -159339 -173564 -54256 -35452 -26630 625 76116 136687 160407 193350
17047A93350j22365l8367P4181P3873j7799o825q3084j86421j11411Q3739J06856
$$ 193350 70985 32618 106799 180672 162873 156048 72964 -113457 -224868 -141129 -34273
17036c4273J47948P1068n1615j22123Q264j8035k6093l3543P6509n7305p2936
$$ -34273 113675 184743 133128 11005 19269 1234 -24859 -58402 18107 -39198 -112134
17025a12134O458J50811K3231K6205M895k7691k2963j9840J0648n5167q9715K3947
$$ -112134 -105676 45135 68366 94571 99466 71775 48812 28972 39620 -15547 -105262 -81315
17013h1315J12731m3360M7250K6888o0422l7427M5867j7788r948N6905n3253k0879
$$ -81315 31416 -11944 35306 62194 1772 -35655 10212 -7576 -17524 39381 -13872 -34751
17001c4751K9771O0785P487k6300m5715k6672J1584P4912n4142J22175J12236
$$ -34751 -4980 55805 63292 36992 -8723 -35395 -23811 51101 -3041 119134 231370
16990B31370k9765j40316m3070j2698j7972k8837n6862j5345K1793P1999J14869
$$ 231370 201605 61289 18219 5521 -12451 -41288 -98150 -113495 -91702 -19703 95166
16979I5166j9473q8083p4045R3788P0793J7589K4434r5941M191p076l3271k8171
$$ 95166 75693 -12390 -86435 7353 78146 95735 120169 24228 28419 21343 -11928 -40099
16967d0099Q716R2987j0379r3061O771r470J855J08325o9112j09005J0680j7642
$$ -40099 -31383 61604 51225 -41836 -35065 -44535 -42680 65645 -3467 -112472 -101792 -119434
16955a19434m2723Q2804J01953J6423p0946O8769J11798j033j5697l2013o0366
$$ -119434 -162157 -79353 22600 39023 -31923 36846 148644 147611 131914 99901 39535
16944C9535Q374j35175k6263L6457Q138M8733R0609N104J12149M0558m6052j29020
$$ 39535 47909 -87266 -113529 -77072 -68934 -20201 70408 75512 187661 228219 182167 53147
16932E3147p7218R113Q7838J3409n8285p5255j7854P9099M3473o281Q0576L2929
$$ 53147 -24071 -14958 72880 86289 28004 -47251 -65105 13994 57467 51186 131762 164691
16920A64691l663m2036L2324n8807l8691j87J1600j6619j11522n578L8093K8777
$$ 164691 161028 118992 151316 92509 53818 53631 65231 48612 -62910 -68488 -30395 -1618
16908a618k9538k1505k2050o5722L7840m885r907O3839J029k586p783Q8417Q0268
$$ -1618 -31156 -52661 -74711 -140433 -102593 -107478 -117385 -53546 -52517 -55103 -62886 25531 105799
16895A05799L4805m2677o67K2590L6828m7312n9036m8959j5357K0435M0866o3740
$$ 105799 140604 97927 97260 119850 156678 109366 50330 1371 -13986 6449 47315 -16425
16883a6425m1173n1007o6723L0446M7323n488N4012Q2487P0262l868j01268q3593
$$ -16425 -57598 -108605 -175328 -144882 -97559 -103047 -49035 33452 103714 99846 -1422 -85015
16871h5015l8630K3548J72304L6480L6234N2530K9277j14415M877n0394o6380
$$ -85015 -123645 -100097 72207 108687 144921 197451 226728 112313 117190 66796 416
16860D16L5854Q376K888o8638K7572J15785j4495p0967m4339L8747M428K5325
$$ 416 36270 44646 47534 -21104 6468 122253 107758 36791 -7548 31199 35627 60952
16848F0952j08259p4570P5979L2197L3462j0296Q4966p0113r6256l566m2065j9749
$$ 60952 -47307 -121877 -45898 -13701 19761 9465 94431 24318 -71938 -75504 -117569 -137318
16836a37318P2742O8667j389R9450l1588n9850M7521j3159o0670k7934L0458M5924
$$ -137318 -64576 4091 2702 102152 70564 10714 58235 45076 -15594 -43528 -13070 32854
16824C2854j2080Q7230K0376o9475m5624j1672J2105Q4932O8705m9723j9480k8518
$$ 32854 20774 108004 128380 58905 13281 1609 13714 98646 167351 117628 98148 69630
16812F9630m5126R443n0429j16555j7960L9687N9357L4428p185j6949J7629Q9061
$$ 69630 24504 33947 -16482 -133037 -150997 -111310 -51953 -17525 -24710 -41659 -24030 65031
16800F5031r2362j07440O8757N4019K8641L0733k6022k5347l6464J5809J8990
$$ 65031 -27331 -134771 -66014 -11995 16646 47379 21357 -3990 -40454 -24645 -5655
16789e655m4885M2999J30471M692n8407m1013P6726o712m8968Q3254k9381r0706
$$ -5655 -50540 -7541 122930 127622 69215 28202 104928 98216 49248 132502 103121 12415
16777A2415m2011k9836K0824J56246L3221n414k8414m3079j05211L1967q836k049
$$ 12415 -29596 -59432 -38608 117638 150859 145445 117031 73952 -31259 708 -8128 -10177
16765a0177j9011J4957l4755J2868K3953j64730L4505P9798J3790J14544Q2905
$$ -10177 -29188 -14231 -48986 -36118 -12165 -176895 -142390 -62592 -48802 65742 148647
16754A48647J2944k8895n4907r2503j55743k46J09380K3982j381j1871l8001l4388
$$ 148647 161591 132696 77789 -14714 -170457 -170703 -61323 -37341 -38722 -50593 -88594 -122982
16742a22982O520k644m6293L5419O527O2257p25N0082O8701j6338K9377l400J6940
$$ -122982 -116462 -119106 -165399 -129980 -123453 -61196 -61921 -11839 56862 40524 69901 66501 83441
16729H3441K8970l5494n5586m4110n2343o9978K9132l1743O0277R850j5245M0004
$$ 83441 112411 76917 21331 -22779 -75122 -145100 -115968 -147711 -87434 -77584 -92829 -52825
16717e2825k7219N0247L0642l4037J5214j00062n2117L7133O880P0646P9889m1590
$$ -52825 -80044 -29797 845 -33192 -17978 -118040 -170157 -133024 -126144 -55498 24391 -17199
16705a7199m0991J4657J25665J6640o1301j9980N827N2516r173o0290l0704k2006
$$ -17199 -58190 -43533 82132 98772 37471 17491 23318 75834 66661 6371 -24333 -46339
16693d6339M9047L6778M5701N3652o5608k0280O1927l9904o6847P148M6002L4485
$$ -46339 2708 39486 85187 138839 73231 52951 114878 74974 8127 15275 61277 95762
16681I5762p5976r2530K4409m2018k2881R9404k3347J13220N9281m6m5074L5804
$$ 95762 19786 -72744 -48335 -90353 -113234 -13830 -37177 76043 135324 135278 90204 126008
16669A26008N4133J5494M418l6005j4810n308q6423n015K4520N121J01245k9674
$$ 126008 180141 195635 200053 164048 149238 143930 57507 52492 77012 82133 183378 153704
16657A53704n2861k8632l6822L2407N4852l596m3435J016J9796j3579M8914q570
$$ 153704 100843 72211 35389 67796 122648 119052 75617 76633 96429 82850 131764 123194
16645A23194L2758r937J1041Q5248M0142j5467p3152r0055j33558k0362L2972
$$ 123194 155952 146015 157056 242304 282446 266979 193827 103772 -29786 -50148 -17176
16634a7176o6383k7521J7664R2243J06648N536l458m9859n6592m4224M2470O4789
$$ -17176 -83559 -111080 -93416 -1173 105475 111011 107553 57694 1102 -43122 -652 64137
16622F4137m494M5047K1575L8666N6035N3997K8460r0975q0433N5251j13773o699
$$ 64137 59643 104690 126265 164931 220966 274963 303423 212448 132015 187266 73493 66794
16610F6794n0973p4998q1367O6935J20685P3477m1004j6043k4463R719R676n6334
$$ 66794 15821 -59177 -140544 -73609 47076 120553 79549 63506 39043 48762 58438 2104
16598B104r4121K057J26399N3379n5990j43142p8489J4898R4691J02357K1942
$$ 2104 -92017 -89960 36439 89818 33828 -109314 -187803 -172905 -78214 24143 46085
16587D6085L7655k0442k2183L6779o3562M3319m7329j3001k2894N0452j6133N218
$$ 46085 83740 63298 41115 77894 14332 57651 10322 -2679 -25573 24879 8746 13964
16575A3964Q2438N5431J0969r4416k5586K452p0106N2735r680l113J6388K2969
$$ 13964 96402 151833 162802 68386 42800 45252 -24854 27881 18201 15088 31476 54445
16563E4445l3048Q872l8849k3729o2555O6230M2723k406P2427q6357p4034l156
$$ 54445 21397 30269 -8580 -32309 -94864 -28634 14089 11683 84110 -2247 -76281 -79437
16551g9437P8418p4568k2785o155P2043m7157M1750r122m9164m065O553N3070
$$ -79437 -1019 -75587 -98372 -104527 -32484 -79641 -37891 -47013 -96177 -100242 -93689 -40619
16539d0619M6432J0219J7006j9320j11806j68051L9536p826q8047j6313K01851
$$ -40619 5813 16032 33038 13718 -98088 -266139 -226603 -234429 -322476 -338789 -136938
16528a36938K03154M1007k13709j809K4095j39468o5071J45812R308k0980L6146
$$ -136938 66216 107223 -106486 -108295 -84200 -223668 -288739 -142927 -133619 -154599 -118453
16517a18453R7411J9904P4372j3170r1903n3646l4090j1241M65N8579O0565K5248
$$ -118453 -21042 -1138 73234 60064 -31839 -85485 -119575 -130816 -130351 -71772 -11207 14041
16505A4041o1584L3606Q376K1162j0933j07414L0141L30q5160j0471O1967O5637
$$ 14041 -47543 -13937 -5561 15601 4668 -102746 -72605 -72275 -157435 -167906 -105939 -40302
16493d0302N8659l1136r268O0736P479m5693r8594M6118K5335M7503p944Q1975
$$ -40302 18357 -12779 -22047 38689 46168 475 -98119 -52001 -26666 20837 12893 94868
16481I4868K7020m3533o8710j3577J4272j1337J775o7934J8336j09338k3593J9920
$$ 94868 121888 78355 9645 -3932 10340 -997 778 -67156 -48820 -158158 -181751 -161831
16469a61831Q6706N027O1288m001m7004J0712j365N9588l4578K8782K8462L918
$$ -161831 -75125 -70098 -8810 -12811 -59815 -49103 -50468 9120 -25458 3324 31786 35704
16457C5704o9739J4488J1168O6383J7681r6654K4333j45628l1336M2100n4058
$$ 35704 -34035 -19547 -8379 58004 75685 -20969 3364 -142264 -173600 -131500 -185558
16446a85558l65M2050J09528K0863k2087N0675J1132j05757n2223j9468P5783
$$ -185558 -185923 -143873 -34345 -13482 -35569 15106 26238 -79519 -131742 -151210 -75427
16435g5427N8547r900O3814J02617j909k0110m7670l951q3660K1783J4103p0550
$$ -75427 -16880 -26780 37034 139651 137742 117632 69962 66011 -17649 4134 18237 -52313
16423e2313l6234Q1345J1942m7689K6245K4971J1099L3687p196L0932L3137k2495
$$ -52313 -88547 -7202 4740 -42949 -16704 8267 19366 53053 45857 76789 109926 87431
16411H7431R1302j37726q8650Q1822O9280L2213j57079j3422O1985J1284J0131
$$ 87431 178733 41007 -47643 34179 103459 135672 -21407 -34829 27156 38440 48571
16400D8571J23147L9248j08219K8914P5044o8341l9323K3103J2754k5190K1614
$$ 48571 171718 210966 102747 131661 206705 138364 99041 122144 134898 109708 131322
16389A31322j69837M3370O63q6981q5837q7918J23189J83452R7497k959k474j0117
$$ 131322 -38515 4855 5518 -81463 -167300 -255218 -132029 51423 148920 145961 143487 133370
16377A33370L7906m5994j3515K5894q1360M783Q158j39326K2215k2714K9145K1123
$$ 133370 171276 125282 111767 137661 56301 61084 69242 -70084 -47869 -70583 -41438 -20315
16365b0315N6822L7764J37n4837m0351l2887l0951J14264N3820m8224m2315m4933
$$ -20315 36507 74271 74408 19571 -20780 -53667 -84618 29646 83466 35242 -7073 -52006
16353e2006K3132J0167p9488j16820l670O0814K6691J49286J33942j03536m7419
$$ -52006 -28874 -18707 -98195 -215015 -218685 -157871 -131180 18106 152048 48512 1093
16342A093O0079O526J9543k5597j00881r4046O6671J44474P9053p8349n7787M0796
$$ 1093 61172 67698 87241 61644 -39237 -133283 -66612 77862 156915 78566 20779 61575
16330F1575L3054o3332o5093m4189j3028r385j015j2146M8157M0419P3387m2422
$$ 61575 94629 31297 -33796 -77985 -91013 -100398 -101413 -113559 -65402 -24983 48404 5982
16318E982p8584L4695J49141J61746J5588n6815j51254j37742p3487J0424L2510
$$ 5982 -72602 -37907 111234 272980 288568 231753 80499 -57243 -130730 -120306 -87796
16307h7796p061q561J6096L2982n9896K747Q3444L7146L4791m1018J6244l7185
$$ -87796 -94857 -103418 -87322 -54340 -114236 -111489 -28045 9101 43892 2874 19118 -18067
16295a8067l3748q185K0751R494K0625L0618k2497m5254n2220J4715M6797k5974
$$ -18067 -51815 -60000 -39249 -29755 -9130 21488 -1009 -46263 -98483 -83768 -36971 -62945
16283f2945m377P001l792r771K477P3948n9149M8347L2212O4382j021J7834l6520
$$ -62945 -67322 -60321 -64113 -73884 -71407 2541 -56608 -8261 23951 88333 87312 105146 68626
16270F8626M2708l4104J6930L3203K631j8248j0163J2712M757q2342q8587L4566
$$ 68626 111334 77230 94160 127363 129994 111746 101583 114295 119052 36710 -51877 -17311
16258a7311J5801l6479N5958N3808n3835r8821m8987K4632k6137K5987Q2124Q501
$$ -17311 -1510 -37989 17969 71777 17942 -80879 -129866 -105234 -131371 -105384 -23260 -14759
16246a4759K5999k367o0846O2031J4021k1371q620m1821P6508l1458J5716l6549
$$ -14759 11240 8873 -51973 10058 24079 2708 -5912 -47733 28775 -2683 13033 -23516
16234b3516N2001M3279r9458L8547O8643O1716j0547o0649j2591o3921Q253J24423
$$ -23516 28485 71764 -27694 10853 79496 141212 130665 70016 57425 -6496 1757 126180
16222A26180R2053M3869l6662p6754p0497l0856m5534l9288N251n205l0211P7006
$$ 126180 218233 262102 225440 148686 78189 47333 1799 -37489 -32238 -37443 -67654 9352
16210I352O4540J1667K8335K5363p9476p8427m1476o2989n999K8347Q3427N6168
$$ 9352 73892 85559 113894 139257 59781 -18646 -60122 -123111 -129110 -100763 -17336 38832
16198C8832j7364o4658N839R2049N3854Q396o3291q0028M9831J52884n4910j23798
$$ 38832 21468 -43190 -37351 54698 108552 116948 53657 -26371 23460 176344 121434 -2364
16186b364p1299n1291k14R6987J38725L7717j08209o9272k8088N1579J429l0759
$$ -2364 -73663 -124954 -125168 -28181 110544 148261 40052 -29220 -57308 -5729 -4300 -35059
16174c5059j5239j9733K4614j0599J30555J4631j68j2474j28609n7317l1063k1931
$$ -35059 -50298 -70031 -45417 -56016 74539 89170 89002 76528 -52081 -109398 -140461 -162392
16162a62392N2485n687M131J11206l5008L7348K3684L3521L4758k6355M9948k2225
$$ -162392 -109907 -115594 -111463 -257 -35265 2083 25767 59288 94046 67691 117639 95414
16150I5414j35299q8774l3763M227K8591L9626o1084n5129J4070L1442J64433
$$ 95414 -39885 -128659 -162422 -158195 -129604 -89978 -151062 -206191 -192121 -160679 3754
16139C754P0868k9787n931o3039o8724k439Q1661O7307k0953j39469l9935Q8057
$$ 3754 74622 44835 38904 -24135 -92859 -95298 -13637 53670 32717 -106752 -146687 -58630
16127e8630o103P454j11837n1129O1778N0302L5783J36551R2371p8292q9410Q602
$$ -58630 -64733 -57279 -169116 -220245 -158467 -108165 -72382 64169 156540 78248 -11162 -2560
16115b560K6070j4937j9562L2437K6846M1512m6055j13850M2949N6898Q0583o2320
$$ -2560 23510 8573 -10989 21448 48294 89806 43751 -70099 -27150 29748 110331 48011
16103D8011l6376o7443m1406m917l6256J11103J05949O831j5662N4210k1067m6058
$$ 48011 11635 -55808 -97214 -102131 -138387 -27284 78665 85496 69834 124044 102977 56919
16091E6919m3962M7436o587p9597k0561J3601R9082L1677J6386K6222M2170J363
$$ 56919 12957 60393 53806 -25791 -46352 -32751 66331 98008 114394 140616 182786 184149
16079A84149j26340k3788l7933R242q973m4645o7658l7833M5486P9074M0058l1412
$$ 184149 57809 34021 -3912 5330 -3643 -48288 -115946 -153779 -108293 -29219 10839 -20573
16067b0573l3787n1275J18365M9525Q5622L1142r777j5521r5800K8584N5205R6008
$$ -20573 -54360 -105635 12730 62255 147877 179019 169242 153721 57921 86505 141710 237718
16055B37718o8327j25357k0929q7837o4347J1388L4217K8918K4843k5025J04300
$$ 237718 169391 44034 23105 -64732 -129079 -117691 -83474 -54556 -29713 -54738 49562
16044D9562O3457N2208J0733M4451p7808r6240j31720R553J38987r897o3968k4926
$$ 49562 113019 165227 175960 220411 142603 46363 -85357 -75804 63183 53286 -10682 -35608
16032c5608p9162K1518J48717j2187j10268M7712Q1817n2580n4923J5949J8080
$$ -35608 -114770 -93252 55465 43278 -66990 -19278 62539 9959 -44964 -29015 -10935
16021a0935K6904N952J7276j4832p1219k0121O8250K2083k0471R562m4456l3365
$$ -10935 15969 21921 39197 24365 -46854 -66975 1275 23358 2887 12449 -32007 -65372
16009f5372n3655M8649P1540o056m5339j4397j26332q1577J12723J45980R6775
$$ -65372 -119027 -70378 1162 -4894 -50233 -64630 -190962 -272539 -159816 -13836 82939
15998H2939R1491m1962o5048N7348L5333q0056j4972n604q5941j5315J17407M1646
$$ 82939 174430 132468 67420 124768 160101 80045 65073 59469 -26472 -41787 75620 117266
15986A17266o4147n1584j17071q715o1676K6196K2648J13335J2276n0344m1091
$$ 117266 53119 1535 -115536 -124251 -185927 -159731 -137083 -23748 -11472 -61816 -102907
15975a02907n9118p177L9798P3343n1393o9173J0907P8186J01775L2744o6957
$$ -102907 -162025 -169202 -129404 -56061 -107454 -176627 -165720 -87534 14241 46985 -19972
15964a9972m0515L7076R3499k4876q6736o4786N008Q0588m5093K8742L3585j22712
$$ -19972 -60487 -23411 70088 45212 -41524 -106310 -101302 -20714 -65807 -37065 -3480 -126192
15952a26192r9054K757J21350J27087Q4310K35J4565N9897q4515q9444K2936J0333
$$ -126192 -225246 -222489 -101139 25948 110258 110493 125058 184955 100440 10996 33932 44265
15940D4265n0680m0167J4329k9761M3104n574l0640L6996m2444Q256p614n349
$$ 44265 -6415 -46582 -32253 -62014 -18910 -24484 -55124 -18128 -60572 -52316 -59930 -65279
15928f5279j9074n1368M1599O2093k2675L0259O834J7038p647j0855M7334L0631
$$ -65279 -84353 -135721 -94122 -32029 -54704 -24445 -17611 -573 -8220 -19075 28259 58890
15916E8890J7442j9882J0814n0748O1946M2075r4710j60537j8892M3386O9272
$$ 58890 76332 56450 67264 16516 78462 120537 25827 -134710 -153602 -110216 -40944
15905d0944N9102J3687o4421l3067k7903K0045K0443P2275J26417j5002j29785
$$ -40944 18158 31845 -32576 -65643 -93546 -73501 -53058 19217 145634 130632 847
15894H47j27489J7176R691O3620Q2723L2330n1602o9389j5548m9553L1410M0160
$$ 847 -126642 -109466 -99775 -36155 46568 78898 27296 -42093 -57641 -107194 -75784 -35624
15882c5624J25624M5810j8760j40436q9356L1260K7933n730K1202R8349J15368
$$ -35624 90000 135810 117050 -23386 -112742 -81482 -53549 -59279 -38077 60272 175640
15871A75640n4416n4438L3439p6025m2821o6525Q8041P6843R9404m4522j57458
$$ 175640 121224 66786 100225 24200 -18621 -85146 2895 79738 179142 134620 -22838
15860b2838p3248K8814J21475K3900j27235q2838O8917R3747j07664r981M8513
$$ -22838 -96086 -67272 54203 78103 -49132 -131970 -63053 30694 -76970 -86951 -38438
15849c8438k1134O8069R8774J08869M9315L1776n9594n7279j2098L7779r8542
$$ -38438 -59572 8497 107271 216140 265455 297231 237637 180358 168260 206039 107497
15838A07497m8953M7377l8624M0118o601o8162Q9495N387j06691n2601k134O5387
$$ 107497 58544 105921 67297 107415 100814 32652 122147 127534 20843 -31758 -33892 31495
15826C1495M994o0066n2047m9138j7685J00515J20210q4143k8945K1945J5088
$$ 31495 36489 -23577 -75624 -124762 -142447 -41932 78278 -5865 -34810 -12865 2223
15815B223k3606Q2621J43142j4454j42613j0463R969k8403J6150J1096N4155J764
$$ 2223 -21383 61238 204380 189926 47313 36850 46819 18416 34566 45662 99817 101581
15803A01581o6964N5628k7456q3280J8094Q661P5373K9278m0811o2912l6017N0281
$$ 101581 34617 90245 62789 -20491 -2397 6264 81637 110915 70104 7192 -28825 21456
15791B1456P9266m403m0967M9564j3848l3893K4069k6524q7485k5919P4007n819
$$ 21456 100722 96319 55352 104916 91068 57175 81244 54720 -32765 -58684 15323 9504
15779I504l707j58526J50077N8445Q853n6696Q2902J17364J5636p9376l6427M243
$$ 9504 5797 -152729 -2652 55793 64646 7950 90852 208216 223852 144476 108049 112292
15767A12292q7006l8464L4277J6815P8304o8502j4685j25979l8569N0457N719
$$ 112292 25286 -13178 21099 37914 116218 47716 33031 -92948 -131517 -81060 -75341
15756g5341M6072K1220L0739N1675N0991m4211o4085K2423R3798m7369j38617
$$ -75341 -29269 -8049 22690 74365 125356 81145 17060 39483 133281 85912 -52705
15745e2705l2903J23049N0464j9239m341L0124o1335o7948M5561Q1202j7009R4114
$$ -52705 -85608 37441 87905 68666 64325 94449 33114 -34834 10727 91929 74920 169034
15733A69034O3658j2853j33623J0591L5927k7992p8952q5659P2162J36043m9189
$$ 169034 232692 219839 86216 96807 132734 104742 25790 -59869 12293 148336 99147
15722I9147q0005L7337N0451J985r6051o6755N8222p1127j29107k5519N5518N1295
$$ 99147 19142 56479 106930 108915 12864 -53891 4331 -66796 -195903 -221422 -165904 -114609
15710a14609l8005j2971J3421J6718L2767o7119L7823M8367j6101N073J16847
$$ -114609 -152614 -165585 -152164 -135446 -102679 -169798 -131975 -83608 -99709 -94636 22211
15699B2211P2508j7202l0881m8205Q618J11307L6352p3503J6725M877r6683l1033
$$ 22211 94719 77517 46636 -1569 7049 118356 154708 81205 97930 102807 6124 -24909
15687b4909r0987j2996O4424k5939q46K201j7115l9305o866K86O8240p3911l6266
$$ -24909 -115896 -128892 -64468 -90407 -91253 -89052 -106167 -145472 -152338 -152052 -83812 -157723 -193989
15674a93989P6103J48692m4145m433M2166l3123q2893K1055M6214O3902m0594
$$ -193989 -117886 30806 -13339 -17772 24394 -8729 -91622 -70567 -24353 39549 -1045
15663a045J1399O7399Q7134M1557p6667j27546n8332P5930O128o6377j8319L0140
$$ -1045 10354 77753 164887 206444 129777 2231 -56101 19829 25957 -40420 -58739 -28599
15651b8599J0606J22462L7329k1135o1429M2358l9504j14245j0605N0658q5864
$$ -28599 -17993 104469 141798 120663 59234 101592 62088 -52157 -62762 -12104 -97968
15640i7968o2988P2640J40629K8063J705j27288l2692J27785K7379j7916l7717
$$ -97968 -160956 -88316 52313 80376 82081 -45207 -77899 49886 77265 59349 21632
15629B1632j4909M5689j806M5690N7367J2698o3463L8760o2779n1747Q1091P2397
$$ 21632 6723 52412 50606 96296 153663 166361 102898 141658 78879 27132 108223 180620
15617A80620p3443o1213j26328M2997n84n4185P3674L5050o1890O5164J1426j7006
$$ 180620 107177 45964 -80364 -37367 -37951 -92136 -18462 16588 -45302 19862 31288 14282
15605A4282q955L0942N5037k1936Q3390L1635k8362q6306r9799O644J7210L9244
$$ 14282 5327 36269 91306 69370 152760 184395 156033 69727 -30072 -23428 -6218 33026
15593C3026J6113M8624o6021o5678j03661P6922J00926J2716k8081l6531J3425
$$ 33026 49139 97763 31742 -33936 -137597 -60675 40251 52967 24886 -11645 1780
15582A780l2141l0849o6080q7251L53J14683J18212L9833r8802q0829k4048R5884
$$ 1780 -30361 -61210 -127290 -214541 -214188 -99505 18707 58540 -40262 -121091 -145139 -49255
15570d9255N5427N6575p709p0291P3906N9253j04955l9273n0588j2284L0242k5445
$$ -49255 6172 62747 55038 -15253 58653 117906 12951 -26322 -76910 -89194 -58952 -84397
15558h4397l0975K24p097Q8598M0393n319j5807L4274j1197k581P4513Q5022O0501
$$ -84397 -115372 -115148 -122245 -33647 6746 1427 -14380 19894 8697 6116 80629 165651 226152
15545B26152M6614l5280q4959j12971n4371m937M9181m6024k6575J6902r0154
$$ 226152 272766 237486 152527 39556 -14815 -19752 29429 -16595 -43170 -26268 -116422
15534a16422O8274M9372N066L5407p934O1777J04689l2925j16386l6050j2668
$$ -116422 -48148 1224 6290 41697 33763 95540 200229 167304 50918 14868 2200
15523B200J1686q86k0486j04932k5543K218M6122J54489M9725L1522l493o8667
$$ 2200 13886 13000 -7486 -112418 -137961 -135743 -89621 64868 114593 146115 142622 73955
15511G3955r821J2204m9998P4745p493n1398K8382N2716q695K927K0036l9457
$$ 73955 64134 76338 26340 101085 93592 42194 70576 123292 114597 117524 137560 98103
15499I8103r1807o2670K9677n9670j5985P9254J18440O4392J4210l2645j12089
$$ 98103 6296 -56374 -26697 -86367 -102352 -23098 95342 159734 173944 141299 29210
15488B9210j4876j15897j22724q415J81115N7558L5431N090P032j06842j71451
$$ 29210 14334 -101563 -224287 -232702 -51587 5971 41402 46492 53524 -53318 -224769
$$ [...]
##END NTUPLES=NMR SPECTRUM
##END=
