##TITLE=Analysis number 310101
Compound Code cc 44309
Book Reference 431/115
Project Code adrs
Chemist Name janea
##JCAMPDX= 6.0         $$ Bruker NMR JCAMP-DX V2.0
##DATA TYPE= NMR SPECTRUM
##DATA CLASS= NTUPLES
##ORIGIN= Bruker BioSpin GmbH
##OWNER= NMR
$$ XWIN-NMR		Version 3.5
$$ Mon Jun 13 10:39:04 2005 GMT Daylight Time (UT+1h)  MAYBRIDGE\NMR@NMR_250MHZ
##.OBSERVE FREQUENCY= 250.131544655141
##.OBSERVE NUCLEUS= ^1H
##.ACQUISITION MODE= SIMULTANEOUS (DQD)
##.ACQUISITION SCHEME= undefined
##.AVERAGES= 16
##.DIGITISER RES= 18
##SPECTROMETER/DATA SYSTEM= dpx250
##.PULSE SEQUENCE= zg30
##.SOLVENT NAME= CDCl3
##.SHIFT REFERENCE= (INTERNAL, CDCl3, 0, 16.522)
##AUDIT TRAIL= $$ (NUMBER, WHEN, WHO, WHERE, WHAT)
$$ ##TITLE= Audit trail, XWIN-NMR		Version 3.5
$$ ##JCAMPDX= 5.01
$$ ##ORIGIN= Bruker BioSpin GmbH
$$ ##OWNER= NMR
$$ C:\u/data/dgb/nmr/ADRS/4030/pdata/1/auditp.txt
$$ ##AUDIT TRAIL=  $$ (NUMBER, WHEN, WHO, WHERE, WHAT)
(   1,<2005-06-13 10:38:42.00 +100>,<MAYBRIDGE\NMR>,<NMR_250MHZ>,
      <created by zg, POWCHK disabled, PULCHK disabled
       configuration hash MD5:
       62 19 C7 07 E1 42 D1 B7 37 6C 3D D0 77 39 F9 E6
       data hash MD5: 64K
       B7 48 31 D9 B7 C4 04 03 8A F1 AF 86 63 8C 36 A3>)
(   2,<2005-06-13 10:38:55.13 +100>,<MAYBRIDGE\NMR>,<NMR_250MHZ>,
      <Start of raw data processing
       ef LB = 0.3 FT_mod = 6 PKNL = 1 SI = 32K 
       data hash MD5: 32K
       97 F1 CE E1 DC FC 46 BB 0F 51 FA C7 11 88 A6 01>)
(   3,<2005-06-13 10:38:57.07 +100>,<MAYBRIDGE\NMR>,<NMR_250MHZ>,
      <apk 
       data hash MD5: 32K
       3F 0C 9E 4C EE A5 5C 7D 2A 67 90 CF 75 EC DF AE>)
(   4,<2005-06-13 10:38:57.83 +100>,<MAYBRIDGE\NMR>,<NMR_250MHZ>,
      <abs ABSG = 5 
       data hash MD5: 32K
       20 FA EA ED 44 70 6A 3B 2F 99 05 2C DD 79 9F B0>)
$$ ##END=
$$ 
$$ hash MD5
$$ 25 D8 1F 9A F9 A4 2B B3 08 DC ED B6 B7 57 0B 55
##$RELAX= 
##$RELAX= 
##$RELAX= 
##$RELAX= 
##$RELAX= 
##$RELAX= 
##$RELAX= 
$$ Bruker specific parameters
$$ --------------------------
##$DU= <C:\u>
##$EXPNO= 4030
##$NAME= <ADRS>
##$PROCNO= 1
##$TYPE= <nmr>
##$USER= <dgb>
##$AMP= (0..31)
100 100 100 100 100 100 100 100 100 100 100 100 100 100 100 100 100 100 
100 100 100 100 100 100 100 100 100 100 100 100 100 100 
##$AQSEQ= 0
##$AQ_mod= 3
##$AUNM= <au_zg>
##$AUTOPOS= <6 >
##$BF1= 250.13
##$BF2= 250.13
##$BF3= 250.13
##$BF4= 250.13
##$BF5= 500.13
##$BF6= 500.13
##$BF7= 500.13
##$BF8= 500.13
##$BYTORDA= 1
##$CFDGTYP= 0
##$CFRGTYP= 5
##$CHEMSTR= <none>
##$CNST= (0..31)
1 1 145 1 1 1 1 1 1 1 1 1 1 1 1 1 1 1 1 1 1 1 1 1 1 1 1 1 1 1 1 1 
##$CPDPRG= <>
##$CPDPRG1= <>
##$CPDPRG2= <>
##$CPDPRG3= <>
##$CPDPRG4= <mlev>
##$CPDPRG5= <mlev>
##$CPDPRG6= <mlev>
##$CPDPRG7= <mlev>
##$CPDPRG8= <mlev>
##$CPDPRGB= <>
##$CPDPRGT= <>
##$D= (0..31)
0 1 0 0 0 0 0 0 0 0.06 0 0 0 0 0 0 0.0002 0 0 0 0 0 0 0 0 0 0 0 0 0 0 
0 
##$DATE= 1118655521
##$DBL= (0..7)
120 120 120 120 120 120 120 120 
##$DBP= (0..7)
150 150 150 150 150 150 150 150 
##$DBP07= 0
##$DBPNAM0= <>
##$DBPNAM1= <>
$$ [...]
##$SUBNAM7= <"">
##$SUBNAM8= <"">
##$SUBNAM9= <"">
##$SW= 20.6930455092707
##$SWIBOX= (0..15)
0 0 3 0 0 0 0 0 0 0 0 0 0 0 0 0 
##$SW_h= 5175.983436853
##$TD= 65536
##$TD0= 1
##$TE= 296.16
##$TE2= 300
##$TE3= 300
##$TEG= 300
##$TL= (0..7)
0 120 120 120 120 120 120 120 
##$TP= (0..7)
150 150 150 150 150 150 150 150 
##$TP07= 0
##$TPNAME0= <>
##$TPNAME1= <>
##$TPNAME2= <>
##$TPNAME3= <>
##$TPNAME4= <>
##$TPNAME5= <>
##$TPNAME6= <>
##$TPNAME7= <>
##$TPOAL= (0..7)
0.5 0.5 0.5 0.5 0.5 0.5 0.5 0.5 
##$TPOFFS= (0..7)
0 0 0 0 0 0 0 0 
##$TUNHIN= 0
##$TUNHOUT= 0
##$TUNXOUT= 0
##$USERA1= <user>
##$USERA2= <user>
##$USERA3= <user>
##$USERA4= <user>
##$USERA5= <user>
##$V9= 5
##$VALIST= <valist>
##$VCLIST= <CCCCCCCCCCCCCCC>
##$VD= 0
##$VDLIST= <DDDDDDDDDDDDDDD>
##$VPLIST= <PPPPPPPPPPPPPPP>
##$VTLIST= <TTTTTTTTTTTTTTT>
##$WBST= 1024
##$WBSW= 4
##$XGAIN= (0..3)
0 0 0 0 
##$XL= 0
##$YL= 0
##$YMAX_a= 444939
##$YMIN_a= -339066
##$ZGOPTNS= <>
##$ZL1= 120
##$ZL2= 120
##$ZL3= 120
##$ZL4= 120
##$ABSF1= 16.522
##$ABSF2= -4.171173
##$ABSG= 5
##$ABSL= 3
##$ALPHA= 0
##$AQORDER= 0
##$ASSFAC= 0
##$ASSFACI= 0
##$ASSFACX= 0
##$ASSWID= 0
##$AUNMP= <proc_1d>
##$AZFE= 0.1
##$AZFW= 0.1
##$BCFW= 0
##$BC_mod= 0
##$BYTORDP= 0
##$COROFFS= 0
##$CY= 12.5
##$DATMOD= 1
##$DC= 0
##$DFILT= <>
##$DTYPP= 0
##$F1P= 14.0000005364418
##$F2P= -0.99999901652339
##$FCOR= 0.5
##$FTSIZE= 32768
##$FT_mod= 6
##$GAMMA= 0
##$GB= 0
##$INTBC= 1
##$INTSCL= 1
##$ISEN= 128
##$LB= 0.3
##$LEV0= 0
##$LPBIN= 0
##$MAXI= 10000
##$MC2= 0
##$MEAN= 0
##$ME_mod= 0
##$MI= 0
##$NCOEF= 0
##$NC_proc= -4
##$NLEV= 6
##$NOISF1= 0
##$NOISF2= 0
##$NSP= 0
##$NTH_PI= 0
##$NZP= 0
##$OFFSET= 16.522
##$PC= 1
##$PHC0= -70.94541
##$PHC1= 8.759617
##$PH_mod= 1
##$PKNL= yes
##$PPARMOD= 0
##$PSCAL= 4
##$PSIGN= 0
##$REVERSE= no
##$SF= 250.13
##$SI= 32768
##$SIGF1= 0
##$SIGF2= 0
##$SINO= 400
##$SIOLD= 32768
##$SREGLST= <1H.CDCl3>
##$SSB= 0
##$STSI= 32768
##$STSR= 0
##$SW_p= 5175.98343685301
##$SYMM= 0
##$S_DEV= 0
##$TDeff= 65536
##$TDoff= 0
##$TI= <Analysis number 999999
Compound Code 99
Book Reference 9
Project Code 9>
##$TILT= no
##$TM1= 0
##$TM2= 0
##$TOPLEV= 0
##$USERP1= <user>
##$USERP2= <user>
##$USERP3= <user>
##$USERP4= <user>
##$USERP5= <user>
##$WDW= 1
##$XDIM= 32768
##$YMAX_p= 511791550
##$YMIN_p= -295315
$$ End of Bruker specific parameters
$$ ---------------------------------
##NTUPLES= NMR SPECTRUM
##VAR_NAME=  FREQUENCY,     SPECTRUM/REAL,   SPECTRUM/IMAG
##SYMBOL=    X,             R,               I
##VAR_TYPE=  INDEPENDENT,   DEPENDENT,       DEPENDENT
##VAR_FORM=  AFFN,          ASDF,            ASDF
##VAR_DIM=   32768,         32768,           32768
##UNITS=     HZ,            ARBITRARY UNITS, ARBITRARY UNITS
##FACTOR=    0.157963299565203, 1,           1
##FIRST=     4132.6476996994, 0,             0
##LAST=      -1043.33573715361, 0,           0
##MIN=       -1043.33573715361, -295315,     0
##MAX=       4132.6476996994, 511791550,     0
$$ Real data points
##PAGE= N=1
##DATA TABLE= (X++(R..R)), XYDATA
$$ [...]
26272D3823m2756R06O5898J8968p1563L0083K5842O43l9267n3355j139j054R4958
26259G1987l7633n0447m4214r932N1843N7338p413m4018j2189O9866L7647j19179
26247c6344J4508p173j9157k4649n56k9615L718R5661K131l5890r4155k3289J19252
26234c5558K8953p9880m6763K5822J15326j8483j13296o759N8956K8723R5259
26223E2300l3320n9739J998N385j3232n4171J7480K5997m000M8828K9737n4959
26211c7696n1969J54720M9534j031L46m6356L5078L9026m1663m8221j142q143
26199D2483N6364j5051L1887L4035l2342q3573l5517n445m113k162N7403M5105
26187H9074m643k5750o7125O7640J30069j5086j07329q5514n5208J2833Q0198
$$ plain form
26272 43823 1067 1973 67871 86839 15276 45359 71201 71844 32577 -20778 -21917 -22971 71987
26259 71987 34354 -16093 -60307 -70239 -18396 38942 31529 -12489 -24678 45188 82835 -36344
26247 -36344 -21836 -29009 -48166 -72815 -73371 -102986 -99268 -3607 -1476 -37366 -131521 -154810 -35558
26234 -35558 -6605 -86485 -133248 -107426 7900 -10583 -123879 -130638 -71682 -42959 52300
26223 52300 18980 -40759 -38761 -33376 -46608 -100779 -83299 -57302 -61302 -12474 17263 -37696
26211 -37696 -89665 65055 114589 113558 113904 67548 102626 141652 99989 51768 50626 42483
26199 42483 98847 83796 115683 149718 117376 33803 -1714 -7159 -11272 -13434 43969 89074
26187 89074 84431 58681 -8444 59196 189265 174179 66850 -18664 -73872 -61039 19159
26176A9159K9076K4604j36415m5838K4812j5977j00182j6615M1810Q6336N8627
26165c0603Q9680K7632m5344P544q3379M3266j7401n830P734P99L9222j2468j6090
26152D762j3287j0339k7343j1549p0503L731J72473J40430m481p6158n8201M1558
26140I1093N2179K8749l047l4599r3337o7569p4825p598N2297O7970M0091J4492
26128F5896m8264P15J3959k7177O1648L6460K5257m4273o2329p2921n4863L3005
26116g2887J26536M4180K3625k8517n8069n9091n5754Q7094r616l520J2341j1738
26104e416L2351N3477J4001N8963j50586m6726n4858m697j7030M5578K4925l9840
26092h9858P8249k9772M482L5924N4177L2634K0174p6820r5114k6201K6178P5002
$$ plain form
26176 19159 48235 72839 -63576 -109414 -84602 -100579 -200761 -217376 -175566 -89230 -30603
26165 -30603 59077 86709 41365 48909 -34470 8796 -8605 -14435 -6701 -5902 33320 20852 4762
26152 4762 -8525 -18864 -46207 -57756 -128259 -124528 47945 188375 183894 107736 49535 91093
26140 91093 143272 172021 168974 134375 41038 -26531 -101356 -108954 -56657 11313 51404 65896
26128 65896 17632 18347 32306 5129 66777 103237 128494 84221 21892 -51029 -105892 -72887
26116 -72887 53649 97829 121454 92937 34868 -24223 -79977 7117 -2499 -6019 6322 -5416
26104 -5416 26935 80412 94413 153376 2790 -43936 -98794 -103491 -120521 -74943 -50018 -89858
26092 -89858 -11609 -41381 -36899 -975 53202 85836 106010 29190 -65924 -92125 -65947 9055
26080I055l4058k6990P210L7583n5682o0761P4373O0091k8231M5279M2525o8937
26068A457j1590K0k8180k9453q336L8678O2651K7525k2518j4580O3268L9691r046
26055A09587O3595K600L954n1125p6201p4696m7605M1142k8031J0307j3282n6503
26043a16258O1017J8719j2193m7993O9957Q4091J03j30069j28407J65806J42623
26032A07396N8938K3701m3026q1852M3456n4809n6092R604m3610O694M5179k6252
26020a0673k5252K9892K9456r6598p048K1568K6055J4947N4654K434m619k1040
26008A3776k6512M7784p7266Q959N1993N7918q631K0844k5175l5502K091P2198
25996A02477J7447J1368n1324j33972j7413J0016q6673K9851O9210J5807L4302
$$ plain form
26080 9055 -25003 -51993 -44783 -7200 -62882 -123643 -49270 10821 -17410 27869 70394 1457
26068 1457 -10133 -10113 -38293 -67746 -76082 -37404 25247 52772 30254 15674 78942 118633 109587
26055 109587 173182 175782 179736 128611 52410 -22286 -69891 -28749 -56780 -46473 -59755 -116258
26043 -116258 -55241 -36522 -48715 -96708 -26751 57340 57443 -72626 -201033 -35227 107396
26032 107396 166334 190035 147009 65157 108613 53804 -2288 7316 -36294 -29600 15579 -10673
26020 -10673 -35925 -6033 23423 -73175 -80223 -58655 -32600 -17653 37001 39435 34816 13776
26008 13776 -12736 35048 -42218 -33259 18734 76652 68021 88865 63690 28188 30279 102477
25996 102477 119924 131292 79968 -54004 -71417 -61401 -148074 -118223 -49013 -33206 1096
25985A096K3888o0001M0626k9788Q430K3012N1252n7711n4674J9232J6140j287
25973a9785O559l0957j3584k4327L8816P8006k2367o7420P505j084J7449k8230
25961e9419k5466Q793k6336j7376J9827L8339M1567K4224m833n839J1868O1357
25949F6706j6182L1477p7465j2366K0027o2412l33R8382O6195k8168p2772k9580
25937a6491P236J7906p5736M2417K095M5203o51m7620Q435M737J12960K1273l1559
25924I0205K0818J2889m6337p5946k0487L7677J6686m2055k568N0829l8726k3354
25912b0369l1587o9143k6843k1668J6414P3726M2010j5239L2478J96n3398N54
25900g2869J0295J30510N5659O5653l057n8265j04650m1734J9758O1087n1487
$$ plain form
25985 1096 24984 -35017 5609 -24179 -15749 7263 58515 804 -53870 -34638 -18498 -19785
25973 -19785 -13226 -44183 -57767 -82094 -43278 34728 12361 -55059 -47554 -48638 -31189 -59419
25961 -59419 -84885 -76092 -102428 -119804 -99977 -61638 -20071 4153 -680 -6519 5349 66706
25949 66706 50524 82001 4536 -7830 12197 -50215 -50548 47834 114029 85861 13089 -16491
25937 -16491 -9255 8651 -67085 -24668 -22573 22630 21979 -25641 -17206 -12469 100491 121764 90205
25924 90205 111023 123912 77575 1629 -18858 18819 35505 -6550 -9118 41711 2985 -20369
25912 -20369 -51956 -121099 -147942 -169610 -153196 -79470 -37460 -52699 -20221 -20025 -73423 -72869
25900 -72869 -62574 67936 123595 189248 186191 127926 23276 -18458 1300 62387 10900
25889A0900M719n9658L4095q509M6933J9292r0824k330M1167l807K8475j9740
25877G13p5082k8823O7652K1071p745K8071J6378k0509j7705m931L2685J6638
25865B8413M9696Q0093o2854k9999K0651q710N652l7839r4838M8788m20P0852
25853F9485j5999N4034l6207j08186l0652J1113K7653K7360J7782k2905q1876
25842h8398l3436R9987k4202j7984q498K9889J11964M1596J0499o2212p0315K997
25830h113Q7613L5465n8869j20300o2891m992O974J11964J9073P353K5590k2903
25818A5964K3297l5071K3866p607m7121k546m5835j4169P9184k1619j0686K5893
25806a6450M6546O933r5826K28K5449N6664j4463q6249j8901L7131O057o6222
$$ plain form
25889 10900 15619 -44039 -9944 -18453 28480 47772 -43052 -45382 -4215 -8022 20453 713
25877 713 -74369 -103192 -35540 -14469 -22214 5857 22235 1726 -15979 -20910 11775 28413
25865 28413 78109 158202 95348 65349 86000 77290 82942 45103 -49735 -947 -1367 69485
25853 69485 53486 107520 71313 -36873 -67525 -56412 -28759 -1399 16383 -6522 -88398
25842 -88398 -121834 -21847 -46049 -64033 -72531 -42642 69322 110918 121417 59205 -11110 -8113
25830 -8113 79500 114965 56096 -64204 -127095 -132087 -125113 -13149 5924 13277 38867 15964
25818 15964 39261 4190 28056 20449 -26672 -29218 -75053 -89222 -10038 -31657 -42343 -16450
25806 -16450 30096 37029 -58797 -58569 -33120 23544 9081 -77168 -96069 -58938 -52881 -119103
25794a19103K122Q9735j0227L7932J00549r2993m1496M3997j16388l0830M9387
25783h7315J4536N5165o5469K5272M0900k7650K0806P3025N5908j64620k8953
25772h8395J04406K0415P545j4787O5037M1963J4171n1910J7662j1358n2520J7357
25760F9586J6360O42J4671J3914q1773j5839n322l2408L7782R937K4990K8990
25748H1530k3280m1796P8631j8105k6313j40864j05073m5804N1538m772J1526
25737a82782J08866R4438M5060l2736n0973K5784m9492O145P5884k8714K5451
25726C6931l8250M7326P7763j00301l5906J3353L3795K9599j458n0899L4335l8498
25714G790p6466J445r235K503J3861J7115M9792R1309r686j19190q0625M5361
$$ plain form
25794 -119103 -116981 -27246 -37473 459 101008 8015 -33481 10516 -105872 -136702 -87315
25783 -87315 -72779 -17614 -83083 -57811 -16911 -44561 -23755 49270 105178 -59442 -88395
25772 -88395 16011 36426 43971 29184 94221 136184 150355 98445 116107 104749 52229 69586
25760 69586 85946 86588 101259 115173 33400 17561 12239 -20169 17613 27550 52540 81530
25748 81530 58250 16454 95085 76980 50667 -90197 -195270 -241074 -189536 -194308 -182782
25737 -182782 -73916 20522 65582 32846 -18127 7657 -41835 -35690 40194 11480 36931
25726 36931 -1319 46007 123770 23469 -12437 916 34711 64310 62852 11953 46288 7790
25714 7790 -68676 -67231 -76466 -73963 -60102 -42987 6805 98114 88428 -30762 -111387 -66026
25702f6026J2554k7204n094j0863l5642J8147Q793L2216K9036n5545j7941r511
25690a27080m8357j3329O6343Q8895P8569p307o8476j0237J0234J00787J2070
25679H2112n5204K4677m202m0573R217M6537K2858o2426p8202m1873j9508J8870
25667i7717L756m8302J2024L5711j5434n781J26379J4394L0504k6820J1733l5409
25655E038n6995J4200J5358J0265L637M8518L1024J684L7034L3857K0016n0325
25643A13311n2439l5256k6218l8553L6878J6397K1016q9986M2406O3289o0391
25632i546n7561J276N837j04840k4017Q3858N5605o0113m3907P0638j9365j04593
25620b06728o526p324L5870J75568R4613j7029p0828L4451R0673n3357o8012k7670
$$ plain form
25702 -66026 -53472 -80676 -85770 -96633 -132275 -114128 -105335 -73119 -44083 -99628 -117569 -127080
25690 -127080 -175437 -188766 -122423 -33528 45041 37734 -30742 -40979 -30745 70042 82112
25679 82112 26908 51585 47383 6810 16027 62564 85422 22996 -55206 -97079 -116587 -97717
25667 -97717 -93961 -142263 -130239 -94528 -109962 -115743 10636 25030 55534 28714 40447 5038
25655 5038 -51957 -37757 -22399 -12134 -8497 40021 71045 72729 109763 143620 163636 113311
25643 113311 60872 25616 -602 -39155 -2277 14120 35136 -54850 -12444 50845 -9546
25632 -9546 -67107 -65831 -59994 -164834 -188851 -104993 -49388 -109501 -153408 -82770 -102135 -206728
25620 -206728 -213254 -220578 -184708 -9140 85473 68444 -2384 32067 122740 69383 1371 -26299
25608b6299j9075O2428J29549L3172r7031q7694M7045k5617j7859J0497N0763
25597E9879J5246q5146J0200k4361l0332P2923L4108n4793R402o237l5731J5467
25585a9375L4058j1740k5840R46j3477r170J6433K2562l5530j2647r621P7996
25573A4595n9865j18209K4093O3482K3269K0232L6981P7878Q6082n1224j78882
25562f1568k1507K646K3125j1779L674j1512J15703J40006k4766o1520j8779n1413
25550B2310M8710K4732O3350j8549o3752n0362o8257j950L0118l4015K7407Q7765
25538F7507J1330m9878q1260p9764M2269R1399N3208O0061l879j18214q8017L0335
25526f4903k9173M859j9529r1098k1188N1982R1746J33558k0358q5866k3666J0855
$$ plain form
25608 -26299 -45374 17054 146603 179775 82744 -4950 42095 16478 -1381 9116 59879
25597 59879 75125 -10021 179 -24182 -54514 18409 52517 -2276 7126 889 -34842 -19375
25585 -19375 14683 2943 -22897 -21951 -35428 -44598 -28165 -5603 -41133 -53780 -63401 14595
25573 14595 -45270 -163479 -139386 -75904 -52635 -32403 4578 82456 168538 117314 -61568
25562 -61568 -83075 -80429 -57304 -69083 -65409 -76921 38782 178788 154022 92502 73723 22310
25550 22310 71020 95752 159102 140553 76801 26439 -41818 -43768 -13650 -47665 -20258 67507
25538 67507 78837 28959 -52301 -132065 -89796 1603 54811 114872 110993 -7221 -95238 -64903
25526 -64903 -94076 -89217 -108746 -199844 -221032 -169050 -77304 56254 35896 -49970 -73636 -62781
25514f2781J4979n611j0173J2341J58560J16531q5240k08542m7908k3991J01591
25503d0244J43637j903k0498J9131j1678l0571n9060m7323O6015j4523Q436m715
25491F704r8058q9691O1635J07779R7670K5132n3936o9712k6733k6599j769K2515
25479d5063R8701Q9872k5466o8834r0290m7523O6954R6453J0529J4471k8847r0593
25467a9636K033K5184N0301j7513p1941p2197O9842J0722j7617k1650K2192j6592
25455e6872k7033m7781j2094j9127P0212J16323M7539K2646j364j9079m4063n7408
25443b8101m4473Q1037Q055k5272K6727m4867K2699O8398l3318p1251k6145J17179
25431E0668O2144l5512j8747q2848l8360L3486J1773L1483m2542p1961J3802Q1047
$$ plain form
25514 -62781 -47802 -53413 -63586 -51245 107315 223846 138606 -69936 -117844 -141835 -40244
25503 -40244 103393 101490 80992 100123 88445 57874 -1186 -48509 17506 2983 11419 6704
25491 6704 -91354 -181045 -119410 -11631 86039 111171 57235 -12477 -39210 -65809 -67578 -45063
25479 -45063 53638 143510 118044 49210 -41080 -88603 -21649 74804 85333 99804 70957 -19636
25467 -19636 -17603 7581 57882 40369 -31572 -103769 -33927 -23205 -40822 -62472 -40280 -56872
25455 -56872 -83905 -131686 -143780 -162907 -92695 23628 71167 93813 92449 73370 29307 -28101
25443 -28101 -72574 8463 16518 -8754 17973 -26894 -4195 64203 30885 -40366 -66511 50668
25431 50668 112812 77300 58553 -24295 -62655 -29169 -17396 14087 -28455 -100416 -86614 -5567
25419e567O6319J725r2K8217k9425n3355P7571N0691l3388K2105J5872m9447m3780
25406D7446O4551L7902q7338p6063j0022Q5407N353j10500o8618j845P1873Q4080
25394D2226J0067K9600k4906m9773m5283j4622J1179o6862O3458O0687j7887M5418
25382D3302K3373m7962p3469M4232k5586o0086J11783J2455j45676l5748L7054
25371a16328J2744O6660J09079M6269m225N91l794l6642j26008L048m294L072
25359d9828N0703O6855r9018o7971k9021J1424j4574l546P9031j994m2295k7219
25347a27453M2108N3402L9434n0677L530O34p4691P9490Q7620K7605p7343p5916
25335g2257N5255L1153k6837q617K8729k8305k4727L9357L920m247O2520m9544
$$ plain form
25419 -5567 60752 62477 62385 90602 61177 7822 85393 136084 102696 124801 140673 91226 47446
25406 47446 111997 149899 62561 -13502 -23524 61883 67236 -43264 -111882 -113727 -41854 42226
25394 42226 52293 81893 56987 7214 -38069 -52691 -41512 -108374 -44916 15771 -2116 43302
25382 43302 66675 18713 -54756 -10524 -36110 -96196 15587 28042 -117634 -153382 -116328
25371 -116328 -103584 -36924 72155 118424 114199 114790 110996 74354 -51654 -48606 -52900 -49828
25359 -49828 875 67730 -31288 -99259 -128280 -116856 -131430 -134976 -55945 -57939 -100234 -127453
25347 -127453 -85345 -31943 7491 -43186 -39656 -39022 -113713 -34223 53397 81002 3659 -72257
25335 -72257 -17002 14151 -12686 -21303 7426 -20879 -45606 -6249 -2329 -6576 55944 6400
25323F400j08278J9143P8415M6699o1859r9884m8377J5163Q1603M651k7025m823
25311i8172P9113J2636k6867P005L4759r263J9555R582l6066L2717J9717l8221
25299F495J1195N3030L5302k135k6732n3271L96j6684Q6563M1460o7351j34069
25287f5801J5051l9263l2714J4117K0170J4372P5540K7252k6851M7007R6659J02100
25275B47639J9738n6315j22543p7519K535N6374l2940j2163q4711K6654L2091
25264a160m1688K3947J28030L1155n2648q3577j5795l2755Q759Q036L0499L9002
25252D1805n4172p275N7027Q7386M227m393n8345n5680P630O5552L407m4252l4627
25239H290J8664l273j2234m5133o6470L8516O0991J9200J8970p6157p4426m0651
$$ plain form
25323 6400 -101878 -82735 -4320 42379 -19480 -119364 -167741 -152578 -70975 -66324 -93349 -98172
25311 -98172 -19059 -6423 -33290 -26285 8474 -789 18766 28348 -7718 24999 44716 6495
25299 6495 17690 70720 106022 103887 77155 23884 24280 7596 94159 135619 68268 -65801
25287 -65801 -50750 -90013 -122727 -108610 -88440 -74068 1472 28724 1873 48880 145539 247639
25275 247639 267377 211062 88519 11000 13535 69909 36969 24806 -59905 -33251 -1160
25264 -1160 -42848 -18901 109129 140284 87636 4059 -11736 -44491 -35732 -27696 2803 41805
25252 41805 -12367 -19642 37385 124771 128998 124605 66260 10580 18210 83762 87169 42917 8290
25239 8290 26954 23681 11447 -33686 -100156 -61640 -649 18551 37521 -38636 -113062 -153713
25227a53713Q9267O6176N7118r9379n0138K5533j4410J4829m1399L451N0902K08
25215e1555L0215r617p1155K7132O832k6694l0905P8813L6468j7786o1010k520
25203i1782K8595l520K0861K8887j5408k6231M9607J5254j478M4766l683j5932
25191B9936M6113j7929r0873r065P0333k0973k3224J2148l0111K8799Q4326J788
25179H1268j24178j05339R617P8378m3315p8944j7404J7692L366P4986O1072L5509
25167g292M4099K5195k426O050N5793m3644j9995j9975n2088N7647M9017l3757
25155E8624m7181J2917O1312m8518k2855K4212q34n5729j0185L9936K5474N5542
25143I2715M2623m1525m0854o3859n6694N001J1845K7720P573j640K4150M2418
$$ plain form
25227 -153713 -64446 1730 58848 -40531 -90669 -65136 -79546 -64717 -106116 -102665 -51763 -51555
25215 -51555 -21340 -30957 -102112 -74980 -68148 -94842 -125747 -46934 -10466 -28252 -89262 -91782
25203 -91782 -63187 -66707 -45846 -16959 -32367 -58598 -8991 6263 4785 49551 45868 29936
25191 29936 76049 58120 -32753 -41818 28515 7542 -15682 -3534 -33645 -4846 79480 81268
25179 81268 -42910 -148249 -138632 -60254 -103569 -182513 -199917 -182225 -178859 -103873 -42801 -7292
25167 -7292 36807 62002 59576 65626 121419 77775 57780 37805 -14283 43364 92381 58624
25155 58624 11443 24360 85672 37154 14299 38511 37677 -18052 -28237 11699 37173 92715
25143 92715 135338 93813 52959 -10900 -67594 -62593 -50748 -23028 -15455 -17095 7055 49473
25131D9473K6296l032m3302l8650N8173L5112o0570m0767l4262n4545l7434j2355
25119a55863l6750R1524J65523J02914k2261n6876R344m4233r1095o4012K6062
25108g5723p274Q2539n3241j7296N8174J12113O333q8115k1749m1367M4031J3644
25096A2069k6131k780o7515J6369M3917R523r3984o8086K3756L3218N0662r987
25084g8969n6552R34J3404O3119J5784o0043j3654L7045L7512r711j810k2618
25072g5559M5312M6220J5843j4236J2983j9524r5871k3677k8482M5484M1314K3440
25060b6753J9125O474n8859P658P7046l3860l4666J29006N7465j0112j6404J562
25048A17682N5374m561o6733N07o1609l2557p350N9227N5732J0326k6143n2732
$$ plain form
25131 49473 75769 72737 29435 -9215 48958 84070 23500 -17267 -51529 -106074 -143508 -155863
25119 -155863 -192613 -101089 64434 167348 145087 88211 97555 53322 -37773 -101785 -75723
25108 -75723 -82997 -458 -53699 -70995 -12821 99292 105625 17510 -4239 -45606 -1575 12069
25096 12069 -14062 -16842 -84357 -67988 -24071 -14548 -108532 -176618 -152862 -119644 -68982 -78969
25084 -78969 -135521 -134587 -121183 -58064 -42280 -102323 -115977 -78932 -41420 -51131 -52941 -75559
25072 -75559 -30247 15973 31816 17580 30563 11039 -84832 -108509 -136991 -91507 -50193 -26753
25060 -26753 -7628 -1154 -60013 -52355 24691 -9169 -43835 85171 142636 132524 116120 117682
25048 117682 173056 168495 101762 102269 40660 8103 753 59980 115712 126038 99895 47163
25036D7163n6074l9449J1175J22732j314m1981j46487j8550O6267q078p13o45
25024f5954k9822J9908J02888M2980N1200j6599m9347l7462P1571L9198l6918
25013I1643m0510m8108p892l6446N200R8081N4628K6438j01554p8960O5384O7041
25001I4945L78m223O5207K059j07087j16380k7813P2992J9689N520j0357J2552
24989G482j06747p4936Q1660K8602K9412K3861m611j9026j4380l9075l8876L2878
24977i3756L1776L0396L5266J3182n2157m93L3197k0432K8572P686O8845l2663
24965D9419q7678O5343K6150J8374K1806j9264j5495n3959J4104L2707r600N168
24953D7075o0734O9625P2515J6569k4166o674l7632o4317J3038q5878M9813K6988
$$ plain form
25036 47163 -8911 -48360 -37185 85547 84233 42252 -104235 -122785 -56518 -64596 -65309 -65954
25024 -65954 -95776 -75868 27020 70000 121200 104601 55254 17792 89363 128561 91643
25013 91643 51133 3025 -4867 -41313 -36113 61968 116596 143034 41480 -37480 27904 94945
25001 94945 95323 91100 156307 158366 51279 -65101 -92914 -19922 -233 5287 -5070 7482
24989 7482 -99265 -174201 -92541 -63939 -34527 -10666 -15277 -34303 -48683 -87758 -126634 -93756
24977 -93756 -61980 -31584 3682 16864 -35293 -35786 -2589 -23021 5551 13237 82082 49419
24965 49419 -38259 27084 53234 71608 93414 74150 58655 4696 18800 51507 41907 47075
24953 47075 -13659 55966 128481 145050 120884 114210 76578 12261 25299 -60579 -10766 16222
24941A6222k246l5923j1863K8703n4389p1105J2375o6147M3666L5067J3449M7630
24929d4561M0568Q7961j3216p027n3591j2481L3722L6180j29148N4413K0670n2984
24917c9494l8028J5241k7213M4782R0780j6140J6855R5468K0287p6943r9774n020
24905a9199k2078P21m0762L4600L2941N3841K6133L2523l4114j2762n5735l3726
24893c7617j5909L6365O9989M4665m7337m9989J14037O4205L0141k0729q9732
24882I8089p6230k9305m997K0591l8303J7917J07462q787q4312n7116k2910n430
24870h3331L0528M7175r592n2451Q9094K1620r064j19974q6367J4145J30781O4142
24858C6706r050k6843N9503j6580m084k4295k5632k761N659n9l5614J6712N7978
$$ plain form
24941 16222 13976 -21947 -33810 -5107 -59496 -130601 -118226 -184373 -140707 -105640 -92191 -44561
24929 -44561 -3993 83968 70752 63725 10134 -2347 31375 67555 -61593 -7180 13490 -39494
24917 -39494 -77522 -62281 -89494 -44712 46068 29928 46783 142251 162538 85595 -14179 -19199
24905 -19199 -41277 -40556 -81318 -46718 -13777 40064 66197 98720 64606 51844 -3891 -37617
24893 -37617 -53526 -17161 52828 97493 50156 167 114204 178409 208550 187821 98089
24882 98089 21859 -7446 -12443 8148 -30155 -12238 95224 86437 2125 -54991 -77901 -83331
24870 -83331 -52803 -5628 -15220 -67671 21423 43043 33979 -85995 -172362 -158217 -27436 36706
24858 36706 27656 813 60316 43736 39652 15357 -10275 -13036 -7377 -7436 -43050 -26338 31640
24845C1640L4463M3702N2326j16511p0182q0922l1107P8169N7246O9031L006p8330
24833g469J1547l7345r2085o2287j1147K6312J29054J0199m1203N0444j3385j7464
24821e4829O0448j0581k5703p3814J00798J68799L0001m5846o9252o480o0232
24810A3309p7927N8709O689M5424K8463k982M2921J3353o7854m7909k3378O176
24798e006j0726o5524M2908l737j49681l8854J15458R9114l3981O079j1325N9002
24786C727K3095L6127N0246k6007n2723o5936l3627j9110R602O9204J1626J4018
24774B0242q024K2317q262j5516p5864K3152r712k5522J3143O2543J05368N4282
24762A58147m5144j01538J1786P1214M6326M152n7953m7494J7198P828K6738r957
$$ plain form
24845 31640 66103 109805 162131 45620 -24562 -105484 -136591 -58422 -1176 67855 70861 -7469
24833 -7469 4078 -33267 -125352 -187639 -198786 -172474 -43420 -33221 -74424 -23980 -37365 -54829
24821 -54829 5619 -4962 -30665 -104479 -3681 165118 195119 149273 80021 73541 13309
24810 13309 -64618 -5909 780 46204 74667 71685 114606 127959 60105 12196 -11182 -5006
24798 -5006 -15732 -81256 -38348 -42085 -191766 -230620 -115162 -16048 -50029 -43950 -55275 3727
24786 3727 26822 62949 113195 87188 34465 -31471 -65098 -84208 -74606 -5402 6224 20242
24774 20242 12218 34535 26273 10757 -65107 -41955 -51667 -77189 -64046 -1503 103865 158147
24762 158147 113003 11465 23251 94465 140791 144943 86990 39496 56694 64522 91260 81303
24750H1303Q101l2467o542k9558o6169o7841L9371L0794K5169O1051P9133K8163
24738A50508m3813j5091j1046R529J7343l1305l8121p0913l9135M207O5293j2709
24726a5253o3680J8071J45418N851J7894L4644r488P3219j3260q2013L490o1885
24714E3008m2864l1474o661J020n2412P459L2019J3636j8861m1059l6232N7040
24702f5381J35422N9538p0002l3551k505o4549r0008r6279j5987N4102N3070O8824
24690f7306l033L0599K8351N8507j1917r2823l1300J8611N6457k9983K854J2077
24678b8906j145j2191K8590O934N7059k1651O3283N851j4714r4772J1130M0847
24666D0315j7872n7970O3532Q0226k9260r3373Q1816M387q4067j3824L7861J2465
$$ plain form
24750 81303 89404 56937 50395 20837 -45332 -113173 -73802 -43008 -17839 43212 122345 150508
24738 150508 106695 91604 80558 90087 107430 76125 38004 -32909 -72044 -67837 -2544 -15253
24726 -15253 -78933 -60862 84556 90407 108301 142945 133457 206676 193416 111403 114893 53008
24714 53008 10144 -21330 -27991 -26971 -79383 -71924 -39905 -26269 -45130 -86189 -122421 -65381
24702 -65381 70041 129579 59577 26026 23521 -41028 -131036 -227315 -243302 -189200 -136130 -67306
24690 -67306 -70339 -39740 -11389 47118 35201 -57622 -88922 -70311 -13854 -43837 -40983 -28906
24678 -28906 -30051 -42242 -13652 -6718 50341 28690 91973 97824 83110 -11662 -532 40315
24666 40315 22443 -35527 28005 108231 78971 -14402 67414 71801 -12266 -26090 11771 24236
24654B4236K7261k4752p3742P349l1264r53J9411l2686L839J9782n217p928M2358
24641c2306K1719l0101j496M7471J2689j1932M01Q149L727n0782J036M6072K9
24628A4676l6953J207R4088l2162o6120M3688L0755J0910J2006P6657q6805j34901
24616g2954o9104o721m2463P7262J00130k292o7831m6774l521L3131L0336M5689
24604b5112R0946Q4701K4531o6969J760M2659j7915j21582r1625P4916K9952P638
24592C3900L69q1267K3529L4740m4454m0358o9928l6581N8878P5758R5756o6412
24580a6070o2035N2720K0968O4889k3423j43170q623M9861k8657N9941N7136L8797
24568F2334l2044m3661K4914k6875l4065J4592j5733k0067O6470n7991m2110J7945
$$ plain form
24654 24236 51497 26745 -46997 -39648 -70912 -71865 -52454 -85140 -81301 -61519 -66736 -74664 -32306
24641 -32306 -10587 -40688 -42184 5287 17976 6044 6445 14594 18321 -32461 -31425 14647 14676
24628 14676 -22277 -21070 73018 40856 -25264 18424 49179 60089 72095 148752 61947 -72954
24616 -72954 -142058 -148779 -191242 -113980 -13850 -16142 -83973 -130747 -134268 -101137 -70801 -25112
24604 -25112 65834 150535 175066 108097 109857 152516 134601 13019 -78606 -3690 26262 33900
24592 33900 34269 -46998 -23469 11271 -33183 -73541 -143469 -180050 -121172 -45414 50342 -16070
24580 -16070 -78105 -25385 -4417 60472 37049 -106121 -114744 -64883 -93540 -33599 23537 62334
24568 62334 30290 -13371 11543 -15332 -49397 -34805 -50538 -70605 -4135 -62126 -104236 -86291
24556h6291P4704P3365K1522o2019l4006j8199p5344k9488J8701J6616N2899k4993
24544g2533N7167n260n5156J2045K1608j5151J3541K9686j298L9638Q9860R063
24532A23210m6651l770M5342j3207m655m4683k4096J3695j7549K7595K2615k1438
24520E6408r472M5195K8788k0214m7738n7610n3938q3032N257K3391L6800L6016
24508d0149n1879m7626N2122M6749K6520J0722P0503r318j48145J9724N097n4871
24496a20551L0030R2994N965k5339j3257j3653k0035K6487p957J07652N0609m8831
24484F4114n6707j8830m4878J7971J3137l8325l6701K721k7604j6445J21893P5255
24472E5601K2661j47J4233m5251j18315k9855J6496M1646N7074m0792p028J9475
$$ plain form
24556 -86291 -11587 61778 83300 21281 -12725 -30924 -106268 -135756 -117055 -100439 -47540 -72533
24544 -72533 -15366 -20626 -75782 -63737 -42129 -57280 -43739 -14053 -15351 24287 114147 123210
24532 123210 76559 72789 118131 104924 100269 55586 31490 45185 27636 55231 77846 56408
24520 56408 46936 92131 120919 100705 52967 -4643 -58581 -141613 -136356 -112965 -76165 -40149
24508 -40149 -92028 -139654 -87532 -40783 -14263 -3541 66962 57644 -90501 -70777 -65680 -120551
24496 -120551 -90521 2473 8438 -16901 -30158 -43811 -63846 -37359 -45316 62336 112945 64114
24484 64114 7407 -11423 -56301 -38330 -25193 -63518 -100219 -97498 -125102 -141547 -19654 55601
24472 55601 78262 78115 92348 47097 -71218 -101073 -84577 -42931 14143 -26649 -33677 -14202
24460a4202O654O1580O4841j7946m1889n601l6134l1051L992k9585o3916K0995
24448h2262J21827j6502p7251p0662J19885Q6851L030p4284o9081l6224j6539
24437a11212n646k4650J6162R2418K4849K3541M23J43N5327r5325p9261J24879
24425B1648M535J1757J848m1128l2154L3404l9212k9419O0528m243k9269N4836
24413A3131P014k6060n9512n0837j1983k4905Q607K5613M1741N8247M9068J231
24401C1355k7022j14825N3000N7505L520N6834Q1544L6012j18395q0509j1317
24390c2298L3120J3292p0856M0741L3263m3847K265M5809Q9064L0900N917q2092
24378F5278o2217N191n4504l2547J005M726K4183Q1664j2741J3098m9825j6574
$$ plain form
24460 -14202 -7548 54032 118873 100927 59038 53437 17303 -13748 -9756 -39341 -103257 -82262
24448 -82262 39565 23063 -54188 -124850 -4965 81886 84916 10632 -58449 -94673 -111212
24437 -111212 -116858 -141508 -125346 -32928 -8079 15462 15885 16028 71355 -23970 -103231 21648
24425 21648 26183 37940 39788 -1340 -33494 -90 -39302 -68721 -8193 -12436 -41705 13131
24413 13131 20145 -5915 -65427 -116264 -128247 -153152 -144545 -118932 -77191 -18944 30124 31355
24401 31355 4333 -110492 -57492 13 3533 60367 141911 177923 59528 -20981 -32298
24390 -32298 822 14114 -56742 -16001 17262 -26585 -24320 21489 110553 141453 147370 65278
24378 65278 3061 8252 -46252 -78799 -77794 -73068 -48885 32779 20038 33136 -16689 -33263
24366c3263o662l2434L0641J3976L877j9394m9550M1283L4156O6903o531k8097
24354A4905n5885J8840O3639k0915n5973J7678K0869k1700k6213j2467R046M574
24342d3602K3104N7546k4739Q9511P2984K4615o1003p6943n0235l3767P80n5774
24330g7523L2650P9099k1288o0144l2936Q4834M6099n8944m6691O1107L7603j0006
24318C3860l0221n0605J14242M5126l6101n2971j2574J1886n2508K7362j1705
24307a4209N3160n4110M5777K0823n1855r1983k7605L5043k7475K4016M8654k874
24295d2638m3531j4177K7938J00855K9710N9595J6168j26057n7670L9974K9097
24284A9264J00008j6641j4151n1534J8462n8712l5085O1532K2846K1517j0027
$$ plain form
24366 -33263 -39925 -72359 -41718 -27742 -23865 -43259 -92809 -51526 -17370 49533 43002 14905
24354 14905 -40980 -22140 41499 20584 -35389 -17711 3158 -18542 -44755 -57222 -48176 -43602
24342 -43602 -20498 37048 12309 101820 174804 199419 138416 61473 11238 -22529 -21749 -77523
24330 -77523 -44873 34226 12938 -47206 -80142 4692 50791 -8153 -54844 6263 43866 33860
24318 33860 3639 -46966 67276 112402 76301 23330 10756 22642 -29866 -2504 -14209
24307 -14209 38951 -15159 30618 51441 -414 -92397 -120002 -84959 -112434 -88418 -39764 -42638
24295 -42638 -86169 -100346 -72408 28447 58157 117752 133920 7863 -49807 -9833 19264
24284 19264 119272 102631 88480 36946 55408 -3304 -38389 23143 45989 67506 57479
24273E7479P7072J8513j18951j23584J0737j3179j3553p561N2831l1762j0498
24262a02456j2365O923K1819J10028J11441K2110r6289l9344N7872P574K2220
24251A09533R841j00162N2371R1003n2832l8152p1935L953K3275j0206l7320o9993
24239i0624L6762O6230M0752k7492m156M796J5650m2982L528n4964n5961P3798
24227c4663m5327m236k9591J5468N7582l3086L8557p288q6495Q237N0788o1185
24215a31239P8505J40827Q1969n2928n2908O352k4933j5685o0901K0002R003M383
24203B447N3027K8758J4460J9198p7885m7488o171o0280r096M2954O542N5411
24191B1877j4788j3899O347O5560J3487m4981p3048Q0856M5416K1973o1381K7997
$$ plain form
24273 57479 134551 153064 34113 -89471 -78734 -91913 -105466 -113027 -60196 -91958 -102456
24262 -102456 -114821 -107898 -86079 23949 135390 157500 61211 21867 79739 87313 109533
24251 109533 119374 19212 71583 162586 109754 71602 -333 3620 26895 16689 -20631 -90624
24239 -90624 -53862 12368 53120 25628 21472 26268 41918 -1064 2464 -52500 -108461 -34663
24227 -34663 -79990 -84226 -113817 -98349 -40767 -73853 -35296 -42584 -129079 -120842 -70054 -131239
24215 -131239 -52734 88093 170062 117134 64226 70578 45645 29960 -30941 -10939 -1936 2447
24203 2447 55474 84232 98692 117890 40005 -7483 -13654 -73934 -83030 -40076 -33534 21877
24191 21877 7089 -6810 -463 65097 78584 33603 -39445 41411 86827 108800 47419 75416
24179G5416M473k7194m1736K3981n122L2676k392l3816l5724j05182K4190L3258
24167e7172P5202L2445r115l7624p9025K3872k5322p8341M3692M6310l759l468
24155g2305k3004p4708L1348k3927L3032j864J8902k283R892j5563K2625N6592
24143d1263j5044j6112K793J41j924j3412R2961m452l8597j7637Q3921j1499m6613
24130b6737l5286N0847N8781p229l4083M6746L8995M6535J9537r7962r4197k6387
24118f0440K4436N4084N0357l8958m4333P3144J1448k52r000J0186p4029l2775
24106c6132Q4178k6606k1486j01101L5212P0668L8026J4220l0002j6569n3990
24095d3582o5225l7560M8593N1918N6939j0161j863P130J375k6338K2722K337
$$ plain form
24179 75416 79889 52695 10959 34940 29818 62494 60102 26286 -9438 -114620 -90430 -57172
24167 -57172 18030 50475 41360 3736 -75289 -51417 -76739 -155080 -111388 -65078 -68837 -72305
24155 -72305 -95309 -170017 -138669 -162596 -129564 -131428 -112526 -114809 -104917 -120480 -97855 -41263
24143 -41263 -56307 -72419 -69626 -69485 -71409 -84821 8140 3688 -34909 -52546 31375 19876 -26737
24130 -26737 -62023 -11176 47605 40376 6293 53039 92034 138569 158106 60144 -34053 -60440
24118 -60440 -36004 18080 68437 29479 -14854 58290 69738 69486 60486 70672 -3357 -36132
24106 -36132 48046 21440 -46 -101147 -65935 4733 42759 56979 26977 10408 -43582
24095 -43582 -108807 -146367 -97774 -45856 11083 922 -941 6189 7564 -18774 3948 6285
24083F285l0706n3451j4035P4149P5688P499m4122j28724j5304O8158j2927r2538
24071a60028m0382R4490o683k2776N6752J9704k2221N1397M5114K4959q4557k3908
24059f8139l5618N606k8412K7478K1222J01261L9983O588J9565n9972p402N184
24047B7344j2724j13592n2760K3042n6968n0903J3834L6923P4620J03343K6314
24036A8473n0215J2743k2196m2053k4102K2963j0340P0700M6784P9849K8901m8716
24024H2791N4741j2280m6065k7480k2129j20244p560N0162L5069k0885l621n4799
24012i2300o346O4598L1080L3328O5016p6826r3180J4848J07823K3326o5215k971
24000C181J00067l8598k5018j5197l176N7803M3429q2318j08063N1478O0841k1889
$$ plain form
24083 6285 -24421 -77872 -91907 -17758 57930 65429 21307 -107417 -122721 -54563 -67490 -160028
24071 -160028 -200410 -105920 -112603 -135379 -78627 -58923 -81144 -29747 15367 40326 -44231 -68139
24059 -68139 -103757 -98151 -126563 -99085 -77863 23398 63381 69969 89534 29562 22160 27344
24047 27344 14620 -98972 -151732 -128690 -185658 -236561 -222727 -185804 -111184 -7841 18473
24036 18473 -31742 -18999 -41195 -83248 -107350 -84387 -94727 -24027 22757 102606 131507 82791
24024 82791 137532 125252 79187 51707 29578 -90666 -98226 -48064 -12995 -33880 -37501 -92300
24012 -92300 -98646 -34048 -2968 30360 95376 18550 -74630 -59782 48041 71367 6152 3181
24000 3181 103248 64650 39632 24435 21259 79062 122491 40173 -67890 -16412 44429 22540
23988B2540j7492j4498o9334l1238K1251m7215o7047L1103J20273L8985q656q7904
23976a09232o1508P2758m7198N6694k8553j6772L5401M6653q861j4131k2820o9674
23964a67243Q0526R9253n0518N2516K2488K6647P4447l9697r5582o9142r803J0417
23952f5691K8626M3080J3506k0557Q1346j1533m1073n332K8033r890n9882n1210
23940g0577L5113L395q577m2648l7553K3777K1112m5968r396P950M3334J5427
23928f4611J2963J0552k5649K2073n0345l1496N408O5672N9197n2089r99k223
23916e1547J0322J0124k9949j6456L5182M5420k4809L8172J9930k6831P08r1067
23904h0801j1830L9379l353J4800m0912J06240P566p726R9975n4099m0943K3849
$$ plain form
23988 22540 5048 -9450 -78784 -110022 -88771 -135986 -203033 -171930 -51657 -12672 -21328 -109232
23976 -109232 -170740 -97982 -145180 -88486 -117039 -133811 -98410 -51757 -60618 -74749 -97569 -167243
23964 -167243 -86717 12536 -37982 14534 37022 63669 138116 98419 2837 -66305 -76108 -65691
23952 -65691 -37065 6015 19521 -1036 80310 68777 27704 22372 50405 40515 -19367 -70577
23940 -70577 -35464 -32069 -40646 -83294 -120847 -97070 -75958 -121926 -131322 -123372 -80038 -64611
23928 -64611 -51648 -41096 -66745 -44672 -95017 -126513 -121105 -55433 3764 -48325 -49324 -51547
23916 -51547 -41225 -31101 -61050 -77506 -42324 3096 -21713 16459 36389 9558 10266 -80801
23904 -80801 -92631 -53252 -56605 -41805 -82717 23523 31089 23363 123338 69239 28296 52145
23892E2145O0749q410m3259l6983j8455m0214J203J0542k1551m9638J2291M5775
23880c5805N4303J3906m673k6063J2494l4946P1387q5037p6444k3846q05k2907
23868a58436j236j6225L1070p088N2463m5733k2811N5633j5514R4856J31019j3948
23856H4050r2142l7090P6256K3525l8616q4772m5294N5437M7867k590m1020K4615
23844b9774Q9810J19561p1782j01372K4242l1324q4401J1628L2881J601n690O3972
23832A9352k1143p2625M142R8405N6130n1276n1886L6919K2014P868J3443N8271
23820A19614O8046J6540n8209k6038j9117K3506R298q8970k3599k6533l4758n0696
23808i0916m5852l0280K7295J01345L6413J09K3215o6597p7570m152M6737L9070
$$ plain form
23892 52145 112894 104484 61225 24242 5787 -34427 -33224 -22682 -44233 -93871 -81580 -35805
23880 -35805 18498 32404 27731 1668 14162 -20784 50603 -34434 -110878 -134724 -135529 -158436
23868 -158436 -159672 -175897 -144827 -151915 -99452 -145185 -167996 -112363 -127877 -33021 97998 84050
23856 84050 -8092 -45182 31074 54599 15983 -68789 -114083 -58646 -10779 -13369 -54389 -29774
23844 -29774 60036 179597 107815 6443 30685 -639 -85040 -73412 -40531 -38930 -44620 19352
23832 19352 -1791 -74416 -70274 28131 84261 32985 -18901 18018 40032 47900 61343 119614
23820 119614 187660 204200 145991 119953 100836 124342 133640 44670 21071 -5462 -40220 -90916
23808 -90916 -136768 -167048 -139753 -38408 -1995 -1886 21329 -45268 -122838 -126990 -80253 -41183
23796d1183J9274L5955q2248l8445J0012M9906K0300N1360Q851N9224L2688m1792
23784H3902l173r4545n6748l652M960K9527P8244M9253L4723j4237J9006l6275
23772I0985o904J9514N4619p4605r4102J3777L6005o304m2125l6542r2993N7425
23760h1250N4724O6467P2555k1808k8144L3561O0100o9151j10218l0932Q7787
23749C3691j0627q3202m0987Q1763J05950L4569k3753r6150k1790l043k5595o0853
23737a10027R62N7099J765j993J08696j2536p0460j2059p4671O6802O9093K131
23725B4802k4212K7586M8351j5403l3499m8669j9656j7862K2147K8767r6653j08980
23713b13281K6508R0516M3454j2189O3238P7542L0601j8793m1278n3054r4808
$$ plain form
23796 -41183 -21909 14046 -68202 -106647 -96635 -46729 -26429 24931 33782 93006 125694 83902
23784 83902 80729 -13816 -70564 -74216 -69256 -39729 38515 87768 122491 108254 127260 90985
23772 90985 84081 103595 158214 83609 -10493 3284 39289 32985 -9140 -45682 -138675 -81250
23760 -81250 -26526 39941 112496 90688 62544 96105 156205 87054 -23164 -54096 33691
23749 33691 23064 -60138 -101125 -19362 86588 121157 97404 1254 -20536 -23579 -49174 -110027
23737 -110027 -109065 -51966 -50201 -52194 56502 43966 -26494 -38553 -113224 -46422 22671 24802
23725 24802 590 28176 76527 61124 27625 -21044 -40700 -58562 -36415 -7648 -104301 -213281
23713 -213281 -186773 -96257 -52803 -64992 -1754 75788 106389 87596 46318 -6736 -101544
23702a01544P6556J11152j7437j2165q4665j40906J9337P4435Q324m7930j7720
23691a32563q835p5806Q3130Q3637o2956M6682N6795j6932n0087p9485L692M4537
23679a08191K1889K8707j618L1392N0210P2249j3106q8521p5449K5921J0993k9465
23667g4989k148L079J1244l7298o4961j0447O2902P9356O5827K3801N3407K1779
23655A31552p0991n7601m2365j9835k1605o5857M6341Q8717L4287k4609M7535
23644D5569J3729n1822k8229P3849j3295q3763l8690J498K1620R4977o9449o10
23632c4616M3093Q3634J075p3720m4758k5107j5913Q6389L9381j10066l2582j1296
23620i4486N551M6202k3689m972N5558K6605j6077p9144m156J1093k9216j6116
$$ plain form
23702 -101544 -24988 86164 68727 56562 -28103 -169009 -149672 -75237 -66913 -114843 -132563
23691 -132563 -141398 -217204 -134074 -50437 -113393 -66711 -9916 -26848 -76935 -156420 -152728 -108191
23679 -108191 -86302 -57595 -59213 -27821 22389 94638 81532 -6989 -82438 -56517 -45524 -74989
23667 -74989 -77137 -74058 -62814 -100112 -165073 -175520 -112618 -33262 32565 56366 109773 131552
23655 131552 60561 2960 -39405 -59240 -80845 -146702 -100361 -11644 22643 -1966 45569
23644 45569 59298 7476 -20753 53096 39801 -43962 -82652 -81154 -59534 35443 -34006 -34616
23632 -34616 8477 92111 93186 19466 -25292 -50399 -66312 20077 59458 -50608 -83190 -94486
23620 -94486 -88935 -42733 -66422 -71394 -15836 10769 -5308 -84452 -88608 -77515 -106731 -122847
23608a22847P096M9762K5683L4674N1984K3291o7206o1282N5349k8694m3579M949
23596g0820l8030m7832N4406O3345j5187l4657K0766J7176O2070N6697o8128j9440
23584a9634O7510o916K2418l8200k5449j2557J30053K7324m4168m0623m8340L4003
23572D5421L431l2595K992J1697M0835l5441n4942M6393k9652l4655j9734J7041
23560c9209M2001l3935O3787J01020K0243j7346p4138j727L1777P7566p0j34557
23548C5412l0605Q2075Q7178j3540m7859p6549o7504K2334L1255m727J6921l9484
23536e093k4704K6145N024M3832j5546j9295L596l9866L25P9839j0847k6370j7795
23523g55k1377M8515N7801M5989l6316q3072l5198K2373L9039j2399M1935k7875
$$ plain form
23608 -122847 -115751 -65989 -40306 -5632 46352 69643 2437 -58845 -3496 -32190 -75769 -70820
23596 -70820 -108850 -156682 -102276 -38931 -54118 -88775 -68009 -50833 11237 67934 -194 -19634
23584 -19634 47876 40960 63378 25178 -271 -12828 117225 144549 100381 59758 11418 45421
23572 45421 48852 16257 19249 30946 71781 36340 -18602 27791 -1861 -36516 -56250 -39209
23560 -39209 2792 -31143 32644 133664 153907 136561 62423 60696 92473 170039 169969 35412
23548 35412 4807 86882 174060 160520 112661 36112 -31392 -9058 22197 17470 34391 -5093
23536 -5093 -29797 -3652 1372 45204 29658 10363 13959 -25907 -25582 54257 43410 17040 -755
23523 -755 -22132 26383 84184 130173 93857 10785 -24413 -2040 36999 24600 66535 38660
23511C8660k5639m3205l452j3354l8914k4677m0657l71J5092P0911M1371N0076
23499B5841N3748j0445p3341K4754L0550k7006O4118O5987p554M9388j4810n9867
23487A21363k8385o2460n4560n4688L4491Q9219k626m4594M6719J7795m5943m5343
23475b9012K0847K6921L9772L3666l8990M1286M0574n9323j9543m8378j03181
23464i5361M3249K3922m525o0483m1733Q9844P6573n9244J7296M1886m7804j8133
23452c4513J891n1121k8891n294M3588q045j91K2127J38445k8402o3570J1213
23440b763M545q9708n6106J2627L4815M4703J1745J8178M2264j0687O2013O7666
23428A39292j0907J3899p04R119q5149j51701n4664J954J36891J02579k4729o606
$$ plain form
23511 38660 13021 -30184 -33636 -46990 -85904 -110581 -151238 -151609 -136517 -65606 -24235 25841
23499 25841 79589 69144 -4197 20557 51107 24101 88219 154206 146652 196040 181230 121363
23487 121363 92978 30518 -24042 -78730 -44239 44980 42354 -2240 44479 62274 16331 -29012
23475 -29012 -8165 18756 58528 92194 53204 94490 135064 75741 56198 7820 -95361
23464 -95361 -52112 -28190 -32715 -93198 -134931 -45087 31486 -27758 -10462 31424 -16380 -34513
23452 -34513 -32622 -83743 -112634 -117928 -74340 -82385 -82576 -60449 77996 49594 -13976 -2763
23440 -2763 1782 -87926 -144032 -131405 -96590 -51887 -40142 -21964 20300 9613 71626 139292
23428 139292 128385 142284 141580 150699 65550 -86151 -140815 -138861 -1970 100609 75880 69274
23416F9274J1956j6999p3121j2805P2280k407L962q0656n126L3882m3980j3074
23404e6814L8684J4372Q4751R522m4550p5711m8831k7767j466J5375M8564L0599
23392a3272M3992l3717K605j3229j9787J0775J8339j5226K9229N3941M7540k0102
23380I1088r0746j21888N4010L4130k0356L9358M0238M0871L0389K5266M4563
23369A66923r471q0487r5719o8954K2651M5952L6232r6740j8604k0233M689Q1724
23357c2037o0351m85l065n6979j4498K5494n3714L8285P8526k6275J3797L9678
23345e1624p8924k8144N1990O9068M2205J57974Q135j15237j1467n2199p2881
23334h1104m7976M2859J8000J4192J9899j6660P9203J2320J0567l7783j9214Q909
$$ plain form
23416 69274 81230 64231 -8890 -21695 50585 48178 52140 -28516 -33642 240 -43740 -56814
23404 -56814 -18130 -3758 80993 90515 45965 -29746 -78577 -106344 -107810 -92435 -43871 -13272
23392 -13272 30720 -2997 -392 -13621 -33408 -22633 -4294 -19520 9709 63650 111190 91088
23380 91088 342 -121546 -67536 -33406 -53762 -14404 25834 66705 97094 122360 166923
23369 166923 157452 76965 -18754 -87708 -65057 -19105 17127 -79613 -98217 -118450 -113761 -32037
23357 -32037 -92388 -92873 -95938 -152917 -167415 -141921 -195635 -157350 -78824 -105099 -91302 -51624
23345 -51624 -130548 -158692 -106702 -37634 4571 162545 170680 55443 43976 -8223 -81104
23334 -81104 -129080 -86221 -68221 -54029 -34130 -50790 28413 40733 51300 13517 -5697 3212
23322C212L6855P047N202r4282j9044j1902M8299l0213N303q893O141P7255K4819
23309D9799o2130n4158N1956J0701M091M186M6199p9041l6195K2107O745J8806
23297a6934J11459m9145j14413l8175K4927Q3842q5590j7440P035L341K4091L5244
23285c1758L5793K1928k0887p2557m8792k0179N1345Q85m8592R506M6508N7987
23273a8813N3180Q7430O9870m0221j51988r8168m8419P1823J34232R269J7203
23262H5398J7741q0149p6752L4083k4535q8670J829L0586M6594N7540K8556l5521
23250c300j544l5608R297N0225L329l2468N2083M561q6671l7267m3070M1838Q8495
23237I900Q7632j3889o6690q629k2413N663N1253N888L3221l6752k7676n0729
$$ plain form
23322 3212 40067 47114 52316 -41966 -61010 -72912 -24613 -54826 -49523 -58416 -52275 24980 49799
23309 49799 -12331 -66489 -14533 -3832 259 4445 50644 -28397 -64592 -42485 -35740 -16934
23297 -16934 94525 45380 -69033 -107208 -82281 1561 -84029 -101469 -94434 -91093 -67002 -31758
23285 -31758 4035 25963 5076 -67481 -116273 -136452 -85107 -84222 -132814 -123308 -76800 -18813
23273 -18813 34367 121797 191667 151446 -542 -98710 -147129 -75306 58926 68195 85398
23262 85398 103139 22990 -53762 -19679 -44214 -132884 -131055 -100469 -53875 3665 32221 -3300
23250 -3300 -4844 -40452 -31155 19070 22399 -10069 42014 46575 -40096 -77363 -120433 -78595 9900
23237 9900 97532 83643 16953 8324 -14089 -8426 42827 48715 81936 45184 17508 -33221
23225c3221n3427M1969P1245O17Q718m6434o6783K660M3476K5733l2733k5342
23213f3522k4779m2261K3307J1136M8053q664K8109J8706M7670j5635L6886K8166
23201H7172K451M3681k0115K2754r32M4298J1453q7483n2883l8221k951k8148
23189a8924l1777N5445M9826J14840J2563j22570o4026K3821K5555qn1209L5521
23177B9057k7273n2729L7039M2272P6734M3847o5472p9949j2083j8612J5490M4507
23165C2828j2669J8486L3661N778p8080o8611k1969k0079O7080L8048l0477M8002
23153A1998O5503o3547j6952n9962m9107n8678Q0949P1110O9207M0616j5623m9313
23141B6201o9381n9718j5226P5879O1052J2459l117K1942p2552j8554o5666l5116
$$ plain form
23225 -33221 -86648 -44679 26566 27183 35901 -10533 -77316 -74656 -31180 -5447 -38180 -63522
23213 -63522 -88301 -130562 -107255 -96119 -48066 -56730 -28621 -9915 37755 22120 59006 87172
23201 87172 89623 133304 113189 135943 135011 179309 190762 103279 50396 12175 9224 -18924
23189 -18924 -50701 4744 54570 169410 181973 59403 -4623 19198 44753 44745 -6464 29057
23177 29057 1784 -50945 -13906 28366 105100 148947 83475 3526 -8557 -27169 -11679 32828
23165 32828 20159 38645 72306 78084 4 -68607 -90576 -110655 -43575 -5527 -36004 11998
23153 11998 77501 13954 -2998 -62960 -112067 -170745 -89796 -18686 50521 91137 75514 26201
23141 26201 -43180 -102898 -118124 -42245 18807 31266 28149 50091 -22461 -41015 -106681 -141797
23129a41797k0632N5865R2620R6347j3216m5611j0389L1021j0489k5903L2722
23118D0538p9720J3670J4280m7914l0219J3454M2362M9749O9702K5572j1224M37
23106A00687j773k9356J3939M2777l9971N3833L4211j73218p0401K3281R534k1508
23094e7965J4164J07707l0027l8543j4396L2632L4539R70K4129M382j5423J3114
23082G5283l0431p4979o3061M5212Q9025P133j2950r4214K0242O0685J7783q2654
23070d2926K2326J02513M4165j06828k8612j1661j00695m955L1066o487n3875
23059a55969J2264J4111M9079N1445R6802K6605l8510n4544M0941M1567m1310
23048D2481k1617M019k0033q367n0199L2764L5931L2598k1601l4087J11194l3563
$$ plain form
23129 -141797 -162429 -106564 -13944 82403 69187 23576 13187 44208 33719 7816 40538
23118 40538 -39182 -25512 -11232 -59146 -89365 -75911 -33549 16200 85902 111474 100250 100687
23106 100687 98914 69558 83497 126274 86303 140136 174347 1129 -69272 -45991 -36457 -57965
23094 -57965 -43801 63906 33879 -4664 -19060 13572 48111 49081 73210 77592 62169 75283
23082 75283 44852 -30127 -93188 -47976 41049 48182 35232 -58982 -38740 21945 39728 -42926
23070 -42926 -20600 81913 126078 19250 -9362 -21023 -121718 -126673 -95607 -102094 -155969
23059 -155969 -143705 -129594 -80515 -29070 67732 94337 55827 1283 42224 83791 42481
23048 42481 20864 24883 4850 -3517 -53716 -20952 14979 47577 25976 -8111 103083 69520
23036F9520j32746k4321N8301j5576k966j6636q401Q6436K5905l8284m4094r1275
23024a34137l0680J02319k3447m5774J2740m68n417P8324K1500k2455K1607P7754
23012E1866J5490k4501r2151o0258O2748K7078O3024P5806l2073p0517j1692r725
23000d905K800j1055o1835J7890N6870M5853N0339q392J8318M574l9658m1859
22988B8940k3844k3768O4971L3483m0117p182M9849l1460p6770q9234M349j3323
22976a24106m356O9981J0962K9963J22052K6985n5233k0009R426N5037j15148
22965E554k4040J0221l7560j5780J8574K1761M9451M1778R344l3796k7553n1265
22953c3311O2306m4270j3612J8646k0060l225M3362K3965J0586l1323m3757k1363
$$ plain form
23036 69520 -63226 -87547 -29246 -44822 -47788 -64424 -72825 13611 39516 1232 -42862 -134137
23024 -134137 -164817 -62498 -85945 -131719 -118979 -119447 -124864 -46540 -25040 -47495 -25888 51866
23012 51866 67356 42855 -49296 -109554 -46806 -19728 43296 119102 87029 16512 4820 -4905
23000 -4905 -2105 -13160 -74995 -57105 -235 45618 95957 87565 105883 110457 70799 28940
22988 28940 5096 -18672 46299 79782 39665 32483 82332 50872 -25898 -115132 -110783 -124106
22976 -124106 -128462 -58481 -47519 -17556 104496 131481 76248 56239 65665 120702 5554
22965 5554 -18486 -8265 -45825 -61605 -43031 -21270 28181 69959 79303 45507 17954 -33311
22953 -33311 28995 -15275 -28887 -10241 -30301 -33526 9836 33801 44387 13064 -30693 -52056
22941e2056M211k0801O5924N5010K4626N5122M1716j5916p2558n4879j51506O3229
22929e7878L5889r184j0486k7388K3199L6948k5729p1517J3378O3319O3927K2552
22917E7030J1054k2522n5468m3074j8530j3286K4505J15519R1669k3168q7102
22906C6627j4412J1465Q205M604p7041M0090n1953K4568k4256m0879q722P1649
22894b0055O0907j9900j20J7304r267l213L8748k1308m8233k751J6564O1085M7745
22881A17506q7828n9652n2554O0176N9395k0949m4854l4125M632L9595R077n730
22869a5311J9582L2757K7876j18181o351N6041Q8705m4832p4366p2679M4092N9221
22857c446L7239P9386k9823j45816M21l545l7300j1517m985J9999L8572L2673
$$ plain form
22941 -52056 -47845 -68646 -2722 52288 76914 132036 173752 157836 85278 30399 -121107 -57878
22929 -57878 -21989 -31173 -41659 -69047 -45848 -8900 -34629 -106146 -92768 -29449 34478 57030
22917 57030 68084 45562 -9906 -52980 -71510 -84796 -60291 55228 146897 123729 36627
22906 36627 22215 33680 41885 46489 -30552 9538 -42415 -17847 -42103 -82982 -91704 -20055
22894 -20055 40852 20952 20832 38136 28869 25656 64404 43096 -5137 -7888 8676 69761 117506
22881 117506 29678 -29974 -82528 -22352 37043 16094 -28760 -62885 -58253 -18658 -9581 -15311
22869 -15311 4271 37028 64904 -53277 -59628 -3587 85118 40286 -34080 -106759 -62667 -3446
22857 -3446 33793 113179 83356 -62460 -62039 -65584 -102884 -114401 -119386 -99387 -60815 -28142
22845b8142q561K9455o7861m9299n5058M3775M9559Q2951n1795q216N8027K5489
22833B0324o1918q727N2848k9119j4871o3619L7621M1536J8850L9666L9710j6938
22821E5363l8048l6675j4312k3561Q6O6746P0674l6304n7100q5160N4204k0901
22809f4988j9359k7278M6543J72098Q5115l6354j8111k4493q231n4223n5978Q933
22797C674l7544j0628M50J9187K035N2932l1169p5265j3372O9317M276l4042J0391
22784c9758M0650J23273J6272l8664m1731o3038n8981l4210R4190N6772j0458
22773D4317n4484j501P6353K9592q5207j1960k7525j38289o757K8322L2661N5947
22761e8531J918k8495N866L1625K4756l3603R927J9236M2375k358K4893j6236
$$ plain form
22845 -28142 -36703 -7248 -75109 -124408 -179466 -135691 -86132 -3181 -54976 -63192 -5165 20324
22833 20324 -41594 -50321 2527 -26592 -41463 -105082 -67461 -25925 -7075 32591 72301 55363
22821 55363 17315 -19360 -33672 -57233 -57147 9599 80273 43969 -13131 -98291 -44087 -64988
22809 -64988 -84347 -111625 -65082 107016 192131 155777 137666 113173 104942 50719 -5259 3674
22797 3674 -33870 -44498 -44048 -24861 -22826 30106 -1063 -76328 -89700 -20383 -16107 -50149 -39758
22784 -39758 892 124165 140437 101773 60042 -2996 -61977 -96187 -1997 54775 44317
22773 44317 -10167 -11668 64685 94277 9070 -2890 -30415 -168704 -175461 -147139 -114478 -58531
22761 -58531 -56613 -85108 -79242 -47617 -22861 -56464 -46537 -27301 15074 12716 37609 21373
22749B1373o9580o8092P8816J0529Q654p756k0269J5687p7162o5047n1019K0887
22737b02979k6674N47N6472M8441O3844n358n2389k4411J2938r277l7715r741
22725a86302j6629O4412J40466J9306p6324k695J3162l15K675J0060k4319j16745
22713a73248n0798R5184J40972M1754p2916k7017k1442M7079j3558L1161j4045
22702a6874r0480k8966R1997o45R831M64J3792J6923o7245n0694k9827k464o4531
22689b18719p0248L3851O1561J03553K2440m1972k5521O2597K4308j6425M6053
22678a8522r718n6995o8901m804R0714Q2958Q0934K8481k3566m8120m9144M754
22666H071J7695q0059p5371O4241J2311R3778O4122j4185j02767L0564J4369n3622
$$ plain form
22749 21373 -48207 -116299 -37483 -26954 -18300 -26056 -46325 -30638 -107800 -172847 -223866 -202979
22737 -202979 -229653 -229106 -172634 -124193 -60349 -65707 -118096 -142507 -129569 -138846 -176561 -186302
22725 -186302 -202931 -138519 1947 21253 -55071 -57766 -44604 -44919 -42244 -32184 -56503 -173248
22713 -173248 -224046 -128862 12110 53864 -19052 -46069 -67511 -20432 -33990 -2829 -16874
22702 -16874 -107354 -136320 -44323 -44968 -35137 -34673 -20881 -3958 -71203 -121897 -151724 -154188 -218719
22689 -218719 -288967 -255116 -193555 -90002 -67562 -109534 -135055 -72458 -48150 -64575 -18522
22678 -18522 -28240 -85235 -154136 -158940 -68226 14732 95666 124147 100581 52461 3317 8071
22666 8071 25766 -54293 -129664 -65423 -53112 40666 104788 90603 -12164 18400 32769 -20853
22654b0853m818N3137p926o8026l0400p6045K841J5952O7610Q886q08R9225l272
22641C5503k2115J5126J5679N1520j18882q8779N2915Q6648n112n2708k7181K6623
22629c0763k6599J0943N5120K0957M660J9404Q7940l7235n5464k2703N578m4615
22617a2777m9340m285l4604M8678l9171O9897Q2089L8245k3140o0012l6943K7084
22605E721l9770k4259l954p768P016l2450n772K7945N9734p3092j7040N8823J0479
22592c4387r6659o1490m8353Q0853Q4080K6083K2236k6233k7031L4705j5252O2012
22580E64l4818m5319J0956n8054n206l7516L8487J17326K6149k7753n272k0367
22568d0823L8977N6542N2108r4482K1056N5599K9983j01168l9925K4334J3684
$$ plain form
22654 -20853 -25671 27466 19540 -48486 -78886 -154931 -152090 -136138 -68528 -59642 -60450 38775 35503
22641 35503 13388 28514 44193 95713 -23169 -111948 -59033 27615 22503 -30205 -57386 -30763
22629 -30763 -57362 -46419 8701 29658 34318 53722 141662 104427 48963 26260 31838 -12777
22617 -12777 -62117 -66402 -101006 -52328 -91499 -21602 60487 98732 75592 15580 -21363 5721
22605 5721 -34049 -58308 -62262 -70030 -63014 -95464 -101236 -73291 -13557 -86649 -103689 -44866 -34387
22592 -34387 -131046 -192536 -240889 -160036 -75956 -49873 -27637 -53870 -80901 -46196 -61448 564
22580 564 -34254 -79573 -68617 -126671 -131877 -169393 -130906 -13580 12569 -15184 -20456 -40823
22568 -40823 -1846 54696 106804 12322 33378 88977 118960 17792 -22133 2201 15885
22557A5885p3243J3590k1178K8644R7869k029k3121K2604l5429J8556J0104m0543
22545A1709l4090l6392n775R0780k7064j7539K5996L152K6509N7937j4779j2346
22533F8098j12558j3567O0948N6680j0521j3670M0912J370m6054K6690J6967N39
22521G5834o5915m0547M7724n072k9695m1797P6360R2070J3693l3805q1960p8609
22509g1719q4400L5620J38977l0193l5599L7296J729Q458m239k0753K5154l7768
22497c7437k7014K2953M9694P5920l7924M5152K4556n4883k7137j01284k0140
22486h7544k1293m0854L0535J5195M0494r296k8933M8401o980k8269P6361Q6217
22474G4034j6297p5259l7J6280n9394j2774J0671L6494K9507k3919J3592P0007
$$ plain form
22557 15885 -57358 -43768 -64946 -36302 61567 59538 36417 59021 23592 42148 52252 11709
22545 11709 -22381 -58773 -64548 26232 -832 -18371 7625 10777 37286 95223 80444 68098
22533 68098 -44460 -58027 2921 59601 49080 35410 76322 77692 31638 58328 75295 75834
22521 75834 9919 -30628 17096 12024 -17671 -59468 16892 108962 122655 88850 6890 -71719
22509 -71719 -156119 -120499 18478 -11715 -47314 -10018 -8289 169 -4070 -24823 331 -37437
22497 -37437 -64451 -41498 8196 84116 46192 91344 115900 61017 33880 -67404 -87544
22486 -87544 -108837 -149691 -119156 -103961 -63467 -72763 -101696 -53295 -60275 -88544 -12183 74034
22474 74034 57737 -17522 -17559 -1279 -60673 -73447 -62776 -26282 3225 -20694 -7102 62905
22462F2905j0865j5009m1208M7648l9682q4511J8092N5337K7755l9330L6985J30432
22450A48549n1308l7457L5722R804l9859K1594K6858p1400r050m6993k1199L8054
22438C315O5529r417J8626m1800l662Q240N43M0800N9302j05319p350J0761l1056
22425H512m7036J7282k260Q3668J9303j00231N499r446J2123M3720q6345m4070
22413i9281P288R9510k266k4149P60M349j29J0841j5868l6700J4531J7718p879
22400c1275L3056j5047K0638M7869n6174j6364K4645l175M67j7703Q3274l7065
22388C3146j485M7771N246j05368j10540n2789R2209J24614K2379o0315j1777
22377a6909k6875M068j14425K6079K3233Q8039J6238n5367m2251k3443K0240K6948
$$ plain form
22462 62905 52040 37031 -4177 43471 3789 -80722 -62630 -7293 20462 -18868 18117 148549
22450 148549 97241 59784 95506 105310 65451 87045 113903 42503 33453 -13540 -34739 3315
22438 3315 68844 59427 78053 36253 32591 40831 41374 82174 141476 36157 28807 39568 8512
22425 8512 -38524 -21242 -23502 60166 79469 -20762 -15263 -24709 -12586 31134 -55211 -99281
22413 -99281 -91993 7517 5251 -18898 -18138 -13789 -13918 -3077 -18945 -55645 -41114 -23396 -31275
22400 -31275 1781 -13266 7372 55241 -933 -17297 7348 4173 4640 -13063 70211 33146
22388 33146 31661 79432 84678 -20690 -131230 -184019 -91810 32804 55183 -5132 -16909
22377 -16909 -43784 -39716 -154141 -128062 -104829 -16790 -552 -55919 -98170 -121613 -101373 -74425
22365g4425K1237k570j0756J8700j1857P8369K5880p7176r414n2345q638J7682
22353h5313k5442l9215J3773P0478m7086P2716N2348l6227l1863K9076Q4177L3842
22341I1264j33285q5501Q741N6673M8648r1978O3831J25924j9962n2808J0963
22330B2510M7374K5251O904k4093K2465k02081o6247J20324M9886l5516k8440
22319f1663j4006J9135j2415N7796O5331j7620q173P046o3295j9634N4902L9527
22307D6931j1290q3726l4360M8315N1448k5743r280k3449R6989N7694o8799n1383
22295f653k1398Q18L7151j17529j7559K6365L5677l2374J7284Q2060n6420m9271
22283a01849Q4293k286r3115m1804K4448j779L6210o118J9062O2467o301N9934
$$ plain form
22365 -74425 -53188 -55758 -66514 -47814 -59671 18698 44578 -32598 -42012 -94357 -102995 -85313
22353 -85313 -110755 -149970 -136197 -65719 -112805 -40089 12259 -23968 -55831 -26755 57422 91264
22341 91264 -42021 -127522 -118781 -62108 -13460 -105438 -41607 84317 64355 11547 22510
22330 22510 69884 95135 102039 77946 100411 -101670 -167917 -47593 2293 -33223 -61663
22319 -61663 -75669 -56534 -68949 -11153 54178 36558 28385 35431 -27864 -47498 7404 46931
22307 46931 35641 -48085 -82445 -34130 17318 -8425 -17705 -41154 55835 113529 44730 -6653
22295 -6653 -28051 -27233 9918 -107611 -125170 -98805 -63128 -95502 -78218 3842 -52578 -101849
22283 -101849 -17556 -19842 -112957 -154761 -130313 -132092 -95882 -102000 -82938 -20471 -26772 33162
22271C3162j5625n1807r613n2131j5658L4615l943K0838L3776L6861k7016p6598
22259i3139o4317K6445J13052M0035k6447P5459m0125l5068O7937K9807j16017
22248b2378m8758P5983k57P916K2718m4042J7398l2832k4324m5504K6590J12566
22236D5076j4446N548n1359j6736j3184K7326n2085k1290K6004r582l4523K3661
22224h5590j9091N0153M8000K4112j7485J09347K6143n0437q4325j5024l617p7957
22212i5771o218k1911l828K146P2848K5357j6570K1177J8470k8882j0796J1581
22200c2397l4493J5830j9649N5451L9591m2716O9176J4796j7436o0427l5264l5310
22188h2848M4838k4404l8919O3379q445m7037j024N5888J0813M6409p0370p940
$$ plain form
22271 33162 17537 -34270 -43883 -96014 -111672 -77057 -81000 -60162 -26386 10475 -16541 -93139
22259 -93139 -157456 -131011 -17959 22076 -4371 71088 30963 -4105 63832 93639 -22378
22248 -22378 -71136 4847 4590 12506 35224 -8818 8580 -24252 -48576 -94080 -67490 45076
22236 45076 30630 36178 -15181 -31917 -45101 -17775 -69860 -91150 -65146 -74728 -109251 -85590
22224 -85590 -104681 -54528 -6528 17584 99 109446 135589 85152 827 -14197 -17814 -95771
22212 -95771 -101989 -123900 -127728 -125582 -52734 -27377 -43947 -22770 -4300 -33182 -43978 -32397
22200 -32397 -66890 -51060 -70709 -15258 24333 -18383 50793 65589 48153 -12274 -47538 -82848
22188 -82848 -38010 -62414 -101333 -37954 -46399 -93436 -94460 -38572 -27759 18650 -51720 -59660
22176e9660L7505M5705l3972m1365N4836O7270o5481l9955q148J8035Q64M2818
22164A8452L5567M758m2514Q851J8211m2902m6998K9406K4535o330o7248k3593
22152h9805j9529l8516j3930M3721O9500P2449n6025J1788q636O8911q030p6399
22140d4501M9007J3808m8421k4151l0423K2503J2210l1117O774q4421k7212J4767
22128a71177O5111N9073j0919l8817L7288J14516M7296K7658l812k4812J8685
22117A20090j09339l670O670N1252K3912K0168r7125O0566Q7540N9514k0827n0205
22105A48546r238j610j3957j23865p0437J11710L0160j6255O2983K3809n1355
22094I0491m4640m8513L3268K1117R604l8967N4815p7686j463M9357k9383j2382
$$ plain form
22176 -59660 -22155 23550 -10422 -51787 3049 70319 4838 -35117 -43265 -25230 -24366 18452
22164 18452 54019 58777 16263 25114 43325 423 -46575 -17169 7366 1036 -66212 -89805
22152 -89805 -109334 -147850 -161780 -118059 -48559 23890 -32135 -20347 -28983 39928 31898 -44501
22140 -44501 4506 18314 -30107 -54258 -84681 -62178 -49968 -81085 -74311 -158732 -185944 -171177
22128 -171177 -106066 -46993 -57912 -96729 -59441 55075 102371 130029 126217 101405 120090
22117 120090 10751 7081 13751 65003 88915 109083 11958 72524 160064 219578 198751 148546
22105 148546 139308 137698 123741 -124 -70561 41149 71309 55054 118037 141846 90491
22094 90491 45851 -2662 30606 51723 61327 22360 77175 -511 -1974 47383 18000 5618
22082E618m5922l8145K609L91j3870R0563P685l2049L195m7150K2429J1626l3082
22069f6102L5002O1131K2763k0044P6854r113m2634K2655O0775J4306l1514j5210
22057A08869r797l1308k7840n6647o4036n242k3797J02862L4198r796p4143p0938
22045a27615J5910K5419J16456J11700j3391j10585p5939K14P570L9588K968O982
22033g23k5769j050k0516n3264k8145J41709L1361q1180K459M2272m3512l738
22021d0096K5404N9858M9928o3393p9431j0293J17605P1590L0927m2295N7250
22010A77054K1831l1070k4652j5813r124m2155n6888p0601N658m771o38l3972
21998h5141L7361K8758J4925R9379r919j11576P4784N1780L1990k845o8932o458
$$ plain form
22082 5618 -40304 -78449 -75840 -75449 -89319 1244 8929 -23120 -19925 -67075 -44646 -33020 -66102
22069 -66102 -31100 30031 52794 32750 109604 100491 57857 80512 141287 155593 124079 108869
22057 108869 99072 67764 39924 -16723 -80759 -86001 -109798 -6936 27262 17466 -56677 -127615
22045 -127615 -111705 -86286 30170 141870 128479 17894 -58045 -57831 -50261 -10673 -7705 -723
22033 -723 -26492 -27542 -48058 -101322 -129467 12242 43603 -37577 -35118 7154 -36358 -40096
22021 -40096 -14692 45166 95094 31701 -47730 -58023 59582 131172 162099 119804 177054
22010 177054 198885 167815 143163 127350 118226 76071 19183 -51418 -45760 -50531 -51169 -85141
21998 -85141 -47780 -19022 -4097 95282 85363 -26213 48571 100351 132341 129496 60564 54106
21986E4106n5389M8297J8789p0922l1960L8523p344J0349N3359j0629j681M9983
21974I5481N3360q9971k5557M4356K6142N7777q3071k9894N3608M2981k6475k2667
21962I6070j7712l3127J3651m7682k1641k1575r355J7029o171L9717K9313M2649
21950H1166L347o3080J079J03194j12810j75387P7994N7036l2628J3000J6936
21939c0153j0442m4069Q056R3320N0841n0945j723n9944p2021J1942R7319k6866
21927c4685J7442n8308Q9493M6479O713n9276n0100j3885J4515L0190K0037L0988
21915C9603l6217n8065m2545M6946j9820m4163L6418N9623R4618M0816n3592M8400
21903A12022R0423o6826q4186K2442J4477L6085P8568k8719j07176l7585j0850
$$ plain form
21986 54106 -1283 47014 65803 -5119 -37079 1444 -5900 4449 57808 47179 45498 95481
21974 95481 148841 58870 33313 77669 103811 161588 78517 48623 102231 145212 118737 96070
21962 96070 78358 45231 58882 11200 -10441 -32016 -41371 -24342 -30513 9204 38517 81166
21950 81166 84513 21433 22512 125706 12896 -162491 -84497 -27461 -60089 -47089 -30153
21939 -30153 -40595 -84664 -76608 16712 67553 16608 14885 -45059 -117080 -105138 -7819 -34685
21927 -34685 -17243 -75551 13942 60421 67134 7858 -42242 -56127 -41612 -11422 8615 39603
21915 39603 3386 -54679 -97224 -50278 -70098 -114261 -77843 -18220 76398 117214 63622 112022
21903 112022 202445 135619 51433 73875 88352 124437 203005 174286 67110 29525 18675
21892A8675K4539L7836m4650o6515Q3405q904r6083p3654Q1508O8242O0366P412
21880I2177J5574p8024K717o1379M83K1786J06935K1795r1802j6038K3589l6233
21868A580q3731K1274Q2223J9722j206p7802K7970l3404K7109O669k9681j3831
21856e3108J9482O0548j0780M1502m4449o5304j3821K7138L7785M6683K8892q6476
21844a1908l5819J941k0223M4796N2351N3965J9933j54708n2373L3453N4892O2297
21832D8597j7859j3720j3741K8691P339N2247J7606m8852p002J7475p518J6438
21820G9701N4736j3530j41273q9774J26459R2666j1440k4874m1845m5718l9383
21809e4275K6962K3967q952L8932q298J8389N8015R5489N1234n923m4220N4887
$$ plain form
21892 18675 43214 81050 36400 -30115 53290 44386 -51697 -125351 -43843 24399 84765 92177
21880 92177 107751 29727 32444 -28935 -28452 -6666 100269 122064 30262 14224 37813 1580
21868 1580 -82151 -60877 21346 41068 39862 -37940 -9970 -43374 -16265 -9596 -39277 -53108
21856 -53108 -33626 26922 16142 57644 13195 -52109 -65930 -38792 -1007 45676 74568 -11908
21844 -11908 -47727 -45786 -66009 -21213 31138 85103 105036 -49672 -102045 -68592 -13700 48597
21832 48597 30738 17018 3277 31968 39307 91554 109160 60308 53306 70781 63263 79701
21820 79701 134437 120907 -20366 -110140 16319 108985 97545 72671 30826 -14892 -54275
21809 -54275 -27313 -3346 -12298 26634 18336 36725 94740 190229 241463 235540 191320 246207
21797B46207M5030J48016J89941O7099J13629J23930J21925k0305j09936j13646
21787H11890j06982j30343m0659n6655q9365j27788l9393j6637p1021k6088L6293
21776A43252K4805k3893k6855J3432m4069o458Q9304K240m2692k0657J8964o1763
21764F5610p0983j3729l8851M4775n515R6324j6536n2495j08572K9095L9102J7279
21752a4496J3553O721n7780m2560L3989m6561L7949J4228L6388m8537p7958O2386
21740h2678R1788O5637n2984k7894O0956N189m7389R196Q2346M2093r3476p0937
21728a8153N5667Q2237j2965l2523k3425o042L2395k5921K624k2826l7105K5940
21716A9903n2699j8447m077O5269m3579j3028j2431M1630O235p182l9179O6464
$$ plain form
21797 246207 291237 439253 629194 696293 809922 933852 1055777 1035472 925536 811890
21787 811890 704908 574565 533906 477251 387886 260098 220705 204068 133047 106959 143252
21776 143252 168057 144164 117309 130741 86672 80214 169518 171758 129066 108409 127373 65610
21764 65610 -5373 -19102 -57953 -13178 -18693 77631 61095 8600 -99972 -70877 -31775 -14496
21752 -14496 -943 5778 -52002 -94562 -60573 -107134 -69185 -54957 -18569 -67106 -145064 -82678
21740 -82678 9110 74747 21763 -6131 54825 60014 12625 21821 104167 146260 52784 -18153
21728 -18153 37514 119751 106786 74263 50838 44796 77191 51270 53894 31068 -6037 19903
21716 19903 -32796 -51243 -55320 9949 -33630 -46658 -59089 -17459 -11224 -18406 -57585 8879
21704H879P2481M5392j50609Q837j7553j9151j3711J7049O4277J04211j7548r1237
21692A1317K8591R11J3233j6779n7955J7645j79L0161N1434K8187j1134J3208
21680A08640J6015m925Q9845m9494j29039n5614l2345K0389K6478Q050L3823l8215
21668f392N9389O5302j0910M703k3165q7404N3599j2381l4670o5936p249K4086
21656d1028R798K3855p4887o8605m230k6733P8293K7714n8729o8262n54N0758
21644a52610J3066K2530j9211L8587J3769K1515K6264Q641k2809Q200M5623J8635
21632B2200l6061K779Q8706N3031j6245m6592K4307j7440p0049o654J8283O4291
21620H0556L250J6836J7842l1048q253q8176o117J20727j5683k4872o316P2768
$$ plain form
21704 8879 81360 126752 -23857 -15020 -32573 -51724 -65435 -48386 15891 120102 102554 11317
21692 11317 39908 40819 54052 37273 -20682 -3037 -3216 26945 78379 106566 95432 108640
21680 108640 124655 119730 209575 160081 31042 -24572 -56917 -36528 -10050 -2000 31823 -6392
21668 -6392 52997 118299 107389 112092 88927 1523 55122 42741 8071 -57865 -65114 -41028
21656 -41028 -31230 -7375 -82262 -150867 -155097 -181830 -103537 -75823 -134552 -202814 -203368 -152610
21644 -152610 -139544 -117014 -136225 -97638 -83869 -62354 -36090 -27449 -50258 -42058 3565 22200
21632 22200 -13861 -11082 77624 130655 114410 67818 92125 74685 4636 -2018 16265 80556
21620 80556 83806 100642 118484 87436 79183 -8993 -15110 105617 89934 65062 58746 131514
21608A31514J2078K4574q2891j12149j4137j4795K3917m478l3782J216k9882J3037
21596h5778N5086N5143J00435p933j23254j02686n849N7088k7492J7093J8766
21585d9381J2433j5190Q793J680N678N4268R5130N0207L1202J2260Q020K4008
21573B39108q0119j69998j14007N6159r43N0820J4833L530p9002l0026m4262k1384
21561a75291R061J6901K5353O2422R985l6649Q11L9753N285K9530N5156o8586
21549b6269J6442N7705o1545k1469M6230m5487m5911m867N7057k2326O8720J2577
21537C0857j9829m9421P1156L5382j9991P7832K3273j7240m7070N8172j8505j05066
21525A9550q8466m4718J08015R2764o9469J9311Q3375J4102l2624q0434j35207
$$ plain form
21608 131514 143592 168166 85275 -26874 -41011 -55806 -31889 -36367 -70149 -68933 -98815 -85778
21596 -85778 -30692 24451 124886 116953 -6301 -108987 -114836 -57748 -85240 -68147 -49381
21585 -49381 -36948 -52138 -43345 -41665 -35987 18281 113411 163618 194820 207080 215100 239108
21573 239108 158989 -11009 -125016 -68857 -69800 -18980 -4147 -617 -79619 -109645 -153907 -175291
21561 -175291 -166230 -149329 -123976 -61554 -51569 -88218 -87407 -47654 -42369 -12839 42317 -26269
21549 -26269 -9827 47878 -13667 -35136 11094 -34393 -80304 -85171 -28114 -50440 18280 30857
21537 30857 11028 -38393 32763 68145 48154 125986 149259 132019 84949 143121 124616 19550
21525 19550 -68916 -113634 -5619 87145 17676 36987 120362 134464 101840 21406 -113801
21514a13801N8488N7502m4835l6108J24582O2521j3909P1l9543p8034p0302L2851
21502f0517K0368O3817O6306O96l6985j517n0133L109P1366L0254M8161O1738
21490B16663q8717j49590j5511P7209K3695k1838K2325j3007p2734Q7148O6866
21479A32509p9350k2237J8196J4699L8453j8541j12339L770M9578k4195M771o8554
21467f3240K4026R5897L6637l8311J4526R7227j1953l3450k6193k1403r4519k2529
21455d3285K3630N6024J05362j0181q0251n3511K2204o723L0011P3752R5826P196
21443B20054j0330P159J3068o8890L6767L8376m2082j33594N7379K3490j10188
21432C1209m469j079o3990Q925M7323K0855k7577n6618K6589O0671k3539p2180
$$ plain form
21514 -113801 -55313 2189 -42646 -78754 45828 108349 94440 94511 54968 -23066 -93368 -60517
21502 -60517 -40149 23668 89974 90670 53685 52168 2035 5144 76510 106764 154925 216663
21490 216663 127946 -21644 -37155 40054 63749 41911 64236 51229 -21505 65643 132509
21479 132509 53159 30922 49118 63817 102270 83729 -28610 -24840 24738 543 5314 -63240
21467 -63240 -39214 56683 93320 55009 69535 166762 154809 121359 95166 73763 -20756 -43285
21455 -43285 -19655 36369 141731 131550 51299 -2212 19992 13269 43280 117032 212858 220054
21443 220054 209724 216883 229951 161061 197828 236204 194122 60528 117907 141397 31209
21432 31209 26740 25661 -38329 -29404 17919 38774 11197 -45421 -18832 41839 18300 -53880
21420e3880L2490N8220N4977L1179m0850k7335k7159n707P8012J7315n3358p635
21408E6269J6892j8883j4930N6711l3084O6669O6704J2901l3105l7975N019L1783
21396A74971M1288K9005q427j525j8074o1255j05836j3729l4735J3701j4628P285
21384H041K7643L9698m3943P9409o344q9382l9721P8896R9745o275q6584j6728
21372D4455j0497J7203J7243P145q124j8151Q1763R8432o170k1974J0702j04210
21360A07817j00065p2753n2224K4824Q6670P3640o94M2625n130l9937K2012K2631
21348A09416j5663L9933o9751m1442K0963J2392R0038J8240L5743m1505k5681
21337A32683k4911k736L5124K2553J9504j7733J9138r814l4466L0624O881j3300
$$ plain form
21420 -53880 -21390 36830 91807 122986 82136 54801 27642 21935 99947 117262 63904 56269
21408 56269 73161 54278 39348 96059 62975 129644 196348 209249 176144 138169 143188 174971
21396 174971 216259 245264 236837 235312 217238 155983 50147 36418 1683 15384 756 8041
21384 8041 35684 75382 31439 110848 104504 15122 -24599 54297 154042 147767 61183 44455
21372 44455 33958 51161 68404 75549 67425 49274 131037 229469 223299 201325 212027 107817
21360 107817 7752 -65001 -117225 -92401 -5731 67909 67215 109840 104710 64773 86785 109416
21348 109416 93753 133686 63935 22493 43456 55848 145886 164126 199869 158364 132683
21337 132683 107772 105036 140160 162713 182217 164484 183622 173808 139342 169966 176847 163547
21325A63547l1903n7449K6288O4989p5029Q2286k0490l5919r1072O1964Q5121
21314A72333Q1948J6692m0830q3037M5885M1475J5897m1761k7245K3024l119Q030
21302B09292J1759J4770q0577k8968P9649R9423k5124q3508k8566m8402K6468
21291A46216J9770j9243N2120L7056n8873M0394j2607J9161L2946K3132K9133
21280C09205K3144q8661M0856J19706J1228j07038n4687n7844m5007L916j3446
21269A41372O6338N6796K3693m3543J7988J6599K1855O4405M518N7172O2152m1110
21257D48235r9436o541N7013O7179J12125J65126J92539J91270J89510J70041
21247A487061P0485n9744j27501j98522j83638j30890r2729J8122K5155N4625
$$ plain form
21325 163547 131644 74195 100483 165472 90443 172729 152239 116320 25248 87212 172333
21314 172333 254281 270973 230143 147106 192991 234466 250363 208602 181357 204381 201262 209292
21302 209292 221051 235821 155244 126276 205925 305348 280224 196716 168150 119748 146216
21291 146216 165986 146743 198863 235919 177046 217440 204833 223994 256940 280072 309205
21280 309205 332349 243688 284544 404250 415478 308440 253753 195909 150902 154818 141372
21269 141372 207710 264506 288199 244656 262644 279243 301098 365503 370021 427193 489345 448235
21257 448235 348799 342258 399271 466450 578575 743701 936240 1127510 1317020 1487061
21247 1487061 1557546 1497802 1370301 1171779 988141 857251 764522 782644 807799 862424
21237H62424K5580M7117L3060l302P8945K82074K23305K22941K34387Q3287m5128
21226B044690j43456k25938j04455n9298j98887q0332m1965p4637J4249J6046
21216A146017k8030n7008K5323J23251m0606n7135K7233k1647k1018l7911O0784
21205A119253Q9358R2136P0510M9263r647O6003N4085j4193O1487J31005K10892
21194A920152J91586J69937K20335J18661R5944o4723j58481r7348R7381R4245
21184B587689J24300K07778J82347K59168K56634L41515L55238L25879M21915
21175E062463K23109N7043Q7934J9331N9108J85380K28681L21983M67437N84138
21165G296607P42169Q67887J213788J386996J744876K267738K900326L787309
$$ plain form
21237 862424 888004 935121 968181 964879 1043824 1325898 1549203 1772144 2006531 2089818 2044690
21226 2044690 1901234 1675296 1570841 1511543 1312656 1232324 1190359 1115722 1129971 1146017
21216 1146017 1117987 1060979 1086302 1209553 1168947 1111812 1139045 1117398 1096380 1058469 1119253
21205 1119253 1208611 1300747 1371257 1420520 1410873 1476876 1530961 1516768 1578255 1709260 1920152
21194 1920152 2111738 2281675 2502010 2620671 2716615 2651892 2493411 2396063 2493444 2587689
21184 2587689 2711989 2919767 3102114 3361282 3617916 3959431 4314669 4640548 5062463
21175 5062463 5285572 5342615 5430549 5449880 5508988 5694368 5923049 6245032 6712469 7296607
21165 7296607 8038776 8906663 10120451 11507447 13252323 15520061 18420387 22207696
21157B2207696M831017O131975P976135J0316668J3174242J6739229K0833612
21150A02210574K5075448K7718500K5393376J5481537o23516j6604488k6104618
21143A52546813k7774844k4668332j9670869j5044306j1382317q622772o696959
21136C8686414n096241m032250l137252k507620k048483j693443j467880j214302
21128A7488943r47040p89711o89319o62782n36863l50319j76825k37164p3636
21119A3025284N3973N2858r6775l01597l85952l63404l49204k82502k29937k29756
21109A0892988k78220l93576m66056l93552l44587m34056l35635k06986j97812
21100G842508j96267l87390m37688l39977m50318m11653m11371m48532k82956
$$ plain form
21157 22207696 27038713 33170688 41146823 51463491 64637733 81376962 102210574
21150 102210574 127286022 155004522 180397898 195879435 195255919 178651431 152546813
21143 152546813 124771969 100103637 80432768 65388462 54006145 45383373 38686414
21136 38686414 33590173 29557923 26420671 23913051 21864568 20171125 18703245 17488943
21128 17488943 16541903 15752192 15062873 14400091 13863228 13512909 13336084 13098920 13025284
21119 13025284 13079257 13132115 13035340 12733743 12347791 11984387 11635183 11352681 11122744 10892988
21109 10892988 10614768 10221192 9755136 9361584 9016997 8582941 8247306 8040320 7842508
21100 7842508 7646241 7258851 6821163 6481186 6030868 5619215 5207844 4759312 4476356
21091D476356k60328j95904j31507j56558j52838j71392j79402j26158j60426
21082B941843j53362j06811j63034j86745j69642n1547J5498p3222q1943j38923
21072A832112o5587p1427k5356K19j206p0978p1160r9092l4803n3742j36709o4864
21060A137407L1803L2838j08832n6463K5732k8155k6346r4349j16237n2645Q69
21049G45622j7578K5650K0338n3116l5621J2550J0982j06009j28087k4550P4244
21038E24425P3018k0035P7070J8531o1538n1089k6349m2217N6561O9780P5062
21027F93219O1852P5239M2832k6731m0106m5562J141o5983j39497j62160r1158
21016C03086m940L5024m0314j1310J8113K4269K483j31545j7841n2331J9783J08997
$$ plain form
21091 4476356 4216028 4020124 3888617 3732059 3579221 3407829 3228427 3102269 2941843
21082 2941843 2788481 2681670 2518636 2331891 2162249 2110702 2126200 2052978 1971035 1832112
21072 1832112 1766525 1695098 1669742 1669961 1668755 1597777 1526617 1427525 1392722 1338980 1202271 1137407
21060 1137407 1169210 1202048 1093216 1036753 1062485 1034330 1007984 913635 797398 744753 745622
21049 745622 728044 753694 774032 720916 685295 697845 708827 602818 474731 450181 524425
21038 524425 597443 577408 654478 673009 611471 560382 534033 491816 548377 618157 693219
21027 693219 755071 830310 873142 846411 806305 760743 761884 695901 556404 394244 303086
21016 303086 298146 333170 292856 281546 299659 323928 326411 194866 177025 124694 144477 253474
21004B53474N4087k5087o7914l7566j11655o4178N2871L1362R5756m54l8439k6105
20992A16152J16700j1437j1097Q343j6581L3169M7292N1173M91L1215K6028l5985
20980C55463p9550J501m5502m8786L2754K4570m1881o702M1435R446J5067m9182
20968B08633P440m215m6072J2161J40586R9185O0133o2813j09228M107L1544J1587
20956C53048m5294j3791L716l3366r4000L2996N8882K0251J4192K0600k9971n779
20944B81484j7123K1297j9311m0832k7940L585K6895m7256J3489J9890Q554k929
20932B19803J5438N7638Q1245Q352M7808O4387N640J9210L1111L3371M4995n966
20920F23032J0369k2971o6627j00674j9017K1866l5795o2756o5216p2691k784
$$ plain form
21004 253474 307561 282474 214560 176994 65339 1161 54032 85394 181150 180696 142257 116152
20992 116152 232852 221415 210318 218661 202080 235249 282541 333714 334205 365420 391448 355463
20980 355463 275913 277414 231912 183126 215880 240450 198569 191867 233302 242748 257815 208633
20968 208633 216073 211858 165786 177947 318533 417718 477851 415038 305810 309917 341461 353048
20956 353048 307754 293963 297679 264313 170313 203309 262191 282442 296634 317234 287263 281484
20944 281484 264361 285658 266347 225515 197575 201160 228055 180799 194288 214178 222732 219803
20932 219803 235241 292879 374124 382476 430284 494671 500311 519521 550632 584003 628998 623032
20920 623032 633401 610430 543803 443129 424112 445978 410183 347427 282211 209520 206736
20909B06736l8032P2135O8153l4092l9597K0562n4691l114p6408n4494m0456M0540
20897F7242J32810J4341J8249K9552o747J3919n1744l6899N4750k6523M0833P0440
20885C20223o4142n3270l4331q639p6422N8857J39829J2740l959m9239m8424p8165
20873A15058N1848R4554K1096j0739m5477k7518M0399Q6312p4890p4202O5784
20862B42225Q3564o849k8462m2261q3723l7866J4132K0908m527O8757J10572m592
20850C31878m7864j2794P3609L421p9582K1197j2021l2259L5874N5719M9687l2946
20838C53919j22185m6997P7094O4111m6062L469J3041m9418k6503K8509Q7013
20827C35991J5313p9875L8139Q6901L4743m2082q3029r3557p922O8703R401l6191
$$ plain form
20909 206736 168704 240839 308992 274900 235303 255865 201174 198060 121652 67158 26702 67242
20897 67242 200052 214393 232642 262194 255447 269366 217622 180723 235473 208950 249783 320223
20885 320223 256081 202811 168480 159841 83419 142276 282105 294845 290886 241647 193223 115058
20873 115058 166906 261460 282556 271817 226340 198822 239221 325533 250643 176441 242225
20862 242225 325789 318940 290478 248217 164494 126628 140760 161668 157141 225898 336470 331878
20850 331878 284014 271220 344829 348250 268668 289865 277844 245585 281459 337178 386865 353919
20838 353919 231734 184737 261831 325942 279880 283349 296390 246972 220469 248978 335991
20827 335991 351304 271429 309568 396469 431212 389130 306101 212544 204622 273325 282726 246535
20815B46535p975K5794M800N504K4395M9494m1719m2468M1586L2182R8318M2816
20803D79262j09172m5352J36483P1996j7196m5198K0161K9693L9142p0389n6406
20792D33024j2609p5150n2445p1703n1862L790R8256N658k0477P6380j8997J5423
20780C29288j8439m0558K8125K9162K1594P1376l4834K6968R0951K4795l9657
20769D88771p9523M7032O2114Q9607K5808q5570M7494O0430m8104j9155L4665
20758F23569K8865L5869J5576M2839J21429J07899L1896Q173j1036K5565M4119
20747A074763R0809L2722J02819J33266K5593q9129q6513O1642o6863l9079K9889
20736A269919J18271P3528Q8295k2154m4375J3513R7304J06949K8778l4324K9926
$$ plain form
20815 246535 238560 264354 269154 274658 299053 348547 306828 264360 305946 338128 436446 479262
20803 479262 370090 324738 461221 533217 516021 470823 490984 520677 559819 489430 433024
20792 433024 420415 345265 292820 221117 169255 173045 271301 276959 256482 332862 313865 329288
20780 329288 310849 270291 298416 327578 349172 420548 385714 412682 503633 528428 488771
20769 488771 409248 456280 518394 608001 633809 548239 595733 656163 608059 588904 623569
20758 623569 652434 688303 703879 746718 868147 976046 1007942 1016115 1005079 1030644 1074763
20747 1074763 1165572 1198294 1301113 1434379 1459972 1370843 1284330 1345972 1279109 1240030 1269919
20736 1269919 1388190 1461718 1550013 1527859 1483484 1496997 1594301 1701250 1730028 1695704 1725630
20725A725630L8490K0372N80m1068l5602L6059J03508J21227J92720J71147J68895
20714B501958O1077J51146J23479J24575J66733J09032M9630K15423K38403M07171
20704D148627M54454N44212N42586M17327J42434j4772O1903K34999L50195N92991
20694G474956Q24268P69242O55976O77112O37505R03896J021829R09763Q37502
20685A4712049J026526J560916K241228L221905M385863O143064Q346992J1126889
20677E2765432J5029619K0141746K6620619L4766723M6104111O3258012Q5712674
20670C44398936R7889145O9503469j173950p0966510r8134867q6674005o3196606
20663A91645612m3416430l0077572k1671618j6121794j2274729r416372p075288
$$ plain form
20725 1725630 1764120 1784492 1785072 1744004 1708402 1744461 1847969 1969196 2161916 2333063 2501958
20714 2501958 2563035 2714181 2837660 2962235 3128968 3238000 3287630 3503053 3741456 4148627
20704 4148627 4603081 5147293 5689879 6107206 6249640 6234868 6296771 6531770 6881965 7474956
20694 7474956 8299224 9068466 9724442 10401554 11039059 11942955 12964784 13874547 14712049
20685 14712049 15738575 17299491 19540719 22762624 27148487 33291551 41638543 52765432
20677 52765432 67795051 87936797 114557416 149324139 195428250 258686262 344398936
20670 344398936 442288081 511791550 510617600 439651090 341516223 254842218 191645612
20663 191645612 148229182 118151610 96479992 80358198 68083469 58667097 51591809
20656E1591809n304523m052747l264473k621987k016617j507276j034345p38299
20648C1051542n63924p51950j058763j182140j065920r23641q23154p03031n83721
20639B3395298l52827p7022J72074J98660P3516k53479l83283o06121q43440r66110
20629B0357266j023283j132022j053977r66389q70602p94244p84341p77501p40623
20620A2214284p17781o68971m75901m52954m86323o23147m63426m47424l19049
20611G559308k47834l47029l83521m15069k57779k21536k80363k41433k03025
20602D961719k41948k05428j95351j75255k15819j58038j29334j13435k23589
20593C303522k63509j97756j09707r1899r4245j7580r1143j87919r8162m2238
$$ plain form
20656 51591809 46287286 42234539 38970066 36348079 34331462 32824186 31789841 31051542
20648 31051542 30487618 29735668 28676905 27494765 26428845 25505204 24682050 23979019 23395298
20639 23395298 23042471 22965449 23137523 23336183 23409699 23156220 22772937 22166816 21323376 20357266
20629 20357266 19333983 18201961 17147984 16181595 15310993 14516749 13732408 12954907 12214284
20620 12214284 11496503 10827532 10351631 9898677 9412354 8789207 8325781 7878357 7559308
20611 7559308 7311474 6964445 6580924 6165855 5908076 5686540 5406177 5164744 4961719
20602 4961719 4719771 4514343 4318992 4143737 3927918 3769880 3640546 3527111 3303522
20593 3303522 3040013 2842257 2732550 2640651 2546406 2528826 2437683 2249764 2151602 2109364
20583B109364l7286J8926j16619j22443r7799j8738m4806n2324P27j04991j33986
20572A400025q1841m8876l4246j26056j4639j0703j11279j04375k8622m6302n1424
20561G41662N1994m405k6916K6732J3812O0098J5351m2707o3104K0732J21681
20550I14930n997P0229J88925O7143J08210N6821O1750m1128j19446j96617j21503
20539I83317m2359o9361j15517j68161k9747j346l8827r3632n5894j5980P265
20528C59758l0049J3727P8468o287n6352k1177P9952m9577m2921k5943m1293m952
20516B53354K4574J0176m9060L1284J0509N5282O6600m4029J0795K7554k1028
20505C76011M2917P866P6609P8269M7982J11389R3804Q0935J07061J57908J07030
$$ plain form
20583 2109364 2072078 2091004 1974385 1851942 1754143 1735405 1690599 1638275 1639002 1534011 1400025
20572 1400025 1318184 1269308 1235062 1109006 1094367 1083664 972385 868010 839388 793086 741662
20561 741662 793656 789251 762335 789067 802879 862977 878328 835621 772517 793249 914930
20550 914930 908933 979162 1168087 1235230 1343440 1400261 1462011 1420883 1301437 1104820 983317
20539 983317 940958 871597 756080 587919 558172 556826 517999 424367 368473 352493 359758
20528 359758 329709 343436 421904 415617 359265 338088 418040 368463 325542 299599 258306 253354
20516 253354 277928 288104 239044 270328 280837 336119 402719 358690 369485 397039 376011
20505 376011 418928 426794 503403 581672 629654 741043 834847 915782 1022843 1180751 1287781
20494A287781j9451j39940r5327m6400r9416n9524n7050p6157l4538q0938k2490
20483E56550R1928J1949j12767j30839j7776J06558L483n022p0747j2915J3657
20472D34059J9069j1239n8757o943O8375L4953l0366l1661k3302j522m848J01675
20460D89493J18838k967j28463m8749o2186r3018o20l9022m7449N9280J05710
20449C50847J8056q7758k9438m3204L4421k8004R125R4095p4852k1740O7519K8899
20437C17966J2972k7625j1974p879o8304l2873L659L2079J0911j667j9642l0265
20425A77358m5738j5656j5939k2562o4469o181J10096L1551N1038J52653N8178
20414D10329R52r6057l8945n040q6074j6931j1361p9385p258N9028O4288n1005
$$ plain form
20494 1287781 1268330 1128390 1033063 986663 887247 827723 770673 694516 659978 579040 556550
20483 556550 648478 660427 547660 416821 399045 505603 509086 504064 433317 420402 434059
20472 434059 453128 441889 383132 376189 444564 479517 449151 417490 394188 392666 387818 489493
20460 489493 608331 605364 476901 428152 365966 272948 272328 233306 185857 245137 350847
20449 350847 368903 281145 251707 208503 242924 214920 224045 318140 243288 221548 289067 317966
20437 317966 330938 303313 291339 283460 215156 182283 185942 218021 228932 227265 207623 177358
20425 177358 131620 115964 100025 77463 12994 6813 116909 148460 199498 352151 410329
20414 410329 411281 315224 276279 271239 185165 168234 156873 77488 70230 129258 193546 142541
20402A42541r468J5368L1340M7645K340o2925N8777L8581p4891j27733j16462
20391e4887M1474J30243P339L1053j3635j34845r6685N1806L1263l6534n8421
20380a01829J2900J06369J0885O376L5657o6961l1693l4383o7990P1603R9973
20369D0907M7380q9091m7090J9456P1492O5309n7583N4173J0728l587Q884m7202
20357G3776P9670P656l5003k7186q165l3228K5713k4089l3120L8282j5489K2164
20345G0981J3722J1096j3558J01024O7470J5948r4632m7429J5029Q7709q81k6408
20333B00071J1545Q7971M7889r0033q2390q663N1385p5795j10625j3255M3914
20322F2014K8703m2442j496r223L3888M9823K9672j7649r0460l1209N4199j3558
$$ plain form
20402 142541 133073 148441 179781 227426 229766 166841 225618 264199 189308 61575 -54887
20391 -54887 -13413 116830 124169 155222 141587 6742 -89943 -38137 -6874 -43408 -101829
20380 -101829 -88929 17440 28325 34701 70358 3397 -28296 -62679 -130669 -59066 40907
20369 40907 88287 -804 -47894 -28438 43054 108363 50780 104953 115681 112094 120978 73776
20357 73776 153446 161102 126099 98913 90748 57520 83233 59144 26024 64306 48817 70981
20345 70981 84703 95799 82241 183265 250735 266683 172051 124622 139651 227360 226479 200071
20333 200071 211616 299587 347476 257443 175053 166390 217775 141980 31355 18100 62014
20322 62014 90717 48275 46779 37556 71444 121267 150939 133290 42830 11621 65820 52262
20310E2262K4106j7774N869p967m7226K6388J77703K9614q5263n3745k0700k0987
20298F2280J2355K3495o8322k0826M8215k8612k2003K3965Q2114Q5336j9177l1035
20286A47785j52399o2957N1847L0674o4714O2992K487n6279n2970K8444o311o2853
20274a34254L4343N9676M2673o13q859N7769n7762k4068N0595l6069M696P0656
20262E8783j2841q5311N766M3041k5487J1605L3202o2991K3279j9934j964O4734
20250C1882o4648j8443n2483n4339J6724J40419J11097m9631n6840r022P0503
20239F5219K2681J5356m7199O3193k5138q4918m8997J2771j9998J8852L3571M8356
20227E3749L3999m1588M6690q6418j29289K3748N3016K3347L1083j3934q4200
$$ plain form
20310 52262 76368 58594 64463 56496 9270 35658 213361 242975 157712 103967 83267 62280
20298 62280 74635 98130 29808 8982 57197 28585 6582 30547 112661 197997 178820 147785
20286 147785 -4614 -67571 -15724 14950 -49764 13228 15715 -40564 -93534 -65090 -71401 -134254
20274 -134254 -99911 -40235 2438 1825 -7034 50735 -7027 -31095 19500 -16569 -11873 58783
20262 58783 45942 -39369 -33603 9438 -16049 -4444 28758 -34233 -10954 -30888 -32852 31882
20250 31882 -32766 -51209 -103692 -158031 -141307 -888 110209 60578 3738 -5284 65219
20239 65219 87900 103256 56057 119250 94112 9194 -39803 -27032 -47030 -28178 5393 53749
20227 53749 87748 46160 92850 6432 -122857 -99109 -46093 -22746 8337 -5597 -89797
20216h9797p5235O9352M2284n6553n404Q9130P7936o3907l7449N5846J35960O9988
20204B12151m6228o8028J0395l3489m9805m9905J8649p150m1221J04694J29762
20193A79825l3122k0833Q7697J2450n4631m6079n6717q873J3360o8043j8075J4163
20181A122k5029K3907P206J0687M9762l4922J3411K142M6552N7068j5490j24880
20169A1536j03354m9188Q256L2883O6998j6997N8377J5684l5224J2443K2429n0471
20157b6628J7439n8077K3485K0073L1788m0973K0157N4618K6932L597k4094K5744
20145G4061j32865j24655N1337M8797J6077K6651J9074K0764O2461J1457P605
20134H0764J9114N0112J5300m0222n933N6776n7194m7956j5244K6675m5865O8075
$$ plain form
20216 -89797 -165032 -95680 -53396 -109949 -115353 -26223 51713 -12194 -49643 6203 142163 212151
20204 212151 165923 97895 108290 74801 24996 -24909 -6260 -13410 -54631 50063 179825
20193 179825 146703 125870 213567 226017 171386 125307 68590 59717 73077 5034 -13041 1122
20181 1122 -23907 0 7206 17893 67655 32733 46144 48286 94838 151906 136416 11536
20169 11536 -91818 -141006 -132750 -99867 -32869 -49866 8511 24195 -11029 1414 23843 -26628
20157 -26628 -9189 -67266 -43781 -23708 8080 -32893 -12736 41882 68814 72411 48317 74061
20145 74061 -58804 -183459 -132122 -83325 -67248 -40597 -21523 -759 61702 73159 80764
20134 80764 99878 149990 165290 125068 119135 175911 118717 70761 55517 82192 36327 104402
20122A04402m082m0972o8686N8961M8069L2107k399K153K4988L8315k8564J11515
20110B75807N0353N8815q172J06174J30668J01262J96161K48768P9662J0187j20990
20099A128695k05525j46591j76053j18919j18420o1326J1190J209J17766J43558
20089E75584Q514m3815J23110J33561J23658J61272J05812P0667r1026j34825
20079A032512k09028j77260j55507j46110n4087m3286r7638n9849M2379N5612
20069A87738k5805l4311M2887O6821j20070l9654M5998R35j2099l2479j02011
20058b2050K7340M4374K0693L5565O0110k6951r2056j25586k7116k842O3017N0828
20046E326L7052L8860K9336l1540l9697r5051j8374L1259R3917O1454J1853p9189
$$ plain form
20122 104402 100320 59348 -9338 49623 97692 129799 127400 129553 154541 192856 164292 275807
20110 275807 326160 384975 376803 482977 613645 714907 911068 1159836 1239498 1249685 1128695
20099 1128695 923170 776579 600526 481607 363187 301861 313051 314260 432026 575584
20089 575584 584098 540283 663393 796954 920612 1081884 1187696 1258363 1167337 1032512
20079 1032512 823484 646224 490717 344607 290520 247234 149596 89747 132126 187738
20069 187738 161933 127622 170509 237330 117260 77606 123604 124539 112440 79961 -22050
20058 -22050 5290 49664 70357 105922 166032 139081 47025 -78561 -105677 -108519 -45502 5326
20046 5326 42378 81238 110574 79034 39337 -55714 -74088 -42829 51088 112542 124395 45206
20034D5206K4165k3955n7118J3252k4904m265K5306J07938N5959n2878q9063P9218
20022I8861j5233m9738L4465l0621n5151k1333n51N2341r613k9585P412J9768
20010A022J3356m6890q9763N4255O9991j8283m6988k2745Q46K5857P2819K2587
19998C6064n1376j5549R993J5541l4190M7805l1995m1875q895P0071J00800j0381
19986H6013k5980j13217P401k8704K1779r716p91O842N3185J175J5002l4759k8008
19973d9778N6612K7548k013L2689M759m9522r2609p0114L4591N0488Q4609J9957
19961D7217l0863J9063M7531m559l7166o5097M7699M8347n6231r3285o355N0511
19949c3188j7501O4024K0144O2301p781j1136p0449n0517o1686L5450N3304J22162
$$ plain form
20034 45206 69371 45416 -11702 1550 -23354 -27619 -2313 105625 161584 108706 19643 98861
20022 98861 83628 33890 68355 37734 -17417 -38750 -39301 13040 3427 -26158 -18746 1022
20010 1022 14378 -32512 -122275 -68020 1971 -16312 -63300 -86045 -85199 -59342 13477 36064
19998 36064 -15312 -30861 -20868 -5327 -39517 8288 -23707 -65582 -74477 -4406 96394 86013
19986 86013 60033 -53184 -45783 -74487 -52708 -62424 -63215 -56373 -3188 -2013 12989 -21770 -49778
19973 -49778 6834 34382 32369 65058 69817 20295 -72314 -142428 -107837 -57349 27260 47217
19961 47217 16354 35417 82948 78389 41223 -23874 23825 72172 15941 -77344 -83699 -33188
19949 -33188 -50689 13335 33479 95780 87999 76863 6414 -44103 -105789 -70339 -17035 105127
19937A05127L1465l4397P32j1794Q435k8015j21017j9323P1819N1236N2183j3411
19925I3040r368N7637l6280p3046O312l8609m7071n523m3200l4844n4368m4794
19913b30114L2089R2051N8805K7201L4357Q0101n305o1256k2766Q775M6360M1689
19901A01987l1945M9881L3279j52077r0129R6260O7249J8809k0937j0190o9035
19890f848M6016L4840q8643o3649l8142J0439J4774R8629k9763J7248J083j02473
19878a06489m1964k093J3885l5191n0977R6749R5925j6496n1841N7131M0112r347
19866a0596j8075N8504M1994j6001k9357J828m0660k0463K6406N1566J2814J2817
19854G0777l8007J2529p4206m0546M3226l8458p9570j9572M7631J34413l2916
$$ plain form
19937 105127 136592 102195 102927 91133 99568 71553 -49464 -68787 3032 54268 106451 93040
19925 93040 83672 141309 105029 31983 38295 -314 -47385 -52908 -96108 -130952 -185320 -230114
19913 -230114 -198025 -105974 -47169 -19968 14389 94490 89185 27929 5163 13938 60298 101987
19901 101987 70042 119923 153202 1125 -89004 7256 74505 93314 72377 62187 -6848
19890 -6848 39168 74008 -14635 -78284 -116426 -105987 -91213 7416 -22347 -5099 -4016 -106489
19878 -106489 -148453 -150546 -136661 -171852 -222829 -126080 -30155 -46651 -98492 -41361 -1249 -10596
19866 -10596 -28671 29833 71827 55826 26469 28297 -12363 -32826 -6420 45146 57960 70777
19854 70777 32770 45299 -28907 -69453 -26227 -64685 -144255 -163827 -116196 18217 -14699
19843a4699j8220R590m4330L8581L3879p7373o4717K4312L2733J10507R7111m4997
19831H2377m4413p5071o2816k2637Q2385N1172M8960o2580q3100j01780O5476
19820a22027J00665N5339L0420L5590l9447n8486L9528K6991K601o9118M53K3051
19808B5560M9891M038l0599k3387K0814k4427J853K5492N7260n5482j11846k6521
19796h7354k5561K5933o675N4069L4357J20371J5569k2064l6222n3672M5447J8958
19784H3156n7605j40977l1197N7061l1063q8278R3550Q9761n5588P8737R4835
19773I2392r6417l5309J4292L571m4581Q2787j236q1756j2751J6736J2735L5506
19761a4031j07778o9081M9449M6933K2564O1634l8010K0312N7838j2082m4183
$$ plain form
19843 -14699 -32919 -23329 -67659 -29078 4801 -72572 -137289 -112977 -80244 30263 127374 82377
19831 82377 37964 -37107 -99923 -122560 -40175 10997 59957 -2623 -85723 -187503 -122027
19820 -122027 -21362 33977 64397 99987 60540 2054 41582 68573 71174 2056 2509 25560
19808 25560 75451 79489 48890 25503 46317 21890 23743 49235 106495 51013 -60833 -87354
19796 -87354 -112915 -86982 -93657 -39588 -5231 115140 130709 108645 72423 18751 64198 83156
19784 83156 25551 -115426 -146623 -89562 -120625 -208903 -115353 -25592 -81180 -2443 92392
19773 92392 -4025 -39334 -25042 -21471 -66052 16735 15499 -66257 -79008 -62272 -49537 -14031
19761 -14031 -121809 -190890 -141441 -94508 -71944 -10310 -48320 -28008 29830 17748 -26435
19750b6435m7344O3172M1513M838k0033K3781k1835k7057N623J2456R277q051
19738I905k5103l2832K8776M4320L6657J0447J3582N4698K1150j02011O349P0724
19726A36662K7542j24209R332Q5482l4797l1081q7831N2989L0656o3116o7915
19715f6286J169l2448M6548J07096M0147l2798o6538j2276l8054K9994j4908q9154
19703a27508q1787M7338K9366M708m8451J7890k5276J17613Q3907K5273o845j854
19691C4374n8133J7689P345L9438O5531o3912m8717k3927J4760K9140r8875l2235
19679a17522Q3264J5556n4609R4321N6288j9539K1547J1204n779n6567n6239j03986
19667a32061J386Q6108N4391k1605l6870l4414l4675O0033O6719K2273J6429j0912
$$ plain form
19750 -26435 -73779 -10607 30906 35744 15711 39492 17657 -9400 -3777 8679 17956 9905
19738 9905 -15198 -48030 -19254 25066 61723 72170 85752 140450 161600 59589 65938 136662
19726 136662 164204 39995 49327 134809 100012 68931 -18900 34089 64745 1629 -66286
19715 -66286 -65117 -97565 -51017 56079 96226 63428 -3110 -15386 -53440 -23446 -38354 -127508
19703 -127508 -209295 -161957 -132591 -127883 -176334 -158444 -183720 -66107 17800 43073 36228 34374
19691 34374 -23759 -6070 1275 40713 106244 42332 -6385 -30312 -15552 13588 -85287 -117522
19679 -117522 -34258 -18702 -73311 21010 77298 57759 79306 90510 84731 28164 -28075 -132061
19667 -132061 -130675 -44567 9824 -11781 -48651 -83065 -117740 -57707 9012 31285 47714 36802
19655C6802q4020J38129O486l5394o2422j4205j9517l6456m5965L0043Q784l8262
19643a15997K766k6427O4241N4493Q6215L824k9186k9392n2665n9080L80m1617
19631a42445L0002O7418L5026O6786k3683j460L8940k5148k3583N7555p496n6953
19619A4959J2802n40K1151n4625n4771P1764K4050P820K1910k5318o1676J077
19607b1397n1924r7198j4715J9765J8921R9869L4093J2526l2165l1522l7795j0941
19595a12483l4861N3440N1226l0913p3173L00J5606l3924N7476O7505L2256L6074
19583B8529K3307j02670l2485N5447L3367o2673J954P588n763l5897m7273R1792
19571d4777L0630j00055J9434O6861K3043N0724Q177j8719N1194k6928m9221n439
$$ plain form
19655 36802 -47218 90911 97397 62003 -419 -14624 -34141 -70597 -116562 -86519 -77735 -115997
19643 -115997 -113231 -139658 -75417 -20924 65291 69115 39929 10537 -42128 -101208 -100828 -142445
19631 -142445 -112443 -45025 -9999 56787 33104 31644 70584 45436 21853 79408 71912 14959
19619 14959 27761 27221 48372 -6253 -61024 10740 34790 42610 64520 39202 -22474 -21397
19607 -21397 -73321 -170519 -185234 -165469 -146548 -46679 -12586 -60 -32225 -63747 -101542 -112483
19595 -112483 -147344 -93904 -42678 -73591 -146764 -146464 -130858 -164782 -107306 -39801 -7545 28529
19583 28529 51836 -50834 -83319 -27872 5495 -57178 -55224 -47636 -53399 -89296 -136569 -44777
19571 -44777 -14147 -114202 -94768 -27907 -4864 45860 54037 35318 86512 59584 10363 4924
19559D924l7592R291O39k3678M4061l4332o8696n9476M2912l3789m6795k2947
19547b25478N729Q5665l721K228m472k1936M4508N102O9327o7156n3237M6114
19535a17327L0700k7731O6527M6577j7660m1077J3434P8589q257j9856j8108m7233
19523f1422L5734N6689N0226M606p0573r0263j0922p3099j1506q1161N0864J13773
19511h7054O3321n488j1287M2272N910Q177N6085K9185j9748k6816o847J446n0332
19498a176K0831J4898p7078o8638o1722J8882J41131P8814n5901j38431p7830
19487b06220J27313Q9377K5918n5933K8051J7753k9147M057L8045O4546j2319
19476I1441j05927m6295J09960N292o3849r1026n3695K0706R7439L8475L3015
$$ plain form
19559 4924 -32668 -23377 -22738 -46416 -2355 -36687 -105383 -164859 -121947 -155736 -202531 -225478
19547 -225478 -219749 -134084 -137805 -135577 -140049 -161985 -117477 -112375 -43048 -110204 -163441 -117327
19535 -117327 -86627 -114358 -47831 -1254 -18914 -59991 -46557 32032 23775 3919 -14189 -61422
19523 -61422 -25688 31001 81227 85833 15260 -75003 -85925 -159024 -170530 -251691 -200827 -87054
19511 -87054 -23733 -29221 -40508 1764 7674 15851 71936 101121 81373 54557 47710 49156 -1176
19498 -1176 19655 34553 -42525 -111163 -172885 -154003 -12872 65942 10041 -128390 -206220
19487 -206220 -78907 10470 36388 -19545 8506 26259 -2888 1169 39214 103760 91441
19476 91441 -14486 -60781 49179 54471 -9378 -100404 -154099 -133393 -35954 2521 35536
19465C5536Q494o671k2776j9767J5304J4833L327Q380q109R226j5750l1379K0657
19452A1305J8225j2859n5314r3882l6737J1964O9216J08007J1645m8333l4669
19441e1432o1939M9276K3116m8749J6919R755p2010n1644J9812K960R8336M6075
19429a9525K3148K3181Q91m5754j03175l9257k992L604K6194N4199N1102Q0475
19417E2091o7935r3927L7584N0168M7074q935j4384r330R4266Q925r0510j09333
19405a04246K9921Q7518M4716l7645j3948j18185K13O549l5431p3518O4391P5369
19393g4296N0507N3703m1542M8291K2139o516o3585j03575m3429O4335O4412L1913
19381B357J0711l661p0657k9842j5149L9333J19752K0644k1089q4361n2326M3637
$$ plain form
19465 35536 44030 37359 14583 -5184 10120 24953 28280 36660 28551 37777 22027 -9352 11305
19452 11305 29530 16671 -38643 -132525 -169262 -157298 -88082 19925 31570 -16763 -51432
19441 -51432 -113371 -64095 -40979 -89728 -72809 -63054 -135064 -186708 -166896 -163936 -65600 -19525
19429 -19525 3623 26804 27695 -18059 -121234 -160491 -163483 -159879 -133685 -79486 -28384 52091
19417 52091 -15844 -109771 -72187 -22019 25055 16120 1736 -7594 86672 95597 5087 -104246
19405 -104246 -74325 13193 57909 20264 6316 -111869 -111656 -105107 -140538 -214056 -149665 -74296
19393 -74296 -23789 29914 -11628 36663 58802 52286 -11299 -114874 -158303 -93968 -29556 2357
19381 2357 13068 9407 -61250 -91092 -106241 -66908 52844 73488 52399 -31962 -84288 -40651
19369d0651j3531m2165J2835J982L678K8321l4210J0977m3057m2071M8694L5894
19357g3304k0391J3657L1386J7005M8382M5855N0061j2144J8689J4117o2987k0673
19345D9653p1815j0636K9039K6885n0118k8511j433L7610J02528Q2039q8094r1419
19333a4272l2947j2399J8874O4557K6377j3623J63N7940J4743l9707O6790N7190
19321A93686l2613K4768l5150n5559K693K9429m723J9381M6535m5135o4253P9361
19309A58420n8086l3005o7108J8847M403M0970J5213l2176n4074n799k9963l9455
19297h1813m8676N2303O1116m8500L932N5591l2515k935Q1408p1784o2002M2571
19285e1304P322K9709k7236M5843K7040r668o982n2164J0669J5159l7635l1656
$$ plain form
19369 -40651 -54182 -96347 -83512 -81530 -77852 -49531 -83741 -72764 -115821 -157892 -109198 -73304
19357 -73304 -93695 -80038 -48652 -31647 16735 62590 112651 100507 119196 133313 70326 49653
19345 49653 -22162 -32798 -3759 23126 -26992 -55503 -56936 -19326 83202 165241 77147 -14272
19333 -14272 -47219 -59618 -40744 23813 50190 36567 36730 94670 109413 69706 136496 193686
19321 193686 161073 185841 150691 95132 97825 127254 122531 141912 188447 143312 79059 158420
19309 158420 100334 67329 221 19068 23471 64441 79654 47478 -6596 -12395 -42358 -81813
19297 -81813 -130489 -78186 -17070 -65570 -61638 -6047 -38562 -41497 39911 -31873 -93875 -51304
19285 -51304 -43982 -14273 -41509 4334 31374 21706 14724 -37440 -26771 -11612 -49247 -80903
19273h0903K8307N9129O4091N6320o25n9655q8718n5246R6628O0711J889l6823
19261D5105j5041N0596R1050k0351k5916n8402Q076J8591o2496q5576Q2001N213
19249C2850k2254l8855P5070J20794J3034m6094k3343m4231k6091P9503l9726
19238H0657n6150L5635k9008K1809M6762l0285L5393Q380j5382l4678J2963r4895
19226a8799o2949p5886M7760J21305N3048L1798P016j0900o934m2700k561m1019
19214h21n3055M5339O369M1028L9129j2598j4673q668K9654o4880j03210K3578
19202g2808r592M244P0505k1515l9673M220M0471k986J9666R4689N3449l5093
19190A05577l8781p52J6707L6023l0795K5332K048m9033L9853K0616n1404K2506
$$ plain form
19273 -80903 -52596 6533 70624 126944 126319 66664 -22054 -77300 19328 80039 81928 45105
19261 45105 30064 80660 171710 151359 125443 67041 75117 93708 31212 -54364 27637 32850
19249 32850 10596 -28259 46811 167605 180639 134545 111202 66971 40880 120383 80657
19238 80657 24507 60142 31134 52943 99705 69420 104813 113193 97811 63133 76096 -18799
19226 -18799 -81748 -157634 -109874 11431 64479 96277 103293 92393 85459 42759 40198 -821
19214 -821 -53876 -8537 -2168 38860 77989 65391 50718 42050 71704 6824 -96386 -72808
19202 -72808 -82400 -78156 -7651 -29166 -68839 -64619 -24148 -27134 -7468 87221 140670 105577
19190 105577 66796 66044 82751 118774 87979 113311 115359 66326 106179 126795 75391 97897
19178I7897n927o3039p3585K5224j3979M179N6987J9621k0474j16209K8767J63274
19166A02736L8405o2083m5791p2986n2433n0922l0579J05998N1661k2887j7488
19155e6369N7471R901l805m7815o7488M1346M3486L3898L0181R739j9018K8351
19143E9878o5656q7357K1302l987R1364Q4775r8267M4639N8076k2991m3696R258
19131D7338k9027n4336j3827K5931o189L8466L7413K3269k3538o8482P1034L3594
19119H1646k3890l8517n1326J7564P4594L8212j3440P2987N1143J0895R9661Q3163
19107D02692L7344J42445Q0978o8920p8987q7014p3756L6455n7902m8930L7945
19096C22350M1693L0915M6302Q9194O3914R561J6968L3245J05933N2403m5741
$$ plain form
19178 97897 91970 28931 -44654 -19430 -33409 -29230 27757 47378 26904 -89305 -60538 102736
19166 102736 141141 79058 33267 -39719 -92152 -143074 -173653 -67655 -15994 -38881 -56369
19155 -56369 1102 11003 7198 -40617 -108105 -66759 -23273 10625 40806 50545 31527 59878
19143 59878 -5778 -93135 -71833 -75820 15544 100319 2052 46691 104767 81776 38080 47338
19131 47338 18311 -36025 -49852 -23921 -30110 8356 45769 69038 45500 -22982 48052 81646
19119 81646 57756 19239 -32087 -14523 60071 98283 84843 157830 208973 219868 319529 402692
19107 402692 440036 582481 663459 594539 515552 428538 354782 391237 333335 284405 322350
19096 322350 364043 394958 441260 530454 594368 603929 620897 654142 760075 812478 766737
19085G66737j38682r7440k27288o3291l2745J994N7332J829K1156k2378J138M5648
19073C14010l2233k7657K3176p1957M0967O165o903m383m5922L573O4087O6992
19061C29915M8975Q7624K653K8544P5510o174J08344J61391R5411J13858Q9646
19050A135697N4654O909p5074n6187J6682p640L1591o9021m7935N0354J5789k9615
19038A026204q6335p0105l0598j08578j72579j03413p886K5952p9543k0894m1089
19027C31136m8709k429K5579n4479p205K3032M3889N3267O7040j8265j04140j9696
19015B89020M4122N8552K6525k8589L4871L9515J815j7895n1173J8804N9285O4669
19003E39521N4416M318O9127l177K4444K3260m4166p4797J1483q251k2562Q566
$$ plain form
19085 766737 628055 530615 303327 240036 207291 209285 266617 268446 289602 267224 268362 314010
19073 314010 281777 254120 277296 205339 246306 252471 245568 241185 195263 198836 262923 329915
19061 329915 378890 466514 469167 497711 573221 567047 675391 836782 932193 1046051 1135697
19050 1135697 1190351 1197260 1122186 1065999 1082681 1075041 1106632 1037611 989676 1040030 1055819 1026204
19038 1026204 939869 869764 839166 730588 558009 454596 446710 472662 393119 372225 331136
19027 331136 282427 279998 305577 251098 243893 266925 310814 364081 431121 412856 308716 289020
19015 289020 333142 391694 418219 389630 424501 464016 465831 447936 396763 415567 474852 539521
19003 539521 593937 598255 667382 664205 688649 711909 667743 592946 604429 596178 573616 582182
18991E82182P4114K1754j06052o8842p5786L7771l5155m4117j04171o265o5437
18980B09996o3277m5064k5094Q3940Q9101n8667n2708m3093j9173j7473N2984
18969A11472N652o4308l1466J759K2707N0403j2836N7659j2385L5561o4834k272
18957I7112j1241n0123m1200M3311N7547l3l0840j00776p744K5064P460K7040
18945A5577k5607P9162J5331o1130j2410m4472l0389N9239M6119J6711L095J3364
18933G4590l9671m376k7385K6710L0047M5397J09358m6654q4898k8430K3502P3760
18921A51950K0608m5630n8239L863n0265k378n5892p2529L1960l304J0923j2661
18909h1594l3087J9327m4094L4334M3613J8939R671L5899l6883n8749P724N5574
$$ plain form
18991 582182 656296 678050 571998 503156 427370 465141 429986 385869 281698 275433 209996
18980 209996 146719 101655 76561 160501 249602 190935 138227 95134 75961 58488 111472
18969 111472 117124 52816 21350 23109 45816 96219 83383 141042 128657 164218 99384 97112
18957 97112 85871 35748 -5452 37859 95406 95373 64533 -36243 -43987 -18923 -11463 15577
18945 15577 -10030 69132 84463 23333 10923 -33549 -63938 -4699 41420 58131 61226 74590
18933 74590 34919 30543 3158 29868 59915 105312 214670 168016 83118 54688 78190 151950
18921 151950 172558 126928 68689 72552 22287 19909 -35983 -108512 -76552 -79856 -68933 -81594
18909 -81594 -114681 -95354 -139448 -105114 -61501 -42562 -32891 3008 -33875 -92624 -84900 -29326
18897b9326K2009k5758j7448M2958N3269O7019m4752l1671L304L2594j794K420
18885G2824L4144O7226k7877j07116N0645m3469j01095M5507R9383P3232j1835
18874A51569K0687Q7312q4620j01J2362k4556k8284k3748J9094J2417J2633N4405
18862B09170m9943o4827N7485M3778l8804r5064P3975k9885j01027k710R9743
18851A01891O0469P550k6834l4358j9974n7984n3480M3407O1737O4556R8578n3171
18839A92387J44Q631K9679O276o2116J4478J6773p1755k1888l7824l7002N570
18827D3353o3406r961M2431J06725J2156M473m8912r111J08001N5830k0984o3820
18815A56775M9260Q0827j1033N1077Q7882J5837m5902k1942k5199k7573J3727
$$ plain form
18897 -29326 -7317 -33075 -50523 -7565 45704 112723 67971 36300 39604 72198 70404 72824
18885 72824 106968 174194 146317 39201 89846 46377 -54718 -9211 90172 163404 151569
18874 151569 172256 259568 174948 174847 187209 162653 134369 110621 129715 142132 154765 209170
18862 209170 159227 94400 151885 195663 156859 61795 135770 105885 4858 2148 101891
18851 101891 162360 169910 143076 108718 88744 30760 -22720 20687 82424 146980 245558 192387
18839 192387 192531 201162 230841 237117 175001 189479 206252 134497 112609 74785 37783 43353
18827 43353 -20053 -30014 12417 119142 131298 135771 86859 77748 185749 241579 220595 156775
18815 156775 206035 286862 275829 326906 414788 430625 384723 362781 337582 310009 323736
18804C23736k2381R3344J6721k3820l9444R116P848L947j7347K5973k3509m9256
18792C04928P7787j3945l5254K8844K0692P826P082l350r4643k4108l2266q1473
18780A62120N1573J0957k050J9484L5275P0173N9335k2352o4303M308j400L7657
18768C60777Q8668J43272J80635O0535j37601j06016r0791p5813n3079p2332o3375
18757B34880r45j0549J4027M6352K7735o831l475j8669P3691n5969n5180J3669
18745B58736L510O0785j8512j2216L3108O9849l1623J3342K5745n049N2485M6413
18733D96573j3602m7591O9575n0824l4314m6289j19734j13808O671J25084O2023
18722C33764L9768l2482k4215Q9452K1446p4642m0741m1584O7455J05273j9766
$$ plain form
18804 323736 301355 394699 411420 387600 348156 357272 365120 369067 351720 377693 354184 304928
18792 304928 382715 368770 333516 362360 383052 390878 397960 394610 299967 275859 243593 162120
18780 162120 213693 224650 222600 242084 277359 347532 406867 384515 320212 324520 323120 360777
18768 360777 449445 592717 773352 833887 696286 590270 499479 423666 370587 298255 234880
18757 234880 233935 223386 237413 283765 311500 304669 301194 282525 356216 300247 245067 258736
18745 258736 262246 323031 304519 292303 325411 395260 363637 376979 402724 397675 450160 496573
18733 496573 482971 435380 504955 454131 419817 373528 253794 139986 146657 271741 333764
18722 333764 373532 341050 316835 406287 427733 353091 312350 270766 338221 443494 423728
18711D23728j02701l8671J4193M7237N600j2464K3550j5966k5272o387M1872O6124
18699D20843j3358J5123J43168n1937j33076N4857N5686l6039p4082P6635L1470
18688D89290l2081J02064Q1904n1830j1994J181j1533N7423O5556r0550o2834
18677E36596n1464K1778k1958N0637j7143P8093R3097K3231N8783m146o2760m8395
18665F56349j550Q0934j01384J1063N0488M2846J0378J5769O1857l8105K7386
18654H16031p7253k3557o9838K4072O2646J3335J53688M6878L3853P9868N415
18643A065138N9297P6809J65730L3742m2633P9628J48925K80944J40621O9620
18633B077821J64893K20648K31258J96370J95411K03630J73775J76094L33726
$$ plain form
18711 423728 321027 282356 296549 343786 349386 336922 360472 344506 319234 312847 354719 420843
18699 420843 407485 422608 565776 513839 380763 435620 491306 455267 381185 457820 489290
18688 489290 457209 559273 641177 589347 577353 578534 567001 624424 689980 599430 536596
18677 536596 485132 506910 484952 535589 518446 596539 689636 712867 771650 767504 704744 656349
18665 656349 654799 735733 634349 645412 695900 738746 749124 764893 826750 788645 816031
18654 816031 738778 715221 645383 669455 732101 745436 899124 946002 979855 1059723 1065138
18643 1065138 1124435 1201244 1366974 1400716 1358083 1437711 1586636 1867580 2008201 2077821
18633 2077821 2242714 2463362 2694620 2890990 3086401 3290031 3463806 3639900 3973626
18624C973626M34858N94790P40507Q15342J139007J610142J958847K267758K526923
18615A6061800K682880L011885M285793O138755P398852N799540N02795l981152
18607D1901148m389518k124583J26258M66165j253402l390603l998810l233492
18599B4103163j937830n56130M96839J388713J769909J205415k55469j752342
18591B4462268k771344k776067k152336j508071j082329p64520k94112m7984R2452
18582A3157957L88187P46739J069521J518276J841253K405300L175829M052981
18574B8356043N113815N460586L818632L70897j848904j526654J66544K105074
18566D2016033M073684O345918R060980J2792244J7609694K3941568L2200358
$$ plain form
18624 3973626 4408484 5003274 5743781 6559123 7698130 9308272 11267119 13534877 16061800
18615 16061800 18744680 21756565 26042358 32181113 39579965 45379505 45882300 41901148
18607 41901148 37511630 35387047 35513305 35979470 34726068 31335465 27336655 24103163
18599 24103163 22165333 21609203 22106042 23494755 25264664 26470079 26214610 24462268
18591 24462268 21690924 18914857 16762521 15254450 14172121 13407601 13113489 13065505 13157957
18582 13157957 13546144 14292883 15362404 16880680 18721933 21127233 24303062 28356043
18574 28356043 33469858 38930444 42749076 43119973 41271069 39744415 39910959 42016033
18566 42016033 46089717 52435635 61496615 74288859 91898553 115840121 148040479
18559A48040479M2525992N2284838N4206794M1374623J7350752o768140k5797651
18552C23217687l6741276l5765619k7930385k2843790j9843998j3137873l615772
18545A63338974N925870J3982527K0687866K4741278K5847488K6168904K3794680
18538C04487587J4736794L216493o347197j7832110k9451551l4818070l4176895
18531A99815051l1544376k7842121k2543161j6855972j2021904q271368n357728
18524G5378421l319746j605540n82381q0467n10173j920581l342838m024389m452402
18515E5539904m371833l862751l169074k556116k077133j678628j308282q94818
18507C5621269n38842j73370K44074O23223R49884R60115P91613R31949R60334
$$ plain form
18559 148040479 190566471 242851309 297058103 338432726 355783478 349015338 323217687
18552 323217687 286476411 250710792 222780407 199936617 180092619 166954746 163338974
18545 163338974 169264844 183247371 203935237 228676515 254524003 280692907 304487587
18538 304487587 319224381 322440874 316093677 298261567 268810016 233991946 199815051
18531 199815051 168270675 140428554 117885393 101029421 89007517 80736149 75378421
18524 75378421 72058675 70453135 69870754 69790287 69280114 67359533 64016695 59992306 55539904
18515 55539904 51168071 47305320 44136246 41580130 39502997 37824369 36516087 35621269
18507 35621269 35082427 34909057 35153131 35776354 36726238 37686353 38477966 39409915 40370249
18498D0370249L39480n95460r65309o14277k59121q6789L28308O90485J249090
18489D0456656J944753J914239J315529J251137J467063J084517P49216k76741
18481D9906369k530679l655750l911542m289204m542319l982950l311285k672813
18473B1009827k112483j712127j461467j264126j154813r68667p54857p27628
18465A0853659o40133m73445l57517l22606l43548l83873l71643k78968l42139
18456G339787l55102k73697k36084k29498k25564k09042j73730j65013r3866p9595
18446E298596j57501j07537j74100k10076j58588k14115m3669j05807j19977j11329
18436C895897j31494p3308n8434j14911j41208m4297r0829o1592j06231j73665
$$ plain form
18498 40370249 40709729 40114269 39148960 38534683 38275562 38188773 38517081 39207566 40456656
18489 40456656 42401409 44315648 45631177 46882314 48349377 49433894 50183110 49906369
18481 49906369 47375690 43719940 39808398 35519194 30976875 26993925 23682640 21009827
18473 21009827 18897344 17185217 15723750 14459624 13304811 12336144 11581287 10853659
18465 10853659 10213526 9740081 9382564 9059958 8716410 8332537 7960894 7681926 7339787
18456 7339787 6984685 6710988 6474904 6245406 6019842 5810800 5637070 5472057 5378191 5298596
18446 5298596 5141095 5033558 4859458 4649382 4490794 4276679 4233010 4127203 4007226 3895897
18436 3895897 3764403 3691095 3632661 3517750 3376542 3332245 3241416 3179824 3073593 2899928
18426B899928m8365p0120m0911j36884j08310q5000o5129L4768q2465j0508r8002
18415B189002r311k136k3882q3121j28174j16500k4310r7961j37522j01530j11703
18404A352852j33851o9678M5305k4371j12917q1120p7062J6476j1570M037J6490
18393I24591l8019n1640K4215k797l2745O1042K7024q4690p3246J5737K6979L0350
18381H26801N4156m8363N978j5121k2658j4877m8316O2814R4856N992K8413K7870
18369I57545n2770k2316K1361l3705L1970L4267q4485r2394J7470Q2016P1118
18358I30077N2630k0973q3811k7580M5378K0119k385p9541L1025N2930l4961J2702
18346H95610l268O1105l2169l4342j6241J1212l1375q5665q6059k9927L1926L943
$$ plain form
18426 2899928 2851563 2781443 2740532 2603648 2495338 2410338 2345209 2379977 2297512 2287004 2189002
18415 2189002 2179691 2177555 2153673 2070552 1942378 1825878 1801568 1703607 1566085 1464555 1352852
18404 1352852 1219001 1149323 1194628 1170257 1057340 976220 899158 915634 904064 908101 924591
18393 924591 886572 834932 859147 856350 823605 884647 911671 826981 753735 769472 796451 826801
18381 826801 880957 832594 838572 823451 800793 785916 737600 800414 895270 901262 929675 957545
18369 957545 904775 882459 903820 870115 902085 936352 851867 759473 776943 858959 930077
18358 930077 982707 961734 877923 850343 895721 915840 913455 833914 864939 917869 882908 895610
18346 895610 892342 953447 921278 886936 870695 881907 850532 764867 678808 648881 680807 684750
18334F84750M2100K8415K2148m2173k3477q5680L3482M475m2567M414p8033o3285
18322D84569m5541N2061J65177l651m5235L4714j9239j41043m7433l6090k911
18311C95378P3928K7344N6176J7414k7527k2759n6554O6560l4014J6860J7977
18300E30783q2508l5689J0920j3089P682N2657L997n8497L0121K0503P0192p2689
18288D64383M4482m0138k3202O999l798O9568N7817R856r3955j25982o9069N7754
18276C54715l6113J7342l1875m9762l2704o898p237N808Q7209L7649r252P088
18264C35970L3938J0927j2388L7411L8840l1613j8573J0730j27567r4987O4582
18253B47270j2709l3198M8696J07536O230K5026m3924q6704O7988O179l2143p1485
$$ plain form
18334 684750 726850 755265 777413 735240 711763 626083 659565 664040 621473 625887 547854 484569
18322 484569 439028 491089 656266 652615 607380 642094 622855 481812 434379 398289 395378
18311 395378 469306 496650 552826 570240 542713 519954 463400 529960 495946 512806 530783
18300 530783 448275 412586 423506 410417 418099 470756 474753 416256 446377 466880 537072 464383
18288 464383 508865 468727 445525 452524 448726 518294 576111 585967 492012 366030 296961 354715
18276 354715 318602 335944 304069 254307 221603 214705 207468 213276 300485 338134 328882 335970
18264 335970 369908 380835 368447 405858 444698 413085 394512 405242 277675 182688 247270
18253 247270 234561 201363 250059 357595 363825 388851 344927 258223 326211 332390 300247 228762
18241B28762j26324p3364J24688R1015Q6383k1087p7504P0330P1659N383m1047
18230C38894m7037k627k7732M1567O4872M5728j1290j07579o8322k1685k6149
18219A78640J8613J8554o8980j3322P4686Q7593J8537j3406n7025n6412j905M9794
18207B35367M3818N8180O766j6424k0401m4134k9594L6019N764L6805k4118m0588
18195B47460J1741l398m3869J4683J01576N9662R330R058q204k7010p595J255
18183C64689q683K7049r544M6187O5173K5049n6249l0793k1970l421N0799o5095
18171C83191q3757O763O7378L0292L0140O0863m1468q3195O5306J9562J0363n8534
18159D06904k5020J5124N4253n1036n3422O733p2529K7354M2153J515M511P2879
$$ plain form
18241 228762 102438 29074 153762 244777 331160 310073 232569 302899 374558 379941 338894
18230 338894 291857 289230 261498 303065 367937 413665 402375 294796 226474 204789 178640
18219 178640 197253 215807 146827 133505 208191 295784 314321 300915 243890 187478 185573 235367
18207 235367 279185 337365 344131 327707 307306 263172 233578 269597 275361 312166 288048 247460
18195 247460 259201 255803 211934 226617 328193 387855 397185 406243 398039 371029 363434 364689
18183 364689 356006 383055 373511 419698 484871 509920 453671 422878 400908 397487 448286 383191
18171 383191 299434 306197 373575 403867 434007 494870 453402 370207 435513 455075 465438 406904
18159 406904 381884 397008 451261 400225 346803 353536 281007 308361 350514 352029 356540 429419
18147D29419L2604O944J0740M1040K1260j0293L7666R2598P8657L0551n1946L3463
18135G52703Q4464M7293j0626O9384J37685J54148k6386K8976J07661K38914J80529
18124A764745K62222K00190K93953N44056O95194Q83794J201611J565190K191835
18115I602790L158407M430976O218427Q225459J1056991J5631163K3076387K9763461
18107A11164061J8656553j2798008k9442078k6649282j7933198j1264259p263914
18100B4469875m792378l321296k450452j900887j465380j045590q18258p16353
18092G959281m99931m38430l69915k78343k68484k70039k28598k48871k32560
18083E124110j40777r3736j02689J7460m5796j11950j10528p4464j0967m228l0800
$$ plain form
18147 429419 462023 468967 479707 520747 542007 531714 569380 661978 740635 771186 719240 752703
18135 752703 837167 884460 873834 943218 1080903 1235051 1208665 1237641 1345302 1584216 1764745
18124 1764745 2026967 2227157 2521110 3065166 3760360 4644154 5845765 7410955 9602790
18115 9602790 12761197 17192173 23410600 31636059 42693050 58324213 81400600 111164061
18107 111164061 129820614 117022606 87580528 60931246 42998048 31733789 24469875
18100 24469875 19677497 16356201 13905749 12004862 10539482 9493892 8675634 7959281
18092 7959281 7459350 7020920 6651005 6372662 6104178 5834139 5605541 5356670 5124110
18083 5124110 4983333 4889597 4786908 4804368 4758572 4646622 4536094 4461630 4450663 4446435 4415635
18072D415635J17282K1288j00356j90198k15896k28493k54210j41766o7311k05497
18062C150478j94750j20290j01065k01291j38904o1220N11n0025n3501n9580k3854
18051B146509r6091j18546K2763Q3811R2119M9999j8300Q540M1939Q9271j782
18040B300232o9873O2708M732j19759j84271k21281j06756O6012j8907k2767j09580
18029A580490j29740j51647j58886q9498j44213q0190j6913j18457j17000k8613
18019E45333J9850n275O0667M2329n6333n4008n582K8150N4629j06599j34169
18008C88992q1311J6276L9462M8802L228K9086O1044R471J02889J2085m2369m2519
17996E45136K087O2998R9858Q1123M1629p828j05757r440K5151p6373R576N587
$$ plain form
18072 4415635 4532917 4554205 4453849 4263651 4047755 3819262 3565052 3423286 3355975 3150478
18062 3150478 2955728 2835438 2734373 2533082 2394178 2332958 2333469 2283444 2229943 2170363 2146509
18051 2146509 2050418 1931872 1954635 2038446 2130565 2180564 2162264 2170804 2212743 2302014 2300232
18040 2300232 2230359 2293067 2297799 2178040 1993769 1772488 1665732 1731744 1712837 1690070 1580490
18029 1580490 1450750 1299103 1140217 1050719 906506 826316 809403 690946 573946 545333
18019 545333 565183 559908 620575 662904 606571 552563 546981 575131 629760 523161 388992
18008 388992 307681 323957 363419 412221 415449 444535 505579 515050 617939 630024 587655 545136
17996 545136 547223 610221 710079 791202 832831 825003 719246 709806 734957 658584 668160 673747
17984F73747M6284M7026L5500j2785L2067L396k9880o9499k7742m1598j26970
17973E29546n7279m9373l8857n3110k1433l3716m0936k5193J6542l0323l2758
17962A63110j10357o9895m5478R8495Q3233N5920l3182l5229j2590m3592P55k5474
17950B5716l0237j2709j4637M1297J66431Q3526j0688o4255Q194K7172m778n6300
17938A58732k1508R175j4372m1997Q1398P0035l8445j68995q2898L0125M7652
17927B8902R2243J5174j2829l5282J0638l7552m8523M0467L1938J480l2394q386
17915D5876R6578P0654n2654j37210j13784o800N8634L5441Q0247M0926l3042
17904H4866J1981N7449l889K0863j0287k4307P3436L5030q4605j09651j5028J2338
$$ plain form
17984 673747 720031 767057 802557 789772 821839 825235 795355 725856 698114 656516 529546
17973 529546 472267 422894 384037 330927 309494 275778 234842 209649 226191 195868 163110
17962 163110 52753 -17142 -62620 35875 119108 175028 141846 106617 94027 50435 51190 25716
17950 25716 -4521 -17230 -31867 9430 175861 259387 248699 184444 192638 219810 215032 158732
17938 158732 137224 146399 132027 90030 171428 241463 203018 34023 -48875 -18750 28902
17927 28902 121145 136319 123490 88208 98846 61294 12771 53238 85176 86656 54262 45876
17915 45876 142454 213108 160454 23244 -90540 -97340 -38706 -3265 76982 117908 84866
17904 84866 96847 154296 150407 171270 160983 136676 210112 245142 160537 50886 35858 48196
17892D8196q55l7227j6542L7042L4913L2356o7489j2344k5659r4507R0872N9676
17880D8432R911q807L3493j9206j06638J4308J4232L2847j415K7659j0478K2535
17868E6873j009M271K772J6349J0840k2813q435l3232J10629R4583q6917p6858
17856F7053L8594J9307N0214P8739J7180O319j00090r0371o6050R696M1349P094
17844G9034N8537l3795m0863J9347j8093L3256k058n6943p49k3915L037M4490
17832F1285j86j4742J7150l7075j08401m2017r0564j0408J04191Q2658O1093P3384
17820I6368J937P6810N7127J8735P740o0832m347j8620J2868j2492l0776m9737
17808I4781j581o6651j28683n536O9217L8321J4031m9253L1652k654k2897K7107
$$ plain form
17892 48196 47341 10114 -6428 30614 65527 97883 30394 18050 -7609 -102116 -11244 48432
17880 48432 58343 49536 83029 63823 -42815 -28507 -14275 18572 17157 44816 34338 56873
17868 56873 55864 60135 62907 79256 90096 67283 58848 25616 136245 230828 143911 67053
17856 67053 105647 124954 175168 253907 271087 277406 177316 86945 20895 30591 71940 79034
17844 79034 137571 103776 62913 82260 64167 97423 95365 38422 37673 13758 16795 61285
17832 61285 61099 46357 63507 26432 -81969 -123986 -214550 -224958 -120767 -38109 22984 96368
17820 96368 98305 175115 232242 250977 258717 197885 193538 174918 187786 175294 144518 94781
17808 94781 93200 26549 -102134 -107670 -38453 -132 13899 -35354 -3702 -6356 -29253 -2146
17796b146J3101k2903N9126O2084l9455j1716P4307j0204k8340l0715l8319j3302
17784A1518k1634N7752R3007L2825l2088k3111q5557l6996j5292L0011j9991n403
17772a4959k8170j0100k4027m1958O1241K9092O1200R1209P7840p9444j07441
17761A4483l5911k2732J3832o8795K9001L0538O6597r774o025j286L1121O391
17749D7440q5107k5527Q2131n642k8535p795K4158R8567m9652j02211J6902O5536
17737C0265P046K9943n5503J2354J9353l8718l1375r27N3928N187J2154m7026
17725c319l9061M5664k3247j5042n709N9758K5406P5779K3396m6720q6327L9372
17713D9950M563j1151K3642M1200K9137m3692J7920J11137m2025r3403j08172
$$ plain form
17796 -2146 10955 -11948 47178 109262 69807 58091 132398 122194 93854 63139 24820 11518
17784 11518 -10116 47636 140643 173468 141380 118269 32712 -4284 -19576 10435 -9556 -14959
17772 -14959 -43129 -53229 -77256 -119214 -57973 -28881 32319 123528 201368 121924 14483
17761 14483 -21428 -44160 -30328 -99123 -70122 -39584 27013 17239 11214 9928 41049 47440
17749 47440 -37667 -63194 18937 13295 -15240 -23035 1123 99690 50038 -52173 -35271 30265
17737 30265 37311 67254 11751 24105 43458 4740 -26635 -27562 26366 31553 43707 -3319
17725 -3319 -42380 3284 -19963 -35005 -40714 19044 44450 120229 143625 96905 10578 49950
17713 49950 54513 43362 67004 108204 137341 93649 111569 222706 180681 87278 -20894
17702b0894J4346M3751K2087l8564k3053N7849k271n3282P4302n1297n1624k5917
17690e4567r533P460n8081N9171K8256M633q004r6885r4612Q789O3622L6360P0863
17677d2528q175k6130k8523L063Q7794p803n2847J9901N5220L6220n7957M0462
17665A8697R305O4015l8873n4386m6506J3217k0241l2678K7415o0006O73N5992
17653f3376O995l5058K997P4232l0375k3234j8637O1455l3523n3687J9649O0366
17641c2196Q5566O4087l1469J0772p8154j12302P046M8011J8186L556K099J3748
17629a050M9518o670n4197m4199J7729k9562P1035O4147P445n6680l6284O9827
17617E1059Q1126M1404p8033j53282P3336m3235r5023Q1283J04429n0132o0013
$$ plain form
17702 -20894 -6548 37203 59290 20726 -2327 55522 53251 -31 74271 22974 -28650 -54567
17690 -54567 -64100 -56640 -114721 -55550 -27294 -22661 -30665 -127550 -222162 -213373 -149751 -113391 -42528
17677 -42528 -50703 -76833 -105356 -102293 -14499 -22302 -75149 -55248 -28 36192 -21765 18697
17665 18697 28002 92017 53144 -1242 -47748 -34531 -54772 -87450 -60035 -120041 -119368 -63376
17653 -63376 -56381 -91439 -88442 -14210 -44585 -67819 -86456 -25001 -58524 -112211 -92562 -32196
17641 -32196 53370 117457 85988 96760 18606 -93696 -86650 -38639 -20453 -16897 -14798 -1050
17629 -1050 48468 41798 -12399 -56598 -38869 -68431 2604 66751 74196 17516 -18768 51059
17617 51059 132185 173589 95556 -57726 15610 -27625 -122648 -41365 63064 12932 -47081
17606d7081M5563N8042N1849J3101O082n8448m1297j2096j18500n0683M0000P5755
17594c7713L6165m3877N8129R2160l4631j17152j1090M1978L860O3065J4798k052
17582F3640k4977N883N890n9566K5856K9478k575K8526P2683J1438p9965q3458
17570g147p2153l8164K9176N1538N8803J8631K0579K6379o1496r222L8798p830
17558D7892j0000o6197j7452K374l3364M5211K4184j2494O005l0160M6132k7534
17546b5403n8104j3779Q5395P2659J34864L0110j15265p2983j948l5598O008q6410
17534h0454O872m4397p76O0558N5502m046O7142J3429m3764j0354N33Q0648M2265
17521A43158m3817n2452l2079l7337n9922M4363O3145L2884j1259q5202p7343
$$ plain form
17606 -47081 -1518 56524 108373 121474 127556 69108 27811 15715 -102785 -153468 -113468 -37713
17594 -37713 -1548 -45425 12704 104864 70233 -46919 -58009 -16031 -12171 50894 65692 63640
17582 63640 38663 44546 50436 -9130 16726 46204 43629 72155 144838 156276 76311 -7147
17570 -7147 -79300 -117464 -88288 -36750 22053 40684 61263 87642 26146 16924 55722 47892
17558 47892 37892 -28305 -45757 -43383 -76747 -31536 -7352 -19846 -13841 -44001 2131 -25403
17546 -25403 -83507 -97286 -11891 60768 195632 225742 110477 37494 35546 -52 5956 -80454
17534 -80454 -73582 -117979 -118755 -58197 -2695 -6741 60401 73830 30066 19712 20245 100893 143158
17521 143158 99341 46889 14810 -22527 -82449 -38086 25059 57943 46684 -38518 -115861
17510a15861M3344L0073K1799L0777l5682n1440j7764L828K3960K7472M7510K9127
17498C7143K9614O721m9139k9263Q2657M6218p5069p7061M510K9732L6506j9594
17486B2975p7261r8021P257M6899K6171J111j0959k5263m3573k8582J06426O6455
17474f365N022n3021M339M4180K885p277l5152k2254M2288J5655J6875j07182
17462a00007Q5955L6670q7659l0485k9299J3574P8812J5829K7684L6881J4072
17451F2027J3121k2476P651Q913L1665N1577R6876j1045J09424J04893N9741O5
17439E12432j05307j24648q3714j1950o688L8451Q0251j92541j24138q9022O0626
17428d6248J3076K8090l4840J7M1848J3322n2569m4412j0048O2264L3857m6972
$$ plain form
17510 -115861 -72517 -42444 -20645 10132 -25550 -76990 -94754 -90926 -66966 -39494 8016 37143
17498 37143 66757 73478 24339 -4924 77733 123951 48882 -28179 -23669 6063 42569 22975
17486 22975 -54286 -152307 -145050 -98151 -71980 -70869 -81828 -107091 -150664 -179246 -72820 -6365
17474 -6365 -1343 -54364 -50025 -5845 -2960 -10237 -45389 -67643 -25355 -9700 7175 -100007
17462 -100007 -14052 22618 -65041 -95526 -124825 -111251 -32439 -16610 11074 47955 62027
17451 62027 75148 52672 60323 69236 100901 152478 249354 238309 347733 452626 512367 512432
17439 512432 407125 282477 198763 186813 180125 218576 298827 106286 -17852 -106874 -46248
17428 -46248 -33172 -5082 -39922 -39905 1943 15265 -37304 -81716 -91764 -29500 4357 -42615
17416d2615O435K5260N324j1307J7748P3026N0738p3809l2755R306O7275J3691
17404A08317l3125m7968j05105J7869J064j6529M4007K6671M5042R6567O384q7906
17392E5288l9439j5286O1062O1323L1875J009M8652j792l0180q2382j64J2104
17380A02070o4616k3134k6271m4475k2282l3900O8740m0274l4066M919R0717N3156
17368C0584m974j9623m6538K9928M029j4662j756j9790N040O591o1527M0359K4624
17355b7715m3303n8884J7969M1782K8225K7583l1495m0175l9436J0197K1853J02984
17343I585o8215l1383M6982J147p9134l9561J36615O8061r5791o1554M769K8566
17331g9913Q0556n040J2210j054k0220L4385p906k4632M1452p9025k3716m5384
$$ plain form
17416 -42615 -36180 -10920 -5596 -16903 845 73871 124609 50800 18045 27351 94626 108317
17404 108317 75192 27224 -77881 -60012 -58948 -75477 -31470 -4799 40243 136810 143194 55288
17392 55288 15849 563 61625 122948 154823 155832 204484 202692 172512 90130 89966 102070
17380 102070 37454 14320 -11951 -56426 -78708 -112608 -43868 -84142 -118208 -113289 -22572 30584
17368 30584 25610 5987 -40551 -10623 -6594 -21256 -23012 -42802 -37762 -31171 -92698 -52339 -27715
17355 -27715 -71018 -129902 -111933 -70151 -41926 -14343 -45838 -86013 -125449 -115252 -93399 9585
17343 9585 -58630 -90013 -43031 -41884 -121018 -160579 -23964 44097 -51694 -113248 -108479 -79913
17331 -79913 643 -4397 7813 6759 -13461 20924 13018 -11614 29838 -49187 -72903 -118287
17319a18287O5159J6287N8589N2231n6958o4513Q2412Q6603k5086j34049k9244
17308f6856L5237m7015r4687R3449J13207L8608m3961j51204m950j8948M5383
17297a01737M3982m026l8968L7383P0737L4257P5512Q0003k3554l7036p3418n9030
17285D105o4721P2513O6869j3780O3562L1023j25494n1085O4880K1381j01952
17274c2699K8623J0310m9536k831o3922L3060N3453K4876O0968J0852O713M7835
17262A27702p2102o5868L0260r634n692j9157O1271L213N1304Q988p3149m0333
17250c197j7673k4335N2650k643R6540P3177j34434k1366l3285p7515j2914Q7975
17238a7020O2458L5723j5953r9342K7739o1145q843N8624N0639O420K2981K696
$$ plain form
17319 -118287 -53128 -36841 21748 73979 17021 -47492 34920 121523 96437 -37612 -66856
17308 -66856 -31619 -78634 -173321 -79872 33335 71943 27982 -123222 -128172 -147120 -101737
17297 -101737 -57755 -61781 -100749 -63366 7371 41628 117140 197143 173589 136553 63135 4105
17285 4105 -60616 11897 78766 64986 128548 159571 34077 -17008 47872 69253 -32699
17274 -32699 -4076 6234 -43302 -46133 -110055 -76995 -23542 1334 62302 73154 79867 127702
17262 127702 55600 -10268 19992 10358 4666 -14491 46780 49993 101297 110285 37136 -3197
17250 -3197 -20870 -45205 7445 4802 101342 174519 40085 18719 -14566 -92081 -104995 -17020
17238 -17020 45438 81161 65208 -34134 -6395 -67540 -76383 -17759 32880 39300 62281 64977
17226F4977j2432l5900k5768n977J2557l4956j1751k9645R6746o400m0814q9028
17214a18391K4482N4833N1324J7391K2074N6831N3745r0096K6040R807Q962j06006
17202A0996j9148L3806O8971N1189l2515n1334o540j1434o91j0728K4826m611
17190E2787k6164q3232q6843o57J8924Q7893l534P6013N8561J0079k1285p6802
17178E740o3446n5574O2880Q0165R444r3281n048J29801N8895r6531j11376J3614
17166f4717J2028R5419J26741n6369j53408m1142N8872K7096Q908P2800r4903
17155h675l501J4765j04303m8558R8065J11990k0274L972l3243l2827m315o9655
17143i6559J9331O1507M7655M3959n9895o8941L9885k0658R94r7931J0149Q1362
$$ plain form
17226 64977 52545 16645 -9123 -15100 -2543 -37499 -49250 -78895 17851 11451 -29363 -118391
17214 -118391 -93909 -39076 12248 29639 51713 108544 162289 72193 98233 108040 117002 10996
17202 10996 -8152 25654 94625 145814 113299 61965 55425 43991 43300 32572 57398 52787
17190 52787 26623 -56609 -143452 -144109 -125185 -37292 -40826 35187 93748 103827 82542 5740
17178 5740 -57706 -113280 -50400 29765 39209 -54072 -59120 70681 129576 33045 -78331 -64717
17166 -64717 -52689 42730 169471 113102 -40306 -81448 -22576 4520 13428 86228 -8675
17155 -8675 -12176 2589 -101714 -150272 -52207 59783 39509 43481 10238 -22589 -26904 -96559
17143 -96559 -77228 -15721 31934 75893 15998 -52943 -13058 -33716 -32722 -130653 -120504 -39142
17131c9142J11841K2569P519j5253P3495l3701m5422r7353q6048N2090N9809R5997
17119A06401n3594k5447Q5242k3538n6669j09290J2176K9444r418L5184k3029
17108c2538l3031j3355j6259L7498N6091m2881l2837K285L9893Q2796J144n0313
17096a507O2230N768n9641Q519j0885P746R7412r879l0145o6914K6870Q1619R343
17083A20536p9419q0634m0866l3551L1236Q4031O712k7702L389J0858k3651q787
17071c7848k3287K719K4994L4575L4871L7873J919o2992m4612j2708k930J6517
17059c0909R403J3515o899j6297l994K1156J8268K8412K2982m8272j3995K170
17047d460j5646k9692q218N6735J24184j0599p1774m573L5413l3931K7815k0984
$$ plain form
17131 -39142 72699 95268 102787 87534 161029 127328 81906 -15447 -101495 -49405 10404 106401
17119 106401 52807 27360 112602 89064 32395 -76895 -64719 -35275 -44693 -9509 -32538
17108 -32538 -65569 -78924 -95183 -57685 -1594 -44475 -77312 -75027 -35134 47662 48806 -1507
17096 -1507 60723 66491 6850 15369 4484 12230 109642 99763 69618 2704 29574 111193 120536
17083 120536 41117 -39517 -80383 -113934 -82698 1333 8045 -19657 -16268 -5410 -29061 -37848
17071 -37848 -61135 -58416 -33422 1153 36024 73897 75816 12824 -31788 -44496 -47426 -30909
17059 -30909 -21506 -7991 -14890 -31187 -35181 -14025 4243 32655 55637 7365 -6630 -4460
17047 -4460 -20106 -49798 -58016 -1281 122903 112304 40530 35957 71370 37439 65254 44270
17035D4270k5595N9759l2883p4202j0858L1762M6706n1735j12213k035N9125M2692
17023b5207n0732L549P4958M1917L9793l1344m6713q177k998j6971M308P9892
17011F2275j3491r7314q0065R4616N8549L8788M1270K779K3071J3849p5194L302
16999G2435J7843k9839j8006k9679j35250r2354M578O7188l3333J3545J15216
16988d7656J09238K2997L1396o5212j04320j7872K8474J08350N0675n6137l3771
16977B6162l1837o4364r322K5762L514J05959P1704k3576j40565o9931J2648K6779
16965f7067Q3352J9134n3455O976k5274P3155m6522k4524m091l1230J7724N1059
16953g63R5183j7739q5280n844K3634q36N0260P1176j0599p2535j02207n9640
$$ plain form
17035 44270 18675 78434 45551 -28651 -39509 -7747 38959 -12776 -124989 -127024 -67899 -25207
17023 -25207 -75939 -72390 2568 44485 84278 52934 6221 -1956 -4954 -21925 -17617 62275
17011 62275 48784 -48530 -128595 -33979 24570 63358 104628 107407 130478 144327 69133 72435
16999 72435 90278 60439 42433 12754 -122496 -214850 -210272 -143084 -176417 -162872 -47656
16988 -47656 61582 84579 115975 50763 -53557 -71429 -42955 65395 116070 59933 26162
16977 26162 -5675 -70039 -79361 -53599 -50085 55874 127578 104002 -36563 -106494 -93846 -67067
16965 -67067 16285 35419 -18036 -11060 -36334 36821 -9701 -34225 -38316 -69546 -51822 -763
16953 -763 94420 76681 -8599 -14443 9191 8355 58615 129791 119192 46657 -55550 -115190
16941a15190J5271Q0415J08465m02m1516l1897n2055n516K8594l8269O7658P6950
16929I2508l3081n9566R2961r0889r3067r550n6674j529K8934j7250j7976L8624
16917a26555L2635n4036R518Q9103j5499O2014K301o0096n9151L9121L069O6115
16905a1461O4074m0231o6366k8843O9308O8977M724l1761m3938k6038M4089N8973
16893F1507q140m0392K9708M6736r1313k8522k0106J9019J4273q3981l4839J19162
16881a6888J42002J9402o230m1731m7330p6117O150K2725l758l6173L0135p0947
16869g8760j0426l7112j2512M5733K4041K4935k9473R4929m739m3936k5170k8420
16857h0910k6923L0255O6569N4179M6552o2171m8106R3282N4401J4643o3264n2708
$$ plain form
16941 -115190 -99919 -19504 88961 88559 47043 15146 -36909 -42425 -13831 -52100 15558 92508
16929 92508 59427 -139 92822 1933 -91134 -100684 -157358 -158887 -129953 -147203 -165179 -126555
16917 -126555 -93920 -147956 -138438 -49335 -64834 -2820 -519 -60615 -119766 -80645 -77576 -11461
16905 -11461 52613 12382 -53984 -82827 -13519 55458 60182 28421 -15517 -41555 2534 61507
16893 61507 53367 12975 42683 89419 -1894 -30416 -50522 -31503 -17230 -101211 -136050 -16888
16881 -16888 125114 144516 138286 96555 49225 -26892 -20742 1983 -1775 -37948 -7813 -78760
16869 -78760 -89186 -126298 -138810 -93077 -69036 -44101 -73574 21355 16616 -27320 -52490 -80910
16857 -80910 -107833 -77578 -11009 43170 89722 27551 -20555 72727 127128 141771 78507 25799
16845B5799j6332M5587l8789j00780j496J14963J19424k418l5345k5327n2129
16834C3157M61J497m9382p95M1111r48o882p8073l1373J01849K5897n8053l625
16821b5159k5512m7791j7028O6932M3947L4613K8606l3829j9806m9092Q0170K5624
16809F1675r9747o8393N692M0700k0841L7321L7780k7447o535j9648n0961m2872
16797a53276m9219P8566Q7504M1833m0164l511L3375J4048L7821K0557n9606n7486
16785d9558k2639O4348L0751m7073J364l2667o2604K1373M3165j118m147o522
16773f5327m5518K450R0164M9375j44533o1779L4228L8081P6897K0559k5632j3870
16761d4905L2076m3490o147j2008Q5401n8731p2929J36396N1498o5304J4936l8156
$$ plain form
16845 25799 9467 55054 16265 -84515 -86011 28952 148376 145958 110613 85286 33157
16834 33157 33618 35115 -14267 -15062 26049 25101 18219 -59854 -91227 10622 36519 -21534 -25159
16821 -25159 -50671 -98462 -115490 -48558 -4611 30002 58608 24779 4973 -44119 36051 61675
16809 61675 -38072 -106465 -100773 -60073 -80914 -43593 -5813 -33260 -39795 -59443 -110404 -153276
16797 -153276 -202495 -123929 -36425 5408 -34756 -38267 -4892 9156 46977 67534 7928 -49558
16785 -49558 -72197 -7849 22902 -24171 -22807 -55474 -118078 -96705 -53540 -54658 -58805 -65327
16773 -65327 -110845 -108395 -18231 31144 -113389 -175168 -140940 -102859 -25962 -5403 -31035 -44905
16761 -44905 -12829 -56319 -62466 -74474 10927 -47804 -120733 15663 67161 1857 16793 -21363
16749b1363j7382P1663q10m3968M491J09549l2425n4445o5400J9638L2379n3517
16737e1590o6748k8836L0950P5614k2856L2811j752n479k1020n2002n5163J14676
16725e1395M5336n5519o8678k6022k0418M8115N9200K9301k5212L0263L753K0838
16713a0438J8932p725k7912p088q028n08m4361K9501M7331l1903J5798Q5207l3113
16700B5693n3700l4799J7661L1644k0719k2053N386L8458P2776m1404p6661m2093
16688i9811N58l7574l6499j0950j4347N1394K5709M961K1562m5267q0688K5312
16676a95640J16502O1388k8725o0531j3260K1829Q5656L084O0392P4042m0177
16665H4560j1089O3189m6960m1397j06269k3285m788n735K1001R7620J1924P533
$$ plain form
16749 -21363 -38745 32918 32108 -11860 -7369 102180 69755 15310 -50090 -30452 1927 -51590
16737 -51590 -118338 -147174 -116224 -40610 -63466 -30655 -32407 -37886 -58906 -110908 -166071 -51395
16725 -51395 -6059 -61578 -130256 -156278 -176696 -128581 -69381 -40080 -65292 -35029 -31276 -10438
16713 -10438 8494 769 -27143 -34231 -42259 -42767 -87128 -57627 -10296 -42199 -26401 58806 25693
16700 25693 -28007 -62806 -45145 -13501 -34220 -56273 -50887 -12429 60347 18943 -57718 -99811
16688 -99811 -99253 -136827 -173326 -184276 -198623 -147229 -121520 -116559 -94997 -140264 -220952 -195640
16676 -195640 -79138 -17750 -46475 -107006 -120266 -98437 -12781 -9697 50695 124737 84560
16665 84560 73471 136660 89700 48303 -57966 -81251 -86039 -91774 -70773 26847 38771 46304
16653D6304k6346M978j0755N0011n7484M1698O9448m1115j35931k4029J00469
16642A7248N5790p2458j1703P8193P0441k0471l7183P052k8153r4121l9612O2987
16630a1990N6163o0794o4073K9417J8205o983k7673P3402J4313j9339k9267k1475
16618e0094l15Q3382j7020j2633M9034p8132j20858j0681O0107P7547L0299k4242
16606a3606q1666J5608K2233J5632L3545L8366j6318o0098j00l9343K729O921
16594g6097J2631O9341k312p4514L1384O5976K7589O413l5238L2693K5126r4501
16582a1509m9041k3174R0193M1084O965M525j39063p4201K4213M1824M9489j7760
16570e6455J9591j1265J5215M6276q2335l2701J1824R14Q4458K3700p5225o990
$$ plain form
16653 46304 19958 24936 14181 64192 6708 48406 117854 76739 -59192 -83221 17248
16642 17248 73038 580 -11123 67070 137511 117040 79857 86909 58756 -35365 -74977 -11990
16630 -11990 44173 -16621 -80694 -51277 -33072 -40055 -67728 5674 19987 648 -28619 -50094
16618 -50094 -50409 32973 15953 3320 52354 -25778 -146636 -157317 -97210 -19663 10636 -13606
16606 -13606 -95272 -79664 -57431 -41799 -8254 30112 13794 -46304 -46404 -85747 -83018 -76097
16594 -76097 -63466 5875 3563 -70951 -39567 26409 53998 60411 25173 57866 82992 -11509
16582 -11509 -60550 -83724 6469 47553 54518 59043 -80020 -154221 -130008 -88184 -38695 -56455
16570 -56455 -36864 -48129 -32914 13362 -68973 -101674 -89850 -88936 -4478 19222 -56003 -62993
16558f2993K5554j1936J0138J6264O1566P397K2854N332q5177r5876J5069L2421
16546e9387q349n707o3992l4576K3802L9447R1282K0101L554n2859J0540l839
16534c9983j8157m757p2333l7270o25K4425P5772J7108k3958m816N4199K6190
16522d205O894o5175M0708l0240j13960k4184O3586R8385N856J077P7119N4718
16510A10579o991r9021L1507l2967L5948L9934J1437N0946j2594m2901n8842k058
16498B4977p5311r595k3409j04159P140L3029K7407Q3505M6103j8566k6283k0474
16486e5636J5037k9010N150k9394m4064l3470L5294Q7276J0645l0968l8433K6738
16474h0835J06948J1403K5182l5158p0032o2565n8598J3990L7479O6008Q1302
$$ plain form
16558 -62993 -37439 -49375 -39237 -22973 38593 45990 68844 74176 -11001 -106877 -91808 -59387
16546 -59387 -67736 -73443 -137435 -172011 -148209 -108762 -17480 2621 6175 -46684 -36144 -39983
16534 -39983 -58140 -62897 -135230 -172500 -173125 -148700 -72928 -55820 -79778 -84594 -30395 -4205
16522 -4205 2689 -62486 -21778 -52018 -165978 -190162 -126576 -28191 -22335 -21258 55861 110579
16510 110579 103588 4567 36074 3107 39055 78989 90426 141372 128778 85877 27035 24977
16498 24977 -50334 -59929 -83338 -187497 -180357 -147328 -119921 -36416 9687 -8879 -35162 -55636
16486 -55636 -40599 -69609 -64459 -93853 -137917 -171387 -136093 -48817 -38172 -69140 -107573 -80835
16474 -80835 26113 37516 62698 27540 -42492 -105057 -163655 -149665 -112186 -46178 35124
16463C5124k7174L3997k9657M0309J08635m7239o7038j2733P1876K5940q8076
16452D3964p9226N9812O1549r6231r4919L9130P395k2678M2120J09736M4353J3870
16440A28875J315p7312j0109K3369j3128m0517j7537P0940M2282k1222q3236q1509
16428g7789j8637j267N8562P2831J5675n5654o1521J1427o4107m5253O7199K7848
16416g0686K3215R392K8752J9319L4338k5873M3447L1110k4801n8833K2710O2276
16404I4366L517l6388n5854K1262M5510m913l0137l3567K5076l5533o6995k2785
16392i6441J5586R17o9406q267L2035L5661m4528r507J5648Q7427O4859R0059
16380A14043n0248j30307M6861N5715n8688m4277L6548M6873M019l8513Q346p6970
$$ plain form
16463 35124 7950 41947 12290 52599 161234 113995 46957 34224 106100 132040 43964
16452 43964 -35262 24550 86099 -10132 -105051 -65921 -58526 -81204 -39084 70652 115005 128875
16440 128875 130190 52878 42769 66138 53010 12493 -5044 65896 108178 86956 3720 -77789
16428 -77789 -96426 -97693 -39131 33700 49375 -6279 -67800 -56373 -120480 -165733 -98534 -70686
16416 -70686 -47471 -38079 -9327 9992 44330 18457 61904 93014 68213 9380 32090 94366
16404 94366 97883 61495 5641 26903 72413 67500 37363 3796 28872 -6661 -73656 -96441
16392 -96441 -80855 -79938 -149344 -157611 -125576 -89915 -134443 -143950 -128302 -40875 23984 114043
16380 114043 63795 -66512 -19651 36064 -22624 -66901 -30353 16520 20539 -17974 -9628 -86598
16368h6598P9541J9147l9525M6769n928K7444l603O7407P0403p1681n1346l7532
16356A4498l4909P359P7614P208k3712O5577l560p2469l6566N736L1918n0036
16344a1342o2326P5331N064P2318L5083j8144k2677m8484o6786r1476o065J7979
16332a21525k7785L6271l253l3777k0254Q3817J20745o976o6218k4395P043j7208
16320g3515j8632L6707M682Q4819K2593k7734O4276J6750l1440j14503l0493k4150
16308i0640K304m3323L4388J7032N9972J1731m1637O6688O2592j0928j6153L7561
16296H9587O1744j3905q3350p6892j19554L2612P2653L4318k9056j7462j7417
16285f6722L9398M3240K0143O187j701l0820O2356J2329p6218J4611l2724L4104
$$ plain form
16368 -86598 -7057 12090 -27435 19334 13406 40850 37247 104654 175057 103376 52030 14498
16356 14498 -20411 -13052 64562 71770 48058 113635 110075 37606 1040 6776 38694 -11342
16344 -11342 -73668 1663 6727 79045 114128 95984 73307 24823 -41963 -133439 -139504 -121525
16332 -121525 -149310 -113039 -116292 -150069 -170323 -86506 34239 27263 -38955 -63350 -56307 -73515
16320 -73515 -92147 -55440 -50758 34061 56654 28920 93196 109946 78506 -35997 -66490 -90640
16308 -90640 -88336 -131659 -97271 -80239 -20267 -8536 -50173 16515 79107 68179 52026 89587
16296 89587 151331 137426 54076 -22816 -142370 -109758 -37105 -2787 -31843 -49305 -66722
16285 -66722 -27324 15916 36059 42246 40545 9725 72081 84410 8192 22803 -9921 24183
16273B4183Q1663J9961k7822m3914j64548j6658M7267Q0890O0263l0993j12522
16262h2230o4178P714N3635K1564R7185M6618k0300J994N967j14553n0892R52
16250i6524N4546K3906R1366M7706j11635M2183K3372k7448k4239j2714o6028
16239e5509o612P8246N6623l7453j38181L1374j8070P5537K0947o655k142J2228
16227A0333L7200l7816n9945O247M2868q9843k433N6895k7992l0221L1843L9678
16215b3186J9022l88j1507j1854K4878j9992K498o8893O0702M3210k8865L7767
16203B3392k0854K6477o0658j3258N0748J1642J8205K5429n8185k6283O980N0685
16191C4320J4582o757j8047l1131l9082R870o0887P653k5241p7127R4695L9941
$$ plain form
16273 24183 105846 125807 97985 54071 -110477 -127135 -79868 1022 61285 30292 -82230
16262 -82230 -146408 -138694 -85059 -63495 33690 80308 60008 62002 67969 -46584 -97476 -96524
16250 -96524 -41978 -18072 73294 121000 9365 51548 74920 47472 23233 10519 -55509
16239 -55509 -62121 16125 72748 35295 -102886 -71512 -89582 -14045 6902 247 -1895 10333
16227 10333 47533 9717 -50228 -43981 -1113 -90956 -93389 -36494 -64486 -94707 -62864 -23186
16215 -23186 -4164 -4552 -16059 -27913 -3035 -23027 -20529 -89422 -28720 14490 -14375 23392
16203 23392 2538 29015 -31643 -44901 5847 17489 35694 61123 2938 -23345 -16365 34320
16191 34320 48902 42145 24098 -7033 -46115 -36245 -97132 -89479 -114720 -191847 -97152 -57211
16179e7211n195l3784L3037l138j208N5290m7187n369M8118L1614N5357N387q7438
16166a1727n9423r247k7315j0475l3035P9411J11771K5410K9436j03929q0831
16155h9954k4851R3872P0909o0503p3188L2782L4406j5028j2880l9281n8532j325
16143a43573N6208O4755o0584j1054J2377J8533L1076P9187J7390j24220m7326
16132a07231Q5384N3447P905m3434J3602Q673r6242m2255K790Q432K2732m4281
16120a30478k9793K5670p5152m4858P600R8824J46778M3913O346o895M0367j6548
16108F5774p4418m9581N4981l8124k1450j6360k0710n6047M0129J1256m7227j9073
16096a70850M0345n2796Q231M1498N6485N0691N5896M9320K332r540j02573q5511
$$ plain form
16179 -57211 -62406 -96190 -63153 -66291 -67499 -12209 -59396 -64765 -16647 14967 70324 75711 -11727
16166 -11727 -71150 -80397 -107712 -118187 -151222 -71811 39960 65370 94806 -9123 -89954
16155 -89954 -114805 -20933 49976 -10527 -83715 -50933 -16527 -31555 -44435 -83716 -142248 -143573
16143 -143573 -87365 -22610 -83194 -94248 -81871 -63338 -32262 46925 64315 -59905 -107231
16132 -107231 -21847 31600 39505 -3929 9673 18346 -77896 -120151 -117361 -108929 -86197 -130478
16120 -130478 -160271 -134601 -209753 -254611 -247011 -148187 -1409 42504 48850 41955 82322 65774
16108 65774 -8644 -58225 -3244 -41368 -62818 -79178 -99888 -155935 -115806 -104550 -151777 -170850
16096 -170850 -130505 -183301 -175070 -133572 -77087 -26396 29500 78820 81152 71612 -30961 -116472
16084a16472j1778m5967J4390P1742j9868r9299P5792L1817M5636J5594l7610
16073g6023j8657O3290J6858m8123K7488O7148m798j8431K531j09855m8833Q7302
16061f0103p874j05313m8803J06549N3738k3062M2917Q7888L1950N7476K6060
16050A61423m5243j18796j14743N9157J02452l2600n1733N2606N9568j1967j01320
16039d1196q3680k5905j9280M9310J47188l9984j2438N150L6139J0873j5775J1690
16027B2092k4267J0369n595K3510o6034Q455J11033M5506j1997q0252l954k4174
16015D692N3198j9386n9793p1030K3169N7353M4596L4437r81m0934m0082K2845
16003H084M3798k2008Q886l1773j08435o795M110R579O5285o8783j070l6814l1868
$$ plain form
16084 -116472 -128250 -174217 -159827 -88085 -107953 -207252 -131460 -99643 -54007 -38413 -76023
16073 -76023 -94680 -31390 -14532 -62655 -35167 31981 27183 8752 11283 -98572 -147405 -60103
16061 -60103 -67977 -173290 -222093 -115544 -61806 -84868 -41951 45937 77887 135363 161423
16050 161423 116180 -2616 -117359 -58202 44250 11650 -40083 12523 72091 60124 -41196
16039 -41196 -124876 -150781 -170061 -120751 26437 -13547 -25985 -20835 15304 26177 10402 22092
16027 22092 -2175 8194 2599 26109 -39925 -31470 79563 125069 113072 32820 28866 4692
16015 4692 57890 38504 -21289 -92319 -69150 -11797 32799 67236 66255 25321 -14761 8084
16003 8084 51882 29874 38760 6987 -101448 -108243 -104133 -94554 -29269 -98052 -99122 -135936 -167804
15990a67804J6719J04467J0747n4832j9994Q042J2671m8456J3166k4860R0209
15979e9925O5589m4989m3886j7191J02060P4376m252l368l6264l62m426m7082
15967a9720k4949O224o5895m2674r664J3856o0098j0711M2915K9360Q971N5308
15955g7077J6973O980j2023k3017N6133o01j0963J7450J4781l0453M667k8127
15943f5277J7349K3541K9001j8211P991m1486m0394J22568N1126M2371K1374l5228
15931A14725n5950m9687q8309q4119K3275k2322N2546K2041K6451m867l3456O0778
15919c8894L0355O074N6085j5829q3241j8519R9984N7600j6203j6943j9810n6875
15907a6216l7156r1123j3769P8832R3240j0262p2943m5224n922K8470N9538K2771
$$ plain form
15990 -167804 -151085 -46618 -35871 -90703 -110697 -102655 -89984 -138440 -125274 -150134 -59925
15979 -59925 5664 -39325 -83211 -100402 1658 76034 71782 68414 32150 31788 27362 -19720
15967 -19720 -44669 -38445 -104340 -147014 -156678 -142822 -202920 -213631 -170716 -141356 -132385 -77077
15955 -77077 -60104 -53124 -65147 -88164 -32031 -32632 -43595 -26145 -11364 -41817 -37150 -65277
15943 -65277 -47928 -24387 4614 -13597 -5606 -47092 -87486 35082 86208 128579 149953 114725
15931 114725 58775 9088 -79221 -163340 -140065 -162387 -109841 -87800 -61349 -66216 -99672 -38894
15919 -38894 -8539 -2465 53620 37791 -45450 -63969 36015 93615 77412 60469 40659 -16216
15907 -16216 -53372 -144495 -158264 -79432 13808 3546 -69397 -114621 -120543 -92073 -32535 -9764
15895i764o4159l777Q8139K2929r5713K4395N1484L1856m1944l5973L8568R971
15883A6012k3499o4594m0979k3676J060Q8080M6575N057n2550j0695r721L8911
15871c0019N0335k2247l9580L4034P550K7987O8355K9782L4126K6068k8780r0149
15859F7462p6604M8442K7641j7653l4546l5046J9632q0771n1924k2838L5039Q5973
15847c5193K7201m4343R0377N8397m9384L8789m8020q5787m2412O9450O7100L5212
15835H1387k3440k1281k383Q9o8501J1813J26007N4536k3868m4524j6597j5341
15823E7897J9868P34N0204J3215n146l7809n5212p6600o3529j5073N2581k2404
15811h1274K8721L0425q274K959M612M3514O1904n0708o30P4408L2032j20611
$$ plain form
15895 -9764 -73923 -77700 10439 33368 -62345 -37950 13534 45390 3446 -32527 6041 16012
15883 16012 -7487 -72081 -113060 -136736 -135676 -47596 -1021 4036 -48514 -59209 -68930 -30019
15871 -30019 20316 -1931 -41511 -7477 73 28060 96415 126197 160323 186391 157611 67462
15859 67462 -9142 39300 66941 49288 14742 -20304 -672 -81443 -133367 -156205 -121166 -35193
15847 -35193 -7992 -52335 38042 96439 47055 85844 37824 -47963 -90375 -20925 46175 81387
15835 81387 57947 36666 34283 34372 -34129 -22316 103691 158227 134359 89835 73238 57897
15823 57897 77765 78499 128703 141918 136772 98963 43751 -32849 -96378 -111451 -58870 -81274
15811 -81274 -52553 -22128 -30402 -27443 -22831 20683 82587 31879 31249 105657 137689 17078
15799A7078j6692j9226k4752l3140M4904Q7801P784N709m8404j9425M0576P4359
15787A16572l0218J0723j26801n3052K3504P9424q471N6734l5572p7064q597o7036
15775a19854m1670K5676J27445J02041L6526J5417l8663J276k750p3479L7616
15764F9581L4859m4628l6470P1489M0775j44542r0000k3089L7981k6515J2506
15753i8053O5798j00154R4331R4616K9595n0315n7032M013K6120m5585k2155k833
15741f1654N3062J9723n2703n530K8379n4256k637M4827J00141M5455j07679l3220
15729b6092n9918N8834J3172N6033K1182k4414l0491j0580n9301k9630m282j1752
15717a07239R3420Q3925n309k3917J4000N5684j3601q4448q8731r198J4214o3780
$$ plain form
15799 17078 386 -18840 -43592 -76732 -31828 55973 63757 69466 21062 1637 42213 116572
15787 116572 86354 97077 -29724 -82776 -59272 20152 11681 68415 32843 -44221 -52818 -119854
15775 -119854 -161524 -135848 -8403 93638 130164 145581 106918 108194 105444 31965 69581
15764 69581 104440 59812 23342 94831 135606 -8936 -98936 -122025 -84044 -110559 -98053
15753 -98053 -32255 -132409 -38078 56538 86133 35818 -21214 -17201 8919 -36666 -58821 -61654
15741 -61654 -8592 11131 -41572 -47102 -18723 -72979 -75616 -30789 69352 114807 7128 -26092
15729 -26092 -86010 -27176 -14004 42029 63211 38797 8306 -2274 -61575 -91205 -95487 -107239
15717 -107239 -13819 70106 64797 40880 54880 110564 96963 12515 -76216 -85414 -71200 -134980
15705a34980n9109O0279K8968k04l8649K7458k7280Q180L69k6989K3182N1354
15693h7421K5675Q9858J325q8380j3169n806j2601M4347N3728N9579L3241l277
15681I7099m2786j5681J4919l026L155m3106p6703p312j9270M5439j8931L0483
15669c5720P2225j9094l9783J9620O477q0365p755P5485O1431p661k4561M668
15657B4967N7729N0868L67n2344o9796l6326l3275L4329O4726K7726n4684r8996
15645h4709j1742m1769K8307O1620M6327P1837j25316p5330l092L7222r539J6923
15633h9261j013M3809o3764Q276M6372j1676k4612P5200L3340o3769m9723P4572
15621b2249N0723p061o5202m226L2312R3844k215k623j8193p0418r2934O1929
$$ plain form
15705 -134980 -194089 -133810 -104842 -105046 -143695 -116237 -143517 -135337 -134968 -161957 -138775 -87421
15693 -87421 -61746 28112 29437 -58943 -72112 -77918 -90519 -46172 7556 67135 100376 97099
15681 97099 54313 38632 53551 50525 53680 10574 -66129 -73441 -92711 -47272 -66203 -35720
15669 -35720 36505 17411 -22372 -2752 3725 -76640 -84395 -8910 52521 44860 20299 24967
15657 24967 82696 133564 133931 81587 11791 -24535 -57810 -23481 41245 68971 14287 -84709
15645 -84709 -96451 -138220 -109913 -48293 -1966 69871 -55445 -130775 -133867 -96645 -106184 -89261
15633 -89261 -90274 -46465 -110229 -101953 -55581 -67257 -91869 -16669 16671 -47098 -96821 -22249
15621 -22249 28474 21413 -43789 -48015 -15703 78141 75926 73303 55110 -15308 -108242 -46313
15609d6313N1842K9417P7155j1364N6498M559p0123o5699L308L7770m6640j06987
15597h6577n0729J0208J47728m119q8749o5497n6608R3710L2339J03107O2608
15586I7421p6072n9900J19650J9444r8740p4968J8915j0660P868K5633Q9520L1054
15574H9165r3270n7373J4501L0226l1978J9763J2146m9588N5553L7872p6819l5773
15562h5575N6944j2337J8668l1250m6017N9447m9090n6517Q9696P9289R3359k8069
15550H8548j19998j1261M4657l5789l2144K36k5934N6304P8869L2944q924l7942
15538B9566r4211j23103K6378O7764N0535K5704N0085o0631j1509k8147N87M8294
15526a8688l3449m0526P478j3893k3518k8084j9816K5407L7349J9466K3537M3539
$$ plain form
15609 -46313 5529 34946 112101 100737 157235 161794 91671 25972 29280 67050 20410 -86577
15597 -86577 -137306 -127098 20630 16511 -72238 -137735 -194343 -100633 -68294 34813 97421
15586 97421 21349 -38551 81099 100543 1803 -73165 -54250 -64910 -57042 -31409 58111 89165
15574 89165 -4105 -61478 -46977 -16751 -48729 -28966 -16820 -66408 -10855 27017 -49802 -85575
15562 -85575 -28631 -40968 -22300 -53550 -99567 -40120 -89210 -145727 -56031 23258 116617 88548
15550 88548 -31450 -42711 1946 -33843 -65987 -65751 -91685 -35381 43488 76432 67508 29566
15538 29566 -64645 -187748 -161370 -93606 -43071 -17367 32718 -27913 -39422 -67569 -66982 -18688
15526 -18688 -52137 -92663 -85185 -99078 -122596 -150680 -170496 -145089 -107740 -88274 -64737 -21198
15514b1198P199N622N7062L0172m5277j542K7180n4749o9849P707M9554P1802
15502F3683O4810p913l6355J9573O9151J4043q3068o0288J4752P7624o6866l4997
15490C4149j7679m5644k5386j8840L689j2088j5348l9769K629O2042L2277J803
15478c8165n8457j6864R5067P473M3913n9917m1656P955J4748k1065J4760p609
15466e9817P198o6319o0923m0993j452J54297K6617l2726p6346J3482p093r335
15454a53410O9081o3731L2460L8811l4572j1617N2369R402K865K3922o9257J488
15442a02189K5770Q069O7648k1416m783L4356J8748J2427l489k3260p6692j8152
15430h2963K3917M8848L3956o239q5370q7323j3641R0657J22196O9729l984k4654
$$ plain form
15514 -21198 -13999 -8377 48685 78857 33580 32038 59218 4469 -65380 -57673 -8119 63683
15502 63683 128493 120580 84225 103798 172949 186992 103924 43636 58388 136012 69146 34149
15490 34149 16470 -29174 -54560 -73400 -69711 -81799 -97147 -136916 -134287 -72245 -39968 -38165
15478 -38165 -96622 -113486 -18419 -10946 32967 -26950 -68606 -60651 -45903 -66968 -52208 -59817
15466 -59817 -52619 -118938 -179861 -220854 -222306 -68009 -41392 -74118 -150464 -136982 -144075 -153410
15454 -153410 -84329 -148060 -115600 -76789 -111361 -122978 -70609 -61207 -58342 -34420 -103677 -102189
15442 -102189 -76419 -68350 -702 -22118 -26901 7455 26203 38630 35141 11881 -64811 -82963
15430 -82963 -59046 -10198 23758 17519 -67851 -155174 -168815 -78158 44038 113767 109783 85129
15418H5129k6581k1566q8682K8356k0808q6255j8417O3809R2768o811j3485J6178
15406C635P967k8070m9243K016j7614m1401J7831l5442N738N9856M3889M8160
15394A7322k940l8480L3259R1156n6301m6681M7192N920o0723j07480j16862L2226
15382b02392N8232O9812L302J4150J7645R5476o3821r225P0963l6944m2341l6557
15370f1700J2672P6479J4751J8426O6179n3385m7019K4674Q592k4755o353L769
15358C2330m5829m6385R2828K0497q422o5323p3605j1891J3044M7764P0221L0793
15346E6022j26266r4349o4233K2190J16394O9952m7658o460R1856J6307l9978
15335f223n4035N2769k0764R7534N9676l4305m5628k3472m1755M1426R1456k022
$$ plain form
15418 85129 58548 36982 -51700 -23344 -44152 -130407 -148824 -85015 7753 942 -12543 3635
15406 3635 11602 -16468 -65711 -63695 -81309 -122710 -104879 -140321 -134583 -74727 -30838 17322
15394 17322 14382 -24098 9161 100317 44016 -2665 44527 50447 -10276 -117756 -234618 -202392
15382 -202392 -144160 -74348 -71046 -56896 -39251 56225 -7596 -16821 54142 17198 -25143 -61700
15370 -61700 -49028 27451 42202 60628 126807 73422 26403 51077 59669 34914 28561 32330
15358 32330 -13499 -59884 32944 53441 45019 -20304 -93909 -105800 -92756 -44992 25229 56022
15346 56022 -70244 -164593 -228826 -206636 -90242 -20290 -67948 -74408 17448 33755 -6223
15335 -6223 -60258 -7489 -28253 69281 128957 94652 49024 25552 -16203 25223 116679 114657
15323A14657p2714q0208m696Q4127K2685k866q5745p982l5704j0973M6299O6316
15311C3196l8813o1658K2308k8773K167k3070j065N2409k7450k9494L1327j9824
15299h8740n0439n802O7714L9495k2792k551Q937N2291M1451K1911k9594k1544
15287A0337k9832j3353j8069j847l0807j0829L7097K2385Q886k0890Q7533J9810
15275F0421m9829j3851j6623m0190p184L3227K0198O7306n931K1357m0604R671
15263C7968M2353n1594m7176O6938m3237r4108N2841Q4786q5920N0929M721m504
15251A3997O507K4232K2223q141J5208n847n8942J7347p5920o1218R480Q7187
15239a3887J4685j0789k9894P712K0112J265j9977j28782K3940J6644K7970M458
$$ plain form
15323 114657 41943 -38265 -42961 41166 63851 60985 -24760 -32742 -68446 -79419 -33120 33196
15311 33196 -5617 -67275 -44967 -73740 -71573 -94643 -95708 -43299 -70749 -100243 -68916 -88740
15299 -88740 -139179 -144981 -77267 -37772 -60564 -63115 -54178 -1887 39564 61475 31881 10337
15287 10337 -19495 -32848 -50917 -52764 -83571 -94400 -57303 -34918 -26032 -46922 40611 60421
15275 60421 10592 -3259 -19882 -60072 -67256 -34029 -13831 53475 47544 68901 28297 37968
15263 37968 80321 28727 -18449 48489 5252 -88856 -36015 48771 -37149 13780 18501 13997
15251 13997 20504 44736 66959 58818 74026 68179 9237 26584 -49336 -110554 -101074 -13887
15239 -13887 798 -9991 -39885 -32173 -12061 -10796 -30773 -159555 -135615 -118971 -91001 -86543
15227h6543N3170j8264l7825R7705j685m0427k4993P6622K8536n0295j08366Q1563
15215c0802l0379M5246N013N418M0364o5916k3036n0154J9125l1435n602J3733
15203a08425J6527n555K5368J20257Q433n7093m5139M3077p6058k1181Q6078N6200
15191D2489j504p3214m2578R113O6260Q0494n9060o7827o9091N5652R22Q76J1019
15178d6449k7356N2383J801p1690K7021J6130O9631L7956o044k7536j8858m8939
15166d1950M5431j0357O6060j0513o0770m8376J3386L6975m288r7443l1083K416
$$ plain form
15227 -86543 -33373 -51637 -89462 8243 6558 -33869 -58862 17760 46296 -3999 -112365 -30802
15215 -30802 -61181 -15935 -10922 -5504 34860 -31056 -54092 -104246 -85121 -116556 -122158 -108425
15203 -108425 -91898 -97453 -72085 48172 56605 -488 -45627 -2550 -78608 -99789 -13711 42489
15191 42489 40985 -32229 -74807 -65694 566 81060 22000 -45827 -114918 -59266 -58344 -57468 -46449
15178 -46449 -73805 -21422 -19621 -91311 -64290 -48160 21471 59427 53383 25847 6989 -41950
15166 -41950 3481 -6876 59184 48671 -12099 -60475 -47089 -10114 -14402 -111845 -142928 -140512
$$ [...]
##END NTUPLES=NMR SPECTRUM
##END=
