##TITLE=Analysis number 311230
Compound Code cc 45609
Book Reference 440/44
Project Code adrs
Chemist Name craigr
##JCAMPDX= 6.0         $$ Bruker NMR JCAMP-DX V2.0
##DATA TYPE= NMR SPECTRUM
##DATA CLASS= NTUPLES
##ORIGIN= Bruker BioSpin GmbH
##OWNER= NMR
$$ XWIN-NMR		Version 3.5
$$ Mon Jul  4 14:58:02 2005 GMT Daylight Time (UT+1h)  MAYBRIDGE\NMR@NMR_250MHZ
##.OBSERVE FREQUENCY= 250.131544655141
##.OBSERVE NUCLEUS= ^1H
##.ACQUISITION MODE= SIMULTANEOUS (DQD)
##.ACQUISITION SCHEME= undefined
##.AVERAGES= 16
##.DIGITISER RES= 18
##SPECTROMETER/DATA SYSTEM= dpx250
##.PULSE SEQUENCE= zg30
##.SOLVENT NAME= CDCl3
##.SHIFT REFERENCE= (INTERNAL, CDCl3, 0, 16.522)
##AUDIT TRAIL= $$ (NUMBER, WHEN, WHO, WHERE, WHAT)
$$ ##TITLE= Audit trail, XWIN-NMR		Version 3.5
$$ ##JCAMPDX= 5.01
$$ ##ORIGIN= Bruker BioSpin GmbH
$$ ##OWNER= NMR
$$ C:\u/data/dgb/nmr/ADRS/5320/pdata/1/auditp.txt
$$ ##AUDIT TRAIL=  $$ (NUMBER, WHEN, WHO, WHERE, WHAT)
(   1,<2005-07-04 14:57:38.30 +100>,<MAYBRIDGE\NMR>,<NMR_250MHZ>,
      <created by zg, POWCHK disabled, PULCHK disabled
       configuration hash MD5:
       62 19 C7 07 E1 42 D1 B7 37 6C 3D D0 77 39 F9 E6
       data hash MD5: 64K
       07 2F AB 74 4A 11 29 44 20 67 83 87 4B 64 D1 E4>)
(   2,<2005-07-04 14:57:52.61 +100>,<MAYBRIDGE\NMR>,<NMR_250MHZ>,
      <Start of raw data processing
       ef LB = 0.3 FT_mod = 6 PKNL = 1 SI = 32K 
       data hash MD5: 32K
       DD 55 56 71 D8 5B C5 61 11 3F 9C 51 76 E0 31 C8>)
(   3,<2005-07-04 14:57:54.50 +100>,<MAYBRIDGE\NMR>,<NMR_250MHZ>,
      <apk 
       data hash MD5: 32K
       E5 BD 24 A0 73 AF 5A 79 EF 7A 5F 1E A9 2F 23 63>)
(   4,<2005-07-04 14:57:55.32 +100>,<MAYBRIDGE\NMR>,<NMR_250MHZ>,
      <abs ABSG = 5 
       data hash MD5: 32K
       80 3F 21 85 1F A0 AC 78 EE 30 F9 8B 4A 06 AF 65>)
$$ ##END=
$$ 
$$ hash MD5
$$ 76 73 37 97 B6 BE E7 4F AD 90 A2 17 AC 7D ED 0B
##$RELAX= 
##$RELAX= 
##$RELAX= 
##$RELAX= 
##$RELAX= 
##$RELAX= 
##$RELAX= 
$$ Bruker specific parameters
$$ --------------------------
##$DU= <C:\u>
##$EXPNO= 5320
##$NAME= <ADRS>
##$PROCNO= 1
##$TYPE= <nmr>
##$USER= <dgb>
##$AMP= (0..31)
100 100 100 100 100 100 100 100 100 100 100 100 100 100 100 100 100 100 
100 100 100 100 100 100 100 100 100 100 100 100 100 100 
##$AQSEQ= 0
##$AQ_mod= 3
##$AUNM= <au_zg>
##$AUTOPOS= <50 >
##$BF1= 250.13
##$BF2= 250.13
##$BF3= 250.13
##$BF4= 250.13
##$BF5= 500.13
##$BF6= 500.13
##$BF7= 500.13
##$BF8= 500.13
##$BYTORDA= 1
##$CFDGTYP= 0
##$CFRGTYP= 5
##$CHEMSTR= <none>
##$CNST= (0..31)
1 1 145 1 1 1 1 1 1 1 1 1 1 1 1 1 1 1 1 1 1 1 1 1 1 1 1 1 1 1 1 1 
##$CPDPRG= <>
##$CPDPRG1= <>
##$CPDPRG2= <>
##$CPDPRG3= <>
##$CPDPRG4= <mlev>
##$CPDPRG5= <mlev>
##$CPDPRG6= <mlev>
##$CPDPRG7= <mlev>
##$CPDPRG8= <mlev>
##$CPDPRGB= <>
##$CPDPRGT= <>
##$D= (0..31)
0 1 0 0 0 0 0 0 0 0.06 0 0 0 0 0 0 0.0002 0 0 0 0 0 0 0 0 0 0 0 0 0 0 
0 
##$DATE= 1120485456
##$DBL= (0..7)
120 120 120 120 120 120 120 120 
##$DBP= (0..7)
150 150 150 150 150 150 150 150 
##$DBP07= 0
##$DBPNAM0= <>
##$DBPNAM1= <>
$$ [...]
##$SUBNAM7= <"">
##$SUBNAM8= <"">
##$SUBNAM9= <"">
##$SW= 20.6930455092707
##$SWIBOX= (0..15)
0 0 3 0 0 0 0 0 0 0 0 0 0 0 0 0 
##$SW_h= 5175.983436853
##$TD= 65536
##$TD0= 1
##$TE= 295.16
##$TE2= 300
##$TE3= 300
##$TEG= 300
##$TL= (0..7)
0 120 120 120 120 120 120 120 
##$TP= (0..7)
150 150 150 150 150 150 150 150 
##$TP07= 0
##$TPNAME0= <>
##$TPNAME1= <>
##$TPNAME2= <>
##$TPNAME3= <>
##$TPNAME4= <>
##$TPNAME5= <>
##$TPNAME6= <>
##$TPNAME7= <>
##$TPOAL= (0..7)
0.5 0.5 0.5 0.5 0.5 0.5 0.5 0.5 
##$TPOFFS= (0..7)
0 0 0 0 0 0 0 0 
##$TUNHIN= 0
##$TUNHOUT= 0
##$TUNXOUT= 0
##$USERA1= <user>
##$USERA2= <user>
##$USERA3= <user>
##$USERA4= <user>
##$USERA5= <user>
##$V9= 5
##$VALIST= <valist>
##$VCLIST= <CCCCCCCCCCCCCCC>
##$VD= 0
##$VDLIST= <DDDDDDDDDDDDDDD>
##$VPLIST= <PPPPPPPPPPPPPPP>
##$VTLIST= <TTTTTTTTTTTTTTT>
##$WBST= 1024
##$WBSW= 4
##$XGAIN= (0..3)
0 0 0 0 
##$XL= 0
##$YL= 0
##$YMAX_a= 330138
##$YMIN_a= -450107
##$ZGOPTNS= <>
##$ZL1= 120
##$ZL2= 120
##$ZL3= 120
##$ZL4= 120
##$ABSF1= 16.522
##$ABSF2= -4.171173
##$ABSG= 5
##$ABSL= 3
##$ALPHA= 0
##$AQORDER= 0
##$ASSFAC= 0
##$ASSFACI= 0
##$ASSFACX= 0
##$ASSWID= 0
##$AUNMP= <proc_1d>
##$AZFE= 0.1
##$AZFW= 0.1
##$BCFW= 0
##$BC_mod= 0
##$BYTORDP= 0
##$COROFFS= 0
##$CY= 12.5
##$DATMOD= 1
##$DC= 0
##$DFILT= <>
##$DTYPP= 0
##$F1P= 14.0000005364418
##$F2P= -0.99999901652339
##$FCOR= 0.5
##$FTSIZE= 32768
##$FT_mod= 6
##$GAMMA= 0
##$GB= 0
##$INTBC= 1
##$INTSCL= 1
##$ISEN= 128
##$LB= 0.3
##$LEV0= 0
##$LPBIN= 0
##$MAXI= 10000
##$MC2= 0
##$MEAN= 0
##$ME_mod= 0
##$MI= 0
##$NCOEF= 0
##$NC_proc= -4
##$NLEV= 6
##$NOISF1= 0
##$NOISF2= 0
##$NSP= 0
##$NTH_PI= 0
##$NZP= 0
##$OFFSET= 16.522
##$PC= 1
##$PHC0= -74.25072
##$PHC1= 4.725296
##$PH_mod= 1
##$PKNL= yes
##$PPARMOD= 0
##$PSCAL= 4
##$PSIGN= 0
##$REVERSE= no
##$SF= 250.13
##$SI= 32768
##$SIGF1= 0
##$SIGF2= 0
##$SINO= 400
##$SIOLD= 32768
##$SREGLST= <1H.CDCl3>
##$SSB= 0
##$STSI= 32768
##$STSR= 0
##$SW_p= 5175.98343685301
##$SYMM= 0
##$S_DEV= 0
##$TDeff= 65536
##$TDoff= 0
##$TI= <Analysis number 999999
Compound Code 99
Book Reference 9
Project Code 9>
##$TILT= no
##$TM1= 0
##$TM2= 0
##$TOPLEV= 0
##$USERP1= <user>
##$USERP2= <user>
##$USERP3= <user>
##$USERP4= <user>
##$USERP5= <user>
##$WDW= 1
##$XDIM= 32768
##$YMAX_p= 331636625
##$YMIN_p= -145640
$$ End of Bruker specific parameters
$$ ---------------------------------
##NTUPLES= NMR SPECTRUM
##VAR_NAME=  FREQUENCY,     SPECTRUM/REAL,   SPECTRUM/IMAG
##SYMBOL=    X,             R,               I
##VAR_TYPE=  INDEPENDENT,   DEPENDENT,       DEPENDENT
##VAR_FORM=  AFFN,          ASDF,            ASDF
##VAR_DIM=   32768,         32768,           32768
##UNITS=     HZ,            ARBITRARY UNITS, ARBITRARY UNITS
##FACTOR=    0.157963299565203, 1,           1
##FIRST=     4132.6476996994, 0,             0
##LAST=      -1043.33573715361, 0,           0
##MIN=       -1043.33573715361, -145640,     0
##MAX=       4132.6476996994, 331636625,     0
$$ Real data points
##PAGE= N=1
##DATA TABLE= (X++(R..R)), XYDATA
$$ [...]
$$ plain form
15768 12796 -11784 -6 9126 -11641 1449 4957 8612 42760 50007 58233 27605 18849 9504
15755 9504 -1088 6090 27341 29279 16144 31673 36107 -1219 775 4540 -20104 -21441 -12279
15742 -12279 -8968 7493 -9000 -21634 -22180 24875 29478 41815 27544 15771 -3617 -9305 -14692
15729 -14692 -31576 -23922 -8423 10023 -9851 -7903 -2467 -6656 -19115 -10566 8402 -37 -7367
15716 -7367 -33783 -49432 -71977 -65251 -39775 -22951 -17598 -19322 2904 15740 15055 1384 -8070
15703 -8070 -5875 -2768 -13279 -22436 21032 21064 -12589 7803 29437 41514 27313 15267 6264
15690 6264 -4126 7627 38223 30826 13678 -6335 -24483 -32085 -36307 -13923 -6145 -9713 -29504
15677 -29504 -23266 -15473 -27374 -45472 -29722 -22930 -20946 -15725 -39807 -75882 -52908 -26932 -41536
$$ packed form
15768A2796k4580J1778R132k0767J3090L508L655L4148P247Q226l0628q756r345
15755I504j0592P178K1251J938j3135J5529M434l7326J994L765k4644j337R162
15742a2279L311J6461j6493j2634n46M7055M603J2337j4271j1773j9388n688n387
15729a4692j6884P654J5499J8446j9874J948N436m189j2459Q549J8968q439p330
15716g367k6416j5649k2545O726K5476J6824N353j724K2226J2836o85j3671r454
15703h070K195L107j0511r157M3468L2l3653K0392K1634J2077j4201j2046r003
15690F264j0390J1753L0596p397j7148k0013j8148p602m222K2384P778l568j9791
15677b9504O238P793j1901j8098J5750O792J984N221k4082l6075K2974K5976j4604
$$ plain form
15664 -41536 -57756 -52181 -30740 -29595 -38459 -30337 -8762 7112 14462 22938 33628 31655 32353
15651 32353 13857 -32402 -47868 -48982 -55830 -18827 18106 6098 -25939 -25232 -55586 -43457
15639 -43457 -42250 -61738 -70941 -45100 -32903 -22647 -15867 -4984 880 16592 32288 20169
15627 20169 7109 1638 -8045 -42820 -61330 -32890 -1630 9345 -10357 -21615 -13320 8365
15615 8365 -523 -9762 -19699 -14588 6724 13040 -5628 -11907 -21217 -53419 -41814 -24189 -19129
15602 -19129 -13351 -10371 -38816 -55759 -41111 -34935 -13034 -6902 -7467 -16149 -35392 -38277 -24900
15589 -24900 -11128 -24151 -16736 -18390 -15006 -22039 -53212 -70616 -61483 -76723 -77093 -28147 5108
15576 5108 -9111 -16243 5553 3009 -28104 -43757 -55059 -61533 -27227 -2944 466 -18236 -11269
$$ packed form
15664d1536j6220N575K1441J145q864Q122K1575J5874P350Q476J0690j973O98
15651C2353j8496m6259j5466j114o848L7003L6933j2008l2037P07l0354J2129
15639d3457J207j9488r203K5841J2197J0256O780J0883N864J5712J5696j2119
15627B0169j3060n471r683l4775j8510K8440L1260J0975j9702j1258Q295K1685
15615H365q888r239r937N111K1312O316j8668o279r310l2202J1605J7625N060
15602a9129N778K980k8445j6943J4648O176K1901O132n65q682j9243k885J3377
15589b4900J3772j3023P415j654L384p033l1173j7404R133j5240l70M8946L3255
15576E108j4219p132K1796k544l1113j5653j1302o474L4306K4283L410j8702O967
$$ plain form
15563 -11269 -2662 10623 44490 5775 -34173 -43360 -21995 -4716 -11112 -11955 -7563 -1395 7012
15550 7012 -5717 -35436 -74942 -80310 -77655 -71067 -36660 -12704 12237 -6170 -8500 -13674 -32275
15537 -32275 -28340 -35665 -18792 5813 266 -7564 9801 -12854 -32805 -29845 488 31063 32828
15524 32828 7673 -2921 -8844 -5628 -12810 -52308 -45342 -34514 -37801 -25576 -17650 -36946 -38112
15511 -38112 -38048 -31117 -6644 -13769 -39240 -41265 -44998 -64636 -60172 -42907 -44981 -53058 -19142 -10135
15497 -10135 -8211 -5558 -37091 -46195 -24934 -4419 16180 8963 -6531 -16162 -788 19572 -9533
15484 -9533 -22825 896 24669 8680 -2505 -17821 -26277 -10174 -8522 -6420 -24709 -26756 -22452
15471 -22452 -12646 21604 33237 30484 40672 26903 -16080 -11189 -10535 -13350 -7933 -19002 -43044
$$ packed form
15563a1269Q607J3285L3867l8715l9948r187K1365J7279o396q43M392O168Q407
15550G012j2729k9719l9506n368K655O588L4407K3956K4941j8407k330n174j8601
15537c2275L935p325J6873K4605n547p830J7365k2655j9951K960L0333L0575J765
15524C2828k5155j0594n923L216p182l9498O966J0828l287J2225P926j9296j166
15511c8112O4O931K4473p125k5471k025l733j9638M464J7265k074q077L3916R007
15497a0135J924K653l1533r104K1261K0515K0599p217j5494r631J5374K0360k9105
15484i533j3292K3721K3773j5989j1185j5316q456J6103J652K102j8289k047M304
15471b2452R806L4250J1633k753J0188j3769m2983M891O54k815N417j1069k4042
$$ plain form
15458 -43044 -47916 -57780 -53718 -15565 -4586 1 -2565 -10552 -12313 -12699 -20002 -13628 -17192 -13150
15444 -13150 -3900 -17562 -18563 -4594 9832 28386 21542 18166 24140 4326 -8705 8418 -10837
15431 -10837 2418 3697 454 13131 19195 4907 1142 17279 4982 8232 16191 -12562 -43033
15418 -43033 -43349 -45631 -40594 -18410 -2952 -9704 -36463 -40408 -29625 -32922 -46005 -27422 18605
15405 18605 12691 9000 -18296 -43115 -39578 -25152 -38870 -5577 -133 592 3814 -8397 -28181
15392 -28181 -26407 3372 13366 7274 8482 22493 10514 3519 -6559 -2284 -7704 -7670 2887 2381
15378 2381 -5141 2466 12559 18107 14664 -6308 -38136 -37300 181 26718 7767 7293 16118 25030
15364 25030 16630 3001 -12394 9006 3021 -23147 -37699 -29397 -16824 12223 -7150 -39273
$$ packed form
15458d3044m872r864M062L8153J0979M587k566p987j761l86p303O374l564M042
15444a3150R250j3662j001J3969J4426J8554o844l376N974j9814j3031J7123j9255
15431a0837J3255J279l243J2677O064j4288l765J6137j2297L250P959k8753l0471
15418d3033l16k282N037K2184J5458o752k6759l945J0783l297j3083J8583M6027
15405A8605n914l691k7296k4819L537J4426j3718L3293N444P25L222j2211j9784
15392b8181J774K9779R994o092J208J4011j1979o995j0078M275n420L4J0557n06
15378B381p522P607J0093N548l443k0972l1828Q36L7481K6537j8951m74Q825Q912
15364B5030q400j3629j5395K1400n985k6168j4552Q302J2573K9047j9373l2123
$$ plain form
15352 -39273 -65416 -89451 -72781 -18184 14681 18796 4042 -1785 -37141 -49405 -43537 -36309
15340 -36309 -36559 -41195 -23945 -20145 -4322 -6862 -25449 -25163 -14022 -1620 -5159 -25841 -43754
15327 -43754 -255 1191 -23421 -20149 10252 915 -17442 -19507 -6528 -13994 -18894 1343 -4908
15314 -4908 -40944 -55031 -59902 -34342 -27555 -11263 -23682 -42488 -55063 -47929 -40857 -21252 -7686
15301 -7686 -11141 -23420 -13613 -35648 -19549 -6617 -21184 -12717 -13294 -18637 -14706 -33752 -12931
15288 -12931 -13287 -35225 -30481 -29072 -13783 -26053 -32740 -15757 -14978 -18894 -21349 -12630 -3106 -19190
15274 -19190 -4850 5919 -20074 -24806 237 -8104 -26032 -12167 -3991 4541 -7821 -18233
15262 -18233 -8094 -1122 -18944 -10170 8459 -13269 -14097 5676 15387 57 8286 2709 -20137
$$ packed form
15352c9273k6143k4035J6670N4597L2865M115j4754n827l5356j2264N868P228
15340c6309k50m636J7250L800J5823k540j8587K86J1141J2402l539k0682j7913
15327d3754M3499J446k4612L272L0401r337j8357k065J2979p466m900K0237o251
15314d908l6036j4087m871K5560O787J6292j2419j8806j2575P134P072J9605J3566
15301g686l455j2279R807k2035J6099J2932j4567Q467n77n343L931j9046K0821
15288a2931l56k1938M744J409J5289j2270o687J6983P79l916k455Q719R524j6084
15274a9190J4340J0769k5993m732K5043q341j7928J3865Q176Q532j2362j0412
15262a8233J0139O972j7822Q774J8629k1728q28J9773R711j5330Q229n577k2846
$$ plain form
15249 -20137 -42764 -33161 -24749 -3773 -9172 -37981 -57724 -53936 -20284 -15766 -21326 -37074 -28810
15236 -28810 12500 25227 18753 24856 8883 -11673 -8146 -4260 15190 31714 37174 21867 28685
15223 28685 7102 2815 -11338 -9602 1587 -7318 -23787 -26689 -52121 -45192 -22116 -27963 -31041
15210 -31041 -12795 6416 -4089 5904 13440 7900 -1199 16662 36036 33340 19858 33468 26948
15197 26948 20775 33880 30959 12840 -3606 -21419 -22898 -33882 -22178 -5705 3437 -6134 -4636
15184 -4636 -12983 3196 13992 22405 5942 -26811 -17931 -21123 -35122 -56431 -39632 -2801 26641
15171 26641 15359 -20919 -10416 16955 12640 -6960 3814 -281 -15251 -30731 -46168 -39661
15159 -39661 -33396 -19121 3726 26870 46921 25848 15439 34458 14769 -13747 -11192 -25791
$$ packed form
15249b0137k2627R603Q412K0976n399k8809j9743L788L3652M518n560j5748Q264
15236b8810M1310J2727o474O103j5973k0556L527L886J9450J6524N460j5307O818
15223B8685k1583m287j4153J736J1189q905j6469k902k5432O929K3076n847l078
15210c1041J8246J9211j0505R993P536n540r099J7861J9374k696j3482J3610o520
15197B6948o173J3105k921j8119j6446j7813j479j0984J1704J6473R142r571J498
15184d636q347J6179J0796Q413j6463l2753Q880l192j3999k1309J6799L6831K9442
15171B6641j1282l6278J0503K7371m315j9600J0774m095j4970j5480j5437O507
15159c9661O265J4275K2847K3144K0051k1073j0409J9019j9689k8516K555j4599
$$ plain form
15147 -25791 -31579 -33332 -8135 -14167 -17947 -20601 -13264 1984 -10804 2334 7580 15374 -8255
15134 -8255 -20128 -4429 -11270 -2339 -13876 -17961 -12237 -10694 -19043 -31604 -10537 6467 11024
15121 11024 2967 -15756 -18421 -19809 -2252 -22765 -44662 -39653 -39620 -45111 -41233 -10264 -25376
15108 -25376 -26288 -15101 25681 38247 26049 -3819 12310 27275 41114 40154 9951 -14664
15096 -14664 -10102 7602 8643 -6538 -7518 -5114 24205 59670 31519 26859 29990 25254 11244
15083 11244 2032 -1145 -11600 -23948 -17662 -42807 -51759 -48024 -30063 -35411 -39161 -28092 -7082
15070 -7082 -22933 -11646 5787 35390 7639 -2755 -9135 2353 18119 -11488 -3407 8370
15058 8370 26379 25541 -7492 -43386 -38068 -1719 15346 18012 25828 21136 23114 15216 -13574
$$ packed form
15147b5791n788j753K5197o032l780k654P337J5248j2788J3138N246P794k3629
15134h255j1873J5699o841Q931j1537m085N724J543q349j2561K1067J7004M557
15121A1024q057j8723k665j388J7557k0513k1897N009L3n491L878L0969j5112
15108b5376r12J1187M0782J2566j2198k9868J6129J4965J3839r60l0203k4615
15096a4664M562J7704J041j5181r80K404K9319L5465k8151m660L131m736j4010
15083A1244r212l177j0455j2348O286k5145q952L735J7961n348l750J1069K1010
15070g082j5851J1287J7433K9603k7751j0394o380J1488J5766k9607Q081J1777
15058H370J8009q38l3033l5894N318L6349J7065K666P816m692J978p898k8790
$$ plain form
15045 -13574 -36406 -49526 -55993 -44617 -39048 -29033 -17577 -19468 -28198 -61118 -61175 -25221 -36607
15032 -36607 -60008 -43689 -36489 -44695 -42414 -30229 -19911 -25808 -32945 -10077 2749 7803 -4247
15019 -4247 -4529 -16715 -8894 3944 9848 33494 44845 10929 -22454 -37707 -26464 -12987 -18722
15006 -18722 -20635 -31264 -52875 -22723 3556 -4987 -5735 -2087 243 17187 11113 -5049 -15854
14993 -15854 -39893 -24960 -3607 -15686 -5043 22711 36370 9737 -7222 -10904 -29201 -51238
14981 -51238 -41334 -34520 -40741 -14583 9616 -11144 -18270 -10120 -20791 -40520 -50679 -32429 -28549
14968 -28549 -27511 -21163 7372 2682 -3448 6631 3436 -24811 -11027 -14407 -21377 -14062 -25711
14955 -25711 -32426 -17038 -18836 -10357 17863 25159 12580 9239 6806 1687 -30049 -22869 4395
$$ packed form
15045a3574k2832j3120o467J1376N569J0015J1456j891q730l2920n7L5954j1386
15032c6607k3401J6319P200q206K281J2185J0318n897p137K2868J2826N054j2050
15019d247k82j2186P821J2838N904K3646J1351l3916l3383j5253J1243J3477n735
15006a8722j913j0629k1611L0152K6279q543p48L648K330J6944o074j6162j0805
14993a5854k4039J4933K1353j2079J0643K7754J3659k6633j6959l682j8297k2037
14981e1238R904O814o221K6158K4199k0760p126Q150j0671j9729j0159J8250L880
14968b8549J038O348K8535m690o130J0079l195k8247J3784l380o970P315j1649
14955b5711o715J5388j798Q479K8220P296j2579l341k433n119l1736P180K7264
$$ plain form
14942 4395 -6510 -30338 -27227 -25895 -42768 -35510 -16785 -8865 16170 40898 17500 -23197 -11679
14929 -11679 -3259 25032 12280 -15013 1854 16497 -8344 -22395 -10439 -6206 11494 13368
14917 13368 17663 -18643 -31121 -29623 -22811 -26600 -3420 -6467 -18278 -29389 -37813 -16595 2754
14904 2754 -19635 -5836 3631 19664 15892 12899 -14152 -38014 -47538 -57668 -50281 -46341 -18111
14891 -18111 3348 -3766 -10386 4971 5700 -11478 -34457 -45220 -30553 -15297 8164 2570 -8008
14878 -8008 -21189 -21631 -7697 9962 -23292 -44147 -38998 -38124 -50502 -76113 -54593 -58134 -64761
14865 -64761 -57363 -56200 -51363 -41457 -46959 -50326 -58708 -38643 -23819 -24381 -31581 -25273 -28500 -38264
14851 -38264 -47316 -57466 -25683 18514 27239 13425 -2291 -22016 -30697 -26517 -14910 -2229
$$ packed form
14942D395j0905k3828L111J332j6873P258J8725P920K5035K4728k3398m0697J1518
14929a1679Q420K8291j2752k7293J6867J4643k4841j4051J1956M233J7700J874
14917A3368M295l6306j2478J498O812l789K3180l047j1811j1111q424K1218J9349
14904B754k2389J3799R467J6033l772k993k7051k3862r524j0130P387L940K8230
14891a8111K1459p114o620J5357P29j7178k2979j0763J4667J5256K3461n594j0578
14878h008j3181m42J3934J7659l3254k0855N149Q74j2378k5611K1520l541o627
14865f4761P398J163M837R906n502l367q382K0065J4824n62p200O308l227r764
14851c8264r052j0150L1783M4197Q725j3814j5716j9725q681M180J1607J2681
$$ plain form
14839 -2229 -9492 -22372 -17315 -26289 -17166 16144 18908 14660 49296 45981 24905 16407 26069 25609
14825 25609 23216 22538 -1466 2318 20628 49245 62857 48319 37365 17025 -9109 -7689 -19221
14812 -19221 -35555 -19422 6126 -14153 -22425 -14795 -15681 -29114 -23694 -28247 -4705 7692 26962
14799 26962 9024 4789 5213 6339 10712 36059 30004 24039 -1572 -27901 -42235 -57752 -65444
14786 -65444 -50287 -3572 14022 20139 44288 60330 61589 53001 38080 32903 18834 8636
14774 8636 -400 3723 5227 -8335 5457 6488 -909 -13297 -21713 -29330 -31730 -9129 -13909 4498
14760 4498 13133 7037 -13525 -23576 -29294 -24261 -16275 9553 9944 -1971 -5330 -2361 9937 -617
14746 -617 -27663 -31926 3411 19742 285 -944 7645 -33279 -37945 -23733 -22314 -25728 -19692
$$ packed form
14839b229p263j2880N057q974R123L3310K764m248L4636l315k1076q498R662m60
14825B5609k393o78k4004L784J8310K8617J3612j4538j0954k0340k6134J420j1532
14812a9221j6334J6133K5548k0279q272P630q86j3433N420m553K3542J2397J9270
14799B6962j7938m235M24J126M373K5347o055n965k5611k6329j4334j5517p692
14786f5444J5157M6715J7594O117K4149J6042J259q588j4921n177j4069j0198
14774H636r036M123J504j3562J3792J031p397j2388q416p617k400K2601m780J8407
14760D498Q635o096k0562j0051n718N033P986K5828L91j1915l359K969J2298j0554
14746f17k7046m263L5337J6331j9457j229Q589m0924m666J4212J419l414O036
$$ plain form
14733 -19692 -16473 -12449 -13499 -7492 -7597 -27060 -10285 -5546 -2047 26117 22891 21234 30329 35459
14719 35459 12134 25094 50409 34323 14286 4336 6171 7387 4317 -23318 -22170 -7308 38160
14706 38160 11283 -7173 -720 14610 29263 28282 19622 7642 19482 29011 35287 3602 -27572
14693 -27572 -10954 2694 2079 3881 1148 21346 9635 -1726 29086 34247 19228 18372 26030
14680 26030 35101 17917 8735 5026 -1883 -21604 7947 41378 30659 42020 21669 -28548
14668 -28548 -41842 -44314 -62000 -58971 -21122 2140 -3217 22114 25772 22034 41404 13029 -12285
14655 -12285 -36223 -35818 -14491 17823 18885 10699 25266 27971 22037 27277 9940 1230 -7383
14642 -7383 -30461 -33121 -46708 -16960 -1244 -1549 -11087 851 1541 -5739 2505 22799 46201
$$ packed form
14733a9692L219M024j050O007j05j9463J6775M739L499K8164l226j657R095N130
14719C5459k3325J2960K5315j6086k0037r950J835J216l070k7635J148J4862M5468
14706C8160k6877j8456O453J5330J4653r81q660j1980J1840R529O276l1685l1174
14693b7572J6618J3648o15J802k733K0198j1711j1361L0812N161j5019q56P658
14680B6030R071j7184r182l709o909j9721K9551L3431j0719J1361k0351n0217
14668b8548j3294k472j7686L029L7849K3262n357K5331L658l738J9370k8375k5314
14655a2285k3938M05K1327L2314J062q186J4567K705n934N240j7337q710q613
14642g383k3078k660j3587K9748J5716l05r538J1938O90p280Q244K0294K3402
$$ plain form
14629 46201 41533 17051 17598 8562 37674 53048 43973 54350 55127 43833 32462 12737 -11598
14616 -11598 59 23812 20972 5377 9891 24805 1291 -3646 20786 47988 55113 37838
14604 37838 25982 9635 137 4199 9242 44757 59641 36703 22701 36038 18557 15743
14592 15743 13085 8984 15709 21001 35866 25370 8380 12769 33750 28530 24520 21419 8483
14579 8483 -13442 -15256 11329 -14085 -13459 4570 20923 29138 11709 33060 18748 -26502 -21985
14566 -21985 -12629 -26188 -21816 -3066 24751 20882 8627 6331 -10780 -6410 27982 48275 44220
14553 44220 33392 48486 62434 52736 57577 55278 35488 36014 50240 55228 41634 69650 65879
14540 65879 41241 13145 5016 -1152 6946 -13333 -1938 16681 29632 22922 5411 -3534 7359
$$ packed form
14629D6201m668k4482N47r036K9112J5374r075J0377P77j1294j1371j9725k4335
14616a1598J1657K3753k840j5595M514J4914k3514m937K4432K7202P125j7275
14604C7838j1856j6347r498M062N043L5515J4884k2938j4002J3337j7481k814
14592A5743k658m101O725N292J4865j0496j6990M389K0981n220m010l101j2936
14579H483k1925j814K6585k5414O26J8029J6353Q215j7429K1351j4312m5250M517
14566b1985R356j3559M372J8750K7817l869j2255k296j7111M370L4392K0293m055
14553D4220j0828J5094J3948r698M841k299j9790N26J4226M988j3594K8016l771
14540F5879k4638k8096q129o168Q098k0279J1395J8619J2951o710j7511q945J0893
$$ plain form
14527 7359 24499 7792 -13579 -16280 -1772 10699 19640 1758 -10295 -25012 -30857 -15107
14515 -15107 -6567 -8565 -6491 -4079 8597 30184 18797 16688 5637 11413 11969 5245 19490
14502 19490 27787 26204 15875 16492 22153 18425 16450 23015 39406 45872 25707 31111 36622 19500
14488 19500 36283 56414 66757 52142 41052 43910 19849 -9829 -23584 -19148 20809 35652
14476 35652 47359 49331 80779 74075 48136 29852 45526 41736 31602 30390 20542 29014 27982
14463 27982 20884 13182 1466 -19499 -16936 4378 24197 39021 11143 9051 12996 18943 18817
14450 18817 5451 19568 45281 64421 74471 73222 58823 88896 110792 121327 145919 139307
14438 139307 103236 115202 119206 104424 106854 141077 153681 156471 169363 204217 204942 244253
$$ packed form
14527G359J7140j6707k1371k701J4508J2471Q941j7882j2053j4717n845J5750
14515a5107Q540j998K074K412J2676K1587j1387k109j1051N776N56o724J4245
14502A9490Q297j583j0329O17N661l728j975O565J6391O466k0165N404N511j7122
14488A9500J6783K0131J0343j4615j1090K858k4061k9678j3755M436L9957J4843
14476C5652J1707J972L1448o704k5939j8284J5674l790j0134j212r848Q472j032
14463B7982p098p702j1716k0965K563K1314J9819J4824k7878k092L945N947j26
14450A8817j3366J4117K5713J9140J0050j249j4399L0073K1896J0535K4592o612
14438A39307l6071J1966M004j4782K430L4223J2604K790J2892L4854P25L9311
$$ plain form
14426 244253 321588 354715 372271 387087 462173 529486 572342 617574 627539 591851 548174 505065
14414 505065 446115 411917 358971 314827 311164 310723 282554 239173 205387 197061 202593 193507 184848
14401 184848 171440 148905 137922 165296 189459 195715 163160 122540 90999 71244 85554 86143
14389 86143 89859 105668 118199 122985 122917 90611 63942 81668 84880 110692 113379 87453 65108
14376 65108 81190 65242 66624 88271 63735 53610 54891 64053 60691 63533 80158 83157 91749
14363 91749 93850 84284 69885 67980 30845 28849 55255 74976 56980 45710 68205 89733
14351 89733 97006 83469 86856 99277 64801 20019 10323 8398 24436 22844 49973 46283 12100
14338 12100 11248 36714 38726 28342 35298 14154 18700 -2358 -35290 -14087 18909 15266 3273
$$ packed form
14426B44253P7335L3127J7556J4816P5086O7313M2856M5232R965l5688m3677m3109
14414E05065n8950l4198n2946m4144l663m41k8169m3381l3786q326N532r086q659
14401A84848j3408k2535j0983K7374K4163O256l2555m0620l1541j9755J4310N89
14389H6143L716J5809J2531M786o8l2306k6669J7726L212K5812K687k5926k2345
14376F5108J6082j5948J382K1647k4536j0125J281R162l362K842J6625K999Q592
14363I1749K101r566j4399j905l7135j996K6406J9721j7996j1270K2495K1528
14351H9733P273j3537L387J2421l4476m4782r696j925J6038j592K7129l690l4183
14338A2100q52K5466K012j0384O956k1144M546k1058l2932K1203L2996l643j1993
$$ plain form
14325 3273 21305 45286 18093 5430 15728 -332 -18624 -19135 1330 -15531 -19535 9820
14313 9820 10168 -1981 2238 -4949 -18758 -16355 -14818 -18029 -40797 -35960 -24373 -32390 -13135 -3531
14299 -3531 17427 -21235 -66149 -68607 -69283 -42508 -9471 11426 3994 -3779 -4760 -20768 -39891
14286 -39891 -57801 -12484 6831 -18700 -14746 -6458 26049 35847 40521 33273 19965 27304 18624
14273 18624 13392 51388 71363 54510 32538 -9947 -23255 16133 45181 25396 32817 54339
14261 54339 65967 77170 72567 39260 28684 30671 15287 3220 20032 38760 45478 28020
14249 28020 48011 63164 69723 71905 46637 27734 59350 74716 94863 97440 72339 74673
14237 74673 65187 76679 108429 130225 177677 183094 192460 211736 235977 252247 281191 294664
$$ packed form
14325C273J8032K3981k7193j2663J0298j6060j8292n11K0465j6861m004K9355
14313I820L48j2149M219p187j3809K403J537l211k2768M837J1587q017J9255R604
14299c531K0958l8662m4914k458o76K6775L3037K0897p432p773r81j6008j9123
14286c9891j7910M5317J9315k5531L954Q288L2507R798M674p248j3308P339q680
14273A8624n232L7996J9975j6853k1972m2485j3308L9388K9048j9785P421K1522
14261E4339J1628J1203m603l3307j0576J987j5384j2067J6812J8728O718j7458
14249B8020J9991J5153O559K182k5268j8903L1616J5366K0147K577k5101K334
14237G4673r486J1492L1750K1796M7452N417R366J9276K4241J6270K8944J3473
$$ plain form
14225 294664 283171 262024 260949 254978 235477 189743 179459 182392 142216 128953 120498 111167
14213 111167 97444 111267 103640 95168 67612 58263 86437 84558 59159 47621 42128 63830
14201 63830 63607 10984 -5059 28255 40338 39374 39175 19434 15212 26019 14091 2856 10749
14188 10749 41155 77997 81690 89546 102085 75782 42905 38046 36513 27017 34679 36149 37215
14175 37215 29449 16220 27700 43786 51779 36759 33028 45296 47260 63742 73668 74766 86155
14162 86155 76774 70971 82136 91334 74373 36645 36649 45830 58473 75795 64311 44560 34755
14149 34755 30960 26921 21753 42396 52177 73136 72874 64226 96262 108615 73056 33584 29228
14136 29228 52479 53280 78437 46672 75301 86326 81729 55562 27930 18333 36558 61382
$$ packed form
14225B94664j1493k1147j075n971j9501m5734j0284K933m0176j3263q455r331
14213A11167j3723J3823p627q472k7556r349K8174j879k5399j1538n493K1702
14201F3830k23n2623j6043L3314J2083r64j99j9741m222J0807j1928j1235P893
14188A0749L0406L6842L693P856J2539k6303l2877m859j533r496P662J470J066
14175C7215p766j3229J1480J6086P993j5020l731J2268J964J6482R926J098J1389
14162H6155r381n803J1165R198j6961l7728MR181J2643J7322j1484j9751r805
14149C4755l795m039n168K0643R781K0959k62q648L2036J2353l5559l9472m356
14136B9228K3251Q01K5157l1765K8629J1025m597k6167k7632r597J8225K4824
$$ plain form
14124 61382 21705 8200 28025 33438 24556 13672 30604 30431 48639 77370 68081 90697 93459
14111 93459 95943 105346 102567 105272 76533 51889 44033 94042 114171 110074 114831 121167 113370
14098 113370 112405 120703 139641 184575 214570 219541 214462 220895 231955 230274 227606 226706 226002 257439
14084 257439 222075 239007 270160 288447 273307 303629 358340 381826 369031 374229 373580 372121
14072 372121 377020 417677 450859 460386 476069 492212 512381 534643 566423 591152 595227 644047
14060 644047 682616 683661 695043 726563 760516 766538 767021 777509 789913 833524 845774 866018
14048 866018 913054 956652 987277 997121 1008925 1027109 1073782 1094953 1085691 1109950 1140898 1190304
14036 1190304 1219559 1261101 1306684 1373349 1420448 1465168 1517080 1578543 1642621 1683269 1743243
$$ packed form
14124F1382l9677j3505J9825N413q882j0884J6932j73J8208K8731r289K2616K762
14111I3459K484R403k779K705k8739k4644p856N0009K0129m097M757O336p797
14098A13370r65Q298J8938M4934K9995M971n079O433J1060j681k668r00p04L1437
14084B57439l5364J6932L1153J8287j5140L0322N4711K3486j2795N198o49j459
14072C72121M899M0657L3182R527J5683J6143K0169K2262L1780K4729M075M8820
14060F44047L8569J045J1382L1520L3953O022M83J0488J2404M3611J2250K0244
14048H66018M7036M3598L0625R844J1804J8184M6673K1171r262K4259L0948M9406
14036A190304K9255M1542M5583O6665M7099M4720N1912O1463O4078M0648N9974
$$ plain form
14025 1743243 1813767 1880329 1982439 2050180 2107565 2198094 2291199 2383244 2443214 2528481 2629809
14014 2629809 2751749 2895053 3009477 3173913 3420916 3730951 4092522 4537881 5052443
14005 5052443 5723505 6482892 7191802 7764624 8114095 8234732 8343059 8630443 9115047
13996 9115047 9771618 10622040 11642240 12850447 14237521 15746232 17379006 19081751
13988 19081751 20771713 22400415 23978984 25510150 27117664 29021207 31447351 34814243
13980 34814243 39655958 46534334 56005943 68477617 83752617 100615526 116550772
13973 116550772 128220645 132616753 128642702 117744871 103222385 88428676 75472170
13966 75472170 65043392 56970251 50729742 45901183 42124774 39058838 36486778 34315629
$$ packed form
14025A743243P0524O6562J02110O7741N7385R0529R3105R2045N9970Q5267J01328
14014B629809J21940J43304J14424J64436K47003L10035L61571M45359N14562
14005E052443O71062P59387P08910N72822L49471J20637J08327K87384M84604
13996I115047O56571Q50422J020200J208207J387074J508711J632774J702745
13988A9081751J689962J628702J578569J531166J607514J903543K426144L366892
13980C4814243M841715O878376R471609J2471674J5275000J6862909J5935246
13973A16550772J1669873M396108l974051j0897831j4522486j4793709j2956506
13966G5472170j0428778q073141o240509m828559l776409l065936k572060k171149
$$ plain form
13958 34315629 32432218 30769896 29258858 27914786 26732185 25673448 24742815 23988798
13950 23988798 23327904 22778003 22300603 21889664 21564555 21317793 21130634 21009949 20948912
13941 20948912 20877286 20755609 20522531 20111500 19566018 18861659 18060590 17238349 16416228
13932 16416228 15569200 14756856 13988858 13260221 12565890 11899438 11291669 10708546 10154670
13923 10154670 9660696 9204829 8745020 8317686 7905181 7540755 7175912 6805914 6460719
13914 6460719 6135251 5851822 5593676 5333190 5057998 4804852 4588046 4396921 4212252
13905 4212252 4007222 3834437 3640787 3461799 3296873 3164268 3039636 2920693 2776505
13896 2776505 2653038 2503461 2379896 2289722 2188911 2116116 2035700 1950347 1862992 1787026
$$ packed form
13958C4315629j883411j662322j511038j344072j182601j058737r30633p54017
13950B3988798o60894n49901m77400m10939l25109k46762j87159j20685o1037
13941B0948912p1626j21677k33078m11031n45482p04359q01069q22241q22121
13932A6416228q47028q12344p67998p28637o94331o66452o07769n83123n53876
13923A0154670m93974m55867m59809m27334m12505l64426l64843l69998l45195
13914F460719l25468k83429k58146k60486k75192k53146k16806j91125j84669
13905D212252k05030j72785j93650j78988j64926j32605j24632j18943j44188
13896B776505j23467j49577j23565r0174j00811p2795q0416q5353q7355p5966
$$ plain form
13886 1787026 1697758 1612038 1564934 1537086 1469653 1375763 1308303 1256927 1206352 1149171 1080429
13875 1080429 1013606 963166 917355 896697 851098 813015 753911 722016 699870 678961 667961
13864 667961 634881 607419 600722 590506 585730 570357 539120 509344 512334 502155 485304 479008
13852 479008 478726 492425 518052 510630 502861 525639 566537 578967 570049 557458 543248 549953 552119
13839 552119 534659 490093 457943 407158 386182 364431 349333 341083 350131 369784 357567 353892
13827 353892 369816 386266 371629 344302 367053 405338 392880 378704 370247 374250 380313 394183
13815 394183 415847 408360 409544 386323 396761 426831 440663 453339 495048 508363 519336 495735
13803 495735 498469 523533 536368 560942 545470 537261 544874 547155 548993 580465 561562 578686
$$ packed form
13886A787026q9268q5720m7104k7848o7433r3890o7460n1376n0575n7181o8742
13875A080429o6823n0440m5811k0658m5599l8083n9104l1895k2146k0909j1000
13864F67961l3080k7462o697j0216m776j5373l1237k9776K990j0179j6851o296
13852D79008k82J3699K5627p422p769K2778M0898J2430q918j2591j4210O705K166
13839E52119j7460m4566l2150n0785k0976k1751j5098q250R048J9653j2217l675
13827C53892J5924J6450j4637k7327K2751L8285j2458j4176q457M003O063J3870
13815C94183K1664p487J184k3221J0438L0070J3832J2676M1709J3315J0973k3601
13803D95735K734K5064J2835K4574j5472q209P613K281J838L1472j8903J7124
$$ plain form
13791 578686 596518 585154 546212 529801 502397 503391 514282 520202 500631 470860 485633 485394
13779 485394 501854 481262 451753 432203 453501 456002 456691 446121 431716 423161 398825 396261
13767 396261 402306 386500 393058 373501 371222 371852 367847 361303 382307 391540 376366 398060 390332
13754 390332 365542 341989 351916 343919 306967 294361 305508 290175 271114 247895 216018 212473
13742 212473 210104 204585 226071 216177 216678 238463 257754 241698 235195 239126 238719 216431 203192
13729 203192 207889 223558 213955 202506 188714 184141 224617 213675 175854 147278 128604 154095
13717 154095 207101 223736 217665 224531 207140 184460 153512 141847 127929 115870 117263 118015
13705 118015 130674 110396 62821 50106 58922 48263 53263 63684 29832 41124 54698 83875
$$ packed form
13791E78686J7832j1364l8942j6411k7404R94J0891N920j9571k9771J4773k39
13779D85394J6460k0592k9509j9550K1298K501O89j0570j4405q555k4336k564
13767C96261O045j5806O558j9557k279O30m005o544K1004R233j5174K1694p728
13754C90332k4790k3553R927p997l6952j2606J1147j5333j9061k3219l1877l545
13742B12473k369n519K1486r894N01K1785J9291j6056o503L931m07k2288j3239
13729B03192M697J5669r603j1449j3792m573M0476j0942l7821k8576j8674K5491
13717A54095N3006J6635o071O866j7391k2680l0948j1665j3918j2059J393P52
13705A18015J2659k0278m7575j2715Q816j0659N000J0421l3852J1292J3574K9177
$$ plain form
13693 83875 100325 93932 57834 55675 59215 55733 47643 54870 71627 77358 92236 67714 42774
13680 42774 28278 63213 61701 71017 70156 66839 75750 79561 83511 82007 61457 61918 60992 51994
13666 51994 29835 37707 55035 47360 83659 91579 78813 92808 121937 129146 128217 146289 154287
13653 154287 154605 158408 163707 178830 190587 163983 161772 153269 131649 136325 103966 97287 111360
13640 111360 125650 108932 96022 102715 114557 112324 113764 120760 105043 91300 82010 100367
13628 100367 134431 141069 149780 143724 158785 158535 115890 84664 75908 88039 110439 126945 147292
13615 147292 155769 140922 127708 125269 107008 92577 89524 92066 94661 119638 109632 112034 107740
13602 107740 134012 132380 107246 83917 75819 95510 87967 77101 89561 77291 65384 67402
$$ packed form
13693H3875J6450o393l6098k159L540l482q090P227J6757N731J4878k4522k4940
13680D2774j4496L4935j512R316q61l317Q911L811L950j504k0550M61r26q998
13666E1994k2159P872J7328p675L6299P920j2766J3995K9129P209r29J8072P998
13653A54287L18L803N299J5123J1757k6604k211q503k1620M676l2359o679J4073
13640A11360J4290j6718j2910O693J1842k233J440O996j5717j3743r290J8357
13628A00367L4064O638Q711o056J5061k50m2645l1226q756J2131K2400J6506K0347
13615A47292Q477j4847j3214k439j8261j4431l053K542K595K4977j0006K402m294
13602A07740K6272j632k5134k3329q098J9691p543j0866J2460j2270j1907K018
$$ plain form
13590 67402 114867 129743 125331 102578 48136 45866 67662 77340 70882 58150 49714 52734 70768
13577 70768 68779 59685 47046 41024 64252 70783 76326 54841 49627 45142 60170 70394 88200
13564 88200 95188 65308 66314 72508 97843 98698 97397 67952 54802 35709 24808 24939 52371
13551 52371 53656 37064 18665 39761 95800 129778 135775 119062 107286 102740 88959 82301
13539 82301 117245 164974 156139 141589 140087 128314 138072 129323 169793 205659 215027 238514 258622
13526 258622 303883 365979 421355 484631 552481 640623 699894 726283 706538 652042 573100
13515 573100 495179 443511 412474 404789 383752 349809 317913 298159 269307 262239 259402 229860
13503 229860 192378 177160 157024 140101 133323 150580 133514 134810 166297 177663 171434 169105
$$ packed form
13590F7402M7465J4876m412k2753n4442k270K1796R678o458j2732q436L020J8034
13577G0768j989r094j2639o022K3228O531N543k1485n214m485J5028J0224J7806
13564H8200O988k9880J006O194K5335Q55j301k9445j3150j9093j0901J31K7432
13551E2371J285j6592j8399K1096N6039L3978N997j6713j1776m546j3781o658
13539H2301L4944M7729q835j4550j502j1773R758q749M0470L5866R368K3487K0108
13526B58622M5261O2096N5376O3276O7850Q8142N9271K6389j9745n4496p8942
13515E73100p7921n1668l1037p685k1037l3943l1896j9754k8852p068k837k9542
13503B29860l7482j5218k0136j6923o778J7257j7066J296L1487J1366o229k329
$$ plain form
13491 169105 158340 135386 131752 146158 157809 170338 175516 172611 174313 187737 184600 178065 146170
13478 146170 124030 134150 143703 146826 127988 89515 88203 87892 84264 85149 97376 123677 121696
13465 121696 95598 57707 44199 26470 40748 70430 56972 47160 46043 26639 25415 66908
13453 66908 83157 55209 50022 68693 97242 103546 107287 85923 66372 90046 91281 65155
13441 65155 41755 25315 30472 -3277 -7324 3900 6646 -12064 -37268 -21105 257 17337
13429 17337 37441 51075 64204 51808 56372 52865 66585 57404 23644 7465 -6521 -23688
13417 -23688 -21853 -27717 -20221 -21424 -1255 8716 16830 25946 21451 -2274 14823 20207 30743
13404 30743 33664 37827 13120 -4510 -10233 -12155 13312 45884 55281 36413 23848 -18077 4903
$$ packed form
13491A69105j0765k2954l634J4406J1651J2529N178k905J702J3424l137o535l1895
13478A46170k2140J0120R553L123j8838l8473j312l11l628Q85J2227K6301j981
13465A21696k6098l7891j3508j7729J4278K9682j3458r812j117j9404j224M1493
13453F6908J6249k7948n187J8671K8549O304L741k1364j9551K3674J235k6126
13441F5155k3400j6440N157l3749m047J1224K746j8710k5204J6163K1362J7080
13429A7337K0104J3634J3129j2396M564l507J3720r181l3760j6179j3986j7167
13417b3688J835n864P496j203K0169R971Q114R116m495k3725J7097N384J0536
13404C0743K921M163k4707j7630n723j922K5467L2572R397j8868j2565m1925K2980
$$ plain form
13391 4903 1943 -8076 6920 31673 45659 36807 29005 32087 43013 30544 36047 55700 71087
13378 71087 66607 32994 17588 25448 -67 -16305 -19767 5255 33271 26977 43979 38367 31370
13365 31370 66683 88315 86928 71385 30362 24344 34874 24954 27378 20795 10798 -11089 13935
13352 13935 48881 41031 15594 13558 10780 29429 33668 44470 47651 21237 16936 38571 54662
13339 54662 21141 -8271 -3183 -960 -5113 -1407 28980 60921 26247 18087 21693 19554 24439
13326 24439 12625 18869 44701 34837 19531 21939 20992 29782 40875 55430 56080 64136 50631
13313 50631 21560 -8842 -19804 -39551 -40143 -34429 -10469 6004 19741 42945 31183 -5818
13301 -5818 -18546 945 21689 32370 6166 -23858 -27364 17389 39363 26762 2668 9338
$$ packed form
13391D903k960j0019J4996K4753J3986q852p802L082J0926j2469N503J9653J5387
13378G1087m480l3613j5406P860k5515j6238l462K5022K8016o294J7002n612o997
13365C1370L5313K1632j387j5543m1023o018J0530r920K424o583r997k1887K5024
13352A3935L4946p850k5437k036k778J8649M239J0802L181k6414m301K1635J6091
13339E4662l3521k9412N088K223m153L706L0387L1941l4674q160L606k139M885
13326B4439j1814O244K5832r864j5306K408r47Q790J1093J4555O50Q056j3505
13313E0631k9071l0402j0962j9747n92N714K3960J6473J3737K3204j1762l7001
13301e818j2728J9491K0744J0681k6204l0024l506M4753K1974j2601k4094O670
$$ plain form
13289 9338 36426 26506 5055 8001 22099 46709 58232 48293 42258 13870 3691 23409 35909
13276 35909 39712 25660 4412 14824 32775 24525 13044 2869 -7258 6134 31003 29607
13264 29607 15032 -3622 -12974 1773 22249 28463 22078 -1710 -18199 -16418 -8020 -2766 5053
13251 5053 22979 45159 39277 44730 47338 62179 65222 44328 35942 46803 56204 70656 67430
13238 67430 44673 7599 2947 -12119 -15544 2586 22998 59410 59789 39952 30916 46560 73906
13225 73906 93138 74427 71655 84526 74653 46663 44646 39723 71448 82127 57134 54680 63761
13212 63761 54607 38006 38579 29181 32742 18738 3001 -1795 12384 19902 17095 7258 19292
13199 19292 50644 41451 32520 29845 42460 29239 6363 15428 18872 34570 46971 55512 37847
$$ packed form
13289I338K7088r920k1451K946J4098K4610J1523r939o035k8388j0179J9718J2500
13276C5909L803j4052k1248J0412J7951q250j1481j0175j0127J3392K4869j396
13264B9607j4575j8654r352J4747K0476O214o385k3788j6489J781Q398N254P819
13251E053J7926K2180n882N453K608J4841L043k0894q386J0861R401J4452l226
13238F7430k2757l7074m652j5066l425J8130K0412L6412L79j9837r036J5644K7346
13225G3906J9232j8711k772J2871r873k7990k017m923L1725J0679k4993k454R081
13212F3761r154j6601N73r398L561j4004j5737m796J4179P518k807r837J2034
13199A9292L1352r193q931k675J2615j3221k2876R065L444J5698J2401Q541j7665
$$ plain form
13186 37847 13105 586 -101 9844 43427 70998 39013 20605 50803 42428 1293 -4479 -14747
13173 -14747 -579 24194 31113 43902 49113 48638 15409 -29657 -17662 -17451 -13180 -8982 -3800
13160 -3800 6186 -11802 1329 21395 41391 52096 71424 77958 64927 70739 61627 62078 60584
13147 60584 48141 38714 62252 52438 29361 4577 13539 37007 52910 60854 59378 45014 32234
13134 32234 29663 13023 23973 30523 28914 53986 41784 56045 63840 60756 50624 47204 61851
13121 61851 52624 50790 53096 51841 60130 46433 40272 24312 32570 13618 7383 51359 56495
13108 56495 46660 37305 19506 30242 41523 28902 19671 13718 7828 19475 29817 5613 12373
13095 12373 35712 46232 52646 64751 65766 34754 8765 13162 11437 2942 2238 13139 1026
$$ packed form
13186C7847k4742j2519o87R945L3583K7571l1985j8408L0198q375m1135n772j0268
13173a4747J4168K4773O919J2789N211m75l3229m5066J1995K11M271M198N182
13160c800R986j7988J3131K0066J9996J0705J9328O534j3031N812r112M51j494
13147F0584j2443r427K3538r814k3077k4784Q962K3468J5903P944j476j4364j2780
13134C2234k571j6640J0950O550j609K5072j2202J4261P795l084j0132l420J4647
13121F1851r227j834K306j255Q289j3697o161j5960Q258j8952o235M3976N136
13108E6495r835r355j7799J0736J1281j2621r231n953n890J1647J0342k4204O760
13095A2373K3339J0520O414J2105J015l1012k5989M397j725q495p04J0901j2113
$$ plain form
13082 1026 20463 47680 43495 23034 6411 22537 36932 41883 39393 5251 23488 35866
13070 35866 19280 21921 14108 27532 23003 20097 23780 35968 47226 15382 17407 41351 35905
13057 35905 12878 9464 3710 -3214 -15161 -4492 1433 -4818 415 29727 29427 42506 54771
13044 54771 53441 51023 54451 20507 -174 1660 1130 10167 22159 34445 25632 25512 26624 20458
13030 20458 7221 -7594 -3375 -5655 -7565 33505 43052 67008 71805 36683 22118 17108 15443
13017 15443 25194 9513 -3115 -20385 -13813 -4144 -15454 -1799 8621 16621 24935 19370 6597
13004 6597 14477 18702 6812 -6915 -13017 -19798 -41342 -47828 -26058 -39560 -30383 -16479 18025
12991 18025 33634 18905 14255 24952 42133 15900 4183 4229 18769 22474 30052 45111 17145
$$ packed form
13082A026J9437K7217m185k0461j6623J6126J4395M951k490l4142J8237J2378
13070C5866j6586K641p813J3424m529k906L683J2188J1258l1844K025K3944n446
13057C5905k3027l414n754o924j1947J0669N925o251N233K9312l00J3079J2265
13044E4771j330k418L428l3944k0681J834n30R037J1992J2286q813j20J112o166
13030B0458j3237j4815M219k280j910M1070R547K3956M797l5122j4565n010j665
13017A5443R751j5681j2628j7270O572R669j1310J3655J0420Q000Q314n565j2773
13004F597P880M225j1890j3727o102o781k1544o486K1770j3502R177J3904L4504
12991A8025J5609j4729m650J0697J7181k6233j1717M6J4540L705P578J5059k7966
$$ plain form
12978 17145 24997 10582 7696 20620 36059 57909 13385 -816 -55 39940 57616 41032
12966 41032 18840 -3933 22556 39605 31213 31175 44590 60741 36764 19702 5731 -7778
12954 -7778 -5309 151 -10799 -7611 -1470 -261 1269 8310 23434 11828 11141 40518 23432 9967
12940 9967 11315 -10705 -46994 -21038 5712 -5905 6235 9603 51495 82570 37167 -7546
12928 -7546 5044 24400 38810 44554 50126 54225 72825 75012 41605 37025 35118 47902 40568
12915 40568 34782 31808 40059 29271 28642 30150 21916 44504 47398 49133 49340 14008 5591 19410
12901 19410 37295 48627 32789 14820 45193 70885 61000 53866 48352 27501 30556 35481 26441
12888 26441 17292 33675 37072 32385 25497 18200 7797 -4369 -13873 -3495 20866 25891 22886
$$ packed form
12978A7145P852j4415k886J2924J5439K1850m4524j4201P61L9995J7676j6584
12966D1032k2192k2773K6489J7049q392l8J3415J6151k3977j7062j3971j3509
12954g778K469N460j0950L188O141J209J530P041J5124j1606o87K9377j7086j3465
12940I967J348k2020l6289K5956K6750j1617J2140L368M1892L1075m5403m4713
12928g546J2590J9356J4410N744N572M099J8600K187l3407m580j907J2784p334
12915D0568n786k974Q251j0788o29J508q234K2588K894J735K07l5332q417J3819
12901A9410J7885J1332j5838j7969L0373K5692r885p134n514k0851L055M925r040
12888B6441r149J6383L397m687o888p297j0403j2166r504J0378K4361N025l005
$$ plain form
12875 22886 2933 -2069 11933 30040 24771 8250 20414 12839 12889 5514 23444 54940 58975
12862 58975 51622 36407 38083 36937 21766 31518 35515 9417 8841 -2101 22454 46000 39865
12849 39865 45082 44630 45164 54725 51738 25226 18416 24719 30956 14842 -1690 -6671 -3698 -2849
12835 -2849 18841 13030 20520 38832 40681 18967 19453 71329 77264 70238 56542 47425 78887
12822 78887 87326 68612 64200 50808 42712 63468 61962 20414 -16576 -52703 -2298 32519
12810 32519 51137 58514 61587 22758 6707 13075 12644 22549 13942 23766 30834 38329 61386 60747
12796 60747 60863 68074 62597 71664 84473 84805 80482 89672 73123 49328 48108 51165 51968 56920
12782 56920 40380 31086 40819 54581 55626 55186 59555 84627 71927 41526 18204 15840 -10840
$$ packed form
12875B2886j9953n002J4002J8107n269j6521J2164p575N0p375J7930L1496M035
12862E8975p353j5215J676j146j5171R752L997k6098n76j0942K4555K3546o135
12849C9865N217m52N34R561k987k6512o810O303O237j6114j6532m981K973Q49
12835b849K1690n811P490J8312J849k1714M86N1876N935p026j3696r117L1462
12822G8887Q439j8714m412j3392q096K0756j506m1548l6990l6127N0405L4817
12810C2519J8618P377L073l8829j6051O368m31R905q607R824P068P495K3057o39
12796F0747J16P211n477R067J2809L32m323R190j6549k3795j220L057Q03M952
12782E6920j6540r294R733J3762J045m40M369K5072j2700l0401k3322k364k6680
$$ plain form
12769 -10840 2452 -7283 2020 16983 25430 15154 7987 -2900 1388 21826 32448 40221 12049
12756 12049 13339 36087 57788 32939 46830 55684 35300 20909 47097 55068 68206 60674
12744 60674 24320 30003 32946 42072 76941 69046 50494 47477 49563 30470 45222 46466 36066
12731 36066 33771 47039 44920 8525 -13207 7476 22145 -978 -15360 345 18514 25276
12719 25276 52867 57485 59899 50023 61108 90978 105400 92449 80875 55866 39578 18407
12707 18407 12303 9497 31686 39779 53864 87571 65262 55214 71256 79650 92964 82499
12695 82499 57292 55195 69351 83829 78913 62616 35944 31547 17239 31528 25413 1630
12683 1630 9441 19094 -6435 9734 35137 26078 6185 7954 29066 36046 45663 53776 66063
$$ packed form
12769a0840J3292r735R303J4963Q447j0276p167j0887M288K0438J0622P773k8172
12756A2049J290K2748K1701k4849J3891Q854k0384j4391K6188P971J3138p532
12744F0674l6354N683K943R126L4869p895j8552l017K086j9093J4752J244j0400
12731C6066k295J3268k119l6395k1732K0683J4669k3123j4382J5705J8169O762
12719B5276K7591M618K414r876J1085K9870J4422j2951j1574k5009j6288k1171
12707A8407o104k806K2189Q093J4085L3707k2309j0048J6042Q394J3314j0465
12695H2499k5207k097J4156J4478m916j6297k6672m397j4308J4289o115k3783
12683A630P811R653k5529J6169K5403r059j9893J769K1112O980R617Q113J2287
$$ plain form
12670 66063 52208 27282 31122 47951 43373 51689 27883 10549 18932 43919 54605 46361 38396
12657 38396 52379 52767 65040 66642 53171 65702 86916 91697 92351 80684 76802 74059 65711
12644 65711 63798 75654 90571 97398 91739 88416 96349 90560 66136 67617 77372 74572 61418
12631 61418 56165 61918 81021 96137 79540 52047 72307 80712 70571 69977 47505 36933 49455
12618 49455 61384 69063 64144 72963 58871 49424 61960 60081 48902 43037 59360 65368 55195
12605 55195 49969 51312 41476 32150 44290 76889 109995 96198 78718 73683 70996 70680 88248
12592 88248 83687 94665 104983 120830 121797 103833 105966 95464 93858 97116 125219 173943 188443
12579 188443 182733 172755 140041 110891 107099 104000 98299 103481 92196 104841 92709 95891 82057
$$ packed form
12670F6063j3855k4926L840J6829m578Q316k3806j7334Q383K4987J0686q244p965
12657C8396J3983L88J2273J602j3471J2531K1214M781O54j1667l882k743q348
12644F5711j913J1856J4917O827n659l323P933n789k4424J481R755k800j3154
12631F1418n253N753J9103J5116j6597k7493K0260Q405j0141n94k2472j0572J2522
12618D9455J1929P679m919Q819j4092r447J2536j879j1179n865J6323O008j0173
12605E5195n226J343r836r326J2140L2599L3106j3797j7480n035k687l16J7568
12592H8248m561J0978J0318J5847R67j7964K133j0502j606L258K8103M8724J4500
12579A88443n710r978l2714k9150l792l099n701N182j1285J2645j2132L182j3834
$$ plain form
12566 82057 110576 132609 97202 91897 100504 137302 161437 171732 159528 150264 159793 167742 170005
12553 170005 178925 193112 215761 229153 244559 267545 292098 296610 301776 317868 336272 382828
12541 382828 458645 556663 620106 662010 710345 739063 719832 691133 619612 556411 514975
12530 514975 449253 417674 401008 354635 322548 294977 297832 296643 291731 297451 299251 260899
12518 260899 255433 267743 261685 262964 253355 242332 217758 181160 178504 221998 239984 230063 228035
12505 228035 222692 248264 266699 267535 266323 242072 216556 193862 175189 202465 210758 204333 206323
12492 206323 211909 216729 220741 215765 206646 219465 205678 162294 116139 99740 125372 149672
12480 149672 153362 169566 168041 150655 139014 141272 138000 126797 132156 128415 104572 98812 97687
$$ packed form
12566H2057K8519K2033l5407n305Q607L6798K4135J0295j2204r264R529P949K263
12553A70005Q920J4187K2649J3392J5406K2986K4553M512N166J6092J8404M6556
12541C82828P5817R8018O3443M1904M8335K8718j9231k8699p1521o3201m1436
12530E14975o5722l1579j6666m6373l2087k7571K855j189m912N720J800l8352
12518B60899n466J2310o058J279r609j1023k4574l6598k656M3494J7986r921k028
12505B28035n343K5572J8435Q36j212k4251k5516k2694j8673K7276Q293o425J990
12492B06323N586M820M012m976r119J2819j3787m3384m6155j6399K5632K4300
12480A49672L690J6204j525j7386j1641K258l272j1203N359l741k3843n760j125
$$ plain form
12467 97687 92010 111135 111790 117918 107469 115975 134316 135868 153352 164128 155002 148480 104757
12454 104757 93619 101896 90356 102370 108928 99013 79199 88998 74730 69505 96700 123576
12442 123576 126353 123105 129452 104025 108067 101007 92239 75217 112518 123899 91136 113289 128206
12429 128206 131624 124187 123883 123065 123233 134538 157604 154730 135227 117612 104736 103729 116625
12416 116625 137486 147101 130800 138214 147816 160234 174478 168584 153427 153637 156740 186668 214733
12403 214733 233618 221144 206893 182342 175840 181394 191832 196283 209696 201065 188030 198024
12391 198024 230837 283692 293567 337089 362909 372474 392259 381253 355703 362968 368261 367040
12379 367040 370768 387007 398288 416756 467600 490954 502593 465067 413982 354485 346699 328715
$$ packed form
12467I7687n677J9125O55O128j0449Q506J8341J552J7484J0776r126o522m3723
12454A04757j1138Q277j1540J2014O558r915j9814R799j4268n225K7195K6876
12442A23576K777l248O347k5427M042p060q768j7022L7301J1381l2763K2153J4917
12429A28206L418p437l04q18J68J1305K3066k874j9503j7615j2876j007J2896
12416A16625K0861R615j6301P414R602J2418J4244n894j5157K10L103K9928K8065
12403B14733J8885j2474j4251k4551o502N554J0438M451J3413q631j3035R994
12391A98024L2813N2855R875M3522K5820R565J9785j1006k5550P265N293j221
12379C67040L728J6239J1281J8468N0844K3354J1639l7526n1085n9497p786j7984
$$ plain form
12367 328715 308756 282215 275012 276456 253768 252930 247312 224411 208463 203465 212427 211184 203275
12354 203275 226526 225723 217973 229876 249108 243344 210033 201449 188887 174117 162177 140628
12342 140628 133416 140096 137946 128515 129241 133855 126868 134129 147581 155932 148233 119077 123546 134131
12328 134131 117047 108044 104584 97606 113811 127379 129571 148501 140404 155406 152925 136088 130233
12315 130233 117824 151543 181092 197202 204296 178356 159167 150408 147248 156245 149842 135739
12303 135739 129272 126231 141990 166445 146425 161300 177274 139973 93439 108143 128901 124452
12291 124452 134531 128680 122081 122572 129904 113421 140878 151473 144373 140652 133594 125875 143059
12278 143059 162729 163357 163478 153542 167203 179089 179345 168725 156548 146816 147628 162011 155905 164778
$$ packed form
12367C28715j9959k6541p203J444k2688q38n618k2901j5948m998Q962j243p909
12354B03275K3251q03p750J1903J9232n764l3311q584j2562j4770j1940k1549
12342A40628p212O680k150r431P26M614o987P261J3452Q351p699k9156M469J0585
12328A34131j7084r003l460o978J6205J3568K192J8930q097J5002k481j6837n855
12315A30233j2409L3719K9549J6110P094k5940j9189q759l160Q997o403j4103
12303A35739o467l041J5759K4455k0020J4875J5974l7301m6534J4704K0758m449
12291A24452J0079n851o599M91P332j6483K7457J0595p100l721p058p719J7184
12278A43059J9670O28J21r936J3661J1886K56j0620j2177r732Q12J4383o106Q873
$$ plain form
12264 164778 146719 100567 76726 77865 83713 109698 141642 154532 156179 187005 203672 212772
12252 212772 235448 231231 215143 204565 199638 206741 186789 173678 193261 198937 231056 255642
12240 255642 284373 285400 269967 279364 308558 346582 368602 377281 374686 357620 376729 376801 380359
12227 380359 351897 363112 397997 392614 395657 429293 455775 454973 475684 502017 536965 571315
12215 571315 554090 553148 580553 613322 636477 665391 681660 705418 740845 779554 807158 817169
12203 817169 819030 835422 840150 849524 878870 910666 930616 960713 968019 965463 998356 1024434
12191 1024434 1043007 1056159 1101026 1148321 1156391 1174920 1208771 1245975 1278542 1334638 1370182
12180 1370182 1414674 1447870 1480048 1535973 1569439 1639185 1700908 1771818 1792189 1820956 1871161
$$ packed form
12264A64778j8059m6152k3841J139N848K5985L1944J2890J647L0826J6667R100
12252B12772K2676m217j6088j0578m927P103j9952j3111J9583N676L2119K4586
12240B55642K8731J027j5433R397K9194L8024K2020Q679k595j7066J9109P2L558
12227C80359k8462J1215L4885n383L043L3636K6482q02K0711K6333L4948L4350
12215E71315j7225r42K7405L2769K3155K8914J6269K3758L5427L8709K7604J0011
12203H17169J861J6392M728R374K9346L1796J9950L0097P306k556L2893K6078
12191A024434J8573J3152M4867M7295Q070J8529L3851L7204L2567N6096L5544
12180A370182M4492L3196L2178N5925L3466O9746O1723P0910K0371K8767N0205
$$ plain form
12169 1871161 1910629 1965823 2039607 2113367 2171211 2240582 2305477 2377703 2473919 2587413 2728195
12158 2728195 2901648 3152572 3372690 3621968 3891797 4172569 4465683 4790093 5133875
12149 5133875 5500652 5959393 6493387 7103444 7817301 8699916 9732965 10892509 12254520
12140 12254520 13812389 15510698 17350367 19246440 21088557 22769728 24253342 25527846
12132 25527846 26746883 28171888 30166051 33088986 37479877 43961156 53261462 65972295
12124 65972295 82104406 100192845 117090444 128919066 132766253 128132341 117034880
12117 117034880 102690597 88081603 75096819 64459567 56165945 49841189 45029302
12110 45029302 41343358 38490180 36272043 34478893 32903301 31466029 30122813 28818298
$$ packed form
12169A871161L9468N5194P3784P3760N7844O9371O4895P2226R6216J13494J40782
12158B728195J73453K50924K20118K49278K69829K80772K93114L24410L43782
12149E133875L66777M58741N33994O10057P13857Q82615J033049J159544J362011
12140A2254520J557869J698309J839669J896073J842117J681171J483614J274504
12132B5527846J219037J425005J994163K922935M390891O481279R300306J2710833
12124F5972295J6132111J8088439J6897599J1828622L847187m633912j1097461
12117A17034880j4344283j4608994j2984784j0637252q293622o324756m811887
12110D5029302l685944k853178k218137j793150j575592j437272j343216j304515
$$ plain form
12102 28818298 27553735 26405398 25357392 24431911 23637674 22973910 22462845 22006051 21660960
12093 21660960 21398610 21229968 21102555 21015227 20939178 20817800 20587237 20189851 19667022 19008770
12083 19008770 18230517 17430388 16565383 15697331 14915675 14183557 13469467 12768141 12087913
12074 12087913 11439553 10871118 10335904 9807004 9318411 8837532 8391489 8001424 7632712
12065 7632712 7272821 6909024 6561126 6279740 6006370 5693932 5415435 5146628 4884879
12056 4884879 4664248 4464527 4239144 4008270 3808743 3656303 3489455 3333869 3223549
12047 3223549 3086944 2926920 2780290 2667235 2545372 2457510 2369904 2266695 2158552 2087836
12037 2087836 2013616 1936251 1843397 1729619 1629338 1563191 1515362 1472385 1395038 1325695 1277895
$$ packed form
12102B8818298j264563j148337j048006r25481p94237o63764n11065m56794l45091
12093B1660960k62350j68642j27413q7328p6049j21378k30563l97386n22829o58252
12083A9008770p78253q00129q65005q68052p81656p32118p14090p01326o80228
12074A2087913o48360n68435n35214n28900m88593m80879m46043l90065l68712
12065G632712l59891l63797l47898k81386k73370l12438k78497k68807k61749
12056D884879k20631j99721k25383k30874j99527j52440j66848j55586j10320
12047C223549j36605j60024j46630j13055j21863q7862q7606j03209j08143p0716
12037B087836p4220p7365r2854j13778j00281o6147m7829m2977p7347o9343m7800
$$ plain form
12026 1277895 1219687 1184218 1156060 1098706 1032775 995575 952213 882966 849350 820535 825954
12015 825954 808969 757748 729101 710667 693794 673428 639853 575980 544818 546519 548598 558389
12003 558389 550667 538019 544450 552898 551057 567925 586982 614287 623641 641402 635542 636530 623814
11990 623814 619287 574001 539944 535832 540267 508186 478305 450341 439266 442453 452787 437157
11978 437157 433663 444848 424783 416506 407718 389957 419352 453056 435970 437484 455248 447283
11966 447283 437877 442714 447289 438975 446535 468774 479630 476371 459585 472143 536429 534245 509099
11953 509099 554247 577000 580222 575438 572755 568839 547930 566467 596044 609533 627169 604824
11941 604824 578122 569685 578511 603025 617053 615098 612748 597615 583410 572175 580222 573384 534240
$$ packed form
12026A277895n8208l5469k8158n7354o5931l7200m3362o9247l3616k8815N419
12015H25954j6985n1221k8647j8434j6873k0366l3575o3873l1162J701K079R791
12003E58389p722j2648O431Q448j841J6868J9057K7305R354J7761n860R88j2716
11990F23814m527m5286l4057m112M435l2081k9881k7964j1075L187J0334j5630
11978D37157l494J1185k0065q277q788j7761K9395L3704j7086J514J7764p965
11966D47283r406M837M575q314P560K2239J0856l259j6786J2558O4286k184k5146
11953E09099M5148K2753L222m784k683l916k0909J8537K9577J3489J7636k2345
11941F04824k6702q437Q826K4514J4028j955k350j5133j4205j1235Q047o838l9144
$$ plain form
11928 534240 529757 524217 504126 539896 530181 514514 526311 521248 502802 482572 481648 481616 464608
11915 464608 475291 499202 519269 513832 471656 456152 463119 486195 491895 478606 470782 465492
11903 465492 463725 442323 405861 378433 365698 361019 358701 346836 337430 346352 341553 324414 328994
11890 328994 358380 371618 354677 368844 360343 325445 316273 314884 295476 280012 279279 278255 299130
11877 299130 316322 298881 302415 295906 294712 312475 358941 368457 363131 341799 341717 326350 289693
11864 289693 265991 250025 242270 236403 234674 255989 258349 242851 274197 310018 290527 260432
11852 260432 256152 246531 228437 199265 189046 199192 192671 210639 216255 218313 225596 218324 213344
11839 213344 211641 183175 145419 144477 170026 204858 224508 216865 206598 185412 159104 168513
$$ packed form
11928E34240m483n540k0091L5770r715j5667J1797n063j8446k0230r24l2j7008
11915D64608J0683K3911K0067n437m2176j5504O967K3076N700j3289p824n290
11903D65492j767k1402l6462k7428j2735m679k318j1865r406Q922m799j7139M580
11890C28994K9386J3238j6941J4167q501l4898r172j389j9408j5464p33j024K0875
11877B99130J7192j7441L534o509j194J7763M6466R516n326k1332q2j5367l6657
11864B89693k3702j5966p755n867j729K1315K360j5498L1346L5821j9491l0095
11852B60432m280r621j8094k9172j0219J0146o521J7968N616K058P283p272m980
11839B13344j703k8466l7756r42K5549L4832J9650p643j0267k1186k6308R409
$$ plain form
11827 168513 173823 177485 197787 194279 186156 216721 228812 227178 225432 238722 240308 234422 244796
11814 244796 235090 204134 227394 243667 279154 286417 245752 242496 227757 225240 248264 277637
11802 277637 278581 269620 268319 281518 293541 281328 240825 218610 262332 284320 310980 315481
11790 315481 289752 272950 285555 289778 299786 270593 266132 291946 300554 289312 281664 289273
11778 289273 284243 277975 274355 281463 288233 284366 286813 254076 251651 251039 258008 267745 258573 251979
11764 251979 252237 265971 269253 278291 281081 280944 253956 244835 262202 298039 306767 272961 219821
11751 219821 221596 251275 270882 267684 246588 231086 224548 218613 221865 243005 244850 230033 207724
11738 207724 243918 248657 251787 251977 279099 273736 250545 212719 205334 201859 228524 231978 218117
$$ packed form
11827A68513N310L662K0302l508q123L0565J2091j634j746J3290J586n886J0374
11814B44796r706l0956K3260J6273L5487P263m0665l256j4739k517K3024K9373
11802B77637R44q961j301J3199J2023j2213m0503k2215M3722K1988K6660M501
11790C15481k5729j6802J2605M223J0008k9193m461K5814Q608j1242p648P609
11778B89273n030o268l620P108O770l867K447l2737k425o12O969R737r172o594
11764B51979K58J3734L282R038K790j37k6988r121J7367L5837Q728l3806n3140
11751B19821J775K9679J9607l198k1096j5502o538n935L252K1140J845j4817k2309
11738B07724L6194M739L130J90K7122n363k3191l7826p385l475K6665L454j3861
$$ plain form
11725 218117 217025 220829 227709 225835 216800 221408 254048 279805 295928 313006 312165 311284 340364
11712 340364 351559 338911 363582 370963 380555 404374 451626 484443 520525 576449 621721 687994
11700 687994 761235 831065 853832 840751 799260 729724 680238 619362 562443 526144 481933
11689 481933 443858 427478 441654 439013 419088 422679 409418 401238 393307 393212 403016 405759 386217
11676 386217 375821 352253 365101 355123 330436 310916 315945 338469 337742 328279 317395 314836 319087
11663 319087 319829 343810 334141 315001 322591 279672 287023 300501 296954 279136 275810 258696 252584
11650 252584 236042 224045 233220 236329 230915 235454 240631 272083 276759 269077 273921 270456 263003
11637 263003 255646 248290 251850 253921 220547 210737 215693 229152 260022 269558 262897 256116 264976
$$ packed form
11725B18117j092L804O880j874r035M608L2640K5757J6123J7078q41q81K9080
11712C40364J1195j2648K4671P381R592K3819M7252L2817L6082N5924M5272O6273
11700F87994P3241O9830K2767j3081m1491o9536m9486o0876n6919l6299m4211
11689D81933l8075j6380J4176k641j9925L591j3261q180p931r5R804K743j9542
11676C86217j0396k3568J2848r978k4687j9520N029K2524p27r463j0884k559M251
11663C19087P42K3981r669j9140P590m2919P351J3478l547j7818l326j7114o112
11650B52584j6542j1997R175L109n414M539N177L1452M676p682M844l465p453
11637B63003p357p356L560K071l3374r810M956J3459L0870R536o661o781Q860
$$ plain form
11624 264976 271765 277427 258741 252667 239075 233759 244719 254189 235561 217578 184327 192110 223032
11611 223032 242356 244956 250413 225056 210697 229360 234777 202793 198890 198573 190895 194703 200670
11598 200670 204259 199925 234584 258779 226816 225785 233392 225863 247256 259970 251914 250258 242081
11585 242081 231465 212008 211446 215193 218830 221968 235916 232445 237544 240000 234258 228024 232995 251206
11571 251206 238976 224891 239228 276480 295758 286241 272312 260194 270683 269085 268876 267795
11559 267795 236043 219353 220475 213622 208569 205373 236448 259256 276323 280958 268594 255692
11547 255692 245657 240120 253427 279001 254723 260492 266678 257703 273038 281225 271104 272443 261566
11534 261566 251523 260536 247502 257077 264869 280814 291302 292580 296395 287213 284333 314895 348768
$$ packed form
11624B64976O789N662j8686o074j3592n316J0960R470j8628j7983l3251P783L0922
11611B23032J9324K600N457k5357j4359J8663N417l1984l903l17p678L808N967
11598B00670L589m334L4659K4195l1963j031P607p529K1393J2714q056j656q177
11585B42081j0616j9457n62L747L637L138J3948l471N099K456n742o234M971J8211
11571B51206j2230j4085J4337L7252J9278r517j3929j2118J0489j598k09j081
11559B67795l1752j6690J122o853n053l196L1075K2808J7067M635j2364j2902
11547B55692j0035n537J3307K5574k4278N769O186q975J5335Q187j0121J339j0877
11534B61566j0043R013j3034R575P792J5945J0488J278L815r182k880L0562L3873
$$ plain form
11521 348768 331006 274968 277175 286580 295019 281575 279751 302012 298391 291262 278973 285377 296767
11508 296767 296579 292731 265072 250060 274249 289394 294900 287404 271115 274039 274768 243973 231696
11495 231696 245518 238901 245302 262136 266655 263395 288580 308955 304955 304433 302111 276528 285701
11482 285701 296002 300903 289543 279026 281570 299231 305974 293126 287708 296628 324468 329666 334804
11469 334804 331995 347211 344713 314038 320230 315527 332578 340636 336817 356816 334428 312448 309605
11456 309605 323368 332725 324240 332633 346322 338524 326928 310093 295024 285843 291806 305906 318124
11443 318124 321622 324948 336688 341623 359766 361281 365727 357105 318984 297633 316278 331989 364588
11430 364588 379422 378266 358106 334510 341689 356388 359441 338989 323724 334049 343213 346818
$$ packed form
11521C48768j7762n6038K207R405Q439j3444j824K2261l621p129j2289O404J1390
11508B96767j88l848k7659j5012K4189J5145N506p496j6289K924P29l0795j2277
11495B31696J3822o617O401J6834M519l260K5185K0375m000n22k322k5583R173
11482B85701J0301M901j1360j0517K544J7661O743j2848n418Q920K7840N198N138
11469C34804k809J5216k498l0675O192m703J7051Q058l819J9999k2388k1980k843
11456C09605J3763R357q485Q393J3689p798j1596j6835j5069r181N963J4100J2218
11443C18124L498L326J1740M935J8143J515M446q622l8121k1351J8645J5711L2599
11430C64588J4834j156k0160k3596P179J4699L053k0452j5265J0325R164L605
$$ plain form
11418 346818 339678 343076 386107 406775 385226 354883 361234 366868 361941 356788 340027 343495 329294
11405 329294 333345 337728 326205 331508 369350 398667 402173 418272 421752 418319 413805 416138 424879
11392 424879 416870 398908 405408 401147 395427 388513 389376 392999 398976 399556 411344 417357 427082 409711
11378 409711 392648 389045 395302 396480 397802 420887 437465 459597 500779 505058 472400 442160
11366 442160 440188 445269 458768 484426 501271 492880 495741 494457 470081 468352 481684 487950 466203
11353 466203 466719 454065 397522 398714 401894 420238 432280 442671 459675 456279 473809 490890
11341 490890 487860 480114 474870 489246 499940 489456 460291 445313 451762 461647 443050 459422
11329 459422 493520 493060 509596 499153 494558 511125 533958 560944 566350 558343 558405 576861 589885
$$ packed form
11418C46818p140L398M3031K0668k1549l0343O351N634m927n153j6761L468j4201
11405C29294M051M383j1523N303L7842K9317L506J6099L480l433m514K333Q741
11392D24879q009j7962O500m261n720o914Q63L623N977N80J1788O013R725j7371
11378D09711j7063l603O257J178J322K3085J6578K2132M1182M279l2658l0240
11366D42160j972N081J3499K5658J6845q391K861j284k4376j729J3332O266k1747
11353D66203N16j2654n6543J192L180J8344J2042J0391J7004l396J7530J7081
11341D90890l030p746n244J4376J0694j0484k9165j4978O449R885j8597J6372
11329D59422L4098m60J6536j0443m595J6567K2833K6986N406q007O2J8456J3024
$$ plain form
11316 589885 588836 598905 615271 594268 574064 562252 546479 552525 542925 535233 511728 514104
11304 514104 538680 540237 561725 543359 539680 557175 569399 598859 586612 582753 592294 603515
11292 603515 613336 615726 616929 620306 581540 561011 589567 595525 608085 606928 605186 601083 618108
11279 618108 631013 634568 612567 603080 587506 571257 546895 575406 623392 644698 630981 643208
11267 643208 649368 662815 672268 657192 644643 659286 656976 636121 672865 687221 687866 688040 703426
11254 703426 689371 681019 659989 650545 714005 711964 715322 703345 679761 682838 690802 722913 758768
11241 758768 744149 740928 750996 770152 783831 777769 763699 752087 757151 748653 743504 768640
11229 768640 783547 764068 769240 798898 817256 839520 870362 861439 835954 847834 844211 832621
$$ packed form
11316E89885j049J0069J6366k1003k0204j1812j5773O046r600p692k3505K376
11304E14104K4576J557K1488j8366l679J7495J2224K9460j2247l859R541J1221
11292F03515R821K390J203L377l8766k0529K8556N958J2560j157j742m103J7025
11279F18108J2905L555k2001r487j5574j6249k4362K8511M7986K1306j3717J2227
11267F43208O160J3447R453j5076j2549J4643k310k0855L6744J4356O45J74J5386
11254G03426j4055q352k1030r444O3460k041L358j1977k3584L077P964L2111L5855
11241G58768j4619l221J0068J9156J3679o062j4070j1612N064q498n149K5136
11229G68640J4907j9479N172K9658J8358K2264L0842q923k5485J1880l623j1590
$$ plain form
11217 832621 809936 784896 791437 820040 882371 907228 887629 874980 863694 870353 924226 947091
11205 947091 949091 953408 947551 925869 919438 928984 934480 915487 913577 959488 995023 1016500 1012059
11192 1012059 1010610 1004352 993421 1011430 1041754 1064501 1055101 1047006 1021510 1014077 1051982 1076888
11180 1076888 1085107 1084628 1068219 1056347 1077867 1106977 1108176 1099578 1089328 1112138 1131651 1142629
11168 1142629 1146885 1146071 1139985 1166794 1211409 1235050 1232234 1222659 1222374 1236321 1242421 1246285 1260843
11155 1260843 1274424 1282409 1293788 1302477 1305846 1317570 1344188 1360169 1392055 1395736 1382427 1394705
11143 1394705 1406398 1409035 1420889 1437696 1441375 1448974 1490130 1517660 1507583 1519978 1547246 1549594
11131 1549594 1558092 1579259 1606083 1618167 1636478 1667177 1695660 1692075 1676028 1680471 1692246 1691927
$$ packed form
11217H32621k2685k5040O541K8603O2331K4857j9599j2649j1286O659N3873K2865
11205I47091K000M317n857k1682o431R546N496j8993j910M5911L5535K1477m441
11192A012059j449o258j0931J8009L0324K2747r400q095k5496p433L7905K4906
11180A076888Q219m79j6409j1872K1520K9110J199q598j0250K2810J9513J0978
11168A142629M256q14o086K6809M4615K3641k816r575k85J3947O100L864J4558
11155A260843J3581P985J1379Q689L369J1724K6618J5981L1886L681j3309J2278
11143A394705J1693K637J1854J6807L679P599M1156K7530j0077J2395K7268K348
11131A549594Q498K1167K6824J2084J8311L0699K8483l585j6047M443J1775l19
$$ plain form
11119 1691927 1739253 1753600 1751409 1767674 1770868 1790346 1800160 1821632 1841755 1861577 1880557 1899411
11107 1899411 1934337 1972248 2017513 2029220 2026485 2051948 2106523 2130655 2124832 2103488 2114958 2144165
11095 2144165 2215809 2252601 2265413 2292708 2324101 2345242 2380430 2396956 2430689 2476128 2495130
11084 2495130 2520952 2562553 2590477 2610463 2632325 2661385 2697970 2743533 2762591 2746677 2774966
11073 2774966 2830791 2868213 2907066 2934728 2965572 2995972 3041835 3074318 3104146 3152529 3205343
11062 3205343 3264421 3321517 3375848 3420649 3477343 3552486 3582923 3602983 3629007 3669862 3728649
11051 3728649 3758928 3810286 3858366 3922572 3970288 4021105 4078167 4134387 4235335 4311591 4351317
11040 4351317 4422353 4482664 4502377 4547383 4617861 4675797 4729683 4809773 4868268 4948966 5024941
$$ packed form
11119A691927M7326J4347k191J6265L194J9478R814K1472K0123J9822J8980J8854
11107A899411L4926L7911M5265J1707k735K5463N4575K4132n823k1344J1470K9207
11095B144165P1644L6792J2812K7295L1393K1141L5188J6526L3733M5439J9002
11084B495130K5822M1601K7924J9986K1862K9060L6585M5563J9058j5914K8289
11073B774966N5825L7422L8853K7662L0844L0400M5863L2483K9828M8383N2814
11062C205343N9078N7096N4331M4801N6694P5143L0437K0060K6024M0855N8787
11051C728649L0279N1358M8080O4206M7716N0817N7062N6220J00948P6256L9726
11040D351317P1036O0311J9713M5006P0478N7936N3886Q0090N8495Q0698P5975
$$ plain form
11029 5024941 5104881 5174132 5239730 5305470 5371910 5431474 5496519 5555717 5631931 5705714 5789580
11018 5789580 5841201 5888212 6003279 6102118 6161934 6234343 6300591 6388339 6439384 6505549 6603988
11007 6603988 6689940 6782295 6844277 6875708 6947149 7043772 7113594 7152434 7216943 7287322 7370521
10996 7370521 7453088 7504640 7581040 7644156 7710080 7778981 7847354 7893212 7945143 7975836 7996862
10985 7996862 8056376 8117016 8183974 8207326 8236853 8288587 8337452 8396716 8429605 8453028 8474749
10974 8474749 8472343 8489952 8506760 8501666 8528571 8561742 8592157 8590866 8561624 8542771 8534665 8507263
10962 8507263 8518286 8519750 8526048 8523867 8528527 8492229 8464964 8445509 8371545 8333891 8327886 8299703
10950 8299703 8262816 8252042 8241929 8224727 8170209 8122020 8050390 7991485 7940444 7890369 7824310
$$ packed form
11029E024941P9940O9251O5598O5740O6440N9564O5045N9198P6214P3783Q3866
11018E789580N1621M7011J15067R8839N9816P2409O6248Q7748N1045O6165R8439
11007F603988Q5952R2355O1982L1431P1441R6623O9822L8840O4509P0379Q3199
10996G370521Q2567N1552P6400O3116O5924O8901O8373M5858N1931L0693K1026
10985G996862N9514O0640O6958K3352K9527N1734M8865N9264L2889K3423K1721
10974H474749k406J7609J6808n094K6905L3171L0415j291k9242j8853q106k7402
10962H507263J1023J464O298k181M660l6298k7265j9455p3964l7654o005k8183
10950H299703l6887j0774j0113j7202n4518m8189p1630n8905n1041n0075o6059
$$ plain form
10939 7824310 7770402 7737845 7690071 7631347 7586428 7536666 7473393 7404565 7360973 7328371 7266424
10928 7266424 7217443 7187289 7141111 7092264 7039921 6966323 6908543 6874735 6847672 6769200 6710004
10917 6710004 6630507 6562140 6491301 6460078 6427496 6381118 6308792 6240523 6187431 6125915 6074437
10906 6074437 6046722 6012525 5962247 5907953 5873346 5812384 5759012 5718949 5663564 5643106 5611201
10895 5611201 5549062 5487749 5445087 5411261 5364896 5315340 5274326 5227941 5199078 5182627 5153503
10884 5153503 5118223 5072333 5041999 4994853 4942768 4907166 4868971 4834744 4781321 4733259 4694594
10873 4694594 4666219 4663935 4659970 4623399 4616237 4596293 4568885 4514617 4469592 4441442 4401889 4381148
10861 4381148 4361858 4350876 4339543 4335117 4298329 4230604 4199763 4167858 4164294 4163436 4136001 4111018
$$ packed form
10939G824310n3908l2557m7774n8724m4919m9762o3273o8828m3592l2602o1947
10928G266424m8981l0154m6178m8847n2343p3598n7780l3808k7063p8472n9196
10917F710004p9497o8367p0839l1223l2582m6378p2326o8269n3092o1516n1478
10906F074437k7715l4197n0278n4294l4607o0962n3372m0063n5385k0458l1905
10895E611201o2139o1313m2662l3826m6365m9556m1014m6385k8863j6451k9124
10884E153503l5280m5890l0334m7146n2085l5602l8195l4227n3423m8062l8665
10873D694594k8375k284l965l6571p162j9944k7408n4268m5025k8150l9553k0741
10861D381148j9290j0982j1333m426l6788o7725l0841l1905l564q58k7435k4983
$$ plain form
10849 4111018 4116436 4112743 4079426 4065443 4048762 4013988 3977613 3949748 3925700 3922650 3908200 3890765
10837 3890765 3853562 3834346 3832842 3816917 3768412 3736457 3733105 3718326 3701578 3716863 3713020 3702504
10825 3702504 3700363 3707359 3712539 3680607 3653351 3652940 3647443 3642681 3621664 3620589 3611844 3604756 3611906
10812 3611906 3578923 3561818 3566367 3597949 3618515 3619301 3598899 3601372 3585704 3557553 3548730 3551496
10800 3551496 3543011 3546238 3556777 3542960 3506527 3486970 3462841 3473353 3510524 3505438 3505475 3510689 3505352
10787 3505352 3493981 3511143 3511066 3502022 3484950 3450147 3450882 3467502 3470456 3489925 3497980 3491915 3493591
10774 3493591 3517384 3517596 3510635 3503941 3498625 3505932 3510647 3508958 3490918 3494405 3510214 3507312 3529417
10761 3529417 3534118 3550341 3565074 3556408 3537619 3552194 3549865 3562796 3568400 3560390 3548929 3582429
$$ packed form
10849D111018N418l693l3317j3983j6681l4774l6375k7865k4048l050j4450j7435
10837C890765l7203j9216j504j5925m8505l1955l352j4779j6748J5285l843j0516
10825C702504k141O996N180l1932k7256m11n497m762k1017j075q745p088P150
10812C611906l2983j7105M549L1582K0566P86k0402K473j5668k8151q823K766
10800C551496q485L227J0539j3817l6433j9557k4129J0512L7171n086L7N214n337
10787C505352j1371J7162p7r044j7072l4803P35J6620K954J9469Q055o065J676
10774C493591K3793K12o961o694n316P307M715j689j8040L487J5809k902K2105
10761C529417M701J6223J4733q666j8789J4575k329J2931N604q010j1461L3500
$$ plain form
10749 3582429 3629003 3660812 3652024 3678181 3692947 3701122 3702209 3697808 3711579 3719340 3712028 3709686 3740387
10736 3740387 3754312 3765439 3772003 3795603 3797638 3813335 3832383 3834880 3855390 3870183 3867898 3852813
10724 3852813 3873139 3912919 3930817 3942463 3986451 4010893 4017952 4009470 4039235 4082746 4084907 4068513
10712 4068513 4079238 4093419 4145727 4188312 4179248 4174606 4185802 4207034 4208572 4264531 4302788 4323829
10700 4323829 4360568 4389132 4408049 4442302 4456443 4482866 4508666 4508429 4521495 4547813 4580090 4613569
10688 4613569 4634889 4671750 4682282 4696146 4695104 4730233 4779422 4812655 4846518 4892852 4939913
10677 4939913 4963195 4985032 5034033 5073787 5100356 5138020 5173076 5198111 5231434 5252174 5273470
10666 5273470 5314099 5354954 5422233 5484852 5507203 5483078 5470634 5525214 5571206 5600259 5640969
$$ packed form
10749C582429M6574L1809q788K6157J4766Q175J087m401J3771P761p312k342L0701
10736C740387J3925J1127O564K3600K035J5697J9048K497K0510J4793k285j5085
10724C852813K0326L9780J7898J1646M3988K4442P059q482K9765M3511K161j6394
10712D068513J0725J4181N2308M2585r064m642J1196K1232J538N5959L8257K1041
10700D323829L6739K8564J8917L4253J4141K6423K5800k37J3066K6318L2277L3479
10688D613569K1320L6861J0532J3864j042L5129M9189L3233L3863M6334M7061
10677D939913K3282K1837M9001L9754K6569L7664L5056K5035L3323K0740K1296
10666E273470M0629M0855O7279O2619K2351k4125j2444N4580M5992K9053M0710
$$ plain form
10655 5640969 5696058 5751342 5810857 5869017 5916923 5954136 5968176 6020780 6068539 6122808 6155109
10644 6155109 6202401 6241417 6305994 6361306 6409274 6493036 6568988 6618112 6655660 6715395 6784413
10633 6784413 6846729 6903958 6962198 7022567 7115506 7193200 7250565 7301345 7369832 7446165 7511386
10622 7511386 7592706 7671145 7727712 7818407 7883085 7966201 8053667 8108485 8186834 8294174 8384977
10611 8384977 8479803 8580595 8676510 8761111 8821244 8899573 9005861 9112406 9188185 9270791 9386724
10600 9386724 9507922 9637147 9771652 9897040 9996344 10086450 10208002 10368500 10497254 10635600
10590 10635600 10747431 10884902 11017978 11165518 11336779 11527096 11721955 11936077 12158154
10581 12158154 12411024 12709908 13029927 13293238 13479094 13556566 13586941 13607075 13666192 13793391
$$ packed form
10655E640969N5089N5284N9515N8160M7906L7213J4040N2604M7759N4269L2301
10644F155109M7292L9016O4577N5312M7968Q3762P5952M9124L7548N9735O9018
10633F784413O2316N7229N8240O0369R2939P7694N7365N0780O8487P6333O5221
10622G511386Q1320P8439N6567R0695O4678Q3116Q7466N4818P8349J07340R0803
10611H384977R4826J00792R5915Q4601O0133P8329J06288J06545P5779Q2606J15933
10600I386724J21198J29225J34505J25388R9304R0106J21552J60498J28754J38346
10590A0635600J11831J37471J33076J47540J71261J90317J94859K14122K22077
10581A2158154K52870K98884L20019K63311J85856P7472L0375K0134N9117J27199
$$ plain form
10571 13793391 13883613 14010884 14150125 14286388 14453010 14602664 14754615 14946353 15149160
10562 15149160 15354007 15544427 15738924 15958269 16167442 16372974 16571936 16778450 17029963
10553 17029963 17296687 17550532 17775937 18023848 18251525 18505596 18750342 19011291 19272933
10544 19272933 19565866 19844284 20099336 20346907 20652390 20928355 21214171 21502519 21783518
10535 21783518 22100319 22407743 22685256 23006335 23317892 23653453 23980580 24302657 24623115
10526 24623115 24959462 25299795 25650714 26000279 26340840 26702728 27071186 27433005 27781314
10517 27781314 28136070 28509544 28896909 29270368 29661156 30044564 30445174 30844355 31252744
10508 31252744 31662470 32069238 32462435 32878137 33292618 33707117 34136774 34548506 34974796
$$ packed form
10571A3793391R0222J27271J39241J36263J66622J49654J51951J91738K02807
10562A5149160K04847J90420J94497K19345K09173K05532J98962K06514K51513
10553A7029963K66724K53845K25405K47911K27677K54071K44746K60949K61642
10544A9272933K92933K78418K55052K47571L05483K75965K85816K88348K80999
10535B1783518L16801L07424K77513L21079L11557L35561L27127L22077L20458
10526B4623115L36347L40333L50919L49565L40561L61888L68458L61819L48309
10517B7781314L54756L73474L87365L73459L90788L83408M00610L99181M08389
10508C1252744M09726M06768L93197M15702M14481M14499M29657M11732M26290
$$ plain form
10499 34974796 35413623 35851647 36270951 36693959 37118917 37552954 37982747 38421103 38870148
10490 38870148 39299350 39751267 40182882 40587333 40991320 41421333 41849827 42305728 42737958
10481 42737958 43209445 43677575 44118257 44542514 44969165 45399689 45793234 46207245 46643685
10472 46643685 47069970 47506203 47939484 48331910 48723213 49106586 49494339 49866176 50249729
10463 50249729 50620562 50934880 51265036 51620993 51943345 52200148 52480617 52800512 53091080
10454 53091080 53317955 53547534 53774665 53997709 54234762 54441464 54629952 54791144 54936540
10445 54936540 55040199 55138703 55227859 55319742 55416839 55472456 55524705 55534873 55512389 55458524 55417664
10434 55417664 55356736 55297326 55231502 55146719 55044846 54913552 54755046 54608950 54440424 54261330
$$ packed form
10499C4974796M38827M38024M19304M23008M24958M34037M29793M38356M49045
10490C8870148M29202M51917M31615M04451M03987M30013M28494M55901M32230
10481D2737958M71487M68130M40682M24257M26651M30524L93545M14011M36440
10472D6643685M26285M36233M33281L92426L91303L83373L87753L71837L83553
10463E0249729L70833L14318L30156L55957L22352K56803K80469L19895K90568
10454E3091080K26875K29579K27131K23044K37053K06702J88488J61192J45396
10445E4936540J03659R8504Q9156R1883R7097N5617N2249J0168k2484n3865m0860
10434E5417664o0928n9410o5824q4783j01873j31294j58506j46096j68526j79094
$$ plain form
10424 54261330 54096105 53886169 53671821 53437039 53181469 52914991 52622713 52352823 52095454
10415 52095454 51828775 51550099 51224736 50861882 50434728 50030731 49588430 49160081 48750153
10406 48750153 48347702 47941120 47480734 47062115 46632240 46185509 45765295 45321633 44867725
10397 44867725 44414879 43964972 43509181 43055271 42611535 42151508 41682989 41222809 40766870
10388 40766870 40315703 39883492 39407849 38940336 38516522 38076369 37619761 37144073 36679616
10379 36679616 36200915 35725184 35280934 34833133 34391501 33955859 33538011 33132675 32703735
10370 32703735 32307777 31879596 31439587 30994166 30588362 30169487 29749392 29353559 28982344
10361 28982344 28599447 28223436 27846184 27489171 27115038 26760924 26390881 26019157 25663380
$$ packed form
10424E4261330j65225k09936k14348k34782k55570k66478k92278k69890k57369
10415E2095454k66679k78676l25363l62854m27154m03997m42301m28349m09928
10406D8750153m02451m06582m60386m18619m29875m46731m20214m43662m53908
10397D4867725m52846m49907m55791m53910m43736m60027m68519m60180m55939
10388D0766870m51167m32211m75643m67513m23814m40153m56608m75688m64457
10379C6679616m78701m75731m44250m47801m41632m35642m17848m05336m28940
10370C2703735l95958m28181m40009m45421m05804m18875m20095l95833l71215
10361B8982344l82897l76011l77252l57013l74133l54114l70043l71724l55777
$$ plain form
10352 25663380 25305461 24929081 24567074 24235448 23920006 23602789 23286494 22964185 22644398
10343 22644398 22333550 22012927 21693088 21396400 21092901 20774419 20477462 20189708 19917936
10334 19917936 19668279 19412810 19149017 18867669 18598231 18356942 18127532 17864054 17625617
10325 17625617 17377519 17145379 16916230 16697149 16487234 16286732 16080429 15862718 15637254
10316 15637254 15439407 15240816 15041882 14863221 14672034 14466587 14276144 14090604 13893800
10307 13893800 13714083 13565356 13423038 13264152 13078104 12895198 12715393 12556120 12418275
10298 12418275 12301554 12157253 12034499 11941088 11851846 11716576 11607005 11464194 11323903 11151322
10288 11151322 11002602 10859978 10709833 10588257 10510443 10446873 10370288 10302958 10239222 10158211
$$ packed form
10352B5663380l57919l76380l62007l31626l15442l17217l16295l22309l19787
10343B2644398l10848l20623l19839k96688l03499l18482k96957k87754k71772
10334A9917936k49657k55469k63793k81348k69438k41289k29410k63478k38437
10325A7625617k48098k32140k29149k19081k09915k00502k06303k17711k25464
10316A5637254j97847j98591j98934j78661j91187k05447j90443j85540j96804
10307A3893800j79717j48727j42318j58886j86048j82906j79805j59273j37845
10298A2418275j16721j44301j22754r3411q9242j35270j09571j42811j40291j72581
10288A1151322j48720j42624j50145j21576p7814o3570p6585o7330o3736q1011
$$ plain form
10278 10158211 10038473 9920496 9817748 9737193 9634384 9528617 9428158 9330416 9242462 9170131
10268 9170131 9099530 9006986 8938175 8895473 8822606 8737156 8657231 8594743 8535600 8496646 8430880
10257 8430880 8348315 8308459 8280978 8257018 8208606 8163402 8118152 8089383 8078965 8059046 8015247
10246 8015247 7990305 7999150 7953042 7917426 7857652 7795810 7764222 7751458 7722414 7697726 7654553
10235 7654553 7633154 7615806 7585289 7535861 7529244 7527486 7507617 7484446 7442290 7385896 7408312 7442642
10223 7442642 7445209 7442066 7434468 7430845 7421970 7434984 7434569 7448222 7467935 7486907 7533075 7571647 7590309
10210 7590309 7635661 7672485 7754785 7800648 7856151 7938705 8033383 8111925 8210521 8328799 8470437
10199 8470437 8660890 8833645 9012701 9284292 9604819 9931713 10247691 10590737 10953359
$$ packed form
10278A0158211j19738j17977j02748q0555j02809j05767j00459r7742q7954p2331
10268I170131p0601r2544o8811m2702p2867q5450p9925o2488n9143l8954o5766
10257H430880q2565l9856k7481k3960m8412m5204m5250k8769j0418j9919m3799
10246H015247k4942Q845m6108l5616n9774o1842l1588j2764k9044k4688m3173
10235G654553k1399j7348l0517m9428o617j758j9869k3171m2156n6394K2416L4330
10223G442642K567l143p598l623q875J3014m15J3653J9713J8972M6168L8572J8662
10210G590309M5352L6824Q2300M5863N5503Q2554R4678P8542R8596J18278J41638
10199H470437J90453J72755J79056K71591L20527L26894L15978L43046L62622
$$ plain form
10190 10953359 11366239 11843656 12401013 13011085 13747526 14655198 15770294 17101361 18691903
10181 18691903 20514234 22590827 24937969 27493890 30135251 32728323 35102088 37204173
10173 37204173 39019524 40623670 42240343 44243354 47129762 51410429 57720323 66894421
10165 66894421 80037526 98738374 125009600 159794337 198891727 228742228 232994971
10158 232994971 210765144 177670341 147175553 123283429 105312927 91782505 81357681
10151 81357681 73175747 66656437 61499439 57412244 54094751 51418165 49285451 47528755
10143 47528755 45942296 44361804 42769363 41251505 39850030 38648999 37618866 36723923
10135 36723923 35966991 35330938 34813988 34411603 34130499 34002055 34031069 34123793 34106999 33814628
$$ packed form
10190A0953359M12880M77417N57357O10072P36441R07672J115096J331067J590542
10181A8691903J822331K076593K347142K555921K641361K593072K373765K102085
10173C7204173J815351J604146J616673K003011K886408M280667O309894R174098
10165F6894421J3143105J8700848K6271226L4784737L9097390K9850501M252743
10158B32994971k2229827l3094803l0494788k3892124j7970502j3530422j0424824
10151H1357681q181934o519310n156998m087195l317493k676586k132714j756696
10143D7528755j586459j580492j592441j517858j401475j201031j030133q94943
10135C6723923p56932o36053n16950m02385k81104j28444K9014R2724j6794k92371
$$ plain form
10125 33814628 33153503 32146941 30939984 29600491 28248540 26935613 25671045 24461699
10117 24461699 23320849 22206100 21097699 20093242 19168743 18298780 17490008 16735142 16027651
10108 16027651 15353862 14737908 14143965 13598772 13097912 12599888 12100779 11620892 11147051
10099 11147051 10691534 10285373 9887747 9542811 9213708 8910370 8588847 8279341 7970131
10090 7970131 7702344 7476268 7249665 7032927 6800780 6594893 6427417 6274209 6114123
10081 6114123 5918334 5756032 5603523 5448679 5308842 5172554 5027693 4938998 4879564 4811302
10071 4811302 4756337 4698217 4595323 4473046 4336663 4200470 4069419 3962950 3857398 3774680
10061 3774680 3692090 3607403 3556875 3481763 3389809 3338128 3266913 3223846 3184045 3132037 3076212
$$ packed form
10125C3814628o61125j006562j206957j339493j351951j312927j264568j209346
10117B4461699j140850j114749j108401j004457r24499q69963q08772p54866p07491
10108A6027651o73789o15954n93943n45193n00860m98024m99109m79887m73841
10099A1147051m55517m06161l97626l44936l29103l03338l21523l09506l09210
10090G970131k67787k26076k26603k16738k32147k05887j67476j53208j60086
10081F114123j95789j62302j52509j54844j39837j36288j44861q8695n9434o8262
10071D811302n4965n8120j02894j22277j36383j36193j31051j06469j05552q2718
10061C774680q2590q4687n0528p5112r1954n1681p1215m3067l9801n2008n5825
$$ plain form
10050 3076212 3041554 2980866 2955392 2919495 2865471 2856937 2833158 2852752 2880821 2875672 2858965 2866714
10038 2866714 2872618 2884359 2888632 2927210 2938618 2960437 2945388 2898246 2832850 2753819 2705508 2654585
10026 2654585 2637789 2622816 2600422 2581687 2542056 2513568 2488033 2463249 2445414 2427469 2430024
10015 2430024 2416954 2384108 2382697 2406005 2427790 2391782 2360132 2337093 2326377 2327045 2338008 2368030
10003 2368030 2366228 2338783 2313156 2336272 2351834 2347482 2376811 2418437 2389453 2385660 2409088 2421383
9991 2421383 2430216 2439281 2438722 2430908 2429372 2415180 2389571 2377274 2373748 2398755 2436850 2400107 2371801
9978 2371801 2352338 2322491 2310593 2306901 2274181 2252684 2226696 2193883 2183622 2161740 2174955 2155782
9966 2155782 2094987 2087873 2089551 2092664 2072056 2047088 2025777 2006526 1978238 1999539 2027885 1999940
$$ packed form
10050C076212l4658o0688k5474l5897n4024q534k3779J9594K8069n149j6707P749
10038B866714N904J1741M273L8578J1408K1819j5049m7142o5396p9031m8311n0923
10026B654585j6796j4973k2394j8735l9631k8488k5535k4784j7835j7945K555
10015B430024j3070l2846j411K3308K1785l6008l1650k3039j0716O68J0963L0022
10003B368030j802k7445k5627K3116J5562m352K9329M1626k8984l793K3428J2295
9991B421383Q833R065n59p814j536j4192k5609j2297l526K5007L8095l6743k8306
9978B371801j9463k9847j1898l692l2720k1497k5988l2813j0261k1882J3215j9173
9966B155782o0795p114J678L113k0608k4968k1311j9251k8288K1301K8346k7945
$$ plain form
9954 1999940 1969664 1939665 1893672 1879938 1873232 1865197 1881886 1888476 1879401 1857957 1829191 1814019
9942 1814019 1796295 1765870 1749645 1730413 1719281 1692466 1653856 1647809 1620516 1575128 1578442 1584124
9930 1584124 1569932 1551624 1512643 1501642 1498717 1513274 1513235 1500065 1494074 1479129 1487686 1500252 1472142
9917 1472142 1448123 1468328 1463432 1418103 1407029 1417648 1407549 1406628 1405623 1401156 1366086 1348918
9905 1348918 1335668 1304637 1279948 1278612 1264161 1249999 1250663 1242225 1213536 1167042 1158226 1147884
9893 1147884 1138520 1114043 1096680 1106635 1088485 1088122 1086127 1085704 1113397 1140893 1125742 1114918 1071183
9880 1071183 1019170 1006581 1020836 1048072 1039275 1030601 1053660 1055137 1019153 1019235 1040114 1034387 1004095
9867 1004095 996344 1021844 1029898 1011057 995541 1025836 1053092 1054101 1021287 1038629 1056191 1083639
$$ packed form
9954A999940l0276k9999m5993j3734o706q035J6689O590r075k1444k8766j5172
9942A814019j7724l0425j6225j9232j1132k6815l8610o047k7293m5388L314N682
9930A584124j4192j8308l8981j1001k925J4557l9j3170n991j4945Q557J2566k8110
9917A472142k4019K0205m896m5329j1074J0619j0099r21j005m467l5070j7168
9905A348918j3250l1031k4689j336j4451j4162O64q438k8689m6494q816j0342
9893A147884r364k4477j7363R955j8150l63j995m23K7693K7496j5151j0824m3735
9880A071183n2013j2589J4255K7236q797q674K3059J477l5984Q2K0879n727l0292
9867A004095p751K5500Q054j8841j5516L0295K7256J009l2814J7342J7562K7448
$$ plain form
9855 1083639 1053795 1039061 1004686 979730 976569 1007549 1030226 1035342 1049255 1073088 1056195 1050320
9843 1050320 1054966 1044563 1044226 1053007 1070048 1106254 1157061 1191472 1217940 1191341 1160151 1135866
9831 1135866 1110972 1078245 1067583 1068455 1052835 1014138 1011244 1014512 1013109 1017294 1046778 1044541 1024875
9818 1024875 1018564 1006596 998426 1004620 992838 968746 940599 924740 936773 947125 935980 934283
9806 934283 929152 916896 929943 932781 901035 924415 962906 942202 930235 892229 877437 879642
9794 879642 851232 861371 885081 866222 861335 858980 833634 821985 827673 851281 859398 844594
9782 844594 831447 853884 867126 841990 821550 820709 800070 770581 763883 766026 740554 748166 753134
9769 753134 771992 810244 806869 800372 835803 853910 831699 776913 755956 778387 778983 763349
$$ packed form
9855A083639k9844j4734l4375k4956l161L0980K2677N116J3913K3833j6893n875
9843A050320M646j0403l37Q781J7041L6206N0807L4411K6468k6599l1190k4285
9831A135866k4894l2727j0662Q72j5620l8697k894L268j403M185K9484k237j9666
9818A024875o311j1968q170O194j1782k4092k8147j5859J2033J0352j1145j697
9806I34283n131j2256J3047K838l1746K3380L8491k0704j1967l8006j4792K205
9794H79642k8410J0139K3710j8859m887k355k5346j1649N688K3608Q117j4804
9782H44594j3147K2437J3242k5136k0440q41k0639k9489o698K143k5472P612M968
9769G53134J8858L8252l375o497L5431J8107k2211n4786k0957K2431N96j5634
$$ plain form
9757 763349 773121 802751 818326 826558 857348 863024 851209 846901 871891 869172 880491 880808 865367
9744 865367 914832 953805 1005939 1062816 1117791 1223482 1372905 1524210 1664302 1755352 1716363
9733 1716363 1616726 1473470 1324008 1214005 1137690 1070197 1006159 972734 946720 941361 940285
9722 940285 915932 904094 890366 883121 846692 840226 842832 828518 831736 823439 798681 806692 799167
9709 799167 791582 776889 767999 744097 745130 757396 775773 767782 739026 743720 750575 738567 720066
9696 720066 719074 714452 683886 659943 651874 644646 641190 656979 665561 671411 649063 635699 618982
9683 618982 622407 606501 596343 611481 587693 561465 583042 606633 610404 595839 550013 534205
9671 534205 569669 599660 596208 588278 558640 539408 544657 549465 567728 545430 520896 528805 527489
$$ packed form
9757G63349R772K9630J5575Q232L0790N676j1815m308K4990k719J1319L17j5441
9744H65367M9465L8973N2134N6877N4975J05691J49423J51305J40092R1050l8989
9733A716363r9637j43256j49462j10003p6315o7493o4038l3425k6014n359j076
9722I40285k4353j1838j3728p245l6429o466K606j4314L218q297k4758Q011p525
9709G99167p585j4693q890k3902J033J2266J8377p991k8756M694O855j2008j8501
9696G20066r92m622l0566k3943q069p228l456J5789Q582N850k2348j3364j6717
9683F18982L425j5906j0158J5138k3788k6228K1577K3591L771j4565m5826j5808
9671E34205L5464K9991l452p930k9638j9232N249M808J8263k2298k4534P909j316
$$ plain form
9658 527489 527189 543933 546406 544313 545421 523461 511134 496182 479329 492978 520549 529254 495403
9645 495403 478942 489934 487008 473442 450139 427813 427962 423728 410654 450486 485628 482890 472062
9632 472062 475017 455221 463034 449036 429199 421756 427602 470187 483723 478498 469961 467436 458883
9619 458883 461143 474264 467772 444698 436386 455291 456407 440713 442308 459384 443042 445460 443444
9606 443444 423382 412573 417548 403084 421781 413213 409554 415143 430273 446227 444574 443347 481932
9593 481932 497578 482224 433147 433640 450320 450850 443658 451291 449211 443288 453906 461381 447647
9580 447647 437438 425895 398534 410015 405877 390948 416987 409375 389116 379837 409289 436148
9568 436148 440773 420437 419428 411314 422444 454644 432674 397123 394117 402238 412470 382541 367890
$$ packed form
9658E27489l00J6744K473k093J108k1960j2327j4952j6853J3649K7571Q705l3851
9645D95403j6461J0992k926j3566k3303k2326J49m234j3074L9832L5142k738j0828
9632D72062K955j9796P813j3998j9837p443N846M2585J3536n225q537k525q553
9619D58883K260J3121o492k3074q312J8905J116j5694J595J7076j6342K418k016
9606D43444k0062j0809M975j4464J8697q568l659N589J5130J5954j653j227L8585
9593D81932J5646j5354m9077M93J6680N30p192P633k080n923J0618P475j3734
9580D47647j0209j1543k7361J1481m138j4929K6039p612k0259r279K9452K6859
9568D36148M625k0336j009q114J1130L2200k1970l5551l006Q121J0232k9929j4651
$$ plain form
9555 367890 359545 387782 419714 431965 435591 435657 419211 401963 399345 415584 425657 424013 401792
9542 401792 382323 395350 407105 411917 420010 399567 363863 361733 379987 405045 405409 412964 428830
9529 428830 418094 407210 362710 362937 368657 376745 365453 336696 310711 321461 335644 360796
9517 360796 384072 376531 381371 377960 364455 369128 376475 388996 392389 398956 405326 377125 374811
9504 374811 374115 384883 352416 319322 329807 340996 349137 349785 359714 346313 346336 341885 330910 346382
9490 346382 373603 362112 376843 397451 410975 395096 365826 355739 347931 348591 349000 329622 319006
9477 319006 318229 297072 292156 295755 296439 302825 312347 315234 314363 300451 306996 300748 282387 285021
9463 285021 309966 311364 313031 285004 266509 300590 316995 316282 311098 310023 316718 305564 290674
$$ packed form
9555C67890q345K8237L1932J2251L626O6j6446j7248k618J6239J0073j644k2221
9542D01792j9469J3027J1755M812Q093k0443l5704k130J8254K5058L64P555J5866
9529D28830j0736j0884m4500K27N720Q088j1292k8757k5985J0750J4183K5152
9517C60796K3276p541M840l411j3505M673P347J2521L393O567O370k8201k314
9504C74811o96J0768l2467l3094J0485J1189Q141O48R929j3401K3m451j0975J5472
9490C46382K7221j1491J4731K0608J3524j5879k9270j0087p808O60M09j9378j0616
9477C19006p77k1157m916L599O84O386R522K887q71j3912O545o248j8361K634
9463B85021K4945J398J667k8027j8495L4081J6405p13n184j075O695j1154j4890
$$ plain form
9450 290674 301707 325652 317838 326811 317767 307163 322128 335286 327093 327342 343938 332603 295169
9437 295169 261804 281703 317668 311744 284106 292992 295457 288500 279877 273571 273592 277602 267128 272751
9423 272751 272435 254717 282031 275430 252276 267926 276037 258648 271475 252123 256437 258732 268854
9410 268854 262714 289070 307000 309722 291044 263810 230803 218293 233323 234143 227998 237667 233546
9397 233546 254059 256172 256203 240725 235699 228966 228666 244588 268191 256850 227873 204050 191477
9384 191477 185406 200483 204371 197469 218396 235054 236666 241506 263793 279505 280673 286609 263501
9371 263501 255088 257641 214440 184379 219222 247343 271705 257322 264781 256025 260085 259054 252333
9358 252333 262066 275952 283306 291655 262420 259355 275012 268742 242291 258726 225745 201726 198150
$$ packed form
9450B90674J1033K3945p814Q973r044j0604J4965J3158q193K49J6596j1335l7434
9437B95169l3365J9899L5965n924k7638Q886K465o957q623o306K1M010j0474N623
9423B72751l16j7718K7314o601k3154J5650Q111j7389J2827j9352M314K295J0122
9410B68854o140K6356J7930K722j8678k7234l3007j2510J5030Q20o145R669m121
9397B33546K0513K113L1j5478n026o733l00J5922K3603j1341k8977k3823j2573
9384A91477o071J5077L888o902K0927J6658J612M840K2287J5712J168N936k3108
9371B63501q413K553m3201l0061L4843K8121K4362j4383P459q756M060j031o721
9358B52333R733J3886P354Q349k9235l065J5657o270k6451J6435l2981k4019l576
$$ plain form
9345 198150 193739 232145 242592 226570 231546 235824 239978 229337 253849 266427 257326 237416 203902
9332 203902 192283 203654 192170 195974 180833 169976 183412 181190 169506 152694 149051 189042
9320 189042 198069 202893 227906 238519 243027 234913 256354 278082 280878 264674 268023 244604 232032
9307 232032 222618 225796 220488 211047 196885 188215 210874 235109 225439 202896 187555 196148 198314
9294 198314 189400 192209 192110 181332 191961 227643 241272 235427 231226 212546 200068 221478 213349
9281 213349 228352 243543 214029 212524 219808 226574 227623 260479 284107 278196 292860 280673 250734
9268 250734 235450 224878 214505 219220 235661 236056 262739 259314 231213 226214 251949 285469 271550
9255 271550 245668 278017 307196 341669 333958 294107 265826 247528 232178 265081 293818 296494
$$ packed form
9345A98150m411L8406J0447j6022M976M278M154j0641K4512J2578r101j9910l3514
9332B03902j1619J1371j1484L804j5141j0857J3436k222j1684j6812l643L9991
9320A89042R027M824K5013J0613M508q114K1441K1728K796j6204L349k3419j2572
9307B32032r414L178n308r441j4162q670K2659K4235r670k2543j5341Q593K166
9294A98314q914K809r9j0778J0629L5682J3629n845m201j8680j2478K1410q129
9281B13349J5003J5191k9514j505P284O766J049L2856K3628n911J4664j2187k9939
9268B50734j5284j0572j0373M715J6441L95K6683l425k8101m999K5735L3520j3919
9255B71550k5882L2349K9179L4473p711l9851k8281j8298j5350L2903K8737K676
$$ plain form
9243 296494 316862 330270 348567 365748 370755 363444 365006 357587 354685 338390 324958 310478 276663
9230 276663 283220 303581 286776 260711 265219 290849 275594 260842 256305 257673 257304 256715 267037
9217 267037 259063 248378 242292 229569 215636 199514 204840 217115 235155 242150 228990 204892
9205 204892 245893 275276 273377 268231 242800 235619 199495 195260 204710 196789 189432 199303 221041
9192 221041 222171 214125 216132 217737 232225 258317 244589 210512 191337 201305 223688 241701 220901
9179 220901 211334 224216 220594 194050 189825 177436 174734 171114 180319 180136 164573 144922 139617
9166 139617 164779 186978 211979 197895 196557 202145 204964 191898 176194 180359 194580 206252
9154 206252 187885 176802 191017 184235 188322 190143 197420 214719 199788 174557 183345 198257 176243
$$ packed form
9243B96494K0368J3408J8297J7181N007p311J562p419k902j6295j3432j4480l3815
9230B76663O557K0361j6805k6065M508K5630j5255j4752m537J368l69n89J0322
9217B67037p974j0685o086j2723j3933j6122N326J2275J8040O995j3160k4098
9205B04892M1001K9383j899n146k5431p181l6124m235R450p921p357R871K1738
9192B21041J130q046K007J605J4488K6092j3728l4077j9175R968K2383J8013k0800
9179B20901r567J2882l622k6544m225j2389k702l620R205j83j5563j9651n305
9166A39617K5162K2199K5001j4084j338N588K819j3066j5704M165J4221J1672
9154B06252j8367j1083J4215o782M087J821P277J7299j4931k5231Q788J4912k2014
$$ plain form
9141 176243 164125 171855 182198 170653 170648 186460 191365 201243 202021 188929 178812 174306 169768 169325
9127 169325 171812 155176 132665 114959 124339 128444 146970 171571 158414 161974 166463 139198 128420
9114 128420 115002 103520 122341 152681 151182 144901 168869 179876 169844 160999 179287 184312
9102 184312 184283 184618 174376 161863 164719 157599 156325 152009 166362 174206 126758 132729 147667 143325
9088 143325 135160 126816 116254 126691 138507 135905 150474 161203 154947 166109 160057 146795 128904
9075 128904 123737 135585 109005 118004 115393 112468 127467 148132 165635 158081 171905 190374 180607
9062 180607 160022 155938 157455 160331 156168 133561 127520 135539 158779 192337 185216 176729 173602
9049 173602 155737 101295 66760 86811 110722 110630 115073 104852 95022 102018 100668 119793 130353
$$ packed form
9141A76243j2118P730J0343j1545nJ5812M905R878P78j3092j0117m506m538m43
9127A69325K487j6636k2511j7706R380M105J8526K4601j3157L560M489k7265j0778
9114A28420j3418j1482J8821L0340j499o281K3968J1007j0032q845J8288N025
9102A84312k9L35j0242j2513K856p120j274m316J4353P844m7448N971J4938m342
9088A43325q165q344j0562J0437J1816k602J4569J0729o256J1162o052j3262j7891
9075A28904n167J1848k6580Q999k611k925J4999K0665J7503p554J3824J8469r767
9062A80607k0585m084J517K876m163k2607o041Q019K3240L3558p121q487l127
9049A73602j7865n4442l4535K0051K3911r2M443j0221r830O996j350J9125J0560
$$ plain form
9036 130353 147164 167563 145688 152671 149318 136125 132158 153013 168022 170708 173956 193303 183714
9023 183714 156278 172089 180587 179067 163543 170896 164896 151924 160501 153444 175911 172038 169121
9010 169121 183515 170530 149880 126469 126277 137010 138326 147464 157911 165142 188658 183520 152583
8997 152583 139380 121925 104423 130401 138115 153478 130711 103012 109928 121250 126984 153850
8985 153850 178091 155126 150804 152805 145474 123151 99942 89930 108786 123829 119228 109431 105739
8972 105739 109124 121974 137823 108078 103320 126874 123118 118367 98296 94194 121219 106048 85720
8959 85720 105565 119590 147950 147779 108750 82020 101328 110394 76517 72382 69908 90214 120873
8946 120873 128160 119297 100571 103442 131211 147903 127911 113957 111079 102382 74309 63523 96148
$$ packed form
9036A30353J6811K0399k1875O983l353j3193l967K0855J5009K686L248J9347r589
9023A83714k7436J5811Q498j520j5524P353o000j2972Q577p057K2467l873k917
9010A69121J4394j2985k0650k3411j92J0733J316R138J0447P231K3516n138l0937
8997A52583j3203j7455j7502K5978P714J5363k2767k7699O916J1322N734K6866
8985A53850K4241k2965m322K001p331k2323k3209j0012J8856J5043m601r797l692
8972A05739L385J2850J5849k9745m758K3554l756m751k0071m102K7025j5171k0328
8959H5720J9845J4025K8360j71l9029k6730J9308R066l3877m135k474K0306L0659
8946A20873P287q863j8726K871K7769J6692j9992j3954k878q697k8073j0786L2625
$$ plain form
8933 96148 128164 103065 59237 57948 68501 89799 112930 125596 120874 110534 113901 156080
8921 156080 103264 70478 78494 92869 119516 121080 117095 67924 44501 85869 83017 92626 107674
8908 107674 106909 105441 131981 125486 111914 133467 145437 147221 128899 113523 127415 100458 108247
8895 108247 157574 163984 156720 165607 191646 201840 197914 198150 217773 223509 219215 211525 233462
8882 233462 259165 289473 308013 329021 334226 343268 341299 362505 374963 440871 531235 639078
8870 639078 856747 1135291 1431977 1586082 1440633 1188498 970904 805395 704578 609313
8860 609313 547566 504687 472646 421403 387516 360557 353489 345779 333499 323892 341658 351858
8848 351858 343220 334696 325116 303530 275784 239691 226641 219486 242194 248956 251757 242097 254607
$$ packed form
8933I6148L2016k5099m3828j289J0553K1298K3131J2666m722j0340L367M2179
8921A56080n2816l2786Q016J4375K6647J564l985m9171k3423M1368k852R609J5048
8908A07674p65j468K6540o495j3572K1553J1970J784j8322j5376J3892k6957P789
8895A08247M9327O410p264Q887K6039J0194l926K36J9623N736m294p690K1937
8882B33462K5703L0308J8540K1008N205R042j969K1206J2458O5908R0364J07843
8870F39078K17669K78544K96686J54105j45449k52135k17594j65509j00817r5265
8860F09313o1747m2879l2041n1243l3887k6959p068p710j2280r607J7766J0200
8848C51858q638q524r580k1586k7746l6093j3050p155K2708O762K801r660J2510
$$ plain form
8835 254607 246108 281260 301997 287089 246517 219440 235014 243138 225454 239138 234535 207732
8823 207732 176758 151020 150259 137161 131175 143605 144445 129139 135254 118504 108102 127443 121581
8810 121581 119258 116369 89247 82834 97149 93020 97183 123087 132936 124116 119609 129468 130241 142241
8796 142241 139739 120272 88190 79857 97549 93460 113891 112640 104711 107419 106093 114013 92754
8783 92754 108378 134526 105955 94661 82523 71583 71427 76611 74533 58975 58998 70293 85873
8770 85873 48828 47576 98336 89603 90910 64976 71770 73067 86807 100934 105228 106664 117358
8757 117358 101423 111681 85675 47009 13403 12604 35278 38078 43591 65333 84239 58786
8745 58786 44478 61188 66071 34223 50268 86599 94187 68937 67604 85291 101425 90805
$$ packed form
8835B54607q499L5152K0737j4908m0572k7077J5574Q124j7684J3684m603k6803
8823B07732l0974k5738p61j3098n986J2430Q40j5306O115j6750j0402J9341n862
8810A21581k323k889k7122o413J4315m129M163K5904R849q820m507R859P73J2000
8796A42241k502j9467l2082q333J7692m089K0431j251p929K708j326P920k1259
8783I2754J5624K6148k8571j1294j2138j0940j56N184k078j5558K3J1295J5580
8770H5873l7045j252N0760q733J307k5934O794J297J3740J4127M294J436J0694
8757A17358j5935J0258k6006l8666l3606p99K2674K800N513K1742J8906k5453
8745E8786j4308J6710M883l1848J6045L6331P588k5250j333J7687J6134j0620
$$ plain form
8733 90805 79498 83712 86931 97592 117539 106962 91122 106061 127360 110094 94681 101507
8721 101507 91423 95797 94266 93307 64328 69957 64620 93628 117662 102490 88434 90617 95190
8708 95190 101099 90544 127704 115960 99106 65340 75992 99991 102440 111289 104426 107101 106404
8695 106404 122245 118344 104316 103414 90279 95550 93743 94229 96387 102478 86812 80463 83110 81693
8681 81693 89726 84872 64475 30407 33398 42960 72963 72516 56890 67865 74094 81375 88446 76896
8667 76896 67337 74998 86420 82514 81196 78057 106056 99598 72381 81912 105487 115236 107175 94173
8653 94173 87102 84857 74082 83955 108946 106396 91845 87794 88248 67705 73149 80271 92094 94570
8639 94570 102085 123449 143801 149667 122452 128756 126499 115625 118502 127809 129502 120967 105734
$$ packed form
8733I0805j1307M214L219J0661J9947j0577j5840J4939K1299j7266j5413O826
8721A01507j0084M374j531r59k8979N629n337K9008K4034j5172j4056K183M573
8708I5190N909j0555L7160j1744j6854l3766J0652K3999K449Q849o863K675o97
8695A06404J5841l901j4028r02j3135N271j807M86K158O091j5666o349K647j417
8681H1693Q033m854k0397l4068K991R562L0003m47j5626J0975O229P281P071j1550
8667G6896r559P661J1422l906j318l139K7999o458k7217R531K3575R749q061j3002
8653I4173p071k245j0775R873K4991k550j4551m051M54k0543N444P122J1823K476
8639I4570P515K1364K0352N866k7215O304k257j0874K877R307J693q535j5233
$$ plain form
8626 105734 95494 76511 79861 80953 58075 64714 93685 106951 111633 109149 101884 103011 91843
8613 91843 77992 99290 124456 132976 125373 127258 133207 137054 123571 111220 90593 99037 128042
8600 128042 143915 152094 144036 146131 159237 176966 179244 199559 251892 247357 248454 248555 232660
8587 232660 237988 228725 211698 197915 186207 158941 115491 107604 105002 113066 119601 124800 137750
8574 137750 148486 174730 171723 138400 119399 143737 133943 94512 103112 104745 136452 156451
8562 156451 156433 145509 154101 142038 159605 163910 142300 151455 142206 139648 112131 114809 137743
8549 137743 146105 143855 153865 163312 152083 157582 180254 175900 147421 145345 158611 131040 139746
8536 139746 157812 128826 145478 191289 205235 221382 193744 162446 152304 150335 157574 148871
$$ packed form
8626A05734j0240j8983L350J092k2878O639K8971J3266M682k484p265J127j1168
8613I1843j3851K1298K5166Q520p603J885N949L847j3483j2351k0627Q444K9005
8600A28042J5873Q179q058K095J3106J7729K278K0315N2333m535J097J01j5895
8587B32660N328r263j7027j3783j1708k7266m3450p887k602Q064O535N199J2950
8574A37750J0736K6244l007l3323j9001K4338r794l9431Q600J633L1707J9999
8562A56451j8j0924Q592j2063J7567M305k1610R155r249k558k7517K678K2934
8549A37743Q362k250J0010R447j1229N499K2672m354k8479k076J3266k7571Q706
8536A39746J8066k8986J6652M5811J3946J6147k7638l1298j0142j969P239q703
$$ plain form
8524 148871 156446 146799 127658 123292 113317 102549 120291 116745 98345 93941 101789 115399 115685
8511 115685 126394 127746 111638 105409 108105 101788 95096 74395 71930 82361 98044 117842 117292
8498 117292 121883 112396 97843 91799 86548 84821 72652 65923 58611 58663 70718 60599 61392 82451
8484 82451 101569 85011 74376 59243 52059 41406 28465 35232 69244 85554 77901 68180 60963
8471 60963 66518 82314 98434 110930 119701 132004 120389 89964 87910 96179 87373 60771 22645
8458 22645 -1317 11085 24923 41758 36517 12592 20869 54413 75236 60288 57025 41782
8446 41782 25133 18064 22172 38933 66472 82869 85460 67250 62159 59266 74175 52146 53929
8433 53929 55782 63507 65917 61774 51649 35996 37155 43989 59034 42612 29901 42721 67539
$$ packed form
8524A48871P575r647j9141m366r975j0768J7742l546j8400m404P848J3610K86
8511A15685J0709J352j6108o229K696o317o692k0701k465J0431J5683J9798n50
8498A17292M591r487j4553o044n251j727j2169o729p312N2J2055j0119P93K1059
8484H2451J9118j6558j0635j5133p184j0653j2941O767L4012J6310p653r721p217
8471F0963N555J5796J6120J2496Q771J2303j1615l0425k054Q269q806k6602l8126
8458B2645k3962J2402J3838J6835n241k3925Q277L3544K0823j4948l263j5243
8446D1782j6649p069M108J6761K7539J6397K591j8210n091k893J4909k2029J783
8433E3929J853P725K410m143j0125j5653J159O834J5045j6422j2711J2820K4818
$$ plain form
8420 67539 39032 13309 21668 40429 60803 67380 78440 89593 87442 78184 68538 78981 68095
8407 68095 48549 6199 -12528 -13616 -10771 -9312 8991 26835 47325 72604 78388 42999 37132
8394 37132 47278 63615 55569 42215 30958 21178 39089 66887 51107 35804 21654 30644
8382 30644 38077 29416 49297 83077 93707 77879 44673 -6906 -2510 32420 35261 43986 51274
8369 51274 43749 73461 74923 49383 17870 7605 4641 -12855 836 55234 75047 57479
8357 57479 37272 29450 54746 64369 64401 35503 38836 22942 15505 2500 12399 48764 38690
8344 38690 46184 66402 66197 41832 14869 5807 -12372 -28188 -32764 -28411 -17514 2806 25072
8331 25072 40652 36907 32164 41514 38823 37869 62506 69935 62042 43860 20178 6172 10907 8905
$$ packed form
8420F7539k8507k5723Q359J8761K0374O577J1060J1153k151r258r646J0443j0886
8407F8095j9546m2350j8727j088K845J459J8303J7844K0490K5279N784l5389n867
8394C7132J0146J6337q046j3354j1257r780J7911K7798j5780j5303j4150Q990
8382C0644P433q661J9881L3780J0630j5828l3206n1579M396L4930K841Q725P288
8369E1274p525K9712J462k5540l1513j0265k964j7496J3691N4398J9813j7568
8357E7479k0207p822K5296R623L2k8898L333j5894p437j3005R899L6365j0074
8344C8690P494K0218k05k4365k6963r062j8179j5816m576M353J0897K0320K2266
8331B5072J5580l745m743R350k691r54K4637P429p893j8182k3682j4006M735k002
$$ plain form
8317 8905 2600 -5697 14912 21320 50460 82899 105305 69138 35322 30090 37128 62775 55453
8304 55453 44217 60345 66131 74907 99400 90188 52053 49056 64564 48590 37755 39380 38604
8291 38604 27280 40118 19123 752 -1220 17299 33133 15789 9149 21524 6688 17631
8279 17631 30359 31505 29350 32594 18410 4202 31170 57515 79134 67356 61367 57531 26775
8266 26775 26938 4070 -18926 -17105 -20718 -38438 4013 10548 5413 7584 16793 40861 43015 26520
8252 26520 40480 76506 71493 39349 17441 27190 28819 11960 15671 22685 25847 7355 13048
8239 13048 4631 -17944 -23355 -5524 27445 48557 28743 1451 14762 -7701 -33253 -11173
8227 -11173 19191 -2549 308 1846 15402 -4658 3691 38198 59238 49733 42130 20058 -1188
$$ packed form
8317H905o305q297K0609O408K9140L2439K2406l6167l3816n232P038K5647p322
8304E5453j1236J6128N786Q776K4493r212l8135k997J5508j5974j0835J625p76
8291C8604j1324J2838k0995j8371j972J8519J5834j7344o640J2375j4836J0943
8279A7631J2728J146k155L244j4184j4208K6968K6345K1619j1778n989l836l0756
8266B6775J63k2868k2996J821l613j7720M2451O535n135K171R209K4068K154j6495
8252B6520J3960L6026n013l2144k1908R749J629j6859L711P014L162j8492N693
8239A3048q417k2575n411J7831L2969K1112j9814k7292J3311k2463k5552K2080
8227a1173L0364k1740K857J538J3556k0060Q349L4507K1040r505p603k2072k1246
$$ plain form
8214 -1188 -6485 257 28596 40058 52937 42526 9893 26555 40588 10565 -2456 9069
8202 9069 28079 38499 35415 26963 34479 39861 35009 21861 27634 31561 40905 14734 16954 28881
8188 28881 36014 47629 40229 49703 57916 39126 63657 40807 21050 52666 65630 80595 50811
8175 50811 33147 23580 3037 16238 32145 44569 62736 57184 73652 99825 55864 27995
8163 27995 19402 20442 37554 41263 61828 56115 30412 -9113 -11461 2572 15798 -789 2260
8150 2260 24968 28095 -891 -8318 18171 19769 597 -19037 23342 33933 24715 23198 24770
8137 24770 32572 48176 45740 26548 28901 53519 74652 49270 22863 -4559 27260 52578
8125 52578 57504 28932 21642 -10563 -26191 -26714 -34557 -23866 -8721 5767 13164 15685 25408
$$ packed form
8214a188n297O742K8339J1462J2879j0411l2633J6662J4033l0023j3021J1525
8202I069J9010J0420l084q452P516N382m852j3148N773L927R344k6171K220J1927
8188B8881P133J1615p400R474Q213j8790K4531k2850j9757L1616J2964J4965k9784
8175E0811j7664r567k0543J3201J5907J2424J8167n552J6468K6173m3961k7869
8163B7995q593J040J7112L709K0565n713k5703l9525k348J4033J3226j6587L049
8150B260K2708L127k8986p427K6489J598j9172j9634M2379J0591r218j517J572
8137B4770P802J5604k436j9192K353K4618K1133k5382k6407k7422L1819K5318
8125E2578M926k8572p290l2205j5628n23p843J0691J5145J4488P397K521R723
$$ plain form
8112 25408 49642 31393 9723 12653 3243 -11651 -8347 -6439 20549 12619 27584 68528 81609
8099 81609 80093 35876 28145 51100 66862 62170 62676 37995 26218 33617 8839 -19058 13202
8086 13202 59350 72996 28680 5341 3328 2395 4022 19009 18915 40584 63951 59531 43546
8073 43546 58501 53026 48138 40178 18479 -824 -8906 5192 12297 4907 6618 37927 75965
8060 75965 74263 54621 50607 41106 30678 55537 30759 27238 20954 19665 12523 35593 32461
8047 32461 15581 24804 45988 44224 41898 42670 32510 33219 35405 45492 58308 58026 59065 55614
8033 55614 50171 39445 40143 52513 61897 66664 37487 34135 23272 41761 41428 22533 24294 38106
8019 38106 31141 11534 13565 30319 52839 72202 74633 68987 72627 43412 8969 23994 26344
$$ packed form
8112B5408K4234j8249k1670K930r410j4894L304J908K6988p930J4965M0944J3081
8099H1609j516m4217p731K2955J5762m692N06k4681j1777P399k4778k7897L2260
8086A3202M6148J3646m4316k3339k013r33J627J4987r4K1669K3367m420j5985
8073D3546J4955n475m888p960k1699j9303q082J4098P105p390J711L1309L8038
8060G5965j702j9642m014r501j0428K4859k4778l521o284j289p142K3070l132
8047C2461j6880R223K1184j764k326P72j0160P09K186J0087J2816k82J039l451
8033E5614n443j0726O98J2370R384M767k9177l352j0863J8489l33j8895J761J3812
8019C8106o965j9607K031J6754K2520J9363K431n646L640k9215l4443J5025K350
$$ plain form
8006 26344 57042 92917 101639 93355 63124 47051 20191 31645 29103 29574 44028 32909 35828
7993 35828 44128 53855 58412 72113 75342 66063 53696 80150 89079 57217 54035 62797 32836
7980 32836 38713 23514 26810 41016 49025 50500 65755 75999 64051 39184 46140 47636 -14184
7967 -14184 -20136 19604 26269 17781 5382 6542 7482 -4429 10957 9024 3407 37367 36499 19478
7953 19478 29924 38414 19614 25867 76666 68182 45145 68743 82102 60542 29153 33825 49017
7940 49017 51543 50554 60443 46317 54639 62562 87754 88142 92463 79105 98099 89949 81379 78610
7926 78610 72688 60046 28495 24168 33168 47766 58128 59079 51023 55461 60133 72078 95399
7913 95399 117479 108661 81196 67644 48067 30624 38042 46558 58472 87335 78325 42241 -1767
$$ packed form
8006B6344L0698L5875Q722q284l0231j6073k6860J1454k542M71J4454j1119K919
7993C5828Q300R727M557J3701L229r279j2367K6454Q929l1862l182Q762k9961
7980C2836N877j5199L296J4206Q009J475J5255J0244j1948k4867O956J496o1820
7967a4184n952L9740O665q488j2399J160R40j1911J5386j933n617L3960q68j7021
7953A9478J0446Q490j8800O253N0799q484k3037K3598J3359k1560l1389M672J5192
7940D9017K526r89R889j4126Q322P923K5192L88M321j3358J8994q150q570k769
7926G8610n922j2642l1551m327R000J4598J0362R51q056M438M672J1945K3321
7913I5399K2080q818k7465j3552j9577j7443P418Q516J1914K8863r010l6084m4008
$$ plain form
7900 -1767 -2837 17306 14527 64993 94709 111562 132613 127050 96759 77773 33947 18734 27030
7887 27030 11072 16836 30401 41595 45679 63509 66450 53935 50041 52482 75792 67220 44604
7874 44604 39683 38557 47909 56350 58598 54949 65537 64313 51057 60757 62645 31894 24000 33434
7860 33434 46140 45598 26794 26540 18444 2050 1450 8112 11610 26614 37112 45821 61007 36345
7846 36345 25199 40930 50826 37518 9456 10402 20211 33413 39198 58537 70815 68817 71347
7833 71347 76842 61706 28513 43108 43607 18383 14356 12211 13113 20265 -512 -40278 -28731
7820 -28731 -8108 -30772 -30983 -15339 -15261 14636 54142 42297 36019 43503 26050 26546 28138 7098
7806 7098 15629 37797 38764 50019 57031 32732 41320 49540 44726 41210 8997 212 20433 25615
$$ packed form
7900a767j070K0143k779N0466K9716J6853K1051n563l0291j8986m3826j5213Q296
7887B7030j5958N764J3565J1194M084J7830K941j2515l894K441K3310q572k2616
7874D4604m921j126R352Q441K248l649J0588j224j3256R700J888l0751p894R434
7860C3434J2706n42j8804k54q096j6394o00O662L498J5004J0498Q709J5186k4662
7846C6345j1146J5731R896j3308k8062R46R809J3202N785J9339J2278j998K530
7833G1347N495j5136l3193J4595M99k5224m027k145R02P152k0777l9766J1547
7820b8731K0623k2664k11J5644P8K9897L9506j1845o278P484j7453M96J592k1040
7806G098Q531K2168R67J1255P012k4299Q588Q220m814l516l2213q785K0221N182
$$ plain form
7792 25615 5325 -3986 -12572 -16018 -129 23566 14840 10058 6660 22506 65587 65326 29065
7779 29065 10764 1420 14017 19071 28309 21103 29157 20315 19510 9259 13195 -1848 -3744 19072
7765 19072 28592 19721 7106 -7773 4851 32037 50014 56837 39421 26114 25572 31738 41794
7752 41794 10831 23814 17760 -5070 -14075 9286 27399 19651 7136 21266 28556 32531 36499
7739 36499 43628 46009 47262 53418 84021 70338 39479 45992 55301 36391 20576 16687 38830
7726 38830 17316 -95 2118 -25131 -24749 -17596 -8488 -9863 5127 967 4403 22320 26351 7507
7712 7507 10797 -4743 -4182 -4379 -7080 -3065 927 -11602 7996 12309 -6997 -28942 -24444 -8907
7698 -8907 -35575 -49498 -44242 -55574 -49721 -23105 -6979 18236 56487 48559 27284 8699 55
$$ packed form
7792B5615k0290r311q586l446J5889K3695q726m782l398J5846M3081k61l6261
7779B9065j8301r344J2597N054R238p206Q054q842q05j0251L936j5043j896K2816
7765A9072R520q871j2615j4879J2624K7186J7977O823j7416j3307n42O166J0056
7752D1794l0963J2983o054k2830r005K3361J8113p748j2515J4130P290L975L968
7739C6499P129K381J253O156L0603j3683l0859O513R309j8910j5815l889K2143
7726C8830k1514j7411K213k7249L82P153R108j375J4990m160L436J7917M031j8844
7712G507L290j5540N61j97k701M015L992j2529J9598M313j9306k1945M498J5537
7698h907k6668j3923N256j1332N853K6616J6126K5215L8251p928k1275j8585q644
$$ plain form
7685 55 22130 17132 3529 3646 21324 44429 46381 56023 62136 48766 37019 19305 23175 15513
7671 15513 8142 -18581 -29669 -39427 -30232 -18313 -5340 -4498 9711 21637 22907 4109 5825
7658 5825 -4894 2756 -1758 2172 -7753 -14301 -846 -7606 -23706 -20253 -10572 -611 4039 3844
7644 3844 6870 10611 -1288 -24183 -18096 -34592 -42246 -13858 -1393 7876 34456 35752 5020
7631 5020 9306 -12424 -13316 23222 33246 63582 64539 64934 30272 24239 29140 18866 15669 25316
7617 25316 25788 5765 -10134 8274 22719 25178 29533 47675 23717 48799 37338 18985 4466
7604 4466 -3466 9672 7174 -13346 -1530 14691 20529 3036 -8763 -6832 -17099 703 16727
7591 16727 17207 -10104 5517 48306 68278 69228 68467 68088 71184 49641 12403 11504 -21376 -24845
$$ packed form
7685E5K2075m998j3603J17J7678K3105J952R642O113j3370j1747j7714L870p662
7671A5513p371k6723j1088r758R195J1919J2973Q42J4209J1926J270j8798J716
7658E825j0719P650m514L930r925o548J3455o760j6100L453R681R961M650j95
7644C844L026L741j1899k2895O087j6496p654K8388J2465R269K6580J296l0732
7631E020M286k1730q92L6538J0024L0336R57L95l4662o033M901j0274l197R647
7617B5316M72k0023j5899J8408J4445K459M355J8142k3958K5082j1461j8353j4519
7604D466p932J3138k498k0520J1816J6221N838j7493j1799J931j0267J7802J6024
7591A6727M80k7311J5621M2789J9972R50p61l79L096k1543l7238q99l2880l469
$$ plain form
7577 -24845 -10126 -6896 -23603 -4450 3965 5515 -2586 -9174 -28333 -4124 29811 31701 16905
7564 16905 3208 6947 18408 22672 -3187 -17370 6545 23014 14267 16708 26316 50702 33403
7551 33403 19773 23877 41082 29259 13991 10126 30332 2693 5130 15107 424 9536 19920
7538 19920 20202 1432 -16410 -27580 -11029 -929 6158 17990 32517 48174 10178 -10445
7526 -10445 -2325 21897 36191 9309 -772 10901 7158 8952 280 8668 17640 -9616 -43031
7513 -43031 -59827 -50878 -19712 -8553 -8349 -3651 -5960 7113 20720 -18013 -27713 -14341 4060
7500 4060 13391 4223 14334 19362 -10612 2074 10402 8742 -20487 -24007 -32477 -18835 4902
7487 4902 17149 23864 48327 34300 31806 33376 31329 17049 -5371 737 7235 -13960 -12528
$$ packed form
7577b4845J4719L230j6707J9153Q415J550q101o588j9159K4209L3935J890j4796
7564A6905j3697L739J1461M264k5859j4183K3915J6469q747K441R608K4386j7299
7551C3403j3630M104J7205j1823j5268l865K0206k7639K437R977j4683R112J0384
7538A9920K82j8770j7842j1170J6551J0100P087J1832J4527J5657l7996k0623
7526a0445Q120K4222J4294k6882j0081J1673l743J794q672Q388Q972k7256l3415
7513d3031j6796Q949L1166J1159K04M698k309J3073J3607l8733r700J3372J8401
7500D060R331r168J0111N028k9974J2686Q328j660k9229l520q470J3642K3737
7487D902J2247O715K4463j4027k494J570k047j4280k2420O108O498k1195J432
$$ plain form
7474 -12528 -4966 10735 13321 4281 10214 19126 24324 14611 1166 -19635 -9853 -16109 2803 19425
7460 19425 20414 20654 18937 -360 -25228 -21485 -13650 -13113 9472 11665 2545 52083 77300 30946
7446 30946 3764 5652 28821 21667 13107 4666 15903 35058 26080 14251 16837 12878 -5044
7433 -5044 -5860 -8021 6099 20528 24994 18349 -8778 -13780 3741 15996 5667 -20709 -17639
7420 -17639 653 -12247 1553 13959 30097 9954 1260 -490 1254 -6981 -19577 -14469 -7187
7407 -7187 -17378 12384 16009 131 5293 12405 9778 17172 24229 30402 13863 12806 3391 13745
7393 13745 26147 46377 38663 31313 34773 38188 2180 -15531 -4837 1190 -13066 -12799 5528
7380 5528 9030 11974 12159 -8789 -18916 4161 6129 4638 44 3524 -3589 14699 14454 -9529
$$ packed form
7474a2528P562J5701K586r040N933Q912N198r713j3445k0801R782o256J8912J6622
7460A9425R89K40j717j9297k4868L743P835N37K2585K193r120M9538K5217m6354
7446C0946k7182J888K3169p154q560q441J1237J9155q978j1829K586l959j7922
7433e044q16k161J4120J4429M466o645k7127n002J7521J2255j0329k6376L070
7420a7639J8292j2900J3800J2406J6138k0143q694j750J744q235j2596N108P282
7407g187j0191K9762L625j5878N162P112k627P394P057O173j6539j057r415J0354
7393A3745J2402K0230p714p350L460L415l6008j7711J0694O027j4256K67J8327
7380E528L502K944J85k0948j0127K3077J968j491m594L480p113J8288k45k3983
$$ plain form
7366 -9529 -20352 8863 23915 -3988 -6320 -4873 -11467 -2146 23488 37162 58022 57444 32732
7353 32732 11487 10550 8875 15921 9313 -7790 -5191 5985 2626 -9287 12021 21750 -1345
7340 -1345 15197 9230 -3605 -15303 -9559 582 3980 38379 53376 19031 1399 575 12016
7327 12016 -10778 -23381 -23751 -45766 -46189 -26775 -41355 -44542 -36896 -28050 -36499 -32799 -13386 -20753
7313 -20753 -21387 -9936 -33653 -64271 -52119 -9876 -12184 -5116 -5567 -1472 -7700 2804 31767
7300 31767 42609 56580 48813 9661 -19416 12903 46203 32095 -7439 -9156 9942 23357
7288 23357 16139 -14874 -6103 6806 -17685 -18134 -14304 -13578 -9690 -4725 -25995 -31752 -17911 -6748
7274 -6748 -3936 -38482 -35787 -36920 -26726 -8493 -8618 -19169 -19566 -7320 -27966 -24448 -19186 7646
$$ packed form
7366i529j0823K9215J5052k7903k332J447o594R321K5634J3674K0860n78k4712
7353C2732k1245r37j675P046o608j7103K599J1176l359j1913K1308R729k3095
7340a345J6542n967j2835j1698N744J0141L398L4399J4997l4345j7632q24J1441
7327A2016k2794j2603l70k2015m23J9414j4580l187P646Q846q449L700J9413p367
7313b0753o34J1451k3717l0618J2152M2243k308P068m51M095o228J0504K8963
7300C1767J0842J3971p767l9152k9077L2319L3300j4108l9534j717J9098J3415
7288B3357p218l1013Q771J2909k4491m49L830P26L888M965k1270n757J3841J1163
7274f748K812l4546K695j133J0194J8233j25j0551l97J2246k0646L518N262K6832
$$ plain form
7260 7646 8596 -8265 -27830 -37044 -25856 1768 5003 1562 -13045 -7659 24576 33252 32355 19036
7246 19036 13103 17084 9096 -1407 -1768 -28197 -27823 15618 -1303 -14992 -21780 -27007 -26276 -21481
7232 -21481 -31727 -20908 7349 2952 -6585 6474 12369 29775 46118 47650 32669 19503 -6138
7219 -6138 -26228 -17033 32656 48310 2767 -19178 -38289 -24266 -27527 -40084 -24050 -15137 -833
7206 -833 -8391 525 5492 -10393 2717 2734 -20963 -35528 -21145 -26190 -25834 -31219 -34692 -4053
7192 -4053 -5803 -19013 4281 -10836 -12301 -146 -8191 -26629 -28326 -36252 -22354 2907 14303
7179 14303 -16229 -21004 -5312 33664 26602 29165 55407 55837 61677 42641 25072 41782 28489
7166 28489 -2830 -36341 -25965 -14386 -48480 -48068 -62998 -93926 -86251 -73879 -69287 -69941 -52605
$$ packed form
7260G646R50j6861j9565r214J1188K7624L235l441j4607N386L2235Q676q97j3319
7246A9036n933L981p988j0503l61k6429L74M3441j6921j3689o788n227P31M795
7232b1481j0246J0819K8257m397r537J3059N895J7406J6343J532j4981j3166k5641
7219f138k0090R195M9689J5654m5543k1945j9111J4023l261j2557J6034Q913J4304
7206h33p558Q916M967j5885J3110J7k3697j4565J4383n045L56n385l473L0639
7192d053j750j3210K3294j5117j465J2155q045j8438j697p926J3898K5261J1396
7179A4303l0532m775J5692L8976p062K563K6242M30N840j9036j7569J6710j3293
7166B8489l1319l3511J0376J1579l4094M12j4930l0928P675J2372M592o54J7336
$$ plain form
7153 -52605 -47865 -36808 -10601 -6935 -7942 -39783 -26754 -10119 3360 2599 418 25127 29574
7140 29574 1921 -24877 -37720 -2664 3614 -6895 -9172 -23044 -16900 -13755 6662 -18583 -54264
7127 -54264 -66715 -70753 -62839 -35350 -24646 -25776 -16855 -22582 -47633 -45186 -55258 -54278 -41695
7114 -41695 -15739 -7883 -15118 -19444 -42713 -31633 -19857 -7233 6050 -6342 6039 -10078
7102 -10078 -29448 -9847 -8667 -22784 -2975 12935 -4888 -28972 -38294 -21135 -11643 -17387 14248
7089 14248 40115 45126 46125 31729 26908 22034 28283 -2903 -14647 -152 -9735 11824 8631
7076 8631 -13764 -27675 -3619 14719 5455 -825 14842 29522 25638 18273 2727 6274 -10205
7063 -10205 -3434 -14331 -10921 -18218 -41051 -41901 -37698 -34718 -11565 -3807 -5785 6093 -14269 -33449
$$ packed form
7153e2605M740J1057K6207L666j007l1841J3029J6635J3479p61k181K4709M447
7140B9574k7653k6798j2843L5056O278j0509k277j3872O144L145K0417k5245l5681
7127e4264j2451m038P914K7489J0704j130Q921n727k5051K447j0072R80J2583
7114d1695K5956P856p235m326k3269J1080J1776J2624J3283j2392J2381j6117
7102a0078j9370J9601J180j4117J9809J5910j7823k4084r322J7159R492n744L1635
7089A4248K5867N011R99j4396m821m874O249l1186j1744J4495r583K1559l193
7076H631k2395j3911K4056J8338r264o280J5667J4680l884p365j5546L547j6479
7063a0205O771j0897L410p297k2833q50M203K980K3153P758j978J1878k0362j9180
$$ plain form
7049 -33449 -32416 -6519 19135 18730 -3421 -11270 -20278 -27861 -23100 -15146 7502 -4827 -8676 5793
7035 5793 7986 -13886 -23787 -9629 -1866 -34075 -56943 -51385 -43736 -29570 -22482 12217 27738
7022 27738 13541 15518 12120 -16973 -8096 18439 18125 10997 9155 -5075 1504 7913 30610 35552
7008 35552 52085 51610 59928 43571 30825 20663 4045 2298 3405 9452 -160 -12602 -11984 -6553
6994 -6553 13654 35003 40653 14812 2726 -4278 19162 22663 16879 23136 28065 26426 2993
6981 2993 1731 5260 -8232 -29717 -19831 -10954 4843 13621 25910 8805 7873 15921 22397 24889
6967 24889 17235 38704 22148 -15425 -9817 -17671 -42114 -26920 -3065 -13720 -25371 -29502 -40281
6954 -40281 -29624 -21912 -19289 10121 12531 13193 -741 -14509 -19552 -11450 -28710 -25189 1862
$$ packed form
7049c3449J033K5897K5654m05k2151p849r008p583M761P954K2648j2329l849J4469
7035E793K193k1872r901J4158P763l2209k2868N558P649J4166P088L4699J5521
7022B7738j4197J977l398k9093Q877K6535l14p128j842j4230O579O409K2697M942
7008C5552J6533m75Q318j6357j2746j0162j6618j747J107O047r612j2442O18N431
6994f553K0207K1349N650k5841j2086p004K3440L501n784O257M929j639k3433
6981B993j262L529j3492k1485R886Q877J5797Q778J2289j7105r32Q048O476K492
6967B4889p654K1469j6556l7573N608p854k4443J5194K3855j0655j1651m131j0779
6954d0281J0657P712K623K9410K410O62j3934j3768n043Q102j7260L521K7051
$$ plain form
6941 1862 12862 30227 12339 -11212 -20034 -10579 -23228 -22464 -27605 -27034 -22130 -12660 -15568 -50704
6927 -50704 -43970 -23405 -13825 -31786 -37516 -19814 -4238 -342 -4022 -13475 -39123 -63511 -40248
6914 -40248 -25287 -16158 2537 -2685 -18309 -37464 -41503 -39237 -27502 -9935 -5173 -32576 -42852
6901 -42852 -38105 -10894 -4983 -13266 -18879 -6549 599 -2703 4619 28285 23217 33718 49044
6888 49044 24736 4784 -1135 9604 42689 64115 54462 37604 40974 34255 48464 55248 57120
6875 57120 38544 42369 44754 30473 6809 15627 25095 11016 1035 21892 148 -14894 19541
6862 19541 12987 3242 14440 1517 -9498 -23156 -37234 -42508 -59418 -37365 -14345 779
6850 779 22394 35330 24507 -31075 -25427 6453 14535 -5593 -20470 -5750 -34938 -68152 -51269
$$ packed form
6941A862J1000J7365j7888k3551q822R455j2649P64n141N71M904R470k908l5136
6927e0704O734K0565R580j7961n730J7702J5576L896l680r453k5648k4388K3263
6914d0248J4961R129J8695n222j5624j9155m039K266J1735J7567M762k7403j0276
6901d2852M747K7211N911q283n613J2330P148l302P322K3666n068J0501J5326
6888D9044k4308j9952n919J0739L3085K1426r653j6858L370o719J4209O784J872
6875E7120j8576L825K385j4281k3664Q818R468j4079r981K0857k1744j5042L4435
6862A9541o554r745J1198j2923j1015j3658j4078n274j6910K2053K3020J5124
6850G79K1615J2936j0823n5582N648L1880Q082k0128j4877J4720k9188l3214J6883
$$ plain form
6837 -51269 -35401 5319 -16244 -31052 -26332 -40488 -37622 -40713 -33843 -11762 2481 -24604 -39158
6824 -39158 -17624 -15275 -7389 -13449 -24669 -39839 -35482 -10272 8424 -3229 -7170 -8490 -12200
6811 -12200 124 9664 33162 41213 36455 38358 32214 2781 -31705 -33028 -8714 13292 22661
6798 22661 13208 481 -3702 -20795 -25318 -24536 -11622 -5562 -5587 15765 3912 -6202 -515 7681
6784 7681 29508 5464 -16211 17105 26151 6073 -5027 -3389 10966 27752 14687 -4091
6772 -4091 -843 -20382 -27676 -20261 -32937 -51990 -59327 -38960 -14998 -19566 8483 6047 -16420
6759 -16420 -34872 -31926 -18380 4525 -15659 -22511 23105 22966 10600 -8383 20419 19314 -900
6746 -900 7595 2582 26950 39889 6717 -21194 -37485 -48881 -15479 -3770 -5544 2419 8397
$$ packed form
6837e1269J5868M0720k1563j4808M720j4156K866l091O870K2081J4243k7085j4554
6824c9158K1534K349P886o060j1220j5170M357K5210J8696j1653l941j320l710
6811a2200J2324R540K3498Q051m758J903o144k9433l4486j323K4314K2006R369
6798B2661r453j2727m183j7093m523P82J2914O060k5K1352j1853j0114N687Q196
6784G681K1827k4044k1675L3316R046k0078j1100J638J4355J6786j3065j8778
6772d091L248j9539p294P415j2676j9053p337K0367K3962m568K8049k436k2467
6759a6420j8452K946J3546K2905k0184o852M5616j39j2366j8983K8802j105k0214
6746i00Q495n013K4368J2939l3172k7911j6291j1396L3402J1709j774P963N978
$$ plain form
6733 8397 -3366 -1971 -5183 -56 10154 23487 18738 20764 32863 14442 4287 3456 -4096 4740
6719 4740 -16848 -7763 5327 28602 45463 62654 104518 149463 131477 99710 88898 67665
6707 67665 41606 20413 26920 10617 -19333 -7626 14158 -5146 -15084 7600 -12 13889
6695 13889 42197 60666 51048 21202 16826 5200 13700 34522 22570 18439 16583 10166 17456
6682 17456 50908 33806 26378 47876 54945 40253 30027 24941 34971 17630 33014 36151 21905
6669 21905 17951 8764 -25183 -31730 -39893 -51838 -49644 -22314 -22434 -17622 -20233 -13931 -22050 -22709
6655 -22709 -16905 -5401 -10371 -4813 13088 8725 -12829 -1515 -23826 -44025 -41247 -14791 -2745
6642 -2745 20339 7029 -5889 -14754 -29687 -17609 -13138 -13645 -30446 -47436 -38232 -45633 -38981
$$ packed form
6733H397j1763J395l212N127J0210J3333m749K026J2099j8421j0155q31p552Q836
6719D740k1588R085J3090K3275J6861J7191M1864M4945j7986l1767j0812k1233
6707F7665k6059k1193O507j6303k9950J1707K1784j9304r938K2684p612J3901
6695A3889K8308J8469r618k9846m376j1626Q500K0822j1952m131j856o417P290
6682A7456L3452j7102p428K1498P069j4692j0226n086J0030j7341J5384L137j4246
6669B1905l954r187l3947o547q163j1945K194K7330j20M812k611O302q119o59
6655b2709N804J1504m970N558J7901m363k1554J1314k2311k0199K778K6456J2046
6642b745K3084j3310j2918q865j4933J2078M471n07j6801j6990R204p401O652
$$ plain form
6629 -38981 -33737 -26373 -24227 -5335 -15460 6587 35935 51968 26108 7447 -6140 -4377 2975
6616 2975 -23952 -47901 -46862 -51950 -15852 7215 36430 22446 -20881 -59371 -64109 -55948 -43288
6603 -43288 -30776 -32067 -23979 -48319 -57813 -30650 -16595 4843 20344 34463 41755 43643 14856
6590 14856 5256 34514 70939 53895 33156 13139 -9022 -16268 -31437 -36884 -58851 -61430 -32350
6577 -32350 3029 -3254 -25313 -29477 -19011 -18372 -29888 396 -12083 -29895 -22225 -10963 -17492
6564 -17492 -21929 -5375 -1331 4047 5032 6417 -18789 -22626 -6443 4616 20424 22843 4929
6551 4929 14346 -165 -33877 -28134 -10147 15996 4414 3427 9862 2326 -4545 -2736 -6717 9715
6537 9715 5338 -22795 -22804 -29621 -17652 -4051 -5180 1466 2055 -21739 -40954 -27797 8879 20123
$$ packed form
6629c8981N244P364K146J8892j0125K2047K9348J6033k5860j8661j3587J763P352
6616B975k6927k3949J039n088L6098K3067K9215j3984m3327l8490m738Q161J2660
6603d3288J2512j291Q088k4340r494K7163J4055K1438J5501J4119P292J888k8787
6590A4856r600K9258L6425j7044k0739k0017k2161p246j5169n447k1967k579K9080
6577c2350L5379o283k2059m164J0466O39j1516L0284j2479j7812P670J1262o529
6564a7492m437J6554M044N378R85J385k5206l837J6183J1059J5808K419j7914
6551D929R417j4511l3712N743J7987K6143j1582r87O435p536o871J809l981J6432
6537I715m377k8133ro817J1969J3601j129O646N89k3794j9215J3157L6676J1244
$$ plain form
6523 20123 -10149 -17791 -3192 10728 -6382 -18638 -22312 -40668 -45428 -47084 -33835 -24299 -32997
6510 -32997 -42650 -22494 -3575 -15626 -41860 -70072 -45022 -33548 -46106 -39391 -38152 -44325 -27172
6497 -27172 -18701 -32415 -21857 -12822 -21350 -36425 -34915 -36875 -48674 -55346 -37192 -12550 -4881
6484 -4881 10255 6246 13469 24213 8199 -1834 -4532 11724 10033 14276 20979 1112 -35372
6471 -35372 -46778 -37135 -7042 14007 -7370 -9673 -6294 -25060 -35818 -42974 -41390 -26954 -2382
6458 -2382 1210 -3764 -14861 -51318 -33234 -24055 -757 6009 -17651 -9571 -9536 -18223 -9557 14250
6444 14250 28121 30788 24324 33080 39452 21715 9099 -18167 -29103 -33016 -47702 -35369 -10305
6431 -10305 2390 13624 6231 -26708 -29693 -15595 -3477 21477 12080 -28928 -50526 -62353
$$ packed form
6523B0123l0272p642J4599J3920j7110j2256l674j8356m760j656J3249R536q698
6510c2997r653K0156J8919j2051k6234k8212K5050J1474j2558O715J239o173J7153
6497b7172Q471j3714J0558R035q528j5075J510j960j1799o672J8154K4642P669
6484d881J5136m009P223J0744j6014j0033k698J6256j691M243O703j9867l6484
6471c5372j1406R643L0093K1049k1377k303L379j8766j0758p156J584J4436K4572
6458b382L592m974j1097l6457J8084R179K3298O766k3660Q080L5q687Q666K3807
6444A4250J3871K667o464Q756O372j7737j2616k7266j0936l913j4686J2333K5064
6431a0305J2695J1234p393l2939k985J4098J2118K4954r397m1008k1598j1827
$$ plain form
6419 -62353 -35693 -17068 770 -9104 -25529 -55374 -55010 -69204 -33770 -25197 -14202 643 34030
6406 34030 49456 40039 13680 -34865 -31483 -24085 -38157 -28523 -16968 3323 6057 12047 9832
6393 9832 -1854 -11364 18737 20352 -14741 -48834 -38394 -11976 -4756 -21278 -22971 -21443 -16826
6380 -16826 -19366 -59965 -74244 -78343 -50884 -39482 -35298 -19966 4615 28757 25546 14827 -6222
6367 -6222 -13151 251 14113 -390 -8763 -20489 -17695 9164 15074 8441 17512 17465 14062 7108
6353 7108 -11079 -14550 -18923 -24266 5070 22701 11687 5349 3478 813 -37133 -51797 -9105
6340 -9105 15755 17355 2300 -3779 -15577 -31924 -40123 -38791 -22779 -22593 17085 9744 -19046
6327 -19046 -15750 -30922 -9175 -10699 -17906 -19037 -9884 -14292 -23484 -18854 -17506 -17688 -35324 -55299
$$ packed form
6419f2353K6660J8625J7838r874j6425k9845L64j4194L5434Q573J0995J4845L3387
6406C4030J5426r417k6359m8545L382P398j4072R634J1555K0291K734N990k215
6393I832j1686r510L0101J615l5093l4093J0440K6418P220j6522j693J528M617
6380a6826k540m0599j4279m099K7459J1402M184J5332K4581K4142l211j0719k1049
6367f222o929J3402J3862j4503q373j1726K794K6859N910o633R071m7l403o954
6353G108j8187l471m373n343K9336J7631j1014o338j871k665l7946j4664M2692
6340i105K4860J600j5055o079j1798j6347q199J332J6012J86L9678p341k8790
6327a9046L296j5172K1747j524p207j131R153m408r192M630J348j82j7636j9975
$$ plain form
6313 -55299 -62753 -35813 -29553 -48144 -63364 -58792 -21500 17290 10277 10978 2997 -1013 5912 -7733
6299 -7733 30043 51608 31353 3405 17946 42416 35793 33386 35306 30233 34558 261 -5652
6286 -5652 12047 3312 2057 24640 20281 -7879 -22122 -31875 -37306 -29528 -119 -2798 -22234
6273 -22234 -32104 -11246 -14638 -35119 -28551 -12711 -10197 -13815 11430 1014 -23409 -14166 -14914
6260 -14914 -19540 -15197 -1732 -17277 -9485 -2178 -14927 -27915 -4680 -238 5692 7628 29506
6247 29506 20585 614 8061 21754 29974 35732 2937 -14027 -31580 -19393 14993 -14351 -13581
6234 -13581 8846 24155 5862 17851 30395 19640 5599 -15055 -43660 -40254 -53168 -33840
6222 -33840 -5356 2603 11408 25827 9458 13088 4366 10830 -2412 -14790 -1640 26282 20725
$$ packed form
6313e5299p454K6940O260j8591j5220M572L7292L8790p013P01p981m010O925j3645
6299g733L7776K1565k0255k7948J4541K4470o623k407J920n073M325l4297n913
6286e652J7699q735j255K2583m359k8160j4243r753n431P778K9409k679j9436
6273b2234r870K0858l392k0481O568J5840K514l618K5245j0416k4423R243p48
6260a4914m626M343J3465j5545P792P307j2749j2988K3235M442N930J936K1878
6247B9506q921j9971P447J3693Q220N758l2795j6964j7553J2187L4386k9344P70
6234a3581K2427J5309j8293J1989J2544j0755j4041k0654k8605L406j2914J9328
6222c3840K8484P959Q805J4419j6369L630q722O464j3242j2378J3150K7922n557
$$ plain form
6209 20725 12092 -35250 -61272 -24700 -18640 -24349 -23738 -25057 4773 33004 18096 -3990 -32695
6196 -32695 -32878 -35860 -44897 -72299 -71139 -55105 -22396 6215 26429 44739 51531 27036 -336
6183 -336 25449 52785 33355 3631 -1507 5293 -4204 -14750 -33244 -37827 -17370 -7099 -25756
6170 -25756 -21082 -27797 -29471 -23136 -15199 -20983 -16300 -16836 -18486 -34783 3046 6868 12599 19432
6156 19432 2376 515 4704 -6398 109 -23462 -48255 -38535 -2366 3031 -24068 -22812 -4897
6143 -4897 4447 29491 33831 27908 25424 719 -16322 -18636 -22788 -8308 -8578 -7966 8557 3383
6129 3383 886 6916 -10670 -35325 -30094 -27014 -30085 -11313 -15286 -17238 -18094 -15877 13180 7151
6115 7151 -28096 -42800 -48334 -49950 -26680 -9258 -18088 12232 -1651 -8549 3509 -8952 -9394
$$ packed form
6209B0725q633m7342k6022L6572O060n709O11j319K9830K8231j4908k2086k8705
6196c2695j83k982r037k7402J160J6034L2709K8611K0214J8310O792k4495k7372
6183c36K5785K7336j9430k9724n138O800r497j0546j8494m583K0457J0271j8657
6170b5756M674o715j674O335P937n784M683n36j650j6297L7829L822N731O833
6156A9432j7056j861M189j1102O507k3571k4793R720L6169N397k7099J256J7915
6143d897R344K5044M340n923k484k4705j7041k314m152J4480k70O12J6523n174
6129C383k497O030j7586k4655N231L080l071J8772l973j952q56K217K9057o029
6115G151l5247j4704n534j616K3270J7422q830L0320j3883o898J2058j2461m42
$$ plain form
6102 -9394 6641 4698 -6082 -27216 -19415 -1882 -4142 -4860 -5920 -3977 -7801 -9601 -11842 -6298
6088 -6298 28250 40492 36177 21717 23873 12432 9378 -23491 -16832 7782 15159 3296 -13834
6075 -13834 -17448 -2439 4903 9332 -15469 -45774 -40273 -29000 -6455 34332 15642 -15273 -48863
6062 -48863 -48518 -51691 -55332 -7064 856 2236 -8578 -33928 -25748 -14392 -4192 38 -1504 -3770
6048 -3770 -13214 -13027 -13867 -5492 13082 10182 31713 30289 28000 8303 5131 -63 4732 -12966
6034 -12966 -18723 -5200 -5050 -16111 -43580 -59180 -49612 -36020 -12341 -8278 -10743 48 -15479
6021 -15479 -25503 -32565 -30288 -34450 -37292 -27340 -16901 -23221 -39333 -78503 -101593 -85762 -76267
6008 -76267 -64020 -80982 -68742 -48209 -30036 -6241 -25757 -29994 -21443 -5885 -4009 -8784 -3459
$$ packed form
6102i394J6035j943j0780k1134P801J7533k260p18j060J943l824j800k241N544
6088f298L4548J2242m315j4460K156j1441l054l2869O659K4614P377j1863j7130
6075a3834l614J5009P342M429k4801l0305N501J1273K2545M0787j8690l0915l3590
6062d8863L45l173l641M8268P920J380j0814k5350Q180J1356J0200M230j542k266
6048c770r444J87q40Q375J8574k900K1531j424k289j9697l172n194M795j7698
6034a2966n757J3523J50j1061k7469j5600R568J3592K3679M063k465J0791j5527
6021a5479j0024p062K277m162k842R952J0439o320j6112l9170k3090J5831R495
6008g6267J2247j6962J2240K0533J8173K3795j9516m237Q551J5558J876m775N325
$$ plain form
5995 -3459 600 -4042 -17663 -45414 -56583 -43838 -39949 -37353 -36921 -29352 -35453 -44354 -19139 -22612
5981 -22612 -13170 -20587 -14329 -30697 -59683 -70636 -46075 -752 22861 30208 51087 54551 65398
5968 65398 62640 40862 -13103 -46009 -39187 -58601 -76960 -56575 -32030 -3916 5889 4310 216
5955 216 -15543 4897 13286 -8428 -16139 -13896 -120 11006 30645 17726 11061 24694 -2711
5942 -2711 -35628 -24230 -27096 -12486 -22389 -13323 6906 -11550 -32553 -20397 -32189 -22491 -17418
5929 -17418 -24987 -10648 -8249 -21634 -6645 1051 -4317 -20986 -7912 3364 -6912 12323 -101
5916 -101 -31949 -26841 -30574 -35519 -20039 -22238 -41818 -45517 -72254 -63522 -43271 -48705 -49602 -40574
5902 -40574 -19633 4097 -24412 -13990 -675 1877 -3209 5695 10079 15411 -5240 6130 6279
$$ packed form
5995c459M059m642j3621k7751j1169J2745L889K596M32P569o101q901K5215l473
5981b2612R442p417O258j6368k8986j0953K4561M5323K3613P347K0879L464J0847
5968F5398k758k1778n3965l2906O822j9414j8359K0385K4545K8114R805j579m094
5955B16j5759K0440Q389k1714p711K243J3776J1126J9639j2919o665J3633k7405
5942b711l2917J1398k866J4610r903R066K0229j8456k1003J2156j1792R698N073
5929a7418p569J4339K399j3385J4989P696n368j6669J3074J1276j0276J9235j2424
5916a01l1848N108l733m945J5480k199j9580l699k6737Q732K0251n434q97R028
5902d0574K0941K3730k8509J0422J3315K552n086Q904M384N332k0651J1370J49
$$ plain form
5889 6279 -16317 -7224 19703 2583 6735 -6098 -20887 -33068 -7927 23718 18978 23636 18469
5876 18469 16790 18850 22892 30137 22191 21889 38235 29604 4338 18657 30459 19394 42585
5863 42585 16974 -15580 -32023 -29249 -20361 2893 10974 17854 4889 -4135 -5029 12589 20618
5850 20618 32145 24133 19057 -4857 -11621 -23841 -6119 -5850 8670 8153 -605 -11246 957
5837 957 8168 -1413 -12595 231 1362 35997 59994 52458 55578 43720 32229 -6476 -24389
5824 -24389 -40021 -38165 -4548 38471 64119 46417 28246 10012 1890 10474 11 2849 13099
5811 13099 8564 -8196 2289 -8168 -16416 -38731 -51901 -43760 -27695 -22213 -29127 -26210 -30926
5798 -30926 -39206 -39976 -24508 -12891 -12399 -34897 -11970 744 6385 18093 13787 1179 -415
$$ packed form
5889F279k2596R093K6927j7120M152j2833j4789j2181K5141L1645m740M658n167
5876A8469j679K060M042P245p946l02J6346q631k5266J4319J1802j1065K3191
5863D2585k5611l2554j6443K774Q888K3254Q081O880j2965r024q94J7618Q029
5850B0618J1527q012n076k3914o764j2220J7722K69J4520n17q758j0641J2203
5837I57P211r581j1182J2826J131L4635K3997p536L120j1858j1491l8705j7913
5824b4389j5632J856L3617M3019K5648j7702j8171j8234q122Q584j0463K838J0250
5811A3099m535j6760J0485j0457q248k2315j3170Q141J6065N482o914K917m716
5798c0926q280p70J5468J1617M92k2498K2927J2714N641J1708m306j2608j594
$$ plain form
5785 -415 -21144 -16859 -12972 -6141 13374 -3506 14061 15979 -597 -10173 -23320 -20113 -6782
5772 -6782 -7265 -42576 -66995 -63777 -39971 -27693 -36707 -47245 -46300 -23525 -23393 -9024 28278 9413
5758 9413 -32543 -33944 -26544 -29434 -25684 -27580 -34829 -15732 12780 -23016 -67221 -78595 -47025
5745 -47025 -38599 -61728 -58206 -32114 -10179 -11996 -7166 -40 6943 -20502 -12384 6352 10171
5732 10171 -7071 -19091 -7900 -25509 -8922 -6920 -486 35944 60228 71119 38618 15126
5720 15126 4094 -7486 -222 24372 15250 2878 25019 4517 -6153 2565 76 -4712 -21276
5707 -21276 -39144 -28656 -27013 -32954 -30283 -9813 -17102 -8915 14684 19470 3111 -19342 -24816
5694 -24816 -28234 -12461 -5818 1089 19099 27844 3352 -3327 -7043 -13742 -6273 -12709 -29684 -35104
$$ packed form
5785d15k0729M285L887O831J9515j6880J7567J918j6576r576j3147L207J3331
5772f782m83l5311k4419L218K3806J2278r014j0538R45K2775J32J4369L7302j8865
5758I413m1956j401P400k890L750j896p249J9097K8512l5796m4205j1374L1570
5745d7025Q426k3129L522K6092K1935j817M830P126O983k7445Q118J8736L819
5732A0171j7242j2020J1191j7609J6587K002O434L6430K4284J0891l2501k3492
5720A5126j1032j1580P264K4594r122j2372K2141k0502j0670Q718k489m788j6564
5707b1276j7868J0488J643n941K671K0470p289Q187K3599M786j6359k2453n474
5694b4816l418J5773O643O907J8010Q745k4492o679l716o699P469o436j6975n420
$$ plain form
5680 -35104 -34893 -35527 -35751 -12965 -318 -23590 -12758 -22265 -32988 -21921 -30622 -51334 -50920 -28334
5666 -28334 -22073 -6432 -11733 -21188 -28680 -29831 -35991 -28679 -4864 1578 -9086 -16512 -3344 -15536
5652 -15536 -17600 -10529 -22896 -22592 -29408 -23791 -6207 8677 4128 -16093 -17740 -583 -17412
5639 -17412 -30521 -20477 -42719 -28628 -47036 -54698 -51444 -39757 -38373 -39171 -22137 -8679 4891
5626 4891 -13309 -40022 -30285 -9903 -399 -2025 -13555 -15533 5304 -10008 -13573 -21407 -15799
5613 -15799 2315 4818 -5170 -18482 -13824 -19319 -46017 -29376 -32450 -43504 -26721 -6916 1679
5600 1679 19154 15920 -5057 -12973 1117 -7439 -10305 -4576 237 12802 12502 3410 -30429 -30146
5586 -30146 -13376 -129 -15658 -40172 -48974 -55059 -75650 -65162 -49071 -51340 -59627 -69433 -43367
$$ packed form
5680c5104K11o34k24K2786J2647k3272J0832r507j0723J1067q701k0712M14K2586
5666b8334O261J5641n301r455p492j151o160P312K3815O442j0664p426J3168j2192
5652a5536k064P071j2367L04o816N617J7584J4884m549k0221j647J7157j6829
5639a7412j3109J0044k2242J4091j8408p662L254J1687J384p98J7034J3458J3570
5626D891j8200k6713R737K0382R504j626j1530j978K0837j5312l565p834N608
5613a5799J8114K503r988j3312M658n495k6698J6641l074j1054J6783J9805Q595
5600A679J7475l234k0977p916J4090q556k866N729M813J2565l00r092l3839K83
5586c0146J6770J3247j5529k4514q802o085k0591J0488J6091k269q287r806K6066
$$ plain form
5573 -43367 -38191 -43336 -33937 -30675 -33847 -34032 -12918 -32150 -62834 -59806 -54491 -45259 -35973 -28548
5559 -28548 -15135 -9693 -22937 -10534 -915 13862 4011 -27804 -36426 -25670 -8304 -13455 3280
5546 3280 11409 13563 -8009 7233 26832 29793 23997 14603 -20131 -22789 -8013 -4630 -39444
5533 -39444 -56123 -51322 -37081 -46360 -41729 -4436 23438 8515 2423 3377 -10682 -15148 25205
5520 25205 50396 28615 -3976 -15727 -1954 1708 -7188 5377 8628 1651 11543 8860 -24076
5507 -24076 -32622 -13294 209 1790 5817 14438 10021 -1722 -10395 -8847 -574 -7914 -19143 -1429
5493 -1429 20046 30730 41662 18675 5887 5859 10230 -15773 -12349 -14684 -18115 -14614 -5107 3719
5479 3719 12831 19856 11507 25251 40296 34597 16267 -3136 -4735 9450 -4859 -9145 1052
$$ packed form
5573d3367N176n145R399L262l172j85K1114j9232l0684L028N315R232R286P425
5559b8548J3413N442j3244J2403R619J4777r851l1815q622J0756J7366n151J6735
5546C280Q129K154k1572J5242J9599K961n796r394l4734k658J4776L383l4814
5533c9444j6679M801J4241r279M631L7293K7874j4923o092R54j4059m466M0353
5520B5205K5191k1781l2591j1751J3773L662q896J2565L251o977R892k683l2936
5507b4076q546J9328J3503J581M027Q621m417j1743q673J548Q273p340j1229J7714
5493a429K1475J0684J0932k2987j2788k8M371k6003L424k335l431L501R507Q826
5479C719R112P025q349J3744J5045n699j8330j9403j599J4185j4309m286J0197
$$ plain form
5466 1052 -8364 -12808 -20516 -8455 8473 13822 -5929 -19142 -10461 -28946 -44268 -48452 -13422
5453 -13422 -38142 -49086 -37466 -21364 -40227 -55801 -45327 -49832 -39168 2045 5472 -34222
5441 -34222 -42131 -23506 -4589 -13667 -13310 -14145 -14908 -12545 -9708 -31226 -21481 -27631 -39134 -33026
5427 -33026 -38445 -37292 -12971 -22951 -9390 -24924 -47002 -39241 -33464 -23096 -21212 -36281 -28747
5414 -28747 -4565 8879 2456 9826 2368 -20147 -45619 -30990 -34826 -42973 -27326 -9520 2447
5401 2447 -3658 -21875 -11293 6726 37487 26972 39568 18128 23372 38585 42986 33669 34382
5388 34382 35880 20702 18892 42400 35397 23493 9837 -8229 -8157 -4891 -16040 -5981 -18414
5375 -18414 -34903 -16521 -15848 -3989 1268 13183 39724 -367 -22542 -26975 -42602 -30689 -17124
$$ packed form
5466A052r416m444p708J2061J6928N349j9751j3213Q681j8485j5322m184L5030
5453a3422k4720j0944J1620J6102j8863j5574J0474m505J0664M1213L427l9694
5441c4222p909J8625J8917r078L57q35p63K363K837k1518R745o150j1503O108
5427c3026n419J153K4321r980J3561j5534k2078P761N777J0368J884j5069P534
5414b8747K4182J3444o423P370p458k2515k5472J4629l836q147J5647J7806J1967
5401B447o105j8217J0582J8019L0761j0515J2596k1440N244J5213M401r317P13
5388C4382J498j5178j810K3508p003j1904j3656j8066P2L266j1149J0059j2433
5375a8414j6489J8382O73J1859N257J1915K6541m0091k2175m433j5627J1913J3565
$$ plain form
5362 -17124 9578 -15017 -26587 -17346 14695 48703 41138 28357 6330 13125 2600 5098 32273
5349 32273 31437 -12304 -40722 -46162 -51299 -24198 -26361 -46081 -2216 25657 18547 -5479 -18248
5336 -18248 13409 27107 11536 1581 -7994 -20161 -33631 -29652 -1561 28397 34785 39945 13834
5323 13834 -8763 2276 -9224 -37583 -29385 -5328 -25583 -42302 -22692 3417 -19696 -10190
5311 -10190 -2582 4423 7869 4386 -20141 15100 21926 38319 44396 24039 7106 15571 13622
5298 13622 3775 341 -9390 -8284 4927 29738 13875 -7135 -5799 -2634 -10158 -33299 -26442
5285 -26442 -23465 -19089 -22889 -28076 -24726 -25234 -9068 3160 25146 4641 -5067 11160 20227 41007
5271 41007 37359 -6073 -25426 -23807 -26884 -17978 -27845 -45809 -51650 -48211 -28910 11589 10174
$$ packed form
5362a7124K6702k4595j1570R241L2041L4008p565j2781k2027O795j0525K498K7175
5349C2273q36m3741k8418n440n137K7101k163j9720M3865K7873p110k4026j2769
5336a8248L1657J3698j5571r955r575j2167j3470L979K8091K9958O388N160k6111
5323A3834k2597J1039j1500k8359Q198K4057k0255j6719J9610K6109k3113R506
5311a0190P608P005L446l483k4527L5241O826J6393O077k0357j6933Q465j949
5298A3622r847l434r731J106J3211K4811j5863k1010J336L165p524k3141O857
5285b6442K977M376l800n187L350n08J6166J2228K1986k0505r708J6227R067K0780
5271D1007l648m3432j9353J619l077Q906r867j7964n841L439J9301M0499j415
$$ plain form
5258 10174 -4651 -14798 -17483 -44556 -28373 -22734 -30868 -31739 -10645 -11505 -6041 -2991 7278 26005
5244 26005 23247 18196 15383 -13986 4293 29570 27785 29379 5907 -18797 -28898 -8064 7640
5231 7640 12502 -7971 -17565 13328 10439 7577 -25118 -15884 13342 -729 -19948 -8764 -5328
5218 -5328 -17197 -13288 -1163 8221 12329 627 -674 -20103 -36959 -34885 -26607 -926 9460
5205 9460 15982 20536 166 -21056 -19952 -15525 -13955 -39233 -40076 -40546 -58444 -59981 -31982 -15980
5191 -15980 -17605 -37408 -32152 -15144 3768 20675 7891 -10144 -14129 -29816 -36455 -20602 -21520
5178 -21520 -15636 -6682 4617 15402 -6035 -7470 -12455 -41790 -68383 -56344 -25948 -4909 1265
5165 1265 -9706 -21795 -13027 -23963 -30128 -30067 -36841 -21038 -7108 -14769 -22782 -7400 -6231 -23619
$$ packed form
5258A0174j4825j0147k685k7073J6183N639q134q71K1094q60N464L050J0269J8727
5244B6005k758n051k813k9369J8279K5277j785J594k3472k4704j0101K0834J5704
5231G640M862k0473r594L0893k889k862l2695R234K9226j4071j9219J1184L436
5218e328j1869L909J2125R384M108j1702j301j9429j6856K074Q278K5681J0386
5205I460O522M554k0370k1222J104M427J570k5278q43m70j7898j537K7999J6002
5191a5980j625j9803N256J7008J8912J6907j2784j8035l985j5687o639J5853r18
5178b1520N884Q954J1299J0785k1437j435m985k9335k6593J2039L0396K1039O174
5165A265j0971j2089Q768j0936o165O1o774J5803J3930p661q013J5382J169j7388
$$ plain form
5151 -23619 -19352 -20375 -25150 -28151 -21288 -20267 -2261 1393 12252 11818 3457 -24433 -40789 -33048
5137 -33048 -16466 3283 18828 9490 5856 -5842 -2892 23243 15090 4604 1010 -2986 -6561
5124 -6561 -20607 -20030 2323 -2305 -2030 2259 -14196 -28102 -33282 -30883 -20989 -19489 -40019 -1075
5110 -1075 24672 7677 -30508 -63230 -72244 -39837 -22587 -25891 -48343 -51911 -19770 12368 -16575
5097 -16575 -13548 -3519 -10474 -11176 -41828 -30303 -10999 7232 3801 -2001 6910 -11795 -9947
5084 -9947 18666 15935 -13675 -38473 -34272 -21385 -35511 -52564 -44805 -5704 -11758 -51378 -64568
5071 -64568 -53616 -28278 -20377 -55865 -82648 -71728 -19949 15251 36284 27536 8126 -2217
5059 -2217 -274 4243 -8922 -15257 -5613 29707 14828 -13721 -12210 -5280 -5900 -7440 -30098 -13599
$$ packed form
5151b3619M267j023m775l001O863J021J8006L654J0859m34q361k7890j6356P741
5137c3048J6582J9749J5545r338l634j1698K950K6135q153j0486l594l996l575
5124f561j4046N77K2353m628K75M289j6455j3906n180K399R894J500k0530L8944
5110a075K5747j6995l8185l2722r014L2407J7250l304k2452l568L2141L2138k8943
5097a6575L027J0029o955p02l0652J1525J9304J8231l431n802Q911j8705J848
5084i947K8613k731k9610k4798M201J2887j4126j7053P759L9101o054l9620j3190
5071f4568J0952K5338P901l5488k6783J0920N1779L5200K1033q748j9410j0343
5059b217J943M517j3165o335R644L5320j4879k8549J511O930o20j540k2658J6499
$$ plain form
5045 -13599 -302 6678 25017 16286 4919 -18287 -39634 -29733 -11518 7243 -21459 -44999
5033 -44999 -36078 -6439 8386 -9072 -12101 -19520 -30582 -11686 16484 17998 15480 11899 -5798
5020 -5798 -4177 14126 29651 27708 2344 4109 13636 4370 -2415 -10657 -5534 -14721 -22253 -13047
5006 -13047 -13908 -12853 6717 1053 -15247 5344 -4979 8654 6930 -12375 -38385 -35436 -41897
4993 -41897 -35918 -27070 -30617 -25612 -27683 -10249 25930 25458 16077 -14102 -21554 -27674 -37723 -36349
4979 -36349 -45566 -14653 7294 -1977 -29874 -23466 235 -6993 -12524 903 1015 -7479 5488
4966 5488 8334 -29617 -46701 -50943 -21615 -2757 -15282 -129 -28506 -41068 -44194 -42270 -17084
4953 -17084 9262 -8104 -17665 -23672 -35605 -19762 -6603 -6992 -39691 -29789 -51424 -61962 -37301
$$ packed form
5045a3599J3297O980J8339q731j1367k3206k1347R901J8215J8761k8702k3540
5033d4999Q921K9639J4825j7458l029p419j1062J8896K8170J514k518l581j7697
5020e798J621J8303J5525j943k5364J765R527r266o785q242N123r187p532R206
5006a3047q61J055J9570n664j6300K0591j0323J3633j724j9305k6010K949o461
4993d1897N979Q848l547N005k071J7434L6179m72r381l0179p452o120j0049J374
4979c6349r217L0913K1947r271k7897O408K3701p228n531J3427J12q494J2967
4966E488K846l7951j7084m242K9328J8858j2525J5153k8377j2562l126J924K5186
4953a7084K6346j7366r561o007j1933J5843J3159l89l2699R902k1635j0538K4661
$$ plain form
4940 -37301 -19076 -18085 -13263 -15982 -30701 -29568 -27307 -40679 -56233 -57994 -57569 -42389 -19845 -44879
4926 -44879 -27665 17076 27487 7985 -9731 1368 -11873 -23507 -27287 -16391 -16436 -21509 -9831
4913 -9831 5616 8635 -4248 -30797 -12349 25606 19976 13642 673 6082 -6746 -16848 -12596
4900 -12596 -29199 -18128 -9026 33433 29655 6049 -15325 -28884 -12422 9077 10634 -7763
4888 -7763 -7547 -20970 -26190 -21443 -27105 -42190 -31190 -9249 -10387 -4665 21845 12512 6612 -1963
4874 -1963 11533 21542 -2556 -11244 16329 14352 2243 6951 14524 29800 23342 7906 524
4861 524 -10857 -21813 -38122 -29162 960 15392 41195 37651 14717 1537 -2756 4869 -13512
4848 -13512 -22069 -19538 -27020 308 -1991 3025 13165 -7727 -15578 3931 4089 4994 5396 10125
$$ packed form
4940c7301J8225R91M822k719j4719J133K261j3372j5554j761M25J5180K2544k5034
4926d4879J7214M4741J0411j9502j7716J1099j3241j1634l780J0896m5n073J1678
4913i831J5447L019j2883k6549J8448L7955n630o334j2969N409j2828j0102M252
4900a2596j6603J1071R102M2459l778k3606k1374j3559J6462K1499J557j8397
4888g763K16j3423n220M747n662j5085J1000K1941j138N722K6510r333n900q575
4874a963J3496J0009k4098q688K7573j977j2109M708P573J5276o458j5436p382
4861E24j1381j0956j6309Q960L0122J4432K5803l544k2934j3180m293P625j8381
4848a3512q557K531p482K7328k299N016J0140k0892p851J9509J58R05M02M729
$$ plain form
4834 10125 16182 8795 24844 21258 6621 -31852 -36756 -4601 19827 30447 8249 9216 30743
4821 30743 50261 39836 34099 15830 5413 28721 27686 9300 24443 42050 27615 -3791
4809 -3791 -177 29855 20011 4234 3680 4740 -2438 -18212 -23836 -17596 -10341 -17406 -40752 -48757
4795 -48757 -39940 -17156 -4531 -4966 -16256 -14949 2164 8961 16401 -8322 -49422 -61251 -58938
4782 -58938 -18942 13068 1148 -7229 -14751 -18298 -12558 4556 -4003 -29250 -53080 -30013 35041
4769 35041 48061 26232 -14693 -37322 -9463 6731 -18299 -33041 -28167 -3452 7230 -27324
4757 -27324 -37020 -27990 -22783 -30918 -37599 -37634 -31281 -27181 -13511 -15667 -14418 -4680 -14671 -25779 -27668
4742 -27668 -18671 270 11037 10744 -5513 -65591 -48244 -14903 -12283 -13367 -8998 1397 -8021
$$ packed form
4834A0125O057p387J6049l586j4637l8473m904L2155K4428J0620k2198R67K1527
4821C0743J9518j0425n737j8269j0417K3308j035j8386J5143J7607j4435l1406
4809c791L614L0032r844j5777n54J060p178j5774n624O240P255p065k3346q005
4795d8757Q817K2784J2625m35j1290J307J7113O797P440k4723m1100j1829K313
4782e8938L9996L2010j1920q377p522l547N740J7114q559k5247k3830K3067O5054
4769C5041J3020k1829m0925k2629K7859J6194k5030j4742M874K4715J0682l4554
4757b7324r696R030N207q135o681l5O353M100J3670k156J249R738r991j1108j889
4742b7668Q997J8941J0767k93j6257o0078J7347L3341K620j084M369J0395r418
$$ plain form
4729 -8021 -39537 -49093 -29789 -26978 -31655 -3732 29097 52261 25609 -24558 -66220 -66114 -45942
4716 -45942 -53807 -77986 -57012 -39702 -7735 19613 1252 -8674 -23527 -30668 -2441 4965 -14230
4703 -14230 -22687 -11560 -4558 652 3071 -12062 -18269 -4264 2590 2203 -15680 -5476 1718 -20700
4689 -20700 -19247 4285 12774 -7232 10490 16438 8500 14526 3156 812 -16690 -27704 -39895
4676 -39895 -47942 -19323 -10816 -19366 -37834 -42488 -51070 -44736 -25002 9834 10633 -12231 -23852
4663 -23852 -10660 -8467 34543 11810 4856 14913 25395 21951 -3190 -16701 -13923 -10421 -26555
4650 -26555 -17555 -3572 -16225 -35517 -40399 -44284 -34933 -23340 -8429 -4322 -4152 12873 9279
4637 9279 20709 34338 9555 559 -5485 -45106 -49186 -37719 -36220 -17476 -9525 12809 12749 3883
$$ packed form
4729h021l1516r556J9304K811m677K7923L2829K3164k6652n0167m1662J06K0172
4716d5942p865k4179K0974J7310L1967K7348j8361r926j4853p141K8227P406j9195
4703a4230q457J1127P002N210K419j5133o207J4005O854l87j7883J0204P194k2418
4689b0700J453K3532Q489k0006J7722N948p938O026j1370k344j7502j1014j2191
4676c9895q047K8619Q507q550j8468m654q582O334J9734L4836P99k2864j1621
4663b3852J3192K193M3010k2733o954J0057J0482l444k5141j3511K778L502j6134
4650b6555R000J3983j2653j9292m882l885R351J1593J4911M107J70J7025l594
4637I279J1430J3629k4783q996o044l9621m080J1467J499J8744P951K2334o0q866
$$ plain form
4623 3883 23776 25302 16024 23761 26655 767 2754 -10141 -11611 -29832 -49073 -32415 -21973
4610 -21973 -6278 10387 9039 -1187 22298 5143 -20342 -18632 -20848 -6660 -2253 -7268 2492
4597 2492 19460 5406 -11471 14839 6892 -5836 -23824 -19809 4735 8066 5200 2443 -50974
4584 -50974 -39906 -30243 -24180 -5976 -3688 -22290 -46986 -44038 -40432 -14363 13780 32245 37526
4571 37526 22483 -1404 5339 1657 14648 -5355 -3990 5494 13218 22783 32991 27711 24946
4558 24946 31277 6232 -4164 -5800 24507 26464 12892 -8939 -23006 -7755 -12748 -60 16152
4545 16152 22413 16211 2206 -19892 -15125 -4905 -2610 -12142 -15497 13640 34422 12457 -20280
4532 -20280 -25615 985 22863 3216 -2994 1965 5983 2707 2701 -3269 1724 917 13008 22308 -3181
$$ packed form
4623C883J9893J526r278P737K894k5888J987j2895j470j8221j9241J6658J0442
4610b1973J5695J6665j348j0226K3485j7155k5485J710k216J4188M407n015R760
4597B492J6968j4054j6877K6310p947j2728j7988M015K4544L331k866k757n3417
4584e0974J1068R663O063J8204K288j8602k4696K948L606K6069K8143J8465N281
4571C7526j5043k3887O743l682J2991k0003J365R484P724R565J0208n280k765
4558B4946O331k5045j0396j636L0307J957j3572k1831j4067J5251m993J2688J6212
4545A6152O261o202j4005k2098M767J0220K295r532l355K9137K0782k1965l2737
4532b0280n335K6600K1878j9647o210M959M018l276on970M993q07J2091R300k5489
$$ plain form
4517 -3181 3125 11698 -80 4707 -6821 15426 -2791 -13374 13448 11949 -338 -5163 -5065 -21942
4503 -21942 -1093 13878 21877 13838 -11213 -21868 -14275 -1235 7837 8805 15626 -10631 -31222
4490 -31222 -35548 -29338 2972 11534 -2054 12751 22059 2041 -8229 -8162 7916 -6150 -27405
4477 -27405 -23216 -52907 -58620 -56062 -24730 364 16572 478 -3623 -40557 -45051 -24776 -335
4464 -335 7105 271 -2062 25128 29817 -25893 -51099 -43099 -22789 -43684 -33331 -26450 9110
4451 9110 258 -20984 3668 -859 -9467 -12890 -45182 -43717 -30708 -14942 -5635 1840 20135
4438 20135 28243 -6640 -22011 -11184 -16802 -15876 6522 -3711 -12973 -4084 -211 8179 120 -14970
4424 -14970 -26153 -25101 -3598 -1210 -25683 -29564 -29022 -23721 -36636 4803 1272 16259 10499
$$ packed form
4517c181O306Q573j1778M787j1528K2247j8217j0583K6822j499j2287m825R8j6877
4503b1942K0849J4971P999q039k5051j0655P593J3040R072R68O821k6257k0591
4490c1222m326O210L2310Q562j3588J4805R308k0018j0270O7J6078j4066k1255
4477b7405M189k9691n713K558L1332K5094J6208j6094m101l6934m494K0275K4441
4464c35P440o834k333K7190M689n5710k5206Q000K0310k0895J0353O881L5560
4451I110q852k1242K4652m527q608l423l2292J465J3009J5766R307P475J8295
4438B0135Q108l4883j5371J0827n618R26K2398j0233r262Q889L873Q390q059j5090
4424a4970j1183J052K1503K388k4473l881N42N301j2915M1439l531J4987n760
$$ plain form
4411 10499 111 -8425 -21219 -19524 -35873 -45754 -48206 -60751 -49123 -30422 -16872 -16414 -23542
4398 -23542 4039 15194 -9917 -32403 -16299 935 -12344 6442 36756 29445 16457 3595
4386 3595 -13772 -44470 -43838 -21200 1405 -4907 -18023 -30930 -1880 18973 10711 -14059 -17767
4373 -17767 -22515 -8121 21295 -1333 -32993 -29061 10630 13069 11598 232 -9855 17383 42392
4360 42392 53979 24912 11153 9299 18609 20266 23053 14396 4229 -20688 -27020 -23983 -9289
4347 -9289 18915 9446 5436 28767 65811 56645 11433 -14645 -11903 -15602 -2706 10121 -7021
4334 -7021 -26673 -22576 -13104 -18453 -11948 -17232 -6461 -1892 -4992 -1645 -4610 12839 25300 55132
4320 55132 56618 56925 58047 55420 48316 30121 35935 35231 20723 13701 28361 1115 -3468 -9613
$$ packed form
4411A0499j0388q536j2794J695j6349r881k452j2545J1628J8701J3550M58p128
4398b3542K7581J1155k5111k2486J6104J7234j3279J8786L0314p311j2988j2862
4386C595j7367l0698O32K2638K2605o312j3116j2907K9050K0853q262k4770l708
4373a7767m748J4394K9416k2628l1660L932L9691K439j471j1366j0087K7238K5009
4360D2392J1587k9067j3759j854R310J657K787q657j0167k4917o332L037J4694
4347i289K8204r469m010K3331L7044r166m5212k6078K742l699J2896J2827j7142
4334g021j9652M097R472n349O505n284J0771M569l100L347k965J7449J2461K9832
4320E5132J486L07J122k627p104j8195N814p04j4508p022J4660k7246m583o145
$$ plain form
4306 -9613 -11433 3648 11800 -15971 -30267 -13270 -34511 -65181 -41272 -38146 -66788 -57344 -32815
4293 -32815 -14590 -2017 -2503 677 -15538 -30124 -15426 -9640 -2670 -19999 -26131 -7728 17234
4280 17234 40211 316 -25433 6669 12942 17327 9043 -8513 -2351 21412 24601 32770 36809
4267 36809 49404 22170 26072 16302 -43063 -14797 5203 18182 39059 51289 30087 -3457
4255 -3457 -8822 -1237 -3791 -3796 -13480 -6349 -18493 -29171 2613 26564 1843 -35387 -35302 -8084
4241 -8084 25759 42105 -3160 -53999 -67638 -77266 -85329 -71079 -51801 -14946 20394 42170
4229 42170 47267 9749 -9478 -9973 -18360 -30233 -20977 3215 -1178 -23060 -24745 -25970 -5898
4216 -5898 -16848 -18288 -3162 10546 -1196 18944 22978 1117 -6876 -1724 -25514 -6696 -19715
$$ packed form
4306i613j820J5081Q152k7771j4296J6997k1241l0670K3909L126k8642R444K4529
4293c2815J8225J2573m86L180j6215j4586J4698N786O970j7329o132J8403K4962
4280A7234K2977l9895k5749L2102O273M385q284j7556O162K3763L189Q169M039
4267C6809J2595k7234L902r770n9365K8266K0000J2979K0877J2230k1202l3544
4255c457n365P585k554nr684P131j2144j0678L1784K3951k4721l7230Q5K7218
4241h084L3843J6346m5265n0839j3639r628q063J4250J9278L6855L5340K1776
4229D2170N097l7518j9227m95q387j1873R256K4192m393k1882j685j225K0072
4216e898j0950j440J5126J3708j1742K0140M034k1861p993N152k3790J8818j3019
$$ plain form
4203 -19715 -24615 -36986 -31511 -21597 -16431 -31415 -22166 -4789 9765 2443 -18149 -13638 -5229
4190 -5229 -5493 11668 -26534 -45121 -55638 -48703 -37387 -21381 -5606 -21936 -30299 -47249 -30788
4177 -30788 -19262 -20526 -28555 -49629 -51941 -42198 10443 14195 -6545 -42991 -63768 -47450 -20133
4164 -20133 1023 4547 6918 -19481 -41062 -45473 -62884 -59018 -42978 -20417 -3662 1083 6470
4151 6470 16699 10548 -29203 -29764 -8853 21972 20318 1280 -17217 -9199 5236 6517 -7518
4138 -7518 -2443 22196 32678 24112 -1700 -5080 20990 42329 31188 8449 14305 37024 52097
4125 52097 45161 6060 -9481 -4502 5524 14821 8457 23502 33746 26865 9736 17121 24335
4112 24335 -2690 -17611 -40523 -55341 -40881 1001 -6848 -39101 -35307 -18161 -29086 -37856
$$ packed form
4203a9715m900j2371N475R914N166j4984R249J7377J4554p322k0592M511Q409
4190e229k64J7161l8202j8587j0517O935J1316J6006J5775j6330q363j6950J6461
4177c0788J1526j264q029k1074k312R743N2641L752k0740l6446k0777J6318K7317
4164b0133K1156L524K371k6399k1581m411j7411L866J6040K2561J6755M745N387
4151F470J0229o151l9751n61K0911L0825j654j9038j8497Q018J4435J281j4035
4138g518N075K4639J0482q566k5812l380K6070K1339j1141k2739N856K2719J5073
4125E2097o936l9101j5541M979J0026R297o364J5045J0244o881j7129P385P214
4112B4335k7025j4921k2912j4818J4460M1882p849l2253L794J7146j0925q770
$$ plain form
4100 -37856 -28263 -5996 -7012 -15564 -18601 -4456 361 16590 45950 32687 -2193 -10423 7349
$$ packed form
4100c7856R593K2267j016q552l037J4145M817J6229K9360j3263l4880q230J7772
$$ [...]
##END NTUPLES=NMR SPECTRUM
##END=
