##TITLE=Analysis number 311023
Compound Code cc 45709
Book Reference 436/48/1
Project Code adrs
Chemist Name williamk
##JCAMPDX= 6.0         $$ Bruker NMR JCAMP-DX V2.0
##DATA TYPE= NMR SPECTRUM
##DATA CLASS= NTUPLES
##ORIGIN= Bruker BioSpin GmbH
##OWNER= NMR
$$ XWIN-NMR		Version 3.5
$$ Wed Jun 29 10:40:59 2005 GMT Daylight Time (UT+1h)  MAYBRIDGE\NMR@NMR_250MHZ
##.OBSERVE FREQUENCY= 250.131544655141
##.OBSERVE NUCLEUS= ^1H
##.ACQUISITION MODE= SIMULTANEOUS (DQD)
##.ACQUISITION SCHEME= undefined
##.AVERAGES= 16
##.DIGITISER RES= 18
##SPECTROMETER/DATA SYSTEM= dpx250
##.PULSE SEQUENCE= zg30
##.SOLVENT NAME= CDCl3
##.SHIFT REFERENCE= (INTERNAL, CDCl3, 0, 16.522)
##AUDIT TRAIL= $$ (NUMBER, WHEN, WHO, WHERE, WHAT)
$$ ##TITLE= Audit trail, XWIN-NMR		Version 3.5
$$ ##JCAMPDX= 5.01
$$ ##ORIGIN= Bruker BioSpin GmbH
$$ ##OWNER= NMR
$$ C:\u/data/dgb/nmr/ADRS/4990/pdata/1/auditp.txt
$$ ##AUDIT TRAIL=  $$ (NUMBER, WHEN, WHO, WHERE, WHAT)
(   1,<2005-06-29 10:40:20.47 +100>,<MAYBRIDGE\NMR>,<NMR_250MHZ>,
      <created by zg, POWCHK disabled, PULCHK disabled
       configuration hash MD5:
       62 19 C7 07 E1 42 D1 B7 37 6C 3D D0 77 39 F9 E6
       data hash MD5: 64K
       56 3B AC 63 DB 56 2E E6 D5 5B 74 D0 F1 22 D2 76>)
(   2,<2005-06-29 10:40:36.16 +100>,<MAYBRIDGE\NMR>,<NMR_250MHZ>,
      <Start of raw data processing
       ef LB = 0.3 FT_mod = 6 PKNL = 1 SI = 32K 
       data hash MD5: 32K
       8F AA A0 A9 65 E7 82 EE 25 D8 DE D6 8E 72 C0 70>)
(   3,<2005-06-29 10:40:41.89 +100>,<MAYBRIDGE\NMR>,<NMR_250MHZ>,
      <apk 
       data hash MD5: 32K
       4E 1F 3F C3 37 C2 4D 94 8F BA B0 1B 30 33 63 9C>)
(   4,<2005-06-29 10:40:43.57 +100>,<MAYBRIDGE\NMR>,<NMR_250MHZ>,
      <abs ABSG = 5 
       data hash MD5: 32K
       DE C0 E6 77 FB C1 36 E7 3A FC AD A4 8E FD F6 C3>)
$$ ##END=
$$ 
$$ hash MD5
$$ 67 92 23 6D D2 7B 84 B9 9F 51 3C 6D 48 3F 68 90
##$RELAX= 
##$RELAX= 
##$RELAX= 
##$RELAX= 
##$RELAX= 
##$RELAX= 
##$RELAX= 
$$ Bruker specific parameters
$$ --------------------------
##$DU= <C:\u>
##$EXPNO= 4990
##$NAME= <ADRS>
##$PROCNO= 1
##$TYPE= <nmr>
##$USER= <dgb>
##$AMP= (0..31)
100 100 100 100 100 100 100 100 100 100 100 100 100 100 100 100 100 100 
100 100 100 100 100 100 100 100 100 100 100 100 100 100 
##$AQSEQ= 0
##$AQ_mod= 3
##$AUNM= <au_zg>
##$AUTOPOS= <11 >
##$BF1= 250.13
##$BF2= 250.13
##$BF3= 250.13
##$BF4= 250.13
##$BF5= 500.13
##$BF6= 500.13
##$BF7= 500.13
##$BF8= 500.13
##$BYTORDA= 1
##$CFDGTYP= 0
##$CFRGTYP= 5
##$CHEMSTR= <none>
##$CNST= (0..31)
1 1 145 1 1 1 1 1 1 1 1 1 1 1 1 1 1 1 1 1 1 1 1 1 1 1 1 1 1 1 1 1 
##$CPDPRG= <>
##$CPDPRG1= <>
##$CPDPRG2= <>
##$CPDPRG3= <>
##$CPDPRG4= <mlev>
##$CPDPRG5= <mlev>
##$CPDPRG6= <mlev>
##$CPDPRG7= <mlev>
##$CPDPRG8= <mlev>
##$CPDPRGB= <>
##$CPDPRGT= <>
##$D= (0..31)
0 1 0 0 0 0 0 0 0 0.06 0 0 0 0 0 0 0.0002 0 0 0 0 0 0 0 0 0 0 0 0 0 0 
0 
##$DATE= 1120038018
##$DBL= (0..7)
120 120 120 120 120 120 120 120 
##$DBP= (0..7)
150 150 150 150 150 150 150 150 
##$DBP07= 0
##$DBPNAM0= <>
##$DBPNAM1= <>
$$ [...]
##$SUBNAM7= <"">
##$SUBNAM8= <"">
##$SUBNAM9= <"">
##$SW= 20.6930455092707
##$SWIBOX= (0..15)
0 0 3 0 0 0 0 0 0 0 0 0 0 0 0 0 
##$SW_h= 5175.983436853
##$TD= 65536
##$TD0= 1
##$TE= 295.16
##$TE2= 300
##$TE3= 300
##$TEG= 300
##$TL= (0..7)
0 120 120 120 120 120 120 120 
##$TP= (0..7)
150 150 150 150 150 150 150 150 
##$TP07= 0
##$TPNAME0= <>
##$TPNAME1= <>
##$TPNAME2= <>
##$TPNAME3= <>
##$TPNAME4= <>
##$TPNAME5= <>
##$TPNAME6= <>
##$TPNAME7= <>
##$TPOAL= (0..7)
0.5 0.5 0.5 0.5 0.5 0.5 0.5 0.5 
##$TPOFFS= (0..7)
0 0 0 0 0 0 0 0 
##$TUNHIN= 0
##$TUNHOUT= 0
##$TUNXOUT= 0
##$USERA1= <user>
##$USERA2= <user>
##$USERA3= <user>
##$USERA4= <user>
##$USERA5= <user>
##$V9= 5
##$VALIST= <valist>
##$VCLIST= <CCCCCCCCCCCCCCC>
##$VD= 0
##$VDLIST= <DDDDDDDDDDDDDDD>
##$VPLIST= <PPPPPPPPPPPPPPP>
##$VTLIST= <TTTTTTTTTTTTTTT>
##$WBST= 1024
##$WBSW= 4
##$XGAIN= (0..3)
0 0 0 0 
##$XL= 0
##$YL= 0
##$YMAX_a= 377895
##$YMIN_a= -425540
##$ZGOPTNS= <>
##$ZL1= 120
##$ZL2= 120
##$ZL3= 120
##$ZL4= 120
##$ABSF1= 16.522
##$ABSF2= -4.171173
##$ABSG= 5
##$ABSL= 3
##$ALPHA= 0
##$AQORDER= 0
##$ASSFAC= 0
##$ASSFACI= 0
##$ASSFACX= 0
##$ASSWID= 0
##$AUNMP= <proc_1d>
##$AZFE= 0.1
##$AZFW= 0.1
##$BCFW= 0
##$BC_mod= 0
##$BYTORDP= 0
##$COROFFS= 0
##$CY= 12.5
##$DATMOD= 1
##$DC= 0
##$DFILT= <>
##$DTYPP= 0
##$F1P= 14.0000005364418
##$F2P= -0.99999901652339
##$FCOR= 0.5
##$FTSIZE= 32768
##$FT_mod= 6
##$GAMMA= 0
##$GB= 0
##$INTBC= 1
##$INTSCL= 1
##$ISEN= 128
##$LB= 0.3
##$LEV0= 0
##$LPBIN= 0
##$MAXI= 10000
##$MC2= 0
##$MEAN= 0
##$ME_mod= 0
##$MI= 0
##$NCOEF= 0
##$NC_proc= -5
##$NLEV= 6
##$NOISF1= 0
##$NOISF2= 0
##$NSP= 0
##$NTH_PI= 0
##$NZP= 0
##$OFFSET= 16.522
##$PC= 1
##$PHC0= -82.63994
##$PHC1= 15.49179
##$PH_mod= 1
##$PKNL= yes
##$PPARMOD= 0
##$PSCAL= 4
##$PSIGN= 0
##$REVERSE= no
##$SF= 250.13
##$SI= 32768
##$SIGF1= 0
##$SIGF2= 0
##$SINO= 400
##$SIOLD= 32768
##$SREGLST= <1H.CDCl3>
##$SSB= 0
##$STSI= 32768
##$STSR= 0
##$SW_p= 5175.98343685301
##$SYMM= 0
##$S_DEV= 0
##$TDeff= 65536
##$TDoff= 0
##$TI= <Analysis number 999999
Compound Code 99
Book Reference 9
Project Code 9>
##$TILT= no
##$TM1= 0
##$TM2= 0
##$TOPLEV= 0
##$USERP1= <user>
##$USERP2= <user>
##$USERP3= <user>
##$USERP4= <user>
##$USERP5= <user>
##$WDW= 1
##$XDIM= 32768
##$YMAX_p= 431455013
##$YMIN_p= -388521
$$ End of Bruker specific parameters
$$ ---------------------------------
##NTUPLES= NMR SPECTRUM
##VAR_NAME=  FREQUENCY,     SPECTRUM/REAL,   SPECTRUM/IMAG
##SYMBOL=    X,             R,               I
##VAR_TYPE=  INDEPENDENT,   DEPENDENT,       DEPENDENT
##VAR_FORM=  AFFN,          ASDF,            ASDF
##VAR_DIM=   32768,         32768,           32768
##UNITS=     HZ,            ARBITRARY UNITS, ARBITRARY UNITS
##FACTOR=    0.157963299565203, 1,           1
##FIRST=     4132.6476996994, 0,             0
##LAST=      -1043.33573715361, 0,           0
##MIN=       -1043.33573715361, -388521,     0
##MAX=       4132.6476996994, 431455013,     0
$$ Real data points
##PAGE= N=1
##DATA TABLE= (X++(R..R)), XYDATA
$$ [...]
23098 -64468 -92085 -83917 -38606 1490 1694 52243 14561 -5226 51608 90803 38407 47599
23086 47599 73458 -26670 -204139 -212427 -107066 -96372 -161830 -175445 -65144 -406 96564
23075 96564 85138 -26065 -47425 -56073 -30224 -22513 -27142 -27691 14265 -10203 -88137 -96219 -96691
23062 -96691 -114131 -154514 -199861 -114175 -19482 -7957 -11185 53644 110620 45631 -35529 -47418
23050 -47418 -19993 -19403 -14853 -26394 -46225 -34640 -25063 -8595 -6883 -54852 -118960 -90263 -54398
23037 -54398 -44639 -98407 -130249 -77137 -75411 5132 -17678 -102095 -95618 -111991 -62905 -9407
23025 -9407 18414 85347 179011 147042 118421 106691 121005 165331 149200 93802 33281 441
23013 441 -25842 -18175 -9825 5836 -43529 -72175 23873 90499 132494 90260 76737 44311
23001 44311 -36806 -61845 -53711 -56095 -1996 44384 72581 122895 146103 66235 125771 203426
22989 203426 167008 60095 -3565 -51070 -179572 -80064 -55295 -73127 -33647 -14039 -7250
22978 -7250 2380 -722 9850 -24992 -94070 -37749 3663 7259 -66139 10410 63453 72264 94323
22965 94323 32403 31705 22042 39629 -40911 -55502 -178353 -191950 -135449 -159409 -216636 -204779
22953 -204779 -109647 -21816 -41205 -42850 -30268 -15597 85886 97232 67186 -5852 -90635
22942 -90635 -103579 -59706 -29927 -9450 38730 35698 36665 -19542 -9191 68219 18998 -81561
22930 -81561 -128504 -101918 19081 -8965 -118504 -77352 50002 -30528 -35315 -26310 -72741
22919 -72741 -90160 -29268 59182 89354 47045 30216 32759 42979 16124 25780 40005 6832
22907 6832 -56423 -39441 -50045 -66000 -91917 -64349 -5090 7384 -16395 35116 33299 69709
22895 69709 -4047 -54646 -11015 63855 -11116 -33483 -47112 -27788 27890 4508 -39723 74305
22883 74305 71592 39170 5752 5444 -33749 527 -15155 -137729 -99535 49560 73784 82161
22871 82161 63277 -59984 -67005 -141 32271 -5605 71929 140326 97895 97847 26037 6563
22859 6563 100376 8053 -62050 -8516 -46837 -27435 51909 63427 -31590 -33206 37546 45664
22847 45664 110035 109139 136121 120488 107521 121666 22367 -28275 -14293 -4473 -18576 -31461
22835 -31461 -18532 -24692 -37438 -2255 -73316 -59813 -40642 5683 66880 1533 5422 73164
22823 73164 33512 -24019 -83003 -74756 12698 51451 -21994 5065 44172 55029 93812 1710
22811 1710 -103372 -108609 -60483 -25631 21385 88320 31030 100095 102601 86162 98103 63647
22799 63647 28286 112856 164814 103812 31181 54526 100942 64215 94954 162917 113660 79141
22787 79141 56210 57296 49454 14676 14243 91751 77505 12703 72294 207055 248519 182129
22775 182129 152537 116494 27149 3821 -39209 -60240 -32745 -27704 -26409 -13651 -34282 -15324
22763 -15324 89115 24528 -55699 -27418 63072 141377 185828 122005 89644 8350 -2214
22752 -2214 70592 38697 56125 32234 -28437 -30354 -78986 17289 37190 26165 16440 96476
22740 96476 113689 70 -60438 -102471 -50709 -22087 -33354 -133875 -273471 -209450 -49936
22729 -49936 -24059 -41949 51229 145273 213493 170910 212569 139675 166142 195306 189775 165420
22717 165420 87556 19578 -8149 -14415 -83394 -71260 -69528 -62392 -67737 13447 36988 58752
22705 58752 54392 72378 -17375 -62720 -60226 -73198 -59275 1945 51402 44338 -8637 -43339
22693 -43339 -19437 33143 -46742 -141286 -114862 -81431 -107431 -10048 95167 116869 3921
22682 3921 -24055 -13338 23349 33013 125564 201954 184563 89468 53570 56501 -65890 -128228
22670 -128228 -32503 113222 142779 118835 21506 4181 592 -48454 -108456 -31609 -11762
22659 -11762 28237 85542 90754 -12536 73570 165770 191923 175373 148456 168925 168404 79620
22647 79620 -38112 -20836 72047 162589 90645 42714 -24075 -37011 30532 25407 -20947 -74380
22635 -74380 -126286 -122020 -29097 11942 -81163 -62557 24494 80017 201954 201775 105623 66678
22623 66678 120377 77138 -17734 13616 29452 66597 37874 -37751 -132787 -89803 -21578 10652
22611 10652 59190 93411 16517 -60764 51527 123127 73506 -10256 31123 127150 136964 25319
22599 25319 26113 -15324 -28052 -46412 -85965 -134593 -67939 24315 45914 29032 -27168 -81907
22587 -81907 -63677 -32790 -56656 -16617 21099 117188 142009 151246 64408 -2362 -58088 -83513
22575 -83513 -116719 -116150 -66261 18567 -61290 -115600 -15907 16965 86808 128744 137441 144408
22563 144408 153133 71182 30718 92451 234071 239541 253753 126673 26447 -107861 -147072
22552 -147072 -147927 -45474 -73249 -115561 -34757 -105735 -108875 -85853 -135869 -87379 -18564 -29706
22540 -29706 -71784 -19651 -3150 36009 66513 82752 65100 48959 147527 107811 107949 123630
22528 123630 88511 48829 147820 135976 90087 63626 60367 119916 108543 49578 29958 1375
22516 1375 -5814 -26174 31964 56734 2014 2946 27381 126730 133999 73747 22808 11808 16170
22503 16170 36757 12648 44294 58253 53188 -55232 -152488 -74003 -31689 14002 59334 -5590
22491 -5590 -84136 -128429 -111612 -36443 -78999 -41352 53567 49328 44532 57983 -58415 6803
22479 6803 68853 98222 18998 -35687 -87624 -91004 -22746 14075 111613 141853 94727 117243
22467 117243 108139 123682 130843 130320 138824 72690 17831 29968 -60567 7247 90816 131797
22455 131797 174132 112638 73946 -60818 -122204 -40976 92820 99024 142361 117278 96644
22444 96644 128245 171374 72188 -131111 -150840 -162835 -159927 -75081 -98626 -80184 -39255 -88346
22432 -88346 -86936 -59218 -16925 -65794 -54215 110803 107786 136987 57075 -43463 -34188 52404
22420 52404 36841 -31983 -17969 -48595 -50762 -74841 -54606 -58563 -6225 -17472 112302 223215
22408 223215 168493 71249 13492 -9492 -51000 4648 -28360 -33663 8405 46011 92691 113526
22396 113526 92210 -10507 -41180 -45601 -22505 -28878 -23042 -112126 -97467 -54258 -71361 -73786
22384 -73786 13848 -5530 -14201 18059 80919 63393 23926 131333 151361 76861 53988 2099
22372 2099 3432 -49623 -123365 -83070 -15696 -29976 -99951 -86048 -84433 -131867 -210892 -165569
22360 -165569 -74253 -39853 3550 -32798 -29007 -63851 -53139 -65602 -15957 84211 226389
22349 226389 228229 195218 171394 108526 -20267 -109728 -128403 -104413 -52772 -61572 -9222 -60780
22337 -60780 -19929 -31877 -47143 39329 108508 147217 129050 65967 -21594 65761 6169 -124859
22325 -124859 -180117 -108569 -93925 -210184 -144971 -34109 12048 -22292 837 -42453 -52014
22314 -52014 -1048 -56403 -47996 -79936 2166 103752 19947 -53177 -20424 -26809 -89812 -31262
22302 -31262 -16283 -64121 -76606 -26663 58673 44513 67540 46809 -22308 -23841 82197 110249
22290 110249 36861 -66314 -120504 -160927 -41612 -23304 -133938 -170051 -20111 76953 5612
22279 5612 -56036 -8737 26284 90511 93463 66523 21473 37797 31869 47612 103671 8684
22267 8684 -12444 -13943 -2993 25439 -89410 -114436 -38790 38592 184718 130558 78181 62822
22255 62822 17820 -7860 45288 -11367 -57151 -8414 57191 100044 70756 18864 -107771
22244 -107771 -52497 16886 -1358 -52172 -72046 45638 86520 55632 77185 77270 156328 121412
22232 121412 112955 75219 117568 103123 74719 76566 -11697 22484 36710 24868 2153 21983
22220 21983 -36162 37284 -29252 -51937 -57930 -167954 -146723 -160832 -120096 -13149 68566
22209 68566 -12353 -82095 -134070 -108393 -35451 -81484 -95265 -50103 -35966 -90028 -93602 -148277
22197 -148277 -148076 -203017 -162378 -9331 112641 44410 -10037 -70541 -68142 -11020 50388 51425
22185 51425 23020 5765 -86580 14872 48018 54884 48240 27514 74199 62152 -43017 -61512
22173 -61512 -28416 102215 174040 199718 163660 73757 10507 -68532 -110865 -143729 -26521
22162 -26521 22073 27403 25703 -6941 -2210 31452 29627 23688 -935 -78734 -123277 -62238 -77452
22149 -77452 -128536 -67976 -66073 -7790 32004 1483 3588 41430 23332 -25406 -9123 17645
22137 17645 -1831 -29817 -64259 -63148 -18509 86737 125417 169218 194856 219406 286356 279488
22125 279488 180286 107030 68105 71777 104857 4454 -65259 -61936 -34222 -45331 -42838 -86279
22113 -86279 -146701 -168908 -152319 -33147 3615 24187 8653 57397 92054 33245 -19443
22102 -19443 -145165 -206369 -213726 -141229 -35753 -34455 -82737 -67229 75792 37352 7310
22091 7310 48395 52377 -48249 -165757 -217588 -219088 -172597 -135778 -63799 36346 94333 75641
22079 75641 -3330 -83779 -59651 6807 87948 177051 274329 300522 238797 122645 57874
22068 57874 131472 44035 -58226 -82488 -67412 -105513 -134280 -34149 48683 57620 -11783
22057 -11783 -57645 -65250 -9010 32320 104199 180550 118222 20416 -51825 -57929 -31341 -19772
22045 -19772 41515 26451 -53101 -2610 12682 7954 57321 25167 -9996 -33595 -27511 16871
22033 16871 52671 108586 47093 -16228 92846 61887 30126 -38646 -107018 -118213 -81823
22022 -81823 -164675 -223445 -143357 145 107306 72975 -27405 -5991 -91344 -65609 -77470
22011 -77470 -39781 -61096 -74201 -65304 39749 6651 -15087 -15135 6750 -9655 -14560 29284
21999 29284 92928 38899 -912 -109741 -166064 -46283 35982 14197 -537 45388 152696
21988 152696 105446 -4808 5553 122730 192127 200403 115337 37058 -2159 9118 151083
21977 151083 247549 142889 -14312 -37450 13857 34611 -14011 -32592 52232 107787 60570
21966 60570 61800 34110 -15022 -11394 -32824 11329 22004 -20365 -2921 -44443 -58565 -145608
21954 -145608 -152974 -119147 -143674 -118046 -64946 -69991 -123042 -121377 -74512 -90190 -71414 18192
21942 18192 19859 85466 69514 -6465 -47664 -55661 -90898 -62803 4265 -39286 -66986 -40885
21930 -40885 46633 94218 88595 16661 6182 -50648 -18739 80596 -8515 -47977 -86479 -94268
21918 -94268 -21635 78639 47606 -49188 -51360 17076 48325 45026 113101 -9375 -118444
21907 -118444 -116290 -74379 29749 56634 -4996 -89185 -102002 -18401 -6854 -32686 -95288
21896 -95288 -55725 -7213 -20369 -57105 -31285 -69671 -10953 36736 26859 27857 -90565 -200569
21884 -200569 -220080 -147368 -22972 -6098 803 4710 -58001 -31093 34764 36388 36011 72212
21872 72212 17271 16022 71811 33468 -62927 -42857 -51791 10453 8130 -33857 -77142 -36237
21860 -36237 -44590 -92534 -69098 -14640 -27906 2931 47078 -23795 -2497 42526 62096 102465
21848 102465 164142 222989 124720 54443 31761 36480 34078 77537 74901 35049 6499 135068
21836 135068 143256 189548 208527 198023 157774 155154 67842 53632 37687 100766 128407 64636
21824 64636 70710 34826 26328 28057 2143 -7301 -3656 -26684 6733 115306 122673 93342 119808
21811 119808 160261 125542 24690 -41612 -34592 -34268 -89972 -55963 -47693 -58523 69841 134783
21799 134783 127198 82551 -2336 -112938 -155313 -88270 41480 24051 -52143 -174088 -148431
21788 -148431 -2789 11154 -11977 107741 130190 5244 -156341 -205442 -184306 -156690 -109954
21777 -109954 -42123 8265 -90754 -114276 -87451 -47788 -27813 -59835 59966 120335 130858
21766 130858 110454 57556 9583 158166 267498 223486 204610 226706 238689 122157 -30697
21755 -30697 -82892 -68667 -15655 -19292 18163 100609 46216 -30000 -135223 -98749 -96990 -103266
21743 -103266 -177302 -19742 31922 30274 -4482 -30628 -56723 -50989 -52382 -82500 -58638 43379
21731 43379 65046 37298 -5577 28976 45115 -6412 2846 17566 -13293 2152 -22537 37102
21719 37102 104451 202816 141445 -19093 -116213 -97543 22582 121604 107950 47116 -11464
21708 -11464 -39216 -30018 -61332 -83141 -95567 -109369 -59795 -82462 -73196 -21066 -101255 -67838
21696 -67838 4040 17929 21050 15983 -15871 -157961 -206856 -235612 -222729 -233715 -336088 -270043
21684 -270043 -188685 -129880 -83785 -89619 3559 110345 105623 42571 -9697 -15301 29434 46478
21672 46478 -41066 -29863 -40555 -50430 28605 64105 -8024 -67167 -57682 -98308 -109893 -159283
21660 -159283 -37135 -11491 -54441 -39480 46986 116476 155364 100045 50043 12962 12386 48409
21648 48409 120554 60340 -26910 2832 53573 -53340 -13089 -63801 -109691 -105696 -45078 -44310
21636 -44310 -79177 -157098 -119603 -136350 -78205 37597 6022 -37688 -71793 -52340 -93568
21625 -93568 -2950 42150 27304 59070 62963 67560 103614 115041 51418 -10311 -68270 680
21613 680 59233 -68247 -154738 -153978 -54617 -89432 -102982 -72052 -96473 -84169 -55117 2523
21601 2523 16287 -32867 34501 -4358 -191801 -291082 -191163 -78313 -103264 -82163 -60580
21590 -60580 -46129 -34409 -30590 -96904 -99324 -95346 -125920 -108243 -31105 -65932 -201625 -128834
21578 -128834 -51058 -34838 52683 99857 61120 73194 75451 74667 72511 23020 -35250 -84614
21566 -84614 -130789 -52401 79971 44977 -4465 -15017 3870 -63763 -112847 -168734 -225250
21555 -225250 -136873 -83522 -100924 -78204 -19282 -22219 -109557 -156422 -93289 -42499 34553 115620
21543 115620 37438 -61269 -139646 -143841 206 41249 -68084 -59134 -23120 -24783 56151 40702
21531 40702 75308 87367 41074 10808 -36005 -23803 70634 55709 32312 -3024 41442 139820
21519 139820 90294 41219 -45616 -87101 -77726 -62019 -101435 -112868 -49654 -125339 -132155 -119823
21507 -119823 -82636 18150 -9234 -40632 32067 91468 139027 97945 20933 -63469 -27249
21496 -27249 -10720 43756 -1554 -145551 -210828 -86952 -29589 -63228 -112430 -33810 41106
21485 41106 145149 107501 60107 109051 165862 148661 133790 83971 -9853 -15867 2132 9661
21473 9661 33614 82640 7526 12973 57228 62237 136033 151107 132547 78108 53854 88428
21461 88428 130251 4957 -19730 30055 102584 142248 162130 7311 -57209 -43094 -28251
21450 -28251 -29420 -124772 -65888 -22674 -120254 -94209 -51726 -10064 -26143 -76463 -89887 -79508
21438 -79508 -50454 -49311 -17555 88638 127682 84746 -29502 -44936 -95986 -70112 -12930
21427 -12930 18855 -27190 -48947 25011 -27282 -65426 -73501 -39453 -40631 -23989 -33033 -122992
21415 -122992 -65175 49499 89116 69586 82674 94443 58459 -5073 -6208 33370 -1417
21404 -1417 -18471 -42466 -90894 -26986 -1384 -19632 -102960 -124493 -56945 -15172 95848 49271
21392 49271 9979 -33075 -30032 -16463 -58641 14769 51323 84080 5631 -108385 -118805 -92263
21380 -92263 -36076 -24072 3317 37547 76209 49675 -85908 -102371 -110083 -115956 -120611 -155989
21368 -155989 -6425 186784 281871 163580 -10918 35959 84827 30383 -20994 -102749 -71857
21357 -71857 -107082 -125276 -52779 -107879 -107681 -95399 -66711 -153770 -163655 -49689 68169 43600
21345 43600 -45283 -43243 -35971 -37710 -23568 -10552 18289 15890 -5996 123498 148894 98139
21333 98139 9467 -7984 21677 -4711 -117612 -138507 -115024 -67378 -61342 -21613 19253 69367
21321 69367 90070 90878 88993 93574 66273 27230 75711 118916 102625 96147 35681 40661 85735
21308 85735 104673 4604 -52401 1558 -3607 -85789 -100989 17807 62510 29662 54341
21297 54341 47617 -3784 22398 50476 -16129 2204 -6605 -16097 6264 87331 97331 111832
21285 111832 88554 90674 74304 63601 102572 9232 -73959 -47508 -61597 -184439 -100095
21274 -100095 79124 11906 -6137 15030 -1762 103648 159827 121181 40053 -48707 -36822
21263 -36822 38475 87397 103593 86120 107403 156204 136758 49030 -18774 -9457 88146 4048
21251 4048 -40165 -97757 -43383 -13352 -20918 17614 -6367 -45461 -47492 3043 51566 -40311
21239 -40311 -107246 -171301 -225814 -290703 -239310 -138344 -129996 -76961 -68149 -53669 -85780 -93054
21227 -93054 -35046 -23390 17132 47681 18068 -38237 -49682 -21399 77137 152573 153122 174262
21215 174262 153825 103761 -5882 -67699 -27789 116069 147508 142230 142110 95249 42518 -37480
21203 -37480 -41920 -52455 -75387 -52221 57832 119532 115706 97004 29885 -3343 36361 -101563
21191 -101563 -213407 -218753 -242202 -220570 -212790 -243354 -203342 -81508 13263 -35450 -82462
21180 -82462 -70056 -60603 -62063 33951 7116 -23052 -11116 -69998 -31078 36557 38774 11180
21168 11180 72911 49150 -11351 11850 -25801 -27366 -1511 9988 -16752 -11716 -61476 -129648
21156 -129648 -76013 -33370 -26501 -89908 -106789 2194 110248 65505 56490 -1182 -47935
21145 -47935 -117973 -61674 25365 60117 79224 131101 102001 -25823 -99459 -48438 62518
21134 62518 134283 124866 112500 122133 86544 106926 126668 150512 188701 186748 214891 191302
21122 191302 128919 126632 118175 94102 109553 157147 154948 97614 67875 87201 49330 19286
21110 19286 4252 -21891 37211 132432 184413 95793 4480 80516 83962 107095 155098 85674
21098 85674 31532 72497 31753 7970 -17446 -4599 17925 8747 50581 30999 -46528 -22087
21086 -22087 50050 57919 24055 23313 20835 -47505 -40951 -16115 -23431 -799 -67543 -77999 11212
21073 11212 90718 18414 9828 29520 36898 -42850 -85474 -154285 -90491 13527 94693 175589
21061 175589 144714 16178 20542 -3527 -63342 -87671 -146043 -169994 -134849 -89178 -64911
21050 -64911 9633 98054 -47928 -65124 -34788 23299 93962 216564 241749 160958 39520
21039 39520 35481 5325 2476 33667 11398 22692 65239 171983 239586 170094 112366 30663
21027 30663 -14029 76489 67885 67346 112724 103482 27354 4308 -65643 -103818 -30260 -27959 -106925
21014 -106925 -130713 -153657 -192577 -150065 -55364 -27857 -10039 -14124 -30798 33930 139586
21003 139586 231978 208174 96990 61590 174394 264144 268560 237325 136995 97691 75827
20992 75827 52968 105266 188805 168953 51966 16024 3191 -38989 31883 49083 -4548
20981 -4548 -106915 -88022 -122565 -109049 -69777 -56662 -163445 -124973 -41636 16351 -24470
20970 -24470 47640 11596 44975 75083 83452 83711 84651 15923 -13179 95561 134480 66318
20958 66318 114037 99297 18845 -69538 46850 90054 49138 74968 24565 105390 177050
20947 177050 150652 57202 37893 111427 151879 79623 90242 110022 223849 184303 80494
20936 80494 64629 91493 133459 138113 91297 -79834 -131469 58793 146717 90908 -12465
20925 -12465 64724 104636 51505 50634 34796 31309 110605 116792 170156 179379 115495 174637 202151
20912 202151 130383 80280 90473 151249 170990 104730 94370 3748 -135874 -92161 51911
20901 51911 108894 81329 -11198 -160 44345 71557 42196 -47149 -87640 -4158 41934 49492
20889 49492 75460 148121 187683 217959 203936 240405 201138 108052 37000 7239 4374 60140
20877 60140 5804 -17856 13811 -8971 -45231 -135561 -164209 -83020 -10678 24343 37757 101409
20865 101409 104064 191084 199803 208017 194888 240102 270189 163525 93531 27262 48655 54477
20853 54477 23475 -20016 -84142 -120053 -66315 5039 2704 -63171 -122930 -178848 -108304 23651
20841 23651 107705 53336 54282 42849 145940 132973 88870 84027 31277 7910 106757 169012
20829 169012 137483 5626 -45471 -73743 7021 -15210 -81068 -78032 -74216 -42568 -28629 -143222
20817 -143222 -232625 -148903 -117531 -102413 -141840 -77505 -20452 -28215 22945 -33743 -51209 -77438
20805 -77438 -68942 -32746 -849 -36845 -108909 -104823 -22387 35545 -41872 -35449 -33339 -39781 -38990
20792 -38990 -84625 -103025 -115736 -81188 50774 19519 -103157 -119643 -46750 -15634 107987
20781 107987 155978 112118 -32739 23240 115415 66105 14592 20058 32980 31093 -85303
20770 -85303 -183682 -158094 -43938 25170 40028 -6934 18695 87968 86582 44215 -45229 -5782
20758 -5782 -18802 -48421 -28131 20557 61607 51596 101922 73652 32016 -28550 -140578 -224621
20746 -224621 -162799 -62620 -82849 -74392 -40226 -74176 -59039 -76122 -43683 -50810 -31142 3451
20734 3451 -37019 -19914 -56251 -68574 -31612 -19029 33025 86202 68163 52584 -29938 -118355
20722 -118355 -109208 -117490 -120624 -79713 -30804 76583 129942 178694 208403 108565 115235 35260
20710 35260 -20604 8456 65482 42603 26490 103083 147819 37724 -105632 -79016 -2166
20699 -2166 23278 -50822 -29128 33972 -15715 -74652 -62487 -14238 -14003 -103162 -35405 58225
20687 58225 91081 147606 80071 -3313 -17494 26784 10061 4823 82648 166095 92728 71837
20675 71837 34053 -21910 30375 -3924 35325 136848 108488 51226 14190 30242 41203
20664 41203 72607 24979 40737 52138 89415 138476 72085 -8224 -23629 17294 79197 47382
20652 47382 89522 199322 118960 67853 125024 99680 -1939 -86528 -31901 18978 144233
20641 144233 20969 26388 101699 62372 -8601 -20776 -134099 -73173 95641 140060 193375
20630 193375 247946 177514 38658 -40646 15434 1288 -30122 610 18139 55128 38670
20619 38670 21435 -13492 -17181 13108 -68177 -79387 -68102 -19435 58374 88949 88029 103974
20607 103974 97069 -28489 -89004 -61107 -113807 -116894 -119553 -71224 -16021 7505 16426 106482
20595 106482 152468 59088 10941 -24091 37993 135702 120884 46414 29769 84245 71192
20584 71192 11256 93495 88078 21681 36032 11409 -26201 -75578 -47201 -45027 39446 176726
20572 176726 187288 136440 93580 69815 7910 55328 19703 -7413 -46935 -37864 75339
20561 75339 96762 47124 46630 187830 233788 172078 123406 83017 155555 184953 143240 61671
20549 61671 -20083 -55448 -22230 45370 31344 -12242 93279 131338 88854 84664 37505 59180
20537 59180 11778 -10839 -12676 -81316 -19727 3484 13158 -88574 -5446 34084 47230 42156
20525 42156 80928 135468 105340 16675 42910 96685 136073 71932 76611 111506 104756 164902
20513 164902 109791 51622 61623 12824 -99347 -4645 52410 32006 29810 23944 -112384
20502 -112384 -168400 -127217 -151022 -220077 -183990 -54280 60949 74626 -4960 -44809 -103526
20491 -103526 -22687 7913 66891 81806 75787 102686 20197 72683 9538 18410 16029 114543
20479 114543 218177 187492 245045 189637 134739 72331 109 -38196 -37052 -5336 -33087
20468 -33087 -71174 5676 136068 140135 47678 37128 88552 192266 124076 129289 -4451
20457 -4451 -80765 -63527 -52955 -72552 -108273 -57265 4441 22429 126674 127222 87609 84886
20445 84886 110517 163857 179096 129576 73197 14786 -40013 172 35099 -55246 -39189 -45912
20433 -45912 -58928 -99184 -147665 -217226 -118853 -84225 -49460 -83762 -17607 -23404 70284 121400
20421 121400 88442 96374 98570 68350 -3812 -14660 -145292 -156063 -44345 97301 72378
20410 72378 19503 -35860 5854 9891 -68317 -127031 -105643 -168963 -157287 -116382 9160 76527
20398 76527 101365 89387 1852 -86818 -31 3522 -70459 -125578 -64797 -117967 -104870 -107114
20386 -107114 40404 89155 68803 76012 82789 48832 61733 117876 163737 232084 253299 176485
20374 176485 57976 38834 92678 -22534 -108044 -33784 34459 57720 81892 152716 184400
20363 184400 57065 34788 124126 103584 85977 95602 88666 -6926 -24088 -41253 37222 69508
20351 69508 9371 -19819 -17394 34831 77353 133988 78329 -398 -59836 -75863 -20923 -6457
20339 -6457 32726 68353 102496 131298 105025 -39308 -110297 -144573 -96117 -32747 -15042 -27930
20327 -27930 5817 -80759 -158164 -31190 51241 39284 86824 158761 133167 85872 60953
20316 60953 35208 8939 -33458 -90465 -37569 -19777 6679 -5983 23899 34000 -78961
20305 -78961 -125498 -35952 -45733 -42428 -12158 17735 -46345 -79842 -83915 5841 22879 34279
20293 34279 31362 107746 127630 73198 64362 13046 -44235 -2895 82206 109422 169331 227114
20281 227114 254711 253227 196390 115433 103128 47336 58549 56475 36056 54506 -2763 -47417
20269 -47417 -4666 53052 76828 179084 203929 124671 54107 24200 -8725 -10698 19300 90715
20257 90715 145932 186053 178429 169884 157799 107685 106683 196330 186087 214301 280297 245602
20245 245602 141108 109800 79460 93541 161716 173627 161055 97767 134431 184735 179342
20234 179342 114760 63338 87534 33228 -57091 -55084 -18131 -76667 -170420 -95617 -15651 38872
20222 38872 104270 54893 -54118 16060 169398 104009 -66766 -95462 11331 13920 25075
20211 25075 50845 70850 93725 66097 31122 125266 215740 242246 235675 228872 204855 86094
20199 86094 83709 93146 185700 170891 123688 83626 16845 -46065 -24250 84860 91596 124566
20187 124566 96142 145636 200821 236032 180733 158566 55050 -52451 -85728 -101734 -64442
20176 -64442 -23687 -16611 -40978 45512 65754 -65175 -54487 -6454 28980 85914 149269 185368
20164 185368 134166 146104 136668 132827 168770 207698 280059 217103 143377 105220 77208 140387
20152 140387 99129 42033 98877 142303 226617 215006 184451 190951 146444 114015 93870 158773
20140 158773 254333 213287 197299 149263 124003 83806 76209 46095 41565 -3986 -15190 66406
20128 66406 75387 3163 -1035 56847 -19721 -78659 2490 -39336 -23045 -18135 -30611 25014
20116 25014 138255 139685 5425 -13832 40338 133588 146479 207303 246526 247385 263045 220969
20104 220969 140196 124277 155875 150021 101725 67448 104287 178623 211313 218086 274019 273949
20092 273949 224345 211329 227245 209183 164489 197006 230878 174340 152721 128796 120713 158037
20080 158037 240814 231248 277202 272234 244614 273958 145028 99059 187931 155573 71468 93345
20068 93345 33993 45505 97503 148663 119221 101627 166016 119206 16738 8423 13217 1561
20056 1561 195 2729 40307 111668 187357 144760 -6022 -46221 18163 1289 71266 149891
20044 149891 218452 287334 306313 198757 148088 147804 136432 130734 117991 144809 186603 174262
20032 174262 96658 137399 106119 -58375 -43034 -87947 -170061 -135481 -86842 -95430 -18440
20021 -18440 7976 22433 51918 122766 137175 110655 126101 137214 101853 11289 -14669 52735
20009 52735 120157 175603 126467 152515 138682 163752 157306 132213 78110 111455 182716 164875
19997 164875 103904 94909 90225 210096 192041 118413 102260 70188 39346 112850 75628 15733
19985 15733 -45774 1143 194585 177340 83871 -6164 -41695 -14134 -22928 -47528 16030 59449
19973 59449 16510 114174 247509 198916 216300 212352 244829 207529 168211 145527 187180 275707
19961 275707 340792 279252 262844 219465 266884 278559 292262 295545 354293 404670 476210 576808
19949 576808 755972 792461 780201 843991 928142 1061401 1233155 1286950 1245263 1230195 1247954
19938 1247954 1163395 1021982 795657 742691 754935 617054 520494 444043 434487 476065 483116
19927 483116 501526 488355 448633 348978 282099 301759 334313 290785 284734 315898 350198 407322
19915 407322 509647 551587 392535 238425 209907 204410 220789 228348 277361 399184 353197
19904 353197 281481 368348 322629 285029 207917 175752 185340 185804 211302 344864 367986 339525
19892 339525 317670 235054 262177 292325 283074 336073 385153 331496 351267 270276 246968 334381
19880 334381 303244 280948 253880 279335 362965 475509 561374 613423 588451 537089 478730
19869 478730 490257 450215 471695 541485 633419 744313 763026 726345 649645 467783 435408
19858 435408 460961 407676 437480 472713 476486 440932 505795 503228 470394 488387 427536 496820
19846 496820 521124 468602 385757 295826 299143 211436 166316 261152 283033 211748 184101 211210
19834 211210 255169 323304 351907 329230 289702 296553 426359 549828 479365 462776 530181
19823 530181 627561 717123 743637 815053 850370 783051 812230 1028055 1304881 1402626 1338758
19812 1338758 1301514 1250880 1182123 1052416 947364 772525 745846 737803 777634 699599 561638
19801 561638 528358 521049 442022 419828 414594 444001 479220 597974 589786 466118 330679
19790 330679 305621 304496 327051 234582 276748 406585 446851 449158 355507 370083 319051 297740
19778 297740 370607 447683 431836 480759 462057 494612 436306 303319 341620 460177 411633
19767 411633 382871 359004 343339 267048 224481 179654 132137 181136 214893 294227 365528
19756 365528 421576 363880 290024 248021 276987 370751 403322 440760 392832 304857 157957
19745 157957 62131 84822 183538 228140 255782 283888 378432 358605 341700 321446 354913
19734 354913 408906 465333 352848 273123 366010 363729 322060 294352 426528 508234 465415
19723 465415 424362 377493 234858 203383 323322 286473 142323 171373 234189 229483 102386
19712 102386 88209 147080 207666 284447 282628 252453 314787 227571 250351 265030 238004 249314
19700 249314 245047 175080 279624 351724 291275 211341 244617 261446 272038 189883 188032 241415
19688 241415 198028 93730 190363 254775 267671 313526 323733 304006 307145 312705 275417 284697
19676 284697 390914 378280 359177 387899 467475 502406 483098 577195 558557 586197 627506
19665 627506 601239 635065 708868 726626 752658 650545 601047 622912 593816 529054 482507
19654 482507 460530 462161 506104 448039 445053 410565 359094 306188 304403 344075 320660 200952
19642 200952 143185 263534 364458 357556 278788 250891 310794 414333 441193 445836 395697
19631 395697 402853 419217 396756 373620 352923 413483 465981 349457 378349 470143 507022
19620 507022 530435 486419 469957 386501 357120 431466 636038 698242 732792 660694 656032
19609 656032 640736 694815 727046 713623 813719 867920 852651 830670 766609 715458 718394
19598 718394 730422 717996 639194 634810 591800 688858 748776 659699 571281 585435 589213 608811
19586 608811 565174 562516 552527 585206 604771 514604 475721 522682 450809 370341 337477 243214
19574 243214 301046 399064 381931 372025 376849 374492 302039 312550 366257 397540 460300 365519
19562 365519 245294 254102 333544 365332 355489 444845 451445 346439 342112 270494 319709 389919
19550 389919 404063 379849 313659 382736 575651 721842 719518 744957 786652 768805 681648
19539 681648 628254 688176 655104 733141 732149 805022 782226 744625 715854 628000 526617 544762
19527 544762 589014 603027 505400 451777 413644 429872 406623 361416 292190 273598 412765
19516 412765 408840 342411 402271 414567 360035 369300 337742 271828 264199 363796 401692 318050
19504 318050 224588 252143 384574 442876 397960 420593 400176 413630 394963 469078 534065
19493 534065 605773 626073 572426 526845 448701 434644 470825 516659 580580 646935 658985
19482 658985 519502 523005 563406 642214 808476 909432 1057099 1029939 989729 1154570 1288597
19471 1288597 1251584 1094369 1194297 1223139 1251903 1317437 1381547 1275733 1225266 1127672 983343
19460 983343 957184 908141 770753 756985 745257 681145 652763 556909 501148 509111 489487
19449 489487 587500 723683 720373 749332 795902 798160 778122 717937 681270 688218 650196 631457
19437 631457 655402 667331 611914 565818 545519 572158 554642 524634 432479 441478 524661 639013
19425 639013 701932 695708 644299 721804 821543 968868 958948 942475 1054201 1200541 1243710
19414 1243710 1217188 1141042 1126447 1119766 1150822 1117998 1100394 1099559 977216 1006296 1080912 998411
19402 998411 882298 848814 938039 1018456 1031593 1046684 1076313 1087704 1164105 1276969 1478099
19391 1478099 1632220 1711820 1680892 1683730 1861647 2085908 2324276 2521943 2613335 2652855
19381 2652855 2685388 2593410 2492165 2364763 2328127 2203219 2199811 2217251 2302290 2280094 2224445
19370 2224445 2255977 2286189 2248690 2308293 2366253 2366744 2442472 2583893 2725526 2740952 2667935
19359 2667935 2670869 2742968 2812644 2807660 2891829 3023042 3079847 3062670 3135898 3362841 3440151
19348 3440151 3495290 3550566 3604466 3647706 3613286 3611988 3657957 3621463 3646998 3630465 3657635
19337 3657635 3683135 3779143 4025163 4159095 4230242 4309775 4448241 4463642 4589039 4749277
19327 4749277 4963745 5183630 5517692 5818651 6055539 6294541 6609720 6950359 7247497
19318 7247497 7447730 7717041 7918824 8110307 8508056 8976417 9423939 9776280 10252358
19309 10252358 10836298 11423675 12137320 12915316 13750149 14850411 16230681 17848494 19781939
19300 19781939 22265427 25264583 28747190 32955727 37832276 43313219 49430176 56250740
19292 56250740 63974015 73112920 84035701 97305756 113311339 132092051 152934409
19285 152934409 174322785 193674489 207930391 214621145 212757517 202874544 186617667
19278 186617667 167046933 146897552 128334461 112173455 98824700 88095268 79571541
19271 79571541 72841504 67288258 62745612 58995370 55906267 53252715 50936120 48925985
19263 48925985 47090908 45600177 44352484 43130817 42118109 41318979 40776854 40478940
19255 40478940 40218037 39994658 39793572 39679333 39528930 39211659 38768490 38112590 37393774
19246 37393774 36531786 35425206 34197292 32825893 31429795 29936575 28470200 26951609
19238 26951609 25533458 24269239 23048058 21952488 20905545 19911044 19017252 18220086
19230 18220086 17500062 16734959 16050067 15422122 14748995 14221535 13785612 13336418 12861525
19221 12861525 12488997 12193918 11896627 11643845 11539417 11397718 11160962 10859603 10555099
19212 10555099 10305967 10129181 9972344 9820654 9653483 9483534 9329913 9218531 9108743
19203 9108743 8995509 8967878 9002474 9034792 9045368 9165305 9299043 9379493 9536946 9764253
19193 9764253 9869928 10031308 10392519 10861522 11343657 11894643 12607013 13358736 14074176
19184 14074176 15002799 16110329 17206283 18497899 20029838 21904451 24242416 27117691
19176 27117691 30616940 34872437 39896510 45500686 51620330 58306964 65667274 73986263
19168 73986263 83794115 95954068 111349026 130521609 153222977 178023655 201382732
19161 201382732 218217701 224324970 218138694 201687595 179197617 155606175 134303021
19154 134303021 116712032 102640602 91481291 82685075 75608081 69735298 65003507
19147 65003507 60977426 57538656 54620599 52194727 50104572 48280182 46606546 45110566
19139 45110566 43893200 42872991 41977002 41258819 40506055 39885968 39273600 38793629 38459649
19130 38459649 38112202 37744513 37438803 36999341 36340231 35563283 34470486 33242520 31984779
19121 31984779 30642056 29221636 27936691 26530424 25106357 23823248 22624947 21544316
19113 21544316 20506896 19517420 18639946 17822105 16983102 16096346 15241847 14428259 13619420
19104 13619420 12958588 12367703 11690624 11129701 10624266 10149583 9619499 9152866 8663613
19095 8663613 8268770 7838421 7512590 7223592 6954904 6651735 6513867 6245381 5889114
19086 5889114 5672889 5495163 5304508 5117143 4908398 4708472 4542854 4304114 4087867
19077 4087867 4033230 3924303 3776564 3548088 3294420 3123345 2953283 2864099 2809567 2693721
19067 2693721 2651748 2628600 2473475 2313512 2221325 2176940 2159835 2069245 1985720 1941085 1848548
19056 1848548 1748926 1607108 1550976 1583149 1529594 1473505 1483070 1472066 1365870 1256168 1274033
19045 1274033 1317375 1296999 1341679 1407916 1360598 1267302 1258196 1332744 1425631 1498356 1411756
19034 1411756 1438526 1538223 1512854 1476233 1261130 1114113 1032005 975229 1060252 1056624 952851
19023 952851 900860 880854 835755 844289 812097 855264 823697 703568 721106 744985 801499
19012 801499 724382 838619 888275 842170 853132 804371 755148 762146 790828 786578 847291 831346
19000 831346 888838 1026472 1048692 974566 922910 987982 1030232 1139849 1253960 1278564 1263549
18989 1263549 1216700 1111702 1079818 1009620 1055168 1095572 1107389 1131606 1123190 1116552 1063767
18978 1063767 1041421 1057290 1014520 983150 926439 844400 830549 807159 686895 639057 604284
18967 604284 649488 692116 656745 614648 659929 646823 668481 664422 666040 698421 704130 720896
18955 720896 743913 779281 823087 778058 798118 775915 704972 768839 814646 793298 768793
18944 768793 778449 787585 917829 836948 775710 835664 916487 974482 901598 741240 653887
18933 653887 586740 532067 564914 581188 574426 495922 490660 536058 582787 552890 491711 514645
18921 514645 623368 685185 613675 574833 592993 615245 666305 586579 614627 562582 526323
18910 526323 584299 613790 627914 582561 554793 572467 522681 492007 480682 534705 500147
18899 500147 426742 447546 518847 503796 430586 398717 406344 409156 440428 539491 650318 599540
18887 599540 483255 362888 388201 402609 396421 469080 405434 387175 358090 261862 418960
18876 418960 520898 480217 525344 502956 603458 661432 598143 581121 615272 539617 513823
18865 513823 455386 493627 537755 610996 620714 680561 584231 437514 414792 428892 436981 255327
18853 255327 145338 223898 295860 281893 292215 364553 322721 259112 277467 253515 285698
18842 285698 421056 446087 469809 282265 175855 263945 347875 438050 518377 558905 626441
18831 626441 574926 519737 617473 648320 562670 508305 500357 511924 540175 571907 571987 593053
18819 593053 646133 746991 732592 729921 740478 684965 680634 626991 639518 713966 744787 846788
18807 846788 885875 854519 825901 861689 948734 1036951 1105206 1122492 1062888 988015 879952
18796 879952 890476 889469 880073 924682 917165 935703 997414 1050251 1073013 1047037 1034177 1063015
18784 1063015 1029613 998949 960066 784220 661253 627865 745706 643963 533745 594826
18774 594826 757324 755518 707296 701478 694382 770170 827136 1014718 1135321 1191810 1044364
18763 1044364 867424 807306 782481 842859 983487 990065 955596 968737 1046436 1003821 995347
18752 995347 1020192 1050106 1076685 1141162 1259865 1304959 1293300 1236841 1245325 1239772 1240995 1189903
18740 1189903 1070012 984964 1072457 1060184 1112419 1145730 1154805 1101767 946300 865037 805195
18729 805195 787354 777764 786822 752071 734342 702752 687916 695964 642867 651731 726206 708246
18717 708246 725155 649355 679478 778813 908028 921876 823879 828268 914208 937878 1058591
18706 1058591 1026994 1042827 1055202 1170038 1316545 1311544 1227336 1098777 1005322 953927 996537
18695 996537 1004693 992029 1028423 1004217 919642 1047242 1087510 939869 809177 792431 728844
18684 728844 649694 602705 576081 620375 658728 583253 580742 582066 651745 620206 690101 782392
18672 782392 783282 888298 794303 729925 646358 638597 662464 696988 789020 774553 843585 911439
18660 911439 877187 848872 869885 972205 1124914 1220161 1173184 1157736 1216732 1376283 1398080
18649 1398080 1400338 1474628 1488720 1417324 1233363 1070997 1000612 950513 947656 931050 1018379
18638 1018379 1017128 892503 753180 669468 683324 784651 828742 884224 896757 866090 917547
18627 917547 987319 1123703 1091581 1006639 1129210 1247259 1296469 1398743 1468903 1618516
18617 1618516 1769906 1833936 1882466 1835400 1819452 1782305 1827447 1728981 1536289 1405095 1359772
18606 1359772 1310624 1289169 1402271 1389363 1397110 1544865 1559074 1585881 1617374 1548021 1556882
18595 1556882 1505102 1566405 1580391 1546960 1498932 1404062 1490797 1593787 1639371 1617928 1609981
18584 1609981 1596811 1589237 1473430 1376285 1452827 1494486 1583703 1671724 1584572 1489447 1508431
18573 1508431 1580450 1515669 1439756 1532019 1559993 1497355 1523570 1595244 1605701 1542983 1584075
18562 1584075 1659573 1732492 1824568 1823010 1827049 1867803 1895846 1978688 2086215 2089705 2149680 2228428
18550 2228428 2233216 2299109 2331707 2372701 2380507 2238105 2211057 2282787 2268380 2341924 2329042
18539 2329042 2307507 2355334 2495476 2570480 2573382 2589417 2613025 2581969 2476432 2394766 2294379
18528 2294379 2171641 2112480 2025631 1974594 1998304 1978075 2065474 2082706 2033397 2016580 2051747
18517 2051747 2133213 2160521 2054356 1952848 1953157 2008224 2077683 2113063 2236311 2375718 2556239
18506 2556239 2605927 2688767 2847232 3036094 3226986 3450362 3649200 3808740 3936298 3985742
18496 3985742 3905337 3845425 3667822 3552976 3466461 3262024 3035281 2911838 2967247 2989409
18486 2989409 2941174 2975582 3038844 2967456 2957414 2964441 2910881 2790709 2691948 2562553 2412982
18475 2412982 2384359 2261193 2180851 2143268 2019147 1913087 1853405 1798270 1780333 1728347 1644737
18464 1644737 1608514 1539308 1482015 1445198 1511112 1570852 1598795 1579848 1571581 1489758 1393326
18453 1393326 1380594 1407797 1504629 1556067 1565211 1533788 1574844 1562261 1585350 1662646 1636405
18442 1636405 1553777 1500035 1524871 1696180 1788237 1756282 1733472 1665166 1669316 1673222 1723119
18431 1723119 1744734 1660457 1545057 1586770 1517113 1470232 1499320 1568544 1586597 1548768 1502015
18420 1502015 1360993 1298854 1301477 1336141 1314229 1285787 1254416 1220097 1284259 1376703 1338714
18409 1338714 1272144 1233747 1319728 1326138 1438065 1446248 1438862 1450730 1378605 1462417 1524115 1632675
18397 1632675 1767885 1858383 1866884 1833536 1822893 1799347 1707284 1767741 1790950 1795133 1802575 1781227
18385 1781227 1874446 1966088 2037986 2150125 2157757 2118913 2157463 2244709 2233761 2149526 2167017
18374 2167017 2258975 2233231 2233416 2175642 2170488 2146493 2248528 2254537 2284535 2278299 2289931 2409889
18362 2409889 2471435 2496176 2547626 2666779 2701516 2749999 2826095 2858269 2840970 2880404 2945611
18351 2945611 3008570 3129132 3221735 3293165 3354414 3422496 3524718 3671931 3764036 3906288
18341 3906288 3990619 4115063 4145379 4226644 4426577 4638581 4835253 4954293 5044745 5292629
18331 5292629 5515183 5850701 6237423 6558933 6990920 7607111 8116313 8698506 9246307
18322 9246307 9979921 10704453 11492351 12490905 13750495 15320072 17142982 19343137 21903725
18313 21903725 24862379 28050405 31429621 34956515 38702279 42569932 46736282 51797942
18305 51797942 58224145 66206173 75779186 86468745 97563033 108885656 120150915
18298 120150915 130269968 137097076 139673064 139080450 136721893 132485191 126106919 118470799
18290 118470799 110983852 104658148 99279503 94730995 90850801 87319206 83550141 79365051
18282 79365051 74890389 70557586 66333761 62418375 58833073 55836901 53666302 52213923
18274 52213923 51266539 50977720 51240853 51782138 52699980 53821601 55366144 57502960 60347298
18265 60347298 64017702 68726699 74424508 80875158 87706660 94708252 101893210 108945165
18257 108945165 115298300 120871468 126313651 132927134 141302979 151620711 164031780 178552218
18249 178552218 194491407 210550392 224372862 234526083 240305249 241026905 235213980
18242 235213980 223146792 207290855 190139565 173143563 156948371 142092182 129558003
18235 129558003 119660675 112194829 106209479 100696784 95429689 90378793 85800136 81639459
18227 81639459 77714235 74203979 71320008 68987105 67134222 65680517 64522542 63622465
18219 63622465 62727762 61774681 61031152 60306484 59583513 58930531 58478330 58312978 58453686
18210 58453686 58845784 58952360 58152536 56107389 53022713 49643202 46572338 44045017
18202 44045017 41790786 39852135 38104110 36469810 35033342 33749109 32614779 31495214
18194 31495214 30358861 29219633 28128743 27157667 26249386 25415103 24627694 23869182 23258552
18185 23258552 22865461 22573976 22341300 22094474 21917435 21867217 21884362 21904087 21962105 22040534
18175 22040534 22079231 22411126 22875275 23587177 24370553 25250283 26102400 26740985 26949883
18166 26949883 26920156 26464412 25708501 24824636 23791228 22801031 21995718 21226378 20525012
18157 20525012 20022603 19602509 19379050 19272183 18996807 18812944 18595957 18391989 18300677
18148 18300677 18276582 18098816 17994169 17947658 17972350 17937649 17893064 17797902 17624647 17584014
18138 17584014 17552374 17557740 17587664 17672203 18022069 18538609 19136098 19783953 20794211 22000925
18128 22000925 23141532 24481258 26166933 27939946 29813545 31992802 34444126 37060653
18120 37060653 39615940 41757563 43657788 45479203 47179019 48979034 51400559 55530804
18112 55530804 62458014 73181183 88497931 108500189 128395647 136769088 127364489
18105 127364489 111250191 100627767 96596820 96700832 99037560 102706363 107100338 112163718
18097 112163718 118831739 128004056 140438299 156214755 174702642 194811182 215109550
18090 215109550 233236195 246642974 253133616 251938143 244120125 231114178 214686760
18083 214686760 197143161 180701233 166862385 156119376 148426877 143144685 139431764
18076 139431764 136309213 132602430 127675663 121584660 115134182 108587573 102346917 96698292
18068 96698292 91811020 87953079 84891204 82534360 80795553 79645404 79038696 78788816
18060 78788816 78913276 79360423 80198890 81494445 83289594 85659816 88768270 92530542
18052 92530542 96773623 101344966 105927745 110427233 114270222 117203819 119797344 122652115
18044 122652115 126300119 131398009 137852230 145458153 153725775 161251527 166828015 169794481
18036 169794481 169632755 165568696 157155901 145652653 132874470 120059027 108030768
18029 108030768 97426668 88677851 81891669 76861465 72902241 69586189 66601597 63569044
18021 63569044 60539894 57558330 54848655 52331616 49992998 47848867 46006799 44488204
18013 44488204 43192678 42011971 40924519 39958450 39014392 38168740 37456799 36744239 35922074
18004 35922074 35170671 34303565 33428451 32428946 31247898 30046574 28763513 27626127 26509642
17995 26509642 25308479 24154132 22954176 21998774 21060302 20063468 19050711 18185716 17271154
17986 17271154 16476859 15692754 14943352 14327295 13714873 13072713 12464991 11794999 11133759
17977 11133759 10621447 10193137 9702152 9266211 8930787 8648520 8454815 8162519 7902994
17968 7902994 7782050 7648464 7393252 7169485 7094057 7133950 7117964 6948974 6778381 6649358
17958 6649358 6506489 6320509 6136891 6021343 5872085 5714716 5549203 5265760 5007101
17949 5007101 4806535 4601981 4410828 4235226 4032565 3981261 3972474 3816345 3726829 3664147
17939 3664147 3589877 3464884 3274720 3108829 2981160 2923221 2880030 2884020 2762882 2778289
17929 2778289 2810768 2872094 2909091 2917792 2829771 2816726 2821033 2881189 2882778 2851323 2826355 2931378
17917 2931378 3014903 3096298 3043066 3150512 3201224 3165559 3109894 3020143 2891990 2787007 2715581
17906 2715581 2664237 2517021 2356896 2273747 2349517 2291503 2163014 2015530 1999080 2072905
17896 2072905 2035258 1984066 1916651 1872533 1799939 1681115 1632853 1575932 1659801 1698378 1677322
17885 1677322 1713961 1575002 1522220 1547113 1533288 1637860 1582894 1554991 1644870 1618323 1610781
17874 1610781 1676670 1754310 1764398 1783497 1649263 1565232 1594642 1578650 1493329 1477567 1415762
17863 1415762 1415455 1447809 1469580 1439718 1374649 1376939 1372153 1263853 1276660 1260091 1210763 1192493
17851 1192493 1138028 1111917 1123532 1057374 1021645 961896 1040349 1065725 1100117 1071196 1074027
17840 1074027 1124251 1139515 1201347 1159389 1059129 1064590 993054 905145 842089 797683 827045
17829 827045 852188 863839 971095 994774 900295 844128 785728 763585 748202 769173 797911
17818 797911 783853 805538 772996 702205 699568 667686 605563 555191 559669 593578 697638 649815
17806 649815 678119 657501 597533 624845 626945 700798 790649 737476 745707 921517 960621 980507
17794 980507 1045689 1142991 1217784 1252029 1234608 1204021 1327506 1446128 1477437 1366624 1395228
17783 1395228 1428404 1288554 1142844 1018202 989619 1018935 1064114 1032195 952554 913845 930582
17772 930582 882850 830371 795641 733446 693000 664833 711203 711842 623355 638871 620450 636473
17760 636473 632840 702982 751709 714656 739750 764093 695387 723548 733926 775434 826859 807380
17748 807380 731225 712574 733228 739807 733939 851854 908680 952480 960547 950580 961679 1002429
17736 1002429 1016133 926040 841749 807713 740231 665244 655179 704312 718151 753302 780461
17725 780461 807403 650003 581781 604310 619793 595744 582365 590414 600939 573982 599540
17714 599540 598213 485546 438989 432451 369266 346036 367839 411547 392846 402500 356739 320721
17702 320721 321778 309011 204751 167757 282130 291677 265627 299511 348615 361678 333556
17691 333556 216657 241811 243725 288744 251217 261816 266229 254264 194978 189115 202692 193901
17679 193901 246793 272124 334497 273107 279822 277088 291691 222895 216239 249252 249741 192638
17667 192638 209803 244995 291103 305328 312850 372896 359412 310762 312498 322762 218467 179847
17655 179847 304483 400675 479164 548010 533882 590725 603927 518587 436858 380640 379856 352396
17643 352396 322834 315982 256251 265911 230492 261043 270696 300369 226237 141741 133914 161912
17631 161912 209628 302685 329184 369770 336998 281886 251872 301089 282109 211439 233799
17620 233799 195421 108621 38586 97381 202896 196760 201170 216477 242035 295927 291760 292712
17608 292712 201422 197094 226136 211304 178805 197060 136013 173990 346355 379938 375272 384733
17596 384733 411674 493600 688338 805364 811760 788843 835868 793646 798536 866476 955441
17585 955441 1005221 1055240 1133519 1077895 952849 842332 777509 709162 629993 525619 400783
17574 400783 328404 330882 380430 379019 404177 379521 421360 339220 345794 361190 371639 448999
17562 448999 485719 477800 461458 493993 406447 302897 332857 323297 395785 367279 339113 393157
17550 393157 413083 446597 530236 660297 733407 758776 843523 860402 801461 792005 861196
17539 861196 879250 787917 712678 705007 633371 540137 554409 599143 686927 708134 748922 816965
17527 816965 739515 654438 542741 423354 442535 478225 444288 384265 388035 361641 357665
17516 357665 325433 269624 296666 334812 296288 276022 357367 370769 293702 174222 95477
17505 95477 175726 231152 293086 260264 221425 191023 253779 344685 285058 175331 211098
17494 211098 149135 58196 36212 -20907 -4524 -21196 -32161 -34880 23104 72250 126520 90190
17482 90190 31445 -43656 -46232 51442 91040 137112 -2716 8221 -8043 28437 -16758 -65299
17470 -65299 -85169 -104970 -88324 -32339 -6072 53762 1700 49552 72493 56067 -11628 -47918
17458 -47918 -19401 60532 45813 134121 202983 188272 134047 29853 78159 86913 106241 172137
17446 172137 294096 341570 296653 373491 463174 533857 547830 457196 282627 126550 85480
17435 85480 150764 177510 186283 160077 102904 -82397 -14599 36070 88139 142824 85082 71352
17423 71352 130829 129891 79890 141545 44487 -62990 -30200 3012 -38867 -45176 -176601 -233782
17411 -233782 -247147 -166737 -132117 -94845 -65432 -128333 -114744 -111964 -130545 -159335 -189552 -159989
17399 -159989 -70481 -805 19419 -42004 -94683 -112756 -159836 -171539 -132834 -40070 -52986
17388 -52986 -41571 -147891 -193543 -178929 -63883 -23989 -24816 -22271 -83339 -180387 -136724 -55806
17376 -55806 -104915 -46045 -11268 -4090 -130077 -108789 -108160 -88881 -64835 -116921 -183230 -190901
17364 -190901 -154839 -176172 -123545 -174678 -235616 -184040 -141782 -193837 -254746 -235143 -121488
17353 -121488 -141771 -243086 -260940 -224647 -179547 -181757 -171047 -150583 -47165 2335 -84612
17342 -84612 -94503 42199 56805 66831 22542 -25850 498 -62549 -195108 -195527 -173558 -36527
17330 -36527 -31015 -192942 -163022 -180843 -244667 -197941 -125365 -6198 -55322 -32657 -10466
17319 -10466 -41081 -70865 -61606 -110692 -175873 -124162 -78452 -63939 -208798 -226722 -187124 -254604
17307 -254604 -150702 -79590 -121551 -125433 -118462 -160101 -68465 76980 40153 -67931 -84696
17296 -84696 -98610 -146037 -196550 -218208 -239787 -271389 -267450 -153464 -108203 -217816 -363670
17285 -363670 -301602 -268912 -188611 -114400 -86 34766 -103195 -184432 -75359 72621 118811
17274 118811 119163 57600 102931 190302 138555 41172 80547 26102 -2350 12305 -42869 -164617
17262 -164617 -137194 -36597 -58142 -84570 -86568 -114881 -105766 -98592 -88976 -43721 -117773 -220404
17250 -220404 -205345 -121396 -54510 -19396 -71207 -19001 -53080 -62509 -56342 -81309 -65063 -101204
17238 -101204 -113608 -186426 -302842 -238199 -100361 -80753 -106175 -96322 -111561 -110027 -71591
17227 -71591 -2357 -36263 -61179 -44727 77469 191049 113473 79895 67435 61453 -12458
17216 -12458 -116594 -150275 -149831 -112513 -123364 -96138 -67976 -23581 -50500 -179967 -178285 -122875
17204 -122875 -86589 -127906 -185675 -173719 -115413 -109339 -121809 -116649 -121335 -64879 -69809 -22315
17192 -22315 -64922 -109865 -133326 -127629 -84602 -98508 -138406 -110741 -138212 -178114 -90693 -91958
17180 -91958 -134065 -119653 -47402 -49036 -92799 -94545 -74246 -47615 -197263 -142790 -42906 -46862
17168 -46862 -58084 -3656 -19478 -31316 -172881 -259001 -183549 -175657 -132208 -146003 -80150 20218
17156 20218 -107656 -105755 -60012 -105048 -100092 -151907 -141246 -100632 -93527 -94324 -128083 -134781 8245
17143 8245 105342 59573 -74184 -107008 -110084 -82994 -33733 -8014 -48290 -137544 -144066 -133962
17131 -133962 -113585 -115099 -139035 -122293 -129677 -153009 -238105 -267766 -157565 -157043 -172616 -132219
17119 -132219 -160815 -207049 -115504 -2346 -58647 -172766 -122009 -34795 -92843 -39670 -10870
17108 -10870 42977 6179 -105598 -184809 -191642 -60857 14938 12984 29364 9630 -44597 -99960
17096 -99960 -69478 51918 78379 42776 121231 77870 22283 56375 26826 26076 -2305 2438
17084 2438 -102027 -66380 -9831 -6266 16753 -30340 -34001 -76345 -64219 -74824 -82095 -89449
17072 -89449 -162367 -173951 -82433 -8021 -27007 26250 90093 43908 25479 59232 -54940
17061 -54940 -119389 -85401 -66651 -4608 64583 40687 3395 -59290 -19775 -45731 -62099 -94282
17049 -94282 881 77806 -29696 -93979 -79846 -61693 -104483 -108598 -111680 -73713 -20052 22613
17037 22613 56937 148517 100834 34361 30830 -9870 -6075 -12775 -79469 -224761 -167643 -144350
17025 -144350 -165386 -189586 -152620 -150836 -154682 -128329 -156710 -169879 -116083 -64851 11060 15463
17013 15463 -99558 -72974 -116500 -117151 -98810 -115352 -68588 -14602 12799 -46691 -63147 -115098
17001 -115098 -101160 -46406 -1529 -10786 64963 3023 -77114 -164893 -191903 -137582 -77900 -105278
16989 -105278 -123493 -134263 -28746 96668 8404 -14650 46326 15169 -50910 -24227 -22494
16978 -22494 -11808 -69174 -251845 -245357 -122540 -2689 -72090 -148543 -152965 -187027 -188968 -174796
16966 -174796 -89355 62432 -8634 -32502 -13697 -3154 14249 -72707 -68969 -98195 -75694
16955 -75694 -26782 4029 -30067 -51734 4193 -15521 -57373 -35479 -5339 48546 11355 -69702
16943 -69702 -61666 -35208 -33077 -57018 -103727 -174282 -230050 -215496 -111983 484 -34157 -75319
16931 -75319 -105639 -138411 -107039 -121902 -196141 -153698 -121870 -146875 -138656 -162514 -126761 -115424
16919 -115424 -76826 -4347 -11915 28512 20057 -10945 -48936 -75640 -28418 -18036 -68873 -104891
16907 -104891 -102936 -188158 -220390 -177821 -37556 -145614 -168824 -158453 -137073 -52059 -46353
16896 -46353 -186748 -240543 -130445 -50760 -57336 -38083 11911 22255 -9887 -130801 -197245
16885 -197245 -336945 -356146 -191562 -110747 -50459 -98405 -98174 -78678 -72784 -64296 -23746 7318
16873 7318 32792 -48197 -79514 -23602 37857 18585 -20273 -60593 -138313 -302523 -286838 -191913
16861 -191913 -94879 -60427 -192572 -216533 -259130 -277862 -258445 -142618 -133726 -169413 -181952
16850 -181952 -152996 -133428 -159060 -103200 -109387 -100727 -94952 -56729 -32037 38869 1569 -79134
16838 -79134 -118526 -6765 -8491 -66579 -115514 -61851 12477 -39315 -152274 -169676 -93902
16827 -93902 -80894 -182256 -217831 -177817 -86553 -148235 -158368 -139459 -239240 -278729 -295083
16816 -295083 -292166 -304579 -189385 -91019 -15699 43516 86139 50369 43067 -76387 -172010
16805 -172010 -171843 -137348 -143761 -69467 -79447 -125616 -82556 -40024 -104490 -158623 -138581 -139223 -92174
16792 -92174 -23772 -44078 18112 4260 -49837 -107203 -92775 -33198 -43162 -116418 -147676 -98869
16780 -98869 -36991 21458 -21325 -40379 -153544 -113714 -57421 -66313 -144082 -221816 -144951 -20082
16768 -20082 33630 42983 29917 -4900 -83588 -43635 -15435 16634 119729 267053 191946
16757 191946 30304 -68709 -136521 -184938 -184346 -250351 -203455 -89436 -72033 6368 52368
16746 52368 67994 81933 65045 57229 -8563 -107103 -83328 -3961 37310 -17085 15740 90179
16734 90179 122338 899 -31999 -129252 -180066 -127902 -31201 53462 -14575 -41904 -29549
16723 -29549 -62815 -158623 -183617 -197389 -163994 -152971 -132270 -69280 -2587 38930 4735 -99009
16711 -99009 -247799 -311660 -227901 -199993 -147314 -102864 -105146 -93109 -51626 -35293 14748 1229
16699 1229 -49725 -17443 8449 -40503 -135809 -113379 25801 49633 -34092 -187222 -151839
16688 -151839 -115034 -117662 -103672 -137964 -159766 -116812 -42927 -8476 -33359 -4029 13086 15448
16676 15448 3671 -48240 -29986 -25822 -120700 -177925 -57411 845 16787 73955 86865 96295
16664 96295 6039 -11555 19321 6267 69217 129847 -8159 -19790 4946 21737 -100992
16653 -100992 -112300 -18950 58621 -48811 -100882 -105372 -92993 -51487 -32553 -125710 -136554
16642 -136554 -87641 -14961 40759 36065 49028 103036 102581 85240 33772 -99095 -21467 50746
16630 50746 52142 -21944 3139 -94924 -158509 -131231 -106663 -127138 -45031 -58364 -138364 -89783
16618 -89783 -128517 -158664 -73666 -30803 -86772 -13622 -52581 -166133 -212941 -187678 -186366 -160419
16606 -160419 -152580 -49315 11282 -87169 -144233 -236260 -237057 -283215 -267388 -288821 -304211 -300898
16594 -300898 -202490 -147220 -183521 -164254 -138169 -221271 -190286 -179799 -219653 -272610 -289119
16583 -289119 -267984 -146259 10139 49102 -13692 -40023 -6862 -113012 -128774 -139021 -150665
16572 -150665 -52372 -51804 -76530 -76360 -48999 50134 102538 11797 -44696 -129793 -77708 -93632
16560 -93632 -203377 -162777 -24692 57461 29054 70376 -12093 -110339 -71171 -112688 -36621
16549 -36621 -73317 -78644 -34761 2925 -125669 -193323 -196622 -122159 -162168 -152499 -124793 -24150
16537 -24150 46313 63007 18222 -86916 -99319 -195359 -223470 -134393 -118733 -240434 -207393
16526 -207393 -174932 -58322 36575 -14158 -35242 -18221 55698 86305 21067 -8828 -113896
16515 -113896 -193916 -205074 -126500 -109815 -166515 -144306 -114187 -134856 -119865 -70466 -143720
16504 -143720 -155086 19824 118644 16605 8392 50987 109847 121155 13846 -32866 -61013
16493 -61013 -119878 -243752 -255931 -154125 -94054 -119594 -181825 -113819 -48870 -8594 -120499
16482 -120499 -186404 -117871 -126438 -180919 -204606 -115508 -75709 -38295 -93273 -126752 -100034 -87681
16470 -87681 -75249 -11862 2904 16500 -24017 -45001 -88050 -96002 -60030 -32903 -51626 -81443
16458 -81443 -97769 -109808 5823 64977 -6131 -22075 -74129 -88107 -164196 -213934 -162008
16447 -162008 -173463 -155739 -125846 -77639 -93446 -141786 -153021 -172131 -175520 -232725 -190110 -100567
16435 -100567 -54474 -10441 20299 -65843 -182338 -162894 -119735 -62942 -71218 -97808 -108859
16424 -108859 -198964 -262949 -151228 -24814 357 -377 2530 -22199 -25672 -3265 -46091 -155807
16412 -155807 -212163 -190673 -210338 -212908 -193280 -134217 -73118 -3469 20350 -9761 -42387 -62958
16400 -62958 63010 145290 104459 15056 -27805 22677 51939 -13580 -102390 -130243 -82032
16389 -82032 -6787 15752 92790 53749 -22759 23658 -13687 21778 39414 63756 -18548 -79188
16377 -79188 -58330 -55903 -46832 -59177 -33401 -57090 -84339 -137370 -212808 -169843 -137233 -39218
16365 -39218 -22218 -27285 -8152 4552 64298 -38302 -83433 -40160 -26176 27480 37170 -34001
16353 -34001 -111393 -111653 -77520 -65821 -129028 -99299 -7669 14792 -29831 -145153 -88145 -22076
16341 -22076 -101928 -151948 -63182 -37133 -83156 -45410 4286 -43002 -109941 -113150 -35463 -49877
16329 -49877 1451 92018 128830 77045 16384 -784 -19204 -135563 -195109 -118693 -84534
16318 -84534 -56752 -38542 -81106 -172191 -75097 -40281 29453 6434 37557 73291 40118 -12189
16306 -12189 78083 125034 50868 83069 129486 154392 168407 156254 141214 220312 232532 246542
16294 246542 255261 185370 158351 96032 158021 137833 195949 174831 147936 215787 235017 188178
16282 188178 146026 116359 27608 17497 54080 35900 40653 86633 -20387 15347 72561
16271 72561 78113 98019 -7377 -88916 -44051 22034 15200 9600 17256 82319 64071 52670
16259 52670 168633 118635 23498 202149 262809 180217 158020 227393 188853 125477 161522
16248 161522 210985 256297 347160 403109 283024 159669 29733 -15243 45667 54094 23559
16237 23559 34238 -1935 -55271 -53950 51702 49718 66537 85572 41107 26920 23793 -38274
16225 -38274 67606 70103 64099 81752 112467 121421 73649 4125 80218 206892 99744 63525
16213 63525 -46366 -146300 -49936 -35035 -80791 -9958 -16045 -35915 -23030 -56329 -32737 -10964
16201 -10964 424 -35203 -22621 37675 -29724 -67629 -83549 -136479 -103637 -84278 5724 118442
16189 118442 137477 203054 157772 154068 163157 187459 255511 237695 177078 105801 82056 25003
16177 25003 -59331 -65091 -86969 -93506 -125055 -157279 -140198 -78334 -59068 -85922 -96598 -80919
16165 -80919 -36800 -29283 -65518 -85990 -18081 88204 172631 183542 176022 103273 64725 20508
16153 20508 46926 93576 -37064 -50951 -32330 37799 94132 107421 112155 80276 13685 22514
16141 22514 28437 -71458 -82251 -64314 -61677 -66659 -111545 -33493 33041 704 -5374 -79233
16129 -79233 -169165 -108051 -61684 -91840 -214142 -279597 -241968 -184897 -122830 -44484 26920
16118 26920 -23819 -110788 -104701 -180826 -197222 -133193 34987 53100 35318 -27288 -30358 -75490
16106 -75490 -102319 -173846 -195632 -163809 -188211 -163159 -127833 -118736 -167408 -195411 -198663 -162628
16094 -162628 -71506 -15720 -170842 -147598 -93481 -45645 -85843 -75936 45307 124109 33822
16083 33822 -94113 -167419 -151632 -94037 -71261 -60706 -88078 -130761 -137345 -145348 -137834 -183827
16071 -183827 -86244 8524 6170 -65628 -89203 -53688 -49603 -96366 -154028 -229409 -204810 -169110
16059 -169110 -156833 -139409 -84281 -50249 -13773 -91499 -205615 -258208 -240693 -146069 -113975
16048 -113975 -189591 -177679 -125538 -83189 -46171 -39 32732 -49234 -82043 -14316 25684
16037 25684 28931 11315 -63575 -42834 -30877 8258 -72969 -105434 -133899 -139160 -110668 -84290
16025 -84290 -128297 -138236 -137806 -73044 -76859 -23092 -105808 -137601 -109868 -66256 -14894 -441
16013 -441 78172 108550 85941 30913 11895 -63538 -158829 -139669 31768 121646 113483 33581
16001 33581 -69829 -125080 -123046 -153165 -137835 -85803 -59400 -104417 -85029 -59350 -89799 -144833
15989 -144833 -157612 -84723 40997 1678 -9647 -94211 -162773 -159978 -33031 -19338 -27111
15978 -27111 -1354 -70370 -172146 -124455 -144576 -152665 -148333 -144468 -92524 8001 20618 53329
15966 53329 98899 48479 -42597 -61410 -116369 -335 27890 675 -8248 -104104 -142232 -106941
15954 -106941 30935 -46377 -129176 -113607 -111942 -160413 -102617 -95620 -131052 -180464 -228853 -196968
15942 -196968 -144416 -92506 -95143 -135359 -121070 -180765 -79145 -27461 -140449 -202014 -127817
15931 -127817 -63119 -32337 -75802 -66564 -71606 -80520 -28903 72827 158846 83423 62825 4428
15919 4428 -129465 -129353 -1033 -5532 8193 -20203 -85859 -20069 3067 68114 55972 -58810
15907 -58810 -138709 -84498 -38313 -35648 -64718 -93939 -10771 -18296 -66461 -95536 -157166 -156952
15895 -156952 -118219 -87382 -84570 -33603 5404 -73588 -83245 -85749 -44747 -53792 -116394 -218069
15883 -218069 -259335 -238050 -156951 -26870 -24064 -32881 -69083 -49218 -33126 -27245 -82960 -29979
15871 -29979 -118183 -201738 -171977 -105145 -103557 -76179 -68187 -63654 -74065 -61144 42694 42692 57675
15858 57675 64353 -24392 -149487 -63571 -59317 -47937 -46658 -55172 -18813 -16642 -28027 -58951
15846 -58951 -11700 -58429 -72922 -7474 -24870 -73680 -45420 14138 70487 -2026 -94682 -40056
15834 -40056 -67155 -185084 -206669 -144895 -115923 -71698 -102816 -62415 -44024 -53622 -64907 -93002
15822 -93002 -48710 -27250 -93396 -181312 -178730 -199873 -210602 -168965 -172339 -166903 -180372 -200373
15810 -200373 -297276 -234935 -183803 -165378 -207717 -128296 -98638 -124958 -122198 -97852 -120376 -152155
15798 -152155 -136903 -141651 -153414 -128799 -35999 7562 55294 -23454 -52561 -21029 -48679 -61890
15786 -61890 -102707 -96743 -125645 -205255 -228228 -152013 -136362 -110642 -19811 26310 -31158 -50411
15774 -50411 -9277 -30100 -25719 -70272 -102786 -89951 -105151 -180642 -120724 -99306 -128575 -93403
15762 -93403 -42938 -56848 -111617 -126964 -90560 24643 96680 35041 -71077 -113528 -105871
15751 -105871 -165353 -149166 -68697 -54748 36296 112346 119550 93990 16655 -26352 -98219 -146902
15739 -146902 -131058 -122740 -176706 -202239 -178899 -129408 -148159 -184551 -215542 -214342 -232541 -197696
15727 -197696 -57462 -13802 -38394 -133632 -148050 -119223 -131241 -107534 -70629 -28466 44569
15716 44569 13067 6133 -13926 -61968 -45193 10021 -52342 -139103 -125230 -131674 -151088 -202127
15704 -202127 -210112 -146652 20009 103545 -12209 -51595 -64863 -44459 -21387 -51035 35827
15693 35827 32514 60204 18293 -5072 12831 42126 19416 -14630 8815 -98424 -206803
15682 -206803 -152441 -124268 -14329 -43748 -47120 -104957 -61538 -29284 -113427 -112127 -179395 -175264
15670 -175264 -110244 -103935 -71116 -39225 17920 26499 -45820 -85294 -60231 44237 57099 61804
15658 61804 -35064 -118340 -83152 -69426 -33119 -17018 -73564 -144804 -202829 -112222 2878
15647 2878 -84877 -137749 -85474 -34432 46836 -37903 -115523 13867 17755 -53195 -111287 -33181
15635 -33181 -546 -83463 -92783 -99701 -142927 -140708 -58197 -53537 -26819 -52667 -108725 -142213
15623 -142213 -78186 -139557 -189242 -67682 2656 -6503 -80869 -164427 -188011 -109439 -104553 -209096
15611 -209096 -218532 -64295 26340 14170 78880 109386 89480 12146 -72221 25274 -59241
15600 -59241 -141244 -156599 -133942 -34234 -65892 -103859 -48679 -17198 -26532 -71320 -54518 -130277
15588 -130277 -138196 -97541 -112326 -165877 -234753 -208034 -148187 -140982 -109670 -122405 -48313 -23222
15576 -23222 -79873 -46569 27405 -17329 -59595 -95599 -121248 -153898 -122050 -33238 -59773 -101709
15564 -101709 -219872 -225686 -185026 -78331 -4777 -8340 -25091 -90136 -50465 38243 55571
15553 55571 -36005 -58014 6120 95722 102338 66577 19192 -88397 -79652 -74072 -79546 -101501
15541 -101501 -90846 -50413 -112923 -108338 -84898 -25380 -7320 -92099 -83616 -16541 134011 118903
15529 118903 79811 27301 -126333 -152668 -54579 17947 -22923 -19397 65115 140459 152249
15518 152249 208099 204734 91866 65196 73931 75344 89920 86099 66046 -13136 -51737 -33028
15506 -33028 35415 68123 46242 98512 122810 107967 125576 84419 83678 166608 151463 134897
15494 134897 77674 132536 143682 106746 67065 115505 231423 206000 225833 269135 306830
15483 306830 315599 247427 257623 332024 435428 571951 681011 683422 708270 720925 794991
15472 794991 876757 956997 1146313 1340227 1623449 1772143 1967022 2132052 2228648 2369918
15462 2369918 2452800 2472775 2372394 2202311 2034511 1835345 1656874 1491423 1408600 1361370
15452 1361370 1174042 1087128 1073791 1055607 972022 934738 898530 819756 742228 657777 629019
15441 629019 575588 586557 605860 640427 595765 564520 724900 781251 737474 758710 774714
15430 774714 700054 682605 569436 526860 542561 588757 578591 587484 554058 448028 326642
15419 326642 346457 370190 321062 363046 388455 410473 380481 287913 360154 306169 257814
15408 257814 300414 304567 271067 164905 225344 237899 235085 190788 117958 128383 180259 151640
15396 151640 128218 199557 228644 246201 231351 233518 181618 155924 164069 139457 151517 125970
15384 125970 151377 238667 315654 325446 272556 237378 258006 245304 193424 125934 51596 63322
15372 63322 41870 58278 72236 70437 28999 -11407 -70939 -38848 -32416 -49 16610 36785
15360 36785 79203 108587 70059 79129 58325 170286 251118 239901 259620 296981 307045 295457
15348 295457 299643 254906 220980 262598 257216 225910 239440 254094 311845 292422 291524 300447
15336 300447 372095 424784 408826 321701 330434 383084 430954 359514 414574 431982 399121 283230
15324 283230 208653 210159 124520 94004 86206 40403 -89301 -124686 -38650 -95117 -113943 -118298
15312 -118298 -84975 -104840 -79291 -57930 -135758 -168436 -186267 -261436 -196125 -119793 -7108
15301 -7108 -2088 -124863 -215172 -144655 -101129 -133687 -206668 -167210 22239 121431 104316 93013
15289 93013 181999 180899 73400 113799 182285 166343 116483 133976 235750 302342 343818
15278 343818 375174 448576 522465 529031 612665 772428 790326 735138 737594 613245 474109
15267 474109 326155 292609 257834 197575 69270 17331 -1415 100997 119336 132934 101013
15256 101013 5792 18023 10781 -25696 -79310 -182481 -236500 -172183 -214926 -283108 -251712
15245 -251712 -236365 -250738 -284872 -301328 -286950 -161861 -98131 -121698 -54000 -33325 -40783
15234 -40783 15001 -2185 -39765 -74626 -31890 7903 63777 139617 158040 152077 184448 258221
15222 258221 213755 53220 55714 184265 194357 252037 303766 314737 306451 230461 202093
15211 202093 267512 299271 260828 206191 218224 204367 213435 234666 175926 136898 162008 114469
15199 114469 132936 92847 27423 -69842 -67683 -115612 -154923 -161945 -203920 -276783 -199446 -132422
15187 -132422 -79370 -31900 52156 116563 163232 133828 16592 66596 110826 75541 22754
15176 22754 1700 1081 -12649 -6708 -33272 -89434 -53215 -59709 -94857 -90835 -162197 -110787 -2874
15163 -2874 28243 19916 24989 120811 204933 150567 46166 132402 168544 194793 232162 199641
15151 199641 250512 284465 315207 327846 341000 295388 244278 195319 207904 275046 288084
15140 288084 281020 202875 129207 87426 85631 87245 239552 279464 210333 197203 127610 163031
15128 163031 147645 113954 137743 187575 146083 236389 343559 403811 468706 588135 690287
15117 690287 780485 831416 850271 896977 1036863 1143985 1241801 1411578 1507311 1572802 1660512
15106 1660512 1782209 1864653 1878529 1811781 1874693 2008539 2273693 2433096 2603018 2642888
15096 2642888 2673276 2823022 2942774 3075270 3191697 3190021 3245937 3347862 3347010 3253109 3265876
15085 3265876 3335529 3370063 3415517 3441053 3587383 3664251 3663940 3819957 3926368 3932809 3941047
15074 3941047 4023267 4057344 4130777 4267809 4340614 4442787 4511160 4635313 4853250 4977739
15064 4977739 4992466 5071482 5138624 5346165 5613995 5788049 5983690 6249961 6513303 6807733
15054 6807733 7205508 7680468 8220093 8848606 9527353 10414604 11457568 12514981 13630845
15045 13630845 14874113 16324964 18129432 20388182 23128537 26353324 30185438 34936799
15037 34936799 40704036 47582890 55373943 64282792 74523683 86095076 99458345 115294988
15029 115294988 134113264 156804557 183907316 215770767 251905651 290652600 329974025
15022 329974025 366788235 397913048 420275031 431455013 430338096 417469260 394511622
15015 394511622 363991793 329155093 293203695 258935944 228181510 201904263 180336795
15008 180336795 163071889 149483616 138680670 129865405 122434835 116115838 110614035
15001 110614035 105873797 101621597 97722004 94277868 91365125 88909625 86772218 85027737
14993 85027737 83652354 82640346 81761337 81000950 80323711 79537966 78637070 77541299 76036845
14984 76036845 74177448 72085585 69743230 67239523 64477774 61518747 58458233 55505230
14976 55505230 52567834 49761810 47139387 44609357 42108208 39831236 37731003 35855904
14968 35855904 34074164 32387694 30767335 29276816 27860509 26458725 25116468 23807279
14960 23807279 22606862 21486303 20316361 19346622 18411409 17498765 16587459 15746001 15016964
14951 15016964 14289909 13625267 12962515 12361893 11790745 11259123 10688465 10142711 9753252
14942 9753252 9342517 8922737 8516809 8151788 7750779 7407956 7074990 6787462 6520594
14933 6520594 6248375 6026855 5767669 5484605 5271110 4975868 4756283 4576414 4442088
14924 4442088 4323874 4113822 3979085 3876134 3630199 3447495 3378005 3330127 3173609 3044308
14914 3044308 3002570 2822144 2647248 2587365 2505596 2431277 2362061 2334940 2264087 2134992 2065696
14903 2065696 2084551 2253358 2307397 2378835 2418444 2349160 2362725 2350252 2324255 2288399 2261046
14892 2261046 2150317 2150212 2092567 1965156 1845649 1630185 1559077 1619866 1468237 1340880
14882 1340880 1344937 1342884 1244677 1090951 1049631 1045380 1167462 1208280 1203524 1220705 1217526 1169593
14870 1169593 1176158 1246043 1205855 1225004 1262166 1273006 1231149 1259743 1326463 1330302 1355247 1406013
14858 1406013 1515326 1567332 1547635 1631198 1658310 1707107 1777581 1868700 2028245 2039338 2051170
14847 2051170 2132949 2149214 2147862 2147502 2092528 2064162 2011731 2012540 1965713 1932556 1907642 1905869
14835 1905869 1750459 1600763 1571941 1526948 1621758 1611187 1635001 1631599 1550175 1567237 1662891
14824 1662891 1649704 1643335 1572041 1497522 1479034 1583684 1566153 1531425 1485110 1434738 1380651
14813 1380651 1420494 1388358 1350624 1291010 1244941 1262845 1331277 1347299 1313994 1264452 1203882
14802 1203882 1171986 1121954 1144982 1214650 1173136 1115019 1071279 1051442 1009568 964058 887813
14791 887813 783952 838056 844298 746295 725875 808829 920835 1014852 961192 924967 925447 858455
14779 858455 805007 960923 1048936 989601 1018338 1012428 1117485 1226077 1214247 1187626 1161716
14768 1161716 1091287 1174293 1218054 1175400 1177468 1212605 1197428 1091632 980532 902482 836235
14757 836235 742988 721801 854408 894730 906833 900608 875213 851182 799791 748948 739954 773315
14745 773315 787895 711512 672911 712017 709698 733002 734861 729227 723840 678545 711440 787492
14733 787492 903966 922068 916479 765518 630427 782987 849907 812783 842101 807326 773964
14722 773964 868259 887439 878349 889650 809261 701755 520959 422760 402877 346208 285608
14711 285608 368815 451663 501418 566109 545361 481740 467661 417588 401145 418472 465505
14700 465505 541239 595060 511118 504571 578135 631449 662238 694678 682847 738584 796800 808770
14688 808770 776030 757940 706693 713700 740230 818137 770976 712784 664647 645215 610820 567067
14676 567067 521124 548066 617116 708143 803451 727565 616888 580725 667894 768439 740392
14665 740392 785588 929193 987763 952183 914188 918997 950130 949175 1017605 883460 826738 799894
14653 799894 793308 836255 774959 819818 833568 791174 757513 820576 721317 639604 582691 598519
14641 598519 586344 568194 552985 518417 473571 496208 578873 581005 524133 402446 436520
14630 436520 424943 395451 435381 433583 457859 559600 572169 447911 399841 351256 273623
14619 273623 282904 298189 309451 352523 266707 314049 300791 287510 283698 327650 330072 340910
14607 340910 346722 378035 292033 143408 139794 233604 317564 301789 341495 351192 355262 375679
14595 375679 360862 399871 403029 316842 278125 337743 363269 373814 341050 461225 560121
14584 560121 645072 764630 927413 1140810 1219222 1284292 1403312 1491574 1673845 1855393
14574 1855393 2131945 2318470 2543635 2798499 2881366 2909477 2903951 2962928 2883471 2678228
14564 2678228 2449750 2300070 2065905 1801075 1594124 1461310 1355816 1277973 1167475 1081008
14554 1081008 1080183 986437 894776 884510 940589 1035125 999364 951719 949838 959435 1095461 1244854
14542 1244854 1291997 1219816 1133411 1134179 1053983 966040 867607 857466 891234 889114 879310 874942
14530 874942 954760 987652 903578 898464 996161 949367 928946 1013303 1039877 1002089 1086652 1157267
14518 1157267 1214356 1249996 1240631 1093268 979800 837465 819750 739747 623400 562951 585521
14507 585521 665345 608721 507332 406186 320358 339917 444190 541584 671903 661162 530041
14496 530041 419275 398908 348881 286764 287870 341291 390914 489631 540154 535775 641339
14485 641339 718595 771539 835276 839149 911499 918464 1009523 1208628 1375447 1573375 1897402
14474 1897402 2114728 2305500 2345965 2412243 2442274 2365987 2218939 2173937 2060816 1908437
14464 1908437 1780518 1612695 1470858 1476042 1330749 1075828 916917 878230 995100 960204
14454 960204 834532 728809 670512 623477 612889 664988 751219 786081 801404 763895 591654
14443 591654 442542 465560 548076 520912 506191 538149 545502 565610 618690 623724 685684 727953
14431 727953 706974 735210 695045 659282 609213 581250 445930 364126 473273 479831 517599
14420 517599 584765 569344 533873 464359 488910 481987 470418 418854 422788 358710 303967 389196
14408 389196 496261 513118 544009 392017 295143 220839 187190 162868 179780 190612 121967
14397 121967 78249 53460 144612 209365 178389 123710 115059 137206 154017 248272 308536 294659
14385 294659 324757 329045 304567 242163 141319 59789 127733 158195 146330 164255 106069
14374 106069 112728 167307 265342 309471 236394 128004 88662 15635 -3371 39782 82362
14363 82362 124570 216546 296775 294481 332181 385924 300802 204716 221688 237226 158485 146826
14351 146826 208338 299483 293285 261944 216848 224733 160703 202820 299446 453852 359320 315331
14339 315331 419517 415166 309982 385624 460961 472797 467807 381073 458520 450236 398101 352353
14327 352353 360870 417718 383181 344488 190966 97925 -21722 29761 158563 168999 114461
14316 114461 46330 11379 -761 -18432 37190 63079 95436 69490 13674 18613 50031 157419
14304 157419 190994 118574 124006 72475 17450 106244 104944 56568 25620 -42585 -86913 -68372
14292 -68372 48994 126085 174171 266343 365118 344076 255313 378281 464396 428607 431101
14281 431101 478237 564616 687017 768158 783630 740371 718042 718469 524644 399445 396515
14270 396515 408977 300275 201353 142930 151721 144529 183413 202911 78922 -1826 59325
14259 59325 44176 69429 76629 41654 2810 -9547 -18567 70666 87811 -24825 -25712 8319
14247 8319 21692 47331 -13341 -101354 -167759 -223139 -201415 -228486 -117020 -66279 -151355 -193863
14235 -193863 -77964 1810 -41534 -110402 -3012 51379 169371 181916 270353 285211 175508
14224 175508 139580 257853 279996 359504 440941 469837 439814 414925 470677 581862 724478
14213 724478 794341 855858 908937 894579 840668 1010050 950393 883217 884395 957760 930531
14202 930531 911928 917217 820303 776969 692126 610281 512511 555908 596791 591414 522610 471693
14190 471693 344054 226378 202273 306056 308303 364704 398331 389345 360002 251562 201067
14179 201067 155046 127822 148980 169148 207808 141299 102216 282917 298155 271395 193136
14168 193136 209784 145311 149231 189773 272349 337065 362790 424418 369164 350325 343662 504872
14156 504872 562663 568051 592935 660393 692503 809949 829980 821070 830959 936494 976041 1032019
14144 1032019 960083 952763 1052531 1197187 1230444 1198144 1208957 1221848 1312878 1363847 1459103
14133 1459103 1602157 1783294 1890967 1827811 1892815 1801462 1770499 1696588 1618871 1555900 1601884
14122 1601884 1516268 1476659 1461725 1430436 1467164 1601097 1816592 2010243 2068971 2084095 2135656
14111 2135656 2164582 2221246 2206152 2206322 2242648 2358700 2444933 2534728 2579677 2612574 2753178
14100 2753178 2871158 2930637 2974421 2956689 2927188 2942156 2927721 2922290 2964773 3054270 3080656
14089 3080656 3129485 3180582 3262806 3419575 3524033 3703791 3842426 3764750 3793562 3924277
14079 3924277 4011649 4116952 4125413 4199396 4271748 4378435 4505629 4630307 4780731 4907492
14069 4907492 5062631 5102027 5114328 5252627 5462682 5627662 5854057 6173142 6487583 6780320
14059 6780320 7245619 7698801 8188763 8582216 9104886 9722246 10412868 11276376 12177458
14050 12177458 13152353 14181635 15398636 16849970 18594269 20833180 23698390 27213416
14042 27213416 31509997 36736463 42957938 50310861 58914199 68805366 79973610 92750725
14034 92750725 107624086 125245639 146626795 172521264 203031244 237827063 275595081
14027 275595081 314112987 351154814 383894480 409523817 425427945 429855127 422315978
14020 422315978 404104351 377651262 345752192 311211432 276437013 243836153 215052609
14013 215052609 191024574 171801051 156740767 144962787 135590327 127895380 121471829
14006 121471829 116051625 111509850 107689426 104529463 101977336 100205720 99075769 98661375
13998 98661375 98886453 99892110 101383971 102884045 104047903 104527030 104665098 104911180 105308834
13989 105308834 105682054 105792562 105294473 103903661 101519640 98057486 93792306 89019925
13981 89019925 83879688 78646079 73550552 68741122 64425765 60510445 57094195 53977537
13973 53977537 51091293 48443967 46031210 43755446 41737635 39808550 38021357 36442024
13965 36442024 35080489 33836161 32654041 31516005 30518664 29680934 28869651 28137267 27507146
13956 27507146 26900872 26336878 25741104 25088189 24409718 23688978 22940193 22189633 21303094
13947 21303094 20405358 19523172 18790712 17937942 17130561 16269915 15449050 14752297 14090664
13938 14090664 13408430 12777696 12189472 11566897 10979264 10526060 10118479 9609371 9233371
13929 9233371 8949023 8692349 8459183 8218255 7853909 7583297 7331952 7115850 6902556
13920 6902556 6746408 6538493 6300818 6074425 5871506 5785233 5771381 5704215 5683945 5629191
13910 5629191 5457684 5350689 5288009 5203194 5076802 5022261 4933543 4853632 4763929 4647817
13900 4647817 4496432 4410651 4322361 4174662 4055911 3869161 3700104 3644218 3520590 3341001
13890 3341001 3180611 2967480 2753955 2670734 2530797 2405571 2385363 2376554 2244851 2239460
13880 2239460 2230018 2179928 2101868 2089457 2174393 2252967 2226561 2184552 2285098 2269547 2187070
13869 2187070 2118082 2136081 2089798 2016084 2081488 2199885 2235207 2295962 2328795 2343845 2360081
13858 2360081 2278796 2233743 2335107 2508010 2650682 2785984 2711088 2668173 2730771 2740729 2644535
13847 2644535 2673128 2695126 2675539 2591020 2485877 2472019 2438690 2317865 2227771 2216146 2150991
13836 2150991 2109204 2036646 2040149 1968013 1904132 1866621 1860175 1955075 1974951 2018597 2071656 2090281
13824 2090281 2002185 1890173 1914901 1945254 1903562 1872729 1802241 1712629 1792739 1795199 1844989
13813 1844989 1917098 1910852 1864486 1830327 1782432 1712958 1635202 1713682 1697392 1589807 1580740
13802 1580740 1576787 1554323 1524712 1528946 1596187 1631348 1511595 1469929 1476663 1433189 1410263 1324726
13790 1324726 1262000 1308352 1260924 1198931 1246700 1312669 1337102 1378859 1430480 1339915 1368770
13779 1368770 1302897 1294811 1378645 1430064 1562656 1674564 1602193 1511823 1470052 1555323 1558219
13768 1558219 1577327 1514660 1488471 1439408 1495456 1505686 1411045 1366833 1344846 1239523 1279831
13757 1279831 1376384 1322520 1299978 1306825 1349117 1411659 1496486 1518189 1439510 1313945 1246728
13746 1246728 1210313 1194142 1081643 1066998 1118805 1213228 1153174 1235535 1251848 1237767 1168870
13735 1168870 1180509 1159904 1134074 1135918 1172624 1247871 1344498 1289797 1400351 1481955 1401590
13724 1401590 1451220 1521437 1446490 1404843 1435922 1527521 1645085 1648204 1552772 1517000 1470532
13713 1470532 1448697 1442017 1418259 1365773 1316572 1210715 1120695 1081128 1028570 1009264 1040441
13702 1040441 1030591 1030707 1101301 1155758 1253370 1208286 1177518 1147658 1153274 1264667 1364677 1346830
13690 1346830 1317582 1175355 1166832 1283132 1339329 1290167 1209558 1223865 1362775 1455469 1440862
13679 1440862 1485864 1642162 1739817 1816824 1827710 1887667 1919777 1940825 1956994 2051061 2157271
13668 2157271 2261100 2365341 2434632 2422558 2508231 2558079 2605976 2656887 2621740 2590288 2580405
13657 2580405 2507344 2389343 2377384 2352970 2306783 2230685 2204580 2134602 2059342 2035206 2052893
13646 2052893 2015878 2001437 2028843 2013553 1961403 2014490 2068098 2101857 2153004 2177287 2085881
13635 2085881 2046175 2074294 2071266 1995061 1917740 1961147 2061035 2094480 1983545 1869970 1809780
13624 1809780 1664404 1522864 1436426 1496129 1637091 1604791 1552721 1434852 1349776 1347370 1367872
13613 1367872 1392392 1389570 1388982 1357522 1327809 1293132 1255980 1247638 1189003 1117787 1075836 978791
13601 978791 919695 920033 1039995 1081488 1098581 1090566 1040233 952027 936454 1096604 1178927 1193912
13589 1193912 1132338 1104277 1145917 1225697 1158350 1137823 1191692 1203508 1215773 1326998 1415546
13578 1415546 1544949 1676080 1914018 2102298 2247305 2431823 2572761 2837665 2938969
13569 2938969 2938593 2875185 2874095 2883378 2793888 2648909 2459713 2247462 1991225 1874550 1784025
13558 1784025 1664452 1500062 1488680 1537672 1487860 1430953 1418280 1472504 1490664 1561002 1503914
13547 1503914 1578109 1680533 1641956 1684292 1784410 1838635 1940812 2132698 2247358 2337601
13537 2337601 2344573 2333975 2294110 2210504 2152976 2212348 2263688 2302848 2293581 2259039 2266417 2307477
13525 2307477 2383602 2488629 2500649 2411577 2253967 2000932 1972709 1968702 1880812 1765733 1585744
13514 1585744 1461378 1409806 1405679 1373053 1313972 1238558 1207900 1055015 1048236 1136962 1088536
13503 1088536 1029771 963852 960213 1066005 1042971 998132 1004471 1046275 1042883 984307 912775 935883
13491 935883 884895 802369 787377 770181 771613 702447 737889 791240 799138 748469 621560 583404
13479 583404 583071 558395 607759 628139 582790 569770 494273 511722 525897 527710 554851 486774
13467 486774 515860 579410 542693 545610 530918 531693 510985 451684 485654 596042 603189 662219
13455 662219 623796 615684 655238 702965 715274 735196 790516 812120 852714 886997 907518 877800
13443 877800 923553 989112 1117243 1229139 1318738 1383466 1452506 1541953 1603794 1781266 2014979
13432 2014979 2140781 2113861 2088238 2093402 1969144 1757512 1574038 1482818 1406277 1272361
13422 1272361 1181822 1133395 1085096 1122087 1038507 1026635 961399 985190 991857 946580 885159
13411 885159 776555 824752 885243 911255 1073046 1182935 1140101 1141971 1206426 1404041 1510725
13400 1510725 1620963 1735949 1903249 2048672 2157262 2244499 2267891 2128484 1910864 1766259
13390 1766259 1661405 1490465 1332633 1171626 1044079 890614 854538 870742 936056 996789
13380 996789 863171 759717 686301 718291 758514 811879 833873 847783 686806 624448 814417
13369 814417 772130 639503 572920 595090 685915 742889 700572 599228 619852 643276 560749
13358 560749 562899 564546 494697 483230 410133 386011 493868 509928 535048 458000 506354 400533
13346 400533 311182 294989 283906 240867 259337 335408 390205 478457 449967 436488 379775
13335 379775 394673 343719 304433 204233 181498 125477 214473 222714 161889 76761 89362
13324 89362 30461 49256 169240 209161 196041 236168 265114 265434 272000 245749 244861 333424
13312 333424 350538 313840 349261 368165 319569 267167 235060 289863 380415 418339 376383
13301 376383 441922 426473 387345 491348 546876 557727 629500 788435 779819 703777 600619
13290 600619 623130 664633 655602 661078 610327 581390 506095 547475 520586 413614 333716 314179
13278 314179 313332 348421 414592 468621 467039 436864 446888 464632 485064 407695 378893 438455
13266 438455 436908 482147 454707 456333 409504 345641 341810 346751 439685 441762 400844 327450
13254 327450 234608 127129 92412 48863 126897 273399 364803 385104 303330 206897 57632
13243 57632 87951 136074 127037 111480 189682 220741 185526 181870 253719 190687 157679 183969
13231 183969 234358 250281 280203 330479 324445 303515 266436 215255 210850 149136 128944 127347
13219 127347 144469 120269 100821 53587 154803 312905 322082 322900 357442 350286 339606 337848
13207 337848 347255 439784 401413 304064 350174 423221 446116 431823 326479 289420 343566
13196 343566 290717 354259 310704 286061 275524 276876 234478 125959 97386 86971 76807
13185 76807 118625 195162 212702 122447 29304 47152 66250 125407 103535 157630 78259 -14405
13173 -14405 48751 181517 313928 290555 198355 148575 93627 98845 177879 194279 273479
13162 273479 297656 313435 373398 346125 384839 378651 409400 403724 450984 493140 458618 477692
13150 477692 512812 427559 354170 315342 290404 449940 506891 382429 281179 347294 415325
13139 415325 308118 231983 259973 306561 376739 370121 328496 277400 314148 346302 391228
13128 391228 383131 290807 272866 288265 261648 258925 214030 199098 236114 210164 165949 176696
13116 176696 192796 189520 143998 161306 232588 286960 278718 270248 325148 371626 294579 256451
13104 256451 242555 312843 293762 233260 198345 305337 318950 294687 310875 366694 417948
13093 417948 474687 408839 375830 478202 455506 417102 401934 323837 240595 251729 203900
13082 203900 94947 78781 156641 303413 278342 255063 293357 243088 205459 252498 327253
13071 327253 361091 328845 292939 259581 286464 193203 195965 319924 334120 246622 226610
13060 226610 219273 347664 389622 349939 248564 270970 322627 231851 195366 217794 201149
13049 201149 88849 148966 128835 121617 197276 202244 218890 179972 121547 151769 302691
13038 302691 382393 336878 300774 279886 290996 212790 113690 100057 163194 250341 271022
13027 271022 294077 252011 173889 134970 67628 33765 62134 89552 99876 122756 107131
13016 107131 80695 115222 120637 103617 91626 123904 47661 45715 84688 102231 114484 175100
13004 175100 238206 185140 118719 123823 128689 111550 158907 142103 121064 225580 358719
12993 358719 314650 210334 162878 220785 289224 337687 406533 344511 316191 340527 259492
12982 259492 202222 191395 197647 240700 343429 316245 250240 143646 115905 157838 288116
12971 288116 292507 352037 370599 315701 233286 177199 222960 238841 207988 104733 176602
12960 176602 247935 294612 229695 181518 123677 5189 1614 103325 148771 5730 45520
12949 45520 105271 201366 156282 199758 162715 161137 168360 203564 255152 178010 83634 -7150
12937 -7150 60326 99760 84361 110335 140052 217727 312128 381808 359708 372630 331649 381538
12925 381538 450671 332053 248133 247970 266901 154074 104208 285983 357864 324461 280766
12914 280766 236920 191161 154150 135115 200399 227460 269485 222979 184792 321401 357164
12903 357164 388407 433429 355946 302018 375582 450588 584121 588520 523591 604163 689433
12892 689433 791335 890360 1096547 1268994 1173729 1007289 792492 608461 521776 507694
12882 507694 481121 463149 339963 210008 202412 240103 298667 323263 394255 329781 245965
12871 245965 222813 238123 360290 378020 363378 355700 263143 201598 299982 298700 220435 223400
12859 223400 269629 324260 248083 176948 234025 234687 169697 237212 325511 315311 261311 243898
12847 243898 290663 298306 228353 205393 190951 216057 221548 152796 198460 254621 238638 160547
12835 160547 166459 87983 12787 17620 78108 124641 116923 124449 206641 310107 204529 136304
12823 136304 138951 150611 172235 187184 253828 335200 284855 334179 349076 378239 430343 397218
12811 397218 307249 204415 82824 103578 85342 143433 183080 81973 -19526 -13120 -49877
12800 -49877 15563 -10093 71407 247670 283768 269331 316369 326458 249640 118398 98959
12789 98959 145250 174009 195089 268956 296348 361100 319708 235856 239543 215227 174642 119976
12777 119976 134959 154140 141397 99251 105729 83036 -12051 -55586 -77014 32751 49971
12766 49971 17218 44667 82282 171004 78754 81200 40366 -60471 -74804 -65217 33191 97191
12754 97191 91031 -1014 42411 46664 -21347 -37445 18209 -564 -25223 -12551 135868 277235
12742 277235 294922 298587 314711 256164 207391 159758 164269 191719 154902 165453 162425 81072
12730 81072 140263 221472 253272 285657 320999 285725 249367 242483 258556 250954 296542 390735
12718 390735 453613 411150 242515 170775 139781 157447 195607 96125 68542 151173 176096
12707 176096 190255 205855 290330 302913 353011 389699 345553 347005 313872 323105 366093 460330
12695 460330 574671 658997 638923 623653 567907 645583 668673 545570 552180 639938 691025
12684 691025 706088 640347 634626 670739 703132 781441 824712 832169 828668 851467 920166 1054579
12672 1054579 1140441 1233850 1284887 1507011 1780962 2017986 2234482 2607248 2997900 3399776
12662 3399776 3910850 4360579 4920821 5692943 6588563 7569543 8809418 10155826 11486388
12653 11486388 12736957 13748192 14445040 14779472 14764411 14334737 13462900 12492198 11385215
12644 11385215 10221273 9074661 8108119 7304859 6540694 5918334 5510650 5138346 4813450
12635 4813450 4617943 4372855 4148910 4036458 3883422 3759803 3616917 3411183 3428093 3401697
12625 3401697 3198299 3072657 3055982 3110741 3099445 3102134 3155269 3142247 3011921 2912619 2848369
12614 2848369 2720441 2588326 2500012 2435431 2380105 2307781 2161797 2031987 1859307 1777381
12604 1777381 1773474 1724279 1542377 1519268 1480519 1468987 1444613 1343008 1304064 1192172 1198311
12593 1198311 1115027 1128706 1149320 1147911 1074094 963284 908430 821740 798738 855708 832626
12582 832626 740497 700387 743467 701281 650851 654508 602049 560128 589504 594914 570398 474359
12570 474359 491194 518052 458555 387773 317619 359363 335783 332920 314127 337021 289589 249910
12558 249910 217357 241598 269843 251234 220515 249408 263284 324728 362706 306050 310292 323756
12546 323756 303870 327167 386179 428441 494350 531628 581804 587880 467337 488080 479273 406321
12534 406321 332802 346327 420858 415015 433660 378674 352413 364323 402548 452315 408295 297317
12522 297317 245651 339736 453595 486498 412960 377695 430882 487193 408238 300871 338273
12511 338273 399727 346298 347799 348670 393965 417373 368768 368317 439545 399340 414116 433652
12499 433652 389732 392325 407126 461524 460211 468257 471325 507382 572940 573966 551218 566207
12487 566207 411230 451415 534332 545175 631495 676551 642791 625269 692924 858160 957656
12476 957656 990183 1065214 1096227 1269739 1425214 1587534 1752892 1907946 2160371 2384903
12466 2384903 2514560 2550536 2569576 2463160 2279730 2083646 1939123 1749010 1597569 1426964
12456 1426964 1264845 1189407 1220427 1142371 1085264 954890 882301 919936 930363 926445 993762
12445 993762 968617 936969 969840 1013876 996243 841035 877981 872880 811587 789269 837261
12434 837261 842684 796187 731548 815434 748943 758516 870932 929207 967174 1023113 998028 932435
12422 932435 821180 673247 645541 653151 583961 615970 629601 655825 778584 741010 723464
12411 723464 760892 831175 808747 738930 731350 682721 617888 607097 662738 685568 688838 714890
12399 714890 762400 784240 851483 905906 847213 874739 925412 1048943 1128905 1200000 1319027
12388 1319027 1319716 1269890 1219411 1197621 1193226 1173908 1117354 1189273 1237831 1273362 1333404 1305991
12376 1305991 1247631 1275368 1215636 1087568 1038046 992985 891301 799612 844866 845343 791525
12365 791525 831667 811897 691199 645875 711248 763447 810984 850774 976554 1087538 1039975
12354 1039975 1056054 1126685 1173569 1206877 1196689 1229608 1255324 1312383 1331429 1358602 1258614
12343 1258614 1272244 1171738 1060796 1067391 1051851 1041738 1075894 1188081 1198340 1239374 1138209
12332 1138209 1142305 1215081 1222511 1246146 1282697 1182972 1089648 1080819 950269 814395 832582
12321 832582 832600 958013 983810 1038513 1128459 1167990 1231795 1310077 1302546 1356808 1411580 1426894
12309 1426894 1293564 1194204 1064256 1060423 1080047 1018476 947502 893832 888884 843792 798600
12298 798600 815522 881144 884467 787211 663705 664308 755094 687830 705617 734388 740009 661940
12286 661940 547729 518076 555305 509590 417939 457415 492890 534076 519569 436646 443025
12275 443025 527226 579794 600712 559974 520438 524150 500098 361938 333029 427711 473918
12264 473918 447153 435228 359651 405676 306693 175273 265283 315712 234161 221916 227640
12253 227640 219695 214365 191264 261855 310908 258282 188486 212030 264328 307073 347611 404052
12241 404052 429972 355268 303561 280110 215140 237597 303452 328296 355076 318043 281054
12230 281054 318027 333475 291124 303767 279913 282814 331811 296170 343988 316227 330968 343933
12218 343933 319509 321304 230851 102345 109546 198600 304091 250791 188091 202294 295875
12207 295875 280110 274864 244906 195926 193221 312322 349844 287246 264514 144160 -18095
12196 -18095 -45654 28611 29529 23568 100708 125026 80121 124277 170388 133206 62802 62565 96496
12183 96496 97491 135674 187650 322476 387989 318882 276778 248039 202929 135169 6132 -39568
12171 -39568 110828 200286 230647 279124 338548 281149 233979 294195 344537 264724 146777
12160 146777 107429 132846 79761 51541 103218 105429 175591 242531 259862 314317 303332 340806
12148 340806 363662 379445 393645 446451 386141 357279 331422 371298 383836 300385 224114
12137 224114 159704 167886 152659 201843 312247 317138 153851 81147 131149 191973 157589
12126 157589 167034 194435 291080 381408 332505 294399 347063 325059 297726 297113 271167 228499
12114 228499 181570 142612 113473 89465 129018 257988 250469 210379 170901 200489 169026
12103 169026 101473 104465 102616 133396 247892 312296 330230 223193 214079 239306 303754 321648
12091 321648 370066 383523 284304 244607 213099 203771 212232 268980 310765 277440 231418 221053
12079 221053 281308 397909 362869 210961 198423 103553 133215 143299 195225 199308 72927
12068 72927 17197 83464 144443 234568 298072 126287 177543 340086 389403 365236 284205
12057 284205 340888 272114 210871 285020 378810 322810 247280 251671 219612 246031 245109 251928
12045 251928 302545 310221 252282 286903 364339 355278 307014 266348 256017 258969 251300 248975
12033 248975 213179 292205 365268 328600 287484 235544 191144 216742 217066 316158 321225 297736
12021 297736 252561 230299 144479 164366 214420 278680 295629 306876 279817 242932 253286
12010 253286 358522 372254 446701 492646 568861 538904 562587 691250 851916 1029951 1143151
11999 1143151 1219062 1439593 1598873 1689832 1851224 2061576 2340447 2708788 3147992 3510595
11989 3510595 3834666 4038903 4211900 4243024 4110786 3681029 3270944 2907488 2634761 2392683
11979 2392683 2163355 1942037 1728746 1521225 1383611 1264875 1203601 1228644 1156373 1193446
11969 1193446 1207434 1181875 1183977 1210477 1179357 1100752 1083603 1056341 1059444 986402 965746 944566
11957 944566 1043491 1142436 1073612 1112917 1069487 981979 944682 956709 904288 900601 828918 812481
11945 812481 725995 683780 595906 555860 616333 502371 534318 624473 654722 575371 554557
11934 554557 527008 566261 558998 570076 583923 555880 453730 375362 409949 470918 504692
11923 504692 397672 309782 219773 197949 289333 354508 409548 395937 406021 338257 332300
11912 332300 321050 328686 280407 214437 190292 255199 290179 388289 411271 333630 271181 268214
11900 268214 329993 289738 269555 341324 392177 400596 338302 290248 293171 261043 250025 234037
11888 234037 102911 34461 40540 73030 138759 159565 206879 236333 317397 312993 247343 304721
11876 304721 302317 304056 247794 269250 314288 333765 313981 335797 214275 166582 215642 161035
11864 161035 141418 255389 379519 364821 279925 220283 171916 123760 213576 281767 196795
11853 196795 136460 70840 79565 50719 103677 138357 114415 142076 301314 314042 276417
11842 276417 276343 274404 291851 187322 163135 164274 192128 270056 296542 197408 170577 177667
11830 177667 152864 198281 86774 117027 168017 242986 300100 299046 179581 104574 132163
11819 132163 184812 284535 272835 217353 198141 170286 137611 208192 264377 326106 398255
11808 398255 325353 268169 316827 373056 320598 211536 128073 95360 83429 126740 157672
11797 157672 144612 206781 261227 302320 276787 254786 228800 224157 237134 228339 138790 119206
11785 119206 105660 138217 175509 177431 166752 239929 213619 279347 364711 260772 206505
11774 206505 258813 285037 323641 344110 348926 365394 350093 345294 295624 202909 236863 192668
11762 192668 121418 106595 116105 82768 5741 2886 25325 116944 101042 44727 85766 191207
11750 191207 198962 163086 177008 247542 254330 200506 174431 237920 198617 161989 155867 152195
11738 152195 180313 178226 306646 312883 291359 287659 348819 320490 307665 235179 156980 78995
11726 78995 77850 90152 92322 203862 220199 234617 224029 255339 312411 158143 152252 244599
11714 244599 188355 115664 110600 228504 275247 281356 271173 218930 195229 230398 210771 221710
11702 221710 206969 102106 45257 57196 76371 97170 82978 81285 150465 224917 186825
11691 186825 220215 218486 159073 107025 85790 89643 49231 44452 37571 123165 92583 84203
11679 84203 73199 58241 73574 183469 198394 192241 280585 200585 147346 146840 151971 152683 181529
11666 181529 171111 160835 181117 248609 187242 74991 65975 38109 66525 112997 143812
11655 143812 98921 54098 67056 92182 54310 114185 116596 123017 159429 171151 129061 53120
11643 53120 39751 169460 238741 163847 141792 150314 124247 88292 180649 255006 203671 142713
11631 142713 182642 177066 162057 206617 134855 184420 189745 144480 157340 177128 155332 98387
11619 98387 149974 224228 250391 199853 54091 65365 127794 133706 201067 240273 200543 105485
11607 105485 31310 32864 143293 125098 216966 277320 375279 347266 320704 291080 283400 252926
11595 252926 277539 331162 334931 274230 222293 169196 202147 173976 189967 235463 210897 277738
11583 277738 254678 294199 286154 345089 289787 163178 70326 119617 195724 137633 115099
11572 115099 101054 104500 129921 176848 293223 262740 120594 52573 125972 195477 220968
11561 220968 236967 263799 238358 170165 27070 22987 48729 48358 54853 104122 139257 126783
11549 126783 86739 100997 62299 108992 120471 141833 206057 248492 252260 257215 265766 279597
11537 279597 300179 266084 236356 222136 367137 476148 494513 422387 396896 365253 295611
11526 295611 313232 457806 431826 408085 401766 371663 333239 430741 468782 404909 414335 342503
11514 342503 211628 287174 304996 264461 229003 253710 230427 230362 281780 240003 226371 326098
11502 326098 373877 305327 327794 284237 255738 207984 200079 186835 201214 228311 304873 365200
11490 365200 339845 254050 239488 195002 198778 269073 252735 246308 237300 292517 272657 179174
11478 179174 199959 253478 283734 333731 442487 411427 333114 293756 305548 342321 258655
11467 258655 313691 355821 215020 70554 -3823 35396 7265 50994 173882 215833 284389
11456 284389 333282 296163 311504 391528 431259 493454 424827 355180 336698 359270 278727
11445 278727 280387 237433 220892 276300 232953 299131 363072 405075 404326 337091 341114 348516
11433 348516 397722 400811 315413 275013 389871 449664 287725 174166 261064 287704 365595
11422 365595 419568 381816 279431 270649 279169 336710 314723 278956 305407 328027 399963 249598
11410 249598 160746 169965 165164 246067 261101 337609 363917 321505 321305 392308 468499 404246
11398 404246 411989 451703 516131 486659 494927 438419 346090 384348 413685 405282 432125 420352
11386 420352 390357 389852 393848 269676 203390 207736 235723 257482 389028 533489 633684
11375 633684 525784 405068 397161 357589 331049 312043 302386 267009 257732 306122 386039 437463
11363 437463 448437 503182 570240 610883 566008 523836 514316 404093 499268 519949 626835
11352 626835 661284 639623 635670 608002 687509 772450 845434 766392 765947 840775 1000445 1142324
11340 1142324 1119168 1004100 1021445 1056832 1062697 1098662 1151583 1145018 1190674 1190130 1206377 1157934
11328 1157934 1167366 1251167 1309670 1399624 1582541 1741982 1922813 2083658 2236288 2327044
11318 2327044 2416154 2409499 2351059 2274144 2057112 1970076 1873566 1707275 1644874 1745546 1666326
11307 1666326 1725810 1805583 1784764 1852162 1841784 1813521 1861757 1883970 1969467 2042107 2187338
11296 2187338 2485516 2833539 3150829 3277010 3402183 3508101 3565861 3609358 3394868 3235636
11286 3235636 3096677 2952566 2812396 2618493 2394161 2172394 2113863 2069953 1875664 1694409
11276 1694409 1625490 1601802 1647240 1670368 1663323 1653300 1520583 1578792 1626736 1645177 1604200
11265 1604200 1545813 1514349 1563789 1570802 1582117 1630252 1702445 1781719 1873866 1979803 2025101
11254 2025101 2017247 2035833 1958849 1811532 1694791 1542426 1535681 1460070 1405148 1360012 1359295
11243 1359295 1339886 1337327 1245658 1218760 1226906 1213459 1189148 1241305 1333619 1331217 1329443 1324307
11231 1324307 1306854 1216438 1163543 1195828 1093564 1036250 1029447 1041309 1056239 1060844 1098881
11220 1098881 1162776 1100858 1003864 941526 1024826 1050061 1076185 1078317 1157066 1246141 1161634
11209 1161634 1092293 1021580 1013137 1146072 1203925 1169480 1174682 1229129 1278759 1213245 1127210
11198 1127210 1183877 1210981 1154311 1229165 1323651 1309019 1178354 1192422 1216325 1205993 1245380
11187 1245380 1171916 1039191 1027014 1041412 1053586 1110975 1054369 1107597 1118309 1149799 1256785
11176 1256785 1263699 1271756 1293048 1248149 1243697 1272724 1185170 1133298 1132907 1128531 1172538 1248866
11164 1248866 1224641 1239687 1275783 1339604 1444982 1453325 1489569 1427539 1461237 1511122 1567397
11153 1567397 1609233 1648352 1709764 1766698 1998699 2048620 2127998 2250495 2412745 2676022
11143 2676022 2912083 3005473 3123044 3051165 2889788 2632939 2424715 2405555 2364273 2245057
11133 2245057 2041265 1938987 1989608 2006291 1925791 1770796 1726203 1779435 1792468 1813641 1699817
11122 1699817 1774231 1838051 1763864 1685317 1692222 1703129 1664620 1684285 1660833 1621826 1586990
11111 1586990 1642172 1737357 1816728 1793866 1773827 1827322 1910563 1933976 1952522 2023451 2082422
11100 2082422 2092294 1963971 1906139 1881428 1800180 1799116 1822664 1752880 1732023 1777676 1902863
11089 1902863 2105568 2215359 2246064 2227919 2255084 2308566 2438568 2704820 2946557 3132135
11079 3132135 3165339 3140544 3035557 2849581 2720208 2622410 2520713 2426452 2392281 2398554 2387572
11068 2387572 2368021 2431788 2355138 2297907 2318354 2256080 2311886 2334259 2325014 2300119 2300105 2332089
11056 2332089 2371606 2264288 2212315 2270957 2345851 2397939 2457120 2406439 2379945 2362250 2308479
11045 2308479 2391182 2371598 2373762 2360280 2422048 2513033 2586963 2739689 2811201 2774443 2708158
11034 2708158 2724231 2704297 2633144 2571962 2599090 2726238 2844672 2844899 2793466 2726840 2818162
11023 2818162 3072283 3165862 3233970 3286084 3342903 3327301 3311707 3384304 3377677 3323614 3229646
11012 3229646 3149060 3049616 3000707 3010754 3130630 3225965 3231671 3195315 3128818 3126412 3112187
11001 3112187 3099937 3065070 3094773 3105027 3175309 3348447 3486620 3510482 3599263 3597417 3549341
10990 3549341 3372289 3282815 3315502 3276260 3303270 3341464 3320475 3312208 3471835 3556230 3527652
10979 3527652 3532816 3528962 3576604 3557103 3640077 3693672 3674720 3614081 3703631 3879608 3860441
10968 3860441 3947118 4081875 4145114 4204917 4348771 4464021 4569458 4805983 5034720 5185136
10958 5185136 5387793 5511973 5556543 5481634 5377741 5198037 5017060 4896795 4754895 4697428
10948 4697428 4707239 4832193 4828493 4824832 4740943 4664712 4669473 4719313 4670438 4652182 4709136 4738149
10936 4738149 4773176 4824816 4814822 4841464 4893105 4937941 4985453 4981037 4988744 4989940 5124105 5213692
10924 5213692 5276191 5254911 5350465 5444673 5507998 5616779 5586886 5507108 5539523 5651799 5691492
10913 5691492 5625314 5585095 5598083 5615970 5580019 5618815 5626518 5668149 5795657 5880744 5888169
10902 5888169 5918406 5996406 5934432 5943731 5996143 6062988 6193507 6235382 6207273 6293319 6227549
10891 6227549 6255819 6306297 6325506 6409150 6484325 6611924 6688436 6735897 6711101 6779445 6843048
10880 6843048 6948066 6972380 7046732 7129509 7118661 7187634 7190248 7140322 7210199 7373945 7459265
10869 7459265 7378782 7379153 7563054 7728726 7792769 7866759 7946347 7960422 7946596 8014815 8059898
10858 8059898 8201574 8280043 8319982 8378174 8417066 8560506 8692372 8718409 8674064 8647828 8699540
10847 8699540 8728851 8819323 8915240 8976728 9047549 9169525 9258314 9373539 9528621 9558529 9551849
10836 9551849 9588311 9656582 9787166 9860483 9869148 10009169 10161098 10288531 10358677 10480652
10826 10480652 10582328 10714322 10748676 10771275 10754044 10817566 10832340 10941299 10998717 10979518
10816 10979518 11067567 11100472 11226470 11426392 11565589 11594022 11593785 11665839 11796452 11961080
10806 11961080 12046860 12218601 12436184 12542217 12611815 12632202 12575255 12587544 12603396 12642154
10796 12642154 12725323 12846687 12976477 13037827 13176963 13204061 13298945 13325747 13282955 13320976
10786 13320976 13358973 13339801 13384904 13524721 13626788 13893790 13950315 13944828 14012369 14119188
10776 14119188 14295151 14321988 14323001 14379182 14476360 14651540 14763901 14798889 14784468 14926801
10766 14926801 15028233 15175642 15241092 15373602 15538096 15742712 15917433 16042838 16203740
10757 16203740 16382506 16489918 16551655 16534193 16448536 16412990 16376124 16289904 16180568 16084537
10747 16084537 16056788 15993096 15996866 16045510 15993655 15981986 16141922 16133566 16094959 16081317 16200881
10736 16200881 16276303 16277989 16312697 16188934 16174227 16270827 16409470 16474735 16421511 16409182 16358449
10725 16358449 16292859 16255532 16385197 16381452 16316305 16354836 16350112 16286613 16267328 16173904 16141770
10714 16141770 16172647 16243198 16276930 16294330 16275743 16163974 16066906 16117537 16170694 16103369 15996725
10703 15996725 16031283 15982214 15892427 15886036 15887871 15779986 15775036 15739803 15700193 15702098 15591478
10692 15591478 15533428 15572419 15648346 15605515 15481653 15398068 15445884 15399537 15374571 15206080 15053146
10681 15053146 15007945 15033812 15049822 15053276 14995848 14965811 14939533 14840814 14743900 14726941 14666409
10670 14666409 14696623 14660800 14652699 14626097 14512622 14436281 14423756 14389143 14368018 14326289 14287211
10659 14287211 14218016 14133662 14023686 13940738 13945925 13945976 13883332 13804035 13767938 13634634 13495969
10648 13495969 13488725 13503186 13383331 13248620 13232780 13191156 13132724 13061313 12980895 12932186 12821378
10637 12821378 12755676 12745044 12674164 12681057 12712394 12617794 12474331 12364923 12265955 12342415 12410407
10626 12410407 12381286 12289512 12199723 12103896 11995109 11866084 11836501 11843182 11852139 11906894 11801728
10615 11801728 11565620 11404818 11377400 11439483 11345884 11291134 11300851 11218238 11093754 10988957
10605 10988957 10934425 10991580 10993005 10930686 10857959 10822107 10675439 10614704 10596801 10550819 10373141
10594 10373141 10285721 10320649 10329624 10340954 10359803 10240889 10124895 10029585 9987987 9896676 9735054
10583 9735054 9681565 9645325 9593783 9543447 9475813 9474724 9460421 9368896 9230240 9167274 9107114
10572 9107114 9049939 9091537 9089265 9119271 9063081 8990907 8921254 8902051 8786645 8707452 8731536
10561 8731536 8723541 8655319 8627427 8536842 8519313 8487511 8464976 8397789 8451547 8431725 8395275
10550 8395275 8392568 8199856 8052998 8032724 8027354 8007271 8012123 8059915 8005380 7872720 7798482
10539 7798482 7705646 7654739 7650066 7578433 7490509 7370299 7310301 7366048 7462877 7483337 7526726
10528 7526726 7417068 7275008 7224637 7208844 7074971 7047397 7029460 6892177 6818139 6859464
10518 6859464 6950050 6918445 6868511 6823705 6883171 6915802 6876537 6745355 6758566 6704256 6518527
10507 6518527 6430030 6445872 6442264 6422021 6444887 6477370 6363944 6316421 6341627 6308661 6291219
10496 6291219 6271291 6262025 6163378 6210273 6325696 6258306 6212597 6133286 6069989 5999545 6053320
10485 6053320 6041307 5951199 5893670 5857908 5817679 5796268 5811151 5760775 5669670 5612163 5525701
10474 5525701 5445130 5389216 5394747 5440568 5428536 5359589 5374425 5438498 5484248 5552509 5593364
10463 5593364 5571241 5500257 5475005 5465569 5394753 5342298 5318101 5356071 5442431 5434487 5448907 5365047
10451 5365047 5261684 5157817 5184160 5154772 5112569 5132675 5233822 5214068 5198265 5276676 5358906
10440 5358906 5378025 5511853 5478046 5362123 5328832 5411812 5350617 5323606 5418127 5597916 5747540
10429 5747540 5863180 5943725 5990852 6188805 6459872 6747275 7300346 8070858 9027422 9808982
10419 9808982 9796447 9105142 8218447 7433049 6828744 6534089 6338850 6151560 5981142 5800334
10409 5800334 5627954 5504376 5382462 5356674 5288823 5217468 5153471 5138664 5156948 5141775 5127416
10398 5127416 5105412 5039872 4969537 4857134 4877316 4847373 4788564 4830068 4833204 4878560 4856081
10387 4856081 4766124 4835755 4832301 4773713 4670029 4603436 4634197 4602482 4531519 4485587 4480611
10376 4480611 4458160 4377106 4272930 4261652 4241160 4193855 4230657 4189868 4170912 4089836 4119179
10365 4119179 4096535 4157424 4134438 4040438 3963604 3943384 3856231 3851635 3863298 3916012 3955920
10354 3955920 3898126 3984571 4003609 3996234 3927630 3889259 3817859 3827295 3855409 3835223 3902373 3888615
10342 3888615 3874464 3940636 3978031 3912159 3936913 4046054 4179738 4194880 4171862 4146204 4088642
10331 4088642 4162394 4174366 4187573 4090877 4027689 4053916 4136473 4264580 4529435 4726090 4785985
10320 4785985 4930904 5169939 5472079 5579471 5704118 5948559 6106937 6208314 6302659 6244219
10310 6244219 6174117 6068674 5980479 5741921 5563057 5406582 5254116 5088203 4919496 4866207
10300 4866207 4725542 4546963 4381504 4368935 4341381 4273344 4216165 4174902 4120510 3907269
10290 3907269 3842935 3842215 3911099 3960700 3833028 3721786 3670935 3604391 3558274 3522548 3514181
10279 3514181 3570660 3610421 3592643 3567071 3531409 3478778 3441898 3435882 3404518 3327253 3357346
10268 3357346 3290648 3273850 3217413 3153322 3118189 3160682 3197503 3197532 3125187 3044958 2993131 2992277
10256 2992277 2963742 3001674 2988393 2996446 3021041 3027745 2975777 2872894 2882261 2925011 2880705 2918601
10244 2918601 2930061 2939874 2997130 3015862 2944378 2890165 2846710 2758778 2772131 2747806 2810201
10233 2810201 2898435 2913220 2945019 2889466 2780447 2755680 2818755 2833660 2824443 2824365 2844544 2847911
10221 2847911 2809534 2779586 2684012 2636693 2714120 2811453 2733042 2716651 2747099 2657941 2576433
10210 2576433 2572558 2663345 2789378 2812880 2780844 2813492 2908327 2965193 2942921 2921126 2922614
10199 2922614 2929404 2963504 3117001 3250140 3241756 3162651 3094809 3186758 3151605 3101743 3072572
10188 3072572 3079931 3047215 2991721 2900729 2906351 2971330 3045655 3050218 3076784 3047738 2968316 2983165
10176 2983165 3025881 3049436 3067242 3153290 3235701 3198401 3109587 3023726 2917894 2840914 2883737
10165 2883737 3048582 3100270 2995619 2941215 3012072 3024879 2895381 2813987 2757147 2734250 2765606
10154 2765606 2702905 2637297 2702352 2729068 2699658 2674438 2690248 2668040 2726344 2830926 2857228
10143 2857228 2831015 2762538 2795327 2772417 2778012 2758914 2722600 2744390 2808536 2727282 2730033 2800839
10131 2800839 2785039 2796149 2878615 3021279 3182059 3256928 3316491 3347376 3349591 3261424 3193513
10120 3193513 3093313 3007467 3033103 3115711 3190316 3220254 3359174 3494791 3648301 3773862
10110 3773862 3937775 4216042 4606800 4965223 5354358 5770936 6201565 6708167 7313748
10101 7313748 8253082 9558048 11269426 13396448 15728253 17663367 18328899 17376671 15349651
10092 15349651 13106691 11255044 9884456 8837857 7990377 7342111 6898021 6608508 6365237
10083 6365237 6123337 5759138 5543948 5475294 5428024 5233473 5085914 5048083 4921969 4815988
10073 4815988 4816409 4802630 4760478 4714454 4663697 4665090 4639166 4631377 4588871 4621046 4580668 4518847
10061 4518847 4477683 4381056 4228432 4114704 3992636 3851481 3737679 3725233 3682201 3586304
10051 3586304 3580459 3549956 3495817 3292061 3197579 3209551 3170975 3139310 3222599 3211333 3088164
10040 3088164 2955170 2960689 2878991 2857922 2899075 2859673 2790756 2842515 2835888 2891704 3010677
10029 3010677 2951804 2917202 2924411 2880492 2776187 2681796 2625255 2587813 2648044 2705343 2701184
10018 2701184 2741585 2588752 2472020 2416150 2427251 2396671 2458793 2477458 2516763 2485886 2414896
10007 2414896 2304165 2168118 2174314 2227274 2261913 2261471 2244748 2255640 2274304 2281989 2325282 2304854
9995 2304854 2281521 2180448 2169549 2274304 2211677 2160833 2144163 2132392 2089202 2139150 2216754
9984 2216754 2145770 2091623 2083691 2067550 2045214 2019275 2028776 2070060 2150956 2167360 2138603 2128082
9972 2128082 2187272 2120359 2033622 2056684 1966518 1924693 1825401 1866280 1936818 2025088 2071200
9961 2071200 2032789 1975779 1984601 2019986 2054639 1977741 1994716 2057113 2045103 1942549 1838878
9950 1838878 1811897 1896094 2043776 2051861 2092661 2083657 2036668 1995169 2054098 2097925 2103114 2067536
9938 2067536 2182773 2181419 2071023 1976654 1969045 1991048 1951430 1966234 2024828 2107463 2155440
9927 2155440 2198397 2199743 2169205 2143368 2109747 2089776 2052689 2202950 2326243 2453483 2556661
9916 2556661 2614903 2683485 2737134 2642960 2542134 2396425 2305207 2187175 2139870 2220430 2164690
9905 2164690 2079997 2033915 2003491 1981908 1970916 2015244 2028290 2023286 1979131 1982304 1981613 1974072
9893 1974072 1978126 1965617 1941853 1891831 1964207 1944078 1934118 1973048 2003579 1976522 1945414 2010540
9881 2010540 2049787 2058098 2019437 1995189 1999545 2046840 2081741 2122305 2034082 1915223 1957618 1922593
9869 1922593 1948676 1956301 1932316 1852605 1774775 1927767 1958559 1901477 1879345 1976948 1947595
9858 1947595 1863281 1771453 1836924 1880778 1844137 1851996 1850096 1836083 1882693 1902304 1929727 1907497
9846 1907497 1755292 1658776 1679077 1647759 1675059 1754626 1872226 1912565 1856826 1796659 1720037
9835 1720037 1773898 1884499 1892243 1850113 1755671 1751201 1690220 1682735 1682485 1637701 1605955 1605683 1620262
9822 1620262 1537887 1468254 1526207 1584618 1651620 1651797 1771475 1739913 1608073 1668230 1692788
9811 1692788 1684581 1680051 1644480 1712315 1778262 1800426 1718039 1730679 1740547 1698029 1757033 1794674
9799 1794674 1790804 1820793 1874192 1856242 1811436 1826715 1782555 1765229 1798342 1781677 1758342 1752758
9787 1752758 1733951 1750833 1738810 1760749 1643181 1582018 1646196 1700509 1746479 1694407 1724222
9776 1724222 1677425 1759673 1778385 1779628 1783595 1759144 1759106 1823588 1874422 1909073 1927002 1941649
9764 1941649 1938463 1905213 1828814 1797009 1778937 1786093 1810483 1829545 1822773 1796093 1767710 1745583
9752 1745583 1603167 1551182 1674238 1714960 1735420 1737872 1756780 1725432 1646059 1687389 1652689
9741 1652689 1570774 1566313 1586885 1676884 1721557 1708308 1652640 1625438 1689569 1741570 1628157
9730 1628157 1485243 1492132 1576652 1579508 1710594 1721520 1721003 1735254 1636925 1514510 1545105 1624301
9718 1624301 1562985 1533443 1558120 1592339 1595762 1593669 1552388 1471999 1440761 1526284 1516139 1549828
9706 1549828 1575804 1566582 1517417 1470869 1531766 1500623 1478049 1530694 1575548 1484755 1477586 1565615
9694 1565615 1603077 1661419 1564500 1505651 1477028 1457144 1544816 1605556 1557649 1568305 1674252
9683 1674252 1701605 1657999 1636837 1635065 1685500 1706100 1689792 1607494 1517237 1541143 1551727 1552464
9671 1552464 1584346 1683697 1641413 1553687 1608690 1676620 1655809 1584303 1567999 1583798 1558960
9660 1558960 1542330 1468486 1503132 1528566 1448370 1466937 1462831 1485819 1481440 1489329 1528435 1506269
9648 1506269 1579238 1657256 1561287 1364372 1326101 1393570 1448701 1530595 1512669 1551751 1543047
9637 1543047 1594966 1554580 1538369 1611164 1586637 1519200 1474348 1421129 1438790 1416483 1405070
9626 1405070 1446230 1397955 1350758 1421876 1524805 1583364 1479673 1428276 1331527 1335502 1400465
9615 1400465 1452374 1467087 1412769 1347961 1341431 1346108 1337242 1314366 1259772 1265610 1365036 1391487
9603 1391487 1435953 1450206 1393412 1317701 1303354 1300280 1301384 1230260 1219665 1251312 1262315 1196255
9591 1196255 1243231 1289667 1264265 1196041 1170963 1245570 1229810 1258346 1332533 1334124 1356821 1439583
9579 1439583 1478159 1449702 1409148 1304748 1279346 1224994 1230149 1306611 1368076 1324228 1235244
9568 1235244 1133300 1172777 1194062 1238737 1245488 1161158 1179992 1166178 1175532 1200839 1207235 1159527
9556 1159527 1045676 1059897 1144586 1104756 1153736 1204602 1168085 1151442 1132798 1160197 1206175
9545 1206175 1302681 1346965 1379069 1451039 1459149 1408397 1291774 1235278 1218522 1215409 1238332 1219554
9533 1219554 1222853 1328454 1412489 1417324 1357255 1202736 1088280 1079796 1148840 1087705 1108967
9522 1108967 1090793 1052886 1112057 1216803 1202052 1148657 1037715 977326 1021252 956372 914067
9511 914067 985085 1025844 994984 980405 974409 995027 1040494 1083965 1041588 1106122 1204095 1271664
9499 1271664 1257535 1134823 1090323 1030893 1009203 1003217 996724 1041610 1003870 990360 953818 1010418
9487 1010418 980174 910373 952665 911087 877734 906701 923679 1061800 1202268 1130574 976081
9476 976081 880705 902917 913530 909605 931173 1035478 1088765 1034190 1004329 991707 1029213 1029645
9464 1029645 1027614 1042077 962516 961887 928175 932904 960005 983718 1005169 962023 921143 891853
9452 891853 1003002 986170 961917 924001 980530 1025367 1042999 1069489 1055749 1016386 947241
9441 947241 882793 887618 877687 953656 971282 969792 969211 1020852 1007176 1016722 1055087 1042114 1081188
9428 1081188 1044517 884635 955897 925951 877460 813137 865888 835522 786263 879496 894466
9417 894466 848645 864559 862551 780940 715220 722826 837400 903990 917732 834733 792806 800926
9405 800926 875108 1004147 974589 891122 862769 842657 928228 919757 861447 819858 863522 893476
9393 893476 880655 904260 939278 942560 888936 886812 891149 731384 579760 642012 732054 768664
9381 768664 816134 856363 802255 735267 785319 770019 721577 754788 858392 805728 861854
9370 861854 913377 972125 953030 960838 885224 883861 862928 714481 646180 666361 742608 798704
9358 798704 713421 707323 794189 848081 816181 827301 843968 815002 751793 792527 754661 804336
9346 804336 822161 684662 684895 730850 715613 763451 767121 760250 763083 745897 768315 705936
9334 705936 583112 548731 515413 529249 580624 591373 659426 733469 693560 639514 702282
9323 702282 730035 663054 687969 804771 806696 733634 708996 773803 835014 807909 716780 692656
9311 692656 703928 656290 622667 582468 617631 654077 710072 792913 816420 790177 771113 720200
9299 720200 706441 607408 651074 795191 824862 943205 847284 645804 562974 561333 587334
9288 587334 622483 617786 586043 563410 638758 633540 553393 582039 714096 758361 786689 847352
9276 847352 879414 915352 794772 638463 529378 555952 688686 762256 782599 826654 826723
9265 826723 692869 703285 709184 759649 794901 813413 781479 860125 926778 913415 879002 765348
9253 765348 748494 783615 869710 864658 799993 763537 841358 872991 893612 897670 916478 902800
9241 902800 950162 912724 884011 860196 852005 787002 702675 777985 868859 849951 861294 898356
9229 898356 866159 861598 899651 994613 1104474 1165036 1207603 1233267 1221405 1166714 1078512 1016552
9217 1016552 1014143 903874 892292 952555 932313 965268 986058 1052952 1039665 1043496 1081550 1096485
9205 1096485 1115136 1136786 1122163 1025688 920222 878884 904302 882832 902150 881175 784230
9194 784230 696072 602441 575783 748123 850208 925607 910441 923292 910216 922498 968290
9183 968290 893954 898655 793553 730350 734545 723235 736544 723250 676834 637103 676212 680969
9171 680969 756212 788432 738381 637584 491431 588017 583240 483513 450630 603036 605407
9160 605407 601571 546406 612422 656033 749586 732262 691143 666992 517660 465939 503562 502925
9148 502925 438823 297755 345343 365194 446265 379826 446274 517158 549782 529931 490753
9137 490753 433123 406601 444736 511755 427856 376931 423352 356690 299264 287511 336384 482181
9125 482181 531043 516868 518317 433925 405355 350568 474169 503967 437089 459109 387421 349165
9113 349165 386276 363782 383016 438902 481496 442978 428647 481964 497661 475896 342365
9102 342365 366979 374421 421372 406108 391803 420168 328120 394561 520980 470705 351192
9091 351192 260903 283600 399575 510654 451299 401663 417018 496165 539249 455452 420727
9080 420727 381784 385709 471318 508165 454118 395320 315469 380585 393642 409979 421090 471746
9068 471746 498244 471166 453386 385629 401899 416558 389020 453932 413777 432947 450778 421354
9056 421354 381149 415379 409795 349268 330152 299864 260221 282573 313703 308015 380971 418499
9044 418499 370067 298709 333098 271805 230100 310640 413070 516691 612432 598746 493664
9033 493664 425613 405927 241904 216408 322345 371504 431567 496982 471397 471793 479274 410077
9021 410077 325885 384488 354818 268838 197861 161224 215851 341544 395853 360973 294638
9010 294638 275666 163077 183993 328039 297417 283738 282012 324233 291584 181659 204440
8999 204440 167210 130365 105159 206964 267369 284520 270822 251008 268957 320906 390637
8988 390637 352432 398928 453615 478737 464284 377698 252680 169519 231397 257403 234528
8977 234528 199786 107384 97852 218115 216711 232201 336874 383509 414405 274155 283961 247406
8965 247406 268183 251016 328898 304564 354071 374551 235545 227988 372605 452721 473484
8954 473484 454475 417478 375181 448114 497015 441941 427448 339470 377989 485759 455274
8943 455274 402663 383224 340263 393248 298255 252514 244268 233716 275248 308196 265371 292440
8931 292440 258383 201866 156168 332920 425971 356698 350445 347017 276781 283060 287985 350989
8919 350989 305298 317594 303777 215867 206582 329991 366956 354641 440565 428193 391251 355827
8907 355827 388952 393466 341683 383161 359273 321464 356258 265376 208203 214187 321087 369474
8895 369474 350107 370941 337503 300602 288010 346797 392672 414930 395915 417013 486523 538947
8883 538947 566451 578917 630541 695470 737161 745178 794759 790016 815897 918038 1100572 1287307
8871 1287307 1244004 1301173 1506909 1731136 1921317 2202643 2761546 3624254 4479624 5245147
8861 5245147 5566597 5081092 4348843 3567653 2881573 2438746 2219918 1995212 1773196 1650806
8851 1650806 1546217 1392883 1419104 1431383 1370707 1327814 1166634 1091520 1184922 1218878 1239473
8840 1239473 1201388 1103315 981534 982121 974157 928853 839244 809226 810439 852864 818584 773150
8828 773150 814760 958877 1041885 972950 936857 1014163 989033 865145 693976 565861 572458
8817 572458 587617 618961 669104 690702 599743 599540 597503 577866 587787 542543 522253 473722
8805 473722 517642 561354 531359 452779 395229 386910 312267 282022 393573 435940 420586 377299
8793 377299 296069 328087 439266 533438 387372 272289 297892 356661 271185 242395 254264
8782 254264 280999 301486 304221 327393 410605 425087 406585 449659 478673 422133 384883 374939
8770 374939 452587 504595 536971 505653 452383 345310 377989 415981 431594 345061 230157
8759 230157 223946 264754 298746 275294 320064 421185 360103 355060 403307 401217 335019 301559
8747 301559 306458 307922 347828 350505 321342 321870 366599 291953 292921 376204 393830 434776 433123
8734 433123 388830 312858 323869 325715 225201 154905 261986 268038 241585 240780 251675 285534
8722 285534 310719 338491 266444 302038 290858 339251 316421 318876 311693 283075 315731 288588
8710 288588 328830 352633 367248 379673 361989 371379 396562 448359 380708 313223 276741 316257
8698 316257 229949 145491 128449 138374 69354 2511 13578 65404 47721 155330 137719 121264
8686 121264 144929 116422 68942 66112 60718 123097 230116 310772 269378 296575 292138 324980
8674 324980 348684 279797 236366 181079 183645 237789 265120 255811 220330 194411 131455 185408
8662 185408 316226 303664 275415 175350 160786 222720 272780 293375 366005 339529 277991
8651 277991 349345 325433 298119 308903 298985 297538 265366 212465 177229 219942 212692 202725
8639 202725 225704 226972 186501 140198 143665 199998 164010 111247 212234 319718 425959
8628 425959 421763 374465 383260 367902 371675 384568 326526 311087 315697 342348 345524 341148 370893
8615 370893 284663 144469 91576 171266 248261 331433 346368 333600 267937 324859 296760
8604 296760 271303 202886 197583 219614 234310 255555 286305 350625 415502 523091 562495 664405
8592 664405 652172 571639 411886 441559 543273 573750 461751 459856 575738 684033 706981
8581 706981 669680 552999 541286 553967 507073 421873 444251 379718 406106 423544 398017
8570 398017 433721 465606 337372 317815 285118 242909 246186 302463 332729 342121 287226 297874
8558 297874 375193 369887 322758 305852 288849 283901 366663 365690 322267 331961 381443 321671 264254
8545 264254 419693 451090 357185 407029 403940 304523 360297 323982 313986 339865 355158 313926
8533 313926 289776 293018 218412 244850 251293 307458 280261 228522 265847 234850 170573 107147
8521 107147 102720 124956 163154 253807 324352 315413 306184 306659 288627 254571 209811 221388 245362
8508 245362 255914 241330 187440 208315 270624 380689 430038 381047 357582 306590 330877
8497 330877 368025 406582 347707 295968 308188 255248 214998 242651 293983 328497 267036 264842
8485 264842 260926 271482 216268 143526 186192 131083 73782 74330 96267 38420 145471 227680
8473 227680 196425 155363 122976 157772 234915 342557 365811 332221 427070 424609 372340 373841
8461 373841 342844 361046 281698 230266 249663 319701 322508 339129 386245 355520 260052 121907
8449 121907 62818 117484 185087 226785 291019 305192 260026 248122 252969 260911 209745 112912
8437 112912 144860 192446 2803 25775 191801 252094 175386 228223 253072 200370 154421
8426 154421 102523 146341 190031 190178 153519 217814 276981 247431 202422 170836 183621 97091
8414 97091 103344 119934 118907 163325 156828 146952 175554 175535 196342 161166 221975 289794 262173
8401 262173 223552 186786 27964 -1075 71492 79176 29223 -5223 34475 113492 134105 77024
8389 77024 41778 54835 84713 88651 121648 231615 219749 157282 105551 117014 216432 215953
8377 215953 230414 325481 325773 193133 66235 96745 122564 200738 154074 133054 195661 211827
8365 211827 190761 123165 175011 160405 148179 159882 216590 253546 268824 281387 391821
8354 391821 493293 405942 359574 278387 211829 195714 201178 158607 99638 68213 72520 102039
8342 102039 158142 135599 125051 246020 333222 283965 225583 144120 142475 143887 57491 33888
8330 33888 158628 191729 145866 150019 124636 57508 49422 84158 138783 165660 37487 19023
8318 19023 -4160 50353 164377 225547 207205 202060 179560 159040 179201 144183 69147 38647
8306 38647 84109 4943 46352 139267 199183 256632 347643 243954 240009 170606 185332 216503
8294 216503 185283 266408 236448 132220 121676 136234 150478 157582 206596 155606 133615 143986
8282 143986 211753 278239 287537 219579 230010 231203 209232 173622 126841 132446 174719 141141
8270 141141 132584 94490 38657 -1805 57853 224210 280559 233034 103577 52785 11956
8259 11956 -2050 -59488 -74373 26139 41093 48277 27157 2190 3321 34024 65210 50887
8247 50887 24899 28662 105492 70698 111689 183702 173041 170852 205709 166708 148492 251668
8235 251668 197291 124129 108869 12207 -30389 132415 186144 184356 214410 184022 154474 113043
8223 113043 101674 23771 107134 115686 125612 107843 186018 260154 258179 246008 278609 224522
8211 224522 221574 294139 312483 257373 189181 191764 162179 123047 138483 169760 75041 83829
8199 83829 103973 96009 85182 32090 31297 -68587 -55878 62070 66447 59417 107156 170702 231356
8186 231356 263707 224670 207067 216897 143938 132210 98526 86290 173943 164311 85675 64988
8174 64988 95372 224551 288601 166026 106970 141982 200753 136552 184967 157319 81707
8163 81707 40231 59625 128039 217847 268962 261181 163669 141597 89432 34500 19937 35807
8151 35807 98954 80883 9691 81195 97794 121454 156400 156440 156147 213709 239961 205648 157851
8138 157851 42417 54344 57572 54568 144788 139690 146462 195667 190049 270477 323684 333928
8126 333928 247858 126688 10277 2926 69715 112994 103687 161708 230935 346248 356990
8115 356990 130884 -69241 -119207 -29584 8836 131151 115676 36675 52299 57395 126104
8104 126104 150256 135656 101349 106286 137867 148855 129200 45746 99049 220618 211138 97609
8092 97609 83593 135153 171870 136570 150280 109984 64305 60685 63317 171496 157314 80194
8080 80194 -3398 4271 27252 -5432 -2206 -5177 26777 120636 180226 130981 152174 187899
8068 187899 110518 71527 5898 26444 -17866 -19172 13457 112314 174867 145552 -35091 -61460
8056 -61460 56870 118285 80458 69054 65200 23309 15444 4630 51990 36343 71439 122607
8044 122607 85041 60709 137821 188133 228559 158202 108380 135772 164892 176221 208332 167998
8032 167998 112453 70982 26946 9599 77602 146567 171304 171412 186088 254842 185251 141672
8020 141672 166826 133530 123591 167021 142747 78987 150626 187895 192580 197636 196853 163134 192376
8007 192376 233246 278206 318882 342247 315018 289031 215499 151093 10870 -106621 -31918
7996 -31918 110044 102266 79544 127646 182421 245303 203136 120855 133769 167790 125649 147226
7984 147226 201885 209355 262976 259951 278550 307071 256350 215218 208752 166602 152240 200453
7972 200453 235188 236257 305203 261499 153119 159862 122172 141422 145650 160103 127508 158079
7960 158079 237334 197625 147753 93273 12501 8917 38554 52017 164928 236423 235166 202523
7948 202523 277730 306893 375512 399463 416806 327236 327489 333431 296979 318427 231829 128228
7936 128228 178349 261038 176225 147845 63536 67691 76906 173178 259672 150394 124484 205664
7924 205664 239321 185610 137894 202744 259735 341657 396733 351905 368316 329676 377683 330388
7912 330388 262221 261509 237159 246786 245708 280736 303586 330682 452312 406426 398501 405030 391176
7899 391176 409429 387148 334270 267510 288126 361957 333090 299634 258928 225981 166196 114202
7887 114202 103100 130585 199432 222922 221398 310463 272730 192246 170686 162497 196180 170315
7875 170315 168778 235348 226123 212568 222252 221049 238025 293962 160655 34081 -19939 13103
7863 13103 100035 226912 217691 123497 156412 248944 188138 100006 137457 184403 221793 231039
7851 231039 221552 117813 82123 116763 105301 108433 142518 107910 98749 133436 177334 217013
7839 217013 194199 277428 314809 239100 225130 284475 198611 167364 179710 157045 125524 188300
7827 188300 215410 214132 172581 175459 101184 138344 289166 290586 263416 159558 117888 154360
7815 154360 196049 255708 209115 86437 64235 101601 219182 226796 193685 84358 36675
7804 36675 66038 8109 78268 67755 8975 8294 5462 17517 79352 14584 14297 62487 130123
7791 130123 129735 113916 176624 331256 340023 232892 153052 41592 83046 179456 197313 208086
7779 208086 92587 -43212 -65792 -12240 162855 163749 120391 114034 29395 -17251 49526 94689
7767 94689 67485 28083 122289 119766 102724 92894 86505 43628 -37781 -83062 -24756 2411
7755 2411 -38528 -129123 -31981 64165 71546 55042 68604 84266 124035 114958 112085 111001 42026
7742 42026 55103 75150 140020 158039 193636 166353 127340 119419 106040 34798 62708 92689
7730 92689 110046 50214 81794 687 -17607 -10510 -104073 11189 142768 140305 103526 26348
7718 26348 90819 126643 146364 150955 123838 45131 42651 15436 -16671 -31432 9370 64791
7706 64791 101298 70258 87027 163820 147209 -42147 -22855 74872 77902 58451 76491 104107
7694 104107 55447 -32821 -72420 -40973 -22218 67519 79206 59093 32255 58561 64027 6761
7682 6761 -34276 -34274 120309 131559 82587 3773 -20411 76446 86064 35664 40082 80878 40099
7669 40099 85473 151834 138905 51607 7093 49098 22619 23572 115713 124304 20328 -111745
7657 -111745 -108366 22459 85938 108222 128744 81763 150931 89723 23900 -11183 -20146 -17105
7645 -17105 39769 16576 45426 77387 90548 142729 173432 191129 150548 95229 80047 90358
7633 90358 114663 58647 -11040 56684 17306 17937 34524 -54942 -98135 -106940 -42816 47853
7621 47853 71790 102439 95539 96064 69527 67463 47050 -12565 -59607 -103743 -72993 43095
7609 43095 50384 8805 -63726 -118623 -66553 16280 47294 59640 53103 79820 -5427 -31438
7597 -31438 22559 -21281 -104790 -61709 -40623 -28055 2576 -1308 37116 128777 132649 95256
7585 95256 22066 -83614 -56601 12809 35545 24821 2333 -61874 -13996 -16874 44966 29572
7573 29572 46554 -22757 -89544 -105715 -73085 -99140 -41265 -46654 -57108 -19767 106615 138063
7561 138063 89879 26734 -52630 -63326 -36621 -94314 -98766 -13734 118009 56956 -1836 4895
7549 4895 -16265 106139 90976 55974 -41635 -5151 36583 112566 126531 157580 170639 81159
7537 81159 -6381 -24817 -22132 19438 21942 -14632 -63176 -147647 -137906 -68983 -79811 -58550
7525 -58550 -87002 -29626 -49275 -45049 -5164 16286 64075 48588 57622 35264 -61326 -37562
7513 -37562 16191 11757 27332 -15388 15006 -35589 -61711 -84726 -91040 -111970 -87967 2803
7501 2803 60468 108055 81932 30382 107392 181044 228369 217609 142446 33189 -7891 -9922
7489 -9922 22926 89086 73058 44088 30759 -6072 -70762 -88582 -140334 -118773 -76513 -94690
7477 -94690 -94144 -178654 -228210 -253879 -226356 -258460 -260685 -227304 -239722 -199542 -156085 -78209
7465 -78209 5463 54528 7932 -87034 -150889 -163429 -130215 -5878 -10769 -23322 12714 5658
7453 5658 145769 235177 205723 156016 72483 -15498 24929 -4018 -64254 -40600 27842 68846
7441 68846 86743 7681 -69223 -3713 8752 -31260 -32646 -15925 -32602 -53270 17101 -340
7429 -340 -85285 12963 56691 -2103 -144885 -201901 -173724 -77819 -21761 36310 31990 -74254
7417 -74254 712 106399 119524 70361 25859 -28111 -66722 -20747 25499 44118 -40388 -173426
7405 -173426 -150138 -95750 -65581 -112542 -73235 -46775 -109370 -38242 186921 100694 20306
7394 20306 -9703 -16872 -9116 -66478 -122192 -226834 -189753 -88148 -76987 -113496 -133972 -45083
7382 -45083 7283 10085 37960 55837 9924 -31928 -1745 106237 66818 80646 161162 160137
7370 160137 116823 139008 142553 -61850 -93838 10875 51612 36980 -9053 20185 94859
7359 94859 156749 92214 65342 110313 144735 92795 74816 88443 22697 -38872 43930 -42579
7347 -42579 -42217 -11691 50625 141067 150629 201856 99359 -5554 70227 95900 71043 62852
7335 62852 24859 -72257 -166714 -99301 22236 66231 -60643 -66403 -35927 -57545 2047 109569
7323 109569 165389 147807 103779 61924 116208 44531 5812 -22497 42331 56910 -21027 6549
7311 6549 11799 -14701 4441 -15552 -47032 -23123 -87524 -44609 -13850 28248 13178 67206
7299 67206 31349 -24488 72448 92101 -16253 40010 153652 162230 101459 72651 67427 47027
7287 47027 121808 140289 -6553 -48475 -37642 8884 9457 20176 49962 69572 -31375 -40955
7275 -40955 -25520 -54509 -88825 -89091 -38923 -68311 -94265 -181998 -176688 -136807 -97330 -46712
7263 -46712 -80300 -20811 -21299 -39522 -84427 -95614 -48020 -81499 -126377 -122801 -115870 -61238 -65561
7250 -65561 -90317 -141784 -127665 6708 4150 -98337 -117280 -127209 -144744 -47693 -53052 -59471
7238 -59471 -109143 -128199 -165698 -175199 -55083 -35991 13006 338 8365 26661 -28431 -168307
7226 -168307 -160379 -143192 -28075 -19317 -62984 -65130 653 -13471 -9825 60314 7182 -5570
7214 -5570 34046 -43541 -82765 -42423 -26807 -92404 -25563 28836 -3555 -25778 23136 -37617
7202 -37617 -43625 -7539 -67108 -116213 -139959 -135685 -199094 -155434 -19062 52330 108243 140983
7190 140983 77195 1778 -57392 -41291 -64466 -80136 -6672 -9308 28825 -23402 -16889 8253
7178 8253 26230 -82002 -103844 -111883 -129836 -68863 -38236 -26339 -40950 -91754 -50802 26506
7166 26506 33737 51079 115520 194192 192145 131934 86970 77100 17566 37216 -15750 -44039
7154 -44039 -43702 -45348 -26475 154846 142199 38143 3465 35135 -43129 -60777 -20287 28128
7142 28128 80161 118950 46940 4922 18102 -57861 -67827 -104338 -147659 -54043 -134713 -123816
7130 -123816 38249 -4344 41280 120995 87319 123899 125907 86905 35528 -703 -48826 -31063
7118 -31063 3816 76724 112923 119953 50424 -23963 -94929 -191224 -255102 -151422 -111494 -19981
7106 -19981 -40785 -25647 51200 26852 41304 93439 20996 41564 -35613 -17920 -6360 -16182
7094 -16182 9384 59349 17773 14932 -20271 24975 -3345 -89962 -92521 -85208 -207858 -214809
7082 -214809 -251407 -281081 -208346 -170100 -159882 -89375 -66022 -41520 -36541 -42097 -72342 -98913
7070 -98913 -109794 -78516 -76328 -2326 40403 30189 -68508 -85312 -121944 -176075 -78780 55414
7058 55414 8595 -70113 -123132 -151486 -21798 112978 37260 -58489 -143296 -64982 6595
7047 6595 105605 167748 100863 56720 15908 17755 12737 -57745 -60999 -38394 -12764 15084 27823
7034 27823 -19161 19280 6007 101776 162356 101422 55438 61188 57226 37470 41237 1715
7022 1715 -27315 -55566 -86016 -89255 -51689 49989 139314 174500 104976 106294 59490 1542
7010 1542 31304 80520 86993 122202 53614 24726 6074 43198 150348 235069 161995 46921
6998 46921 107370 133527 4715 7256 3525 117304 61925 33934 106523 132491 21334 -51764
6986 -51764 -50844 -14449 -75222 -93379 -63495 28656 89641 -26971 -80019 -7837 -101199 -97110
6974 -97110 -13047 -16938 -10061 89246 -8985 -74483 -8635 11501 -59654 -139297 -83691 -97778
6962 -97778 -52973 40960 87952 211890 209562 132859 173014 163097 124441 116322 86566 -34892
6950 -34892 -146030 -110026 -71278 -38334 24476 11722 -18001 16533 49759 1396 -62407 -108728
6938 -108728 -45494 -5879 27055 24109 -18671 -34882 58402 105700 86684 121577 64099 -25751
6926 -25751 -84697 -11658 120891 188201 71597 -63042 -140374 -94000 121260 223394 117331
6915 117331 89203 107701 85989 -22341 -146495 -96504 18192 62748 35904 44752 45748 77272
6903 77272 128649 88038 55637 88922 104363 147914 149625 168894 100453 105374 13826 -45026
6891 -45026 -36139 -82216 -28367 9043 18168 28217 637 -44026 -59997 -36064 63455 133424
6879 133424 58030 16537 28442 69834 74423 114943 209079 203450 127644 60635 30946 26377
6867 26377 53409 39970 -5687 -50703 -79688 33753 97871 96150 93555 190195 185597 113430
6855 113430 106374 76112 54677 -8969 -34074 -3204 -67743 -75049 -32323 -23324 -42973 28652
6843 28652 23948 -35919 -121612 -35887 61708 85282 -60157 -161868 -152889 -75516 -105611 -116311
6831 -116311 -133054 -167878 -106306 8904 61606 53272 27261 -7458 -20484 5932 93082 210209
6819 210209 188494 53292 64573 86311 81162 65960 87030 117050 103514 40763 32987 -53576
6807 -53576 -66917 31615 40651 36323 -74838 -59307 -61540 -55124 -7389 14657 35932 113411
6795 113411 126043 101829 108456 111644 154228 118811 11877 -16194 -162570 -183264 -29217
6784 -29217 -30666 -154747 -75328 -114454 -146313 -118645 6062 -45627 -112699 -103293 8426 66694
6772 66694 47999 -25214 -21693 -57034 -45732 29005 46732 62123 30188 71603 82193 10524
6760 10524 -80597 -79676 46712 49144 72620 128931 61979 10812 105972 87716 89840 102082
6748 102082 74590 -8933 10811 40888 10113 -23851 -9494 -19452 -114780 -78224 -23630 -2398
6736 -2398 -21802 -58082 -7380 9688 -25197 -104876 -88993 -79414 -14069 -30585 -145803 -110491
6724 -110491 -47913 -26859 5197 -44051 -15591 28560 160702 229295 291347 237530 191940
6713 191940 238749 263068 279903 373280 403255 347188 312952 319962 177962 81044 56517 15232
6701 15232 16420 100174 156411 148896 107837 88975 125116 102287 68213 88306 51866 1412
6689 1412 43756 -5192 -30091 77425 12845 -68666 -79018 -53587 46011 52835 -73713 -29040
6677 -29040 65785 87264 -14869 -118174 -124980 -69608 51400 44583 -10934 -91188 -106138 -41717
6665 -41717 35874 1309 -36248 -2063 -37799 -160191 -198179 -133611 -61177 -100584 -91976 -17946
6653 -17946 -58132 -113691 -156849 -104209 -70681 71195 60609 -71996 2601 35747 78924
6642 78924 63299 57287 124810 111699 164998 200732 127797 88060 61594 24177 -23205 -67103
6630 -67103 -46692 -6711 30075 8483 -78425 -10710 68207 89575 -51502 -120145 -152238 -163673
6618 -163673 -139215 -74239 -56992 -67352 4891 -62517 -104334 -72684 -28863 -37912 -62853 -48683
6606 -48683 -59224 -93414 -114612 -155311 -122127 10430 38550 -37886 -15207 49945 24932 2900
6594 2900 23026 28337 -8198 15436 -24890 1978 101366 58500 -8867 74075 60026 -12108
6582 -12108 -51737 -30597 -49275 -107939 -115807 -172424 -257515 -249006 -186870 -115048 -112974 -117799 -108852
6569 -108852 -103809 -103373 -56249 44498 86602 45756 -15442 27341 -21519 -81400 -91019 -118639
6557 -118639 -36769 7929 -21187 -59450 -171251 -128132 -100320 -119267 -147718 -119520 -154603
6546 -154603 -109306 -37324 -54971 -32317 -27733 -56226 -176683 -193941 -117904 -44413 -13744 -10468
6534 -10468 13266 -32727 -72269 -74890 -45163 -19610 -56034 -96159 -46064 1615 -53367 12647
6522 12647 45160 35910 16791 -48263 -21094 -53558 -85106 -92533 -95228 -88196 -94252 -4381 -52786
6509 -52786 -138742 -171647 -137667 -96629 -163927 -59254 30873 10217 -30079 -25054 14222 31473
6497 31473 -47481 -32109 -32147 74467 108720 87931 90581 48913 -36027 -84064 -49019 -31381
6485 -31381 -25867 34484 26752 22818 -5875 -26138 -24182 -66325 -116697 -95037 -60848 -76952 -125973
6472 -125973 -158602 -168982 -47348 27977 13913 -23020 36617 169929 148405 124756 108512
6461 108512 94841 -57896 -105720 -43973 -10368 -7862 16025 58262 21081 -25986 -6447 -50356
6449 -50356 7200 24127 -26250 -52780 -6657 17064 30099 68803 154295 220783 252843 171394
6437 171394 -1800 2301 64091 79020 873 29100 -769 -51119 14745 126091 133356 63859
6425 63859 -114232 -200813 -202982 -185735 -81471 -23313 -33061 11972 87327 -17576 -43659 -82462
6413 -82462 -53942 23487 68487 52873 10378 -28151 -51663 -75760 -29629 -102364 -204530 -161376
6401 -161376 -136104 -159414 9576 85710 54595 2905 -60075 -71508 -29691 -16829 32902
6390 32902 46741 40608 44762 53292 -29853 -15138 36433 -33146 -94206 -95797 68504 168205
6378 168205 67363 -32381 -49540 -77129 -109058 -120020 -139414 -156263 -134613 -90017 -64909
6367 -64909 -91739 -203570 -207195 -165705 -122180 -146971 -115477 -79899 -54344 -82421 -59801 -70970
6355 -70970 -96575 -79531 -96175 -147696 -46831 84867 112755 59205 64945 49318 13167 -86267
6343 -86267 -89460 23715 52644 -9273 -77510 -139809 -63544 14008 55525 1016 72849 6899
6331 6899 -91568 -68599 16106 67012 30257 -29648 -8174 -39587 -131332 -57047 23163 17148
6319 17148 -504 -4398 -5954 -25724 65785 153496 34687 -105378 -119428 -126768 -82344 -34466
6307 -34466 -30950 -44340 -74977 -62018 -76274 -139003 -175240 -55766 68591 116598 109189 63852
6295 63852 58226 50413 77890 47111 57211 50246 29666 47141 -70442 -4758 51521 76456
6283 76456 20794 19893 46303 -32903 -62555 -9209 -32584 -88379 -52692 -44495 -35328 39616 -3955
6270 -3955 -495 -21648 -104510 -109571 -176074 -252162 -222448 -107789 -112345 -157825 -225448 -326649
6258 -326649 -301423 -179698 -109341 -94809 -77795 -31159 -110829 -197388 -243788 -238065 -118348
6247 -118348 -56768 -37676 -37302 -13589 25028 60554 49551 -91571 -68101 43356 67093 48767
6235 48767 36622 -68878 -127497 -124450 -158203 -200949 -197092 -227126 -127955 48976 37130 -100030
6223 -100030 -239603 -177000 -54243 -113962 -118438 -40717 43357 21930 -29738 -115247 -108395 -18604
6211 -18604 47664 62900 29640 41248 62600 24681 52514 31239 62777 42973 20402 16927
6199 16927 -21253 -16511 -31015 -72740 -54404 -48962 7543 31991 -27332 -104217 -8295 109612
6187 109612 8106 -53688 -64977 -52759 -105706 -157836 -123863 13715 110056 115410 143248
6176 143248 83031 -12652 -79137 -59008 -89090 -93921 -79780 -209687 -207397 -215100 -131175 -40855
6164 -40855 -56128 -159493 -152747 -121149 -86617 -117765 -27345 44938 154876 271561 283853
6153 283853 237182 130976 28005 -86224 -42446 76171 44733 -43100 -118569 -133118 -165674
6142 -165674 -125431 -201343 -199678 -105458 -94139 -60066 -6674 16871 -48011 -68114 -107558 -113663
6130 -113663 -119596 -172198 -154550 -94643 -80420 -93907 -53236 -109074 -163286 -159415 -94948 -107561
6118 -107561 -71051 21461 91709 -52718 -124866 -128981 -104135 -110836 -12530 30240 -71442 -2702
6106 -2702 -33 -59226 -73672 -43648 -44502 12942 59056 83954 47712 22342 81222 91987 392
6093 392 19369 7372 -45847 -27238 40554 -23786 -132245 -109174 -49328 74377 63301 58796
6081 58796 120425 185310 107069 -21211 -73272 -49721 -21467 -84051 -70425 -79517 -82197 870
6069 870 119023 171154 130139 80851 96666 171794 144391 85659 41625 -11921 79366 26835
6057 26835 -65920 -116251 -104574 -9046 -101630 -17827 63183 66243 41636 24197 -25402 -20964
6045 -20964 28898 34893 10578 -73926 -134030 -84034 -51397 -31059 -40862 -75840 -147194 -186492
6033 -186492 -145781 -78083 -28792 -43021 -36769 -66393 43270 118631 78259 31152 -39747 -64535
6021 -64535 -90586 -53031 15387 35475 34996 12104 -43220 47145 98119 114758 10458 -84243
6009 -84243 62572 85073 -8252 -43274 -23796 34174 12432 -21599 -16680 -69585 -65086 -28284
5997 -28284 -53891 -860 11144 19118 -25289 -174567 -245560 -218240 -144518 -40312 -7257 -63049
5985 -63049 -31478 -87996 -77118 12239 -1751 21870 87447 157335 86072 82562 26757 -7588
5973 -7588 -83523 -102269 -59124 -12702 -75811 -92635 -4889 -34476 -94124 -96156 -99242 -144790
5961 -144790 -165064 -110735 -39010 -126957 -187167 -132549 -129069 -138297 -171495 -195617 -179054 -116970
5949 -116970 -136529 -54395 -71425 -44551 -69975 -79032 22669 50626 -44803 -141483 -38670
5938 -38670 57223 -68887 -124245 -70831 16895 59089 59817 65848 51832 78708 42735 38489
5926 38489 9960 31378 5056 -6236 -67595 -139479 -90230 -83021 -136606 -74323 -131467 -169247
5914 -169247 -59537 -2005 -16777 -105530 -46455 -21610 -128623 -177347 -151710 -129097 -73133
5903 -73133 -128072 -89072 -48197 -18305 129710 77763 -50438 -73908 -47700 -34274 -102359
5892 -102359 -84459 -114572 -167421 -186023 -225157 -178793 -26528 -44345 -71942 -92111 -121115
5881 -121115 -83881 -25954 -16000 -3326 38797 -15223 -81250 -88274 -80334 -195612 -186487 -157597
5869 -157597 -168414 -134522 -66345 -49342 -112712 -102849 -121543 -114037 -16795 -13198 15325 -86193
5857 -86193 -61782 -134821 -150062 -105695 -98856 -3407 16223 -64736 -74744 -37713 -63451 -138050
5845 -138050 -89853 -63088 8135 79992 85788 18894 -17267 -2312 25850 11825 -51874 -81977
5833 -81977 -96838 -33841 -57306 -142741 -93447 -47170 -73276 -51987 -56553 -22249 -51716 -695
5821 -695 46120 80805 117116 189098 87279 36448 30489 22255 3969 35163 7155 40996
5809 40996 119125 112301 72753 55312 -16023 -100981 -66022 -55139 -167205 -75769 16399 -14610
5797 -14610 -13855 9543 30023 -5388 -60739 -94214 -14473 -17044 -37733 -74005 -119689 -79933
5785 -79933 -97475 -45954 -48389 -89271 -24472 -66803 -97790 -33691 63269 -15291 -110583 -113500
5773 -113500 -17633 53516 24159 134033 149355 55319 16289 67703 71887 19541 23173 76782
5761 76782 67992 89340 109087 60965 -36394 17222 18605 -14979 -2681 -74562 -128366 -86955
5749 -86955 -68374 -81956 -59082 -107297 -137784 -45445 1780 -51538 -147632 -197548 -39540 21312
5737 21312 -52561 -29087 -77748 -124835 -59764 -9321 -81620 -113935 -23686 -13722 92484 109057
5725 109057 -36361 -156910 -126602 -91674 -97446 -141077 -144590 -154667 -111305 11319 29765
5714 29765 -11720 -52842 -59163 43567 49259 -36746 -23015 -13092 -26566 -17264 58919 112746
5702 112746 108632 59267 -632 -23396 -32216 30612 25796 19153 28997 121590 201274 214879 122290
5689 122290 77676 79765 99650 45062 -15868 -66461 -101370 -148594 -114169 -32186 14418 -13683
5677 -13683 -57005 -110387 -140554 -205339 -202222 -86422 -52866 -106704 -36207 -27352 13266 29929
5665 29929 17428 -4892 -32448 -31029 54628 87651 12018 80802 162870 35721 -23670 -3128
5653 -3128 2567 -96866 -96259 -29230 71388 164056 112036 -53595 21337 34246 -52919 -30346
5641 -30346 -48689 -46949 -9648 -30182 22713 143433 154224 69142 30405 -68532 -59666 11394
5629 11394 83124 7466 -36581 -59289 -80288 -25549 65214 123594 86449 -27238 -65679 -15750
5617 -15750 -50078 -127551 -130024 -162340 -119592 -154116 -144669 -82461 -83543 -62319 13487 40467
5605 40467 59977 31254 -74771 -75175 -61244 1781 61096 -10260 -93672 -140477 -109551 -63111
5593 -63111 -53779 -94363 -66717 -23680 -37298 -25721 -27661 -40712 -60467 -81882 -7672 73093
5581 73093 154959 203194 146423 25082 12747 -44133 -44694 -42829 -47916 -18998 -29710 -2391
5569 -2391 113282 83691 18705 -60795 -174005 -122988 -90375 -50738 -149636 -225607 -228034 -146413
5557 -146413 -97959 -82314 -74441 -116094 -145154 -160576 -165170 -139697 -88801 -48296 4111 -11659
5545 -11659 -23319 -43682 -31890 -26089 -4684 99762 145193 105115 141094 122310 138773 146007
5533 146007 67077 10900 -21640 -111611 -195629 -133009 -83308 -56448 -122481 -183232 -150422 -94582
5521 -94582 -37863 15728 -60762 -21628 -82954 -86084 -112179 -111244 -124739 -35148 -11498 -143796
5509 -143796 -237791 -212550 -171566 -103043 -30473 17656 -96237 -168078 -78734 -50399 -97480
5498 -97480 -82079 -9381 18030 74253 92557 48152 45027 91185 35358 -9815 -58862 -5615
5486 -5615 12895 -50594 -104922 -84357 -26107 32660 11100 -27582 -37274 -40170 68523 105755
5474 105755 157900 19287 -100194 -82798 -300 49931 7384 -22296 -69135 -49888 -32044
5463 -32044 26489 7569 -10189 40819 -51055 -122795 -141338 -71677 -58807 -40347 -14161 961
5451 961 3672 -93298 -139873 -149533 -195451 -143439 -40153 -31433 -26955 -5812 -8051 -47881 -108657
5438 -108657 -97201 -64093 -94049 -26511 -52128 -81078 -105911 -96444 -43902 -94738 -86427 -87022
5426 -87022 -94406 -153137 -114490 -44633 47016 27905 -80516 -79089 -110004 -106583 -92244 -41636
5414 -41636 -6867 74324 71213 -11729 -47662 -21668 14066 -91116 -112492 -35000 -38622 -11822
5402 -11822 38144 13749 -33172 -95124 -79261 7562 39704 6017 -108534 -91035 -30340 -5759
5390 -5759 2200 -18750 -3622 -55533 -100816 -96964 -113618 -52887 -90040 -26683 76864 69544
5378 69544 -46204 -75915 -131660 -96485 -76346 -65934 -87526 17040 103448 51513 -41709
5367 -41709 -174649 -130982 75171 78369 10562 -3764 -44547 421 1222 -40548 2214 16104
5355 16104 10268 -75135 -170554 -33967 -70467 17115 79051 25950 74046 37482 3833 -79974
5343 -79974 -50270 16490 48823 48241 -18112 -101203 -154219 -153834 -120687 -95318 -108672 -122863 -62016
5330 -62016 -41476 -68164 24594 38780 -3433 16844 29442 -9688 -110454 -190424 -185754 -145820
5318 -145820 -154063 -178647 -199232 -173131 -123604 -116072 -152698 -124994 -133581 -176246 -206481 -249432
5306 -249432 -263985 -124734 -34924 -8296 -114763 -240300 -278798 -210914 -150790 -55119 -43021
5295 -43021 -68822 -96837 -88594 -24781 -77839 -169442 -97256 -102454 -186052 -235708 -199578 -125701
5283 -125701 -99209 -77884 -59134 -40752 -53879 -48967 -129441 -194207 -179880 -291412 -388521 -331612
5271 -331612 -218835 -146508 -75942 24204 60636 -34433 -222633 -282047 -203950 -5702 28768
5260 28768 -9853 -22319 -28906 -56437 -154047 -181674 -240062 -116006 -126629 -80876 -120916 -190580
5248 -190580 -167213 -54085 31861 -37644 -149888 -85054 18731 21845 -52324 -64513 -33903
5237 -33903 -124177 -147176 -198410 -233794 -136540 -146009 -131388 -90239 -30722 2064 -37142 -85561
5225 -85561 -71400 61190 -15974 -104255 -38163 100256 75252 38080 105071 98042 17934 32817
5213 32817 90778 126539 43999 10381 -6951 81855 13184 -34179 -118825 -142057 -81797 -109269
5201 -109269 -31554 29205 51617 49747 12961 -9948 74476 8066 -44614 -38478 -28598 -74848
5189 -74848 -52605 -44259 -3304 10164 105278 11563 86927 122063 70724 50457 7782 -50865
5177 -50865 -49884 -18380 -4880 -38927 -96961 -112567 -106068 -101304 -42872 27746 75836 51762 43759
5164 43759 44907 43815 39448 -9214 -27550 57110 76683 8165 77913 145432 97580 51782
5152 51782 19211 5007 30340 -7154 24150 42524 7062 7877 -46768 -116382 -167561 -119364
5140 -119364 -112497 -144205 -102390 -128730 -180113 -152017 -163747 -215463 -282793 -279042 -208988 -131664
5128 -131664 -55660 -134276 -103590 -86800 -127218 -77286 42790 78283 -84383 -267131 -241372
5117 -241372 -187211 -179623 -190564 -30316 25593 -415 -1879 47516 23668 -14714 24748 78482
5105 78482 82735 76457 110344 50416 -92906 -196323 -156260 -85842 5027 37682 -6216 -58974
5093 -58974 -38728 -3562 -106879 -102723 99184 110412 10862 35153 107733 1465 -150033
5082 -150033 -74223 -34474 20369 81444 118404 158108 102256 83632 38285 -27651 -2692 -3067
5070 -3067 -42517 -92968 -42989 43746 35257 78762 56278 128222 58382 29203 131431 104094
5058 104094 145343 145062 26573 40716 42475 12040 44961 52043 10081 73375 86257 70732
5046 70732 41924 28069 141395 107978 102239 134096 41344 -6473 -90237 -110928 -90525 -92676
5034 -92676 -49329 -94359 -146690 -238631 -254607 -196393 -75464 -126254 -138314 -212730 -228819 -134288
5022 -134288 -136014 -71773 -126624 -217311 -176506 -174863 -124249 -53034 -23708 7698 24622 -24956
5010 -24956 -46391 -8992 10378 -90223 -113157 -116943 -76972 -68467 -36512 4205 82179 -9633
4998 -9633 -85299 -106769 -168724 -227858 -119617 -11237 -42921 -146560 -149183 -18329 63868
4987 63868 74480 -12064 -68243 -22108 -12956 -40402 -24657 -64455 -95688 -47061 -47048 -76355 -123889
4974 -123889 -193858 -259682 -165624 28680 78049 713 -37688 -63466 -107568 -104773 -116682 -193970
4962 -193970 -161321 -148918 -80107 -148705 -170716 -191696 -235216 -184512 -220720 -272508 -208896 -231819
4950 -231819 -142619 -6410 48377 24161 60823 6215 -2556 15559 -26598 -63769 -61909 -52684
4938 -52684 4533 74490 -44296 -142081 -103269 -89549 -141379 -24010 33934 27656 -35778 -112495
4926 -112495 -170462 -162962 -98429 -105499 -136899 -100812 -78341 -88925 -170178 -219310 -218884 -152650
4914 -152650 -58774 5975 40394 3111 -31160 -103830 -94734 -71378 -61613 -13877 17796 -12394
4902 -12394 -8950 63382 62188 67936 59679 28540 -38020 -30728 -13435 -26434 12267 49308 49531
4889 49531 -13712 -29287 -35478 -87327 -163870 -126202 -101943 -190568 -214829 -205655 -117410 -30642
4877 -30642 -76444 -162355 -102672 -107879 -230338 -303743 -297807 -288704 -272346 -119226 -122640 -89488
4865 -89488 -42525 -14804 2512 -25478 -103118 -30270 -15066 1235 24223 48107 48295 73502
4853 73502 46071 16044 123056 154069 200741 137822 104515 87535 61543 931 -57332 -51020
4841 -51020 -31680 1370 19771 -1359 58140 26895 -24498 57950 64752 94358 152907 127936
4829 127936 -51107 -85563 -154868 -133664 -20902 72841 23911 -52179 2844 13001 15324
4818 15324 42365 -13275 -79216 -33452 -48459 13801 2479 -8173 -1903 -95494 -43488 -29354
4806 -29354 -43979 65278 93512 -7050 -112064 -65041 77229 189706 172181 81064 33846
4795 33846 -57698 -180599 -264413 -230700 -169063 -75618 -100167 -128053 -64749 -40842 47788 94863
4783 94863 67494 27683 11746 -3223 -73239 -34702 -26603 -127526 -125223 -147165 -97980 -29902
4771 -29902 -29964 920 -10949 -71828 -124175 -46275 -35151 -104119 -218819 -185630 -166980 -99148
4759 -99148 -37313 3678 -16690 -62117 -102786 -106992 -70661 -70754 11020 34086 61003 41121 -8659
4746 -8659 -27707 -15475 -21623 34466 64492 56533 7344 105856 95461 82815 -48403 -142777
4734 -142777 -213415 -174709 -182351 -102905 -55671 -136246 -126507 49854 17966 -93731 27655
4723 27655 38172 9137 -88467 -139859 -93774 -82650 -133357 -96350 -118739 -68350 33179 4539
4711 4539 -31849 -17080 8241 -3237 -16113 43091 126373 160936 48539 -63257 1527 38439
4699 38439 -26612 -22565 89034 117232 106198 118758 135957 89704 35313 -32301 -14764 -21968
4687 -21968 -72633 -55760 21227 85780 -25002 -19138 -57426 -42177 41646 61595 69641 59941
4675 59941 3444 -56064 -57045 -41715 -16273 -16474 10968 2066 -60405 -146726 -206489 -112217 11732
4662 11732 -48968 -16718 -27118 -60612 -31277 -25518 -17240 44966 -63250 4544 58099 3281
$$ [...]
##END NTUPLES=NMR SPECTRUM
##END=
