##TITLE=Analysis number 310102
Compound Code cc 46004
Book Reference 415/178
Project Code adrs
Chemist Name bos
##JCAMPDX= 6.0         $$ Bruker NMR JCAMP-DX V2.0
##DATA TYPE= NMR SPECTRUM
##DATA CLASS= NTUPLES
##ORIGIN= Bruker BioSpin GmbH
##OWNER= NMR
$$ XWIN-NMR		Version 3.5
$$ Mon Jun 13 10:46:33 2005 GMT Daylight Time (UT+1h)  MAYBRIDGE\NMR@NMR_250MHZ
##.OBSERVE FREQUENCY= 250.131544655141
##.OBSERVE NUCLEUS= ^1H
##.ACQUISITION MODE= SIMULTANEOUS (DQD)
##.ACQUISITION SCHEME= undefined
##.AVERAGES= 16
##.DIGITISER RES= 18
##SPECTROMETER/DATA SYSTEM= dpx250
##.PULSE SEQUENCE= zg30
##.SOLVENT NAME= CDCl3
##.SHIFT REFERENCE= (INTERNAL, CDCl3, 0, 16.4504)
##AUDIT TRAIL= $$ (NUMBER, WHEN, WHO, WHERE, WHAT)
$$ ##TITLE= Audit trail, XWIN-NMR		Version 3.5
$$ ##JCAMPDX= 5.01
$$ ##ORIGIN= Bruker BioSpin GmbH
$$ ##OWNER= NMR
$$ C:\u/data/dgb/nmr/ADRS/4040/pdata/1/auditp.txt
$$ ##AUDIT TRAIL=  $$ (NUMBER, WHEN, WHO, WHERE, WHAT)
(   1,<2005-06-13 10:45:55.94 +100>,<MAYBRIDGE\NMR>,<NMR_250MHZ>,
      <created by zg, POWCHK disabled, PULCHK disabled
       configuration hash MD5:
       62 19 C7 07 E1 42 D1 B7 37 6C 3D D0 77 39 F9 E6
       data hash MD5: 64K
       13 50 CB 61 2F 00 1E 21 1E 89 A2 F1 3E 11 27 0B>)
(   2,<2005-06-13 10:46:13.27 +100>,<MAYBRIDGE\NMR>,<NMR_250MHZ>,
      <Start of raw data processing
       ef LB = 0.3 FT_mod = 6 PKNL = 1 SI = 32K 
       data hash MD5: 32K
       70 B9 60 1F 71 14 69 D4 7E 1A DA 4B 4E 4A B4 04>)
(   3,<2005-06-13 10:46:18.16 +100>,<MAYBRIDGE\NMR>,<NMR_250MHZ>,
      <apk 
       data hash MD5: 32K
       13 DA AA 7B D3 27 DC C7 F4 32 C4 65 53 AA 4F 34>)
(   4,<2005-06-13 10:46:19.61 +100>,<MAYBRIDGE\NMR>,<NMR_250MHZ>,
      <abs ABSG = 5 
       data hash MD5: 32K
       F0 FA 02 E6 B7 68 A5 D7 4F 5D 68 8C 18 E5 B7 82>)
$$ ##END=
$$ 
$$ hash MD5
$$ E2 41 FC 4A CF 5B 03 E2 6D C2 A5 71 D6 2B 00 F2
##$RELAX= 
##$RELAX= 
##$RELAX= 
##$RELAX= 
##$RELAX= 
##$RELAX= 
##$RELAX= 
$$ Bruker specific parameters
$$ --------------------------
##$DU= <C:\u>
##$EXPNO= 4040
##$NAME= <ADRS>
##$PROCNO= 1
##$TYPE= <nmr>
##$USER= <dgb>
##$AMP= (0..31)
100 100 100 100 100 100 100 100 100 100 100 100 100 100 100 100 100 100 
100 100 100 100 100 100 100 100 100 100 100 100 100 100 
##$AQSEQ= 0
##$AQ_mod= 3
##$AUNM= <au_zg>
##$AUTOPOS= <7 >
##$BF1= 250.13
##$BF2= 250.13
##$BF3= 250.13
##$BF4= 250.13
##$BF5= 500.13
##$BF6= 500.13
##$BF7= 500.13
##$BF8= 500.13
##$BYTORDA= 1
##$CFDGTYP= 0
##$CFRGTYP= 5
##$CHEMSTR= <none>
##$CNST= (0..31)
1 1 145 1 1 1 1 1 1 1 1 1 1 1 1 1 1 1 1 1 1 1 1 1 1 1 1 1 1 1 1 1 
##$CPDPRG= <>
##$CPDPRG1= <>
##$CPDPRG2= <>
##$CPDPRG3= <>
##$CPDPRG4= <mlev>
##$CPDPRG5= <mlev>
##$CPDPRG6= <mlev>
##$CPDPRG7= <mlev>
##$CPDPRG8= <mlev>
##$CPDPRGB= <>
##$CPDPRGT= <>
##$D= (0..31)
0 1 0 0 0 0 0 0 0 0.06 0 0 0 0 0 0 0.0002 0 0 0 0 0 0 0 0 0 0 0 0 0 0 
0 
##$DATE= 1118655954
##$DBL= (0..7)
120 120 120 120 120 120 120 120 
##$DBP= (0..7)
150 150 150 150 150 150 150 150 
##$DBP07= 0
##$DBPNAM0= <>
##$DBPNAM1= <>
$$ [...]
##$SUBNAM7= <"">
##$SUBNAM8= <"">
##$SUBNAM9= <"">
##$SW= 20.6930455092707
##$SWIBOX= (0..15)
0 0 3 0 0 0 0 0 0 0 0 0 0 0 0 0 
##$SW_h= 5175.983436853
##$TD= 65536
##$TD0= 1
##$TE= 296.16
##$TE2= 300
##$TE3= 300
##$TEG= 300
##$TL= (0..7)
0 120 120 120 120 120 120 120 
##$TP= (0..7)
150 150 150 150 150 150 150 150 
##$TP07= 0
##$TPNAME0= <>
##$TPNAME1= <>
##$TPNAME2= <>
##$TPNAME3= <>
##$TPNAME4= <>
##$TPNAME5= <>
##$TPNAME6= <>
##$TPNAME7= <>
##$TPOAL= (0..7)
0.5 0.5 0.5 0.5 0.5 0.5 0.5 0.5 
##$TPOFFS= (0..7)
0 0 0 0 0 0 0 0 
##$TUNHIN= 0
##$TUNHOUT= 0
##$TUNXOUT= 0
##$USERA1= <user>
##$USERA2= <user>
##$USERA3= <user>
##$USERA4= <user>
##$USERA5= <user>
##$V9= 5
##$VALIST= <valist>
##$VCLIST= <CCCCCCCCCCCCCCC>
##$VD= 0
##$VDLIST= <DDDDDDDDDDDDDDD>
##$VPLIST= <PPPPPPPPPPPPPPP>
##$VTLIST= <TTTTTTTTTTTTTTT>
##$WBST= 1024
##$WBSW= 4
##$XGAIN= (0..3)
0 0 0 0 
##$XL= 0
##$YL= 0
##$YMAX_a= 426715
##$YMIN_a= -304704
##$ZGOPTNS= <>
##$ZL1= 120
##$ZL2= 120
##$ZL3= 120
##$ZL4= 120
##$ABSF1= 16.45037
##$ABSF2= -4.242802
##$ABSG= 5
##$ABSL= 3
##$ALPHA= 0
##$AQORDER= 0
##$ASSFAC= 0
##$ASSFACI= 0
##$ASSFACX= 0
##$ASSWID= 0
##$AUNMP= <proc_1d>
##$AZFE= 0.1
##$AZFW= 0.1
##$BCFW= 0
##$BC_mod= 0
##$BYTORDP= 0
##$COROFFS= 0
##$CY= 12.5
##$DATMOD= 1
##$DC= 0
##$DFILT= <>
##$DTYPP= 0
##$F1P= 14.0000005364418
##$F2P= -0.99999901652339
##$FCOR= 0.5
##$FTSIZE= 32768
##$FT_mod= 6
##$GAMMA= 0
##$GB= 0
##$INTBC= 1
##$INTSCL= 1
##$ISEN= 128
##$LB= 0.3
##$LEV0= 0
##$LPBIN= 0
##$MAXI= 10000
##$MC2= 0
##$MEAN= 0
##$ME_mod= 0
##$MI= 0
##$NCOEF= 0
##$NC_proc= -4
##$NLEV= 6
##$NOISF1= 0
##$NOISF2= 0
##$NSP= 0
##$NTH_PI= 0
##$NZP= 0
##$OFFSET= 16.45037
##$PC= 1
##$PHC0= -71.26064
##$PHC1= 8.149711
##$PH_mod= 1
##$PKNL= yes
##$PPARMOD= 0
##$PSCAL= 4
##$PSIGN= 0
##$REVERSE= no
##$SF= 250.130017916605
##$SI= 32768
##$SIGF1= 0
##$SIGF2= 0
##$SINO= 400
##$SIOLD= 32768
##$SREGLST= <1H.CDCl3>
##$SSB= 0
##$STSI= 32768
##$STSR= 0
##$SW_p= 5175.98343685301
##$SYMM= 0
##$S_DEV= 0
##$TDeff= 65536
##$TDoff= 0
##$TI= <Analysis number 999999
Compound Code 99
Book Reference 9
Project Code 9>
##$TILT= no
##$TM1= 0
##$TM2= 0
##$TOPLEV= 0
##$USERP1= <user>
##$USERP2= <user>
##$USERP3= <user>
##$USERP4= <user>
##$USERP5= <user>
##$WDW= 1
##$XDIM= 32768
##$YMAX_p= 400955543
##$YMIN_p= -500634
$$ End of Bruker specific parameters
$$ ---------------------------------
##NTUPLES= NMR SPECTRUM
##VAR_NAME=  FREQUENCY,     SPECTRUM/REAL,   SPECTRUM/IMAG
##SYMBOL=    X,             R,               I
##VAR_TYPE=  INDEPENDENT,   DEPENDENT,       DEPENDENT
##VAR_FORM=  AFFN,          ASDF,            ASDF
##VAR_DIM=   32768,         32768,           32768
##UNITS=     HZ,            ARBITRARY UNITS, ARBITRARY UNITS
##FACTOR=    0.157963299565203, 1,           1
##FIRST=     4114.73154008086, 0,            0
##LAST=      -1061.25189677215, 0,           0
##MIN=       -1061.25189677215, -500634,     0
##MAX=       4114.73154008086, 400955543,    0
$$ Real data points
##PAGE= N=1
##DATA TABLE= (X++(R..R)), XYDATA
$$ [...]
25095g7173Q4150O7918j14917o6977Q5510k8579K1775M9011j04028m965J02626
$$ -77173 6977 74895 -40022 -106999 -21489 -50068 -28293 20718 -83310 -88275 14351
25084A4351K4161O0260J8568m3711k3397Q5567J50585p4617r5092l8819j2232
$$ 14351 38512 98772 117340 73629 50232 135799 286384 211767 116675 77856 65624
25073F5624n6590M9469J8838K9708O3050p2381l8760K4614K9825q6207n3670P2068
$$ 65624 9034 58503 77341 107049 170099 97718 58958 83572 113397 27190 -26480 45588
25061D5588J8340k6412j4477N6309j730k07461o9269n6835J06457M6882P513O9408
$$ 45588 63928 37516 23039 79348 77618 -129843 -199112 -255947 -149490 -102608 -95095 -25687
25049b5687P3722l4864P1890l5572q5294M8576j14081j09596n7519J25885J55127
$$ -25687 48035 13171 85061 49489 -35805 12771 -101310 -210906 -268425 -142540 12587
25038A2587Q9726J280p2790j32752J4821j02232r6713J70510Q7137j29824K559
$$ 12587 102313 103593 30803 -101949 -87128 -189360 -286073 -115563 -28426 -158250 -155691
25027a55691R2244l9714P8822J62487r267j00287j09147O4063P909o3446L2165
$$ -155691 -63447 -103161 -24339 138148 128881 28594 -80553 -16490 -8581 -72027 -39862
25016c9862q6658p4849M2599M9341J2323J10683k840m891m1725l3114j1683p0332
$$ -39862 -126520 -201369 -158770 -109429 -97106 13577 10737 5846 -35879 -68993 -80676 -151008
25004a51008J03992J62060J08429l9050m9177n1223j17165p9163L7772N9072p2179
$$ -151008 -47016 115044 223473 184423 135246 84023 -33142 -112305 -74533 -15461 -87640
24993h7640J14352L3786j06653L1505k6351M6054O9692l9830o6964J40693m2896
$$ -87640 26712 60498 -46155 -14650 -41001 5053 74745 34915 -32049 108644 65748
24982F5748l0417r6558j23213L3779P4781O7991J8936l114j1014R5719j1640j1223
$$ 65748 35331 -61227 -184440 -150661 -75880 -7889 11047 7933 -3081 92638 80998 69775
24970F9775o3344P2563J20256p0553l4069j4300j46829p4757N052R4921M0918
$$ 69775 6431 78994 199250 128697 94628 80328 -66501 -141258 -136206 -41285 -367
24959c67P4137m3721o6469q8748O6661L1465Q2025m5774N9363n7809j33303q9536
$$ -367 73770 30049 -36420 -125168 -58507 -27042 54983 9209 68572 10763 -122540 -212076
24947b12076j2787N2763O1458N0113M1309M8328Q0140m1448n2839o3818k7413
$$ -212076 -224863 -172100 -110642 -60529 -19220 29108 109248 67800 14961 -48857 -76270
24936g6270j7391N9031P3580l3679J6435J8358m6807k7867M6733L1457K4100K4412
$$ -76270 -93661 -34630 38950 5271 21706 40064 -6743 -34610 12123 43580 67680 92092
24924I2092o1770J0881o342J6609j8779l6460K8887K6105O755m161j03445q7974
$$ 92092 30322 41203 34861 51470 32691 -3769 25118 51223 57978 53817 -49628 -137602
24912a37602n2997j8194N6083J49577p794o2159M2292R415q2374J3549J6609J05045
$$ -137602 -190599 -208793 -152710 -3133 -10927 -73086 -30794 -21379 -103753 -90204 -73595 31450
24900C1450n969j22594n203q929J54824Q8478j50379p6149P6509J73316j20493
$$ 31450 25481 -97113 -102316 -111245 43579 132057 -18322 -94471 -17962 155354 34861
24889C4861R367q1399j01718Q0299N5506J8114j3545j0332r9382j08857P2241
$$ 34861 44228 -37171 -138889 -58590 -3084 15030 1485 -8847 -108229 -217086 -144845
24878a44845O2503n1492o839O0545L6275j71455K0027M9989J29116J58927o9274
$$ -144845 -82342 -133834 -140673 -80128 -43853 -215308 -195281 -145292 -16176 142751 73477
24867G3477n1515p0081k5606k0504m012n363N7877m7203M2771O9093r0677p6692
$$ 73477 21962 -48119 -73725 -94229 -98241 -103604 -45727 -92930 -50159 18934 -71743 -148435
24855a48435q7817J3545j9373R505J70596K0608m2428l7798J034L2985J5156K0180
$$ -148435 -236252 -222707 -242080 -232575 -61979 -41371 -83799 -121597 -120563 -87578 -72422 -52242
24843e2242J1586m6557M696J3000J4300M5742Q3772k9377O873Q1978q770R947
$$ -52242 -40656 -87213 -82517 -69517 -55217 -9475 74297 44920 51793 133771 125001 134948
24831A34948J707m1503l6107j1106n6155K2974O1592r247j911J30685Q1967k17439
$$ 134948 136655 95152 59045 47939 -8216 14758 76350 67103 65192 195877 277844 60405
24819F0405m2391M9111L6695K3086j14876m1322j1914K6103M2046n1752r7975
$$ 60405 18014 67125 103820 126906 12030 -29292 -41206 -15103 26943 -24809 -122784
24808a22784j2253k8185L8667p1996R2678J91179k7706q620l6463K9403k3711
$$ -122784 -135037 -163222 -124555 -196551 -103873 87306 59600 50980 14517 43920 20209
24797B0209K9776m5118J05300Q233M3667M8430j92906j41753R2337Q4342o1594
$$ 20209 49985 4867 110167 118400 162067 210497 17591 -124162 -31825 52517 -9077
24786i077p4638r085K7295J4110o8096L0328o6M1653J44562M4440J7064j4907
$$ -9077 -83715 -92800 -65505 -51395 -119491 -89163 -89229 -47576 96986 141426 158490 143583
24774A43583j559J6453N108l6537M5397R1473m002j10567k9627O2413l4605o8991
$$ 143583 142024 158477 163585 127048 172445 263918 259916 149349 119722 182135 147530 78539
24762G8539m0917N4925o8646p9970q1560k1248N6300L6518n4838M8115O6648J3418
$$ 78539 37622 92547 23901 -56069 -137629 -158877 -102577 -66059 -120897 -72782 -6134 7284
24750G284k7805k6001M6215Q5708n3536p5716j19884r6319p0407R9822J58680
$$ 7284 -20521 -46522 -307 85401 31865 -43851 -163735 -260054 -330461 -230639 -71959
24739g1959J30355p840l8258M6520n3204q0722q6103L3873M5027r5567M6954J25210
$$ -71959 58396 50556 12298 58818 5614 -75108 -161211 -127338 -82311 -177878 -130924 -5714
24727e714k8871K6908Q1940K0370k8099n6624p148j17649p7835Q296j22903n1800
$$ -5714 -34585 -7677 74263 94633 66534 9910 2762 -114887 -192722 -184426 -307329 -359129
24715c59129l0426R4213o27Q0532M8405J12749J02900K3580n0191l6866k1798
$$ -359129 -389555 -295342 -295969 -215437 -167032 -54283 48617 72197 22006 -14860 -36658
24704c6658k5658P1212J05377j18659N3918R0812l126j3605N7024K4652q8647
$$ -36658 -62316 8896 114273 -4386 49532 140344 137218 123613 180637 205289 116642
24693A16642m5744o5803R6567R8259j0661j10129m0751n9287j4837l2992L3267
$$ 116642 70898 5095 101662 199921 189260 79131 38380 -20907 -35744 -68736 -35469
24682c5469Q366L3039m9886q3858R2506Q3744k0418N6386k400k17142p3962k7177
$$ -35469 -27103 5936 -43950 -127808 -35302 48442 28024 84410 82010 -135132 -209094 -236271
24670b36271k2848J09816J37309M3271j29838j5667K13621R9190r7939n8190m952
$$ -236271 -259119 -149303 -11994 31277 -98561 -114228 99393 198583 100644 42454 37502
24659C7502o6865J5046o4256q3900j7054J10292O2055J8191l0105l3820n0210
$$ 37502 -29363 -14317 -78573 -162473 -179527 -69235 -7180 11011 -19094 -52914 -103124
24648a03124m8763J19511J33375q5245r9842m2538K9882m9505N9864n095k283
$$ -103124 -151887 -32376 100999 15754 -84088 -126626 -96744 -146249 -86385 -91480 -93763
24637i3763p1430R3140N1998j6166j0289j53917l8620P4686o8151p846J04604
$$ -93763 -165193 -72053 -20055 -36221 -46510 -200427 -239047 -164361 -232512 -240358 -135754
24626a35754K8206Q576N1269K2200O6479p5989m1855j2257j1301J6030N9996p712
$$ -135754 -107548 -98972 -47703 -25503 40976 -35013 -76868 -89125 -100426 -84396 -24400 -32112
24614c2112J8086Q2527k6809K9390r5534l287j1611o0087j2812K4443Q4426O2636
$$ -32112 -14026 68501 41692 71082 -24452 -27739 -39350 -99437 -112249 -87806 -3380 59256
24602E9256Q1317M5074L032m1115O6034l5820r3830n3830K8280J18006j16924
$$ 59256 140573 185647 188679 147564 213598 177778 83948 30118 58398 176404 59480
24591E9480j23390J9312j00011r681m0103J51303Q5480m157L2527Q10M421P5642
$$ 59480 -63910 -44598 -144609 -154290 -194393 -43090 42390 38233 70760 71570 75991 151633
24579A51633p0692j04428m0354k4459j00464j5547L927l0933P5182N4783r732
$$ 151633 80941 -23487 -63841 -88300 -188764 -204311 -200384 -231317 -156135 -101352 -111084
24568a11084O811N3019j3373J31504M8201l4892j1315o8953l5467K7694n0729
$$ -111084 -104273 -51254 -64627 66877 115078 80186 68871 -82 -35549 -7855 -58584
24557e8584Q221l4831M3330J51548J9686o9051p6197r9598o2578J10411l8360
$$ -58584 -50363 -85194 -41864 109684 129370 60319 -15878 -115476 -178054 -67643 -106003
24546a06003j05265O6658M4842q4369l0691k6435J984R3621J13632j9637m523
$$ -106003 -211268 -144610 -99768 -184137 -214828 -241263 -239279 -145658 -32026 -51663 -56186
24535e6186R2770Q4750j06721j53822R6828R4281J29515r895q0181m4853j241
$$ -56186 36584 121334 14613 -139209 -42381 51900 181415 171520 91339 46486 45245
24524D5245J7081J2772R066p972r0124l5469J6797M9227M6033m8426n3789o6030
$$ 45245 62326 75098 84164 76192 -13932 -49401 -32604 16623 62656 14230 -39559 -105589
24512a05589r4423m251K1737K5664N1494L8146Q814l1356l8956p2255n91J40913
$$ -105589 -200012 -204263 -182526 -156862 -105368 -67222 -58408 -89764 -128720 -200975 -201566 -60653
24500f0653k0197M1598J0862J65261J2583j44929R90J35352n9837l8285p3742
$$ -60653 -80850 -39252 -28390 136871 149454 4525 5515 140867 81030 42745 -30997
24489c0997l7246K2583P6586j6283m1683M4348Q119P6752J47585m279j48063j39698
$$ -30997 -68243 -45660 30926 14643 -27040 17308 25427 102179 249764 245485 97422 -42276
24477d2276p076n0918Q3999J14700K3337o2015m4125p9038P041m3317M5959M5140
$$ -42276 -49352 -100270 -16271 98429 121766 59751 15626 -63412 -56371 -99688 -53729 -8589
24465h589M7799K8482M3960P7379o3962n6252n8924k3732N6150j15938p1846q4946
$$ -8589 39210 67692 111652 189031 125069 68817 9893 -13839 42311 -73627 -145473 -230419
24453b30419j087K9144p0631o1226J39179J27253N3813J8888j58039n910J05457
$$ -230419 -231506 -202362 -272993 -334219 -195040 -67787 -13974 4914 -153125 -159035 -53578
24442e3578L5911L7121q1841K2426k1011P6413J2126N269M34j4334P5731J20054
$$ -53578 -17667 19454 -62387 -39961 -60972 15441 27567 32836 33270 18936 94667 214721
24430B14721O4799m882r0771j24526k678J05567o1357J7586M4499n7585o6964
$$ 214721 279520 274638 183867 59341 56663 162230 100873 118459 162958 105373 38409
24419C8409j74718l8331J9203j9491J2263P3633J25855N5509o7002o1730P2605
$$ 38409 -136309 -174640 -155437 -174928 -162665 -89032 36823 92332 25330 -36400 36205
24408C6205Q2047j13799J5185K3233r0124m6410M4048k7407p0953P9140J17806
$$ 36205 118252 4453 19638 42871 -47253 -93663 -49615 -77022 -147975 -68835 48971
24397D8971M143o2533r9127M0041N6813m4944j9055p4483m5868N9230l3099p5784
$$ 48971 53114 -9419 -108546 -68505 -11692 -56636 -75691 -150174 -196042 -136812 -169911 -245695
24385b45695J3324l8601r359O0439J27983J59305k554j23531j29502N2928Q4008
$$ -245695 -232371 -270972 -280331 -219892 -91909 67396 64842 -58689 -188191 -135263 -51255
24374e1255P5548Q4029l4946r7221m1746Q569L2279J06469k2939k4678k6434O747
$$ -51255 24293 108322 73376 -23845 -65591 -57022 -24743 81726 58787 34109 7675 14422
24362A4422k9745P717L9673l2028O451o8519q3240j2563l6411K32953J21139k5610
$$ 14422 -15323 -7606 32067 39 6490 -62029 -145269 -157832 -194243 38710 159849 134239
24350A34239j57015R742Q5912O6012l6871p904L9187n8633j22905Q939J20420
$$ 134239 -22776 -13034 72878 138890 102019 94115 133302 74669 -48236 -39297 81123
24339H1123N0638m1441n4118l3083L0145J560l1955k5942j19551L5872J40655
$$ 81123 131761 90320 36202 3119 33264 34824 2869 -23073 -142624 -106752 33903
24328C3903n7356N0767J2425K763N6027R6386m5042j53778k6455M9602J2917m081
$$ 33903 -23453 27314 39739 42502 98529 194915 149873 -3905 -30360 19242 32159 28078
24316B8078M4540R0429o193q3778p6471L4282K6222m1023r7315L4641K10566j1716
$$ 28078 72618 163047 156854 73076 -3395 30887 57109 16086 -81229 -46588 163978 152262
24304A52262j84995P132O4847m1821p5048R3721N309J6507l3843K2496n5004l3754
$$ 152262 -32733 -25601 39246 -2575 -77623 16098 21407 37914 4071 26567 -28437 -62191
24292f2191N7493P0390P0582l2155j05689K9720o061N8467P0579m7730j6334M9962
$$ -62191 -4698 65692 136274 104119 -1570 28150 22089 80556 151135 103405 87071 137033
24280A37033K1047k2124j08769j13012r134M763j17642p7151m1005K9331J14823
$$ 137033 158080 135956 27187 -85825 -94959 -90196 -207838 -284989 -325994 -296663 -181840
24269a81840L7842m8772Q8168J8618o6096J1793P9130L6973N8867n5146l8488
$$ -181840 -143998 -192770 -104602 -85984 -152080 -140287 -61157 -24184 34683 -20463 -58951
24258e8951N4964Q2563j41958k6523R1318J10938M6346M8338j24459j59207p7825
$$ -58951 -3987 78576 -63382 -89905 1413 112351 158697 207035 82576 -76631 -154456
24247a54456L2630K2142J09782N2812p0211p540j0443k2977R1284q976r5484j15985
$$ -154456 -121826 -99684 10098 62910 -7301 -14841 -25284 -48261 43023 34047 -61437 -177422
24235a77422o4417J13363J42258M7730l144r4531p070L7388l9707L6792J3805
$$ -177422 -241839 -128476 13782 61512 58368 -36163 -43233 -5845 -45552 -8760 5045
24224E045J7452j1276j07444Q208M2684j57579N3003Q417M2878J02400q9529k986
$$ 5045 22497 11221 -96223 -88015 -45331 -202910 -149907 -141490 -98612 3788 -85741 -88727
24212h8727J8864j6563L1096o8888M3402L2253J3544n1652J5368L7202l1879j03892
$$ -88727 -69863 -86426 -55330 -124218 -80816 -48563 -35019 -86671 -71303 -34101 -65980 -169872
24200a69872j1516p0458Q7238J47525J30112P7515l1730j24502m8463j18883q5508
$$ -169872 -181388 -251846 -164608 -17083 113029 190544 158814 34312 -14151 -133034 -218542
24189b18542P9590J11739O4942N4105k02R8219J3533j20209M4526L1947L7207
$$ -218542 -138952 -27213 37729 91834 91632 189851 203384 83175 127701 159648 196855
24178A96855O8608n003j46500j58083n5892R8971L4578m5564j45238j50197J7708
$$ 196855 265463 260460 113960 -44123 -100015 -1044 33534 -12030 -157268 -307465 -289757
24167b89757O2417O5597M6354M1281o7838J3988K3924O2679J0199K7647Q3052
$$ -289757 -227340 -161743 -115389 -74108 -141946 -127958 -104034 -41355 -31156 -3509 79543
24156G9543K7711l5762j28771l5005J6743K067l8506K8450r7298P699j7424o5882
$$ 79543 107254 71492 -57279 -92284 -75541 -73474 -111980 -83530 -180828 -173129 -190553 -256435
24144b56435J05238N6852j9336l6166R1662r947r1624N3279J21380N0275l6645
$$ -256435 -151197 -94345 -113681 -149847 -58185 -68132 -159756 -106477 14903 65178 28533
24133B8533M5394K7934j6187J094N3956O0008p8385n9206J5522j21015j55628
$$ 28533 73927 101861 85674 86768 140724 200732 122347 63141 78663 -42352 -197980
24122a97980M0260J07676Q3634p235o3360q5001N3770L4560J4875q818K6293n7383
$$ -197980 -157720 -50044 33590 26355 -37005 -122006 -68236 -33676 -18801 -27619 -1326 -58709
24110e8709j1922J5078J10127J539k1336o6183n6710K0022r8431j03937j2266
$$ -58709 -70631 -55553 54574 56113 34777 -31406 -88116 -68094 -166525 -270462 -282728
24099b82728O4740K30233K0030j69758p5215k1626o3427P0280J19704N5741m8113
$$ -282728 -217988 12245 32275 -137483 -212698 -234324 -297751 -227471 -107767 -52026 -100139
24088a00139o1385j01241R7554J39294j2018l9618L4291L8251o652J05451Q324
$$ -100139 -161524 -262765 -165211 -25917 -37935 -77553 -43262 -5011 -11663 93788 102112
24077A02112p7562o4353L2616K6501j22392n5065m8237M7736M1500M2792J3992
$$ 102112 24550 -39803 -7187 19314 -103078 -158143 -206380 -158644 -117144 -74352 -60360
24066f0360n9975j71299j8795J24358J23439l0075o4355j45962j8729J14334L5426
$$ -60360 -120335 -291634 -310429 -186071 -62632 -92707 -157062 -303024 -321753 -207419 -171993
24055a71993P3955o3503m9220O7650P2158J01520n7927p0865m8145q739J20446
$$ -171993 -98038 -161541 -210761 -143111 -70953 30567 -27360 -98225 -146370 -155109 -34663
24044c4663M8500p0215j69296n1044J35662J64721j767J09787N6915j21457j76273
$$ -34663 13837 -56378 -225674 -276718 -141056 23665 21898 131685 188600 67143 -109130
24033a09130p3714J18563R866m5826J00221P7945j794l6193M0065l7165L929r6473
$$ -109130 -182844 -64281 -54415 -100241 -20 77925 76131 39938 80003 42838 46767 -49706
24021d9706N8567l4265J8688O2572k7996j40776k0157J56856K1083k1511J5766
$$ -49706 8861 -25404 -6716 55856 27860 -112916 -133073 23783 44866 23355 39121
24010C9121n8461j0483p6155P5877O7718n1319j32636m0678J47887M9495L6581
$$ 39121 -19340 -29823 -105978 -30101 37617 -13702 -146338 -187016 -39129 10366 46947
23999D6947J56501n7703p4257m1260P9130N9704p5142r9718m5854r351J0264J07199
$$ 46947 203448 145745 71488 30228 109358 169062 93920 -5798 -51652 -61003 -50739 56460
23987E6460n9877l0993M828r3646p5989R3876J11216K1276r4876r6682L2963P8609
$$ 56460 -3417 -34410 -29582 -123228 -199217 -105341 5875 27151 -67725 -164407 -131444 -52835
23975e2835P9263K3166o0482L5901L3348k1854n2506M055Q7321M6027Q2697Q4316
$$ -52835 26428 49594 -10888 25013 58361 36507 -15999 -11944 75377 121404 204101 288417
23963B88417r4544j32909j66626r2902K131k1390N8384L1313j0678k1400k1315
$$ 288417 193873 60964 -105662 -198564 -196433 -217823 -159439 -128126 -138804 -160204 -181519
23952a81519l0216J6801J8076K7094Q9010K7597J03175J5223O1669L7780n4764
$$ -181519 -211735 -194934 -176858 -149764 -60754 -33157 70018 85241 146910 184690 129926
23941A29926m368n8592m0066n0077J6226P5984R6394J5076p7847j17426l7448
$$ 129926 125558 66966 26900 -23177 -6951 69033 165427 180503 102656 -14770 -52218
23930e2218r955l5907n571q4691N2505J56616J11919Q2671j4619j41423j50062
$$ -52218 -62173 -98080 -103651 -188342 -135837 20779 132698 215369 200750 59327 -90735
23919i0735k1937M6140L7037J5677O6783q32k9960n2732n781m7802k2956L2232
$$ -90735 -112672 -66532 -29495 -13818 52965 52133 22173 -30559 -36340 -84142 -107098 -74866
23907g4866O774k0057M4851M1567K1961M0430O8006q8166j10339m8966N2070p650
$$ -74866 -68092 -88149 -43298 -1731 20230 60660 128666 40500 -69839 -118805 -66735 -74385
23895g4385N5073P3341N0597l275p9771j64756K0313J11682K1217j16913l2692
$$ -74385 -19312 54029 104626 101351 21580 -143176 -122863 -11181 10036 -106877 -139569
23884a39569j8460P4312P6989N109J11247N2021j26616Q8171J40942k4520j43779
$$ -139569 -158029 -83717 -6728 -1619 109628 161649 35033 123204 264146 239626 95847
23873I5847J6525j1048j38287n3458L5521J69058Q2283j6010q4974m4538J0824
$$ 95847 112372 101324 -36963 -90421 -54900 114158 196441 180431 95457 50919 61743
23862F1743l416l2764j0890p3142O5499M1936O6081K3072l4003o0710L1171L8085
$$ 61743 58327 25563 14673 -58469 7030 48966 115047 138119 104116 43406 74577 112662
23850A12662m5971p0959p4650M9407J48574j2494j40642q8743K1222Q3974L9255
$$ 112662 66691 -4268 -78918 -29511 119063 106569 -34073 -122816 -101594 -17620 21635
23839B1635J4102K4010J9227j387L114m1700q5029o1420m1830J20338J9527k1604
$$ 21635 35737 59747 78974 77587 80701 39001 -46028 -107448 -149278 -28940 -9413 -31017
23827c1017k1069o1548J60342o237l1131k7976L2747N6758M7811k9450J7197j11209
$$ -31017 -52086 -113634 46708 40471 9340 -18636 14111 70869 118680 89230 106427 -4782
23815d782k1761M0299r787q0584p2602J764M6144J12099L3131l8319l6917J5906
$$ -4782 -26543 13756 3969 -76615 -149217 -147453 -101309 10790 43921 5602 -31315 -15409
23803a5409K7572j49106m7634J60475R9585M8645l614j4913o3821l7470r0883
$$ -15409 12163 -136943 -184577 -24102 75483 124128 120514 105601 41780 4310 -86573
23792h6573j57519Q145J60455L3562R248M1769l9403k8510O4982P5986K7882K5742
$$ -86573 -244092 -235947 -75492 -41930 -32682 9087 -30316 -58826 6156 82142 110024 135766
23780A35766R1074j7818j64903j2548P3484N358l0254r0468l9783R7181O157j11940
$$ 135766 226840 209022 44119 31571 105055 110413 80159 -10309 -50092 47089 53246 -58694
23768e8694K8973K1737k2326L5961j8074O2113L1739o9498j07429m6655Q1105
$$ -58694 -29721 -7984 -30310 5651 -12423 49690 81429 11931 -95498 -142153 -61048
23757f1048n4871J388M2835l7616j3711L9330m7225p2825J27776J7860l6835P0453
$$ -61048 -115919 -114531 -71696 -109312 -123023 -83693 -130918 -203743 -75967 -58107 -94942 -24489
23745b4489J78816J37412l4624j25016q9876q838Q4654q0534O7168J27244O1406
$$ -24489 154327 291739 257115 132099 42223 33385 118039 37505 104673 231917 293323
23734B93323n1498o7510k26675m4708n5347k6881M5127N1910p4325K0356J8442
$$ 293323 241825 174315 -52360 -97068 -152415 -179296 -134169 -82259 -156584 -136228 -117786
23723a17786M4398J61339J00627j02309q0349n5763M9563R183J782K8236m6125
$$ -117786 -73388 87951 188578 86269 5920 -49843 -280 8903 10685 38921 -7204
23712g204o3009Q6828m5881j03858m1917L6142M427j08142o0322J57904J37945
$$ -7204 -70213 16615 -29266 -133124 -175041 -138899 -134472 -242614 -302936 -145032 -7087
23701g087k6674j41353j6778K4658O9521m0373R9136P2244l5348m9264Q371J404
$$ -7087 -33761 -175114 -191892 -167234 -97713 -138086 -38950 33294 -2054 -51318 -42947 -41543
23689d1543J1713m5364m7589k5692J9571o7788k1811J10173J11945M9863n252
$$ -41543 -29830 -75194 -122783 -148475 -128904 -196692 -218503 -108330 3615 53478 48226
23678D8226p4428o9185k6341K1877J03323O175O1990P7560o123o7653J5739l4512
$$ 48226 -26202 -95387 -121728 -99851 3472 9647 71637 149197 143074 75421 91160 56648
23666E6648L7642K4332L1032l1265r7337q0227N7777K1741j6411L2169q5198k7878
$$ 56648 94290 118622 149654 118389 21052 -59175 -1398 20343 3932 36101 -49097 -76975
23654g6975l695K2327o0910q65L5063P8395o3253k107R4544L2982l9271j06512
$$ -76975 -80670 -58343 -119253 -120118 -85055 -6660 -69913 -72020 22524 55506 16235 -90277
23642i0277J12643J6293J6823j0642p1901k0495k8747M3670J2026j7491O9594
$$ -90277 22366 38659 55482 44840 -27061 -47556 -76303 -32633 -20607 -38098 31496
23631C1496m5476j20163l2521O600P2588J7601j3592J3122O4348P834J1881q2745
$$ 31496 -13980 -134143 -166664 -160064 -87476 -69875 -83467 -70345 -5997 1837 13718 -69027
23619f9027J09345o830Q967j7605r970K5572J07151J3791J2655r0420j5967j15598
$$ -69027 40318 33488 42455 24850 14880 40452 147603 161394 174049 83629 67662 -47936
23607d7936M2O5331Q9694m44j6578n067O7501P1288q6515j50515j41367r385R4372
$$ -47936 -47894 17437 107131 106687 90109 85042 152543 223831 137316 -13199 -154566 -163951 -69579
23594f9579k0222J7102o8326p4731L367J39151J01547l4189K5880L3498K9518
$$ -69579 -89801 -72699 -141025 -215756 -212389 -73238 28309 -5880 20000 53498 83016
23583H3016M7380M7222q5638r4696M2205R2369m4272N955j933r0928k3465M0432
$$ 83016 130396 177618 91980 -2716 39489 131858 87586 93541 91608 680 -22785 17647
23571A7647j3786J4055L4764P5289l2215j70751m8084R7769J1471k7711k3735
$$ 17647 3861 17916 52680 127969 95754 -74997 -123081 -25312 -13841 -41552 -65287
23560f5287P5928L7941k5088r970L3146l9975n83J1016l199m4608j01568p721
$$ -65287 10641 48582 23494 13524 46670 6695 6112 17128 13929 -30679 -132247 -139968
23548a39968O8964O739P7360k0958n1174L4721M6883j722M2819N513K4944p791
$$ -139968 -71004 -64265 13095 -7863 -59037 -24316 22567 20845 63664 69177 94121 86330
23536H6330p9797J1938N7121O0128k9966n4804j05208j1855M8833P0470J5694
$$ 86330 6533 18471 75592 135720 105754 50950 -54258 -66113 -17280 53190 68884
23525F8884k9404O0795M7168j6349m0255q5828j0563l1137J0080j8153L0543K7243
$$ 68884 39480 100275 147443 131094 90839 5011 -5552 -36689 -26609 -44762 -14219 13024
23513A3024k4691l6820q51R4699k484m4929N2387J5448j7048k3583Q2986j908
$$ 13024 -11667 -48487 -49338 45361 42877 -2052 50335 65783 48735 25152 108138 106230
23501A06230M9916R747m5111j9579m1839j27443Q0467L9669m6574j56285r523
$$ 106230 156146 165893 120782 101203 59364 -68079 12388 52057 5483 -150802 -160325
23490a60325M6112k5042J5874k1006J9400J934M556n5411P6589R9790n2776j32427
$$ -160325 -114213 -139255 -123381 -144387 -124987 -123053 -118497 -173908 -97319 2471 -50305 -182732
23478a82732M8693J36657M2319M5001j9119l3963P4122M4598q4695q5615j11934
$$ -182732 -134039 2618 44937 89938 70819 36856 110978 155576 70881 -14734 -126668
23467a26668r368j21J4786M1223P0169r789j8010L5639L5207L3849o62n5565m3641
$$ -126668 -136036 -136157 -121371 -80148 -9979 -19768 -37778 -2139 33068 66917 66255 10690 -32951
23454c2951N7299n9496l6475P5011N5126n4090K0748P2243O3490K6342n8128j62969
$$ -32951 24348 -35148 -71623 3388 58514 4424 25172 97415 160905 187247 129119 -33850
23442c3850j05093L2192O2927N5248m0943j04205n9080K0245P3073K037m2005
$$ -33850 -138943 -106751 -43824 11424 -29519 -133724 -192804 -172559 -99486 -97449 -139454
23431a39454M6185O133r7260R558K5948N8828K039J04122J07982Q3551j07663
$$ -139454 -93269 -87136 -184396 -174838 -148890 -90062 -88023 16099 124081 207632 99969
23420I9969L2156j0116r9797r4890j01565j6741J35451J02220Q7104n0002j29849
$$ 99969 132125 122009 22212 -72678 -174243 -190984 -55533 46687 133791 83789 -46060
23409d6060j1688j582K1575j7443J02809j12441j00799Q118P2871P7110l0080
$$ -46060 -57748 -59330 -37755 -55198 47611 -64830 -165629 -157511 -84640 -7530 -37610
23398c7610j00280L7045M3544J66272J2357l0774k9150n4276n6707L0970M340
$$ -37610 -137890 -100845 -57301 108971 121328 90554 61404 7128 -49579 -18609 -14269
23387a4269L2377k7013J60728m6526k2149o1240j6759l4325l3605j92289j52202
$$ -14269 18108 -8905 151823 105297 83148 21908 5149 -29176 -62781 -255070 -407272
23376d07272J40990Q1532J41374J9797M4949Q4531m2171K172K6119m0224p8080
$$ -407272 -266282 -184750 -43376 -23579 21370 105901 63730 65902 92021 51797 -26283
23365b6283j7290L9827L3474l5098o438K0079M0430m255Q499O7522J10745m7946
$$ -26283 -43573 -3746 29728 -5370 -11808 8271 48701 44446 52945 120467 231212 183266
23353A83266q3363j02307j50990j27835J2000P1999K04560R1383j42476k5088
$$ 183266 99903 -2404 -153394 -281229 -269229 -197230 7330 98713 -43763 -68851
23343f8851m0746M0702J44488L3372r3734N087l4483N255j22708M6531J74824
$$ -68851 -109597 -68895 75593 108965 15231 20318 -14165 -8910 -131618 -85087 89737
23332H9737O4520j73j8965r1930o1981q2347N4155k8572p0893J16983R4298N2000
$$ 89737 154257 154084 135119 43189 -18792 -101139 -46984 -75556 -146449 -29466 64832 116832
23320A16832o1575r770n8444M8317O9973l7244j22501J65830k328k3370M9407
$$ 116832 55257 45487 -12957 35360 105333 68089 -54412 111418 109090 85720 135127
23309A35127Q5038p3013j19983j63484p864Q3463Q3192L8085l2744L1749K2438
$$ 135127 220165 147152 27169 -136315 -144179 -60716 22476 60561 27817 59566 82004
23298H2004N5794p7215k7239j89468J9564Q7464J15519J21728r4207m2514O306
$$ 82004 137798 60583 33344 -156124 -136560 -49096 66423 188151 93944 51430 57736
23287E7736M2216m6401j05318M9262j10733j3974J00719K5955l3718o5161N0559
$$ 57736 99952 53551 -51767 -2505 -113238 -127212 -26493 -538 -34256 -99417 -48858
23276d8858O7761J5765l6872l2047J9068j6073L0729R6040J706r3059j8824o4222
$$ -48858 18903 34668 -2204 -34251 -15183 -31256 -527 95513 97219 4160 -14664 -78886
23264g8886q3381J14049J64816O2664R0296J6299R334j85921m2680Q3825l872
$$ -78886 -162267 -48218 116598 179262 269558 285857 295191 109270 66590 150415 146543
23253A46543j5801p7802j3155r0508o0777r167k4628J07524p0938Q354P2296Q243
$$ 146543 130742 52940 39785 -50723 -111500 -120667 -145295 -37771 -108709 -100355 -28059 -19816
23241a9816M3234O9737J8954j63045j34984n8179p78M5751J06215P3452K8287
$$ -19816 23418 93155 112109 -50936 -185920 -244099 -244877 -199126 -92911 -19459 8828
23230H828J37003M720k3840p2905m7169P0781n5884K6764Q934L8085Q4108M7012
$$ 8828 145831 150551 126711 53806 6637 77418 21534 48298 57232 95317 179425 226437
23218B26437p0931J02432J12018J89414K06733L31668L80543N00547L76154k24950
$$ 226437 155506 257938 369956 559370 766103 1097771 1478314 1978861 2355015 2130065
23208B130065n74364n06756l23725k01172j45101j28970J02212K1956r1988j17018
$$ 2130065 1555701 1048945 725220 524048 378947 249977 352189 374145 282157 165139
23198A65139N0776l1519r6675j8410N4823n0306n5505K7407k3760J05621R2133
$$ 165139 215915 184396 87721 69311 124134 73828 18323 45730 21970 127591 219724
23187B19724K9596r0843l1945L8706j08876o1754l6084N4315K4273o3680q6142
$$ 219724 249320 158477 126532 165238 56362 -5392 -41476 12839 37112 -26568 -112710
23176a12710P2814R2549N5693R5831p545r6003R7897O6830M9195M210j16341q5991
$$ -112710 -39896 52653 108346 204177 196632 100629 198526 265356 314551 318761 202420 116429
23164A16429n3024k9142n1842M7975m0992M080O9508L1090L0964N6284M885r8508
$$ 116429 63405 34263 -17579 30396 -10596 -6516 62992 94082 125046 181330 186215 87707
23152H7707r2094N6965k6508j48159N0820p376M4511N5398j02644m5889j3820
$$ 87707 -4387 52578 26070 -122089 -71269 -78645 -34134 21264 -81380 -127269 -141089
23141a41089Q0511J64866j0372j03371n2651N4951J43947l7495l8682K2369L8160
$$ -141089 -60578 104288 93916 -9455 -62106 -7155 136792 99297 60615 82984 121144
23130A21144q1990r7875q4473N2641R9161K6407L2270L0472J2853k06501n6250
$$ 121144 39154 -58721 -143194 -90553 8608 35015 67285 97757 110610 -95891 -152141
23119a52141m9627K36704Q2566R226m4460l2532O1337J09108J7549j32473o6591
$$ -152141 -201768 34936 117502 126728 82268 49736 111073 220181 237730 105257 38666
23108C8666M4907j5169l4302k0724j2138j3401q547O2575R3793J66321L4816o9105
$$ 38666 83573 68404 34102 13378 1240 -12161 -20708 41867 135660 301981 336797 267692
23096B67692j46751m6265K8447N2627k3963O0724P6394K5810j76105j10634N3075
$$ 267692 120941 74676 103123 155750 131787 192511 268905 294715 118610 7976 61051
23085F1051J27933j02099j31286N7093p0574O505J2639O5011R021O454L3644M1822
$$ 61051 188984 86885 -44401 12692 -57882 -51377 -38738 26273 35294 41748 75392 117214
23073A17214P4999L5110j08904m0650L508m0945K327K5401P0034j31250k14355
$$ 117214 192213 227323 118419 77769 81277 40332 42659 68060 138094 6844 -207511
23062b07511o11M5261K9810P2274k9413N8799K3072k3182k3755J2980K9869O275
$$ -207511 -208122 -162861 -133051 -60777 -90190 -31391 -8319 -31501 -55256 -42276 -12407 -6132
23050f132M8465P1254l426j8787j4691O9644J32302J02201j07979n3492k5183
$$ -6132 42333 113587 110161 91374 76683 146327 278629 380830 272851 219359 194176
23039A94176j1883k1779j3628j1318o5795M8794J66798j37501k5249R6648J03322
$$ 194176 182293 160514 146886 135568 69773 118567 285365 147864 122615 219263 322585
23028C22585J711j62690j82061r5371N0022M1715J47105K2212n5327r7663k1252
$$ 322585 324296 161606 -20455 -115826 -65804 -24089 123016 145228 89901 -7762 -29014
23017b9014k9888j9324m6040K8770j24943P773J07978O4734Q807n0575N9326L3924
$$ -29014 -58902 -78226 -124266 -95496 -220439 -212666 -104688 -39954 -31147 -81722 -22396 11528
23005A1528O8606P7286j47727J1700l3382m423J21802J29499M4465o8080p6432
$$ 11528 80134 157420 9693 21393 -11989 -16412 105390 234889 279354 211274 134842
22994A34842O0729Q002M0507o9793k0627R3808Q10q1682k1429n7943l4487j234
$$ 134842 195571 203573 244080 174287 153660 247468 248278 166596 145167 87224 52737 51503
22982E1503M3226M8932j18810n3726K2269J5484K3765R9012J15326R1171p904
$$ 51503 94729 143661 24851 -28875 -6606 8878 32643 131655 246981 338152 330248
22971C30248j02289j27840Q8262J4572k0039J40527O2066m3515o4669N3393K9042
$$ 330248 227959 100119 188381 202953 182914 323441 385507 341992 277323 330716 359758
22960C59758O2597j0246n6451J28495Q3466R550j30938j61707m73840k74644l3288
$$ 359758 422355 412109 355658 484153 567619 577169 446231 284524 -189316 -463960 -497248
22949d97248l386J21238J67495R4826K8374q6104K9404J68709n2695K470J478
$$ -497248 -500634 -379396 -211901 -117075 -88701 -174805 -145401 23308 -29387 -26917 -25439
22938b5439p5818j5763N0635m359p2501p8220o7621Q6370o0684K9578N9603K1673
$$ -25439 -101257 -117020 -66385 -70744 -143245 -221465 -289086 -202716 -263400 -233822 -174219 -152546
22926a52546J16856J6443Q748p3820o4120j2788M3284J14378j3571o5203J0335
$$ -152546 -35690 -19247 -10499 -84319 -148439 -161227 -117943 -3565 -17136 -82339 -72004
22915g2004J5595P9383N8961M3173n6850k037n3405R9883J32904K5782o4775P375
$$ -72004 -56409 22974 81935 125108 68258 66221 12816 112699 245603 271385 206610 213985
22903B13985O114r5452k4927J25644m850q6646l0268P2744k0061j0572K0022j05431
$$ 213985 220099 124647 99720 225364 220514 133868 103600 176344 156283 145711 165733 60302
22891F0302q0026J03190K7490j13287p1673J25840k9282m3056J1647Q1914O8277
$$ 60302 -19724 83466 110956 -2331 -74004 51836 22554 -20502 -8855 73059 141336
22880A41336j5856Q3852k7165m9460j30248m4279P4693L6020K0763m1766m6975
$$ 141336 125480 209332 182167 132707 2459 -41820 32873 68893 89656 47890 915
22869I15K1367l8083k9733M9668l0497p1214k4293J75594J2800k1710l308j1103
$$ 915 22282 -15801 -45534 4134 -26363 -97577 -121870 53724 66524 44814 41506 30403
22857C0403O2638l2872j48225o4456J15797J49262K0330q4316j90736R195M8626
$$ 30403 93041 60169 -88056 -152512 -36715 112547 132877 48561 -142175 -132980 -84354
22846h4354j8388m7390n717j5059J7273L0528m9500Q4388Q1251k5934J21300m1510
$$ -84354 -102742 -150132 -155849 -170908 -153635 -123107 -172607 -88219 -6968 -32902 88398 46888
22834D6888K5573L1830K1286q3681o4100J6946k5029o6901J13220M7695l4261
$$ 46888 72461 104291 125577 41896 -22204 -5258 -30287 -97188 16032 63727 29466
22823B9466L3768j6334j15418m4152R6307q672M1879P1575K29359l123j30293
$$ 29466 63234 46900 -68518 -112670 -16363 -25035 16844 88419 317778 314655 184362
22812A84362r2531r0472l3799l6720l0182K9459J9097L2368K8325J2186Q4005
$$ 184362 91831 1359 -32440 -69160 -99342 -69883 -50786 -18418 9907 22093 106098
22801A06098r3805P0965j3889k8444p6059N1146Q179J4260l7579m16O2502M312
$$ 106098 12293 83258 69369 40925 -35134 16012 24191 38451 872 456 62958 67270
22789F7270Q243M8845L6325N2047n9581j01116K3876M0929N07L1367J3694k3669
$$ 67270 75513 124358 160683 212730 153149 52033 75909 116838 117345 148712 162406 138737
22777A38737k4464n4657J04346K6587J33107o6025k6282n2884k4236l6461P457
$$ 138737 114273 59616 163962 190549 323656 257631 231349 178465 154229 117768 125225
22766A25225L8380J9577O2099P8091J71377l4445k8506n0682L5873j06220j46604
$$ 125225 163605 183182 245281 323372 494749 460304 431798 381116 416989 310769 164165
22755A64165p1532J9357j1980q858N6672R6537J7839j8806j32780K688Q2528N1272
$$ 164165 92633 111990 100010 91152 147824 244361 262200 243394 110614 113302 195830 247102
22743B47102Q7097j04070j1509j4926J87598m9236r6129P4474j2495P9793K16091
$$ 247102 334199 230129 218620 203694 391292 342056 245927 320401 307906 387699 603790
22732F03790O922j3499O4465J49634j2943J23604J28598J46181L76665N37653
$$ 603790 610712 597213 661678 811312 798369 921973 1050571 1196752 1573417 2111070
22722B111070N33359J54014m39705m96229m18582l37733j38233L4184K8141j10691
$$ 2111070 2644429 2798443 2358738 1862509 1443927 1106194 967961 1002145 1030286 919595
22712I19595p9336L5115j3843J9853k0358J1030k8849K761K39854K17681q0801
$$ 919595 840259 875374 861531 881384 861026 872056 843207 845968 1085822 1303503 1222702
22701A222702j31594j5909p746P9056m9386j6194j6348j04594l9777R8734J58152
$$ 1222702 1091108 1075199 1067453 1146509 1097123 1080929 1064581 959987 920210 1018944 1177096
22690A177096M1084p6166P5884J81676J00080j17396L0764K01262J13703M0479
$$ 1177096 1218180 1142014 1217898 1399574 1499654 1382258 1413022 1614284 1727987 1768466
22680A768466R3639O6055j24491p6391P5244N0645J32437N7969Q6624L7036J54912
$$ 1768466 1862105 1928160 1803669 1727278 1802522 1853167 1985604 2043573 2130197 2167233 2322145
22669B322145J37661J90403J37857K75719M34976L95495K90327M32089N61834
$$ 2322145 2459806 2650209 2788066 3063785 3498761 3894256 4184583 4616672 5178506
22660E178506N55610P79123J044215J337852J702267K219548K950860L797918
$$ 5178506 5734116 6513239 7557454 8895306 10597573 12817121 15767981 19565899
22652A9565899M797886N974550P968288J0868622J3998053J7479562K0941470
$$ 19565899 24363785 30338335 38306623 49175245 63173298 80652860 101594330
22645A01594330K6759952L9568366O4100487R7520751P1411657m1564389r0805661
$$ 101594330 128354282 167922648 232023135 329543886 400955543 359391154 268585493
22638B68585493p5799172n4130527l5410349k3448096j5798564j1120415p893114
$$ 268585493 192786321 138655794 103245445 79797349 63998785 52878370 44985256
22631D4985256n352190l997973l314249l053583k566275k093959j919520j704092
$$ 44985256 39633066 35635093 32320844 29267261 26700986 24607027 22687507 20983415
22623B0983415j528243j290207j157858j055481p76008n20847l29677l45425l91414
$$ 20983415 19455172 18164965 17007107 15951626 15175618 14654771 14325094 13979669 13588255
22614A3588255l92578k44591j74083m9527J40641J66448J89161J19990k17985
$$ 13588255 13195677 12951086 12777003 12727476 12868117 13034565 13223726 13343716 13125731
22605A3125731m95899o18274p33897o52838p87442o15798n46780m60452m12805
$$ 13125731 12629832 12011558 11277661 10624823 9837381 9221583 8674803 8214351 7801546
22596G801546l36845m06507m11142l65447m33075l32209j95485k99508k11111
$$ 7801546 7464701 7058194 6647052 6281605 5848530 5516321 5320836 5021328 4810217
22587D810217k06943k82882k82945j65230p4380j22991k11950j49750l09078j58976
$$ 4810217 4603274 4320392 4037447 3872217 3797837 3674846 3462896 3313146 3004068 2845092
22577B845092o1332k14439j60562J30040l5944j12940j93019j20442p7916q3649
$$ 2845092 2783760 2569321 2408759 2538799 2502855 2389915 2196896 2076454 1998538 1914889
22567A914889p2639L4382O8847R8198N8485J55389L56186M46128J36634l39887
$$ 1914889 1842250 1876632 1945479 2043677 2102162 2257551 2613737 3059865 3196499 2856612
22557B856612n05084n05202m14364j98069n4492k5474j26630o1012N9348m4156
$$ 2856612 2351528 1846326 1431962 1233893 1179401 1153927 1027297 966285 1025633 981477
22547I81477j45245j69916o148M3924j16299l4066q3636M7549N1324l320Q1280
$$ 981477 836232 666316 660168 704092 587793 553727 470091 517640 568964 565644 646924
22536F46924Q1219j1211j12659k4603R4642m132n810l6206j1020j1599Q7966M077
$$ 646924 728143 716932 604273 579670 674312 670180 664370 628164 617144 605545 693511 697588
22524F97588j0010N3381j6270J0648P7341K6325j46380J7840l3225r772q8968
$$ 697588 687578 740959 724689 735337 812678 839003 692623 710463 677238 667466 578498
22513E78498j2946N5897p3523k00972p6704N2115K8017j03379j5563j4818j1148
$$ 578498 565552 621449 547926 346954 270250 322365 350382 247003 231440 216622 205474
22502B05474o4437N1010J7860N037o4395J1090l3024R4757Q3166M838J901p356
$$ 205474 141037 192047 209907 214944 150549 161639 128615 223372 306538 311376 313277 305921
22490C05921q5687l6381p8404n2814n5677j9948J06677R8079O6591K1026P4836
$$ 305921 220234 183853 105449 52635 -3042 -22990 83687 181766 248357 269383 344219
22479C44219m9340j26229m2130K900L7262O7656m942O3173k5336k8049O7005N7857
$$ 344219 294879 168650 126520 129420 166682 234338 229396 292569 267233 239184 306189 364046
22467C64046J8880j04372P975J27168R6169j37612j74720p6842J01544J21812
$$ 364046 382926 278554 286529 413697 509866 372254 197534 120692 222236 344048
22457C44048q7869R668n1864L1874k7524q5080L6977j2046O8337p460N4513K3394
$$ 344048 256179 265847 213983 245857 218333 133253 170230 158184 226521 219061 273574 296968
22445B96968P3619O1298N9081l0057l7722p6643l9509k3486M9771J10301n7181
$$ 296968 370587 431885 490966 460909 423187 346544 307035 283549 333320 443621 386440
22434C86440j07577o5143j62632j06L7395m2640J981j4189K0627P0734j1907J2979
$$ 386440 278863 213720 51088 50982 88377 45737 47718 33529 54156 124890 112983 125962
22422A25962P646k0523M9988L7846M0491J8133K1876N7595N4957j1378k4815j88373
$$ 125962 133608 113085 163073 200919 241410 259543 281419 339014 393971 382593 357778 169405
22410A69405R0300n1945R640R5236p6689o9140k3612R6486L225k9793P5879K9025
$$ 169405 259705 207760 217400 312636 235947 166807 143195 239681 242906 213113 288992 318017
22398C18017j20194o1681k3408K4027n3485N945Q1949J56329L8174p0167k1630
$$ 318017 197823 136142 112734 136761 83276 89221 171170 327499 365673 295506 273876
22387B73876r052l338L0361k852l7785K0828L249m3719q6579q1851O0414m5933
$$ 273876 264824 261486 291847 288995 251210 272038 275287 231568 144989 63138 123552 77619
22375G7619o5711r012M5517K069j75243j44744K9700J44826L9189L6986K636P2935
$$ 77619 11908 2896 48413 50482 -124761 -269505 -239805 -94979 -55790 -18804 -16168 56767
22363E6767Q8776J8518Q2412m5438p6222j03653q878N9361N1984P1617M8460n236
$$ 56767 145543 164061 246473 201035 124813 21160 12282 71643 123627 195244 243704 238468
22351B38468L7787l7000j18353J10037m2271L2076j35801p7143M6023L2558N4395
$$ 238468 276255 239255 120902 230939 188668 220744 84943 7800 53823 86381 140776
22340A40776p0631p9669J23491J44218O4027J02472Q5099k6772r428l7581j16362
$$ 140776 70145 -9524 113967 258185 322212 424684 509783 483011 473583 436002 319640
22329C19640k36605j74537o5893M8866j44538o2824K8277M9523J10964L4592N5982
$$ 319640 83035 -91502 -157395 -108529 -253067 -315891 -287614 -238091 -127127 -92535 -36553
22318c6553J7038p8781m7999L6211R7728j3152m8703K4833l4734j00934j1561
$$ -36553 -19515 -98296 -146295 -110084 -12356 -25508 -74211 -49378 -84112 -185046 -196607
22307a96607Q6711P1759J9022M3308r2079o3435P7420L4664p3843n4105J26393
$$ -196607 -109896 -38137 -19115 24193 -67886 -131321 -53901 -19237 -93080 -147185 -20792
22296b0792J62903o0124j79644K878J13866Q4462R6164n0397n3915L071k8680
$$ -20792 142111 81987 -97657 -94779 19087 103549 199713 149316 95401 98472 69792
22285F9792r2563p0524j06495J19797J02640m8624j54666L3031L7460l8457M800
$$ 69792 -22771 -93295 -199790 -79993 22647 -25977 -180643 -147612 -110152 -148609 -143809
22274a43809j9015n4268m3160R7867q176J5877J36945J32211Q5566J03521J2872
$$ -143809 -162824 -217092 -260252 -162385 -170561 -154684 -17739 114472 200038 303559 316431
22263C16431j21158j29955p1950Q214M2675L9128q8628k03803j04202K9513J49933
$$ 316431 195273 65318 -6632 1582 44257 83385 -5243 -209046 -313248 -283735 -133802
22252a33802J07899q6013N9788P5062m6207q9953K0416N9267o9422Q1969O0388
$$ -133802 -25903 -111916 -52128 22934 -23273 -113226 -92810 -33543 -102965 -20996 39392
22241C9392O0382o7856q1641k6028j13238l4364P6332J28433J14439l5650j38188
$$ 39392 99774 31918 -49723 -75751 -188989 -223353 -147021 -18588 95851 60201 -77987
22230g7987Q1107p8817L2806J6759O6285k6919M2401m932k7452j4649k1616o1324
$$ -77987 3120 -75697 -42891 -26132 40153 13234 55635 50703 23251 8602 -13014 -74338
22218g4338k4742q6444Q0808J31166L8821J4111j73263n0063J9798J1108J05085
$$ -74338 -99080 -185524 -104716 26450 65271 79382 -93881 -143944 -124146 -113038 -7953
22207g953O4389o8446o0805J4838j8142Q7489N0926j15328N7790K2429L1297M4104
$$ -7953 56436 -12010 -72815 -57977 -76119 11370 62296 -53032 4758 27187 58484 102588
22195A02588j66734p2509P896J6182L2916P2212J01116J03696j23624j22117j00231
$$ 102588 -64146 -136655 -128759 -112577 -79661 -7449 93667 197363 73739 -48378 -148609
22184a48609q971o4009l487J73349R4148n0291m5944m1796k399L2299O887m3052
$$ -148609 -157580 -221589 -225076 -51727 42421 -7870 -53814 -95610 -98009 -65710 -58823 -101875
22172a01875J7725O0989m8039p4963N5291J12616R9264L798j2917p2601n8833
$$ -101875 -84150 -23161 -71200 -146163 -90872 21744 121008 124806 111889 39288 -19545
22161a9545l4853K1849J34826N7260j09600o6551M8924p1855J3277L3909j21206
$$ -19545 -54398 -32549 102277 159537 49937 -16614 32310 -39545 -26268 7641 -113565
22150a13565k4402J49991P3158P6001j18864L5091J32875M2175q7973p9387j69784
$$ -113565 -137967 12024 85182 161183 42319 77410 210285 252460 164487 85100 -84684
22139h4684q6876P2633N0107j22235J55448N598l0577P4674J35453j18709q6794
$$ -84684 -171560 -98927 -48820 -171055 -15607 -10009 -40586 34088 169541 50832 -35962
22128c5962l4693J54811P1019K3486q3924p6915n3876N0176O8192m8709K0055
$$ -35962 -70655 84156 155175 178661 94737 17822 -36054 14122 82314 33605 53660
22117E3660n7495N9887M2250q1913j5751k8614j4513j18781o422P9574J54051
$$ 53660 -3835 56052 98302 16389 638 -27976 -42489 -161270 -167692 -88118 65933
22106F5933n0827l8647Q8255R447j15158n5607P0879K7529P2923K40N4845q3332
$$ 65933 15106 -23541 64714 74161 -40997 -96604 -25725 1804 74727 74967 129812 46480
22094D6480o677P0506m4697m4412k2551j0979K1192M3186N3119M6119j62065q9603
$$ 46480 39803 110309 65612 21200 -1351 -12330 8862 52048 105167 151286 -10779 -100382
22082a00382L654Q4722O1872k6673J8530J04799N6854j9469m983J60349J67982
$$ -100382 -96728 -12006 49866 23193 41723 146522 203376 183907 178924 339273 507255
22071E07255k5859j27387m6433J53480J77487J10708K40003L58082N44906K74826
$$ 507255 481396 354009 307576 461056 638543 749251 989254 1347336 1892242 2167068
22061B167068k60893n61377l59546k89611j65853j48196n3328p2717q3265K3199
$$ 2167068 1906175 1344798 985252 695641 529788 381592 328264 255547 172282 195481
22051A95481n6117J7273K4246p2429p2351L0504P5502r7745q2758R6684R7555
$$ 195481 139364 156637 180883 108454 36103 66607 142109 44364 -38394 58290 155845
22040A55845k9804n1993q9867J8662j5467L6886m1590p2167N3234l9535m7274
$$ 155845 126041 74048 -15819 2843 -12624 24262 -17328 -89495 -36261 -75796 -123070
22029a23070K4564Q6203J23909j4551M7014m7524o295R808L1740r511L2314p8896
$$ -123070 -98506 -12303 111606 97055 144069 96545 90250 100058 131798 122287 154601 75705
22017G5705q0335L3862j6635l0517j2877J8247L0559J49866P6851r369O2035j16064
$$ 75705 -4630 29232 12597 -17920 -30797 -12550 18009 167875 244726 235357 297392 181328
22005A81328o3371k7899l0474L2707J6911q0917O2328q4555o6510J7005O9626
$$ 181328 117957 90058 59584 92291 109202 28285 90613 6058 -60452 -43447 26179
21994B6179J0020p3721M2645P0135O8239j21628p9907J0199R2707j26560j55977
$$ 26179 36199 -37522 5123 75258 143497 21869 -58038 -47839 44868 -81692 -237669
21983b37669k2139L0226l0097n4127Q762J78386R5461L3496r7592j8163M347L5781
$$ -237669 -259808 -229582 -259679 -313806 -305044 -126658 -31197 2299 -95293 -113456 -109109 -73328
21971g3328M2437K16989K3562j11827j05995q788M7312m9522r1455m1095j0065
$$ -73328 -30891 186098 209660 97833 -8162 -16950 30362 -19160 -110615 -151710 -161775
21960a61775k3731O7138K2535M2703p4594k9153p6131q1929Q9326J09418j14102
$$ -161775 -185506 -118368 -95833 -53130 -127724 -156877 -233008 -314937 -225611 -116193 -230295
21949b30295L6336O4621o6486O0466L9184Q6501L1939j28736P866L9385J51685
$$ -230295 -193959 -129338 -195824 -135358 -96174 -9673 22266 -106470 -98604 -59219 92466
21938I2466m9316j08680O524l7754J20324O5130q0899j4617Q817r375j6778L7762
$$ 92466 43150 -65530 -59006 -96760 23564 88694 7795 -6822 1995 -7380 -24158 13604
21926A3604N1825j4918O7002P5970o3244j48508j11985l367N5305n470O6514Q6859
$$ 13604 65429 50511 117513 193483 130239 -18269 -130254 -133621 -78316 -83786 -17272 69587
21914F9587k1980j12609l7680O3r004L6321M6777Q8007P5418P1164k883q5086
$$ 69587 47607 -65002 -102682 -102619 -111623 -75302 -28525 59482 134900 206064 203181 118095
21902A18095k6629l0327n5389q9067K6492J19984Q3277K6065l6534j51526r3891
$$ 118095 91466 61139 5750 -83317 -56825 63159 146436 172501 135967 -15559 -109450
21891a09450J9449J73215N6464l1791K0424O174n8506l5325p7405m1302M4451
$$ -109450 -90001 83214 139678 107887 128311 134485 75979 40654 -36751 -78053 -33602
21880c3602N5262j30551j0497O2629Q593Q241k0804J9256J49872J03971o5683
$$ -33602 21660 -108891 -119388 -56759 -48166 -39925 -60729 -41473 108399 212370 146687
21869A46687k7907O677j24962R638O480p03p8420O1170M6326K47k3959n0606r8277
$$ 146687 118780 125457 495 10133 16613 15910 -62510 -1340 44986 45233 21274 -29332 -127609
21856a27609P9904K7048o1194L8297J39873M9980o8160j20930K1535P0533J28739
$$ -127609 -47705 -20657 -81851 -43554 96319 146299 78139 -42791 -21256 49277 178016
21845A78016Q3427J6989K2541n3633l7574P85j10322n6029j19740j33120J33055
$$ 178016 261443 278432 300973 247340 209766 210551 100229 44200 -75540 -208660 -75605
21834g5605J42171l9297p3234o3927Q2276m422L60j5693n55m8674j51986O1541
$$ -75605 66566 27269 -45965 -109892 -27616 -32038 -31678 -47371 -47926 -96600 -248586 -187045
21822a87045j154K3019J2704Q2998M1741j0691J02297L0972o3298j37178n2750
$$ -187045 -188199 -165180 -152476 -69478 -27737 -38428 63869 94841 31543 -105635 -158385
21811a58385J05877J63942k4640J2046j85867p0288n088J27906P3247o6826P1184
$$ -158385 -52508 111434 86794 98840 -87027 -157315 -162403 -34497 38750 -28076 43108
21800D3108M6622o5702o1751p1645P8202M665j939j0959M4721l5684k5023l451
$$ 43108 89730 24028 -37723 -109368 -31166 -26501 -28440 -39399 5322 -30362 -55385 -58836
21788e8836J3458l1868j52191j2463R2613J11072R0554K8521M6933o5769o8039
$$ -58836 -45378 -77246 -229437 -241900 -149287 -38215 52339 80860 127793 62024 -6015
21777f015m5929m5796l3699l7493n286M2089P5298O7260M5221j8780p567n614
$$ -6015 -51944 -97740 -131439 -168932 -174218 -132129 -56831 10429 55650 36870 29303 23689
21765B3689o840R1345P2491l6208K6734l4746K5860m8868l0266K6916Q540R353
$$ 23689 16849 108194 180685 144477 171211 136465 162325 113457 83191 110107 118647 128000
21753A28000o3524o9476J8785j31761J0514M6513J02752O7234r7797K3093N0260
$$ 128000 64476 -5000 13785 -117976 -107462 -60949 41803 109037 11240 34333 84593
21742H4593L036R0506J4580o1533j10579j51822p2362K5575l3819R8335R0070
$$ 84593 87629 178135 192715 131182 20603 -131219 -203581 -178006 -211825 -113490 -23420
21731b3420j2981l7371j04473n9865J35033o8102K8278P7970J10390l7609r8947
$$ -23420 -36401 -73772 -178245 -238110 -103077 -171179 -142901 -64931 45459 7850 -91097
21720i1097K2033M2975q5286p3024m8214j6162P7442J63691J17617k4542r8542
$$ -91097 -69064 -26089 -111375 -184399 -232613 -248775 -171333 -7642 109975 85433 -13109
21709a3109M907O4212J9827k5668l3138q3507l350k8773L0928P1946N2979o7951
$$ -13109 -8202 56010 75837 50169 17031 -66476 -69826 -98599 -67671 4275 57254 -10697
21697a0697q5241o40j2521J9889J64283N1612m7407O3138K9512K5449n035j12227
$$ -10697 -95938 -96578 -109099 -89210 75073 126685 79278 142416 171928 197377 192342 80115
21685H0115n7950j5328N0523R4574K4668r2106O5253j5331l8400l0271o3061l7911
$$ 80115 22165 6837 57360 151934 176602 84496 149749 134418 96018 65747 2686 -35225
21673c5225J1455l12k0233L1929N941K1994k1623K3221N37r3262M6072J34440
$$ -35225 -23770 -24082 -44315 -12386 -6445 15549 -6074 17147 17684 -75578 -29506 104934
21661A04934q9246j62714l7635K74l7048n0995Q4940J0688Q252J21761J23898
$$ 104934 15688 -147026 -184661 -184387 -221435 -272430 -187490 -176802 -168550 -46789 77109
21650G7109P946r30n676o0706q9703l8796l3615m4494k8125J51256O5790N915
$$ 77109 85055 84125 78449 17743 -71960 -110756 -144371 -188865 -216990 -65734 56 5971
21638E971J6958N5386Q9299M7920K809j5341j19504m2244l8956j3207P1422j2368
$$ 5971 22929 78315 167614 215534 218343 203002 83498 41254 2298 -10909 60513 48145
21626D8145j21428J8298J36739P0601o3803j06905n4516m5100Q843m4412m5476
$$ 48145 -73283 -54985 81754 152355 88552 -18353 -72869 -117969 -109126 -153538 -199014
21615a99014P9836O1675M7315l0861M6489k7670o1895k6360L5182o4011J26648
$$ -199014 -119178 -57503 -10188 -41049 5440 -22230 -84125 -110485 -75303 -139314 -12666
21604a2666L0137n8787j06128j0661M0769J04786o0421K8044M761L3736R2582
$$ -12666 17471 -41316 -147444 -158105 -117336 -12550 -72971 -44927 -40166 -6430 86152
21593H6152l4658q3039p8787L7898J4136l8659m239j00112K6136P229N1729Q3846
$$ 86152 51494 -31545 -110332 -72434 -58298 -96957 -101196 -201308 -175172 -167943 -116214 -32368
21581c2368J4160J16679P1068m22p8395r1652m8037M6778o3354N1539J7798K5332
$$ -32368 -18208 98471 169539 169117 90722 -930 -48967 -2189 -65543 -14004 3794 29126
21569B9126n623J4276j3636J3620Q3447L3145p0936j23870j07611N6516N5444
$$ 29126 23503 37779 24143 37763 121210 154355 83419 -40451 -148062 -91546 -36102
21558c6102p6975M576O1845q627j16324O9361N4538J03720q373l3126n9962M6487
$$ -36102 -113077 -108501 -46656 -55283 -171607 -102246 -47708 56012 47639 14513 -45449 1038
21546A038q1686j26015k2162Q7150J97117Q002j22452k7727O6466J97605M5972
$$ 1038 -80648 -206663 -228825 -141675 55442 63444 -59008 -86735 -20269 177336 223308
21535B23308o4366k2313n1351K5649R3325j68952n0925O4433k381L1596K5355
$$ 223308 158942 136629 85278 110927 204252 35300 -15625 48808 46427 78023 103378
21524A03378j734L3256l6765j40557r8297J39835n673m5720K2787Q0993m5431
$$ 103378 101644 134900 98135 -42422 -140719 -884 -6557 -52277 -29490 51503 6072
21513F072Q4313J0165j24548m0570O2824K4210q4157O4799J0809n6753L4996P0494
$$ 6072 90385 100550 -23998 -64568 -1744 22466 -61691 3108 13917 -42836 -7840 62654
21501F2654n7214q5899q703K1446N6496Q3180J0310M991J7657M999N0444J84830
$$ 62654 5440 -80459 -89162 -67716 -11220 71960 82270 87261 104918 109917 160361 345191
21489C45191l8668j17175p0159Q399P6277k0319r7905k8919r4108R148N6020M5610
$$ 345191 306523 189348 119189 127588 203865 183546 85641 56722 -37386 -28238 27782 73392
21477G3392M7410N2035j7652j16948o1325O345n7242j19180M5073J04434L6550
$$ 73392 120802 172837 155185 38237 -23088 -16743 -73985 -193165 -148092 -43658 -7108
21466g108n2750N1563j4938j00138l2370k1129k7176M6080K1323n2716Q8095R2292
$$ -7108 -59858 -8295 -23233 -123371 -155741 -176870 -204046 -157966 -136643 -189359 -101264 -8972
21454h972p7805Q8704J33551L809p0816o5257N8833M2037N1478n2063m0551M7594
$$ -8972 -86777 1927 135478 139287 68471 3214 62047 104084 155562 103499 62948 110542
21442A10542l7541q3512Q904J45300r985J9743k6927k3161n9510k9013N5641K107
$$ 110542 73001 -10511 -1607 143693 133708 153451 126524 103363 43853 14840 70481 72588
21430G2588m2212p5853N1594R494j2534P698k2411o5394n2777P7278r2876R881
$$ 72588 30376 -45477 6117 15611 3077 10775 -11636 -77030 -129807 -52529 -145405 -135524
21418a35524J20995L9714n8472o9291J0554k8348m878j3514j2379m3587q712K8510
$$ -135524 -14529 25185 -33287 -102578 -92024 -120372 -125250 -138764 -151143 -194730 -203442 -174932
21406a74932M8044K123k9940K5925o0287j00812O8649J12308L8105J7529j7632
$$ -174932 -126888 -124765 -154705 -128780 -189067 -289879 -221230 -108922 -70817 -53288 -70920
21395g0920k0567L6807K1869Q191M7104j06021L4811M0024Q9170O2881J8789K7934
$$ -70920 -91487 -54680 -32811 -24620 22484 -83537 -48726 -8702 80468 143349 162138 190072
21383A90072M429q8524j59300o9260P511p6842R6570P126P5555r706k6077J01805
$$ 190072 194501 105977 -53323 -122583 -115072 -191914 -95344 -88218 -12663 -22369 -48446 53359
21371E3359P1696M096J7040k6192q1643n8046M6942K5865K5073n4899N3431o2626
$$ 53359 125055 129151 146191 119999 38356 -19690 27252 53117 78190 23291 76722 14096
21359A4096l3178J09987J7869o5290r7039o7831Q9942j2107o2357Q6002J12478
$$ 14096 -19082 90905 108774 43484 -53555 -121386 -31444 -43551 -105908 -19906 92572
21348I2572m1426j5820N6929m377j74663k8495J03931K8551j02747O119P9585
$$ 92572 51146 35326 92255 87878 -86785 -115280 -11349 17202 -85545 -79426 159
21337A59k8767J05745k3043j59635n1546k3631k5541O5584L4595o2520j6480L5969
$$ 159 -28608 77137 54094 -105541 -157087 -180718 -206259 -140675 -106080 -168600 -185080 -149111
21325a49111M0479M1747O6033j8582l6301m6635J322j4888k7998L3217J2022J5374
$$ -149111 -108632 -66885 -852 -19434 -55735 -102370 -101048 -115936 -143934 -110717 -98695 -83321
21313h3321K5576n1489p3236L2355K2173J1613J10213J53847Q6867j84931j21412
$$ -83321 -57745 -109234 -182470 -150115 -127942 -116329 -6116 147731 234598 49667 -71745
21302g1745K5701J20024o2678r5821L6807k2661l6745M8762m5407r652R3837m4593
$$ -71745 -46044 73980 11302 -84519 -47712 -70373 -107118 -58356 -103763 -113415 -19578 -64171
21290f4171k2272P9343J34684Q6676o149n6698o5853j27112m084K5052Q8342n2190
$$ -64171 -86443 -7100 127584 214260 208111 151413 85560 -41552 -45636 -20584 67758 15568
21278A5568j21265m6717N3898P551L0621N5507M3747O1348m441O8073K4205m491
$$ 15568 -105697 -152414 -98516 -90965 -60344 -4837 38910 100258 95817 163890 188095 183604
21266A83604J0038q8153R4691M7955N4943o6447q0655p6519p9996j3917k683Q3370
$$ 183604 193642 105489 200180 248135 303078 236631 155976 79457 -539 -14456 -17139 66231
21254F6231j73041k983P5773J3975k123Q6878k51o8068q139M6615J74316L2296
$$ 66231 -106810 -109793 -34020 -20045 -22168 64710 64459 -3609 -11748 34867 209183 241479
21242B41479l3870j65181k44520J2890M9324L1242r7595P5712N1218J67029O0921
$$ 241479 207609 42428 -202092 -189202 -139878 -108636 -206231 -130519 -79301 87728 148649
21231A48649k16982m9321J92747J27073o6216q9699N2182j5892l7775m1968k0067
$$ 148649 -68333 -117654 75093 202166 135950 46251 98433 82541 44766 2798 -17269
21220a7269Q2117J7547K7996K1779L9609o8274r5547j63518J6994N2730N625p4711
$$ -17269 64848 82395 110391 132170 171779 103505 7958 -155560 -138566 -85836 -80211 -154922
21208a54922k7996J81747M4009O6627l1772r6322P3440R1020k1287j5394m2541
$$ -154922 -182918 -1171 42838 109465 77693 -18629 54811 145831 124544 109150 66609
21197F6609m9883n6769K7303j5141p008J1683k3157j46106O5895J04903q0710
$$ 66609 16726 -40043 -12740 -27881 -34889 -23206 -46363 -192469 -126574 -21671 -102381
21186a02381m6587l8396J44146Q3248J3984k2780Q815l2690m2657n9344j27523
$$ -102381 -148968 -187364 -43218 40030 54014 31234 40049 7359 -35298 -94642 -222165
21175b22165l6293J04448J6417Q8220J36467j30960O5510N3208k2179n8054q2921
$$ -222165 -258458 -154010 -137593 -49373 87094 -43866 21644 74852 52673 -5381 -88302
21164h8302j11732M1332N6354Q3402j5868l38j01354k1671N242O7955J18901J666
$$ -88302 -200034 -158702 -102348 -18946 -34814 -35152 -136506 -158177 -152935 -84980 33921 35587
21152C5587r0938l6133P7885N5732k8735p2975P6986Q8140p841m3705k2981K6034
$$ 35587 -55351 -91484 -13599 42133 13398 -59577 17409 105549 97708 54003 31022 57056
21140E7056k1546n9666j9510j4117M8921R1836L3741j35177j2862R1434j4524
$$ 57056 35510 -24156 -43666 -57783 -8862 82974 116715 -18462 -31324 60110 45586
21129D5586Q9030P0102k3327M0972j30251j5365j05031j27742J4033K5249j5635
$$ 45586 134616 204718 181391 222363 92112 76747 -28284 -156026 -141993 -116744 -132379
21118a32379o207J04047O8525R54k41n4342j5481M1640r5531p5893J4939Q1732
$$ -132379 -138586 -34539 33986 34940 34699 -19643 -35124 6516 -89015 -164908 -149969 -68237
21106f8237N3492K3804q850o89Q7267N756p1837o0023J35531N3004j8164L4630
$$ -68237 -14745 9059 209 -480 86787 92543 20706 -39317 96214 149218 131054 165684
21094A65684m3926o3829L4365j26289j11493J07790J44309Q3697j05643j07262
$$ 165684 121758 57929 92294 -33995 -145488 -37698 106611 190308 84665 -22597
21084b2597L4195k4445k7968j066K1234J60067m9433l5612k3130K9992j1858P7701
$$ -22597 11598 -12847 -40815 -41881 -20647 139420 89987 54375 31245 61237 49379 127080
21072A27080R3635P1263j50721j21104L2835M8948j806o7325o1455j15409J16660
$$ 127080 220715 291978 141257 20153 52988 101936 100130 32805 -28650 -144059 -27399
21061b7399M7889r0714L420L388J4577J0512j353j8177R7248K7520n967n0328
$$ -27399 20490 -70224 -66804 -63416 -48839 -38327 -39680 -57857 39391 66911 60944 10616
21049A0616q4371K6146J17918K0168N2069p4399L1667J15470k8830q5411r3891
$$ 10616 -73755 -47609 70309 90477 142546 68147 99814 215284 186454 101043 7152
21038G152m738L5737Q7850K6067k232J7582J10571p1492q4815o0718o9730J1818
$$ 7152 2414 38151 126001 152068 149836 167418 277989 206497 121682 60964 -8766 3052
21026C052P7127M6411j2692n1446j9517o1573j03180L9759N1865j36778L6540
$$ 3052 80179 126590 113898 62452 42935 -18638 -121818 -82059 -30194 -166972 -130432
21015a30432R8107K4657p17n7691j31187r496L9506o4817j2361J71047J38782
$$ -130432 -32325 -7668 -8385 -66076 -197263 -206759 -167253 -232070 -244431 -73384 65398
21004F5398L0260l9382j05688n3563J55385J56693j1357l7778o0634N5279p26
$$ 65398 95658 56276 -49412 -102975 52410 209103 197746 159968 99334 154613 153887
20993A53887p52j78664p9229l3135P8104L232n9112P9927k6619J8056n9751O1173
$$ 153887 153135 -25529 -104758 -137893 -59789 -56557 -115669 -35742 -62361 -44305 -104056 -42883
20981d2883j3425j29164j45083m4969N1871J48642J44071O0364m852m2637k5223
$$ -42883 -56308 -185472 -330555 -375524 -323653 -175011 -30940 29424 24572 -18065 -43288
20970d3288k4672n9483R7958J7328m5237l4229j4177J2136q545j57539P7495M9528
$$ -43288 -67960 -127443 -29485 -12157 -57394 -91623 -105800 -93664 -102209 -259748 -182253 -132725
20958a32725R2619R3306J5591L9058P326j39375q5803L5807J02915l9450P5666
$$ -132725 -40106 53200 68791 107849 115175 -24200 -110003 -74196 28719 -10731 64935
20947F4935o4145j14875r9061j32620J05490J44531l8062k4155L7568K8465J05224
$$ 64935 790 -114085 -213146 -345766 -240276 -95745 -133807 -157962 -120394 -91929 13295
20936A3295L3941m6404L6897O8443N953k8821j03409j12785N7874Q8881r2723
$$ 13295 47236 832 37729 106172 112125 83304 -20105 -132890 -75016 13865 -78858
20925g8858J6715m653j6899M3951Q87l3466k7294N625J65261P1302l2684L9289
$$ -78858 -62143 -66796 -83695 -39744 -38857 -72323 -99617 -93992 71269 142571 109887 149176
20913A49176k1998j23245j15848J13448J32783o3697j03911l5679M9064o7473
$$ 149176 127178 3933 -111915 1533 134316 70619 -33292 -68971 -19907 -87380
20903h7380k9279J10668O9285m9565j6581J04443J44160M2771k6563j90657j46546
$$ -87380 -116659 -5991 63294 13729 -2852 101591 245751 288522 261959 71302 -75244
20892g5244K4k9568M0713r46R6577J1959p7252N7246J79379q1923j36286n4806
$$ -75244 -75220 -104788 -64075 -65021 31556 43515 -33737 23509 202888 120965 -15321 -70127
20880g0127K6159P6464m1997M2619o0934q3998R5812j9921l0018r7889j08230
$$ -70127 -43968 32496 -9501 33118 -27816 -111814 -16002 -35923 -65941 -163830 -272060
20869b72060Q2208J20519m1463R380M4645M4694r4846k2595J69923J44423m5993
$$ -272060 -189852 -69333 -110796 -101416 -56771 -12077 -106923 -129518 40405 184828 138835
20858A38835k08956L2825k8486O400m5095J05874J37179p5250P6580o6015j37376
$$ 138835 -70121 -37296 -65782 -59382 -104477 1397 138576 63326 139906 73891 -63485
20847f3485q5955J7382J18237M3164m0433J19683Q4037k7896l7456p6423J8437
$$ -63485 -149440 -132058 -13821 29343 -11090 108593 192630 164734 127278 50855 69292
20836F9292K7148L1381o7154j41451l8871Q1996J01196Q0143O4224m4279p52n8958
$$ 69292 96440 127821 60667 -80784 -119655 -37659 63537 143680 207904 163625 162873 103915
20824A03915n6508p8246O5453j3425j25966M0958N9210J39622M4731j46134n3260
$$ 103915 47407 -30839 34614 21189 -104777 -63819 -4609 135013 179744 33610 -19650
20813a9650o5672J2744j22021L7873Q0894J337m129O3043M609K2207N1670P1630
$$ -19650 -85322 -72578 -194599 -156726 -75832 -74495 -78624 -15581 -10972 11235 62905 134535
20801A34535l9680n047N9413n8238j48486q6460M6672J31608N7722j9879j03907
$$ 134535 94855 89808 149221 90983 -57503 -143963 -97291 34317 92039 72160 -31747
20790c1747J239O513N6995P4948J993J58180M116q7575K2656m4081k09024K5743
$$ -31747 -30508 -23995 33000 107948 109941 268121 272237 184662 207318 163237 -45787 -20044
20778b0044L4571K9393j6317n9840n187j59582j32408j3040R7639O4227J43940
$$ -20044 14527 43920 27603 -32237 -37424 -197006 -329414 -342454 -244815 -180588 -36648
20767c6648M4125l1995n1423J5329q8451k9085J08898l6990j11782j5220O1596
$$ -36648 7477 -24518 -75941 -60612 -149063 -178148 -69250 -106240 -218022 -233242 -171646
20756a71646N3948P7861O0221n1468k6347L2971Q0479l9491o5470O0924M7395
$$ -171646 -117698 -39837 20384 -31084 -57431 -24460 56019 16528 -48942 11982 59377
20745E9377o6017m969L3219o678l7239j03722n7970Q5162J36127k8654p9455K1726
$$ 59377 -6640 -11609 21610 14932 -22307 -126029 -183999 -98837 37290 8636 -70819 -49093
20733d9093N3536R2558j35900J337m0713M6620N063l6183l2798J4540m4394l5800
$$ -49093 4443 97001 -38899 -37562 -78275 -31655 -26592 -62775 -95573 -81033 -125427 -161227
20721a61227N9878M6709P8370K7452n6557J7854R2371j2976j14033M1072n4279
$$ -161227 -101349 -54640 23730 51182 -5375 12479 104850 91874 -22159 18913 -35366
20710c5366k952j7442p8757L583O8149k5823j8865O1813J25J16990J17707j04832
$$ -35366 -38318 -55760 -134517 -130934 -62785 -88608 -107473 -45660 -45535 71455 189162 84330
20698H4330m6190P8239m4388j28601p5621N108J43497j6194p1455r9889L8494
$$ 84330 38140 116379 71991 -56610 -132231 -127123 16374 180 -71275 -171164 -132670
20687a32670l28M6934M7200k6040j43131J10139J74286j6356M603M5317l6487
$$ -132670 -132998 -86064 -38864 -64904 -208035 -97896 76390 60034 64637 109954 73467
20676G3467K9863J8825p4757P7045J7320l5367m067N0545m0350o4677M5990O017
$$ 73467 103330 122155 47398 124443 141763 106396 102329 152874 112524 47847 93837 99854
20664I9854k7282L3808R3790p4869p9241P7786L3927q4269R9165l7589N8951j8309
$$ 99854 72572 106380 200170 125301 46060 123846 157773 73504 172669 135080 194031 175722
20652A75722l1654j03505m3853n9250K7277m9396l7974m1119K05680J29114M2208
$$ 175722 144068 40563 -3290 -62540 -35263 -84659 -122633 -163752 41928 171042 213250
20641B13250Q597j0762m6790k1567n6939j40846k431M4372p0613n4494Q7711J83573
$$ 213250 221847 211085 164295 142728 85789 -55057 -57488 -13116 -83729 -138223 -50512 133061
20629A33061L3223J4357N6965m1731j19751M138K1135Q849L1500j866j63166p4699
$$ 133061 166284 180641 237606 195875 76124 80262 101397 110246 141746 139880 -23286 -97985
20617i7985L0270J00767j7125j06679J27341L7874l9336m0270L4037O505M9730
$$ -97985 -67715 33052 15927 -90752 36589 74463 35127 -5143 28894 35399 85129
20606H5129m097j0604j08823j06632Q0202J90025J35334m8010r8948N2237N7308
$$ 85129 81032 70428 -38395 -145027 -64825 125200 260534 212524 113576 165813 223121
20595B23121j36402o9569J20176Q0719l5656o4197n8048o0500J27443K1694J87
$$ 223121 86719 17150 137326 218045 182389 118192 60144 -356 127087 148781 148968
20584A48968k7250j3342n5047Q9039l671j52755n4179l4152o2430L9853p242O7139
$$ 148968 121718 108376 53329 142368 138697 -14058 -68237 -102389 -164819 -124966 -132208 -65069
20572f5069R5408Q736q9231p2251l1838K8779K0843O2849Q0036K9727K1563m9434
$$ -65069 30339 39075 -50156 -122407 -154245 -125466 -104623 -41774 38262 67989 89552 40118
20560D0118J6020n59j09264m78N1275Q4891q3598M3629n1751r6855r2970J7717
$$ 40118 56138 55579 -53685 -54163 -2888 82003 -1595 42034 -9717 -106572 -199542 -181825
20548a81825J14635J77289R1713q0642j10468n7423n050j0557N6866m4261L4588
$$ -181825 -67190 110099 201812 121170 10702 -46721 -51771 -62328 -5462 -49723 -15135
20537a5135j9975L1518J9476o5962l08K9708O5617P8469J3618m4371r3716j4796
$$ -15135 -35110 -3592 15884 -50078 -50386 -20678 44939 123408 137026 92655 -1061 -15857
20525a5857L123P3682M1784k3551Q5762j8781r0578m2558p7386Q1367k8383m6311
$$ -15857 -12734 60948 102732 79181 164943 146162 55584 13026 -64360 17007 -11376 -57687
20513e7687k0755k7937n2553J21205k2333J01672M0996L9144j15788m9850r9550
$$ -57687 -78442 -106379 -158932 -37727 -60060 41612 82608 121752 5964 -43886 -143436
20502a43436m4158Q2360J86754J4418j56585L4523K7348n8908k2806n28L4977
$$ -143436 -187594 -105234 81520 95938 -60647 -26124 1224 -57684 -80490 -81018 -46041
20491d6041j5383o278J22929Q1867j14121R714Q6683n9617k34039o4777L1505
$$ -46041 -61424 -67702 55227 137094 22973 32687 119370 59753 -174286 -239063 -207558
20480b07558L2794N5048J44395J35023O6762l3266K1719q4041j91957J8726L9390
$$ -207558 -174764 -119716 24679 159702 226464 193198 214917 130876 -61081 -42355 -2965
20469b965m4788p5727N0132J14158R7625l0194j7842j32770j43458j7767j5935
$$ -2965 -47753 -123480 -73348 40810 138435 108241 90399 -42371 -185829 -203596 -219531
20458b19531l9342L4149J4288M2609J28601Q1125o0365m2076N7379N1264o7950
$$ -219531 -258873 -224724 -210436 -167827 -39226 41899 -18466 -60542 -3163 48101 -19849
20447a9849m9747J925K7193m6429J58939J21303L334o3850j043J05436j1856j94626
$$ -19849 -69596 -67671 -40478 -86907 72032 193335 196669 132819 131776 237212 225356 30730
20435C0730m5164K986J04727O8624M574k1633Q2588Q040j0445K7102j8161j2621
$$ 30730 -14434 -11448 93279 161903 166477 144844 227432 235472 225027 252129 233968 221347
20423B21347j06519j3924o158q77K1397r6170n6336J26648N7849p8162o2545j0881
$$ 221347 114828 100904 94746 93869 115266 19096 -37240 89408 147257 69095 6550 -4331
20411d331O1871l1247j6207j02382p0902P2167J6643R8320K4441L349m3952O4679
$$ -4331 57540 26293 10086 -92296 -163198 -91031 -74388 23932 48373 51722 7770 72449
20399G2449J07641o4848k33991k6972J20861K157m5596j1746M0671j838j29475
$$ 72449 180090 115242 -118749 -145721 -24860 -22703 -68299 -80045 -39374 -41212 -170687
20388a70687j5147L4100J5675L0845J9167o8432N679j1830n8833N0025L044J03927
$$ -170687 -185834 -151734 -136059 -105214 -86047 -154479 -148800 -160630 -219463 -169438 -166394 -62467
20376f2467J65236K5047j01754p3006J9672J260q33j59072o6054p908R9479P5687
$$ -62467 102769 127816 26062 -46944 -27272 -26012 -26845 -185917 -251971 -259879 -160400 -84713
20364h4713K22867O8843l7747j9177l8391j2300j4252j592j07319R3483Q9782
$$ -84713 138154 206997 169250 150073 111682 99382 85130 83538 -23781 69702 159484
20353A59484n3825n5122o4566j1492k3773m3530N4095L557N4094P1662O1490M8200
$$ 159484 105659 50537 -14029 -25521 -49294 -92824 -38729 -35172 18922 90584 152074 200274
20341B00274R0986M5753j87264j62129O0551j6888J04061J4049n4646j07822p8779
$$ 200274 291260 337013 149749 -12380 48171 31283 135344 149393 94747 -13075 -91854
20330i1854M2361M0863Q7049O1012p6604j1562J0243O713p3L2231J07161q0954
$$ -91854 -49493 -8630 78419 139431 62827 51265 61508 68221 68148 100379 207540 126586
20318A26586j63905N4533R6318o1275L2307P7200R3342q7558p9798k9219O0931
$$ 126586 -37319 17214 113532 52257 84564 161764 255106 167548 87750 58531 119462
20307A19462M1636r6729q0607j9330R4213L8062j05039R201J44235j3307m0255
$$ 119462 161098 64369 -16238 -35568 58645 96707 -8332 869 145104 131797 91542
20296I1542N628n6981J20641J52201m8836N898l1851q8257n1701o5250l4669j6532
$$ 91542 97170 40189 160830 313031 264195 270093 238242 149985 98284 33034 -1635 -18167
20284a8167J17838Q1491j03598L3945L0122j745o098k0022k7371O888J31371P5891
$$ -18167 99671 181162 77564 111509 141631 139886 133788 113766 86395 93283 224654 300545
20272C00545J45590O9970J83666J89570j001L0685K97645M90755K34897k46793
$$ 300545 446135 516105 699771 889341 888340 919025 1216670 1707425 1942322 1695529
20262A695529l39158k97151k03902j98639o7064j02139j69681l7559j06658q4117
$$ 1695529 1356371 1059220 855318 656679 589615 487476 317795 280236 173578 89461
20252H9461q1956Q6063J29725N7330p6895O5224k1683n3935P3875M8416j45850
$$ 89461 7505 93568 223293 280623 203728 268952 247269 193334 267209 315625 169775
20241A69775j48235P0107N2108J8274j844q0965q7259L5832K6718L4153k4951
$$ 169775 21540 91647 143755 162029 160185 79220 -8039 27793 54511 88664 63713
20230F3713j12109N38M980L9352O2725r1942L4274R0475l6636n5169M4079Q7354
$$ 63713 -48396 -47858 -42878 -3526 59199 -32743 1531 92006 55370 201 44280 131634
20218A31634Q711l3635j1933j0855o0838n2897O2285K8311k1961Q4072M3627J28190
$$ 131634 140345 106710 94777 83922 23084 -29813 32472 60783 38822 122894 166521 294711
20206B94711q0733k29293o9637L3438L3466J0734n5452P0741P8271l7552M0391
$$ 294711 213978 -15315 -84952 -51514 -18048 -7314 -62766 7975 86246 48694 89085
20195H9085K8254n0360K1555J6349m1779K0746l197J0295L7n3671O8786P114J12736
$$ 89085 117339 66979 88534 104883 63104 83850 80653 90948 90985 37314 106100 113214 225950
20182B25950p9688j00583n4402J56993K03136n7151j91188j55929M7863J11621
$$ 225950 146262 45679 -8723 148270 351406 294255 103067 -52862 -4999 106622
20172A06622J44895j9091n0762J1255n4641K5195R7404R192l5704q4553k6960
$$ 106622 251517 232426 181664 192919 138278 163473 260877 270069 234365 149812 122852
20161A22852k7920O5139o2213q4272l4286j5239j02296J13110J21139j26678p7715
$$ 122852 94932 160071 97858 13586 -20700 -35939 -138235 -25125 96014 -30664 -108379
20150a08379J27763R8979j17255J1333j229J06648n1875p2237n0004n414o1062
$$ -108379 19384 118363 1108 12441 11212 117860 65985 -6252 -56256 -61670 -122732
20139a22732P5755R1894o8258n3753J1441O3880Q5161q2915k0957p9240P256R7552
$$ -122732 -46977 44917 -23341 -77094 -65653 -1773 83388 473 -20484 -99724 -92468 5084
20127E084n737L7435O0223n1659j06794m673J2945o3597m5290R2118O3476Q751
$$ 5084 -653 36782 97005 45346 -61448 -66121 -53176 -116773 -162063 -69945 -6469 2282
20115B282L4801J1314o8479K9238n8281j2855J21155O4021l9850m8963K335O7581
$$ 2282 37083 48397 -20082 9156 -49125 -61980 59175 123196 83346 34383 36718 104299
20103A04299m2527j1146Q4358m6135J769n6830q7969r0293l2516N9644R7538J59948
$$ 104299 61772 50626 134984 88849 90618 33788 -54181 -144474 -176990 -117346 -19808 140140
20091A40140L0859P3704N6886j00721m0943P5121K5430j2832r7405K7865R9233
$$ 140140 170999 244703 301589 200868 159925 235046 260476 247644 150239 178104 277337
20080B77337j09250l4111n5278k9461o6410k477K7579N7346n4977j4871Q2006
$$ 277337 168087 133976 78698 49237 -17173 -19650 7929 65275 10298 -4573 77433
20069G7433J13782m1890j05273M3648N732j36640Q197J48180J45185M8247M3267
$$ 77433 191215 149325 44052 87700 93432 -43208 -35011 113169 258354 306601 349868
20058C49868m7980m5261M5606L1275l1852r0767k26693o1055J71353P7923k4133
$$ 349868 301888 256627 302233 333508 301656 210889 -15804 -76859 94494 172417 148284
20047A48284O5495l763R1958N7710j579O1380J25740J06321N9943K7904K091l508
$$ 148284 213779 210016 301974 359684 358105 419485 545225 651546 711489 739393 741484 737976
20035G37976M7747l1577q7261l0419P3923k4975n3325L0187P7581R4269p7022
$$ 737976 785723 754146 666885 636466 710389 685414 632089 662276 739857 834126 757104
20024G57104J6932R369J937o260n2546L7465J1056l7095q7193j56610R354P0949
$$ 757104 774036 783405 785342 779082 726536 764001 775057 737962 650769 494159 503513 574462
20012E74462n2677r1673q0096j44722K4141Q2089l665m0528K2753N6812m7384
$$ 574462 521785 430112 350016 205294 229435 311524 307859 267331 290084 346896 299512
20001B99512p4885m8101J3252P1909O5166p109n8304N1187J42513L0025J1071
$$ 299512 224627 176526 189778 261687 326853 319744 261440 312627 455140 485165 496236
19990D96236J99964k2302r2215Q5110J58752J67875q683J9020l6906j6637P7517
$$ 496236 696200 673898 581683 666793 825545 993420 984737 1003757 966851 950214 1027731
19979A027731J7740K8314P0827j4905n6373j20371k81750l50070r8291K5373R4436
$$ 1027731 1045471 1073785 1144612 1129707 1073334 952963 671213 321143 222852 248225 342661
19968C42661o6p0051Q2702l9057j51800n2223K2185j9195j1962O9471q055P6067
$$ 342661 342595 272544 355246 316189 164389 112166 134351 115156 103194 172665 164610 240677
19956B40677l3081j17477r9021M3208L0761N0329k2856L5151m6815L0680L1624
$$ 240677 207596 90119 -8902 34306 65067 115396 92540 127691 80876 111556 143180
19945A43180l4358l5356j1663l7931m0745R4228R5758m6292p0612J6589L7906
$$ 143180 108822 73466 61803 23872 -16873 77355 173113 126821 56209 72798 110704
19934A10704J4082P1115Q4887o4353o5770l6378J17133R3133l9470n306r041p516
$$ 110704 124786 195901 280788 216435 150665 114287 231420 324553 285083 279777 270736 263220
19922B63220O4788N968n3103L1694N5210L3239J2491J2252j15236o2971R7836
$$ 263220 328008 333976 280873 312567 367777 401016 413507 425759 310523 247552 345388
19911C45388j1650j28547K7324P2878p7421p4221K8644j9295r2807n352L083j9716
$$ 345388 333738 205191 232515 305393 227972 153751 182395 163100 70293 64941 68024 48308
19899D8308N1035M736n2076L0191J00429O779J5457r5022p9562N5069P8549J22145
$$ 48308 99343 104079 52003 82194 182623 189402 204859 109837 30275 85344 163893 286038
19887B86038n821p5539q4259p809r7676q108J47908L7839k8017r0269M7199n849
$$ 286038 280217 204678 120419 112610 14934 6826 154734 192573 164556 74287 121486 115637
19875A15637P482O2546j03890j20919O5734p27K8176J17163Q1050n9156m6190
$$ 115637 123119 185665 81775 -39144 26590 25863 54039 171202 252252 193096 146906
19864A46906J46089n7356l9136K247O305L2084n23p4791O560N7322l8292J3237
$$ 146906 292995 235639 196503 198750 205055 237139 236616 161825 168385 225707 187415 200652
19852B00652L5665p7907O544Q6079K0721M3499K8439l475o5229j03686j2373J13319
$$ 200652 236317 158410 164954 251033 271754 315253 343692 340217 274988 171302 158929 272248
19840B72248n0231m447J06171k8881k9527k8145J6132Q8580N0695L18R8017o3986
$$ 272248 222017 217570 323741 294860 265333 237188 253320 341900 392595 392913 490930 426944
19828D26944j04019m6747q1373Q349j26590k5955J41155p6943o9956j11098p05
$$ 426944 322925 276178 194805 203154 76564 50609 191764 114821 44865 -66233 -66938
19817f6938O0335o6418j00984M4497J13323J41704r937P4974n8279j01975l3556
$$ -66938 -6603 -73021 -174005 -129508 -16185 125519 115582 190556 132277 30302 -3254
19806c254N9656J7607R4890K1700k4840R2605K6397l9602J02576M620j8461K7935
$$ -3254 56402 74009 168899 190599 165759 258364 284761 245159 347735 352355 333894 361829
19794C61829m1901l4600L660M6667J65098J27648j28106p6799k620O3436L3152
$$ 361829 319928 285328 288988 335655 500753 628401 500295 423496 420876 484312 517464
19783E17464o7785n3705j0739q4150k1954n9007j30614n8459L5777L7561J33455
$$ 517464 449679 395974 385235 301085 279131 220124 89510 31051 66828 104389 237844
19772B37844K6120j24237m9096M4558M2229O8538L3782o422n4153j04454R7153
$$ 237844 263964 139727 90631 135189 177418 245956 279738 273316 219163 114709 211862
19761B11862J4792P712l7402Q2839M4386m3304Q2322m4998k1824J3401j5064M7700
$$ 211862 226654 234366 196964 279803 324189 280885 363207 318209 296385 309786 294722 342422
19749C42422k4180O8727P6347o7853m3378J20004M7633N8019j2466L8214O8541
$$ 342422 318242 386969 463316 395463 352085 472089 519722 577741 565275 603489 672030
19738F72030q1663m9199M8983N9611R485K7102m6804n4576J7886J54273M9463
$$ 672030 590367 541168 590151 649762 659247 686349 639545 584969 602855 757128 806591
19727H06591J3939Q2058J22879j0193J9627J26933k4179j41335q122J04920J37411
$$ 806591 820530 902588 1025467 1015274 1034901 1161834 1137655 996320 988198 1093118 1230529
19716A230529r7057k1120Q0203M8972K8872R7598R1919l7093M0843N5000J16829
$$ 1230529 1133472 1112352 1192555 1241527 1270399 1367997 1459916 1422823 1463666 1518666 1635495
19705A635495M4931J04658M0748Q682J4267M9115p5755R868O4712K7416O7903
$$ 1635495 1680426 1785084 1825832 1834514 1848781 1897896 1822141 1832009 1896721 1924137 1992040
19694A992040J80244K33289J57166L64509M12345L16171K69613M56159O96900
$$ 1992040 2172284 2405573 2562739 2927248 3339593 3655764 3925377 4381536 5078436
19685E078436P82468L89806O8817Q7751L52997M90224R14716J272492J688957
$$ 5078436 5860904 6250710 6319527 6407278 6760275 7250499 8165215 9437707 11126664
19676A1126664K222079K568759K934240L641890N180362P253093R749903J2916760
$$ 11126664 13348743 15917502 18851742 22493632 27673994 34927087 44676990 57593750
19668E7593750J6300193J9590205K4120202L3160018N1538834P7875201P9620423
$$ 57593750 73893943 93484148 117604350 150764368 202303202 280178403 359798826
19661C59798826J1079657o5238710p8938580o2114735m3120735k8853561j9674046
$$ 359798826 370878483 305639773 226701193 164586458 121465723 92612162 72938116
19654G2938116j3707252r834203p079808n058329l704358k830494k172781j709810
$$ 72938116 59230864 49396661 42316853 37258524 33554166 30723672 28550891 26841081
19646B6841081j413859j359771j680087j703868j320881r52002p03360m01992
$$ 26841081 25427222 24067451 22387364 20683496 19362615 18410613 17707253 17305261
19638A7305261j73405m15628q82291q61240n87838m73157l22416j35157K3797
$$ 17305261 17131856 16716228 15833937 14972697 14384859 13911702 13589286 13454129 13477926
19629A3477926J29176R5283O6870l15378n75236p19444o70660o35069o52348o51614
$$ 13477926 13607102 13702385 13769255 13453877 12878641 12159197 11488537 10853468 10201120 9549506
19619I549506m60014m50154m56282m98040m89338n13610k61013j56755j89426
$$ 9549506 9089492 8639338 8183056 7685016 7195678 6682068 6421055 6264300 6074874
19610F074874k22648k95916l29947j54118r6583j32794k64092j88506k09921k06345
$$ 6074874 5852226 5556310 5226363 5072245 4975662 4842868 4578776 4390270 4180349 3974004
19600C974004k55696k73572j10527j00773n5502r9255o5176n5142k03647o4181
$$ 3974004 3718308 3444736 3334209 3233436 3177934 3078679 3013503 2958361 2754714 2690533
19590B690533M9298o8140j21964P575n9693m0630j5447N6789l3913j12917j30019
$$ 2690533 2739831 2671691 2549727 2557302 2497609 2456979 2441532 2498321 2464408 2351491 2221472
19579B221472l1906j6318j02906K0209K8005K7056p6395m7440j02753N9500J16441
$$ 2221472 2189566 2173248 2070342 2090551 2118556 2145612 2069217 2021777 1919024 1978524 2094965
19568B094965o9970j09811n7856M5038J26954J52256Q3138O5430j5590N108Q2865
$$ 2094965 2024995 1915184 1857328 1902366 2029320 2181576 2264714 2330144 2314554 2319662 2402527
19557B402527J43225J04609N1756O489J57657K20015J65890K77951K46573J95650
$$ 2402527 2545752 2650361 2702117 2708606 2866263 3086278 3252168 3530119 3776692 3972342
19547C972342K91311L69748M64293O23201L69175L79117O68191P37071Q48948
$$ 3972342 4263653 4633401 5097694 5720895 6090070 6469187 7137378 7874449 8723397
19538H723397J109167J406601J674504J529302J570668K048292K758371L413455
$$ 8723397 9832564 11239165 12913669 14442971 16013639 18061931 20820302 24233757
19530B4233757L389380L262618L741118N325518P355245Q559116Q244399P155162
$$ 24233757 27623137 30885755 34626873 39952391 47307636 55866752 64111151 71266313
19522G1266313P957775J0770617J3851982J2719032N787179J874320M118674O743564
$$ 71266313 79224088 89994705 103846687 116565719 122352898 124227218 128345892 135089456
19514A35089456N425487j286603p266023o861980m614583n102288p014065p751193
$$ 135089456 140514943 139228340 131962317 125100337 120485754 115383466 108369401 100618208
19506A00618208p405352p501103p607350o736609n113689l851641m506555n600967
$$ 100618208 93212856 85711753 78104403 71367794 66254105 62402464 57895909 52294942
19498E2294942n313997m214076l130740k650876k688265k433346k125848j471953
$$ 52294942 46980945 42766869 39636129 36985253 34296988 31863642 29737794 28265841
19490B8265841p60272k57025J00687M50465Q91304J533749J984798K674437L025479
$$ 28265841 27505569 27248544 27349231 27799696 28691000 30224749 32209547 34883984 37909463
19481C7909463L210367L341411M190022N361916O310381N940372M597404M989779
$$ 37909463 41119830 44461241 48651263 54013179 60323560 66263932 70861336 75851115
19473G5851115P100287R008463R280663Q661205R146132J0348305J0091477P692690
$$ 75851115 82951402 91959865 101240528 109901733 119047865 129396170 139487647 147180337
19465A47180337O813455R026491P493628K25611n306823o665406l751565k865472
$$ 147180337 153993792 163020283 170513911 170739522 165432699 158767293 155015728 152150256
19457A52150256r177908j4740697j4627259j1423890q254702q145600r789573
$$ 152150256 142972348 128231651 113604392 102180502 93925800 85780200 75990627
19450G5990627r649146p683970n587575m076971l837447m070239l625023k933394
$$ 75990627 66341481 58657511 53069936 48992965 45155518 41085279 37460256 34526862
19442C4526862k327637k144394k118880j965782j712924j308413j258454j161417
$$ 34526862 32199225 30054831 27935951 25970169 24257245 22948832 21690378 20528961
19434B0528961q87308n97087n98951o61940o04246m40923k93668m29648o66014
$$ 20528961 19641653 19044566 18445615 17783675 17179429 16738506 16444838 16015190 15349176
19425A5349176n24109n23279n97816o20218n61906n00764l95372m76257m12238
$$ 15349176 14825067 14301788 13703972 13083754 12521848 12021084 11625712 11149455 10737217
19416A0737217m40270m63917m20521l68078m93200m36559l80038l09505j94256
$$ 10737217 10296947 9833030 9412509 9044431 8551231 8114672 7734634 7425129 7230873
19407G230873k58280l14575k94613l30786m77838l92327k32190j46054j40192
$$ 7230873 6972593 6658018 6363405 6032619 5554781 5162454 4930264 4784210 4644018
19398D644018k04639p6979k00156p8414j19308j76835o3801j47702k21203p7975
$$ 4644018 4439379 4362400 4162244 4083830 3964522 3787687 3723886 3576184 3354981 3277006
19388C277006O337j1003q5148j49826j35056k09700j30032M2774p7986k86737
$$ 3277006 3283343 3272340 3187192 3037366 2902310 2692610 2562578 2605352 2527366 2240629
19378B240629r8377j5120N2032k4332q9540k5094Q6338N1036m1655j06480j8692
$$ 2240629 2142252 2127132 2179164 2154832 2065292 2040198 2126536 2177572 2135917 2029437 2010745
19367B010745j4727j31160j14549j29397j13817O0511N4155M4949M1026j9827
$$ 2010745 1996018 1864858 1750309 1620912 1507095 1567606 1621761 1666710 1707736 1687909
19357A687909J6703J00767Q1454p9633M3385J49028j49236l56180l22829k48628
$$ 1687909 1704612 1805379 1886833 1807200 1850585 1999613 1850377 1494197 1171368 922740
19347I22740p3608J00947o4470O0616Q7075M4328J554j9159o4664P1479k9033
$$ 922740 849132 950079 885609 946225 1033300 1077628 1079182 1060023 995359 1066838 1037805
19336A037805j19620K5077K0916J6550l6391o3552J9747p7168J03307Q7251j66014
$$ 1037805 918185 943262 964178 980728 944337 880785 900532 823364 926671 1013922 847908
19325H47908j09892k7533O8528P1829n4476j15232M2382J05128j8668j04467l3936
$$ 847908 738016 710483 779011 850840 796364 681132 723514 828642 809974 705507 671571
19314F71571R1568J0032j73139m1902K6949J61470n1777p8594o835m6944J3272
$$ 671571 763139 773171 600032 558130 585079 746549 694772 616178 609343 562399 575671
19303E75671Q9209R3901n4260r1989l9272M7139K72l0471j1863L1345M8140N2735
$$ 575671 664880 758781 704521 612532 573260 620399 620671 590200 578337 609682 657822 710557
19291G10557J6114K2902N04J5694o8779j0410l3080J6136M5375N2229j2336m3019
$$ 710557 726671 749573 750077 765771 696992 686582 653502 669638 715013 767242 754906 711887
19279G11887Q7712M2335P7904q2197j37328K4673n1762J28655Q329l5939q8030
$$ 711887 799599 841934 919838 837641 700313 724986 673224 801879 810208 774269 686239
19268F86239j4033M459j54752o5867J17490J24726L8431o5837k2695P1779r4831
$$ 686239 672206 676665 521913 456046 573536 698262 736693 670856 648161 719940 625109
19257F25109j23961Q5564J26856o4529m6341l0026q5591M7402r8441r0463O337
$$ 625109 501148 586712 713568 649039 602698 572672 487081 534483 436042 345579 351916
19246C51916j12441M0895O8966O7349M3895J20777J07872O7694K829n8137r5825
$$ 351916 239475 280370 349336 416685 460580 581357 689229 756923 759752 701615 605790
19235F05790j1006j07580J0246K5390J17480J13799K9193o9964l5059O9288r5314
$$ 605790 594784 487204 497450 522840 640320 754119 783312 713348 678289 747577 652263
19224F52263j56432n9957M7484M1578M8350j36733o4685p3358Q6330J9733l3378
$$ 652263 495831 435874 483358 524936 573286 436553 371868 298510 384840 404573 371195
19213C71195k8823R6303J17093n1741j20677j33872L7804J86242k5721j18671
$$ 371195 342372 438675 555768 504027 383350 249478 287282 473524 447803 329132
19203C29132K424q3565m885N9376p5281p177O5880m9898p0171K7391L4736K9441
$$ 329132 331556 247991 243106 302482 227201 220024 285904 236006 165835 193226 227962 257403
19191B57403j5878j12176n0185M9233r1971o857J46894K00407l8691j47170J07444
$$ 257403 241525 129349 79164 128397 36426 29569 176463 376870 338179 191009 298453
19180B98453J01675j8321l0942K5592L6475N1372n3878M1095O7372L4991L529
$$ 298453 400128 381807 350865 376457 412932 464304 410426 451521 518893 553884 557413
19169E57413k7024m0959J455j16776o2469N5838M7503M0467l8461m193m1963l9576
$$ 557413 530389 489430 490885 374109 311640 367478 414981 455448 416987 412794 370831 331255
19157C31255k5888M8884M7986J5172l316J1043n8942n5454o8406n4182j36297
$$ 331255 305367 354251 402237 417409 414093 425136 366194 310740 242334 188152 51855
19146E1855j40987n4961M7990N0715l4437P3768j4611n4784j69728o5547M0335
$$ 51855 -89132 -144093 -96103 -45388 -79825 -6057 -20668 -75452 -245180 -310727 -270392
19135b70392M4234O3755J01614m5166r4555K8829N9787J22055n1047Q7860J2194
$$ -270392 -226158 -162403 -60789 -105955 -200510 -171681 -111894 10161 -40886 46974 59168
19124E9168K2751k0940K6930J3084J76325M400q6931o5361j3165L0477N0468O8758
$$ 59168 81919 60979 87909 100993 277318 281718 194787 129426 116261 146738 197206 265964
19112B65964M6623r6663J9627N1819N4047j2665n4859p5823m7913m530j08422
$$ 265964 312587 215924 235551 287370 341417 328752 273893 198070 150157 145627 37205
19101C7205k0581l9471L9824P7762K1397j10887l5310M0114M5545O1694O2219
$$ 37205 16624 -22847 16977 94739 116136 5249 -30061 10053 55598 117292 179511
19090A79511o6009M595n5487j12953P4030R3249k9306m5506N4792Q007j7038P0113
$$ 179511 113502 118097 62610 -50343 23687 116936 87630 42124 96916 104923 87885 157998
19078A57998P5135l7162o7865j7463r6105p0746q5231J47531K42026n3409r3008
$$ 157998 233133 195971 128106 110643 14538 -56208 -141439 6092 248118 194709 101701
19067A01701K3535o4683N133J18079p1456m5516Q7549J48645O7501R1976J43738
$$ 101701 125236 60553 65686 183765 112309 66793 154342 302987 370488 462464 606202
19056F06202N1088J68601K49425K94070L84201K25700j21951l73834l75043k35405
$$ 606202 657290 825891 1075316 1369386 1753587 1979287 1857336 1483502 1108459 873054
19046H73054j63541m7902p4644j33963j21429l4377J0398P1328k5373K4487K7878
$$ 873054 709513 661611 586967 453004 331575 297198 307596 378924 353551 378038 405916
19035D05916m6885k3587J3544l605N0992J2303L1193K6367P0292j2665k442j09696
$$ 405916 359031 335444 348988 345383 396375 408678 439871 466238 536530 523865 521423 411727
19023D11727o151O0061l4034m7106l8738K8990J33560P8298J09167J196k4689
$$ 411727 405576 465637 431603 384497 345759 374749 508309 586607 695774 696970 672281
19012F72281K6115j05387J6889M5056n2998J4931O3415l595l93O9901K7166J393
$$ 672281 698396 593009 609898 654954 601956 616887 680302 676707 676314 746215 773381 774774
19000G74774L8238j9203j4553L1496L0869L2463k3225k9383M5425m5974L2932
$$ 774774 813012 793809 779256 810752 841621 874084 850859 821476 866901 820927 853859
18989H53859Q5873j32627J685n6423j6453J01623J14583J03912k8075Q343K1491
$$ 853859 939732 807105 808790 752367 735914 837537 952120 1056032 1027957 1036300 1057791
18978A057791m4067l8418K155J98167K1108l8283K3874N2153O0967m3702l8178
$$ 1057791 1013724 975306 977461 1175628 1196736 1158453 1182327 1234480 1295447 1251745 1213567
18967A213567N0972K17004J48253Q7495n10Q3935K25287O5244Q8591J31392N5693
$$ 1213567 1264539 1481543 1629796 1717291 1716781 1800716 2026003 2091247 2179838 2311230 2366923
18956B366923Q6093J27320O8548N3816P7414R3673R5127J06354J60979J02503
$$ 2366923 2453016 2580336 2648884 2702700 2780114 2873787 2968914 3075268 3236247 3338750
18946C338750K20924J26408K46149L22345K05034L28929K24509J95437L96556
$$ 3338750 3559674 3686082 3932231 4254576 4459610 4788539 5013048 5208485 5605041
18937E605041N37519N67712M60309N91692Q33015Q87716R87328J285523J780436
$$ 5605041 6142560 6710272 7170581 7762273 8595288 9483004 10470332 11755855 13536291
18928A3536291K257225K283886K498489K976996L737672M375740M274956M194844
$$ 13536291 15793516 18077402 20575891 23552887 27290559 31666299 35941255 40136099
18920D0136099N363550P437371R495747J0917487J1317203J0698883J2284538
$$ 40136099 45499649 52937020 62432767 73350254 84667457 95366340 107650878
18913A07650878J6306011J8301902J2482346M616357N251219Q116845M398907
$$ 107650878 123956889 142258791 154741137 159357494 164608713 172725558 177124465
18906A77124465n246387j0133577p943357p703365j1168306j2572925j0704728
$$ 177124465 171878078 161744501 153801144 146097779 134929473 122356548 111651820
18899A11651820p679739p306763q498356p650487n316836m107849m962913o036081
$$ 111651820 103972081 96665318 88166962 80516475 75199639 71091790 66128877 60092796
18891F0092796n823113m994628m356253m099065l477568k930682k304111j675883
$$ 60092796 54269683 49275055 44918802 40819737 37342169 34411487 32107376 30431493
18883C0431493j180724p04057l12576m7926L68803Q20496J263724J685619K339963
$$ 30431493 29250769 28546712 28234136 28186210 28555013 29375509 30639233 32324852 34664815
18874C4664815L070684L532727L381577M088424N203476O146414N103652M030981
$$ 34664815 37735499 41268226 44649803 48738227 53941703 60088117 65191769 69222750
18866F9222750N109817P241801P792299O424119P161507R804609J0548228O958324
$$ 69222750 74332567 81574368 89366667 95790786 102952293 112756902 123305130 130263454
18858A30263454M691887P635134R780990L125657n911057p065454l520189m087648
$$ 130263454 134955341 142590475 152371465 155497122 149586065 142520611 139000422 134912774
18850A34912774j1301242j4472441j2840272j0456036r223272q625522p767934
$$ 134912774 123611532 109139091 96298819 85842783 76619511 67993989 60226055
18843F0226055o849076n496652m035394k974136l038204l173451k854898k473906
$$ 60226055 53376979 47880327 43844933 40870797 37832593 34659142 31804244 29330338
18835B9330338k167189k078804j835507j561543j310326j059948r02897q87418
$$ 29330338 27163149 25084345 23248838 21687295 20376969 19317021 18414124 17526706
18827A7526706p14025o15982o71484o50284o40097m83065l79812m22412n08449
$$ 17526706 16812681 16196699 15525215 14874931 14234834 13751769 13371957 12949545 12441096
18818A2441096m25362l35412m32329n41176m24396m35041m58198m10748l87046
$$ 12441096 12015734 11680322 11247993 10706817 10282421 9847380 9389182 8978434 8591388
18809H591388m55945m83558j77510l28694m04270l00302k70181l52594l44307
$$ 8591388 8135443 7651885 7474375 7145681 6741411 6441109 6170928 5818334 5474027
18800E474027k23916j68333j23485k21175k06491k75753k26459j53217n7101q6974
$$ 5474027 5250111 5081778 4958293 4737118 4530627 4254874 4028415 3875198 3818097 3731123
18790C731123k35784j49715n2098n3844q7616k008j77268j54738j69769j58938
$$ 3731123 3495339 3345624 3293526 3239682 3152066 3150058 2972790 2818052 2648283 2489345
18780B489345k6320o7488j36048q1772j9892j4227m5698o7751j46251m3525O3075
$$ 2489345 2463025 2395537 2259489 2177717 2157825 2143598 2097900 2030149 1883898 1840373 1903448
18769A903448P7120M3701J52318L10507J09619k45647k95720k80319k69619j88041
$$ 1903448 1980568 2024269 2176587 2487094 2596713 2351066 2055346 1775027 1505408 1317367
18759A317367p3983k9851M1017r268l8057j8233k0571j58002j17141Q6735j6685
$$ 1317367 1243384 1213533 1254550 1245282 1207225 1188992 1168421 1010419 893278 980013 963328
18748I63328q8583o8156j6919O6541J75720P6936q3057j7528J49905N7823M7649
$$ 963328 874745 806589 789670 856211 1031931 1108867 1025810 1008282 1158187 1216010 1263659
18737A263659o2020k34574o4347M7391J01713P5561m7764k232N1735l1912q9904
$$ 1263659 1201639 967065 902718 950109 1051822 1127383 1079619 1077387 1129122 1097210 1007306
18726A007306o6206j6473p2071J9681p5091k4374o244j03352q3738O5368J07707
$$ 1007306 941100 924627 852556 872237 797146 772772 766528 663176 579438 644806 752513
18715G52513j3982K6368P8805J13046J200r8891j64429m7965j20256l1298l2481
$$ 752513 738531 764899 843704 956750 957950 859059 694630 646665 526409 495111 462630
18704D62630j8090M1928L2893M0772p9642K5492K4811j2048j82955O2288O9445
$$ 462630 444540 486468 519361 560133 480491 505983 530794 518746 335791 398079 467524
18693D67524M9791J1208L2792J4045L8925L9754m0523J59695P7929q7050J3870
$$ 467524 517315 528523 561315 575360 614285 654039 613516 773211 851140 764090 777960
18682G77960O7249n2208P1229P0705j62818j66194o0210J0945q3544q6170K9451
$$ 777960 845209 793001 864230 934935 772117 605923 545713 556658 473114 386944 416395
18671D16395J42825j949l7033N1732P403r9967k1188N9822o4432j9702N9407L2061
$$ 416395 559220 557271 520238 571970 579373 479406 458218 518040 453608 433906 493313 525374
18659E25374J42491O8053m5975j73989j6369Q9388Q7116n2396j55225j43116J4605
$$ 525374 667865 735918 689943 515954 499585 588973 676089 623693 468468 325352 339957
18648C39957k334M3150L9948N7835J6002l6041M0339o435r6718l2626P822q3554
$$ 339957 337623 380773 420721 478556 494558 458517 498856 492421 395703 363077 370899 287345
18636B87345J08611N2536j25615l8981K3237j348J28635J54969q191j51043j08551
$$ 287345 395956 448492 322877 283896 307133 305785 434420 589389 581198 430155 321604
18625C21604j50850L6579O5021R4889J03593l8608j0820k2356m60J4278q357N67
$$ 321604 170754 207333 272354 367243 470836 432228 421408 399052 398592 412870 404513 405080
18613D05080L477j698j6735J27301J14125J20297r8088p1293r8106q7950l241
$$ 405080 408557 406859 390124 517425 631550 751847 653759 582466 484360 396410 393169
18602C93169k4731J9252J45798q4542j69171O5935K477n2321K0158Q8927j64213
$$ 393169 368438 387690 533488 448946 279775 345710 348187 295866 316024 404951 240738
18591B40738j75657l102J9718k6165N9021L360j59960j02177l1262J46786O6530
$$ 240738 65081 61979 81697 55532 114553 117913 -42047 -144224 -175486 -28700 37830
18580C7830M1170n1513R5588J28315N4825n3322q5499l7391k7649J53386P0423
$$ 37830 79000 27487 123075 251390 306215 252893 167394 130003 102354 255740 326163
18569C26163k8815j28355k7045J04485k7178k7547l074O1316Q5158Q0500l9669
$$ 326163 297348 168993 141948 246433 219255 191708 188634 249950 335108 415608 375939
18558C75939n7264q0641r7815J2559R7873M7079k2820n7651p325J28032J1351
$$ 375939 318675 238034 140219 152778 250651 297730 274910 217259 209934 337966 349317
18547C49317r1146n7385n936Q3432q0410p0837r0501j7101J0557K4965o5390K625
$$ 349317 258171 200786 194850 278282 197872 127035 36534 19433 29990 54955 -10435 -7810
18535g810M1412p7782o4661M1680q6002k0691k4997L3146P8285O7923j14822o0671
$$ -7810 33602 -44180 -108841 -67161 -153163 -173854 -198851 -165705 -87420 -19497 -134319 -194990
18523a94990M3924J12943O2440O371O4823Q8988L129n4776Q7772j1489K4756l0196
$$ -194990 -151066 -38123 24317 30688 95511 184499 187628 132852 220624 209135 233891 203695
18511B03695K0687J2985n6334o5408M8773L9100j08795n2278P4347m1529r9697
$$ 203695 224382 237367 181033 115625 164398 203498 94703 42425 116772 75243 -24454
18500b4454q0531j3652J05818L5754J00950O37j09122k2413m6132n1859K7542
$$ -24454 -104985 -118637 -12819 22935 123885 124522 15400 -7013 -53145 -105004 -77462
18489g7462K33528M8492q8926l9900l5760r8793J7898J26294J84j29298K4334
$$ -77462 156066 204558 115632 75732 39972 -58821 -40923 85371 85555 -43743 -19409
18478a9409L6706J4309m8333j69606J4787K47883N0659n4175o3677r472M8932
$$ -19409 17297 31606 -16727 -186333 -171546 76337 126996 72821 9144 -328 48604
18467D8604P9544j7654j23294j8672M0798J2891l3463M9767j442J4678j7874n3623
$$ 48604 128148 110494 -12800 -31472 9326 22217 -11246 38521 37079 51757 33883 -19740
18455a9740j12110M2627K2380k6521R88J8180J20818n940q7054M4712J21194k3687
$$ -19740 -131850 -89223 -66843 -93364 -92376 -74196 46622 40682 -46372 -1660 119534 95847
18443I5847m1091r5581N3502o921k0227K9059j20795P8412N9219M8856j3080m1610
$$ 95847 54756 -40825 12677 5756 -14471 14588 -106207 -27795 31424 80280 67200 25590
18431B5590J26297Q1377k1584m0871q5183L340N2210M4752k2315j1926J62113
$$ 25590 151887 233264 211680 170809 85626 88966 141176 185928 163613 151687 313800
18420C13800L9705j21958k81712k06787m6624N748j2924J0297J73806L3918k3753
$$ 313800 353505 231547 -50165 -256952 -303576 -297828 -310752 -300455 -126649 -92731 -116484
18409a16484l5812j7136M1826P8954J19689N1588L7485Q9519J61542M3165K9240
$$ -116484 -152296 -169432 -127606 -48652 71037 122625 160110 249629 411171 454336 483576
18398D83576P163o9084n730k5948M8R7429j04053m103M63J02445J3847k7940N6050
$$ 483576 490739 421655 415925 389977 390025 487454 383401 379298 379761 482206 496053 468113 524163
18385E24163N3454J34025R6810P2507j14564p0081L5753P0060k1225j51380j77238
$$ 524163 577617 711642 808452 880959 766395 696314 732067 802127 780902 629522 452284
18374D52284P2134J35998n0744k35766j80602J11241K8228n588P3436l0755j35281
$$ 452284 524418 660416 609672 373906 193304 304545 332773 327185 400621 369866 234585
18363B34585p9159R7659J7706P991k0825l790l2746k0123o202k5986l3319Q8763
$$ 234585 155426 253085 270791 278782 257957 254167 221421 201298 195096 169110 135791 224554
18351B24554p5179o792N8954J7920K16717K6278J9128l7747j43192J7093J05306
$$ 224554 149375 142583 201537 219457 436174 462452 481580 443833 300641 317734 423040
18340D23040L7167N6338J08938J03479J9258l0461o3745J1180k654j0504o3571
$$ 423040 460207 516545 625483 728962 748220 717759 654014 665194 662540 652036 588465
18329E88465k61969j3495K28717K41308Q192k05070j2581l4687k86955n2144k6281
$$ 588465 326496 313001 541718 783026 791218 586148 573567 538880 251925 199781 173500
18318A73500O7946J02840l0838j07735o2470m0882N5517R9202j41704n6531J31769
$$ 173500 241446 344286 313448 205713 143243 102361 157878 257080 115376 58845 190614
18307A90614l847n2543R043O2957J17076j6200n6196k8723l6964p3941o7906J5289
$$ 190614 186767 134224 143267 206224 323300 307100 250904 222181 185217 111276 43370 58659
18295E8659K3209k2016J9980o8469o1462K1605N4470J506R829l1709j00601j9612
$$ 58659 81868 59852 79832 11363 -50099 -28494 25976 27482 37311 5602 -94999 -114611
18283a14611L468P8989J7532j6748j11476l1408J12444K4677O3052N764J53912
$$ -114611 -111143 -32154 -14622 -31370 -142846 -174254 -61810 -37133 25919 31683 185595
18272A85595R8607l8317j27133j34827J11752O4042j31074p4888j3060j3090j12378
$$ 185595 284202 245885 118752 -16075 95677 159719 28645 -46243 -59303 -72393 -184771
18261a84771k0997J22622j4729Q808J9662K4817P2276l0549K9624K5324m3725
$$ -184771 -205768 -83146 -97875 -89067 -69405 -44588 27688 -2861 26763 52087 8362
18250H362q7437n9514l3616N9407j17467m494K13105O8526K8730n7600J61687
$$ 8362 -79075 -138589 -172205 -112798 -230265 -234759 -21654 46872 75602 18002 179689
18239A79689R702j25390q2817R5576P4483j86201j84812R5579N1951N0617J53075
$$ 179689 189391 64001 -18816 76760 151243 -34958 -219770 -124191 -72240 -21623 131452
18228A31452L6877o721J2492n1904J9803K0515P009l6527p0034N9982n1342k2047
$$ 131452 168329 161608 174100 122196 141999 162514 169523 132996 62962 122944 71602 49555
18216D9555K3397M0501J31421K6547m1819k1539j07244j22324o9820J0610N4590
$$ 49555 72952 113453 244874 271421 229602 208063 100819 -21505 -91325 -80715 -26125
18205b6125J51156N4016k8942j27338m4276m216j00432n0252N7612J32889Q9737
$$ -26125 125031 179047 150105 22767 -21509 -25725 -126157 -176409 -118797 14092 103829
18194A03829J91090L391R00O8580J04881o4280j9352K8367q1167j21999p4836
$$ 103829 294919 298310 299210 367790 472671 408391 389039 417406 336239 214240 139404
18183A39404K4234J2180K2623N3271P5923J5450q4195o1103r8974j8257J02911
$$ 139404 163638 175818 198441 251712 327635 343085 258890 197787 98813 80556 183467
18172A83467K44903J01356k8640j41663j42452p2136J98395Q3179J5966l52l6164
$$ 183467 428370 529726 501086 359423 216971 144835 343230 426409 442375 442023 405859
18161D05859j5246L616l6542J5165R1201R3364J06287o4536n9439Q0031P4623
$$ 405859 390613 394229 357687 372852 464053 557417 663704 599168 539729 619760 694383
18150F94383M5241J3522P1137P1230N3281M4360j07000j17670m1048N6956N7880
$$ 694383 739624 753146 824283 895513 948794 993154 886154 768484 727436 784392 842272
18139H42272R5535J31631k1403M4514J21746O2616J24136J96645J45147j2530
$$ 842272 937807 1069438 1048035 1092549 1214295 1276911 1401047 1597692 1742839 1730309
18129A730309J69287L32092L59725K04904K57753L15461M87605O68218R60963
$$ 1730309 1899596 2231688 2591413 2796317 3054070 3369531 3857136 4525354 5486317
18120E486317J240122J542856K045931K893056L928394N230960O571523Q189183
$$ 5486317 6726439 8269295 10315226 13208282 17136676 22367636 28939159 37128342
18112C7128342R622690J2132639J7967624K9166975M6060340L6721410k4228089
$$ 37128342 46751032 58883671 76851295 106018270 152078610 188800020 164571931
18105A64571931m2799213l4374689k4342630j5829491j0674448p206565n012929
$$ 164571931 121772718 87398029 63055399 47225908 36551460 29344895 24331966
18098B4331966l711431k831780k073944j634505j149723q77511r93098r17529
$$ 24331966 20620535 17788755 15714811 14080306 12930583 12053072 11059974 10142445
18090A0142445o31828m66897n45468m64415m31452l73848m91529k82567j13037
$$ 10142445 9510617 9043720 8498252 8033837 7602385 7228537 6737008 6454441 6341404
18081F341404n4902m1792j39943k14788L1767K3391k000M6075J11707j0163l02928
$$ 6341404 6286502 6244710 6104767 5889979 5921746 5945137 5943137 5989212 6100919 6090756 5787828
18070E787828k33662k25279k21675l46275l29903k98718k45495k48010k79424
$$ 5787828 5554166 5328887 5107212 4760937 4431034 4132316 3886821 3638811 3359387
18061C359387j72769j62257j84615j52986p6377k6502j83226k50892j01778j10135
$$ 3359387 3186618 3024361 2839746 2686760 2610383 2583881 2400655 2149763 2047985 1937850
18051A937850K268m4394r9873k3694r7309j61517q8585j40207j33738N7793m2642
$$ 1937850 1940118 1895724 1795851 1772157 1674848 1513331 1424746 1284539 1150801 1208594 1165952
18040A165952m6232o8076M0711q7015l7888k3297r7668l4349Q0938k355j13658
$$ 1165952 1119720 1051644 1092355 1005340 967452 944155 846487 812138 893076 890721 777063
18029G77063j12785o2654L4837j09484o7402N632O0289N6804p1632j13248L8762
$$ 777063 664278 601624 636461 526977 459575 465207 525496 582300 510668 397420 436182
18018D36182k9105j7238J16072j6717j71242K0709J6332p2250r2255k0996K0849
$$ 436182 407077 389839 505911 489194 317952 338661 354993 282743 190488 169492 190341
18007A90341J3593l4807j04835O8174Q2734Q076K9355K4979L754Q7088K6781n5426
$$ 190341 203934 169127 64292 132466 215200 223276 252631 277610 281364 368452 395233 339807
17995C39807j5816k8269k1805p0065K4876J27876L806Q4488J8664l8937N2556
$$ 339807 323991 295722 273917 203852 228728 356604 360410 444898 463562 424625 477181
17984D77181k4262o0375K7936j1949n4779j23979j21016j21179O0563P2354N9892
$$ 477181 452919 392544 420480 408531 353752 229773 108757 -12422 48141 120495 180387
17973A80387R4883J14096j69999r3659l0322K8064M7742L3750K2897L3169j91151
$$ 180387 275270 389366 219367 125708 95386 123450 171192 204942 227839 261008 69857
17962F9857j1200J23303Q1699L590j72538q8438J4245P8984m377K7803l1233j18830
$$ 69857 58657 181960 263659 267249 94711 6273 20518 99502 95125 122928 91695 -27135
17950b7135O5046J74198J6737o4534m2102l4056J0938j20629J46522J44402l4341
$$ -27135 37911 212109 228846 164312 122210 88154 99092 -21537 124985 269387 235046
17939B35046J904J248J2921n8970j5508O6886J5090M3248p6078n2660R2276m2334
$$ 235046 236950 238198 251119 192149 176641 243527 258617 301865 225787 173127 265403 223069
17927B23069j28412L6623N6126m6951n2661Q0934M4142N3038q008k8520l7902
$$ 223069 94657 131280 187406 140455 87794 168728 212870 265908 257900 229380 191478
17916A91478r066O7706K2294K4951k0356J2415J04074J0457m9962j15148r6262
$$ 191478 182412 250118 272412 297363 277007 289422 393496 403953 353991 238843 142581
17905A42581J8366R927K356O2398k9051j58172K7079O9077Q324L0861j13348o7598
$$ 142581 160947 170874 173230 235628 206577 48405 75484 144561 152885 183746 70398 2800
17893B800n9059M5877K31077J45948N9478P998j28081j51225j54782J5914k120
$$ 2800 -56259 -10382 220695 366643 426121 434119 306038 154813 31 15945 13825
17882A3825J9622O0264L8007n4996l4462m4668l9910L6848Q6880Q7544K4496K3579
$$ 13825 33447 93711 131718 76722 42260 -2408 -42318 -5470 81410 168954 193450 217029
17870B17029Q8012M2620q0180m0936n4554l0468O454K8704l8535k2386K6740J4371
$$ 217029 305041 347661 267481 226545 171991 141523 147977 176681 138146 115760 142500 156871
17858A56871n4060m8085o818Q2636k3955p6469o2062J03240R4870j03635q645
$$ 156871 102811 54726 47908 130544 106589 30120 -31942 71298 166168 62533 53888
17847E3888n4115r9070O7249M2510l6090J29550K5423n2360k0825q6572J1408
$$ 53888 -227 -99297 -32048 10462 -25628 103922 129345 76985 56160 -30412 -19004
17836a9004O9082P6014m3708k6044N6192P2262q7961L1089L8568j4846j11339
$$ -19004 50078 126092 82384 56340 112532 184794 96833 127922 166490 151644 40305
17825D0305k0409K2290K3343n2707o9738J5884l1453P8341n105l9906k6225P8742
$$ 40305 19896 42186 65529 12822 -56916 -41032 -72485 5856 751 -39155 -65380 13362
17813A3362J54497o8727j77250r8794J3586L8121J00219R8178m5668j11488P0823
$$ 13362 167859 99132 -78118 -176912 -163326 -125205 -24986 73192 27524 -83964 -13141
17802a3141J76244m5109L3882j2088J0521m8954q3194j62413r7963R3469j6337
$$ -13141 163103 117994 151876 139788 150309 101355 18161 -144252 -242215 -148746 -165083
17791a65083N7012O1887J72002J14569j26503j26633p2984L9983Q2644j4007j095
$$ -165083 -108071 -46184 125818 240387 113884 -12749 -85733 -45750 36894 22887 21792
17780B1792n9973q3181J8860L3289M6180p421J5555j659M3065K9162l8856l4747
$$ 21792 -38181 -121362 -102502 -69213 -23033 -30454 -14899 -16558 26507 55669 16813 -17934
17768a7934K9761m3176n8708O8242m7317R0470Q0992o7261r2240N89N64m0002
$$ -17934 11827 -31349 -90057 -21815 -69132 21338 102330 35069 -57171 -56582 -56018 -96020
17756i6020j8643J5511o1379M6448M2592L0273m5445q8629P0419N269Q3357Q92
$$ -96020 -114663 -99152 -160531 -114083 -71491 -41218 -86663 -175292 -104873 -99604 -16247 -15355
17744a5355j93049k1473K08497J4123J2671M2485m3427n3575j06057Q1195j9526
$$ -15355 -208404 -229877 -21380 -7257 5414 47899 4472 -49103 -155160 -73965 -93491
17733i3491K95L3438P2448l8017J3816j20777q7898O5467R5721q838r5899N5412
$$ -93491 -93196 -59758 12690 -25327 -11511 -132288 -220186 -154719 -58998 -67836 -163735 -108323
17721a08323M4063L8455J01844L4744j42253k4554m0303n6937O8092P9710r39
$$ -108323 -64260 -25805 76039 110783 -31470 -56024 -96327 -153264 -85172 -5462 -6401
17710f401m5545n1200O1237Q7182q1165n3211J12582l8918q3668o0389P8684k7741
$$ -6401 -51946 -103146 -41909 45273 -35892 -89103 23479 -15439 -99107 -159496 -80812 -108553
17698a08553q173L3741R1002q817Q0805m4187j04224l6027P9317J0653N614O3657
$$ -108553 -116726 -82985 8017 -800 80005 35818 -68406 -104433 -25116 -14463 -8849 54808
17686E4808L855l3098p1877j33844O8741K11867M2436Q693l9971j11293N1860
$$ 54808 58663 25565 -46312 -180156 -111415 100452 142888 151581 111610 317 52177
17675E2177J12761o971K576M5238R423j20553p4827m8111j021p2369n8009l8680
$$ 52177 164938 157967 160543 205781 215204 94651 19824 -28287 -29308 -101677 -159686 -198366
17663a98366O9210J54666M1865l8426R0272l6139k9096J15716o1336k0828P902
$$ -198366 -129156 25510 67375 28949 119221 83082 53986 169702 108366 87538 95440
17652I5440j53818q7617p071P7778n4538j1943L9502N3633Q6756J75624L3517
$$ 95440 -58378 -145995 -153066 -75288 -129826 -141769 -102267 -48634 38122 213746 247263
17641B47263m6161q4259j18501J04271O0087j66059r3818k0751L024J04595n6069
$$ 247263 201102 116843 -1658 102613 162700 -3359 -97177 -117928 -114904 -10309 -66378
17630f6378k2975n000l1153k3489k4263P5095J14520J26823O2020r7243m5297
$$ -66378 -89353 -94353 -125506 -148995 -173258 -98163 16357 143180 205200 107957 62660
17619F2660J9146J3382j13746n46J3193o969N0379p8770q2126J01379J37065P5
$$ 62660 81806 95188 -18558 -19104 -5911 -12880 37499 -41271 -123397 -22018 115047 115122
17607A15122L4307q9259N2488j1263l9402j0141j33856j2687O4201j257j9377
$$ 115122 149429 60170 112658 101395 61993 51852 -82004 -94691 -30490 -31747 -51124
17596e1124l6679p9130J49J00074J35293L7775l3414J3560K9623r19l9771o7710
$$ -51124 -87803 -166933 -166784 -66710 68583 106358 72944 86504 116127 115208 75437 7727
17584G727j09867M8899O8995l4261j9813k0510J6308M4075p936n0503l0812L3714
$$ 7727 -102140 -53241 15754 -18507 -38320 -58830 -42522 1553 -6383 -56886 -87698 -53984
17572e3984M9523N8365L6061q4720k18579R7132J34010r8755q3279O0717M2375
$$ -53984 -4461 53904 89965 5245 -213334 -116202 17808 -80947 -164226 -103509 -61134
17561f1134K6834o703J3457N9299M256J33945O3237l9905j58823j59469j5884
$$ -61134 -34300 -41003 -27546 31753 36009 169954 233191 193286 34463 -125006 -140890
17550a40890k707n8499j7948l7965P445J24085j6917L5597R3324j8820j18881
$$ -140890 -143597 -202096 -220044 -258009 -250564 -126479 -143396 -107799 -14475 -33295 -152176
17539a52176j0432M1180N1826M6415m9247L022N0824p7523j1878M6819n5236o2178
$$ -152176 -162608 -121428 -69602 -23187 -72434 -69412 -18588 -96111 -107989 -61170 -116406 -178584
17527a78584O0318N6514j5312N4114J24651j7714j21523l669k4012O9705J10135
$$ -178584 -118266 -61752 -77064 -22950 101701 83987 -37536 -41205 -65217 4488 114623
17516A14623j8539k38742j00101O5772R7631J43589o6802J0785j8807j08016L646
$$ 114623 96084 -142658 -242759 -176987 -79356 64233 -2569 8216 -10591 -118607 -114961
17505a14961l9502L7896P6043J08747J07522j201k2507m9797n1733j32795R782
$$ -114961 -154463 -116567 -40524 68223 175745 174544 152037 102240 50507 -82288 -72506
17494g2506l4217p7613n43j5215M8708R7198J46157J0840r8161L6316J0028J9453
$$ -72506 -106723 -184336 -184879 -200094 -151386 -54188 91969 102809 4648 40964 50992 70445
17482G0445M2473o7942l0411J41855R2507Q2864p7006n6810j37506j03720j6812
$$ 70445 112918 44976 14565 156420 248927 331791 254785 197975 60469 -43251 -60063
17471f0063p4338j33570K0084Q0337k1011K2037L2077n3304k5468J05694k7567
$$ -60063 -134401 -267971 -247887 -167550 -188561 -166524 -134447 -187751 -213219 -107525 -135092
17460a35092j564n6644J931Q6778L7203m1257K0787J53630J09969j1563j05513
$$ -135092 -136656 -193300 -191369 -104591 -67388 -108645 -87858 65772 175741 164178 58665
17449E8665r6969M7018J10863L2963R5107J57731J60626K29763J17182j68660
$$ 58665 -38304 8714 119577 152540 247647 405378 566004 795767 912949 744289
17439G44289j01770o7714q0067n6504K5217L8932j71528p9002K7103j4736p0690
$$ 744289 642519 574805 494738 438234 463451 502383 330855 251853 278956 264220 193530
17428A93530o886N5896p0684L42J0008M4362o9322j8559Q986R7896l5900r3530
$$ 193530 186644 242540 171856 172198 182206 226568 157246 138687 147673 245569 209669 116139
17416A16139n3146n9026P5716j0254q0243r1730j3350N7946R0351n6607p867L3382
$$ 116139 62993 3967 79683 69429 -10814 -102544 -115894 -57948 32403 -24204 -32071 1311
17404A311j21019j3895M4967J7022r183p987q7441N4246O8418J57230L7496j5135
$$ 1311 -119708 -133603 -88636 -71614 -80797 -88784 -176225 -121979 -53561 103669 141165 126030
17392A26030R9282n5411l1870m2766j7040r2943j35220L8890J26059r839j03888
$$ 126030 225312 169901 138031 95265 78225 -14718 -149938 -111048 15011 5172 -98716
17381i8716J0414K6981l2646N1548L7768j2605q7923j8030k9783p4497O2046J26977
$$ -98716 -88302 -61321 -93967 -42419 -4651 -17256 -105179 -123209 -152992 -227489 -165443 -38466
17369c8466J19251J6572P1638L3849l6632j43719j48376M0622j9238l502P1095
$$ -38466 80785 97357 168995 202844 166212 22493 -125883 -85261 -104499 -108001 -36906
17358c6906M3875q7809J7220j5668k2242j17554m1553Q7743J90046K4133q9230
$$ -36906 6969 -80840 -63620 -79288 -101530 -219084 -260637 -172894 17152 41285 -47945
17347d7945l8972K9387L2956N2558N8044k4636j17832k5603O4518J57822l2211
$$ -47945 -86917 -57530 -24574 27984 86028 61392 -56440 -82043 -17525 140297 108086
17336A08086j07559j1811m9026P4209o6555r3575J4046p7330r3666L7942J51536
$$ 108086 527 -11284 -60310 13899 -52656 -146231 -132185 -209515 -303181 -265239 -113703
17325a13703n1035J27857J07863O1862L6196m0801O8208j15376j38762n2554j22995
$$ -113703 -164738 -36881 70982 132844 169040 128239 196447 81071 -57691 -110245 -233240
17314b33240l165M5332K5356L3849J4123M9719J3247J20211Q1020K3254l1558
$$ -233240 -236405 -191073 -165717 -131868 -117745 -68026 -54779 65432 146452 169706 138148
17303A38148j13458R7483n1545j07778K4745K990R4903P7997p2060l7089J1261
$$ 138148 24690 122173 70628 -37150 -12405 -9415 85488 163485 91425 54336 65597
17292F5597R968l7661Q150j59231M0696J45232K0001j8126L3941j5835N8194R0476
$$ 65597 75565 37904 46054 -113177 -72481 72751 92752 74626 108567 92732 150926 241402
17280B41402p0477n5710q0472j73672N7755j9507R0915M509q4623K1363p0999
$$ 241402 170925 115215 34743 -138929 -81174 -100681 -9766 -5257 -89880 -68517 -139516
17269a39516J6122P8743m2501j7919o3841L9578J9341o7061P3308O3774r896j592
$$ -139516 -123394 -44651 -87152 -105071 -168912 -129334 -109993 -177054 -103746 -39972 -49868 -51460
17257e1460J09166j5162l4703j6946L9505p6041k3723K2083N2164j6367l4856
$$ -51460 57706 42544 7841 -9105 30400 -45641 -69364 -47281 4883 -11484 -46340
17246d6340K4104L815k5246j3950p592l2652L0244J14118J9046j23794j42361
$$ -46340 -22236 -18421 -43667 -57617 -65209 -97861 -67617 46501 65547 -58247 -200608
17235b00608j8523J06127q5140l3325L5161L6071O6296P2345j5733o6758L337
$$ -200608 -219131 -113004 -198144 -231469 -196308 -160237 -93941 -21596 -37329 -104087 -100750
17224a00750o81M7458Q2263Q7703O4003q4578j40304n2927J07529o6397k1952
$$ -100750 -101431 -53973 28290 115993 179996 95418 -44886 -97813 9716 -56681 -78633
17213g8633J4349P1858O7939Q4154j8338j42801j17644l6814o1251J4178r3833
$$ -78633 -64284 7574 75513 159667 141329 -1472 -119116 -155930 -217181 -203003 -296836
17202b96836R4410J30634O5885Q209L7928r2494p1421n3466N8344k8000M5988
$$ -296836 -202426 -71792 -5907 2302 40230 -52264 -123685 -177151 -118807 -146807 -100819
17191a00819R0435o230l7331J04842P8714n0368q8390m9344N7778J04168L3267
$$ -100819 -10384 -16614 -53945 50897 129611 79243 -9147 -58491 -713 103455 136722
17180A36722n7322o2822m1885K30k6024L215O965L0708j04303j66251J50603J83209
$$ 136722 79400 16578 -25307 -25077 -51101 -47886 -40921 -10213 -114516 -280767 -130164 53045
17168E3045m0953j25430n3733L2996O3582R8042J52685M2466k0460J1707J2358
$$ 53045 12092 -113338 -167071 -134075 -70493 27549 180234 222700 202240 213947 226305
17157B26305r7753p2802L5565J62054J9507j03655j12284j2794q6713q8185j289
$$ 226305 128552 55750 91315 253369 272876 169221 56937 44143 -42570 -130755 -132044
17146a32044Q9100J57353j15271m8601j9449Q2761L9022p1220K2144l0397q4260
$$ -132044 -42944 114409 -862 -49463 -68912 13849 52871 -18349 3795 -26602 -110862
17135a10862m5012O1555m9968l2277J4185M1828R0315L9254J33043O2940j7737
$$ -110862 -155874 -94319 -144287 -176564 -162379 -120551 -30236 9018 142061 205001 187264
17124A87264n5299j48408k9594L5142J04699J02430j2720k667m8891J4250q1951
$$ 187264 131965 -16443 -46037 -10895 93804 196234 183514 180847 131956 146206 64255
17113F4255m7392j71269J16498J21256N9137m5597j0254j5875N1084J7198m9475
$$ 64255 16863 -154406 -37908 83348 142485 96888 86634 70759 121843 139041 89566
17102H9566J1057k7516j30762o5024j2943J01859j6952p6570k1925m8164J09931
$$ 89566 100623 73107 -57655 -122679 -135622 -33763 -50715 -127285 -149210 -197374 -87443
17091h7443p361O2085P5370N4789j3587o4226L9922J04550K9817j36924n7793
$$ -87443 -94804 -32719 42651 97440 83853 19627 59549 164099 193916 56992 -801
17080h01K7109l9074p4659J8006L9080m4647r02Q048O1164L247r8195M8173l42
$$ -801 26308 -12766 -87425 -69419 -30339 -74986 -75888 -67840 -6676 -3429 -101624 -53451 -53793
17067e3793j07018n8255J47211K2458r6017J262K6926N4986j15908L1363M6023
$$ -53793 -160811 -219066 -71855 -49397 -145414 -144152 -117226 -62240 -178148 -146785 -100762
17056a00762J06111K5637K2327J06027l4733K2082O4445P6180j1889o8199Q1832
$$ -100762 5349 30986 53313 159340 124607 146689 211134 287314 275425 207226 289058
17045B89058l8996j05690n6733J8850n7743L759L3418q7406j03187J880K1450
$$ 289058 250062 144372 87639 106489 48746 52505 85923 -1483 -104670 -102790 -81340
17034h1340k5824J03170P9656O2679N9180r008k0612o9981j77256J01304J95166
$$ -81340 -107164 -3994 75662 138341 197521 188513 167901 97920 -79336 21968 217134
17023B17134L1682j91927j30309q8598k8032J7369R7320J47162r0051o6814J0778
$$ 217134 248816 56889 -73420 -162018 -190050 -172681 -75361 71801 -18250 -85064 -74286
17012g4286N4799L283l3299j8812N2134n1806l4751Q6132P8135j9286n1204J01367
$$ -74286 -19487 -16204 -49503 -68315 -16181 -67987 -102738 -16606 61529 42243 -8961 92406
17000I2406Q7051Q166j69624L5214L4474r1853k1530n9196j4549L3642M5749P7124
$$ 92406 179457 187623 17999 53213 87687 -4166 -25696 -84892 -99441 -65799 -20050 57074
16988E7074K8274m8143q7792J536k9349k9412R8163K21014m3951j0486l3482K0525
$$ 57074 85348 37205 -50587 -49051 -78400 -107812 -9649 211365 167414 156928 123446 143971
16976A43971N7849r7339r087j08604o4875j1097M8689l3153n409R1086k5351j11067
$$ 143971 201820 104481 95394 -13210 -78085 -89182 -40493 -73646 -79055 12031 -13320 -124387
16964a24387j7999J2409k742k1153R3552J27088j0187o7495J8893j2367K620K2221
$$ -124387 -142386 -129977 -132719 -153872 -60320 66768 56581 -10914 7979 -4388 -1768 20453
16952B0453j951j42286j03939k9893K4687J35983J07264P930j5458L4097l2063
$$ 20453 18502 -123784 -227723 -257616 -232929 -96946 10318 18248 2790 36887 4824
16941D824l7144l6739N8560J9895k378n4086n9965K4214l0735l6284J4072N0844
$$ 4824 -32320 -69059 -10499 9396 7018 -47068 -107033 -82819 -113554 -149838 -135766 -84922
16929h4922L7830j7621p3923L6582L9565L3134J03195L458P4822N0677j67152
$$ -84922 -47092 -64713 -138636 -102054 -62489 -29355 73840 77298 152120 202797 35645
16918C5645o1252L0096R1351Q6645j05382p5223J8551j9822l3620Q3443m8096
$$ 35645 -25607 4489 95840 182485 77103 1880 20431 609 -33011 50432 2336
16907B336n0444M2132N1825J23941p2371j93680j37840k9091m461J05163M4704
$$ 2336 -48108 -5976 45849 169790 97419 -96261 -234101 -263192 -267653 -162490 -117786
16896a17786N8399J5516L4466q0747L896r6972p900J47136K7536n8143J96n1915
$$ -117786 -59387 -43871 -9405 -90152 -86256 -183228 -191128 -43992 -16456 -74599 -74403 -126318
16884a26318L1635K3577R0284p637j01226L7628L7042Q087M8000P4788n0139Q2443
$$ -126318 -94683 -71106 19178 11541 -89685 -52057 -15015 -6928 41072 115860 65721 148164
16872A48164R6074K8163j76282p8018l2224j5317J9933M6949j9459R8632k2962
$$ 148164 244238 272401 96119 18101 -14123 -29440 -9507 37442 17983 116615 93653
16861I3653r8551j03556r2459k8028K8756p0193M4356o0475L6973l3785J1758
$$ 93653 -4898 -108454 -200913 -228941 -200185 -270378 -226022 -286497 -249524 -283309 -271551
16850b71551J55955o0659J55752K1262j09480k7353Q643J5632J59662O8485n1619
$$ -271551 -115596 -176255 -20503 759 -108721 -136074 -127431 -111799 47863 116348 64729
16839F4729J6431K6295k018l9098O3671o4198k4950M8690q6704J7434n6889m759
$$ 64729 81160 107455 105437 66339 130010 65812 40862 89552 2848 20282 -36607 -41366
16827d1366q4719m635O6391J30716J23272m2698q6825M9905Q2410l0556j09275
$$ -41366 -126085 -130720 -64329 66387 189659 146961 60136 110041 192451 161895 52620
16816E2620L9002j15931p3716M2308j5173r9957J5060M7445o0988n4065L417J02047
$$ 52620 91622 -24309 -98025 -55717 -70890 -170847 -155787 -108342 -169330 -223395 -219978 -117931
16804a17931J12598k1434l7825M5960K4098n0148j0049j5313j19099J28357J03821
$$ -117931 -5333 -26767 -64592 -18632 5466 -44682 -54731 -70044 -189143 -60786 43035
16793D3035J5014p3090q7365M0873J05236R654n3540j23404J8626J07971K5294
$$ 43035 58049 -15041 -102406 -61533 43703 53357 -183 -123587 -104961 3010 28304
16782B8304m2123n7271j22702J15399J81237l6711l4951p1441K9065R7326m6766
$$ 28304 -13819 -71090 -193792 -78393 102844 66133 31182 -40259 -11194 86132 39366
16771C9366K3386k2029R4795l153p6606q8583o7472l0185j0396R3587M4673K2441
$$ 39366 62752 40723 135518 132365 55759 -32824 -100296 -130481 -140877 -47290 -2617 19824
16759A9824M9945j50035j55911L0843Q8675R5107J43424k5572r0767P942L4515
$$ 19824 69769 -80266 -236177 -205334 -116659 -21552 121872 96300 5533 13475 47990
16748D7990k0971k17179j33327J22298Q9810O4295K1298O9854n5817p7798J47
$$ 47990 27019 -190160 -323487 -201189 -111379 -47084 -25786 44068 -11749 -89547 -89400
16737h9400P281K7648J3607m3367L8771M8346k4773o7906Q827l4600j25113l4560
$$ -89400 -82119 -54471 -40864 -84231 -45460 2886 -21887 -89793 -80966 -115566 -240679 -275239
16725b75239P6962R8672Q5739J9751r8481J00723N4213k2491k9178o257N4652
$$ -275239 -198277 -99605 -13866 5885 -92596 8127 62340 39849 10671 4414 59066
16714E9066J0479m169L3244q2895K6280M9361J2513j39292J5785R8588l8301k8323
$$ 59066 69545 65376 98620 15725 42005 91366 103879 -35413 -19628 78960 40659 12336
16702A2336J01442j2967p7273j1637L6723k0860N8207J7564q590L5199N8667n2505
$$ 12336 113778 100811 23538 11901 48624 27764 85971 103535 94945 130144 188811 136306
16690A36306q5740j4817l0213J431K7794N2060N380P9624J22767J6707m064m9594
$$ 136306 50566 35749 5536 6967 34761 86821 92201 171825 294592 311299 307235 257641
16678B57641k63275j20031P3673O1958L7245N9454J2615J6795j2281m579J7730
$$ 257641 -5634 -125665 -51992 9966 47211 106665 119280 136075 123794 119215 136945
16667A36945N1067j84747N0460L4765K7440M7354l5046j04559j51960l7251k492
$$ 136945 188012 3265 53725 88490 115930 163284 128238 23679 -128281 -165532 -168024
16656a68024l575Q4722L6678Q0000M8449p567l5280p2363q7888J6609o8329j05711
$$ -168024 -171599 -86877 -50199 29801 78250 70683 35403 -36960 -124848 -108239 -176568 -282279
16644b82279Q5237J05838N9872Q165J1472m6996n3373k9028j9063m2133J1985
$$ -282279 -197042 -91204 -31332 -23167 -11695 -58691 -112064 -141092 -160155 -202288 -190303
16633a90303P5978l6755p2198K9136P1601J13770p4321n179J00958N856P6190
$$ -190303 -114325 -151080 -223278 -194142 -122541 -8771 -83092 -88271 12687 18543 94733
16622I4733m4853k8808J11162L0062m2942j04781O0783J00946L1895J01892n4599
$$ 94733 49880 21072 132234 162296 119354 14573 75356 176302 208197 310089 255490
16611B55490j19884K0941j1704j57691m7310P2121m0808j3027q7855L4251J58692
$$ 255490 135606 156547 144843 -12848 -60158 11963 -28845 -41872 -129727 -95476 63216
16600F3216Q5955P1588J14966k8807j20586j5121l8507o3083L7285N78P880m2125
$$ 63216 149171 220759 335725 306918 186332 171211 132704 69621 106906 107484 115364 73239
16588G3239j45515O8666Q0343O1260j00418j67643j4846J16804Q8418J19585M493
$$ 73239 -72276 -3610 76733 137993 37575 -130068 -144914 -28110 60308 179893 184386
16577A84386o3466M5396p6961p3159m057J70363K8008o1134q3094k3874l1147
$$ 184386 120920 166316 89355 16196 12139 182502 210510 149376 66282 42408 11261
16566A1261N5084j362q4947o6822j8183J15410M3443N4146k2419m0549j28460
$$ 11261 66345 64983 -19964 -86786 -104969 10441 53884 108030 85611 45062 -83398
16555h3398o807K6672L571J13244J2260k311M2353K6488m495l4560j43486r055
$$ -83398 -90205 -63533 -59962 53282 65542 63231 105584 132072 127577 93017 -50469 -59524
16543e9524R3782J0552N5668k0740K2359n2425r4999J9416R4508R0232o0160o6442
$$ -59524 34258 44810 100478 79738 102097 49672 -45327 -25911 68597 158829 98669 32227
16531C2227O5204R9828l1130j1586r7440p2093L1996j19212l8856N7248K2299
$$ 32227 97431 197259 166129 154543 57103 -14990 17006 -102206 -141062 -83814 -61515
16520f1515P7646Q9359r041j53472n7276N2505L6707m1567l8033Q6699k7161m632
$$ -61515 16131 105490 96449 -57023 -114299 -61794 -25087 -66654 -104687 -17988 -45149 -49781
16508d9781J0754K7584M1660o7274J5020J12376L8577n7720m4598o0488k3516
$$ -49781 -39027 -11443 30217 -37057 -22037 90339 128916 71196 26598 -33890 -57406
16497e7406k2580m035p4230J4106J10060J52766K2128p9565L68l7263k9377P4432
$$ -57406 -79986 -84021 -158251 -144145 -34085 118681 140809 61244 61612 24349 -5028 69404
16485F9404K1327m1048J9992m7896r551o0948N6545M7426o948M6260m8114m8686
$$ 69404 90731 49683 69675 21779 12228 -48720 7825 55251 48303 94563 46449 -2237
16473b237k3011M5533K6899Q4557J05745j25735p1875r2016m6783k7348N3217
$$ -2237 -25248 20285 47184 131741 237486 111751 39876 -52140 -98923 -126271 -73054
16462g3054J39910m5276k35840q4339R4300j6760N5565Q825J96751M4291p5425
$$ -73054 66856 21580 -214260 -298599 -204299 -221059 -165494 -156669 40082 84373 8948
16451H948q8799o5886J0067J264M7069Q4729k0279q6199j36773R527R8841R1013
$$ 8948 -79851 -145737 -135670 -134406 -87337 -2608 -22887 -109086 -245859 -236332 -137491 -46478
16439d6478L1306j11857J9244M8811o1252l705K9161P0146j21619q5394J11220
$$ -46478 -15172 -127029 -107785 -58974 -120226 -123931 -94770 -24624 -146243 -231637 -120417
16428a20417J44377O0967J91442L1630j39265m2260N146q3375k9131n295k3430
$$ -120417 23960 84927 276369 307999 168734 126474 131620 48245 19114 13819 -9611
16417i611p691N0787m7580K5262m319m6721j9780k0365O6081k5176q6142j4997
$$ -9611 -17302 33485 -14095 11167 6848 -39873 -59653 -80018 -13937 -39113 -125255 -140252
16405a40252J22189J81413O5886j57488r7227J4298N5647m8901q712j42152L1459
$$ -140252 -18063 163350 229236 71748 -25479 -11181 44466 -4435 -13147 -155299 -123840
16394a23840J20638l0715L6580J13980N3250O0597n1756p789j3247n8223j53806
$$ -123840 -3202 -33917 2663 116643 169893 230490 178734 170945 157698 99475 -54331
16383e4331r9714m3262Q7526J743l5886o3780J69767J51035K8909l3150l1903
$$ -54331 -154045 -197307 -109781 -108038 -143924 -207704 -37937 113098 142007 108857 76954
16372G6954n0660k0051K0275j13138j24165l1978J32934M1787L1790O2182M7405
$$ 76954 26294 6243 26518 -86620 -210785 -242763 -109829 -68042 -36252 25930 73335
16361G3335M393k7232J7702J1981l9186j24810n204l1260J7260J69356J56903
$$ 73335 77728 50496 68198 80179 40993 -83817 -89021 -120281 -103021 66335 223238
16350B23238q875K6359k281j29595j14183J6348k4396N2857q138m2013L0485J1954
$$ 223238 214363 240722 238441 108846 -5337 11011 -13385 39472 31334 -10679 19806 31760
16338C1760J9745n1565m0222m1687P383j9464O9050o2691K1271J31730M3893n1375
$$ 31760 51505 -60 -40282 -81969 -74586 -94050 -25000 -87691 -66420 65310 109203 57828
16326E7828l1409o0411j32355M5523k2959Q147K7522J7127J908K4931P8310L5579
$$ 57828 26419 -33992 -166347 -120824 -143783 -135636 -108114 -90987 -89079 -64148 14162 49741
16314D9741J02612o1741J5105K7508l0023n5840l6255l5527m7763l8039K531N5514
$$ 49741 152353 90612 105717 133225 103202 47362 11107 -24420 -72183 -110222 -107691 -52177
16302e2177K9240n8953l7557m1497J4269J30771K2205O8785p0011j139j425P051
$$ -52177 -22937 -81890 -119447 -160944 -146675 -15904 6301 75086 5075 3936 2511 9562
16290I562n6039L5349P9557n68M3046j4395O631o4578N4500M8875j02136r5574
$$ 9562 -46477 -11128 68429 67861 110907 96512 103143 38565 93065 141940 39804 -55770
16278e5770o1756q827j7523N3950Q310n692k6441M5547K2824J3270O3314j7400
$$ -55770 -117526 -126353 -143876 -89926 -81616 -87308 -113749 -68202 -45378 -32108 31206 13806
16266A3806M6495l0310r4841r3510K3246P3742j8344q890j8694q9285K0263J9126
$$ 13806 60301 29991 -64850 -158360 -135114 -61372 -79716 -88606 -107300 -196585 -176322 -157196
16254a57196J7100M4225J13045l823r6535N6191k900p2343o6195o5761N5285M2083
$$ -157196 -140096 -95871 17174 13351 -83184 -26993 -29893 -102236 -168431 -234192 -178907 -136824
16242a36824l8286R1527J89199l2700j37850O4271R5976N8098M5555J464j21025
$$ -136824 -175110 -83583 105616 72916 -64934 -663 95313 153411 198966 200430 79405
16231G9405q5953J7726r9346n1102J37891K6899j50975j6519J30686J7441j3701
$$ 79405 -6548 11178 -88168 -139270 -1379 25520 -125455 -141974 -11288 6153 -7548
16220g548l4996j09416k4349Q6350J7589J13344R1410J09437j9846r6130l2889
$$ -7548 -42544 -151960 -176309 -89959 -72370 40974 132384 241821 221975 125845 92956
16209I2956o0227n8306O9245J10524J4564m4637j7423m0093J3107m177Q9329o9394
$$ 92956 32729 -25577 43668 154192 168756 124119 106696 66603 79710 75533 164862 95468
16197I5468r9719l9847Q2891o4311O6774J2257l8774L0042O0311r6360n2317j4232
$$ 95468 -4251 -44098 38793 -25518 41256 53513 14739 44781 105092 8732 -43585 -57817
16185e7817o9686K2624o0488J746k8991L6864j35949m8366j5471J16628L3390
$$ -57817 -127503 -104879 -165367 -163621 -192612 -155748 -291697 -340063 -355534 -238906 -205516
16174b05516R12K9649o1555Q8691K689n8606l0875O9413J01380N1613q630J4399
$$ -205516 -204604 -174955 -236510 -147819 -145130 -203736 -234611 -165198 -63818 -12205 -20835 -6436
16162f436j44593M2027r672o9816P9228O7515o643J27378J5524n9452j23610q6798
$$ -6436 -151029 -109002 -118674 -188490 -109262 -41747 -48390 78988 94512 35060 -88550 -175348
16150a75348J01522J75699j11494l6045l687K1979K540n1030q129N4290q2218
$$ -175348 -73826 101873 -9621 -45666 -49353 -27374 -24834 -75864 -83993 -29703 -111921
16139a11921Q3430l0498M6766N7949k0687j34403J47805J39424p1377j13379r075
$$ -111921 -28491 -58989 -12223 45726 25039 -109364 38441 177865 106488 -6891 -15966
16128a5966l9766m1806k8646J49553O8317n0574R1310l6970r0360L700M2468J4639
$$ -15966 -55732 -97538 -126184 23369 91686 41112 132422 95452 5092 8792 51260 65899
16116F5899j2555K6316L1806l328p1933K6984N4584J45301p1322p2999O9534k6084
$$ 65899 53344 79660 111466 108138 36205 63189 117773 263074 191752 118753 188287 162203
16104A62203j36175j19378j29963O2236J05749K9616J0166L2903L358j9042P2365
$$ 162203 26028 -93350 -223313 -161077 -55328 -25712 -15546 17357 20715 1673 74038
16093G4038l4113k5819P4347m0718L1355n6304m8642m2282j2575k5873j9465o208
$$ 74038 39925 14106 88453 47735 79090 22786 -25856 -68138 -80713 -106586 -126051 -132259
16081a32259j1842P724K7146N1043N0415J9268n121L6008L4074Q0551j05072o7087
$$ -132259 -144101 -136377 -109231 -58188 -7773 11495 6374 42382 76456 157007 51935 -15152
16069a5152J0002N8578j02307m6732R6413q5398j37635N6426O4636M0550k6936
$$ -15152 -5150 53428 -48879 -95611 802 -84596 -222231 -165805 -101169 -60619 -87555
16058h7555m3385R9779K5782O3223l8615l967K5568l7277j980q9169l8150J55382
$$ -87555 -130940 -31161 -5379 57844 19229 15262 40830 3553 1573 -87596 -125746 29636
16046B9636J40740j07713p4667O0700N2256K532p3965l2427Q301n0258J5510M660
$$ 29636 170376 62663 -12004 48696 100952 103484 29519 -2908 5393 -44865 -29355 -24695
16034b4695j15791n157K1323J36229k041n1779M9805l8486J39156L5840j0638
$$ -24695 -140486 -145643 -124320 11909 9868 -41911 7894 -30592 108564 144404 133766
16023A33766P24K0635N4328k4614m0075p8123Q2977L384p4046p1676l7998N2175
$$ 133766 134490 155125 209453 184839 144764 66641 149618 153002 78956 7280 -30718 21457
16011B1457j87o41Q3014O4213m7177L2805j25174j06673p8858q394M7915K0229
$$ 21457 21270 20629 103643 167856 120679 153484 28310 -78363 -157221 -165615 -117700 -97471
15999i7471q7513l5347n3628j788M3039J59394Q3972r2641p9967L4548k08832
$$ -97471 -184984 -220331 -273959 -275747 -232708 -73314 10658 -81983 -161950 -127402 -336234
15988c36234p532J02155O4888M3063Q0422m569m5175K4693M8404J34470N9236
$$ -336234 -343766 -241611 -176723 -133660 -53238 -57807 -102982 -78289 -29885 104585 163821
15977A63821o198j09963j15862K877J68856r6966J6930O9578n0875j8798J8602
$$ 163821 157623 47660 -68202 -65325 103531 6565 23495 93073 42198 23400 42002
15966D2002l8575M9253o4618n7444l3751J45004L6327r6053j4414k7484o5144
$$ 42002 3427 52680 -11938 -69382 -103133 41871 78198 -17855 -32269 -59753 -124897
15955a24897N3041R3519j2172P451p6485j06704K5599R0063n0656J2943l9770
$$ -124897 -71856 21663 9491 16942 -59543 -166247 -140648 -50585 -101241 -88298 -128068
15944a28068j1896p523J28685K14509j21942k31548k500J01975L4845o8636m9334
$$ -128068 -139964 -147487 -18802 195707 73765 -157783 -160283 -58308 -23463 -92099 -141433
15933a41433O9081J27454n4990N3579P9272j05096o9893l3395J11341N3528k9145
$$ -141433 -72352 55102 112 53691 132963 27867 -42026 -75421 35920 89448 60303
15922F0303j16876n3667J15592R6594J7975K8934r0117o223m5225J3910n3019
$$ 60303 -56573 -110240 5352 101946 119921 148855 58738 52515 7290 21200 -31819
15911c1819j16607r2575K6130J60647Q1296p4953J04209L3345j29697j16768J6177
$$ -31819 -148426 -241001 -214871 -54224 27072 -47881 56328 89673 -40024 -156792 -140615
15900a40615O6286P2773R5563L3767l4186j0429L9829J8898M5700j5787p028k6859
$$ -140615 -74329 -1556 94007 127774 93588 83159 122988 141886 187586 171799 164771 137912
15888A37912J8910J892m2759m2417j26898p2694M565l6773O8443P651O332P2648
$$ 137912 156822 158714 115955 73538 -53360 -126054 -121489 -158262 -89819 -82168 -75836 -3188
15876c188J78521J18249J8141J0889r9698j27113k6412M3811n7037j37020K0939
$$ -3188 175333 293582 311723 322612 222914 95801 69389 113200 56163 -80857 -59918
15865e9918L1494P4590Q171k0000m1737l5640o8400j30372J02209J71610j4654
$$ -59918 -28424 46166 54337 34337 -7400 -43040 -111440 -241812 -139603 32007 17353
15854A7353q0500l5117M5396m2906O9138N3767j7704p7607M3254J5941M532K7145
$$ 17353 -63147 -98264 -52868 -95774 -26636 27131 9427 -68180 -24926 -8985 -4453 22692
15842B2692Q7865m4758M1249m9117J06999J1996j09539j8308J2148k8016n0072
$$ 22692 110557 65799 107048 57931 164930 176926 67387 49079 61227 33211 -16861
15831a6861r0404p8836n1779J79230J59437p1755j21010o685J09000J70265L6084
$$ -16861 -107265 -186101 -237880 -58650 100787 29032 -91978 -98663 10337 180602 216686
15820B16686k17946j7635J14914p2493J5289J159k2827P2388J03263j8687j8807
$$ 216686 -1260 -18895 96019 23526 38815 39974 17147 89535 192798 174111 155304
15809A55304j0036J4895o0204p8580P8930p2333j7103j54690j22858P2145J93522
$$ 155304 145268 160163 99959 21379 100309 27976 10873 -143817 -266675 -194530 -1008
15798a008P1575j09712L4324L5606j2821k8490p9581j09541l0312K5988L8837
$$ -1008 70567 -39145 -4821 30785 17964 -10526 -90107 -199648 -229960 -203972 -165135
15787a65135L979J23041J37083J4104q4362r7843j8043P0715L327m9967m7319
$$ -165135 -161156 -38115 98968 113072 28710 -69133 -87176 -16461 -13134 -63101 -110420
15776a10420J07610J52611m931r4959n3043j0364k1785k4648l4424q4859J11346
$$ -110420 -2810 149801 144870 49911 -3132 -13496 -35281 -59929 -94353 -179212 -67866
15765f7866N9807o067J25586n2148n988n6952N8650l915L3806N5232o5790j12291
$$ -67866 -8059 -14126 111460 59312 53324 -3628 55022 51107 84913 140145 74355 -37936
15753c7936q4184P2389J2192k8755j30391N1918J11714J22085k4727j18515l2096
$$ -37936 -122120 -49731 -37539 -66294 -196685 -144767 -33053 89032 64305 -54210 -86306
15742h6306P4829L5891J583O848P4223k0822N4847l663o7356l2436K7457M0613
$$ -86306 -11477 24414 25997 32845 107068 86246 141093 137430 70074 37638 65095 105708
15730A05708o7286n2922m0299N4786J03416l6654k3394L1108J35396j26616r6604
$$ 105708 38422 -14500 -54799 -13 103403 66749 43355 74463 209859 83243 -13361
15719a3361L3646j1922P1623j8685j37297o4119Q3897O621k0775j2313M909L6208
$$ -13361 20285 8363 79986 61301 -75996 -140115 -56218 -49597 -70372 -82685 -77776 -41568
15707d1568m9862l5840P1368K4252m8702k3852O3727j74102k4306K4558K19309
$$ -41568 -91430 -127270 -55902 -31650 -80352 -104204 -40477 -214579 -238885 -214327 4982
15696D982L8900J13741r5262j30103M9288q6640j22666O7234J14384Q2468J17650
$$ 4982 43882 157623 62361 -67742 -18454 -105094 -227760 -160526 -46142 36326 153976
15685A53976J30236o8301J2355j054n0181k51r5384p9737p0453j0403l1346M7330
$$ 153976 284212 215911 228266 227212 177031 176780 81396 1659 -68794 -79197 -110543 -63213
15673f3213n7844J17545J29546M9898j4245j41021j8173n0656M4540N1006j33776
$$ -63213 -121057 -3512 126034 175932 161687 20666 2493 -48163 -3623 47383 -86393
15662h6393j76572o930J22835r851J42652M0526j2251K6567o9588K859L0779n5460
$$ -86393 -262965 -269895 -147060 -156911 -14259 26267 14016 40583 -29005 -26146 4633 -50827
15650e0827N3752O5456j1150p9077o2012k03M8810Q133k41090j85044J42545J56978
$$ -50827 2925 68381 57231 -21846 -83858 -84061 -35251 -27118 -268208 -453252 -310707 -153729
15638a53729N5982J1226J04581R6093N9910o6833j26780r0651M2686L2799L8620
$$ -153729 -97747 -86521 18060 114153 174063 107230 -19550 -110201 -67515 -34716 3904
15627C904K5669j4095l8243M4622K979J4194N1407m5026j72652j22549j1139N6252
$$ 3904 29573 15478 -22765 21857 24836 39030 90437 45411 -127241 -249790 -260929 -204677
15615b04677J11974J03172J7680P9219j5817l8805p5105M3969J7123l0110L6710
$$ -204677 -92703 10469 28149 107368 91551 52746 -22359 21610 38733 8623 45333
15604D5333J10824k5260j65309P418R8351p4502r4361l7414K8264n0263l1979
$$ 45333 156157 130897 -34412 -26994 71357 -3145 -97506 -134920 -106656 -156919 -188898
15593a88898O430J5946R1225O2224Q7138K2573r0504k2182k0504p1046P7480L3212
$$ -188898 -182468 -166522 -75297 -13073 74065 96638 6134 -16048 -36552 -107598 -30118 3094
15581C094P1111J16579O1922o147j50060O630N2198O1604N8781l9248p881p2675
$$ 3094 74205 190784 252706 246559 96499 103129 155327 216931 275712 236464 228583 155908
15569A55908K5973m2107j24731K4069p8525L6758o8991n8055m2956Q2066N8046
$$ 155908 181881 139774 15043 39112 -39413 -2655 -71646 -129701 -172657 -90591 -32545
15558c2545L615j14081J0872K01328O0772n7154n8012l9178o4822j4258L8725
$$ -32545 -28930 -143011 -132139 69189 129961 72807 14795 -24383 -89205 -103463 -64738
15547f4738L5685P724m6408o8971J17156J95729L4842r8861j53389L625J15648
$$ -64738 -29053 -21329 -67737 -136708 -19552 176177 211019 112158 -41231 -37606 78042
15536G8042J00570j20254L694M7294k5625J977k7716k321m2929n0766k5109R4388
$$ 78042 178612 58358 62052 109346 83721 85698 57982 55661 12732 -38034 -63143 31245
15524C1245k6855m8357m3655L7220k6901J7223P8996M991K6842j12759r2979J30954
$$ 31245 4390 -43967 -87622 -50402 -77303 -60080 18916 23907 50749 -62010 -154989 -24035
15512b4035P0411J5998K2954r1052m6085K7150P3229P6816k868o8264o9242L7518
$$ -24035 46376 62374 85328 -5724 -51809 -24659 48570 125386 122518 54254 -14988 22530
15500B2530J04668N6964n1226j3165K0539n4039q1601m9971n6236o19O0730o4530
$$ 22530 127198 184162 132936 119771 140310 86271 4670 -45301 -101537 -102156 -41426 -105956
15488a05956k5140J18121M3456R1198J251j924J5638J0814l1501l4005j6002K9789
$$ -105956 -131096 -12975 30481 121679 122930 121006 136644 147458 115957 81952 65950 95739
15476I5739o4345j2588O6066M7976Q9253m7998p9441K1019O4452m9076n2899O620
$$ 95739 31394 18806 84872 132848 222101 174103 94662 115681 180133 131057 78158 84778
15464H4778j09962K2225M5835o5129o8783M3266m2873N8535K644k5974K9272n124
$$ 84778 -25184 -2959 42876 -22253 -91036 -47770 -90643 -32108 -29464 -55438 -26166 -31290
15452c1290m041n9101p3407K5501J09550J45485L5298q1168k818p398n439k984
$$ -31290 -35331 -94432 -167839 -142338 -32788 112697 147995 66827 64009 56611 51172 48188
15440D8188K3274K6072J7695p9604j48660n0103r108M6396N0922J44014K6253
$$ 48188 71462 97534 115229 35625 -113035 -163138 -172246 -125850 -74928 69086 95339
15429I5339J5754j47018r2023J0162o3401m482R4340Q7960K2104L5255K550O6517
$$ 95339 111093 -35925 -127948 -117786 -181187 -185669 -91329 -3369 18735 53990 56540 123057
15417A23057p4953k3296J38600k3662o7533O653O119j1510K337l6971o5409J08192
$$ 123057 48104 24808 163408 139746 72213 78866 84985 73475 75812 38841 -26568 81624
15405H1624P3838j46652n9442N516Q169p0579R798l374R9142N6731j20139j9178
$$ 81624 155462 8810 -50632 -45116 -36947 -107526 -97728 -101102 -1960 54771 -65368 -84546
15393h4546K6822P2257N8764r8462L499O1407K7281q3302N5130j35306k3542K1343
$$ -84546 -57724 14533 73297 -25165 -21666 39741 67022 -16280 38850 -96456 -119998 -98655
15381i8655M6192J47958R7037l3031j62190j9499P3794N0309P0370l9242n9490
$$ -98655 -52463 95495 192532 159501 -2689 -22188 51606 101915 172285 133043 73553
15370G3553k6271r5035l2156R990R2328J07732P9885j58708j97933P1612M2391
$$ 73553 47282 -47753 -79909 -69919 22409 130141 210026 51318 -146615 -75003 -32612
15359c2612P2856P0808k9080J2402O9143n5036r3370l5865j25431k632J52911
$$ -32612 40244 111052 81972 94374 163517 108481 15111 -20754 -146185 -148817 4094
15348D094L0876o5169j1169J7425n8713N1653m4021m7315n7200O6213O3333O2391
$$ 4094 34970 -30199 -41368 -23943 -82656 -31003 -75024 -122339 -179539 -113326 -49993 12398
15336A2398P140L6679L7304k5948k7172K6619J36703m6047P4948N9358j2024J9438
$$ 12398 19538 56217 93521 67573 40401 67020 203723 157676 232624 291982 279958 299396
15324B99396n7708j30714o3428k4819p9528M0537J19282Q7297r2485n3868n8497
$$ 299396 241688 110974 47546 22727 -56801 -16264 103018 190315 97830 43962 -14535
15313a4535j17876j7543K2294p1675K6905N9920q712M0003L0345m7582P1341R8075
$$ -14535 -132411 -149954 -127660 -199335 -172430 -112510 -121222 -81219 -50874 -98456 -27115 70960
15301G0960J20505K0917M825K0610M181N463p5841r3342j06480J3376L2761j8687
$$ 70960 191465 212382 217207 237817 241998 247461 171620 78278 -28202 -14826 17935 -752
15289g52m6393O7587M3376O3216n6999L8086j05085j70864m0054M9772P5433P1614
$$ -752 -47145 20442 63818 127034 70035 108121 3036 -167828 -207882 -158110 -82677 -11063
15277a1063j6021J635K9088l0080n9961j03017L0771J04964K9588P8457J01279
$$ -11063 -27084 -25449 3639 -26441 -86402 -189419 -158648 -53684 -24096 54361 155640
15266A55640n4239j27525M6315n0441J5465L9749n3212l6042P6909N0091l9362
$$ 155640 101401 -26124 20191 -30250 -14785 24964 -28248 -64290 12619 62710 23348
15255B3348p7746n7087J13064j5881j8785K524N5400J977M8392m2776k1690j6161
$$ 23348 -54398 -111485 1579 -14302 -33087 -30563 24837 26814 75206 32430 10740 -5421
15243e421l2952J4805n2859K8609O7876r1065k3354K1378K3063Q48o6803L9849
$$ -5421 -38373 -23568 -76427 -47818 20058 -71007 -94361 -72983 -49920 -49072 -115875 -76026
15231g6026P5209L9654J6292k5116p5214J2921R0547P418J05328K3505j03933
$$ -76026 -817 38837 55129 30013 -45201 -32280 58267 65685 171013 194518 90585
15220I0585m2722q681j21126m9171Q8514J9306J5609m6703N2584n4650m9974O3769
$$ 90585 47863 39182 -81944 -131115 -42601 -23295 -7686 -54389 -1805 -56455 -106429 -42660
15208d2660O0650P635m3505k7151j552P0209K8610r0103q397p211p4140R9591
$$ -42660 17990 25625 -17880 -45031 -46583 23626 52236 -37867 -46264 -53475 -127615 -28024
15196b8024M8170P9993j56079j34329P0858n087O7111Q0385J63408j3849j49409
$$ -28024 20146 100139 -55940 -190269 -119411 -124498 -57387 22998 186406 172557 23148
15185B3148j76539j24319k0622J82368O7036R474K6539m9130k9051j0088K1798
$$ 23148 -153391 -277710 -298332 -115964 -48928 -39454 -12915 -62045 -91096 -101184 -79386
15174g9386p636K9937K0054k8894j2025J15838k1138k2137K1114q8675L5044P4458
$$ -79386 -87022 -57085 -37031 -65925 -77950 37888 16750 -5387 15727 -72948 -37904 36554
15162C6554k6761l095J3728M3674M601p6773m1923l2660O4894J55202J2771l8306
$$ 36554 9793 6698 20426 64100 68701 -8072 -49995 -82655 -17761 137441 150212 111906
15150A11906R256p0781L344p9511l5510K3509L8583P860L567k0739j40049R3510
$$ 111906 121162 50381 53725 -25786 -61296 -37787 796 8656 12223 -8516 -148565 -55055
15138e5055J22830J41201K989o4929k2204p4690N481P2292L8967K5736N9133m0436
$$ -55055 67775 208976 211965 147036 124832 50142 55623 127915 166882 192618 251751 211315
15126B11315o5103r8692j34022n236R3834K9178r222r1818l8961r7050O3786K9956
$$ 211315 146212 47520 -86502 -91738 2096 31274 22052 -69766 -108727 -205777 -141991 -112035
15114a12035M088Q5176L4322m0190N9514l8354Q5330O2196n8213p1593r0788K3561
$$ -112035 -107947 -22771 11551 -28639 30875 -7479 77851 140047 81834 10241 -80547 -56986
15102e6986m5445Q8550N0544m6499j41407k465J04936M6875q5779k1750M2268
$$ -56986 -102431 -13881 36663 -9836 -151243 -153708 -48772 -1897 -87676 -109426 -67158
15091f7158N7625p5040L9021m9400j27515l3582Q085R6307P9064l686j1769q0799
$$ -67158 -9533 -84573 -45552 -94952 -222467 -256049 -247964 -151657 -72593 -76279 -88048 -168847
15079a68847M4086J10378j9902N52l2113M4956M1150j02733N9678j7672j1888
$$ -168847 -124761 -14383 -34285 -33733 -65846 -20890 20260 -82473 -22795 -40467 -52355
15068e2355j9399n6048J1765O9763m1876k3588k6983K3312J01663Q6896p0020
$$ -52355 -71754 -127802 -116037 -46274 -88150 -111738 -138721 -115409 -13746 73150 3130
15057C130j7387N8326l7536m1373J7178n663O4218n467O9787m1614n7739o475
$$ 3130 -14257 44069 6533 -34840 -17662 -23325 40893 35426 105213 63599 5860 -615
15045f15J5081J8809K3124P697n4482J32799p0353j2295p3868P818R536n1036
$$ -615 14466 33275 56399 64096 9614 142413 72060 59765 -14103 -6285 3251 -47785
15033d7785q1334L7571j9949n5574L4252J6920K7672J6254L951j74965P5650K43862
$$ -47785 -129119 -91548 -111497 -167071 -132819 -115899 -88227 -71973 -68022 -242987 -167337 76525
15021G6525L7955l8982O8947j3898j39974n7490P2093l4025P692J9021k5604M8349
$$ 76525 114480 75498 144445 130547 -9427 -66917 5176 -28849 -21157 -2136 -27740 20609
15009B0609k3470k6341P1241P0479j6961J9482k3515q4472N3248L7118k2101q582
$$ 20609 -2861 -29202 42039 112518 95557 115039 91524 7052 60300 97418 75317 66735
14997F6735R486J2932n2979K1147p6012j04536J5434J13303p8634O8336J12918
$$ 66735 76221 89153 36174 57321 -18691 -123227 -107793 5510 -73124 -4788 108130
14986A08130K031j29898r5537R2485r912p3247N6760J28573K85J0713j5972J03802
$$ 108130 110161 -19737 -115274 -22789 -32701 -105948 -49188 79385 79670 90383 74411 178213
14974A78213M7397l9486q4305q4196R8822J5843j39575j16758O98o2515R4325
$$ 178213 225610 186124 101819 17623 116445 132288 -7287 -124045 -123347 -185862 -91537
14963i1537L7315o8165J58486Q6010l4154j0801q0439m0044K3143m3225L0424
$$ -91537 -54222 -122387 36099 122109 87955 77154 -3285 -43329 -20186 -63411 -32987
14952c2987J02815L6841J2184q4791J7140J03936N9667o4321p4551K1616j31944
$$ -32987 69828 106669 118853 34062 51202 155138 214805 150484 75933 97549 -34395
14941c4395p5689N5098K8613R005O1511p4328j057J18411K4243M0030j8529n8078
$$ -34395 -110084 -54986 -26373 -17368 44143 -30185 -31242 87169 111412 151442 132913 74835
14929G4835l4818q2772r6244J34115P2694j52711r4607N8627O3491J38754M1156
$$ 74835 40017 -42755 -138999 -4884 67810 -84901 -179508 -120881 -57390 81364 122520
14918A22520r2328j8607O812K876P588R5632P7440n3306o2967o9501M8819N0210
$$ 122520 30192 11585 18397 21273 28861 124493 201933 148627 85660 16159 64978 115188
14906A15188p8530j12943N7565J6921K498R573K440O6552k9211o0453O2854L209
$$ 115188 36658 -76285 -18720 -1799 699 10272 12712 79264 50053 -10400 52454 55663
14894E5663M1901l2745Q937k8691j07756j4064K2277j7853L4216L5948l8174L8110
$$ 55663 97564 64819 73756 45065 -62691 -76755 -54478 -72331 -38115 -2167 -40341 -2231
14882b231O0526J19427Q7441r405j09636k9651o5925r7038j07533J17899N8103
$$ -2231 58295 177722 265163 255758 146122 116471 50546 -46492 -154025 -36126 21977
14871B1977J01290l94n0519m5577j5067q7305m7943J06715J09977n3981j84938
$$ 21977 123267 122873 72354 26777 11710 -75595 -123538 -16823 93154 39173 -145765
14860a45765m3994J71609J73252O7348q0976k9952o7660K4730J0167j13260q4581
$$ -145765 -189759 -18150 155102 222450 141474 111522 43862 68592 78759 -34501 -119082
14849a19082L2925M6969P6811J1807Q4892Q0098k8405j31684j16426K4496J16113
$$ -119082 -86157 -39188 37623 49430 134322 214420 186015 54331 -62095 -37599 78514
14838G8514J48917l0039j5595r4621r8443l4292l8934r309K0465n9845J3363M2749
$$ 78514 227431 197392 181797 87176 -11267 -45559 -84493 -93802 -73337 -133182 -119819 -77070
14826g7070J13176L446k3700j18533k3117N7001N3481O313M6458Q1405l8070o1339
$$ -77070 36106 39552 15852 -102681 -125798 -68797 -15316 -9003 37455 118860 80790 19451
14814A9451J0098q762n9566J0823p0126L4072O2608n1530J1982m2825N8482L8072
$$ 19451 29549 20787 -38779 -27956 -98082 -64010 -1402 -52932 -40950 -83775 -25293 12779
14802A2779L8570k8697m308M0240M8060K1528L9721K7573p5773j14374N59m5045
$$ 12779 51349 22652 18344 58584 106644 128172 167893 195466 119693 5319 5878 -39167
14790c9167m2350M1134n156l0817l3107M1503J05006L7730P9585L8777n976m7908
$$ -39167 -81517 -40383 -45539 -76356 -109463 -67960 37046 74776 154361 193138 187162 139254
14778A39254Q1188O1134p7449j38005n7250o0250J2598L650m7558m1235m6381
$$ 139254 220442 281576 204127 66122 8872 -51378 -38780 -35130 -82688 -123923 -170304
14767a70304N5482J12827P5672J118m6658J6737j8071l3607l807P2667j8691n7036
$$ -170304 -114822 -1995 73677 74795 28137 44874 26803 -6804 -10611 62056 43365 -13671
14755a3671j821N1358K9090K4840j75498K1238J46561m3915j8074j4487M568P8954
$$ -13671 -15492 35866 64956 89796 -85702 -64464 82097 38182 20108 5621 10189 89143
14743H9143P6477o9030j11587N9220N7174P48r0191j2870l4492J4533j0124j16859
$$ 89143 165620 96590 -14997 44223 101397 102145 11954 -916 -35408 -20875 -30999 -147858
14731a47858K3819P8690R000J9096l4575j6656j24974k1717P4635L6541K4984
$$ -147858 -124039 -45349 -36349 -17253 -51828 -68484 -193458 -215175 -140540 -103999 -79015
14720g9015N7226N430o3458O5392J7191o657O2820M9868j04029k775q3716O7914
$$ -79015 -21789 -16359 -79817 -14425 2766 -3891 58929 108797 4768 1993 -81723 -13809
14708a3809J02375o0188n5O4394O549k483O5372p722j43231o6151M4940p958j12667
$$ -13809 88566 28378 28323 92717 99266 96783 162155 154433 11202 -54949 -10009 -17967 -130634
14695a30634K5734R7934n2179p3973N6678J95409M41j37218l9544P6089K6411
$$ -130634 -104900 -6966 -59145 -133118 -76440 118969 119410 -17808 -57352 18737 45148
14684D5148J72486m632q9284j82677J26661j2814l7248j6683j5768Q4075l8231
$$ 45148 217634 213002 123718 -58959 67702 54888 17640 957 -14811 69264 31033
14673C1033m2482L1602J29560k8398r7476l2645K3626j1214l3862l4647k5635
$$ 31033 -11449 20153 149713 121315 23839 -8806 14820 3606 -30256 -64903 -90538
14662i0538k4999M5601M9802M0501J4327J3313J7104L1761Q978o8123m5373j11570
$$ -90538 -115537 -69936 -20134 20367 34694 48007 65111 96872 105850 37727 -7646 -119216
14650a19216o0084o5865K2060M3888P7180J01454L3581L3455O4669L0945o7149
$$ -119216 -179300 -245165 -223105 -179217 -102037 -583 32998 66453 131122 162067 94918
14639I4918j22678N6207K8673o50o2627l4534N8083q0175R7265K7771K66N6919
$$ 94918 -27760 28447 57120 56470 -6157 -40691 17392 -62783 34482 62253 62519 119438
14627A19438p6173L969j25288K8238j8192o2202P4924J74810P961l5103M8845
$$ 119438 43265 47234 -78054 -49816 -68008 -130210 -55286 119524 127485 92382 141227
14616A41227m0445m8979R4301m8400n5546k4538j19133K0523J68566o9856j3128
$$ 141227 100782 51803 146104 97704 42158 17620 -101513 -80990 87576 17720 4592
14605D592K9176k9469l8119K5437J05685j9908n5908O5537Q622j09570q284Q6943
$$ 4592 33768 4299 -33820 -8383 97302 77394 21486 87023 95645 -13925 -22209 64734
14593F4734m9102r362L2261j01953L435k2111j69001O4110R9879J23994Q0381
$$ 64734 15632 6270 38531 -63422 -59987 -82098 -251099 -186989 -87110 36884 117265
14582A17265j5350k2512Q8960l3003m7360l1141n7477l7231K3708M6834N7958
$$ 117265 101915 79403 168363 135360 88000 56859 -618 -37849 -14141 32693 90651
14571I0651l8911l3672L485J09090K3791O7572P7545O7248j15646j28833K969
$$ 90651 51740 18068 21553 130643 154434 222006 299551 366799 251153 122320 125289
14560A25289m4247m7580m7067j9324J4467O9643J4154n1555K2297p6825j13023
$$ 125289 81042 33462 -13605 -32929 -18462 51181 65335 13780 36077 -40748 -153771
14549a53771M4694M9888p0959P2138J47196M7775L4647n5139j06011q6114j22440
$$ -153771 -109077 -59189 -130148 -58010 89186 136961 171608 116469 10458 -75656 -198096
14538a98096J5597R8419J60458L2227q7210o3638k7897j3706m8177l3238J25839
$$ -198096 -182499 -84080 76378 108605 21395 -42243 -70140 -83846 -132023 -165261 -39422
14527c9422L5481j16748j9095M0617K0587l4488J0799O835o072o0916J7258J32415
$$ -39422 -3941 -120689 -139784 -99167 -78580 -113068 -102269 -95434 -101506 -162422 -145164 -12749
14515a2749L9696j5463j06454J09845J05018P0151l6513m4891p1517j25269q4319
$$ -12749 26947 11484 -94970 14875 119893 190044 153531 108640 37123 -88146 -172465
14504a72465P8296J14467J29169m5037j21418O6156P8357J3628r0246n6951N4474
$$ -172465 -94169 20298 149467 104430 -16988 49168 127525 141153 50907 -6044 48430
14493D8430O7527m4022Q5311q7487j26071p0407J10448R5652N382n6687k3706
$$ 48430 115957 71935 157246 69759 -56312 -126719 -16271 79381 84763 28076 4370
14482D370K4213M2997o9136k4412j42826N6734J20405j9961k5813q7326K1071
$$ 4370 28583 71580 2444 -21968 -164794 -108060 12345 -7616 -33429 -120755 -99684
14471i9684J2425o4379N7544J12161J0703K6073n1809j9851j769L6623M8710r5137
$$ -99684 -87259 -151638 -94094 18067 28770 54843 3034 -16817 -18586 18037 66747 -28390
14459b8390q4051k1017J37042M0813l6807k0482q8385m5078L2593L2268K9317
$$ -28390 -112441 -133458 3584 44397 7590 -12892 -101277 -146355 -113762 -81494 -52177
14448e2177J12601q4611j7837L1174P5515P6817m5840j05600Q4247j03870j2292
$$ -52177 60424 -24187 -42024 -10850 64665 141482 95642 -9958 74289 -29581 -41873
14437d1873J6952R489L8610j25355j76024M650J34247N6722J04609R5189j2838
$$ -41873 -24921 -15432 23178 -102177 -278201 -273551 -139304 -82582 22027 117216 104378
14426A04378J3358L1143l6878j1969k8519o8701o5120k1117K0386J6250K6681
$$ 104378 117736 148879 112001 100032 71513 2812 -62308 -83425 -63039 -46789 -20108
14415b0108P9946l3920o6604R6846M5360N4023j36256r8157R5532K9273K980L4058
$$ -20108 59838 25918 -40686 56160 101520 155543 19287 -78870 16662 45935 48915 82973
14403H2973j22155j42397L6495m0625J2839J43444j3520k2181r716J67674Q937
$$ 82973 -39182 -181579 -145084 -185709 -172870 -29426 -42946 -65127 -74843 92831 101768
14392A01768p9528J1956M0919l5886J37094o2r0663l8060J43328K1318j9383m6810
$$ 101768 22240 34196 75115 39229 176323 176261 85598 47538 190866 212184 192801 145991
14380A45991m5898j26181r0807L1902N6568M5545m0143o4343L1099q609j6380
$$ 145991 100093 -26088 -116895 -84993 -28425 17120 -23023 -87366 -56267 -64876 -81256
14369h1256j3958p598O1089J61965o4j18524k0105k4711N6025j04908p8528K6970
$$ -81256 -95214 -102812 -41723 120242 120178 1654 -18451 -43162 12863 -92045 -170573 -143603
14357a43603J24306M8434k1228r0576j10694M5256M4690J42619P0822o911o8645
$$ -143603 -19297 29137 7909 -82667 -193361 -148105 -103415 39204 110026 103115 34470
14346C4470n4594L5710L5400J65266J39690k5501j20137n4817p125j44975j91571
$$ 34470 -20124 15586 50986 216252 355942 330441 210304 155487 148362 3387 -188184
$$ [...]
##END NTUPLES=NMR SPECTRUM
##END=
