##TITLE=Analysis number 307169
Compound Code gk 00321
Book Reference 358/126
Project Code adrs
Chemist Name mikem
##JCAMPDX= 6.0         $$ Bruker NMR JCAMP-DX V2.0
##DATA TYPE= NMR SPECTRUM
##DATA CLASS= NTUPLES
##ORIGIN= Bruker BioSpin GmbH
##OWNER= NMR
$$ XWIN-NMR		Version 3.5
$$ Fri Apr 22 09:38:34 2005 GMT Daylight Time (UT+1h)  MAYBRIDGE\NMR@NMR_250MHZ
##.OBSERVE FREQUENCY= 250.131544655141
##.OBSERVE NUCLEUS= ^1H
##.ACQUISITION MODE= SIMULTANEOUS (DQD)
##.ACQUISITION SCHEME= undefined
##.AVERAGES= 16
##.DIGITISER RES= 18
##SPECTROMETER/DATA SYSTEM= dpx250
##.PULSE SEQUENCE= zg30
##.SOLVENT NAME= CDCl3
##.SHIFT REFERENCE= (INTERNAL, CDCl3, 0, 16.522)
##AUDIT TRAIL= $$ (NUMBER, WHEN, WHO, WHERE, WHAT)
$$ ##TITLE= Audit trail, XWIN-NMR		Version 3.5
$$ ##JCAMPDX= 5.01
$$ ##ORIGIN= Bruker BioSpin GmbH
$$ ##OWNER= NMR
$$ C:\u/data/dgb/nmr/ADRS/2040/pdata/1/auditp.txt
$$ ##AUDIT TRAIL=  $$ (NUMBER, WHEN, WHO, WHERE, WHAT)
(   1,<2005-04-22 09:37:59.88 +100>,<MAYBRIDGE\NMR>,<NMR_250MHZ>,
      <created by zg, POWCHK disabled, PULCHK disabled
       configuration hash MD5:
       62 19 C7 07 E1 42 D1 B7 37 6C 3D D0 77 39 F9 E6
       data hash MD5: 64K
       5B B3 C7 93 B5 DB 9C AC 29 56 D9 BB 73 4F 34 24>)
(   2,<2005-04-22 09:38:14.91 +100>,<MAYBRIDGE\NMR>,<NMR_250MHZ>,
      <Start of raw data processing
       ef LB = 0.3 FT_mod = 6 PKNL = 1 SI = 32K 
       data hash MD5: 32K
       6F 98 15 44 05 4B 2D 05 81 84 D3 5C 27 06 12 C6>)
(   3,<2005-04-22 09:38:20.77 +100>,<MAYBRIDGE\NMR>,<NMR_250MHZ>,
      <apk 
       data hash MD5: 32K
       7B 1B 72 A3 D8 31 B5 D7 A5 31 44 26 9C F0 F2 8E>)
(   4,<2005-04-22 09:38:22.35 +100>,<MAYBRIDGE\NMR>,<NMR_250MHZ>,
      <abs ABSG = 5 
       data hash MD5: 32K
       A3 42 78 25 D6 B8 BC FC 95 84 91 40 54 AE DA 8A>)
$$ ##END=
$$ 
$$ hash MD5
$$ 2E 51 DA A3 AA C6 D1 69 96 BC 42 16 2B 3D D2 BB
##$RELAX= 
##$RELAX= 
##$RELAX= 
##$RELAX= 
##$RELAX= 
##$RELAX= 
##$RELAX= 
$$ Bruker specific parameters
$$ --------------------------
##$DU= <C:\u>
##$EXPNO= 2040
##$NAME= <ADRS>
##$PROCNO= 1
##$TYPE= <nmr>
##$USER= <dgb>
##$AMP= (0..31)
100 100 100 100 100 100 100 100 100 100 100 100 100 100 100 100 100 100 
100 100 100 100 100 100 100 100 100 100 100 100 100 100 
##$AQSEQ= 0
##$AQ_mod= 3
##$AUNM= <au_zg>
##$AUTOPOS= <2 >
##$BF1= 250.13
##$BF2= 250.13
##$BF3= 250.13
##$BF4= 250.13
##$BF5= 500.13
##$BF6= 500.13
##$BF7= 500.13
##$BF8= 500.13
##$BYTORDA= 1
##$CFDGTYP= 0
##$CFRGTYP= 5
##$CHEMSTR= <none>
##$CNST= (0..31)
1 1 145 1 1 1 1 1 1 1 1 1 1 1 1 1 1 1 1 1 1 1 1 1 1 1 1 1 1 1 1 1 
##$CPDPRG= <>
##$CPDPRG1= <>
##$CPDPRG2= <>
##$CPDPRG3= <>
##$CPDPRG4= <mlev>
##$CPDPRG5= <mlev>
##$CPDPRG6= <mlev>
##$CPDPRG7= <mlev>
##$CPDPRG8= <mlev>
##$CPDPRGB= <>
##$CPDPRGT= <>
##$D= (0..31)
0 1 0 0 0 0 0 0 0 0.06 0 0 0 0 0 0 0.0002 0 0 0 0 0 0 0 0 0 0 0 0 0 0 
0 
##$DATE= 1114159078
##$DBL= (0..7)
120 120 120 120 120 120 120 120 
##$DBP= (0..7)
150 150 150 150 150 150 150 150 
##$DBP07= 0
##$DBPNAM0= <>
##$DBPNAM1= <>
$$ [...]
##$SUBNAM7= <"">
##$SUBNAM8= <"">
##$SUBNAM9= <"">
##$SW= 20.6930455092707
##$SWIBOX= (0..15)
0 0 3 0 0 0 0 0 0 0 0 0 0 0 0 0 
##$SW_h= 5175.983436853
##$TD= 65536
##$TD0= 1
##$TE= 295.16
##$TE2= 300
##$TE3= 300
##$TEG= 300
##$TL= (0..7)
0 120 120 120 120 120 120 120 
##$TP= (0..7)
150 150 150 150 150 150 150 150 
##$TP07= 0
##$TPNAME0= <>
##$TPNAME1= <>
##$TPNAME2= <>
##$TPNAME3= <>
##$TPNAME4= <>
##$TPNAME5= <>
##$TPNAME6= <>
##$TPNAME7= <>
##$TPOAL= (0..7)
0.5 0.5 0.5 0.5 0.5 0.5 0.5 0.5 
##$TPOFFS= (0..7)
0 0 0 0 0 0 0 0 
##$TUNHIN= 0
##$TUNHOUT= 0
##$TUNXOUT= 0
##$USERA1= <user>
##$USERA2= <user>
##$USERA3= <user>
##$USERA4= <user>
##$USERA5= <user>
##$V9= 5
##$VALIST= <valist>
##$VCLIST= <CCCCCCCCCCCCCCC>
##$VD= 0
##$VDLIST= <DDDDDDDDDDDDDDD>
##$VPLIST= <PPPPPPPPPPPPPPP>
##$VTLIST= <TTTTTTTTTTTTTTT>
##$WBST= 1024
##$WBSW= 4
##$XGAIN= (0..3)
0 0 0 0 
##$XL= 0
##$YL= 0
##$YMAX_a= 445449
##$YMIN_a= -399466
##$ZGOPTNS= <>
##$ZL1= 120
##$ZL2= 120
##$ZL3= 120
##$ZL4= 120
##$ABSF1= 16.522
##$ABSF2= -4.171173
##$ABSG= 5
##$ABSL= 3
##$ALPHA= 0
##$AQORDER= 0
##$ASSFAC= 0
##$ASSFACI= 0
##$ASSFACX= 0
##$ASSWID= 0
##$AUNMP= <proc_1d>
##$AZFE= 0.1
##$AZFW= 0.1
##$BCFW= 0
##$BC_mod= 0
##$BYTORDP= 0
##$COROFFS= 0
##$CY= 12.5
##$DATMOD= 1
##$DC= 0
##$DFILT= <>
##$DTYPP= 0
##$F1P= 14.0000005364418
##$F2P= -0.99999901652339
##$FCOR= 0.5
##$FTSIZE= 32768
##$FT_mod= 6
##$GAMMA= 0
##$GB= 0
##$INTBC= 1
##$INTSCL= 1
##$ISEN= 128
##$LB= 0.3
##$LEV0= 0
##$LPBIN= 0
##$MAXI= 10000
##$MC2= 0
##$MEAN= 0
##$ME_mod= 0
##$MI= 0
##$NCOEF= 0
##$NC_proc= -3
##$NLEV= 6
##$NOISF1= 0
##$NOISF2= 0
##$NSP= 0
##$NTH_PI= 0
##$NZP= 0
##$OFFSET= 16.522
##$PC= 1
##$PHC0= 136.7347
##$PHC1= 4.803997
##$PH_mod= 1
##$PKNL= yes
##$PPARMOD= 0
##$PSCAL= 4
##$PSIGN= 0
##$REVERSE= no
##$SF= 250.13
##$SI= 32768
##$SIGF1= 0
##$SIGF2= 0
##$SINO= 400
##$SIOLD= 32768
##$SREGLST= <1H.CDCl3>
##$SSB= 0
##$STSI= 32768
##$STSR= 0
##$SW_p= 5175.98343685301
##$SYMM= 0
##$S_DEV= 0
##$TDeff= 65536
##$TDoff= 0
##$TI= <Analysis number 999999
Compound Code 99
Book Reference 9
Project Code 9>
##$TILT= no
##$TM1= 0
##$TM2= 0
##$TOPLEV= 0
##$USERP1= <user>
##$USERP2= <user>
##$USERP3= <user>
##$USERP4= <user>
##$USERP5= <user>
##$WDW= 1
##$XDIM= 32768
##$YMAX_p= 535300973
##$YMIN_p= -26887
$$ End of Bruker specific parameters
$$ ---------------------------------
##NTUPLES= NMR SPECTRUM
##VAR_NAME=  FREQUENCY,     SPECTRUM/REAL,   SPECTRUM/IMAG
##SYMBOL=    X,             R,               I
##VAR_TYPE=  INDEPENDENT,   DEPENDENT,       DEPENDENT
##VAR_FORM=  AFFN,          ASDF,            ASDF
##VAR_DIM=   32768,         32768,           32768
##UNITS=     HZ,            ARBITRARY UNITS, ARBITRARY UNITS
##FACTOR=    0.157963299565203, 1,           1
##FIRST=     4132.6476996994, 0,             0
##LAST=      -1043.33573715361, 0,           0
##MIN=       -1043.33573715361, -26887,      0
##MAX=       4132.6476996994, 535300973,     0
$$ Real data points
##PAGE= N=1
##DATA TABLE= (X++(R..R)), XYDATA
$$ [...]
18854b231m21K177j134o001m437J784K173K723m07l956J907O265L993J58k452
$$ -2231 -2652 -475 -1609 -7610 -12047 -10263 -8090 -5367 -5774 -9730 -7823 -1558 2435 2593 141
18839A41K718K327m644l656m473n08l03R886O126l880k474M62l010p401K955L021
$$ 141 2859 5186 542 -3114 -7587 -8095 -8398 1488 7614 3734 1260 1722 -1288 -8689 -5734 -2713
18823b713L191J385m235l665J692p80k684o45P016N166P74l085r14k335P41L778
$$ -2713 478 1863 -2372 -6037 -4345 -5125 -7809 -8454 -1438 3728 4502 1417 503 -1832 -1091 2687
18807B687L454Q68P25n177J067l049l095J646K131J564J187k582n017J412K176
$$ 2687 6141 7009 7734 2557 3624 575 -2520 -874 1257 2821 4008 1426 -3591 -2179 -3
18792cj041j18J165O91J943K2j311o76k585p14n93P13N937M590N12k667K087K894
$$ -3 -1044 -1162 3 694 2637 2659 1348 672 -1913 -2627 -3220 -2507 3430 8020 8532 5865 7952 10846
18774A0846L173P137R397M000M619K61m089r154m947j170p92p135o798J676P848
$$ 10846 14019 21156 30553 34553 39172 39433 35344 26190 21243 20073 19281 12146 5348 7024 14872
18759A4872m78k82j547j297P26k769n056l498p098j52J913j353R417N750m580
$$ 14872 14394 14112 12565 11268 11994 9225 4169 671 -6427 -6579 -4666 -6019 3398 9148 4568
18744D568l191l527n33P77N308p74j910n293k290n054N285L654K595K441J682
$$ 4568 1377 -2150 -2683 -1906 3402 2628 718 -4575 -6865 -11919 -6634 -2980 -385 2056 3738
18729C738o57J010M075m767K607K866m179j773K245J671o631m064j370L490K108
$$ 3738 3081 4091 8166 3399 6006 8872 4693 2920 5165 6836 205 -3859 -5229 -1739 369
18714C69J153L767j80m018p95j954J892q77j85N402j49m588J677M278l73k174
$$ 369 1522 5289 5109 1091 296 -1658 234 -643 -828 4574 4425 -163 1514 5792 5419 3245
18698C245k883k717j33J070k285M580K992m574o87J568K017m033k767J196L009
$$ 3245 362 -2355 -2488 -1418 -3703 877 3869 -705 -1392 176 2193 -1840 -4607 -3411 -402
18683d02O44O04j842J214Q227K085j077l655J618J007k974j831N55K44j336o90
$$ -402 242 846 -996 218 8445 10530 9453 5798 7416 8423 5449 3618 4173 4417 3081 2391
18667B391k677q79l73K133j542j098p89P99J465l467l190M72L268L745j0k281
$$ 2391 -286 -1165 -1538 595 -947 -2045 -2834 -2035 -570 -4037 -7227 -6755 -3487 258 248 -2033
18651b033j991l109k58P116L336m154j068l16L363j301q29K337K554N45j457q20
$$ -2033 -4024 -7133 -7391 -275 3061 -1093 -2161 -2477 886 -415 -1244 1093 3647 4192 2735 1915
18635A915l53K577P35l612j582L129L641n9n41K472m356j948Q65r33q71j518K337
$$ 1915 1562 4139 4874 1262 -320 2809 6450 6391 5850 8322 3966 2018 2883 1950 1079 -439 1898
18618A898J162k891o63O166q01l801k082j044L728j014k44L694L470k207n52n020
$$ 1898 3060 169 -494 5672 4871 1070 -1012 -2056 1672 658 414 4108 7578 5371 4819 -201
18602b01m965l035l196K809K494K542M671o16K555K131m335l392m049j820M940
$$ -201 -5166 -8201 -11397 -8588 -6094 -3552 1119 503 3058 5189 854 -2538 -6587 -8407 -3467
18587c467j576N712N922K365q57J104j550k426l84L285j836m197K21l900p17L30
$$ -3467 -5043 669 6591 8956 8099 9203 7653 5227 4843 8128 6292 2095 2316 -1584 -2301 -1971
18571a971L72Pq48j023L064j0m497R51L690K072k302J985K604K758l761p385k948
$$ -1971 -1599 -1592 -2440 -3463 -399 -409 -4906 -3955 -265 1807 -495 1490 4094 6852 3091 -4294 -7242
18554g242K055O872K198k22j345l765M926N093j182O201J084r409k686M37O74
$$ -7242 -5187 1685 3883 3661 2316 -1449 3477 8570 7388 13589 14673 5264 2578 3015 3689
18539C689k348N56K642L96j214j961K307Q27r01N091P063M863k722m71m708j720
$$ 3689 1341 1897 4539 4935 3721 1760 4067 4894 3993 9084 16147 21010 18288 17817 13109 11389
18523A1389l696L23k354k233l804J488N468J770j255k74O86M7O8p52j355j1j560
$$ 11389 7693 8016 5662 3429 -375 1113 6581 8351 7096 6822 7508 7555 7623 6871 5516 5505 3945
18506C945m602K697k43j090j610o16p33J12P52J284j128k306J373M271J568J671
$$ 3945 -657 2040 1797 707 -903 -1519 -2252 -2140 -1388 -104 -1232 -3538 -2165 2106 3674 5345
18490E345J314k007m34M044L38l141K737q49k126j699l354L34K274M793K014K655
$$ 5345 6659 4652 4218 8262 8600 5459 8196 7347 5221 3522 168 502 2776 7569 9583 12238
18474A2238N78j691k302k329l012l7K668L217J98o91l662k327j634j621K916K862
$$ 12238 12816 11125 8823 6494 3482 3445 6113 9330 9528 8837 5175 2848 1214 -407 2509 5371
18458E371K28L451K316n143n851J656k374j684J92J380L180k651o72K816L586
$$ 5371 5599 9050 11366 6223 372 2028 -346 -2030 -1838 -458 2722 71 -601 2215 5801
18443E801r2n6K42k688K486J13k42k799l041K565J577J476m10K091K430k787n429
$$ 5801 5709 5653 5895 3207 5693 5806 5564 2765 -276 2289 3866 5342 4932 7023 9453 6666 1237
18426A237J42R69j00P92L403k03J666j295o076j9L790J199N58k390m518K716K097
$$ 1237 1379 2348 2248 3040 6443 6240 7906 6611 535 516 4306 5505 6063 3673 -845 1871 3968
18409C968N72M977j254k224m343m344L944J302Q84l557m297K48L553J919K281
$$ 3968 4540 9517 8263 6039 1696 -2648 1296 2598 3482 -75 -4372 -4124 -571 1348 3629
18394C629M336j596k449J740n12k333o04m257Q44q40K553P30l737j15J644J412
$$ 3629 7965 6369 3920 5660 5148 2815 2211 -2046 -1202 -2042 511 1241 -2496 -2611 -967 445
18378D45L813L713K349m703k431l971m06Q6k723l18K746O060K885k981k230L288
$$ 445 4258 7971 10320 5617 3186 -785 -1191 -1105 -3828 -4146 -1400 4660 7545 4564 2334 5622
18362E622J050k117K668O064n96m912p23n404O855M450L256j022k773j249j86
$$ 5622 6672 4555 7223 13287 12691 7779 7056 1652 8507 12957 16213 15191 12418 11169 10983
18347A0983J41m17m451k684O1L36K14J040J810P5K303r73M57k922k209K960J894
$$ 10983 11124 10707 6256 3572 3633 3969 4183 5223 7033 7108 9411 8438 8895 5973 3764 6724 8618
18330H618k651n360L110P96L004L710P229M948n164m520L161K304l122m516n36
$$ 8618 5967 607 3717 4513 7517 11227 18456 23404 18240 13720 16881 19185 16063 11547 11011
18315A1011K489r24K101o43k89l418P29j914N664J0500P965J742O717m481K078
$$ 11011 13500 12576 14677 14034 13745 10327 11056 9142 14806 25306 33271 35013 41730 37249 39327
18300C9327N071J4602J8177K4395L6708M3220N6833O1317O0998N5613L9792J3551
$$ 39327 44398 59000 77177 101572 138280 181500 238333 299650 360648 416261 456053 469604
18288D69604k0157l7754m1255m3719m1297k2585K85K3180L4549M9209M9185M6992
$$ 469604 449447 411693 370438 326719 285422 262837 263122 286302 320851 370060 419245 466237
18276D66237K7490J854k3247m5925n5827n6230n9256n4145l7330k6276j8133j0759
$$ 466237 493727 495581 472334 426409 370582 314352 255096 200951 163621 137345 119212 108453
18264A08453j2284j0164j1332j0442n150m524r822l793m931m754j966p37M215
$$ 108453 96169 86005 74673 64231 59081 54557 44735 40942 36011 31257 29291 28554 32769
18251C2769Q43l578j00K966J84j257K311k487k330l954J389j07m332n607l723
$$ 32769 33612 30034 29934 32900 33084 31827 34138 31651 29321 25367 26756 26649 22317 16710 12987
18236A2987l53M445L512j895m68N96J410k419o21j829m085k498L677J269J614
$$ 12987 12634 17079 20591 18696 18228 18824 20234 17815 17194 15365 11280 8782 12459 13728 15342
18221A5342N489j053j2K142k652j214L481j50k924l401k841l47P114M261q22j996
$$ 15342 20831 19778 19766 21908 19256 18042 21523 21373 18449 15048 12207 11860 18974 23235 22413 20417
18205B0417j199J243M194o86o904p38m032m271J727K405P634K036k000k925k923
$$ 20417 19218 20461 24655 23969 17065 16327 12295 8024 9751 12156 19790 21826 19826 16901 13978
18190A3978j266P83j540J037J868M407J564L033K01l671j875O23J207J15k877
$$ 13978 12712 13495 11955 12992 14860 19267 20831 23864 24065 20394 18519 19142 20349 20464 17587
18175A7587l333k407k797K496N087O23L736J476j091m760o07J234p09R06J100
$$ 17587 14254 11847 9050 11546 16633 17256 20992 22468 21377 16617 16010 17244 16535 17441 18541
18160A8541K055K137l345m03P04M623K001M402J468O66M527K494o21J746J263
$$ 18541 20596 22733 19388 18985 19689 24312 26313 30715 32183 32849 37376 39870 39249 40995 42258
18145D2258O10j534l05K033j295n36N071M550K68M730K737P970Q810K309J206
$$ 42258 42868 41334 41029 43062 41767 41231 46302 50852 51120 55850 58587 66557 75367 77676 78882
18130G8882M350M445R346R861J1188J1161J7372K1873K6690L1320M7037O3650
$$ 78882 83232 87677 97023 106884 118072 129233 146605 168478 195168 226488 273525 337175
18118C37175R1582J46142K38055L85722O03645R41695J363586J495430R13490
$$ 337175 428757 574899 812954 1198676 1802321 2744016 4107602 5603032 6516522
18109F516522O8392m38848q54379j226830j162992p97019m90115k90569j74059
$$ 6516522 6584914 6146066 5291687 4064857 2901865 2104846 1614731 1324162 1150103
18100A150103j14415j27231j26825j07275r1260p8322o4136n4240m4932l3522
$$ 1150103 1035688 908457 781632 674357 583097 504775 440639 386399 341467 307945
18090C07945k9485l0431k5802j6269j5811k2551j3826p619j1970r726p778m365
$$ 307945 278460 248029 222227 205958 190147 167596 153770 146151 134181 124455 116677 112312
18078A12312k73o231l30k76o206n149k111r970r091o687n934m208P863J804K144
$$ 112312 112039 105808 105478 105202 98996 93847 91736 81766 72675 65988 60054 55846 63709 65513 67657
18063F7657Q38k227J338R3o276o143j145l181q4l803L555K767l462k558j374k572
$$ 67657 68495 66268 67606 67699 61423 55280 54135 50954 50870 47067 50622 53389 49927 47369 45995 43423
18047D3423M959j444m525Q6J289m479P04M436j48K940N503j537l143k880j042
$$ 43423 48382 46938 42413 42499 43788 39309 40013 44449 44301 47241 52744 51207 48064 45184 44142
18032D4142O620K332j429N867o92k451n180k237j599l586J519k774J329M192O993
$$ 44142 50762 53094 51665 57532 56840 54389 49209 46972 45373 41787 43306 40532 41861 46053 53046
18017E3046K334n812l992k504K97k396p068m248N3J272j934j343M592O26P46J114
$$ 53046 55380 49568 45576 43072 43369 40973 33905 29657 29710 30982 29048 27705 32297 32923 33669 34783
18001C4783k504j889J666L778J849J439M61M85m13N300N808P484k62jl741r086
$$ 34783 32279 30390 32056 35834 37683 39122 39583 40068 39655 44955 50763 58247 57985 57984 54243 45157
17985D5157j594o90o791k487K167K266K368R26N156M495K835O884N01Q55p1L98
$$ 45157 43563 42873 36082 33595 35762 38028 40396 41322 46478 50973 53808 60692 61193 62048 61977 62375
17969F2375K139N20M167N766J4154R563J3919J1753J0744J6065K4462L0982M3556
$$ 62375 64514 65034 69201 74967 89121 98684 112603 124356 135100 151165 175627 206609 250165
17956B50165O6309P4105P4104P0469M7082K7363N836j9644l0598l0988k4509m985
$$ 250165 316474 390579 464683 535152 582234 609597 615433 595789 565191 534203 509694 504709
17944E04709J1068K8089L6991M1078K9263J0214k4286m6908n7521o4453o2896
$$ 504709 515777 543866 580857 621935 651198 661412 637126 590218 532697 468244 405348
17933D05348o3122m6352l4995k5290k4224k6191k1293j2956r107q835p093p896
$$ 405348 342226 295874 260879 235589 211365 185174 163881 150925 141818 132983 125890 117994
17921A17994n818j1779n461j925j285J363l818p086q968m499j425O71n928Q09
$$ 117994 112176 100397 94936 93011 91726 93089 89271 82185 73217 68718 67293 67964 62036 62845
17907F2845L934k563p83M309j721J05O510K134k209l247l573j71j446q43L482
$$ 62845 66779 64216 63433 67742 66021 66126 72636 74770 72561 69314 65741 65570 64124 63281 66763
17892F6763l136J544K658K554m161J073m597n589J731J469L345p11j917K602m0
$$ 66763 63627 65171 67829 70383 66222 67295 62698 57109 58840 60309 63654 62943 61026 63628 63588
17877F3588N86K952k453l830r6j807m518l810n84k747n334k746l908k840j323
$$ 63588 64174 67126 64673 60843 60747 58940 54422 50612 50028 47281 41947 39201 35293 32453 31130
17862C1130J634L813N308J1052P130N831K880k203j985q142n603k343J826K726
$$ 31130 32764 36577 41885 52937 60067 65898 68778 66575 64590 56448 50845 48502 50328 53054
17848E3054M13J0704J6965J1816J2250O839N571Q754m518R638Q580J016l85p523
$$ 53054 53467 64171 81136 92952 105202 112041 117612 126366 121848 131486 140066 141082 140697 133174
17834A33174n604m481p016j332L719N678r6R3r43j362l364k592J13l026k008k002
$$ 133174 127570 123089 116073 114741 118460 124138 124042 124135 123192 121830 118466 115874 115987 112961 110953 108951
17818A08951p127o134M76q592p32Q72O642L107K543L130K124J760N558P871O377
$$ 108951 101824 95690 96166 87574 86842 87714 94356 97463 100006 103136 105260 107020 112578 120449 126826
17803A26826j515K659O113N733l685J89N260K083M731M996Q447J2470J6888J7734
$$ 126826 125311 127970 134083 139816 136131 136320 141580 143663 148394 153390 161837 174307 191195 208929
17789B08929J2358O922J0843Q485l366j0602m657k366j300j642K677Q789M788
$$ 208929 221287 228209 239052 247537 244171 233569 228912 226546 225246 223604 226281 235070 239858
17776B39858N734J0675N689M067M759J3224J5661J6143J5079K0153J9663J6580
$$ 239858 245592 256267 261956 266023 270782 284006 299667 315810 330889 351042 370705 387285
17764C87285K0924J9453J4748J7413J9450J7125J6193J9925K1454K7117K9788
$$ 387285 408209 427662 442410 459823 479273 496398 512591 532516 553970 581087 610875
17753F10875K9249L9440M4822M6720N9384P2151R4150J13182J34545J55064J59722
$$ 610875 640124 679564 724386 771106 830490 902641 996791 1109973 1244518 1399582 1559304
17742A559304J48604J27275R6094N9647L3412K1316J3479L4108P4729J19236J83537
$$ 1559304 1707908 1835183 1931277 1990924 2024336 2045652 2059131 2093239 2167968 2287204 2470741
17731B470741K46806L09574L73320M37006M94294N61788O75059Q60281J162308
$$ 2470741 2717547 3027121 3400441 3837447 4331741 4893529 5568588 6428869 7591177
17722G591177J677761K493402L735950N510854P690064R825476J1480355J1788624
$$ 7591177 9268938 11762340 15498290 21009144 28699208 38524684 50005039 61793663
17714F1793663J0065308O912571K709798k185161o008130q059725q614690p296622
$$ 61793663 71858971 78771542 81481340 79296179 73288049 65228324 56613634 49317012
17706D9317012m528086j016681K752262O131133Q694740R717889Q516156N691541
$$ 49317012 44788926 43772245 46524507 52655640 61350380 71068269 79584425 85275966
17698H5275966J751719l105136p259910r724094j0855053j0439876q839916o912652
$$ 85275966 87027685 83922549 76662639 66938545 56083492 45643616 36803700 29891048
17690B9891048n116279l725310k753326k161475j825910j573735j386823j235394
$$ 29891048 24774769 21049459 18296133 16134658 14308748 12735013 11348190 10112796
17682A0112796j111485r93968q85315p76173o68450n60924m57880l60831k80920
$$ 10112796 9001311 8007343 7122028 6345855 5677405 5116481 4658601 4297770 4016850
17673D016850k13644j67926j49688j56949j83503k16084k38765k52553k49812
$$ 4016850 3803206 3635280 3485592 3328643 3145140 2929056 2690291 2437738 2187926
17664B187926k33136k07539j75188j46160j25392j09998r8797q4381p7411o7582
$$ 2187926 1954790 1747251 1572063 1425903 1300511 1190513 1091716 1007335 929924 862342
17654H62342n5444n3177n1092n0523n1975m9182l6874l4708k6039k5544j8944
$$ 862342 806898 753721 702629 652106 600131 550949 514075 479367 453328 427784 408840
17643D08840j5940r499j6816j0381m118j1470j4136j3792q918q773o143p642m595
$$ 408840 392900 383401 366585 356204 352086 340616 326480 312688 303770 294997 288854 281212 276617
17630B76617m295m820n454r582q089j2596j3188j0688j058M294O050K503k136
$$ 276617 272322 267502 262048 252466 244377 231781 218593 207905 206847 211141 217191 219694 217558
17617B17558m259p440j831k416j043o650o311o093j760m243p872k768K050M473
$$ 217558 213299 205859 204028 201612 200569 193919 187608 181515 179755 175512 167640 164872 166922 171395
17603A71395l950k046J172l522k920j065q12M13O443M228L327R944N015K595M839
$$ 171395 167445 165399 166571 163049 160129 159064 158252 158665 165108 169336 172663 182607 187622 190217 195056
17588A95056N801m325O82r08o522r4j542k226m830k707j96k430M288n845k024
$$ 195056 200857 196532 197214 196306 189784 189690 188148 185922 181092 178385 178189 175759 180047 174202 172178
17573A72178k238R9o003j121j201q386k474L049n171m265l722j604q733p441o763
$$ 172178 169940 170039 164036 162915 161714 153328 150854 153903 148732 144467 140745 139141 130408 122967 116204
17558A16204q809o928p536m442L35R259L461K535N776M959N623K048j996k142
$$ 116204 107395 100467 92931 88489 88824 98083 101544 104079 109855 114814 120437 122485 120489 118347
17544A18347q622q578m172p980j455j666l437k281j394p81n142J003m965n983
$$ 118347 109725 101147 96975 88995 87540 85874 82437 80156 78762 77981 72839 73842 68877 62894
17530F2894m20k421m08n66J556o264m493m683o265l458L73M518O088N35l392m969
$$ 62894 62474 60053 59645 59079 60635 54371 49878 45195 38930 35472 35845 40363 46451 46986 43594 38625
17514C8625l697l528n916m351l342J658J709K516L235M682r96O35O67n900p74
$$ 38625 34928 31400 25484 21133 17791 19449 21158 23674 26909 31591 30595 31230 31897 25997 25223
17499B5223k39p104L202J993j378r743l405O852L754J258L316l846j460L65J181
$$ 25223 24984 17880 21082 23075 21697 11954 8549 15401 19155 20413 23729 19883 18423 18788 19969
17484A9969J094J999K527j511k090J508j941M246N639K575j999j325N220K440
$$ 19969 21063 23062 25589 24078 21988 23496 21555 25801 31440 34015 32016 30691 35911 38351
17470C8351L58K610P12q63l923l006j840N029K792K387M749M46K174J305L066
$$ 38351 38709 41319 42031 41168 37245 34239 32399 37428 40220 42607 47356 47802 49976 51281 54347
17455E4347k530k766J019K837n426j815p20O798K860N794J3089J3000J0022Q841
$$ 54347 51817 49051 50070 52907 47481 45666 44946 51744 54604 60398 73487 86487 96509 105350
17441A05350N056m110j0303j6125j4170m252k367o995m438o68L17P975K028n605
$$ 105350 110406 106296 95993 79868 65698 61446 59079 52084 47646 46978 47295 55270 57298 51693
17427E1693l552o73N72j0515j2146r286k204l77k384o096K170J0255J791j220
$$ 51693 48141 47468 48040 37525 25379 16093 13889 13512 11128 5032 7202 17457 19248 18028
17413A8028j928j301k369l128K405Q48L314L32r9j444k492l02J52j593l088p211
$$ 18028 16100 14799 12430 9302 11707 12555 15869 16201 16102 14658 12166 11864 12016 10423 7335 124
17397A24m303k528M861j841j907j63O978M607q9j115k841j454l870n023r636n114
$$ 124 -4179 -6707 -1846 -3687 -5594 -5757 1221 5828 5739 4624 1783 329 -3541 -8564 -18200 -23314
17381b3314k168j405L273J850L847M113K985M524r56M577N75l515M93j268L588
$$ -23314 -25482 -26887 -23614 -21764 -17917 -13804 -10819 -6295 -7251 -2674 -2099 -5614 -5121 -6389 -2801
17366b801O83l366L50K698m24m56k02n49J157P36l588O22J879l712r18M97J792
$$ -2801 -2118 -5484 -5134 -2436 -2860 -3316 -3518 -4067 -2910 -2174 -5762 -5140 -3261 -6973 -7891 -7394 -5602
17349e602P81J435O861L599j759Q29M151n29j113M61j812n97m140m328K605j716
$$ -5602 -4821 -3386 3475 7074 5315 6144 10295 9766 8653 9114 7302 6705 2565 -1763 842 -874
17333h74r60q19j298N88N142k867m28p71M58J522j90j296L762J054Q25J543m204
$$ -874 -1834 -2653 -3951 -3363 1779 -1088 -1516 -2287 -1829 -307 -497 -1793 1969 3023 3848 5391 1187
17316A187K435P58j237J79J573j454q89j195K032L051n149l575j486k793k607
$$ 1187 3622 4380 3143 3322 4895 3441 2552 1357 3389 6440 1291 -2284 -3770 -6563 -9170
17301i170k115J423J335L585K608L273q54M935K295j180j071j971k894L031K075
$$ -9170 -11285 -9862 -8527 -4942 -2334 939 85 5020 7315 6135 5064 3093 199 3230 5305
17286E305r97n74L013K481k494n342j117j249J996M111l504p40N374K749j918
$$ 5305 4308 3734 6747 9228 6734 1392 275 -974 1022 5133 1629 889 6263 9012 7094
17271G094l519m946K01p07q95J113k855m899O27P529L224K577Q088j686m67J156
$$ 7094 3575 -1371 -1170 -1877 -2772 -1659 -4514 -9413 -8786 -1257 1967 4544 12632 10946 10479 11635
17255A1635K55L753n022j071K018j612l126o043k64Q64Q09J939K484k361j074
$$ 11635 11890 15643 10621 9550 11568 9956 6830 787 523 1387 2196 4135 6619 4258 3184
17240C184J649k060j801n611l083L37K630N1j14j216q31j755K360J90K820k157
$$ 3184 4833 2773 972 -4639 -7722 -7385 -4755 -4704 -4818 -6034 -6865 -8620 -6260 -6070 -3250 -5407
17224e407n038N6Mrl58l072j035M031K181L200l07k035j869m413J754N071O452
$$ -5407 -10445 -10389 -10385 -10394 -10752 -13824 -14859 -10828 -8647 -5447 -5754 -7789 -9658 -14071 -12317 -7246 -794
17207g94L96J259N89n008p261j47O908n31K253m34j337j901k295p48M970J608
$$ -794 -398 861 1450 -3558 -10819 -10966 -4058 -4589 -2336 -2770 -4107 -6008 -8303 -9051 -4081 -2473
17191b473k025r04M199N501k701m907k375p56l027M35L100R93Q83J634K393J912
$$ -2473 -4498 -5402 -1203 4298 1597 -3310 -5685 -6441 -9468 -9033 -5933 -4940 -4057 -2423 -30 1882
17175A882M844L35j847m136j017l518J508P89m193k12Q85J495L345O261O456l707
$$ 1882 6726 7061 5214 1078 61 -3457 -1949 -1160 -5353 -5565 -4680 -3185 160 6421 12877 9170
17159I170p838j452K470K380k471J189L225P79l284j534K21Q56O312N800M290
$$ 9170 1332 -120 2350 4730 2259 3448 6673 7452 4168 2634 2855 3711 10023 15823 20113
17144B0113k40k174J055J1641K527L493L735J0442J1600J3759K0971L0360N1454
$$ 20113 19873 17699 18754 30395 32922 36415 40150 50592 62192 75951 96922 127282 178736
17131A78736O3957O4232N5876M7928L3050N107k3808l8815m8395m8675l0732j4253
$$ 178736 242693 306925 362801 410729 443779 448886 425078 386263 337868 289193 258461 244208
17119B44208J0792K7544M5333M7481N0835L7493J8849l020l3669m9528n3994n7169
$$ 244208 255000 282544 327877 375358 426193 463686 482535 479515 445846 396318 342324 285155
17107B85155n5818m6301l5819k5051j3201j9670j5670r901o487k198m510n749
$$ 285155 229337 183036 147217 122166 108965 89295 73625 63724 57237 55039 50529 44780
17095D4780m795o568r294j569K382k496m386n259l700n72K281J990p95K067j324
$$ 44780 39985 33417 24123 22554 24936 22440 18054 12795 9095 8523 10804 12794 11999 14066 12742
17080A2742k288j814l70l247k542j73l015J123M038k14l239n967k984j557K374
$$ 12742 10454 8640 8270 5023 2481 2308 -707 416 4454 4240 1001 -4966 -7950 -9507 -7133
17065g133M310K835K429k547K718R18K74k697l917L47L834k261l516O04k627k087
$$ -7133 -2823 12 2441 -106 2612 3530 3804 1107 -2810 -2463 1371 -890 -4406 -3802 -6429 -8516
17049h516j492N84K782j782l198M315M972N69K646J310k604j912J758L82k762
$$ -8516 -10008 -9424 -6642 -8424 -11622 -7307 -2335 -1766 880 2190 -414 -2326 -568 -186 -2948
17034b948j830j048p34j498J682L524J619m87K681q45L382j552j776o449P17J176
$$ -2948 -4778 -5826 -6560 -8058 -6376 -2852 -1233 -1720 961 116 3498 1946 170 -6279 -5562 -4386
17018d386M124K184K297J331J406P0m523n555k279j517K905R45j413L740M570
$$ -4386 -262 1922 4219 5550 6956 7026 2503 -3052 -5331 -6848 -3943 -2998 -4411 -671 3899
17003C899n83n498m49k786n71K871O023K567p302r96j403N426j403m107j1n65
$$ 3899 3316 -2182 -2631 -5417 -5988 -3117 2906 5473 -1829 -2825 -4228 1198 -205 -4312 -4323 -4888
16987d888j213Q09M545M443k933k246n95L086L170P09k843j552P44k392M45l463
$$ -4888 -6101 -5292 -747 3696 763 -1483 -2078 1008 4178 4887 2044 492 1236 -1156 -711 -4174
16971d174j553L278M021n966O80K654Q85J051j744j907r36J612M148j26q54n472
$$ -4174 -5727 -2449 1572 -4394 -3714 -1060 -175 876 -868 -2775 -3711 -2099 2049 1923 1069 -4403
16955d403q93j968l607L989L270J337m471k308K473L299J185M14J628N582j061
$$ -4403 -5296 -7264 -10871 -6882 -3612 -2275 -6746 -9054 -6581 -3282 -2097 -1683 -55 5527 4466
16940D466n880j795N32L447n97J140j325k042j430K451n8k479j277k015K498J277
$$ 4466 -1414 -3209 -2677 770 173 1313 -12 -2054 -3484 -1033 -1091 -3570 -4847 -6862 -4364 -3087
16924c087J317j046l32j04l622p63L158j54k565p85k63M635m307j788k213j59
$$ -3087 -1770 -2816 -3148 -3252 -6874 -7637 -4479 -4633 -7198 -7983 -8246 -3611 -7918 -9706 -11919 -12078
16908a2078J735L995J999J958L990m374L850M141l807j335l656j135M675j747
$$ -12078 -10343 -6348 -4349 -2391 1599 -2775 1075 5216 1409 74 -3582 -4717 -42 -1789
16894a789p02k29p551J030M556l060n195j64L141P061j623l703j109k135L839
$$ -1789 -2491 -2720 -10271 -9241 -4685 -7745 -12940 -13104 -9963 -2902 -4525 -8228 -9337 -11472 -7633
16879g633j095k171L953J712K113o694n19k589K096J388m00P6j456L348J542K456
$$ -7633 -8728 -10899 -6946 -5234 -3121 -9815 -10334 -12923 -10827 -9439 -9839 -9763 -11219 -7871 -6329 -3873
16863c873j854n40l015L38j73K408L950K750kk350M76J22m843j684M759J206k482
$$ -3873 -5727 -6267 -9282 -8944 -9117 -6709 -2759 -9 -11 -2361 -1885 -1763 -6606 -8290 -3531 -2325 -4807
16846d807J209k400K53j396M145j560k888M026L100l373r44m5N707K39j145k306
$$ -4807 -3598 -5998 -5745 -7141 -2996 -4556 -7444 -3418 -318 -3691 -4635 -4680 1027 1266 121 -2185
16830b185l520n024k816M109M608M509K975p797k005M110K202M874J862R50L90
$$ -2185 -5705 -10729 -13545 -9436 -4828 -319 2656 -5141 -7146 -3036 -834 4040 5902 6852 7242
16815G242l641p313n209L9MJ6n31K433j036L275K637J150K714n281J32j150k626
$$ 7242 3601 -3712 -8921 -8882 -8878 -8862 -9393 -6960 -7996 -4721 -2084 -934 1780 -3501 -3369 -4519 -7145
16798g145K835K971l826J77k271k057k98Q52K784N546J874r76k291m350Q09K334
$$ -7145 -4310 -1339 -5165 -4988 -7259 -9316 -9614 -8762 -5978 -432 1442 466 -1825 -6175 -5366 -3032
16782c032k380q16n17L31n687m405O05L198L010M672K43K230J818J620K589j544
$$ -3032 -5412 -6228 -6745 -6414 -12101 -16506 -15901 -12703 -9693 -5021 -4778 -2548 -730 890 3479 1935
16766A935j521j045M23o47N84l750p719p6J976J095j801k28M574j522L395N453
$$ 1935 414 -631 -208 -855 -271 -4021 -11740 -11816 -9840 -8745 -10546 -10774 -6200 -7722 -4327 1126
16750A126j342K087k173m016j005J582N790m114q08l939J724n58R41k544k045
$$ 1126 -216 1871 -302 -4318 -5323 -3741 2049 -2065 -2873 -6812 -5088 -5646 -4705 -7249 -9294
16735i294R22l052Q62O215P049k172M725R58q683o325K318M82J066K887k570j728
$$ -9294 -8372 -11424 -10562 -4347 2702 530 5255 6213 -2470 -8795 -6477 -5995 -4929 -2042 -4612 -6340
16719f340k766k417J895N016k69k68J304R56R06K661J769l997r04K167K77Q54
$$ -6340 -9106 -11523 -9628 -4612 -4881 -5149 -3845 -2889 -1983 678 2447 -1550 -2454 -287 -10 844
16703H44O16P48m015J78j020K573M462L247m556m279L10L180L212l719p18o39
$$ 844 1460 2208 -1807 -1629 -2649 -76 4386 7633 3077 -1202 -892 2288 5500 1781 1063 424
16687D24K778k540j718j86J464l022m247J291J927J987K345J093j145J198l783
$$ 424 3202 662 -1056 -1242 222 -2800 -7047 -5756 -3829 -1842 503 1596 451 1649 -2134
16672b134k926J274P04Q80M21j540P23J913J211P5j066k400J162j008K062m6j801
$$ -2134 -5060 -3786 -3082 -2202 -1781 -3321 -2598 -685 526 601 -465 -2865 -1703 -2711 -649 -695 -2496
16655b496l624n293l072K821O100J993J515q74j365k779M12O559L402p44p10l480
$$ -2496 -6120 -11413 -14485 -11664 -5564 -3571 -2056 -2930 -4295 -7074 -6662 -103 3299 2555 1845 -1635
16639a635l016n84P14L833K848k64k326P46J19m321k604j924j974J996m2N404
$$ -1635 -4651 -5235 -4521 -688 2160 1896 -430 316 435 -3886 -6490 -8414 -10388 -8392 -8434 -3030
16623c030O427j355j711l930m56M88J059l248m092J008J874P04P79P45J510J079
$$ -3030 3397 2042 331 -3599 -4055 -3567 -2508 -5756 -9848 -8840 -6966 -6262 -5483 -4738 -3228 -2149
16607b149P42l008k107N73P33K40J025j289l04k953k207L426M248l88j922q67
$$ -2149 -1407 -4415 -6522 -5949 -5216 -4976 -3951 -5240 -5544 -8497 -10704 -7278 -3030 -3418 -5340 -6207
16591f207j59j1q14M40K692K262J261K355l508p762J953O341K133k926m56k314
$$ -6207 -6366 -6377 -7191 -6751 -4059 -1797 -536 1819 -1689 -9451 -7498 -1157 976 -1950 -2406 -4720
16575d720j93L161Q01k447l640J219j259K62N568m13k980l382K232M846l482j305
$$ -4720 -4913 -1752 -951 -3398 -7038 -5819 -7078 -6816 -1248 -1661 -4641 -8023 -5791 -945 -4427 -5732
16559e732K149J117q31R83J350M58k600J303n6L190J490k492j001O789J472p171
$$ -5732 -3583 -2466 -3297 -2314 -964 -506 -3106 -1803 -1859 1331 2821 329 -672 6117 7589 418
16543D18M43j902q56k413j098L208K006K31L853j472J70l983j097l138J441l838
$$ 418 861 -1041 -1897 -4310 -5408 -2200 -194 37 3890 2418 2588 -1395 -2492 -5630 -4189 -8027
16527h027J021K820N540k677j739L191J967P61j87K419L496m469n970q49L311
$$ -8027 -7006 -4186 1354 -1323 -3062 129 2096 2857 2670 5089 8585 4116 -1854 -2703 608
16512F08o5k379k392K833L511k39K013k028j710l40M950J446j749q6r02n049m257
$$ 608 543 -1836 -4228 -1395 2116 1877 3890 1862 152 -188 4762 6208 4459 4373 3471 -1578 -5835
16495e835J12L441J358M62J894J095r29m189J70O419J952m494o621j783K783J322
$$ -5835 -5723 -2282 -924 -462 1432 2527 1598 -2591 -2421 3998 5950 1456 -5165 -6948 -4165 -2843
16479b843j866J765N019j828j158k337P72P376l389o739J561M662l044K984J679
$$ -2843 -4709 -2944 2075 247 -911 -3248 -2476 4900 1511 -5228 -3667 995 -2049 935 2614
16464B614r474l228N187O050j820k287m013m539M981N796K081k374j205N482K512
$$ 2614 -6860 -10088 -4901 1149 -671 -2958 -6971 -11510 -6529 -733 1348 -1026 -2231 3251 5763
16449E763L289j640m774L86J1K128m31j675L616l74k351j367J925l241n264l703
$$ 5763 9052 7412 2638 3024 3035 5163 4732 3057 6673 6299 3948 2581 4506 1265 -3999 -7702
16433g702j482M894l070p07J611O21L621M523L44l921m020L262Q06K388L840L380
$$ -7702 -9184 -4290 -7360 -8067 -6456 -5835 -2214 2309 2653 -1268 -5288 -2026 -1220 1168 5008 8388
16417H388J444J693r56k029k658J149L556R66k941k887l848M864K328j370k269
$$ 8388 9832 11525 10569 8540 5882 7031 10587 11553 8612 5725 1877 6741 9069 7699 5430
16402E430l462L477J098j625J946k112j802n035m271J45K759o39n30L197k092
$$ 5430 1968 5445 6543 4918 6864 4752 2950 -2085 -6356 -6211 -3452 -4091 -4621 -1424 -3516
16387c516J366j087R15N8K18J457o84N11N61m572j713L275j30K98J693K276J781
$$ -3516 -2150 -3237 -2322 -2264 -2046 -589 -1273 -762 -201 -4773 -6486 -3211 -3341 -3043 -1350 926 2707
16370B707L671K54l8J169L33M94j43n062m260K980o74K158K904r99m282j553j183
$$ 2707 6378 6632 6594 7763 8096 8590 8447 3385 -875 2105 1431 3589 6493 5494 1212 -341 -1524
16353a524J067j826O87K462k51K253N044J505K36L89J32j668l889m26m09k62l86
$$ -1524 -457 -2283 -1596 866 615 2868 7912 9417 9653 10042 10174 8506 4617 4191 3782 3520 3134
16336C134O74n02j640J113K497k108k139j092k595l354K283K042k668K25l237
$$ 3134 3808 3306 1666 2779 5276 3168 1029 -63 -2658 -6012 -3729 -1687 -4355 -4130 -7367
16321g367j673N808L245Q73K16K300N53k604M963Q125L367j246m501k691m40J401
$$ -7367 -9040 -3232 13 886 1102 3402 3955 1351 6314 14439 17806 16560 12059 9368 8928 10329
16305A0329l329M07N160J869K32j353O64j96O69P48J251L29j832p766L8M327K566
$$ 10329 7000 7407 12567 14436 14668 13315 13979 13783 14452 15200 16451 16780 14948 7182 7220 11547 14113
16288A4113l212k565j945Q04K243q18J883K532q98p66j156J505O460j813l550
$$ 14113 10901 8336 6391 7195 9438 8620 10503 13035 12137 11371 10215 11720 18180 16367 12817
16273A2817m785j445K118J793m068m577k381K577M100K701J754k969m648k051
$$ 12817 8032 6587 8705 10498 6430 1853 -528 2049 6149 8850 10604 7635 2987 936
16259I36Q95O45j385k165J32j128m436L064K013m388j474P651K400j384r31k917
$$ 936 1831 2476 1091 -1074 -942 -2070 -6506 -3442 -1429 -5817 -7291 360 2760 1376 445 -2472
16243b472J651q45l012L593L961k084j123j05O11j786Q1o43m822p86L4j943N688
$$ -2472 -821 -1666 -4678 -1085 2876 792 -331 -436 175 -1611 -1530 -2173 -6995 -7781 -7747 -9690 -4002
16226d002N968J988q68M888k707o383m541J045K328J993K409q76P86M568j886
$$ -4002 1966 3954 3086 7974 5267 -1116 -5657 -4612 -2284 -291 2118 1242 2028 6596 4710
16211D710n25l550k407K252N018j918k058j668l009L046j36L83N304O228N23j664
$$ 4710 4185 635 -1772 480 5498 3580 1522 -146 -3155 -109 -245 138 5442 11670 12193 10529
16195A0529n346n796R91K587J261Q893r62l620n103k759j935k439j612k271L661
$$ 10529 5183 -613 378 2965 4226 13119 12157 8537 3434 675 -1260 -3699 -5311 -7582 -3921
16180c921N283m14L520k828j394O143J093k811k512k176K857n52j740K350m96
$$ -3921 1362 948 4468 1640 246 6389 7482 4671 2159 -17 2840 2288 548 2898 2402
16165B402j749L233p4o06k976m231J836L063j209M17N166K180K14M936R51o84
$$ 2402 653 3886 3812 3206 230 -4001 -2165 898 -311 106 5272 7452 7666 12602 13553 12869
16149A2869j325l040n518J238J693K730M378J482m057l478J23K134n715o955j857
$$ 12869 11544 8504 2986 4224 5917 8647 13025 14507 10450 6972 7095 9229 3514 -3441 -5298
16134e298M925N65k578k928L928N852J531M81k294k577j888K200o18p65J64j170
$$ -5298 -373 192 -2386 -5314 -1386 4466 5997 6478 4184 1607 -281 1919 1301 536 700 -470
16118d70K857O467L278m978j561k479j406M926K82m857n492j425M260M559p36
$$ -470 2387 8854 12132 7154 5593 3114 1708 6634 6916 2059 -3433 -4858 -598 3961 3225
16103C225P43K615Q88J869N12j817J214k475j971K856m071j581M410P93R14L526
$$ 3225 3968 6583 7471 9340 9852 8035 9249 6774 4803 7659 3588 2007 6417 7210 8124 11650
16087A1650K350M393j275m425J504M135j803O7R68j812k877j418k33J521J792
$$ 11650 14000 18393 17118 12693 14197 18332 16529 16596 17564 15752 12875 11457 11224 12745 14537
16072A4537l527J044J097p64L52m281k859L57K096o95k785k002n789k539j378
$$ 14537 11010 12054 13151 12387 12739 8458 5599 5956 8052 7357 4572 2570 -3219 -5758 -7136
16057g136L562M481O290L199p62k538J676j94J549J466K779j87m02J273m232j785
$$ -7136 -3574 907 7197 10396 9634 7096 8772 8578 10127 11593 14372 14185 13783 15056 10824 9039
16041I039J429j379l422m558P73P10j291J77m387k96J700M753j46K57j365K072
$$ 9039 10468 9089 5667 1109 1882 2592 1301 1478 -2909 -3205 -1505 3248 3102 3359 1994 4066
16025D066K069J950K974k63Q07l640K229n833o746m887K649J271N399M674J467
$$ 4066 6135 8085 11059 10796 11603 7963 10192 4359 -2387 -7274 -4625 -3354 2045 6719 8186
16010H186k293j829M560j203J121j421k023L712l565j041j117j402J07K283P621
$$ 8186 5893 4064 8624 7421 8542 7121 5098 8810 5245 4204 3087 1685 1792 4075 11696
15995A1696M885k466o096m013k408m4L972l248m767J262K620j964n66N517M419
$$ 11696 16581 14115 8019 4006 1598 1554 5526 2278 -2489 -1227 1393 -571 -1137 4380 8799
15980H799l690k927k49K557N336L889lN629L229M011J142k418K864L703p606o499
$$ 8799 5109 2182 1933 4490 9826 13715 13712 19341 22570 26581 27723 25305 28169 31872 24266 17767
15964A7767k619n057j469M350Q389K340J271Q55J440k738j255p18j201k970j037
$$ 17767 15148 10091 8622 12972 21361 23701 24972 25827 27267 24529 23274 22556 21355 18385 17348
15949A7348j653k248k500N38L74J212J137J393n256j50L398J217m358P790O90
$$ 17348 15695 13447 10947 11485 11859 13071 14208 15601 10345 10195 13593 14810 10452 18242 18932
15934A8932l114m649o97l696r90j654L87J935M393J576j231L16L874L835p267
$$ 18932 15818 11169 10472 6776 5786 4132 4519 6454 10847 12423 11192 11508 15382 19217 11950
15919A1950m597j550l034K89P948K925r35J345r68k744N402K534n135J85j882
$$ 11950 7353 5803 2769 3058 11006 13931 12996 14341 13373 10629 16031 18565 13430 13615 11733
15904A1733J763k925J720k760q00R8o0K562J992M116k154k184k573k009m36k4
$$ 11733 13496 10571 12291 9531 8731 8829 8769 11331 13323 17439 15285 13101 10528 8519 8083 8059
15888H059L300Q02J263J017O14J96l88K381L815K126n98n277n772j545n55j834
$$ 8059 11359 12161 13424 14441 15055 15251 14863 17244 21059 23185 22587 17310 11538 9993 9438 7604
15872G604O153M501R36K142L4n921J415N757O119J837N965P628L562R223J1085
$$ 7604 13757 18258 19194 21336 21370 15449 16864 22621 28740 30577 36542 44170 47732 56955 68040
15857F8040M462Q397J6752K6273M3650O2209R3063J03189P4471K9729j7148m3053
$$ 68040 72502 80899 97651 123924 167574 229783 322846 426035 500506 530235 513087 470034
15845D70034o2842p2457n9525l4232j4094P022K9337M7910O5754P6567O6559K7684
$$ 470034 407192 334735 275210 240978 226884 233906 263243 311153 376907 453474 520033 547717
15833E47717j9187m8404o8368q5792p7008n5363l2544j9851j1245q997q758j4220
$$ 547717 528530 480126 411758 325966 248958 193595 161051 141200 129955 120958 112200 97980
15821I7980q819j1019q513r878l660r6j464p089l902j590n040n18k144J24K8K849
$$ 97980 89161 78142 69629 59751 56091 55995 54531 47442 43540 41950 36910 36392 34248 34372 34400 37249
15805C7249J712r525p689M975M231K283K222l257o652j645M356k378l903k171
$$ 37249 38961 29436 21747 26722 30953 33236 35458 32201 25549 23904 28260 25882 21979 19808
15791A9808J547O35J426k75n038q45n49O954J606J207l211p06l083l402J289K18
$$ 19808 21355 21990 23416 23141 18103 17258 16709 23663 25269 26476 23265 22559 19476 16074 17363 17581
15775A7581R54L158L64j968J694j673l830J932J479L782M964n21j360k26k742
$$ 17581 18535 21693 22057 20089 21783 20110 16280 18212 19691 23473 28437 27916 26556 26330 23588
15760B3588k54J809k612l728p442k980K824M172K009P62j859k16n30r58L32k274
$$ 23588 23334 25143 22531 18803 11361 8381 11205 15377 17386 18148 16289 16073 15543 14585 14917 12643
15744A2643o132m796L080J163L949K542m01k091k621K629j11k944K992K564J004
$$ 12643 6511 1715 4795 5958 9907 12449 12048 9957 7336 9965 9854 6910 9902 12466 13470
15729A3470n92m331O841L538k205J173m464J470O303J650l671O77l430k220K801
$$ 13470 12878 8547 15388 18926 16721 17894 13430 14900 21203 22853 19182 19859 16429 14209 17010
15714A7010K478k702J67J677J750l977j90j648M658M70n888J11J512N652q55p996
$$ 17010 19488 16786 16953 18630 20380 16403 16213 14565 19223 19693 13805 13916 15428 21080 20225 12229
15698A2229K43J389K417P873K693m130p983L56N290K293K206j354k344j511j727
$$ 12229 12472 13861 16278 24151 26844 22714 14731 15087 20377 22670 24876 23522 21178 19667 17940
15683A7940j026m691k229O245Q00K287M110M644K118J303k797n486j903j906L446
$$ 17940 16914 12223 9994 16239 17039 19326 23436 28080 30198 31501 28704 23218 21315 19409 22855
15668B2855K568m52p76j175K005L302K766p88k487R02m987m231P27J423J565l746
$$ 22855 25423 24971 24195 23020 25025 28327 31093 30305 27818 28720 23733 19502 20229 21652 23217 19471
15652A9471j214O787M694L108l809P66M447J57n901n621j546J993Q76L684P79
$$ 19471 18257 25044 29738 32846 29037 29803 34250 34407 28506 22885 21339 23332 24208 27892 28671
15637B8671k055j885o60m309J39N015N530k4m182N546L785k110l955M264P036
$$ 28671 26616 24731 24071 19762 19901 24916 30446 30422 26240 31786 35571 33461 29506 33770 40806
15622D0806j694j391J707k08J027L836K656K411q16q80R79K04r54r790p644n555
$$ 40806 39112 37721 39428 39220 40247 44083 46739 49150 48334 47454 48433 48637 47683 37893 30249 24694
15606B4694Jq80Q84J646P054O871M146O16K698l42n661o139n694l536p99o228
$$ 24694 24695 23815 24699 26345 33399 40270 44416 45032 47730 47388 41727 35588 29894 26358 25559 19331
15590A9331j258J791N976R34O33J318O19O14l795J263O72L220M514R72L473M412
$$ 19331 18073 19864 25840 26774 27407 28725 29344 29958 26163 27426 28098 31318 35832 36804 40277 44689
15574D4689K867N255N906K010j2647j8649k1738j1723J218J1249Q222j10p129
$$ 44689 47556 52811 58717 60727 48080 29431 7693 -4030 -2812 8437 16659 16549 9420
15561I420j511P895R680R340J0564j116j7797j4876j174J4620J6861J0341l430
$$ 9420 7909 15804 25484 34824 45388 44272 26475 11599 10425 25045 41906 52247 48817
15548D8817k331R288R792K76r355j2782j0511m256J2563J1791J685k306K843N050
$$ 48817 46486 55774 65566 65842 56487 43705 33194 28938 41501 53292 54977 52671 55514 60564
15534F0564N619L416O096J101r782r090o568o235n22k879m622K483J625N8l316
$$ 60564 66183 69599 75695 76796 67014 57924 51356 45121 44599 41720 37098 39581 41206 41264 37948
15519C7948Q91k9L451R86l393q12O234J789j073r15l106L042L936m19M181M325
$$ 37948 38839 38810 42261 43247 39854 39042 45276 47065 45992 45077 41971 45013 48949 48530 52711 57036
15503E7036J017J2n935J508O343L766k710p161q015k332l807j153L447J43M201
$$ 57036 58053 58065 52130 53638 59981 63747 61037 53876 45861 43529 39722 38569 42016 42159 46360
15488D6360J576O182L023q76J201l459m772r176n093m319k470L008K477Q306Q848
$$ 46360 47936 54118 57141 56265 57466 54007 49235 40059 34966 30647 28177 31185 33662 41968 50816
15473E0816j23j97k669l455l117K04j951l134J655L742O648N015K197o320m519
$$ 50816 50693 50496 47827 44372 41255 41459 39508 36374 38029 41771 48419 53434 55631 49311 44792
15458D4792n634L489k680J709J843j455j174L290n846o785n050j833J481R450
$$ 44792 39158 42647 39967 41676 43519 42064 40890 44180 38334 31549 26499 24666 26147 35597
15444C5597J2775Q214J0886J3760Q696K091n08l30k819q194q686k747K788R739
$$ 35597 48372 56586 67472 81232 89928 92019 91511 91181 88362 80168 71482 68735 71523 81262
15430H1262J1747R388J8120J7228J0214k366J23N136M129R661N641K609n497j7871
$$ 81262 93009 102397 120517 137745 147959 145593 145716 150852 154981 164642 170283 172892 167395 149524
15416A49524j1859l317O819J227l073o922q481L154l108N305J2560M700m889j2464
$$ 149524 137665 134348 141167 142394 139321 132399 123918 127072 123964 129269 141829 146529 141640 129176
15402A29176j2648m917J534K617j477L737j850M680L772K080o39J223K930R437
$$ 129176 116528 111611 113145 115762 114285 118022 116172 120852 124624 126704 126065 127288 130218 139655
15388A39655P136M443M979R776J0068q57p951l318K19M996k2K550N925P938J1201
$$ 139655 146791 151234 156213 165989 176057 175200 167249 163931 164150 169146 169124 171674 177599 185537 196738
15373A96738J1320O674K530J494J960L724m246l050L128J0565J1612R832Q624
$$ 196738 208058 214732 217262 218756 220716 224440 220194 217144 220272 230837 242449 252281 260905
15360B60905O299J0135Q749P362N36J0273J6805J4096K0203K3485K4266J9529
$$ 260905 267204 277339 286088 293450 293986 304259 321064 335160 355363 378848 403114 422643
15348D22643J0915J5538J6104Q625J4292K1060J9456K2693J9066K9038L3745K9990
$$ 422643 433558 449096 465200 473825 488117 509177 528633 551326 570392 599430 633175 663165
15336F63165K7007L1073L5738L6819L8475M1105M9734N4494O6704P9596R6171
$$ 663165 690172 721245 756983 793802 832277 873382 923116 977610 1044314 1123910 1220081
15325A220081J22526J51774J74036J76616J42735J10974J06410J08010J11116
$$ 1220081 1342607 1494381 1668417 1845033 1987768 2098742 2205152 2313162 2424278
15316B424278J17631J45680K00901K58752L32869M40311N76944P34597Q92934
$$ 2424278 2541909 2687589 2888490 3147242 3480111 3920422 4497366 5231963 6124897
15307F124897J056348J286587J713694K455102L642542N473203Q155940J1835093
$$ 6124897 7181245 8467832 10181526 12636628 16279170 21752373 29908313 41743406
15299D1743406J5887258J7499813J3172608M638892k915493q446699j2617936
$$ 41743406 57630664 75130477 88303085 92941977 90026484 81579785 68961849
15292F8961849j3340390j0320183o037899k113252J447941N040809Q884793J2949925
$$ 68961849 55621459 45301276 39263377 37150125 38598066 43638875 52523668 65473593
15284F5473593J5269680J2120924M152221l534386r141514j3568419j5038642
$$ 65473593 80743273 92864197 97016418 93482032 84340518 70772099 55733457
15277E5733457j2762600r115345o115960m088268k815467k220812k047174j884001
$$ 55733457 42970857 33855512 27739552 23651284 20835817 18615005 16567831 14683830
15269A4683830j684749j493369j311055j152884j007736q68410p43149o43512
$$ 14683830 12999081 11505712 10194657 9041773 8034037 7165627 6422478 5778966
15261E778966n56450m68472l97553l31622k59416k12346j93427k00065k11624
$$ 5778966 5222516 4754044 4356491 4024869 3765453 3553107 3359680 3159615 2947991
15252B947991k21578k34168k24784k10243j84730j60244j42626j27595j11081
$$ 2947991 2726413 2492245 2267461 2057218 1872488 1712244 1569618 1442023 1330942
15243A330942r5412q3026o8462n7061m3969m0486m2340m7854n7250n8156o1132
$$ 1330942 1235530 1152504 1084042 1026981 983012 942526 900186 852332 795082 736926 675794
15232F75794o1422n2559l8755k9865k3754j0897o338n781n524j0558j1691p011
$$ 675794 614372 561813 523058 493193 469439 458542 452204 446423 440899 430341 418650 411639
15220D11639p574l875P721K2336M0134N2881P0862Q5983R2680Q4849N2522J2652
$$ 411639 404065 400190 407911 430247 470381 523262 594124 680107 772787 857636 910158 922810
15208I22810l3174o1980p0589o8001m4487k701K7479N2428P9667P4762M1787j985
$$ 922810 889636 827656 757067 689066 644579 641878 669357 721785 801452 876214 918001 916016
15196I16016m1102p1169r5066r7168q5932o8721n1922l2472k3781j5716j6469
$$ 916016 874914 803745 708679 611511 525579 456858 404936 372464 348683 332967 316498
15185C16498k0749k0431j3350j1999j2339p243n350J80N596N750M032k499q296
$$ 316498 295749 275318 261968 249969 237630 230387 225037 225217 230813 236563 240595 238096 229800
15172B29800l579N057Q614n347j6366j1507P26l513o447n008O078M242J294j5073
$$ 229800 226221 231278 239892 234545 218179 206672 207398 203885 197438 192430 198508 202750 204044 188971
15158A88971j3532Q86R612L666j2592j3066J862l798p907o775J095k04j591m341
$$ 188971 175439 176325 185937 189603 177011 163945 165807 162009 154102 147327 148422 148218 146627 142286
15144A42286k244l454j1563j1592o702n748M05P065L561J261O835M645o06o84
$$ 142286 140042 136588 125025 113433 106731 100983 101388 108453 112014 113275 120110 124755 124149 123465
15130A23465J004n303r261l944n412p182l952R89j893l701m909k750j267J911
$$ 123465 124469 119166 109905 105961 100549 93367 89415 90404 88511 84810 79901 77151 75884 77795
15116G7795m431k46K467J953O04o821k627q59j0688m452k613l598j703J167K30
$$ 77795 73364 73118 75585 77538 78142 71321 68694 67835 57147 52695 50082 46484 44781 45948 46178
15101D6178L008N233J111n485p177o629o246k323J076L576N53K093L343k367M402
$$ 46178 49186 54419 55530 50045 42868 36239 29993 27670 28746 32322 32875 34968 38311 35944 40346
15086D0346L298m502j472k135m284O65p17l204n4J049M250J336k24m562o70J16
$$ 40346 43644 39142 37670 35535 31251 31916 31199 27995 27941 28990 33240 34576 34352 29790 29120 29236
15070B9236l869K240J0146p31o941l410l413J492L478O65M17K645O10J156l023
$$ 29236 25367 27607 37753 37022 30081 26671 23258 24750 28228 28893 29310 31955 32565 33721 30698
15055C0698o092l170K824Q062J73n63J847P4k564K997P208M433L409L194L353
$$ 30698 24606 21436 24260 32322 32495 31932 33779 33853 31289 34286 41494 45927 49336 52530 55883
15040E5883M90p38j472n19l038k976K769L169P423N473N606m142p038J134J7571
$$ 55883 56373 55635 54163 53644 50606 47630 50399 53568 60991 66464 72070 67928 60890 62024 79595
15025G9595J7539k674j7914k4778j2444n003k070M700M125K566K923l739n656
$$ 79595 97134 94460 76546 51768 39324 34321 32251 36951 41076 43642 46565 42826 37170
15012C7170J2867J9661m471j4068j6136j6004j870o24j243k23k316k8L934L15
$$ 37170 50037 69698 65227 51159 35023 19019 17149 16525 15282 15059 12743 12715 16649 16964
14998A6964k961j475J197L590J066j560O62o07j479M469J464K972j26m881q894
$$ 16964 14003 12528 13725 17315 18381 16821 17483 16876 15397 19866 21330 24302 24176 19295 10401
14983A0401p389k696m765k547j983L839M843M628K926M092O025q75j1035p441
$$ 10401 3012 316 -4449 -6996 -8979 -5140 -297 4331 7257 11349 17374 16499 5464 -1977
14969a977k921j890r141k488P240k201J796M280L250L055k084j242m209j977k178
$$ -1977 -4898 -6788 -15929 -18417 -11177 -13378 -11582 -7302 -4052 -997 -3081 -4323 -8532 -10509 -12687
14954a2687M36M205L386q87j332j98O938L336k305n871k588l818k470O573J3897
$$ -12687 -12251 -8046 -4660 -5547 -6879 -7077 -139 3197 892 -4979 -7567 -11385 -13855 -7282 6615
14939F615L289k115n439m495j567j98o35J298M064j344q31l348K867p19J668N957
$$ 6615 9904 7789 2350 -2145 -3712 -3910 -4545 -3247 817 -527 -1358 -4706 -1839 -2558 -890 5067
14923E067k419j945k978r93j888N469K490l137K254j613k898M555L044J110j83
$$ 5067 2648 703 -2275 -3268 -5156 313 2803 -334 1920 307 -2591 1964 5008 6118 5935
14908E935l771m124J584J260J098l328l021q32l04K116K405J615l64j3k85K595
$$ 5935 2164 -1960 -376 884 1982 -1346 -4367 -5199 -5503 -3387 -982 633 269 256 -29 2566
14892B566K805M99o40k9l570J624O587M284r77k842k090m489P74J487K688R10
$$ 2566 5371 5870 5230 5201 1631 3255 9842 14126 13149 10307 8217 3728 4502 5989 8677 9587
14876I587J366j264k195k67k86N30k27K325J386j15j408J201k324q62j71J43k030
$$ 9587 10953 9689 7494 7227 6941 7471 7244 9569 10955 10840 9432 10633 8309 7447 7276 7419 5389
14859E389j398M160J964m327r05O98J648L596L729l439n0J734j848n79j138j359
$$ 5389 3991 8151 10115 5788 4883 5581 7229 10825 14554 11115 11065 12799 10951 10372 9234 7875
14843G875j894L675j036l943J425L08j606K416N699k32JK553l688o295l401p42
$$ 7875 5981 9656 8620 4677 6102 6410 4804 7220 12919 12687 12688 15241 11553 5258 1857 1115
14827A115n2M097R834L992j820o261l43O439l026m66R13p441o700j791k553J887
$$ 1115 1063 5160 14994 18986 17166 10905 10562 17001 13975 13509 14422 6981 281 -1510 -4063 -2176
14811b176J863k786j977j51M152O60O69Q4k343k240K326k343q36R72j540K713
$$ -2176 -313 -3099 -5076 -5227 -1075 -415 254 338 -2005 -4245 -1919 -4262 -5098 -4126 -5666 -2953
14795b953L032o97k319k478k369K279M456N371l5J282K714j50m329k228p89K927
$$ -2953 79 -618 -2937 -5415 -7784 -5505 -1049 4322 4287 5569 8283 8133 3804 1576 787 3714
14779C714L004J242l04r31n479j013L204K121R61j330q200j116N661Q666J804
$$ 3714 6718 7960 7656 6725 1246 233 3437 5558 6519 5189 -3011 -4127 1534 10200 12004
14764A2004J173p170l054J012O432J171l027L20K160M345j851K429N288R20N672
$$ 12004 13177 6007 2953 3965 10397 11568 8541 8861 11021 15366 13515 15944 21232 22152 27824
14749B7824J0137N880J0800J3199K0011L2450L7945N4904P9660R8054Q6289L7558
$$ 27824 37961 43841 54641 67840 87851 120301 158246 213150 292810 390864 477153 514711
14737E14711j0698l9392o5545p3222o0640l7350j5463K757J9757M6343O9301Q1111
$$ 514711 504013 464621 399076 325854 265214 227864 212401 215158 234915 281258 350559 431670
14725D31670P5948L7097r413m5499p0675q4841p2129n6450m1949k9878k1163j0885
$$ 431670 507618 544715 535302 489803 419128 334287 262158 205708 163759 133881 112718 101833
14713A01833m236k965r347j5261j0665k144o352r622q16k308m611l116p91j438
$$ 101833 97597 94632 85285 70024 59359 57215 50863 41241 40425 38117 33506 30390 29599 28161
14699B8161m412m715l051J668r68K37k435M602K281o93j418l200l372o798r5J735
$$ 28161 23749 19034 15983 17651 16683 16920 14485 19087 21368 20675 19257 16057 12685 5887 5792 7527
14683G527K029p3j954k701l616K047J823J573N202L086j239k441K265k030p95
$$ 7527 9556 9483 7529 4828 1212 3259 5082 6655 11857 14943 13704 11263 13528 11498 10703
14668A0703J42l457J484N102m911l310j216J710K444l33N92P05k367J986M094
$$ 10703 10845 7388 8872 13974 9063 5753 4537 6247 8691 8358 8950 9655 7288 9274 13368
14653A3368K509p355p079l67K899M038K439l484j604Mn230k462O127k833k548
$$ 13368 15877 8522 1443 1076 3975 8013 10452 6968 5364 5368 138 -2324 3803 970 -1578
14638a578L031M171R38j193k441J273K93J651L80K925r22l257p01M071j153R00
$$ -1578 1453 5624 6562 5369 2928 4201 4494 6145 6525 9450 8528 5271 4570 8641 7488 8388
14622H388K211m475m660J169J314P19J072j861k534M881M791j490l074J93%K167
$$ 8388 10599 6124 1464 2633 3947 4666 5738 3877 1343 6224 11015 9525 6451 6644 6644 8811
14606H811R08k791l517J102K170k120K30K235j271J55M351r01k886J904j869N6
$$ 8811 9719 6928 3411 4513 6683 4563 4793 7028 5757 5912 10263 9362 6476 8380 6511 6567
14590F567L602j72m091j170J608k161K531J582J361J434m247l222j932O1m55j880
$$ 6567 10169 9997 5906 4736 6344 4183 6714 8296 9657 11091 6844 3622 1690 1751 1296 -584
14574e84N039O413j616l304j857K114N113J529L31k203k528j214o745q25L306
$$ -584 4455 10868 9252 5948 4091 6205 11318 12847 13178 10975 8447 7233 488 -337 2969
14559B969k571k94N507J028P83L734l273j43q28K068l345O96M90j325j715r70
$$ 2969 398 104 5611 6639 7422 11156 7883 7740 6912 8980 5635 6331 6821 5496 3781 2811
14543B811j094m796j058J204J671O755K420L61J63J540m880k871J740J685J364
$$ 2811 1717 -3079 -4137 -2933 -1262 5493 7913 8274 8437 9977 5097 2226 3966 5651 7015
14528G015l567k11L700K858K293P24q54q49l74l429l95l892j711N51O1r60J053
$$ 7015 3448 3237 6937 9795 12088 12812 11958 11109 10735 7306 6911 3019 1308 1859 1920 960 2013
14511B013k829q66M039m88j793K841J249L006J756q66J159k037m017k942l484
$$ 2013 -816 -1682 2357 1869 76 2917 4166 7172 8928 8062 9221 7184 3167 225 -3259
14496c259L389L006K378j131M85J892l069j759m616p03J619M728O822k84P92q81
$$ -3259 130 3136 5514 4383 4868 6760 3691 1932 -2684 -3387 -1768 2960 9782 9498 10290 9409
14480I409l871l267j003K823J91N12l077J148J289M389l903M95L229m2j571Q79
$$ 9409 5538 2271 1268 4091 4282 4794 1717 2865 4154 8543 4640 5135 8364 8322 6751 7630
14464G630m420r24P73o50L727J56k37K892J069K732M396j089l893R24R83K030
$$ 7630 3210 2286 3059 2409 6136 6292 6055 8947 10016 12748 17144 16055 12162 13086 14069 16099
14448A6099N62M00k362o487o107K95L160J696l624K585K289J559k694l318k40
$$ 16099 16661 17061 14699 8212 2105 2400 5560 7256 3632 6217 8506 10065 7371 4053 3813
14433C813J865N874r53J060N064j754o087r17j656O10R68n461j239N687j86k891
$$ 3813 5678 11552 10599 11659 16723 14969 8882 7965 6309 6919 7887 2426 1187 6874 6688 3797
14417C797L311M275J262r39j448R65j118l466M256L306j702j995K171K716r26
$$ 3797 7108 11383 12645 11706 10258 11223 10105 6639 10895 14201 12499 10504 12675 15391 14465
14402A4465k391l418P41M65P66j216o66K336R00m109k157L277K675J062j569Q01
$$ 14465 12074 8656 9397 9862 10628 9412 8746 11082 11982 7873 5716 8993 11668 12730 11161 11962
14386A1962o65L26L862k923j431K602q15K9q22k08l316n158N44K133M011J973
$$ 11962 11297 11623 15485 12562 11131 13733 12918 12947 12125 11917 8601 3443 3987 6120 10131 12104
14370A2104n409J115j728K263K618j847j838j247J600n7j152K573k968j104K904
$$ 12104 6695 7810 6082 8345 10963 9116 7278 6031 7631 7574 6422 8995 6027 4923 7827
14355G827L938J988k784p79j909l869K707M778K40J615k63n86k759m383j58Q04
$$ 7827 11765 13753 10969 10190 8281 4412 7119 11897 12137 13752 13489 12903 10144 5761 5603 6407
14339F407l869J085J609L169Q049K05j866J4r79o024Q38P778l63O34r89j153o58
$$ 6407 2538 3623 5232 8401 16450 16655 14789 14803 13824 7800 8638 16416 16053 16687 15698 14545 13887
14322A3887r35K313L65j032J791k940O04k7J105K20Q94q859O38J028j295R97J498
$$ 13887 12952 15265 15630 14598 16389 13449 14053 14026 15131 15351 16245 7386 8024 9052 7757 8754 10252
14305A0252j0j979j84n70L82L056Q23q24L325L691j784k770q53l065j61J247j77
$$ 10252 10242 8263 8079 7509 7891 10947 11770 10946 14271 17962 16178 13408 12555 9490 9329 10576 10399
14288A0399J948o17l990K557K810o963k475N244j65n939J968L118L019M793M607
$$ 10399 12347 11730 7740 10297 13107 6144 3669 8913 8748 2809 4777 7895 10914 15707 20314
14273B0314o34l432m057l567J761K695n389p81M663L120k2m427J52L516J081Q415
$$ 20314 19680 16248 12191 8624 10385 13080 7691 6910 11573 14693 14671 10244 10396 13912 14993 23408
14257B3408O304o261p72k284o15l601m367j140j563k645N036l97k677m4J156j634
$$ 23408 29712 23451 22679 20395 19780 16179 11812 10672 9109 6464 11500 11103 8426 8382 9538 7904
14241G904J620J621m70j913K488K380J612J580p91l8l641m312k179N195M618j790
$$ 7904 9524 11145 10675 8762 11250 13630 15242 16822 16031 15993 12352 8040 5861 11056 15674 13884
14225A3884J218l248J404J882K03o398k54Q987K333o327n094k597M879N46m085
$$ 13884 15102 11854 13258 15140 15343 8945 8691 17678 20011 13684 8590 5993 10872 11418 7333
14210G333k349K779O570L93j582M278O444k074j015j140l526j100J021K083k002
$$ 7333 4984 7763 14333 14726 13144 17422 23866 21792 20777 19637 16111 15011 16032 18115 16113
14195A6113K201r61J142p30j284J329M02P51j749l63j886K765J087q15k61k819
$$ 16113 18314 17353 18495 17765 16481 17810 18212 18963 17214 16851 14965 17730 18817 18002 17741 14922
14179A4922K658O021j003l631m19m49k798K938L666r63J960J714K381m039k03
$$ 14922 17580 23601 22598 18967 18548 18099 15301 18239 21905 20942 22902 24616 26997 22958 22755
14164B2755N077J490j030k66K795k591m800L09J192l609M95L311L258l191k962
$$ 22755 27832 29322 28292 28026 30821 28230 23430 23739 24931 21322 21817 25128 28386 25195 22233
14149B2233M372K614l866R40L602L510q31K202L528R64j101l28J66q11L251l470
$$ 22233 26605 29219 25353 26293 29895 33405 32574 34776 38304 39268 38167 37839 38005 37194 40445 36975
14133C6975n712j317J667q70L279M745R59j546l009k120p54l386J902J218J451
$$ 36975 31263 29946 31613 30743 34022 38767 39726 38180 35171 33051 32297 28911 30813 32031 33482
14118C3482k405p17J237Q22J552j946n70M89k358L9j205l243J98N299j20J995
$$ 33482 31077 30360 31597 32419 33971 32025 31455 31944 29586 29625 28420 25177 25375 30674 30554 32549
14102C2549K281L562l393o236k9J472k71o98k546j792M302J434j316l484J03K060
$$ 32549 34830 38392 34999 28763 28734 30206 29935 29237 26691 24899 29201 30635 29319 25835 25938 27998
14086B7998j312J484k49L278N8l447K592R376K605l426N56j161l164m897j32Q76
$$ 27998 26686 28170 27921 31199 31257 27810 30402 39778 42383 38957 39513 38352 35188 30291 30159 31035
14070C1035P78l500J976N659M942m255o216J846j801p54j410j47j572M92o216
$$ 31035 31813 28313 30289 35948 40890 36635 30419 32265 30464 29710 28300 28153 26581 27073 20857
14055B0857o240O61L354L076m6J772K607j864K164M931j295o667n349j750K880
$$ 20857 14617 15278 18632 21708 21662 23434 26041 24177 26341 31272 29977 23310 17961 16211 19091
14040A9091M001Q713L388o672l933N51l09j830K229L748L2l533j858o74J572M92
$$ 19091 23092 31805 35193 28521 24588 25139 24830 23000 25229 28977 29009 25476 23618 22944 24516 25008
14024B5008Q8J871K099o88J915L094m94k277K058o784l517j026K138N59r96j968
$$ 25008 25096 26967 29066 28378 30293 33387 32893 30616 32674 25890 22373 21347 23485 24044 23048 21080
14008B1080r55K967M525l277J120L196j860k080o02K999M098M480p924r133m998
$$ 21080 20125 23092 27617 24340 25460 28656 26796 24716 24114 27113 31211 35691 27767 18634 13636
13993A3636r62J957j379l33K163J425M072K47o401K082O205N099j251n075m437
$$ 13636 12674 14631 13252 12919 15082 16507 20579 20826 14425 16507 22712 27811 26560 21485 17048
13978A7048j688L455Q30k165K249L998l39k50N31K17J605n78j979r64J166J857
$$ 17048 15360 18815 19645 17480 19729 23727 23388 23138 23669 23886 25491 24913 22934 21970 23136 24993
13962B4993m44K037K078o392l163k845K938O854p1j420L313k355l66K716K637
$$ 24993 24549 26586 28664 22272 19109 16264 19202 26056 25985 24565 27878 25523 25157 27873 30510
13947C0510j328R71m003j139l451k641Q6N810K443q73M99K27j640K16l52k056
$$ 30510 29182 30153 26150 25011 21560 18919 19005 24815 27258 26385 26884 27111 25471 25687 25335 23279
13931B3279J656j610L028K725k949N71p59k677m358L148O168J846j678J305k582
$$ 23279 24935 23325 26353 29078 26129 26700 25941 23264 18906 22054 28222 30068 28390 29695 27113
13916B7113n62N051K264l445n29n000J364K229m2K611M875K145J264n984j50M849
$$ 27113 26551 31602 33866 30421 29892 24892 26256 28485 28443 31054 35929 38074 39338 33354 33204 38053
13900C8053J499M06l636L59J262K297J684K874M641L237r98j452q351j387L446
$$ 38053 39552 39958 36322 36681 37943 40240 41924 44798 49439 52676 51678 50226 41875 40488 43934
13885D3934O072K936k482l040J159j896k198J219J605m21k460K463M71m743j431
$$ 43934 50006 52942 50460 47420 48579 46683 44485 45704 47309 46888 44428 46891 47362 42619 41188
13870D1188L437K192M982L0k302q65N154N567Q13m877N193l58j550k372O196n655
$$ 41188 44625 46817 51799 51829 49527 48662 53816 59383 60196 55319 60512 60154 58604 56232 62428 56773
13854E6773n327j717j069r36J653Q152M06J81M450k809L950L220j358o314l660
$$ 56773 51446 49729 48660 47724 49377 57529 57935 58116 62566 59757 63707 66927 65569 59255 55595
13839E5595K501m86L53l525k098r15l70k052J300K72l333r86oQ59p54N346J940
$$ 55595 58096 57610 57963 54438 52340 51425 51055 49003 50303 50575 47242 46256 46250 47109 46355 51701 53641
13822E3641o187m251j780j508K839KO34K830M620j583j165J650k951l370o63j705
$$ 53641 47454 43203 41423 39915 42754 42756 43390 46220 50840 49257 48092 49742 46791 43421 42758 41053
13806D1053j203M044P77j059r09Q17R89K419j684k6J802l616L666n43j286m266
$$ 41053 39850 43894 44671 43612 42703 43520 44509 46928 45244 45218 47020 43404 47070 46527 45241 40975
13790D0975J053J793K104K430k45l472m260L459j736k906L572J971O08k231k915
$$ 40975 42028 43821 45925 48355 48110 44638 40378 43837 42101 39195 42767 44738 45346 43115 40200
13775D0200R95K354l606k007N548M013n29k538L904j974n867n326K864N16l579
$$ 40200 41195 43549 39943 37936 43484 47497 46968 44430 48334 46360 40493 35167 38031 38547 34968
13760C4968k631K389K648K254J153R91j154J725O005m172k647J527j560m418l226
$$ 34968 32337 34726 37374 39628 40781 41772 40618 42343 48348 44176 41529 43056 41496 37078 33852
13745C3852k761L271N993L153j104M4L323m708j981j24m743k537N009J933j187
$$ 33852 31091 34362 40355 43508 42404 42448 45771 41063 39082 38958 34215 31678 36687 38620 37433
13730C7433N209M741J270L853j0j54l09Q19J306n466K481J66k724p22m282l776
$$ 37433 42642 47383 48653 52506 52496 52342 52033 52852 54158 48692 51173 51339 48615 47893 43611 39835
13714C9835m284R67N022J853n08n147r78l711k185J812M02l039k651Q01l313k206
$$ 39835 35551 36518 41540 43393 42885 37738 36760 33049 30864 32676 33078 30039 27388 28189 24876 22670
13698B2670O762Q543K779O65j621l327J254L409o25M474M298l46p16k836l5K588
$$ 22670 29432 37975 40754 41419 39798 36471 37725 41134 40509 44983 49281 48935 48219 45383 45348 47936
13682D7936j058L269k671m717P82N627J545J441P33J165k310l639o495k020J040
$$ 47936 46878 50147 47476 42759 43541 49168 50713 52154 52887 54052 51742 48103 41608 39588 40628
13667D0628n69J564j325j558l71J423J469J077M254k559p99K363J159p23J23k042
$$ 40628 40059 41623 40298 38740 38369 39792 41261 42338 46592 44033 43234 45597 46756 46033 46156 44114
13651D4114N219M945p519n809J349n678j401J296K369J853k329J060j623O509
$$ 44114 49333 54278 46759 40950 42299 36621 35220 36516 38885 40738 38409 39469 37846 44355
13637D4355P420K16o983l890j08L069K836K916J095o574m124K12L124N380K064
$$ 44355 51775 51991 45008 41118 41010 44079 46915 49831 50926 44352 40228 40440 43564 48944 51008
13622E1008M26M912N68j953K03J5j498k497J304J634m109n456k274L210L004Q39
$$ 51008 51434 56346 56914 54961 55164 55179 53681 51184 52488 54122 50013 44557 42283 45493 48497 49336
13606D9336k613j051k991L709L438o945j572J486j428K562N017k231n150j051
$$ 49336 46723 45672 42681 46390 49828 42883 41311 42797 41369 43931 48948 46717 41567 40516
13592D0516M179L154r9L256N913k630K901q32k248o210l41k750j517P303J856
$$ 40516 44695 47849 47750 51006 56919 54289 57190 56358 54110 47900 47559 44809 43292 50595 52451
13577E2451n35K156K836l507l423N184L830n66j621q81K5K517L628n04R81m814
$$ 52451 51916 54072 56908 53401 49978 55162 58992 58426 56805 55924 55949 58466 62094 61590 62571 57757
13561E7757m656l0K10R16R84P91K467P28L071m63j403J223m093k876J65K878j762
$$ 57757 53101 53071 53281 54197 55181 55972 58439 59167 62238 61775 60372 61595 57502 54626 54791 57669 55907
13544E5907n87J353k657p25J091J521O32j027J458J09j759j412J276J155j87M143
$$ 55907 55320 56673 54016 53291 54382 55903 56535 55508 56966 57075 55316 53904 55180 56335 56148 60291
13528F0291N965n138o104j481M087k36K818K782l105m269m216N040J476M104K506
$$ 60291 66256 61118 55014 53533 57620 57384 60202 62984 59879 55610 51394 56434 57910 62014 64520
13513F4520k826l79O880J670j458k877l254m217Q82j270K203J77K205n30O10j652
$$ 64520 61694 61315 68195 69865 68407 65530 62276 58059 58941 57671 59874 60051 62256 61726 62336 60684
13497F0684j757m460j60N077j947M791k54J167j397L090K839l96l741J476J498
$$ 60684 58927 54467 54307 59384 57437 62228 61974 63141 61744 64834 67673 67277 63536 65012 66510
13482F6510Q27K662l666m827L540M972K775l865k136J587K451J268P91l99K072
$$ 66510 67337 69999 66333 61506 65046 70018 72793 68928 66792 68379 70830 72098 72889 72490 74562
13467G4562J205m047n737J635J100O207O28L75l597k40o842M019N692Q46p359
$$ 74562 75767 71720 65983 67618 68718 74925 75553 75928 72331 72091 65249 69268 74960 75806 68447
13452F8447k042K96J267k64k82P26J296j456q95n67L790N757J968m31K079j586
$$ 68447 66405 66701 67968 67704 67422 68148 69444 67988 67093 66526 70316 76073 78041 77610 79689 78103
13436G8103n018k303L007P919l953j611n10n675j108K264k91j989n37Q39K65M200
$$ 78103 73085 70782 73789 81708 77755 76144 75634 69959 68851 71115 70824 68835 68298 69137 69402 73602
13420G3602J212N868M93l884j12O33M394J615j238q00L051Q35q14k637m03O10
$$ 73602 74814 80682 81175 77291 77179 77812 82206 83821 82583 81783 84834 85669 84855 82218 81815 82425
13404H2425M533l453l750N22j432J982L14K75l651l751Q659N368J523m442j144
$$ 82425 86958 83505 79755 80277 78845 80827 81141 81416 77765 74014 82673 88041 89564 85122 83978
13389H3978K256j314k561k141J321L299l441j177J899j814j672L306m94n62O796
$$ 83978 86234 84920 82359 80218 81539 84838 81397 80220 82119 80305 78633 81939 81445 80883 87679
13374H7679j032l745j116r99O71R06J561O408k035p82L45j676K540k206q406l311
$$ 87679 86647 82902 81786 80787 81458 82364 83925 90333 88298 87516 87861 86185 88725 86519 78113 74802
13358G4802N671K164P19J385l251j753j189k066L243M620R77K663M229j489l136
$$ 74802 80473 82637 83356 84741 81490 79737 78548 76482 79725 84345 85322 87985 92214 90725 87589
13343H7589n705m448P416L900J110k580O035K846j333j637j538j565l0r18K429
$$ 87589 81884 77436 84852 88752 89862 87282 93317 96163 94830 93193 91655 90090 90060 89142 91571
13328I1571O2J825l851J818L217P04j751K006k328M277k655L41K333k159J680
$$ 91571 91633 93458 89607 91425 94642 95346 93595 95601 93273 97550 94895 95236 97569 95410 97090
13313I7090L910J777k096J703K881O22k194k707O52j450o986j926m85j901N262
$$ 97090 101000 102777 100681 102384 105265 105887 103693 100986 101638 100188 93202 91276 90791 88890 94152
13298I4152L504j313j081L056M119q19k142L80R92j654J83Q46j322J467j713j053
$$ 94152 97656 96343 95262 98318 102437 101618 99476 99856 100848 99194 99377 100223 98901 100368 98655 97602
13282I7602j533M17L655j155q10l251Q61K943N550L042K342K829p165l953J959
$$ 97602 96069 96486 100141 98986 98176 94925 95786 98729 104279 107321 109663 112492 105327 101374 103333
13267A03333J393K469j147k369R76L412k564j855K854P438K76J402k155m875j386
$$ 103333 104726 107195 106048 103679 104655 108067 105503 103648 106502 113940 114216 115618 113463 108588 107202
13252A07202L828J106J941L379J396o275j84L175M789K442J584J208k409R58k328
$$ 107202 111030 112136 114077 117456 118852 112577 112393 115568 120357 122799 124383 125591 123182 124140 121812
13237A21812L350L980k031k173j527p5R92j714m971M32N94N460J1441Q774J4923
$$ 121812 125162 129142 127111 124938 123411 123336 124328 122614 117643 118075 118669 124129 135570 144344 159267
13222A59267J1735M526O126l65q830n847r204r412r705l92k183l694j351q135
$$ 159267 171002 175528 181654 181289 172459 166612 157408 147996 138291 137899 135716 132022 130671 122536
13208A22536P94L647L354j329j316r37j766R208M931l899J977J221k738l445o502
$$ 122536 123330 126977 130331 129002 127686 126749 124983 134191 139122 135223 137200 138421 135683 132238 125736
13193A25736k317O396J962J949o10j112r02J888K150R11k694k62N36l532L4j737
$$ 125736 123419 129815 131777 133726 133116 132004 131102 132990 135140 136051 133357 133095 133631 130099 130133 128396
13177A28396m98M944M341K002K671J208J175k938O25J252m063m431M46O422L640
$$ 128396 127898 132842 137183 139185 141856 143064 144239 141301 141926 143178 139115 134684 135130 141552 145192
13162A45192l828j076M226J362l359k64L077M412P520J379M880Q60m639l255J355
$$ 145192 141364 140288 144514 145876 142517 142253 145330 149742 157262 158641 163521 164381 159742 156487 157842
13147A57842j462j482P49m128n60n71R75p02m445jl879K874O886P740n26p821
$$ 157842 156380 154898 155647 151519 150959 150388 151363 150661 146216 146215 142336 145210 152096 159836 159310 151489
13131A51489J51N494N982Q32k335p72k992L69J450j910k24K375L95K16P01O36
$$ 151489 151640 157134 163116 163948 161613 160841 157849 158218 159668 157758 157534 159909 160304 160520 161221 161857
13115A61857N22J366l15K343N015L11L490J642J746l30K074j725k456L08N242
$$ 161857 162379 163745 163430 165773 170788 171099 174589 176231 177977 177647 179721 177996 175540 175848 181090
13100A81090Q83l60j834o539j202J744K186R034O08k585m814K611L765K487l458
$$ 181090 181973 181613 179779 173240 172038 173782 175968 185002 185610 183025 178211 180822 184587 187074 183616
13085A83616j783n722M53J494l822k566K158K242L653L211M06Q30L08J085N00
$$ 183616 181833 176111 176564 178058 174236 171670 173828 176070 179723 182934 183340 184170 184478 185563 186063
13070A86063L117j631l592L454Q529j141k141j791L311M39n327q646K223R530
$$ 186063 189180 187549 183957 187411 195940 194799 192658 190867 194178 194617 189290 180644 182867 192397
13056A92397J885m154j476k543L5L973P054L027L715J100l34Nj345j652K125n10
$$ 192397 194282 190128 188652 186109 186144 190117 197171 200198 203913 205013 204679 204684 203339 201687 203812 203302
13040B03302L933j990p954j880M378j322k320O114L437l661l167L89l86l012Q07
$$ 203302 207235 205245 197291 195411 199789 198467 196147 202261 205698 202037 198870 199259 198873 195861 196668
13025A96668L754l146o01N700K489r42j625J966J651J131m23M094K669l70j579
$$ 196668 200422 197276 196675 202375 204864 203922 202297 204263 205914 207045 206622 210716 213385 213015 211436
13010B11436n93M701K894N61L170L743M724N343P12J01P075O448Q82Q92o702m438
$$ 211436 210843 215544 218438 218999 222169 225912 230636 235979 236691 236792 243867 250315 251197 252089 245387 240949
12994B40949m09K980m486R7Q13J512J185k22J38N594k668P89J174L015j502j096
$$ 240949 240540 243520 239034 239131 239944 241456 242641 242419 242557 248151 245483 246272 247446 250461 248959 247863
12978B47863n144k843L104m046j883j400l302J793L136K039L688R656Q437M810
$$ 247863 242719 239876 242980 238934 237051 235651 232349 234142 237278 239317 243005 252661 261098 265908
12964B65908K155m240n420r92L737L551J9n450l641Q2J641k381J908j84P80L046
$$ 265908 268063 263823 258403 257411 261148 264699 264718 259268 255627 255709 257350 254969 256877 256693 257473 260519
12948B60519K716J518l559K702O717n04m097K810m80J99J722J171J763j831K896
$$ 260519 263235 264753 261194 263896 270613 270109 266012 268822 268342 268541 270263 271434 273197 271366 274262
12933B74262M062M510N362o72j13J934p921j314Q534J058j426k630m726J965K139
$$ 274262 278324 282834 288196 287524 287411 289345 281424 280110 288644 289702 288276 285646 280920 282885 285024
12918B85024m095L625R54L166P486L843k795O191O10j948O34L006M815m235o31
$$ 285024 280929 284554 285508 288674 296160 300003 297208 303399 304009 302061 302695 305701 310516 306281 305650
12903C05650O838M135O16N204L451Q30L507k491k328j057M019K144k053m007J698
$$ 305650 312488 316623 317239 322443 325894 326724 330231 327740 325412 324355 328374 330518 328465 324458 326156
12888C26156L893K523j555K518Q925J191N20L079K497j818L714k442m502R25J136
$$ 326156 330049 332572 331017 333535 342460 343651 344171 347250 349747 347929 351643 349201 344699 345624 346760
12873C46760K517Q27J654L286M847P151J220k346J125J911K360N755P266P563
$$ 346760 349277 350104 351758 355044 359891 367042 368262 365916 367041 368952 371312 377067 384333 391896
12859C91896M544J420Q65K73K706r07M092M603L735J376J896J969K295J115N785
$$ 391896 396440 397860 398725 398998 401704 400797 404889 409492 413227 414603 416499 418468 420763 421878 427663
12844D27663m439p931o512m573m458J345L871J311L776J435L85J969M318O176
$$ 427663 423224 415293 408781 404208 399750 401095 404966 406277 410053 411488 411873 413842 418160 424336
12830D24336N350K800K650k124q85N20J050QO270J0841Q879R633R744J2137P612
$$ 424336 429686 432486 435136 433012 432127 432647 433697 433705 439975 450816 459695 469328 479072 491209 498821
12815D98821N657l975n727j4118j0011l503l668J183M10K700K671O70N611O912
$$ 498821 504478 500503 494776 480658 470647 467144 463476 464659 465069 467769 470440 471110 476721 483633
12801D83633L782J0576J2233J7660K3219K6619L6266M5933N3481P2551J14026
$$ 483633 487415 497991 510224 527884 551103 577722 613988 659921 713402 785953 899979
12790H99979J63378K46526L69767N01368N40939M49276K86115L5723k43465m06525
$$ 899979 1063357 1309883 1679650 2181018 2721957 3171233 3457348 3493071 3249606 2843081
12780B843081m51481m38134l54047k39495j52574j01077p0427n7127n7063n3408
$$ 2843081 2391600 1953466 1599419 1359924 1207350 1106273 1035846 978719 921656 868248
12770H68248m4698l5911k5108k3459j9142j3594j3993r409j0435n927r452q847
$$ 868248 823550 787639 762531 739072 719930 706336 692343 682934 672499 666572 657120 648273
12758F48273m680o913r25J111j801l026m452j316m758j5r91N50O825L962L864
$$ 648273 643593 636680 635755 636866 635065 632039 627587 626271 621513 621498 620507 621057 627882 631844 635708
12743F35708O251O964J1996R692P584K624K380L388K398m556n242o239j063L154
$$ 635708 641959 648923 660919 670611 678195 680819 683199 686587 688985 684429 679187 672948 671885 675039
12729F75039P166j172k817M015Q396R749P062J204o414M24P950J2185P17n30O028
$$ 675039 682205 681033 678216 682231 690627 700376 707438 708642 702228 702652 710602 722787 723504 722974 729002
12714G29002Q398R521M905M624M682P715K536O788Q043P471Q115J1150O648J653
$$ 729002 737400 746921 751826 756450 761132 768847 771383 778171 786214 793685 801800 812950 819598 821251
12700H21251L024m978l136Q98N191M383P989K712R226J0965K932M593Q403M663
$$ 821251 824275 819297 816161 817059 822250 826633 834622 837334 846560 857525 860457 865050 873453 878116
12686H78116O944J646O710P829P106N999P587Q514O949P948K361K191O681J1001
$$ 878116 885060 886706 893416 901245 908351 914350 921937 930451 937400 945348 947709 949900 956581 967582
12672I67582J3872J0913J5664J2078J2197J6347J8863J7869J0095r01o898j5012
$$ 967582 981454 992367 1008031 1020109 1032306 1048653 1067516 1085385 1095480 1094579 1087681 1072669
12660A072669j9366k2394j9550q759q82N854J2601K5134J8379J3566J8942K2973
$$ 1072669 1053303 1030909 1011359 1002600 1001718 1007572 1020173 1045307 1063686 1077252 1096194 1119167
12648A119167J8151O970M925K957n79k23O534M108J751K719R906P914P383P879
$$ 1119167 1137318 1144288 1149213 1152170 1151591 1151368 1157902 1162010 1163761 1166480 1176386 1184300 1191683 1199562
12634A199562K176O524J0138J5916K0107J6061J8438K3557L1859L6381L5079K6899
$$ 1199562 1201738 1208262 1218400 1234316 1254423 1270484 1288922 1312479 1344338 1380719 1415798 1442697
12622A442697p800n8149o5386m9357k3588K2050K7978J9427L344k1104j7859J978
$$ 1442697 1434897 1376748 1311362 1262005 1238417 1260467 1288445 1307872 1311216 1290112 1272253 1274231
12610A274231K0209K8635L5071M2451N2625N4920N4863M7575M7121L3333L8219
$$ 1274231 1294440 1323075 1358146 1400597 1453222 1508142 1563005 1610580 1657701 1691034 1729253
12599A729253M9997K4713K1728r871k6048m9265n3757l7134j6130R310J5086J6209
$$ 1729253 1779250 1803963 1825691 1815820 1789772 1740507 1686750 1649616 1633486 1642796 1657882 1674091
12587A674091J6270J1587K0664K1234K0651K5720K6431J9567K0490K2245J8350
$$ 1674091 1690361 1701948 1722612 1743846 1764497 1790217 1816648 1836215 1856705 1878950 1897300
12576A897300K4043J8028J5468J9688J4225J8441K0151K0210J8936J8732J7662
$$ 1897300 1921343 1939371 1954839 1974527 1988752 2007193 2027344 2047554 2066490 2085222 2102884
12565B102884J5235J3555J1393Q806J7163J4461J9379K3651J9310J2648K2840
$$ 2102884 2118119 2131674 2143067 2151873 2169036 2183497 2202876 2226527 2245837 2258485 2281325
12554B281325K7882K8538K8558L2156K9584K4005J7717P244J0313J1875J1720
$$ 2281325 2309207 2337745 2366303 2398459 2428043 2452048 2469765 2477009 2487322 2499197 2510917
12543B510917K1945L0687M2770N1024N4434M1099L4688L3111K1953Q392M548J0954
$$ 2510917 2532862 2563549 2606319 2657343 2711777 2752876 2787564 2820675 2842628 2851020 2855568 2866522
12531B866522J9243L5492L8552L6181L9506L3345K4650K4964K2952J9747L0675
$$ 2866522 2885765 2921257 2959809 2995990 3035496 3068841 3093491 3118455 3141407 3161154 3191829
12520C191829L4168L4680L9468M7261M5402M2136L9971M8113M4737M6833M6691
$$ 3191829 3225997 3260677 3300145 3347406 3392808 3434944 3474915 3523028 3567765 3614598 3661289
12509C661289M1425M7881N0545M6663M4105L4707K9250J9107O817R490K2928M2677
$$ 3661289 3702714 3750595 3801140 3847803 3891908 3926615 3955865 3974972 3981789 3991279 4014207 4056884
12497D056884O5142Q1025R0431R7626J02090J00357Q5115Q0223P5367O9747O6769
$$ 4056884 4122026 4203051 4293482 4391108 4493198 4593555 4678670 4758893 4834260 4904007 4970776
12486D970776P0144P2489P5880Q0087Q4011R9382J14387J15551R9257O6953Q7830
$$ 4970776 5040920 5113409 5189289 5269376 5353387 5452769 5567156 5682707 5781964 5848917 5936747
12475E936747O3637O4801J17770P6278J10782P4931L6866K2027K3108L1325P2487
$$ 5936747 6000384 6065185 6182955 6259233 6370015 6444946 6481812 6503839 6526947 6558272 6630759
12464F630759R3112R8097R8013J02596R8886R8783J06504J13084J21374J30628
$$ 6630759 6723871 6821968 6919981 7022577 7121463 7220246 7326750 7439834 7561208 7691836
12454G691836J35192J36021J38357J39338J39050J42443J39520J40362J40868
$$ 7691836 7827028 7963049 8101406 8240744 8379794 8522237 8661757 8802119 8942987
12445H942987J45699J52343J57056J65219J72534J86890J85605J91052J95987
$$ 8942987 9088686 9241029 9398085 9563304 9735838 9922728 10108333 10299385 10495372
12436A0495372J94844J89264J86709J81741J84638J86587J97716K07455K11466
$$ 10495372 10690216 10879480 11066189 11247930 11432568 11619155 11816871 12024326 12235792
12427A2235792K23836K32173K38884K47432K53189K54384K55453K45967K45917
$$ 12235792 12459628 12691801 12930685 13178117 13431306 13685690 13941143 14187110 14433027
12418A4433027K55912K65697K85519K97761L05712L00820L03031L06520L00306
$$ 14433027 14688939 14954636 15240155 15537916 15843628 16144448 16447479 16753999 17054305
12409A7054305L03514L16718L34481L55949L81134M01068M18198M23815M12818
$$ 17054305 17357819 17674537 18009018 18364967 18746101 19147169 19565367 19989182 20402000
12400B0402000L98230L88221L73292L68675L74523L80037L77740L84768L88545
$$ 20402000 20800230 21188451 21561743 21930418 22304941 22684978 23062718 23447486 23836031
12391B3836031L90560L90715L82546L85687L86467L92277M11123M23472M37427
$$ 23836031 24226591 24617306 24999852 25385539 25772006 26164283 26575406 26998878 27436305
12382B7436305M53347M63069M78712M80290M87926N06353N13999N25935N38839
$$ 27436305 27889652 28352721 28831433 29311723 29799649 30306002 30820001 31345936 31884775
12373C1884775N49314N55869N77902O27751O79455P54450Q85854J055100J248906
$$ 31884775 32434089 32989958 33567860 34195611 34875066 35629516 36515370 37570470 38819376
12364C8819376J508086J842512K249874K819813L638456M752164O236976Q370695
$$ 38819376 40327462 42169974 44419848 47239661 50878117 55630281 61867257 70237952
12356G0237952J1703897J6934780K5028920L7324936N5050785P6015368Q7896560
$$ 70237952 81941849 98876629 123905549 161230485 216281270 292296638 380193198
12349C80193198P7569426N3661147K3877202j4391237m8569879o4896954p0960575
$$ 380193198 457762624 511423771 535300973 520909736 472339857 407442903 336482328
12342C36482328o8745480n5011003l7513754k4466445j7470560j3902262j2113980
$$ 336482328 267736848 212725845 175212091 150745646 133275086 119372824 107258844
12335A07258844j1635342j0676027r185325p678674o415669n409739m620755l995713
$$ 107258844 95623502 84947475 75762150 68083476 61667807 56258068 51637313 47641600
12327D7641600l481556l041760k663971k349930k072611j819122j610471j430230
$$ 47641600 44160044 41118284 38454313 36104383 34031772 32212650 30602179 29171949
12319B9171949j282308j168465j074682j008433r59055r15716q56791p93452p44198
$$ 29171949 27889641 26721176 25646494 24638061 23679006 22763290 21906499 21113047 20368849
12310B0368849o99630o60557o31119o01709n72699n36356n11231m96695m93550
$$ 20368849 19669219 19008662 18377543 17775834 17203135 16666779 16155548 15658853 15165303
12301A5165303m80983m72061m67804m47389m19244l82620l46885l15032k64076
$$ 15165303 14684320 14212259 13744455 13297066 12877822 12495202 12148317 11833285 11569209
12292A1569209k26730j96204j80614j78391j77711j89876k02619k07669j98218
$$ 11569209 11342479 11146275 10965661 10787270 10609559 10419683 10217064 10009395 9811177
12283I811177j86810j74933j61131j42576j35523j26768j19802j11398r1899o1660
$$ 9811177 9624367 9449434 9288303 9145727 9010204 8883436 8763634 8652236 8560337 8498677
12273H498677j2532O6797J89849L65636O10113Q38598Q08602M07696r3646m64009
$$ 8498677 8486145 8552942 8742791 9108427 9718540 10557138 11365740 11773436 11679790 11215781
12263A1215781p48257r03968q29666o17198m18414k90330k10248j72013j75850
$$ 11215781 10467524 9563556 8733890 8116692 7698278 7407948 7197700 7025687 6849837
12254F849837j85546j77381j67229j52308j40883j28938j18459j17276j07745
$$ 6849837 6664291 6486910 6319681 6167373 6026490 5897552 5779093 5661817 5554072
12245E554072j01399r4804q5787p4849p1489o5802o8846o4003o7052o2604o7458
$$ 5554072 5452673 5357869 5272082 5197233 5125744 5059942 4991096 4927093 4860041 4797437 4729979
12234D729979o9042o0207n1112m2017k8303j0868K948n141j5704l7889m4570m040
$$ 4729979 4660937 4600730 4549618 4507601 4479298 4468430 4471378 4466237 4450533 4412644 4368074 4364034
12222D364034j426m0079l6011p4217r0199j09919q2139p1071q7989r6547q5375
$$ 4364034 4362608 4322529 4286518 4212301 4122102 4012183 3930044 3858973 3770984 3674437 3589062
12211C589062p4719o8034o1666n2682m8827l9575l5880k3610k3134j2333K781
$$ 3589062 3514343 3446309 3384643 3331961 3283134 3243559 3207679 3184069 3160935 3148602 3151383
12200C151383O284N744N858p278k1494l8007n6558o4825o5748n5591n2832l8072
$$ 3151383 3157667 3163411 3169269 3161991 3140497 3102490 3045932 2981107 2915359 2859768 2806936 2768864
12188B768864k6375k7508k1623k2811k0313k8421k7977k4254k6399k3579k5544
$$ 2768864 2742489 2714981 2693358 2670547 2650234 2621813 2593836 2569582 2543183 2519604 2494060
12177B494060k1548k7082l1757k7685l3566l4384l8050l1467k6627l1352k6404
$$ 2494060 2472512 2445430 2413673 2385988 2352422 2318038 2279988 2248521 2221894 2190542 2164138
12166B164138k2960j6787j7278k7826l8647m1124m1473l6157k7733j0822k678
$$ 2164138 2141178 2124391 2107113 2079287 2040640 1999516 1958043 1921886 1894153 1883331 1880653
12155A880653j767J945M864k457j2439k3315k8795l0326k8226k2612j5704j3807
$$ 1880653 1878886 1880831 1885695 1883238 1870799 1847484 1818689 1788363 1760137 1737525 1721821 1708014
12143A708014q361p756r043r507o946m712j2875j8667k0292j8028j6461j8719
$$ 1708014 1699653 1691897 1682854 1673347 1666401 1661689 1648814 1630147 1609855 1591827 1575366 1556647
12131A556647k1308j4070j4056j1767j4289j1307p471r346j0902j3360r132j1994
$$ 1556647 1535339 1521269 1507213 1495446 1481157 1469850 1462379 1453033 1442131 1428771 1419639 1407645
12119A407645r243q830p012l073j684m584k209m663K42M118J388m025k946r478
$$ 1407645 1398402 1389572 1382560 1379487 1377803 1373219 1371010 1366347 1366589 1370707 1372095 1368070 1365124 1355646
12105A355646j4988j5765j1543r485j2551j7617j8493r229j127P812J5125J2029
$$ 1355646 1340658 1324893 1313350 1303865 1291314 1273697 1255204 1245975 1244848 1252660 1267785 1279814
12093A279814P107J827p400m878n220j1309j7019o170l956k541O36j07n818k1191
$$ 1279814 1286921 1288748 1281348 1276470 1271250 1259941 1242922 1236752 1232796 1230255 1230891 1230784 1224966 1203775
12079A203775j3098L5665L7052P250l863o0373r4950q3976o2489k2722K205O173
$$ 1203775 1190677 1226342 1263394 1270644 1266781 1206408 1111458 1027482 964993 942271 944476 950649
12067I50649M097k496j749l176l943r68o146j5974q348p000r243q399p219n763
$$ 950649 954746 952250 950501 947325 943382 942414 936268 920294 911946 904946 895703 887304 880085 874322
12053H74322j0705r776p649l284R57k381q956m568p212J871j311J017q5L109K449
$$ 874322 863617 853841 846192 842908 843865 841484 832528 827960 820748 822619 821308 822325 822240 825349 827798
12038H27798p241j8685k7579k7354l0672k8612k4214j9758j4634KJ83N740M508
$$ 827798 820557 801872 774293 746939 716267 687655 663441 643683 629049 629051 629234 634974 639482
12025F39482K618l287l89K755K613M347R05k381l356n389l384L38R06n43m685
$$ 639482 642100 638813 638424 641179 643792 648139 649044 646663 643307 637918 634534 634872 635778 635235 630550
12010F30550o974m483j999m438k685J586l91R52M886j666o229n486j626n568q951
$$ 630550 623576 619093 617094 612656 609971 611557 611166 612118 617004 615338 609109 603623 601997 596429 587478
11995E87478n237o318n423p870o103k983m069m869j171j339n276l282r711p000
$$ 587478 582241 575923 570500 562630 556527 553544 549475 544606 543435 542096 536820 533538 523827 516827
11981E16827k214J070L281L375J892K52L140L02j959j17l408n714q7L477l040
$$ 516827 514613 515683 518964 522339 524231 524483 527623 527925 525966 525849 522441 516727 516640 520117 517077
11966E17077m053m360o871o492r249q281j203J502l419n084j965k441O56J789
$$ 517077 513024 508664 501793 495301 486052 477771 476568 478070 474651 469567 467602 465161 465817 467606
11952D67606J828N024j419M480L604m338j749K589k346m728k276k463l246k933
$$ 467606 469434 474458 473039 477519 481123 476785 475036 477625 475279 470551 468275 465812 462566 459633
11938D59633m047m397j683K156k910p293j409P533M732l768m180J205M804J924
$$ 459633 455586 451189 449506 451662 448752 441459 440050 447583 452315 448547 444367 445572 450376 452300
11924D52300J099K461N223O368K607P864J2171J3065J6137J9253K8188M3114O1749
$$ 452300 453399 455860 461083 467451 470058 477922 490093 503158 519295 538548 566736 609850 671599
11911F71599R2252J44369K23818L35040M67585N34085M73592L27865R7157j85428
$$ 671599 763851 908220 1132038 1467078 1934663 2468748 2942340 3270205 3367362 3181934
11901C181934l81337m39580m39413l70320k60861j61274j07572q5630p0590o4158
$$ 3181934 2800597 2361017 1921604 1551284 1290423 1129149 1021577 935947 865357 801199
11891H01199o3271m8608l7413l1874l2693k8343k8073k6385k6578l1361k8738
$$ 801199 737928 689320 651907 620033 587340 558997 530924 504539 477961 446600 417862
11880D17862k1440j9170j3247q330K064N734M401K990j537o384n801p597m046
$$ 417862 396422 377252 364005 355675 357739 363473 367874 370864 369327 362943 357142 349545 345499
11867C45499o537m078L454M020L127J857m765r871k744l336k834m320l597m593
$$ 345499 338962 334884 338338 342358 345485 347342 342577 332706 329962 326626 323792 319472 315875 311282
11853C11282p257l015j721m436p490k409j880j701R65j694l216l772M245J388
$$ 311282 304025 301010 299289 294853 287363 284954 283074 281373 282338 280644 277428 273656 277901 279289
11839B79289O57J452R10M559J883l761o352J57k482k001k897j295K727M713N139
$$ 279289 279946 281398 282308 286867 288750 284989 278637 278794 276312 274311 271414 270119 272846 277559 282698
11824B82698Q272K803k832p028l694L725l072o331j939o315o882o224m136N111
$$ 282698 290970 293773 290941 283913 280219 283944 280872 274541 272602 266287 259405 253181 249045 254156
11810B54156O445K768K298l794n352J614l30k826l622k576j735p27Q36l43j0n555
$$ 254156 260601 263369 265667 261873 256521 258135 257805 254979 251357 248781 247046 246319 247155 246812 246802 241247
11794B41247j772K800K770N60l017NQ33j257R22Ll33k453k638j257K567L909j442
$$ 241247 239475 242275 245045 245605 242588 242593 243426 242169 243091 243094 242761 240308 237670 236413 238980 242889 241447
11777B41447k507Q89k276o709k561L347L509K66k220J620k557k801n95N303k84
$$ 241447 238940 239829 237553 230844 228283 231630 235139 235405 233185 234805 232248 229447 228852 234155 233871
11762B33871j208J256j518o272l535k330m021k492j009N75o24J503l211m312P937
$$ 233871 232663 233919 232401 226129 222594 220264 216243 213751 212742 213317 212693 214196 210985 206673 214610
11747B14610J908l315m554k075K499L738K131j488j359l169l123k307n167n863
$$ 214610 216518 213203 208649 206574 209073 212811 214942 213454 212095 208926 205803 203496 198329 192466
11733A92466K337J014j067p44j723K917l94J926k405m549k616N771J0832O422
$$ 192466 194803 195817 194750 194006 192283 195200 194806 196732 194327 189778 187162 192933 203765 210187
11719B10187n44m308J857P933K84n757o347j049J572n835j1089K993Q03k185n593
$$ 210187 209643 205335 207192 215125 215409 209652 203305 202256 203828 197993 186904 189897 190700 188515 182922
11704A82922n220K96l260l483J181q32J512J171j999q49n151K45k663j821M738
$$ 182922 177702 177998 174738 171255 172436 171604 173116 174287 172288 171439 166288 166533 163870 162049 166787
11689A66787L151j651j52j024M939J962k715n949m613M867K975J378K793K771
$$ 166787 169938 168287 168135 167111 172050 174012 171297 165348 160735 165602 168577 169955 172748 175519
11675A75519J657j06j202N53O19m485m792K15J412r46l850K365N543l74k199n731
$$ 175519 177176 177070 175868 176421 177040 172555 167763 167978 169390 168444 164594 166959 172502 172128 169929 164198
11659A64198o145k613L167N094j795o821k1K471l741L178l034K24N340j382K954
$$ 164198 158053 155440 158607 163701 161906 155085 155064 157535 153794 156972 153938 154162 159502 158120 161074
11644A61074K864p486j835j343m076J82r1K28j980M709K711p10J515m722o092
$$ 161074 163938 156452 154617 153274 149198 149380 149289 149517 147537 152246 154957 154247 155762 151040 144948
11629A44948m045j475K178N607L592J783j933M444M385p058l962n587J988N547
$$ 144948 140903 139428 141606 147213 150805 152588 150655 155099 159484 152426 148464 142877 144865 150412
11615A50412l65m111l875N419J128L140N224k09j187L000m350k564l073o246k820
$$ 150412 150047 145936 142061 147480 148608 151748 156972 156763 155576 158576 154226 151662 148589 142343 139523
11600A39523j94J010l116j290j514r64N908n013k374m96l83o171K002J809L4L8
$$ 139523 139329 140339 137223 135933 134419 133455 139363 134350 131976 131480 131097 124926 126928 128737 128771 128809
11584A28809P472J125l802k099L89J354j914L027N497J1504N636L016K212n231
$$ 128809 136281 137406 133604 131505 131894 133248 131334 134361 139858 151362 156998 160014 162226 156995
11570A56995n489m239j635q140n698J548j556j38J894N177m10Q85m330m14K64
$$ 156995 151506 147267 145632 137492 131794 133342 131786 131648 133542 138719 138309 139194 134864 134450 134714
11555A34714J062M25k728l82J895k255n529n037l899j932k6k140K427K591L909
$$ 134714 135776 136201 133473 133091 134986 132731 127202 122165 118266 116334 116308 114168 116595 119186 123095
11540A23095N890m581j8J845k487l853M81L562L233j126k937k020J722R08q32
$$ 123095 128985 124404 124386 126231 123744 119891 120372 123934 127167 126041 123104 121084 122806 123714 122882
11525A22882n01m518J034J827q79J388J124K648P15k095m134l890N85N776Q169
$$ 122882 122381 117863 118897 120724 119845 121233 122357 125005 125720 123625 119491 115601 116186 121962 130131
11510A30131J454o825l840k36l822J719l602J518M299j446m095K644J183J803
$$ 130131 131585 124760 120920 120684 116862 118581 114979 116497 120796 119350 115255 117899 119082 120885
11496A20885K528l36K430o88m34K099k682Q73N251P101N440K838M013o295n183
$$ 120885 123413 123077 125507 124819 124385 126484 123802 124675 129926 137027 142467 145305 149318 143023 137840
11481A37840k047K616j524l945n518k525l575l390J635k228k153O93J777K322
$$ 137840 135793 138409 136885 132940 127422 124897 121322 117932 119567 117339 115186 115879 117656 119978
11467A19978k340J177Q51K060L364k888O23k976k129M84r77o57l871j610M425
$$ 119978 117638 118815 119666 121726 125090 122202 122825 119849 117720 118204 117227 116570 112699 111089 115514
11452A15514j348M96J412J990N948P100J610k001L490N94p389p627r830m062k315
$$ 115514 114166 114662 116074 118064 124012 131112 132722 130721 134211 134805 127416 119789 109959 105897 103582
11437A03582N047R34K83l201K48L213L977O76K705J058k244j06j345k313n18j672
$$ 103582 108629 109563 109846 106645 106893 110106 114083 114759 117464 118522 116278 116172 114827 112514 111996 110324
11421A10324J609K992L759Q190L627r84o383n688j74L062J037j127k219j523O43
$$ 110324 111933 114925 118684 126874 130501 129517 123134 117446 117272 120334 121371 120244 118025 116502 117145
11406A17145N508j021k767j810n620k201L133J275M914j088l762K687K518n51
$$ 117145 122653 121632 118865 117055 111435 109234 112367 113642 118556 117468 113706 116393 118911 118360
11392A18360k723J800J100l868J245j975m063Q47o15j674M495J736k329m478k10
$$ 118360 115637 117437 118537 114669 115914 113939 109876 110723 110108 108434 112929 114665 112336 107858 107648
11377A07648N238J359R56Q88k152l233j42l824m543L34j296L707L147L119K560
$$ 107648 112886 114245 115201 116089 113937 110704 110562 106738 102195 102529 101233 104940 108087 111206 113766
11362A13766j367J735M380j461o63j792j395k026j753L308K984k559k138K824
$$ 113766 112399 114134 118514 117053 116390 114598 113203 111177 109424 112732 115716 113157 111019 113843
11348A13843j475L723N749J839q03p55l90K200l38O02K156K985R119M109L690
$$ 113843 112368 116091 121840 123679 122876 122121 121731 123931 123593 124195 126351 129336 138455 142564 146254
11333A46254L576n837m235m123m263l845Q43P036p64n972l572K521j759l016K511
$$ 146254 149830 143993 139758 135635 131372 127527 128370 135406 134642 128670 125098 127619 125860 122844 125355
11318A25355o217l806j674P16P225O611l427l754m75K694p52j054K15Q15l857
$$ 125355 119138 115332 113658 114374 121599 128210 124783 121029 120554 123248 122496 121442 121657 122472 118615
11303A18615K107K528m359P83k32K655J726J015J42k904m664L87L799J980k659
$$ 118615 120722 123250 118891 119674 119442 122097 123823 124838 124980 122076 117412 117799 121598 123578 120919
11288A20919J818r26N944K919j924K950K859k021j66k398k768q95K335m72M71
$$ 120919 122737 121811 127755 130674 128750 131700 134559 132538 132372 129974 127206 126311 128646 128174 128645
11273A28645K18M717J76j045j984k373k179o34N376K034k016k547j71M706N43
$$ 128645 128863 133580 133756 132711 130727 128354 126175 125541 130917 132951 130935 128388 128217 132923 133466
11258A33466N881L80K199J9j39J251Q79J44n58l082j268j260O821M520K265N618
$$ 133466 139347 139727 141926 141945 141806 143057 143936 144080 143522 140440 139172 137912 144733 149253 151518 157136
11242A57136M601M980K250L019L292K46l148j675J052l38j14q23n2L51K697l108
$$ 157136 161737 166717 168967 171986 175278 175524 172376 170701 171753 171415 171301 170478 170426 170777 173474 170366
11226A70366J107l33m688k402j361O85o15L64J888k858J58N707N68j30k047l734
$$ 170366 171473 171140 166452 164050 162689 163374 162759 163123 165011 162153 162311 168018 168586 168456 166409 162675
11210A62675J524M056J419m258j077M155k717Q10O625K696n207n569K029J867
$$ 162675 164199 168255 169674 165416 164339 168494 165777 166587 173212 175908 170701 165132 167161 169028
11196A69028R89M932J827j612L887r70k980J320N988K214K973Q538N267O380O187
$$ 169028 170017 174949 176776 175164 179051 178081 175101 176421 182409 184623 187596 196134 201401 207781 213968
11181B13968J0401J585M587P776N083L146L297k272m937m191o802o019n824j147
$$ 213968 224369 225954 230541 238317 243400 246546 249843 247571 242634 238443 231641 225622 219798 218651
11167B18651l870k076l063J334k8l002R5l029l570M72K87l782N202K795j34m07
$$ 218651 214781 212705 209642 210976 210948 207946 208041 205012 201442 201914 202201 198419 203621 206416 206282 205875
11151B05875M764J595L007J59r32k910l63J642k452K133K127m902m466M509N891
$$ 205875 210639 212234 215241 215400 214468 211558 211195 212837 210385 212518 214645 209743 205277 209786 215677
11136B15677L140J688K852L173M524L374R28N173J1683P914R08J887L321N166
$$ 215677 218817 220505 223357 226530 231054 234428 235356 240529 252212 260126 261034 262921 266242 271408
11122B71408J975j584q70p008p801l455k544n088n875L784M415L171M401K151
$$ 271408 273383 271799 270929 263921 256120 252665 250121 245033 239158 242942 247357 250528 254929 257080
11108B57080M803K718l50k499l252p236o660M31N553M340l117o386m770k960K375
$$ 257080 261883 264601 264251 261752 258500 251264 244604 245035 250588 254928 251811 245425 240655 237695 240070
11093B40070J361K663j41J15J225j106k170M346jj538K48K170l602k904K445L29
$$ 240070 241431 244094 243953 244068 245293 244187 242017 246363 246362 244824 245072 247242 243640 240736 243181 243510
11077B43510m114j064K281N182L858k785K1N377O242M359M383K552j008J157j089
$$ 243510 239396 238332 240613 245795 249653 246868 246889 252266 258508 262867 267250 269802 268794 269951 268862
11062B68862p909l395k864n619O55J044K531j161J100k400q362p028k097J232
$$ 268862 260953 257558 254694 249075 249730 250774 253305 252144 253244 250844 242482 235454 233357 234589
11048B34589k341k487N40O7J251K455R94l824m986l182l973j180J256J74k617
$$ 234589 232248 229761 230301 230368 231619 234074 235068 231244 226258 223076 219103 217923 219179 219353 216736
11033B16736k596m19R38L102K065J857p10q57o87K499M702o01n330m750l218m226
$$ 216736 214140 213721 214659 217761 219826 221683 220973 220116 219429 221928 226630 226029 220699 215949 212731 208505
11017B08505K684J25n158m881j182L88j558q89M597m710N24J920N54N52K314L885
$$ 208505 211189 211314 206156 201275 200093 200481 198923 198034 202631 197921 198445 200365 200919 201471 203785 207670
11001B07670L146k16L338J1900J3358J3662J4160J5904J4259Q336L581k704j4272
$$ 207670 210816 210600 213938 225838 239196 252858 267018 282922 297181 305517 309098 306394 292122
10988B92122j7140k0473j5539j5111j1149j0387n916o566o928p818p67j948N17
$$ 292122 274982 254509 238970 223859 212710 202323 196407 189841 182913 175095 174328 172380 172897
10975A72897P24j955q12K254J289j616N62K388K852L249N63l09m183p061p039
$$ 172897 173621 171666 170854 173108 174397 172781 173343 175731 178583 181832 182395 182086 177903 170842 163803
10960A63803q026k789k514j636M74R48j190J770j75k069l951l97K77j770k184
$$ 163803 155777 152988 150474 148838 149312 150260 149070 150840 150665 148596 144645 144248 144525 142755 140571
10945A40571o96J175k734j329M50l169j503p70l644p122r06K22N09k483r63K97
$$ 140571 139875 141050 138316 136987 137437 134268 132765 131995 128351 121229 120323 120545 121054 118571 117608 117905
10929A17905N360j685p683m474K038l121K883N518l688L36K34K415K606J80M232
$$ 117905 123265 121580 113897 109423 111461 108340 111223 116741 113053 113389 113623 116038 118644 118824 123056
10914A23056O312O758O369Q07j201j043l894K24q59o488n345l749j981j362p408
$$ 123056 129368 136126 142495 143302 142101 141058 137164 137388 136529 130041 124696 120947 118966 117604 110196
10899A10196j1194M108k75l63J727p37j867o044k327K028o049l994N058J604J505
$$ 110196 99002 103110 102835 102472 104199 103462 101595 95551 93224 95252 89203 85209 90267 91871 93376
10884I3376j973J190j420p533l747M274L21j158k392j859l022j748O531o37R05
$$ 93376 91403 92593 91173 83640 79893 84167 84488 83330 80938 79079 76057 74309 80840 80203 81108
10869H1108K16n7J922m256r09n665n119L099L408k08l139K781j92l794J126n97
$$ 81108 81324 81267 83189 78933 78024 72359 67240 70339 73747 73539 70400 73181 72989 69195 70321 69724
10853F9724j812k15K199k883J828m49k414m653p744K947j426k181J153N823N085
$$ 69724 67912 67697 69896 67013 68841 68392 65978 61325 53581 56528 55102 52921 54074 59897 64982
10838F4982J636l068Q37p1p504j534l69K894J912j117K552J172m315j949l526
$$ 64982 66618 63550 64387 64316 56812 55278 54909 57803 59715 58598 61150 62322 58007 56058 52532
10823E2532J621M378R49J125j06j749k126k765l512L205J937j661j668K654P405
$$ 52532 54153 58531 59480 60605 60499 58750 56624 53859 50347 53552 55489 53828 52160 54814 62219
10808F2219M218l908k887k811P21J642l948j776k011K560J994L355K073K198K58
$$ 62219 66437 62529 59642 56831 57552 59194 55246 53470 51459 54019 56013 59368 61441 63639 63897
10793F3897j032j848k275Q39M537j02L78L483N811N764j437J368k960m22n108
$$ 63897 62865 61017 58742 59581 64118 64016 64394 67877 73688 79452 78015 79383 76423 76001 70893
10778G0893k213k756k278m262n672j892k415J00L894M587K863j072O14l22l133
$$ 70893 68680 65924 63646 59384 53712 51820 49405 49505 53399 57986 60849 59777 60391 60069 56936
10763E6936m246l395L942l828r05L004k143l972K298j778J612m36K643M318l680
$$ 56936 52690 49295 53237 49409 48504 51508 49365 45393 47691 45913 47525 47089 49732 54050 50370
10748E0370l186O517j179J597M796O712K231L90O413j47N02l924n393m166k896
$$ 50370 47184 53701 52522 54119 58915 65627 67858 68248 74661 74514 75016 71092 65699 61533 58637
10733E8637J550K788J154k839j185M406K947J165K443k0J713J125M976K895K531
$$ 58637 60187 62975 64129 61290 60105 64511 67458 68623 71066 71046 72759 73884 78860 81755 84286
10718H4286N065Q276M270N292N907J9913J6795J7015K4322L5600N2887P6854J04293
$$ 84286 89351 97627 101897 107189 113096 133009 149804 166819 191141 226741 279628 356482 460775
10705D60775J03962O7894K8674K7875K1391K3575N5640J15285J94011K77914L28794
$$ 460775 564737 632631 661305 689180 710571 734146 789786 905071 1099082 1376996 1705790
10694A705790K94578J63605l771j43792k39559k71974k38529j71420j02351l7154
$$ 1705790 2000368 2163973 2160202 2016410 1776851 1504877 1266348 1094928 992577 955423
10684I55423O249K324j2677l0693l8364n3511p6274q6321q4105p6206p3617o6638
$$ 955423 961672 963996 951319 920626 882262 828751 752477 666156 582051 505845 432228 365590
10672C65590n5516l7827k9304k6968j6869j2152j1596j0763j4089q102n434k838
$$ 365590 310074 272247 242943 215975 199106 186954 175358 164595 150506 142404 136970 134132
10660A34132k838l203j779r82K261j431n031r72K802k703j549k113L22N64j454
$$ 134132 131294 128091 126312 125330 127591 126160 121129 120157 122959 120256 118707 116594 116916 117480 116026
10645A16026j089K592K056l633m742p352j4456q182j157n013j5N393L82k641L208
$$ 116026 114937 117529 119585 115952 111210 103858 89402 81220 80063 75050 75035 80428 80810 78169 81377
10630H1377M789O319M365l377k347l416o162l533l125p59o58n838m346J893k374
$$ 81377 86166 92485 96850 93473 91126 87710 81548 78015 74890 74131 73473 67635 63289 65182 62808
10615F2808k710k612k071j636L405M583N686M859J1599J7644J6267K0133J8222
$$ 62808 60098 57486 55415 53779 57184 61767 67453 72312 83911 101555 117822 137955 156177
10602A56177J674l06m430p789q725j0471j3257j1241r597m656P11p500p229l496
$$ 156177 157851 157545 153115 145326 136601 126130 112873 101632 92035 87379 88090 80590 73361 69865
10588F9865p07R89K357m034k824l124m073j817l623m494o420l150K076O788P338
$$ 69865 69158 70147 72504 68470 65646 62522 58449 56632 53009 48515 42095 38945 41021 47809 55147
10573E5147R35o909l352M379P807L230O282Q012O56N978O384Q835K777k89Q082
$$ 55147 56082 49173 45821 50200 58007 61237 67519 75531 76187 82165 88549 97384 100161 99872 107954
10558A07954O593J2773J9282K1523K7996M2398O0895R4200J49799K29025L43754
$$ 107954 114547 127320 146602 168125 196121 238519 299414 393614 543413 772438 1116192
10547A116192M85384N38922L62305O3851j55547l09158m33846m29453l08962j96781
$$ 1116192 1601576 2140498 2502803 2566654 2411107 2101949 1668103 1238650 929688 732907
10537G32907j24956p8445n4607m7221n1330m9651m0991l0696l0028k5316k0769
$$ 732907 607951 529506 474899 427678 376348 326697 285706 255010 224982 199666 178897
10526A78897j5298j3915j2644o993o548m803q320l489r303r664q596q610p987
$$ 178897 163599 149684 137040 130047 123499 118696 110376 106887 97584 87920 79324 70714 62727
10513F2727l374m632n411k162j690l361o963j49K755J1o848k016J540j609r22
$$ 62727 59353 54721 49310 47148 45458 42097 35134 34985 37740 37751 30903 28887 30427 28818 27896
10498B7896K158j0k965l455q36j541m616M08M486k171m26J721q80J241O508O818
$$ 27896 30054 30044 27079 23624 22788 21247 16631 17039 21525 19354 18928 20649 19769 21010 27518 34336
10482C4336L501O950P348J470l78o92n169k633m965p075J085P84l22m282l947
$$ 34336 37837 44787 52135 53605 53227 52535 47366 44733 39768 32693 33778 34562 34240 29958 26011
10467B6011l484m438j973L488j539P02n27K92K470k377l621l778P187J36k457
$$ 26011 22527 18089 16116 19604 18065 18767 18240 18532 21002 18625 15004 11226 18413 18549 16092
10452A6092K336L421O28L287O192P06k526j540m464L18q62n25K790N53j291N214
$$ 16092 18428 21849 22477 25764 31956 32662 30136 28596 24132 24450 23588 23063 25853 26406 25115 30329
10436C0329M908K280r69j968n612N53M153k155k637j482n242j999k916Q76n366
$$ 30329 35237 37517 36548 34580 28968 29521 33674 31519 28882 27400 22158 20159 17243 18119 12753
10421A2753l460l697J369L420J699K179P83k589R07M532L066k219j146K083J316
$$ 12753 9293 5596 6965 10385 12084 14263 15046 12457 13364 17896 20962 18743 17597 19680 20996
10406B0996k552J351R435N080Q342J6038K4311K6792J8438p97m423j0974j7264
$$ 20996 18444 19795 29230 34310 42652 58690 83001 109793 128231 127434 123011 112037 94773
10393I4773j9671j4525j3545o334n229m718J641K458N518K26o990m213L512K41
$$ 94773 75102 60577 47032 40698 35469 30751 32392 34850 40368 40594 33604 29391 32903 33144
10379C3144k661j029J849K272k152k652k352j856n27j462r47k477j170J681O51
$$ 33144 30483 29454 31303 33575 31423 28771 26419 24563 24036 22574 21627 19150 17980 19661 20312
10364B0312j934k945j860K756l288l318k206J50n13N8M742J274l660l506J92j025
$$ 20312 18378 15433 13573 16329 13041 9723 7517 7667 7154 7212 11954 13228 9568 6062 6254 5229
10348E229k805L532K309k861k729L565j82J255k703J504m626J432N694J745M915
$$ 5229 2424 5956 8265 5404 2675 6240 6058 7313 4610 6114 1488 2920 8614 10359 15274
10333A5274O654K408J763k533l173j523l43J19Q60m979k120n259j027Q44k586
$$ 15274 21928 24336 26099 23566 20393 18870 18527 18646 19506 14527 12407 7148 6121 6965 4379
10318D379J260L237o94L138J190q654l701J680k686l093N173N819m185L90J041
$$ 4379 5639 8876 8182 11320 12510 3856 155 1835 -851 -3944 1229 7048 2863 3253 4294
10303D294n140p342L115J429K041L916K06O043K442j836p77m56K741Q48K180m636
$$ 4294 -846 -8188 -5073 -3644 -1603 2313 2519 8562 11004 9168 8391 7935 10676 11524 13704 9068
10287I068j844j230M868M72k093N983J027J437j222o38J117n060q66K141L857
$$ 9068 7224 5994 10862 11334 9241 15224 16251 17688 16466 15828 16945 11885 11019 13160 17017
10272A7017O93q02O856Q195M924J538m88n86j626p827q124k566k843Q85M511Q142
$$ 17017 17710 16908 23764 31959 36883 38421 37933 37347 35721 27894 19770 17204 14361 15246 19757 27899
10256B7899K180j885L931J0350J1162O381J309k422q196n959p491j2330r297l91
$$ 27899 30079 28194 32125 42475 53637 60018 61327 58905 50709 44750 37259 24929 15632 15241
10242A5241J479O08J370Q3n44o0l032K320k190m046m302M614K182J431k871l909
$$ 15241 16720 17328 18698 18781 18237 18177 15145 17465 15275 11229 6927 11541 13723 15154 12283 8374
10226H374n03m731K562J42m023j925K869n2M23j074m13J084J050l132l055J827
$$ 8374 7871 3140 5702 5844 1821 -104 2765 2713 3136 2062 1649 2733 3783 651 -2404 -577
10210e77J212L669L035l494K220N250j06n302M359k837m564k60J115j490J340
$$ -577 635 4304 7339 3845 6065 11315 11209 5907 10266 7429 2865 2605 3720 2230 3570
10195C570q56m209j129K12M083K243j766M969L130k323l471m229Q96J023K803
$$ 3570 2714 -1495 -2624 -2412 1671 3914 2148 7117 10247 7924 4453 224 1120 2143 4946
10180D946N09m14l889j220M301Q41J290K739k905l765k906K076N417J456j43M96
$$ 4946 5455 5041 1152 -68 4233 5074 6364 9103 6198 2433 -473 1603 7020 8476 8333 8829
10164H829k021m89R29L68m470k529M296p20k175q54K64l734k917J432J489M973
$$ 8829 6808 6319 7248 7616 3146 617 4913 4193 2018 1164 1428 -2306 -5223 -3791 -2302 2671
10148B671l903l171J804N477K196j06J229k672k495L945j383l159m302J136p35
$$ 2671 -1232 -4403 -2599 2878 5074 4968 6197 3525 1030 4975 3592 433 -3869 -2733 -3468
10133c468n039J656N435J915j560L144N755m861o906K85L803J072l03J663K246
$$ -3468 -8507 -6851 -1416 499 -1061 2083 7838 2977 -3929 -3644 159 1231 928 2591 4837
10118D837N682K130L512q33j97m005o68n585k181o806N83Ml262P18n36K140K536
$$ 4837 10519 12649 16161 15328 15131 11126 10458 4873 2692 -4114 -3531 -3527 -6789 -6071 -6607 -4467 -1931
10101a931K455k02j016l016O58J522K812l910o05L603J718k75r42o41l652N71
$$ -1931 524 322 -694 -3710 -3052 -1530 1282 -2628 -3233 370 2088 1813 871 230 -3422 -2851
10085b851n15n206m822j163M834L907O782j448k853J991j236O97K707K993K133
$$ -2851 -3366 -8572 -13394 -14557 -9723 -5816 966 -482 -3335 -1344 -2580 -1883 824 3817 5950
10070E950P37l221l764m999j633K808K616p66n137J604N44n38Q05J927K871J522
$$ 5950 6687 3466 -298 -5297 -6930 -4122 -1506 -2272 -7409 -5805 -5261 -5799 -4994 -3067 -196 1326
10054A326l979o41J705L035j962K59K228l90q326N050J463k686n2O70J963j849
$$ 1326 -2653 -3294 -1589 1446 -516 -257 1971 1581 -6745 -1695 -232 -2918 -2970 -2300 -337 -2186
10038b186J349J716K70k244j680M281N892K238o25q88k790K18o169p762K979q06
$$ -2186 -837 879 1149 -1095 -2775 1506 7398 9636 9011 8123 5333 5551 -618 -8380 -5401 -6207
10022f207J478M867R9k661J506K012j046k519J566l2j429q95k5K573L438L66o84
$$ -6207 -4729 138 237 -2424 -918 1094 48 -2471 -905 -937 -2366 -3261 -3286 -713 2725 3091 2407
10005B407n200n846J508L943m31K147J494k104k761k694L595L614J471k59K535
$$ 2407 -2793 -8639 -7131 -3188 -3619 -1472 22 -2082 -4843 -7537 -3942 -328 1143 884 3419
9990C419L938M48l057k436l798J338J403o51L982J42k436J858K711O037J545O9
$$ 3419 7357 7805 4748 2312 -1486 -148 1255 604 4586 4728 2292 4150 6861 12898 14443 14512
9974A4512N250n53R19M595p36j0336m227q58n289l454P50K040k327l047o01L603
$$ 14512 19762 19209 20128 24723 23987 13651 9424 8566 3277 -177 573 2613 286 -2761 -3362 241
9958B41J147J700j292m400l779o00L125j369K256R80J929J93P38n65L341L857
$$ 241 1388 3088 1796 -2604 -6383 -6983 -3858 -5227 -2971 -1991 -62 131 869 304 3645 7502
9942G502p3n881j0324o863p36M492J0197K662l216j877j556M095o95q44J246l225
$$ 7502 7429 1548 -8776 -15639 -16375 -11883 -1686 976 -2240 -4117 -5673 -1578 -2273 -3117 -1871 -5096
9926e096l361N394M005k928k512p2j453j625L475K178J312K812m406n274L976
$$ -5096 -8457 -3063 942 -1986 -4498 -4570 -6023 -7648 -4173 -1995 -683 2129 -2277 -7551 -3575
9911c575L313K542j794n66M698K024K88j835o303k175K681O37j265J095l72l500
$$ -3575 -262 2280 486 -80 4618 6642 6930 5095 -1208 -3383 -702 -65 -1330 -235 -607 -4107
9895d107L361M112J53m577k37j171M6P34l053k742M615J905m926j964J738L322
$$ -4107 -746 3366 3519 -1058 -1295 -2466 -2420 -1686 -4739 -7481 -2866 -961 -5887 -7851 -6113 -2791
9879b791L443M612l062k511J482o59o05m057j772K016m111J193J12L169K584l76
$$ -2791 652 5264 2202 -309 1173 514 -91 -4148 -5920 -3904 -8015 -6822 -6710 -3541 -957 -1333
9863a333J022q92K378k882q06K792L587k901j073r13J794J999k924r030k010N855
$$ -1333 -311 -1203 1175 -1707 -2513 279 3866 965 -108 -1021 773 2772 -152 -9182 -11192 -5337
9847e337P969P1m772o029k122M741l2M20m8K842N406K65m396L02j200M862K448
$$ -5337 2632 2703 -2069 -8098 -10220 -5479 -5511 -5091 -5139 -2297 3109 3374 -1022 -720 -1920 2942 5390
9830E390l14K98l823M62P301L570J423Q65J211K983P77l800L986N95l413p840
$$ 5390 5076 5374 1551 2013 9314 12884 14307 15172 16383 19366 20143 16343 20329 20924 17511 9671
9814I671j402P18j778k886k265j65l711k118l027R48L641N816j894p438l409J466
$$ 9671 8269 8987 7209 4323 2058 1893 -1818 -3936 -6963 -6015 -2374 3442 1548 -5890 -9299 -7833
9798g833r03n1k050j976K793M405L967L867L80p86K03M96n978L980N492J183j282
$$ -7833 -8736 -8787 -10837 -12813 -10020 -5615 -1648 2219 2599 1813 2016 2512 -3466 514 6006 7189 5907
9781E907k80J195j701j028J928R93o42L85M385L969J329M491Q540J3124J4280
$$ 5907 5627 6822 5121 4093 6021 7014 6372 6757 11142 15111 16440 20931 29471 42595 56875
9766E6875K7417M5398O0499O3793L8790k30k5295m2056n1482m1347k8722k3820
$$ 56875 84292 129690 190189 253982 292772 292542 267247 225191 173709 132362 103640 79820
9754G9820j9343p529k423j880l985l489o244p416o276L68K32j61K516M55P180
$$ 79820 60477 52948 50525 48645 44660 41171 34927 27511 21235 21603 21835 21674 24190 24645 31825
9739C1825K953M636J0737J1354K825l889j0617j0675r135r432p247r299q99J204
$$ 31825 34778 39414 50151 61505 64330 60441 49824 39149 30014 20582 13335 4036 3137 4341
9725D341O115J132j285m487n349q032m85Q172N857J544L572M685O839J3055R365
$$ 4341 10456 11588 10303 5816 467 -7565 -8050 122 5979 7523 11095 15780 22619 35674 45039
9710D5039J933o940q505r547o047j739k066m310k506j168q98J343L42j297K077
$$ 45039 46972 40032 31527 21980 15933 14194 12128 7818 5312 4144 3246 4589 4931 3634 5711
9695E711k205l498K731l58j943n062L98P595Q300j280o026m715m493K982l203
$$ 5711 3506 8 2739 2381 438 -4624 -4226 3369 11669 10389 4363 -352 -4845 -1863 -5066
9680e066j434j267K773M644l211k074j025n447L395N706J964r122R77Q93J680
$$ -5066 -6500 -7767 -4994 -350 -3561 -5635 -6660 -12107 -8712 -3006 -1042 -10164 -9187 -8294 -6614
9665f614p82L87j062n80L383K153j89j235R19o18k816K107N835N68p047k814O002
$$ -6614 -7396 -7009 -8071 -8651 -5268 -3115 -3304 -4539 -3620 -4238 -7054 -4947 888 1456 -5591 -8405 -2403
9648b403k98j644m087J780L032l648j445k13M393M432m788k487K496J391k990
$$ -2403 -2701 -4345 -8432 -6652 -3620 -7268 -8713 -8926 -4533 -101 -4889 -7376 -4880 -3489 -6479
9633f479L780M486k344j899j428j724K1J3r23R09K561K886J856j823k214j703
$$ -6479 -2699 1787 -557 -2456 -3884 -5608 -5587 -5574 -6497 -5588 -3027 -141 1715 -108 -2322 -4025
9617d025J133J786K286n855K923M429j170J11K258J652O307J1651R098N960K311
$$ -4025 -2892 -1106 1180 -4675 -1752 2677 1507 1618 3876 5528 11835 23486 32584 38544 40855
9602D0855K66o210l229k326o793q163m628k865l864n778J546N771k864j467R19
$$ 40855 41121 34911 31682 29356 22563 14400 9772 6907 3043 -2735 -1189 4582 1718 251 1170
9587A170k405m375l947k742O84N410K260M851l96J408K097O422P147O416j889
$$ 1170 -1235 -5610 -9557 -12299 -11615 -6205 -3945 906 510 1918 4015 10437 17584 24000 22111
9572B2111m664O89m724J973K113J619L64o406k358l739l179Q959J3923K201O048
$$ 22111 17447 18136 13412 15385 17498 19117 19481 13075 10717 6978 3799 12758 26681 28882 34930
9557C4930P556J1048O161j644m581n294k90m347o601r422k822p386n085l734K112
$$ 34930 42486 53534 59695 58051 53470 48176 47886 43539 36938 27516 24694 17308 12223 8489 10601
9542A0601n588p815k756j853L497M464K639o42n25j736j922k562J218N610j295
$$ 10601 5013 -2802 -5558 -7411 -3914 550 3189 2547 2022 286 -1636 -4198 -2980 2630 1335
9527A335l113j548k575R43N359O17O530O746j100j928m540L268N389l580o69K777
$$ 1335 -1778 -3326 -5901 -4958 401 1018 7548 14294 13194 11266 6726 9994 15383 11803 11134 13911
9511A3911m151n719m825R74o020K329K963J391J888k435k593K89K662k348j400
$$ 13911 9760 4041 -784 190 -5830 -3501 -538 853 2741 306 -2287 -1998 664 -1684 -3084
9496c084k069q68L937l481m429J000J204L251K656J532r7l254l12L748K383K804
$$ -3084 -5153 -6021 -2084 -5565 -9994 -8994 -7790 -4539 -1883 -351 -448 -3702 -4014 -266 2117 4921
9480D921m66m915L996o8n831O03M209J846j738k044l263l046o28J743r62L724
$$ 4921 4455 -460 3536 3468 -2363 -1760 2449 4295 2557 513 -2750 -5796 -6424 -4681 -5643 -1919
9464a919k06r24k061j132J078p67L772L396k595n324r19r90l022J991K944k729
$$ -1919 -2125 -3049 -5110 -6242 -5164 -5931 -2159 1237 -1358 -6682 -7601 -8591 -11613 -9622 -6678 -9407
9448i407K370M80N77M667j54K545L428M183l025p786n948k420J462M323L716L053
$$ -9407 -7037 -6557 -5980 -1313 -1467 1078 4506 8689 5664 -2122 -8070 -10490 -9028 -4705 -989 2064
9432B064k306R72q228j1632K169M678L605M648k55P60k765m742k232J967k470
$$ 2064 -242 730 -7498 -19130 -16961 -12283 -8678 -4030 -4285 -3525 -6290 -11032 -13264 -11297 -13767
9417a3767j969Q607J2417N850R868Q215m008j2228j4535o125q045k010J534K195
$$ -13767 -15736 -7129 5288 11138 21006 29221 25213 12985 -1550 -7675 -15720 -17730 -16196 -14001
9403a4001N138Q066O109J2064R372j36l512j0988j0006o337n015k408L239O331
$$ -14001 -8863 -797 5312 17376 26748 26612 23100 12112 2106 -4231 -9246 -11654 -8415 -2084
9389b084K970L436m2k940n477j77j343k751l843K28O235j210M93Q20n39L689j963
$$ -2084 886 4322 4280 1340 -4137 -4314 -5657 -8408 -12251 -12023 -5788 -6998 -6505 -5685 -6224 -2535 -4498
9372d498O74N691L125m435k994n987k559K930O68L82J886q9J162k527n729p77
$$ -4498 -3824 1867 4992 557 -2437 -8424 -10983 -8053 -7385 -7003 -5117 -5206 -4044 -6571 -12300 -13077
9356a3077N250o31K251k976K808j177l860K41K628K168m27M390K274q69K01j659
$$ -13077 -7827 -8458 -6207 -9183 -6375 -7552 -11412 -11171 -8543 -6375 -6802 -2412 -138 -1007 -806 -2465
9340b465n247m799L457R04l60M070j529n58k315n13J626J036j018K009o99k003
$$ -2465 -7712 -12511 -9054 -8150 -8510 -4440 -5969 -6527 -8842 -9355 -7729 -6693 -7711 -5702 -6401 -8404
9324h404J888K29j594j878J172n90j706j090J7L055L790m41m316J981M888J067
$$ -8404 -6516 -6287 -7881 -9759 -8587 -9177 -10883 -11973 -11956 -8901 -5111 -5552 -9868 -7887 -2999 -1932
9308a932J843L374o20l761L237L621O10n21P27Q03M116j930l250j796o52l135
$$ -1932 -89 3285 2665 -1096 2141 5762 6372 5851 6578 7381 11497 9567 6317 4521 3869 734
9292G34l401m727k991N052M268l452J189K089Q109j784k870k117N016o261J447
$$ 734 -2667 -7394 -10385 -5333 -1065 -4517 -3328 -1239 6870 5086 2216 99 5115 -1146 301
9277C01K906P95k510n223p43m459j897O428M425k328J491N717J169n583k950R60
$$ 301 3207 4002 1492 -3731 -4474 -8933 -10830 -4402 23 -2305 -814 4903 6072 489 -2461 -1501
9261a501R48L206l379K891L925K40L81J68J768o446k932r76M90L005K45P54q43
$$ -1501 -553 2653 -726 2165 6090 6330 6711 6879 8647 2201 -731 -1707 -1217 1788 2033 2787 1944
9244A944J073l429n805l104M908l0k602n669K070K900M357O95o59j498l450K356
$$ 1944 3017 -412 -6217 -9321 -4413 -4443 -7045 -12714 -10644 -7744 -3387 -2692 -3351 -4849 -8299 -5943
9228e943j6j862J114M502J79o35K74J517J340L493n046J042l621n383M210L428
$$ -5943 -5959 -7821 -6707 -2205 -2026 -2661 -2387 -870 470 3963 -1083 -41 -3662 -9045 -4835 -1407
9212a407J47q84j486J586J0q28j747o46j32k781k384k298O039M355l285p01l443
$$ -1407 -1260 -2144 -3630 -2044 -2034 -2862 -4609 -5255 -5387 -8168 -10552 -12850 -6811 -2456 -5741 -6442 -9885
9195i885k960k433K30K853K364K492Q18J439M663M620l293n422k648Q27Q081J800
$$ -9885 -12845 -15278 -15048 -12195 -9831 -7339 -6521 -5082 -419 4201 908 -4514 -7162 -6335 1746 3546
9179C546n75l450j509J253j817k378J973j049o53L466K670l486r54j653K458J98
$$ 3546 2971 -479 -1988 -735 -2552 -4930 -2957 -4006 -4659 -1193 1477 -2009 -2963 -4616 -2158 -1960
9163a960j533k095N50P30j314L086N177k218n066L70k371j968R492j019k117L845
$$ -1960 -3493 -5588 -5038 -4308 -5622 -2536 2641 423 -4643 -4273 -6644 -8612 880 -139 -2256 1589
9147A589j497l636L069K04k097l289m22R66j838k958J713L728L399J154o50k295
$$ 1589 92 -3544 -475 -271 -2368 -5657 -6079 -5113 -6951 -9909 -8196 -4468 -1069 85 -565 -2860
9131b860k988j570K514m91N598m53l867K76j451M17k771n400L638L468k220L128
$$ -2860 -5848 -7418 -4904 -5395 203 -250 -4117 -3841 -5292 -4875 -7646 -13046 -9408 -5940 -8160 -5032
9115e032P151L264p17o262o819l830k401M764M62p09M798N20j932J642m001j554
$$ -5032 2119 5383 4666 -1596 -8415 -12245 -14646 -9882 -9420 -10129 -5331 -4811 -6743 -5101 -9102 -10656
9099a0656M427J502P98k594K164j098j072J305p23j745j359M789M743l774J152
$$ -10656 -6229 -4727 -3929 -6523 -4359 -5457 -6529 -5224 -5947 -7692 -9051 -4262 481 -3293 -2141
9084b141K666j794j294K678m354J420L883K629k684o66n893n058O000J908n71
$$ -2141 525 -1269 -2563 115 -4239 -2819 1064 3693 1009 343 -5550 -10608 -4608 -2700 -3271
9069c271J313n22k140M750J998n266n809M0L693m13K525r60n363N96M163k015
$$ -3271 -1958 -2480 -4620 130 2128 -3138 -8947 -8907 -5214 -5627 -3102 -4062 -9425 -8829 -4666 -6681
9053f681l39k329n15k349l411M776L934o99K472m47l868j195j62J431M143k320
$$ -6681 -7020 -9349 -9864 -12213 -15624 -10848 -6914 -7613 -5141 -5588 -9456 -10651 -10813 -9382 -5239 -7559
9037g559P29l193r40K458K935L213k216j542m068k647l693p8L053J875J782Q48
$$ -7559 -6830 -10023 -10963 -8505 -5570 -2357 -4573 -6115 -10183 -12830 -16523 -16601 -13548 -11673 -9891 -9043
9021i043P447K679MJ470J635j291l785k341r53m200o46M015J999K715J303l924
$$ -9043 -1596 1083 1087 2557 4192 2901 -884 -3225 -4178 -8378 -9024 -5009 -3010 -295 1008 -2916
9005b916q52J9M15Q54k44K124J340P06l742m826J626M944L082l719j357K565p72
$$ -2916 -3768 -3749 -3334 -2480 -2724 -600 740 1446 -2296 -7122 -5496 -552 2530 -1189 -2546 19 -753
8988g53m816M3o58K42j748j209j804J91o85p30K136P195M81K275n80j896j336
$$ -753 -5569 -5526 -6184 -5942 -7690 -8899 -10703 -10512 -11197 -11927 -9791 -2596 -2115 160 -420 -2316 -3652
8971c652Q74J099j010m849Q24L672l653q12j770L134j398L441J856L644l169K331
$$ -3652 -2778 -1679 -2689 -7538 -6714 -3042 -6695 -7507 -9277 -6143 -7541 -4100 -2244 1400 -1769 562
8955E62K018N49J633l893n190K108K921j775j695J492J662J233J022k481J589
$$ 562 2580 3129 4762 869 -4321 -2213 708 -1067 -2762 -1270 392 1625 2647 166 1755
8940A755K602L187r48m62l538m259L37q24m614J205k513o33J576K407N94j2j620
$$ 1755 4357 7544 6596 6134 2596 -1663 -1326 -2150 -6764 -5559 -8072 -8705 -7129 -4722 -4128 -4140 -5760
8923e760J214K312k306l107j805l331p848J939O453O688J962l079m067K601K792
$$ -5760 -4546 -2234 -4540 -7647 -9452 -12783 -20631 -18692 -12239 -5551 -3589 -6668 -10735 -8134 -5342
8908e342O82j881J378J166J791K056l027r033l586J164O7L311P573J815k202j541
$$ -5342 -4660 -6541 -5163 -3997 -2206 -150 -3177 -12210 -15796 -14632 -14565 -11254 -3681 -1866 -4068 -5609
8892e609k971j780p51r12j022m184J858J084L826O88j177L428M390P00l225K008
$$ -5609 -8580 -10360 -11111 -12023 -13045 -17229 -15371 -14287 -10461 -9773 -10950 -7522 -3132 -2432 -5657 -3649
8876c649k005n183L042M028O81n59M349M294o508p7j067J555J632k858J512m422
$$ -3649 -5654 -10837 -7795 -3767 -3086 -3645 704 4998 -1510 -1587 -2654 -1099 533 -2325 -813 -5235
8860e235k694J583k051k980K339j634k696Q16L099R78L257J276L890K685o641
$$ -5235 -7929 -6346 -8397 -11377 -9038 -10672 -13368 -12552 -9453 -8475 -5218 -3942 -52 2633 -4008
8845d008m866R92L429K992L336j049L664K626m805j958q21N001j548m136l129
$$ -4008 -8874 -7882 -4453 -1461 1875 826 4490 7116 2311 353 -468 4533 2985 -1151 -4280
8830d280j751J140k726K117P071k476m924K30R38Q145L204n199m875N235Q82n232
$$ -4280 -6031 -4891 -7617 -5500 1571 -905 -5829 -5599 -4661 3484 6688 1489 -3386 1849 2731 -2501
8814b501k18O06O447K738n762n051J609p20q02r33K417M112K402n921k121k259
$$ -2501 -2719 -2113 4334 7072 1310 -3741 -2132 -2852 -3654 -4587 -2170 1942 4344 -1577 -3698 -5957
8798e957P11K818M455n700l244P77M72Q88L002K913J75o42J559O05m351J73K217
$$ -5957 -5246 -2428 2027 -3673 -6917 -6140 -5668 -4780 -1778 1135 1310 668 2227 2832 -1519 -1346 871
8781H71J559k865K616N298o58N163L983k497n709k148o721n15K481n248r20j543
$$ 871 2430 -435 2181 7479 6821 11984 15967 13470 7761 5613 -1108 -1623 858 -4390 -5310 -6853
8765f853J617n996m574O126L441L21L0R56L27n818m413O2M927N285o65l742r66
$$ -6853 -5236 -11232 -15806 -9680 -6239 -5918 -5888 -4932 -4605 -10423 -14836 -14774 -9847 -4562 -5227 -8969 -9935
8748i935L598r79Q28K037n572l641j162N880J43J100M041J752l09j491J78J758
$$ -9935 -6337 -7316 -6488 -4451 -10023 -13664 -14826 -8946 -8803 -7703 -3662 -1910 -2219 -3710 -3532 -1774
8732a774J170L1L752N24J906L245l642p538l452K207K033j686n28l059j673M380
$$ -1774 -604 -573 3179 3703 5609 8854 5212 -2326 -5778 -3571 -1538 -3224 -3752 -6811 -8484 -4104
8716d104j666m094M041P436m84j341l595n429m77p2J365O489P256m010n423k777
$$ -4104 -5770 -9864 -5823 1613 1129 -212 -3807 -9236 -9713 -9785 -8420 -1931 5325 1315 -4108 -6885
8700f885K179M578L735K669p57K476P102m370q007l622k902k254o20N50N191Q64
$$ -6885 -4706 -128 3607 6276 5519 7995 15097 10727 2720 -902 -3804 -6058 -6678 -6128 -937 -73
8684g3L321q09m157k119l586j025K879M348R18k603o32K961k305l96l053l736
$$ -73 3248 2439 -1718 -3837 -7423 -8448 -5569 -1221 -303 -2906 -3538 -577 -2882 -3278 -6331 -10067
8668a0067J17j165n90Q86K839M647L88J201J168o29k736K404l028l57j132k713
$$ -10067 -9950 -11115 -11705 -10819 -7980 -3333 -2945 -1744 -576 -1205 -3941 -1537 -4565 -4922 -6054 -8767
8652h767L402o08l768J999L793J784j716m496L37M306k90P00r41j761j673k234
$$ -8767 -5365 -5973 -9741 -7742 -3949 -2165 -3881 -8377 -8040 -3734 -4024 -3324 -4265 -6026 -7699 -9933
8636i933M75J352L635M205N079j663N280P836O459j481m968k912K92K009j548
$$ -9933 -9458 -8106 -4471 -266 4813 3150 8430 16266 22725 21244 16276 13364 13656 15665 14117
8621A4117j890n271m050m692M86L031J291l896N47l464j476n59l488p59K537Q61
$$ 14117 12227 6956 2906 -1786 -1300 1731 3022 -874 -327 -3791 -5267 -5826 -9314 -10073 -7536 -6675
8605f675M43K725L309m243l710j888N28k037L982K926q75j431N639M043J072k886
$$ -6675 -6232 -3507 -198 -4441 -8151 -10039 -9511 -11548 -7566 -4640 -5515 -6946 -1307 2736 3808 922
8589I22k987j426n088n47J885M323L72J05j9k339k406K4L548k828l414M208K025
$$ 922 -2065 -3491 -8579 -9126 -7241 -2918 -2546 -2441 -2460 -4799 -7205 -7181 -3633 -6461 -9875 -5667 -3642
8572c642k960K162K195L658l171n618J273M552k22j653m77K742J683R55j851l097
$$ -3642 -6602 -4440 -2245 1413 -1758 -7376 -6103 -1551 -1773 -3426 -3903 -1161 522 1477 -374 -3471
8556c471n486l043k574l233L201K443O791K975L066M69n905k603O370N525M455
$$ -3471 -8957 -12000 -14574 -17807 -14606 -12163 -5372 -2397 669 1138 -4767 -7370 -1000 4525 8980
8541H980J266k422N503O603R15l890k199K59k732j980m289K44L05l695j100j117
$$ 8980 10246 7824 13327 19930 20845 16955 14756 15015 12283 10303 6014 6258 6563 2868 1768 651
8525F51N0K328j712o00M586K372k159o789L251O379p54l303n025R55L017L70l66
$$ 651 701 3029 1317 717 5303 7675 5516 -1273 1978 8357 7603 4300 -725 230 3247 3617 3251
8508C251L512J844K492j333j366q74L981J193K4l060l134M607K602L926M071J640
$$ 3251 6763 8607 11099 9766 8400 7526 11507 12700 12724 9664 6530 11137 13739 17665 21736 23376
8492B3376J279j13l090J513o404n411N67r55n379k1K13k358J739k635k725J58
$$ 23376 24655 24542 21452 22965 16561 11150 11717 10762 5383 5362 5575 3217 4956 2321 -404 -246
8476b46m425K211M278L925m7m423m775J395l435k924Q40L737J708J64j028L006
$$ -246 -4671 -2460 1818 5743 5696 1273 -3502 -2107 -5542 -8466 -7626 -3889 -2181 -2017 -3045 -39
8460c9K691j028j480o42J739n29j001m825K231N163M274k583M507L903K050R33
$$ -39 2652 1624 144 -498 1241 712 -289 -5114 -2883 2280 6554 3971 8478 12381 14431 15364
8444A5364j142k50n024n902r94r44K939P057j273l156k026j320l947k285o15j138
$$ 15364 14222 13972 8948 3046 2052 1108 4047 11104 9831 6675 4649 3329 -618 -2903 -3518 -4656
8428d656j997J169m296M8J126O66M898r09q05L241j022j697q75k925N470J721
$$ -4656 -6653 -5484 -9780 -9732 -8606 -7940 -3042 -3951 -4756 -1515 -2537 -4234 -5109 -8034 -2564 -843
8412h43q190o228M77M489J973m06L646L076n855l60k742j767K322L716J926M914
$$ -843 -9033 -15261 -14784 -10295 -8322 -8728 -5082 -2006 -7861 -8221 -10963 -12730 -10408 -6692 -4766 148
8396A48K833J585Q21o12m078j718j969k735K417N322J74M026n483n695R53K063
$$ 148 2981 4566 5387 4775 697 -1021 -2990 -5725 -3308 2014 2188 6214 731 -4964 -4011 -1948
8380a948K503N204J488m666J684Q4K321M10n68k241L338j126m553Q17k610l309
$$ -1948 555 5759 7247 2581 4265 4349 6670 7080 6512 4271 7609 6483 1930 2747 137 -3172
8364c172M750J274j920K917J72l254j645L724q99m368j98M719k244P6M716k799
$$ -3172 1578 2852 932 3849 4021 767 -878 2846 1947 -2421 -2619 2100 -144 -68 4648 1849
8348A849k012L37N066J227M04l524m964J389J505k250m236j21j846k631P157Q74
$$ 1849 -163 174 5240 6467 6871 3347 -1617 -228 1277 -973 -5209 -5330 -7176 -9807 -2650 -1776
8332a776K156L936R31L107M193j528J739o22k506l510M07L316J100n179k479m888
$$ -1776 380 4316 5247 8354 12547 11019 12758 12136 9630 6120 6527 9843 10943 5764 3285 -1603
8316a603k201N9l980K847r90l094J058Q662L400p93j585J007L002m030m486j252
$$ -1603 -3804 -3745 -7725 -4878 -5868 -8962 -7904 758 4158 3365 1780 2787 5789 1759 -2727 -3979
8300c979q68J638N169n7k230J338M364N259k601k273n35J169k779l983k90j324
$$ -3979 -4847 -3209 1960 1903 -327 1011 5375 10634 8033 5760 5225 6394 3615 -368 -658 -1982
8284a982L852M41J892k394l449j268m01L067j453M430p41R43K505l343j537l676
$$ -1982 1870 2311 4203 1809 -1640 -2908 -3309 -242 -1695 2735 1994 2937 5442 2099 562 -3114
8268c114m241K2P171N655l50l00k734K7O06J242k834k213J144k379k753K718J830
$$ -3114 -7355 -7333 -162 5493 5143 4843 2109 2136 2742 3984 1150 -1063 81 -2298 -5051 -2333 -503
8251e03J41j68k761J413N198q3j059j991j371j26k222m270J889L157p30L835J188
$$ -503 -362 -530 -3291 -1878 3320 3237 2178 187 -1184 -1310 -3532 -7802 -5913 -2756 -3486 349 1537
8234A537o63l143j077M96Q36j222l38k616m749M175P133O35m26l81p54J97m8l931
$$ 1537 874 -2269 -3346 -2850 -2014 -3236 -3574 -6190 -10939 -6764 369 1004 578 197 -557 -360 -408 -4339
8216d339n08N325L067J318J684j827p9k942l849j674m25j218J176m455J140K196
$$ -4339 -4847 478 3545 4863 6547 4720 4641 1699 -2150 -3824 -4249 -5467 -4291 -8746 -7606 -5410
8200e410o01M526k463l311m95J205M650O244L631l482n664o198J840K183L37K502
$$ -5410 -6011 -1485 -3948 -7259 -7754 -6549 -1899 4345 7976 4494 -1170 -7368 -5528 -3345 -3008 -506
8184e06P06l627k531O969j965k953J629M679j261m584j070J666j065j061K370
$$ -506 200 -3427 -5958 1011 -954 -3907 -2278 2401 1140 -3444 -4514 -2848 -3913 -4974 -2604
8169b604J24L62M999k800n136K417K708K880p79j385k960l480l527Q3J210j669
$$ -2604 -2480 -2118 2881 81 -5055 -2638 70 2950 2171 786 -2174 -5654 -9181 -9098 -7888 -9557
8153i557J900M499J131N15K66l840j868O71j098k263o51J935n16N089N123K632
$$ -9557 -7657 -3158 -2027 -1512 -1246 -5086 -6954 -6283 -7381 -9644 -10295 -8360 -8876 -3787 1336 3968
8137C968j374n221j402J911k23k294l200L096J610M118k758m29l107m091J327
$$ 3968 2594 -2627 -4029 -2118 -2341 -4635 -7835 -4739 -3129 989 -1769 -2198 -5305 -9396 -8069
8122h069K426K195N90m761j075M08J232j961j581J715m237J070N805J155k387
$$ -8069 -5643 -3448 -2858 -7619 -8694 -8286 -7054 -9015 -10596 -8881 -13118 -12048 -6243 -5088 -7475
8107g475K23L251k574Q69K860j311J752j122l849p07j56O710K320l729K099J771
$$ -7475 -7252 -4001 -6575 -5706 -2846 -4157 -2405 -3527 -7376 -8083 -8239 -1529 791 -2938 -839 932
8091I32k427l078K843j744K48J577j209o65j752K070R66J249K220J122N62J795
$$ 932 -1495 -4573 -1730 -3474 -3226 -1649 -2858 -3523 -5275 -3205 -2239 -990 1230 2352 2914 4709
8075D709m016P1J570m52k5k195l765l375k125m252j277R66O764K280K080q1J443
$$ 4709 693 764 2334 1882 1857 -338 -4103 -7478 -9603 -13855 -15132 -14166 -7402 -5122 -3042 -3123 -1680
8058a680j422p6K16l070j28k563k022J512L973J340n338n492K429O751j529o58
$$ -1680 -3102 -3178 -2962 -6032 -6160 -8723 -10745 -9233 -5260 -3920 -9258 -14750 -12321 -5570 -7099 -7757
8042g757K764J289K57k143j272J527l89j206M31L334K109j401k015R2L091k623
$$ -7757 -4993 -3704 -3447 -5590 -6862 -5335 -5724 -6930 -6499 -3165 -1056 -2457 -4472 -4380 -1289 -3912
8026c912l602K595l91K261L29l24J478j384P76K907k621j714l496j29L494N73
$$ -3912 -7514 -4919 -5310 -3049 -2720 -3044 -1566 -2950 -2174 733 -1888 -3602 -7098 -7227 -3733 -3160
8010c160k173m390l637p3K261L118L582M146O487K981r46k78L52l031m948m235
$$ -3160 -5333 -9723 -13360 -13433 -11172 -8054 -4472 -326 6161 9142 8196 7918 8270 5239 291 -3944
7994c944J631P90M460j523k637l367l893l720j171n6J574j446N85O023J821L22
$$ -3944 -2313 -1523 2937 1414 -1223 -4590 -8483 -12203 -13374 -13430 -11856 -13302 -12717 -6694 -4873 -4551
7978d551o23M713Q33n22K100J395n685m255k149k99O37l389m325M098P461J467
$$ -4551 -5174 -461 372 -150 1950 3345 -2340 -6595 -8744 -9043 -8406 -11795 -16120 -12022 -4561 -3094
7962c094j916K8k408j561j243K290j063j717j14l804K462M419l06k408J821k874
$$ -3094 -5010 -4982 -7390 -8951 -10194 -7904 -8967 -10684 -10798 -14602 -12140 -7721 -8027 -10435 -8614 -11488
7946a1488K800O671M67J16m98j141k72O899L68m341p14o587n88O556M854k659
$$ -11488 -8688 -2017 -1550 -1434 -1932 -3073 -3345 3554 3922 -419 -1133 -7720 -8308 -1752 3102 443
7930D43m347L892M213k478k559k960j016l975K947J143M049L308l014O23l763
$$ 443 -3904 -12 4201 1723 -836 -3796 -4812 -8787 -5840 -4697 -648 2660 -354 269 -3494
7915c494K979K528j469j052l03K515O03K112k568J550r31k45l74k208k882j62
$$ -3494 -515 2013 544 -508 -811 1704 2307 4419 1851 3401 2470 2225 1851 -357 -3239 -3401
7899c401o72O52j045l381j169K873K926n79K460K045k699j020j176N272n08o88
$$ -3401 -4073 -3421 -4466 -7847 -9016 -6143 -3217 -3796 -1336 709 -1990 -3010 -4186 1086 578 -110
7883a10K331q4j390k584l269k639M30K00M98L021O265j531l661j206J172K146
$$ -110 2221 2137 747 -1837 -5106 -7745 -7315 -7115 -6617 -3596 2669 1138 -2523 -3729 -2557 -411
7867d11l702N156M999l53j172n733n563J70P849K521K048K47k85k795q80O30l00
$$ -411 -4113 1043 6042 5689 4517 -1216 -6779 -6609 1240 3761 5809 6056 5771 2976 2096 2726 2426
7850B426n457q7K765o512L185O588K806p46q4J902j272o033l71M55l247j768j008
$$ 2426 -3031 -3118 -353 -6865 -3680 2908 5714 4968 4884 6786 5514 -519 -890 -435 -3682 -5450 -6458
7833f458J833L015J003j78K838M210J332j565k944j558K642j801m934q23N11j019
$$ -6458 -4625 -1610 -607 -785 2053 6263 7595 6030 3086 1528 4170 2369 -2565 -3388 -2877 -3896
7817c896M07K583K417Q99l093j081P40J633K161O6m690m282N35j688K068L870
$$ -3896 -3489 -906 1511 2410 -683 -1764 -1024 609 2770 2836 -1854 -6136 -5601 -7289 -5221 -1351
7801a351J360M131M12P53J386j954l127L918k757m851k165O99q34J786K898j065
$$ -1351 9 4140 4552 5305 6691 4737 1610 5528 2771 -2080 -4245 -3546 -4380 -2594 304 -761
7785g61r80M1j770O275J048J4j187l360m89K20P70L74j554j659j644j431l67J877
$$ -761 -1741 -1700 -3470 2805 3853 3867 2680 -680 -1169 -949 -179 195 -1359 -3018 -4662 -6093 -6460 -4583
7767d583N863L993m765o003j63j936K509r84K823k469M17K666N63J6M017L005
$$ -4583 1280 5273 508 -5495 -5658 -7594 -5085 -6069 -3246 -5715 -5298 -2632 -2069 -2053 1964 4969
7751D969j899O22p853n406J563l503Q2L840q09j325r95K512q20O1k056n55J727
$$ 4969 3070 3692 -4161 -9567 -8004 -11507 -11425 -7585 -8394 -9719 -10714 -8202 -9022 -8961 -11017 -11572 -9845
7734i845K305k05j405J531o4R05L949O0M08M41J75n14N609m49l392Q46m24k616
$$ -9845 -7540 -7745 -9150 -7619 -7683 -6778 -2829 -2769 -2361 -1920 -1745 -2259 3350 2901 -491 355 -69 -2685
7716b685n711K716Q418J537J127K51m912o498N00r56K735j673j740J696J160J930
$$ -2685 -8396 -5680 2738 4275 5402 5653 741 -5757 -5257 -6213 -3478 -5151 -6891 -5195 -4035 -2105
7700b105k043n235J308K406N57L4J90J245J613l022K65M881k724j816l002n945
$$ -2105 -4148 -9383 -8075 -5669 -5112 -5078 -4888 -3643 -2030 -5052 -4787 94 -2630 -4446 -7448 -13393
7684a3393O095K642m93L38K491L132K036j171J882k225k934p30L781j455l039
$$ -13393 -7298 -4656 -5149 -4811 -2320 812 2848 1677 3559 1334 -1600 -2330 1451 -4 -3043
7669c043m237n535k105J569K949M031N132K386M859j995r084P002K984k487p83
$$ -3043 -7280 -12815 -14920 -13351 -10402 -6371 -1239 1147 6006 4011 -5073 1929 4913 2426 1643
7654A643p697k807M323q95m964J355J726N681N4j140N286Q95n31l155k240J969
$$ 1643 -6054 -8861 -4538 -5433 -10397 -9042 -7316 -1635 -1581 -2721 2565 3460 2929 -226 -2466 -497
7638d97M489J394j695l198k032Q42J142n03j988q6Q65L246k231m344l604q04K930
$$ -497 3992 5386 3691 493 -1539 -697 445 -58 -2046 -2132 -1267 1979 -252 -4596 -8200 -9004 -6074
7621f074n9m970K133K308J812K34k922P55J952j801j546J92k564l633L673P5M116
$$ -6074 -6133 -11103 -8970 -6662 -4850 -4616 -7538 -6783 -4831 -6632 -8178 -7986 -10550 -14183 -10510 -10435 -6319
7604f319K900j988l634J290P74N540r58o661m268J630L634r66K876N933k461J096
$$ -6319 -3419 -5407 -9041 -7751 -6977 -1437 -2395 -9056 -13324 -11694 -8060 -9026 -6150 -217 -2678 -1582
7588a582L360o05m417k755L535L840P59n575j473J288O11J346L36K92l357n458
$$ -1582 1778 1173 -3244 -5999 -2464 1376 2135 -3440 -4913 -3625 -3014 -1668 -1332 -1040 -4397 -9855
7572i855M959O915k847j008l899Q62J612l496m112M493Q175M480m316j766Q26
$$ -9855 -4896 2019 -828 -1836 -5735 -4873 -3261 -6757 -10869 -6376 1799 6279 1963 197 1023
7557A023k796J618M350n58L445l68p160r80M805J600J103P21o310n947L559K031
$$ 1023 -1773 -155 4195 3637 7082 6714 -446 -1426 3379 4979 6082 6803 493 -5454 -1895 136
7541A36k404p355j947N331P506J424m725l43l364J175J70k091l8K73J849k344
$$ 136 -2268 -9623 -11570 -6239 1267 2691 -2034 -2377 -5741 -4566 -4396 -6487 -6525 -6252 -4403 -6747
7525f747k47N214k059m022M36O07K116j07M274J028J54j560k794j335m92m94q93
$$ -6747 -6994 -1780 -3839 -7861 -7425 -6818 -4702 -4809 -535 493 647 -913 -3707 -5042 -5534 -6028 -6921
7508f921l918j338N893O296j542J16L445K304m9o316k702o73N454j229l742k129
$$ -6921 -10839 -12177 -6284 12 -1530 -1414 2031 4335 4286 -2030 -4732 -5405 49 -1180 -4922 -7051
7492g051k377O520M372l223l559M0k84K294j005m71J205o15j319n6P33m92K768
$$ -7051 -9428 -2908 1464 -1759 -5318 -5278 -5562 -3268 -4273 -4744 -3539 -4154 -5473 -5529 -4796 -5288 -2520
7475b520O728K745j539K657k91n550m900j646J354J022k975J30K242k94k524J877
$$ -2520 4208 6953 5414 8071 7780 2230 -2670 -4316 -2962 -1940 -4915 -4785 -2543 -2837 -5361 -3484
7459c484j81k407j293j052K551L677O256j544j904J724j374j888l075n920k677
$$ -3484 -3665 -6072 -7365 -8417 -5866 -2189 4067 2523 619 2343 969 -919 -3994 -9914 -12591
7444a2591L877j905j030K838J026K885O65K334L00J692K481q85j0031q45k377
$$ -12591 -8714 -10619 -11649 -8811 -7785 -4900 -4235 -1901 -1601 91 2572 1687 -8344 -9189 -11566
7429a1566J841M638k412K559N423K659n38J568o08n137L03p15L503J392q49q65
$$ -11566 -9725 -5087 -7499 -4940 483 3142 2604 4172 3564 -1573 -1270 -1985 1518 2910 2061 1196
7413A196K69K141K720l88m674l636K726j90l006L40O499L896n292O60k462l605
$$ 1196 1465 3606 6326 5938 1264 -2372 354 164 -2842 -2502 3997 7893 2601 3261 799 -2806
7397b806j405J479k14K556O233J661k542m619n561k529j960Q46Q810O019k014
$$ -2806 -4211 -2732 -2946 -390 5843 7504 4962 343 -5218 -7747 -9707 -8861 -51 5968 3954
7382C954m745K79n110J256L010K187k833n719K102j159L674L337J400j861l718
$$ 3954 -791 -512 -5622 -4366 -1356 831 -2002 -7721 -5619 -6778 -3104 233 1633 -228 -3946
7367c946L558M426j461l755j314L93J403K621l777m090j49J50r35L006J511o441
$$ -3946 -388 4038 2577 -1178 -2492 -2099 -696 1925 -1852 -5942 -6091 -5941 -6876 -3870 -2359 -8800
7351h800k691l100J415N054p22k648R2J53m47J924j110o46J802L614M755K901
$$ -8800 -11491 -14591 -13176 -8122 -8844 -11492 -11400 -11247 -11694 -9770 -10880 -11526 -9724 -6110 -1355 1546
7335A546j775J970M646j928l991j025n293k883K408M446K08M75j01j887n977l970
$$ 1546 -229 1741 6387 4459 468 -557 -5850 -8733 -6325 -1879 -1671 -1196 -1297 -3184 -9161 -13131
7319a3131N23M011N83M416L14J784J745M099L977j606M97K097l686k888j008k553
$$ -13131 -12608 -8597 -8014 -3598 -3284 -1500 245 4344 8321 6715 7212 9309 5623 2735 1727 -826
7303h26J80k105k283l53k012o43m857l82O393L932J117j204k105L438R81n507
$$ -826 -646 -2751 -5034 -5387 -7399 -8042 -12899 -13281 -6888 -2956 -1839 -3043 -5148 -1710 -729 -6236
7287f236m38o6k090j195L831k372K892r35L64L160K904j915R39L55o30j463K043
$$ -6236 -6674 -6740 -8830 -10025 -6194 -8566 -5674 -6609 -6245 -3085 -181 -2096 -1157 -802 -1432 -2895 -852
7270h52P64k568L70n9m099J065L498j427N88m336O42M282P77k141k441l697k609
$$ -852 -88 -2656 -2286 -2345 -6444 -5379 -1881 -3308 -2720 -7056 -6414 -2132 -1355 -3496 -5937 -9634 -12243
7253a2243Q01j232L643O86M013J685O15R54Q39l623k497N5J450P739k873m368
$$ -12243 -11442 -12674 -9031 -8345 -4332 -2647 -2032 -1078 -239 -3862 -6359 -6304 -4854 2885 12 -4356
7237d356k939m38L477J58Q24P65r80l762q82M607M836J222l919q53k007p176P27
$$ -4356 -7295 -7733 -4256 -4098 -3274 -2509 -3489 -7251 -8133 -3526 1310 2532 -1387 -2240 -4247 -11423 -10696
7220a0696M353K366J153m373k692r3L028Q41k910p3j906K035M634N449k170K83
$$ -10696 -6343 -3977 -2824 -7197 -9889 -9982 -6954 -6113 -9023 -9096 -11002 -8967 -4333 1116 -1054 -771
7204g71J292M78l344j055K762o47l161m102j756J437K806N340p85p252j545O131
$$ -771 521 999 -2345 -3400 -638 -1285 -4446 -8548 -10304 -8867 -6061 -721 -1506 -8758 -10303 -4172
7188d172M400j413j296l677n87N438n48m27j871J240L374L412N60k029l022k950
$$ -4172 228 -1185 -2481 -6158 -6745 -1307 -1855 -2282 -4153 -2913 461 3873 4433 2404 -618 -3568
7172c568l643L645K098J37J125l123K120L273l026l672K476L03K269J612j750
$$ -3568 -7211 -3566 -1468 -1331 -206 -3329 -1209 2064 -962 -4634 -2158 -1855 414 2026 276
7157B76q92K620J713K443k35q239m162P60M314K536J150l797l509j263K628J344
$$ 276 -616 2004 3717 6160 5925 -2314 -6476 -5716 -1402 1134 2284 -1513 -5022 -6285 -3657 -2313
7141b313K157k521k31J569j811j6n04Q68J868q7k266k840o81j449J325J208p96
$$ -2313 -156 -2677 -2908 -1339 -3150 -3166 -3670 -2802 -934 -1021 -3287 -6127 -6808 -8257 -6932 -5724 -6520
7124f520j412l190N30L756k428m756j397J001K360k613N202Q950J133m000n943
$$ -6520 -7932 -11122 -10592 -6836 -9264 -14020 -15417 -14416 -12056 -14669 -9467 -517 616 -3384 -9327
7109i327j287L234R13Q1J305L49j864L311m810N33L865K18m773j359J980O386
$$ -9327 -10614 -7380 -6467 -6386 -5081 -4732 -6596 -3285 -8095 -7562 -3697 -3479 -8252 -9611 -7631 -1245
7093a245R56N61l362m07P729L037Q55n094l756j624o45k159k15l771o406L552
$$ -1245 -289 272 -3090 -3497 4232 7269 8124 3030 -726 -2350 -2995 -5154 -5369 -9140 -15546 -11994
7077a1994M074q6k193M169L857O284k050k290J698J627j97k381j954R93J922j268
$$ -11994 -7920 -8006 -10199 -6030 -2173 4111 2061 -229 1469 3096 2899 518 -1436 -443 1479 211
7061B11k922k888J788J296n03j765r48N06K714j000o21k762J724K563j146L993
$$ 211 -2711 -5599 -3811 -2515 -3018 -4783 -5731 -5225 -2511 -3511 -4132 -6894 -5170 -2607 -3753 240
7045B40O089j450l508l482N4P38j959R14K732j120l273Q73J246L854K793k017
$$ 240 6329 4879 1371 -2111 -2057 -1319 -3278 -2364 368 -752 -4025 -3152 -1906 1948 4741 2724
7029B724q524n851N160N229N530l955j164L409k792N72L534r093J087K522k999
$$ 2724 -5800 -11651 -6491 -1262 4268 313 -851 2558 -234 338 3872 -5221 -4134 -1612 -4611
7014d611m507o6K895J890M718Q79J736K066l463n033J003M684M414q66M287Q596
$$ -4611 -9118 -9184 -6289 -4399 319 1198 2934 5000 1537 -3496 -2493 2191 6605 5739 10026 18622
6998A8622O484L548k541m578m777k703r491q514m289j228N953O739J0200R686
$$ 18622 25106 28654 26113 21535 16758 14055 4564 -3950 -8239 -9467 -3514 3225 13425 23111
6984B3111K069K496M337k692n102o133p941k092j821o891j189J548K806l536o28
$$ 23111 25180 27676 32013 29321 24219 18086 10145 8053 6232 -659 -1848 -300 2506 -1030 -1658
6969a658m298l559n75K561J984m037O980L221k383k951q192l622N093M796J654
$$ -1658 -5956 -9515 -10090 -7529 -5545 -9582 -2602 619 -1764 -4715 -12907 -16529 -11436 -6640 -4986
6954d986K976J771l767J17l078l972J46L056J860l191P70K461l716l131Q80j110
$$ -4986 -2010 -239 -4006 -3889 -6967 -10939 -10793 -7737 -5877 -9068 -8298 -5837 -9553 -12684 -11804 -12914
6938a2914k241L335M871N446K278m173R19J395o129m78J535L191J939K715M190
$$ -12914 -15155 -11820 -6949 -1503 775 -3398 -2479 -1084 -7213 -7691 -6156 -2965 -1026 1689 5879
6923E879n513J42K328j010j236m348P65J349l809k196M84K201K283K641L87m193
$$ 5879 366 508 2836 1826 590 -3758 -2993 -1644 -5453 -7649 -7165 -4964 -2681 -40 347 -3846
6907c846q1q82j717j220M477k359j595p88Q22J697j261m485M0K889L744J330K779
$$ -3846 -3927 -4809 -6526 -7746 -3269 -5628 -7223 -8011 -7189 -5492 -6753 -11238 -11198 -8309 -4565 -3235 -456
6890d56k7j695j032m20J444j143n40K431K179J937K230k193l997K243K293j367
$$ -456 -483 -2178 -3210 -3630 -2186 -3329 -3869 -1438 741 2678 4908 2715 -1282 961 3254 1887
6874A887m375m872O19n7L825K19Q54M316L935k17j652J435k707Q4l116J812l42
$$ 1887 -2488 -7360 -6741 -6798 -2973 -2754 -1900 2416 6351 6134 4482 5917 3210 3294 178 1990 1648
6857A648m379l076L7K244m291q22K22N86k408R82Q029P420K486o005l819l286
$$ 1648 -2731 -5807 -5770 -3526 -7817 -8639 -8417 -7831 -10239 -9257 -1228 6192 8678 2673 -1146 -4432
6841d432J517J760N58o58o21n63K655n07l588m199j394K579L305l43J363M570
$$ -4432 -2915 -1155 -597 -1255 -1876 -2439 216 -291 -3879 -8078 -9472 -6893 -3588 -3931 -2568 2002
6825B002J711p863l600P51L226L875J901L059j641J571K234m229R7K20k029N84
$$ 2002 3713 -4150 -7750 -6999 -3773 102 2003 5062 3421 4992 7226 2997 3094 3314 1285 1869
6809A869l344j838N16M14L31K566k263l277J614O076J205N26k63J79J207m031
$$ 1869 -1475 -3313 -2797 -2383 -2052 514 -1749 -5026 -3412 2664 3869 4395 4132 4311 5518 1487
6793A487j636l97l940l639j747L122L907K352k525M47J327J452j623j64J955K20
$$ 1487 -149 -546 -4486 -8125 -9872 -6750 -2843 -491 -3016 -2569 -1242 210 -1413 -1577 378 598
6777E98j451o084k834M069K627J952o75k572k236Q98J220Q10k239N761jj601K069
$$ 598 -853 -6937 -9771 -5702 -3075 -1123 -1798 -4370 -6606 -5708 -4488 -3678 -5917 -156 -157 -1758 311
6760C11M530q64l107Q71r47n143o82j128J603J090q30r56l465L60L881L618L021
$$ 311 4841 3977 870 1741 794 -4349 -5031 -6159 -4556 -3466 -4296 -5252 -8717 -8357 -4476 -858 2163
6743B163l294j302k86K994p42k430J767J208M286j714K706J946o134J048Q49m133
$$ 2163 -1131 -2433 -2719 275 -467 -2897 -1130 78 4364 2650 5356 7302 1168 2216 3065 -1068
6727a068j365r25j646M569M257J180k171L665m349o888l861J251J522R92L333
$$ -1068 -2433 -3358 -5004 -435 3822 5002 2831 6496 2147 -4741 -8602 -7351 -5829 -4837 -1504
6712a504K271K384K13K233m696p412j860p97o02j869N070N008j796j096J414K325
$$ -1504 767 3151 3364 5597 901 -6511 -8371 -9168 -9770 -11639 -6569 -1561 -3357 -4453 -3039 -714
6696g14K562p76J710j107K56m661l411J35j298j453J951K783M304L269R9j878
$$ -714 1848 1072 2782 1675 1931 -2730 -6141 -6006 -7304 -8757 -6806 -4023 281 3550 3649 1771
6680A771J655K013l209n678J68J488J840R64J099K152k891j79l69m521j816j192
$$ 1771 3426 5439 2230 -3448 -3280 -1792 48 1012 2111 4263 1372 1193 824 -3697 -5513 -6705
6664f705J802L29M447N331r63j993n779k414J399O74M28j666J811M084L445r28
$$ -6705 -4903 -4574 -127 5204 4241 2248 -3531 -5945 -4546 -3872 -3444 -5110 -3299 785 4230 3302
6648C302l336m12l716J940j359k787k957N475N839o86j050l174j680Q62J351L66
$$ 3302 -34 -446 -4162 -2222 -3581 -6368 -9325 -3850 1989 1303 253 -2921 -4601 -3739 -2388 -2022
6632b022j352l95j494m333j410R31K658o590R53R802M860J511n25n67Q73l155
$$ -2022 -3374 -3769 -5263 -9596 -11006 -10075 -7417 -14007 -13054 -3252 1608 3119 2594 2027 2900 -255
6616b55R04K370J34l936m983J02K553K193L000j699j370j098k918K018M042l986
$$ -255 649 3019 3153 -783 -5766 -5664 -3111 -918 2082 383 -987 -2085 -5003 -2985 1057 -2929
6600b929n23l2q33l918j380O990j069k428r09Q45J217N31O60j543O438M869n842
$$ -2929 -3452 -3484 -4317 -8235 -9615 -2625 -3694 -6122 -7031 -6186 -4969 -4438 -3778 -5321 1117 5986 144
6583A44k060M80l844l417j048K67j174K144M038L710J784m7R48l007Q75K82n514
$$ 144 -1916 -1436 -5280 -8697 -9745 -9478 -10652 -8508 -4470 -760 1024 977 1925 -1082 -207 75 -5439
6566e439j292M699k828j615l93L306J706M783K51j77J957o01l677M49m000l454
$$ -5439 -6731 -2032 -4860 -6475 -6868 -3562 -1856 2927 3178 3001 4958 4357 680 1129 -2871 -6325
6550f325p02M107K908o09r53j905j551o32j324P58O233N206K306l886r531o782
$$ -6325 -7027 -2920 -12 -621 -1574 -3479 -5030 -5662 -6986 -6228 5 5211 7517 3631 -5900 -12682
6534a2682K16O372L089j171l719J300J946l12N395k024J959j030J16J25K325M29
$$ -12682 -12466 -6094 -3005 -4176 -7895 -6595 -4649 -4961 434 -1590 369 -661 -545 -420 1905 2334
6518B334l442o381L506L136k593K905P24j766L05L074L452j123l43j692l297j960
$$ 2334 -1108 -7489 -3983 -847 -3440 -535 189 -1577 -1272 1802 5254 4131 3788 2096 -1201 -3161
6502c161j119k054K753N089J599K253l538k063J332J240K668j95k74l418n305
$$ -3161 -4280 -6334 -3581 1508 3107 5360 1822 -241 1091 2331 4999 4804 4530 1112 -4193
6487d193j1j39O13O189j33j52n45o348l793j901M723m60J625M312J423k508m576
$$ -4193 -4204 -4343 -3730 2459 2326 2174 1629 -4719 -8512 -10413 -5690 -6150 -4525 -213 1210 -1298 -5874
6470e874o6k804l769Q42j707l361J573m256LQ661M019O368L281M497k501k788
$$ -5874 -5940 -8744 -12513 -11671 -13378 -16739 -15166 -19422 -19419 -10758 -6739 -371 2910 7407 4906 2118
6454B118m796n764P38M570L057l087l458L103M451O24J86L802K754k992k209j036
$$ 2118 -2678 -8442 -7704 -3134 -77 -3164 -6622 -3519 932 1556 1742 5544 8298 5306 3097 2061
6438B061O7l174J389K566j23j523l428K108j510j664L287J973J342K762m703k077
$$ 2061 2128 -1046 343 2909 2786 1263 -2165 -57 -1567 -3231 56 2029 3371 6133 1430 -647
6422f47j083k679M682L702M235L825k994p678L812j252r234n366l655R71L936
$$ -647 -1730 -4409 273 3975 8210 12035 9041 1363 5175 3923 -5311 -10677 -14332 -13361 -9425
6407i425L275j918j131K980L654P84k137l686p0P745K458K77K843j621o30m31
$$ -9425 -6150 -8068 -9199 -6219 -2565 -1781 -3918 -7604 -7674 71 2529 2806 5649 4028 3398 2967
6391B967qp21j421K072M949j732j2001n179q69j014M688o86L497M958j603l15
$$ 2967 2959 2238 817 2889 7838 6106 -5895 -11074 -11943 -12957 -8269 -8955 -5458 -500 -2103 -2418
6375b418L630P42j764n008n78J340L522P688p09n52P27k774j299r64m180K145
$$ -2418 1212 1954 190 -4818 -5396 -4056 -534 7154 6445 5893 6620 3846 2547 1583 -2597 -452
6359d52O876j75l874J217k1n846n942k124K759K82k711M71K670M51P61M211L556
$$ -452 6424 6249 2375 3592 3571 -2275 -8217 -10341 -7582 -7300 -10011 -9540 -6870 -6419 -5658 -1447 2109
6342B109J37l35K816O50o168q12Q665K37m125k546Q72n265J341j295k096N06L040
$$ 2109 2246 1911 4727 5377 -791 -1603 7062 7299 3174 628 1500 -3765 -2424 -3719 -5815 -5309 -2269
6325b269k494j179r87R121q13p704K79j877L165r71J597O166J520j662j047m466
$$ -2269 -4763 -5942 -6929 2192 1379 -6325 -6046 -7923 -4758 -5729 -4132 2034 3554 1892 845 -3621
6309c621l651K281K916L053k184K265L1K222j859m657O82M951M289M28k777k535
$$ -3621 -7272 -4991 -2075 978 -1206 1059 1090 3312 1453 -3204 -2522 2429 6718 7146 4369 1834
6293A834j571j223k089k958k980R40L702L733P6Q95k9k591J99q06M994j277m929
$$ 1834 263 -960 -3049 -6007 -8987 -8047 -4345 -612 -536 359 330 -2261 -2062 -2868 2126 849 -4080
6276d080K449L519l03M799l278k511p03L955M63l715l670j282J036L939N199o800
$$ -4080 -1631 1888 1585 6384 3106 595 -108 3847 4310 595 -3075 -4357 -3321 618 5817 -983
6260i83o902K566K596K924K035J2O03N47n325m131k202l12O623K179n59j786R32
$$ -983 -7885 -5319 -2723 201 2236 2248 2851 3398 -1927 -6058 -8260 -8572 -1949 230 -329 -2115 -1183
6243a183O39o85m185K152K039m2P14j746m979K701L296m427P9K874J798O63p98
$$ -1183 -544 -1229 -5414 -3262 -1223 -1265 -551 -2297 -7276 -4575 -1279 -5706 -5627 -2753 -955 -292 -1090
6226a090k023r42K274K842j56j827L727k380n121p37K507K569J523J008j950K344
$$ -1090 -3113 -4055 -1781 1061 905 -922 2805 425 -4696 -5433 -2926 -357 1166 2174 224 2568
6210B568K666m127j320k473M681J665m437n43K540k827R93J961m90K374L23l002
$$ 2568 5234 1107 -213 -2686 1995 3660 -777 -1320 1220 -1607 -614 1347 857 3231 3554 552
6194E52j561j42o23O65J622K89l525o81J858j80l147L39L806o02L52J633m61l592
$$ 552 -1009 -1151 -1774 -1109 513 802 -2723 -3404 -1546 -1726 -4873 -4534 -728 -1330 -978 655 194 -3398
6176c398K227N29m73L9Q89K74n779j337j689j771L083P006L043K278M68j436k033
$$ -3398 -1171 -642 -1115 -1076 -187 87 -5692 -7029 -8718 -10489 -7406 -400 2643 4921 5389 3953 1920
6159A920J838l81k907m967J063j713j837j269j342K578J427k06K617M197J469
$$ 1920 3758 3377 470 -4497 -3434 -5147 -6984 -8253 -9595 -7017 -5590 -5796 -3179 1018 2487
6144B487k78m997j789j729L303l954j917K974N210L109k98q00L181K297m739n330
$$ 2487 2209 -2788 -4577 -6306 -3003 -6957 -8874 -5900 -690 2419 2121 1321 4502 6799 2060 -3270
6128c270L030q04j533l984M764L805K998J453j880k609lk455J747O523J583l886
$$ -3270 -240 -1044 -2577 -6561 -1797 2008 5006 6459 4579 1970 1967 -488 1259 7782 9365 5479
6112E479k788k007Q5L951J393J30j542o53K987m84K28K119k606o112p20J964l732
$$ 5479 2691 684 769 4720 6113 6243 4701 4048 7035 6551 6779 8898 6292 180 -540 1424 -2308
6095b308l883r00l034M904O037K993L98l223J327l03l023l564k191q32M84M788
$$ -2308 -6191 -7091 -10125 -5221 816 3809 4207 984 2311 2008 -1015 -4579 -6770 -7602 -7118 -2330
6079b330j547P25p03K929L524k766j031M446l015j88M345J943J382K094k811k222
$$ -2330 -3877 -3152 -3855 -926 2598 -168 -1199 3247 232 44 4389 6332 7714 9808 6997 4775
6063D775l216K875j466K856N18m703Q14J832K975l244j0243K16Q909k08j725m58
$$ 4775 1559 4434 2968 5824 6342 1639 2453 4285 7260 4016 -6227 -6011 2898 2690 965 507
6047E07N76j718p18l000l054O29K173K073M91n185Q12N804L072L726k045j784
$$ 507 1083 -635 -1353 -4353 -7407 -6778 -4605 -2532 -2041 -7226 -6414 -610 2462 6188 4143 2359
6031B359j236M6l773l544m88K173l404k794P074N082j115J50n014K710J096n32
$$ 2359 1123 1169 -2604 -6148 -6636 -4463 -7867 -10661 -3587 1495 380 530 -4484 -1774 -678 -1210
6015a210m182k122j093K952O181M291K564n806j32M81n10j970k55j419j679m001
$$ -1210 -5392 -7514 -8607 -5655 526 4817 7381 1575 1443 1924 1414 -556 -811 -2230 -3909 -7910
5999g910J475M95R46J791K179J949j263k459j98M613m074k116M5J321L534N028
$$ -7910 -6435 -5940 -4994 -3203 -1024 925 -338 -2797 -2995 1618 -2456 -4572 -4527 -3206 328 5356
5983E356J710k048k623J171n670r070M693N362M568l888m025o98J15L455M558
$$ 5356 7066 5018 2395 3566 -2104 -11174 -6481 -1119 3449 -439 -4464 -5162 -5047 -1592 2966
5968B966N23n311n583l557N428K357K665K225m086j799J609j188J565O619k374
$$ 2966 3489 -1822 -7405 -10962 -5534 -3177 -512 1713 -2373 -4172 -2563 -3751 -2186 4433 2059
5953B059l020L222k644j983N22L439M659j35k784J966j88L35J143K53L7j028l835
$$ 2059 -961 2261 -383 -2366 -1844 1595 6254 6119 3335 5301 5113 5448 6591 6844 6881 5853 2018
5936B018l099l362m263L437K426j870j135j084n76M850P282N764r50j86o403k962
$$ 2018 -1081 -4443 -8706 -5269 -2843 -4713 -5848 -6932 -7508 -2658 4624 10388 9438 9252 2849 -113
5920a13k587J306m029P60Q234n888n89L721M017k200l676j306l211j990k351M75
$$ -113 -2700 -1394 -5423 -4663 3571 -2317 -2906 815 4832 2632 -1044 -2350 -5561 -7551 -9902 -9427
5904i427K035M509L645j422L540J139l4j009o643q74N056N53q42P92M86j564k328
$$ -9427 -7392 -2883 762 -660 2880 4019 3985 2976 -3667 -4541 515 1068 226 1018 1504 -60 -2388
5887b388K76j533q1q84k152L420R75j897N57l508l67M880l7J87J274m886p24J040
$$ -2388 -2112 -3645 -3726 -4610 -6762 -3342 -2367 -4264 -3707 -7215 -7582 -2702 -2739 -2552 -1278 -6164 -6888 -5848
5869e848N682K543L710J46k17M04k097o350n539n517L366M903m652K34L419j204
$$ -5848 -166 2377 6087 6233 6016 6420 4323 -2027 -7566 -13083 -9717 -4814 -9466 -9232 -5813 -7017
5853g017J874O926M08k319K553N845L654r10j852k900J795J482j348m419m456
$$ -7017 -5143 1783 2191 -128 2425 8270 11924 11014 9162 6262 8057 9539 8191 3772 -684
5838f84L004J098l5k811k031J647J254N28J46j296Q70k013J744J381l104k649
$$ -684 2320 3418 3383 572 -1459 188 1442 1970 2116 820 1690 -323 1421 2802 -302 -2951
5822b951M057O97m408m514K338J484M404j243o204n056p53J803L208r7J022j290
$$ -2951 1106 1803 -2605 -7119 -4781 -3297 1107 -136 -6340 -11396 -12149 -10346 -7138 -7235 -6213 -7503
5806g503k816L642J337k145L60K920L611j504J778L253M885j359k367j648L130
$$ -7503 -10319 -6677 -5340 -7485 -7125 -4205 -594 -2098 -320 2933 7818 6459 4092 2444 5574
5791E574m192k745O62l78M451P79k449n252j314K231M328J747j311Q63j288N40
$$ 5574 1382 -1363 -701 -1079 3372 4151 1702 -3550 -4864 -2633 1695 3442 2131 2994 1706 2246
5775B246J170M46j867k088j495K364M165j577j481k941m695j989N997N654K285
$$ 2246 3416 3862 1995 -93 -1588 776 4941 3364 1883 -1058 -5753 -7742 -1745 3909 6194
5760F194k811m865j054J476P80o45J616J87J64J758N53m574l605J133j414M336
$$ 6194 3383 -1482 -2536 -1060 -280 -925 691 878 1042 2800 3353 -1221 -4826 -3693 -5107 -771
5744g71J0142M087l008k915m632m192J302K214J728n49k784K726N36q81j172l533
$$ -771 9371 13458 10450 7535 2903 -1289 13 2227 3955 3406 622 3348 3884 3003 1831 -1702
5728a702J331K915m367l685L461l56j859j433J725N021k8n97M088l429m958k488
$$ -1702 -371 2544 -1823 -5508 -2047 -2403 -4262 -5695 -3970 1051 1023 426 4514 1085 -3873 -6361
5712f361j314K395J407L195J851r50J569K37r95l693m081k8J297k596j847K948
$$ -6361 -7675 -5280 -3873 -678 1173 223 1792 2029 1034 -2659 -6740 -6768 -5471 -8067 -9914 -6966
5696f966L662K355M618q90M02k827P33J954l776j992K212K254J077k529P27L152
$$ -6966 -3304 -949 3669 2779 3181 354 1087 3041 -735 -2727 -515 1739 2816 287 1014 4166
5680D166k5j585l597l984n82l2J823L394N383J207o58l232n847k92J740M17l122
$$ 4166 4141 2556 -1041 -5025 -5607 -5639 -3816 -422 4961 6168 5510 2278 -3569 -3861 -2121 -1704 -4826
5663d826l547N706O711J924m580k338k251L934J338k876q003Q36K655N38j110
$$ -4826 -8373 -2667 4044 5968 1388 -950 -3201 733 2071 -805 -8808 -7972 -5317 -4779 -5889
5648e889M623O465k819k492K388P107n621n140J638m30l469k212K548J030M581
$$ -5889 -1266 5199 2380 -112 2276 9383 3762 -1378 260 -170 -3639 -5851 -3303 -2273 2308
5633B308J612j424L86j784K81m858K785P20n867m34L629m56j294J950O201L771
$$ 2308 3920 2496 2882 1098 1379 -3479 -694 26 -5841 -6275 -2646 -3102 -4396 -2446 3755 7526
5617G526p415j752K747j414L188M305j13q37K858J449l84m589k04k906j105K430
$$ 7526 111 -1641 1106 -308 2880 7185 7072 6235 9093 10542 10158 5569 5365 2459 1354 3784
5601C784K5q32O18K294k716o662K71P97N207K535J036J033m557q518k147K682
$$ 3784 3809 2977 3595 5889 3173 -3489 -3218 -2421 2786 5321 6357 7390 2833 -5685 -7832 -5150
5585e150K060J124k553J717N7k215K557K064m078o38Q25L762K753k70j836R35
$$ -5150 -3090 -1966 -4519 -2802 -2745 -4960 -2403 -339 -4417 -5055 -4230 -468 2285 2015 179 1114
5569A114N672l577j043k618m334K635L72o48j501l18N31K367J891m297Q32M246
$$ 1114 6786 3209 2166 -452 -4786 -2151 -1779 -2427 -3928 -4246 -3715 -1348 543 -3754 -2922 1324
5553A324k190O45J037P056j923k549m328J5R24K565J395l719j029o98k743j100
$$ 1324 -866 -221 816 7872 5949 3400 -928 -913 11 2576 3971 252 -777 -1475 -4218 -5318
5537e318l495O15M292M31J470R31M200L399L455Q57j643L555r09k741o221l253
$$ -5318 -8813 -8198 -3906 -3475 -2005 -1074 3126 6525 9980 10837 9194 12749 11840 9099 2878 -375
5521c75K13N1J349J614J727m609o868l087L513M360N628K70m169k67M749n0k538
$$ -375 -162 -111 1238 2852 4579 -30 -6898 -9985 -6472 -2112 3516 3786 -383 -650 4099 4049 1511
5504A511o955K089K710L291L23r99o71l444K551K316J885j743M09m044k903k014
$$ 1511 -5444 -3355 -645 2646 2969 1970 1299 -2145 406 2722 4607 2864 3273 -771 -3674 -5688
5488e688K561M675Q86r09J200l573K788O127K281k200j620k178o697j373L51k27
$$ -5688 -3127 1548 2434 1525 2725 -848 1940 8067 10348 8148 6528 4350 -2347 -3720 -3369 -3596
5472c596M044Q53L99K134l769o141L00M410J560L059J520l540k960m377n8j104
$$ -3596 448 1301 1700 3834 65 -6076 -5776 -1366 194 3253 4773 1233 -1727 -6104 -6162 -7266
$$ [...]
##END NTUPLES=NMR SPECTRUM
##END=
