##TITLE=Analysis number 312573
Compound Code gk 00377
Book Reference 1
Project Code adrs
Chemist Name fudan
##JCAMPDX= 6.0         $$ Bruker NMR JCAMP-DX V2.0
##DATA TYPE= NMR SPECTRUM
##DATA CLASS= NTUPLES
##ORIGIN= Bruker BioSpin GmbH
##OWNER= NMR
$$ XWIN-NMR		Version 3.5
$$ Tue Aug  9 10:08:52 2005 GMT Daylight Time (UT+1h)  MAYBRIDGE\NMR@NMR_250MHZ
##.OBSERVE FREQUENCY= 250.131544655141
##.OBSERVE NUCLEUS= ^1H
##.ACQUISITION MODE= SIMULTANEOUS (DQD)
##.ACQUISITION SCHEME= undefined
##.AVERAGES= 16
##.DIGITISER RES= 18
##SPECTROMETER/DATA SYSTEM= dpx250
##.PULSE SEQUENCE= zg30
##.SOLVENT NAME= CDCl3
##.SHIFT REFERENCE= (INTERNAL, CDCl3, 0, 16.4531)
##AUDIT TRAIL= $$ (NUMBER, WHEN, WHO, WHERE, WHAT)
$$ ##TITLE= Audit trail, XWIN-NMR		Version 3.5
$$ ##JCAMPDX= 5.01
$$ ##ORIGIN= Bruker BioSpin GmbH
$$ ##OWNER= NMR
$$ C:\u/data/dgb/nmr/ADRS/7360/pdata/1/auditp.txt
$$ ##AUDIT TRAIL=  $$ (NUMBER, WHEN, WHO, WHERE, WHAT)
(   1,<2005-08-09 10:08:33.56 +100>,<MAYBRIDGE\NMR>,<NMR_250MHZ>,
      <created by zg, POWCHK disabled, PULCHK disabled
       configuration hash MD5:
       62 19 C7 07 E1 42 D1 B7 37 6C 3D D0 77 39 F9 E6
       data hash MD5: 64K
       90 6B B7 E9 4E 5F 4F 37 64 61 17 AE 69 85 00 1A>)
(   2,<2005-08-09 10:08:44.23 +100>,<MAYBRIDGE\NMR>,<NMR_250MHZ>,
      <Start of raw data processing
       ef LB = 0.3 FT_mod = 6 PKNL = 1 SI = 32K 
       data hash MD5: 32K
       E4 3C BB B7 2D 29 95 9A 02 00 16 A3 08 C5 E9 32>)
(   3,<2005-08-09 10:08:46.09 +100>,<MAYBRIDGE\NMR>,<NMR_250MHZ>,
      <apk 
       data hash MD5: 32K
       68 1B 71 F5 A2 81 AE 37 1A F4 45 72 40 21 BD D1>)
(   4,<2005-08-09 10:08:46.76 +100>,<MAYBRIDGE\NMR>,<NMR_250MHZ>,
      <abs ABSG = 5 
       data hash MD5: 32K
       27 C5 2E FD 79 36 0F F7 11 78 7B 11 DD 7E 86 2B>)
$$ ##END=
$$ 
$$ hash MD5
$$ CE 5C 2B 83 B9 99 48 16 35 12 7A 91 0D 51 9A 11
##$RELAX= 
##$RELAX= 
##$RELAX= 
##$RELAX= 
##$RELAX= 
##$RELAX= 
##$RELAX= 
$$ Bruker specific parameters
$$ --------------------------
##$DU= <C:\u>
##$EXPNO= 7360
##$NAME= <ADRS>
##$PROCNO= 1
##$TYPE= <nmr>
##$USER= <dgb>
##$AMP= (0..31)
100 100 100 100 100 100 100 100 100 100 100 100 100 100 100 100 100 100 
100 100 100 100 100 100 100 100 100 100 100 100 100 100 
##$AQSEQ= 0
##$AQ_mod= 3
##$AUNM= <au_zg>
##$AUTOPOS= <8 >
##$BF1= 250.13
##$BF2= 250.13
##$BF3= 250.13
##$BF4= 250.13
##$BF5= 500.13
##$BF6= 500.13
##$BF7= 500.13
##$BF8= 500.13
##$BYTORDA= 1
##$CFDGTYP= 0
##$CFRGTYP= 5
##$CHEMSTR= <none>
##$CNST= (0..31)
1 1 145 1 1 1 1 1 1 1 1 1 1 1 1 1 1 1 1 1 1 1 1 1 1 1 1 1 1 1 1 1 
##$CPDPRG= <>
##$CPDPRG1= <>
##$CPDPRG2= <>
##$CPDPRG3= <>
##$CPDPRG4= <mlev>
##$CPDPRG5= <mlev>
##$CPDPRG6= <mlev>
##$CPDPRG7= <mlev>
##$CPDPRG8= <mlev>
##$CPDPRGB= <>
##$CPDPRGT= <>
##$D= (0..31)
0 1 0 0 0 0 0 0 0 0.06 0 0 0 0 0 0 0.0002 0 0 0 0 0 0 0 0 0 0 0 0 0 0 
0 
##$DATE= 1123578512
##$DBL= (0..7)
120 120 120 120 120 120 120 120 
##$DBP= (0..7)
150 150 150 150 150 150 150 150 
##$DBP07= 0
##$DBPNAM0= <>
##$DBPNAM1= <>
$$ [...]
##$SUBNAM8= <"">
##$SUBNAM9= <"">
##$SW= 20.6930455092707
##$SWIBOX= (0..15)
0 0 3 0 0 0 0 0 0 0 0 0 0 0 0 0 
##$SW_h= 5175.983436853
##$TD= 65536
##$TD0= 1
##$TE= 295.16
##$TE2= 300
##$TE3= 300
##$TEG= 300
##$TL= (0..7)
0 120 120 120 120 120 120 120 
##$TP= (0..7)
150 150 150 150 150 150 150 150 
##$TP07= 0
##$TPNAME0= <>
##$TPNAME1= <>
##$TPNAME2= <>
##$TPNAME3= <>
##$TPNAME4= <>
##$TPNAME5= <>
##$TPNAME6= <>
##$TPNAME7= <>
##$TPOAL= (0..7)
0.5 0.5 0.5 0.5 0.5 0.5 0.5 0.5 
##$TPOFFS= (0..7)
0 0 0 0 0 0 0 0 
##$TUNHIN= 0
##$TUNHOUT= 0
##$TUNXOUT= 0
##$USERA1= <user>
##$USERA2= <user>
##$USERA3= <user>
##$USERA4= <user>
##$USERA5= <user>
##$V9= 5
##$VALIST= <valist>
##$VCLIST= <CCCCCCCCCCCCCCC>
##$VD= 0
##$VDLIST= <DDDDDDDDDDDDDDD>
##$VPLIST= <PPPPPPPPPPPPPPP>
##$VTLIST= <TTTTTTTTTTTTTTT>
##$WBST= 1024
##$WBSW= 4
##$XGAIN= (0..3)
0 0 0 0 
##$XL= 0
##$YL= 0
##$YMAX_a= 275426
##$YMIN_a= -176533
##$ZGOPTNS= <>
##$ZL1= 120
##$ZL2= 120
##$ZL3= 120
##$ZL4= 120
##$ABSF1= 16.45312
##$ABSF2= -4.240053
##$ABSG= 5
##$ABSL= 3
##$ALPHA= 0
##$AQORDER= 0
##$ASSFAC= 0
##$ASSFACI= 0
##$ASSFACX= 0
##$ASSWID= 0
##$AUNMP= <proc_1d>
##$AZFE= 0.1
##$AZFW= 0.1
##$BCFW= 0
##$BC_mod= 0
##$BYTORDP= 0
##$COROFFS= 0
##$CY= 12.5
##$DATMOD= 1
##$DC= 0
##$DFILT= <>
##$DTYPP= 0
##$F1P= 14.0000005364418
##$F2P= -0.99999901652339
##$FCOR= 0.5
##$FTSIZE= 32768
##$FT_mod= 6
##$GAMMA= 0
##$GB= 0
##$INTBC= 1
##$INTSCL= 1
##$ISEN= 128
##$LB= 0.3
##$LEV0= 0
##$LPBIN= 0
##$MAXI= 10000
##$MC2= 0
##$MEAN= 0
##$ME_mod= 0
##$MI= 0
##$NCOEF= 0
##$NC_proc= -5
##$NLEV= 6
##$NOISF1= 0
##$NOISF2= 0
##$NSP= 0
##$NTH_PI= 0
##$NZP= 0
##$OFFSET= 16.45312
##$PC= 1
##$PHC0= -72.43965
##$PHC1= 6.260717
##$PH_mod= 1
##$PKNL= yes
##$PPARMOD= 0
##$PSCAL= 4
##$PSIGN= 0
##$REVERSE= no
##$SF= 250.130017228621
##$SI= 32768
##$SIGF1= 0
##$SIGF2= 0
##$SINO= 400
##$SIOLD= 32768
##$SREGLST= <1H.CDCl3>
##$SSB= 0
##$STSI= 32768
##$STSR= 0
##$SW_p= 5175.98343685301
##$SYMM= 0
##$S_DEV= 0
##$TDeff= 65536
##$TDoff= 0
##$TI= <Analysis number 999999
Compound Code 99
Book Reference 9
Project Code 9>
##$TILT= no
##$TM1= 0
##$TM2= 0
##$TOPLEV= 0
##$USERP1= <user>
##$USERP2= <user>
##$USERP3= <user>
##$USERP4= <user>
##$USERP5= <user>
##$WDW= 1
##$XDIM= 32768
##$YMAX_p= 529191392
##$YMIN_p= -1142607
$$ End of Bruker specific parameters
$$ ---------------------------------
##NTUPLES= NMR SPECTRUM
##VAR_NAME=  FREQUENCY,     SPECTRUM/REAL,   SPECTRUM/IMAG
##SYMBOL=    X,             R,               I
##VAR_TYPE=  INDEPENDENT,   DEPENDENT,       DEPENDENT
##VAR_FORM=  AFFN,          ASDF,            ASDF
##VAR_DIM=   32768,         32768,           32768
##UNITS=     HZ,            ARBITRARY UNITS, ARBITRARY UNITS
##FACTOR=    0.157963299565203, 1,           1
##FIRST=     4115.41900845922, 0,            0
##LAST=      -1060.56442839379, 0,           0
##MIN=       -1060.56442839379, -1142607,    0
##MAX=       4115.41900845922, 529191392,    0
$$ Real data points
##PAGE= N=1
##DATA TABLE= (X++(R..R)), XYDATA
$$ [...]
$$ plain form
25873 149035 35008 264580 434262 535060 624285 535000 386649 -171593 -407965 -294749
25863 -294749 -111697 -173642 -589 147218 205986 113187 -60133 -388592 -308857 133028
25853 133028 430875 407823 227706 125254 -129042 69638 64176 -119674 -154269 -394229
25843 -394229 -399223 -180469 67147 111487 -123391 -302148 -387832 -33517 270738 118109
25833 118109 -195945 -351313 -541031 -489267 -757489 -1067837 -924190 -382284 -454228 -879213
25823 -879213 -574879 -441300 -356755 -353845 -635093 -662351 -17882 534225 53265 -152364
25813 -152364 -275411 -477936 -571570 -787488 -770331 -589468 -123586 569278 446045 -220719
25803 -220719 -333286 -418750 -460729 -423536 -119366 -69115 -121743 -229349 -37290 53310 -86187
$$ packed form
25873A49035j14027K29572J69682J00798Q9225q9285j48351n58242k36372J13216
25863b94749J83052o1945J73053J47807N8768r2799j73320l28459P9735M41885
25853A33028K97847k3052j80117j02452k54296J98680n462j83850l4595k39960
25843c94229m994K18754K47616M4340k34878j78757q5684L54315L04255j52629
25833A18109l14054j55368j89718N1764k68222l10348J43647N41906p1944m24985
25823h79213L04334J33579Q4545K910k81248k7258O44469N52107m80960k05629
25813a52364j23047k02525r3634k15918J7157J80863M65882O92864j23233o66764
25803b20719j12567q5464m1979L7193L04170N0251n2628j07606J92059R0600j39497
$$ plain form
25792 -86187 -85278 -94793 -19245 245976 312622 91057 -104594 -34876 -54174 -247001 -22668
25781 -22668 277927 443080 96704 3894 51704 -9036 -115160 -179679 -292092 -268527 -309724
25770 -309724 -445339 -512874 -382600 -222409 -124122 -358639 -396046 -296104 68114 -193003
25760 -193003 -255482 -84412 -160083 -337482 -256710 -335697 -279721 -196927 -117377 -226796 -219290
25749 -219290 -306763 -298569 -208468 -204646 -244190 -109404 -223038 -346170 -86293 139568 26943
25738 26943 396971 841444 457747 406128 319068 52458 -175446 -349174 -724408 -682270
25728 -682270 -340429 132259 158294 97419 328507 792422 551137 80963 196903 307766
25718 307766 -35848 -191396 34351 322850 180335 17504 -86814 -220664 -200031 -236613
$$ packed form
25792h6187R09r515P5548K65221O6646k21565j95651O9718j9298j92827K24333
25781b2668L00595J65153l46376r2810M7810o0740j06124o4519j12413K3565m1197
25770c09724j35615o7535J30274J60191R8287k34517l7407R9942L64218k61117
25760a93003o2479J71070p5671j77399Q0772p8987N5976Q2794P9550j09419P506
25749b19290q7473Q194R0101L822l9544J34786j13634j23132K59877K25861j12625
25738B6943L70028M44473l83697n1619q7060k66610k27904j73728l75234M2138
25728f82270L41841M72688K6035o0875K31088M63915k41285m70174J15940J10863
25718C07766l43614j55548K25747K88499j42515j62831j04318j33850K0633l6582
$$ plain form
25708 -236613 -508371 -245013 287409 288547 -62254 -120686 166259 -18781 -118267 -87697
25698 -87697 20180 -197114 -380771 -357843 -309165 -388193 -214474 -164108 -58653 -233439
25688 -233439 -276385 -190832 94214 109060 15510 10658 -219092 -492335 -315529 4741 -41830
25677 -41830 95161 79043 191715 -8146 -210498 -93219 -90002 -188979 216603 252375 53642
25666 53642 36782 -16482 -128022 -54644 108107 -152037 -240962 -18085 -265382 -287114 -18009
25655 -18009 139461 73664 -59618 20037 28174 101792 105274 -199522 -269055 -318458 -359953
25644 -359953 -122298 18449 259985 338044 286502 264218 206643 557013 295395 -98086
25634 -98086 -28994 16696 -312282 -496810 -203178 -65062 -146468 -238815 -368866 -246094
$$ packed form
25708b36613k71758K63358N32422J138l50801n8432K86945j85040r9486L0570
25698h7697J07877k17294j83657K2928M8678p9028J73719N0366J05455j74786
25688b33439m2946Q5553K85046J4846r3550m852k29750k73243J76806L20270m6571
25677d1830J36991j6118J12672j99861k02352J17279L217r8977M05582L5772j98733
25666E3642j6860n3264j11540P3378J62751k60144q8925K22877k47297k1732K69105
25655a8009J57470o5797j33282P9655Q137P3618L482l04796o9533m9403m1495
25644c59953K37655J40747K41536P8059n1542k2284n7575L50370k61618l93481
25634i8086O9092M5690l28978j84528K93632J38116q1406r2347j30051J22772
$$ plain form
25624 -246094 -385817 -226935 -119810 -141621 -260840 105988 303237 435765 366243 383678
25614 383678 290960 349524 679302 650792 224354 -68150 413579 848822 1125301 1130603
25604 1130603 1056943 779441 482823 244168 -12685 214154 260194 80017 11813 7624
25594 7624 -69184 -443491 -765730 -488533 -174197 -56376 216451 -23566 -371658 -247719
25584 -247719 -331253 -407311 -237276 -204497 -353920 -292092 -17198 -56405 -114539 -4994 278767
25573 278767 404877 594076 463603 80627 -422256 -323316 -319742 -177257 -98489 -283629
25563 -283629 -203531 -222525 -223280 -43054 -56301 20887 200865 168383 -11990 -275673 -201200
25552 -201200 -32058 -62010 -382357 -445493 -429761 -316323 -123759 -19457 -7577 -217574
$$ packed form
25624b46094j39723J58882J07125k1811j19219L66828J97249J32528o9522J7435
25614C83678r2718N8564L29778k8510m26438k92504M81729M35243K76479N302
25604A130603p3660k77502k96618k38655k56853K26839M6040j80177o8204m189
25594G624p6808l74307l22239K77197L14336J17821K72827k40017l48092J23939
25584b47719q3534p6058J70035L2779j49423O1828K74894l9207n8134J09545K83761
25573B78767J26110J89199j30473l82976n02883R8940L574J42485P8768j85140
25563b83629Q0098j8994p55J80226j3247P7188J79978l2482j80373k63683P4473
25552b01200J69142k9952l20347o3136J5732J13438J92564J04302J1880k09997
$$ plain form
25542 -217574 -209512 -124724 -224135 -351798 -379750 -334773 -110862 57504 -158501 -107806 -229155
25531 -229155 25485 360084 152976 97298 213320 12582 -229 94409 176699 -77668
25521 -77668 -60168 52093 -208819 -350567 -128035 204085 230054 417636 511672 606090
25511 606090 521697 621445 485780 381581 191349 480383 936954 959310 589528 319399
25501 319399 -13608 -89815 -328107 -614468 -330267 81363 212198 138652 -85685 -373986
25491 -373986 -339247 -37495 175529 -50544 -131697 -212502 31056 87023 -326741 -253026
25481 -253026 -77990 3598 428393 332444 289555 326686 310053 46793 -100498 -330198
25471 -330198 -371106 -187584 -291976 -154624 -168332 -340924 -520883 -119242 100879 143644
$$ packed form
25542b17574Q062Q4788r9411j27663k7952M4977K23911J68366k16005N0695j21349
25531b29155K54640L34599k07108n5678J16022k00738j2811R4638Q2290k54367
25521g7668J7500J12261k60912j41748K22532L32120K5969J87582R4036R4418
25511F06090q4393R9748j35665j04199j90232K89034M56571K2356l69782k70129
25501C19399l33007p6207k38292k86361K84201M11630J30835p3546k24337k88301
25491c73986L4739L01752K13024k26073q1153q0805K43558N5967m13764P3715
25481b53026J75036Q1588M24795r5949m2889L7131j6633k63260j47291k29700
25471c30198m0908J83522j04392J37352j3708j72592j79959M01641K20121M2765
$$ plain form
25461 143644 272092 178342 -56771 360404 356139 123893 157575 17039 -12335 -5283 221654
25450 221654 32137 -143561 69131 193925 167849 494227 288346 84972 231478 303156
25440 303156 306723 703891 702237 379267 534550 480073 455182 398296 585212 637732 35305
25429 35305 -160375 -12915 81012 -114900 -20287 32024 187172 14913 83350 -65581
25419 -65581 -41784 -240934 -271458 -182633 230876 400123 588089 283235 -295573 -541132
25409 -541132 -463767 -226962 -15429 -170080 -65563 11684 -87654 33066 -5121 461137
25399 461137 559540 455987 423789 208866 -55229 -41826 -151781 -2155 -12553 -173011
25389 -173011 -208784 258595 545058 169232 116532 403303 457892 591399 309174 -9330
$$ packed form
25461A43644J28448r3750k35113M17175m265k32246L3682j40536k9374P052K26937
25450B21654j89517j75698K12692J24794k6076L26378k05881k03374J46506P1678
25440C03156L567L97168j654l22970J55283n4477k4891n6886J86916N2520o02427
25429C5305j95680J47460R3927j95912R4613N2311J55148j72259O8437j48931
25419f5581K3797j99150l0524Q8825M13509J69247J87966l04854n78808k45559
25409e41132P7365K36805K11533j54651J04517P7247r9338J20720l8187M66258
25399D61137R8403j03553l2198k14923k64095J3403j09955J49626j0398j60458
25389a73011l5773M67379K86463l75826n2700K86771N4589J33507k82225l18504
$$ plain form
25379 -9330 -46042 -130632 -167140 19205 -210682 38128 337200 206128 -70895 -107273 -266846
25368 -266846 -251602 30346 179282 518018 581283 377098 57762 -217093 -540586 -221622
25358 -221622 -94873 -31463 -142994 -3390 250140 393861 249644 184945 9812 65769
25348 65769 -260629 -462975 -537489 -369851 -342832 -371877 -631733 -667316 -216540 217755
25338 217755 46715 -147105 -190154 -362088 -294847 -217971 -413682 -411113 -385807 -174866 -175731
25327 -175731 -63318 62911 -89188 -252585 -231101 5233 -205654 -419492 -286381 60351
25317 60351 152786 261956 524199 478316 86725 -614450 -698560 -686422 -520594 69160
25307 69160 431650 417929 363117 559024 224860 44628 118818 417508 792780 492437
$$ packed form
25379i330l6712q4590l6508J86345k29887K48810K99072j31072k77023l6378j59573
25368b66846J5244K81948J48936L38736O3265k04185l19336k74855l23493L18964
25358b21622J26749O3410j11531J39604K53530J43721j44217o4699j75133N5957
25348F5769l26398k02346p4514J67638K7019k9045k59856l5583M50776M34295
25338B17755j71040j93820m3049j71934O7241P6876j95711K569K5306K10941q65
25327a75731J12413J26229j52099j63397K1484K36334k10887k13838J33111L46732
25317F0351R2435J09170K62243m5883l91591p01175q4110J2138J65828N89754
25307F9160L62490j3721n4812J95907l34164j80232P4190K98690L75272l00343
$$ plain form
25297 492437 80290 51976 -23457 161086 53330 -321131 -483658 -406370 -583278 -43871
25287 -43871 412693 218257 176976 35292 -324927 -350816 -78490 150298 216932 51137
25277 51137 263945 212312 -78471 25191 41720 -53762 -19419 -70218 -249096 -211735 42124
25266 42124 47503 219985 253098 -12981 -172546 23657 167415 343431 59793 104965
25256 104965 304434 673567 652704 815271 785457 818051 910123 724186 454410 367000
25246 367000 508383 675069 637666 282731 49499 25752 215619 177522 -198443 -152275
25236 -152275 -423006 -672834 -341149 25464 -12345 170707 150167 22882 38813 225495
25226 225495 552650 451756 57699 44268 -22303 95358 80759 -178114 -585163 -559316
$$ packed form
25297D92437m12147k8314p5433J84543j07756l74461j62527P7288j76908N39407
25287d3871M56564j94436m1281j41684l60219k5889K72326K28788O6634j65795
25277E1137K12808n1633k90783J03662J6529r5482L4343n0799j78878L7361K53859
25266D2124N379J72482L3113k66079j59565J96203J43758J76016k83638M5172
25256A04965J99469L69133k0863J62567k9814L2594R2072j85937k69776q7410
25246C67000J41383J66686l7403l54935k33232k3747J89867l8097l75965M6168
25236a52275k70731k49828L31685L66613l7809J83052k0540j27285J5931J86682
25226B25495L27155j00894l94057j3431o6571J17661j4599k58873m07049K5847
$$ plain form
25216 -559316 -85426 -53063 -218657 -388686 -499053 -899538 -890231 -407565 -43322 -236690
25206 -236690 -322588 -212660 -268608 -489800 -696842 -221689 375709 610200 469900 229746
25196 229746 92999 13538 -45235 -37830 -5204 248351 323465 9033 -342908 -233981 -87852
25185 -87852 -82002 -292222 -327622 -53824 -42727 -211280 -149326 -281570 -260248 -57075 13535
25174 13535 -72091 -429097 -716579 -881707 -915420 -287164 -4563 -184163 -590366 -439228
25164 -439228 -531135 -305638 6701 -203896 -189847 -90140 -97404 -441930 -582015 -643612 -646744
25153 -646744 -302052 171912 322363 46760 -412610 -377922 -462303 -203528 209541 527927
25143 527927 317673 186691 -345568 -203611 179637 135656 40636 29184 87600 60147
$$ packed form
25216e59316M73890L2363j65594j70029j10367m00485R307M82666L64243j93368
25206b36690q5898J09928n5948k21192k07042M75153N97398K34491j40300k40154
25196B29746j36747p9461n8773P405L2626K53555P5114l14432l51941J08927J46129
25185h7852N850k10220l5400K73798J1097j68553O1954j32244K1322K03173P0610
25174A3535q5626l57006k87482j65128l3713O28256K82601j79600m06203J51138
25164d39228r1907K25497L12339k10597J4049R9707p264l44526j40085o1597l132
25153f46744L44692M73964J50451k75603m59370L4688q4381K58775M13069L18386
25143E27927k10254j30982n32259J41957L83248m3981r5020j1452N8416k7453
$$ plain form
25133 60147 -25865 -74638 -199261 -298607 -291982 91092 192630 220646 382076 308164 13769
25122 13769 -356090 57777 82289 -63030 -358203 -477259 -183711 -77188 -221993 -643749
25112 -643749 -678266 -507560 -643492 -820265 -982077 -905830 -764715 -792628 -717705 -466364
25102 -466364 -513708 -383661 -485364 -565720 -487820 -453065 -574629 -240154 -22286 126763
25092 126763 357313 363992 407964 126553 -102503 37290 196660 553512 284854 -257950
25082 -257950 -563794 -276376 -123047 2380 -173459 -83112 -87251 -158885 -177291 -237431 -332258
25071 -332258 -277365 178058 311264 347334 269240 211675 191593 5989 -164351 -21018
25061 -21018 -53209 25768 297719 135166 -128398 -273878 -65697 -112358 -81515 199947
$$ packed form
25133F0147q6012m8773j24623r9346O625L83074J01538K8016J61430p3912k94395
25122A3769l69859M13867K4512j45319k95173j19056K93548J06523j44805m21756
25112f43749l4517J70706j35932j76773j61812P6247J41115k7913P4923K51341
25102d66364m7344J30047j01703q0356P7900L4755j21564L34475K17868J49049
25092A26763K30550O679M3972k81411k29056J39793J59370L56852k68658n42804
25082b57950l05844K87418J53329J25427j75839R0347m139p1634j8406o0140r4827
25071c32258N4893M55423J33206L6070p8094n7565k0082j85604j70340J43333
25061b1018l2191P8977K71951j62553k63564j45480K08181m6661L0843K81462
$$ plain form
25051 199947 11573 -417637 -81919 166998 39451 -106389 -159513 -456347 -443710 -239542
25041 -239542 -137063 211323 317713 39654 -190324 -254222 -399098 -35593 180017 378089
25031 378089 335466 169665 36819 -19995 69522 76637 -60769 -189965 -392200 -279233
25021 -279233 -37345 182519 32660 131307 32982 64718 -69342 -179317 -100422 68267
25011 68267 12171 -286323 -29993 193996 658235 687274 414276 158590 -138115 107773
25001 107773 290895 368913 551214 641873 339757 381697 285345 -252603 -453695 -686994
24991 -686994 -583523 -620808 -423776 -126769 -257466 -304182 -233144 -369363 -435323 -290039
24981 -290039 -389815 -556946 -563035 -362528 80723 53989 208857 205574 -256521 -571270 -701996
$$ packed form
25051A99947j88374m29210L35718K48917j27547j45840n3124k96834J2637K04168
25041b39542J02479L48386J06390k78059k29978o3898j44876L63505K15610J98072
25031C78089m2623j65801j32846n6814Q9517P115j37406j29196k02235J12967
25021b79233K41888K19864j49859R8647r8325L1736j34060j09975P8895J68689
25011F8267n6096k98494K56330K23989M64239K9039k72998k55686k96705K45888
25001A07773J83122P8018J82301R0659l02116M1940r6352n37948k01092k33299
24991f86994J03471l7285J97032K97007j30697m6716P1038j36219o5960J45284
24981b90039r9776j67131o089K00507M43251k6734J54868l283m62095l14749j30726
$$ plain form
24970 -701996 -814302 -591028 -378605 -486445 -292037 -14909 26768 -398630 -189968 30560
24960 30560 -7351 192590 114067 11029 -56484 -254201 -240146 -196479 3035 -121693 264210
24949 264210 -38339 -483651 -512580 -389348 -148206 -424652 -172859 -79719 -316814 -334684
24939 -334684 -313450 -214314 -30750 -52126 10024 10512 -170895 211632 674961 599000 685934
24928 685934 195803 329227 499644 98723 -74996 4888 94989 133315 161668 122283
24918 122283 148280 -20784 -406494 -652411 -432705 -278110 -48976 25813 -16658 -166559
24908 -166559 -277783 -239195 14714 -61457 -277053 51002 295348 594752 925764 810932
24898 810932 400936 -17046 -463387 -341730 -309474 -222291 -81985 -48330 123390 129419
$$ packed form
24970g01996j12306K23274K12423j07840J94408K77128M1677m25398K08662K20528
24960C0560l7911J99941p8523j03038o7513j97717J4055M3667J99514j24728L85903
24949B64210l02549m45312k8929J23232K41142k76446K51793R3140k37095j7870
24939c34684K1234R9136J83564k1376O2150M88j81407L82527M63329p5961Q6934
24928F85934m90131J33424J70417m00921j73719P9884R0101L8326K8353l9385
24918A22283K5997j69064l85710k45917K19706J54595K29134P4789m2471j49901
24908a66559j11224L8588K53909p6171k15596L28055K44346K99404L31012j14832
24898H10932m09996m17982m46341J21657L2256Q7183J40306L3655J71720O029
$$ plain form
24888 129419 -95635 -357165 -383622 -76691 -83129 -3894 -108407 7780 38773 205278
24878 205278 340612 364014 206042 20567 44326 173546 183249 336115 76833 -40227
24868 -40227 -8359 224206 55201 -219396 -345666 -576150 -76917 583552 741457 322841
24858 322841 150155 407631 547558 534651 321447 319733 276801 371316 275114 17793 179946
24847 179946 247560 451817 133435 97250 240587 530092 563627 559433 515580 358843 165039
24836 165039 276085 49865 -8510 75251 344901 405941 399986 553216 420633 276078
24826 276078 27624 351522 367803 524877 774214 635345 214730 386955 290010 135242
24816 135242 -275746 -284278 -386430 -667900 -776372 -425429 -114184 -372543 -189870 259600
$$ packed form
24888A29419k25054k61530k6457L06931o438P9235j04513J16187L0993J66505
24878B05278J35334K3402j57972j85475K3759J29220R703J52866k59282j17060
24868d0227L1868K32565j69005k74597j26270k30484M99233O60469J57905m18616
24858C22841j72686K57476J39927j2907k13204j714m2932R4515r6202k57321J62153
24847A79946O7614K04257l18382l6185J43337K89505L3535m194m3853j56737j93804
24836A65039J11046k26220n8375Q3761K69650O1040n955J53230j32583j44555
24826B76078k48454L23898J6281J57074K49337j38869m20615J72225r6945j54768
24816A35242m10988q532j02152k81470j08472L50943L11245k58359J82673M49470
$$ plain form
24806 259600 320170 349831 353380 305141 303318 -217924 -480876 -271772 242501 530074 301225
24795 301225 430924 15618 -37454 39042 267132 103913 -166561 91936 102413 154852
24785 154852 211538 72559 -30634 6012 190512 208202 -31424 -72199 128763 -11107
24775 -11107 -154277 -58286 -7826 -186810 -140810 8510 56841 -207916 -243764 -211415 -44662
24764 -44662 192431 -37016 -212000 -216795 -99847 -340853 -572123 -648941 -409754 -119299
24754 -119299 -266429 -78948 54234 255204 357466 405299 175880 166667 179370 57195
24744 57195 52968 245994 671568 758352 482012 396544 424204 250956 36761 127728 337881
24733 337881 473148 97002 -58866 -53732 307339 278114 125772 178876 336990 266979
$$ packed form
24806B59600O0570K9661L549m8239j823n21242k62952K09104N14273K87573k28849
24795C01225J29699m15306n3072P6496K28090j63219k70474K58497J0477N2439
24785A54852N6686j38979j03193L6646J84500J7690k39626m0775K00962j39870
24775a1107j43170R5991N0460j78984M6000J49320M8331k64757l5848L2349J66753
24764d4662K37093k29447j74984m795J16948k41006k31270p6818K39187K90455
24754a19299j47130J87481J33182K00970J02262M7833k29419r213J2703j22175
24744E7195m227J93026M25574Q6784k76340q5468K7660j73248k14195R0967K10153
24733C37881J35267l76146j55868N134L61071k9225j52342N3104J58114p0011
$$ plain form
24723 266979 -251415 -353576 -36222 346192 193396 -29143 325612 280841 -23873 -363706
24713 -363706 -288107 217349 101357 -190165 -345613 -334831 -27446 17199 304114 415606
24703 415606 427208 149804 -270232 -571345 -310453 -299634 -209466 -393720 -579946 -593665
24693 -593665 -554236 -324336 -215901 -119382 -383727 -909026 -870683 -356379 -146235 -13048
24683 -13048 51900 146093 211984 384366 411031 357712 233396 367030 320380 -26540 -470044
24672 -470044 -419574 63498 306971 469123 333344 25447 -168095 -478729 -663807 -819427
24662 -819427 -795338 -623734 -769990 -875258 -641852 -262104 -149349 -77036 73664 231522
24652 231522 685606 397965 -201231 -156988 19097 118112 368941 329525 -117653 -526291
$$ packed form
24723B66979n18394j02161L17354L82414j52796k22539L54755m4771l04714l39833
24713c63706P5599N05456j15992k91522j55448J0782L07385M4645K86915J11492
24703D15606J1602k77404m20036l01113K60892J0819R0168j84254j86226j3719
24693e93665L9429K29900J08435R6519k64345n25299L8343N14304K10144J33187
24683a3048O4948R4193O5891J72382K6665n3319j24316J33634m6650l46920m43504
24672d70044N0470M83072K43473J62152j35779l07897j93542l10634j85078j55620
24662h19427K4089J71604j46256j05268K33406L79748J12755P2313J50700J57858
24652B31522M54084k87641n99196M4243J76085R9015K50829l9416m47178m08638
$$ plain form
24642 -526291 -621466 -621183 -250909 -406851 -405721 -143120 30891 -204870 -521097 -408858 -475356
24631 -475356 -465858 -301871 -20420 197752 264175 381454 306283 77176 -41185 149474
24621 149474 185481 -69555 107882 220320 -3416 -384953 -646599 -577167 -383815 -488003
24611 -488003 -542603 -300772 -483409 -612320 -447786 -143354 -56582 66315 -173828 173358
24601 173358 172690 221493 456468 775188 803301 337759 -14840 -48208 422841 602549 863719
24590 863719 732037 528615 278141 -254738 -248856 204092 445834 466071 245911 146500
24580 146500 -3200 -30030 88035 133461 288214 505212 757740 414525 127534 -273748
24570 -273748 105723 221663 95437 -44665 -164248 -59572 -280543 -392137 -289323 -49607
$$ packed form
24642e26291r5175K83L70274j55942J130K62601J74011k35761l16227J12239o6498
24631d75356R498J63987K81451K18172O6423J17279p5171k29107j18361J90659
24621A49474L6007k55036J77437J12438k23736l81537k61646O9432J93352j04188
24611d88003n4600K41831j82637j28911J64534L04432Q6772J22897k40143L47186
24601A73358o68M8803K34975L18720K8113m65542l52599l3368M71049J79708K61170
24590H63719j31682k03422k50474n32879N882M52948K41742K0237k20160r9411
24580A46500j49700k6830J18065M5426J54753K16998K52528l43215k86991m01282
24570b73748L79471J15940j26226j40102j19583J04676k20971j11594J02814K39716
$$ plain form
24560 -49607 23241 124276 74747 167323 298823 147717 -380974 -255084 169710 272698
24550 272698 57448 34809 174187 22462 -419733 -843908 -733695 -585971 -310634 -70655
24540 -70655 143994 -14754 -328 -80571 -221032 -107676 -73851 -231036 -308193 -289882 140565
24529 140565 448634 712748 744616 186696 -41089 -303255 -8283 -46511 115594 59336
24519 59336 -280438 -265663 -359530 -217733 -305288 -403270 -37673 -97095 -21367 52730 -275370
24508 -275370 -294584 -110142 70855 193903 535388 897443 759480 671136 490567 393375
24498 393375 52065 -213034 -422312 -290495 -455333 -330869 -416269 -367521 -532578 -428437
24488 -428437 -496334 -532480 -394162 3502 115030 -42109 -112068 -185571 -282871 -327266 -413729
$$ packed form
24560d9607P2848J01035m9529R2576J31500j51106n28691J25890M24794J02988
24550B72698k15250k2639J39378j51725m42195m24175J10213J47724K75337K39979
24540g0655K14649j58748J4426q0243j40461J13356L3825j57185p7157J8311M30447
24529A40565L08069K64114L1868n57920k27785k62166K94972l8228J62105n6258
24519E9336l39774J4775r3867J41797q7555r7982L65597n9422P5728P4097l28100
24508b75370j9214J84442J80997J23048L41485L62055j37963q8344j80569r7192
24498C93375l41310k65099k09278J31817j64838J24464q5400M8748j65057J04141
24488d28437o7897l6146J38318L97664J11528j57139o9959p3503r7300m4395q6463
$$ plain form
24477 -413729 -237039 -107146 36392 203352 634319 360449 -282369 -561036 -323082 107670
24467 107670 144263 124540 204670 197567 29502 -17134 -17989 319870 560155 381509 212905
24456 212905 52043 -105132 -280123 -334945 -687355 -608196 -571946 -460778 -44392 191362
24446 191362 427775 480277 152732 -131249 -88416 -163889 -530198 -606252 -612781 -347853 -107583
24435 -107583 25839 -183009 -467963 -403719 -219279 -61883 -132821 -42316 355427 279234
24425 279234 268717 314783 362542 55452 -143280 -10327 -244672 -264077 -33620 -58373
24415 -58373 -42489 -42515 116446 375616 420475 101394 184391 492006 454891 585481 469409
24404 469409 50961 -66918 -271968 -489911 -479015 -222523 159141 -83972 -468715 -373716
$$ packed form
24477d13729J76690J29893J43538J66960M30967k73870o42818k78667K37954M30752
24467A07670L6593j9723Q0130p103j68065m6636q55L37859K40285j78646j68604
24456B12905j60862j57175j74991n4822l52410P9159L6250J11168M16386K35754
24446A91362K36413N2502l27545k83981M2833p5473l66309p6054o529K64928K40270
24435a07583J33422k08848k84954O4244J84440J57396p0938R0505L97743p6193
24425B79234j0517M6066M7759l07090j98732J32953k34345j9405K30457k4753
24415e8373J5884k6J58961K59170M4859l19081Q2997L07615l7115J30590j16072
24404D69409m18448j17879k05050k17943J0896K56492L81664k43113l84743R4999
$$ plain form
24394 -373716 -146781 -117041 -256656 -78368 -28655 -286761 -201100 -24759 105229 255407
24384 255407 -58391 -357368 -446653 -592733 -411534 -282757 -382736 -276083 -268227 32698
24374 32698 -28603 66942 -82243 -139496 -270456 -242850 24903 -264274 -451151 -150991
24364 -150991 101102 -141045 -118294 161055 147506 -8763 50486 138656 60002 137111 66977
24353 66977 -64162 -340312 -348890 -486307 -791614 -912642 -756267 -611092 -333312 -98758
24343 -98758 194418 285827 314587 -115941 -364663 -138030 7553 -110934 -155268 -163159 55014
24332 55014 196551 378942 456831 291992 210317 -113673 -139280 -215651 -452946 -644942
24322 -644942 -579100 -616141 -346766 -52084 181262 228117 89006 87677 79747 116606 206619
$$ packed form
24394c73716K26935K9740j39615J78288M9713k58106Q5661J76341J29988J50178
24384B55407l13798k98977q9285j46080J81199J28777r9979J06653P856L00925
24374C2698o1301R5545j49185n7253j30960K7606K67753k89177j86877L00160
24364a50991K52093k42147K2751K79349j3549j56269N9249Q8170p8654P7109p0134
24353F6977j31139k76150q578j37417l05307j21028J56375J45175K77780K34554
24343i8758K93176R1409K8760m30528k48722K26633J45583j18487m4334p891K18173
24332E5014J41537J82391P7889j64839q1675l23990k5607p6371k37295j91996
24322f44942O5842l7041K69375K94682K33346M6855j39111j329p930L6859R0013
$$ plain form
24311 206619 382798 172352 -80517 -105655 261123 338126 141424 -57677 -196767 -114395
24301 -114395 64068 -192231 -194233 306669 347374 330170 320693 159733 360517 325134 447576
24290 447576 292618 -173326 -72068 390039 403481 79053 -86929 -63717 -277221 -129929
24280 -129929 119778 201177 -90196 -425042 40608 152741 -48734 -25632 -344371 -480368
24270 -480368 -578718 -376010 -12702 43008 55233 -77085 249058 502652 476821 554942
24260 554942 469397 420550 239298 214318 236885 -92206 -57301 78791 241449 14140
24250 14140 -560742 -619440 -501883 -171213 163286 132595 -253616 -137220 -130873 -281770
24240 -281770 8827 149072 -133605 -257279 -136360 57922 25141 -474807 -563883 -375324
$$ packed form
24311B06619J76179k10446k52869k5138L66778P7003j96702j99101j39090Q2372
24301a14395J78463k56299k002N00902M0705j7204r477j60960K00784l5383J22442
24290D47576j54958m65944J01258M62107J3442l24428j65982K3212k13504J47292
24280a29929K49707Q1399k91373l34846M65650J12133k01475K3102l18739j35997
24270d80368r8350K02708L63308N5710J2225j32318L26143K53594k5831P8121
24260E54942q5545m8847j81252k4980K2567l29091L4905J36092J62658k27309
24250A4140n74882n8698J17557L30670L34499l0691l86211J16396O347j50897
24240b81770K90597J40245k82677j23674J20919J94282l2781m99948q9076J88559
$$ plain form
24230 -375324 -93076 -157523 -529112 -333582 -45305 29836 -34629 -283651 -251828 -26031
24220 -26031 103546 28682 -330350 -316855 -5718 217685 232599 298947 176309 295325
24210 295325 291905 156205 109709 -49186 -171948 41825 393984 335646 356570 205578
24200 205578 -176401 -200657 -5868 179211 443163 357554 335751 96218 62506 -114905
24190 -114905 -312478 -485732 -474606 -359747 -367867 -269938 121960 363579 287896 -42545
24180 -42545 -90414 132690 138540 -6133 12405 263393 362536 140870 3042 -177535 -365165
24169 -365165 -572485 -491686 -131579 -159386 -5025 85618 -116131 90029 152527 34232
24159 34232 4280 -58774 -207384 -46168 -238004 -444908 -486241 -247297 -139274 -436129
$$ packed form
24230c75324K82248o4447l71589J95530K88277P5141o4465k49022L1823K25797
24220b6031J29577p4864l59032J3495L11137K23403J4914O6348j22638J19016
24210B95325l420j35700m6496j58895j22762K13773L52159n8338K0924j50992
24200B05578l81979k4256J94789J85079K63952q5609k1803k39533l3712j77411
24190a14905j97573j73254J1126J14859q120R7929L91898K41619p5683l30441
24180d2545m7869K23104N850j44673J8538K50988R9143k21666j37828j80577j87630
24169c65165k07320Q0799L60107k7807J54361R0643k01749K06160O2498j18295
24159C4232k9952o3054j48610J61216j91836k06904m1333K38944J08023k96855
$$ plain form
24149 -436129 -359589 -159834 260896 481435 119704 -247528 -64972 118109 161329 82666
24139 82666 -167124 -345454 -217800 -239944 -651893 -379458 -265263 -167045 -112978 -298090
24129 -298090 -376700 -270380 -321069 14168 37607 -148046 -146067 -104457 -190676 -288076 -271225
24118 -271225 -337534 -501491 -479555 -724214 -666032 -338021 -167190 -289837 -79308 -42081
24108 -42081 256012 195590 -87826 -43764 127610 -19979 -217750 -484800 -559126 -157977
24098 -157977 -187156 -269362 -640351 -520844 73976 155232 -23947 50184 -144625 -339621
24088 -339621 -104409 278695 421605 333499 80335 -76450 -282647 -67538 434365 417696
24078 417696 272844 254770 257319 474656 639824 675437 544991 289106 -59940 173493
$$ packed form
24149d36129P6540J99755M20730K20539l61731l67232J82556J83081M3220p8663
24139H2666k49790j78330J27654k2144m11949K72435J14195R8218N4067j85112
24129b98090p8610J06320n0689L35237K3439j85653J979M1610q6219r7400J6851
24118b71225o6309j63957K1936k44659N8182L28011J70831j22647K10529L7227
24108d2081K98093o0422k83416M4062J71374j47589j97771k67050p4326M01149
24098a57977k9179q2206l70989J19507N94820Q1256j79179P4131j94809j94996
24088c39621K35212L83104J42910q8106k53164j56785k06197K15109N01903j6669
24078D17696j44852j8074K549K17337J65168L5613j30446k55885l49046K33433
$$ plain form
24068 173493 388837 356746 380832 602849 494026 96284 -88292 -485310 -262219 6314
24058 6314 -99901 358348 487717 339414 146452 -39924 -88994 -110709 -113998 27954 6230
24047 6230 2648 -34968 4277 215880 305408 380337 224908 269525 424122 669073 498996
24036 498996 630192 411348 134970 -10858 -107874 -330729 -474277 -455177 -279941 78820
24026 78820 101821 260507 558956 638809 249270 -93386 -84548 91635 34733 -114750 111701
24015 111701 319017 279874 389962 395196 49572 -18914 125591 -233133 -276385 -141009
24005 -141009 -102233 -347959 -384193 -128072 -164079 -256203 -212105 -178870 14591 -83092 -32648
23994 -32648 -130178 -181574 -433356 -316339 -391676 -322953 -250991 -278572 -293750 -300564 -327188
$$ packed form
24068A73493K15344l2091K4086K22017j08823l97742j84576l97018K23091K68533
24058F314j06215M58249J29369j48303j92962j86376m9070k1715l289J41952k1724
24047F230l582l7616L9245K11603Q9528P4929j55429M4617J54597K44951j70077
24036D98996J31196k18844k76378j45828r7016k22855j43548J9100J75236L58761
24026G8820K3001J58686K98449P9853l89539l42656Q838J76183n6902j49483K26451
24015A11701K07316l9143J10088N234l45624o8486J44505l58724m3252J35376
24005a41009L8776k45726l6234K56121l6007r2124M4098L3235J93461r7683N0444
23994c2648r7530n1396k51782J17017p5337O8723P1962k7581j5178o814k6624
$$ plain form
23983 -327188 -72291 193262 108890 -273271 -423954 -317668 -523074 -560431 -533192 -299108
23973 -299108 -140541 23140 193108 209028 545 -122372 121765 230212 327530 237969
23963 237969 -65706 -408331 -151476 -27520 42997 -288237 -442166 -14504 -309462 -489659
23953 -489659 -320563 141111 123768 -213767 -275537 -242934 -131266 103943 17571 57532
23943 57532 118339 53862 -66961 -116533 120892 253765 471360 586312 829497 615442
23933 615442 459363 160571 49524 -207538 -111227 3112 11265 338564 709921 792012
23923 792012 497647 130087 15412 185804 261459 232138 292929 317928 31421 -87718
23913 -87718 -334554 -332987 -148492 -56649 -69423 19271 283510 634312 355622 241985 80237
$$ packed form
23983c27188K54897K65553q4372l82161j50683J06286k05406l7357K7239K34084
23973b99108J58567J63681J69968J5920k08483j22917K44137J08447R7318q9561
23963B37969l03675l42625K56855J23956P0517l31234j53929M27662k94958j80197
23953d89659J69096M61674j7343l37535o1770L2603J11668K35209q6372L9961
23943E7532O0807o4477j20823m9572K37425J32873K17595J14952K43185k14055
23933F15442j56079k98792j11047k57062R6311J14339Q153L27299L71357Q2091
23923G92012k94365l67560j14675J70392P5655k9321O0791K4999k86507j19139
23913h7718k46836J567J84495R1843j2774Q8694K64239L50802k78690j13637j61748
$$ plain form
23902 80237 -127608 -42581 -71044 252066 569837 650174 600221 153648 210863 183623 30593
23891 30593 -124278 -227240 27715 41631 223800 399545 379619 118362 -50375 -228329
23881 -228329 -443475 -259323 221577 259044 151473 284313 33683 -263215 -232347 -305041
23871 -305041 -325429 -387621 -228750 -66444 -237484 -584786 -754769 -672086 -374206 -121158
23861 -121158 92746 -62787 -474323 -245666 78754 75229 -104396 -66910 164982 207801
23851 207801 -5302 -367240 -222838 -296015 -310546 -329813 -445965 -392591 110372 285761
23841 285761 286206 179497 322238 108852 4427 -76393 -303086 -380918 -287301 -128418 -384950
23830 -384950 -239659 156746 8160 -417458 -491808 -218499 73582 223166 358185 388533
$$ packed form
23902H0237k07845Q5027k8463L23110L17771Q0337m9953m46573N7215k7240j53030
23891C0593j54871j02962K54955J3916J82169J75745j9926k61257j68737j77954
23881b28329k15146J84152M80900L7467j07571J32840k50630k96898L0868p2694
23871c05041k0388o2192J58871J62306j71040l47302j69983Q2683K97880K53048
23861a21158K13904j55533m11536K28657L24420l525j79625L7486K31892M2819
23851B07801k13103l61938J44402p3177j4531j9267j16152N3374N02963J75389
23841B85761M45j06709J42741k13386j04425q0820k26693p7832R3617J58883k56532
23830c84950J45291L96405j48586m25618p4350K73309K92081J49584J35019L0348
$$ plain form
23820 388533 259653 461871 390662 110008 204802 135448 -122385 -7078 -92106 -16518
23810 -16518 -275471 -280666 -178848 -166317 -235512 -178406 -461417 -437656 -465005 -443286 -422760
23799 -422760 -783147 -774167 -967685 -794652 -698201 -400407 90289 292818 6566 101351
23789 101351 149732 -174559 -84403 -173495 107728 155427 -200275 -157990 -91372 -5776 -44641
23778 -44641 -157600 -135037 34983 149435 19724 61572 174676 13352 -55359 -148260
23768 -148260 58096 143287 111543 -28206 -75920 220895 68632 63616 -71451 -453618
23758 -453618 -408340 -110094 69770 -9797 35252 102949 -5715 -128824 -222209 -55084
23748 -55084 -19560 -240783 -601421 -742510 -439571 -316533 -155 -326891 -412918 -132076
$$ packed form
23820C88533j28880K02218p1209k80654R4794o9354k57833J15307q5028P5588
23810a6518k58953n195J01818J2531o9195N7106k83011K3761k7349K1719K0526
23799d22760l60387Q980j93518J73033R6451K97794M90696K02529k86252R4785
23789A01351M8381l24291R0156q9092K81223M7699l55702M2285O6618Q5596l8865
23778d4641j12959K2563J70020J14452j29711M1848J13104j61324o8711r2901
23768a48260K06356Q5191l1744j39749m7714K96815j52263n016j35067l82167
23758d53618M5278K98246J79864p9567M5049O7697j08664j23109r3385J67125
23748e5084L5524k21223l60638j41089L02939J23038L16378l26736q6027K80842
$$ plain form
23738 -132076 -102144 21581 83296 -270785 -302868 -136883 -36088 33489 285586 91004
23728 91004 -208294 -207413 341738 265666 194280 -158281 -75379 -210274 -184993 165496 133410
23717 133410 271361 400904 230037 -7911 -111544 -208607 -200284 -292513 -341071 -331182 -219166
23706 -219166 -129230 88638 53214 -300838 -683059 -667698 -669306 -590785 -302363 -126329 40487
23695 40487 69843 145714 545147 251929 439345 339310 -27564 -174688 -94448 146262
23685 146262 102370 -186999 65167 490213 276500 134941 -12956 61901 550952 592111
23675 592111 427348 74002 162362 280818 110129 112408 222769 479811 355687 -271252
23665 -271252 -559511 -433539 -219637 177559 419784 13982 -271958 -241494 83856 215097
$$ packed form
23738a32076K9932J23725O1715l54081l2083J65985J00795O9577K52097j94582
23728I1004k99298Q81N49151p6072p1386l52561Q2902j34895K5281L50489l2086
23717A33410J37951J29543j70867k37948j03633r7063Q323r2229m8558R889J12016
23706b19166Q9936K17868l5424l54052l82221J5361j608P8521K88422J76034J66816
23695D0487K9356P5871L99433k93218J87416j00035l66874j47124Q0240K40710
23685A46262m3892k89369K52166M25046k13713j41559j47897P4857M89051M1159
23675E92111j64763l53346Q8360J18456j70689K279J10361K57042j24124o26939
23665b71252k88259J25972K13902L97196K42225m05802k85940L0464L25350J31241
$$ plain form
23655 215097 256673 364674 208300 94123 -38152 -99223 -307457 40620 182621 -94299
23645 -94299 -197140 -306584 -150212 -264923 -459053 -625301 -132248 70659 -11390 -184024
23635 -184024 -185872 -105568 -344607 -657060 -291882 -450008 -426186 -319057 -374399 -96996
23625 -96996 88184 262129 331954 298149 333670 313476 128016 251977 134526 106073 -34939
23614 -34939 120154 737117 749561 402627 -23822 -48906 -102398 166387 334228 316955
23604 316955 -158475 -567593 -590635 -258134 35112 -228922 -419962 -350701 -316063 -349953
23594 -349953 -248753 147933 286429 13298 -114487 138723 250012 267019 458735 555335
23584 555335 517644 366104 365566 169142 94850 77621 -313067 -210958 -188201 -56206 -184936
$$ packed form
23655B15097M1576J08001j56374j14177j32275o1071k08234L48077J42001k76920
23645i4299j02841j09444J56372j14711j94130j66248M93053K02907q2049j72634
23635a84024j848Q0304k39039l12453L65178j58126K3822J07129n5342K77403
23625i6996J85180J73945O9825l3805L5521k0194j85460J23961j17451k8453j41012
23614c4939J55093O16963J2444l46934m26449k5084n3492K68785J67841j7273
23604C16955m75430m09118k3042L32501K93246k64034j91040O9261L4638l3890
23594c49953J01200L96686J38496k73131j27785K53210J11289J7007J91716R6600
23584E55335l7691j51540n38j96424p4292j7229l90688J02109K2757J31995j28730
$$ plain form
23573 -184936 -300245 -79603 -94183 -259140 -264416 -356042 -265546 -66181 125438 23300
23563 23300 235877 304694 64685 -169988 93551 -3708 -141493 -69794 157177 -45500
23553 -45500 -77064 -206378 2193 258848 788896 822275 637271 429439 455860 567795
23543 567795 487744 441846 130382 112540 1466 -44405 -112343 172131 315048 81094
23533 81094 204490 -37758 -271714 -351371 -85520 184353 428090 451994 515326 190953
23523 190953 -146108 -223508 -179310 -257440 -215671 -610617 -532677 -455610 -187767 -39243 106581
23512 106581 318103 596938 636131 161991 24536 131009 -107819 -347703 -529029 -368623
23502 -368623 -97794 -162504 -465333 -647986 -397471 -75351 490906 482066 193726 100616
$$ packed form
23573a84936j15309K20642j4580j64957n276r1626R0496J99365J91619j02138
23563B3300K12577O8817k40009k34673K63539r7259j37785P1699K26971k02677
23553d5500l1564j29314K08571K56655N30048L3379j85004k07832K6421J11935
23543E67795q0051m5898l11464j7842j11074m5871o7938K84474J42917k33954
23533H1094J23396k42248k33956p9657K65851K69873K43737K3904O3332l24373
23523A90953l37061p7400M4198p8130M1769l94946P7940P7067K67843J48524J45824
23512A06581K11522K78835L9193m74140j37455J06473k38828k39884j81326J60406
23502c68623K70829o4710l02829j82653K50515L22120N66257q840k88340r3110
$$ plain form
23492 100616 -63840 -312324 -19249 432789 794925 599968 67150 -276505 -374472 -609107
23482 -609107 -653917 -331538 -332508 -145693 -82834 122263 60644 107848 94517 192197 207292
23471 207292 433521 389121 37275 122161 82134 183038 -57619 82053 329927 527057
23461 527057 632884 441397 383462 121881 -85064 -235755 -263260 -318165 -496977 -423521
23451 -423521 2384 276810 181723 308834 615324 431335 -42015 139706 58186 114802
23441 114802 -207569 -501000 -509164 -539875 -337937 -128331 138707 524731 814251 692856
23431 692856 488119 69758 -69045 164347 -13151 -51155 -129264 -87490 -338153 -240405
23421 -240405 79172 293655 325140 13719 -175354 65526 552916 593468 601261 426767
$$ packed form
23492A00616j64456k48484K93075M52038L62136j94957n32818l43655r7967k34635
23482f09107m4810L22379r70J86815O2859K05097o1619M7204j3331R7680J5095
23471B07292K26229m4400l51846Q4886m0027J00904k40657J39672K47874J97130
23461E27057J05827j91487n7935k61581k06945j50691k7505n4905j78812P3456
23451d23521M25905K74426r5087J27111L06490j83989m73350J81721q1520N6616
23441A14802l22371k93431q164l0711K01938K09606K67038L86024K89520j21395
23431F92856k04737m18361j38803K33392j77498l8004p8109M1774k50663R7748
23421b40405L19577K14483L1485l11421j89073K40880M87390M0552P793j74494
$$ plain form
23411 426767 271734 197488 -66341 210017 379569 178509 38285 193525 89075 -141725
23401 -141725 -277358 22174 -36439 -270745 -11804 296474 252744 116773 89645 210027
23391 210027 310416 78595 -87009 -13343 129536 -61216 6241 127591 244220 289071
23381 289071 526072 536818 105929 236776 324370 362476 184202 263509 278301 329238 315069
23370 315069 527378 424865 128335 -103554 -138394 -309761 -56532 126576 -187289 -112421
23360 -112421 -17783 -276922 -82846 -44559 -136261 -81650 -69855 -212278 -390178 -234415
23350 -234415 65146 -15743 -40922 -842 -140679 -160079 -312126 -135206 -277450 -158653
23340 -158653 -489706 -570437 -158382 248883 510702 387583 -239858 -394492 -437686 -340572
$$ packed form
23411D26767j55033p4246k63829K76358J69552k01060j40224J55240j04450k30800
23401a41725j35633K99532n8613k34306K58941L08278m3730j35971k7128J20382
23391B10027J00389k31821j65604P3666J42879j90752O7457J21350J16629M4851
23381B89071K37001J0746m30889J30847Q7594L8106j78274P9307J4792N0937j4169
23370C15069K12309j02513k96530k31889l4840j71367K53229J83108l13865P4868
23360a12421R4638k59139J94076L8287r1702N4611J1795j42423j77900J55763
23350b34415K99561q0889k5179M0080j39837j9400j52047J76920j42244J18797
23340a58653l31053q0731M12055M07265K61819j23119o27441j54634m3194R7114
$$ plain form
23330 -340572 119829 48148 -438551 -644445 -520800 -183454 -227990 -680331 -1046942 -720061
23320 -720061 -272444 158671 168311 54645 38913 130699 95928 62993 -39347 -172236 -149847
23309 -149847 -147422 32275 -182738 -250635 -76740 -230575 -563873 -396833 -112130 -163043
23299 -163043 -391051 -509280 -356398 -236121 -139125 129756 306008 221534 73020 382799
23289 382799 401226 467163 204032 14804 202111 535907 633432 566666 654664 454697
23279 454697 203920 311806 214427 106643 64654 194971 97647 48990 -50627 -80979 225467
23268 225467 297108 102150 110262 295929 243689 91754 -164451 -202909 35158 157310
23258 157310 21020 46827 191976 -1259 62768 76186 214267 353480 162373 114170
$$ packed form
23330c40572M60401p1681m86699k05894J23645L37346m4536m52341l66611L26881
23320g20061M47617M31115R640j13666j5732R1786l4771l2935j02340j32889K2389
23309a49847K425J79697k15013o7897J73895j53835l33298J67040K84703n0913
23299a63043k28008j18229J52882J20277R6996K68881J76252q4474j48514L09779
23289C82799J8427O5937k63131j89228J87307L33796R7525o6766Q7998j99967
23279D54697k50777J07886r7379j07784m1989J30317r7324m8657r9617l0352L06446
23268B25467P1641j94958Q112J85667n2240j51935k56205l8458K38067J22152
23258A57310j36290K5807J45149j93235O4027J3418J38081J39213j91107m8203
$$ plain form
23248 114170 443593 452583 336291 244120 59997 479417 791802 709741 103277 135814
23238 135814 421458 557834 365743 21189 -8803 95772 193584 83417 181614 167847
23228 167847 -145165 -289325 -168316 80688 -11608 -378351 58681 342291 484007 136927
23218 136927 -95912 -195998 -187138 54053 140427 66658 73731 88563 -221754 -228663 -50475
23207 -50475 243760 284921 589151 454290 264653 -113830 -19293 70475 58748 84250 51202
23196 51202 -12783 -124289 -357601 -431671 -295465 -55761 336093 304918 281340 7758
23186 7758 -425450 -674367 -428657 -143528 14909 -189710 6381 135853 178386 66634
23176 66634 -108711 -223479 -221444 -58237 252191 -127809 -406569 -332680 -194216 147511
$$ packed form
23248A14170L29423Q990j16292r2171j84123M19420L12385q2061o06464L2537
23238A35814K85644J36376j92091l44554k9992J04575R7812j10167R8197j3767
23228A67847l13012j44160J21009K49004r2296l66743M37032K83610J41716l47080
23218A36927k32839j00086Q860K41191Q6374p3769P073J4832l10317o909J78188
23207e0475K94235M1161L04230j34861j89637l78483R4537Q9768j1727K5502l3048
23196E1202o3985j11506k33312p4070J36206K39704L91854l1175k3578k73582
23186G758m33208k48917K45710K85129J58437k04619J96091J29472M2533j11752
23176F6634j75345j14768K035J63207L10428l80000k78760P3889J38464L41727
$$ plain form
23166 147511 196006 216693 169796 107682 254059 382127 159303 91078 175588 370616 214088
23155 214088 122397 86667 -20586 160960 169612 321767 571513 166727 22471 -110085
23145 -110085 23943 430417 440305 167374 -233005 -363441 -328494 -221054 -41207 214657
23135 214657 219824 219574 144858 223454 140585 -29597 214083 327917 125792 -76097 -417089
23124 -417089 -513403 -196163 -179151 -324399 -265185 -75676 91391 154725 162345 -95188 -319333
23113 -319333 -175720 -107274 -193746 -18570 -83309 -393811 -252505 178953 139735 103935
23103 103935 349111 167545 -269554 -47959 -93307 -78606 -252060 -372350 -268744 -388732
23093 -388732 -323853 34153 -48510 -218142 -324124 -20384 70036 -23575 -24317 -30668 18621
$$ packed form
23166A47511M8495K0687m6897o2114J46377J28068k22824o8225Q4510J95028j56528
23155B14088r1691l5730j07253J81546Q652J52155K49746m04786j44256j32556
23145a10085J34028M06474R888k72931m00379j30436L4947J07440J79847K55864
23135B14657N167k50p4716P8596q2869j70182K43680J13834k02125k01889l40992
23124d17089r6314L17240J7012j45248N9214J89509J67067O3334P620k57533k24145
23113c19333J43613O8446q6472J75176o4739l10502J41306M31458l9218l5800
23103A03935K45176j81566m37099K21595m5348J4701j73454j20290J03606j19988
23093c88732O4879L58006q2663j69632j05982L03740R0420r3611p42o351M9289
$$ plain form
23082 18621 134296 376743 496841 698575 792146 346955 126255 239875 179049 72974
23072 72974 152425 167698 -289772 -460416 -361321 -312954 -358444 -656364 -704610 -444184 -21406
23061 -21406 277193 584234 369397 189169 125785 95133 -297541 -365163 -642262 -869252
23051 -869252 -340367 98561 -89087 -210915 -64194 297217 308419 -138897 -146206 38095
23041 38095 -291404 -357051 -30002 68702 176189 412682 421070 130464 -65055 118576
23031 118576 296339 515391 539263 188506 31261 -7745 -138453 -220513 -130306 144206
23021 144206 183236 106973 -22995 -205779 -80995 12918 181782 472097 441377 168190
23011 168190 -148947 -285969 -399526 -364202 -160907 -61342 -107607 -237916 -5315 370637
$$ packed form
23082A8621J15675K42447J20098K01734R3571m45191k20700J13620o0826j06075
23072G2974P9451J5273m57470j70644R9095M8367m5490k97920m8246K60426M22778
23061b1406K98599L07041k14837j80228o3384l0652l92674o7622k77099k26990
23051h69252N28885M38928j87648j21828J46721L61411J1202m47316p309J84301
23041C8095l29499o5647L27049R8704J07487K36493Q388k90606j95519J83631
23031A18576J77763K19052K3872l50757j57245l9006j30708q2060R0207K74512
23021A44206L9030p6263j29968j82784J24784R3913J68864K90315l0720k73187
23011A68190l17137j37022j13557L5324K03295R9565m6265j30309K32601L75952
$$ plain form
23001 370637 375974 516297 804875 523950 146249 -61967 -409767 -267701 -138496 -67865
22991 -67865 -90836 -15373 -448141 -662637 -553961 -377590 50853 210869 -206 -211931
22981 -211931 120440 154981 -85794 -332466 -248242 168043 276046 191080 454108 433397
22971 433397 131094 139529 -100361 -46950 412611 283829 80464 54676 -50148 73318
22961 73318 441788 350244 -115486 -212090 -152503 -299145 -156483 -146313 -326312 -9535
22951 -9535 23856 48979 123415 73456 -95021 47694 -182053 -151660 -30782 -85859 80128
22940 80128 -7310 -409169 -723524 -646198 -585351 -547464 -452930 -464815 -50408 -44923 -192132
22929 -192132 -239642 -211500 -119958 -4857 -324558 -655430 -454723 -477146 -273569 163942
$$ packed form
23001C70637N337J40323K88578k80925l77701k08216l47800J42066J29205P0631
22991f7865k2971P5463m32768k14496J08676J76371M28443J60016k11075k11725
22981b11931L32371L4541k40775k46672Q4224M16285J08003q4966K63028k0711
22971D33397l02303Q435k39890N3411M59561j28782k03365k5788j04824J23466
22961G3318L68470r1544m65730r6604N9587j46642J42662J0170j79999L16777
22951i535L3391K5123P4436m9959j68477J42715k29747L0393J20878n5077J65987
22940H0128q7438m01859l14355P7326O0847L7887R4534j1885M14407N485j47209
22929a92132m7510K8142R1542J15101l19701l30872K00707k2423K03577M37511
$$ plain form
22919 163942 3601 -260645 -40048 -40112 -32688 -62838 92350 38835 -308239 -284424 238078
22908 238078 184454 -50385 -9655 -196918 -333161 -335434 -359139 -234946 -204784 -431424 -408853
22897 -408853 -390753 -65930 73032 351744 693838 670611 430452 668580 290500 198381
22887 198381 399542 29813 -97287 265441 392980 -65439 50790 649035 599122 174456
22877 174456 -204631 -416875 -325829 -257940 -256606 50054 9226 -124218 -14607 27610 206551
22866 206551 304809 39491 -22654 -325576 -350630 -22863 -57151 -39792 71646 -47123
22856 -47123 -160293 -411450 -736831 -801758 -638590 -635576 -384262 -171966 -393054 -569644
22846 -569644 -506023 -85338 -142832 -268285 -224540 -239083 -151088 -433042 -734382 -517339
$$ packed form
22919A63942j60341k64246K20597o4P424l0150J55188n3515l47074K3815N22502
22908B38078n3624k34839M0730j87263j36243k273k3705J24193L0162k26640K2571
22897d08853J8100L24823J38962K78712L42094k3227k40159K38128l78080r2119
22887A98381K01161l69729j27100L62728J27539m58419J16229N98245m9913m24666
22877A74456l79087k12244R1046O7889J334L06660m0828j33444J09611M2217J78941
22866B06551R8258k65318o2145l02922k5054L27767l4288J7359J11438j18769
22856d7123j13170k51157l25381o4927J63168L014K51314K12296k21088j76590
22846e69644O3621M20685n7494j25453M3745j4543Q7995k81954l01340K17043
$$ plain form
22836 -517339 -569978 -369229 -32267 -149513 -61192 112555 246239 509514 395866 116139
22826 116139 -44308 -175787 -230323 -368518 -368381 44183 519101 433481 45734 126524 -65737
22815 -65737 -522780 -599302 -440236 -417314 -495360 -163651 155327 148205 166711 -31537 -205417
22804 -205417 -256220 -92211 113704 103406 -1948 135724 134412 -25593 134371 227251
22794 227251 284132 139350 -127325 -128288 -254674 -179584 -73539 -46371 257930 -243892 -457939
22783 -457939 -322601 -246585 -136465 -50362 -87077 -70093 -143318 -273572 -275750 -222937 -151398
22772 -151398 -19962 192728 196959 225917 134343 239412 75015 -173998 -10934 149804
22762 149804 409509 477211 178226 31539 6021 -93943 3964 -26795 78403 163418 -62729
$$ packed form
22836e17339n2639K00749L36962j17246Q8321J73747J33684K63275j13648k79727
22826A16139j60447j31479n4536j38195J37M12564M74918q5620l87747Q0790j92261
22815f5737m57043p6522J59066K2922p8046L31709L18978p122J8506j98248j73880
22804b05417n0803J64009K05915j0298j05354J37672j312j60005J59964R2880
22794B27251N6881j44782k66675r63j26386P5090J06045K7168L04301n01822k14047
22783d57939J35338P6016J10120Q6103l6715J6984p3225j30254k178N2813P1539
22772a51398J31436K12690M231K8958r1574J05069j64397k49013J63064J60738
22762A49804K59705O7702k98985j46687k5518r9964R7907l0759J05198Q5015k26147
$$ plain form
22751 -62729 -241298 -237233 -62485 -103435 -44103 -33043 -567851 -577914 -565373 -443119 -158660
22740 -158660 -3188 -116334 -188361 -244835 229943 456290 486117 220100 -40849 -22141
22730 -22141 -50435 -88788 -160345 197957 394557 344279 82754 -123833 -82963 129214 62645
22719 62645 175525 136967 149310 -68606 -242854 -373064 -124216 361103 201713 -46136
22709 -46136 -404645 -518574 -501188 -727267 -622499 -494991 -556460 -353028 -227200 -174734
22699 -174734 -326207 -128585 376304 558293 107101 -76519 -83486 41719 -70828 16303
22689 16303 323279 232030 -116152 -263647 -59982 84759 44332 -92467 -30587 -51268
22679 -51268 -392955 -641260 -383231 -148279 -287473 -152233 -62514 8440 7349 -44502 105110
$$ packed form
22751f2729j78569M065J74748m0950N9332J1060n34808j0063J2541J22254K84459
22740a58660J55472j13146p2027n6474M74778K26347K9827k66017k60949J8708
22730b2141k8294l8353p1557L58302J96600n0278k61525k06587M0870K12177o6569
22719F2645J12880l8558J2343k17916j74248j30210K48848M85319j59390k47849
22709d6136l58509j13929J7386k26079J04768J27508o1469K03432J25828N2466
22699a74734j51473J97622N04889J81989m51192j83620o967J25205j12547Q7131
22689A6303L06976r1249l48182j47495K03665J44741m0427j36799O1880k0681
22679e1268l41687k48305K58029K34952j39194J35240Q9719P0954j091n1851J49612
$$ plain form
22668 105110 301234 456131 750038 475050 161614 43659 -102462 222315 966255 1064235
22658 1064235 684277 248936 -184438 -175757 -137700 -113987 149848 -72084 -18916 -64438
22648 -64438 -87232 -238127 -192701 -123963 -53803 -18814 -54704 94328 301035 258106 119087
22637 119087 -26158 -206500 -88427 139884 -23304 -22883 51914 422887 558049 266032
22627 266032 271392 146610 32033 16261 -176320 -430176 -659984 -426772 -179269 33369
22617 33369 144971 -1536 -206198 43542 167819 -42863 311763 246132 170057 105624
22607 105624 67741 -23927 -280523 -55690 27848 45307 222917 19309 -143401 -95665
22597 -95665 -92682 -140617 -430037 -257240 -45759 -182718 -445483 -240281 458306 876852
$$ packed form
22668A05110J96124J54897K93907k74988l13436j17955j46121L24777P43940R7980
22658A064235l79958m35341m33374Q681L8057K3713K63835k21932N3168m5522
22648f4438k2794j50895M5426O8738P0160L4989l5890J49032K06707m2929j39019
22637A19087j45245j80342J18073K28311j63188M21P4797L70973J35162k92017
22627B66032N360j24782j14577j5772j92581k53856k29808K33212K47503K12638
22617C3369J11602j46507k04662K49740J24277k10682L54626o5631p6075o4433
22607A05624l7883r1668k56596K24833Q3538J7459J77610k03608j62710M7736
22597i5665K983m7935k89420J72797K11481j36959k62765K05202O98587M18546
$$ plain form
22587 876852 804960 320653 349645 456430 83634 -192330 -167377 -194061 -426967 -414345
22577 -414345 -364383 -377107 -477370 -269507 -72486 -352497 -507445 -310034 -244473 191400
22567 191400 496228 739000 896836 836572 878682 942898 797107 130876 -116784 45378
22557 45378 537911 490806 414132 412873 296311 -388410 -722552 -369036 -89822 89428
22547 89428 255193 329542 300852 161746 -96305 -211569 -426025 -156026 -23211 175173
22537 175173 27435 197042 131338 -155123 -251179 22758 -33045 -83718 218340 457252
22527 457252 -58780 -541042 -481366 -195604 -211125 -307064 -423073 -459542 -240375 47932
22517 47932 57088 44129 -168971 -158430 -167160 -449501 -640125 -486559 -504779 -630658 -722663
$$ packed form
22587H76852p1892m84307K8992J06785l72796k75964K4953k6684k32906J2622
22577d14345M9962j2724j00263K07863J97021k80011j54948J97411O5561M35873
22567A91400L04828K42772J57836o0264M2110O4216j45791o66231k47660J62162
22557D5378M92533m7105p6674j259j16562o84721l34142L53516K79214J79250
22547H9428J65765P4349k8690j39106k58051j15264k14456K69999J32815J98384
22537A75173j47738J69607o5704k86461r6056K73937n5803n0673L02058K38912
22527D57252n16032m82262N9676K85762j5521r5939j16009l6469K19167K88307
22517D7932R156j2959k13100J0541q730k82341j90624J53566j8220j25879r2005
$$ plain form
22506 -722663 -753171 -750218 -511317 -638347 -597217 -603008 -305293 -279319 53708 -5740 -238115
22495 -238115 -121067 -335292 -143991 -114301 -322005 -468473 -477041 -404163 -246073 -210488
22485 -210488 -47613 299718 348882 469069 424693 356759 68781 55498 57970 -54760 -103813
22474 -103813 54104 -136032 -365021 -381550 -395988 6477 109015 -154475 -146264 -68413
22464 -68413 102429 -7899 -94616 82800 410290 407606 322655 250476 98776 -8547 -83528
22453 -83528 -327644 -715167 -556352 -213064 49774 186484 194278 -3565 -145850 -264149
22443 -264149 -394416 -672584 -426550 -273321 73703 216336 31076 3517 101489 86043
22433 86043 63754 -592053 -658487 -381395 162252 56205 221537 560077 629090 332275
$$ packed form
22506g22663l0508K953K38901j27030M1130n791K97715K5974L33027n9448k32375
22495b38115J17048k14225J91301K9690k07704j46468q568P2878J58090L5585
22485b10488J62875L47331M9164J20187m4376o7934k87978j3283K472j12730m9053
22474a03813J57917j90136k28989j6529j4438M02465J02538k63490Q211P7851
22464f8413J70842j10328q6717J77416L27490k684q4951p2179j51700j07323p4981
22453h3528k44116l87523J58815L43288K62838J36710P794j97843j42285j18299
22443b64149j30267k78168K46034J53229L47024J42633j85260k7559R7972j5446
22433H6043k2289o55807o6434K77092N43647j06047J65332L38540O9013k96815
$$ plain form
22423 332275 319062 497014 637387 585183 431954 532589 727944 743216 625042 731664
22413 731664 961710 881206 508923 34105 34485 279327 138718 -157037 -336950 -442419
22403 -442419 -707962 -604437 -455050 -271546 -357664 -507555 -554559 -576123 -361471 -335032
22393 -335032 -319951 -281098 -170777 -25630 47585 -192481 -356644 -164450 -266610 -8111
22383 -8111 185184 314375 430074 694580 633729 434984 487344 319625 347018 415331 222521
22372 222521 -114822 -100542 311985 597881 480022 49331 -337746 -473132 -635101 -353537
22362 -353537 223917 146067 135819 33375 -117206 -155068 -246958 -197864 33346 298009
22352 298009 122243 -146166 -164810 -53284 115098 111118 264990 -155009 -220106 85423
$$ packed form
22423C32275j3213J77952J40373n2204j53229J00635J95355J5272j18174J06622
22413G31664K30046q0504l72283m74818L80K44842j40609k95755j79913j05469
22403d42419k65543J03525J49387J83504q6118j49891m7004k1564K14652K6439
22393c35032J5081L8853J10321J45147P3215k40066j64163J92194j02160K58499
22383h111J93295J29191J15699K64506o0851j98745N2360j67719K7393O8313j92810
22372B22521l37343J4280M12527K85896j17859m30691l87077j35386j61969K81564
22362c53537N77454p7850j0248j02444j50581l7862r1890M9094K31210K64663
22352B98009j75766k68409j8644J11526J68382l980J53872m19999o5097L05529
$$ plain form
22342 85423 -152985 -571952 -397725 -366566 -170851 258765 328655 322140 359855 200894 326758
22331 326758 453345 553776 38997 -107056 149043 388564 281542 -119321 -285676 -324436
22321 -324436 -561719 -371015 -386418 -370494 -135499 -62863 -144941 -57057 3250 -331321 -493197
22310 -493197 -409773 -534039 -295736 130715 1644 -185532 -378864 -307566 95930 357232
22300 357232 325786 170285 88608 -197691 -53519 -157379 -401180 -239625 -82574 176397
22290 176397 306148 123047 -17833 -262888 -150687 -184383 -115791 -91031 -32721 -414026
22280 -414026 -435373 -611199 -289790 -517616 -733250 -703612 -431378 -208097 -511469 -473818
22270 -473818 -456972 -676621 -469184 -595528 -697180 -299574 -60283 -117857 -18726 124795
$$ packed form
22342H5423k38408m18967J74227L1159J95715M29616O9890o515L7715j58961J25864
22331C26758J26587J00431n14779j46053K56099K39521j07022m00863j66355l8760
22321c24436k37283J90704j5403J5924K34995P2636q2078Q7884O0307l34571j61876
22310d93197Q3424j24266K38303M26451j29071j87176j93332P1298M03496K61302
22300C57232l1446j55501q1677k86299J44172j03860k43801J61555J57051K58971
22290A76397J29751j83101j40880k45055J12201l3696O8592K4760N8310l81305
22280d14026k1347j75826L21409k27826k15634K9638K72234K23281l03372L7651
22270d73818J6846k19649K07437j26344j01652L97606K39291n7574R9131J43521
$$ plain form
22260 124795 35675 27587 403580 58930 109607 165152 172504 -14002 -126471 -226312 -291047
22249 -291047 -52082 427587 563535 105730 70107 -57710 -379084 -286374 -209465 -197271
22239 -197271 -78336 -50601 -90074 -175327 -309460 -527747 -324789 -169039 48627 92957
22229 92957 -238082 -216614 -549475 -485398 -141636 -443255 -333842 -149907 -216132 -457112
22219 -457112 -666559 -455501 -650060 -437842 -312911 -210710 65243 239731 214169 267033
22209 267033 -70503 -56243 190651 94114 -223259 -618553 -642909 -384229 -156180 -86388
22199 -86388 86094 57535 27676 32527 71283 225493 214945 -102649 -253875 -332320 -321891
22188 -321891 15536 272158 212728 413344 173383 -112898 -302577 -466754 -485744 -330832
$$ packed form
22260A24795q9120q088L75993l44650N0677N5545P352j86506j12469r9841o4735
22249b91047K38965M79669J35948m57805l5623j27817l21374R2710P6909J2194
22239a97271J18935K7735l9473q5253j34133k18287K02958J55750K17666M4330
22229I2957l31039K1468l32861O4077L43762l01619J09413J83935o6225k40980
22219d57112k09447K11058j94559K12218J24931J02201K75953J74488k5562N2864
22209B67033l37536J4260K46894r6537l17373l95294k4356K58680K28049O9792
22199h6388J72482k8559k9859M851L8756J54210j0548l17594j51226p8445J0429
22188c21891L37427K56622n9430K00616k39961k86281j89679j64177j8990J54912
$$ plain form
22178 -330832 -507449 -932483 -821580 -411951 -154977 -36168 -5125 -341467 -338161 -259093
22168 -259093 -236637 1900 72958 216590 117836 -124670 27047 374864 361789 50719
22158 50719 -213560 -415316 -114847 -5788 136764 278392 235978 -80069 104088 304668
22148 304668 117180 -47458 -214150 -41732 -15661 -62376 -245872 159579 288536 332394
22138 332394 214137 96942 418932 432020 370364 448866 87909 -69491 -101081 -81794
22128 -81794 7719 179013 256296 232532 12950 -175305 -418363 -119409 7961 178870
22118 178870 275839 136153 165355 99901 30575 -84055 -558562 -541685 -489445 -301833 -320241
22107 -320241 -333856 -424747 -329132 -215514 18289 -96419 -46337 -46396 -201648 -4292 -64721
$$ packed form
22178c30832j76617m25034J10903M09629K56974J18809L1043l36342L306P9068
22168b59093K2456K38537P1058J43632r8754k42506J51717L47817j3075l11070
22158E0719k64279k01756L00469J09059J42552J41628m2414l16047J84157K00580
22148C04668j87488j64638j66692J72418K6071m6715j83496M05451J28957M3858
22138C32394j18257j17195L21990J3088o1656P8502l60957j57400l1590J9287
22128h1794Q9513J71294P7283k3764k19582j88255k43058K98954J27370J70909
22118A78870R6969j39686K9202o5454o9326j14630m74507J6877N2240J87612j8408
22107c20241j3615r0891R5615J13618K33803j14708N0082n9j55252J97356o0429
$$ plain form
22096 -64721 -302984 -304068 -20315 66098 320550 275033 23831 -301791 -486258 -437852 -100866
22085 -100866 139886 -66473 -307131 -308723 -319736 -246885 -232640 -172174 -456666 -372097 -126122
22074 -126122 90120 287376 432903 236318 -86465 -153442 -45875 19622 261349 347200
22064 347200 -190859 -549676 -627065 -371471 -202118 -222765 -294120 -74491 39127 130497
22054 130497 344236 733486 994659 985379 592966 465419 573336 399364 84280 94339
22044 94339 30154 187837 375641 296131 191383 -32148 -376689 -600743 -654620 -543348
22034 -543348 -334410 -33750 172554 -10016 -82331 45247 393226 505457 305141 109328
22024 109328 -367625 -4212 334388 587936 561959 431705 196457 310703 114608 -264644
$$ packed form
22096f4721k38263j084K83753Q6413K54452m5517k51202l25622j84467M8406L36986
22085a00866K40752k06359k40658j592j1013P2851J4245O0466k84492Q4569K45975
22074a26122K16242J97256J45527j96585l22783o6977J07567O5497K41727Q5851
22064C47200n38059l58817p7389K55594J69353k0647p1355K19629J13618R1370
22054A30497K13739L89250K61173r280l92413j27547J07917j73972l15084J0059
22044I4339o4185J57683J87804p9510j04748k23531l44541k24054n3877J11272
22034e43348K08938L00660K06304j82570p2315J27578L47979J12231k00316j95813
22024A09328m76953L63413L38600K53548k5977j30254k35248J14246j96095l79252
$$ plain form
22014 -264644 -259264 -74201 -177114 -177633 -227024 -316879 64576 162760 114603 186048 585137
22003 585137 177643 -50668 15614 -189620 -424355 -336555 -378725 50321 -91136 -135940
21993 -135940 -148355 -412276 -544056 -408882 -29474 42224 25246 47450 60529 246373
21983 246373 368503 160962 -1741 -419268 -528050 -111995 90357 311300 -212986 -521953
21973 -521953 -399474 -469726 -359018 -404593 -452433 -232657 -176735 27221 187651 299311
21963 299311 19943 -187843 -520443 -460817 -331858 -200425 153326 -118169 -352357 -298089
21953 -298089 -712230 -928795 -626898 -275461 -266392 -205204 -254462 -213468 -188263 -462555 -504400
21942 -504400 -382758 52375 13951 171749 398135 421009 140984 -87028 -91184 8924
$$ packed form
22014b64644N380J85063j02913n19m9391q9855L81455R8184m8157P1445L99089
22003E85137m07494k28311O6282k05234k34735Q7800m2170M29046j41457m4804
21993a35940j2415k63921j31780J35174L79408P1698j6978K2204J3079J85844
21983B46373J22130k07541j62703m17527j08782M16055K02352K20943n24286l08967
21973e21953J22479p0252J10708m5575m7840K19776N5922K03956J60430J11660
21963B99311k79368k07786l32600N9626J28959J31433L53751k71495k34188N4268
21953b98089m14141k16565L01897L51437R069O1188m9258M0994K5205k74292m1845
21942e04400J21642M35133l8424J57798K26386K2874k80025k28012m156J00108
$$ plain form
21932 8924 166544 271584 274571 -79904 -129293 129882 63418 -335246 -395239 -373930 -425006
21921 -425006 -131223 168028 477499 471483 106958 -158118 -140059 -456291 -460183 -246187
21911 -246187 -44256 41117 356706 421475 347161 268193 571782 481656 550931 549258 366842
21900 366842 -7078 15495 301730 293620 239173 147392 238453 159017 89050 77033 91853
21889 91853 -97146 115063 18128 -135370 -283693 -175223 -324902 -502571 -243311 -69064
21879 -69064 -244576 -388291 -396754 -175357 -49823 -220339 -161759 -55698 116454 194198
21869 194198 244640 -170323 -257474 -257223 -750845 -619572 -567323 -563960 -244862 -60281 262644
21858 262644 170496 7884 -412334 -549592 -407875 -282271 4943 287125 326509 157518
$$ packed form
21932H924J57620J05040K987l54475m9389K59175o6464l98664n9993K1309n1076
21921d25006K93783K99251L09471o016l64525k65076J8059l16232l892K13996
21911b46187K01931Q5373L15589O4769p4314p8968L03589r0126O9275j673j82416
21900C66842l73920K2573K86235q110n4447r1781R1061p9436o9967j2017J4820
21889I1853j88999K12209r6935j53498j48323J08470j49679j77669K59260J74247
21879f9064j75512j43715q463K21397J25534j70516N8580J06061J72152P7744
21869A94198N0442m14963q7151K51m93622J31273N2249L363L19098J84581L22925
21858B62644r2148j62612m20218j37258J41717J25604K87214K82182L9384j68991
$$ plain form
21848 157518 -21218 138142 -48132 -137873 -21341 140637 21804 -85728 -396333 -528448
21838 -528448 -122570 -68246 74331 14912 70915 -53271 -22313 -70905 150320 520792
21828 520792 450217 370949 206965 -26459 341787 342941 154716 228631 60797 -82396
21818 -82396 -316266 -272803 -127274 -162713 68362 306123 401998 70461 -341831 -462156
21808 -462156 -419069 -265062 33769 109862 222101 93899 -177630 -393441 -515586 -333563
21798 -333563 7377 140699 38990 68018 269754 299906 242730 76778 75003 104346 432615
21787 432615 195948 -214382 -383113 -184309 129676 -109103 -311727 -375848 -293628 -225748
21777 -225748 -178036 -96053 143434 193803 190405 -160393 -13618 -23733 132089 -30296 -187019
$$ packed form
21848A57518j78736J59360j86274q9741J16532J61978j18833j07532l10605j32115
21838e28448M05878N4324J42577n9419N6003j24186L0958m8592K21225L70472
21828E20792p0575p9268j63984k33424L68246J154j88225P3915j67834j43193
21818h2396k33870M3463J45529l5439K31075K37761R5875l31537m12292j20325
21808d62156M3087J54007K98831P6093J12239j28202k71529k15811j22145J82023
21798c33563L40940J33322j01709K9028K01736L0152n7176j65952j775K9343L28269
21787D32615k36667m10330j68731J98804L13985k38779k02624o4121Q2220O7880
21777b25748M7712Q1983K39487N0369l398l50798J46775j0115J55822j62385j56723
$$ plain form
21766 -187019 -152547 -122253 -426740 -718606 -572866 -543226 -331715 -289376 -52436 150987
21756 150987 305607 216003 227823 -41393 -32138 154667 -1844 179053 371527 223120
21746 223120 124275 98206 194120 -27371 1379 -11309 -525432 -166039 198246 584253
21736 584253 753861 690495 554351 261298 278123 205051 207294 88714 -131308 -625
21726 -625 216535 298743 105206 52737 227273 -98664 -213717 -299877 59291 285154 226443
21715 226443 119747 -68160 -156052 -137827 109609 175887 93551 -447847 -638526 -383800
21705 -383800 22676 197866 259071 -18539 -151923 -493011 -479856 -44761 133616 -165062
21695 -165062 -118125 51354 19308 -253489 -359956 23967 -187401 -282038 -176272 -17972
$$ packed form
21766a87019L4472L0294l04487k91866J45740K9640K11511M2339K36940K03423
21756A50987J54620q9604J1820k69216R255J86805j56511J80897J92474j48407
21746B23120r8845k6069R5914k21491K8750j2688n14123L59393L64285L86007
21736E84253J69608o3366j36144k93053J6825p3072K243j18580k20022J30683
21726f25K17160Q2208j93537n2469J74536l25937j15053q6160L59168K25863n8711
21715B26443j06696j87907q7892J8225K47436O6278q2336n41398j90679K54726
21705c83800M06476J75190O1205k77610j33384l41088J3155M35095J78377k98678
21695a65062M6937J69479l2046k72797j06467L83923k11368r4637J05766J58300
$$ plain form
21685 -17972 315847 186693 -126503 87288 328475 350408 319000 400840 126615 111179
21675 111179 12635 298277 368113 44148 -145942 12757 237356 286454 566879 448846
21665 448846 150695 57355 159465 163928 49993 236632 300683 -103218 -586812 -608070
21655 -608070 -108045 194226 45232 46478 -131644 -152975 -180701 -9884 72904 -32258
21645 -32258 -251394 -365596 -177533 -217766 -247710 -288803 -51885 -409263 -496105 -775928
21635 -775928 -1044495 -794532 -325440 37455 119424 -90756 -62368 -410798 -626021 -607569
21625 -607569 -269604 -191014 -471983 -598307 -516822 -418851 -324076 -294737 -48596 -23998 79357
21614 79357 131624 -248092 -381954 -178772 -494449 -871013 -1045678 -824202 -305870 -78158
$$ packed form
21685a7972L33819j29154l13196K13791K41187K1933l1408Q1840k74225j5436
21675A11179r8544K85642O9836l23965j90090J58699K24599M9098K80425j18033
21665D48846k98151r3340J02110M463j13935J86639O4051m03901m83594k1258
21655f08070N00025L02271j48994J246j78122k1331k7726J70817Q2788j05162
21645c2258k19136j14202J88063m0233k9944m1093K36918l57378q6842k79823
21635g75928k68567K49963M69092L62895Q1969k10180K8388l48430k15223J8452
21625f07569L37965P8590k80969j26324Q1485R7971R4775K9339K46141K4598J03355
21614G9357N2267l79716j33862K03182l15677l76564j74665K21476N18332K27712
$$ plain form
21604 -78158 -25699 8382 -178716 -216491 -252044 22804 131723 270180 415535 498634 423142
21593 423142 181423 242277 154343 58869 138111 157012 331884 227036 144579 213351 480478
21582 480478 586364 450720 204079 -72830 187567 456748 370631 358114 646026 824444
21572 824444 433771 209957 172639 92439 299283 355297 261022 325148 316234 142712 82084
21561 82084 -69597 13693 -55370 -80306 -208765 -391704 -373627 -481840 -822282 -652048
21551 -652048 -246662 157844 -3910 -144223 -227586 -255756 -392723 -610999 -488308 -128571
21541 -128571 111341 414789 512111 545380 505278 321350 -9845 -324 459482 766941
21531 766941 758658 896417 709505 806262 819896 646038 1209168 2065537 2566398 2720854
$$ packed form
21604g8158N2459L4081j87098l7775l5553K74848J08919J38457J45355Q3099p5492
21593D23142k41719O0854q7934r5474P9242J8901J74872j04848q2457O8772K67127
21582D80478J05886j35644k46641k76909K60397K69181q6117j2517K87912J78418
21572H24444l90673k23814l7318q0200K06844N6014r4275O4126q914j73522o0628
21561H2084j51681Q3290o9063k4936j28459j82939J8077j08213l40442J70234
21551f52048M05386M04506j61754j40313q3363k8170j36967k18276J22691L59737
21541a28571K39912L03448R7322L3269m0102j83928l31195R521M59806L07459
21531G66941q283J37759j86912R6757J3634j73858N63130Q56369N00861J54456
$$ plain form
21521 2720854 2603482 2401306 2118858 2237820 2159988 2217399 1878077 1781078 1694472 1144725
21511 1144725 637294 467935 600037 878397 664975 687829 520307 254653 162578 197556
21501 197556 172180 -170539 -243533 47430 404053 186170 52226 142752 -43739 -214753
21491 -214753 -466648 -442541 -169011 180693 126149 -23640 -185611 -181900 -151767 -75090 157796
21480 157796 -16500 -75102 -3024 -168676 -49760 207465 482081 654327 674732 154205
21470 154205 -106422 64141 -57345 -142954 -47406 385096 410221 -115981 -420380 -15297
21460 -15297 217632 230082 136789 -118692 -375330 -123236 -140208 -417134 -613285 -697849
21450 -697849 -325492 141218 107107 268881 165816 324862 544976 567319 529119 732050
$$ packed form
21521B720854j17372k02176k82448J18962p7832N7411l39322r6999q6606n49747
21511A144725n07431j69359J32102K78360k13422K2854j67522k65654r2075L4978
21501A97556k5376l42719p2994K90963L56623k17883j33944R0526j86491j71014
21491b14753k51895K4107K73530L49704n4544j49789j61971L711L0133P6677K32886
21480A57796j74296n8602P2078j65652J18916K57225K74616J72246K0405n20527
21470A54205k60627J70563j21486q5609R5548M32502K5125n26202l04399M05083
21460a5297K32929J2450r3293k55481k56638K52094j6972k76926j96151q4564
21450f97849L72357M66710l4111J61774j03065J59046K20114K2343l8200K02931
$$ plain form
21440 732050 486499 283091 41129 -102674 -325590 -535791 -142869 22953 -117757 -203664
21430 -203664 -272252 -91306 49050 29341 85028 280666 546592 431184 -90101 -226885
21420 -226885 -484013 -493620 -296917 -225266 93205 357550 605424 321390 560723 627698
21410 627698 625253 133544 -206366 -164938 48912 312548 303498 -73066 -164926 -279706 -271061
21399 -271061 -324122 -775829 -877764 -456830 -182285 -130312 -78827 10029 30417 137832
21389 137832 115124 298731 437676 515724 325444 257428 555084 417120 233642 57295
21379 57295 -224911 -546549 -542282 -323447 -203905 -121284 -35093 29752 30194 162288 77867
21368 77867 72245 54337 -236592 -348457 86691 -179694 -353461 -406756 -462458 -594145 -464543
$$ packed form
21440G32050k45551k03408k41962j43803k22916k10201L92922J65822j40710q5907
21430b03664o8588J80946J40356j9709N5687J95638K65926j15408n21285j36784
21420b26885k57128r607J96703P1651L18471K64345K47874k84034K39333O6975
21410F27698k445m91709l39910M1428K13850K63636r050l76564r1860j14780Q645
21399b71061n3061m51707j01935M20934K74545N1973N1485Q8856K0388J07415
21389A37832k2708J83607J38945P8048j90280o8016K97656j37964j83478j76347
21379E7295k82206l21638M267K18835J19542Q2621Q6191O4845M42J32094q4421
21368G7867n622j7908k90929j11865M35148k66385j73767n3295n5702j31687J29602
$$ plain form
21357 -464543 -34531 143573 329375 552505 766645 248936 168995 233913 276350 410172
21347 410172 379173 523531 261535 161342 35997 361920 573224 562158 295060 -1524
21337 -1524 185879 416151 175084 32652 -33213 -155168 -204900 -45231 -217800 -157173
21327 -157173 66580 290157 188400 181750 136876 229816 3972 -256845 -287223 -68454
21317 -68454 215671 360348 393944 619883 431389 -20754 -152052 172834 317704 101793
21307 101793 60090 182124 118550 67287 270000 461402 162904 18917 -218859 -641910
21297 -641910 -633204 -359599 -281585 -180311 -96888 -115279 -164971 149894 2824 -74562 218441
21286 218441 -821 79673 258519 106761 -88855 172757 73901 338838 186066 360192
$$ packed form
21357d64543M30012J78104J85802K23130K14140n17709p9941O4918M2437J33822
21347D10172l0999J44358k61996j00193j25345L25923K11304j1066k67098k96584
21337a524J87403K30272k41067j42432o5865j21955m9732J59669j72569O0627
21327a57173K23753K23577j01757o650m4874R2940k25844k60817l0378K18769
21317f8454K84125J44677L3596K25939j88494m52143j31298L24886J44870k15911
21307A01793m1703J22034o3574n1263K02713J91402k98498j43987k37776m23051
21297f41910Q706K73605P8014J01274Q3423j8391m9692L14865j47070p7386K93003
21286B18441k19262Q0494J78846j51758j95616K61612r8856K64937j52772J74126
$$ plain form
21276 360192 -21447 61305 207978 260617 214910 349046 371172 260412 197957 94607
21266 94607 182627 -69202 -399715 -513663 -519548 -374090 66596 39143 -7073 411242 505822
21255 505822 471784 -34284 -360349 -178663 -30154 -77281 103848 -38663 -15280 222083
21245 222083 248147 146244 399753 58706 -230816 -194938 225194 461623 356171 267636
21235 267636 407107 294014 287284 553603 69439 -242550 353832 420337 285136 197311
21225 197311 135347 93999 138101 373917 414646 505964 402601 407935 540790 357673 -159860
21214 -159860 -90404 -54049 -95519 -106839 -325401 -150907 -146092 222199 400777 -1393 -366012
21203 -366012 -453589 -198030 -433311 -349233 -59221 158908 198927 371909 431190 164557
$$ packed form
21276C60192l81639Q2752J46673N2639m5707J34136K2126j10760o2455j03350
21266I4607Q8020k51829l30513j13948n885J45458M40686k7453m6216M18315R4580
21255E05822l4038n06068l26065J81686J48509m7127J81129j42511K3383K37363
21245B22083K6064j01903K53509l41047k89522L5878M20132K36429j05452q8535
21235B67636J39471j13093o730K66319m84164l11989N96382O6505j35201q7825
21225A97311o1964m1348M4102K35816M0729R1318j03363N334J32855j83117n17533
21214a59860O9456L6355m1470j1320k18562J74494M815L68291J78578m02170l64619
21203c66012q7577K55559k35281Q4078K90012K18129M0019J72982N9281k66633
$$ plain form
21193 164557 -186173 -372704 -187899 -155839 -222798 -65881 220251 165815 -199273 -304719
21183 -304719 -285563 -65364 -4152 -189777 -298028 -180878 -203913 -164843 126021 368999
21173 368999 524920 287697 63947 162774 21762 -15290 503489 599345 387814 324327
21163 324327 569900 635429 682107 546128 312255 406839 336217 140376 -22113 11547
21153 11547 98170 166223 453087 103838 -133736 330410 637267 650148 426898 614624
21143 614624 964657 863702 492997 640294 827855 975590 600636 416580 346262 160308
21133 160308 -320275 -353910 -311058 -298328 -193392 536229 1000936 568211 457247 567252
21123 567252 245430 97697 275157 441412 319666 448392 597578 209320 91747 505758
$$ packed form
21193A64557l50730j86531J84805L2060o6959J56917K86132n4436l65088j05446
21183c04719J9156K20199O1212j85625j08251J17150k3035L9070K90864K42978
21173C68999J55921k37223k23750R8827j41012l7052N18779R5856k11531o3487
21163C24327K45573O5529M6678j35979k33873R4584p0622j95841j62489L3660
21153A1547Q6623O8053K86864l49249k37574M64146L06857J2881k23250J87726
21143F14624L50033j00955l70705J47297J87561J47735l74954j84056p0318j85954
21133A60308m80583l3635M2852J2730J04936P29621M64707m32725j10964J10005
21123E67252l21822j47733J77460J66255j21746J28726J49186l88258j17573M14011
$$ plain form
21113 505758 362437 -107973 41667 225409 155760 87295 129272 362626 499268 183182
21103 183182 330238 608312 646812 649452 852759 880433 821790 803607 1072181 938747 644757
21092 644757 674051 564064 266516 299229 467764 406635 189334 58585 -96169 153261
21082 153261 345732 313342 303762 486607 186850 -6243 54606 180434 242196 247010 230504
21071 230504 465711 492962 527869 252811 311735 494088 382682 374339 622271 463701
21061 463701 -30802 157583 -148729 -258270 -154637 89432 -28591 -293458 -151606 -170137
21051 -170137 378870 660656 764357 776004 783513 1231863 1643077 1405913 868777 464854
21041 464854 594181 1047781 1184334 865234 527604 618555 702888 540495 772818 758383
$$ packed form
21113E05758j43321m70410J49640J83742o9649o8465M1977K33354J36642l16086
21103A83182J47056K78074L8500K640K03307K7674n8643j8183K68574j33434k93990
21092F44757K9294j09987k97548L2713J68535o1129k17301j30749j54754K49430
21082A53261J92471l2390r580J82845k99757j93093O0849J25828O1762M814j6506
21071B30504K35207K7251L4907k75058N8924J82353j11406q343K47932j58570
21061D63701m94503J88385l06312j09541J03633K44069j18023k64867J41852j8531
21051a70137N49007K81786J03701J1647P509M48350M11214k37164n37136m03923
21041D64854J29327M53600J36553l19100l37630R0951Q4333j62393K32323j4435
$$ plain form
21031 758383 899240 962492 921560 571085 474705 930813 1435361 1298368 1063775 1024061
21021 1024061 988467 905148 745523 770224 978117 988156 859686 1078525 1315804 1321136
21011 1321136 1312323 1400993 1831640 1785801 1194318 953330 1056076 1054451 1225057 1069369
21001 1069369 1120421 1073045 978350 787868 1034589 1555254 1610292 1648362 1491733 1282587
20991 1282587 1478153 1905553 2082810 1906364 1711347 1754247 2045976 2254369 2162443 2282675
20981 2282675 2582639 2693182 2441244 2415881 2338522 2255424 2022940 2029115 1774184 1686637
20971 1686637 1784519 2120397 2344223 2005767 2136046 2275040 2619671 2825195 2566899 2125219
20961 2125219 2142325 2334592 2103755 1965925 2309869 2144518 2073476 2203768 2549608 2758740
$$ packed form
21031G58383J40857O3252m0932l50475r6380M56108N04548j36993k34593l9714
21021A024061l5594q3319j59625K4701K07893J0039j28470K18839K37279N332
21011A321136q813Q8670M30647m5839n91483k40988J02746j625J70606j55688
21001A069369N1052m7376r4695j90482K46721N20665N5038L8070j56629k09146
20991A282587J95566M27400J77257j76446j95017M2900K91729K08393r1926J20232
20981B282675K99964J10543k51938k5363p7359q3098k32484O175k54931q7547
20971A686637R7882L35878K23826l38456J30279J38994L44631K05524k58296m41680
20961B125219J7106J92267k30837j37830L43944j65351p1042J30292L45840K09132
$$ plain form
20951 2758740 2813624 2774626 2807751 2995439 3218407 3113250 3206735 3472804 3485058 3495106
20941 3495106 3431067 3351932 3428789 3497285 3314252 3513583 3741627 3718884 3797173 3769750 4033012
20930 4033012 3955372 4118075 4303954 4565534 5088846 5329856 5542787 5599203 5754308 5918523
20920 5918523 5988560 6199911 6626319 7343002 7899975 8163234 8592955 9283140 10058412 10590943
20910 10590943 11048277 11500426 12122490 12742939 13365174 14127487 14976097 15273202 15737873
20901 15737873 16233302 16914551 17446585 18221494 18430884 18510405 18804603 18971284 19792561
20892 19792561 20495403 21656166 23050512 24560947 26063900 27619914 29569148 32245011
20884 32245011 35158528 38406500 42455969 46959065 52234420 58172237 65431945 73988895
$$ packed form
20951B758740N4884l8998L3125J87688K22968j05157R3485K66069J2254J0048
20941C495106o4039p9135P6857O8496j83033J99331K28044k2743P8289k7423K63262
20930D033012p7640J62703J85879K61580N23312K41010K12931N6416J55105J64215
20920E918523P0037K11351M26408P16683N56973K63259M29721O90185P75272N32531
20910A0590943M57334M52149O22064O20449O22235P62313Q48610K97105M64671
20901A5737873M95429O81249N32034P74909K09390P9521K94198J66681Q21277
20892A9792561P02842J160763J394346J510435J502953J556014J949234K675863
20884C2245011K913517L247972M049469M503096N275355N937817P259708Q556950
$$ plain form
20876 73988895 84004518 95857898 110358458 128196036 150298318 177599808 211734953
20869 211734953 254301478 306738291 366792330 428142523 480257908 509100568 507391502
20862 507391502 476620189 425074959 363578399 302248930 248192061 203182551 166708011
20855 166708011 138270391 115683179 97380617 82452149 70756673 61559087 53900259
20848 53900259 47432031 42545301 38096574 34381237 31386453 28707977 26547277 24399487
20840 24399487 22630016 21254710 19775404 18529288 17332137 16401125 15631613 15210660
20832 15210660 14688965 14674529 14766503 14715907 14405743 13951722 13318384 12733175 12154948 11626329
20822 11626329 10925170 10458127 9991188 9802663 9807350 9628568 9144267 8465805 7715954 7552037
$$ packed form
20876G3988895J0015623J1853380J4500560J7837578K2102282K7301490L4135145
20869B11734953M2566525N2436813O0054039O1350193N2115385K8842660j709066
20862E07391502l0771313n1545230o1496560o1329469n4056869m5009510l6474540
20855A66708011k8437620k2587212j8302562j4928468j1695476r197586p658828
20848E3900259o468228m886730m448727l715337k994784k678476k160700k147790
20840B4399487j769471j375306j479306j246116j197151r31012p69512m20953
20832A5210660n21695j4436R1974n0596l10164m54021o33338n85209n78227n28619
20822A1626329p01159m67043m66939j88525M687j78782m84301o78462p49851j63917
$$ plain form
20812 7552037 7321112 6413458 5736161 5469191 4966866 4630970 4623137 4732829 4452097 4152514
20802 4152514 3858415 3366792 2957851 2589503 2556098 2692760 2810953 2851494 2758742 2804113
20792 2804113 2843877 2488155 2290180 2525395 2147029 1744335 1693315 2071721 1903466 1594066
20782 1594066 1265705 1302740 1479146 1635452 1393980 1479718 1519688 1531055 1917882 2059048
20772 2059048 1778652 1253842 1352132 1600736 1628866 1490299 1312534 1129294 1253556 1147176
20762 1147176 751113 673200 625820 889656 1078040 1082593 1143675 1072733 796614 1116074
20752 1116074 1161043 1128357 1529502 1366555 1500623 1537477 1083836 460640 336715 317101
20742 317101 272616 269155 95009 91778 452310 707614 914460 780588 558840 686695
$$ packed form
20812G552037k30925r07654o77297k66970n02325l35896p833J09692k80732k99583
20802D152514k94099m91623m08941l68348l3405J36662J18193M0541r2752M5371
20792B804113L9764l55722j97975K35215l78366m02694n1020L78406j68255l09400
20782A594066l28361L7035J76406J56306k41472Q5738L9970J1367L86827J41166
20772B059048k80396n24810R8290K48604K8130j38567j77765j83240J24262j06380
20762A147176l96063p7913m7380K63836J88384M553O1082p0942k76119L19460
20752A116074M4969l2686M01145j62947J34068L6854m53641o23196j23925j9614
20742C17101m4485l461j74146l231L60532K55304K06846j33872k21748J27855
$$ plain form
20732 686695 664366 593036 609382 702191 750155 607407 411742 347742 681747 578509 167017
20721 167017 43196 96994 251321 390236 86620 39854 -10149 -123469 -230750 -173237
20711 -173237 73490 126750 87995 -53547 -195366 -312288 90254 367029 532982 804639
20701 804639 735790 806521 657496 530881 476772 448824 362999 250953 340500 331955 255586
20690 255586 -17748 -63218 116944 23599 -250221 -89979 -24176 122629 107160 55105
20680 55105 293986 229500 -107903 -255463 14543 373896 836759 982336 812253 809032
20670 809032 803764 691973 772540 830534 893008 815848 733854 463096 241989 317936 350531
20659 350531 409876 322950 118186 296857 530633 794852 727548 528188 530315 141644
$$ packed form
20732F86695k2329p1330J6346R2809M7964j42748j95665o4000L34005j03238m11492
20721A67017j23821N3798J54327J38915l03616m6766n0003j13320j07281N7513
20711a73237K46727N3260l8755j41542j41819j16922M02542K76775J65953K71657
20701H04639o8849P0731j49025j26615n4109k7948q5825j12046Q9547q545p6369
20690B55586k73334m5470J80162r3345k73820J60242O5803J46805j5469n2055
20680E5105K38881o4486l37403j47560K70006L59353M62863J45577j70083l221
20670H09032n268j11791Q0567N7994O2474p7160q1994k70758k21107P5947L2595
20659C50531N9345q6926k04764J78671K33776K64219o7304j99360K127l88671
$$ plain form
20649 141644 41756 156232 383404 602957 526867 457170 453229 775100 847640 588258 216889
20638 216889 37882 3892 261378 447798 283634 90600 429575 640800 408461 72166
20628 72166 255441 387969 491989 618381 695125 846835 583767 342783 380258 779268
20618 779268 809902 905685 609085 345994 16700 -75712 166810 350450 385669 514867
20608 514867 495087 205043 36212 -126987 -136999 158030 399949 135043 78006 72341
20598 72341 424758 476453 363009 391590 363097 210059 424333 529740 345678 300883
20588 300883 45685 -116217 -13487 -109070 -229925 -100518 176258 404374 465358 197358
20578 197358 181713 105255 -196579 -177067 -152012 -228551 136759 391868 374699 508601 534876
$$ packed form
20649A41644r9888J14476K27172K19553p6090o9697l941L21871P2540k59382l71369
20638B16889j79007l3990K57486J86420j64164j93034L38975K11225k32339l36295
20628G2166J83275J32528J04020J26392P6744J51710k63068k40984L7475L99010
20618G79268L0634R5783k96600k63091l29294r2412K42522J83640L5219J29198
20608E14867j9780k90044j68831j63199j0012K95029K41919k64906n7037n665
20598G2341L52417N1695j13444K8581k8493j53038K14274J05407j84062m4795
20588C00883k55198j61902J02730r5583j20855J29407K76776K28116O0984k68000
20578A97358j5645p6458l01834J9512K5055p6539L65310K55109j7169J33902K6275
$$ plain form
20567 534876 320417 47570 -22443 -73226 -136560 200343 341271 603359 560814 558702 561704
20556 561704 750160 882680 528598 521171 633039 480831 488428 310736 -156413 -3855
20546 -3855 25020 123923 21248 -5605 -92080 -249640 -136763 -94672 -173502 -314222 -145852
20535 -145852 -282104 -479798 -154919 19418 -134726 -160861 53859 161014 -156117 -506449
20525 -506449 -886501 -750615 -644495 -503772 -282951 -343690 -422205 -215506 -35769 153555
20515 153555 3417 34175 144890 169580 -133581 -6543 -2576 17872 200678 146408 -3907
20504 -3907 -131510 -131333 -121380 208387 -80270 -161381 -174037 -417478 -462263 -215723 -158502
20493 -158502 -450992 -347414 -381839 -341029 -91760 28640 -200094 -59293 95361 193242
$$ packed form
20567E34876k14459k72847p0013n0783o3334L36903J40928K62088m2545k112L002
20556E61704J88456J32520l54082p427J11868j52208P597j77692m67149J52558
20546c855K8875R8903j02675k6853q6475j57560J12877M2091p8830j40720J68370
20535a45852j36252j97694L24879J74337j54144k6135K14720J07155l17131l50332
20525e06449l80052J35886J06120J40723K20821o0739p8515K06699J79737J89324
20515A53555j50138L0758J10715K4690l03161J27038L967K0448J82806n4270j50315
20504c907j27603J77R953L29767k88657q1111j2656k43441m4785K46540N7221
20493a58502k92490J03578l4425M0810K49269J20400k28734J40801J54654R7881
$$ plain form
20483 193242 -33767 123617 -217045 -422834 -573591 -481705 -28173 432319 -321297 -412380
20473 -412380 -50993 -126071 113935 434095 259063 -25113 -89259 -221551 -362184 -434591
20463 -434591 -486435 -409739 -274434 -273377 -186939 -434313 -669789 -379362 -88461 -102357 -57382
20452 -57382 94991 157976 103768 273497 647595 744361 454939 185937 -146543 -127409
20442 -127409 2235 202157 248718 126820 -24971 9927 70464 153802 334074 -127300
20432 -127300 -316786 -217136 -470738 -557352 -729791 -386171 84141 105049 195662 73500
20422 73500 -304869 -609286 -579931 -300674 -270326 -654710 -439068 47997 392705 417380
20412 417380 56132 -352907 -341111 -141988 -220724 -254259 47411 321089 547436 468153
$$ packed form
20483A93242k27009J57384l40662k05789j50757R1886M53532M60492p53616r1083
20473d12380L61387p5078K40006L20160j75032k84176o4146j32292j40633p2407
20463d34591n1844P6696J35305J057Q6438k47374k35476K90427K90901j3896M4975
20452e7382J52373O2985n4208J69729L74098R6766k89422k69002l32480J9134
20442a27409J29644J99922M6561j21898j51791L4898O0537Q3338J80272m61374
20432a27300j89486R9650k53602q6614j72439L43620M70312K0908R0613j22162
20422G3500l78369l04417K9355K79257L0348l84384K15642M87065L44708K4675
20412D17380l61248m09039J1796J99123p8736l3535L01670K73678K26347p9283
$$ plain form
20402 468153 54842 -217525 -429290 -360725 -171736 123319 -132391 -79432 -34709 -101630
20392 -101630 -8302 -173698 18816 182536 507500 391644 289028 335170 64713 -220895
20382 -220895 -92733 140057 501148 561685 381122 562294 352070 -51836 -277335 -375398
20372 -375398 -416993 -464560 -368417 -398435 -410868 -271817 212613 348885 180350 372727
20362 372727 60068 -59237 32497 237675 240675 72542 -47323 152966 250519 500887
20352 500887 600719 94691 -25841 189363 399241 226556 403019 517700 772444 535329
20342 535329 422398 480069 310859 304490 339885 465050 220105 89383 95589 -16321 -181879
20331 -181879 -353518 -227384 -289822 -288001 -14033 30273 32234 178634 100873 -52547 -182667
$$ packed form
20402D68153m13311k72367k11765O8565J88989K95055k55710N2959M4723o6921
20392a01630R3328j65396J92514J63720L24964j15856j02616M6142k70457k85608
20382b20895J28162K32790L61091O0537j80563J81172k10224m03906k25499r8063
20372c75398m1595m7567R6143l0018j2433J39051M84430J36272j68535J92377
20362C72727l12659j19305R1734K05178L000j68133j19865K00289R7553K50368
20352E00887R9832n06028j20532K15204K09878j72685J76463J14681K54744k37115
20342E35329j12931N7671j69210o369L5395J25165k44945j30722O206j11910j65558
20331a81879j71639J26134o2438J821K73968M4306J961J46400p7761j53420j30120
$$ plain form
20320 -182667 -143203 -17458 18738 451499 477286 189900 -207877 63788 145717 -110539
20310 -110539 -165177 147041 -98594 -121986 420720 500766 296594 -80097 -272777 -396117
20300 -396117 -459463 -325192 -353363 -448115 -627251 -664129 -540920 -140497 273635 425379
20290 425379 384412 305233 117785 373131 493831 51018 -16496 170825 242121 4831
20280 4831 -10245 289445 438757 97781 218943 187745 -185542 -452745 -443982 -397539 -270905
20269 -270905 -276888 -309115 -212214 -373556 -253571 -184387 -107558 -243368 -388335 -475113 -83194
20258 -83194 -99434 -242992 -62962 27605 -54011 -280653 -459015 -387848 -223866 -188868 -45118
20247 -45118 35696 -144172 -65200 143878 464416 613480 133596 -55952 -66532 217608
$$ packed form
20320a82667L9464J25745L6196M32761K5787k87386l97777K71665Q1929k56256
20310a10539n4638L12218k45635k3392N42706Q0046k04172l76691j92680j23340
20300c96117o3346J34271k8171r4752j79136l6878J23209M00423M14132J51744
20290D25379m0967p9179j87448K55346J20700m42813o7514J87321P1296k37290
20280D831j5076K99690J49312l40976J21162l1198l73287k67203Q763M6443J26634
20269b70905n983l2227R6901j61342J19985O9184P6829j35810j44967q6778L91919
20258h3194j6240j43558J80030R0567q1616k26642j78362P1167J63982L4998J43750
20247d5118Q0814j79868P8972K09078L20538J49064m79884j89548j0580K84140
$$ plain form
20237 217608 469731 341648 200337 285106 316737 -158476 -515555 69375 166038 -215852
20227 -215852 -275729 -291805 -241393 3143 36176 86116 73457 -32007 -250729 -320273 -522982
20216 -522982 -453728 -202044 -47944 325685 570057 306084 79032 329127 515872 725767
20206 725767 1187876 1695669 2040940 2268698 2361904 2814800 3037233 2877011 2748287 2392023
20196 2392023 2065425 1880975 1561554 1273286 913600 728669 634119 639554 547131 427905
20186 427905 468061 546781 464111 339560 183524 104644 47562 -136717 -167524 -142160 -166176
20175 -166176 -495086 -662497 -607302 -516964 -537276 -300329 101266 98832 -181092 10218
20165 10218 76007 95544 -104269 -188914 -20460 66157 75033 112506 -259806 -522511 -590038
$$ packed form
20237B17608K52123j28083j41311Q4769L1631m75213l57079N84930R6663l81890
20227b15852n9877j6076N0412K44536L3033M9940j2659j05464k18722o9544k02709
20216e22982O9254K51684J54100L73629K44372k63973k27052K50095J86745K09895
20206G25767M62109N07793L45271K27758R3206M52896K22433j60222j28724l56264
20196B392023l26598j84450l19421k88268l59686j84931r4550N435r2423j19226
20186D27905M0156P8720q2670j24551j56036p8880n7082j84279l0807K5364k4016
20175a66176l28910j67411N5195R0338k0312K36947M01595k434k79924J91310
20165A0218O5789J9537j99813q4645J68454Q6617Q876L7473l72312k62705o7527
$$ plain form
20154 -590038 -433948 -196118 81546 92886 57158 -127460 166602 265292 476481 396522
20144 396522 479909 482058 260354 99833 235211 601557 831039 638850 -7970 -12001
20134 -12001 200699 206874 221946 387728 509571 228947 208622 314522 269168 271659 53970
20123 53970 -287873 -480172 -349225 -134678 -7996 91620 371609 375556 368463 381498 334604
20112 334604 328918 172621 12679 -224331 -234798 -304702 -40526 106190 294879 14736
20102 14736 116378 294698 353547 173104 342991 195419 -203593 -369940 -216984 -143300
20092 -143300 -244429 -252479 -171113 -105895 219530 207361 150305 197287 -146930 -93805 8961
20081 8961 165738 219324 106964 -27860 174384 409625 329332 153273 176320 124687 204642
$$ packed form
20154e90038J56090K37830K77664J1340l5728j84618K94062R8690K11189p9959
20144C96522Q3387K149k21704j60521J35378L66346K29482j92189o46820m031
20134a2001K12700O175J5072J65782J21843k80624k0325J05900m5354K491k17689
20123E3970l41843j92299J30947K14547J26682R9616K79989L947p093J3035m6894
20112C34604n686j56297j59942k37010j0467o9904K64176J46716J88689k80143
20102A4736J01642J78320N8849j80443J69887j47572l99012j66347J52956P3684
20092a43300j01129q050Q1366O5218L25425j2169n7056M6982l44217N3125J02766
20081H961J56777N3586j12360j34824K02244K35241q0293j76059K3047n1633P9955
$$ plain form
20070 204642 230123 -99154 -165451 35293 63310 -10002 2850 -184496 -241440 -136543 -162260
20059 -162260 -278391 -445967 -456899 -448659 -244889 -312120 -373088 -107163 155736 104692 -29010
20048 -29010 -131057 45353 114955 98797 207386 162929 -113887 121695 -782 -138638
20038 -138638 -53330 -26697 -135587 23693 136967 256941 380320 163245 47980 -127024
20028 -127024 -298181 -19957 -147502 -28128 -116610 -5769 270046 272138 125842 256528
20018 256528 53762 -215878 -387834 -229710 68180 332691 553008 342680 148700 119707
20008 119707 -8786 -43405 50409 38293 448574 224711 217548 197434 91593 177706 215781
19997 215781 196426 138374 58575 159429 233087 4261 -165201 230556 430608 259106
$$ packed form
20070B04642K5481l29277o6297K00744K8017p3312J2852j87346n6944J04897k5717
20059a62260j16131j67576j0932Q240K03770o7231o0968K65925K62899n1044j33702
20048b9010j02047J76410O9602j6158J08589m4457k76816K35582j22477j37856
20038a38638Q5308K6633j08890J59280J13274J19974J23379k17075j15265j75004
20028a27024j71157K78224j27545J19374q8482J10841K75815K092j46296J30686
20018B56528k02766k69640j71956J58124K97890K64511K20317k10328j93980k8993
20008A19707j28493l4619R3814j2116M10281k23863p163k0114j05841Q6113L8075
19997B15781j9355n8052p9799J00854P3658k28826j69462L95757K00052j71502
$$ plain form
19987 259106 -101385 -240806 153812 527467 1036837 1742019 2367925 2151666 1730254 1379860
19977 1379860 1199851 917418 874964 834123 835518 322595 80646 221231 440969 544756
19967 544756 500711 253046 471261 606960 374467 435121 169764 570208 740661 780684
19957 780684 505156 467929 160068 135327 -174823 -92292 325097 729589 854031 1164959
19947 1164959 1761261 1792460 1844960 1770641 1409336 1004040 1042125 867553 789891 555700
19937 555700 304948 80150 -117573 -99207 -73732 -98605 -99332 -49667 -26573 -19613 -378486
19926 -378486 -490635 -261521 -108156 2341 230757 237990 138037 -162286 -225025 -525527
19916 -525527 -376831 -115501 -127306 275602 301691 141095 -263911 -592089 -434791 89867
$$ packed form
19987B59106l60491j39421L94618L73655N09370P05182O25906k16259m21412l50394
19977A379860j80009k82433m2454m0841J395n12923k41949J40585K19738J03787
19967E44756m4045k47665K18215J35699k32493O0654k65357M00444J70453M0023
19957G80684k75528l7227l07861k4741l10150Q2531M17389M04492J24442L10928
19947A164959N96302L1199N2500p4319l61305m05296L8085j74572p7662k34191
19937E55700k50752k24798j97723J8366K5475k4873p27M9665K3094O960l58873
19926c78486j12149K29114J53365J10497K28416P233r9953l00323o2739l00502
19916e25527J48696K61330j1805M02908K6089j60596m05006l28178J57298N24658
$$ plain form
19906 89867 5041 -131621 20640 187473 -2591 -157709 55037 -219002 -618705 -76983
19896 -76983 295413 206692 40410 115635 503097 425484 126982 332443 246799 326679 375124
19885 375124 354257 376121 263829 175680 -199249 -458165 -571319 -329717 90148 347776
19875 347776 9892 -390804 -270829 -10649 141188 193353 1143 357365 585503 261626
19865 261626 157477 -24659 -44448 -208528 -439469 -365539 -199099 -172885 -235933 -381218
19855 -381218 -499763 -497634 -236330 85056 -105305 -9861 394282 577098 527748 713282
19845 713282 719696 559290 432103 577958 458995 85621 52577 160758 403184 193104
19835 193104 -163187 -186717 108328 216721 349674 96708 -344801 -242968 150030 161922
$$ packed form
19906H9867q4826j36662J52261J66833j90064j55118K12746k74039l99703N41722
19896g6983L72396q8721j66282P5225L87462p7613k98502K05461q5644P9880M8445
19885C75124k0867K1864j12292q8149l74929k58916j13154K41602M19865K57628
19875C47776l37884m00696J19975K60180J51837N2165j92210L56222K28138l23877
19865B61626j04149j82136j9789j64080k30941P3930J66440K6214o3048j45285
19855c81218j18545K129K61304L21386j90361R5444M04143J82816m9350J85534
19845G13282O414j60406j27187J45855j18963l73374l3044J08181K42426k10080
19835A93104l56291k3530K95045J08393J32953k52966m41509J01833L92998J1892
$$ plain form
19825 161922 267320 144090 18651 106546 23164 3964 -77340 -24891 327402 520139
19815 520139 568467 850284 1096782 824932 440404 186794 -71533 -117582 -39594 -178700
19805 -178700 156280 322589 166003 -165849 -138106 47980 -9597 42305 184859 439581
19795 439581 592673 858278 833214 517608 406819 607905 133933 -122869 121556 -98315
19785 -98315 -229961 -125689 91816 147997 36064 263076 105353 41053 234126 376127
19775 376127 521772 195341 365085 578342 436774 302203 106921 374440 322120 186165
19765 186165 574011 552646 402052 395477 261681 381868 587508 607059 76612 -183000
19755 -183000 -443377 -336827 -308028 -256613 -200091 92677 -199452 40182 391041 297566
$$ packed form
19825A61922J05398j23230j25439Q7895q3382j9200q1304N2449L52293J92737
19815E20139M8328K81817K46498k71850l84528k53610k58327m6049P7988j39106
19805a78700L34980J66309j56586l31852K7743J86086n7577N1902J42554K54722
19795D39581J53092K65605k5064l15606j10789K01086m73972k56802K44425k19871
19785i8315j31646J04272K17505N6181j11933K27012j57723o4300J93073J42001
19775C76127J45645l26431J69744K13257j41568j34571j95282K67519n2320j35955
19765A86165L87846k1365j50594o575j33796J20187K05640J9551n30447k59612
19755a83000k60377J06550K8799N1415N6522K92768k92129K39634L50859r3475
$$ plain form
19745 297566 449836 211659 512272 762958 558051 476088 447026 373065 271125 484235
19735 484235 340824 46852 -43075 58381 13348 369505 464091 360461 205553 316451
19725 316451 405683 402346 520376 549384 560336 456700 544006 611104 425093 397594 180747
19714 180747 -94282 -145371 -297738 -225207 -60810 -365549 -499152 -333109 -208064 153673
19704 153673 135462 -144550 -235808 -312492 -67935 -189482 -293430 -317245 -280054 60157
19694 60157 90377 -168265 -378780 -386928 46293 480244 331310 338024 315254 25022 33605
19683 33605 -59080 64235 83924 151593 93419 209661 328809 -293789 -470266 22461
19673 22461 182518 119866 63424 -56496 -8286 390088 458715 559802 582822 394014 226076
$$ packed form
19745B97566J52270k38177L00613K50686k04907q1963k9062p3961j01940K13110
19735D84235j43411k93972q9927J01456m5033L56157R4586j03630j54908J10898
19725C16451Q9232l337J18030K9008J0952j03636Q7306O7098j86011k7499k16847
19714A80747k75029n1089j52367P2531J64397l04739j33603J66043J25045L61737
19704A53673j8211k80012r1258p6684K44557j21547j03948k3815L7191L40211
19694F0157L0220k58642k10515q148M33221M33951j48934O714k2770k90232Q583
19683C3605r2685J23315J9689O7669n8174J16242J19148o22598j76477M92727
19673B2461J60057o2652n6442j19920M8210L98374O8627J01087K3020j88808j67938
$$ plain form
19662 226076 138154 -69940 -172153 -117667 -8360 -17161 308734 314845 3529 197207 50451
19651 50451 -124918 -103491 -229112 -372750 -306480 -154448 67528 117562 46656 -134208
19641 -134208 -425382 -324003 -84795 -233981 -290197 -18388 151327 -132421 -440400 -355745
19631 -355745 -143395 -15303 111489 -148924 -70541 356899 310197 156146 361355 768358
19621 768358 1023865 1008258 876574 684068 579379 863615 993634 1056933 982313 994159
19611 994159 767244 710892 496397 201506 68489 420209 389289 312365 9176 71061
19601 71061 318662 265569 307523 234681 382634 373866 527186 652599 697251 727125 274585
19590 274585 130489 -236540 -108769 -93555 -162144 201286 40819 -156282 -210921 -42716
$$ packed form
19662B26076q7922k08094j02213N4486J09307q801L25895O111l11316J93678j46756
19651E0451j75369K1427j25621j43638O6270J52032K21976N0034p0906j80864
19641a34208k91174J01379K39208j49186n6216K71809J69715k83748l07979Q4655
19631c55745K12350J28092J26792k60413P8383M27440m6702j54051K05209M07003
19621G68358K55507j5607j31684j92506j04689K84236J30019O3299p4620J1846
19611I94159k26915n6352k14495k94891j33017L51720l0920p6924l03189O1885
19601G1061K47601n3093M1954p2842J47953q768J53320J25413M4652K9874m52540
19590B74585j44096l67029J27771J5214o8589L63430j60467j97101n4639J68205
$$ plain form
19580 -42716 -9299 8710 520438 1104401 1122482 1091042 1115191 1161455 1082171 565633 541883
19569 541883 610589 579819 850674 896634 627848 537112 529354 757608 974680 791186 548737
19558 548737 502220 298979 217114 37496 -94353 -410992 31459 467960 489521 876368
19548 876368 1060611 953246 853048 1094626 1179311 814553 610098 491693 436154 472844
19538 472844 681181 642989 618300 861193 953432 1133419 822005 824586 1020348 1086454 788272
19527 788272 747627 1044552 1311635 1160852 1327479 1294560 1438950 1540615 1548346 1431316
19517 1431316 1373242 1395457 1481695 1534678 1829908 1748055 1606455 1643830 1657426 1445044 1083474
19506 1083474 870378 1086752 1309734 1367022 1125230 887518 493816 254044 473916 892043
$$ packed form
19580d2716L3417J8009N11728N83963J8081l1440K4149M6264p9284n16538k3750
19569E41883O8706l0770K70855M5960k68786r0736p758K28254K17072j83494k42449
19558E48737m6517k03241q1865j79618j31849l16639M42451M36501K1561L86847
19548H76368J84243j07365j00198K41578Q4685l64758k04455j18405n5539L6690
19538D72844K08337l8192k4689K42893R2239J79987l11414K581J95762O6106k98182
19527G88272m0645K96925K67083j50783J66627l2919J44390J01665P731j17030
19517A431316n8074K2215Q6238N2983K95230q1853j41600L7375J3596k12382l61570
19506A083474k13096K16374K22982N7288k41792k37712l93702k39772K19872M18127
$$ plain form
19496 892043 686808 522888 848363 1010182 1103264 1206905 1265245 1262050 1141504 1114770
19486 1114770 1116566 1368885 1491255 1665358 2103531 2048834 2226401 2419286 2137205 1991682
19476 1991682 1917792 1977546 1999124 1809636 1748737 1867257 1629855 1711641 2123500 1995904
19466 1995904 1968024 1607642 1279372 1677846 1943871 1967087 2356718 2231919 2237659 2474737
19456 2474737 2648423 2470719 2415560 2554044 2326345 2552216 2851206 3149782 2988350 2975189
19446 2975189 2824365 2974058 3300748 3357205 2852710 2844044 3461975 3879058 3790900 3767891
19436 3767891 4134401 4469811 4793843 5252995 5746092 6366914 6910554 6951920 6999972 7105674
19426 7105674 6988792 6649169 6747919 6928311 7470518 8095420 9007530 9668805 9996031 10166369
$$ packed form
19496H92043k05235j63920L25475J61819R3082J03641N8340l195j20546k6734
19486A114770J796K52319J22370J74103M38173n4697J77567J92885k82081j45523
19476A991682p3890N9754K1578j89488o0899J18520k37402Q1786M11859j27596
19466A995904k7880l60382l28270L98474K66025K3216L89631j24799N740K37078
19456B474737J73686j77704n5159J38484k27699K25871K98990K98576j61432j3161
19446B975189j50824J49693L26690N6457n04495q666O17931M17083q8158k3009
19436C767891L66510L35410L24032M59152M93097O20822N43640M1366M8052J05702
19426G105674j16882l39623R8750J80392N42207O24902R12110O61275L27226J70338
$$ plain form
19416 10166369 10711818 11502984 12757777 14189312 16010647 17344884 18795673 20523082
19408 20523082 22472227 25106085 28185779 31456173 35189739 39822449 45922548 54137788
19400 54137788 64995553 79705514 100514046 131962642 179897890 251498431 342768342
19393 342768342 405967920 407724126 370094336 300415617 221281926 159295607 117060186
19386 117060186 88669641 69496898 56360011 47334515 41088204 36707780 34163539
19379 34163539 33031966 32699307 32568752 32900937 33832719 34464950 35472815 36969075 38984846
19370 38984846 41642920 45000095 49360886 55501294 64614672 76647923 93415599 118174767
19362 118174767 155569052 212270004 296462790 395389264 450038019 440889398 391637899
$$ packed form
19416A0166369N45449P91166J254793J431535J821335J334237J450789J727409
19408B0523082J949145K633858L079694L270394L733566M632710O100099Q215240
19400E4137788J0857765J4709961K0808532L1448596M7935248P1600541R1269911
19393C42768342O3199578J756206l7629790o9678719p9133691o1986319m2235421
19386A17060186k8390545j9172743j3136887r025496o246311m380424k544241
19379C4163539j131573l32659j30555L32185R31782O32231J007865J496260K015771
19370C8984846K658074L357175M360791O140408R113378J2033251J6767676K4759168
19362A18174767L7394285N6700952Q4192786R8926474N4648755r148621m9251499
$$ plain form
19355 391637899 309615876 224022122 159668892 115608390 85742057 65326571 51150018
19348 51150018 40901338 33818334 28666536 24750870 22026382 19615769 17742557 16228088
19340 16228088 15362370 14278019 12848763 11563393 10173286 9068061 8359411 7555658
19332 7555658 6963323 6723237 5943737 5198669 4858117 4692808 4645624 4597867 4514870 4585168
19322 4585168 5146220 5308528 5199439 4909788 4038350 3341842 2650404 2258828 2309224 2037828
19312 2037828 1833679 1979833 1946703 1870355 1756132 1615916 1350821 1198766 1103237 851402
19302 851402 1121649 1018758 976482 1094757 1281907 1156711 1153643 937893 848699 615860
19292 615860 573262 849648 882361 743658 746205 888966 873369 877230 777895 635225 780302
$$ packed form
19355C91637899q2022023q5593754o4353230m4060502k9866333k0415486j4176553
19348E1150018j0248680p083004n151798l915666k724488k410613j873212j514469
19340A6228088q65718j084351j429256j285370j390107j105225p08650q03753
19332G555658n92335k40086p79500p45068l40552j65309m7184m7757q2997P0298
19322D585168N61052J62308j09089k89651q71438o96508o91438l91576N0396k71396
19312B037828k04149J46154l3130p6348j14223j40216k65095j52055r5529k51835
19302H51402K70247j02891m2276J18275J87150j25196l068k15750q9194k32839
19292F15860m2598K76386L2713j38703K547J42761j5597L861r9335j42670J45077
$$ plain form
19281 780302 833387 774854 856119 912282 813933 1007940 1075687 975948 943540 826954 702331
19270 702331 1048134 992277 726509 625853 597817 538581 465274 461123 400793 424596 177657
19259 177657 69369 207580 224296 -119891 -281823 -9260 390356 594020 479649 610165
19249 610165 646718 746688 1044412 1315591 1245161 1269451 1480639 2189016 2851576 3008950
19239 3008950 2638899 2378690 2128426 1459839 914856 698495 846737 527643 316473
19230 316473 -242929 -483588 -429693 -156500 363418 548588 273348 69140 -6509 -108112
19220 -108112 -184822 -5525 299968 277720 81047 261674 296299 44124 239799 259562
19210 259562 24796 327116 994468 1725452 2462845 2484849 1909152 1850628 1763112 1147721
$$ packed form
19281G80302N3085n8533Q1265N6163r8349J94007O7747r9739l2408j16586j24623
19270G02331L45803n5857k65768j00656k8036n9236p3307m151o0330K3803k46939
19259A77657j08288J38211J6716l44187j61932K72563L99616K03664j14371J30516
19249F10165L6553R9970K97724K71179p0430K4290K11188P08377O62560J57374
19239C008950l70051k60209k50264o68587n44983k16361J48242l19094k11170
19230C16473n59402k40659N3895K73193N19918J85170k75240k04208p5649j01603
19220a08112p6710J79297L05493k2248j96673J80627L4625k52175J95675J9763
19210B59562k34766L02320O67352P30984P37393K2004n75697n8524q7516o15391
$$ plain form
19200 1147721 1063973 1235916 998140 620831 272126 460334 727785 884990 579100 337590
19190 337590 690911 467658 224165 -40716 -194520 -334428 -342523 50476 319263 250583
19180 250583 527126 632932 223880 102437 276108 132103 74704 247256 231909 120256
19170 120256 61757 -168721 -160153 117977 535517 590313 1140328 1208689 937966 533632
19160 533632 438366 298515 214857 526293 577106 304297 333953 456316 697364 364738
19150 364738 398480 712131 783858 417443 4136 154286 192649 325280 112849 460425
19140 460425 521723 211875 140025 -10131 -313333 -133815 20125 166339 323716 217586
19130 217586 48621 83304 333123 208341 256105 369108 208179 157416 263606 102788
$$ packed form
19200A147721q3748J71943k37776l77309l48705J88208K67451J57205l05890k41510
19190C37590L53321k23253k43493k64881j53804j39908q095L92999K68787o8680
19180B50583K76543J05806m09052j21443J73671j44005n7399J72552j5347j11653
19170A20256n8499k30478Q568K78130M17540N4796N50015O8361k70723m04334
19160E33632r5266j39851q3658L11436N0813k72809K9656J22363K41048l32626
19150C64738L3742L13651P1727l66415m13307J50150L8363J32631k12431L47576
19140D60425O1298l09848p1850j50156l03202J79518J53940J46214J57377j06130
19130B17586j68965L4683K49819j24782M7764J13003j60929n0763J06190j60818
$$ plain form
19120 102788 -43507 -118814 -221827 -48302 -107456 121585 256509 353801 339133 185698
19110 185698 -50407 224867 345327 389868 556562 648526 401826 -240295 -481186 -222641
19100 -222641 -17945 199047 378222 304667 -8156 -78882 -5843 43911 -277615 -320376
19090 -320376 72148 335012 565494 724763 275636 -205503 -183228 -401364 -448311 -397423
19080 -397423 -281395 290143 666480 538394 45097 204031 312425 286694 453329 134168
19070 134168 60055 153706 103383 247180 409244 402138 301163 277675 421706 521366 209853
19059 209853 148817 413156 463056 463205 520766 764431 734040 373303 269443 205238 151513
19048 151513 85909 -56627 -231960 -318733 -444176 88750 505435 653867 201965 -168591
$$ packed form
19120A02788j46295p5307j03013J73525n9154K29041J34924R7292j4668j53435
19110A85698k36105K75274J20460M4541J66694R1964k46700o42121k40891K58545
19100b22641K04696K16992J79175p3555l12823p0726P3039M9754l21526m2761
19090c20376L92524K62864K30482J59269m49127m81139K2275k18136m6947N0888
19080c97423J16028N71538L76337j28086m93297J58934J08394k5731J66635l19161
19070A34168p4113R3651n0323J43797J62064p106j00975k3488J44031R9660l11513
19059B09853o1036K64339M9900J49N7561K43665l0391l60737j03860o4205n3725
19048A51513o5604j42536j75333q6773j25443N32926M16685J48432m51902l70556
$$ plain form
19038 -168591 -105380 267595 598869 495055 747588 607364 706146 917381 932045 647419
19028 647419 641503 501426 344843 672166 1077298 1040678 917419 799883 747560 783834
19018 783834 773110 728175 676906 496518 401063 541811 422019 192957 251558 138294
19008 138294 -103466 9077 -40446 -162657 -103257 -217687 -231039 -46079 29025 -138294
18998 -138294 -310593 -239041 -436975 -208650 186722 377945 313825 430277 448695 247806
18988 247806 279097 -16472 -321839 -35351 209357 334626 278970 84909 -89863 13885
18978 13885 39673 206186 453628 651735 537023 220930 -58214 -52927 -11334 554548
18968 554548 610216 398124 429096 755696 788592 692658 358626 103273 27923 89250 148240
$$ packed form
19038a68591O3211L72975L31274j03814K52533j40224R8782K11235J4664k84626
19028F47419n916j40077j56583L27323M05132l6620j23259j17536n2323L6274
19018G83834j0724m4935n1269j80388r5455J40748j19792k29062N8601j13264
19008A38294k41760J12543m9523j22211N9400j14430j3352J84960P5104j67319
18998a38294j72299P1552j97934K28325L95372J91223o4120J16452J8418k00889
18988B47806L1291k95569l05367K86488K44708J25269n5656j94061j74772J03748
18978A3885K5788J66513K47442J98107j14712l16093k79144N287M1593N65882
18968E54548N5668k12092L0972L26600L2896r5934l34032k55353p5350O1327N8990
$$ plain form
18957 148240 -19098 -183439 -263837 -116144 -72560 -256259 -158323 -29987 -117329 -46359
18947 -46359 -65371 -43990 488293 721145 871251 692758 763035 745127 542933 850009
18937 850009 835366 229048 -202314 185966 286251 297027 339482 586572 873338 270135
18927 270135 10941 -280230 -236664 -93243 121480 3765 157004 331379 445896 83359
18917 83359 33080 249527 314312 504571 455542 186997 -53878 -56962 251090 501984 382953
18906 382953 86569 104617 219945 74666 -132843 -740396 -616153 -276660 53681 467842
18896 467842 680195 775173 805153 670236 456261 229936 221022 157574 192615 351078 87963
18885 87963 -149919 -200291 -107310 -188138 -350131 -174988 62224 84093 325415 657032
$$ packed form
18957A48240j67338j64341q0398J47693M3584j83699R7936J28336q7342P0970
18947d6359j9012K1381N32283K32852J50106j78493P0277j7908k02194L07076
18937H50009j4643o06318m31362L88280J00285J0776M2455K47090K86766o03203
18927B70135k59194k91171M3566J43421K14723j17715J53239J74375J14517l62537
18917H3359n0279K16447O4785J90259m9029k68545k40875l084L08052K50894j19031
18906C82953k96384J8048J15328j45279k07509o07553J24243L39493L30341M14161
18896D67842K12353R4978K9980j34917k13975k26325q914o3448L5041J58463k63115
18885H7963k37882n0372R2981q0828j61993J75143K37212K1869K41322L31617
$$ plain form
18875 657032 858144 811698 923728 736147 447391 298064 125271 82714 115159 271844
18865 271844 717589 869367 575888 290592 419337 463761 373755 419112 385767 682234
18855 682234 744616 554684 197075 -105884 -111757 20545 79010 -77388 152534 110528
18845 110528 386784 742541 652797 906335 1055972 1342412 1500418 1364455 1281996 1375063
18835 1375063 1467808 1367799 1033927 1117494 1195655 1097450 766463 724758 971725 1097104
18825 1097104 1089629 1325632 1203704 1162592 1300245 1341622 828383 491795 591349 855916
18815 855916 1491441 1591477 1634862 1528503 1762833 1765596 2084562 2357945 2308190 2211476
18805 2211476 2429493 2622267 2768689 2660644 2526878 2759684 2694746 2758790 2486204 2053939
$$ packed form
18875F57032K01112m6446J12030j87581k88756j49327j72793m2557L2445J56685
18865B71844M45745J51778k93479k85296J28745M4424r0006M5357l3345K96467
18855F82234O2382j89932l57609l02959n873J32302N8465j56398K29922m2006
18845A10528K76256L55757q9744K53538J49637K86440J58006j35963q2459R3067
18835A375063R2745j00009l33872Q3567P8161r8205l30987m1705K46967J25379
18825A097104p475K36003j21928m1112J37653M1377n13239l36588R9554K64567
18815H55916O35525J00036M3385j06359K34330K763L18966K73383m9755r6714
18805B211476K18017J92774J46422j08045j33766K32806o4938O4044k72586m32265
$$ plain form
18795 2053939 1912412 1891488 1755079 1531365 1543164 1401744 1413999 1518932 1508629 1212009
18785 1212009 1111203 1269652 1356847 1466133 1670266 1724551 1962935 2491208 2581697 2320175
18775 2320175 1881321 1713632 1866904 2166115 2845318 3626294 4198308 4491140 5400930
18766 5400930 6702637 7356819 7373364 6732190 5824942 5150621 3984602 3667054 3616244
18757 3616244 3121501 2728948 2608438 2464707 2379813 2476893 2780671 2824675 2822985 2815363 2818001
18746 2818001 2618149 2373207 2364821 2521923 2376260 2300332 2824013 3148105 3266476 3619122
18736 3619122 3600510 3435807 3821678 3999983 4204286 4061037 4081250 4345433 4713155 4935689
18726 4935689 5315927 5459739 5448618 5718127 6193420 6648858 6989571 7047905 7396508 8052551
$$ packed form
18795B053939j41527k0924j36409k23714J1799j41420J2255J04933j0303k96620
18785A212009j00806J58449Q7195J09286K04133N4285K38384N28273R0489k61522
18775B320175m38854j67689J53272K99211O79203P80976N72014K92832R09790
18766E400930J301707O54182J6545o41174r07248o74321j166019l17548n0810
18757C616244m94743l92553j20510j43731q4894R7080L03778M4004j690p622K638
18746B818001j99852k44942q386J57102j45663p5928N23681L24092J18371L52646
18736C619122j8612j64703L85871J78305K04303j43249K0213K64183L67722K22534
18726D935689L80238J43812j1121K69509M75293M55438L40713N8334L48603O56043
$$ plain form
18716 8052551 8912272 9857872 10758387 12217010 13585288 14615665 15680662 16475099 17046847
18707 17046847 17869657 18420560 19753127 21677433 24251788 27363932 31086747 35462775
18699 35462775 40882579 47412789 55462778 65872979 80023599 100830037 132168327
18692 132168327 179968231 252682848 349119126 431284101 452112868 421545785 353988660
18685 353988660 267188949 191943820 138782533 103186537 79924431 64344571 53944075
18678 53944075 47085290 42434059 38797234 35866345 33155657 31230149 29760525 29037582
18670 29037582 29236953 30466322 32456678 35231887 38693546 43021431 47875605 53635147
18662 53635147 60616002 69573814 81764486 101258327 131603882 178270636 248378541
$$ packed form
18716H052551Q59721R45600R00515J458623J368278J030377J064997P94437N71748
18707A7046847Q22810N50903J332567J924306K574355L112144L722815M376028
18699C5462775N419804O530210Q049989J0410201J4150620K0806438L1338290
18692A32168327M7799904P2714617R6436278Q2164975K0828767l0567083o7557125
18685C53988660q6799711p5245129n3161287l5595996k3262106j5579860j0400496
18678E3944075o858785m651231l636825k930889k710688j925508j469624p22943
18670B9037582J99371J229369J990356K775209L461659M327885M854174N759542
18662E3635147O980855Q957812J2190672J9493841L0345555M6666754P0107905
$$ plain form
18655 248378541 336326517 399996803 406012322 369700291 301899726 223079562 158155043
18648 158155043 113201165 82825376 62631798 48738874 39185429 32365575 27415685
18641 27415685 23047421 19765366 17470077 15229545 13596836 12395806 11788461 11344215
18633 11344215 10790910 10305006 10245984 10427490 10459317 9327351 7982228 6952508 6405430
18624 6405430 5691004 5066160 4755279 4733706 4356491 4092904 3762499 3259577 3029664 2921054
18614 2921054 3250375 2862934 2682406 2736248 2393560 2180008 2076167 2080071 2069554 1820515
18604 1820515 1562062 1628989 1580250 1659917 1646126 1327287 1314408 988077 978434 801521 620271
18593 620271 576106 776113 775285 749223 567623 330819 250776 474881 307262 366948 635749
$$ packed form
18655B48378541Q7947976O3670286O015519l6312031o7800565p8820164o4924519
18648A58155043m4953878l0375789k0193578j3892924r553445o819854m949890
18641B7415685m368264l282055k295289k240532j632709j201030o07345m44246
18633A1344215n53305m85904n9022J81506L1827j131966j345123j029720n47078
18624F405430p14426o24844l10881k1573l77215k63587l30405n02922k29913j08610
18614B921054L29321l87441j80528N3842l42688k13552j03841L904j0517k49039
18604A820515k58453O6927m8739P9667j3791l18839j2879l26331r643j76913j81250
18593F20271m4165K00007q28k6062j81600k36804q0043K24105j67619N9686K68801
$$ plain form
18582 635749 641153 965510 1352371 1213899 806802 596450 527930 614582 956139 1055322
18572 1055322 906665 945387 926951 917830 914341 975657 669922 602209 536549 650689 715890
18561 715890 580981 314073 219920 45351 -91461 -256525 -123241 86774 211125 347501
18551 347501 498928 822961 801374 484130 62004 -48814 -141307 -134397 32289 -48442
18541 -48442 280059 422892 481904 598062 683234 405084 138482 -131161 -19347 171946
18531 171946 383764 548794 640085 663413 516126 708538 417980 269467 341816 50472
18521 50472 -157259 -253752 -398203 -266573 -93132 50231 195544 -124990 -233600 -1825
18511 -1825 116179 -4902 -149741 -271133 -265527 -208307 -215588 -258809 -146723 257106 317223
$$ packed form
18582F35749N404L24357L86861j38472m07097k10352o8520Q6652L41557R9183
18572A055322j48657L8722j8436r121l489O1316l05735o7713o5660J14140O5201
18561G15890j34909k66908r4153j74569j36812j65064J33284K10015J24351J36376
18551C47501J51427L24033k1587l17244m22126j10818r2493O910J66686q0731
18541d8442L28501J42833N9012J16158Q5172k78150k66602k69643J11814J91293
18531A71946K11818J65030R1291K3328j47287J92412k90558j48513P2349k91344
18521E0472k07731r6493j44451J31630J73441J43363J45313l20534j08610K31775
18511a825J18004j21081j44839j21392N606N7220p281m3221J12086M03829O0117
$$ plain form
18500 317223 121144 -25461 -59566 511029 828089 1066242 1168603 692425 233886 179952
18490 179952 336291 313916 395156 316672 434412 396513 706185 436594 254418 185428
18480 185428 330646 340902 2566 9400 172707 66294 177820 337720 208652 80526
18470 80526 354904 506508 434409 254257 -159438 -488607 -47847 501629 366157 179949
18460 179949 466432 501592 493530 487125 467525 686584 481672 25228 77675 -228730 -41284
18449 -41284 225870 266328 123498 151849 324199 205251 280976 328747 470266 626566
18439 626566 688354 327381 282703 356977 467830 359310 103136 -27957 325909 477955
18429 477955 242998 64096 -66550 -164103 172052 467420 270657 -71170 -15678 106010
$$ packed form
18500C17223j96079j46605l4105N70595L17060K38153J02361m76178m58539n3934
18490A79952J56339k2375Q1240p8484J17740l7899L09672k69591j82176o8990
18480A85428J45218J0256l38336O834J63307j06413J11526J59900j29068j28126
18470H0526K74378J51604p2099j80152m13695l29169M40760N49476j35472j86208
18460A79949K86483L5160q062o405j9600K19059k04912m56444N2447l06405J87446
18449d1284K67154M0458j42830K8351J72350j18948P5725M7771J41519J56300
18439F26566O1788l60973m4678P4274J10853j08520k56174j31093L53866J52046
18429D77955k34957j78902j30646r7553L36155K95368j96763l41827N5492J21688
$$ plain form
18419 106010 120994 321633 629838 680104 427320 586632 530067 450815 266108 246222
18409 246222 443894 159513 -28665 215457 455104 596817 610829 716637 818696 514232
18399 514232 359228 353028 246261 246744 218112 285761 153839 9920 -81554 -295957 -199610
18388 -199610 109417 220019 184193 431515 341505 227030 329022 229709 -263496 -209851
18378 -209851 248499 457281 90567 66 -50434 -132380 -132689 166658 221135 103503 -224839
18367 -224839 13361 310147 257316 109623 -87969 -288151 -97398 163004 -43727 -162608
18357 -162608 -205100 26323 270789 220147 -5820 -130121 -308274 -643804 -420261 -146683
18347 -146683 -441970 -16238 81109 153478 181929 397616 887889 1378951 1595654 1768534
$$ packed form
18419A06010J4984K00639L08205N0266k52784J59312n6565p9252j84707j9886
18409B46222J97672k84381j88178K44122K39647J41713J4012J05808J02059l04464
18399E14232j55004o200j06767M83k8632O7649j31922j43919r1474k14403R6347
18388a99610L09027J10602l5826K47322r0010j14475J01992r9313m93205N3645
18378b09851M58350K08782l66714r0501n0500q1946l09K99347N4477j17632l28342
18367b24839K38200K96786n2831j47693j97592k00182J90753K60402k06731j18881
18357a62608m2492K31423K44466n0642k25967j24301j78153l35530K23543K73578
18347a46683k95287M25732R7347P2369K8451K15687M90273M91062K16703J72880
$$ plain form
18337 1768534 1911627 1588476 820507 25289 102979 211371 128539 23602 -70681 183611
18327 183611 294753 102914 293077 184009 211157 142805 -263852 -308701 -157349 -263987
18317 -263987 -326135 285653 326209 298747 81864 -50898 -81158 -265432 -177175 154915
18307 154915 250525 574944 593165 324184 209736 70280 -3955 -3458 130432 31570 344785
18296 344785 463451 604654 755282 613194 566856 338813 343763 352145 44541 57078 421261
18285 421261 302202 313161 183904 172813 257164 478102 484035 490132 279815 528835 175924
18274 175924 -349027 5619 -2161 141946 -50778 -59266 -33060 201723 186157 118598 184832
18263 184832 647074 758342 833091 1110845 823768 429803 358289 620476 387543 -1425
$$ packed form
18337A768534J43093l23151p67969p95218P7690J08392q2832j04937r4283K54292
18327A83611J11142j91839J90163j09068K7148o8352m06657m4849J51352j06638
18317b63987o2148O11788M0556k7462k16883j32762l0260j84274Q8257L32090
18307A54915R5610L24419J8221k68981j14448j39456p4235M97J33890r8862L13215
18296C44785J18666J41203J50628j42088m6338k28043M950Q382l07604J2537L64183
18285D21261j19059J0959j29257j1091Q4351K20938N933O097k10317K49020l52911
18274A75924n24951L54646p780J44107j92724q488K6206K34783j5566o7559O6234
18263A84832M62242J11268P4749K77754k87077l93965p1514K62187k32933l88968
$$ plain form
18253 -1425 -9340 308576 293197 302554 -86119 83587 180490 264183 491384 481456 323017
18242 323017 525398 715137 868549 706729 581467 719522 864321 959313 1178814 1239956
18232 1239956 1190323 946405 479717 387978 749441 1067131 1058514 1249296 1158047 1377218
18222 1377218 1430469 766197 487855 629123 988218 1029314 893434 675282 705972 836922
18212 836922 934382 688480 502974 935503 1016359 789083 607168 430233 599681 630945
18202 630945 683629 586837 632819 829242 1088899 1375106 924125 1168021 1513503 1329237
18192 1329237 1130149 1068127 1054380 1242294 1519165 1757420 1707885 1530797 1302000 1274013
18182 1274013 1433690 1461111 1275615 1363135 1438373 1391607 1229682 1460738 1396003 1575329
$$ packed form
18253a425p915L17916j5379R357l88673J69706R6903Q3693K27201r928j58439
18242C23017K02381J89739J53412j61820j25262J38055J44799R4992K19501O1142
18232A239956m9633k43918m66688r1739L61463L17690q617J90782r1249K19171
18222A377218N3251o64272k78342J41268L59095M1096j35880k18152L0690J30950
18212H36922R7460k45902j85506M32529Q0856k27276j81915j76935J69448L1264
18202F30945N2684r6792M5982J96423K59657K86207m50981K43896L45482j84266
18192A329237j99088o2022j3747J87914K76871K38255m9535j77088k28797k7987
18182A274013J59677K7421j85496Q7520P5238m6766j61925K31056o4735J79326
$$ plain form
18172 1575329 1706322 1694651 1625604 1696294 1975700 1753808 1857619 2268808 2335906 2444519
18162 2444519 2730505 2718209 2390567 2273208 2679090 2652025 2327792 2282863 2384847 2188293
18152 2188293 2291342 2650084 2962064 3270336 3745080 4175936 4430965 4620515 4448559
18143 4448559 4409952 4821325 5259669 5516868 5880343 6276023 6910013 7417996 7785312 8650428
18133 8650428 9433311 10015658 11169477 12388756 13502173 14199889 14665457 15799821 16996177
18124 16996177 18890712 20732476 23009835 25959956 29516301 33952281 39625013 46605986
18116 46605986 55191772 65983495 80737524 101706707 133429563 182552830 258692801
18109 258692801 370108000 485864355 529191392 502372871 430256440 324894250 228011256
$$ packed form
18172A575329J30993j1671o9047P0690K79406k21892J03811M11189O7098J08613
18162B444519K85986j2296l27642j17359M05882k7065l24233m4929J01984j96554
18152B188293J03049L58742L11980L08272M74744M30856K55029J89550j71956
18143D448559l8607M11373M38344K57199L63475L95680O33990N07983L67316Q65116
18133H650428P82883N82347J153819J219279J113417O97716M65568J134364J196356
18124A6996177J894535J841764K277359K950121L556345M435980N672732O980973
18116D6605986Q585786J0791723J4754029K0969183L1722856M9123267P6139971
18109B58692801J11415199J15756355M3327037k6818521p2116431j05362190r6882994
$$ plain form
18102 228011256 159901558 114832421 84463893 63922382 49651265 40288999 33586626
18095 33586626 28309067 24211651 20960445 18161320 15721949 13883453 12149325 10486517
18087 10486517 9371196 8711899 7689084 7072502 6659405 6353945 5628696 4760156 4331677
18078 4331677 4150103 4001094 3524737 3222608 2934720 2827503 2613090 2130812 2054585 2040054
18068 2040054 2138858 1983738 1663254 1463584 1619433 1952854 2038181 1560590 1408093 1326963
18058 1326963 1474734 1665427 1737145 1619619 1796191 1848905 1427678 1139500 1132784 1093710
18048 1093710 937044 873124 729998 707704 826144 1096894 1205796 1142074 862717 1071689
18038 1071689 894196 726206 643899 742878 666758 556400 288278 257494 460093 351315
$$ packed form
18102B28011256o8109698m5069137l0368528k0541511j4271117r362266o702373
18095C3586626n277559m097416l251206k799125k439371j838496j734128j662808
18087A0486517j115321o59297j022815o16582m13097l05460p25249q68540m28479
18078D331677j81574j49009m76357l02129k87888j07217k14413m82278p6227j4531
18068B040054R8804j55120l20484j99670J55849L33421Q5327m77591j52497q1130
18058A326963J47771J90693P1718j17526J76572N2714m21227k88178o716l9074
18048A093710j56666o3920j43126k2294J18440K70750J08902o3722k79357K08972
18038A071689j77493j67990q2307R8979p6120j10358k68122l0784K02599j08778
$$ plain form
18028 351315 480957 53410 -31367 120194 548883 887736 922384 811898 614155 293596
18018 293596 290865 280018 234975 48413 242 100681 24577 157084 266790 -53148 -291569
18007 -291569 -105583 -58805 246531 253782 85500 172069 221718 253997 117904 59818 380681
17996 380681 601610 483317 576141 683449 1005721 874898 686037 370346 291841 499325
17986 499325 848213 937516 983828 785359 593501 474348 392615 134494 -205378 -190990
17976 -190990 -111739 79432 171253 -247868 -564671 -469540 -77223 -45981 -70351 -123663 73359
17965 73359 -11675 -236812 -78752 99341 228035 125029 525491 424927 222658 248257
17955 248257 2871 -202679 -264809 -278199 -128534 -606246 -709625 -350214 -73629 286861
$$ packed form
18028C51315J29642m27547q4777J51561M28689L38853L4648j10486j97743l20559
18018B93596k731j0847m5043j86562m8171J00439p6104J32507J09706l19938k38421
18007b91569J85986M6778L05336P251j68282Q6569M9649L2279j36093n8086L20863
17996C80681K20929j18293R2824J07308L22272j30823j88861l15691p8505K07484
17986D99325L48888Q9303M6312j98469j91858j19153q1733k58121l39872J4388
17976a90990P9251J91171R1821m19121l16803R5131L92317L1242k4370n3312J97022
17965G3359q5034k25137J58060J78093J28694j03006M00462j00564k02269K5599
17955B48257k45386k05550o2130j3390J49665m77712j03379L59411K76585L60490
$$ plain form
17945 286861 213426 -219305 -477234 -575200 -488680 -382436 -226451 -319717 -165619 -74090
17935 -74090 -336484 -318851 -282826 -270634 -485908 -228583 42885 77322 212834 402351
17925 402351 308068 174518 155347 403058 97398 79277 142702 347220 433020 537715
17915 537715 559841 393987 310536 476845 435581 322242 358641 342692 131949 -25644
17905 -25644 98509 7551 350102 432608 176567 45418 -123376 -15054 -104151 -109833 -160698
17894 -160698 134788 128246 126421 -40712 -147487 -253340 -31601 351885 259678 195986 49288
17883 49288 91366 -114102 -112666 -27279 240104 221660 -40068 117911 205704 -67515 156596
17872 156596 371631 196636 219275 264996 169909 9001 -175168 -524917 -408561 -330628
$$ packed form
17945B86861p3435m32731k57929r7966Q6520J06244J55985r3266J54098R1529
17935g4090k62394J7633L6025J2192k15274K57325K71468L4437J35512J89517
17925D02351r4283j33550j9171K47711l05660j8121O3425K04518Q5800J04695
17915E37715K2126j65854q3451J66309m1264j13339L6399j5949k10743j57593
17905b5644J24153r0958L42551Q2506k56041j31149j68794J08322q9097n682n0865
17894a60698K95486o542j825j67133j06775j05853K21739L83486r2207o3692j46698
17883D9288M2078k05468J436Q5387K67383j8444k61728J57979Q7793k73219K24111
17872A56596K15035j74995K2639M5721r5087j60908j84169l49749J16356P7933
$$ plain form
17862 -330628 -346304 -326501 -120519 -9354 -119557 -50146 157843 -210264 -343996 -307090
17852 -307090 -64124 117481 -229017 -9379 288923 268834 -41596 -182135 -96728 150243
17842 150243 -26764 -191245 -191792 -194822 -48147 13901 -53375 -65544 -152696 -267131 -458845
17831 -458845 -440058 -74672 98768 98059 230170 216465 -50708 212326 662747 506099
17821 506099 199156 11428 168821 59676 -109792 -238974 -564040 -442465 -253999 -484352
17811 -484352 -249943 -196462 -71933 -273849 -799301 -588238 -119383 -243751 -356947 -93759
17801 -93759 27386 -171490 -270249 -97506 -19915 91127 552340 916604 470037 131992
17791 131992 231031 262489 221742 344450 528512 549331 391076 176079 94012 256424
$$ packed form
17862c30628j5676J9803K05982J11165j10203O9411K07989l68107j33732L6906
17852c07090K42966J81605l46498K19638K98302k0089l10430j40539Q5407K46971
17842A50243j77007j64481n47l030J46675O2048o7276j2169q7152j14435j91714
17831d58845J8787L65386J73440p09J32111j3705k67173K63034M50421j56648
17821E06099l06943j87728J57393j09145j69468j29182l25066J21575J88466k30353
17811d84352K34409N3481J24529k01916n25452K11063M68855j24368j13196K63188
17801i3759J21145j98876r8759J72743P7591J11042M61213L64264m46567l38045
17791A31992R9039L1458m0747J22708J84062K0819j58255k14997q2067J62412
$$ plain form
17781 256424 45297 -190113 -328498 -77394 127425 156471 330935 569062 374854 93761
17771 93761 -155498 -173603 3529 -197499 -246710 -169408 41784 422966 177627 -68517
17761 -68517 41489 -12970 30083 121875 1120 -104547 -279747 -172598 -236665 -465157
17751 -465157 -590028 -514915 -369705 -174611 -509262 -651808 -295238 29128 157689 293380
17741 293380 58242 -129983 -103213 110036 462196 475382 199930 -206859 -270050 -338539
17731 -338539 -113882 130058 62177 18782 -190465 -603228 -198551 56031 -18502 -4601
17721 -4601 -2720 -95649 -280439 -222073 -39703 175095 376611 562540 380504 -209011 -799514
17710 -799514 -1033706 -890300 -206825 16823 -51270 -107755 -48778 -6840 224473 345875
$$ packed form
17781B56424k11127k35410j38385K51104K04819K9046J74464K38127j94208k81093
17771I3761k49259j8105J77132k01028m9211P7302K11192L81182k45339k46144
17761f8517J10006n4459M3053R1792j20755j05667j75200J07149o4067k28492
17751d65157j24871P5113J45210J95094l34651j42546L56570L24366J28561J35691
17741B93380k35138j88225K6770K13249L52160J3186k75452m06789o3191o8489
17731c38539K24657K43940o7881m3395k09247m12763M04677K54582p4533J3901
17721d601J881r2929j84790N8366J82370K14798K01516J85929j82036n89515n90503
17710g99514k34192J43406O83475K23648o8093n6485N8977M1938K31313J21402
$$ plain form
17700 345875 240737 69908 165275 91215 -83572 -148762 -218041 95372 211962 281184
17690 281184 -20238 178283 120896 -67654 -164035 -12041 -180679 -289064 -175521 -142018
17680 -142018 -32826 157911 106387 112212 -65121 -159363 64230 142509 379558 199989
17670 199989 137185 264747 516653 145806 -186813 -426252 -484007 -191481 50991 317012
17660 317012 -38860 -146511 -143864 -259297 -564768 -269478 -187478 -199333 -167381 -233043 37357
17649 37357 -71254 -70446 -157618 -66286 -134230 -33253 -12661 -50243 64262 254863 -67576
17638 -67576 -337290 -163505 136280 -218686 -113930 23254 86555 190559 61062 -97120
17628 -97120 -55177 -1313 334423 645879 843161 993229 796406 425034 36934 78457
$$ packed form
17700C45875j05138j70829R5367p4060j74787o5190o9279L13413J16590O9222
17690B81184l01422J98521n7387j88550r6381J51994j68638j08385J13543L3503
17680a42018J09192J90737n1524N825j77333r4242K23593P8279K37049j79569
17670A99989o2804J27562K51906l70847l32619k39439n7755K92526K42472K66021
17660C17012l55872j07651K647j15433l05471K95290Q2000j1855L1952o5662K70400
17649C7357j08611Q08q7172R1332o7944J00977K0592l7582J14505J90601l22439
17638f7576k69714J73785K99785l54966J04756J37184O3301J04004j29497j58182
17628i7120M1943N3864L35736L11456J97282J50068j96823l71372l88100M1523
$$ plain form
17618 78457 395175 300000 286316 101016 196211 272546 197841 63103 -217942 -521973 -489246
17607 -489246 -657546 -545297 -300229 420257 511205 36802 -277084 -385707 -308683 -119571
17597 -119571 -49140 -393300 -226011 51343 -123991 -439709 -363442 -100510 -80140 120542
17587 120542 160358 247627 62585 30063 -39572 58457 266194 235433 6827 -13499 120069
17576 120069 77277 -6573 162760 362200 264354 15486 52785 260880 315113 269537 444667
17565 444667 260249 -69784 -238562 -295349 -43383 -41055 53451 337868 422275 426713 422549
17554 422549 535559 180650 -34482 -158244 -115675 -189366 -224419 -179614 -578779 -351629
17544 -351629 409155 438469 102484 1826 -377938 -545186 -554581 -255726 -112113 -124375
$$ packed form
17618G8457L16718r5175j3684j85300R5195P6335p4705j34738k81045l04031L2727
17607d89246j68300J12249K45068P20486R0948m74403l13886j08623P7024J89112
17597a19571P0431l44160J67289K77354j75334l15718P6267K62932K0370K00682
17587A20542L9816Q7269j85042l2522o9635R8029K07737l0761k28606k0326J33568
17576A20069m2792q3850J69333J99440r7846k48868L7299K08095N4233m5576J75130
17565D44667j84418l30033j68778n6787K51966K328R4506K84417Q4407M438m164
17554D22549J13010l54909k15132j23762M2569p3691l5053M4805l99165K27150
17544c51629P60784K9314l35985j00658l79764j67248r395K98855J43613j2262
$$ plain form
17534 -124375 -60827 -313281 -730734 -537075 -235238 -180817 -255500 -443008 -354554 -156705
17524 -156705 103223 82390 77369 198115 -129010 -38812 49268 -249073 -357277 -265907 -163272
17513 -163272 239117 207264 122990 -167651 -126419 -174826 -338893 -567719 -699827 -629756
17503 -629756 -332009 -118551 54031 33899 -206250 -173478 -191628 -15308 -154700 -500024
17493 -500024 -935740 -898146 -862751 -614944 -500071 -343180 -137376 -222884 -325028 -231250
17483 -231250 -197094 -362717 -450245 -252772 -331169 -188419 -26545 -60481 -29031 104014
17473 104014 -361028 -354162 -148030 -69662 -229957 -365979 -546865 -86205 114926 -121312
17463 -121312 -150428 185217 209819 111220 249753 327139 343657 131892 -134045 -176124 50529
$$ packed form
17534a24375O3548k52454m17453J93659L01837N4421p4683j87508Q8454J97849
17524a56705K59928k0833n021J20746l27125R0198Q8080k98341j08204R1370J02635
17513a63272M02389l1853q4274k90641M1232m8407j64067k28826j32108P0071
17503f29756K97747K13458J72582k0132k40149L2772j8150J76320j39392l45324
17493e00024m35716L7594L5395K47807J14873J56891K05804q5508j02144R3778
17483b31250L4156j65623q7528J97473p8397J42750J61874l3936L1450J33045
17473A04014m65042O866K06132P8368j60295j36022j80886M60660K01131k36238
17463a21312k9116L35645K4602r8599J38533P7386J6518k11765k65937m2079K26653
$$ plain form
17452 50529 -88806 4981 -9025 151408 172731 70503 80888 527311 937667 1769817
17442 1769817 2316298 2507831 2332011 1956115 1262713 883513 855180 388536 42694 -250717
17432 -250717 -271547 -2026 208575 262046 603211 505909 440533 743623 701833 468058
17422 468058 270475 114625 -219035 81902 220266 -51430 -290535 -595435 -540253 -302355
17412 -302355 -36606 89662 55955 9650 -182323 -473314 -417625 -523965 -504140 -618464
17402 -618464 -220737 53946 159480 99907 109667 128717 -151447 -102737 95318 194153 64179
17391 64179 -165891 -87166 -350564 -348748 -146493 -441905 -853703 -732848 -853649 -711527
17381 -711527 -267830 -138730 -31945 -255756 -546515 -489314 -369424 -577739 -475235 -583778
$$ packed form
17452E0529j39335R3787j4006J60433K1323j02228J0385M46423M10356Q32150
17442A769817N46481J91533j75820l75896o93402l79200k8333m66644l45842k93411
17432b50717k0830K69521K10601N3471L41165r7302o5376L03090m1790k33775
17422D68058j97583j55850l33660L00937J38364k71696k39105l04900N5182K37898
17412c02355K65749J26268l3707m6305j91973k90991N5689j06340J9825j14324
17402f18464L97727K74683J05534n9573R760J9050k80164M8710J98055R8835j29974
17391F4179k30070P8725k63398J816K02255k95412m11798J20855j20801J42122
17381g11527M43697J29100J06785k23811k90759N7201J19890k08315J02504j08543
$$ plain form
17371 -583778 -501799 -247552 -210436 -164479 -228623 -264003 15564 94598 -231128 -699469 -316622
17360 -316622 -140432 -24373 -215491 -529765 -612868 -417651 -547077 -561652 -98500 293310
17350 293310 157441 -181196 -393817 -504999 -239358 -400719 -588685 -211844 -245163 -245915
17340 -245915 -325424 -459124 -326295 -171810 -146515 -109960 -194006 -373258 -325011 -344823 -518023
17329 -518023 -317174 80673 432593 147798 -181139 -170611 -250133 -284456 -481131 -531300
17319 -531300 180518 171818 -323073 -500844 -410487 -479906 -417876 -305840 -349079 -286876 48203
17308 48203 269365 85151 -378872 -447555 -151438 3164 272933 335700 91985 25052
17298 25052 -380199 -497377 -572655 -203023 -18389 -71743 -114985 -34468 12534 131909 161019
$$ packed form
17371e83778Q1979K54247L7116M5957o4144l5380K79567P9034l25726m68341L82847
17360c16622J76190J16059j91118l14274q3103J95217j29426j4575M63152L91810
17350B93310j35869l38637k12621j11182K65641j61361j87966L76841l3319p52
17340b45915p9509j33700J32829J54485K5295L6555q4046j79252M8247j9812j73200
17329e18023K00849L97847L51920k84795l28937J0528p9522l4323j96675n0169
17319e31300P11818q700m94891j77771R0357o9419O2030J12036m3239O2203L35079
17308D8203K21162j84214m64023o8683K96117J54602K69769O2767k43715o6933
17298B5052m05251j17178p5278L69632J84634n3354m3242Q0517M7002J19375K9110
$$ plain form
17287 161019 9736 -245454 73641 24727 -289088 97479 281053 206827 -66866 -334580
17277 -334580 -393732 -324694 -540893 -516187 -566028 -270782 34346 -128994 -305528 -301796 -47943
17266 -47943 172160 13992 -286124 -484802 -288449 138811 580687 588367 461151 410839
17256 410839 374501 254995 212626 -142507 -526109 -467824 -270591 -120898 -24215 -189530
17246 -189530 -137685 239681 236189 205050 25476 69226 110311 -204587 18595 -10607 -31551
17235 -31551 -122370 44987 298349 79272 106796 139900 -37704 -47611 130595 491131 302023
17224 302023 -182681 -11808 220578 229195 237000 306518 15289 297252 288970 35807 51039
17213 51039 40992 -302222 -386889 -459090 -166072 147191 281827 331406 406951 508533 720002
$$ packed form
17287A61019j51283k55190L19095m8914l13815L86567J83574p4226k73693k67714
17277c34580n9152O9038k16199K4706m9841K95246L05128j63340j76534L732K53853
17266d7943K20103j58168l00116j98678J96353M27260M41876P680j27216n0312
17256D10839l6338j19506m2369l55133l83602N8285J97233J49693R6683j65315
17246a89530N1845L77366l492l1139j79574M3750M1085l14898K23182k9202k0944
17235c1551r0819J67357K53362k19077K7524L3104j77604r907J78206L60536j89108
17224C02023m84704J70873K32386Q617P805O9518k91229K81963q282k53163J5232
17213E1039j0047l43214q4667p2201K93018L13263J34636M9579P5545J01582K11469
$$ plain form
17202 720002 553794 417140 445435 205038 -203385 -238809 -288830 -203330 184662 109496
17192 109496 -592111 -893605 -810487 -594838 -356149 -305961 -268845 -126471 49386 -166495
17182 -166495 49915 133553 259700 144157 -194209 -317918 -297851 33080 -100297 -329402
17172 -329402 -323806 -30396 1877 136940 55411 -69485 62009 155037 133154 -3545 -56594
17161 -56594 291479 389020 305146 94266 52454 103804 235273 363268 343615 254170 -161919
17150 -161919 -195009 -288233 -144051 -167296 -127174 -200869 -260143 -240537 49560 341384 82877
17139 82877 -302949 -560734 -295581 -227641 -470144 -349366 -295412 -502223 -394127 -332544
17129 -332544 -141260 -90514 -23424 19682 4884 -134305 33737 -23886 -357309 -448000 -285470
$$ packed form
17202G20002j66208j36654K8295k40397m08423l5424n0021Q5500L87992p5166
17192A09496p01607l01494Q3118K15649K38689N0188L7116J42374J75857k15881
17182a66495K16410Q3638J26147j15543l38366j23709K0067L30931j33377k29105
17172c29402N596K93410L2273J35063q1529j24896J31494R3028k1883j36699n3049
17161e6594L48073R7541q3874k10880m1812N1350J31469J27995j9653q9445m16089
17150a61919l3090r3224J44182k3245M0122p3695n9274J9606K90097K91824k58507
17139H2877l85826k57785K65153O7940k42503J20778N3954k06811J08096O1583
17129c32544J91284N0746O7090M3106j4798j39189J68042n7623l33423r0691J62530
$$ plain form
17118 -285470 -135980 70051 72434 108175 381642 199440 -29251 -121302 -238626 -422434
17108 -422434 158795 301648 414280 33780 -356050 -355122 -409712 -264544 -319902 -314478 -373567
17097 -373567 -214470 -180962 -144140 -50662 -185244 -288986 -29840 7252 -20106 -341863
17087 -341863 -410148 -602687 -674957 -528776 -148029 64824 -38075 180507 379835 437805
17077 437805 279565 214780 537673 127120 -292331 -276674 -471665 -659784 -354305 -314459
17067 -314459 -490090 -266978 -115818 175293 512873 167217 -210648 -375388 -126163 -323092
17057 -323092 -533996 -497468 -90272 746 -384737 -630772 -688484 -586205 -562743 -482167
17047 -482167 -124904 -9107 64175 -49172 -439642 -290044 288747 149251 109158 168774
$$ packed form
17118b85470J49490K06031K383L5741K73467j82202k28691r2051j17324j83808
17108d22434N81229J42853J12632l80500l89830R28n4590J45168n5358N424n9089
17097c73567J59097L3508L6822R3478j34582j03742K59146L7092k7358l21757
17087c41863o8285j92539p2270J46181L80747K12853j02899K18582J99328N7970
17077D37805j58240o4785L22893m10553m19451J5657j94991j88119L05479L9846
17067c14459j75631K23112J51160K91111L37580l45656l77865j64740K49225j96929
17057c23092k10904L6528M07196R1018l85483k46035n7712J02279K3462Q0576
17047d82167L57263J15797P3282j13347l90470J49598N78791j39496m0093N9616
$$ plain form
17037 168774 -136236 -52898 -34372 9020 139140 297555 259566 426244 469874 170835
17027 170835 -186713 21301 182624 -64281 -136545 -135417 -399154 -290628 -413934 -414035 -216478
17016 -216478 -57517 842 -405677 -792878 -876407 -790812 -949752 -1106302 -1119612 -1031873
17006 -1031873 -1063756 -829680 -428320 46458 281646 502764 655461 377835 459382 481074
16996 481074 298828 286195 225746 199227 130817 -188519 -307944 9353 296062 319617
16986 319617 68303 -1839 -37950 22119 -158239 25762 -17284 25677 -3004 -64568 -44488
16975 -44488 -20407 -62400 -410037 -373149 -77251 1136 11513 13809 148541 230489 283618
16964 283618 79392 -217918 -81266 72451 19723 -429301 -235636 -10635 -21957 78299
$$ packed form
17037A68774l05010Q3338J8526M3392J30120J58415l7989J66678M3630k99039
17027A70835l57548K08014J61323k46905p2264J128k63737J08526j23306j01J97557
17016b16478J58961N8359m06519l87201q3529Q5595j58940j56550j3310Q7739
17006a031873l1883K34076M01360M74778K35188K21118J52697k77626Q1547K1692
16996D81074j82246j2633o0449k6519o8410l19336j19425L17297K86709K3555
16986C19617k51314p0142l6111O0069j80358J84001m3046M2961k8681o1564K0080
16975d4488K4081m1993l47637L6888K95898P8387J0377K296J34732Q1948N3129
16964B83618k04226k97310J36652J53717n2728m49024J93665K25001j1322J00256
$$ plain form
16954 78299 398010 643854 690526 536886 420879 243214 260156 289837 72955 -120685
16944 -120685 -364366 -576928 -166051 37049 -144592 -327593 -368309 -85370 1836 14797
16934 14797 80309 11967 -62357 -30881 -256549 -402483 -314030 77945 137830 90445 40199
16923 40199 -128886 -293610 -547927 -460567 -226597 -99815 -281022 -271103 -363742 -369771 -117547
16912 -117547 -290819 -510896 -535407 -491357 -171450 -39199 -170592 59042 51914 -219693
16902 -219693 -339444 11401 -63545 -352995 -123490 -51094 183835 166170 -198762 -284623
16892 -284623 -390089 -740179 -751532 -314522 -43355 -238906 -238614 -140255 134496 24396
16882 24396 -423723 -268980 3201 145747 286996 201488 352785 406884 101440 -98836
$$ packed form
16954G8299L19711K45844M6672j53640j16007j77665J6942K9681k16882j93640
16944a20685k43681k12562M10877K03100j81641j83001m0716K82939Q7206J2961
16934A4797O5512o8342p4324L1476k25668j45934Q8453L91975N9885m7385n0246
16923D0199j69085j64724k54317Q7360K33970J26782j81207R919r2639o029K52224
16912a17547j73272k20077k4511M4050L19907J32251j31393K29634p128k71607
16902b19693j19751L50845p4946k89450K29505P2396K34929j7665l64932q5861
16892b84623j05466l50090j1353M37010K71167j95551K92R8359K74751j10100
16882B4396m48119J54743K72181J42546J41249q5508J51297N4099l05444k00276
$$ plain form
16872 -98836 -445643 -435404 -199573 -25387 -250012 -226310 -12822 44369 -105296 -260435
16862 -260435 -199054 121407 194715 371229 -57782 -219922 -263903 -250022 -59301 31726
16852 31726 392656 501587 257473 443192 382283 -106864 -88961 -29891 118073 -51908
16842 -51908 -192847 -295643 -173920 96251 -44036 -79459 -346013 -519786 -471054 -230898
16832 -230898 -313116 -212806 200845 258142 16621 298519 496855 630042 743529 590398
16822 590398 54596 -34334 108237 373338 126845 -22661 -152726 -297608 -506044 -529686
16812 -529686 -349980 -115428 -224902 24023 196275 226444 190547 76006 -82100 71606
16802 71606 149166 278117 255918 285097 221931 263180 -221070 -378172 135353 -11485 -58498
$$ packed form
16872i8836l46807J0239K35831J74186k24625K3702K13488N7191j49665j55139
16862b60435O1381L20461P3308J76514m29011j62140m3981J3881J90721R1027
16852C1726L60930J08931k44114J85719o0909m89147J7903N9070J47964j69981
16842e1908j40939j02796J21723K70171j40287l5423k66554j73773M8732K40156
16832b30898q2218J00310M13651N7297k41521K81898J98336J33187J13487j53131
16822E90398n35802q8930J42571K65101k46493j49506j30065j44882k08436k3642
16812e29686J79706K34552j09474K48925J72252L0169l5897j14541j58106J53706
16802G1606P7560J28951k2199K9179o3166M1249m84250j57102N13525j46838m7013
$$ plain form
16791 -58498 -150926 -261146 -109805 100405 191477 245903 8029 -33911 202258 115836 16626
16780 16626 -159731 -64017 -101788 -91751 -6132 69428 -340290 -330294 -104205 -127757 -142672
16769 -142672 -106332 -433784 -387464 -239296 -153649 -218488 -256985 -207137 47688 70633 111664
16758 111664 -221580 -170275 -435909 -561844 -408217 -327964 -295445 -262543 -445451 -623618
16748 -623618 -393038 -101459 145805 26610 -188018 167337 502225 145850 -111008 -428957
16738 -428957 -289934 -67366 75889 -83396 -179160 -352481 -389816 -180445 -82281 152418
16728 152418 -136049 -231138 -264910 -176366 -212599 -114656 43624 -103568 -129782 27904 183196
16717 183196 347660 97696 256275 484436 459104 440188 461001 542956 247297 115904
$$ packed form
16791e8498r2428j10220J51341K10210R1072N4426k37874m1940K36169q6422r9210
16780A6626j76357R5714l7771J0037Q5619P5560m09718R996K26089k3552j4915
16769a42672L6340l27452M6320J48168Q5647o4839l8497M9848K54825K2945M1031
16758A11664l33244N1305k65634j25935J53627Q0253L2519L2902j82908j78167
16748f23618K30580K91579K47264j19195k14628L55355L34888l56375k56858l17949
16738d28957J39023K22568J43255j59285r5764j73321l7335K09371R8164K34699
16728A52418k88467r5089l3772Q8544l6233R7943J58280j47192k6214J57686J55292
16717A83196J64464k49964J58579K28161k5332j8916K0813Q1955k95659j31393
$$ plain form
16707 115904 -112563 -222899 -7463 27694 -156905 39147 294417 87542 -277727 -237363
16697 -237363 -279629 -353067 -777861 -869738 -467058 -310219 -136447 -31 -75926 -388669
16687 -388669 -444332 -558155 -390001 -102231 -123564 -2466 322923 232146 -160007 -212370
16677 -212370 -293580 -245223 83453 57955 -151300 151735 45291 -71550 -346475 -203999
16667 -203999 -290656 -209828 55216 37044 123737 214980 58463 291144 124024 -179721
16657 -179721 -364083 -372136 -276694 -360286 -183861 -3431 -44378 -77380 -176833 -179563 1148
16646 1148 -234652 -571965 -514720 -154933 -238092 -106290 355881 238764 -209649 -57235
16636 -57235 265822 218526 418630 517521 160725 215586 183425 124664 117524 261187 179911
$$ packed form
16707A15904k28467j10336K15436L5157j84599J96052K55270k06875l65269M0364
16697b37363m2266p3438m24794r1877M02680J56839J73772J36416p5895l12743
16687c88669n5663j13823J68154K87770k1333J21098L25389r0777l92153n2363
16677b12370q1210M8357L28676k5498k09255L03035j06444j16841k74925J42476
16667b03999q6657Q0828K65044j8172Q6693R1243j56517K32681j67120l03745
16657a79721j84362q053R5442q3592J76425J80430m0947l3002r9453k730J80711
16646A148k35800l37313N7245L59787q3159J31802M62171j17117m48413J52414
16636e7235L23057m7296K00104R8891l56796N4861l2161n8761p140J43663q1276
$$ plain form
16625 179911 388220 206793 -53093 -87508 -219043 -320488 -170785 92705 152794 366555
16615 366555 302254 -25216 -310634 -389207 -130700 385591 467108 384586 226479 313402
16605 313402 527121 211534 82247 38550 99613 103634 10813 26346 3695 301840 403588
16594 403588 135102 -73868 -325357 -582792 -657788 -498096 -306212 76887 397211 259787
16584 259787 88438 -13041 10650 110514 151385 214339 10670 -227276 -139459 -208271 217153
16573 217153 424158 266376 -50968 118986 -10786 77536 -146005 -388394 -215472 89216
16563 89216 186178 -213214 -336023 -588981 -533922 -428271 51271 -10873 -258929 -639256
16553 -639256 -689460 -268106 -42113 -102335 34199 483539 760543 476311 -34891 -119554
$$ packed form
16625A79911K08309j81427k59886l4415j31535j01445J49703K63490O0089K13761
16615C66555o4301l27470k85418p8573K58507N16291Q1517q2522j58107Q6923
16605C13402K13719l15587j29287m3697O1063M021r2821J5533k2651K98145J01748
16594D03588k68486k08970k51489k57435p4996J59692J91884L83099L20324j37424
16584B59787j71349j01479K3691R9864M0871O2954k03669k37946Q7817o8812M25424
16573B17153K07005j57782l17344J69954j29772Q8322k23541k42389J72922L04688
16563H9216R6962l99392j22809k52958N5059J05651M79542o2144k48056l80327
16553f39256n0204M21354K25993o0222J36534M49340K77004k84232n11202q4663
$$ plain form
16543 -119554 -273011 -286664 -388873 -252220 -198452 -214923 971 201095 -168300 -402040
16533 -402040 -355726 -641840 -456366 -368491 -361101 -199547 -320460 -372281 -444592 -361206 -180302
16522 -180302 140352 385832 326901 247982 167495 296284 429093 456494 191794 104930
16512 104930 5206 -111430 -152344 -421540 -550674 -547101 59166 539817 420296 141562
16502 141562 -230599 -185248 183559 -91758 -347595 -229499 51724 292613 506959 544104
16492 544104 289195 93618 247687 125827 -89812 -293825 -118438 82911 170854 419638
16482 419638 471308 287074 -115891 -138687 -14399 -243581 -260849 126618 35232 -133684
16472 -133684 -59330 -59552 -98252 88982 -168606 -405014 -373027 -177385 126016 362159 439741
$$ packed form
16543a19554j53457j3653j02209J36653N3768j6471K15894K00124l69395k33740
16533d02040M6314k86114J85474Q7875P390J61554j20913n1821p2311Q3386J80904
16522a80302L20654K45480n8931p8919q0487J28789J32809K7401k64700q6864
16512A04930r9724j16636m0914k69196j29134L573O06267M80651j19521k78734
16502A41562l72161M5351L68807k75317k55837J18096K81223K40889K14346L7145
16492E44104k54909j95577J54069j21860k15639k04013J75387K01349Q7943K48784
16482D19638N1670j84234m02965k2796J24288k29182j7268L87467r1386j68916
16472a33684P4354k22l8700J87234k57588k36408L1987J95642L03401K36143P7582
$$ plain form
16461 439741 279027 328628 -32024 -197233 -182289 -27168 150110 439967 565273 229919
16451 229919 76154 -97119 -269140 -202439 -307291 20087 77482 50350 153973 493298
16441 493298 356927 135206 -253120 107448 57887 -333680 -184318 -174019 -59665 -168733
16431 -168733 -237889 127127 138142 441592 359518 109906 14717 93527 160718 96540 157470
16420 157470 -276160 -162031 -92546 -46535 -277057 -206071 -212802 -169684 153880 -114711 -372703
16409 -372703 -171230 -201949 -487768 -251580 -24030 -57285 -46222 -469825 -503939 -386513
16399 -386513 -537391 -850755 -670864 -332291 31897 252490 433058 260634 22549 -333190
16389 -333190 -41708 -141059 -273188 38580 304348 -226761 -381624 -322978 -297487 -110382
$$ packed form
16461D39741j60714M9601l60652j65209J4944J55121J77278K89857J25306l35354
16451B29919j53765j73273j72021O6701j04852L27378N7395k7132J03623L39325
16441D93298j36371k21721l88326L60568m9561l91567J49362J0299J14354j09068
16431a68733o9156L65016J1015L03450q2074k49612r5189P8810O7191o4178O0930
16420A57470m33630J14129O9485M6011k30522P0986o731M3118L23564k68591k57992
16409c72703K01473l0719k85819K36188K27550l3255J1063m23603l4114J17426
16399c86513j50878l13364J79891L38573L64188K20593J80568j72424k38085l55739
16389c33190K91482r9351j32129L11768K65768n31109j54863N8646K5491J87105
$$ plain form
16379 -110382 -63284 235344 384689 15525 -364319 -375820 -264501 -348191 15194 47913
16369 47913 -271761 -45398 -64048 5279 -126247 -324782 -155987 -23910 -343638 -407904
16359 -407904 -292360 -396201 -398231 -49275 44629 113987 -181718 -67527 14053 -11001 8398
16348 8398 206727 -262830 -399464 -298513 -276337 -289681 -507510 -291343 -301467 -213446 -133932
16337 -133932 -53739 -192396 -285739 -218127 -76901 -170728 -97275 -12061 -51812 -121549 -173220
16326 -173220 -42523 143610 259333 267575 193494 252502 47524 -137734 -49475 -47633 -140152
16315 -140152 -111433 -10289 249799 134881 -42284 143050 235204 131976 241151 474553
16305 474553 526435 355198 271184 25473 66335 180386 209559 323584 489810 404353
$$ packed form
16379a10382M7098K98628J49345l69164l79844j1501J11319q3690L63385L2719
16369D7913l19674K26363j8650O9327j31526j98535J68795J32077l19728o4266
16359d07904J15544j03841k030L48956R3904O9358k95705J14191Q1580k5054J9399
16348H398J98329m69557j36634J00951K2176j3344k17829K16167j0124Q8021P9514
16337a33932Q0193j38657r3343O7612J41226r3827P3453Q5214l9751o9737n1671
16326a73220J30697J86133J15723Q242p4081N9008k04978j85258Q8259J842r2519
16315a40152K8719J01144K60088j14918j77165J85334R2154j03228J09175K33402
16305D74553N1882j71237q4014k45711M0862J14051K9173J14025J66226q5457
$$ plain form
16295 404353 -152891 -351629 -615167 -742152 -350203 -44622 -347721 -323322 -406807 -311495
16285 -311495 60648 30544 -89749 -325400 -200227 -130273 -207086 -473049 -124093 -98828
16275 -98828 -182008 -29109 205447 235224 188426 193917 117669 101756 89538 25387 -65857
16264 -65857 -69743 147734 127751 -449986 -762406 -318071 -79696 -52939 118091 86674 298531
16253 298531 206153 131106 184777 187419 242634 104239 200990 439670 277364 67645 127181
16242 127181 152515 247230 223839 -182639 -286025 -320568 -348861 -421663 -304187 -15715 87836
16231 87836 42779 54638 -250145 -509852 -393637 -366227 -429728 -351827 -435636 -429261 -371078
16220 -371078 -389972 -340351 -253761 -557692 -296522 60536 -201099 -95151 -16958 260017
$$ packed form
16295D04353n57244j98738k63538j26985L91949L05581l03099K4399q3485R5312
16285c11495L72143l0104j20293k35651J25173O9954p6813k65963L48956K5265
16275i8828q3180J52899K34556K9777m6798N491p6248j5913j2218o4151r1244
16264f5857l886K17477j9983n77737l12420M44335K38375K6757J71030l1417K11857
16253B98531r2378p5047N3671K642N5215j38395R6751K38680j62306k09719N9536
16242A27181K5334R4715k3391m06478j03386l4543k8293p2802J17476K88472J03551
16231H7836m5057J1859l04783k59707J16215K7410o3501P7901q3809O375N8183
16220c71078j8894M9621Q6590l03931K61170L57058k61635J05948P8193K76975
$$ plain form
16210 260017 482071 455564 301172 143903 139580 143788 -158077 -90071 -16352 24104 429889
16199 429889 567951 486114 564734 579058 382889 422182 508996 596785 755998 467917 194307
16188 194307 284157 524278 149303 -164623 -182984 -579835 -443257 -112636 -213577 -90501
16178 -90501 169455 269925 254985 590283 974383 805906 386682 431958 637516 326659
16168 326659 306779 457406 498262 265526 -36673 -71569 -200709 -559029 -730546 -457628
16158 -457628 -299297 -233979 76402 282681 130697 23965 -11262 72551 23642 -175453
16148 -175453 -314386 292025 488529 466567 537692 313038 362184 330873 111222 -108599
16138 -108599 58401 101421 -151211 -173950 122147 355121 165293 42951 406406 421769
$$ packed form
16210B60017K22054k6507j54392j57269m323M208l01865O8006P3719M0456M05785
16199D29889J38062q1837P8620J4324j96169L9293Q6814Q7789J59213k88081k73610
16188A94307Q9850K40121l74975l13926j8361l96851J36578L30621j00941J23076
16178i0501K59956J00470j4940L35298L84100j68477m19224M5276K05558l10857
16168C26659j9880J50627M0856k32736l02199l4896j29140l58320j71517K72918
16158d57628J58331O5318L10381K06279j51984j06732l5227Q3813m8909j99095
16148a75453j38933O06411J96504k1962P1125k24654M9146l1311k19651k19821
16138a08599J67000M3020k52632k2739K96097K32974j89828j22342L63455J5363
$$ plain form
16128 421769 582641 461410 51944 14245 463401 717952 1035373 878227 582501 562917
16118 562917 415102 194249 269447 383800 273894 -90463 -160317 -137686 182796 159916
16108 159916 59200 -32656 -186023 -127777 136504 342473 244199 267785 412508 98425
16098 98425 201912 137646 -133793 -610484 -708147 -267699 -23850 -129735 -326975 -83554
16088 -83554 -42387 -179609 -41566 -9491 -110524 112893 368644 246623 271948 247266
16078 247266 59474 22176 266873 292344 319863 388036 298774 328026 312292 -225300 -455570
16067 -455570 -383201 -112369 -86170 -377509 -198023 -213923 -237045 -486805 -415326 227309
16057 227309 658891 688038 508829 -67011 -227290 -405606 -354801 -194238 229811 407133
$$ packed form
16128D21769J60872j21231m09466l7699M49156K54551L17421j57146k95726j9584
16118E62917j47815k20853P5198J14353j09906l64357o9854K2631L20482k2880
16108A59916j00716r1856j53367N8246K64281K05969r8274K3586J44723l14083
16098I8425J03487o4266k71439m76691r7663M40448K43849j05885j97240K43421
16088h3554M1167j37222J38043L2075j01033K23417K55751j22021K5325k4682
16078B47266j87792l7298K44697K5471K7519O8173q9262K9252j5734n37592k30270
16067d55570P2369K70832K6199k91339J79486j5900k3122k49760P1479O42635
16057B27309M31582K9147j79209n75840j60279j78316N0805J60563M24049J77322
$$ plain form
16047 407133 217816 237431 424833 673935 686278 376488 267586 372784 398586 306805
16037 306805 426452 237565 73072 140133 -72102 -145108 164025 207345 489183 817948
16027 817948 709929 258686 -222681 -358969 -300839 -233692 -204890 -343344 -416449 -390370
16017 -390370 -126215 302886 372179 78778 332957 426025 90309 197791 -167650 -351963
16007 -351963 -347953 -296578 -282669 -528205 -507299 -738888 -628549 -502064 -367205 112757
15997 112757 44259 -70374 3743 -12637 159158 251269 164903 -118271 79455 469845
15987 469845 345973 200449 359648 -78919 -290526 -44303 207823 435692 14403 281571
15977 281571 418161 62372 -49785 67795 5158 -14996 -101454 -119707 -275085 -160377
$$ packed form
16047D07133j89317J9615J87402K49102J2343l09790j08902J05198K5802r1781
16037C06805J19647j88887j64493O7061k12235p3006L09133M3320K81838L28765
16027H17948j08019m51243m81367j36288N8130O7147K8802j38454p3105K6079
16017c90370K64155M29101O9293k93401K54179R3068l35716J07482l65441j84313
16007c51963M010N1375J3909k45536K0906k31589J10339J26485J34859M79962
15997A12757o8498j14633P4117j6380J71795R2111q6366k83174J97726L90390
15987D69845j23872j45524J59199m38567k11607K46223K52126K27869m21289K67168
15977B81571J36590l55789j12157J17580o2637k0154q6458j8253j55378J14708
$$ plain form
15967 -160377 -64701 -125820 -252876 123460 97278 156611 361215 284318 -14688 58828 76479
15956 76479 285862 400753 427923 458801 391854 -138365 -357114 -160722 -17596 -123963
15946 -123963 40373 448262 226957 -57968 -31850 50393 200408 220491 16681 -235757
15936 -235757 -281717 -71269 -385776 -299729 -237407 39605 293058 175777 312208 533885
15926 533885 387896 478396 319617 367120 460674 465023 479460 487065 228478 108314 248253
15915 248253 369398 293398 84904 -162866 50364 -214611 -167330 -124546 -139703 -291011
$$ packed form
15967a60377R5676o1119j27056L76336k6182N9333K04604p6897k99006P3516J7651
15956G6479K09383J14891K7170L0878o6947n30219k18749J96392J43126j06367
15946a23963J64336M07889k21305k84925K6118Q2243J50015K0083k03810k52438
15936b35757m5960K10448l14507Q6047O2322K77012K53453j17281J36431K21677
15926E33885j45989R0500j58779M7503R3554M349J4437P605k58587j20164J39939
15915B48253J21145p6000k08494k47770K13230k64975M7281M2784j5157j51308
$$ [...]
##END NTUPLES=NMR SPECTRUM
##END=
