##TITLE=Analysis number 313114
Compound Code gk 01904
Project Code adrs
Chemist Name endeavour
##JCAMPDX= 6.0         $$ Bruker NMR JCAMP-DX V2.0
##DATA TYPE= NMR SPECTRUM
##DATA CLASS= NTUPLES
##ORIGIN= Bruker BioSpin GmbH
##OWNER= NMR
$$ XWIN-NMR		Version 3.5
$$ Wed Aug 24 14:28:34 2005 GMT Daylight Time (UT+1h)  MAYBRIDGE\NMR@NMR_250MHZ
##.OBSERVE FREQUENCY= 250.131544655141
##.OBSERVE NUCLEUS= ^1H
##.ACQUISITION MODE= SIMULTANEOUS (DQD)
##.ACQUISITION SCHEME= undefined
##.AVERAGES= 16
##.DIGITISER RES= 18
##SPECTROMETER/DATA SYSTEM= dpx250
##.PULSE SEQUENCE= zg30
##.SOLVENT NAME= DMSO
##.SHIFT REFERENCE= (INTERNAL, DMSO, 0, 16.522)
##AUDIT TRAIL= $$ (NUMBER, WHEN, WHO, WHERE, WHAT)
$$ ##TITLE= Audit trail, XWIN-NMR		Version 3.5
$$ ##JCAMPDX= 5.01
$$ ##ORIGIN= Bruker BioSpin GmbH
$$ ##OWNER= NMR
$$ C:\u/data/dgb/nmr/ADRS/8540/pdata/1/auditp.txt
$$ ##AUDIT TRAIL=  $$ (NUMBER, WHEN, WHO, WHERE, WHAT)
(   1,<2005-08-24 14:28:17.25 +100>,<MAYBRIDGE\NMR>,<NMR_250MHZ>,
      <created by zg, POWCHK disabled, PULCHK disabled
       configuration hash MD5:
       62 19 C7 07 E1 42 D1 B7 37 6C 3D D0 77 39 F9 E6
       data hash MD5: 64K
       61 24 66 70 0F B9 9A 6A 75 19 15 22 B1 B9 2E 23>)
(   2,<2005-08-24 14:28:27.78 +100>,<MAYBRIDGE\NMR>,<NMR_250MHZ>,
      <Start of raw data processing
       ef LB = 0.3 FT_mod = 6 PKNL = 1 SI = 32K 
       data hash MD5: 32K
       2B 62 85 95 48 A3 F4 77 01 FC 98 86 E9 0E 2C 22>)
(   3,<2005-08-24 14:28:29.53 +100>,<MAYBRIDGE\NMR>,<NMR_250MHZ>,
      <apk 
       data hash MD5: 32K
       F9 D0 CE 94 F1 F8 9D 7E 3E E1 3B 15 1E 3E E2 DA>)
(   4,<2005-08-24 14:28:30.28 +100>,<MAYBRIDGE\NMR>,<NMR_250MHZ>,
      <abs ABSG = 5 
       data hash MD5: 32K
       63 C6 02 68 8E B3 C2 6E 0F 0A F4 5E FE 73 04 07>)
$$ ##END=
$$ 
$$ hash MD5
$$ BB 6B A5 1E 3D 3B E1 6B FA 29 79 10 EF C3 76 11
##$RELAX= 
##$RELAX= 
##$RELAX= 
##$RELAX= 
##$RELAX= 
##$RELAX= 
##$RELAX= 
$$ Bruker specific parameters
$$ --------------------------
##$DU= <C:\u>
##$EXPNO= 8540
##$NAME= <ADRS>
##$PROCNO= 1
##$TYPE= <nmr>
##$USER= <dgb>
##$AMP= (0..31)
100 100 100 100 100 100 100 100 100 100 100 100 100 100 100 100 100 100 
100 100 100 100 100 100 100 100 100 100 100 100 100 100 
##$AQSEQ= 0
##$AQ_mod= 3
##$AUNM= <au_zg>
##$AUTOPOS= <41 >
##$BF1= 250.13
##$BF2= 250.13
##$BF3= 250.13
##$BF4= 250.13
##$BF5= 500.13
##$BF6= 500.13
##$BF7= 500.13
##$BF8= 500.13
##$BYTORDA= 1
##$CFDGTYP= 0
##$CFRGTYP= 5
##$CHEMSTR= <none>
##$CNST= (0..31)
1 1 145 1 1 1 1 1 1 1 1 1 1 1 1 1 1 1 1 1 1 1 1 1 1 1 1 1 1 1 1 1 
##$CPDPRG= <>
##$CPDPRG1= <>
##$CPDPRG2= <>
##$CPDPRG3= <>
##$CPDPRG4= <mlev>
##$CPDPRG5= <mlev>
##$CPDPRG6= <mlev>
##$CPDPRG7= <mlev>
##$CPDPRG8= <mlev>
##$CPDPRGB= <>
##$CPDPRGT= <>
##$D= (0..31)
0 1 0 0 0 0 0 0 0 0.06 0 0 0 0 0 0 0.0002 0 0 0 0 0 0 0 0 0 0 0 0 0 0 
0 
##$DATE= 1124890096
##$DBL= (0..7)
120 120 120 120 120 120 120 120 
##$DBP= (0..7)
150 150 150 150 150 150 150 150 
##$DBP07= 0
##$DBPNAM0= <>
##$DBPNAM1= <>
##$DBPNAM2= <>
$$ [...]
##$SUBNAM7= <"">
##$SUBNAM8= <"">
##$SUBNAM9= <"">
##$SW= 20.6930455092707
##$SWIBOX= (0..15)
0 0 3 0 0 0 0 0 0 0 0 0 0 0 0 0 
##$SW_h= 5175.983436853
##$TD= 65536
##$TD0= 1
##$TE= 295.16
##$TE2= 300
##$TE3= 300
##$TEG= 300
##$TL= (0..7)
0 120 120 120 120 120 120 120 
##$TP= (0..7)
150 150 150 150 150 150 150 150 
##$TP07= 0
##$TPNAME0= <>
##$TPNAME1= <>
##$TPNAME2= <>
##$TPNAME3= <>
##$TPNAME4= <>
##$TPNAME5= <>
##$TPNAME6= <>
##$TPNAME7= <>
##$TPOAL= (0..7)
0.5 0.5 0.5 0.5 0.5 0.5 0.5 0.5 
##$TPOFFS= (0..7)
0 0 0 0 0 0 0 0 
##$TUNHIN= 0
##$TUNHOUT= 0
##$TUNXOUT= 0
##$USERA1= <user>
##$USERA2= <user>
##$USERA3= <user>
##$USERA4= <user>
##$USERA5= <user>
##$V9= 5
##$VALIST= <valist>
##$VCLIST= <CCCCCCCCCCCCCCC>
##$VD= 0
##$VDLIST= <DDDDDDDDDDDDDDD>
##$VPLIST= <PPPPPPPPPPPPPPP>
##$VTLIST= <TTTTTTTTTTTTTTT>
##$WBST= 1024
##$WBSW= 4
##$XGAIN= (0..3)
0 0 0 0 
##$XL= 0
##$YL= 0
##$YMAX_a= 326620
##$YMIN_a= -381050
##$ZGOPTNS= <>
##$ZL1= 120
##$ZL2= 120
##$ZL3= 120
##$ZL4= 120
##$ABSF1= 16.522
##$ABSF2= -4.171173
##$ABSG= 5
##$ABSL= 3
##$ALPHA= 0
##$AQORDER= 0
##$ASSFAC= 0
##$ASSFACI= 0
##$ASSFACX= 0
##$ASSWID= 0
##$AUNMP= <proc_1d>
##$AZFE= 0.1
##$AZFW= 0.1
##$BCFW= 0
##$BC_mod= 0
##$BYTORDP= 0
##$COROFFS= 0
##$CY= 12.5
##$DATMOD= 1
##$DC= 0
##$DFILT= <>
##$DTYPP= 0
##$F1P= 14.0000005364418
##$F2P= -0.99999901652339
##$FCOR= 0.5
##$FTSIZE= 32768
##$FT_mod= 6
##$GAMMA= 0
##$GB= 0
##$INTBC= 1
##$INTSCL= 1
##$ISEN= 128
##$LB= 0.3
##$LEV0= 0
##$LPBIN= 0
##$MAXI= 10000
##$MC2= 0
##$MEAN= 0
##$ME_mod= 0
##$MI= 0
##$NCOEF= 0
##$NC_proc= -3
##$NLEV= 6
##$NOISF1= 0
##$NOISF2= 0
##$NSP= 0
##$NTH_PI= 0
##$NZP= 0
##$OFFSET= 16.522
##$PC= 1
##$PHC0= -86.58902
##$PHC1= 1.428478
##$PH_mod= 1
##$PKNL= yes
##$PPARMOD= 0
##$PSCAL= 4
##$PSIGN= 0
##$REVERSE= no
##$SF= 250.13
##$SI= 32768
##$SIGF1= 0
##$SIGF2= 0
##$SINO= 400
##$SIOLD= 32768
##$SREGLST= <1H.DMSO>
##$SSB= 0
##$STSI= 32768
##$STSR= 0
##$SW_p= 5175.98343685301
##$SYMM= 0
##$S_DEV= 0
##$TDeff= 65536
##$TDoff= 0
##$TI= <Analysis number 999999
Compound Code 99
Book Reference 9
Project Code 9>
##$TILT= no
##$TM1= 0
##$TM2= 0
##$TOPLEV= 0
##$USERP1= <user>
##$USERP2= <user>
##$USERP3= <user>
##$USERP4= <user>
##$USERP5= <user>
##$WDW= 1
##$XDIM= 32768
##$YMAX_p= 455707413
##$YMIN_p= -187125
$$ End of Bruker specific parameters
$$ ---------------------------------
##NTUPLES= NMR SPECTRUM
##VAR_NAME=  FREQUENCY,     SPECTRUM/REAL,   SPECTRUM/IMAG
##SYMBOL=    X,             R,               I
##VAR_TYPE=  INDEPENDENT,   DEPENDENT,       DEPENDENT
##VAR_FORM=  AFFN,          ASDF,            ASDF
##VAR_DIM=   32768,         32768,           32768
##UNITS=     HZ,            ARBITRARY UNITS, ARBITRARY UNITS
##FACTOR=    0.157963299565203, 1,           1
##FIRST=     4132.6476996994, 0,             0
##LAST=      -1043.33573715361, 0,           0
##MIN=       -1043.33573715361, -187125,     0
##MAX=       4132.6476996994, 455707413,     0
$$ Real data points
##PAGE= N=1
##DATA TABLE= (X++(R..R)), XYDATA
$$ [...]
18726D8077125m979415n573540n646582n103366m122190l147441k395211j788362
18718A5321018j407692j130785r45475p78590o51805n22695m67242m03908l62228
18709H650598k99272k43926k12302j89019j69774j79127j93532k16467k78931
18700F668248l40343l61176l48389l29373l11064k97683k65759k29506k26950
18691C958005k03697k07337j83598j32571j53066j54505j32908j04548j14461
18682B571314j37902j19132j03041r0528p3574q7017o0741n9157j02989r6000
18672A641233o1124l2569n9598o9940m7302k7405m0980n6035l8195m9155o0803
18661A098127k7031k2652j7868m6168l8395l854l859k1780q415m8998p7124l5125
$$ plain form
18726 48077125 43097710 37524170 31877588 26774222 22652032 19504591 17109380 15321018
18718 15321018 13913326 12782541 11837066 11058476 10406671 9883976 9416734 9012826 8650598
18709 8650598 8351326 8107400 7895098 7706079 7536305 7357178 7163646 6947179 6668248
18700 6668248 6327905 5966729 5618340 5288967 4977903 4680220 4414461 4184955 3958005
18691 3958005 3754308 3546971 3363373 3230802 3077736 2923231 2790323 2685775 2571314
18682 2571314 2433412 2314280 2211239 2120711 2047137 1960120 1899379 1840222 1737233 1641233
18672 1641233 1580109 1547540 1487942 1418002 1370700 1343295 1302315 1246280 1208085 1158930 1098127
18661 1098127 1071096 1048444 1030576 984408 946013 942159 938300 916520 908105 859107 781983 746858
18649G46858M866l4060m9441k114J3798J8348j0898l6694j1306j2417l2898j6295
18637E77747k4436l0282R526L0918J1598K4457L4902l481k5621p617j2865k9154
18625E55692l3202l2278k6554l0898m2031l4259k6983j836J2225L5550K3641J574
18613D00641j0521J9575L8020J9783K4175N35n638l057j4845J1473K4143K8263
18601E32547O531l3919m1547p6348l4727o549k8573j8527r221J386R041K5450
18589C25544Q566O221k896j9024k3318J0230J0227k119j4405O459n997P963J2577
18576C20028j5634j8056K068J442N805M7216Q6105M2271M1344J1041p753q409
18564E07468l0202m7516n2957l6514k2155r392j9666P75P684o867q565m667j9341
$$ plain form
18649 746858 751724 717664 668223 666109 679907 698255 687357 650663 639357 626940 594042 577747
18637 577747 553311 523029 532555 563473 575071 599528 634430 630949 605328 597711 584846 555692
18625 555692 522490 490212 463658 432760 390729 356470 329487 327651 339876 375426 399067 400641
18613 400641 390120 409695 447715 467498 491673 492208 486570 483513 468668 480141 504284 532547
18601 532547 539078 505159 463612 387264 352537 345988 317415 298888 289667 291053 300094 325544
18589 325544 334110 340331 337435 318411 295093 305323 315550 313431 299026 305485 299488 307451 320028
18576 320028 304394 286338 288406 289848 295653 342869 428974 471245 512589 523630 515877 507468
18564 507468 477266 429750 376793 340279 318124 308732 289066 289841 297525 290658 282093 277426 258085
18551B58085J0114J3297L20q001K6015p473l8294m471j670J79Q050J3353J3550
18538B83054k368k4096m747K462k7581k0884q949m498J8512l414j0565R758J2316
18525B19000J6801q502o569N200j7074k3745j8170K2010P403j366l154k0415q230
18512A63189J8468P128k0081J6364J8875J0237m6179m403J2482k204J3334J3481
18500B00691J7938K5369L416j8106k7618m462J4849J4642O864m3949m4467j4228
18488A30939p225K2523K5215K513J3102j2786n0087R70R101P950N799k472K8977
18475A74519L2173J0669k8189j5095O899j4632j1664n741N749K0705M990o358
18463A74025P89k4137r546J1820M521P081j1188Q792J3844J0562m789k2670p485
$$ plain form
18551 258085 268199 281496 281816 273815 299830 292357 254063 249592 247922 248101 256151 269504 283054
18538 283054 280686 256590 251843 254305 226724 205840 196891 192393 210905 207491 196926 206684 219000
18525 219000 235801 227299 220730 225930 208856 185111 166941 188951 196354 194988 191834 171419 163189
18512 163189 181657 188785 168704 185068 203943 214180 168001 163598 176080 173876 187210 200691
18500 200691 218629 243998 247414 229308 201690 197228 212077 226719 233583 189634 145167 130939
18488 130939 123714 146237 171452 173965 187067 174281 124194 125164 134265 142215 148014 145542 174519
18475 174519 206692 217361 189172 174077 180976 166344 154680 148939 154688 175393 180383 174025
18463 174025 174814 150677 141131 152951 157472 164553 153365 162157 176001 186563 181774 159104 151619
18450A51619J1395K2122J9839k0858j4119j0147K391J2383k214l141k037r973
18438A57260K485J6340K9168K9416j2924k0983m740j3658j1894j8105j0015Q519
18426A50869O123J0878r508j8145k989J6879K4184n698J198j9439J0939Q18l7403
18413A28706K7196r559J6167K0231j2922n631J7886J3216j8224P830N833j2224
18401A78505J835r558o035j3196j5059r213P207J134o523l941j7002K9661N782
18388A43597j9031L7028K6561J2224M238k8430l6557j146J4384j0949m775J3618
18376A50762j473m177q31o383K5366J523P192K7598J2161k6590j7180k2108r520
18363A36340M742K2132R844o792q362J1754M2048L1638j363j179k8767K7284K4159
$$ plain form
18450 151619 163014 185136 204975 184117 169998 159851 162242 174625 172411 169270 167233 157260
18438 157260 159745 176085 205253 234669 221745 200762 196022 182364 170470 152365 142350 150869
18426 150869 156992 167870 158362 140217 137228 154107 178291 172593 173791 154352 165291 166109 128706
18413 128706 155902 146343 162510 182741 169819 164188 182074 195290 177066 184896 190729 178505
18401 178505 180340 170782 164747 151551 136492 127279 134486 135620 129097 125156 108154 137815 143597
18388 143597 124566 161594 188155 200379 204617 176187 139630 138484 152868 141919 137144 150762
18376 150762 149289 145112 144281 137898 163264 164787 171979 199577 211738 185148 167968 145860 136340
18363 136340 141082 163214 173058 166266 157904 169658 211706 243344 241981 240802 212035 239319 263478
18350B63478J4577O1016O4920N7596N3110M5922r039p4071q7472o4594m7740n6468
18338B21235r679q152l2557l869L9318L49K5644j436p146J1258L7145L9592M1535
18325C53237N6245R3779O7964o865q3100r6670p8146l0951l1461q375q143o05
18313B26909J2485M396k8505j8378p995k5614j0943m501m521J2190Q513j9968
18301A44068k9062O44K7880M126o045L917o232N628j676Q596O09O339k2898r584
18287A26310M283J4897M627l294L0181J0726j5442l2001o286M578O832K3834j3700
18274A55545k1112j9505k126k060l002k3222j7154o792P86J8688K5916M2710J0012
18261A58684k2617m0999j649J3806k5235m882J5626K1226L193J9355Q255k8546
$$ plain form
18350 263478 278055 339071 403991 461587 514697 560619 551580 477509 390037 325443 277703 221235
18338 221235 211556 203404 170847 166978 206296 206645 232289 230853 223707 234965 272110 311702 353237
18325 353237 409482 503261 571225 564360 481260 384590 306444 275493 244032 235657 227514 226909
18313 226909 239394 243790 215285 196907 188912 163298 152355 147854 143333 155523 164036 144068
18301 144068 115006 115650 143530 147656 141611 145528 139296 144924 143248 151844 152453 158792 135894 126310
18287 126310 130593 145490 150117 146823 177004 187730 172288 140287 134001 138579 145411 169245 155545
18274 155545 134433 114928 112802 110742 107740 84518 67364 60572 61358 80046 105962 148672 158684
18261 158684 136067 95068 93419 107225 81990 77108 92734 113960 117153 136508 144763 116217
18249A16217k4138j8622o452N718J7836J5737J4176J5120o773r819r642l0781
18237G8577O154Q877j0698J6046q21r731J1348J8593j2148O472j1827K421n317
18224I7946O601J0355J019M716k2028r713R926j1018l294k1237K339P441J5374
18211H8427M383J4152N63o787J1779M006r14L887l692K276p905J9750k52k5678
18197A03995m819K7210J6622k0392j4974p290J35p816J7343R272P718j9789k7839
18184G9376n571K1140J2408n395j4145k3069J3712K5650N686k0446K093O235K0766
18171A18440L3087j7503j2825j0885K2765Q104m946L385j8048o717J2946J1830
18159A39633r603J7819o058q504K1241L5192J3484K6650K6450J8533K9144L1749
$$ plain form
18249 116217 92079 73457 67005 72723 90559 106296 120472 135592 128819 119000 109358 78577
18237 78577 84731 93608 82910 98956 98135 88404 99752 118345 106197 112669 100842 103263 97946
18224 97946 104547 114902 115921 120637 98609 88896 98822 87804 84510 63273 65612 73053 88427
18211 88427 92810 106962 107525 100738 112517 116523 115609 119496 115804 118080 110175 129925 129673 103995
18197 103995 99176 126386 143008 122616 107642 100352 100487 92671 110014 119286 127004 107215 79376
18184 79376 73805 94945 107353 101958 87813 64744 78456 104106 109792 89346 91439 97674 118440
18171 118440 151527 134024 121199 110314 133079 141183 136237 139622 121574 114857 127803 139633
18159 139633 130030 147849 141791 133287 154528 189720 203204 229854 256304 274837 303981 335730
18147C35730J7258o340q638j553q12J2565j6235l6718k0131n018j0879m4870o520
18134B07839M7349L731j7019j116N110L718j7959q835N2513N1678M1186J6366
18122C84561k8623k9512j1271j5510l6316j1036l2863j8203o144j3342O187M349
18110A92277j2165Q209q101k2338q581q309j8387Q012J4136j6742k1469K6134
18098A32676J2622l508j8548k5485K49L0445K8729l1244j1665j0382k111o896
18086I4882K623K5843R036q614l908m513r267K4176J9597K0750k377k2953q607
18073A36668k182j766j8479k7827k830p481J4317J5935K3262j1960p803J7605
18061A27459j2584j5866m032R100q378J06K4719j358j659r389j2529j6421K1771
$$ plain form
18147 335730 352988 346648 338010 336457 335645 348210 331975 295257 275126 270108 259229 214359 207839
18134 207839 255188 258919 241900 240784 245894 249612 231653 222818 275331 327009 368195 384561
18122 384561 355938 326426 315155 299645 263329 252293 219430 201227 195083 181741 187928 192277
18110 192277 180112 188321 180220 157882 149301 140992 122605 130617 144753 128011 106542 132676
18098 132676 145298 141790 123242 97757 98006 128451 157180 125936 114271 103889 101778 94882
18086 94882 97505 123348 132384 123770 119862 115349 106082 130258 149855 170605 168228 145275 136668
18073 136668 134486 132720 114241 86414 83584 76103 90420 106355 129617 117657 109854 127459
18061 127459 114875 99009 94977 104077 95699 95805 120524 119166 117507 108118 95589 79168 100939
18048A00939K1757P87k143k9823j6537K0701J7770J5344l6628m859L5021J4067
18036A36396r822n525O746q074j1899J5351j4981q313o45J9968k007n892j9628
18023I1675o509m079p9J8939K2755R020m930m856l026l8807k1026J7262n446R821
18009H0714n879J4120Q568J0707j0149k6207k6994M927K8155J4461O169r305k313
17996H6974n999p951R153j1001k365J1573K1139j4235J933n377j0631o623j4481
17983E2109o183k886K497J2217j5821j8662O688M2108K5627j6380K1031J1459
17971A13804j0071K3315J5455j8161l5554o361R977J8583l4584j3973k482R236
17959F9184J6817O937Q591K0758j1040l9568j5717j3310q726j2578J4227K9506
$$ plain form
18048 100939 122696 123483 121340 91517 74980 95681 113451 128795 92167 87308 122329 136396
18036 136396 126574 121049 127795 119721 107822 123173 108192 99879 99234 119202 117195 111303 91675
18023 91675 85166 81087 81008 99947 122702 131722 126792 121936 118910 80103 59077 76339 70893 80714
18009 80714 74835 88955 97523 108230 98081 71874 44880 49807 77962 92423 98592 89287 86974
17996 86974 80975 73024 82177 71176 68811 80384 101523 87288 89221 83844 73213 66590 52109
17983 52109 45926 43040 45537 57754 41933 23271 29959 72067 97694 81314 102345 113804
17971 113804 103733 127048 142503 124342 88788 82427 92404 110987 76403 62430 59948 69184
17959 69184 86001 92938 101529 122287 111247 71679 55962 42652 33926 21348 35575 65081
17947F5081j031K229K3046j4013k2000O130O293M456J9251J684k0028j1607r257
17934E0234J5647M5461N044J9142J0980q612l1859j3583N222J6129n466k281P477
17921A13535l321l948N22m897q023k4073q652K839j9876j3400M400N381Q828L9631
17907H8946J4255j5235o437J1556K3386n477q797j9874Q38r650l9274m409M635
17894C4463j2439j1275O181K8411K090k405K1860j4917r016J0698Q698L3887q231
17881H8005j8738J8713J2574j5658j3007n992k5283k7379L0971L6608p748R191
17869H2257O92L459j0736k1456l3664J1980K7997K8652N514K781n273j6513P121
17856H2811J786N420k4353J2563l5321k2129j3601J9229L5147j8961j7320J9558
$$ plain form
17947 65081 64050 66279 89325 75312 53312 59442 65735 70191 89442 91126 71098 59491 50234
17934 50234 65881 111342 116386 135528 146508 137896 106037 92454 97676 113805 108339 106058 113535
17921 113535 110214 106266 106788 101891 93868 69795 61143 63982 44106 30706 35106 40487 49315 88946
17907 88946 103201 87966 81529 93085 116471 110994 102197 82323 83161 73511 34237 29828 34463
17894 34463 22024 10749 16930 45341 47431 45026 66886 51969 42953 53651 62349 96236 88005
17881 88005 69267 87980 100554 84896 71889 65897 40614 13235 44206 80814 73066 82257
17869 82257 82949 86408 75672 54216 20552 32532 60529 89181 94695 97476 92203 75690 82811
17856 82811 84597 90017 65664 78227 42906 20777 7176 26405 61552 42591 25271 44829
17844D4829J3458j2168j5699j1299n96J4474J4909O513J115N653n792Q834k0837
17831D3394J476K0857p325q341J6762N478J5885J16k6957n997k137J3900m375
17818F2736n843j3027k2293J7525q827m754J9095J0279J0179O420J6624j5224
17806G2890j2984R083Q400m609R56l3937j4698M880J4284m074l261J239q359j8607
17792A1203Q025J8131M605K4562K666l0093P507j1764k9648J2771L8644K1529
17780G8138n755q508m004j072m041J5797m549j3093P009K0014j4601k8103j0319
17767B6913j0596p168R106J3085K3122n188N84L5271O028p303k6864j6237n68
17754D0185K540Q541J3439J0011o211o073K3199r221l2219j2186M509K2438J9764
$$ plain form
17844 44829 58287 46119 30420 19121 18525 32999 47908 54421 55536 61189 55397 64231 43394
17831 43394 44870 65727 58402 50061 66823 72301 88186 88302 61345 55348 53211 67111 62736
17818 62736 56893 43866 21573 39098 30271 25517 44612 54891 65070 71490 88114 72890
17806 72890 59906 68989 77389 72780 73736 39799 25101 29981 44265 40191 36930 38169 29810 11203
17792 11203 19228 37359 41964 66526 69192 39099 46606 34842 5194 17965 56609 78138
17780 78138 72383 63875 59871 58799 54758 70555 66006 52913 59922 79936 65335 37232 26913
17767 26913 16317 9149 18255 31340 54462 49274 49858 85129 91157 83854 56990 40753 40185
17754 40185 42725 51266 64705 74716 68505 62432 85631 76410 44191 32005 36514 58952 78716
17741G8716l733k5298j461Q903J3381l128n821k847o215J6753O954j4563l533
17728E8108k627J4441R517k287j5632k589J0617M286o908j7039m538J3515J5432
17715G4296R065j8019j0876J2246K0100j6059m6276q889L1153N13J2838m108q270
17702D7714M643R324J1842j4202k6856M685K2029P96R604o260k6526l0146k472
17689D175o274j2621j767K4689Q319L439J3462J8836m760q843j5792j4364K7988
17676C6487n388k156L09p616J3466L5259l099k9325N710k82Q955j5189J1943P967
17662E7041O052k834j1086j9839j301J803j532J7799L0190J3857N540j4721p38
17649H0231p392l0711m626J3911J7309j9411J6504j6538j539J8056K0044J775
$$ plain form
17741 78716 74983 49685 48224 57127 70508 67380 61559 58712 52497 69250 76204 61641 58108
17728 58108 55481 69922 79439 77152 61520 58931 69548 73834 66926 49887 45349 58864 74296
17715 74296 83361 65342 54466 66712 86812 70753 24477 15588 46741 47254 60092 55984 47714
17702 47714 52357 61681 73523 59321 32465 37150 59179 59975 69579 63319 36793 6647 4175
17689 4175 -2099 -14720 -16487 8202 16521 19960 33422 52258 47498 38655 22863 8499 36487
17676 36487 31099 28943 29252 21636 35102 70361 67262 37937 43647 43365 52320 37131 49074 57041
17662 57041 63093 60259 49173 29334 28033 29836 28304 46103 76293 90150 95690 80969 80231
17649 80231 72839 42128 37502 51413 68722 49311 65815 49277 47738 65794 85838 87613
17637H7613r863k103k2840j7285J6330k7057m711j3227J5900p25O064J1583Q969
17624D8648K4961J372n318q060J612Q35P861k3727k850P593r055r924L844o733
17610C1059j9879J1554L5151J1824o180M494M699j8403j5408J8558K0330q254
17598F9545j128R952R285l3021j3692j806j2874j139j3570k065N242j983L806
17585A6552r303J3181J9332m139n544L1821J5347N18j0529j3940J5098M642k3464
17572D9572M819l371J0511q296k1855J2298k1844J025P516m27N364O726r158Q154
17558D1034m407l0491R941M818J7754L028k619p470J5963j7010k8816Q898K413
17545A3036J3947J1882p528j3806O442J2298K1718K8329j3881l22K5568j8967
$$ plain form
17637 87613 77750 75647 52807 35522 51852 24795 20084 6857 22757 22032 28096 39679 48648
17624 48648 73609 74981 69663 61603 63215 64050 71911 48184 45334 52927 43872 33948 37792 31059
17610 31059 11180 22734 57885 69709 63529 68023 72722 54319 38911 57469 77799 69545
17598 69545 68417 78369 87654 54633 40941 39135 26261 25122 11552 9487 14729 12746 16552
17585 16552 7249 20430 39762 35623 30079 61900 77247 77765 67236 53296 68394 73036 49572
17572 49572 54391 51020 61531 53235 31380 43678 21834 22859 30375 29948 35312 42038 32880 41034
17558 41034 36627 6136 16077 20895 38649 41677 39058 31588 47551 30541 1725 10623 13036
17545 13036 26983 38865 31337 17531 23973 36271 57989 86318 72437 72115 97683 78716
17533G8716k4847J1964K4362j6013k7861k093k3146n769K6212J5542j7107m844
17521C5116o589J5840j3239K6017J1881l2115q373J4579j2602r881K292P607j6201
17508A4332p687r976k6748K8725Q292r024r368Q899K3252L391M7605M80n1706
17495B0467k0997J4540J4627j0482r5J7150k575j4372l97m058K404K741R706k2893
17481E766K2841K966K118l490k1980J4914n725K521K2933k415M041n524n945r195
17467B3826m731J2838J4193N132o072j2189k0220p28K1532n742l7515j9213K6873
17454b016L0815Q942j1768p774P293r162J5125n065l1591k3519L9569K0370J0446
17441D1665k3650l56J6628Q582j0126J646J9415J2394q04k1400j2750J3601K631
$$ plain form
17533 78716 53869 65833 90195 74182 46321 44228 21082 15313 41525 57067 39960 35116
17521 35116 28527 44367 31128 57145 69026 36911 28538 43117 30515 20634 22926 30533 14332
17508 14332 6645 -3331 -30079 -1354 6938 -2086 -11454 -2555 20697 24088 71693 72173 20467
17495 20467 -530 14010 28637 18155 18060 35210 32635 18263 17866 13808 16212 18953 28659 5766
17481 5766 28607 31573 33691 30201 8221 23135 17410 19931 42864 40449 44490 38966 33021 23826
17467 23826 19095 31933 46126 51258 45186 32997 12777 12049 33581 27839 -9676 -28889 -2016
17454 -2016 28799 37741 25973 18199 25492 16330 31455 26390 -5201 -28720 10849 31219 41665
17441 41665 18015 17659 34287 42869 32743 34389 53804 66198 65394 43994 31244 44845 47476
17428D7476o82J5316J3933j2321j500n42j5716J013J562q541J6639P962j522j9920
17414D3157j2289J5954K1979J1470q99k8532j0422k0237j2376J315l32P30J9715
17401B9233K1336O708l219P037l630M394j4906k8009j7445O068j4730j214j954
17388a0331J9429K1684j7113J7888N1229J0218k4042l4119k7091J2995K0200j3793
17376B7154j0002J0815J6692J1345o73J1756j0861k6303J2932M996j6810j6462
17364A4579O490N991l670K907J716p735j303M1352J050j7692m917j6060j5937
17351F771L7971L0379J54j1015j3192L054k0031k5654p298N049o79J7076J8165
17338D0750m950m187p301P605M877j9529j765N4547J8818r150j2378j7686l1328
$$ plain form
17428 47476 46794 62110 76043 63722 62222 61680 45964 46977 48539 39998 56637 64599 63077 43157
17414 43157 30868 46822 68801 80271 79372 50840 40418 20181 7805 9120 8788 9518 29233
17401 29233 50569 57277 54058 61095 57465 61859 46953 18944 1499 7567 -7163 -8377 -10331
17388 -10331 9098 30782 13669 31557 82786 93004 68962 34843 7752 20747 40947 27154
17376 27154 17152 27967 44659 56004 55331 67087 56226 29923 42855 47851 31041 14579
17364 14579 21069 27060 23390 26297 28013 20278 18975 60327 61377 43685 38768 22708 6771
17351 6771 44742 75121 75275 64260 51068 54122 34091 8437 1139 6188 5509 22585 40750
17338 40750 35800 31613 24312 31917 36794 17265 15500 70047 88865 79715 67337 49651 18323
17325A8323O054J2073j2488O26j8713j805K4185Q402M88j2543J4161k930k237
17312C3596J3725o039l412Q587J8151k0192k8093p360N207J7234j5219k2816m292
17299a0923o492K4956K4620n816k0722n48K738K2559m481R303O659k361J6764
17286E6256J1263r962j2806N643Q669p098J4448K305k9614j7883m829J0950M153
17273C1495M83L065j7768L177J5423j2316k1369j576J2965p673o044J6966K0105
17260C6933j1623j7854J6074L1995K2794j810k2462N281k0601j471k3486j8290
17248d520L373k271M71K9871P350l0776k054P241j7889n524J7135L5920K7375
17235F5702l3105Q947J1124k027J5090j0683j417J8860o235J5091K1899m657o641
$$ plain form
17325 18323 24377 36450 23962 24588 5875 4070 28255 36657 37145 24602 38763 35833 33596
17312 33596 47321 41282 37870 46457 64608 44416 16323 8963 14170 31404 16185 -6631 -10923
17299 -10923 -17415 7541 32161 26345 5623 5075 7813 30372 25891 35194 41853 39492 56256
17286 56256 67519 57557 44751 50394 59063 51965 66413 68718 39104 21221 16392 27342 31495
17273 31495 31978 35043 17275 20452 35875 23559 2190 614 13579 5906 -138 16828 36933
17260 36933 25310 7456 23530 55525 78319 76509 54047 59328 38727 37256 13770 -4520
17248 -4520 -1147 -3418 -2947 26924 34274 3498 1444 8685 -9204 -14728 2407 38327 65702
17235 65702 32597 41544 52668 50641 65731 55048 53631 72491 66256 81347 103246 98589 91948
17222I1948L527k1571j5368j2949J170L796k5102l7329m427P939o943J4922J1967
17209A1580m484r277j7468R468j4993K900l272j0586J3248K2300K8629L7808p892
17196E7961l0891J0392L0327L610k121l4091r576j651J4965o240K082j0063k9807
17183e103k365K1427j5453o99K5954J4293j0062l1482j8645m163o183J0375K2606
17170E00J9379j1120j8933L0716J3023o597j4074j4378K4587R999q389K0240o611
17157C8342j3064j750K496l0671r462O715J357Q101K1516L2504J2978k196j7518
17144D9348K2854K2014o639j7954M274J1106K7111M9865N7652L3340j3840o8862
17132A70269o1669l1951P854r015l2914k7146R189R321p492l0420j4649p72L0509
$$ plain form
17222 91948 95475 73904 58536 45587 46757 50553 25451 -11878 -16305 -8366 -15309 -387 11580
17209 11580 7096 -2181 -19649 -10181 -25174 -22274 -25546 -36132 -22884 -584 28045 65853 57961
17196 57961 27070 37462 67789 71399 69278 35187 25611 23960 38925 32685 34767 24704 -5103
17183 -5103 -7468 13959 -1494 -2193 23761 38054 27992 -3490 -22135 -26298 -32481 -22106 500
17170 500 19879 8759 -10174 20542 33565 26968 12894 -1484 23103 33102 24713 44953 38342
17157 38342 25278 23528 26024 -4647 -14109 -7394 -6037 2064 23580 56084 69062 66866 49348
17144 49348 72202 94216 87577 69623 73897 85003 112114 161979 219631 252971 239131 170269
17132 170269 108600 76649 84503 75488 42574 15428 24617 33938 26446 -3974 -18623 -19395 11114
17119A1114L5310J9194Q307q388k234j0919j9388k0668j6269K763J7436M5631
17107F1889K0329R802L1121L6522Q6554M6513J9942j5340p1515m2485m8194m2613
17095I2525l6920J1132m93j5993n574J2839J3684K3411k0944l093M005o066k3000
17082D5513l5695k3153j113K4795N5989M100j2260j5777j0791r789P165q44j2026
17069A6114j9111p533K4077r17k0776K627p72M383q227o432N394K0140N281j2841
17055A407m620K4083J6377N990j8674n931J2210O919N83n1169j6315K3248j5395
17042b1287J562j8176J0555L5163J5134j2666J2652J9822q339Q004j975j3046
17030B7403p124k054Q981J0606k1637j2917q581K5306N532q177K4109L11j7868
$$ plain form
17119 11114 46424 65618 73925 65537 63303 52384 32996 12328 -3941 -1178 16258 61889
17107 61889 82218 92020 123141 159663 246217 292730 312672 297332 225817 183332 135138 92525
17095 92525 55605 66737 66244 50251 44677 57516 71200 94611 73667 70574 74579 68513 45513
17082 45513 9818 -13335 -14448 10347 66336 70436 58176 42399 31608 21819 28984 28140 16114
17069 16114 -2997 -10530 13547 12630 -8146 -5519 -6291 -1908 -10135 -16567 -11173 8967 14248 1407
17055 1407 -3213 20870 37247 43237 24563 18632 30842 37761 38344 -12825 -29140 -5892 -21287
17042 -21287 -19725 -37901 -27346 7817 22951 10285 22937 42759 34420 42424 40449 27403
17030 27403 20279 18225 27206 37812 16175 3258 -5323 19983 25515 17338 41447 41758 23890
17017B3890j9958J9594J9506r383J8494j8155k3885O839J4213O823j208n905Q803
17004C9668q810L9k6210k9339j1674L2330L2881K9686K5317r59l9611l5938J1821
16991A9201J5329J1829L864l324J086J007m768K080R539K0028k1182P0m068N703
16977E6394k869k2453n431j3309j7510J3344n409p471K2570J3596J0304l703j3926
16964B4127j45K2386k5121r698j2895Q92k326j0826k1948J9995J4382k711m01
16951d289J8289L2157O607J6735L228l0905k4885j1102j0653m707Q548J5872R389
16938B4284K363J1125j4168M378m933k3741n131N712j8451J1098L2367J8267r330
16925C3840j154P663p823k1732j9219m584M602K6689Q050J263j2867j9067O867
$$ plain form
17017 23890 3932 23526 43032 33649 52143 33988 10103 16942 31155 37978 36770 30865 39668
17004 39668 30858 30897 4687 -24652 -36326 -3996 28885 58571 83888 82929 43318 7380 19201
16991 19201 34530 46359 50223 46899 47985 48992 44224 46304 55843 75871 54689 54759 50691 56394
16977 56394 53525 31072 25641 12332 -5178 8166 2757 -4714 17856 31452 41756 38053 24127
16964 24127 23982 46368 21247 11549 -1346 -454 -2780 -13606 -35554 -15559 -1177 -3888 -4289
16951 -4289 14000 46157 52764 69499 72727 41822 16937 5835 -4818 -9525 -977 14895 24284
16938 24284 26647 37772 23604 27982 23049 -692 -5823 -111 -18562 -7464 24903 43170 33840
16925 33840 32686 40349 32526 10794 -8425 -13009 -8407 18282 26332 27595 14728 -4339 2528
16912B528p009j0872J2553K5728j9943j8310k35j069m583J2250N473J1620J3867
16899B1998j8888j5660n387Q98K8339K9624J7462k3509k4638Q408K2984l156p495
16886C0980j0433p136p07K351J4623j570J074K4555m395j7023k0819J8723j67
16873C0056m6328j9725k3652J5321M912K7012K114J089l420j5120R15J8109R668
16860I51K356n74k4410j4606l285L8149J9307L225L144j6175j4001j0533J6700
16847B48K2647j5302K9534L3804J0417K478q499k1029p035J770j3386k2762j2625
16834B60J1915M371M897j091M33J2704J8386p208j6871r196k0777Q98J9030j3077
16820D674j6941N421o915J2686j5812N232L9592J783k5623M562N743j6012j1997
$$ plain form
16912 2528 -4481 -15353 -2800 22928 2985 -15325 -15560 -16629 -21212 -8962 -3489 8131 21998
16899 21998 3110 -12550 -17937 -17039 11300 40924 58386 34877 10239 18647 41631 38475 30980
16886 30980 20547 13411 12704 15055 29678 28108 29182 53737 49342 32319 11500 30223 30056
16873 30056 -16272 -35997 -59649 -44328 -39416 -12404 -10290 -9201 -12621 -27741 -26826 -8717 951
16860 951 3307 2733 -21677 -36283 -39568 -1419 17888 21113 24257 8082 -5919 -16452 248
16847 248 22895 7593 37127 70931 81348 83826 75327 54298 47263 49033 35647 12885 260
16834 260 12175 16546 21443 20352 20785 33489 51875 44667 27796 18600 -2177 -1279 17751 4674
16820 4674 -12267 -6846 -13761 -1075 -16887 -11655 27937 29720 4097 8659 14402 -1610 -13607
16807a3607J1700l445L0984K6333k6919Q527J2220M587l205l661k4467j3218J5614
16794B1443J3826R178j5548k2895N791P825j0894O630K1206m549j380j8133k296
16781A0204R103L63q182j0197m748Q545L739J1747o44K6689J3959l7772j2964
16768I842J061l12q19N550K5073Q692k0192j1442k4761Q411O877J8314l687j9302
16754C305p703Q147L525j7498N100O139p479q785J8600K5561J7480N548k3049
16741B8891k1729k162J5337O686J5933J1106j007k1371k166J7818O289q558J2364
16728E7431j7120k7435k2227o429J3159k0606n599k749K3116L1016m008k7246
16716h697p176J2528R169J9536j1791Q43n996m114j3770k051J2896J9361L892
$$ plain form
16807 -13607 -1907 -5352 25632 51965 25046 33573 45793 50380 47175 43514 19047 5829 21443
16794 21443 35269 44447 28899 6004 11795 19620 8726 15356 36562 32013 30633 12500 10204
16781 10204 19307 19670 11488 1291 -3457 5088 8827 20574 19930 46619 60578 22806 9842
16768 9842 10903 10591 9772 15322 40395 49087 28895 17453 -7308 1103 7980 26294 22607 3305
16754 3305 -4398 3749 7274 -10224 -5124 1015 -6464 -15249 3351 28912 46392 51940 28891
16741 28891 7162 5000 20337 27023 42956 54062 53055 31684 29518 47336 53625 45067 57431
16728 57431 40311 12876 -9351 -15780 -2621 -23227 -28826 -31575 -8459 22557 18549 -8697
16716 -8697 -15873 -3345 5824 25360 13569 14412 8416 4302 -9468 -11519 1377 20738 24630
16703B4630O226k0963qK4K112J4123j4761k0584N707K7617J2831M489R08J7819
16689F0170r341k7051l845j7083m237J3249j4550o920J3075L820M19k3325J9029
16676C410j866m242J058j8n983j489r349J674J1814k815p81J7477k219j2542M285
16661a586r212m111K2776K8548o903j5271k1203J0731j7890k0447J9636k661j3630
16648c1223K7913J337J8526P513p383j4441J1503J8154j7261n389p753J2176J3383
16635B7055p855q225o683j2716j2362K419K1738k328q647J5055n872K973J2313
16622A6865o197j3401J6442J1526j6073k0908Q550N60M193p459J066l0802J0391
16609b5247K9415o944J6297K9087j051k0540k9327k3432R466J7679j0815L997
$$ plain form
16703 24630 30856 9893 9885 9909 12021 26144 11383 -9201 -3494 24123 36954 41443 42351 60170
16689 60170 50829 23778 19933 2850 -1387 11862 -2688 -9608 3467 7287 7706 -15619 3410
16676 3410 1544 -2698 -1640 -1658 -7641 -9130 -18479 -16805 -4991 -7806 -8587 8890 6671 -5871 -1586
16661 -1586 -10798 -14909 7867 36415 29512 14241 -6962 3769 -14121 -34568 -14932 -17593 -31223
16648 -31223 -3310 -1973 16553 24066 16683 2242 13745 31899 14638 9249 1496 13672 27055
16635 27055 19200 10975 4292 -8424 -20786 -18367 3371 1043 -7604 7451 1579 4552 16865
16622 16865 10668 -2733 13709 25235 9162 -11746 -3196 -2636 1557 -5902 -4836 -35638 -25247
16609 -25247 4168 -2776 13521 42608 41557 21017 -8310 -31742 -22276 -4597 -15412 -11415
16597a1415M7898R665k2330q333k5916j8003J9989J5190n601JK2122J7064q198
16584C2133Q449j842O76j6827j7131q124J4275O742l0941j0650Q265Q883k0789
16571b6881J9313L3080j1068j3672l663P131o544M19L876N22n423j0162J4461
16558A389R830Q333o782k9623J3661m748L531K6507m839n721j7689k4091K158
16545b8084L862J922J4672m925j1080L552L745k0008l218Q219m08L106P280r509
16531c0874j4957k2610O772J2260K2214K7159M306k4879L68J7005r131J0993K4327
16518B2953J74j1753J0756k6394o172j846P010M028R255J2181J0477K238j4304
16505A8603p954J6111J0512K5812l3865k8260J8583O183j2481r481m479Q283r653
$$ plain form
16597 -11415 36483 46148 23818 15485 -10431 -28434 -8445 6745 1144 1145 23267 40331 32133
16584 32133 40582 38740 39416 22589 5458 -2666 11609 18351 -12590 -23240 -14975 -6092 -26881
16571 -26881 -7568 25512 14444 772 -2891 4240 -2304 -1885 1991 2513 -2910 -13072 1389
16558 1389 11219 19552 12770 -16853 -3192 -7940 -4409 22098 17259 11538 -6151 -30242 -28084
16545 -28084 -24222 -22300 -7628 -12553 -23633 -20081 -16336 -36344 -39562 -31343 -31751 -28645 -21365 -30874
16531 -30874 -45831 -68441 -61669 -49409 -27195 -36 4270 -20609 -20241 -3236 -12367 -1374 22953
16518 22953 23127 11374 22130 -4264 -10436 -12282 -5272 -1244 8011 20192 30669 32907 18603
16505 18603 10649 26760 37272 63084 29219 959 19542 25725 13244 3763 -716 7567 -2086
16492b086j8496j795J2395J1237r41j6907L282J5724l854n748j3969J3372N609
16479b177P409j6573j1628J7767J3934L4889j5419j7380j0614j3287J2495R771
16467I187J6775J0475J1223J0651m264j6066m875j7838n734r342j9780k5407N262
16454c9733J132J9031J5372M737j1368j3175L991O569J7187K3587j4297l7189
16442b4156q482J9607k683j1820J9410J603j2695K1971Q51K289J0705q165j9523
16429a1088L201l564j7010m159L203J0904K4753J7777n534O637J0229J6270J0344
16416F1963j9355r074J369o717q568k2485n550q105p49J7657Q941o284p465k6748
16402c1170K4768M6786J6136l9960m2823k935P671q01K0715M0151k1968p91P202
$$ plain form
16492 -2086 -20582 -22377 -9982 1255 314 -16593 -13311 2413 -1441 -7189 -21158 -7786 -2177
16479 -2177 5232 -11341 -22969 -5202 8732 43621 28202 10822 208 -13079 -584 9187
16467 9187 25962 36437 47660 58311 54047 37981 33106 15268 9534 192 -19588 -44995 -39733
16454 -39733 -38601 -19570 -4198 539 -10829 -24004 -20013 -13444 3743 27330 13033 -24156
16442 -24156 -32638 -13031 -15714 -27534 -8124 -6521 -19216 2755 3606 5895 16600 8435 -11088
16429 -11088 -7887 -11451 -28461 -32620 -29417 -18513 6240 24017 18483 25120 35349 51619 61963
16416 61963 42608 33534 34903 28186 19618 -2867 -8417 -16522 -17271 386 9327 3043 -4422 -31170
16402 -31170 -6402 40384 56520 16560 -26263 -29198 -21527 -22328 -1613 38538 16570 15779 22981
16389B2981J860K525j8359k4876J8365J0983n519q491l0303J0519L885o274j1086
16376c3790K6123L9012M572q738L214k2268L37K0026L548j9111o853M095m438
16363E729j6731K033K0857Q759j247k7937k7594J6508P031K1151J9255K412J6572
16350D6798j6675j1202L316k5086J0847K0388m632j2871K7257l037k2589k7857
16338a5343l0357j1291l844J8132L202L143R351L3757J12K3644k2746p131K9188
16325B9817l2591j5475L296J8326J1026n26j6591j894Q973K6974J0636j8700k1725
16312A546J378r239j0883J7720M299j9724K409K523j952k635J5674K0661m273
16299A7504o451K6924J546j4354k9092j0332J7793j5019n491K3213J3912k9971
$$ plain form
16389 22981 24841 27366 9007 -15869 2496 13479 7960 -531 -30834 -20315 -16430 -22704 -33790
16376 -33790 -7667 31345 35917 27179 30393 8125 8462 28488 32036 12925 6072 10167 5729
16363 5729 -11002 -8969 11888 20647 19400 -8537 -36131 -19623 -12592 8559 27814 30226 46798
16350 46798 30123 18921 22237 -2849 7998 28386 23754 10883 38140 35103 12514 -15343
16338 -15343 -45700 -56991 -60835 -42703 -39501 -36358 -27007 6750 6862 30506 7760 629 29817
16325 29817 -2774 -18249 -14953 3373 14399 13873 -2718 -4612 4361 31335 41971 23271 1546
16312 1546 2924 -6315 -17198 522 4821 -14903 -12494 -9971 -11923 -14558 1116 21777 17504
16299 17504 11053 37977 39523 25169 -3923 -14255 3538 -11481 -16972 6241 20153 -9818
16287i818r587Q982O953n205J8376K180j5540P811J4367l171J3347j0062k7336
16274h703j3275j2029J4873R434K3408j144p09j2731J7224J2255j5873j7015j3748
16261a8033q403N877M0776k2581j7128J7142k1413j8288L551j6901L2001P839
16249a5561R701k402k1281M056k2396J6408J1998J0530J3175J0101m150j4582
16237d403j4598k1351K256K448r423M4530J3557N617k5595R343o982M072L671
16224C142K2151n389o452j0611J8Q513l3489j9191J3726K7888K9284N001j3507
16211B1084o756r76M987m37j4636j3634l489j3859r559j927o120r20K6495N393
16197a4354J0060L630r742j100n651k631J3557L11L47m471Q999J3951m785j2421
$$ plain form
16287 -9818 -19405 -10423 -3470 -8675 9701 11881 -3659 4152 18519 15348 28695 18633 -8703
16274 -8703 -21978 -34007 -19134 -9700 13708 12564 11855 -876 16348 28603 12730 -4285 -18033
16261 -18033 -26436 -20559 20217 -2364 -19492 -2350 -23763 -42051 -38500 -55401 -23400 -15561
16249 -15561 -5860 -8262 -29543 -25487 -47883 -31475 -19477 -8947 4228 14329 10179 -4403
16237 -4403 -19001 -40352 -38096 -35648 -45071 -541 13016 18633 -6962 2381 -4601 -529 3142
16224 3142 25293 19904 13452 2841 2859 11372 -22117 -41308 -27582 306 29590 34591 21084
16211 21084 14328 13352 18339 17902 3266 -10368 -13857 -27716 -37275 -39202 -45322 -46242 -19747 -14354
16197 -14354 -4294 -664 -10406 -11506 -17157 -19788 -6231 -5920 -5573 -10044 -1045 12906 8121 -4300
16183d300N091R783l378k1572o017K440q627o208K7342O074j7692k3284O038R685
16169b4625l542Q71J3340J5286K3336o485k3459j74J7627n732Q507M206j8729
16156D27j8088K225N50j3191J4215K9433k354M778R810J0201k4712k8446n964
16143b1116J926K7940J4708j170r814q833j88m295o515J0533r925l2060M939J1941
16129b1929j0240k3242K7884J4753r689j6034j6813J4102J9233j9636j9417p017
16117f8045k681K1102j4923P046K9593J1000j8424J510K5789K867k583o310j5444
16104b9503j92J2128K8620J0744q840n791J5793J2689r484p843k7471j1745n664
16091b6559o138L1501r304K2932J6141p48j577K436k2580j1932n335q60J4837
$$ plain form
16183 -4300 791 10574 7196 -14376 -20393 -17953 -26580 -32788 -5446 628 -17064 -40348 -34310 -24625
16169 -24625 -28167 -27296 -13956 1330 24666 18181 -5278 -5452 12175 6443 14950 19156 427
16156 427 -17661 -15436 -14886 -28077 -13862 15571 13217 17995 27805 38006 13294 -15152 -21116
16143 -21116 -19190 8750 23458 22288 12474 3641 3453 -842 -7357 3176 -6749 -38809 -33870 -21929
16129 -21929 -32169 -55411 -27527 -12774 -22463 -38497 -55310 -41208 -21975 -41611 -61028 -68045
16117 -68045 -70726 -49624 -64547 -57501 -27908 -16908 -35332 -33822 -8033 -5166 -7749 -14059 -29503
16104 -29503 -29695 -17567 11053 21797 12957 7166 22959 35648 26164 18321 -9150 -20895 -26559
16091 -26559 -32697 -1196 -10500 12432 28573 27825 26248 28684 6104 -5828 -11163 -12023 2814
16078B814r230R238R424m597k3721o070P339J7502q37M606j5462R84J4855k1923
16064a5078l8950J5222J1108J8574J4299k036j5427p526n640R282M223j8474j8243
16051d8666j4025K3401J0005L346j5456J635J6733l412J210K0706K4343j1854
16039G966k6857q071k0936M995M1575J3415j6881j6391N371j0363j5918q331R121
16026d1305J1510K7179J0553K614q299j7351K2025N803P85J2384m6j7448n560
16013B844k079n616j3678K2164M6743O630j2886l8357j8624J9123j9026j0538
16001b3300P389K609k8460J2918K1517K1556m70n463l540P196k0274j9575O966
15988b0931K5831j0172q900Q959m152q282M509n391J3386K4265K5146J4381j8703
$$ plain form
16078 2814 -6416 2822 12246 7649 -16072 -22142 -14803 2699 1862 6468 -8994 -8010 6845 -15078
16064 -15078 -54028 -38806 -27698 -9124 5175 3139 -12288 -19814 -25454 -16172 -11949 -30423 -48666
16051 -48666 -62691 -39290 -29285 -25939 -41395 -39760 -23027 -26439 -25229 -4523 19820 7966
16039 7966 -18891 -26962 -47898 -42903 -1328 12087 -4794 -21185 -15814 -26177 -42095 -50426 -41305
16026 -41305 -29795 -2616 7937 10551 2252 -15099 6926 12729 13514 25898 25852 8404 2844
16013 2844 765 -4851 -18529 3635 50378 57008 44122 5765 -12859 6264 -12762 -23300
16001 -23300 -15911 -13302 -41762 -28844 -7327 14229 13759 8296 4756 11952 -8322 -27897 -20931
15988 -20931 4900 -5272 -14172 -5213 -9365 -17647 -13138 -18529 -5143 19122 44268 58649 39946
15975C9946k6717R074n295o455l351q506O863J2943j4652L4589K972j872j4521
15962B5018Q612j4112j1798k5781O729J2264j3067K984j7951j7784R781K1769
15950a3336n420j5836J0189p011m882J3904K5709J1787M083N502L430r619N397
15937B3897o188j5641q490q52L6440J3615l0275k6209L284K856p113o108l3958
15924e4742k805J3125J2579J6637k86k1998n9K0163J6278q440k6495k0092K0604
15911c5531P542j535j0820l164M461J0063R66J8375k639Q709K0388J8208k9652
15898E371l3610L3260J3865j2876o936j467m454R75q43N842J5975k454j4386j3457
15884a5195L058M725p090j555J4639r749J462O759m344j2221R582J0647J0046
$$ plain form
15975 39946 13229 22303 17008 10553 7202 -1304 5559 18502 3850 38439 41411 39539 25018
15962 25018 33630 19518 7720 -18061 -11332 932 -12135 -9151 -27102 -44886 -35105 -13336
15950 -13336 -18756 -34592 -24403 -31414 -36296 -22392 3317 15104 19187 24689 28119 18500 23897
15937 23897 17709 2068 -6422 -7274 29166 42781 12506 -13703 -10419 -7563 -14676 -20784 -54742
15924 -54742 -57547 -44422 -31843 -15206 -15492 -37490 -37549 -17386 -1108 -9548 -36043 -56135 -35531
15911 -35531 -27989 -29524 -40344 -43508 -39047 -28984 -28018 -9643 -12282 -3573 16815 35023 5371
15898 5371 -28239 5021 18886 6010 -926 -2393 -6847 -5872 -6715 -873 15102 12648 -1738 -15195
15884 -15195 -12137 -7412 -14502 -16057 -1418 -11167 -9705 -2946 -7290 -19511 -9929 718 10764
15871A0764J4575j5855k0174K1459l674j4710J4476r277r589R495O413J7260k5575
15858d412j4283q997K1121L2716k8974j463N900k94J2839m176N313M198j139Q301
15844B6650j5176l8235j0542R027n538O80K2915M36O814j188P760n214J9282n894
15830A1777j7359j3926O38q138J0277O062l31j5251m766K196J8138J1353M766
15817E436J2195k423k522k0766k3988Q189J2575j0433l458J3406O94L79j8264
15804b8980J8149k339R206J1993L800J3979j7221J2474Q95o95k356l042J5981
15791C1844o133j1266L126K0503J5472j6126l8443j2004L4270L166l0688n71J6282
15778I432M899O959J7335L9734m167M395J7472J1449O4977L2171K2211K0745J578
$$ plain form
15871 10764 25339 9484 -10690 10769 7095 -7615 6861 -2416 -12005 -2510 3903 21163 -4412
15858 -4412 -18695 -27692 -6571 26145 -2829 -4292 1608 1314 14153 9977 15290 19488 18349 26650
15844 26650 11474 -26761 -37303 -28276 -33814 -33134 -10219 -9783 -2969 -4157 3603 -1611 17671 11777
15830 11777 -5582 -19508 -18870 -27008 -16731 -10669 -11000 -26251 -31017 -28821 -10683 670 5436
15817 5436 17631 15208 12686 -8080 -32068 -23879 -11304 -21737 -25195 -11789 -11095 -10716 -28980
15804 -28980 -10831 -13170 -3964 8029 11829 25808 8587 21061 21956 21261 18905 15863 31844
15791 31844 25711 14445 17571 38074 53546 37420 -1023 -13027 21243 24409 -6279 -6850 9432
15778 9432 14331 21290 38625 78359 74192 78587 96059 107508 172485 204656 226867 247612 249190
15765B49190K2610N161j6833k4008l5599j8105K955J221l287L063R256K2044L064
15752B20732M4431K772Q220l309o840n0450l5360l4410j6116r088L082k0746k3313
15739G9605j8518j9428M837R080j039n78j0172j1888J4972J1213j0830N962J788
15726E5004j8757k0190k907l063L282J7072q349k4802J02N197m281J3345k2794
15713a1141m162k073J4515O999J233m51l384J0977j9683j3141k147L3397Q249
15700A9188k362n289p504j8931k739j0828M097R062l92P330K0920p635k748N388
15686G557K7634J3006j9209r890J1920M339j2369P161j5560L939K3751l5163k5083
15673a7967r131P227J0245j5651p393k292K5991K7036n549j7993m930k1665P549
$$ plain form
15765 249190 271800 276961 260128 236120 200521 182416 185371 186592 183305 186368 195624 217668 220732
15752 220732 265163 267935 276155 272846 266006 215556 180196 145786 129670 120582 123664 102918 79605
15739 79605 61087 41659 46496 55576 54537 53959 43787 31899 46871 58084 47254 53216 55004
15726 55004 36247 16057 13150 10087 13369 30441 22092 -2710 -2608 2589 -1692 11653 -11141
15713 -11141 -15303 -17376 -2861 4138 5371 4920 1536 12513 -7170 -20311 -22458 10939 19188
15700 19188 16826 11537 4033 -14898 -17637 -28465 -24368 -15306 -15698 -8368 12552 4917 2169 7557
15686 7557 35191 48197 28988 19098 31018 35357 22988 30149 14589 18528 42279 7116 -17967
15673 -17967 -27098 -19871 -9626 -25277 -32670 -34962 -8971 18065 12516 -5477 -10407 -32072 -24523
15660b4523k425o090O045J7467J6869L11k8122J2041l888p896O545O181o401J2503
15646a383L237j0306Q865M471q476k6792r275J3932K5285j7048n246J7161P575
15633B000p860o317J9016J6658j5400k7671J8225j637j7711j1381O802J6287M893
15620d096k558m559j2101j0830k349J4113J5325N168j3774J191J9322j931K960
15607E881K0815R383j1742j6501k6358M061J8389k5875K949J2831J5848j0207
15595e26m414n858K6667K896j1701k7906o184l287j4482j2552L6757R142K0979
15582I531O461k6320q521J5771J0634K5770K943l435J0246n65l2537j6311m885
15569a1218J6081k730J0526m041j0012j790K3460j1952l51K2095k4294j4838j4962
$$ plain form
15660 -24523 -26948 -33038 -26993 -9526 7343 7654 -20468 -8427 -12315 -20211 -13666 -7485 -13886 -1383
15646 -1383 1854 -8452 413 4884 -3592 -30384 -39659 -25727 -442 -17490 -22736 -5575 2000
15633 2000 -5860 -12177 6839 23497 8097 -19574 -1349 -2986 -20697 -32078 -25276 -8989 -4096
15620 -4096 -6654 -11213 -23314 -34144 -36493 -22380 -7055 -1887 -15661 -14470 4852 2921 5881
15607 5881 26696 36079 24337 7836 -18522 -14461 3928 -21947 -18998 -6167 9681 -526
15595 -526 -4940 -10798 15869 18765 7064 -20842 -27026 -30313 -44795 -57347 -20590 -11448 9531
15582 9531 15992 -10328 -18849 -3078 7556 33326 36269 32834 43080 42515 9978 -6333 -11218
15569 -11218 4863 2133 12659 8618 -1394 -3184 20276 8324 7973 30068 5774 -9064 -24026
15556b4026l664O296O197J7770J750K3164j6713j2047J2422nj0339k6922j925
15543b8042K0388R178j8712m821j649L6130j8173k4363p761N0885Q559k6528l6868
15530d1777J2952J0429L7772k157l0850j9238M522j61j2175J0683K6157N715k800
15517i28n543J5287J3586J9434j3561q356k6195K371j2841j8396J4793K748L947
15504a3654J081k0858m311J1028r176J0868K3575K649J6044M90j9869R954K6290
15491C4111k3597k3771K3433O119j5762j2168j529J8375k0839k6603k9571k532
15479g4334K104o374M291J1853J9839q659P861K0809K7393M115j1550j308n722
15466i682K7088q160j8563l988J6408P048j6795j6630k4979l5204M644L6969K2639
$$ plain form
15556 -24026 -27690 -21394 -15197 2573 4323 27487 10774 -1273 11149 11144 805 -26117 -28042
15543 -28042 -7654 1524 -17188 -22009 -23658 12472 -5701 -30064 -37825 13060 21619 -4909 -41777
15530 -41777 -28825 -18396 19376 17219 -13631 -32869 -28347 -28508 -40683 -30000 -3843 1872 -928
15517 -928 -6471 8816 22402 41836 28275 19919 -6276 -3905 -16746 -35142 -20349 -17601 -13654
15504 -13654 -12573 -33431 -37742 -26714 -35890 -25022 -1447 1202 17246 17736 -2133 7821 34111
15491 34111 10514 -13257 10176 16295 533 -11635 -13164 5211 -15628 -42231 -71802 -74334
15479 -74334 -72230 -78604 -74313 -62460 -42621 -51280 -43419 -22610 4783 8898 -2652 -3960 -9682
15466 -9682 17406 9246 -9317 -13305 3103 10151 -6644 -23274 -48253 -83457 -78813 -41844 -19205
15453a9205K924m541q60O792m205p546R174J2462m667o178O272M427q304j5264
15439b8719J6496j1635l6871j0373J3853n88K3907K7732J5952j0830J3903L678
15427A6505j2032j3212q525P607k385o247j2756k214J5201Q972J5940N447k400
15414I901q690J4766J6487M987M793k890j7222j6808L520Q863k0260N677J5895
15401A9019j8207j0228n416K700j2296J91K3608m787j7640k3760k0784K5974J8703
15388b2923R985J6855p031j9394J2772J5379j0725k3715j8080J2997N756j964
15376c0088J1273K438Q527P122o797n101J8908j078l803m122Q343m20l167K336
15362D371J6969P313q669p083P68j2084J8319M33j9377J9958k2242j5731M006
$$ plain form
15453 -19205 -16281 -20822 -21682 -14890 -19095 -26641 -17467 -5005 -9672 -15850 -9578 -5151 -13455 -28719
15439 -28719 -12223 -23858 -60729 -71102 -57249 -57837 -33930 -6198 9754 -1076 12827 16505
15427 16505 4473 -8739 -17264 -9657 -12042 -18289 -31045 -33259 -18058 -9086 6854 12301 9901
15414 9901 1211 15977 32464 37451 42244 39354 22132 5324 8844 17707 -2553 3124 19019
15401 19019 812 -9416 -14832 -12132 -24428 -24237 -629 -5416 -23056 -46816 -67600 -41626 -22923
15388 -22923 -12938 3917 -3114 -22508 -9736 5643 -5082 -28797 -46877 -33880 -28124 -30088
15376 -30088 -18815 -16377 -7850 -728 -7525 -12626 6282 5204 1401 -2721 5622 5202 2035 4371
15362 4371 21340 28653 19984 12901 13669 1585 19904 20337 960 20918 -1324 -17055 -13049
15349a3049M449l6274k5323J4549J6010k6573K4185J9303R882o394K453Q078K991
15336e713K527j1666p076M903J5856p241N514K3141n438R044q425m9808l351K7137
15322a0596J4027n24K9808M60k3387k1948j9387J9620m84N453J1997L95J2178
15309A7612k1233l59M530j0654j2644m808N969p198j0987R103J7251J303k5903
15296c8018k4079J3365K1982M571J1589N521N934r92n397j178N320n41R956N301
15282A3334r935n674O540J1469J2908j2733o499N630j5445k7941j1375q817K1023
15269b7515J5569J8234L913p452p596p951J0449k175L022o975j3955M883J4020
15256c529j1214L628n859K821J4836j0000j3085j0815k070J4844L9046N885K720
$$ plain form
15349 -13049 -8600 -44874 -70197 -55648 -39638 -66211 -42026 -22723 -12841 -19235 -16782 -8704 -5713
15336 -5713 -3186 -14852 -21928 -17025 -1169 -8410 -2896 20245 14807 23851 15426 -34382 -37733 -10596
15322 -10596 3431 2907 32715 33175 9788 -12160 -31547 -11927 -12411 -6958 5039 5434 17612
15309 17612 -3621 -3980 550 -10104 -22748 -27556 -21587 -28785 -39772 -30669 -13418 -12115 -38018
15296 -38018 -62097 -48732 -26750 -22179 -10590 -5069 865 -127 -5524 -6702 -1382 -1923 8033 13334
15282 13334 3399 -2275 4265 15734 28642 15909 9410 15040 -405 -28346 -39721 -48538 -27515
15269 -27515 -11946 6288 10201 2749 -4847 -12798 -2349 -4524 -1502 -8477 -22432 -17549 -3529
15256 -3529 -14743 -11115 -16974 -14153 683 -9317 -22402 -33217 -35287 -20443 18603 24488 27208
15243B7208J069P674j29j9163r717J0753n266M594J0845l2372j7318J1207N235
15230e380N560J4656N388k9080j9626j5586n890r886P182L0478k282L875L52j49
15216b0388Q9p264J2981L1074r385O119j6541k3143k532o641J3434J2963q463
15203a7697j1029j7330n13J431J1184Q660J4862J67k888k4440P819K3638J0408
15190D272l272K4309j2507k0015k0197J3113J2353N046k0067n463M155R959m949
15177a3263J4559O391J275m875J1405j8763k6111J061j0459N258M513R719N931
15164a3359j0095r660k041O302j0845j6594O344K1859K5963Q868q937j4743j0629
15151b7567k0564o352J3630K0077K5674R038K908j685l0687O404K2184m97j083
$$ plain form
15243 27208 28277 35951 35822 16659 6942 17695 12429 17023 27868 -4504 -21822 -10615 -5380
15230 -5380 180 14836 20224 -8856 -28482 -44068 -49958 -59844 -52662 -22184 -24466 -20591 -20239 -20388
15216 -20388 -20299 -27563 -14582 16492 7107 13226 -3315 -26458 -28990 -35631 -22197 -9234 -17697
15203 -17697 -28726 -46056 -46569 -45138 -33954 -25294 -10432 -10265 -13153 -37593 -29774 -6136 4272
15190 4272 1000 25309 12802 -7213 -27410 -14297 -1944 3102 -16965 -22428 -18273 -8314 -13263
15177 -13263 1296 7687 8962 4087 15492 -3271 -29382 -28321 -38780 -33522 -29009 -19290 -13359
15164 -13359 -23454 -33114 -35155 -28853 -39698 -56292 -49948 -28089 -2126 6742 -2195 -16938 -27567
15151 -27567 -48131 -54483 -40853 -20776 4898 13936 16844 15159 -15528 -9124 13060 12563 11480
15138A1480j930J8788n649M661L89j3791j040k956P369k4678n756n990L552J1164
15124d387J7251j3121K0346O849j679J6798j2869r969l2236j3646j2263L347n129
15111d0708m313p074J4086j69j2836p501J0744P912o497P160k1204K989L2835
15098b4576n79m054Q273P475Q677j6521j516J2129k291M258j5206J3676j3656
15085b3911j0566K2886J0102p145K501l638R100j2239o808P94J5044m50k3620
15072b7950q849K35J0366j7592J2495l246j3496M449J9329J6933J1633j9759K340
15059a3112K4503O891P900k5892L934J1891j2816k8451Q707l100r447J3068J3866
15046b058q7r505j1270M479P858j1249J2455L2130K73k3833k109p096J4073q630
$$ plain form
15138 11480 9550 28338 22689 27350 27739 13948 12908 9952 17321 -7357 -13113 -19103 -15551 -4387
15124 -4387 12864 -257 20089 26938 25259 42057 29188 19219 -13017 -26663 -38926 -35579 -40708
15111 -40708 -45021 -52095 -38009 -38178 -51014 -58515 -47771 -39859 -46356 -39196 -60400 -57411 -24576
15098 -24576 -25155 -29209 -20936 -13461 -4784 -21305 -22821 -10692 -12983 -8725 -23931 -10255 -23911
15085 -23911 -34477 -11591 -1489 -8634 -6133 -9771 -671 -12910 -19718 -18924 -3880 -4330 -27950
15072 -27950 -36799 -36564 -26198 -43790 -31295 -34541 -48037 -43588 -24259 -7326 4307 -15452 -13112
15059 -13112 11391 18282 26182 290 4224 16115 3299 -25152 -16445 -19545 -28992 -15924 -2058
15046 -2058 -2145 -11650 -22920 -18441 -10583 -21832 -9377 22753 23026 -807 -2916 -10012 4061 -4569
15032d569j1474L6834R853l766R932p336k6950n417N524n786j7321r015J7682
15019a1809j0381j1200L1550J2821Q023r908l1433j4167j580l359K5496J5510
15007d37k488k2565j0146m501k2436R16J8323J4755r169o927K3427K4345l964
14994h67J9636J2438j5684k958k7840l0093J8254L9443J3469j2924P87J2225J6098
14981D1984K987k5220j5599l0199L1268J431M172P643l992j5961j0211k3594J6718
14968a8573l827r700J2184l190k2659J2005K179n041l483k3300K6145M1559K103
14955F402l1170j0789J8580J3686J1651J0306K7141k0360j8762k1730l531M840
14943a3736o25p062k6931J7124J8119n153j3066j1906j0901L3552L8913j0523
$$ plain form
15032 -4569 -16043 20791 30644 26878 36810 29474 2524 -2893 2631 -3155 -20476 -29491 -11809
15019 -11809 -22190 -33390 -1840 10981 19004 9096 -22337 -36504 -38084 -41443 -15947 -437
15007 -437 -2925 -25490 -35636 -40137 -62573 -61657 -43334 -28579 -37748 -44675 -21248 3097 -867
14994 -867 18769 31207 15523 12565 -15275 -45368 -27114 12329 25798 12874 13661 25886 41984
14981 41984 44971 19751 4152 -26047 5221 6652 10824 18467 14475 -1486 -11697 -35291 -18573
14968 -18573 -22400 -32100 -19916 -23106 -45765 -33760 -31581 -36622 -40105 -63405 -37260 4299 6402
14955 6402 -24768 -35557 -16977 -3291 8360 18666 45807 25447 6685 -15045 -18576 -13736
14943 -13736 -14361 -21423 -48354 -31230 -13111 -18264 -31330 -43236 -54137 -20585 18328 7805
14931G805l332j499J5083K4283k979j0762q458Q652m492k1320j8916m202p730
14918b7867j052m403J204L3208P8k3175o31N242M63j7361l598N497k558J0785
14904b4168J9122j0482j525r666L654L641J819k6210p004m095l342J7520J7598
14891b3138J9020o433p788L080K4792j6506j2108o121J3251o883J1670J3671J5955
14878B2462k6839j2479K0955K1167M653j1922j1834J939K2723j8970r996r564
14866g705P613J9575L553j532k2864n255K0114j6592k8048J8154M4709j3127J1702
14853C0297p937j2305J6069K5919o715j0354J0539K655K6437j4907l0700k5947
14841C051j6882l2916J3156K6870N572j738J4081m85r087j7183j7072J8432K476
$$ plain form
14931 7805 4473 2974 18057 42340 39361 28599 20141 28793 24301 2981 -15935 -20137 -27867
14918 -27867 -28919 -33322 -32118 1090 1168 -22007 -22638 -17396 -16933 -34294 -37892 -32395 -34953 -24168
14904 -24168 -5046 -15528 -17053 -26719 -23065 -19424 -17605 -43815 -50819 -54914 -58256 -40736 -23138
14891 -23138 -4118 -10551 -18339 -15259 9533 -6973 -19081 -25202 -11951 -18834 -7164 6507 22462
14878 22462 -4377 -16856 4099 25266 29919 17997 6163 8102 30825 11855 1859 -7705
14866 -7705 -92 19483 23036 21504 -1360 -6615 13499 -3093 -31141 -12987 31722 18595 30297
14853 30297 22360 10055 26124 52043 45328 34974 45513 48168 74605 59698 28998 3051
14841 3051 -13831 -46747 -33591 -6721 -1149 -2887 11194 10709 1622 -15561 -32633 -14201 -11725
14828a1725k5621m058k3857k856M3178N5219r884l0304j8761o438m867k335J8629
14815b3680J888K2545m059j3944k732K823k423J6450o429Q759L1082j4702k7262
14802a1684m5994q399J4680j2025K2920J8839j5770o220K7509L5488J3561q618
14790B4287J1156N909l0562K029J9249M3404J8173l2004k6791r842j0405j2757
14778A846K7231J4959k4851k5189j0529J4243l0930j520J1830q359j1651J0222
14766c2698K7543J2536J7005K215p837R288r521l44j8379j5203J4162K2399K5275
14753D6441q668j9891k5391j813p788K600n336J1664o232O71J1457Q640R581j624
14739A4311J1099J5342j6153j6501j6250j7822r094J8071K7427J9135j5151j0440
$$ plain form
14828 -11725 -37346 -41404 -65261 -68117 -24939 30280 20396 -9908 -28669 -35107 -39974 -42309 -23680
14815 -23680 -21792 753 -3306 -17250 -19982 -17159 -19582 -3132 -9561 -802 30280 15578 -11684
14802 -11684 -57678 -66077 -51397 -63422 -40502 -21663 -37433 -43653 -16144 19344 32905 24287
14790 24287 35443 41352 10790 12819 32068 75472 93645 61641 34850 25008 14603 1846
14778 1846 29077 44036 19185 -6004 -16533 -2290 -33220 -34740 -22910 -31269 -42920 -32698
14766 -32698 -5155 7381 24386 26601 18764 28052 18531 18187 -192 -15395 -1233 21166 46441
14753 46441 37773 17882 -7509 -9322 -17110 -14510 -19846 -8182 -14414 -13743 -2286 6354 15935 14311
14739 14311 25410 40752 24599 8098 -8152 -25974 -35068 -16997 10430 29565 14414 3974
14727C974L640K779m1781k9979j8978j8667J7282K4105N502r149M048J4722J0778
14714c1724N169Q431K5551j620k9765k957L566J2560J7653j3206K253n953l964
14701a4006n385j0050j741R858j996J106j5716j666m800O162J1626K4520O905
14688D817j0639j9610M031L6668K450p649J9694j925l9844P056r473k2256j4352
14675e1032k0293j8921K984R551K0185K5204K850L022O811J5961k853j1926K193
14662a6264L0991q16k5106j5623k799o13N717j0922j9181J3971M859J1312L601
14649b0873M787l362O041J2856j7949j7368j318j2531L9909L6846r691l5887j136
14636a9676P945J7346J662j2246j8186j5253j729J7350J6012J172n386n71J4022
$$ plain form
14727 3974 7614 10393 -31388 -61367 -80345 -99012 -81730 -57625 -52123 -61272 -57224 -42502 -31724
14714 -31724 -26555 -18124 7427 5807 -23958 -26915 -23349 -10789 6864 -6342 -4089 -10042 -14006
14701 -14006 -19391 -29441 -31182 -21324 -23320 -22214 -37930 -39596 -44396 -38234 -26608 -2088 4817
14688 4817 -5822 -25432 -21401 15267 17717 10068 29762 27837 -12007 -4951 -14424 -36680 -51032
14675 -51032 -71325 -90246 -87262 -77711 -57526 -32322 -29472 -26450 -19639 -3678 -6531 -18457 -16264
14662 -16264 14727 13911 -11195 -26818 -29617 -30230 -24513 -35435 -54616 -40645 -35786 -24474 -20873
14649 -20873 -16086 -19448 -13407 -551 -18500 -35868 -37186 -49717 -9808 27038 17347 -18540 -19676
14636 -19676 -11731 5615 7277 -4969 -23155 -38408 -40137 -22787 -6775 -5603 -10989 -11560 2462
14623B462L2577j7685l6069J4582j2657J552K8396j5667j6905J126l298j6298
14611c7884m116k702j1709p66J123N738J980J1779K1881R437k5734q683K420N606
14597c1630j1909J4670K0849n364n1443k1635J5976L6747K3703K4474o573J203
14585I068o071m151o796j2846j8048p933J0902o069m2516Q30O5009O376j3604
14572b5849j7435N721J1590l9496L647J0007o952j8760K1067J3963L8498q80k1502
14559b6381n351m769j2640o777J8769K7430J8002l64l8314p412n87R804P489O629
14545a4472J5650R784q443q306n540l223K4947j4584l1298K4169K2963j2654j0249
14532a1256j179K4420j533n185j9506K1347j272o771N786Q895O988j0479p079
$$ plain form
14623 2462 35039 17354 -18715 -4133 -16790 -15238 13158 -2509 -19414 -18288 -21586 -37884
14611 -37884 -42000 -44702 -56411 -57177 -56054 -50316 -48336 -36557 -14676 -5239 -30973 -39656 -37236 -31630
14597 -31630 -43539 -28869 -8020 -13384 -64827 -86462 -70486 -33739 -10036 14438 7865 9068
14585 9068 2997 -1154 -7950 -20796 -38844 -46777 -35875 -41944 -84460 -83630 -18621 -12245 -25849
14572 -25849 -43284 -37563 -25973 -65469 -61822 -51815 -58767 -77527 -56460 -42497 -3999 -4879 -26381
14559 -26381 -31732 -36501 -49141 -55918 -37149 -9719 8283 7919 -30395 -37807 -38394 -28590 -21101 -14472
14545 -14472 1178 10962 2519 -5787 -11327 -14550 10397 -4187 -35485 -11316 11647 -1007 -11256
14532 -11256 -12435 11985 10452 5267 -14239 7108 5836 -935 4851 13746 20734 10255 3176
14519C176O457J488K6729Q979Q495l548k7553l0479l5747j2532j366K9042P140
14506a9719k8415k508L1776j091J1164k190J2703K0064J7913j2649r073p284K133
14493A2824l1667l625j2353J9990o101l3018K8719J5747j9972j4519K1040k8882
14481e1817n029P873L0326K8609K650k4351j0591l390N74J5122n245N859O08j5642
14467b4444k035P889L724j6025l458l426K2002p824M313J6807P329K193j0044
14454b999k6574j0984j5573l378J0489K4411L3602J5240j6251j0966k247j2048
14442a7278J5323J3657j9093J089k378l159K6208n67j1359k3351K252L6509n85
14429A7268j2674K319j4023j3781j9099K915O904J4516l556p400J1487r88j43
$$ plain form
14519 3176 9633 11121 37850 46829 55324 51776 24223 -6256 -42003 -54535 -55901 -26859 -19719
14506 -19719 -48134 -50642 -18866 -19957 -8793 -10983 1720 21784 39697 27048 17975 10691 12824
14493 12824 -18843 -22468 -34821 -14831 -20932 -53950 -25231 -9484 -29456 -43975 -22935 -51817
14481 -51817 -56846 -48973 -18647 9962 12612 -11739 -22330 -25720 -25146 -10024 -15269 -9410 -8802 -24444
14467 -24444 -26479 -18590 -14866 -30891 -34349 -37775 -15773 -23597 -19284 -2477 4852 7045 -2999
14454 -2999 -29573 -40557 -56130 -59508 -49019 -24608 8994 24234 7983 -2983 -5230 -17278
14442 -17278 -1955 11702 -7391 -6302 -8680 -11839 14369 13802 2443 -20908 -18656 17853 17268
14429 17268 4594 6913 -7110 -20891 -39990 -37075 -30171 -15655 -19211 -26611 -15124 -16112 -16255
14416a6255J3281J3233o329k2900k03L53P538j988L509R50Q780k203k173n278
14402i685l415R570K1516N413k6164j7049K4827J35K268P903J4677R23j7363j9763
14388f207N015N060m237n322j272Q857j3959j5057K2410k825L42k331j9813j0234
14374c9573p010K6350K1896J7945j6599k0033j444K139n968n432j2499n385J224
14361d4389J082O309Q527k212M350j3476J0313M2107J8466k9805J3749J1322l2605
14348f262J2190J6463k2202l8517k457L3918m853j9709J5967O263J2371j3068
14336i896k1100M05m024k26K1033j627k0909J3882K3604k761J3834j0349j5262
14323a3396k3721p425K8715K7096l66J5097J0891m227o13L624j0031k4507r98
$$ plain form
14416 -16255 -2974 10259 3930 -18970 -19173 -18820 -11282 -13270 -9761 -8811 -31 -2234 -4407 -9685
14402 -9685 -13100 -3530 17986 23399 -2765 -19814 5013 5148 7416 15319 29996 30919 13556 -6207
14388 -6207 -1192 3868 -369 -5691 -6963 1894 -12065 -27122 -4712 -7537 -7195 -9526 -29339 -39573
14374 -39573 -46583 -20233 1663 19608 3009 -17024 -18468 -16329 -22297 -27729 -40228 -45613 -44389
14361 -44389 -43307 -36998 -28471 -30683 -26333 -39809 -29496 12611 31077 1272 15021 26343 -6262
14348 -6262 5928 22391 189 -38328 -40785 -6867 -11720 -31429 -15462 -9199 3172 -9896
14336 -9896 -30996 -30591 -34615 -34841 -13808 -15435 -36344 -22462 1142 -1619 12215 1866 -13396
14323 -13396 -37117 -44542 -15827 11269 10903 26000 36891 32664 32051 35675 25644 1137 139
14310A39j0440k0527j114J6316K7980K3094q794l5097k6634n020j3075L171J2033
14297c7968J9318K799R260j075k4537J0513J3009K8670L076o110k6195k9793j3484
14284e2517L2915J8551N362m065j1638l232J3228P85p599J871r92n346n515K548
14270a5644k987r799N828J600j4009O611O923J4353r381J4346J6607r172k0044
14257a4768J8022J9352J5171k7854k1324j2048k1733Q691J8827j1288J608K6593
14245g51k333J0818o158j920J3064p954J0487O58j8167N840K6596l355k6998l7396
14231c7569o792j6151r488J8347M5864J462Q473k3068j1463J8662O32Q276K825
14218A0r320O775M143k701o0p664J5491R9K189k9600o388Q281K5134r719M608
$$ plain form
14310 139 -10301 -30828 -31942 -15626 12354 35448 26654 -8443 -35077 -40097 -53172 -50001 -37968
14297 -37968 -18650 -15851 -6591 -7666 -32203 -21690 -8681 19989 23065 16955 -9240 -39033 -52517
14284 -52517 -19602 -1051 4311 246 -11392 -14624 -1396 -611 -8210 -6339 -7331 -12677 -18192 -15644
14270 -15644 -18631 -28430 -22602 -21002 -35011 -28400 -21477 -7124 -16505 -2159 14448 5276 -14768
14257 -14768 3254 22606 37777 9923 -11401 -23449 -45182 -36491 -17664 -28952 -27344 -751
14245 -751 -3084 7734 1576 -344 12720 4766 15253 15911 -2256 3584 30180 26825 -173 -37569
14231 -37569 -44361 -60512 -70000 -51653 -5789 -4327 4146 -18922 -30385 -11723 -11091 -2815 10
14218 10 -9310 -2535 1608 -1093 -1153 -8817 6674 6773 8962 -20638 -27026 -18745 6389 -3330 1278
14203A278j4214M409J2775k729j3419j882O202K0846K6858l529l819l8160p556
14190a2940J4182k745K927k081j7737l772L115M166M55K2536L3396Q592k2718
14177B7376l303M1392r970k2069K207J0498j6419K909L773J318J3580J8675j5173
14164E4794k7902p461k276k2466m178q999j9245j4447j8683l224J5235J3746J5198
14151b9908M0436k512l7497q840L4258K4684K012l2075K242L6964J1694N599J4393
14138F1450m1906k2675R37P173J2568j3420q323j6551r663R51K3964J3894m972
14125C427q148O990L0240Q290j7159L42m0291j0700j9719K9626J8148j0093k1939
14112c0986Q259J2378J8980K0003L786l6596l5901l057P947K8925R220l923l023
$$ plain form
14203 1278 -12936 -8527 4248 1519 -11900 -13782 -7580 13266 40124 36595 32776 -5384 -12940
14190 -12940 1242 -1503 1424 -657 -18394 -22166 -19051 -14885 -14430 8106 41502 50094 27376
14177 27376 24073 65465 55495 33426 35633 46131 29712 32621 36394 37712 51292 69967 54794
14164 54794 26892 19431 17155 -5311 -9489 -18488 -37733 -52180 -70863 -74087 -58852 -45106 -29908
14151 -29908 10528 8016 -29481 -38321 -4063 20621 22633 -9442 -7200 29764 41458 47057 61450
14138 61450 19544 -3131 -2194 4979 17547 4127 -4196 -20747 -30410 -29459 -5495 8399 3427
14125 3427 -4721 2269 32509 40799 23640 23982 -16309 -27009 -46728 -17102 1046 -9047 -30986
14112 -30986 -22727 -10349 8631 28634 32420 -4176 -40077 -43134 -35187 -6262 2958 -965 -3988
14099c988kK01J4605k912r649J7445N95j3185j6247J545j0099L900p594m803K6015
14084d173p811k856J1965l541K382j2402Q808m268J441j2679k4139J5436j5720
14071d7557K930R458q309N527J0072J731l272K4934L8401K0065j3846k7985l5900
14058b3751k3579m326J2241K3505P646J4255J6494J0236k535l3318j2612J3129
14046b615J5535k9406j7396J208j050j1716R395L7694J4033o405o238J5998R422
14033B8459r055n864j931l863j1739Q518O379O617N153Q311q803l2659n87L0052
14019A8988k898K464R410j0630q011j5789K165j978o629Q9r1O977M088K2606J1812
14004C2573K121k5797k1334J4116J9196m199L15j8233l6903o312o826K4478L0528
$$ plain form
14099 -3988 -3990 -3789 10816 7904 -1745 15700 16295 3110 -13137 -11592 -21691 -17791 -25385 -30188 -4173
14084 -4173 -11984 -14840 -2875 -6416 -4034 -16436 -7628 -11896 -10455 -23134 -47273 -31837 -47557
14071 -47557 -44627 -35169 -43478 -37951 -27879 -26148 -29420 -4486 33915 53980 40134 12149 -23751
14058 -23751 -47330 -51656 -39415 -15910 -8264 5991 22485 32721 30186 -3132 -15744 -2615
14046 -2615 12920 -16486 -33882 -32674 -33724 -45440 -36045 1649 15682 9277 3039 19037 28459
14033 28459 19404 13540 11609 7746 -3993 4525 10904 17521 22674 30985 22182 -10477 -11064 18988
14019 18988 16090 18554 27964 17334 9323 -6466 -4301 -6279 -12908 -12819 -12910 -5933 -1845 20761 32573
14004 32573 34694 8897 -12437 1679 20875 16676 16991 -1242 -38145 -44457 -51283 -26805 3723
13991C723R640Q362q583N650k1819l7091J0059o60J1439o062j2862J4349M0692
13978A6837K3382L81M028j991j8125j9721R54j4096J3287Q447p970k547M234k6419
13964a9319l715p681J8181K9674n670j760K0627o173l9070J394J0594K524o531
13951f925m908j4897K1772J7630o160n265P751L890k6774j0927K2406K6892J340
13938B5825J4960L585k7224r545R164J1582J9680q823j8782K471J2459j1623j9500
13925D229j6912j368J5961J4127k292k0724q239J4129J4817K1908Q410M617l4559
13912A4104k0347J6080o570O755Q039M39j8456O247J464J634J0464L713k2955
13899F11N506m850K9593K6816M479r660j0787k8802l900j4549J6478o928j4169
$$ plain form
13991 3723 13363 21725 13142 18792 -3027 -40118 -30059 -30719 -19280 -25342 -38204 -23855 16837
13978 16837 40219 40600 44628 42637 24512 4791 5745 -8351 4936 13383 5413 2866 7100 -19319
13964 -19319 -23034 -30715 -12534 17140 11470 9710 30337 24164 -14906 -13512 -2918 -394 -6925
13951 -6925 -11833 -26730 -4958 12672 6512 1247 8998 12888 -13886 -24813 -2407 24485 25825
13938 25825 40785 44370 17146 7601 16765 28347 48027 39204 20422 22893 35352 23729 4229
13925 4229 -12683 -14051 1910 16037 13745 -6979 -15218 -1089 13728 35636 44046 48663 14104
13912 14104 -6243 9837 3267 10022 18061 18500 44 6291 7755 9389 19853 23566 611
13899 611 6117 1267 30860 57676 62155 52495 41708 12906 9006 -5543 10935 4007 -10162
13886a0162j6571L839k998l795M051J1310k286m790q681O192J4052J5319k3971
13873a8491p028K4024K8064K071N777O387m749p1099m0416j401L5648K5863o841
13860b2191L532J0235J0479q275j5218q114J2477J5888O029k1566k4956R266J3211
13847a9203K5794J1944r712l0452J4497L462J2374M21l263J2738j5735j2715k2218
13834c2068J3563K0266j2487k7115J621J368o80r242O570J6912P690J7878J5884
13821B0160r641q177N636l9007l2172R981K1489P969J0224M086K1933J9899j7303
13808A5077k1676J405J2728L260K128k6213r469J9301J2088m614J8748R75j075
13795B2663l1991j8674k119L5178q568k51J522N378r799r593j0002J5506K3581
$$ plain form
13886 -10162 -26733 -22894 -25892 -29687 -25636 -14326 -16612 -21402 -30083 -23891 -9839 5480 -18491
13873 -18491 -25519 -1495 26569 28640 34417 40804 36055 -35044 -75460 -76861 -41213 -15350 -22191
13860 -22191 -18659 -8424 2055 -6220 -21438 -29552 -17075 -1187 4842 -16724 -41680 -32414 -19203
13847 -19203 6591 18535 8823 -21629 -7132 -3670 8704 9125 5862 18600 2865 -9850 -32068
13834 -32068 -18505 1761 -10726 -37841 -36220 -34852 -35532 -44774 -38204 -21292 -13602 4276 20160
13821 20160 10519 2342 7978 -31029 -63201 -53220 -31731 -23762 -13538 -9452 12481 32380 15077
13808 15077 -6599 -5194 7534 10794 12922 -13291 -22760 -3459 8629 4015 22763 23738 22663
13795 22663 -9328 -28002 -30121 5057 -3511 -3762 -2240 3138 -6661 -16254 -26256 -10750 12831
13782A2831p216j2954k4900j8217J6829L0083L759J1370j0578k2190r472J6200
13770a4455J7879p705p921l262q661J908J3190q106m434K9224L5740j2947k1901
13757H549k3453P035j0483K6279K6018J3776K426j415l0366m2711k3623j983L6512
13744a3439K1831k7568k2274L92J4218j972J134L1996N907N02j680n496j4511
13731a0960k864J0267R38j2360k171K9670J9662j9760j228J568k1969K2597m90
13718A2900k4559J3527q157k8379l673j5917n435K5841K1954J8107P895p226o605
13705B73j5985p624M636J0223J8918Q412m161K9234K185j7639k4891l73L2878
13692C6086k401l5154J0532J4139k3338k9837o698J6782J2395K6399J5748J7940
$$ plain form
13782 12831 5615 -7339 -32239 -50456 -33627 -3544 215 11585 1007 -21183 -30655 -14455
13770 -14455 3424 -4281 -12202 -15464 -24125 -22217 -9027 -17133 -21567 7657 43397 30450 8549
13757 8549 -14904 -7869 -18352 7927 33945 47721 50147 48732 18366 -24345 -47968 -49951 -13439
13744 -13439 8392 -19176 -41450 -41058 -26840 -28812 -27678 4318 10225 10727 9047 3551 -10960
13731 -10960 -13824 -3557 -2619 -14979 -17150 12520 32182 12422 11194 12762 -9207 13390 12900
13718 12900 -11659 1868 -6289 -34668 -38341 -54258 -59693 -33852 -11898 6209 14104 6878 273
13705 273 -15712 -23336 -18700 -8477 10441 18853 14692 43926 46111 28472 3581 3208 36086
13692 36086 33685 -1469 9063 23202 -136 -29973 -36671 -19889 -7494 18905 34653 52593
13680E2593k0047k9867R988n753j5440P325J5617K7505J5794r257P336J6375m2328
13667B9841n0326J9554o877k2670P184L814K1284J4959K3313J2839r406k8681
13655A4828j5558n964J5652L545p232K2416j3138k2670R880N914J149l427O187
13642A1582m946j7864J5988K3009o99j1583k4955j92Q933J3777R011m075l971
13629A4015k856j122L039k672L889n932j6862j0188n559j0791K922K5456j289
13616g950J7102K3325n391j9905j6993J1419J5144K916J1919O299j4231l508J5473
13603C5619l221N111o369j9252J221J8769K1239j0862k1918J7970J6365p517j3797
13590C3358j113j1428J6219K2010k5048j3104n462o676k3370j1651K1798J9985
$$ plain form
13680 52593 32546 2679 12667 6914 -8526 -1201 14416 41921 57715 48458 55794 72169 29841
13667 29841 -20485 -931 -7808 -30478 -23294 -19480 1804 16763 40076 52915 43509 14828
13655 14828 -730 -6694 8958 12503 5271 27687 14549 -8121 1759 7673 8822 5395 11582
13642 11582 6636 -11228 4760 27769 27070 15487 -9468 -9660 -727 13050 22061 17986 14015
13629 14015 11159 10037 13076 10404 14293 8361 -8501 -18689 -24248 -35039 -32117 -6661 -7950
13616 -7950 9152 32477 27086 7181 -9812 1607 16751 19667 31586 37885 23654 20146 35619
13603 35619 32398 37509 31140 11888 13109 31878 53117 42255 20337 38307 54672 47155 33358
13590 33358 32245 20817 37036 59046 33998 20894 15432 8756 -14614 -26265 -4467 15518
13578A5518m859k5098N144L0677J9195N956L923l0790k0281N889O222K422L654
13565A7572k3242n050R773L250k7679k4137J8434K1685O370j4213J7111J1274
13553A1148j3613r011j5322K3642J7953k1594J9337j1229j7220J4435O074P729
13541A2329K086R717JK9518K4330j3071k6533J3167k570m7599k8419K1001K3713
13528A7670J4778j5470k6555j5496L6697J7310M14J1048j5265k5227L894p890
13516d092j2286q613Q879J1824M934J2993M1526J1285k8548j4983j480K2949q678
13503C5710q136n380R665K0629J205J1746j510j1946O096l3809k9629r983j452
13490a6794J4281o065L141o637l387N391P40K319l567P381q993k645J8092J7122
$$ plain form
13578 15518 10659 -14439 -9295 21382 40577 46533 50456 19666 -615 5274 11496 13918 17572
13565 17572 -5670 -10720 -947 2303 -25376 -49513 -31079 -9394 -3024 -17237 -126 11148
13553 11148 -2465 -11476 -26798 -3156 14797 -6797 12540 1311 -15909 -1474 4600 12329
13541 12329 14415 24132 24133 53651 77981 64910 38377 51544 48974 1375 -27044 -6043 17670
13528 17670 32448 16978 -9577 -25073 11624 28934 29348 40396 25131 -96 3798 -4092
13516 -4092 -16378 -24991 -16112 -4288 646 13639 55165 66450 37902 22919 21439 44388 35710
13503 35710 27574 22194 31859 52488 53693 65439 63929 51983 58079 24270 -5359 -15342 -16794
13490 -16794 -2513 -8578 -5437 -12074 -15461 -10070 -9330 -7011 -10578 -3197 -12190 -14835 3257 20379
13476B0379k2680M672J272m162l027K3180J9201J2309L1460o472K491j5511k9001
13463C4111q567M853J7913n80j7058P581N146j709m014O903j7398p985O495J3085
13449C8776q698N572k714j0831l418K779j0492j6825m728K4382J9611j2812j1532
13436I070R851q602p246p960N759j8122Q708J8186k402J8092K0600n192j215k5017
13422A4510j8006J6775Q910m527L827Q001j2901m925Q609m744K816J824j457j6780
13408A932r429J3731J5393J1218J2742n748M470k1999r797k093R123L199k7175
13395d433J0158J7036N329N101k2413m0457O213Q947k0631J727K0134R610L3788
13382C0109m382k9945O955K664J4138M798m839j5584j0443K8773K4740j4656k9074
$$ plain form
13476 20379 -2301 2371 3643 -519 -3546 19634 38835 51144 82604 76132 78623 63112 34111
13463 34111 25544 30397 48310 47730 30672 38253 43399 41690 37676 44579 27181 19196 25691 38776
13449 38776 30078 35650 32936 22105 18687 21466 10974 -5851 -10579 13803 33414 20602 9070
13436 9070 18921 10319 3073 -4887 872 -17250 -8542 9644 7242 25334 45934 40742 39527 14510
13422 14510 -3496 13279 22189 17662 21489 29490 16589 11664 20273 15529 18345 20169 18712 1932
13408 1932 -7497 6234 21627 32845 45587 39839 44309 22310 12513 10420 19543 22742 -4433
13395 -4433 5725 22761 28090 33191 10778 -29679 -23466 -14519 -35150 -33423 -13289 -3679 30109
13382 30109 25727 -4218 2737 5401 19539 24337 19498 3914 -6529 22244 46984 32328 3254
13369C254Q584j767M125P665j3087J0129j0260j9445o115J7507j0757m849K4202
13356I186j5895k531k3060l097N488k1217L6412J0350r677N58J2534K1404K618
13343B3073j4335K7420n706j4717k9816j2327P887l648j3462n806O489K7515k520
13330i953K2122M167k3692j7509n163M5343K0247M054q110q492k7757j5451J7612
13317b582N4026K9242p906L285p699J2262j9440n646k212j4738Q104j446p058
13304C8192o110J2592j8155m1397J2942J0231o319K737N903L4686K2749k490p379
13291E8182k1114l7292k2526J7663J5029k099l18K2046n378j2965j1643J2673
13279A2258J7650P697m301L122l3105j6542L867Q231K4855L8303q969j8581L856
$$ plain form
13369 3254 11838 10071 14196 21861 8774 18903 8643 -10802 -16917 590 -10167 -15016 9186
13356 9186 -6709 -9240 -32300 -35397 -29909 -51126 -14714 -4364 -14041 -13483 -949 20455 23073
13343 23073 8738 36158 30452 15735 -14081 -26408 -18521 -22169 -35631 -41437 -34948 -7433 -9953
13330 -9953 12169 16336 -7356 -24865 -30028 15315 35562 39616 31506 23014 -4743 -20194 -2582
13317 -2582 51444 80686 72780 76065 68366 80628 61188 55542 53330 38592 46696 45250 38192
13304 38192 32082 44674 26519 -14878 -1936 8295 1976 4713 10616 45302 68051 65561 58182
13291 58182 37068 -224 -22750 -5087 9942 7843 7525 29571 24193 11228 -415 12258
13279 12258 29908 37605 33304 36426 3321 -13221 -9354 -1123 23732 62035 53066 34485 38341
13266C8341m293j4732n598P527j5591k7211N387O778L2913q149j2462J4589j3881
13253C618r085M724q61J1561j1777Q541K5431Q194j7993j0032J2226o122k3880
13240e455r526K2682J8092J5341Q387L903k8392O041j4689K7730j1285j9143L3848
13227D7534r15k9812k1030J2213j3029r759J1217r102p123j0797J3537K6000J190
13214A0124j9061J200K7247q614o007j3791J2571J52k9174L595L4947K7333k6534
13201A3988j9398r666N601P785K117L9952J8255n904j0392q047J754L2602J0884
13188G9531m246j8699k3933q74p139o33N13O59o782j665J3574p30j736n140Q476
13173C1176J3535J015q836L125J0015J454P096K105K5041K6315o675r718o646
$$ plain form
13266 38341 34048 19316 13718 21245 5654 -21557 -16170 -9392 23521 15372 2910 17499 3618
13253 3618 -5467 -743 -1604 9957 -1820 6721 32152 40346 22353 12321 24547 18425 -5455
13240 -5455 -14981 7701 25793 41134 49521 53424 25032 31073 16384 44114 32829 13686 47534
13227 47534 46619 16807 -4223 7990 -5039 -14798 -3581 -12683 -19806 -30603 -17066 8934 10124
13214 10124 -8937 -7737 19510 10896 4889 -8902 3669 3821 -25353 -21758 13189 40522 13988
13201 13988 -5410 -15076 -9475 -1690 427 40379 58634 52730 42338 34291 36045 68647 79531
13188 79531 75285 56586 32653 31779 24640 24007 24520 25179 18397 16732 30306 29576 27840 22700 31176
13173 31176 44711 45726 36890 40015 50030 51484 58580 60685 85726 112041 105366 95648 89002
13160H9002J3863K1242O593J3463j220Q328R169L3384N2819O5973L2295Q7784
13148D32695Q3546R4256J41632J59445K57644L08033L09792K97179J60636n8380
13138B186478k57078l65696l53545k59809j72342j20778q3424o5701j6081m9590
13128D42434l8631l0553j5640k0826k9890k3797j1326j2838n1901k3030Q77n355
13116A79524O986R915L694m4328l0180J4510L0276p844k0989K8K1083K5654l1581
13103A56748j9325j739K491K284N997l775l7277k5645k1736O302L9q322N380N2551
13089A13973Q041l1350l2433R973N877K0902k023k6862Q906K2204J6922L909J178
13076A19217k0590k4091K1128O300j3222L844N087l399j9650Q788k4107j0509
$$ plain form
13160 89002 102865 124107 130700 144163 142943 151271 160440 193824 246643 312616 344911 432695
13148 432695 516241 610497 752129 911574 1169218 1477251 1787043 2084222 2244858 2186478
13138 2186478 1929400 1563704 1210159 950350 778008 657230 573806 508105 492024 442434
13128 442434 403803 373250 357610 336784 306894 283097 271771 258933 207032 184002 184879 179524
13116 179524 186510 196425 200119 155791 125611 140121 170397 162553 141564 141592 162675 188329 156748
13103 156748 137423 135684 138175 140459 146456 142681 105404 79759 58023 64325 64364 56042 61422 113973
13089 113973 122014 90664 58231 68204 74081 94983 92960 66098 75004 97208 114130 118039 119217
13076 119217 98627 74536 95664 101964 88742 92586 97673 94274 74624 83412 59305 48796
13064D8796n417R154L5983k2403j7449m02J867K2526K6957j1463n1824j9007J0282
13051B7600L216k3024P588K7832j7227j8361J0029J5445J8712J6882Q000N736
13039H2428k7125k5850K8620m524J7647J3023K7650l684N86O103j0761j5493L301
13026I1921j3792J4994O254o008j6647m539l127j4096O845j4136m580p197K7463
13013F3355O391K878K0945j9947l6916j4334R368M4928k008n500J7237J7114k4819
13000G8692j320J1928J5727o891J9044K3640n562J0635J3477O950j8007q342j2471
12987A27500K2871J3791j4625j117K0438J5857k5571m0494K456J8687J8033J526
12975A59352j8162r348r790M87M1765L8556l2560m2853q533N34n146k228p793
$$ plain form
13064 48796 43379 52533 88516 66113 48664 48262 50129 72655 99612 88149 36325 17318 27600
13051 27600 30816 7792 15380 43212 25985 7624 17653 33098 51810 68692 76692 82428
13039 82428 55303 29453 58073 53549 71196 84219 111869 108185 108771 114874 104113 88620 91921
13026 91921 78129 93123 99377 93369 76722 72183 69056 54960 61805 47669 43089 35892 63355
13013 63355 69746 72624 93569 73622 36706 22372 31740 76668 74660 69160 86397 103511 78692
13000 78692 77372 89300 105027 98136 117180 140820 135258 145893 159370 166320 148313 139971 127500
12987 127500 150371 164162 149537 148420 168858 184715 159144 118650 121106 139793 157826 159352
12975 159352 141190 131842 122052 122539 164304 202860 170300 127447 118914 119448 114302 112074 104281
12962A04281k243p439Q600K6207K0077k2871q980M023J4047N191o63j0467L634
12949A33397J964j1013J949o823R182L166P337K2928J7126K4793L9483M9253K9256
12936C21998o170k4428j612K2565N1241R696q752j7033j3975k3147l2502k0602
12924B57279R231l810l5087k2957O19J0518j1772l3036R247P924J1802N829k138
12911B03649J3626J4777L600m149M186J9991l660J2515j0129m570p367m3842q131
12898A90496K342J4674K9223K8320L4857K0697K735K1635J8883n390k700K594
12886C58366k4899l0937m4134k3557O567p660N582J691m015O642M0672K2609L3219
12873C40146J7041R636J9201M0654K238m0350n9207n7808Q35J5487L0736M8762
$$ plain form
12962 104281 102038 94599 103199 129406 149483 126612 117632 121655 135702 140893 140230 129763 133397
12949 133397 135361 124348 126297 119474 128656 131822 139159 162087 179213 204006 243489 292742 321998
12936 321998 315828 291400 289788 312353 363594 373290 364538 347505 333530 310383 277881 257279
12924 257279 266510 262700 227613 204656 205275 215793 204021 170985 180232 188156 199958 205787 203649
12911 203649 217275 232052 235652 231503 235689 255680 252020 264535 254406 249836 242469 198627 190496
12898 190496 192838 207512 236735 265055 299912 320609 323344 344979 363862 358472 355772 358366
12886 358366 333467 302530 258396 234839 241406 233746 239328 241019 237004 243646 284318 306927 340146
12873 340146 357187 366823 386024 426678 428916 388566 329359 271551 272386 287873 318609 367371
12861C67371L8239K7780j8857r847n8227m3053J7882Q259P484j0795j4922j3813
12849B97501J6226J2624j4643m1998j4702j4160J4212J9717j8964k2664O922L2359
12837B72430r52J7632Q49j915j8710l4939N987L4392J8873j0389Q655k0691L2759
12824C03981N4766O062J6778M685l727N3383M9544j2774k0398K9692O1495N7900
12812F01387N1871R4688J20185K09373L32743M18540L60995J92876j2931j67146
12802B202581l13385m43175m89980n49320m52192j41654J55081K81323K74952
12793E24231J25940m2508j31123o2532L3489Q694k3975J8764K3297M3911N2291
12782E70479L1176J8863K3963K4725L0828R652J2048j001k78K2523K3479M307
$$ plain form
12861 367371 405610 433390 414533 404686 346459 303406 321288 329547 337031 326236 311314 297501
12849 297501 313727 326351 311708 269710 255008 240848 255060 274777 255813 233149 240071 272430
12837 272430 271478 289110 289959 288044 269334 234395 240382 274774 293647 283258 291913 271222 303981
12824 303981 358747 364809 381587 386272 382545 435928 485472 472698 452300 481992 543487 601387
12812 601387 653258 747946 868131 1077504 1410247 1828787 2189782 2382658 2369727 2202581
12802 2202581 1889196 1446021 956041 406721 -45471 -187125 -32044 249279 524231
12793 524231 650171 607663 476540 414008 447497 456191 432216 450980 474277 518188 570479
12782 570479 601655 620518 644481 669206 700034 709686 721734 720733 720455 742978 766457 770764
12770G70764M6089O7319M0869k5432o644J4602J0997M4677M8789K3725J0698M9267
12758A095720L4046Q506p488N476L6771L5286K6954J6128L4060J0982J3631M6620
12746A356692M7807M1077L8492M1009K4764K4400N8722Q5109N9831K4975J0315
12735A813193J4269L5542O9472O9369O7925P1006P4787P9823O6633O3632P1267
12724B496918R3247N5705J01575J04921J01488R2012J22051J27750J48148J78851
12714C622666K20407K35774K36656K45418K82603K67561K60421K80451K93946
12705E945903L46039L78110M11430N26053O23020O75132P73127Q91705J036647
12696A1607166J239007J504676J855892K310330K841484L467555M210561M995317
$$ plain form
12770 770764 816853 884172 925041 899609 892965 907567 918564 963241 1012030 1035755 1046453 1095720
12758 1095720 1129766 1138272 1130784 1136260 1173031 1208317 1235271 1251399 1285459 1296441 1310072 1356692
12746 1356692 1404499 1445576 1484068 1525077 1549841 1574241 1632963 1718072 1777903 1802878 1813193
12735 1813193 1827462 1863004 1932476 2001845 2069770 2140776 2215563 2295386 2362019 2425651 2496918
12724 2496918 2590165 2645870 2747445 2852366 2953854 3045866 3167917 3295667 3443815 3622666
12714 3622666 3843073 4078847 4315503 4560921 4843524 5111085 5371506 5651957 5945903
12705 5945903 6291942 6670052 7081482 7607535 8230555 8905687 9678814 10570519 11607166
12696 11607166 12846173 14350849 16206741 18517071 21358555 24826110 29036671 34031988
12688C4031988N738506O695739Q220977J0620508J4293345J9440922K6446638
12681A25488623L5843522M8067036O2712975P5517969P1890567L6186721j5246254
12674D40461159o0894070q2167857p3328235n3520081l6397448k4785259j7410436
12667I1957773j2674416r428191p060246n461435m497653l874727l415892k970964
12659D2574249k464478j961587j570832j263156j014716p95839n44816l81375
12651C2577450m74987q77845j327625j613019j690604j643938j563704j493233
12643B1892495j377473j271056j121105j033937r52319q70658q04399p75716p69254
12634A2916578p26405o61273n87872n42424n00638m73864m39412l83082l28343
$$ plain form
12688 34031988 39770494 46466233 54687210 65307718 79601063 99041985 125488623
12681 125488623 161332145 209399181 272112156 347630125 419520692 455707413 440461159
12674 440461159 379567089 297399232 224070997 170550916 134153468 109368209 91957773
12667 91957773 79283357 69855166 62794920 57333485 52835832 48961105 45545213 42574249
12659 42574249 40109771 38148184 36577352 35314196 34299480 33503641 32958825 32577450
12651 32577450 32102463 31224618 29896993 28283974 26593370 24949432 23385728 21892495
12643 21892495 20515022 19243966 18122861 17088924 16136605 15265947 14461548 13685832 12916578
12634 12916578 12190173 11528900 10941028 10398604 9897966 9424102 8984690 8601608 8273265
12625H273265k76651k26697j91781j71623j00346n5771o0979j92764l41564m58841
12615F196248m80817m17414l46962k93438k66319k15740j85206j91164j77502
12606C621686j68359j49292j18470j22819j15675j12702j25493j10640j01335
12597B496901p6714j17260r4751o7417m9238o5007q9301n4952l9490m6580l2951
12586A763240l1113k0906k1177n3667p4403m2166n9117o2000m5923m7659m1284
12575A263825p0998n5593j9109l2072j4898j2401j7585k3046k023k887j0449m509
12563I98255L356M372M00l5394m4191J5387J23377J81739J13096m4758j35080
12552A180559j09217p3373j12272j69752j55548j14659j20894r0417k8808l4554
$$ plain form
12625 8273265 7996614 7769917 7578136 7406513 7306167 7250396 7189417 6996653 6655089 6196248
12615 6196248 5715431 5298017 4951055 4657617 4391298 4175558 3990352 3799188 3621686
12606 3621686 3453327 3304035 3185565 3062746 2947071 2834369 2708876 2598236 2496901
12597 2496901 2420187 2302927 2208176 2140759 2091521 2026514 1937213 1882261 1842771 1796191 1763240
12586 1763240 1732127 1711221 1690044 1636377 1561974 1519808 1460691 1398691 1352768 1305109 1263825
12575 1263825 1192827 1137234 1118125 1086053 1071155 1058754 1041169 1018123 1016100 1013213 1002764 998255
12563 998255 1001611 1005983 1006383 970989 926798 942185 1065562 1247301 1360397 1315639 1180559
12552 1180559 1071342 997969 885697 715945 560397 445738 324844 234427 205619 171065
12542A71065k1949K6763L9915J8596O929J4999K8438p376k5090j3316N564Q966
12530B53504j2932j6031P109M7646L3138P202L5018K6941L4902K2497j8502Q615
12518D29107P636O803j7533J0553L6957m198L504J1839n866J7610J1333l111j1954
12505D92680l2409m2742j1329J5854K5194Q004K6250M855j5639j2627j3938N717
12493D49870K6448K0015K3057O5703R2906J36101J91516K06088K64639K45146
12483A721489Q4933j14489k61949k97449k24536j37750r8370n3948n2566m5414
12473E19951k8420K31l5867k9004k4511j2808j2593k104J2125k1119l6302m1563
12461B88016k7907M814K589P86j3903k7418m4958r592j8442j0544m727J1972J883
$$ plain form
12542 171065 149116 175879 215794 234390 241319 256318 284756 277380 252290 238974 244538 253504
12530 253504 240572 224541 231650 279296 312434 319636 354654 381595 416497 438994 420492 429107
12518 429107 436743 443546 426013 436566 473523 469325 472829 484668 478802 496412 507745 504634 492680
12505 492680 460271 417529 406200 422054 447248 455252 481502 486357 470718 458091 444153 449870
12493 449870 476318 496333 519390 585093 677999 814100 1005616 1211704 1476343 1721489
12483 1721489 1806422 1691933 1429984 1132535 907999 770249 671879 617931 565365 519951
12473 519951 491531 491762 455895 426891 402380 389572 376979 374875 387000 365881 329579 288016
12461 288016 260109 264923 267512 268298 254395 226977 182019 172427 153985 143441 138714 150686 152569
12448A52569l4402j3370r019k644L6527J6333j3351N554M650R32j6414j9977J3516
12435A20904K0913K191L241J0901N691J0565j2979r801j0454J3527j0645j2277
12423A31777R352K3204r774J4203J3055k3409o304R4K160L403m837k1003K0634
12410A52555O217j9483M13m5k4226j4596J4880J1495p461l2995k3264K810K1293
12397H7593J087J8148J4818j3872o435J045O164J4332J4365J281j503p766j7111
12384A12146n866N075K5148K1022j0135q45p073L468r09m65k8846q509M37Q60
12370A05508q121r391N447P164j0149K2938m781j0742n900J0679K3814J1429j8393
12357A19502n126j5245k0366j8771K0052M5346R367j4672j8985O734M450p251
$$ plain form
12448 152569 118167 104797 95778 93134 129661 145994 132643 138197 142847 143779 127365 107388 120904
12435 120904 141817 144008 147249 158150 163841 174406 161427 151626 141172 154699 144054 131777
12423 131777 141129 164333 154559 168762 181817 158408 152104 152198 154358 157761 152924 131921 152555
12410 152555 158772 139289 139702 139657 115431 100835 115715 127210 119749 86754 63490 66300 87593
12397 87593 88680 106828 121646 107774 101339 102384 108548 122880 137245 138526 137023 129257 112146
12384 112146 106280 111355 136503 157525 147390 146545 139472 142940 142031 141566 112720 104211 104648 105508
12370 105508 97387 87996 93443 100607 90458 113396 108615 97873 91973 102652 126466 137895 119502
12357 119502 114376 99131 78765 59994 80046 125392 134759 120087 101102 107836 112286 105035
12345A05035O626r392M337R474j7022l5193Q641K8415q828k6438l1599p405j664
12332B4987J1545j0970J6651J2669r061j617K0535j62Q551q99q476k0299J1105
12319E4559l180L912k5359k179N418L7022J7123j9339k5807j6928J5906n642J1185
12306D6691K2991J1677O189r919j8308L2M442J2961j0131k1635J295J949J0577
12293E8811O883j2884j3572o71m162L043m097o627j9306L415l74n520J9577M457
12279B8973n103k9371Q729N613m085R952K0975K8236k9333k2405J7796L238M88
12266C3703j1021j1160j2989J7622P176r579q403J2840K4702P357P293m329l6757
12253A6455j4373j2892N829J3893J8202j667K6658K730p834J077K9175j5147j3952
$$ plain form
12345 105035 111661 102269 106606 116080 99058 63865 72506 100921 92093 65655 34056 26651 24987
12332 24987 36532 25562 42213 54882 45821 44204 64739 64577 73128 72229 63753 43454 54559
12319 54559 51379 55291 29932 27753 33171 70193 87316 67977 42170 25242 41148 35506 46691
12306 46691 69682 81359 87548 77629 59321 59353 63795 76756 66625 44990 46285 48234 58811
12293 58811 65694 52810 39238 38567 34405 37448 33351 26724 7418 10833 10459 4939 24516 28973
12279 28973 23870 -5501 3228 8841 4756 14708 35683 63919 34586 12181 29977 33215 33703
12266 33703 22682 11522 -1467 16155 23331 13752 5349 18189 42891 50248 57541 53212 16455
12253 16455 2082 -10810 -4981 8912 27114 25447 52105 54835 47001 48078 77253 62106 48154
12240D8154K2862J2491J2167M658j3553k1314J986J0987m216O004K0203P854J1500
12227A19783n725m959M387Q994J7967j0012J0412k025J4042L9942L6839K0326
12215B49971L6379M1784O0078R1862J13604J08882J61402K05770K93058L56766
12205A719556L44799K05270j9742k14229l57541l62917k82739j67686j31460j22133
12195F11178p0673n7027l3190j4519l1562k5244m5790l4527j841M671k5926l3641
12183B41909k689p770N025j3889m0622l872J752m039M341l0900p871L124J8750
12170A63249R151Q802L6858j9292n223M569j0523j0110J2960Q078o168j0410k7196
12157A54745J2188M1795K2369R341L5026M6975N6511N8309P1228J17006J66907
$$ plain form
12240 48154 71016 83507 95674 100332 86779 65465 67451 78438 74222 80226 100429 108283 119783
12227 119783 114058 109099 113486 122480 140447 130435 140847 138822 152864 192806 229645 249971
12215 249971 286350 328134 388212 480074 593678 702560 863962 1069732 1362790 1719556
12205 1719556 2064355 2269625 2249883 2035654 1678113 1315196 1032457 864771 733311 611178
12195 611178 540505 483478 450288 435769 404207 378963 333173 298646 296805 301476 275550 241909
12183 241909 239220 231450 236475 222586 181964 178092 179844 175805 180146 149246 141375 144499 163249
12170 163249 172400 181202 218060 198768 193545 198114 187591 177481 190441 198519 192351 181941 154745
12157 154745 166933 208728 231097 240438 275464 322439 378950 437259 508487 625493 792400
12146G92400J96277J89066K21420K41455J57378J859j51224k82866k79649k20664
12136H65452j73782j18583o5862m7944m4993n5886k9141j6470k7022k4121j1265
12125B50383l1253r253j2285k1774L081J9660j3822j1634k6290j4598R118L1470
12113A72803J8748k2140J969j1567l9023j9783L635k6374K612L2006n897p372
12101I9617k790j4612k6424J2092k1383j7962L1632N223k1033j1314m634P711
12089C6123o624j0321o040k3237q369K2352L0472J0391j3941k4405r307J7921
12077A5015K4962N220m0003k0069J381p09J6812J6907O149K4054j0207J0721l523
12064D6710l471j076R163N885J8686K1680k1072k7476k7258j1890k235J7637K4417
$$ plain form
12146 792400 988677 1177743 1399163 1640618 1797996 1799855 1648631 1365765 1086116 865452
12136 865452 691670 573087 507225 459281 414288 358402 329261 312791 285769 261648 250383
12125 250383 219130 209877 197592 175818 178899 198559 184737 173103 146813 132215 141333 172803
12113 172803 191551 169411 171380 159813 120790 101007 104642 78268 80880 112886 106989 99617
12101 99617 96827 82215 55791 67883 46500 28538 60170 65393 44360 33046 28412 36123
12089 36123 29499 19178 13138 -10099 -18468 3884 34356 44747 30806 6401 -2906 15015
12077 15015 39977 45197 5194 -14875 -13494 -14203 2609 19516 25665 49719 39512 50233 46710
12064 46710 43239 42163 51326 57211 75897 97577 76505 49029 21771 9881 7646 25283 49700
12051D9700J4875J04j1321r920j6614q569p554J1790o669m782r110J152K6473
12038B9555J641K317K954j5290j2484j5618P016R508j6006N431K4638q20j3313
12025I529r942K0479o912p935m266J3236M624r037J7329q671P01r108J3669Q043
12011C1739j1351j4262J095R226q310N295l6978j4881K4916K7070O217o479J6025
11998B9322J2512m4191j4443k488k12j2358j5608K0456J9954j7993R15P268j1803
11985b8669K467K0452j0538j0385p508l708J0194L6860k7601r694Q136L793J7700
11972A499J2973J4141j716k9263k5423P891J8546J7173J6639O5k3897q915o527
11959f814j1550L5505J0754k2547k2372j7098L402J9378J4132p854N131J613J23
$$ plain form
12051 49700 64575 64679 53358 43438 26824 18255 10701 22491 15822 11040 1930 3082 29555
12038 29555 31196 33513 36467 21177 8693 -6925 91 9599 -6407 -976 23662 22842 9529
12025 9529 -413 20066 13154 5219 953 14189 18813 9776 27105 18434 19135 10027 23696 31739
12011 31739 20388 6126 7221 16447 8137 13432 -23546 -38427 -13511 13559 19776 13297 29322
11998 29322 41834 -2357 -16800 -19288 -19500 -31858 -47466 -27010 -7056 -25049 -24134 -16866 -28669
11985 -28669 -26202 -5750 -16288 -26673 -34181 -37889 -27695 9165 -18436 -28130 -19994 -16201 1499
11972 1499 14472 28613 26897 -2366 -27789 -19898 -1352 15821 32460 32525 8628 -287 -6814
11959 -6814 -18364 17141 27895 5348 -17024 -34122 -30720 -11342 2790 -5064 67 1680 1803
11946A803J1198J2361J3069j8877k1799J7253K6670Q818j4530J746L00k3592k951
11933A1469L642O772o999J1135J990L122q575n812j400p628l414k3604k835L539
11919a8598R916J1859M392q231l1114k0442L9273J2806r503q407K2163j1147j5206
11906b2239N93J0501N289j1194J7751K6063Q870k6193k2481j2657J286J5783j643
11893a0271O907O061j1181J0713R510o271j4662J8931r123o394Q571M89p055N520
11879A745K146O459j5381Q415K1000M265j8213r067r535K9441R809L587K1293
11866E5964j2904j9208j327M287k518o027k4193j1982j4857k071J4978J1176J0791
11853B109o963m990j3123L136Q389J3591q082K354L8471j821q94k017j4871J4276
$$ plain form
11946 1803 13001 25362 38431 19554 -2245 15008 41678 50496 35966 37712 38012 14420 11469
11933 11469 15111 21883 14884 26019 28009 31131 22556 16744 15344 7716 4302 -19302 -22137 -18598
11919 -18598 -8682 3177 7569 -662 -31776 -52218 -12945 -139 -9642 -18049 4114 -7033 -22239
11906 -22239 -21646 -11145 -5856 -17050 701 26764 35634 9441 -13040 -25697 -24411 -8628 -10271
11893 -10271 -3364 2697 -8484 2229 11739 5468 -9194 9737 614 -5780 2791 3280 -3775 1745
11879 1745 3891 10350 -5031 3384 24384 28649 10436 1369 -8166 21275 31084 34671 55964
11866 55964 43060 23852 22525 26812 24294 18267 -5926 -17908 -32765 -34836 -19858 -8682 2109
11853 2109 -4854 -9844 -22967 -19831 -11442 2149 -5933 -3579 34892 33071 32177 30160 15289 29565
11839B9565R948j0081j8459n413p975j9527j8978J0175J2203K205K2345J9210
11827B5218j6858o913j0676J474J2738m514j9954k721J6587K912M761o808L268
11814a486j809j0457q442O402J1441J1155O887J4191J385j6632j2178J9634M426
11801B4517j377l1106j5266N166J1077K3381J765l0951J795R183o701P844N532
11788D859Q961r527r455j0180L586p648O3O558J6322n533o409p432m933O378L3528
11773A9138r458K4056m734j3123q372j8378n432Q317j2198m629l021j6349K2283
11760b1900K8120K9142K50k2662n11m105N686R063O40P32k2212r88j4695q315
11746b1755Q294K715N629R058j9116k6113o962K4748J7687n821j996M104J6040
$$ plain form
11839 29565 39513 29432 10973 5560 -2415 -21942 -40920 -30745 -18542 -16337 6008 25218
11827 25218 8360 1447 -9229 -7755 4983 469 -19485 -22206 -5619 -2707 2054 -4754 -1486
11814 -1486 -3295 -13752 -22194 -15792 -4351 6804 13691 27882 29267 12635 457 20091 24517
11801 24517 23140 -7966 -23232 -18066 -6989 16392 18157 -12794 -10999 -1816 -8517 -673 4859
11788 4859 13820 4293 -5162 -15342 -11756 -19404 -19341 -12783 3539 -1994 -8403 -15835 -20768 -14390 19138
11773 19138 9680 33736 29002 15879 7507 -10871 -16303 -7986 -20184 -24813 -27834 -44183 -21900
11760 -21900 6220 35362 35612 12950 12439 8334 14020 23083 23723 24455 2243 1255 -13440 -21755
11746 -21755 -13461 -10746 -5117 3941 -15175 -41288 -48250 -23502 -5815 -11636 -13632 -9528 6512
11733F512k678J1170m407j4451j703J299k3298j3523L3928M7984k542l3893R670
11720A4068J9188j5306k6511r239K1706N836j1017j2845K5951J4539R494n232
11708C0632l4848L046m341R145J1748l0043K177J8794q6j69P276O606p721k2695
11694a0479R328j3442o676q536J0345J9366J3932Q922P017n633J1585L199j9010
11681A9918k3427q615k365J0304K3982r150j5396J6155J7065N579j8152j890k609
11668A1399L395o898j4972R20K6305R624k6306j4622K1556J6540K854K0700K7300
11655G7795j1218K2629M280m5792j6608L0325J245k3962J456K0593L298j7630
11643D6411J98J6277J6215k1756p558K7189L9614M1223J8859J8207M8031Q0360
$$ plain form
11733 6512 3834 15004 10597 -3854 -5557 -4258 -27556 -41079 -7151 40833 38291 4398 14068
11720 14068 33256 17950 -8561 -17800 3906 9742 -1275 -14120 11831 26370 35864 30632
11708 30632 -4216 -1170 -5511 3634 15382 -14661 -12484 6310 6224 6055 13331 19937 12216 -10479
11694 -10479 -1151 -14593 -21269 -29805 -19460 -94 13838 22760 29777 24144 35729 38928 19918
11681 19918 -3509 -12124 -14489 -4185 19797 10647 -4749 11406 28471 34050 15898 14008 11399
11668 11399 14794 7896 -7076 -6156 20149 29773 3467 -11155 10401 26941 29795 50495 77795
11655 77795 66577 89206 93486 47694 31086 61411 62656 38694 40150 60743 64041 46411
11643 46411 46609 62886 79101 57345 49787 76976 116590 157813 176672 194879 242910 323270
11631C23270J08663J69321K57023L76754N67714P43952N74463P8946m38144q11660
11621A950302o77310m23236k38244j27066r7703q0710l2350l6397j9491j0764
11611B07031o862k5970q975j1491Q458k3191j9455J1327J661k0568J5813M057
11599A31835j3274J3256J0299j1350k6997o346k0212n892K1609P312J5527j921
11587A13846m4361k1560k9607j3002R781N502o942o285k3004N162J2339j6719
11575a4850J1566K5290k378N134r145J60k9189R78K1827q405k5237K3318J1206
11562A0275j3293j7007k0577K2824L2331J165j6726K2437J2208K1534m3323J518
11550A3366O317K885m2124J2858J4773r856o878J719J4630K150k1311r970J1725
$$ plain form
11631 323270 431933 601254 858277 1235031 1802745 2546697 3121160 3200106 2761962 1950302
11621 1950302 1272992 849756 611512 484446 386743 306033 273683 237286 217795 207031
11611 207031 200169 174199 165224 153733 162191 139000 119545 130872 132533 111965 127778 131835
11599 131835 118561 131817 142116 130766 103769 97423 77211 71319 92928 100240 115767 113846
11587 113846 69485 47925 18318 5316 15097 20599 13657 7372 -15632 -10470 1869 -14850
11575 -14850 -3284 22006 19628 24762 15617 15777 -13412 -12434 9393 988 -24249 -931 10275
11562 10275 -3018 -20025 -40602 -17778 14553 15718 -1008 21429 33637 55171 11848 13366
11550 13366 19683 22568 -19556 -6698 8075 -1781 -8659 -6940 7690 9840 -11471 -21441 -9716
11537i716J7864K923P430M513n328J594J8461P242j1620R630j1637p044J6602
11524D0914J565j2264l4737q471q584J4747J8612n645j38l417J1399M905J7535
11511C6421L78j9862k3526k1147J0753L9453L4095l83j0632j4399O658J2464q869
11498D1404k2646j8709K0492J6967l088r867K661j3937k2446K759j5429j7371
11486c9210K920K0769j40m714j8386L416p064J4940K1197J6766j468j3439j8876
11473b3289Q630L1080K782k9654k0660M857J5827J737k945J6367l462j3335O843
11460e222N492J163j0759n134r016j2885L384K1952K3815j1379j1107k1334j4752
11447d5782j7705K5627L0747K3904K438j7590l3489l369J5758L6068J7981q248
$$ plain form
11537 -9716 8148 11071 18501 23014 17686 19280 37741 44983 33363 42993 31356 24312 40914
11524 40914 42479 30215 -4522 -12993 -21577 -6830 11782 6137 5999 2582 13981 18886 36421
11511 36421 36799 16937 -6589 -27736 -16983 22470 56565 56182 45550 31151 37809 50273 41404
11498 41404 18758 49 20541 37508 34420 24553 27214 13277 -9169 -6410 -21839 -39210
11486 -39210 -36290 -15521 -15661 -20375 -38761 -35345 -42409 -27469 -6272 10494 9026 -4413 -23289
11473 -23289 -14659 16421 19203 -10451 -31111 -26254 -10427 -8690 -11635 4732 1270 -12065 -5222
11460 -5222 270 1433 -9326 -14460 -23476 -36361 -32977 -11025 12790 1411 -9696 -31030 -45782
11447 -45782 -63487 -37860 -7113 16791 19229 1639 -31850 -35219 -19461 16607 34588 26340
11435B6340k6139m2235R410J1385K0123P742p21K932j4528o111j7132r868J8361
11422b0441R092k156J5452K8144J6159k9546p732k471j5748l874K8461N215n397
11409A5158O270n041j4912o101n583l458k3686m315L0208K6463k5200k3019R281
11396b3935K257k4293J97J7703N144o467o726N199J0725J7739K0593L904j7192
11383D848R705J2385M980L597j615Q273m479j0154J3454K24k6250L343n591j3122
11369d02K5776J0597j3124N30j3027j9770j3397K3400L217n83j8168K816l580
11356a5715p770N498J8096k5127N160K33r515O767j5344O49R293K4427j8079k5268
11342d6695J5701J9567J4040K4964K930l510k0071N83j472J9329K883P70K4567
$$ plain form
11435 26340 201 -42034 -32624 -21239 -1116 6626 5905 8837 -5691 -11802 -28934 -38802 -20441
11422 -20441 -11349 -13505 1947 30091 46250 16704 8972 6501 -9247 -13121 15340 20555 15158
11409 15158 21428 16387 1475 -4626 -10209 -13667 -37353 -41668 -11460 15003 -10197 -33216 -23935
11396 -23935 -21678 -45971 -45774 -28071 -22927 -29394 -36120 -30921 -20196 -2457 18136 22040 4848
11383 4848 14553 26938 31918 35515 33900 42173 37694 27540 40994 41218 14968 18311 12720 -402
11369 -402 25374 35971 22847 23377 10350 -9420 -22817 583 3800 3217 -14951 -12135 -15715
11356 -15715 -23485 -17987 109 -25018 -19858 -19625 -29140 -22373 -37717 -37068 -27775 -3348 -21427 -46695
11342 -46695 -30994 -11427 2613 27577 30507 26997 6926 7509 6037 25366 28249 29019 53586
11329E3586j8077l4090r583j0383j367K3657J4237n178k1275j5211l33J9314L695
11316a008r718K768k601P393J5775j095J3255j4650j0641n209j888K3508K4687
11303D0576J942l269k660j1939K149k6006m9676j276M154K2758n615o81K5229
11290d314l33j7485J743M126J4584R842r578R109R099R971l298L096l5770k5584
11276c4792J1121P464Q890n787j6562J0013N170J4105l502J3106n888r135L443
11263b354L841N491J5055j1896j350j6356j0508k5315m946j3577R32J2671O512
11250d1800J0336J1401K0473J5172j827l6857j7932J2288Q284j5436K3117L2476
11238A9695r098r914L331J6644j0170J099m884o704J2080J2283O109l2293k8284
$$ plain form
11329 53586 35509 1419 -8164 -18547 -19914 3743 17980 12802 -8473 -23684 -24017 -4703 -1008
11316 -1008 -10726 -7958 -10559 -3166 12609 11514 24769 10119 -522 -5731 -7619 15889 40576
11303 40576 42518 39249 36589 24650 26799 793 -48883 -50159 -46005 -23247 -28862 -29543 -4314
11290 -4314 -4647 -22132 -20389 -16263 -1679 8163 -1415 7694 16793 26764 23466 26562 -9208 -34792
11276 -34792 -23671 -16207 -7317 -13104 -29666 -19653 -14483 -378 -3880 9226 3338 -5797 -2354
11263 -2354 1487 6978 22033 10137 8787 -7569 -18077 -43392 -48338 -61915 -60983 -48312 -41800
11250 -41800 -31464 -20063 410 15582 13755 -23102 -41034 -28746 -20462 -35898 -12781 19695
11238 19695 10597 683 4014 20658 10488 11587 6703 -1 12079 24362 30471 -1822 -30106
11225c0106J2821q850J9582J0836R291q909q549p414J1598K0241l854j9685Q467
11212E469r52RN556k4927k6658j7710K723J0642K4053J8287l918J858j6333J5255
11198f646L2117l2150l9795J516R942j5760P87M2204J3918Q647J3773p635j3878
11185G040j3754j7875Q683n981K1047K3025q356j2988j781P919m129J1685k069
11172A2466k8972M737K5363L80j5686m682j0003o714K9299P705K2464J1364j8249
11159B9472j7892k8129j4019K091l735M579J4445R962N740N236q332l0763p546
11146c8891K86O348M990O490J0449l934k3259J132K0491K5250n339J5649K7229
11133D6891j5013k2964j769J357q830J0655j6403K9205K729l0251k3376J5808
$$ plain form
11225 -30106 -17285 -26135 -6553 4283 13574 4665 -3884 -11298 300 20541 16687 -2998 5469
11212 5469 4517 4526 10082 -14845 -41503 -59213 -56490 -45848 -21795 -3508 -7426 -5568 -21901 -6646
11198 -6646 25471 -6679 -46474 -44958 -35016 -50776 -49989 -7785 6133 14780 28553 20918 7040
11185 7040 -6714 -24589 -15906 -21887 -840 22185 13829 841 -940 6979 2850 14535 12466
11172 12466 -16506 -11769 13594 13974 -1712 -6394 -16397 -23111 6188 13893 36357 47721 29472
11159 29472 11580 -16549 -30568 -28477 -32212 -27633 -13188 -3226 2514 7750 -582 -31345 -38891
11146 -38891 -38605 -32257 -27267 -20777 -10328 -14262 -37521 -36389 -15898 9352 4013 19662 46891
11133 46891 31878 8914 7145 8502 -328 10327 -6076 23129 25858 -4393 -27769 -11961
11121a1961J8880j1188k869j7287J9652n85j8630J915J0428K6268j7244l454O440
11108C65j3494K5398L7111j2552P172q778k2500j2329j43o779k595K794J2238
11095E908K3876k0960l0145j4132N321K5972L1319P300j4449j2187J3959J1887
11083C3669j5760l1942K860r90P335J956R899j3459l91J2139L848R033J2087J2468
11069D2752j0109j7153p478o147m870K1950K7490j8801r300l831k2798k6448k8332
11056f3075K7226L9001J977j7099O042J153J1295J3864o624j4682j432P304J7072
11043B2022K1247N216j4443r267J8782J6583j6901R422K4641K3564K6463J8128
11031A45457j3495L093j1964l1835m213J4037J5988Q341k0701M6181N2052R920
$$ plain form
11121 -11961 6919 -4269 -7138 -24425 -4773 -5358 -23988 -22073 -11645 14623 -2621 -6075 365
11108 365 -13129 12269 49380 36828 44000 35222 12722 393 250 -6529 -9124 -6330 5908
11095 5908 29784 8824 -21321 -35453 -30132 -4160 27159 34459 20010 7823 21782 33669
11083 33669 17909 -14033 -11173 -12163 -4828 -2872 7027 -6432 -6823 5316 9164 18197 30284 42752
11069 42752 32643 15490 8012 1865 -3005 18945 46435 27634 18334 14503 -8295 -34743 -63075
11056 -63075 -35849 3152 5129 -11970 -5928 -4775 6520 20384 13760 -922 -2354 4950 22022
11043 22022 43269 48485 34042 24775 43557 60140 43239 52661 77302 100866 127329 145457
11031 145457 131962 135055 123091 91256 87043 101080 117068 125409 104708 150889 202941 212861
11019B12861j4018j5327j5602k5032k9121j7317k3377j9225M992J5424J949J0613
11007H6820L19J3867K365k3916r222k747L801J7382j2677j3562k215K4089n643
10994G8661k4170J4823K5398k702j6098k6743l4247j8403J7022J69J3456K2135
10982D9301j6073l2945m6016R775k057J0828J7698R597K2080N920J8702j96j6993
10969B9621j7831j3922p065K3984j1884k3942L000L0357j8921r433R761k2379
10957b8654J7402J7096R076P190K1029O182j2765K7314p014o491k8197k1044K2638
10944B3762J8707j9871j9182K214k3478j9296J8746J2382K4955J4592j0370j0174
10932A2987J1814L124j9922m0665J0332J7736J050p308j9137l927J7476L7747
$$ plain form
11019 212861 198843 183516 167914 142882 113761 96444 73067 53842 58834 74258 76207 86820
11007 86820 87139 101006 103371 79455 70233 67486 71287 88669 75992 62430 60215 84304 78661
10994 78661 54491 69314 94712 92010 75912 49169 14922 -3481 13541 13710 27166 49301
10982 49301 33228 283 -45733 -35958 -38015 -27187 -9489 108 22188 28108 46810 46614 29621
10969 29621 11790 -2132 -9197 14787 2903 -21039 -18039 12318 -6603 -16036 -6275 -28654
10957 -28654 -11252 5844 14920 22110 43139 49321 36556 63870 56856 50365 22168 1124 23762
10944 23762 42469 22598 3416 5630 -17848 -37144 -18398 -6016 18939 33531 23161 12987
10932 12987 24801 27925 8003 -32662 -22330 -4594 -3544 -10852 -29989 -33916 -16440 21307
10920B1307J2763k9979L138j3939J509r59J3306P480p109N256L468k0889j1362
10907a6010k3750n727J4667p242l701k7621q780L8901L8162J6934J1975k5356
10895B452j3431o654k5710l306m601K4933K6107o483J2063K50j3213L9455K2623
10882E4485j0814k1176J376L0282J0508n625N670k549k7037J5627K584l6213J1605
10869B8723j9648k2265j3577o734Q776k076n543N289L3142K5856k693j7129j1594
10856E27L458Q047J7350K546r708o275L880J7193k5237N233K5597j665k7020o997
10842F929Q72J8762L3225j755l1328K099J435l2956L0165L5839j3241j8935o084
10829B5027K758Q265K0408J137k8159m784j7634J3809Q025J4230J2483O665L648
$$ plain form
10920 21307 34070 4091 7229 -6710 -5201 -6160 7146 14626 7517 12773 16241 -4648 -16010
10907 -16010 -39760 -45487 -30820 -38062 -41763 -69384 -78164 -39263 -1101 15833 27808 2452
10895 2452 -10979 -17633 -43343 -46649 -51250 -26317 -210 -6693 5370 5620 -7593 31862 54485
10882 54485 43671 22495 23871 54153 64661 59036 64706 62157 35120 50747 53331 17118 28723
10869 28723 9075 -13190 -26767 -33501 -24725 -26801 -32344 -27055 6087 31943 29250 12121 527
10856 527 3985 12032 29382 31928 22220 15945 19825 37018 11781 17014 42611 40946 13926 6929
10842 6929 7801 26563 59788 58033 26705 28804 30239 -2717 27448 63287 50046 31111 25027
10829 25027 27785 36050 56458 57595 29436 24652 7018 20827 28852 43082 55565 62230 65878
10816F5878p232k5163j9988q307j4054j4559N888K2819o069K4951J7349J0974
10804E2487j5517j0552J4588k0313o696K0939K3399k796o214j5659j0914P495
10792C0247q937l759m349l0097j5732L8208P859j6384j5836N039K852O802J0053
10779E966J3008J4299l505l214k847M0023O784l9987k0236L730R269J1764m211
10766C0843J610n078j7963M711J1792L860j2157J5205J516j5555R747J4081J4108
10753E6720j5831j8223L756l888r878J8968k509P528L7126J9164N428j1773j1947
10740G4641n531k667J9201j8777k2110K1905J0530J4974J7551K6199J1564J0953
10728A58433Q191j3814l1240j4128n871j2877J322J7996K0200K6135J1084J2780
$$ plain form
10816 65878 58646 33483 13495 5188 -8866 -23425 -17537 5282 -787 24164 41513 52487
10804 52487 36970 26418 41006 20693 13997 34936 58335 55539 49325 33666 22752 30247
10792 30247 21310 17551 13202 -16895 -32627 5581 13440 -2944 -18780 -13741 -10889 -4087 5966
10779 5966 18974 33273 29768 26554 23707 63730 70514 30527 10291 14021 23290 35054 30843
10766 30843 32453 27375 9412 14123 25915 29775 17618 32823 34339 18784 28531 42612 56720
10753 56720 40889 22666 26422 22534 12656 31624 29115 36643 73769 92933 98361 86588 74641
10740 74641 69110 66443 85644 66867 44757 66662 77192 92166 109717 135916 147480 158433
10728 158433 166624 152810 121570 107442 101571 88694 90016 108012 128212 154347 165431 178211
10716A78211o723n74l0203k3221m6942j2989J0922N0301M2276j895j3902p628
10704A37633K775k3624q179j7105J297O823j8793k0017m28O0525J2567j8528m888
10691A10058R956j5550k356J733k566j564N001L6166M5770m979m0323j3105o370
10678A21871J2283J8000M555Q26j6643o743K9891J6978j3217N678M765K2640J5769
10665B16653l2081q239M3752J2254M994J9915K0783j5246k5502k3612J2900K7966
10653B54537J2898J5721J3769P019J5940r691R42q973K7479L1423J2738J2407
10641C86209Q395L8815K5862J7625K0523K7647K5537M2026M2791N3330O7769P5947
10629H32476O7789P2160J26332J24728J50020J85241K12242K88154L76303N15299
$$ plain form
10716 178211 171488 170914 140711 117490 70548 57559 68481 118782 161058 159163 145261 137633
10704 137633 140408 116784 108605 91500 92797 99620 80827 60810 60382 120907 133474 114946 110058
10691 110058 120014 104464 102108 103841 101275 99711 104712 140878 186648 181669 141346 128241 121871
10678 121871 134154 152154 156709 157535 140892 134149 164040 181018 167801 173479 178244 200884 216653
10665 216653 184572 176333 220085 232339 237333 257248 278031 262785 237283 213671 226571 254537
10653 254537 267435 283156 296925 303944 319884 310193 311135 302162 329641 361064 373802 386209
10641 386209 394604 433419 459281 476906 497429 525076 550613 592639 635430 688760 756529 832476
10629 832476 900265 972425 1098757 1223485 1373505 1558746 1770988 2059142 2435445 2950744
10619B950744O53077Q23373R99105J188430J285699J206356Q89607M49023O1612
10610A0507026r5485q438K69550O92635J196645J736151K214562K481388K210002
10601B1204036J278867P6325q76778j240736r90238l65110M78062J320810K085741
10592B2970979K728632K897403K263373P51052j118154k471621k878934k463850
10584B2678880j651346p50293R3584P51622J220491J314242Q02438k68026j471546
10575B2720046k290067k447868k094893j495369q93237m17192o4462J45382J16921
10566A3279261j38181n66002r89958j284291j346581j215021r94152p93636o28119
10557E323320m87940l70119k80609k47049k28186k18204j72365j49746j65397
$$ plain form
10619 2950744 3603821 4427194 5426299 6614729 7900428 9106784 9996391 10445414 10507026
10610 10507026 10411541 10403103 10672653 11365288 12561933 14298084 16512646 18994034 21204036
10601 21204036 22482903 22559228 21682450 20441714 19451476 19086366 19564428 20885238 22970979
10592 22970979 25699611 28597014 30860387 31611439 30493285 28021664 25142730 22678880
10584 22678880 21027534 20277241 20370825 21122447 22342938 23657180 24459618 24191592 22720046
10575 22720046 20429979 17982111 15887218 14391849 13498612 13081420 13016958 13162340 13279261
10566 13279261 13141080 12575078 11585120 10300829 8954248 7739227 6745075 5951439 5323320
10557 5323320 4835380 4465261 4184652 3937603 3709417 3491213 3318848 3169102 3003705
10548C003705j72129j63973j47555j40272j09109q9345j18267j25234j03700j20806
10538A713315j06651p5217r2238q1859o5223o0354p5233n0321n9915n5987l1024
10527I59293n3771o0218n8229o1113j8596m7783m4658l6262m1180k8991j3280
10516D95212j4274o518j7347j0968l9429m1927n0949j7524j1493O226J793k5015
10504B67787k6935K446p246o787k8228l088K7246j7279l2817n132M211l830K119
10491A72467J0849N882L68k5972p053K2035j1598n528q703n684r885K125j4977
10478A24326k7301K681k759j2887l791J1239J2847n683J0264K0512p804M747l0554
10465I5837j4838m450k1716p043p080J9705K1638K808k0746k3931J0787j304q697
$$ plain form
10548 3003705 2831576 2667603 2520048 2379776 2270667 2181322 2063055 1937821 1834121 1713315
10538 1713315 1606664 1531447 1439209 1357350 1292127 1231773 1156540 1106219 1046304 990317 959293
10527 959293 905522 845304 787075 725962 707366 659583 614925 578663 537483 508492 495212
10516 495212 480938 474420 457073 446105 406676 364749 313800 296276 284783 291009 292802 267787
10504 267787 240852 243298 236052 229265 201037 197949 225195 207916 175099 169967 174178 170348 172467
10491 172467 183316 189198 189566 163594 156541 178576 166978 161450 152747 147063 137178 139303 124326
10478 124326 97025 99706 96947 84060 80269 91508 104355 98672 108936 129448 121644 126391 95837
10465 95837 80999 76549 54833 47790 40710 60415 82053 84861 64115 40184 50971 49667 40970
10452D0970P059j936k8337P689R771N165j8785j2801J9619Q107J4419o898j2334
10439C1708j6559n032O847K5294L3237j5643k9098L354l210p076J9693j7749p136
10426A8630L167N530M0152J930J2981o999k7464J245p04R575j9537n051M6r31
10412C2570o845j327O775Q445J2261j3896k8018n946K988J1859m86k458q830n820
10398A272m213p223j076J099J0159l464Q826J919l3207O6J0669N921J232J5292
10384G272J0756R821k063L428J1998K0546J6475j8173j2027k3050o095j1481J8195
10371B5602J650j2546m695k3057j1467J4385p780L539j8036K2378j896k939J5379
10358E17J2245j3206q029n387n968J0724J7390J0156j7374j4292N19K627K2971
$$ plain form
10452 40970 48029 46093 17756 25445 35216 40381 21596 8795 28414 36521 50940 44042 31708
10439 31708 15149 10117 16964 42258 75495 59852 30754 34108 30898 23822 43515 25766 18630
10426 18630 21797 27327 67479 69409 82390 75391 47927 49172 48468 58043 38506 33455 33501 32570
10412 32570 25725 24398 31173 39618 51879 37983 9965 4019 7007 18866 18380 15922 7092 1272
10398 1272 -2941 -10164 -11240 -10141 18 -3446 5380 7299 -25908 -25842 -15173 -9252 -8020 7272
10384 7272 18028 27849 25786 29214 41212 61758 78233 60060 48033 24983 18888 7407 25602
10371 25602 27252 14706 10011 -13046 -24513 -10128 -17908 -14369 -32405 -10027 -11923 -14862 517
10358 517 12762 -444 -8473 -13860 -19828 -9104 8286 18442 1068 -13224 -12705 -10078 12893
10345A2893M337p124j0244q915j5135J2479L9130M198j2744m201j7522j617J235
10332c230O682K4262R97l204r325r090p070K83L6340M320l6494l189j928J7994
10318A7348j151k2388j6397J5235k488j6940L25J7039R537n378p858l406J89r489
10304b5822k7904j1189J6525R536l050K8139q360p795p010M600M2601N723j5869
10291A25q674P686q418P170J2934j4402M854R908O49j3261k3186J5317N525k8872
10277c2645L237J6610P496J1711j0814j3829M218J3387j1990p339p494p129J3715
10264b0866K0547J1892p10j1421j6389J6150K1736Q047j1284p709k512L741m97
10251A0725K0424J4717l0178l5720j5600k8294q109M906J2620J1212o777J8824
$$ plain form
10345 12893 17230 10106 -138 -9053 -24188 -11709 27421 31619 18875 14674 -2848 -4465 -3230
10332 -3230 3452 27714 28711 25507 16182 7092 22 305 36645 40965 4471 1282 -646 17348
10318 17348 16197 -6191 -22588 -7353 -9841 -26781 -26456 -9417 120 -5258 -13116 -16522 -16333 -25822
10304 -25822 -53726 -64915 -48390 -38854 -41904 -13765 -22125 -29920 -36930 -32330 10271 15994 125
10291 125 -8549 -863 -9281 -2111 10823 -3579 1275 11183 11832 -1429 -24615 -9298 -3773 -32645
10277 -32645 -29408 -12798 -5302 6409 -4405 -18234 -14016 -629 -12619 -19958 -27452 -34581 -20866
10264 -20866 -319 11573 10863 -558 -16947 -797 20939 28986 17702 9993 7481 11222 10725
10251 10725 31149 45866 15688 -20032 -35632 -63926 -72035 -67129 -54509 -43297 -50074 -31250
10239c1250L2281p574q9j2474k5353k1738m402L0289O780R618j907j5434p102
10226d8355K8347J3752j6710m764R146R361L677j2357k1275j1509l317J0407K0426
10213b3171j0803O8K8209K2596P193j2570j3005j5012j9136M747N561k2594L0613
10200a7304J1097j6593k7407J0493P722Q458l56K481k3817J1184J2185q84J882
10187b0859o181M0781R401j1145k989N903r450J2826K9524Q826j4418j9895Q152
10174C0476l038j4338J2429K5665J6626J5574O982n202J3559J9801K8124K517
10162A49175q040k2072j1092j0908J398J6941J1160N990m181k02J4403k601k9514
10149A10457n3593k2629J5696L0768J4393n41O473L7450j0727J0835Q385j9967
$$ plain form
10239 -31250 1031 -6543 -6632 -19106 -44459 -66197 -70599 -40310 -33530 -23912 -25819 -41253 -48355
10226 -48355 -20008 -6256 -22966 -27730 -18584 -9223 -5546 -17903 -39178 -50687 -54004 -43597 -23171
10213 -23171 -33974 -33906 -5697 16899 24092 11522 -1483 -16495 -35631 -30884 -25323 -47917 -17304
10200 -17304 -6207 -22800 -50207 -39714 -31992 -23534 -23890 -21409 -45226 -34042 -21857 -22741 -20859
10187 -20859 -27040 13741 23142 11997 9008 14911 5461 18287 47811 56637 42219 22324 30476
10174 30476 27438 13100 25529 51194 67820 83394 90376 85174 98733 118534 146658 149175
10162 149175 141135 119063 107971 97063 98461 115402 126562 132552 128371 128169 142572 139971 110457
10149 110457 56864 34235 49931 80699 95092 94551 101024 138474 127747 138582 146967 127000
10137A27000l5006p118j4300j9584p589m900J6501J1397n019J7575l0850m1105
10125G002j1121M695J5263R516K8898j4591k9184o129J8055M2138L909j8654k0974
10112B8823j7458q53o982j4848K678j2589N80J3174M108J0820j0475j3060L222
10099a2860J1108J6013n579j3118R729R156o06j9094j5410O249J5474L558l3026
10086b8406l189J2160K989j050k6965o021M176J0126j9070R67K5869P517L855
10073a7042r464k3566o940J2281K4221J6796p800J642j2921l587J7908j0604k5031
10060d4107j0173L1475Q274N368r110j1302j5246N237L944L270N56J201k88J4984
10046a5917J2570K6707J5716P638j0335J8128l0234m5481j4670N882J2758q718
$$ plain form
10137 127000 91994 84876 70576 50992 43403 38503 55004 66401 61382 78957 48107 7002
10125 7002 -4119 576 15839 25355 54253 39662 10478 4349 22404 64542 68451 49797 28823
10112 28823 11365 10512 3530 -11318 -8640 -21229 -20649 -7475 -3367 7453 -3022 -16082 -12860
10099 -12860 -1752 14261 8682 -4436 5293 14449 13843 -5251 -20661 -14412 1062 4620 -28406
10086 -28406 -31595 -19435 -16446 -17496 -44461 -50482 -46306 -36180 -55250 -54283 -28414 -20897 -17042
10073 -17042 -26506 -50072 -57012 -44731 -20510 -3714 -11514 -9872 -22793 -26380 -8472 -19076 -44107
10060 -44107 -54280 -22805 -14531 -9163 -18273 -29575 -44821 -39584 -35640 -32370 -31814 -30613 -30901 -15917
10046 -15917 -3347 23360 39076 46714 36379 54507 24273 -21208 -35878 -29996 -17238 -25956
10034b5956k3136q686K238J57K334J5182J3733J0400p008k3549L355K8738k794
10021a4992q533P692j5246m234J6458J6126j9815p187J3605J1929K874J5290J9839
10008C3806j0806k7250Q5K5052j9158l942m933k0161J144j4379o253J2084M6446
9995A1735o762j8515R1k4336K1002J1537k5258Q995k12q53J937K5q233p764j3698
9980e0309p660M762J8959J6701Q426L27j1942K205K2557O220r231J6202L006k0898
9966f75j6678j8853J1656K2191p116k411M833j2393K0510l932k0020j735K542
9953b2081k401j062J717J133m864Q600J6682L834j0821K889k0101k1601K5383
9940b2693K0310K291j9361l4652l758L3530M259J3999p838j6030J3145K8302L1215
$$ plain form
10034 -25956 -49092 -57778 -55540 -55383 -53049 -37867 -24134 -13734 -20742 -44291 -40936 -12198 -14992
10021 -14992 -23525 -15833 -31079 -35313 -18855 -2729 -22544 -29731 -16126 -4197 -1323 13967 33806
10008 33806 23000 -4250 -4165 20887 1729 -2213 -7146 -27307 -26163 -40542 -46795 -34711 11735
9995 11735 4973 -13542 -13451 -37787 -16785 -5248 -30506 -21511 -21723 -22576 -20639 -20614 -28847 -36611 -50309
9980 -50309 -57969 -53207 -34248 -17547 -9121 -8794 -20736 -18531 4026 10246 1015 17217 20223 -675
9966 -675 -17353 -36206 -24550 -2359 -9475 -11886 -7053 -19446 1064 -2868 -22888 -24623 -22081
9953 -22081 -24482 -25544 -23827 -22694 -27558 -18958 -2276 1558 -9263 -6374 -26475 -48076 -22693
9940 -22693 -2383 -92 -19453 -54105 -57863 -24333 -20074 -6075 -13913 -29943 -16798 11504 42719
9927D2719k0043l1623j2117L2799J6370p539k4933l051J807j6599l3780J8078
9915c7912K3538Q431j2801j8372r065k057K3307O275O879K5821K4152k24k5156
9902A2816j4503P215J8515r662l4999j2056k297K826k9616K9304O834J8712J5780
9889H869k069J0239P439k4091k242N379k8112j6951P495J1465o874M779j9210
9876d3884J303J1246O718o037K018J6422L402k0236j8513l592L4640N822O42K551
9862g498j3955n9L1263J6988r798j672r459L798j894J3581P294O23j3614j1623
9848C975j1013q543Q969l65P908r071p518R342K2r96n089J3292J5886o429j5540
9833e170J2301J4845m835r251n539j8815M69J1868j1088k6676J0232L353j2988
$$ plain form
9927 42719 22676 -8947 -21064 11735 28105 20566 -4367 -7418 -5611 -22210 -55990 -37912
9915 -37912 -14374 -5943 -18744 -37116 -46181 -48238 -24931 -18656 -11777 14044 38196 37972 12816
9902 12816 -1687 5528 24043 14381 -20618 -32674 -34971 -32145 -61761 -32457 -25623 -6911 8869
9889 8869 6800 17039 24478 387 -1855 3524 -24588 -41539 -34044 -22579 -29453 -24674 -43884
9876 -43884 -42581 -31335 -24617 -30654 -28636 -12214 -8812 -29048 -47561 -51153 -16513 -10691 -10049 -7498
9862 -7498 -21453 -21512 9751 26739 16941 15269 5810 9608 7714 21295 28589 29212 15598 3975
9848 3975 -7038 -15581 -6612 -6977 931 -8140 -15658 -6316 -6294 -7290 -12379 913 16799 10370 -5170
9833 -5170 7131 21976 17141 7890 2351 -16464 -15995 -4127 -15215 -41891 -31659 -28306 -41294
9820d1294K0300P583N533j271K832R808N405M274r738J83o036j5092j0970L6032
9806G549J2103j0434j7556k1024M541l548j1109j4683P178J3570R289r254j9662
9793e3040M627K4126K7044j4386k0614L416o427m719J7260K7162K8423l314k6880
9780B678J1691Q936o310K812N185n143k2583l570J9383M282K0869j3182k2745
9767B303j1925N706j8791j2452J6461M720l222k1228j5008n21n45l745n084R769
9753e3562j936n203K3521L006o174r754J4352K2850R805j5903j2990P036o578
9740c1530j4258j806Q365K9714P38j4880j016p774p892J504P532J3881J205K581
9726a3636m627n069J0978j1843k1675K3284K7260j30j0719j6066j927p431P943
$$ plain form
9820 -41294 -20994 -13411 -7878 -9149 -6317 3491 8896 13170 3432 3615 -2421 -17513 -28483 7549
9806 7549 19652 9218 -8338 -29362 -24821 -28369 -39478 -54161 -46983 -33413 -24124 -33378 -53040
9793 -53040 -48413 -24287 2757 -11629 -32243 -28827 -35254 -39973 -22713 4449 32872 29558 2678
9780 2678 14369 23305 16995 19807 24992 19849 -2734 -6304 13079 17361 38230 25048 2303
9767 2303 -9622 -3916 -22707 -35159 -18698 -13978 -17200 -38428 -53436 -53957 -54502 -58247 -63331 -53562
9753 -53562 -55498 -60701 -37180 -34174 -40348 -50102 -35750 -12900 -3095 -18998 -31988 -24952 -31530
9740 -31530 -45788 -47594 -39229 -9515 -8777 -23657 -24673 -32447 -40339 -38835 -31303 -17422 -16217 -13636
9726 -13636 -18263 -23332 -12354 -24197 -45872 -22588 4672 4542 -6177 -22243 -24170 -31601 -23658
9713b3658J1371q21l046R813n103O405q172R940J383J0769J5422k2785o967j0558
9699a6007L414Q036L0767j0036j2071m752n850j6693K586l359J4466K0925J4755
9686B6181J1058O083k1784o567j362j9654j3107J0287M110K94j7619j5471K1310
9673a6241j0238j6698l518n27L0985j155j3374P634j2160l133n62O078j863n954
9659d0726j9415J4883Q298l212J0860Q629R047R6J5521J2133J5151L1400K6837
9646H9502N0523j4065n2469k1198l9848l4582p674O109K048L029j0597k571L8269
9633F476J8118k9406j4382o121J5753J6182M745o855Q42j5073j1983j864J2182
9620a1386r930J3369l560N706J1292K084Q89j2903j5077j7417O854J1905J204
$$ plain form
9713 -23658 -12287 -13108 -16154 -6341 -11444 -5039 -13211 -3271 -1888 8881 24303 1518 -5449 -16007
9699 -16007 -12593 -4557 26210 16174 4103 -649 -6499 -23192 -20606 -23965 -9499 11426 26181
9686 26181 37239 43322 21538 14971 13609 -6045 -19152 -8865 -4755 -4461 -22080 -37551 -16241
9673 -16241 -26479 -43177 -46695 -47222 -16237 -17392 -30766 -23132 -35292 -38425 -38987 -32909 -34772 -40726
9659 -40726 -60141 -45258 -36960 -40172 -29312 -20683 -11636 -11540 3981 16114 31265 62665 89502
9646 89502 140025 125960 73491 52293 12445 -22137 -29811 -23702 -21654 -18625 -29222 -31793 6476
9633 6476 24594 -4812 -19194 -25315 -9562 6620 11365 4510 5352 -9721 -21704 -23568 -11386
9620 -11386 -21316 -7947 -11507 -5801 5491 7575 8464 -4439 -19516 -36933 -30079 -18174 -16970
9607a6970M608J0927j771j103q451p871q730j1588o206J3594J0488J8158j4835
9594a9750R660j279j9046j4443j8116J5702M6659K7853l072M925j804j0743k5689
9581i143j8489P971k361J4840Q740Q194m599j4446Q469J083r654J0251l737o35
9567c516J0158l1939K631L0993K5630j1215j1565j9956j4969K5458O063l0206
9555b2433k5921M265R883M136J2607j059q761o225m244J1599O829j2281j6634
9542d8239O265L0529K2971j5024j0693j105K094J5942J7261k8384k0321q404Q03
9529c6305J2968J2625J4276K2759j7167j5284J3762l277j7130n088p288O351J6223
9516b575J2606M487O961K195l333K3634R014l0191j3862k8203m443N984L7292
$$ plain form
9607 -16970 -12362 -1435 -3206 -4309 -12760 -20631 -29361 -40949 -47155 -33561 -23073 -4915 -19750
9594 -19750 -10090 -11369 -30415 -44858 -62974 -47272 -613 27240 24168 29093 27289 16546 -9143
9581 -9143 -27632 -19661 -22022 -7182 1558 9752 5153 -9293 -824 259 -9395 856 -2881 -3516
9567 -3516 6642 -25297 -22666 8327 33957 22742 11177 -8779 -23748 1710 7773 -22433
9555 -22433 -48354 -44089 -34206 -30070 -17463 -18522 -27283 -33508 -37752 -26153 -19324 -31605 -48239
9542 -48239 -41974 -11445 11526 -3498 -14191 -15296 -13202 2740 20001 -8383 -28704 -37108 -36305
9529 -36305 -23337 -10712 3564 26323 9156 -6128 7634 4357 -12773 -17861 -25149 -18798 -2575
9516 -2575 10031 14518 21479 23674 20341 43975 52989 22798 8936 -19267 -23710 -17726 19566
9503A9566P679k3260l9637L303J5835K0850L371j4447O184k2998j2321J1502n822
9490c0195l770J533J2693M1296R472l933j0675q060k1178m689K0319r024K8518
9477B2307J1155k8375J5186j6685n169K466m698J9072L0429k2935j4446L301n657
9464E951k9515j7743n750P122J3135J9648K5211J8753k041n2997k8845R268J8706
9451a9097k40Q286p996L380q315K309J3977N75p4J0460j7521K9211k307j6732
9437d084L6891K4414j2806o581o843l4070j7049M853O785J2073j3534k4387K1461
9424a2877K9753L702j9908n411J3511q821j8299M751q137J1183P478J1979j4868
9411e964J6226j5216j2406n763j2727L840K5286J6940n88Q38k9110k2740j46K8603
$$ plain form
9503 19566 27245 3985 -35652 -32349 -16514 4336 7707 -6740 -556 -23554 -35875 -24373 -30195
9490 -30195 -33965 -32432 -19739 21557 31029 27096 16421 8361 -12817 -17506 2813 -6211 22307
9477 22307 33462 5087 20273 3588 -1581 885 -3813 15259 45688 22753 8307 11608 5951
9464 5951 -23564 -41307 -47057 -39935 -26800 -7152 18059 36812 34771 -18226 -47071 -37803 -19097
9451 -19097 -19337 -11051 -19047 -15667 -23982 -21673 -7696 -7121 -7195 3265 -14256 14955 12648 -4084
9437 -4084 32807 57221 44415 37834 30991 -3079 -20128 -15275 -8490 3583 -9951 -34338 -12877
9424 -12877 16876 20578 670 -4741 8770 -51 -18350 -13599 -21736 -10553 -3075 8904 -5964
9411 -5964 10262 -4954 -17360 -23123 -35850 -32010 -6724 10216 9628 10466 -18644 -41384 -41530 -12927
9397a2927Q74j4905n993J1634J866j4809q94J7119R900J1399O739j682l014k6073
9383b0766O668K4493l4033p081M211J1397K2610R814k7390k1254J6413J8467k8276
9370b4727j5562N067p316r470Q784M0196j1575l0087k417Q376J6868j6103J6302
9357b1664K7387j752j8768j4655j0910O883K0121P322k0060j2261k0373J920K6500
9344c0310O202j7739o709J9725J9694J6309j963j511Q300J621m0194m727J3137
9331a8165q380K408l91N310j1291J1768K7198K1257j8069k0872n662q365L663
9318a9591P261K697L024J1041M213j6383o484k4753m425j1782p130P96M7063j6835
9304c1288q092K3236J0784Q105K5824j2104j2181k0461p547K836J93Q402R828
$$ plain form
9397 -12927 -12053 -26958 -32951 -21317 -19451 -34260 -35154 -18035 -8135 3264 10003 8321 5307 -20766
9383 -20766 -14098 10395 -23638 -30719 -26508 -15111 7499 17313 -10077 -31331 -14918 3549 -24727
9370 -24727 -40289 -35222 -42538 -52008 -43224 -3028 -14603 -44690 -47107 -38731 -21863 -37966 -21664
9357 -21664 5723 3971 -14797 -29452 -40362 -33479 -13358 -6036 -26096 -38357 -58730 -56810 -30310
9344 -30310 -24108 -41847 -48556 -28831 -9137 7172 5209 3698 11998 13619 -26575 -31302 -18165
9331 -18165 -26545 -24137 -24528 -19218 -30509 -18741 8457 29714 11645 -9227 -14889 -23254 -19591
9318 -19591 -12330 -9633 -6609 4432 8645 -7738 -14222 -38975 -43400 -55182 -62312 -61516 -14453 -31288
9304 -31288 -39380 -16144 -5360 2745 28569 16465 4284 -16177 -23724 -20888 -20695 -12293 -2465
9291b465q705j1146k8331J5146L5231q459o253J7310P82j6723J3849J1505o377
9278E364r672P831j1550M271L8517j8043o352j5204k3533J8695K188J9646P362
9265A9520k2179j7610J8680N797Q284k1287j1385J2326k958J8965J9178P980j7137
9252A8174J0591j9731j3997P039N049m764k7055j9010J68K92j3528Q355J3592
9239c4825r280J5443J2919L050R47J4042O923Q817j5244k8592P886J0353O697
9226h64j692K0683p280j6462J376J1456j4567l641P702M979N630l25k9549O119
9212a6435J7306K1059J7197j3708r764j0721p850Q679j3204J0402M303j0193K429
9199e00O094L24r878p576k152J4360j6985j0533R248m269Q691M1842j6533j0618
$$ plain form
9291 -2465 -11170 -22316 -50647 -35501 -270 -8729 -14982 2328 3110 -13613 236 11741 5364
9278 5364 -4308 3523 -8027 -3756 34761 16718 10366 -4838 -28371 -9676 -7488 12158 19520
9265 19520 -2659 -20269 -1589 4208 12492 -8795 -20180 -7854 -10812 8153 27331 35311 18174
9252 18174 28765 9034 -4963 2076 7125 2361 -24694 -43704 -43536 -43244 -56772 -48417 -34825
9239 -34825 -44105 -28662 -15743 -12693 -11746 2296 9219 18036 2792 -25800 -17914 -7561 -864
9226 -864 -2556 18127 10847 -5615 -4239 7217 -7350 -10991 -3289 1690 7320 6995 -22554 -16435
9212 -16435 871 21930 39127 25419 15655 4934 -2916 5763 -7441 2961 7264 -2929 -500
9199 -500 5594 5918 -3960 -11536 -13688 672 -16313 -26846 -17598 -21867 -13176 28666 12133 1515
9185A515m95l84k3216K468p899J416J939j0411J7688o270J0627K3420q025k4650
9171b2277j1896J9757k810j0684N48O053K2761j538j8669L169k690o79J0512o439
9157a4882J6146O298Q867P310q068k2453j2837P956N883L701r229n863L676j4123
9143b7618j3292m719J6537J2306K017j2038J609K8267M722J1989J7043k6256k5616
9130a5049L481N962j5834J2177K6782j0665j2081l4415j4111O634Q943Q14O886
9117c0476L3975j1625p612J548j6487k1547j852L5701J1327Q82Q567R145j3566
9104b020l9164O718J0633R558P41j489K3392p295K209L1880j7533k9179j8901
9091c0450J0443K045p860K454Q726Q026L689K054j7178l185j636l587L250k752
$$ plain form
9185 1515 1020 636 -22580 -20112 -28011 -26595 -24656 -35067 -17379 -23649 -13022 10398 2373 -22277
9171 -22277 -34173 -14416 -17226 -27910 -27362 -21309 1452 -86 -18755 -15586 -18276 -18955 -8443 -14882
9157 -14882 1264 7562 16429 23739 15671 -6782 -19619 -11663 -5780 -2079 -11308 -17171 -13495 -27618
9143 -27618 -40910 -45629 -29092 -16786 -14769 -26807 -25198 3069 7791 19780 36823 10567 -15049
9130 -15049 -11568 -5606 -21440 -9263 17519 6854 -5227 -39642 -53753 -47119 -38176 -37362 -30476
9117 -30476 3499 -8126 -15738 -14190 -30677 -52224 -54076 -18375 -7048 -6166 2401 11546 -2020
9104 -2020 -41184 -34466 -23833 -14275 -13534 -15023 8369 1074 3283 35163 17630 -11549 -30450
9091 -30450 -20007 -17962 -25822 -23368 -14642 -6616 -2927 -873 -18051 -21236 -22872 -26459 -23209 -25961
9077b5961K3508K3226k0084q395R930K28k6318j9610J8836L1122q966l772R316
9064C060M392R696j4026l8118k328K0042J8584j1926j5654o409J3582L2962J1362
9051B5219m829J063J734J1968q086J9845k5398m6854k7687K0739L6297k886k9615
9038b8490j5722M201l765J5601K4271L7149r011q866j2766p212J6955r036j8936
9025a5627k107J7834M758Q199j0680p769J5719Q77r886N940J3227J699M979k4128
9011C035k6275P990J6630M046j0005n567O473r747p037n85r520N890K1282J6240
8997A2850J3504j8071k927k5445j1180P509P981q37o034j1784J644L5693K1122
8984B4025r106k4395o127L828J0102L072M010k0386k5623j2196K0884J2876k2421
$$ plain form
9077 -25961 -2453 20773 689 -7706 2224 2452 -23866 -43476 -24640 6482 -2484 -6256 3060
9064 3060 7452 17148 3122 -34996 -37324 -17282 1302 -10624 -26278 -32687 -19105 13857 25219
9051 25219 20390 21453 23187 35155 27069 46914 21516 -25338 -53025 -32286 4011 1125 -28490
9038 -28490 -44212 -40011 -43776 -28175 -3904 33245 24234 15368 2602 -4610 12345 3309 -15627
9025 -15627 -17734 100 4858 13057 2377 -5392 10327 11204 1318 7258 20485 22184 27163 3035
9011 3035 -23240 -15250 1380 5426 -4579 -10146 -3673 -13420 -20457 -21042 -30562 -24672 -3390 12850
8997 12850 26354 8283 5356 -20089 -31269 -23760 -15779 -16616 -22650 -34434 -32790 2903 24025
8984 24025 14919 -9476 -15603 -11775 -1673 1399 5409 -14977 -40600 -52796 -31912 -19036 -41457
8971d1457o26l958O926n606M051J881P029J4488K65J111k1168r072K5817J9772
8957e47O738Q951q998k5229R04M5987Q945k0651j996K928O595K3j5338o838j8453
8942a6979k5093K820J2503J8838J5537j2592j0283j1680Q237J6598J8703N95j2905
8929D299J6510k4921l5457n737J731L203J5123R213n674o079L251j3487K1805
8916a6220K2703r20J0540L227j6199j065k1144r145J4345Q082J7154Q574j5542
8903D390j8963j0812J551q934o595J9293J0149R704P715j9675o253Q214k99L1746
8889B1231J9772j0021j3975k994r766r964K3816K399j0398J6569j559N197k321
8876B7986J304J1363k5214k0914k679J3560J4764J488L589J9628K0210q99l1559
$$ plain form
8971 -41457 -42083 -46041 -39115 -44721 -40670 -38789 -31760 -17272 -17007 -15896 -37064 -46136 -20319 -547
8957 -547 6191 15142 6144 -19085 -18181 27806 36751 16100 14104 17032 23627 23650 8312 1474 -16979
8942 -16979 -42072 -39252 -26749 -7911 7626 -4966 -15249 -26929 -18692 -2094 16609 17204 4299
8929 4299 20809 -4112 -39569 -45306 -43575 -40372 -25249 -16036 -21710 -27789 -24538 -38025 -16220
8916 -16220 6483 5563 16103 19330 3131 2066 -19078 -28223 -13878 -5796 11358 19932 4390
8903 4390 -14573 -25385 -23834 -32768 -39363 -20070 -9921 -217 7498 -12177 -18430 -10216 -10515 21231
8889 21231 41003 30982 17007 14013 4247 -5717 18099 20498 10100 26669 25110 30307 27986
8876 27986 29290 40653 15439 -5475 -8154 5406 20170 21658 25247 44875 65085 64186 32627
8863C2627l4929j1485J1795j6488L283J4192m171l2298O186m028l383J5455J6719
8850f525J7753r404k6933j3649j0825O224K3438J4610j1116j8017K8040N5268
8838D8864J0255j4548J903O67R482j4909J6252j5546l5948l9825p709J7571L225
8825b0266J849J1326K8334L7727p981j6521K878J2777o670N141j1736q774r880
8812A8204k9788j2279K1112N090j1104j0409Q515k094k3134k614L8737P251j2974
8799e487O359R874J3084o235k5916J839o541m165n298j572P095K4585K262Q792
8785A8676l686q459j5906k3256P308o97p986J4291K064j3743Q307K8895K5632
8772C1440J595j7484j9869j9945q231L096M475q470n575P445J4921j2955q344
$$ plain form
8863 32627 -2302 -13787 -1992 -18480 -15197 -1005 -5176 -37474 -31288 -35316 -38699 -23244 -6525
8850 -6525 11228 1824 -25109 -38758 -49583 -43359 -19921 -5311 -16427 -34444 -6404 48864
8838 48864 59119 44571 46474 47141 56623 41714 57966 42420 6472 -33353 -41062 -23491 -20266
8825 -20266 -18417 -7091 21243 58970 50989 34468 37346 50123 43453 48594 36858 28084 18204
8812 18204 -11584 -23863 -2751 2339 -8765 -19174 -10659 -12753 -35887 -38501 236 7487 -5487
8799 -5487 872 10746 23830 17595 -8321 -6482 -13023 -17188 -22486 -24058 -16963 7622 9884 18676
8785 18676 14990 6531 -9375 -32631 -25323 -26020 -34006 -19715 -17651 -31394 -23087 5808 31440
8772 31440 33035 15551 -4318 -24263 -32494 -29398 -24923 -33393 -38968 -31523 -16602 -29557 -37901
8759c7901M567k2052l0461J4665L7996L0574J1677J4186k1009m3017R894J894
8747b8987j4966L287K5368N358K7141J9806j3628k0461j9972p233k431J0306j4053
8734c0465J6355J8982j513p990p339j2228j1050J3028O693m636n888j2079J973
8721c6157k0115J9070K9903j270j5710l037L8582L622r605k097k2471o564J3250
8708a2599M307m54j0883J2879K6147o422J475o356n256p669l642R20j2232j3726
8694c3511J1787K4211K6754k2354k4276P35J4936L215j146N971p882r63K669J3328
8680A3474N625K141K8227j6621m7680k3130M3718L7367J683k3305n000j4944M246
8667E801M065k0432j8535L04P997J6333N868q378j1222K362J2860K7706l1990
$$ plain form
8759 -37901 -33334 -55386 -85847 -71182 -33186 -2612 9065 23251 2242 -40775 -30881 -28987
8747 -28987 -43953 -40666 -15298 -9940 17201 37007 23379 2918 -17054 -24287 -26718 -16412 -30465
8734 -30465 -14110 4872 3359 -4631 -11970 -24198 -35248 -22220 -15527 -20163 -26051 -38130 -36157
8721 -36157 -56272 -37202 -7299 -8569 -24279 -27316 11266 14888 5283 3186 -19285 -25849 -12599
8708 -12599 -8292 -8746 -19629 -6750 19397 12975 14450 8094 2838 -4831 -8473 -7553 -19785 -33511
8694 -33511 -21724 2487 29241 6887 -17389 -16654 -1718 1497 351 6322 -1560 -2523 146 13474
8680 13474 19099 21240 49467 32846 -14834 -37964 5754 43121 44804 21499 16499 1555 5801
8667 5801 9866 -10566 -29101 -28797 -20800 -4467 1401 -6977 -18199 -15837 -2977 24729 -7261
8654g261j9088p490L127m764q943J1821K7098K2636J6444m128j0493o145J0869
8641B3683k0083k1607j5302j5772N5739K2319m037l88R281j0795J0493Q663K621
8628D4815j6258k3679n639J925K8112k5970p469p185J749j911q85p073o560J257
8614b4771p376R601k8213l9226P587K4247K4145K0606J1422j7920k2550n893L6696
8601a1645O453R134J6329J075P637k1822k4282j7286J3811K4056j5540l64J3262
8588H18R913N080j8706l0771k1526r777J305J3238M7184K7917o993j7184r080
8575h582J2951P211N638q575j0545J1497J9965j2291q864j2441j0555o016J6166
8562d441j2811k710N729J8021q000q79K4108J9074J3761o255k0309J2158J1266
$$ plain form
8654 -7261 -26349 -33839 -30712 -35476 -44419 -32598 -5500 17136 33580 29452 18959 12814 23683
8641 23683 3600 -18007 -33309 -49081 6658 28977 24940 24552 33833 23038 33531 42194 44815
8628 44815 28557 4878 -761 1164 29276 3306 -4163 -11348 -9599 -11510 -12395 -19468 -26028 -24771
8614 -24771 -32147 -22546 -50759 -89985 -82398 -58151 -34006 -13400 -1978 -19898 -42448 -48341 -11645
8601 -11645 -5192 3942 20271 21346 28983 7161 -17121 -34407 -20596 3460 -12080 -12444 818
8588 818 10731 15811 -2895 -33666 -55192 -64969 -63664 -50426 -3242 24675 17682 498 -8582
8575 -8582 4369 11580 17218 8643 -1902 9595 29560 17269 8405 -4036 -14591 -20607 -4441
8562 -4441 -17252 -19962 -14233 3788 -4212 -5091 19017 38091 51852 45597 25288 37446 48712
8549D8712j3546k5314k4190k5257J467P391R586k71k4410j2314J9197J6713R437
8536a2799L1564p445Q724k904q042j2258r845K88j7760p625M4343M3619m059r341
8522C6460J2739K149k3285Q22J9058L68k2635k6043j3113R664K774l66k108K580
8508i36J1697K7456q195j8269k5592m201J2133q282j4581l95j7605r333J0596
8495d5507O781J5913K9564J138n27j2818n509j5481J6275J4147K7680k9924q359
8482f627O258L7196J8243n30n054k1545l9761j3142N574Q062J477J4346J3795
8469A8292j8857o184P385k780r3k622K986K7660O576o336j7436j3909R201J333
8455E216O647J3208J2015k6134j0984k0031o623K0301K0129j7438Q86l763l525
$$ plain form
8549 48712 35166 9852 -14338 -39595 -38128 -30737 -21151 -21422 -45832 -58146 -38949 -22236 -12799
8536 -12799 18765 11320 20044 17140 9098 -3160 -13005 -12717 -30477 -38102 6241 49860 45801 36460
8522 36460 49199 51348 28063 28885 47943 48311 25676 -367 -13480 -3816 -1042 -1408 -3516 -936
8508 -936 10761 38217 30022 11753 -13839 -18040 -5907 -14189 -28770 -29165 -46770 -56103 -45507
8495 -45507 -38726 -22813 6751 7889 7362 -5456 -10965 -26446 -10171 3976 31656 1732 -6627
8482 -6627 -369 36827 55070 54540 49486 27941 -11820 -24962 -19388 -11326 -9849 4497 18292
8469 18292 -565 -6749 636 -2144 -2237 -4859 -1873 25787 32363 26027 8591 -5318 3883 5216
8455 5216 11863 25071 37086 10952 -32 -20063 -26686 -6385 13744 -3694 -2808 -6571 -10096
8442a0096K2774J3481j6055K085K5061O037j9956n087M647L0328J0314o112n627
8429E1794j0894o444R663j3996j3504k1802M450L639j4517k3563j167J7762q132
8416b6711R414O375O438K7898j418j1988m321K802J6022j532k0647O060L1297
8403C9689O884l5054j5687N710o227j7848k824K354J4920K3471p639j104j0526
8390c881K348J9182J5760p526j8000J734K7863J3236l3870k0403K247j0282m283
8377a5875J5753n023L264n073N973L386J0799p949k2137J9346Q818P576l380o327
8363I151K015j8500j6788Q055l797L03J3973P307J033r251j3386n678L7076P488
8349A9001n692K501J3514M821L1699p311k0325k223j7302J902O644N736p068K320
$$ plain form
8442 -10096 12678 26159 10104 12189 37250 43287 23331 18244 22891 53219 63533 57421 51794
8429 51794 40900 34456 44119 30123 16619 -5183 -733 2906 -11611 -35174 -36341 -18579 -26711
8416 -26711 -17297 -10922 -4484 23414 21996 10008 5687 8489 24511 22979 2332 8392 39689
8403 39689 46573 11519 -4168 1542 -4685 -22533 -25357 -23003 -8083 15388 7749 6645 -3881
8390 -3881 -1533 17649 33409 25883 7883 9617 37480 50716 16846 -3557 -1310 -11592 -15875
8377 -15875 -122 -5145 -1881 -6954 -981 2405 13204 5255 -16882 2464 11282 18858 15478 9151
8363 9151 11166 -7334 -24122 -16067 -19864 -19561 -5588 1719 2752 -6499 -19885 -25563 11513 19001
8349 19001 13309 15810 29324 34145 65844 58533 38208 35985 18683 20585 27229 32965 25897 28217
8335B8217l930k7061j8129k526k72M136K8854L8309J4938l1673j8222k5174k8949
8322d1482R261j2909k1157K3561M1368J4755J87O629p206q395M248p431k3650
8309b2221K5954J9451q737Q069J6922p124l472k6636l813o586k82M669J2758L3131
8295D2083j4548k6839j6115M028Q167J8649m80j6653L048J8696K452R710l0212
8282A986k4800N766L18M934K0562P468J843J1763R916j8085k7186r903o138k693
8268b4249P590J5043m170N11k1182p252R839N334J0764J5853Q096p373K010J8979
8254B9793k577N173p320j8663n946R369N419J6852k955m3013l0328N1924J3861
8241B1589k6744P341k16l0576o897N7451m988k0731P495K395j7703j6660m444
$$ plain form
8335 28217 24287 -2774 -20903 -23429 -23701 -19565 9289 47598 62536 30863 12641 -12533 -41482
8322 -41482 -32221 -45130 -66287 -42726 -1358 13397 13584 20213 13007 4612 8860 1429 -22221
8309 -22221 3733 23184 14447 22516 39438 32314 28842 2206 -1607 -8193 -8475 -3806 8952 42083
8295 42083 27535 696 -15419 -11391 -3224 15425 14945 -1708 1340 20036 22488 32198 1986
8282 1986 -22814 -17048 -16730 -11796 8766 16234 18077 29840 39756 21671 -5515 -15418 -21556 -24249
8268 -24249 -16659 -1616 -5786 -5275 -26457 -33709 -23870 -18536 -7772 8081 16177 8804 10814 29793
8254 29793 27216 32389 25069 6406 460 9829 15248 32100 29145 -13868 -44196 7728 21589
8241 21589 -5155 2186 1970 -28606 -35503 21948 16960 -3771 3724 6119 -11584 -28244 -32688
8228c2688K7636q219j5591J4067J8375J1435j2275q14J2238J894K308k7829j102
8215a0565j065j0368J7366J0665R162m518q345J870p390K1368j5359O387Q716
8202A7924j372j845j4742k2000N154J3604J3892l691l0959k7876K1966K7494J3592
8189A1141N8J1691J8167K719r323r406l3254r323l029l1793k42O882p472j391
8175e4575O300J4999k3907j464n708K295N0821K4358J4867J9917j3562k8224j0315
8162d198K207k0264j4346J4499J1532P856n825r44k344n285Q128n034K089J1911
8148a8L206j5039M75J0642J5561P708j1649l3751l250n306j0014K575J4695l660
8134b7825q973j8185J1772K6067M3460M064r19q763j8883p712n938J4160P480
$$ plain form
8228 -32688 -5052 -13271 -28862 -14795 3580 15015 2740 1926 14164 16058 18366 -9463 -10565
8215 -10565 -11630 -21998 -4632 6033 15195 10677 2332 4202 -3188 18180 2821 9208 17924
8202 17924 16552 14707 -35 -22035 -16881 -3277 10615 6924 -24035 -51911 -29945 -2451 11141
8189 11141 11199 22890 41057 43776 34453 25047 -8207 -17530 -20559 -52352 -52594 -45712 -53184 -54575
8175 -54575 -48275 -33276 -57183 -58647 -64355 -62060 -11239 13119 27986 47903 34341 6117 -4198
8162 -4198 -1991 -22255 -36601 -22102 -10570 -2714 -8539 -9483 -11827 -17112 -8984 -14018 -11929 -18
8148 -18 3188 -11851 -11376 -734 14827 22535 10886 -22865 -26115 -31421 -41435 -38860 -24165 -27825
8134 -27825 -36798 -54983 -43211 -17144 26316 30380 29461 20698 1815 -5897 -11835 2325 9805
8121I805k1732k1460k975J9728q710K762K5134K1518q15n719J8851J1522j1255
8108C6654k4085k1889j2835N73J4354k579J282J3973J6337k6189k0778J1256o371
8095b0297k875m1436J0497K0466L520R941J3304Q946n562k811k4269j4067J5177
8082b9466M2423R829m91j673j6695P601N465j8015k1053J6060J4488O622K2430
8069C7525j6948k7739p888M724L415M960J2822J5944r490k4191j8170J0901k182
8056a6317J694P368O26J1975P065J3614j88l0427k3636L729k221l405M17J0694
8042a9012m911m12j2372J0039K649j4690k935J5480k791P030o543l368J0219P691
8028a3926l6356J5556K8264l501L125L40l5044K665j611J4106J7011l258P002
$$ plain form
8121 9805 -11927 -33387 -36362 -16634 -25344 -22582 2552 24070 23255 17536 36387 47909 36654
8108 36654 12569 -9320 -22155 -21582 -7228 -9807 -8525 5448 21785 -4404 -25182 -13926 -20297
8095 -20297 -23172 -64608 -54111 -33645 -30125 -20184 -6880 2066 -3496 -6307 -30576 -44643 -29466
8082 -29466 12957 22786 22295 20622 3927 11528 16993 -1022 -22075 -6015 8473 15095 37525
8069 37525 20577 -7162 -15050 -10326 -6911 -1951 10871 26815 17325 -6866 -25036 -14135 -16317
8056 -16317 -14623 -7255 -6629 5346 12411 26025 25837 -4590 -28226 -24497 -26718 -30123 -29706 -19012
8042 -19012 -23923 -24335 -36707 -26668 -24019 -38709 -41644 -26164 -28955 -21925 -28468 -31836 -21617 -13926
8028 -13926 -50282 -34726 -6462 -9963 -6838 -6498 -41542 -38877 -40488 -26382 -9371 -12629 -5627
8015e627j424m4247k1852J4338J3108K7411J3953m572j6561k2857M82J4585J1674
8002b1589R732L7059J3187k664l62Q474k984j3798L291Q639K2433K047k0148m5994
7988b677k3883L264J5178j0661J7898R415M408N717l695n220j794J7064k117l895
7974A9002k3397k0033O282Q083n408j2498j3310o6r584J7345N5637n268k4882
7961h097o577O25j472M518K106j1488J7492K9139O888K262k7706j1281J3746q795
7947A360l1456J3855J2553J761j1309n314L509m502m540q912K7862P886o236Q907
7933E424j7118j6393r416J7598P295M449J9283j8492k3090j199K9717M4852K571
7920D5481k6246l0586N602o054k5757p635J3696J4986J0050j29j5320j8407K6750
$$ plain form
8015 -5627 -7051 -51298 -73150 -58812 -45704 -18293 -4340 -8912 -25473 -48330 -47848 -33263 -21589
8002 -21589 -11857 25202 38389 35725 35363 43837 40853 27055 30346 38985 61418 63465 43317 -2677
7988 -2677 -26560 -23296 -8118 -18779 -881 8534 12942 18659 14964 9744 7950 25014 22897 19002
7974 19002 -4395 -24428 -18146 -10063 -15471 -27969 -41279 -41345 -50929 -33584 22053 16785 -8097
7961 -8097 -14674 -14049 -15521 -11003 -8897 -20385 -2893 26246 33134 35396 7690 -3591 10155 1360
7947 1360 -30096 -16241 -3688 -1927 -13236 -18550 -15041 -19543 -24083 -32995 -5133 2753 -3483 5424
7933 5424 -11694 -28087 -37503 -19905 -12610 -8161 11122 -7370 -30460 -31659 -1942 42910 45481
7920 45481 19235 -11351 -5749 -11803 -37560 -45195 -31499 -16513 -6463 -6592 -21912 -40319 -13569
7907a3569j7939K9917Q586K0972j3491k2834r081l0489k15K4692n246O913j0850
7894c2634J9989J6773j5356q638J392J9684P279K6218j1365k5188p273J1109j3884
7881a1894j6883O192N726R59K6607Q538j4454j0853J4920k4334J811K3862M429
7868A4626k7841J1413K3956J8517q403j0305q685o554J4456j3634j6418k0404
7856b9276j7456Q89K8528K1394K4447J833p695K281j1912J6366J4491n608l818
7843C4464j5891k4486n297M371j15q804R551K1342j2107L388p10J0503N788k2248
7829b51K0863k748k9523j3716J7818J7559j3590L867Q571M623Q336O763k5804
7816B768P154q146j4173j6027k5385p025J4203K1583J9204K059j0265J8917L38
$$ plain form
7907 -13569 -31508 -1591 6995 27967 14476 -8358 -17439 -47928 -48143 -23451 -28697 -21784 -32634
7894 -32634 -12645 4128 -11228 -19866 -18474 1210 8489 34707 23342 -1846 -9119 1990 -11894
7881 -11894 -28777 -22585 -16859 -15900 10707 19245 4791 -6062 8858 -15476 -13665 10197 14626
7868 14626 -13215 -1802 22154 40671 32268 21963 13278 6724 21180 7546 -8872 -29276
7856 -29276 -46732 -45843 -17315 4079 28526 30359 22664 24945 13033 29399 43890 38282 34464
7843 34464 18573 -5913 -11210 -6839 -6954 -15758 -6207 15135 3028 6416 5706 16209 21997 -251
7829 -251 20612 17864 -11659 -25375 -7557 10002 -3588 279 8850 13473 21809 28572 2768
7816 2768 9922 1776 -12397 -28424 -53809 -60834 -46631 -25048 -5844 -3785 -14050 4867 5205
7803E205q389J1993K17K242N118J968K4255m59j0525k699L072j1526j3306r023
7789a857j6515O958R929o034k851O971K0466N187k4838j3661k3605P771j2919
7776d4998J9691K1988r828p537Q01J7683J1385n980k2720j6457L816j8447r709
7763f0312K231K7937J8777J947J601P203l1854L586J0633J9772j0172j8247J6394
7750a0504O595j5634k4660J2691J1280l810q969J3797K2919J5072J0880L0954
7738F0611O546l4346p693j1742j0337k1936N499P240k6305o696Q404J3253P662
7725i840K0109q410r128k805j762l201Q54n040j106J0715m114R795r29k9884l560
7710c8306K4594J7715J7748m098k3083j6459J7850K2275j0413L544R216j6322
$$ plain form
7803 5205 -3184 8809 9026 11268 16386 18354 42609 42150 31625 28926 31998 20472 7166 -1857
7789 -1857 -18372 -11414 -1485 -7519 -10370 -3399 17067 22254 -2584 -16245 -39850 -32079 -44998
7776 -44998 -25307 -3319 -13147 -20684 -19883 -2200 9185 3205 -19515 -35972 -32156 -50603 -60312
7763 -60312 -58081 -30144 -11367 -9420 -7819 -616 -32470 -28884 -18251 1521 -8651 -26898 -10504
7750 -10504 -3909 -19543 -44203 -31512 -20232 -24042 -33011 -19214 3705 18777 29657 60611
7738 60611 67157 32811 25118 13376 3039 -18897 -13398 -6158 -32463 -39159 -30755 -17502 -9840
7725 -9840 10269 1859 -7269 -10074 -11836 -15037 -14183 -19223 -20329 -9614 -13728 -3933 -4862 -34746 -38306
7710 -38306 -13712 4003 21751 17653 -5430 -21889 -4039 18236 7823 11367 20583 4261
7698D261l7823j7972P801j373J8217J577K1493L986j1587M961K21Q663n243J450
7684a368L1601L944j8302o562q799r554r036m298Q439K5915Q694j8857o202J2650
7670H265j0290r574n472K4742K9705j0990q637P427J5487K99m3845k1405K2543
7657a745Q251J0784r314j3498p487l846j1290J1041J4642o30K783K825R536J3936
7643B5988N514r987J5863R803l459j6435k0752j4881R927Q586o30R590o616k3867
7629a1356j46M859n648Q40J2951p890K4151N675J6467l586j0254J0034J150j2284
7615B4963k4799J0808M407q602l978Q977N809k3715j7117R865L1099J2259p970
7602B2006K4657J3493k3138j7772n187j4688p829j9612j0925J1227p66K8649J7931
$$ plain form
7698 4261 -33562 -51534 -43733 -45106 -26889 -25312 -3819 167 -11420 -6459 -6238 2425 -2818 -1368
7684 -1368 30233 34177 15875 9313 514 -9040 -18076 -22374 -13935 11980 20674 1817 -4385 8265
7670 8265 -2025 -11599 -17071 7671 37376 26386 17749 25176 40663 40962 -2883 -24288 -1745
7657 -1745 6506 17290 7976 -5522 -13009 -16855 -28145 -17104 -2462 -3092 -309 2516 12052 25988
7643 25988 31502 21515 37378 47181 43722 27287 6535 -8346 1581 10167 9537 19127 12511 -11356
7629 -11356 -11502 -6643 -12291 -11451 1500 -6390 17761 23436 39903 36317 26063 36097 37247 24963
7615 24963 164 10972 15379 6777 2799 11776 17585 -6130 -23247 -13382 17717 29976 22006
7602 22006 46663 60156 37018 19246 14059 -629 -8458 -28070 -38995 -27768 -28534 115 18046
7589A8046K0175r57j9285j0049J4815j6m901k7473n687R796J190N311M788j9523
7575a3770K441R604K9206J730j4548l497j7648n715N115J8215k087M163k0005
7562f796j884q79j8242N975Q53J151P405j7379j0344n596J6885J5902K0684K814
7548A0549k2741n739r974J7323L6290K82J353J5891J9756p223l9477k5J981j7764
7534D82k1779l591M448L367L983j2627j4002n594R124J0750J1074J4506p793N834
7520a818J8549j630o171q127J9876N181j7481j0754l521L1311J3414J710j5032
7507B5507k979p854j5914Q735L460L921j4565l212J0986j3488k5106K289j0519
7494c8739J4406J6642k033R330J1160J548J8863j3388l7840p014L4016K6073K362
$$ plain form
7589 18046 38221 37264 17979 7930 22745 22729 17828 -9645 -15332 -5536 -4346 965 5753 -13770
7575 -13770 -11329 -1725 27481 29211 14663 11166 -6482 -12197 -7082 11133 9046 13209 -6796
7562 -6796 -8680 -9559 -27801 -21826 -20973 -19822 -12417 -29796 -40140 -45736 -28851 -12949 7735 10549
7548 10549 -12192 -17931 -27905 -10582 25708 25990 27343 43234 62990 55767 16290 16265 18246 482
7534 482 -21297 -24888 -20440 -17073 -13090 -25717 -39719 -45313 -36189 -25439 -14365 141 -7652 -1818
7520 -1818 16731 15101 8930 803 20679 25860 8379 -2375 -5896 25415 38829 40539 25507
7507 25507 22528 14674 -1240 7495 10955 14876 311 -2901 8085 -5403 -30509 -28220 -38739
7494 -38739 -24333 -7691 -9724 -394 10766 12314 31177 17789 -20051 -27065 6951 33024 35386
7481C5386n663M613r287l5779k614O967M081J6180k3717j8528N499o194k441r83
7467c2480M076J6865l758n620m649j7412J922o019L506K3955P955K2930J2713
7454B3984k8112j3038J2555p879Q989p219J2025M2117J874l7130m4363r997O712
7441c9482K1659L001J1332q653o988K2174J9071j8801m256n290J190j1839l971
7428b0853J7590M3240J3415l1262k0885j5702j7291o441M7933p599k6079m517
7416b8451R320J8720k99n845P670K0902l778j0110j65L4489P015l339j3312j6094
7402A6723l507j4366k5736o185L2410Q116K0077J0767j413j7958m881K4510p941
7389C0616l999p159O68k532P443m113k0744p170j1816p821N076Q004J5067J6551
$$ plain form
7481 35386 29723 34336 25049 -10730 -13344 -6377 -2296 13884 -9833 -28361 -22862 -29056 -31497 -32480
7467 -32480 -28404 -11539 -15297 -20917 -25566 -42978 -41056 -47075 -43569 -19614 -11659 11271 23984
7454 23984 -4128 -17166 -4611 -12490 -3501 -10720 1305 43422 45296 8166 -36197 -46194 -39482
7441 -39482 -17823 -14822 -3490 -12143 -19131 3043 22114 3313 -943 -6233 -5043 -16882 -20853
7428 -20853 -3263 39977 53392 22130 1245 -14457 -31748 -38189 9744 2145 -23934 -28451
7416 -28451 -19131 -411 -710 -6555 1115 22017 18239 8129 7964 42453 49468 46129 32817 16723
7402 16723 13216 -1150 -26886 -33071 -661 7455 27532 38299 36886 18928 14047 38557 30616
7389 30616 26617 19458 20126 17594 25037 20924 180 -6990 -18806 -26627 -21551 -13547 1520 18071
7375A8071J5322p246J075J7111n434k8775m4504O506J4913K144q612O331p818
7362b0916l508J4476J988r700k7453J8524K2808m272J1599J0192j1798J5438m364
7349A3014p223j6123K2479N455j3016k29J600j9206k584K9112j313l2685j5953
7336c6672j9913M407K7754K3688L084j9951j5083p059J064q097M785J9940K5744
7323C691k919j1322K2520J8862K8166O392n2913m0760M618P24q253P446k256L2353
7309F349R689j6560M326j1698J6966k317j5868J1717n006J2640J0716J3879J0608
7296D5441r500o244q566k6203k1808J210R826J5133M067o877j0260R632K872J5630
7282A4353J7257k667p788O621l0318k0581L714j1614K4659K9849m968j9607N985
$$ plain form
7375 18071 33393 26147 27222 44333 38899 10124 -34380 -27874 -12961 -10817 -19429 -13098 -20916
7362 -20916 -24424 -9948 -7960 -17660 -45113 -26589 -3781 -8053 3546 13738 1940 17378 13014
7349 13014 5791 -10332 12147 17602 4586 4357 5957 -13249 -15833 13279 11966 -20719 -36672
7336 -36672 -56585 -52178 -24424 -736 2348 -17603 -32686 -39745 -38681 -46778 -41993 -22053 3691
7323 3691 772 -10550 11970 30832 58998 65390 12477 -28283 -23665 -22941 -31194 -23748 -26004 6349
7309 6349 16038 -522 3804 -7894 9072 6755 -9113 2604 -2402 10238 20954 34833 45441
7296 45441 35941 29697 21131 -5072 -26880 -25670 -15844 -711 3356 -3521 -13781 -4149 -1277 14353
7282 14353 31610 28943 21155 27776 -2542 -23123 -19409 -31023 -6364 23485 18517 -1090 4895
7269D895q594j643m962q336m5406q427L512K6826L6945K2399r147l5621R272J690
7255a6597m993L3381J9444J7163j0708q856j3005O854O937j8497n350k5635j6592
7242c6454J302K6723N176l5824J4409L0257m554l6864O487J1757M274q540j114
7229b2965l446J3364K0250J4549O931j5613l3655k0063N512K3050k967K9600J9801
7216C4348M226l678j241k5361k9787L0653K8821k662j4578m7336J517L0331J1664
7203A6917k1925k1758L731K9234M6929M092l2839j5082M41k1742LJ2630j007l230
7189c606M199l2715k9391K3283K0360j550j6281n700K9233m307j3331j3118j0049
7176e2973K1839J5253M387M190J4988P677l116J251j9057j3795n655J5372L5501
$$ plain form
7269 4895 -3699 -5342 -10304 -18640 -64046 -72473 -68961 -42135 -5190 17209 8062 -27559 -18287 -16597
7255 -16597 -21590 11791 31235 48398 37690 28834 15829 22683 29620 11123 5773 -19862 -36454
7242 -36454 -35152 -8429 -3253 -39077 -24668 5589 1035 -35829 -29342 -17585 -13311 -21851 -22965
7229 -22965 -26411 -13047 7203 21752 28683 13070 -20585 -40648 -35136 -12086 -15053 14547 34348
7216 34348 38574 34896 33655 8294 -21493 9160 37981 35319 20741 -26595 -25078 5253 16917
7203 16917 -5008 -26766 -23035 6199 53128 57220 24381 9299 9740 -12002 -11999 631 -376 -3606
7189 -3606 593 -32122 -61513 -38230 -17870 -19420 -35701 -41401 -12168 -16475 -29806 -42924 -52973
7176 -52973 -31134 -15881 -11494 -7304 7684 15361 12245 13496 -5561 -19356 -25011 -9639 25862
7163B5862K2324O051k2112m3618P073K2681k181j8068p21p97N84q94N521r616
7149g911p403M360N532j2202K4492p170l3429K5976P177j5165k5752m766J6560
7136b9701K0644M153j855n31j4489J7002K3747k7568j1129j2200O116k415l959
7123c2185P074J8052L296M598j3530r504J6268K3054j5251n237l34P99n570j5192
7109b3662k098K237N187q298P856K683j5535J1295o395r797J4319K9424Q705l7366
7095b1445j4594K4125K7056N79n642P840J3190J1457j8428k2439k3346j4058L2368
7082c337J9103M963J527K0206p608l2095l4061N2K5561M744j5691k28J9814p519
7068d569J7184K5019J1961p72N069k476l0788o137K524N531K1045j6479j1755
$$ plain form
7163 25862 48186 54237 32125 -11493 -4420 18261 16080 -1988 -2709 -3506 -2922 -3816 1705 -7911
7149 -7911 -15314 -10954 -5422 -17624 6868 -302 -33731 -7755 -578 -15743 -41495 -46261 -29701
7136 -29701 -9057 -4904 -6759 -7290 -21779 -4777 18970 -8598 -19727 -31927 -25811 -28226 -32185
7123 -32185 -25111 -7059 -3763 835 -12695 -22199 -5931 17123 1872 -3365 -3699 -2900 -8470 -23662
7109 -23662 -25760 -23523 -18336 -26634 -18778 -16095 -31630 -20335 -26730 -36527 -22208 7216 15921 -21445
7095 -21445 -36039 -11914 15142 15721 10079 17919 31109 42566 24138 1699 -21647 -35705 -3337
7082 -3337 15766 20729 22256 42462 34854 2759 -31302 -31250 -5689 -945 -16636 -16864 2950 -4569
7068 -4569 12615 37634 49595 48823 53892 51416 20628 14491 17015 22546 43591 27112 15357
7055A5357l6688l733J231l772N944J7102p295j1616j2763J5373p32n627o608j5913
7041d9740j8414J0206K3900K6326O63J7619M851j3421K6301N060k4040k5780j3873
7028c0342j3829K2304K8965p392n329Q037Q749J0208O304k0993j7215j8680J1092
7015a8121j7432k390K9649j0566l992M405J2810J6913k108k7356k4373J3143M0112
7002A0694J4646l2524j6167j226n033M084J7999k0392m998r306L695L7825K631
6989A928j0480j9714R35M212r515J7218J3067P282P973j5514j7865P724j2900
6976b5649j7210k0669J2958N1353J4883k7317J020J4090j4138j4851O13K2180
6964b737K058L958Q421K693k2063J4425M353j674N960k8515k797Q359J8569R245
$$ plain form
7055 15357 -21331 -25064 -23833 -27605 -21661 -4559 -11854 -23470 -36233 -20860 -21592 -27219 -33827 -49740
7041 -49740 -68154 -57948 -34048 -7722 -7059 10560 15411 1990 28291 33351 9311 -16469 -30342
7028 -30342 -44171 -21867 7098 -294 -5623 2414 11163 21371 27675 6682 -10533 -29213 -18121
7015 -18121 -35553 -37943 -8294 -18860 -22852 -18447 -5637 11276 9168 -18188 -42561 -29418 10694
7002 10694 25340 -7184 -23351 -24577 -29610 -25526 -7527 -27919 -32917 -42223 -38528 -703 1928
6989 1928 -8552 -28266 -27331 -23119 -32634 -15416 -2349 4933 12906 -2608 -20473 -12749 -25649
6976 -25649 -42859 -63528 -50570 783 15666 -11651 -10631 3459 -10679 -25530 -24917 -2737
6964 -2737 -679 3279 11700 14393 -7670 6755 11108 9434 15394 -13121 -15918 -7559 11010 20255
6950B0255j2532Q63p578j5414j2743n518N816j8830J5616L3328j3109j392J87
6937a1051Q715J469r885q618K091R651n324M743m075j6154L154K7327M551j5295
6923h701o18k9116N047R157n600l415l532K3513O404J5094K3000j6839j299j6295
6909c200j9866l148q957o921K6094J4259K8373R460O688J898n757M57N397j8913
6895B5864m9427k05K9977J6584k4868j9213k0150o973p410J9453K5121J288J0930
6882I71K462p33K1476J4894j5172j9321l748j1616J1154J8876L0495J0048O992
6869F6778N961k0960l0632j5278o878L4391l637j5321j3250J4928j0621l861J1506
6856A3126J3661O273Q881L044J0971l861j5166k4230m994j6403J8671K024q880
$$ plain form
6950 20255 7723 8586 1008 -14406 -27149 -32667 -26851 -45681 -30065 3263 -9846 -11238 -11051
6937 -11051 -2336 -867 -10752 -19370 -17279 -7628 -12952 -8209 -12284 -28438 -25284 2043 6594 -8701
6923 -8701 -9319 -38435 -33388 -24231 -29831 -33246 -36778 -13265 -6861 8233 31233 14394 13095 -3200
6909 -3200 -23066 -26214 -35171 -42092 -15998 -1739 26634 36094 42782 44680 38923 39380 44777 25864
6895 25864 -23563 -23768 6209 22793 -2075 -21288 -41438 -48411 -55821 -36368 -11247 -9959 971
6882 971 3433 2700 24176 39070 23898 4577 829 -10787 367 19243 49738 59786 66778
6869 66778 72739 51779 21147 5869 -1009 33382 29745 14424 1174 16102 5481 1620 13126
6856 13126 26787 33060 41941 44985 55956 52095 36929 12699 7705 -8698 9973 11997 3117
6843C117n689K057j1040Q469J7846m393J5293k2226J0944J9220j2999k8335j1201
6830a8937l558L2038P404l675R866J7561l298k2641m895j5200j7050J5604Q827
6817B046l526l378j0001L291J3175J6179J3168K285J368j0642j5404J563p408
6804B716m872J8999l374J267J1783J2638N463J2153j0660j7120k1926j817J9578
6791B4828J4039j6168j3588j6266O135J816m640K6053K1697O097j6151m7531m280
6778a7959J7090j6014k0319n171j8213J5412L7505L1733J6369k2539j7962Q126
6766H058j4740n231j4451q385J1817j05K528L1389j1311m977k7212n297j0061
6753d7978J3949J3985N506j3621k629J823K3145p78k095q685K8956K140j9522
$$ plain form
6843 3117 -2572 -515 -11555 -3086 14760 10367 25660 3434 14378 33598 20599 -7736 -18937
6830 -18937 -22495 9543 16947 13272 23138 40699 37401 14760 9865 -5335 -22385 -6781 2046
6817 2046 -1480 -4858 -14859 -11568 1607 17786 30954 33239 34607 23965 8561 10124 2716
6804 2716 -2156 16843 13469 14736 26519 39157 44620 56773 46113 28993 7067 5250 24828
6791 24828 38867 22699 9111 -7155 -1020 796 -3844 22209 43906 50003 33852 -13679 -17959
6778 -17959 -869 -16883 -37202 -42373 -60586 -45174 -7669 24064 40433 17894 -68 8058
6766 8058 -6682 -11913 -26364 -34749 -22932 -23037 -20509 10880 -431 -5408 -32620 -37917 -47978
6753 -47978 -34029 -20044 -14538 -28159 -30788 -28965 -5820 -6598 -8693 -17378 11578 13718 -5804
6740e804j250k6694k968Q091J464j036K306J1637k0594k4478J237J7630K0742
6727a9717J3856J8735J5804J3319l0548k4741K5621O968N122M56j8795N72j5258
6714h606k0236o509J9512m174m331K3319J3184k2691j9723K4858j983j0333J1631
6701f082J9554p715j1578M850M229j6795J0133N755J7175k890K01p050m7411o727
6687d4351K1981l244l19R638O900J1543M286j1375K2019K5906l1595q808k0578
6674a7997J0319J5225J796N916j534o48j2609J2052J6008o369j5311o425L6641
6661C7064k1070p992K1821r230j5951P539j1273nJ7123m877R436J8684j3256j382
6647B6631M124Q502J5078K973k2045r932p277J9200K962j9864k2900J96J3229
$$ plain form
6740 -5804 -7054 -33748 -36716 -28625 -27161 -28197 -25891 -14254 -34848 -59326 -58089 -40459 -19717
6727 -19717 -5861 12874 28678 41997 11449 -13292 12329 19297 24419 24875 6080 6652 -8606
6714 -8606 -28842 -35351 -15839 -20013 -24344 -1025 12159 -10532 -30255 -5397 -7380 -17713 -6082
6701 -6082 13472 5757 -5821 -971 3258 -13537 -3404 2351 19526 16636 16837 9787 -37624 -44351
6687 -44351 -22370 -25614 -25933 -16295 -9395 2148 6434 -4941 17078 42984 11389 2581 -17997
6674 -17997 -7678 7547 9343 15259 13725 13077 468 12520 28528 22159 6848 423 37064
6661 37064 15994 8002 29823 20593 4642 12181 908 903 18026 13149 22585 41269 28013 26631
6647 26631 30755 39257 54335 57308 35263 25331 18054 37254 40216 20352 -2548 -2352 10877
6634A0877K7355J1030n328j3064o659j5463j3541j876J996J8542r781j2801R820
6621A107P363J205k0350j553L535R19k0698J432O491J9562k200J7899P982r925
6607A2769k9349p512j4679r801J2224M5946J3418n602o582Q721J8179r422r893
6594A8417p076N330j6242k9516Q931K0006M955r611O835P233K0248l409q132J5896
6580C3865k0681l2426l831K706J969N862p115n406n894j327Q957m189m176r103
$$ plain form
6634 10877 38232 49262 43934 30870 24211 8748 -4793 -6669 -4673 13869 4088 -8713 1107
6621 1107 8470 9675 -10675 -12228 -8693 -7774 -28472 -27040 -20549 -987 -3187 14712 22694 12769
6607 12769 -16580 -24092 -38771 -48572 -36348 9598 23016 17414 10832 19553 37732 28310 18417
6594 18417 11341 16671 429 -29087 -20156 -150 4805 -4806 2029 9262 29510 26101 17969 33865
6580 33865 13184 -19242 -23073 -20367 -18398 -12536 -19651 -25057 -30951 -32278 -23321 -27510 -31686 -40789
$$ [...]
##END NTUPLES=NMR SPECTRUM
##END=
