##TITLE=Analysis number 307446
Compound Code km 08723
Project Code adrs
Chemist Name endeavour
##JCAMPDX= 6.0         $$ Bruker NMR JCAMP-DX V2.0
##DATA TYPE= NMR SPECTRUM
##DATA CLASS= NTUPLES
##ORIGIN= Bruker BioSpin GmbH
##OWNER= NMR
$$ XWIN-NMR		Version 3.5
$$ Tue May  3 14:45:30 2005 GMT Daylight Time (UT+1h)  MAYBRIDGE\NMR@NMR_250MHZ
##.OBSERVE FREQUENCY= 250.131544655141
##.OBSERVE NUCLEUS= ^1H
##.ACQUISITION MODE= SIMULTANEOUS (DQD)
##.ACQUISITION SCHEME= undefined
##.AVERAGES= 16
##.DIGITISER RES= 18
##SPECTROMETER/DATA SYSTEM= dpx250
##.PULSE SEQUENCE= zg30
##.SOLVENT NAME= CDCl3
##.SHIFT REFERENCE= (INTERNAL, CDCl3, 0, 16.522)
##AUDIT TRAIL= $$ (NUMBER, WHEN, WHO, WHERE, WHAT)
$$ ##TITLE= Audit trail, XWIN-NMR		Version 3.5
$$ ##JCAMPDX= 5.01
$$ ##ORIGIN= Bruker BioSpin GmbH
$$ ##OWNER= NMR
$$ C:\u/data/dgb/nmr/ADRS/2670/pdata/1/auditp.txt
$$ ##AUDIT TRAIL=  $$ (NUMBER, WHEN, WHO, WHERE, WHAT)
(   1,<2005-05-03 14:45:08.99 +100>,<MAYBRIDGE\NMR>,<NMR_250MHZ>,
      <created by zg, POWCHK disabled, PULCHK disabled
       configuration hash MD5:
       62 19 C7 07 E1 42 D1 B7 37 6C 3D D0 77 39 F9 E6
       data hash MD5: 64K
       16 63 68 16 B6 74 71 88 4C AC 2E EE A2 1D 08 A0>)
(   2,<2005-05-03 14:45:21.04 +100>,<MAYBRIDGE\NMR>,<NMR_250MHZ>,
      <Start of raw data processing
       ef LB = 0.3 FT_mod = 6 PKNL = 1 SI = 32K 
       data hash MD5: 32K
       B6 FE E8 0C BC F7 6D 53 D9 1A 33 07 5B B8 87 CC>)
(   3,<2005-05-03 14:45:22.92 +100>,<MAYBRIDGE\NMR>,<NMR_250MHZ>,
      <apk 
       data hash MD5: 32K
       2F C5 C3 4B C2 7E 60 3B 5A F8 49 09 40 28 65 E5>)
(   4,<2005-05-03 14:45:23.67 +100>,<MAYBRIDGE\NMR>,<NMR_250MHZ>,
      <abs ABSG = 5 
       data hash MD5: 32K
       53 3F 02 39 EF 9A 70 A1 23 DF BD 38 68 7F E8 81>)
$$ ##END=
$$ 
$$ hash MD5
$$ 8C 58 3A BB E0 F9 F7 EC F0 FA 12 97 16 1D FE 19
##$RELAX= 
##$RELAX= 
##$RELAX= 
##$RELAX= 
##$RELAX= 
##$RELAX= 
##$RELAX= 
$$ Bruker specific parameters
$$ --------------------------
##$DU= <C:\u>
##$EXPNO= 2670
##$NAME= <ADRS>
##$PROCNO= 1
##$TYPE= <nmr>
##$USER= <dgb>
##$AMP= (0..31)
100 100 100 100 100 100 100 100 100 100 100 100 100 100 100 100 100 100 
100 100 100 100 100 100 100 100 100 100 100 100 100 100 
##$AQSEQ= 0
##$AQ_mod= 3
##$AUNM= <au_zg>
##$AUTOPOS= <32 >
##$BF1= 250.13
##$BF2= 250.13
##$BF3= 250.13
##$BF4= 250.13
##$BF5= 500.13
##$BF6= 500.13
##$BF7= 500.13
##$BF8= 500.13
##$BYTORDA= 1
##$CFDGTYP= 0
##$CFRGTYP= 5
##$CHEMSTR= <none>
##$CNST= (0..31)
1 1 145 1 1 1 1 1 1 1 1 1 1 1 1 1 1 1 1 1 1 1 1 1 1 1 1 1 1 1 1 1 
##$CPDPRG= <>
##$CPDPRG1= <>
##$CPDPRG2= <>
##$CPDPRG3= <>
##$CPDPRG4= <mlev>
##$CPDPRG5= <mlev>
##$CPDPRG6= <mlev>
##$CPDPRG7= <mlev>
##$CPDPRG8= <mlev>
##$CPDPRGB= <>
##$CPDPRGT= <>
##$D= (0..31)
0 1 0 0 0 0 0 0 0 0.06 0 0 0 0 0 0 0.0002 0 0 0 0 0 0 0 0 0 0 0 0 0 0 
0 
##$DATE= 1115127907
##$DBL= (0..7)
120 120 120 120 120 120 120 120 
##$DBP= (0..7)
150 150 150 150 150 150 150 150 
##$DBP07= 0
##$DBPNAM0= <>
##$DBPNAM1= <>
##$DBPNAM2= <>
$$ [...]
##$SUBNAM7= <"">
##$SUBNAM8= <"">
##$SUBNAM9= <"">
##$SW= 20.6930455092707
##$SWIBOX= (0..15)
0 0 3 0 0 0 0 0 0 0 0 0 0 0 0 0 
##$SW_h= 5175.983436853
##$TD= 65536
##$TD0= 1
##$TE= 295.16
##$TE2= 300
##$TE3= 300
##$TEG= 300
##$TL= (0..7)
0 120 120 120 120 120 120 120 
##$TP= (0..7)
150 150 150 150 150 150 150 150 
##$TP07= 0
##$TPNAME0= <>
##$TPNAME1= <>
##$TPNAME2= <>
##$TPNAME3= <>
##$TPNAME4= <>
##$TPNAME5= <>
##$TPNAME6= <>
##$TPNAME7= <>
##$TPOAL= (0..7)
0.5 0.5 0.5 0.5 0.5 0.5 0.5 0.5 
##$TPOFFS= (0..7)
0 0 0 0 0 0 0 0 
##$TUNHIN= 0
##$TUNHOUT= 0
##$TUNXOUT= 0
##$USERA1= <user>
##$USERA2= <user>
##$USERA3= <user>
##$USERA4= <user>
##$USERA5= <user>
##$V9= 5
##$VALIST= <valist>
##$VCLIST= <CCCCCCCCCCCCCCC>
##$VD= 0
##$VDLIST= <DDDDDDDDDDDDDDD>
##$VPLIST= <PPPPPPPPPPPPPPP>
##$VTLIST= <TTTTTTTTTTTTTTT>
##$WBST= 1024
##$WBSW= 4
##$XGAIN= (0..3)
0 0 0 0 
##$XL= 0
##$YL= 0
##$YMAX_a= 389026
##$YMIN_a= -422907
##$ZGOPTNS= <>
##$ZL1= 120
##$ZL2= 120
##$ZL3= 120
##$ZL4= 120
##$ABSF1= 16.522
##$ABSF2= -4.171173
##$ABSG= 5
##$ABSL= 3
##$ALPHA= 0
##$AQORDER= 0
##$ASSFAC= 0
##$ASSFACI= 0
##$ASSFACX= 0
##$ASSWID= 0
##$AUNMP= <proc_1d>
##$AZFE= 0.1
##$AZFW= 0.1
##$BCFW= 0
##$BC_mod= 0
##$BYTORDP= 0
##$COROFFS= 0
##$CY= 12.5
##$DATMOD= 1
##$DC= 0
##$DFILT= <>
##$DTYPP= 0
##$F1P= 14.0000005364418
##$F2P= -0.99999901652339
##$FCOR= 0.5
##$FTSIZE= 32768
##$FT_mod= 6
##$GAMMA= 0
##$GB= 0
##$INTBC= 1
##$INTSCL= 1
##$ISEN= 128
##$LB= 0.3
##$LEV0= 0
##$LPBIN= 0
##$MAXI= 10000
##$MC2= 0
##$MEAN= 0
##$ME_mod= 0
##$MI= 0
##$NCOEF= 0
##$NC_proc= -5
##$NLEV= 6
##$NOISF1= 0
##$NOISF2= 0
##$NSP= 0
##$NTH_PI= 0
##$NZP= 0
##$OFFSET= 16.522
##$PC= 1
##$PHC0= -77.12209
##$PHC1= 11.59335
##$PH_mod= 1
##$PKNL= yes
##$PPARMOD= 0
##$PSCAL= 4
##$PSIGN= 0
##$REVERSE= no
##$SF= 250.13
##$SI= 32768
##$SIGF1= 0
##$SIGF2= 0
##$SINO= 400
##$SIOLD= 32768
##$SREGLST= <1H.CDCl3>
##$SSB= 0
##$STSI= 32768
##$STSR= 0
##$SW_p= 5175.98343685301
##$SYMM= 0
##$S_DEV= 0
##$TDeff= 65536
##$TDoff= 0
##$TI= <Analysis number 999999
Compound Code 99
Book Reference 9
Project Code 9>
##$TILT= no
##$TM1= 0
##$TM2= 0
##$TOPLEV= 0
##$USERP1= <user>
##$USERP2= <user>
##$USERP3= <user>
##$USERP4= <user>
##$USERP5= <user>
##$WDW= 1
##$XDIM= 32768
##$YMAX_p= 441070343
##$YMIN_p= -473406
$$ End of Bruker specific parameters
$$ ---------------------------------
##NTUPLES= NMR SPECTRUM
##VAR_NAME=  FREQUENCY,     SPECTRUM/REAL,   SPECTRUM/IMAG
##SYMBOL=    X,             R,               I
##VAR_TYPE=  INDEPENDENT,   DEPENDENT,       DEPENDENT
##VAR_FORM=  AFFN,          ASDF,            ASDF
##VAR_DIM=   32768,         32768,           32768
##UNITS=     HZ,            ARBITRARY UNITS, ARBITRARY UNITS
##FACTOR=    0.157963299565203, 1,           1
##FIRST=     4132.6476996994, 0,             0
##LAST=      -1043.33573715361, 0,           0
##MIN=       -1043.33573715361, -473406,     0
##MAX=       4132.6476996994, 441070343,     0
$$ Real data points
##PAGE= N=1
##DATA TABLE= (X++(R..R)), XYDATA
$$ [...]
$$ plain form
23721 292476 248520 149335 107820 106468 -5025 -110746 -131247 -75226 -131055 -60163 -17765
23710 -17765 -71212 -202445 -173745 -88399 -3278 75143 106287 80588 -51272 -184398 -62243
23699 -62243 886 -7372 -115737 -150026 -35035 -161956 -210219 -168041 -79716 -129892 -211078
23688 -211078 -167782 -189176 -126239 -60261 10571 453 -70157 -164303 -99759 -56654 -84691
23677 -84691 -176018 -169820 -72334 -125493 -230794 -176703 -72690 -87682 -192990 -146402 -162921
23666 -162921 -75377 -24759 15639 601 -57241 -59719 -54942 -70576 -13673 -55734 -123703 -51905
23654 -51905 30393 -89884 -218070 -268068 -288624 -232255 -154802 -121716 -166736 -167999 -67861
23643 -67861 -64690 -156803 -103987 -34003 -131430 -105595 -21838 54746 69412 11256 -46581 21386
$$ packed form
23721B92476m3956r9185m1515j352j11493j05721k0501N6021n5829P0892M2398
23710a7765n3447j31233K8700Q5346Q5121P8421L1144k5699j31860j33126J22155
23699f2243O3129q258j08365l4289J14991j26921m8263M2178Q8325n0176q1186
23688b11078M3296k1394O2937O5978P0832j0118p0610r4146O4544M3105k8037
23677h4691r1327O198R7486n3159j05301N4091J04013j4992j05308M6588j6519
23666a62921Q7544N0618M0398j5038n7842k478M777j5634N6903m2061o7969P1798
23654e1905Q2298j20277j28186m9998k0556N6369P7453L3086m5020j263J00138
23643f7861L171r2113N2816O9984r7427K5835Q3757P6584J4666n8156n7837O7967
$$ plain form
23631 21386 -55286 -48145 -61523 -30769 -9387 57392 110719 56206 101402 46160 -1063 25728
23619 25728 62723 122282 21564 10303 40676 81751 153871 137564 170500 145127 27433
23608 27433 -72716 10016 -6186 19095 -10788 -112427 -71136 -72229 -107717 -35058 25710
23597 25710 -79159 -113490 -45014 25615 -63198 -58711 -58948 -141852 -133054 -138579 -84557 26759
23585 26759 147628 95197 100630 80646 124983 88223 77804 47036 50320 149309 119959 102011
23573 102011 -59672 -185040 -166321 -78486 -88768 -187433 -192759 -146672 -76141 -106773 -167728
23562 -167728 -197787 -156388 -227771 -250244 -162024 -177030 -161359 -110363 -31808 126379 46777
23551 46777 -42199 -83671 -6766 59757 101524 101785 56367 -40523 -95124 -26080 -53326 -132743
$$ packed form
23631B1386p6672P141j3378L0754K1382O6779N3327n4513M5196n5242m7223K6791
23619B5728L6995N9559j00718j1261L0373M1075P2120j6307L2936k5373j17694
23608B7433j00149Q2732j6202K5281k9883j01639M1291j093l5488P2659O0768
23597B5710j04869l4331O8476P0629q8813M487k37q2904Q798n525N4022J11316
23585B6759J20869n2431N433j9984M4337l6760j0419l0768L284R8989k9350j7948
23573A02011j61683j25368J8719Q7835j0282r8665n326M6087P0531l0632o0955
23562a67728l0059M1399p1383k2473Q8220j5006J5671N0996P8555J58187p9602
23551D6777q8976m1472P6905O6523M1767K61m5418r6890n4601O9044k7246p9417
$$ plain form
23539 -132743 -58268 30158 32789 -2322 -43732 -54918 9115 -24800 -72980 -59357 -12460 -12609
23527 -12609 -20715 -113813 -182741 -183555 -165208 -194970 -139253 -48146 52074 74894 81078 94876
23515 94876 55812 149603 200351 78135 -81834 -57910 81854 104272 137083 166013 57444
23504 57444 -136998 -197380 -146458 -44958 -75921 -125056 -94092 -38310 -6431 37717 -30460
23493 -30460 -57115 40041 106899 12136 3730 63264 137324 162735 142793 100021 83991 15502
23481 15502 49942 93277 50880 -77752 2492 28175 61714 41839 44511 -25895 -19721 16333
23469 16333 140644 96345 7896 -66946 -110833 -137177 -112565 46276 166415 165102 33811
23458 33811 -66157 -31459 -101938 -202287 -240196 -105477 39092 138648 123223 -21112 29816
$$ packed form
23539a32743P4475Q8426K631l5111m1410j1186O4033l3915m8180J3623M6897j49
23527a2609q106r3098o8928q14J8347k9762N5717R1107J00220K2820O184J3798
23515I4876l9064R3791N0748j22216j59969K3924J39764K2418L2811K8930j08569
23504E7444j94442o0382N0922J01500l0963m9135L0964N5782L1879M4148o8177
23493c0460k6655R7156O6858r4763q406N9534P4060K5411j9942m2772j6030o8489
23481A5502L4440M3335m2397j28632Q0244K5683L3539j9875K672p0406O174L6054
23469A6333J24311m4299q8449p4842m3887k6344K4612J58841J20139j313j31291
23458C3811r9968L4698p0479j00349l7909J34719J44569R9556j5425j44335N0928
$$ plain form
23447 29816 57754 16658 15434 -78678 -157062 -129960 -31239 70819 91845 85191 6064 -99646
23435 -99646 -227990 -129628 -127220 -70113 55550 83860 69514 17391 20867 117255 67610 13533
23423 13533 -42048 -74701 -98708 -66933 -93111 -56170 31880 32985 -34594 -70945 -58007 -3623
23411 -3623 -9458 81355 41500 -19421 -21553 99374 95749 97044 -3273 -165073 -153632 -88863
23399 -88863 -110226 -20481 48235 97373 63754 90103 77406 119029 111459 126848 120136 48458
23387 48458 8944 49748 66916 121860 143626 95597 3614 78274 7892 16288 19830 23162
23375 23162 46644 54599 59454 116687 20341 -70907 25481 68494 -27810 68482 142374 204965
23363 204965 244328 131900 19908 -81858 -55511 -9818 -23164 -111961 -95259 -81901 19970
$$ packed form
23447B9816K7938m1096j224r4112p8384K7102R8721J02058K1026o654p9127j05710
23435i9646j28344R8362K408N7107J25663K8310j4346n2123L476R6388m9645n4077
23423A3533n5581l2653k4007L1775k6178L6941Q8050J105o7579l6351J2938N4384
23411c623n835R0813l9855o0921k132J20927l625J295j00317j61800J1441O4769
23399h8863k1363Q9745O8716M9138l3619K6349j2697M1623p570J5389o712p1678
23387D8458l9514M0804J7168N4944K1766m8029r1983P4660p0382Q396L542L332
23375B3162K3482P955M855N7233r6346r1248R6388M3013r6304R6292P3892O2591
23363B04965L9363j12428j11992j01766K6347M5693j3346q8797J6702J3358J01871
$$ plain form
23352 19970 35863 36774 37004 -23005 12493 9823 34407 55694 111037 90535 131347 200392 60606
23339 60606 104451 69657 -70442 -18668 70435 92143 75699 14942 34649 -22805 -57669
23328 -57669 -1931 -53359 -87645 -172431 -182219 -44094 50601 98327 176703 122182 19455
23317 19455 -80393 -82147 -32488 42675 -82631 -82550 29864 31635 36540 26176 4157 37377
23305 37377 43162 22227 25087 54018 61458 73814 86331 -48341 -66308 -27392 -17271 114711
23293 114711 162564 130393 55482 -13142 -44245 -74707 -145367 -150506 -171099 -235348 -199842 -74415
23281 -74415 5447 21348 -20110 -25419 -133657 -163171 -70162 118320 220673 160281 78318
23270 78318 183025 198726 259977 199150 115801 92940 38649 85058 -2598 -137454 -164366
$$ packed form
23352A9970J5893R11K30o0009L5498k670K4584K1287N5343k0502M0812O9045j39786
23339F0606M3845l4794j40099N1774Q9103K1708j6444o0757J9707n7454l4864
23328e7669N5738n1428l4286q4786r788J38125R4695M7726P8376n4521j02727
23317A9455r9848j754M9659P5163j25306Q1J12414J771M905j0364k2019L3220
23305C7377N785k0935K860K8931P440J2356J2517j34672j7967L8916J0121J31982
23293A14711M7853l2171p4911o8624l1103l0462p0660n139k0593o4249L5506J25427
23281g4415P9862J5901m1458n309j08238k9514R3009J88482J02353o0392q1963
23270G8318J04707J5701O1251o0827q3349k2861n4291M6409q7656j34856k6912
$$ plain form
23259 -164366 -116914 -94840 -4846 -20798 -65117 -47020 -119007 -69662 60543 74478 50828
23248 50828 -5259 -42967 -47024 -89571 -111885 -180848 -1307 132222 140796 23247 -39075
23237 -39075 -25893 -42096 -108904 -132477 -73715 -126919 -25326 20729 53201 5211 63553
23226 63553 90095 52857 -69389 -182842 -164729 -127723 -112816 -6008 126077 152829 119241
23215 119241 99869 162298 180086 126962 -4190 -10313 24648 66074 -416 -106971 -68208
23204 -68208 -53414 -183882 -140972 -40566 -82504 -61415 -58653 -102103 7797 65587 89189
23193 89189 12074 -8270 -122768 -110467 2190 84465 -40250 -143907 -209915 -154215 -102202
23182 -102202 -49241 81312 44886 -64756 -8601 61028 -94092 -102411 73372 86382 98949
$$ packed form
23259a64366M7452K2074Q9994j5952m4319J8097p1987M9345J30205J3935k3650
23248E0828n6087l7708m057m2547k2314o8963J79541J33529Q574j17549o2322
23237c9075J3182j6203o6808k3573N8762n3204J01593M6055L2472m7990N8342
23226F3553K6542l7238j22246j13453J8113L7006J4907J06808J32085K6752l3588
23215A19241j9372O2429J7788n3124j31152o123L4961M1426o6490j06555L8763
23204f8208J4794j30468M2910J00406m1938K1089K762m3450J09900N7790K3602
23193H9189p7115k0344j14498J2301J12657Q2275j24715j03657o6008N5700N2013
23182a02202N2961J30553l6426j09642N6155O9629j55120q319J75783J3010J2567
$$ plain form
23171 98949 72673 -14120 -2281 66924 154342 187700 88533 -32344 55250 96376 60836
23160 60836 82494 -9296 -37643 -129546 -45328 94465 103701 73184 126951 53615 -44871 -24184
23148 -24184 -78378 -119770 -55911 73078 109661 184355 156930 51144 14849 16053 27673
23137 27673 -30054 -22768 -66472 -49672 8075 39638 -27189 -34996 -5879 90961 113693 58290
23125 58290 -29527 -14687 10759 -21255 -106341 -120988 -77084 -91215 -74362 -19258 58893 73161
23113 73161 36205 26366 107863 84437 -97049 -202416 -237051 -280024 -251124 -115617 89100
23102 89100 75172 95502 118027 1606 -116691 -65793 -48990 -49073 31916 60805 -6003 -52528
23090 -52528 -30402 -97709 -110862 -75355 -128228 -117662 -39279 14779 4643 -86838 -120135 -53459
$$ packed form
23171I8949k6276q6793J1839O9205Q7418L3358r9167j20877Q7594M1126l5540
23160F0836K1658r1790k8347r1903Q4218J39793R236l0517N3767p3336r8486K0687
23148b4184n4194m1392O3859J28989L6583P4694k7425j05786l6295J204J1620
23137B7673n7727P286m3704J6800N7747L1563o6827p807K9117R6840K2732n5403
23125E8290q7817J4840K5446l2014q5086j4647M3904j4131J6853N5104P8151J4268
23113G3161l6956r839Q1497k3426j81486j05367l4635m2973K8900J35507K04717
23102H9100j3928K0330K2525j16421j18297N0898J6803q3Q0989K8889o6808m6525
23090e2528K2126o7307j3153L5507n2873J0566P8383N4058j0136r1481l3297O6676
$$ plain form
23078 -53459 35305 -21750 -20394 -59036 -89269 -17225 53866 -39442 -102391 -67783 -100915 -63206
23066 -63206 -24361 -12302 -39922 -61818 -66745 -57738 -94983 -136402 -90230 -155741 -181036 -172186
23054 -172186 -164218 -29292 176355 226687 168957 134478 94329 51994 133135 188234 69853
23043 69853 -21589 -121204 -80321 15341 -23086 5405 -114067 -191770 -157820 -79816 3597
23032 3597 -7001 83283 159061 149496 152968 158075 44684 -38933 -42856 -59402 -63506 53178
23020 53178 130336 130363 169759 187361 138861 97324 75670 -47517 -160404 -162906 -205431 -88380
23008 -88380 -36581 -48289 -51268 24794 124552 9175 -130850 -159562 -153457 -148328 -75189 -17562
22996 -17562 -31665 -10966 -83097 -143906 -162512 -7892 23311 -10969 21385 -27614 -60550
$$ packed form
23078e3459Q8764n7055J356l8642l0233P2044P1091r3308o2949L4608l3132L7709
23066f3206L8845J2059k7620k1896m927R007l7245m1419M6172o5511k5295Q850
23054a72186P968J34926K05647N0332n7730l4479m0149m2335Q1141N5099j18381
23043F9853r1442r9615M0883R5662l8427K8491j19472p7703L3950P8004Q3413
23032C597j0598R0284P5778r565L472N107j13391q3617l923j6546m104J16684
23020E3178P7158K7L9396J7602m8500m1537k1654j23187j12887k502m2525J17051
23008h8380N1799j1708k979P6062R9758j15377j40025k8712O105N129P3139N7627
22996a7562j4103K0699p2131o0809j8606J54620L1203l4280L2354m8999l2936
$$ plain form
22985 -60550 78315 166312 131828 124904 108840 118058 83575 40118 -71514 -118773 -182612 -211981
22973 -211981 -92941 -1445 30425 103626 76852 53327 138930 181890 101531 -36245 -85944
22962 -85944 -158706 -186167 43427 181859 156316 82124 27307 3156 -24165 -38438 3028
22951 3028 -14524 -6789 -45519 7457 48132 -60682 -129141 -166826 -229183 -364463 -340698 -148243
22939 -148243 -93637 -108590 -151507 -146333 -49036 -43704 -42197 -126989 -152813 -91074 7707 72668
22927 72668 190447 263108 240960 184899 127666 -35913 -153853 -166087 -218702 -265249 -168495
22916 -168495 -52330 -45367 15288 -11665 -29404 -62537 -21646 49121 159508 177822 178415 108503
22904 108503 80343 74049 139569 107486 36118 978 -83899 -73469 -2451 71314 66764 -960
$$ packed form
22985f0550J38865Q7997l4484o924j6064R218l4483m3457j11632m7259o3839k9369
22973b11981J19040R1496L1870P3201k6774k3525Q5603M2960q0359j37776m9699
22962h5944p2762k7461K29594J38432k5543p4192n4817k4151k7321j4273M1466
22951C028j7552P735l8730N2976M0675j08814o8459l7685o2357j35280K3765J92455
22939a48243N4606j4953m2917N174R7297N332J507q4792k5824O1739R8781O4961
22927G2668J17779P2661k2148n6061n7233j63579j17940j2234n2615m6547R6754
22916a68495J16165O963O0655k6953j7739l3133M0891P0767J10387J8314N93o9912
22904A08503k8160o294O5520l2083p1368l5140q4877J0430P1018P3765m550o7724
$$ plain form
22892 -960 -49290 51721 5010 -65297 48809 -7859 -52405 -62662 -111929 -101371 -137026 -37239
22880 -37239 -42287 -47723 -29748 25855 42331 -43714 -104733 -53699 -4346 16168 -11873 -65241
22868 -65241 -93648 -142433 -94916 22614 22585 -26275 -34698 -88278 -54592 -60662 -75708 -30777
22856 -30777 -31816 -11171 -15976 7745 31101 -43477 -47150 -80989 -131209 -177787 -62030 -27034
22844 -27034 -44787 -113177 -69452 13822 61337 91725 80773 91592 42883 37049 23938 9724
22832 9724 88476 79868 -27101 -39817 96210 145003 23427 -50533 -71286 15063 95036
22821 95036 85863 119957 135945 144111 174144 175395 184276 154335 114066 27565 78853 108700
22809 108700 29725 -27940 31494 -26598 -105366 -64980 -19718 -25479 -47097 40891 145874
$$ packed form
22892i60m8330J01011m6711p0307J14106n6668m4546j0257m9267J0558l5655R9787
22880c7239n048n436J7975N5603J6476q6045o1019N1034M9353K0514k8041n3368
22868f5241k8407m8785M7517J17530k9m8860q423n3580L3686o070j5046M4931
22856c0777j039K0645m805K3721K3356p4578l673l3839n0220m6578J15757L4996
22844b7034j7753o8390M3725Q3274M7515L0388j0952J0819m8709n834j3111j4214
22832I724P8752q608j06969j2716J36027M8793j21576p3960k0753Q6349P9973
22821I5036r173L4094J5988Q166L0033J251Q881k9941m0269q6501N1288K9847
22809A08700p8975n7665N9434n8092p8768M0386M5262n761k1618Q7988J04983
$$ plain form
22798 145874 119483 3800 -103956 -133649 -109309 13311 46190 -62741 28530 56594 65232
22787 65232 77823 -42025 -113659 -37578 44620 51950 -1097 -28805 65771 77526 117869 96613
22775 96613 34269 -33698 -46468 -33156 20259 91854 97383 1767 -10856 45368 49778 90551
22763 90551 57925 73152 112780 60216 113399 173816 111485 128309 93959 46646 -4453 99367
22751 99367 82426 29045 20718 15768 19045 48844 -105146 -156244 -146829 -97230 -41546 2774
22739 2774 -23810 -62633 -42627 1196 152433 209022 56763 -134350 -142470 -12842 7336
22728 7336 -11312 100966 184027 190514 202090 261616 183962 126965 -1433 -68028 -19832 62545
22716 62545 90247 153080 45778 -52098 -17220 6520 101548 91414 82266 190318 158072
$$ packed form
22798A45874k6391j15683j07756k9693K4340J22620L2879j08931R1271K8064Q638
22787F5232J2591j19848p1634P6081Q2198P330n3047k7708R4576J1755M0343k1256
22775I6613o2344o7967j2770J3312N3415P1595N529r5616j2623N6224M410M0773
22763I0551l2626J5227L9628n2564N3183O0417o2331J6824l4350m7313n1099J03820
22751I9367j6941n3381q327m950L277K9799j53990n1098R415M9599N5684M4320
22739B774k6584l8823K0006M3823J51237N6589j52259j91113q120J29628K0178
22728G336j8648J12278Q3061O487J1576N9526p7654n6997j28398o6595M8196Q2377
22716F2545K7702O2833j07302r7876L4878K3740R5028j0134r148J08052l2246
$$ plain form
22705 158072 99054 -121526 -250633 -154241 -67183 -89753 -223035 -264410 -154943 -6706
22695 -6706 70521 62039 -59473 -79782 -82617 -64798 -60722 -44891 -9566 -4526 -66760 -70117 -60063
22682 -60063 -91752 -122843 -123484 -221336 -148160 -143564 -111022 -99034 -19395 33324 10301 -31972
22670 -31972 -71285 -103261 -166287 -104971 25563 93000 52664 104582 -6719 -77008 -77648 3629
22658 3629 11725 -2087 -12530 13882 -79287 -117559 -71143 -10335 2058 -12996 -58688 -86747
22646 -86747 13903 91090 38878 -15578 52175 81041 22878 41304 47219 121746 90448 -44244
22634 -44244 -75072 -41918 65206 11971 -19850 -67508 -36730 -38465 -91063 -123389 -161631 -202314
22622 -202314 -183473 -110348 -75793 -11255 46945 -34901 -54780 -1379 29818 -16486 -80127
$$ packed form
22705A58072n9018k20580j29107R6392Q7058k2570j33282m1375J09467J48237
22695f706P7227q482j21512k0309k835J7819M076J5831L5325N040o2234l357J0054
22682f0063l1689l1091o41r7852P3176M596L2542J1988P9639N2719k3023m2273
22670c1972l9313l1976o3026O1316J30534O7437m0336N1918j11301p0289o40Q1277
22658C629Q096j3812j0443K6412r3169l8272M6416O0808J2393j5054m5692k8059
22646h6747J00650P7187n2212n4456O7753K8866n8163J8426N915P4527l1298j34692
22634d4244l0828L3154J07124n3235l1821m7658L0778j735n2598l2326l8242m0683
22622b02314J8841P3125L4555O4538N8200q1846j9879N3401L1197m6304o3641
$$ plain form
22611 -80127 -106406 -12986 65006 20175 -78772 -54750 -125485 -9687 58371 89685 94541 79338
22599 79338 -14950 46354 24919 -39943 -2731 68015 53970 13748 13982 2130 -27603 1662
22587 1662 24363 -25665 63154 -45721 64448 96261 28697 -58930 -101833 -72880 -19096
22576 -19096 72003 99795 40975 94506 86379 37544 -2519 -129173 -148331 -59331 78801
22565 78801 -12150 -33008 -55689 -182771 -104598 -52494 -51018 46041 43592 -75644 -160134 -27940
22553 -27940 42441 49962 55851 59678 -34541 -21897 305 -39078 -14643 -22218 -55510 -95695
22541 -95695 -83888 -849 -42579 -36513 -98256 -97482 -87847 -119200 -81302 -7886 -34422 -59511
22529 -59511 -41689 -26998 -60289 -90585 -100935 -60841 -136303 -152539 2260 96638 51899
$$ packed form
22611h0127k6279R3420P7992m4831r8947K4022p0735J15798O8058L1314M856j5203
22599G9338r4288O1304k1435o4862L7212P0746j4045m0222K34j1852k9733K9265
22587A662K2701n0028Q8819j08875J10169L1813o7564q7627m2903K8953N3784
22576a9096R1099K7792n8820N3531q127m8835m0063j26654j9158Q9000J38132
22565G8801r0951k0858k2681j27082P8173N2104J476R7059k449j19236q4490J32194
22553b7940P0381P521N889L827r4219J2644K2202l9383K4435p575l3292m0185
22541i5695J1807Q3039m1730O066o1743P74R635l1353L7898P3416k6536k5089
22529e9511J7822J4691l3291l0296j0350M0094p5462j6236J54799R4378m4739
$$ plain form
22518 51899 -32552 -46584 -70641 -69580 -63107 32923 35087 2512 24155 86855 114698 69552
22506 69552 33434 107 -30085 -22063 5642 23441 111926 124963 10979 -30468 9738 54358
22494 54358 21059 -22212 -86397 -48757 -34522 14395 60986 134796 73275 -6883 -85528 -83026
22482 -83026 36680 230069 200562 190018 247487 130191 -35595 -183021 -207039 -241652 -202557
22471 -202557 -41711 -23980 30971 2606 -18089 21711 20926 23332 106338 123107 55450 -80496
22459 -80496 25522 165521 24935 -14973 58058 10382 61807 135073 118154 -22830 -118693
22448 -118693 -80032 -85370 -60719 -57688 -55069 -93610 -124107 -105976 -15082 66690 48878 23955
22436 23955 -5024 -10556 28618 90045 100468 37564 -7906 48390 16638 46612 132723 148958
$$ packed form
22518E1899q4451j4032k4057J061O473R6030K164l2575K1643O2700K7843m5146
22506F9552l6118l3327l0192Q022K7705J7799Q8485J3037j13984m1447M0206M4620
22494E4358l3299m3271o4185L7640J4235M8917M6591P3810o1521q0158p8645K502
22482h3026J19706J93389k9507j0544N7469j17296j65786j47426k4018l4613L9095
22471b02557J60846J7731N4951k8365k0695L9800p85K406Q3006J6769o7657j35946
22459h0496J06018J39999j40586l9908P3031m7676N1425P3266j6919j40984r5863
22448a18693L8661n338K4651L031K619l8541l0497J8131R0894Q1772j7812k4923
22436B3955k8979n532L9174O1427J0423o2904m5470N6296l1752K9974Q6111J6235
$$ plain form
22424 148958 106357 44115 64155 69673 91898 46429 -3639 -35348 -62916 -273 -53969 2080
22412 2080 69232 175314 182014 76647 44009 29444 -28753 -35510 -83193 -27743 -75501 -83807
22400 -83807 -31673 42621 -72088 -94805 -89546 -106806 -132871 -93191 -60214 -72458 -113026 -77360
22388 -77360 -82460 -57700 -30969 -3976 -49112 -60828 -27125 394 -67613 86306 83753 35361
22376 35361 15913 -38760 -42954 15284 109565 183491 106237 -7467 -40000 -15199 66669 35344
22364 35344 69338 98146 81704 169864 138614 97361 56750 -78600 -111330 -33872 -9262
22353 -9262 23713 137382 49907 -8542 -34262 -895 103119 102093 18551 -6193 70787 57729
22341 57729 48496 115756 119407 118261 177180 52499 -29075 -135148 -90190 7887 42756 75664
$$ packed form
22424A48958m2601o2242K0040N518K2225m5469n0068l1709k7568O2643n3696N6049
22412B080O7152J06082O700j05367l2638j4565n8197o757m7683N5450m7758q306
22400h3807N2134P4294j14709k2717N259j7260k6065L9680L2977j2244m0568L5666
22388g7360n100K4760K6731K6993m5136j1716L3703K7519o8007J53919k553m8392
22376C5361j9448n4673m194N8238R4281P3926p7254j13704l2533K4801Q1868l1325
22364C5344L3994K8808j6442Q8160l1250m1253m0611j35350l2730P7458K4610
22353i262L2975J13669q7475n8449k5720L3367J04014j026q3542k4744P6980j3058
22341E7729r233O7260L651j146N8919j24681q1574j06073M4958R8077L4869L2908
$$ plain form
22329 75664 -68726 -148200 -192625 -214252 -112788 -57338 -191044 -215078 -173149 -149656 -61005
22318 -61005 -46745 74372 195939 176886 112254 63417 48092 50564 63853 105929 -31051
22307 -31051 -24238 27970 139808 351213 340394 188277 149895 222131 204428 103929 175670
22296 175670 260976 155318 186623 102930 81409 80561 52631 16296 -69183 -12025 111 25630
22284 25630 57412 -20973 -51971 -14147 25107 -35050 69460 54636 -75924 -88138 -137913
22273 -137913 -289772 -261905 -181805 -180885 -98758 -42559 74029 45962 -10431 3051 49630
22262 49630 57514 -81577 -77566 -80908 -67602 -166349 -173194 -169927 -154776 -61692 -116480 -175868
22250 -175868 -59353 -2274 58164 134019 137020 78894 72713 -3859 -26669 -17128 -19878 -49103
$$ packed form
22329G5664j44390p9474m4425k1627J01464N5450j33706k4034M1929K3493Q8651
22318f1005J4260J21117J21567j9053o4632m8837j5325K472J3289M2076j36980
22307c1051O813N2208J11838K11405j0819j52117l8382P2236j7703j00499P1741
22296A75670Q5306j05658L1305q3693k1521q48k7930l6335q5479N7158J2136K5519
22284B5630L1782p8385l0998L7824L9254o0157J04510j4824j30560j2214m9775
22273a37913j51859K7867Q0100R20Q2127N6199J16588k8067n6393J3482M6579
22262D9630P884j39091M011l342J3306r8747o845L267J5151R3084n4788n9388
22250a75868J16515N7079O0438P5855L001n8126o181p6572k2810R541k750k9225
$$ plain form
22238 -49103 38407 45722 71197 -36924 26982 -18560 -83303 -101321 -135386 -84801 -38615 72129
22226 72129 23412 2175 24338 -30064 -1241 68646 92614 165115 147840 64976 87981 38622
22214 38622 13895 -34287 -95671 -15875 -63897 -60909 -78113 -143218 -146784 -42009 6734 -2073
22202 -2073 80547 181277 119496 113017 63102 8179 71785 46687 -66939 -38390 -46467 65676
22190 65676 126688 105381 24375 123129 111687 129212 149237 134027 120124 -25935 47282
22179 47282 97934 39514 70769 56248 18302 -78188 -34177 142385 198834 149411 103093
22168 103093 32007 44500 57567 109855 76612 27000 -27248 -102901 -76216 -117220 -164632
22157 -164632 -131773 -5065 -22106 -100340 -137903 -52358 2702 58812 27794 -49201 51094
$$ packed form
22238d9103Q7510P315K5475j08121O3906m5542o4743j8018l4065N0585M6186J10744
22226G2129m8717k1237K2163n4402K8823O9887K3968P2501j7275q2864K3005m9359
22214C8622k4727m8182o1384P9796m8022K988j7204o5105l566J04775M8743q807
22202b073Q2620J00730o1781o479m9915n4923O3606k5098j13626K8549q077J12143
22190F5676O1012k1307q1006R8754j1442J7525K0025j5210j3903j46059P3217
22179D7282N0652n8420L1255j4521l7946r6490M4011J76562N6449m9423m6318
22168A03093p1086J2493J3067N2288l3243m9612n4248p5653K6685m1004m7412
22157a64632L2859J26708j7041p8234l7563Q5545N5060N6110l1018p6995J00295
$$ plain form
22146 51094 164856 32693 8986 42711 -27026 -69974 -71832 -76756 -155748 -237870 -103272
22135 -103272 23810 103452 52394 -167016 -210561 -178854 -89299 15926 59582 6107 -117796
22124 -117796 -92891 56523 99759 114240 165066 163587 145240 158131 159030 95939 173003 236775
22112 236775 175438 68829 25259 -4911 33695 34173 102474 70278 14035 -97531 -144490
22101 -144490 -120143 -28609 128 37495 71188 35191 99072 92016 95232 112260 73574 72320
22089 72320 50133 -8846 26719 31088 -5935 -28225 -115430 -198165 -99746 8294 4374 26479
22077 26479 93029 95275 57123 34779 -6014 -60228 -162897 -175847 -123743 -198033 -137030 -38424
22065 -38424 -12325 -36373 54236 170947 220137 146360 126685 74677 117748 119617 40832 24346
$$ packed form
22146E1094J13762j32163k3707L3725o9737m2948j858m924p8992q2122J34598
22135a03272J27082P9642n1058k19410m3545L1707Q9555J05225M3656n3475j23903
22124a17796K4905J49414M3236J4481N0826j479j8347J2891Q99o3091P7064O3772
22112B36775o1337j06609m3570l0170L8606M78O8301l2196n6243j11566m6959
22101a44490K4347R1534K8737L7367L3693l5997O3881p056L216J7028l8686j254
22089G2320k2187n8979L5565M369l7023k2290q7205q2735R8419J08040l920K2105
22077B6479O6550K246l8152k2344m0793n4214j02669j2950N2104p4290O1003R8606
22065c8424K6099k4048R0609J16711M9190p3777j9675n2008M3071J869p8785j6486
$$ plain form
22053 24346 -28593 -46262 -103753 -35205 136523 83829 47329 90933 91429 21585 58877 89406
22041 89406 90994 -4550 -26150 -48974 15165 -1486 -14210 60248 126616 106035 125129 119502
22029 119502 88812 96960 78595 37537 161766 125027 184797 139391 95472 6059 -120058
22018 -120058 -113542 -155810 -186176 -205664 -189041 -129232 -96590 -85631 -182673 -161193 -186049 -91239
22006 -91239 -3137 22721 -11093 5640 -2284 103140 95309 19371 29552 54429 63417 11256
21994 11256 -6493 -19484 1560 4305 -15337 -14734 33426 -71313 -43566 -4 90199 61800
21982 61800 -17373 -77383 -142952 -255701 -252430 -245422 -144919 -114735 -69604 4851 38838 57318
21970 57318 4052 -28801 29205 78112 164557 176832 300844 321804 258456 212910 65769
$$ packed form
22053B4346n2939j7669n7491O8548J71728n2694l6500M3604M96o9844L7292L0529
22041H9406J588r5544k1600k2824O4139j6651j2724P4458O6368k0581J9094n627
22029A19502l0690Q148j8365m1058J24229l6739N9770m5406m3919q9413j26117
22018a20058O516m2268l0366j9488J6623N9809L2642J0959r7042K1480k4856R4810
22006i1239Q8102K5858l3814J6733p924J05424p831p5938J0181K4877Q988n2161
21994A1256j7749j2991K1044K745j9642O03M8160j04739K7747M3562R0203k8399
21982F1800p9173o0010o5569j12749L271P008J00503L0184M5131P4455L3987J8480
21970E7318n3266l2853N8006M8907Q6445J2275J24012K0960o3348m5546j47141
$$ plain form
21959 65769 4500 -101113 -109038 6696 85775 55097 48968 156742 224206 210831 202039 174359
21947 174359 87501 -46307 -56264 -69258 -49072 -50852 -162787 -69512 62718 71832 12077
21936 12077 36117 35568 124351 181411 148077 58800 -65881 46762 147125 145905 101624 109144
21924 109144 92298 165427 74144 -26281 -33111 90552 101818 63548 106833 85181 16120
21913 16120 -62231 -127406 -87869 31903 76820 131225 68550 -51067 -145191 -82438 -18991
21902 -18991 -28573 13085 73122 142122 120054 68850 126325 227839 237633 202703 149202 100642
21890 100642 130356 98028 5177 -22509 -74321 -51186 11672 51565 45527 65559 77824 65712
21878 65712 82296 1243 62678 55659 124575 207791 207672 213712 173374 149186 139636 120322 42387
$$ packed form
21959F5769o1269j05613p925J15734P9079l0678o129J07774O7464j3375q792k7680
21947A74359q6858j33808r957j2994K0186j780j11935R3275J32230R114n9755
21936A2077K4040n49Q8783N7060l3334q9277j24681J12643J00363j220m4281P520
21924A09144j6846P3129r1283j00425o830J23663J1266l8270M3285k1652o9061
21913A6120p8351o5175L9537J19772M4917N4405o2675j19617r4124O2753O3447
21902a8991r582M1658O0037O9000k2068n1204N7475J01514R794l4930n3501m8560
21890A00642K9714l2328r2851k7686n1812K3135O2858L9893o038K0032J2265j2112
21878F5712J6584q1053O1435p019O8916Q3216j19O040m0338k4188r550j9314p7935
$$ plain form
21865 42387 -29263 -56002 -14775 71893 18004 -30044 -63086 -184442 -225135 -248723 -268679
21854 -268679 -189161 -129181 -102473 -33776 34820 95029 180969 220242 162772 37548 -41487
21843 -41487 -43903 -36019 -39350 47012 54583 76668 6123 36595 84435 103438 41534 102988
21831 102988 109204 147566 57714 27414 -34666 85157 121342 105975 170891 208319 144084
21820 144084 137163 174710 126423 16558 16969 86031 -7389 -31566 12338 -87813 -55064 41732
21808 41732 216263 247661 179974 21110 -71302 -163473 -58367 27999 -38728 -140053 -66249
21797 -66249 -7903 -48262 -44088 959 117087 113581 19890 16942 -44816 -185411 -133938 -112095
21785 -112095 -173598 -92299 33391 27191 24757 54906 120357 78081 56492 46174 104316 -28974
$$ packed form
21865D2387p1650k6739M1227Q6668n3889m8048l3042j21356m0693k3588j9956
21854b68679P9518N9980K6708O8697O8596O0209Q5940L9273n7470j25224p9035
21843d1487k416P884l331Q6362P571K2085p0545L0472M7840J9003o1904O1454
21831A02988O216L8362q9852l0300o2080J19823L6185j5367O4916L7428o4235
21820A44084o921L7547m8287j09865M11O9062r3420k4177M3904j00151L2749R6796
21808D1732J74531L1398o7687j58864r2412r2171J05106Q6366o6727j01325P3804
21797f6249N8346m0359M174M5047J16128l506r3691k948o1758j40595N1473K1843
21785a12095o1503Q1299J25690o200k434L0149O5451m2276k1589j0318N8142j33290
$$ plain form
21773 -28974 -33396 -25802 -15376 8839 135270 147932 102915 73586 64865 -15202 -9536 -1829
21761 -1829 -4960 -60074 -109190 -66970 -40156 -160887 -158912 -159147 -21100 103314 118642 115488
21749 115488 82739 96300 109800 84445 31072 -5073 -48057 -32140 31192 72948 11978
21738 11978 -18096 -43260 10182 39709 10214 11724 -47208 -22769 -48654 -56780 -102348 -41704
21726 -41704 -103612 20007 16015 -48005 -32781 27976 65558 48285 82803 99361 354 22743
21714 22743 2411 -74244 -47028 72991 70845 8915 -2170 64221 66353 -90121 -130346 -156817
21702 -156817 -189793 -146432 -76826 11807 116151 152879 96523 47133 12536 -8750 -58214
21691 -58214 -152505 -152587 -73544 -36522 -14585 -36038 -77484 -76510 235 149226 222313 199349
$$ packed form
21773b8974m422P594J0426K4215J26431J2662m5017k9329q721q0067N666P707
21761a829l131n5114m9116M2220K6814j20731J975k35J38047J24414J5328l154
21749A15488l2749J3561J3500k5355n3373l6145m2984J5917O3332M1756o0970
21738A1978l0074k5164N3442K9527k9495J510n8932K4439k5885q126m5568O0644
21726d1704o1908J23619l992o4020J5224O0757L7582j7273L4518J6558r9007K2389
21714B2743k0332p6655K7216J20019k146o1930j1085O6391K132j56474m0225k6471
21702a56817l2976M3361O9606Q8633J04344L6728n6356m9390l4597k1286m9464
21691e8214r4291q2P9043L7022K1937k1453m1446R74P6745J48991P3087k2964
$$ plain form
21679 199349 122968 -3410 -67940 -119906 -96753 -152961 -130298 -78953 -64142 -18849 -2147
21668 -2147 -119930 -84178 -71104 -148490 -134766 -100433 -4334 -23997 10475 -23016 -135657
21657 -135657 -196000 -115751 -16030 10285 43494 109423 122818 -12077 -22623 15532 -56666
21646 -56666 -101540 -73544 -45429 -6607 -30693 -6787 -54428 -71799 -84522 -147212 -171016 -61432
21634 -61432 -76347 70370 117261 75831 77309 30957 14179 -35685 -106926 -167694 -168269 -101065
21622 -101065 65594 83262 119733 197082 236939 215074 179655 99722 66339 14164 57323
21611 57323 121233 84364 -32686 -162352 -184894 -137991 -93707 -88219 -119016 -208799 -145204
21600 -145204 -41349 -51768 -90408 38496 125595 92064 59526 -9653 -62228 51563 22956
$$ packed form
21679A99349p6381j26378o4530n1966K3153n6208K2663N1345J4811M5293J6702
21668b147j17783L5752J3074p7386J3724L4333R6099j9663L4472l3491j12641
21657a35657o0343Q0249R9721K6315L3209O5929J3395j34895j0546L8155p2198
21646e6666m4874K7996K8115L8822k4086K3906m7641j7371j2723o2690k3804J09584
21634f1432j4915J46717M6891m1430J478m6352j6778m9864p1241o0768n75O7204
21622a01065J66659J7668L6471P7349L9857k1865l5419p9933l3383n2175M3159
21611E7323O3910l6869j17050j29666k2542M6903M4284N488l0797q9783O3595
21600a45204J03855j0419l8640J28904Q7099l3531l2538o9179n2575J13791k8607
$$ plain form
21589 22956 -54315 -61309 -103883 -63498 -114312 -150470 -152581 24294 113683 85480 29928 51335
21577 51335 40329 17920 -34055 -118018 -141889 -101420 -36077 82481 200486 112001 155157
21566 155157 244699 236131 223013 225160 247841 113225 -30843 -68406 -30502 -57372 22252
21555 22252 24090 21559 -113708 -195739 -164703 -97806 -32389 60561 30935 88716 139964 75002
21543 75002 140968 83605 29831 87591 54869 5459 -65003 18181 116102 123919 156380 118103
21531 118103 -13469 3933 17023 63291 46186 -38234 -115697 -186353 -166075 -26444 23637
21520 23637 -72873 -106579 -91414 -100270 -36560 -58104 -103198 -95145 -74708 12454 47418 35988
21508 35988 78724 67185 79420 -48642 -110244 -139661 -264485 -170008 -100033 -102596 -30518
$$ packed form
21589B2956p7271o994m2574M0385n0814l6158k111J76875Q9389k8203n5552K1407
21577E1335j1006k2409n1975q3963k3871M0469O5343J18558J18005q8485M3156
21566A55157Q9542q568j3118K147K2681j34616j44068l7563L7904k6870P9624
21555B2252J838k531j35267q2031L1036O6897O5417R2950k9626N7781N1248o4962
21543G5002O5966n7363n3774N7760l2722m9410p0462Q3184R7921P817L2461l8277
21531A18103j31572J7402J3090M6268j7105q4420p7463p0656K0278J39631N0081
21520B3637r6510l3706J5165q856O3710k1544m5094Q053K0437Q7162L4964j1430
21508C5988M2736j1539J2235j28062o1602k9417j24824R4477O9975k563P2078
$$ plain form
21497 -30518 106901 173778 105159 94924 128573 78961 -15337 -83863 -106048 33080 14343
21486 14343 45429 121174 177224 184836 165074 142823 122897 92422 65565 88610 57869 77829
21474 77829 127325 139254 50175 64615 46561 -20464 -32616 -68428 -116470 -57858 31521 109565
21462 109565 155954 136435 149570 173381 97889 73687 -42754 -75559 -87119 -12573 97151
21451 97151 25966 -34577 20669 -5559 -33157 -90513 -213154 -160492 -104155 -148601 -136336
21440 -136336 -93999 -12826 -34160 76882 101005 84176 111277 124028 69276 57308 -54115
21429 -54115 -107195 -74609 -23317 49269 44155 12847 75732 117920 77755 -45312 -89340 -116902
21417 -116902 -61829 -34251 -69332 -22991 26800 -43875 -31616 13680 -47266 -25201 -34844 -66927
$$ packed form
21497c0518J37419O6877o8619j0235L3649m9612r4298o8526k2185J39128j8737
21486A4343L1086P5745N6050P612j9762k2251j9926l0475k6857K3045l0741J9960
21474G7829M9496J1929q9079J4440j8054o7025j2152l5812m8042N8612Q9379P8044
21462A09565M6389j9519J3135K3811p5492k4202j16441l2805j1560P4546J09724
21451I7151p1185o0543N5246k6228k7598n7356j22641N2662N6337m4446J2265
21440a36336M2337Q1173k1334J11042K4123j6829K7101J2751n4752j1968j11423
21429e4115n3080L2586N1292P2586n114l1308O2885M2188m0165j23067m4028k7562
21417a16902N5073K7578l5081M6341M9791p0675J2259M5296o0946K2065r643l2083
$$ plain form
21405 -66927 -95277 -54840 -25019 22466 -40545 -50728 -84560 -81625 -92906 -61737 -3045 44366
21393 44366 -28669 -43507 -71732 -98024 -3789 48217 -16283 -35019 -78890 -63135 31741 26397
21381 26397 -7663 -16815 99207 58377 -113667 -154443 -214208 -255809 -115964 80252 51517
21370 51517 1130 44861 118943 64314 -89616 5397 99903 71252 23344 91199 128664
21359 128664 73834 -20469 -25156 -24058 -6553 24562 3375 -40364 -171563 -169885 -113587 -80340
21347 -80340 -76273 -98974 -55014 96325 176985 125412 110112 170010 185907 214113 154398 172566
21335 172566 219060 197234 232988 200144 84233 -8340 -28406 -75609 -31545 55441 -10877
21324 -10877 31065 66828 94277 83353 5778 29135 66420 87973 10888 10974 47519 169692
$$ packed form
21405f6927k8350M0437K9821M7485o3011j0183l3832K935j1281L1169N8692M7411
21393D4366p3035j4838k8225k6292R4235N2006o4500j8736m3871J5755R4876n344
21381B6397l4060r152J16022m0830j72044m0776n9765m1601J39845J96216k8735
21370E1517n0387M3731P4082n4629j53930R5013R4506k8651m7908O7855L7465
21359A28664n4830r4303m687J098J7505L1115k1187m3739j31199J678N6298L3247
21347h0340M067k2701M3960J51339Q0660n1573j5300N9898J5897K8206n9715J8168
21335A72566M6494k1826L5754l2844j15911r2573k0066m7203M4064Q6986o6318
21324a0877M1942L5763K7449j0924p7575K3357L7285K1553p7085Q6L6545J22173
$$ plain form
21312 169692 113626 -37186 -56761 -101275 -158455 -148343 -76753 20375 87481 87800 64671 106656
21300 106656 186745 127458 50731 33956 2207 159427 265043 128399 29586 -94968 -87169
21289 -87169 -75115 -34918 -28345 17145 74114 81121 83148 86766 -46492 -56371 78042 51964
21277 51964 -15969 -35050 -10816 -42493 -85004 -116623 -101412 -50097 -37164 -7391 36999 -19684
21265 -19684 -44020 -85979 -98672 37638 47205 100892 11900 -22655 46722 40627 -42639 -19230
21253 -19230 46271 -40990 -93673 26635 132481 103188 75893 -18725 -72694 -159927 -63389
21242 -63389 36997 -42136 -32319 69118 12804 8022 -83601 -148399 -119125 -115987 -72876 -24072
21230 -24072 -20805 -5217 -42529 -65327 -67023 -71792 -45642 3038 -38691 -13978 35885 13710
$$ packed form
21312A69692n6066j50812j9575m4514n7180J0112P1590R7128O7106L19k3129M1985
21300A06656Q0089n9287p6727j6775l1749J57220J05616j36644r8813j24554P799
21289h7169J2054M0197O573M5490N6969P007K027L618j33258r879J34413k6078
21277E1964o7933j9081K4234l1677m2511l1619J5211N1315J2933K9773M4390n6683
21265a9684k4336m1959j2693J36310R567N3687q8992l4555O9377o095q3266K3409
21253a9230O5501q7261n2683J20308J05846k9293k7295r4618n3969q7233R6538
21242f3389J00386p9133R817J01437n6314m782r1623o4798K9274L138M3111M8804
21230b4072L267J5588l7312k2798j696m769K6150M8680m1729K4713M9863k2175
$$ plain form
21218 13710 -8168 30175 -56128 -65325 -16074 46031 67167 46987 53171 19069 24613 10128
21206 10128 -41188 -20109 22483 178770 215238 43598 -6867 -45110 -58202 44452 74818
21195 74818 43877 7985 89586 192000 112832 25425 82691 82194 -16131 -36305 23649 -23060
21183 -23060 -27250 -21876 -25897 -81497 -97664 -17977 125859 109291 52962 77151 23803 13844
21171 13844 68790 -31676 -26464 -33865 -132315 -179919 -206060 -256480 -183754 -67597 762 16034
21159 16034 43231 -11527 21271 55050 -33530 -65844 1001 64098 79744 39113 -44760 -113325
21147 -113325 -57648 -44430 -118797 -132844 -13541 91609 69491 -2313 -21549 -59712 -186238
21136 -186238 -278918 -149034 -599 58266 103166 108149 143521 132410 73373 90002 56377
$$ packed form
21218A3710k1878L8343q6303r197M9251O2105K1136k0180O184l4102N544j4485
21206A0128n1316K1079M2592J56287L6468j71640n0465l8243j3092J02654L0366
21195G4818l0941l5892Q1601J02414p9168q7407N7266m97r8325k0174N9954m6709
21183b3060m190N374m021n5600j6167P9687J43836j6568n6329K4189n3348r959
21171A3844N4946j00466N212p401r8450m7604k6141n0420P2726J16157O8359J5272
21159A6034K7197n4758L2798L3779q8580l2314O6845O3097J5646m0631q3873o8565
21147a13325N5677J3218p4367j4047J19303J05150k2118p1804j9236l8163j26526
21136a86238r2680J29884J48435N8865M4900M983L5372j1111n9037J6629l3625
$$ plain form
21125 56377 11774 -24473 -97524 -39207 -22188 -60821 -47667 -90359 -157691 -83069 -45604 3022
21113 3022 -16385 63619 134536 145479 94074 -3260 -70856 -65505 31638 62339 52943 12042
21101 12042 34354 57888 25994 -64921 -1682 -113297 -105044 -66242 -84001 18515 75219
21090 75219 -6299 75677 153787 40482 -24405 -105080 -81910 13919 91505 73212 84204
21079 84204 80546 78665 29949 -19998 -47326 -42819 65801 93288 102959 128944 180119 75596
21067 75596 -133974 -246675 -179287 -172588 -204117 -64445 -24588 -3782 65576 -4438 56352
21056 56352 172607 162482 133156 102174 126867 191197 154296 105119 53405 71388 47443
21045 47443 19697 43712 24065 -78757 -87869 -34015 -40982 -77904 -81574 -10330 -38396 -134472
$$ packed form
21125E6377m4603l6247p3051N8317J7019l8633J3154m2692o7332P4622L7465M8626
21113C022j9407Q0004P0917J0943n1405r7334o7596N351R7143L0701r396m0901
21101A2042K2312K3534l1894r0915O3239j11615Q253L8802j7759J02516N6704
21090G5219q1518Q1976P8110j13305o4887q0675K3170R5829P7586j8293J0992
21079H4204l658j881m8716m9947k7328M507J08620K7487R671K5985N1175j04523
21067G5596k09570j12701O7388O699l1529J39672L9857K0806O9358p0014O0790
21056E6352J16255j0125k9326l0982K4693O4330l6901m9177n1714J7983k3945
21045D7443k7746K4015j9647j02822r112N3854o967l6922l670P1244k8066r6076
$$ plain form
21033 -134472 -83132 -34787 -28810 -91559 -132713 -77627 57606 169214 221411 163715 98766
21022 98766 147879 245482 312897 358768 249989 152104 86754 100987 108510 148088 156257 199438
21010 199438 190881 176572 92676 79842 144768 89117 65647 59366 -161944 -286811 -156333
20999 -156333 -27431 -2124 -48189 -104205 -88159 -69082 -71516 -5711 68883 118935 105246
20988 105246 106915 72864 92454 68510 11321 -2947 -26015 -117685 -158831 -77118 37444
20977 37444 117716 116820 57716 49635 4800 -28994 -12701 45255 235303 172388 -47314 -112303
20965 -112303 -133487 -55279 58195 23491 13219 -6155 -1703 45611 160855 164767 111429
20954 111429 87090 -29022 -95096 -186432 -145192 -97973 -142023 -30545 111380 55737 46647
$$ packed form
21033a34472N1340M8345N977o2749m1154N5086J35233J11608N2197n7696o4949
21022I8766M9113R7603O7415M5871j08779r7885o5350J4233P523L9578Q169M3181
21010A99438q557j4309q3896j2834O4926n5651k3470o281k21310j24867J30478
20999a56333J28902K5307m6065n6016J6046J9077k434O5805P4594N0052j3689
20988A05246J669l4051J9590k3944n7189j4268k3068r1670m1146Q1713J14562
20977C7444Q0272q96n9104q081m4835l3794J6293N7956J90048o2915k19702o4989
20965a12303k1184P8208J13474l4704j0272j9374M452M7314J15244L912n3338
20954A11429k4339j16112o6074r1336M1240M7219m4050J11478J41925n5643r090
$$ plain form
20943 46647 6737 -35310 5346 -81821 -187327 -72167 -27639 -56003 -22864 -64462 63310
20932 63310 96494 43902 12527 1511 58969 75570 37676 70383 108650 73175 -57620
20921 -57620 -94814 -48662 -129768 -224234 -89846 15868 -60232 -41940 372 54101 119077
20910 119077 100986 136722 90563 1529 83734 129987 90398 223958 319057 238683 187525
20899 187525 159920 95896 94806 164768 218797 114953 38774 -63254 -47757 -16015 -80283
20888 -80283 -81029 6917 57657 20092 55379 17333 29449 -40816 -15572 10853 -64186 -24527
20876 -24527 -14626 8923 -19561 -66395 -98596 5373 -137523 -75024 6643 27177 26201 57492
20864 57492 71540 139419 67630 78627 131381 81735 105136 69488 -56000 -63367 -33623 36905
$$ packed form
20943D6647l9910m2047M0656q7167j05506J15160M4528k8364L3139m1598J27772
20932F3310L3184n2592l1375j1016N7458J6601l7894L2707L8267l5475j30795
20921e7620l7194M6152q1106r4466J34388J05714p6100J8292M2312N3729O4976
20910A19077j8091L5736m6159q9034Q2205M6253l9589J33560R5099q0374n1158
20899A87525k7605o4024j090O9962N4029j03844p6179j02028J5497L1742o4268
20888h0283p46Q7946N0740l7565L5287l8046J2116p0265K5244K6425p5039L9659
20876b4527R901K3549k8484m6834l2201J03969j42896O2499Q1667K0534r76L1291
20864E7492J4048O7879p1789J0997N2754m9646K3401l5648j25488p367K9744P0528
$$ plain form
20852 36905 16549 -123469 -117600 -158174 -102775 -159441 -228641 -161599 -152177 -70034 27999 26502
20840 26502 67277 50279 -11735 40443 55908 -18458 -112999 -139177 -76277 -75319 -11295 29539
20828 29539 -31120 -12030 101685 75161 190692 226065 163055 176326 90755 -25742 439
20817 439 51737 163557 266493 239147 176732 212241 187368 149416 99233 -46324 -86668
20806 -86668 -119244 -81347 -74669 -58570 -70121 -120798 -165832 -102556 -97724 -91492 8701 151811
20794 151811 170178 79135 -15752 34918 569 -120191 -46115 111104 122667 118763 184253
20783 184253 106126 -41068 9941 59295 -18804 -10926 45250 118905 185854 158449 72474
20772 72474 16449 -51324 -48438 -27764 -91886 -177289 -137887 -52123 -204374 -175045 -28285
$$ packed form
20852C6905k0356j40018N869m0574N5399n6666o9200O7042R422Q2143R8033j497
20840B6502M0775j6998o2014N2178J5465p4366r4541k6178O2900R58O4024M0834
20828B9539o0659J9090J13715k6524J15531L5373o3010J3271q5571j16497K6181
20817D39N1298J11820J02936k7346o2415L5509k4873l7952n0183j45557m0344
20806h6668l2576L7897O678J6099j1551n0677m5034O3276M832O232J00193J43110
20794A51811J8367r1043r4887N0670l4349j20760P4076J57219J1563l904O5490
20783A84253p8127j47194N1009M9354p8099P878N6176P3655O6949k7405q5975
20772G2474n6025o7773K886K0674o4122q5403L9402Q5764j52251K9329J46760
$$ plain form
20761 -28285 -54269 -80295 16106 29646 10692 -8052 98994 -55985 -220890 -150441 -145243
20750 -145243 -140391 -20202 61071 51196 92605 17691 -22060 -45618 1823 50697 -92 63446
20738 63446 118544 67567 -993 -51576 -40689 -95877 -208459 -99946 -75450 -80507 -10334
20727 -10334 21577 6344 -37529 9464 -4992 -94961 -54108 34277 168927 153625 191345
20716 191345 185619 17766 -145881 -109640 -37063 10073 14679 177258 254344 240748 213948
20705 213948 171103 111851 87560 60867 31615 -8097 19790 -11913 66307 81136 71183 129923
20693 129923 56669 56737 119995 234387 211969 143633 64885 -397 85602 149647 66734 18155
20681 18155 -24742 74380 129578 196219 185135 109031 32618 43785 78219 63498 11442 86634
$$ packed form
20761b8285k5984k6026R6401J3540j8954j8744J07046j54979j64905P0449N198
20750a45243M852J20189Q1273r875M1409p4914l9751k3558M7441M8874n0789O3538
20738F3446N5098n0977o8560n0583J0887n5188j12582J08513K4496n057P0173
20727a0334L1911j5233m3873M6993j4456q9969M0853Q8385J34650j5302L7720
20716A91345n726j67853j63647L6241P2577M7136M606J62579P7086j3596k6800
20705B13948m2845n9252k4291k6693k9252l9712K7887l1703P8220J4829r953N8740
20693A29923p3254O8O3258J14392k2418o8336p8748o5282Q5999O4045q2913m8579
20681A8155m2897R9122N5198O6641j1084p6104p6413J1167L4434j4721n2056P5192
$$ plain form
20669 86634 213759 228945 43214 -55863 -71756 -81874 21535 98348 101384 21536 -87381
20658 -87381 12008 41522 8580 -112076 -65043 7709 132422 59686 36726 55904 112756
20647 112756 24405 -118262 -132082 -148792 -207862 -190576 -177541 -193404 -119256 -103949 368
20636 368 86364 133782 147220 178241 51618 -36997 -55110 8074 58286 63553 46325 2657
20624 2657 -36389 29939 11484 16438 965 -101015 -132768 -186590 -163236 -86066 40544 32983
20612 32983 22726 -17910 -110606 -58239 -101958 -144305 -49181 39900 -34205 -60862 -70435 17292
20600 17292 45741 45116 32291 662 50404 93909 57136 56316 28180 -60092 16013 63603
20588 63603 20400 106642 154301 68047 44740 -59175 -98528 -110249 -44583 49425 7189
$$ packed form
20669H6634J27125J5186j85731r9077j5893j0118J03409P6813L036p9848j08917
20658h7381R9389K9514l2942j20656M7033P2752J24713p2736k2960J9178N6852
20647A12756q8351j42667j3820j6710n9070J7286J3035j5863P4148J5307J04317
20636C68Q5996M7418J3438L1021j26623q8615j8113O3184N0212N267j7228m3668
20624B657l9046O6328j8455M954j5473j01980l1753n3822K3354P7170J26610p561
20612C2983j0257m0636r2696N2367m3719m2347R5124Q9081p4105k6657r573Q7727
20600A7292K8449o25j2825l1629M9742M3505l6773q20k8136q8272P6105M7590
20588F3603m3203Q6242M7659q6254k3307j03915l9353j1721O5666R4008m2236
$$ plain form
20577 7189 -33116 -275 -59351 -57811 -108951 -24456 19588 128735 185344 137784 96986 -30570
20565 -30570 -140423 -89200 -72345 -43900 -73566 -64128 -75599 -70842 -21584 -77253 -79669 833
20553 833 68425 -66216 -140407 -100511 -47637 -58890 10601 -10605 -63519 -51763 -115684 -68228
20541 -68228 104075 155622 46247 45942 53673 139794 215128 218409 115052 -46864 43740 76308
20529 76308 37791 87654 -4886 57523 274983 264845 156809 30632 -30645 -49927 -9528
20518 -9528 21042 23950 -38870 -119489 -34551 63876 182010 215063 168837 194701 105946 21263
20506 21263 99181 187462 117939 67689 31004 6105 -65657 -169477 -108713 12837 -33839
20495 -33839 -50433 21967 54875 12764 16654 34418 33596 -6109 -48851 -59034 -117792 -91824
$$ packed form
20577G189m0305L2841n9076J540n1140Q4495M4044J09147N6609m7560m0798j27556
20565c0570j09853N1223J6855K8445k9666R438j1471M757M9258n5669k416Q0502
20553H33O7592j34641p4191L9896N2874j1253O9491k1206n2914J1756o3921M7456
20541f8228J72303N1547j09375l05P731Q6121P5334L281j03357j61916R0604L2568
20529G6308l8517M9863r2540O2409K17460j0138j08036j26177o1277j9282M0399
20518i528L0570K908o2820q0619Q4938R8427J18134L3053m6226K5864q8755q4683
20506B1263P7918Q8281o9523n0250l6685k4899p1762j03820O0764J21550m6676
20495c3839j6594P2400L2908m2111L890J7764q22l9705m2742j0183n8758K5968
$$ plain form
20483 -91824 7079 9149 25883 -69983 -91809 103032 151962 27693 38275 -15753 -58358
20472 -58358 15877 23119 18940 104781 232016 173152 60094 19307 -59449 -89390 -52705 91816
20460 91816 129538 200575 203120 139476 113302 47333 -17792 61484 -11597 16096 -1272 -56743
20448 -56743 -2720 32211 59762 66861 28986 63383 64455 34017 65216 50519 54434 106739
20436 106739 68439 25270 29941 8409 -22233 -68748 -108377 -54911 -148384 -47752 128641
20425 128641 127478 71235 -9070 31181 41014 -22245 -70682 -34873 -71481 -82452 -144689 -143762
20413 -143762 -107586 -97885 -69579 -65195 43343 138672 168444 220221 85256 13768 32169
20402 32169 58545 35329 72461 143338 214933 81556 -8402 55540 128216 65038 13399
$$ packed form
20483i1824R8903K070J6734r5866k1826J94841M8930j24269J0582n4028m2605
20472e8358P4235P242m179Q5841J27235n8864j13058m0787p8756k9941L6685J44521
20460I1816L7722P1037K545o3644k6174o5969o5125P9276p3081K7693j7368n5471
20448e6743N4023L4931K7551P099l7875L4397J072l0438L1199j4697L915N2305
20436A06739l8300m3169M671k1532l0642m6515l9629N3466r3473J00632J76393
20425A28641j163n6243q0305M0251R833o3259m8437L5809l6608j0971o2237R27
20413a43762L6176R701K8306M384J08538R5329K9772N1777j34965p1488J8401
20402C2169K6376k3216L7132P0877P1595j33377q9958O3942P2676o3178n1639
$$ plain form
20391 13399 193568 243652 156764 142864 12596 -54092 5258 56138 11780 94196 182579
20380 182579 232779 177385 204408 83683 210878 299604 275746 174208 117271 182633 218683
20369 218683 230911 142160 103947 52766 -49724 -38295 69289 128770 111603 130460 91920
20358 91920 69591 18364 915 -12099 -10705 33617 -58698 -104045 -17697 49655 98837 73782
20346 73782 38077 11775 -94691 -194150 -206328 -179779 -125294 -167575 -184362 -165657 -66844
20335 -66844 66250 89311 8810 -70448 -56666 122489 249579 177011 77220 82791 107556
20324 107556 133085 116576 84364 -29839 -51357 88088 172371 179214 32099 2767 111384
20313 111384 64047 82033 99029 131906 154923 160074 65362 40469 36841 22359 34 17580
$$ packed form
20391A3399J80169N0084q6888j3900j30268o6688N9350N0880m4358Q2416Q8383
20380A82579N0200n5394K7023j20725J27195Q8726k3858j01538n6937O5362L6050
20369B18683J2228q8751l8213n1181j02490J1429J07584N9481j7167J8857l8540
20358I1920k2329n1227j7449j3014J394M4322r2315m5347Q6348O7352M9182k5055
20346G3782l5705k6302j06466r9459j2178K6549N4485m2281j6787J8705R8813
20335f6844J33094K3061q0501p9258J3782J79155J27090p2568r9791N571K4765
20324A07556K5529j6509l2212j14203k1518J39445Q4283O843j47115k9332J08617
20313A11384m7337J7986J6996L2877K3017N151r4712k4893l628j4482k2325J7546
$$ plain form
20301 17580 68797 72225 -11314 -90204 -148688 -91254 -18999 38361 135789 126758 76210 -22707
20289 -22707 100197 76042 -77803 -80675 33827 59120 -10830 15762 43432 37238 -17811
20278 -17811 -8148 34434 62079 -3347 66888 100250 64258 34792 -76833 -80194 -69122 -112631
20266 -112631 -118144 -143626 -94843 -11197 57287 65188 75018 69221 86721 78819 58954 41093
20254 41093 34408 85101 140589 -8464 -30375 -65674 68620 201251 136642 70717 99940
20243 99940 121977 53824 73234 61789 21858 115898 136072 95034 74497 33730 79583 39199
20231 39199 -20274 -18787 20164 65488 51216 159516 147065 68082 31277 4366 -20103 143171
20219 143171 130336 166030 132927 103561 100761 136188 151189 168616 78168 48042 7673 -24044
$$ packed form
20301A7580N1217L428q3539p8890n8484N7434P2255N7360R7428r031n0548r8917
20289b2707J22904k4155j53845k872J14502K5293o9950K6592K7670o194n5049
20278a7811R663M2582K7645o5426P0235L3362l5992k9466j11625l361J1072m3509
20266a12631n513k5482M8783Q3646O8484P901R830n797J7500p902j9865j7861
20254D1093o685N0693N5488j49053k1911l5299J34294J32631o4609o5925K9223
20243I9940K2037o8153J9410j1445l9931R4040K0174m1038k0537m0767M5853m0384
20231C9199n9473J487L8951M5324j4272J08300j2451p8983l6805k6911k4469J63274
20219A43171j2835L5694l3103k9366k800L5427J5001J7427r0448l0126m0369l1717
$$ plain form
20207 -24044 -29787 14965 33797 147959 258250 203576 132655 177245 138670 98947 185280
20196 185280 184993 50104 -17710 21089 -27529 71349 73262 12610 80859 95338 -20318 -86971
20184 -86971 -111309 -111877 -44109 7104 6899 29657 109270 42562 -32295 55035 -14547 23981
20172 23981 77916 216105 182094 32539 205071 142282 -5770 -17931 -26115 3450 -31775
20161 -31775 14434 -33028 -66411 -34643 -11946 -62314 -93373 -48612 75612 111668 160095
20150 160095 164867 86217 -20168 -77188 -87934 -48138 -76836 -49760 99611 155836 126338
20139 126338 139389 134447 -17127 -177383 -183128 -238540 -165068 -61799 -86789 -29054 12640
20128 12640 7298 -11879 72431 62425 -3780 -44937 -29417 -2664 28072 13961 37832 58679
$$ packed form
20207b4044n743M4752J8832J14162J10291n4674p0921M4590l8575l9723Q6333
20196A85280k87j34889o7814L8799m8618R8878J913o0652O8249J4479j15656o6653
20184h6971k4338n68O7768N1213k05K2758P9613o6708p4857Q7330o9582L8528
20172B3981N3935J38189l4011j49555J72532o2789j48052j2161q184K9565l5225
20161c1775M6209m7462l3383L1768K2697n0368l1059M4761J24224L6056M8427
20150A60095M772p8650j06385n7020j0746L9796k8698K7076J49371N6225k9498
20139A26338J3051m942j51574j60256n745n5412P3472J03269k4990N7735M1694
20128A2640n342j9177Q4310j0006o6205m1157J5520K6753L0736j4111K3871K0847
$$ plain form
20116 58679 56416 125784 174471 225734 191889 156648 128833 95044 18256 18926 46668 17530
20104 17530 36042 7449 29159 -24997 32423 -9662 -101596 -84190 31306 66462 46849
20093 46849 83835 153719 128361 174562 225529 230344 346557 345258 196234 104337 163158 298248
20081 298248 244819 105539 72778 115329 51191 -20379 -79544 -50791 -4021 -54196 -32160
20070 -32160 31765 164387 262065 185765 196955 254158 302144 330726 229447 185368 196956
20059 196956 118550 -4582 24921 74184 75491 56225 22781 111100 128789 128720 85627 12778
20047 12778 962 -16023 -15714 -30545 -37167 19637 56003 93654 -7770 -71000 -19426 55692
20035 55692 17932 -36054 -47487 -7558 13858 36450 88733 160353 179654 283396 231166
$$ packed form
20116E8679k263O9368M8687N1263l3845l5241k7815l3789p6788O70K7742k9138
20104A7530J8512k8593K1710n4156N7420m2085r1934J7406J15496L5156j9613
20093D6849L6986O9884k5358M6201N0967M815J16213j299j49024r1897N8821J35090
20081B98248n3429j39280l2761M2551o4138p1570n9165K8753M6770n0175K2036
20070c2160O3925J32622R7678p6300J1190N7203M7986K8582j01279m4079J1588
20059A96956p8406j23132K9503M9263J307j9266l3444Q8319J7689o9m3093p2849
20047A2778j1816j6985L09j4831o622N6804L6366L7651j01424o3230N1574P5118
20035E5692l7760n3986j1433L9929K1416K2592N2283P1620J9301J03742n2230
$$ plain form
20024 231166 168406 121430 21109 101916 157487 189736 121845 54410 82911 63532 17140
20013 17140 -61215 -75308 -31442 -74502 -96092 -35305 -13353 -55866 -30031 34460 37493 101701
20001 101701 151623 214665 222670 197286 107888 46714 139381 152480 111471 33518 -107432
19990 -107432 -11925 159112 158822 165070 252211 169584 59767 48459 -34 -104115 -135630
19979 -135630 -101963 -54804 -68391 -73585 -74612 71677 120780 41985 57890 14202 -59554 -63447
19967 -63447 -28878 24785 1231 -14566 -38855 63101 54598 146212 146450 107409 137115 182845
19955 182845 201880 114082 24265 -50055 -49204 -14683 -35319 6355 44766 44108 770 -1314
19943 -1314 -11804 -47374 -30085 154141 162995 64247 33938 12098 32319 59271 87398 101893
$$ packed form
20024B31166o2760m6976j00321Q0807N5571L2249o7891o7435K8501j9379m6392
20013A7140p8355j4093M3866m3060k1590O0787K1952m2513K5835O4491L033O4208
20001A01701M9922O3042Q005k5384q9398o1174R2667J3099m1009p7953j40950
19990a07432R5507J71037k90O248Q7141q2627j09817j1308m8493j04081l1515
19979a35630L3667M7159j3587n194j027J46289M9103p8795J5905m3688p3756l893
19967f3447L4569N3663k3554j5797k4289J01956q503R1614K38l9041K9706M5730
19955A82845J9035q7798q9817p4320Q51L4521k0636M1674L8411o58m3338k084
19943a314j0490l5570J7289J84226Q854r8748l0309k1840K0221K6952K8127J4495
$$ plain form
19931 101893 98159 53038 53010 124901 64640 126011 188660 158749 130264 117753 108594 139075
19919 139075 136368 156857 263343 243358 220903 152694 75473 53321 -23192 -153901 -101726
19908 -101726 -106593 -23697 -75116 -74837 -35066 67499 176037 228583 294232 245378 170596 182803
19896 182803 123037 34370 70550 89517 54188 86868 208370 212534 260061 244657 231503
19885 231503 246910 243972 246067 136668 186081 364880 426283 456478 442152 315801 222845
19874 222845 190115 71444 115443 121024 134443 60871 58903 73684 151601 195036 250614 193253
19862 193253 229994 352274 405638 379605 219899 155665 194506 107716 -79471 -22860 44909
19851 44909 119996 192229 202512 152904 53282 -5511 -102144 -166084 -74558 82873 168220
$$ packed form
19931A01893l734m5121k8P1891o0261O1371O2649k9911k8485j2511r159L0481
19919A39075k707K0489J06486j9985k2455o8209p7221k2152p6513j30709N2175
19908a01726m867Q2896n1419K79L9771J02565J08538N2546O5649m8854p4782J2207
19896A82803n9766q8667L6180J8967l5329L2680J21502M164M7527j5404j3154
19885B31503J5407k938K095j09399M9413J78799O1403L0195j4326j26351r2956
19874B22845l2730j18671M3999N581J3419p3572j968J4781P7917M3435N5578n7361
19862A93253L6741J22280N3364k6033j59706o4234L8841q6790j87187N6611O7769
19851D4909P5087P2233J0283m9608r9622n8793r6633o3940R1526J57431Q5347
$$ plain form
19840 168220 179763 135755 61529 106532 147541 71109 33584 64577 97381 153139 134414
19829 134414 50410 78108 29366 -104237 -97759 22055 111598 91436 108706 197924 222566
19818 222566 191755 123015 77732 157603 135400 83101 34380 -13149 -67187 3616 41282
19807 41282 29784 -31795 -66326 8979 13676 -52734 -20169 97059 114486 58200 97899 206404
19795 206404 229495 207759 190212 156446 80875 118165 91485 61357 146247 193877 182054
19784 182054 229539 123166 43577 46467 75802 80209 42026 -6196 -45056 -55673 27543 91461
19772 91461 92136 46648 11606 -35598 -27671 87168 -28087 -76687 6399 83593 136480 121001
19760 121001 105654 89175 25813 18625 94461 63191 124038 68796 10212 -10008 110686
$$ packed form
19840A68220J1543m4008p4226M5003M1009p6432l7525L0993L2804N5758j8725
19829A34414q4004K7698m8742j33603O478J19814Q9543k0162J7270Q9218K4642
19818B22566l0811o8740m5283P9871k2203n2299m8721m7529n4038P0803L7666
19807D1282j1498o1579l4531P5305M697o6410L2565J17228J7427n6286L9699J08505
19795B06404K3091k1736j7547l3766p5571L7290k6680l0128Q4890M7630j1823
19784A82054M7485j06373p9589K890K9335M407l8183m8222l8860j0617Q3216O3918
19772I1461O75m5488l5042m7204P927J14839j15255m8600Q3086P7194N2887j5479
19760A21001j5347j6479o3362p188P5836l1270O0847n5242n8584k0220J20694
$$ plain form
19749 110686 97378 -9269 -70034 12594 25785 22725 -10155 29565 17049 29754 106022
19738 106022 63284 44066 69269 110800 147767 142197 176038 150418 156506 171119 118767 182846
19726 182846 186443 217864 171224 139475 138377 135299 90025 41369 73121 106279 99889 152894
19714 152894 187160 153528 142115 247235 283541 221166 221064 276233 262294 212360 177679 198326
19702 198326 141298 180278 156259 162938 127119 179559 214399 279729 213268 145362 126419 56796
19690 56796 51659 -2611 -68030 -51754 -90715 -147436 -46514 7228 33860 59252 139014 183598
19678 183598 187215 121366 67860 92266 101459 88295 185879 252911 128035 88757 70207 112397
19666 112397 153401 157909 162814 72328 25829 45517 76063 101815 162127 210607 190583 38875
$$ packed form
19749A10686j3308j06647o0765Q2628J3191l060l2880L9720j2516J2705P6268
19738A06022m2738j9218K5203M1531L6967n570L3841k5620O088J4613n2352O4079
19726A82846L597L1421m6640l1749j098l078m5274m8656L1752L3158o390N3005
19714A52894L4266l3632j1413J05120L6306o2375j02N5169j3939m9934l4681K0647
19702A98326n7028L8980k4019O679l5819N2440L4840O5330o6461o7906j8943o9623
19690E6796n137n4270o5419J6276l8961n6721J00922N3742K6632K5392P9762M4584
19678A83598L617o5849n3506K4406R193j3164R7584O7032j24876l9278j8550M2190
19666A12397M1004M508M905r0486m6499J9688L0546K5752O0312M8480k0024j51708
$$ plain form
19654 38875 -4724 14535 28362 60704 100847 153226 12168 36175 186508 254930 242082
19643 242082 282301 357445 273726 311292 256176 156217 64468 153469 111009 61254 -19872
19632 -19872 -60550 42987 89162 -26869 -83312 -181542 -147350 -632 55369 67907 51631
19621 51631 46249 35747 115116 177626 250483 237046 187375 123986 157566 108124 125021 170316
19609 170316 246856 311929 223668 141427 87984 53081 66611 36248 109956 39702 148040
19598 148040 169439 88674 46868 35584 67107 150487 204738 159350 163982 212568 296854 272416
19586 272416 197225 241531 208036 130772 32420 -33216 84389 138733 151675 263700 236232
19575 236232 325223 424253 324538 190141 116361 52086 111596 72094 1896 35872 75856
$$ packed form
19654C8875m3599J9259J3827L2342M0143N2379j41058K4007J50333O8422j2848
19643B42082M0219P5144q3719L7566n5116r9959r1749Q9001m2460m9755q1126
19632a9872m0678J03537M6175j16031n6443r8230L4192J46718N6001J2538j6276
19621E1631n382j0502P9369O2510P2857j3437m9671o3389L3580m9442J6897M5295
19609A70316P6540O5073q8261q2241n3443l4903J3530l0363P3708p0254J08338
19598A48040K1399q0765m1806j1284L1523Q3380N4251m5388M632M8586Q4286k4438
19586B72416p5191M4306l3495p7264r8352o5636J17605N4344J2942J12025k7468
19575B36232Q8991R9030r9715j34397p3780o4275N9510l9502p0198L3976L9984
$$ plain form
19564 75856 41592 118096 174218 162578 186064 157172 55753 -92183 -41760 -34718 -62575
19553 -62575 -14695 29348 39254 114261 115140 67878 -14660 43803 75961 148123 180986 165325
19541 165325 133692 78464 77531 116174 207601 190667 209500 182102 107533 55091 8027 41748
19529 41748 175574 201165 167455 208344 240365 303182 365061 413990 325733 222282 199576
19518 199576 245630 247219 179350 235246 262171 191098 118490 -14294 28495 174625 120711
19507 120711 99383 176550 236094 196373 87349 75987 59581 54897 61092 112835 178726 282066
19495 282066 247061 189100 110825 125156 286453 353184 400330 326903 203353 182846 207418
19484 207418 217286 167609 183512 188478 80303 40227 27303 114844 215767 203668 260605
$$ packed form
19564G5856l4264P6504N6122j1640K3486k8892j01419j47936N0423P042k7857
19553f2575M7880M4043R906P5007Q79m7262q2538N8463L2158P2162L2863j5661
19541A65325l1633n5228r33L8643R1427j6934J8833k7398p4569n2442m7064L3721
19529D1748J33826K5591l3710M0889L2021O2817O1879M8929q8257j03451k2706
19518A99576M6054J589o7869N5896K6925p1073p2608j32784M2789J46130n3914
19507A20711k1328P7167N9544l9721j09024j1362j6406m684O195N1743O5891J03340
19495B82066l5005n7961p8275J4331J61297O6731M7146p3427j23550k0507K4572
19484B07418R868m9677J5903M966j08175m0076j2924Q7541J00923j2099N6937
$$ plain form
19473 260605 240592 165328 162223 183092 256563 306003 311911 328938 234571 101442 -4599
19462 -4599 -23260 -16320 2726 6617 64910 90023 79091 73915 48962 98010 98388 147048 123209
19449 123209 -578 6320 37040 113572 123306 23215 -56111 8314 47815 35880 -5323
19438 -5323 -79968 65626 104039 141985 173379 52227 -9981 -18186 21490 63091 66723 158606
19426 158606 109858 103665 126489 193641 198600 216917 230961 246683 265992 215567 214564 193627
19414 193627 235594 192554 102193 116334 96452 84293 13955 83903 104040 80352 140304
19403 140304 206578 244012 186991 162807 87022 45622 49142 -1827 28097 129775 186434
19392 186434 194704 121593 30185 109998 153653 291164 332031 371778 368486 286331 150681
$$ packed form
19473B60605k0013p5264l105K0869P3471M9440N908J7027r4367j33129j06041
19462d599j8661O940J9046L891N8293K5113j0932n176k4953M9048L78M8660k3839
19449A23209j23787O898L0720P6532R734j00091p9326O4425L9501j1935m1203
19438e323p4645J45594L8413L7946L1394j21152o2208q205L9676M1601L632R1883
19426A58606m8748o193K2824O7152M959J8317J4044J5722J9309n0425j003k0937
19414A93627M1967m3040r0361J4141j9882j2159p0338O9948K0137k3688N9952
19403A40304O6274L7434n7021k4184p5785m1400L520n0969K9924J01678N6659
19392A86434Q270p3111r1408P9813M3655J37511M0867L9747l292q2155j35650
$$ plain form
19381 150681 196342 173998 108643 48667 99973 21107 43646 123727 124761 89371 98109 51749
19369 51749 12282 -2110 46551 102413 114184 145031 310533 367356 241048 195184 215112
19358 215112 217980 241118 175430 83691 130518 206754 223615 173575 184980 188007 204883 246027
19346 246027 331697 268866 166743 156425 142207 174911 192370 204061 131299 22419 -13257
19335 -13257 38375 155257 216230 182419 120132 118932 137491 80698 51105 192088 225782
19324 225782 174116 198287 196655 195034 276171 236962 266063 287411 271587 270542 244471 183735
19312 183735 177760 189128 190803 239412 231304 230488 206227 111419 59369 50624 34595 109511 112205
19299 112205 70909 1534 60419 161873 143277 90707 63529 71345 147186 192513 207101
$$ packed form
19381A50681M5661k2344o5355n9976N1306p8866K2539Q0081J034l5390Q738m6360
19369E1749l9467j4392M8661N5862J1771L0847J65502N6823j26308m5864J9928
19358B15112K868K3138o5688r1739M6827P6236J6861n0040J1405L027J6876M1144
19346B46027Q5670o2831j02123j0318j4218L2704J7459J1691p2762j08880l5676
19335a3257N1632J16882O0973l3811o2287j200J8559n6793k9593J40983L3694
19324B25782n1666K4171j632j621Q1137l9209K9101K1348j5824j045k6071o0736
19312A83735n975J1368J675M8609q108q16k4261r4808n2050q745j6029P4916K694
19299A12205m1296o9375N8885J01454j8596n2570k7178P816P5841M5327J4588
$$ plain form
19288 207101 242067 191018 214629 270040 280278 284081 196401 129108 87584 71901 38250 90007
19276 90007 51805 -87509 -163278 -2933 114867 150895 150478 96970 101294 87070 59601 79896
19264 79896 141619 107400 106423 110012 3445 -15070 67125 88839 28127 -4228 -63641 -94808
19252 -94808 -103968 -24883 100215 121843 83922 236309 248845 194383 192150 153851 209575 138678
19240 138678 173546 282265 392574 459052 384112 225309 146620 179055 198779 196889 181599
19229 181599 111476 154066 151897 114517 34246 107106 135379 117758 154239 313025 377213
19218 377213 355858 255693 190711 99614 190754 213492 81066 10815 96336 237955 157405
19207 157405 75111 -20480 -40789 9689 11584 34283 90036 238642 311634 251342 228950
$$ packed form
19288B07101L4966n1049K3611N5411J0238L803q7680o7293m1524j5683l3651N1757
19276I0007l8202j39314p5769J60345J17800L6028m17n3508M324j4224k7469K0295
19264G9896O1723l4219r77L589j06567j8515Q2195K1714o0712l2355n9413l1167
19252i4808r160P9085J25098K1628l7921J52387J2536n4462k233l8299N5724p0897
19240A38678L4868J08719J10309O6478p4940j58803p8689L2435J9724j890j5290
19229A81599p0123M2590k169l7380q0271P2860K8273j7621L6481J58786O4188
19218C77213k1355j00165o4982r1097R1140K2738j32426p0251Q5521J41619q0550
19207A57405q2294r5591k0309N0478J895K2699N5753J48606P2992o0292k2392
$$ plain form
19196 228950 94128 8819 87820 211259 186565 173970 122121 70218 133641 141858 184584
19185 184584 199328 241240 277563 258375 195636 152215 190393 173999 352034 335345 265544
19174 265544 289559 250280 242192 217768 221589 298354 336892 269061 164184 257319 287710 230005
19162 230005 141328 128770 244033 251700 247984 355849 430923 395194 280076 249459 291482
19151 291482 308055 315304 348525 341517 259854 111542 154021 237519 288175 337579 276437 267843
19139 267843 335536 353384 332451 353428 327518 283438 245299 231768 148208 133483 205818
19128 205818 227933 137585 230713 192669 249133 346005 305596 215209 240227 201796 95315
19117 95315 -3304 24586 70883 109577 165986 286833 247453 196452 262173 227054 200420
$$ packed form
19196B28950j34822q5309P9001J23439k4694j2595n1849n1903O3423Q217M2726
19185A84584J4744M1912L6323j9188o2739m3421L8178j6394J78035j6689o9801
19174B65544K4015l9279q088k4424L821P6765L8538o7831j04877R3135L0391n7705
19162B30005q8677j2558J15263P667l716J07865P5074l5729j15118l0617M2023
19151B91482J6573P249L3221p008q1663j48312M2479Q3498N0656M9404o1142q594
19139B67843O7693J7848k0933K0977k5910m4080l8139j3531q3560j4725P2335
19128B05818K2115r0348R3128l8044N6464R6872m0409r0387K5018l8431j06481
19117I5315r8619K7890M6297L8694N6409J20847l9380n1001O5721l5119k6634
$$ plain form
19106 200420 258840 235865 204847 177712 315081 371395 385601 329919 317688 231079 278474
19095 278474 300940 267882 296093 264324 277852 327829 281671 224684 139079 172701 242232
19084 242232 234414 252035 206208 202325 255195 194615 82863 30860 175536 286938 315233
19073 315233 331046 232099 157017 182847 190276 114255 -23505 6268 101639 138832 211610
19062 211610 250795 193912 231864 268181 244619 245991 317858 338589 331841 313384 306739 274057
19050 274057 280706 240614 224115 245276 242786 222786 313380 401889 399365 321097 335421 268509
19038 268509 255784 226990 170709 264716 323314 350200 337766 349978 421841 282098 190139
19027 190139 142106 136183 227374 350093 433451 357344 315444 312151 400194 445723 351972 309995
$$ packed form
19106B00420N8420k2975l1018k7135J37369N6314J4206n5682j2231q6609M7395
19095B78474K2466l3058K8211l1769J3528M9977m6158n6987q5605L3622O9531
19084B42232p818J7621m5827l883N2870o0580j11752n2003J44676J11402K8295
19073C15233J5813r8947p5082K5830P429p6021j37760K9773R5371L7193P2778
19062B11610L9185n6883L7952L6317k3562J372P1867K0731o748j8457o645l2682
19050B74057O649m0092j6499K1161k490k0000R0594Q8509k524p8268J4324o6912
19038B68509j2725k8794n6281R4007N8598K6886j2434J2212P1863j39743r1959
19027A90139m8033n923R1191J22719Q3358p6107m1900l293Q8043M5529r3751m1977
$$ plain form
19015 309995 338443 392200 445924 396108 370675 441633 398771 327241 239418 241137 310694 340597
19003 340597 328448 316097 317846 326101 273070 269590 256501 324681 323198 299988 297721 262842
18991 262842 292193 235901 38785 -45012 77595 242571 348670 271015 350035 466801
18981 466801 406888 388823 339359 322888 354524 275619 250351 367689 428296 386501 336900
18970 336900 413274 383262 501077 544376 532829 446450 443324 405362 359315 434512 475389
18959 475389 475060 407239 411229 382253 416533 451848 468419 375221 345137 281899 149212 164659
18947 164659 206632 268690 317232 330398 449614 406622 326168 306134 377367 433789 492652
18936 492652 491268 408274 395893 361194 310285 320350 423472 396758 302379 295986 357485 378234
$$ packed form
19015C09995K8448N3757N3724m9816k5433P0958m2862p1530q7823J719O9557K9903
19003C40597j2149j2351J749Q255n3031l480j3089O8180j483k3210k267l4879
18991B62842K9351n6292j97116q3797J22607J64976J06099p7655P9020J16766
18981D66801n9913j8065m9464j6471L1636p8905k5268J17338O0607m1795m9601
18970C36900P6374l0012J17815M3299j1547q6379l126l7962m6047P5197M0877
18959D75389l29o7821L990k8976L4280L5315J6571r3198l0084o3238j32687J5447
18947A64659M1973O2058M8542J3166J19216m2992q0454k0034P1233N6422N8863
18936D92652j384q2994j2381l4699n0909J0065J03122k6714r4379o393O1499K0749
$$ plain form
18924 378234 301877 367542 449565 397535 471625 594655 531569 421253 466120 508936 472768
18913 472768 378067 413723 457171 494617 489923 408680 284963 327502 370390 434772 540892
18902 540892 537424 452055 426505 481002 519484 506783 462483 419220 278467 305999 504777
18891 504777 557024 477993 418037 401813 386875 396892 396695 390197 382802 405028 525647 536094
18879 536094 394793 275065 294037 379308 422409 435281 393898 363925 428317 482718 516099
18868 516099 453054 403552 431153 387098 387204 388412 430734 512112 588650 611527 517267 534244
18856 534244 529902 601523 669270 771423 885949 969013 1039077 1117694 1238612 1181937 1227275
18845 1227275 1404677 1480461 1608377 1626959 1490908 1493970 1624890 1605730 1637928 1609905 1620725
$$ packed form
18924C78234p6357O5665Q2023n2030P4090J23030o3086j10316M4867M2816l6168
18913D72768r4701L5656M3448L7446m694q1243j23717M2539M2888O4382J06120
18902E40892l468q5369k5550N4497L8482j2701m4300m3263j40753K7532J98778
18891E04777N2247p9031n9956j6224j4938J0017j97o498p395K2226J20619J0447
18879E36094j41301j19728J8972Q5271M3101J2872m1383k9973O4392N4401L3381
18868E16099o3045m9502K7601m4055J06J208M2322Q1378P6538K2877r4260J6977
18856E34244m342P1621O7747J02153J14526Q3064P0064P8617J20918n6675M5338
18845A227275J77402P5784J27916J8582j36051L062J30920j9160L2198k8023J0820
$$ plain form
18834 1620725 1566292 1483050 1417489 1472895 1604003 1698786 1619225 1577640 1502585 1477281 1421439
18823 1421439 1400404 1413820 1457766 1342336 1248983 1179462 1123006 1033562 937892 918268 907565
18812 907565 961119 886023 844044 876026 910813 1025652 1164064 1240230 1331563 1300582 1430909
18801 1430909 1595924 1538842 1637346 1756565 1673065 1525999 1506547 1511156 1518702 1578458 1695827
18790 1695827 1865060 2084371 2238609 2341632 2426405 2462130 2441624 2361628 2173242 1956371
18780 1956371 1817222 1789501 1765268 1663914 1650680 1483846 1367873 1313380 1222657 1116006
18770 1116006 1097241 1235690 1410439 1659832 1839577 1690308 1400417 1243800 1125718 990245
18760 990245 866128 807964 756764 784456 695918 640542 688588 681736 615417 604310 479568
$$ packed form
18834A620725n4433q3242o5561N5406J31108R4783p9561m1585p5055k5304n5842
18823A421439k1035J3416M3946j15430r3353o9521n6456q9444r5670j9624j0703
18812I07565N3554p5096m1979L1982L4787J14839J38412P6166R1333l0981J30327
18801A430909J65015n7082R8504J19219q3500j47066j9452M609P546N9756J17369
18790A695827J69233K19311J54238J03023Q4773L5725k0506p9996j88386k16871
18780A956371j39149k7721k4233j01354j3234j66834j15973n4493r0723j06651
18770A116006j8765J38449J74749K49393J79745j49269k89891j56617j18082j35473
18760I90245j24117n8164n1200K7692q8538n5376M8046o852o6319j1107j24742
$$ plain form
18749 479568 373240 369780 468080 602044 555465 471364 459364 423813 394431 432293 463782
18738 463782 494286 525236 562183 664014 586051 515944 569185 608873 543245 446013 464796
18727 464796 476628 415685 321783 401873 566145 668059 619877 562498 538043 537675 615666
18716 615666 634096 589994 516287 494523 619071 678965 663665 675383 659086 682648 730291
18705 730291 689789 543581 659467 623302 532664 511020 432357 439986 707904 840734 791466
18694 791466 775909 606009 613401 791069 980481 1068634 1165381 1267805 1250836 1194181 1118345
18683 1118345 1087029 1065835 1177915 1309834 1474057 1555474 1495813 1475343 1332279 1275323
18673 1275323 1219224 1155905 1093790 998852 896661 1052944 1239771 1258807 1121972 963614
$$ packed form
18749D79568j06328l460R8300J33964m6579q4101j2000l5551k9382L7862L1489
18738D63782L0504L0950L6947J01831p7963p0107N3241L9688o5628r7232J8783
18727D64796J1832o0943r3902Q0090J64272J01914m8182n7379k4455l68P7991
18716F15666J8430m4102p3707k1764J24548N9894j5300J1718j6297K3562M7643
18705G30291m0502j46208J15886l6165r0638k1644p8663P629K67918J32830m9268
18694G91466j5557j69900P392J77668J89412Q8153R6747J02424j6969n6655p5836
18683A118345l1316k1194J12080J31919J64223Q1417n9661k0470j43064n6956
18673A275323n6099o3319o2115r4938j02191J56283J86827J9036j36835j58358
$$ plain form
18663 963614 817451 748533 683607 642171 724984 776929 807853 912038 1042210 973856 907880
18652 907880 903633 964893 1077284 1203873 1210436 1196647 1237804 1411121 1606492 1761877 1774086
18641 1774086 1745110 1722191 1753006 1792417 1829062 1962825 2090016 2210334 2350491 2434410
18631 2434410 2440073 2260713 2093187 2042176 1929840 1933030 1935008 2052229 2142224 2008319 1785924
18620 1785924 1590957 1457480 1373791 1180585 1026499 1020750 1022605 967388 997114 1016174 1114995
18609 1114995 1201409 1270126 1244234 1245559 1165781 1099172 1163668 1171411 1187721 1235053 1315809 1305041
18597 1305041 1280856 1252975 1273435 1336881 1349033 1405482 1554256 1766387 1933147 2115260
18587 2115260 2274620 2189053 1951442 1637240 1594000 1670254 1754343 1783470 1906651 1908214 1861134
$$ packed form
18663I63614j46163o8918o4926m1436Q2813N1945L0924J04185J30172o8354o5976
18652I07880m247O1260J12391J26589O563j3789M1157J73317J95371J55385J2209
18641A774086k8976k2919L0815L9411L6645J33763J27191J20318J40157Q3919
18631B434410N663j79360j67526n1011j12336L190J978J17221Q9995j33905k22395
18620A785924j94967j33477q3689j93206j54086n749J855n5217K9726J9060R8821
18609A114995Q6414O8717k5892J325p9778o6609O4496P743J6310M7332Q0756j0768
18597A305041k4185k7881K0460O3446J2152N6449J48774K12131J66760J82113
18587B115260J59360q5567k37611l14202m3240P6254Q4089K9127J23181J563m7080
$$ plain form
18576 1861134 1774901 1639315 1486807 1303299 1199065 1159565 1124532 1150191 1073889 1031797
18566 1031797 1156502 1236100 1187282 1189563 1139803 1158050 1148049 1129830 1213323 1331983 1328343
18555 1328343 1424502 1498443 1664307 1674976 1557657 1465142 1386599 1388430 1389451 1470361 1521079
18544 1521079 1500421 1422823 1332109 1288810 1269928 1267703 1140269 1112214 1131249 1024775 881538
18533 881538 960216 1046215 1116296 1162579 1186282 1113242 1025244 1021483 1031897 1063988 1148214 1178927
18521 1178927 1192816 1288332 1401331 1492548 1581677 1556457 1477324 1520653 1579486 1606968 1686840
18510 1686840 1824604 1937253 2112284 2139127 2078996 2060717 2034111 1967983 1903034 1839947 1827149
18499 1827149 1777060 1693909 1701824 1675487 1691454 1627219 1628901 1626314 1523395 1426999 1315940
$$ packed form
18576A861134q6233j35586j52508j83508j04234l9500l5033K5659p6302m2092
18566A031797J24705P9598m8818K281m9760J8247j0001j8219Q3493J18660l640
18555A328343R6159P3941J65864J0669j17319r2515p8543J831J021Q0910N0718
18544A521079k0658p7598r0714m3299j8882k225j27434k8055J9035j06474j43237
18533H81538P8678Q5999P0081M6283K3703p3040q7998l761J0414L2091Q4226L0713
18521A178927J3889R5516J12999R1217Q9129k5220p9133M3329N8833K7482P9872
18510A686840J37764J12649J75031K6843o0131j8279k6606o6128o4949o3087j2798
18499A827149n0089q3151P915k6337J5967o4235J682k587j02919r6396j11059
$$ plain form
18488 1315940 1322975 1426567 1576822 1670327 1680758 1712607 1586320 1546536 1587075 1606842 1527262
18477 1527262 1545163 1638460 1720286 1826326 1982804 1981061 1974524 1999883 2065336 2017824 1961517
18466 1961517 2037059 2040122 2038008 2158210 2262546 2336658 2358688 2297444 2220433 2186870 2248570
18455 2248570 2226229 2219080 2265665 2279629 2245500 2138968 2029608 2005280 2101000 2142001 2230359
18444 2230359 2140638 2115998 2081449 2092668 1966247 1942853 2071366 2169132 2175466 2179279 2281765
18433 2281765 2411225 2460117 2443603 2329692 2229544 2333073 2367383 2331337 2340032 2364284 2343487
18422 2343487 2270760 2321699 2456793 2572756 2628341 2569298 2497516 2471687 2558801 2594833 2553301
18411 2553301 2631123 2678493 2777550 2840207 2858436 2951242 3067699 3182243 3237309 3308746 3405601
$$ packed form
18488A315940P035J03592J50255R3505J0431L1849j26287l9784M0539J9767p9580
18477A527262J7901R3297Q1826J06040J56478j743o537K5359O5453m7512n6307
18466A961517P5542L063k114J20202J04336P4112K2030o1244p7011l3563O1700
18455B248570k2341p149M6585J3964l4129j06532j09360k4328R5720M1001Q8358
18444B230359q9721k4640l4549J1219j26421k3394J28513R7766O334L813J02486
18433B281765J29460M8892j6514j13911j00148J03529L4310l6046Q695K4252k0797
18422B343487p2727N0939J35094J15963N5585n9043p1782k5829Q7114L6032m1532
18411B553301P7822M7370R9057O2657J8229R2806J16457J14544N5066P1437R6855
$$ plain form
18400 3405601 3420212 3425988 3462293 3531453 3547484 3671731 3716324 3794862 3914556 3966540 4108130
18389 4108130 4280951 4354354 4414708 4644762 4754504 4790404 4937551 5058653 5271510 5622374
18379 5622374 5920926 6277723 6595661 7038379 7568573 8031791 8530569 9059123 9547047
18370 9547047 9895990 10524451 11305163 12255470 13503265 14959776 16389736 18097510 20208674
18361 20208674 22737711 26245290 31203911 38413081 48866277 63302548 82347079 105643890
18353 105643890 132010755 158169151 177328137 186477388 186641092 178865609 166899660
18346 166899660 157220764 156359788 169068933 195172619 228675494 259024606 278244446
18339 278244446 283345364 273341764 250713071 220808783 190258062 164864894 146053689
$$ packed form
18400C405601J4611N776L6305O9160J6031J24247M4593P8538J19694N1984J41590
18389D108130J72821P3403O0354K30054J09742L5900J47147J21102K12857L50864
18379E622374K98552L56797L17938M42718N30194M63218M98778N28554M87924
18370I547047L48943O28461P80712R50307J247795J456511J429960J707774K111164
18361B0208674K529037L507579M958621P209170J0453196J4436271J9044531K3296811
18353A05643890K6366865K6158396J9158986R149251J63704p775483j1965949
18346A66899660r678896q60976J2709145K6103686L3502875L0349112J9219840
18339B78244446N100918j0003600k2628693k9904288l0550721k5393168j8811205
$$ plain form
18332 146053689 132357377 123382896 119117974 118809838 119853206 119653691 117045388 111018399
18324 111018399 101568483 90497481 79780728 71025164 64634678 60327947 57876985 57142365
18316 57142365 57885601 60157007 64656969 72173931 83903390 101057969 122659094 144926521
18308 144926521 164375674 180373825 193128676 202608024 208915572 216009567 230661413
18301 230661413 258370229 298200186 337925581 368921226 394217690 408623730 404331649
18294 404331649 388001211 372464961 367143846 372707177 380761808 382220742 374057910 353023165
18286 353023165 317286253 271713164 225103766 185228924 155580113 135465401 122257217
18279 122257217 113918328 108987134 106344652 103986143 100370795 95024584 87469492 78125815
$$ packed form
18332A46053689j3696312q974481m264922l08136J043368j99515k608303o026989
18324A11018399r449916j1071002j0716753q755564o390486m306731k450962p34620
18316E7142365P43236K271406M499962P516962J1729459J7154579K1601125K2267427
18308A44926521J9449153J5998151J2754851R479348O307548P093995J4651846
18301B30661413K7708816L9829957L9725395L0995645K5296464J4406040m292081
18294D04331649j6330438j5536250n321115N563331Q054631J458934q162832k1034745
18286C53023165l5736912m5573089m6609398l9874842k9648811k0114712j3208184
18279A22257217q338889m931194k642482k358509l615348n346211p555092r343677
$$ plain form
18271 78125815 68180815 58882100 51063027 44942369 40130793 36214070 32990232 30113785
18263 30113785 27530013 25277642 23262272 21273418 19384610 17741426 16258262 14875351
18255 14875351 13672003 12736550 11771040 11041095 10481000 10006725 9594338 9174304 8856956
18246 8856956 8610287 8426661 8276407 8146354 8078780 8087333 8154939 8248646 8334618 8402848 8417151
18235 8417151 8302717 8091183 7973788 7858537 7861662 7976970 8158030 8273283 8210280 8261564
18225 8261564 8208776 8251298 8299325 8328388 8407864 8515566 8702543 8975191 9275935 9374574
18215 9374574 9456544 9420003 9544286 9795206 10220702 10568756 10915483 11126402 11385679 11654097
18205 11654097 12005999 12516618 13134362 13917281 14853821 15818477 16840418 17736323 18718411
$$ packed form
18271G8125815r945000r298715p819073o120658m811576l916723l223838k876447
18263C0113785k583772k252371k015370j988854j888808j643184j483164j382911
18255A4875351j203348r35453r65510p29945n60095m74275m12387m20034l17348
18246H856956k46669j83626j50254j30053o7574Q553O7606R3707Q5972O8230J4303
18235H417151j14434k11534j17395j15251L125J15308J81060J15253o3003N1284
18225H261564n2788M2522M8027K9063P9476J07702J86977K72648L00744R8639
18215I374574Q1970l6541J24283K50920M25496L48054L46727K10919K59277K68418
18205A1654097L51902N10619O17744P82919R36540R64656J021941Q95905R82088
$$ plain form
18196 18718411 20026142 21915290 24398115 27792977 32386178 39000955 48905607 63234157
18188 63234157 81678511 102497687 121539434 132767653 132449504 122783919 111048846
18181 111048846 104485447 108199286 124035716 149979560 178926339 200637317 206163451
18174 206163451 193696753 167966220 138550825 113041655 94940132 84352513 79922710
18167 79922710 80592378 85563018 92681294 97850806 97470428 90638428 79855755 68734468
18159 68734468 59811632 53759346 50004731 47931949 47038823 46961264 47389702 48307522 50127978
18150 50127978 53491862 59486130 68436425 79542797 90015518 97510599 102425058 106671079
18142 106671079 112811351 124222562 144969345 178038546 220564466 263490017 298800477
$$ packed form
18196A8718411J307731J889148K482825L394862M593201O614777R904652J4328550
18188F3234157J8444354K0819176J9041747J1228219l18149r665585j1735073
18181A11048846o563399L713839J5836430K5943844K8946779K1710978N526134
18174B06163451j2466698k5730533k9415395k5509170j8101523j0587619m429803
18167G9922710O69668M970640P118276N169512l80378o832000j0782673j1121287
18159F8734468q922836o052286l754615k072782q93126p7559M28438R17820J820456
18150E0127978L363884N994268Q950295J1106372J0472721P495081M914459M246021
18142A06671079O140272J1411211K0746783L3069201M2525920M2925551L5310460
$$ plain form
18135 298800477 327831608 360652815 402410376 437673215 441070343 402675876 338556658
18128 338556658 274016361 226988528 201751256 194586750 200278610 213191097 226060354
18121 226060354 232029286 226381065 208880516 182952379 155670125 132647740 116424637
18114 116424637 107204496 104060330 107643980 121220457 150907876 199533254 240830895
18107 240830895 238820277 204565189 155466191 116075995 93605485 82098143 76648623
18100 76648623 75292072 77851671 84687717 96481800 112944239 130457703 142832223
18093 142832223 146198885 142402537 138082078 141196164 157111035 184859727 216479136
18086 216479136 242247439 256246908 258146988 252626888 243844258 229422321 206095910
$$ packed form
18135B98800477K9031131L2821207M1757561L5262839L397128l8394467o4119218
18128C38556658o4540297m7027833k5237272p164506N691860J2912487J2869257
18121B26060354N968932n648221j7500549k5928137k7282254k3022385j6223103
18114A16424637r220141l144166L583650J3576477K9687419M8625378M1297641
18107B40830895k010618l4255088m9098998l9390196k2470510j1507342n449520
18100G6648623j356551K559599O836046J1794083J6462439J7513464J2374520
18093A42832223L366662l796348m320459L114086J5914871K7748692L1619409
18086B16479136K5768303J3999469J900080n520100q782630j4421937k3326411
$$ plain form
18079 206095910 175301133 143684756 117834247 100111077 89323602 83135926 79872166
18072 79872166 78388876 77458013 75132726 70237284 63399366 56215061 49798399 44820070
18064 44820070 41207700 38527136 36465734 34707794 33218179 31945942 31271628 31452480
18056 31452480 32560176 34951789 39221020 46171433 57459582 74234231 94588887 110833238
18048 110833238 115773726 109464789 97877090 88530793 86530158 93872223 112242021 143020164
18040 143020164 180881918 208279985 209900595 187356939 153597014 123269230 103886746
18033 103886746 96031010 98174928 108793070 123038922 130587913 125135209 109065071
18026 109065071 89078058 71604174 59387670 51272064 46032779 42771414 40874169
$$ packed form
18079B06095910l0794777l1616377k5850509j7723170j0787475o187676l263760
18072G9872166j483290r30863k325287m895442o837918p184305o416662m978329
18064D4820070l612370k680564k061402j757940j489615j272237o74314J80852
18056C1452480J107696K391613M269231O950413J1288149J6774649K0354656J6244351
18048A10833238M940488o308937j1587699r346297k000635P342065J8369798L0778143
18040A43020164L7861754K7398067J620610k2543656l3759925l0327784j9382484
18033A03886746p855736K143918J0618142J4245852P548991n452704j6070138
18026A09065071j9987013j7473884j2216504q115606n239285l261365j897245
$$ plain form
18019 40874169 39817895 39511118 39973771 41251267 44091401 49664668 58517427 68395396
18011 68395396 74399890 73210621 66097057 56942517 49191451 44267353 42169752 42451089
18003 42451089 45089415 50491108 59423261 72988135 92182572 115887341 141874390
17996 141874390 168176080 191228554 203705477 198705002 178367042 151134708 124357554
17989 124357554 101785413 83915205 70228963 60431758 53875744 49313833 46031474
17982 46031474 43413144 41194160 39485537 38754058 39472911 42357436 46473373 48951642
17974 48951642 47264076 41940661 35102236 29020251 24731017 21780114 19760506 18395294
17966 18395294 17666289 17404402 17603594 18259453 19755622 22505378 27059572 32525142 36596237
$$ packed form
18019D0874169j056274l06777M62653J277496K840134N573267Q852759R877969
18011F8395396O004494j189269p113564r154540p751066m924098k097601K81337
18003D2451089K638326N401693Q932153J3564874J9194437K3704769K5987049
17996A41874390K6301690K3052474J2476923n000475k0337960k7232334k6777154
17989A24357554k2572141j7870208j3686242r797205o556014m561911l282359
17982D6031474k618330k218984j708623p31479P18853K884525M115937K478269
17974D8951642j687566n323415o838425o081985m289234k950903k019608j365212
17966A8395294p29005k61887J99192O55859J496169K749756M554194N465570M071095
$$ plain form
17957 36596237 37359270 35058328 31757962 29438319 29482043 32607032 39165614 48228163
17949 48228163 55380833 56521133 51483112 43064866 35011354 29627810 27214091 27398166
17941 27398166 29613755 31825346 31815919 28995929 24466330 19805330 16016475 13334697
17933 13334697 11510004 10067624 9106364 8357910 7681486 7100768 6571753 5993440 5552269
17924 5552269 5092530 4494052 4000426 3532217 3075156 2632739 2512473 2425530 2283583 2219863
17914 2219863 2128157 1920433 1708583 1585856 1396024 1373575 1201245 1001420 848898 857900
17904 857900 882126 951672 936279 851185 763481 653472 675554 673255 673871 631652 539695 491513
17892 491513 367997 314809 346776 370964 332610 390850 410593 325804 242680 286682 191869
$$ packed form
17957C6596237P63033k300942l300366k319643M3724L124989O558582R062549
17949D8228163P152670J140300n038021q418246q053512n383544k413719J84075
17941B7398166K215589K211591r427k819990m529599m661000l788855k681778
17933A3334697j824693j442380r61260p48454o76424n80718n29015n78313m41171
17924E552269m59739n98478m93626m68209m57061m42417j20266q6943j41947o3720
17914B219863r1706k07724k11850j22727j89832k2449j72330j99825j52522R002
17904H57900K4226O9546j5393q5094q7704j10009K2082k299O16m2219r1957m8182
17892D91513j23516n3188L1967K4188l8354N8240J9743q4789q3124M4002r4813
$$ plain form
17881 191869 200370 302619 336596 381816 369601 302707 319862 263497 312981 355351 362271 337573
17869 337573 429984 384083 354968 321766 312592 250633 205440 184270 218714 279269 328641 258035
17857 258035 315084 403887 506598 563037 603453 637748 689753 781710 931878 1022225 1195819
17846 1195819 1289575 1418861 1540687 1556800 1587988 1591485 1598648 1579101 1634452 1665244 1611560
17835 1611560 1746672 1838437 1742046 1717286 1747720 1724155 1740121 1470759 1321259 1229500 1087840
17824 1087840 925686 836672 753883 713020 731618 649688 680450 711974 734175 648791 427491
17813 427491 262565 119473 16758 6510 65255 77547 154478 317009 375253 362414 372154
17802 372154 575337 814905 781715 752085 735539 711783 801385 776254 720326 853496 943744
$$ packed form
17881A91869Q501J02249L3977M5220j2215o6894J7155n6365M9484M2370O920k4698
17869C37573R2411m5901k9115l3202r174o1959m5193k1170L4444O0555M9372p0606
17857B58035N7049Q8803J02711N6439M0416L4295N2005R1957J50168R0347J73594
17846A195819R3756J29286J21826J6113L1188L497P163j9547N5351L0792n3684
17835A611560J35112R1765r6391k4760L0434k3565J5966k69362j49500r1759j41660
17824A087840j62154q9014q2789m0863J8598q1930L0762L1524K2201q5384k21300
17813D27491j64926j43092j02715j0248N8745J2292P6931J62531N8244j2839R740
17802C72154K03183K39568l3190k9630j6546k3756Q9602k5131n5928J33170R0248
$$ plain form
17791 943744 931529 1007350 1186617 1283808 1358849 1401458 1283009 1069242 925239 881154 874532
17780 874532 813346 664954 581934 565307 526899 604707 663062 568576 403813 380339 360596
17769 360596 299800 245104 64079 136020 159139 80516 -52507 -59158 -9760 49796 4911
17758 4911 -147785 -141156 -126477 -86692 -65971 -126629 -116952 -151530 -128839 -109723 -209832 -158327
17746 -158327 -102443 -137995 -83941 -53141 -79167 -123915 -98812 -153561 -48568 -75289 -102092
17735 -102092 34916 -136442 -235954 -290305 -281356 -295234 -306384 -258632 -183469 -198824 -188700
17724 -188700 -204152 -61640 29260 -13668 -80027 -54770 2480 -38165 -69156 -112829 -155970
17713 -155970 -204648 -169110 -8160 1335 -93562 -93924 -75473 -66006 -65698 -155654 -145572 -206621
$$ packed form
17791I43744j2215P5821J79267R7191P5041M2609j18449k13767j44003m4085o622
17780H74532o1186j48392q3020j6627l8408P7808N8355r4486j64763k3474j9743
17769C60596o0796n4696j81025P1941K3119p8623j33023o651M9398N9556m4885
17758D911j52696O629J4679L9785K0721o0658R677l4578K2691J9116j00109N1505
17746a58327N5884l5552N4054L0800k6026m4748K5103n4749J04993k6721k6803
17735a02092J37008j71358r9512n4351Q949j3878j1150M7752P5163j5355J0124
17724a88700j5452J42512R0900m2928o6359K5257N7250m0645l0991m3673m3141
17713a55970m8678L5538J60950R495r4897l62J8451R467L08q9956J0082o1049
$$ plain form
17701 -206621 -212545 -140690 -79149 -85277 -121209 -82293 -100836 -72794 24687 44590 -74794 -126827
17689 -126827 -111978 -161438 -230545 -226969 -125626 -89250 -22574 148697 247964 269497 306642
17678 306642 329105 431788 576703 641840 725990 694098 749608 798505 751747 760134 914126
17667 914126 979028 1078128 1131746 1117736 921056 678610 495264 348637 268828 256011 316979
17656 316979 237632 90260 106557 209267 172592 103664 177920 193979 121305 66656 -68200
17645 -68200 -114135 -25009 -21505 -43841 -54822 23613 124839 271159 271102 118983 161672 293454
17633 293454 457276 678041 868026 1041840 1201110 1211867 1128393 1195112 1305926 1345412
17623 1345412 1316010 1411997 1475510 1404717 1303699 1135471 1074344 1087158 1141879 1128429 1109291
$$ packed form
17701b06621n924P1855O1541o128l5932L8916j8543K8042R7481J9903j19384n2033
17689a26827J4849m9460o9107L576J01343L6376O6676J71271R9267K1533L7145
17678C06642K2463J02683J44915O5137Q4150l1892N5510M8897m6758Q387J53992
17667I14126O4902R9100N3618j4010j96680k42446j83346j46627p9809j2817O0968
17656C16979p9347j47372J6297J02710l6675o8928P4256J6059p2674n4649j34856
17645f8200m5935Q9126L504k2336j0981P8435J01226J46320n7j52119M2689J31782
17633B93454J63822K20765J89985J73814J59270J0757q3474O6719J10814L9486
17623A345412k9402R5987O3513p0793j01018j68228o1127J2814N4721j3450j9138
$$ plain form
17612 1109291 1027568 996909 863331 789403 707179 592692 513970 373134 237954 193107
17602 193107 156684 154123 244729 186453 67903 14657 -10721 -121433 -101594 -78570 -22308
17591 -22308 -23838 -23382 91889 219939 258059 319505 409484 454028 521580 617453 595316 556424
17579 556424 456368 445546 438695 405868 439549 365574 223272 251742 386238 410621 369126
17568 369126 469215 592405 597920 642825 567877 330760 197111 208477 162404 65684 20307
17557 20307 30766 -94162 -155593 -86184 -77007 -26400 56703 97846 146395 188921 221805 242330
17545 242330 222777 304977 352457 407204 402323 442169 450084 325341 239811 290430 262579 194276
17533 194276 176116 229089 316302 442949 388642 203421 96043 20735 -47179 -125704 -104005
$$ packed form
17612A109291q1723l0659j33578p3928q2224j14487p8722j40836j35180m4847
17602A93107l6423k561R0606n8276j18550n3246k5378j10712J9839K3024N6262
17591b2308j530M56J15271J28050L8120O1446Q9979M4544O7552R5873k2137l8892
17579E56424j00056j0822o851l2827L3681p3975j42302K8470J34496K4383m1495
17568C69126J00089J23190N515M4905p4948k37117j33649J1366m6073r6720m5377
17557B0307J0459j24928o1431O9409R177N0607Q3103M1143M8549M2526L2884K0525
17545B42330j9553Q2200M7480N4747m881L9846P915j24743q5530N0619k7851o8303
17533A94276j8160N2973Q7213J26647n4307j85221j07378p5308o7914p8525K1699
$$ plain form
17522 -104005 1845 60298 84383 87893 100155 108569 65090 56031 135127 144527 -676 -33225
17510 -33225 30558 57775 31791 52637 117706 170671 167494 139251 192481 259019 289375 304144
17498 304144 322407 356086 496830 622621 788254 845635 861860 846359 661628 483621
17488 483621 508254 497863 391143 286002 271433 273251 349172 305538 252078 138118 242798
17477 242798 255595 162645 131225 50472 -28892 -1071 -69279 -112103 -95602 -110483 -81041
17466 -81041 12513 137072 4105 -43205 -77364 -83273 21914 -3081 34635 143917 196745
17455 196745 174620 181663 216978 267031 291169 221885 233390 391739 487472 567512 626471
17444 626471 767502 925927 1136017 1165139 904217 773832 624598 327214 245211 267152
$$ packed form
17522a04005J05850N8453K4085L510J2262Q414m3479r059P9096R400j45203l2549
17510c3225O3783K7217k5984K0846O5069N2965l177k8243N3230O6538L0356J4769
17498C04144J8263L3679J40744J25791J65633N7381J6225j5501j84731j78007
17488D83621K4633j0391j06720j05141j4569J818P5921m3634n3460j13960J04680
17477B42798J2797r2950l1420q0753p9364K7821o8208m2824J6501j4881K9442
17466h1041R3554J24559j32967m7310l4159n909J05187k4995L7716J09282N2828
17455A96745k2125P043L5315N0053K4138o9284J1505J58349R5733Q0040N8959
17444F26471J41031J58425K10090K9122k60922j30385j49234k97384q2003K1941
$$ plain form
17434 267152 298909 304297 220122 35621 -61126 -68727 -80822 -180224 -205504 -138856 -124836 -208050
17422 -208050 -57466 72273 118541 75316 48340 -53665 -139295 -197768 -185274 -158206 -167828
17411 -167828 -165550 -112417 -90066 -143768 -120757 -89855 -118657 -139168 -96221 -7229 20090 -117323
17399 -117323 -286976 -342682 -383114 -307832 -328508 -338722 -209411 -238146 -314978 -326905 -289723
17388 -289723 -231180 -244116 -249118 -157600 -155499 -100722 9168 55217 75 -70673 -107721 -155455
17376 -155455 -144493 -121568 -209115 -240272 -254832 -219948 -160961 -84930 -7700 -70869 -102680
17365 -102680 -113845 -130775 -107116 -114183 -141789 -163267 -216692 -156262 -131488 -147044 -232631 -150639
17353 -150639 -197882 -222283 -243868 -299007 -288123 -310041 -372682 -369930 -344764 -347205 -348308 -386054
$$ packed form
17434B67152L1757N388q4175j84501r6747p601j2095r9402k5280O6648J4020q3214
17422b08050J50584J29739M6268m3225k6976j02005q5630n8473J2494K7068r622
17411a67828K278N3133K2351n3702K3011L0902k8802k0511M2947Q8992K7319j37413
17399a17323j69653n5706m0432P5282k0676j0214J29311k8735p6832j1927L7182
17388b89723N8543j2936n002R1518K101N4777J09890M6049n5142p0748l7048m7734
17376a55455J0962K2925q7547l1157j4560L4884N8987P6031P7230o3169l1811
17365a02680j1165j6930K3659p067k7606k1478n3425O0430K4774j5556q5587Q1992
17353a50639m7243k4401k1585n5139J0884k1918o2641K752K5166k441j103l7746
$$ plain form
17341 -386054 -390759 -392183 -290428 -230625 -322919 -451855 -473406 -442182 -304479 -274522 -285723
17330 -285723 -340766 -323931 -111461 -66583 -140253 -157305 -229815 -348825 -366759 -280991 -233257
17319 -233257 -241740 -388880 -322264 -207556 -232660 -299185 -377099 -319362 -276067 -160377 -224090
17308 -224090 -321855 -350199 -314774 -169855 -3236 1254 -66965 -114399 -81814 -150935 -211060
17297 -211060 -288782 -281831 -287434 -349108 -399671 -360946 -390401 -371971 -342531 -346400 -383722 -256977
17285 -256977 -166007 -171930 -136896 -68707 -146655 -281021 -351361 -328397 -303614 -381440 -405354
17274 -405354 -318235 -311442 -267443 -217514 -95129 -89615 -19790 -75560 -149971 -205823 -101471
17263 -101471 -8273 -34959 -99065 -157363 -244947 -305956 -304934 -184713 -71866 -9060 283
$$ packed form
17341c86054m705j424J01755N9803r2294j28936k1551L1224J37703K9957j1201
17330b85723n5043J6835K12470M4878p3670j7052p2510j19010j7934Q5768M7734
17319b33257q483j47140O6616J14708k5104o6525p7914N7737M3295J15690o3713
17308b24090r7765k8344L5425J44919J66619M490o8219m7434L2585o9121o0125
17297b11060p7722O951n603o1674n0563L8725k9455J8430K9440l869l7322J26745
17285b56977R0970n923L5034O8189p7948j34366p0340K2964K4783p7826k3914
17274d05354Q7119O793M3999M9929J22385N514O9825n5770p4411n5852J04352
17263a01471R3198k6686o4106n8298q7584o1009J022J20221J12847O2806R343
$$ plain form
17252 283 -55242 7923 -118668 -265909 -298463 -292101 -331872 -296555 -260406 -261658 -155870 -171244
17240 -171244 -168345 -71564 -70948 -99591 -143031 -168900 -238386 -272721 -115350 -38609 -204019 -228669
17228 -228669 -237793 -210113 -274606 -370580 -346077 -340904 -316706 -172307 -128240 -221322 -317449 -243962
17216 -243962 -141843 -179479 -220833 -325427 -303114 -235210 -267620 -241191 -230695 -189012 -145684
17205 -145684 -248575 -332126 -255175 -204094 -226063 -106297 -14598 -32075 -111055 -269002 -385552
17194 -385552 -379648 -242179 -188303 -120327 -80759 -99401 -70688 -24001 -118293 -138544 -142056 -144912
17182 -144912 -198968 -248987 -82658 -127156 -194214 -160552 -236188 -244440 -251032 -126109 -154187
17171 -154187 -137497 -53412 -13426 -72403 -146282 -116722 -39795 -22515 -14404 -77325 -31148 1693
$$ packed form
17252B83n5525O3165j26591j47241l2554O362l9771L5317L6149j252J05788j5374
17240a71244K899R6781O16k8643m3440k5869o9486l4335J57371P6741j65410k4650
17228b28669r124K7680o4493r5974K4503N173K4198J44399M4067r3082r6127P3487
17216b43962J02119l7636m1354j04594K2313O7904l2410K6429J0496M1683M3328
17205a45684j02891q3551P6951N1081k1969J19766R1699j7477p8980j57947j16550
17194c85552N904J37469N3876O7976L9568j8642K8713M6687r4292k0251l512k856
17182a44912n4056n0019J66329m4498o7058L3662p5636q252o592J24923k8078
17171a54187J6690Q4085L9986n8977p3879K9560P6927J7280Q111o2921M6177L2841
$$ plain form
17159 1693 -80262 -115087 -162284 -213869 -198513 -116683 -104560 -120532 -185589 -280328 -175630 -185473
17147 -185473 -266825 -321754 -381536 -289995 -181348 -106125 -22585 24949 -59679 -142505 -120866
17136 -120866 -118071 -44392 -89961 -86423 -59740 -94106 -76486 -1235 14848 -24494 -33380 -63389
17124 -63389 -80140 -112811 -80071 11951 -21465 -69869 -36244 -74504 -100368 -143827 -128380 -124627
17112 -124627 -157462 -110539 -46706 37862 68549 93376 82525 16742 -120882 -159527 -201502
17101 -201502 -236434 -253706 -216661 -134557 -173771 -113613 -62242 -22377 -62057 -44573 64028
17090 64028 -17454 -47129 13376 -67963 -231442 -206205 -119048 -54405 -9035 -782 -58635 -137808
17078 -137808 -197520 -181749 -288069 -327144 -210050 -90750 -120241 -195142 -154944 -100074 -100712
$$ packed form
17159A693q1955l4825m7197n1585J5356Q1830J2123j5972o5057r4739J04698r843
17147a85473q1352n4929n9782R1541J08647P5223Q3540M7534q4628q2826K1639
17136a20866K795P3679m5569L538K6683l4366J7620P5251J6083l9342q886l0009
17124f3389j6751l2671L2740R2022l3416m8404L3625l8260k5864m3459J5447L753
17112a24627l2835M6923O3833Q4568L0687K4827j0851o5783j37624l8645m1975
17101b01502l4932j7272L7045Q2104l9214O0158N1371L9865l9680J7484J08601
17090F4028q1482k9675O0505q1339j63479K5237Q7157O4643M5370Q253n7853p9173
17078a37808n9712J5771j06320l9075J17094J19300k9491p4901M0198N4870o38
$$ plain form
17067 -100712 -203732 -210812 -183110 -123265 -110711 -223385 -317643 -282883 -216475 -160430 -163844
17056 -163844 -176172 -183108 -275846 -260359 -101188 -23774 -12049 -54424 -80489 -116728 -48503
17045 -48503 -46269 -140440 -150371 -215316 -265545 -228745 -269544 -287264 -277728 -311925 -282833 -312395
17033 -312395 -213305 -143208 -166280 -207281 -227193 -210370 -179992 -154194 -219356 -191200 -182923 -213320
17021 -213320 -234074 -298314 -219997 -169016 -123210 -28585 12479 -57610 -75508 9402 -8754
17010 -8754 -31726 -35574 -84435 -24392 -60805 -16607 21576 -123386 -203791 -216442 -153535 -124746
16998 -124746 -65526 -104580 -47201 9875 -30204 -46117 -68618 -98780 -64657 -119153 -151063
16987 -151063 -101988 -95245 -77374 -71529 -106801 -94407 -107769 -157432 -127593 -161387 -139362 -160457
$$ packed form
17067a00712j03020p080K7702N9845J2554j12674r4258L4760O6408N6045l414
17056a63844j2328o936r2738J5487J59171P7414J1725m2375k6065l6239O8225
17045d8503K234r4171r931o4945n0229L6800m0799j7720R536l4197K9092k9562
17033c12395R9090P0097k3072m1001j9912J6823L0378K5798o5162K8156Q277l0397
17021b13320k0754o4240P8317N0981M5806R4625M1064p0089j7898Q4910j8156
17010h754k2972l848m8861O0043l6413M4198L8183j44962q0405j2651O2907K8789
16998a24746N9220l9054N7379N7076m0079j5913k2501l0162L4123n4496l1910
16987a51063M9075O743J7871N845l5272J2394j3362m9663K9839l3794K2025k1095
$$ plain form
16975 -160457 -150393 -68420 -126892 -200729 -63887 -60449 -21555 -14412 -42537 -130892 -140853 -222517
16963 -222517 -134630 -76147 -193547 -157173 -151332 -217397 -226591 -268969 -189549 -156680 -102084 -46897
16951 -46897 -91973 -184173 -272769 -404646 -357738 -304773 -246094 -304429 -285023 -203914 -160436
16940 -160436 -237998 -274621 -183440 -193802 -282578 -255831 -248029 -212594 -294648 -274046 -298629 -322501
16928 -322501 -258472 -158728 -132990 -136899 -97293 -67046 -61356 -147186 -143492 -28313 -76995 -157930
16916 -157930 -89184 -11123 97973 108412 33310 -72377 -111112 -132383 -69972 -151492 -231716
16905 -231716 -138902 -100510 -119152 -124513 -147023 -110045 -49679 -75659 -93619 -185727 -229003 -234438
16893 -234438 -227773 -213630 -235789 -166487 -23352 -78054 -66428 -65329 -93296 -224559 -289076
$$ packed form
16975a60457J0064Q1973n8472p3837J36842L438L8894P143k8125q8355r961q1664
16963b22517Q7887N8483j17400L6374N841o6065r194m2378P9420L2869N4596N5187
16951d6897m5076r2200q8596j31877M6908N2965N8679n8335J9406Q1109M3478
16940a60436p7562l6623R1181j0362q8776K6747P802L5435q2054K0602k4583k3872
16928c22501O4029R9744K5738l909L9606L0247N690q5830L694J15179m8682q0935
16916a57930O8746P8061J09096J0439p5102j05687l8735k1271O2411q1520q0224
16905b31716R2814L8392j8642n361k2510L6978O0366k5980j7960r2108m3276n435
16893b34438O665J4143k2159O9302J43135n4702J1626J099k7967j31263o4517
$$ plain form
16882 -289076 -180939 -88360 -220399 -240176 -197706 -210252 -205514 -199081 -190700 -191756 -227677 -181095
16870 -181095 -145426 -259637 -350172 -435071 -457137 -422875 -370134 -299711 -290302 -347673 -327059
16859 -327059 -325993 -265873 -282920 -227458 -289780 -339838 -354304 -286260 -290758 -315640 -264674 -154815
16847 -154815 -111889 -192212 -289292 -216137 -240512 -254562 -168354 -139167 -178934 -320553 -378808
16836 -378808 -360658 -308938 -256261 -220910 -170820 -141468 -134107 -170594 -204369 -305137 -256624
16825 -256624 -178624 -201821 -177884 -215003 -195677 -130165 -115848 -146080 -138237 -80148 -51498 -99247
16813 -99247 -67105 -55917 -28863 3207 40047 77277 -19503 -90087 -160313 -160081 -231516 -220744
16801 -220744 -162191 -128548 -42004 -139809 -240124 -77634 5521 -44183 -223836 -231075 -238591
$$ packed form
16882b89076J08137R2579j32039j9777M2470j2546M738O433Q381j056l5921M6582
16870a81095L5669j14211r0535q4899k2066L4262N2741P0423R409n7371K0614
16859c27059J066O0120j7047N5462o2322n0058j4466O8044m498k4882N0966J09859
16847a54815M2926q0323r7080P3155k4375j4050Q6208K9187l9767j41619n8255
16836c78808J8150N1720N2677L5351N0090K9352P361l6487l3775j00768M8513
16825b56624P8000k3197K3937l7119J9326O5512J4317l0232P843N8089K8650m7749
16813i9247L2142J1188K7054L2070L6840L7230r6780p0584p0226K32p1435J0772
16801b20744N8553L3643Q6544r7805j00315J62490Q3155m9704j79653p239p516
$$ plain form
16790 -238591 -204643 -175465 -151663 -161536 -241917 -273294 -182530 -15145 40927 71803 28012
16779 28012 54525 3434 -132453 -220573 -109459 -80533 -21066 22306 -51823 -151975 -120300
16768 -120300 -82554 -62134 -80945 -12665 -26637 -71784 -100434 -21196 -89896 -152662 -103816
16757 -103816 -182688 -208116 -146817 -150894 -152011 -186705 -161116 -56941 -125787 -120070 -31973 41360
16745 41360 71502 81489 -2043 48288 127424 37906 -111484 -128812 -100170 -109573 -68168 -105827
16733 -105827 -126048 -55659 -73315 -20380 95909 48698 -94312 -124391 -160965 -161153 -34758
16722 -34758 11939 16444 -4498 -119814 -164091 -193745 -274162 -216888 -218673 -216752 -222572 -300516
16710 -300516 -222116 -156491 -176432 -52971 -51484 -152758 -127533 -152382 -79410 -77944 -91391
$$ packed form
16790b38591L3948K9178K3802r873q0381l1377R0764J67385N6072L0876m3791
16779B8012K6513n1091j35887q8120J11114K8926N9467M3372p4129j00152L1675
16768a20300L7746K0420j8811O8280j3972m5147k8650P9238o8700o2766M8846
16757a03816p8872k5428O1299m077j117l4694K5589J04175o8846N717Q8097P3333
16745D1360L0142R987q3532N0331P9136q9518j49390j7328K8642r403M1405l7659
16733a05827k0221P0389j7656N2935J16289m7211j43010l0079l6574j88J26395
16722c4758M6697M505k0942j15316m4277k9654q0417N7274j785J921n820p7944
16710c00516P8400O5625j9941J23461J487j01274K5225k4849P2972J466j3447
$$ plain form
16699 -91391 -101209 -98137 -81749 11481 -27936 -2842 33918 21014 46162 62011 21445 14749
16687 14749 -84266 -132582 -142026 -127335 -155442 -188563 -207718 -167685 -141856 -69778 -47945 -25214
16675 -25214 -16361 -12458 60654 78618 12479 -32870 -75220 -64899 -161777 -163045 -154341 -163496 -125612
16662 -125612 -162882 -190989 -312739 -290219 -145829 2556 -92576 -192551 -212853 -133400 -67786
16651 -67786 -4545 12212 -89507 -162132 -199720 -224185 -64093 -55496 -102616 -54231 -147256
16640 -147256 -173628 -121914 -84476 -119378 -154250 -295959 -140499 95438 95848 -27507 -164431
16629 -164431 -230971 -158798 -66655 -108276 -189780 -120334 -105070 -68092 -73603 -122418 -124346 -87179
16617 -87179 -84406 -189975 -228165 -219301 -186845 -158789 -177065 -101832 -86527 -146210 -196925 -236959
$$ packed form
16699i1391r818L072J6388R3230l9417K5094L6760j2904K5148J5849m0566o696
16687A4749r9015m8316r444J4691k8107l3121j9155M0033K5829P2078K1833K2731
16675b5214Q853L903P3112J7964o6139m5349m2350J0321r6878j268Q704r155L7884
16662a25612l7270k8107j21750K2520J44390J48385r5132r9975k0302P9453O5614
16651f7786O3241J6757j01719p2625l7588k4465J60092Q597m7120M8385r3025
16640a47256k6372N1714L7438l4902l4872j41709J55460K35937M10j23355j36924
16629a64431o6540P2173R2143m1621q1504O9446J5264L6978n511m8815j928L7167
16617h7179K773j05569l8190Q864L2456K8056j8276P5233J5305n9683n0715m0034
$$ plain form
16605 -236959 -221435 -222418 -102015 -51036 -96129 -30583 -52809 -4885 31484 -41642 -56499 -467
16593 -467 31790 25906 -162604 -179781 -121793 -164826 -177579 -124235 -76718 -145354 -230359 -206714
16581 -206714 -122482 -105846 -57936 -15351 -8492 -18335 -59766 -94112 16352 3960 -60458 -87844
16569 -87844 10629 96500 102818 22757 -38942 -42778 -33194 -133087 -253889 -175067 -93008 -190336
16557 -190336 -263725 -184631 -156703 -46732 -46547 -72600 -37626 -53138 -43769 -41296 -97016 -200690
16545 -200690 -206958 -223264 -173656 -238006 -293154 -270815 -304634 -322603 -237788 -136616 -104159
16534 -104159 -75229 -96044 -100644 -72119 -46713 -19121 -63504 -103665 -106609 -103545 -85169 -27509
16522 -27509 -92583 -179762 -133119 -79748 -59576 -53463 -118900 -121991 -65747 -46991 -49642 -145974
$$ packed form
16605b36959J5524r83J20403N0979m5093O5546k2226M7924L6369p3126j4857N6032
16593d67L2257n884j88510j7177N7988m3033j2753N3344M7517o8636q5005K3645
16581b06714Q4232J6636M7910M2585O859r843m1431l4346J10464j2392o4418k7386
16569h7844R8473Q5871O318q0061o1699l836R584r9893j20802P8822Q2059r7328
16557a90336p3389P9094K7928J09971J85k6053L4974j5512R369K473n5720j03674
16545b00690o268j6306M9608o4350n5148K2339l3819j7969Q4815J01172L2457
16534a04159K8930k0815m600K8525K5406K7592m4383m0161k944L064J8376N7660
16522b7509o5074q7179M6643N3371K0172O113o5437l091N6244J8756k651r6332
$$ plain form
16510 -145974 -163948 -228372 -217503 -85524 22428 -5099 -94522 -188735 -160044 -94141 -50437
16499 -50437 -136765 -216702 -220766 -277412 -214698 -121948 -98634 -110145 -75613 57306 221179
16488 221179 76833 -63779 -28444 4816 -31748 -19330 -87503 -152883 -135213 -121375 -129738
16477 -129738 -224503 -238213 -198555 -144104 -82773 -105731 -116247 -180893 -75220 18280 -23532
16466 -23532 -118134 -161103 -115641 -123205 -46986 -76583 -143888 -189940 -262895 -251819 -226709 -154655
16454 -154655 -50196 -68690 -89063 -72788 -75003 -56274 -51209 -6229 -6048 -71579 -117545 -128764
16442 -128764 -168365 -170386 -183267 -174727 -139076 -104541 -136360 -219454 -162313 -154986 -195428 -219865
16430 -219865 -211758 -185276 -56825 21556 -123964 -229457 -115383 -22681 -63378 10700 3776
$$ packed form
16510a45974j7974o4424J0869J31979J07952k7527q9423r4213K8691O5903M3704
16499e0437q6328p9937m064n6646O2714R2750K3314j1511L4532J32919J63873
16488B21179j44346j40612L5335L3260l6564J2418o8173o5380J7670J3838q363
16477a29738r4765j3710L9658N4451O1331k2958j0516o4646J05673R3500m1812
16466b3532r4602m2969M5462p564P6219k9597o7305m6052p2955J1076K5110P2054
16454a54655J04459j8494k0373J6275k215J8729N065M4980J81o5531m5966j1219
16442a28764l9601k021j2881Q540L5651L4535l1819q3094N7141P327m0442k4437
16430b19865Q107K6482J28451P8381j45520j05493J14074R2702m0697P4078o924
$$ plain form
16419 3776 -64445 -72376 -204253 -229836 -200560 -229250 -140424 -89409 -121860 -50326 -25392 -11408
16407 -11408 -143178 -183099 -141557 -128941 -224645 -252419 -192808 -180332 -140785 -218346 -344550
16396 -344550 -184227 -63783 -9121 81980 127925 83267 36340 4933 -129486 -158951 -102591
16385 -102591 -238140 -391528 -384970 -199013 -193459 -168583 -201386 -262360 -211852 -192576 -211442
16374 -211442 -228517 -160371 -143421 -125509 -79435 -23003 30914 -2123 -48035 -32831 -59401
16363 -59401 -19810 27577 -58092 -35595 -68314 -54782 -60610 -88393 -182040 -188677 -98390 -49507
16351 -49507 -27112 114569 114798 -66144 -95006 -45380 -105858 -152121 -66046 -56032 -161535
16340 -161535 -239098 -245453 -201403 -145953 -100968 -77756 -100784 -63509 41969 85746 42699
$$ packed form
16419C776o8221p931j31877k5583K9276k8690Q8826N1015l2451P1534K4934J3984
16407a1408j31770l9921M1542J2616r5704k7774N9611J2476L9547p7561j26204
16396c44550J60323J20444N4662R1101M5945m4658m6927l1407j34419k9465N6360
16385a02591j35549j53388O558J85957N554K4876l2803o0974N0508J9276j8866
16374b11442j7075O8146J6950J7912M6074N6432N3917l3037m5912J5204k6570
16363e9401L9591M7387q5669K2497l2719J3532n828k7783r3647o637R0287M8883
16351d9507K2395J41681K29j80942k8862M9626o0478m6263Q6075J0014j05503
16340a61535p7563o355M4050N5450M4985K3212k3028L7275J05478M3777m3047
$$ plain form
16329 42699 -39509 -128068 -219268 -181895 -133403 -61114 -58893 -58976 -68569 -69728 33201 61163 -2502
16316 -2502 76999 -35655 -132732 -98990 -118647 -113704 -44206 -44825 19565 13541 -110249 -214969
16304 -214969 -240366 -53555 17067 -72702 -112705 -202306 -191357 -37658 -54571 -224182 -260383
16293 -260383 -199670 -119071 -104754 -171149 -258802 -331257 -330104 -234651 -113366 -150917 -244973
16282 -244973 -276929 -184833 -80169 -134880 -170881 -223573 -158188 -96861 -85427 -8618 -31624
16271 -31624 -39365 -101481 -199986 -220398 -45333 -50397 -84914 -105974 -156920 -126132 -211003 -163873
16259 -163873 -106616 -176418 -125536 -35297 107304 145431 -5310 -60209 -74002 -66889 -81036
16248 -81036 -137363 -93453 -73325 -85032 -98495 -65578 -91528 -125108 -59882 -22753 -2611 -27913
$$ packed form
16329D2699q2208q8559r1200L7373M8492P2289K221q3r593j159J02929K7962o3665
16316b502P9501j12654r7077L3742j9657M943O9498o19O4390o024j23790j04720
16304b14969k5397J86811P0622q9769m0003q9601J0949J53699j6913j69611l6201
16293b60383O0713Q0599J4317o6395q7653p2455J153R5453J21285l7551r4056
16282b44973l1956R2096J04664n4711l6001n2692O5385O1327J1434P6809k3006
16271c1624p741o2116r8505k0412J75065n064l4517k1060n0946L0788q4871M7130
16259a63873N7257o9802N0882R0239J42601L8127j50741n4899j3793P113j4147
16248h1036n6327M3910K0128j1707j3463L2917k5950l3580O5226L7129K0142k5302
$$ plain form
16236 -27913 14359 19064 -77835 -72271 -58542 -21120 39614 26755 -99345 -184913 -213213 -185585
16224 -185585 -66954 -23253 -50271 -17172 111163 47079 -85133 -125461 -97261 -103044 -88743
16213 -88743 -48432 -46828 -76488 -130119 -102207 -24794 -71307 -148633 -156998 -102941 -150500 -210554
16201 -210554 -212182 -232589 -233319 -290051 -218556 -67711 -72869 -47749 -28305 -158863 -102727 -36506
16189 -36506 -33359 79019 -11144 -93931 -148519 -135731 -106647 -110968 -106123 -46669 -125952 -188886
16177 -188886 -263156 -324074 -246867 -124292 -98647 -120576 -144411 -175256 -112021 -116558 -234076
16166 -234076 -204057 -45671 -19225 -15006 -71081 -127281 -170698 -173980 -193160 -133475 -1384
16155 -1384 -15585 -134944 -148078 -132662 -155280 -316978 -423479 -331028 -173066 -87108 -172356
$$ packed form
16236b7913M2272M705r6899N564J3729L7422O0734j2859j26100q5568k8300K7628
16224a85585J18631M3701k7018L3099J28335o4084j32212m0328K8200n783J4301
16213h8743M0311J604k9660n3631K7912P7413m6513p7326q365N4057m7559o0054
16201b10554j628k0407p30n6732P1495J50845n158K5120J9444j30558N6136O6221
16189c6506L147J12378r0163q2787n4588J2788K9084m321M845N9454p9283o2934
16177a88886p4270o0918P7207J22575K5645k1929k3835l0845O3235m537j17518
16166b34076L0019J58386K6446M219n6075n6200m3417l282j9180N9685J32091
16155a384j4201j19359j3134J5416k2618j61698j06501R2451J57962Q5958q5248
$$ plain form
16144 -172356 -165964 -69247 -36469 -61368 -60557 -191042 -113875 -71106 -112563 -46903 -168279 -179807
16132 -179807 -166638 -180298 -131433 -223496 -310934 -281748 -296605 -237784 -199256 -150213 -69166
16121 -69166 -150138 -270905 -287577 -219367 -175262 -139224 -187644 -215918 -117447 -10812 101337
16110 101337 125951 63280 49238 -16652 -46590 -8341 -16101 23539 -138184 -234596 -221441
16099 -221441 -198855 -228474 -78101 45484 -21517 -171323 -231934 -145210 -76481 -2827 35815
16088 35815 -146542 -205158 -138199 -30896 17784 85055 101866 -4268 -87478 -70462 -61414
16077 -61414 -121032 -75685 -60349 -40448 -40424 38670 44190 17247 -50818 -74087 -39405 -80016
16065 -80016 -108954 -50049 -184353 -169949 -117617 -151879 -33597 53970 59984 60339 -12527 29378
$$ packed form
16144a72356O392R6717L2778k4899Q11j30485P7167M2769m1457O5660j21376j1528
16132a79807J3169j3660M8865r2063q7438K9186j4857N8821L8528M9043Q1047
16121f9166q0972j20767j6672O8210M4105L6038m8420k8274R8471J06635J12149
16110A01337K4614o2671j4042o5890k9938L8249p760L9640j61723r6412J3155
16099b21441K2586k9619J50373J23585o7001j49806o0611Q6724O8729P3654L8642
16088C5815j82357n8616O6959J07303M8680O7271J6811j06134q3210J7016R048
16077f1414n9618M5347J5336J9901K4P9094N520k6943o8065k3269L4682m0611
16065h0016k8938N8905j34304J4404N2332l4262J18282Q7567O014L55p2866M1905
$$ plain form
16053 29378 11144 -70190 -160741 -25360 40862 -70251 -108676 -21541 45250 -9013 -90425
16042 -90425 -77057 -43568 30541 69358 42356 43496 89792 117147 -49597 -59599 -97438 -108593
16030 -108593 -8953 39877 23436 -24059 -27371 -77869 -110669 -109593 -88789 -120151 -108976 -156859
16018 -156859 -109952 -44854 -117822 -166168 -240033 -294997 -156874 -63073 652 34760 60818
16007 60818 -40122 -133778 -95753 -38443 -20229 31775 70954 148471 195973 164010 104367
15996 104367 -42804 -69146 -113901 -167028 -181669 -159638 -124787 -29079 -75868 -33633 -2294
15985 -2294 44234 -9672 -3771 -61358 -58823 -67048 -141917 -20859 52016 16257 28732 -85701
15973 -85701 -62475 -88662 -35613 17894 -28289 -101148 -144385 -205175 -105460 -66578 -96846 -258083
$$ packed form
16053B9378j8234q1334r0551J35381O6222j11113l8425Q7135O6791n4263q1412
16042i0425J3368L3489P4109L8817k7002J140M6296K7355j66744j0002l7839j1155
16030a08593R9640M8830j6441m7495l312n0498l2800J076K0804l1362J1175m7883
16018a56859M6907O5098p2968m8346p3865n4964J38123R3801O3725L4108K6058
16007F0818j00940r3656L8025N7310J8214N2004L9179P7517M7502l1963n9643
15996A04367j47171k6342m4755n3127j4641K2031L4851R5708m6789M2235L1339
15985b294M6528n3906N901n7587K535q225p4869J21058P2875l5759J2475j14433
15973h5701K3226k6187N3049N3507m6183p2859m3237o0790R9715L8882l0268j61237
$$ plain form
15961 -258083 -333853 -283803 -190146 -94948 -5111 -97051 -170666 -75727 176085 123188 37751
15950 37751 37999 22635 104321 4865 -181087 -229557 -211810 -201772 -190969 -244915 -229156 -226911
15938 -226911 -142977 -29796 81120 107492 20070 -112061 -124210 -92289 -32057 7882 -46214
15927 -46214 -188475 -133339 -32481 40338 40992 20298 60063 8550 -69506 -30852 -37970 22115
15915 22115 5491 -71980 -49250 -72621 -101253 -94501 -77088 95199 126806 58335 592 -56236
15903 -56236 -109771 -274806 -311413 -198901 -181666 -252589 -209023 -124520 -27196 46450 151515
15892 151515 81854 71175 49885 -120971 -159331 -162648 -88898 45468 103700 34118 20032
15881 20032 -206 -84172 -144396 -210491 -112245 -22609 -49471 -34219 -89442 -134312 -50879 -37540
$$ packed form
15961b58083p5770N0050R3657R5198Q9837r1940p3615R4939K51812n2897q5437
15950C7751K48j5364Q1686r9456j85952m8470J7747J0038J0803n3946J5759K245
15938b26911Q3934J13181J10916K6372q7422j32131j2149L1921O0232L9939n4096
15927d6214j42261N5136J00858P2819O54k0694L9765n1513p8056L8654p118O0085
15915B2115j6624p7471K2730k3371k8632O752J7413J72287L1607o8471n7743n6828
15903e6236n3535j65035l6607J12512J7235p0923M3566Q4503R7324P3646J05065
15892A51515o9661j0679k1290j70856l8360l317P3750J34366N8232o9582j4086
15881B0032k0238q3966o0224o6095R8246Q9636k6862J5252n5223m4870Q3433J3339
$$ plain form
15869 -37540 -51708 -39608 34515 -43640 -92282 -56397 -46183 -125562 -105921 -83375 -85636 -86323
15857 -86323 -158764 -210457 -117370 -91017 9361 -27038 -115058 -37564 58291 47011 -61048
15846 -61048 -151753 -121535 -24871 62880 107474 74793 -33637 -85908 -73451 -104505 -161150
15835 -161150 -106984 -206895 -345804 -244485 -97419 -25665 2225 -55120 -57787 -25629 -16689
15824 -16689 -141146 -164874 -208813 -103109 44216 61097 95853 55056 -16685 7529 60488
15813 60488 -67470 -152177 -128457 -92831 -41244 23831 56683 26925 -46543 -94821 -181796
15802 -181796 -215274 -144168 -106759 -64125 -80767 -18735 7201 5252 55889 9680 90706 199882
15790 199882 178756 84828 -34360 -103551 -141193 -98767 -73063 -62921 -114967 -97753 -19804
$$ packed form
15869c7540j4168J2100P4123p8155m8642L5885J0214p9379J9641K2546k261o87
15857h6323p2441n1693R3087K6353J00378l6399q8020P7494R5855j1280j08059
15846f1048r0705L0218R6664Q7751M4594l2681j08430n2271J2457l1054n6645
15835a61150N4166r9911j38909J01319J47066P1754K7890n7345k667L2158Q940
15824a6689j24457k3728m3939J05704J47325J6881L4756m0797p1741K4214N2959
15813F0488j27958q4707K3720L5626N1587O5075L2852k9758p3468m8278q6975
15802a81796l3478P1106L7409M2634j6642O2032K5936j949N0637m6209Q1026J09176
15790A99882k1126r3928j19188o9191l7642M2426K5704J0142n2046J7214P7949
$$ plain form
15779 -19804 -51371 -33502 11421 20697 -51902 -138958 -107677 -81514 -85569 -175222 -169198 -98070
15767 -98070 -15727 -10055 10708 38650 -39144 -214306 -244740 -249839 -280577 -228733 -261430 -226292
15755 -226292 -78755 -41609 -99704 -108716 -118470 -166427 -140414 -80332 -96706 43112 49393 65171
15743 65171 134474 143537 129116 88579 49331 -26458 -97391 -64655 58179 10443 -35513 -65922
15731 -65922 -88664 -99939 -2068 -57967 -129805 -212738 -133989 71123 95447 -3256 -30305
15720 -30305 -52669 -65400 -103141 -97686 -127206 -45248 38891 51552 59229 1256 113574 206139
15708 206139 72897 39253 45841 56746 126885 130151 86188 -52386 24459 33930 -48321 -80947
15696 -80947 -30395 -18003 32150 -4739 -67688 -121908 -121164 -209536 -188887 -73958 -52252 -77231
$$ packed form
15779a9804l1567J7869M4923R276p2599q7056L1281K6163m055q9653O024P1128
15767i8070Q2343N672K0763K7942p7794j75162l0434n099l0738N1844l2697L5138
15755b26292J47537L7146n8095r012r754m7957K6013O0082j6374J39818O281J5778
15743F5171O9303R063j4421m0537l9248p5789p0933L2736J22834m7736m5956l0409
15731f5922k2742j1275R7871n5899p1838q2933P8749K05112K4324r8703k7049
15720c0305k2364j2731l7741N455k9520Q1958Q4139J2661P677n7973J12318R2565
15708B06139j33242l3644O588J0905P0139L266m3963j38574P6845R471q2251l2626
15696h0947N0552J2392N0153l6889o2949n4220P44q8372K0649J14929K1706k4979
$$ plain form
15684 -77231 -56209 21597 44863 70866 93632 11822 -26870 -54217 -70031 -132417 -127822 -137259
15672 -137259 -66150 2391 116737 115023 59728 -10513 -127492 -62228 -92636 -57474 -28990
15661 -28990 -55225 -133883 -169913 -184856 -199540 -250520 -224447 -35347 -11388 -30760 -32617 -51218
15649 -51218 -116135 -172920 -95321 -77170 32751 56429 -9140 -128633 -251987 -181918 -99298
15638 -99298 -165779 -253799 -295551 -210233 -170746 -254556 -275565 -278862 -201382 -108916 -66711 -49427
15626 -49427 -52564 67148 -3598 -123476 -166367 -210513 -138097 -24482 -51864 -92533 11737
15615 11737 21502 61227 113394 45721 -36139 -43478 46523 -63161 -168076 -159333 -135688 -206395
15603 -206395 -268767 -215239 -125614 -51767 -90424 -102754 -90251 -73627 -49168 10419 75935
$$ packed form
15684g7231K1022P7806K3266K6003K2766q1810l8692k7347j5814o2386M595r437
15672a37259P1109O8541J14346j714n5295p0241j16979O5264l0408L5162K8484
15661b8990k6235p8658l6030j4943j4684n0980K6073J89100K3959j9372j857j8601
15649e1218o4917n6785P7599J8151J09921K3678o5569j19493j23354P0069Q2620
15638i9298o6481q8020m1752Q5318L9487q3810k1009l297P7480R2466M2205J7284
15626d9427l137J19712p0746j19878m2891m4146P2416J13615k7382m0669J04270
15615A1737R765L9725N2167o7673q1860p339R0001j09684j04915Q743K3645p0707
15603b06395o2372N3528Q9625P3847l8657j2330J2503J6624K4459N9587O5516
$$ plain form
15592 75935 -23003 -10062 -52174 -107405 -184408 -188011 -69315 -58818 -52667 -31607 -102698 -157708
15580 -157708 -87967 44532 124600 53485 -17091 -118679 -86291 -84247 -141776 -132489 -147949
15569 -147949 -116892 -143013 -100367 -77454 -96026 -120866 -8667 44674 28577 4791 -46100
15558 -46100 -192373 -166739 -75060 -61341 -58988 -105868 -182502 -191304 -175057 -84605 -112523 -144143
15546 -144143 -77133 -57573 -82711 -41671 11118 155680 92100 18510 24311 -88220 -138195
15535 -138195 -152808 -96461 -63225 -16421 -14992 -66915 -102213 -143849 -174298 -91084 121235
15524 121235 41579 -165604 -187803 -240306 -137851 -61534 -31998 39442 28714 -23393 -106834
15513 -106834 -103715 -91006 -163087 -111940 -47435 -61229 -176476 -227394 -202409 -132214 -80729
$$ packed form
15592G5935r8938J2941m2112n5231p7003l603J18696J0497O151K1060p1091n5010
15580a57708O9741J32499Q0068p1115p0576j01588L2388K044n7529R287j5460
15569a47949L1057k6121M2646K2913j8572k4840J12199N3341j6097k3786n0891
15558d6100j46273K5634R1679J3719K353m6880p6634q802J6247R0452k7918l1620
15546a44143O7010J9560k5138M1040N2789J44562o3580p3590N801j12531m9975
15535a38195j4613N6347L3236M6804J429n1923l5298m1636l0449Q3214K12319
15524A21235p9656k07183k2199n2503J02455P6317K9536P1440j0728n2107q3441
15513a06834L119J2709p2081N1147O4505j3794j15247n0918K4985P0195N1485
$$ plain form
15502 -80729 -50726 -40303 -97407 -138767 -215007 -225161 -178717 -239608 -195759 -109784 -71408 -155448
15490 -155448 -220770 -203609 -250403 -215759 -224870 -183674 -142624 -129618 -199984 -248448 -270849 -315149
15478 -315149 -199669 -186620 -174012 -64377 -29648 -57096 -114026 -102381 -83922 -37767 -22382
15467 -22382 9422 -32361 -183587 -132691 -95570 -193175 -253972 -293709 -221968 -129259 -139958
15456 -139958 -276703 -357588 -207843 -181190 -170809 -77904 -39843 -76488 -74615 -51591 14288
15445 14288 696 111152 151445 77838 -78541 -24807 69996 76541 -29828 3415 -45982
15434 -45982 -42075 1281 20670 -49056 -106552 -115311 -115061 -150021 -101190 -89381 -98311 -141076 -201115
15421 -201115 -113153 -47306 -52848 -13128 47648 -60473 -116015 -22806 1417 -23428 -108526
$$ packed form
15502h0729L0003J0423n7104m1360p6240j0154M6444o0891M3849Q5975L8376q4040
15490a55448o5322J7161m6794L4644r111M1196M1050J3006p0366m8464k2401m4300
15478c15149J15480J3049J2608J09635L4729k7448n6930J1645J8459M6155J5385
15467b2382L1804m1783j51226N0896L7121r7605o0797l9737P1741R2709j0699
15456a39958j36745q0885J49745K6653J0381R2905L8061l6645J873K3024O5879
15445A4288j3592J10456M0293p3607j56379N3734R4803O545j06369L3243m9397
15434d5982L907M3356J9389o9726n7496q759K50l4960M8831J1809q930m2765o0039
15421b01115Q7962O5847n542L9720O0776j08121n5542R3209K4223k4845q5098
$$ plain form
15410 -108526 -124131 -43563 77815 77075 80049 123481 117804 -7157 -76450 -134692 -128353 -59204
15398 -59204 -58595 -69701 -69584 -77589 -52959 53627 2060 -110428 -111496 -6793 5795 -53438
15386 -53438 -63590 -67786 -108473 -63369 -9234 6395 -201 -105660 -148538 -87547 -98301 -137605
15374 -137605 -171820 -101861 -50208 -37918 36382 129684 158517 112346 91337 9250 -131790
15363 -131790 -175872 -164353 -154730 -79013 69348 52178 -35280 -38464 -53647 27258 -18901 -113333
15351 -113333 -161859 -94287 -46190 -79313 -111164 -98359 -146474 -116696 -145364 -106518 -194832
15340 -194832 -239724 -148251 -135929 -139389 -195932 -221259 -279505 -201616 -145767 -57747 -151100 -148183
15328 -148183 -73366 -64915 -30199 -59650 11998 154652 178878 128574 75025 60395 133106
$$ packed form
15410a08526j5605Q0568J21378p40K974M3432n677j24961o9293n8242O339O9149
15398e9204O09j1106J17q005K4630J06586n1567j12488j068J04703J2588n9233
15386e3438j0152m196m0687M5104N4135J5629o596j05459m2878O0991j0754l9304
15374a37605l4215O9959N1653J2290P4300R3302K8833m6171k1009q2087j41040
15363a31790m4082J1519R623P5717J48361j7170q7458l184j5183Q0905m6159r4432
15351a13333m8526O7572M8097l3123l1851J2805m8115K9778k8668L8846q8314
15340a94832m4892R1473J2322l460n6543k5327n8246P7889N5849Q8020r3353K917
15328a48183P4817Q451L4716k9451P1648J42654K4226n0304n3549j4630P2711
$$ plain form
15317 133106 163428 116130 -9582 -29647 -120138 -98483 -90166 -127961 -149472 -157820 -138229 -88996
15305 -88996 -67318 509 -78996 -117337 56936 99627 48654 -119394 -137756 -74793 -61979
15294 -61979 -87895 -78262 -48672 -9227 17399 36916 -48118 -76340 5963 161793 176014 37115
15282 37115 -167493 -143696 20257 74476 -44812 -124658 -69506 -42663 -44578 -112381 -153180
15271 -153180 -166193 -111018 -92005 -7835 -15714 12306 107611 104657 131440 123128 92945 10453
15259 10453 -38962 -89485 -146723 -117998 -84757 25970 -67371 -104823 -109957 -105795 -9595 52410
15247 52410 80421 -21026 -29834 -64609 -35083 -43131 -69091 85129 219754 174929 103070
15236 103070 6814 -94290 -77357 -51004 -149890 -221917 -170092 -91532 -50736 -52955 10627
$$ packed form
15317A33106L0322m7298j25712k0065r0491K1655Q317l7795k1511q348J9591M9233
15305h8996K1678O7827p9505l8341J74273M2691n0973j68048j8362O2963J2814
15294f1979k5916R633K9590L9445K6626J9517q5034k8222Q2303J55830J4221j38899
15282C7115k04608K3797J63953N4219j19288p9846N5152K6843j915o7803m0799
15271a53180j3013N5175J9013Q4170p879K8020R5305k954K6783q312l0183q2492
15259A0453m9415n0523n7238K8725L3241J10727r3341l7452n134M162R6200O2005
15247E2410K8011j01447q808l4775K9526q048k5960J54220J34625m4825p1859
15236A03070r6256j01104J6933K6353r8886p2027N1825P8560M0796k219O3582
$$ plain form
15225 10627 -81082 -95345 -147650 -165651 -106873 -123457 -29896 32125 81758 129646 153042 184831
15213 184831 99951 -18843 -107994 -105919 -81565 -54366 33045 23448 -66975 -53794 65779
15202 65779 110048 183030 155034 137442 136698 100548 47198 -45153 -112462 -120929 -86648 -99149
15190 -99149 -34691 74299 132137 150141 118407 69114 64811 126027 140395 56392 77678 61462
15178 61462 5293 59630 48791 -9358 -107615 -83883 -33619 -26092 -24187 -2893 20750 110464
15166 110464 162584 43423 -2085 61619 129906 -13587 -147035 -151619 -176123 -160253 -126285
15155 -126285 -50668 -33169 -142528 -119696 -17113 -41424 -157753 -134091 -63800 -7463 14081
15144 14081 18081 -45497 -11931 -18478 1415 -24043 24478 71925 71694 102284 123195 39064
$$ packed form
15225A0627r1709j4263n2305j8001N8778j6584R3561O2021M9633M7888K3396L1789
15213A84831q4880j18794q9151K075K4354K7199Q7411r597r0423J3181J19573
15202F5779M4269P2982k7996j7592p44l6150n3350r2351o7309q467L4281j2501
15190i9149O4458J08990N7838J8004l1734m9293m303O1216J4368q4003K1286j6216
15178F1462n6169N4337j0839n8149r8257K3732N0264P527J905K1294K3643Q9714
15166A10464N2120j19161m5508O3704O8287j43493j33448m584k4504J5870L3968
15155a26285P5617J7499j09359K2832J02583k4311j16329K3662P0291N6337K1544
15144A4081M000o3578L3566o547J9893k5458M8521M7447k31L0590K0911q4131
$$ plain form
15132 39064 -69137 -87321 -23628 19300 -85149 -116421 -77921 -86068 -42609 -79278 -89394
15121 -89394 7499 113140 55801 1751 -25371 -69457 -22843 -59697 3589 54209 -779
15110 -779 27459 48523 39578 -13517 -44362 -35909 -15796 -18230 -16600 -65036 -48504 -70871 -48865
15097 -48865 -121097 -205215 -157242 -106807 -114249 -165534 -79620 -21816 -90438 -188969 -241548 -292980
15085 -292980 -220410 -163226 -73121 48971 66994 21897 -69776 -47287 -4367 -13382 -141219
15074 -141219 -177383 -180706 -72060 10079 -56681 -115530 -111129 -114336 -130303 -173999 -218713 -109362
15062 -109362 -71671 -87182 -91917 -79884 -57993 -118185 -199776 -236738 -170090 -15614 78416
15051 78416 93078 74204 -77591 -105098 -123156 -71362 -148562 -202985 -245056 -207948 -94560
$$ packed form
15132C9064j08201j8184O3693M2928j04449l1272L8500q147M3459l6669j0116
15121h9394R6893J05641n7339n4050k7122m4086M6614l6854O3286N0620n4988
15110g79K8238K1064q945n3095l0845Q453K0113k434J630m8436J6532k2367K2006
15097d8865p2232q4118M7973N0435p442n1285Q5914N7804o8622r8531n2579n1432
15085b92980P2570N7184R0105J22092J8023m5097r1673K2489M2920r015j27837
15074a41219l6164l323J08646Q2139o6760n8849M401l207j5967m3696m4714J09351
15062a09362L7691j5511m735J2033K1891o0192q1591l6962O6648J54476R4030
15051G8416J4662j8874j51795k7507j8058N1794p7200n4423m2071L7108J13388
$$ plain form
15040 -94560 18996 71993 105882 116136 4198 -68543 -135559 -146095 -38332 -528 -35324
15029 -35324 -101405 -37027 -70439 -88498 -66221 -38290 -48094 -57788 -81482 -138860 -180609 -120652
15017 -120652 -95217 -48202 -35046 23412 -13056 -6801 -94801 -169924 -125165 -75004 -75956 -119988
15005 -119988 -182151 -311346 -256409 -148562 -101395 -45961 5141 71556 -15904 -207012 -269413
14994 -269413 -270742 -138074 -69455 -70526 -59553 -66617 -69302 7952 23977 98058 73174 30805
14982 30805 4190 -135934 -112213 22129 110604 42152 8728 -7209 -22493 -43576 -13279
14971 -13279 95769 90878 47177 -47173 -91257 -90843 -100077 -166532 -67908 -81168 38692 143615
14959 143615 -79457 -111586 -59075 -117886 -152736 -137003 -101631 -85040 -42524 -214368 -234730
$$ packed form
15040i4560J13556N2997L3889J0254j11938p2741o7016j0536J07763L7804l4796
15029c5324o6081O4378l3412j8059K2277K7931r804r694k3694n7378m1749N9957
15017a20652K5435M7015J3156N8458l6468O255q8000p5123M4759N0161r52m4032
15005a19988o2163j29195N4937J07847M7167N5434N1102O6415q7460j91108o2401
14994b69413j329J32668O8619j071J0973p064k685P7254J6025P4081k4884m2369
14982C0805k6615j40124K3721J34342Q8475o8452l3424j5937j5284k1083L0297
14971a3279J09048m891m3701r4350m4084M14r234o6455R8624j3260J19860J04923
14959A43615k23072l2129N2511n8811l4850J5733L5372J6591M2516j71844k0362
$$ plain form
14948 -234730 -152876 -104498 -61757 -111838 -88585 -63261 -59440 -31446 13198 20058 85662 234395
14936 234395 221791 19894 -52434 -46286 -157283 -193666 -69400 -22324 -58653 -23744 17326
14925 17326 30334 9319 -90486 -87602 -8298 85187 180451 161717 39635 -33616 -8855 35519
14913 35519 -31223 -108877 -162441 -192172 -189803 -210276 -144554 -137720 -62558 -51040 -375 137513
14901 137513 131377 -13928 -34699 -164682 -162131 -114360 -114174 -85299 -18424 85661 97450 16075
14889 16075 -48804 -84681 -145095 -166863 -111537 -19624 82200 87706 -21217 7724 81931
14878 81931 70421 -5071 -61308 -71124 -140179 -180336 -26742 11569 -38573 -131501 -101512 -130313
14866 -130313 -97945 -44159 -46397 -118028 -188718 -168998 -231245 -289547 -225019 -186143 -145421 -63102
$$ packed form
14948b34730Q1854M8378M2741n0081K3253K5324L821K7994M4644O860O5604J48733
14936B34395j2604k01897p2328O148j10997l6383J24266M7076l6329L4909M1070
14925A7326J3008k1015r9805K884P9304R3485R5264j8734j22082p3251K4761M4374
14913C5519o6742p7654n3564k9731K369k0473O5722O834P5162J1518N0665J37888
14901A37513o136j45305k0771j29983K551M7771J86K8875O6875J04085J1789q1375
14889A6075o4879l5877o0414k1768N5326R1913J01824N506j08923K8941P4207
14878H1931j1510p5492n6237r816o9055m0157J53594L8311n0142r2928K9989k8801
14866a30313L2368N3786k238p1631p0690J9720o2247n8302O4528L8876M0722Q2319
$$ plain form
14854 -63102 16803 42689 121052 160548 63493 29506 50183 -53022 8303 -44454 -92807
14843 -92807 -11014 -2869 -40668 31579 70352 130782 192836 93855 16434 75406 173548 148272
14831 148272 1232 -117090 -95245 -44088 -69876 8584 89049 54901 -103697 -168629 -125847
14820 -125847 -81200 -47226 -76892 -88549 -176155 -108679 42175 41127 -42516 -80760 -105749
14809 -105749 -26153 16118 -98610 -159852 -42905 -32526 -113203 -102524 -116936 -67451 -84478
14798 -84478 -142136 -149575 -47086 22116 94552 63609 16722 -79889 -115413 13987 57517
14787 57517 35725 -33393 -76141 -12062 37532 27082 -78261 -168621 -154959 -106432 -107033 -110216
14775 -110216 -225627 -301152 -224092 -218857 -39454 56741 -16470 -66015 -118558 -46190 37575
$$ packed form
14854f3102P9905K5886P8363L9496r7055l3987K0677j03205O1325n2757m8353
14843i2807Q1793Q145l7799P2247L8773O0430O2054r8981p7421N8972R8142k5276
14831A48272j47040j18322K1845N1157k5788P8460Q0465l4148j58598o4932M2782
14820a25847M4647L3974k9666j1657q7606O7476J50854j048q3643l8244k4989
14809a05749P9596M2271j14728o1242J16947J0379q0677J0679j4412M9485j7027
14798h4478n7658p439J02489O9202P2436l0943m6887r6611l5524J29400M3530
14787E7517k1792o9118m2748O4079M9594j0450j05343r0360J3662M8527o01l183
14775a10216j15411p5525P7060N235J79403R6195p3211m9545n2543P2368Q3765
$$ plain form
14764 37575 -54394 -100932 -52671 17303 47853 124916 41539 -93073 -91333 -58833 -80741 -210561
14752 -210561 -301319 -194858 -89305 -63265 -29007 -68451 -34938 4646 -62435 -84690 -72059
14741 -72059 58870 43142 -83792 -258044 -222477 -86905 -27054 -54576 12687 68239 91191
14730 91191 102401 15073 -41830 65182 72695 17875 -38813 -45691 -48931 -133260 -134702 -31448
14718 -31448 87962 147585 164750 91422 -918 -41240 -8624 -3732 -66601 -2465 102088
14707 102088 155417 82257 44960 -1818 -26584 -11708 -60349 -69022 -86788 -74505 3086 -49883
14695 -49883 -50017 -27039 -12757 34688 91772 87004 1999 16712 76476 11521 -122896 -129819
14683 -129819 -135347 57545 164639 72153 -16301 2376 10940 16339 106596 100878 -23226 30299
$$ packed form
14764C7575r1969m6538M8261O9974L0550P7063q3377j34612J740L2500k1908j29820
14752b10561r0758J06461J05553K6040L4258l9444L3513L9584o7081k2255J2631
14741g2059J30929j5728j26934j74252L5567J35572N9851k7522O7263N5552K2952
14730I1191J1210q7328n6903J07012P513n4820n6688o878l240q4329j442J03254
14718c1448J19410N9623J7165p3328r2340m0322L2616M892o2869O4136J04553
14707A02088N3329p3160l7297m6778k4766J4876m8641q673j7766J2283P7591n2969
14695d9883j34K2978J4282M7445N7084m768q5005J4713N9764o4955j34417o923
14683a29819n528J92892J07094r2486q8454J8677Q564N399R0257n718j24104N3525
$$ plain form
14671 30299 57589 40308 42870 75069 -6804 -39318 -21138 -49680 -81075 -157942 -173932 -94133
14659 -94133 -37032 -59290 -94982 -171218 -187021 -69148 7804 44315 92048 116891 -22103
14648 -22103 -114264 -38910 -16436 -51854 -55327 21445 7547 -64140 -59798 -139671 -95322 -216177
14636 -216177 -289084 -164609 -46495 -6581 27298 83221 135744 25528 -123168 -138088 -39604
14625 -39604 -80660 -79852 35558 13777 30816 58264 85768 57016 142193 152190 160116 292937
14613 292937 450916 409662 294906 303255 325796 252955 296394 416389 358861 390690 289907
14602 289907 278585 353465 316488 217689 114633 154385 261693 281200 258351 278343 364482
14591 364482 372750 297158 216178 144387 98719 36905 -22810 -9796 -153535 -156318 -121615 -79190
$$ packed form
14671C0299K7290j7281K562L2199q1873l2514J8180k8542l1395p6867j5990P9799
14659i4133N7101k2258l5692p6236j5803J17873P6952L6511M7733K4843j38994
14648b2103r2161P5354K2474l5418l473P6772j3898p1687M342p9873M4349j20855
14636b16177p2907J24475J18114L9914L3879N5923N2523j10216j48696j4920R8484
14625c9604m1056Q08J15410k1781J7039K7448K7504k8752Q5177R997P926J32821
14613B92937J57979m1254j14756Q349K2541p2841M3439J19995n7528L1829j00783
14602B89907j1322P4880l6977r8799j03056L9752J07308J9507k2849J9992Q6139
14591C64482Q268p5592q0980p1791m5668o1814n9715J3014j43739k783L4703M2425
$$ plain form
14579 -79190 -128948 -220565 -163612 -64787 -57814 33567 99016 96264 61171 11939 -43830 29799
14567 29799 189754 195984 122996 136105 126318 194555 201552 121719 53 -56285 11156 -56188
14555 -56188 -3197 42467 110523 94797 101824 65375 19923 39946 75295 150382 272101 127085
14543 127085 39692 23333 12636 69685 78596 162622 118623 48963 -63802 19355 168101
14532 168101 175824 136621 129390 166351 236422 283689 280382 259059 281784 284835 273427 394130
14520 394130 442059 484977 508709 373222 277487 230275 187728 116318 108888 73640 176841
14509 176841 198652 253567 264284 209869 104509 73126 19128 17139 160729 311152 264822
14498 264822 101705 14640 5482 45450 101863 107580 73151 83354 145065 68277 87926 77347
$$ packed form
14579g9190m9758r1617N6953R8825O973R1381O5449k752l5093m9232n5769P3629
14567B9799J59955O230p2988J3109r787O8237O997p9833j21666n6338O7441o7344
14555e6188N2991M5664O8056j5726P027l6449m5452K0023L5349P5087J21719j45016
14543A27085q7393j6359j0697N7049Q911Q4026m3999o9660j12765Q3157J48746
14532A68101P723l9203p231L6961P0071M7267l307k1323K2725L051j1408J20703
14520C94130M7929M2918K3732j35487r5735m7212m2547p1410p430l5248J03201
14509A76841K1811N4915J0717n4415j05360l1383n3998j989J43590J50423m6330
14498B64822j63117q7065r158L9968N6413N717l4429J0203O1711p6788J9649j0579
$$ plain form
14486 77347 132907 62327 67331 118625 104023 25562 460 41598 -86798 -179632 -240834 -220681
14474 -220681 -161448 -82186 -29984 13546 -44102 -68273 -44220 -10725 42426 64333 58448 -5186
14462 -5186 17489 55428 77819 73524 73985 92217 67860 -5583 -17680 49622 -45604 -158845
14450 -158845 -101802 46842 88062 -29814 -79975 -58587 -74121 -127467 -150699 -128398 -56396
14439 -56396 -130195 -45142 66563 -8993 -30495 -162 -16420 -12945 -25623 -30474 -56352 -82656
14427 -82656 -66227 -41623 -32230 -374 -76784 -32059 32641 -104114 -211722 -57855 105729
14416 105729 107807 46439 -16164 -96467 -9649 -40464 -90530 -110716 -75886 -29338 -95 13310
14404 13310 91076 115506 171531 115989 91514 198105 178813 50495 9300 35400 94158
$$ packed form
14486G7347N5560p0580N004N1294j4602p8461k5102M1138j28396r2834o1202K0153
14474b20681N9233P9262N2202M3530n7648k4171K4053L3495N3151K1907n885o3634
14462e186K2675L7939K2391m295M61J8232k4357p3443j2097O7302r5226j13241
14450a58845N7043J48644M1220j17876n0161K1388j5534n3346k3232K2301P2002
14439e6396p3799Q5053J11705p5556k1502L0333j6258L475j2678m851k5878k6304
14427h2656J6429K4604R393L1856p6410M4725O4700j36755j07608J53867J63584
14416A05729K078o1368o2603q0303Q6818l0815n0066k0186L4830M6548K9243J3405
14404A3310P7766K4430N6025n5542k4475J06591j9292j28318m1195K6100N8758
$$ plain form
14393 94158 101451 77887 42891 30617 29778 -43778 -87947 -19399 73604 57835 4583 -20935
14381 -20935 6275 29080 -22535 -77119 -156441 -134637 -57247 15236 -13789 -61250 -80793 -14754
14369 -14754 18239 -31244 -86065 -82278 -22786 -145684 -175823 -38309 17118 71108 10217
14358 10217 -46453 42297 76370 56803 78351 124761 147904 134507 156897 104722 144152 133076
14346 133076 54586 58221 22572 -16845 30442 78774 116141 86722 120282 148616 95520 65588
14334 65588 109035 95981 81485 59717 -70943 -51967 51250 123459 98085 14063 13571 133414
14322 133414 135343 106271 93754 145344 149994 44478 32873 28459 157889 118087 -12821
14311 -12821 -109950 -67155 11865 51827 1622 18501 32727 19712 -53791 -102782 -98740 10425
$$ packed form
14393I4158P293k3564l4996j2274q39p3556m4169O8548R3003j5769n3252k5518
14381b0935K7210K2805n1615n4584p9322K1804P7390P2483k9025m7461j9543O6039
14369a4754L2993m9483n4821L787N9492j22898l0139J37514N5427N3990o0891
14358A0217n6670Q8750L4073j9567K1548M6410K3143j3397K2390n2175L9430j1076
14346A33076p8490L635l5649l9417M7287M8332L7367k9419L3560K8334n3096k9932
14334F5588M3447j3054j4496k1768j30660J8976J03217P2209k5374q4022m92J19843
14322A33414J929k9072j2517N1590M650j05516j1605m414J29430l9802j30908
14311a2821r7129M2795P9020L9962n0205J6879J4226j3015p3503m8991M042J09165
$$ plain form
14299 10425 102024 35565 17886 44636 53995 92878 123224 51963 12726 -59654 65488 56851
14287 56851 121866 179520 247816 230562 312886 283406 214651 245144 232084 339271 408533
14276 408533 501029 584450 709694 754124 683453 741983 868816 889194 770911 703051 712207
14265 712207 691106 672719 588936 464068 404501 266311 246603 248104 277884 192852 126276
14254 126276 95978 24767 46594 209519 281169 198826 198805 223801 199800 180972 85421 -18297
14242 -18297 -19265 -13516 -15537 -40020 -13524 47868 57630 88124 -7041 -38147 9186 93589 176897
14229 176897 200535 217167 51869 27697 133285 185241 209936 252984 289805 290508 274769
14218 274769 333197 420166 525592 607539 755547 905217 995159 1188607 1254981 1242833 1344536
$$ packed form
14299A0425R1599o6459j7679K6750R359L8883L0346p1261l9237p2380J25142q637
14287E6851O5015N7654O8296j7254Q2324k9480o8755L0493j3060J07187O9262
14276D08533R2496Q3421J25244M4430p0671N8530J26833K0378j18283o7860R156
14265G12207k1101j8387q3783j24868n9567j38190j9708J501K9780q5032o6576
14254A26276l0298p1211K1827J62925P1650q2343k1K4996k4001j8828r5551j03718
14242a8297r68N749k021k4483K6496O1392R762L0494r5165l1106M7333Q4403Q3308
14229A76897K3638J6632j65298k4172J05588N1956K4695M3048L6821P03j5739
14218B74769N8428Q6969J05426Q1947J48008J49670Q9942J93448O6374j2148J01703
$$ plain form
14207 1344536 1324950 1203031 1054967 959712 865127 760075 716522 659890 623463 602378 543105
14196 543105 569420 611188 488493 414332 303709 289535 354526 337850 315538 385017 345445
14185 345445 264856 301818 173732 216729 244837 250722 252010 259102 282821 261303 207320 179478
14173 179478 237091 219103 160898 186643 228023 269002 295538 295303 347415 367566 274047 262437
14161 262437 287346 287606 227865 235532 250697 245871 192951 191525 175891 133068 40750 9973
14149 9973 34657 89111 70846 78670 148122 237660 268471 283560 210238 57170 37426 138992
14137 138992 233511 177082 159083 182884 173251 222058 332650 542446 656158 592819 514556
14126 514556 507051 589328 589445 624887 674036 671481 628504 625840 619094 472956 488613 514130
$$ packed form
14207A344536j9586j21919j48064r5255r4585j05052m3553n6632l6427k1085n9273
14196E43105K6315M1768j22695p4161j10623j4174O4991j6676k2312O9479l9572
14185C45445q0589L6962j28086M2997K8108N885J288P092K3719k1518n3983k7842
14173A79478N7613j7988n8205K5745M1380M0979K6536k35N2112K0151r3519j1610
14161B62437K4909K60n9741P667J5165m826n2920j426j5634m2823r2318l0777
14149I973K4684N4454j8265P824O9452Q9538L0811J5089p3322j53068j9744J01566
14137A38992R4519n6429j7999K3801r633M8807J10592K09796J13712o3339p8263
14126E14556p505Q2277J17L5442M9149k555m2977k664o746j46138J5657K5517
$$ plain form
14114 514130 487830 563610 629351 616953 628364 608852 635235 652178 590049 558722 631074
14103 631074 579134 526815 382042 282357 354473 322988 263359 257721 203210 211792 374756
14092 374756 515744 441438 304003 196659 87621 82541 154747 177368 171633 152009 114912
14081 114912 139890 263109 304083 271877 195942 123070 60833 30161 6937 29175 86759
14070 86759 149682 130788 96068 155107 45773 -9324 -58569 -60779 10505 104662 38632 -10659
14058 -10659 -19401 66837 87835 46282 24339 63454 108695 23634 -80355 -86386 -8048 65506
14046 65506 187526 136328 38369 11894 -58896 -17942 42348 64591 107979 34844 -6470
14035 -6470 26949 128810 236462 250300 238758 190688 120806 117321 11086 47610 87033
$$ packed form
14114E14130k6300P5780O5741j2398J1411j9512K6383J6943o2129l1327P2352
14103F31074n1940n2319j44773r9685P2116l1485n9629n638n4511Q582J62964
14092C74756J40988p4306j37435j07344j09038n080P2206K2621n735j9624l7097
14081A14912K4978J23219M0974l2206p5935p2872o2237l0672k3224K2238N7584
14070H6759O2923j8894l4720N9039j09334n5097m9245k210P1284R4157o6030m9291
14058a0659q742Q6238K0998m1553k1943L9115M5241q5061j03989o031P8338P3554
14046F5506J22020n1198r7959k6475p0790M0954O0290K2243M3388p3135m1314
14035f470L3419J01861J07652J3838j1542m8070o9882l485j06235L6524L9423
$$ plain form
14024 87033 99273 114009 61616 61050 8336 -23759 62818 93215 93856 58661 30367 -17999
14012 -17999 -47433 17186 66795 57502 8940 -74372 -124855 -109197 -30096 16329 -17514 -127151
14000 -127151 -189984 -176018 -143714 -93994 -26869 -58095 -26560 21522 15276 89693 64407 99232
13988 99232 83596 -28612 -7266 65117 22467 -23146 24048 116326 81202 52797 -7665
13977 -7665 16222 64216 -13692 -60526 -63689 16686 59046 20897 -60620 -58484 -39525 79312
13965 79312 143574 183638 145867 135567 88906 -119 76760 117693 139675 156589 126970 71578
13953 71578 -34340 -16840 15450 21151 50002 160925 263704 196166 120813 -32167 -171131
13942 -171131 -55208 67368 140789 112042 97802 114664 131827 149030 98947 36460 -13228
$$ packed form
14024H7033J2240J4736n2393n66n2714l2095Q6577L0397O41l5195k8294m8366
14012a7999k9434O4619M9609r293m8562q3312n0483J5658P9101M6425l3843j09637
14000a27151o2833J3966L2304M9720O7125l1226L1535M8082o246P4417k5286L4825
13988I9232j5636j12208K1346P2383m2650m5613M7194R2278l5124k8405o0462
13977g665K3887M7994p7908m6834l163Q0375M2360l8149q1517K136J8959J18837
13965G9312O4262M0064l7771j0300m6661q9025P6879M0933K1982J6914k9619n5392
13953G1578j05918J7500L2290N701K8851J10923J02779o7538p5353j52980j38964
13942a71131J15923J22576P3421k8747j4240J6862J7163J7203n0083o2487m9688
$$ plain form
13931 -13228 31270 56894 113716 168291 156038 141395 147007 98962 70932 167063 249788 484923
13919 484923 674144 744407 889910 1063884 997454 938651 964846 1039986 1143169 1152151 1055360
13908 1055360 903467 906897 953579 899752 769734 815259 758518 589742 507235 462342 313993
13897 313993 291497 406372 382283 269730 224140 125064 62021 101713 197268 145839 94619
13886 94619 150206 153262 74395 52602 62326 72765 154957 135256 174900 206475 147761 125160
13874 125160 229653 321526 345531 166484 174667 167485 157049 199479 250410 216371 187006
13863 187006 132622 119367 151168 68367 29853 43855 8407 33887 86182 182291 230485
13852 230485 166840 142993 187750 113387 168867 276745 234574 213805 254153 154400 145592
$$ packed form
13931a3228M4498K5624N6822N4575j2253j4643N612m8045k8030R6131Q2725K35135
13919D84923J89221P0263J45503J73974o6430n8803K6195P5140J03183Q982r6791
13908A055360j51893L430M6682n3827j30018M5525n6741j68776q2507m4893j48349
13897C13993k2496J14875k4089j12553m5590r9076o3043L9692R5555n1429n1220
13886I4619N5587L056p8867k1793R724J0439Q2192j9701L9644L1575n8714k2601
13874A25160J04493R1873K4005j79047Q183p182j0436M2430N0931l4039k9365
13863A87006n4384j3255L1801q2801l8514J4002l5448K5480N2295R6109M8194
13852B30485o3645k3847M4757p4363N5480J07878m2171k0769M0348r9753q808
$$ plain form
13841 145592 200560 281418 320852 380897 444735 417486 400833 440512 447816 334267 301085
13830 301085 315300 175187 100361 152018 79683 106773 148732 172856 144148 207398 305314
13819 305314 279843 144271 138202 313292 343870 301119 302681 246839 340213 385231 364135
13808 364135 395802 449064 469227 375841 382896 398844 468837 533972 506656 586719 619967 611643
13796 611643 708921 738251 817959 863418 951013 1015721 1004333 1075307 1105837 1139597 1125018
13785 1125018 1208297 1184230 1188530 1190127 1186353 1246295 1420867 1535646 1662984 1848248 2142289
13774 2142289 2220829 2137855 2165558 2405665 2577831 2825028 3035675 3269861 3619365 3939496
13764 3939496 4199130 4446129 4827381 5109668 5429084 5776403 6174307 6657086 7155553
$$ packed form
13841A45592N4968Q0858L9434O0045O3838k7249j6653L9679P304j13549l3182
13830C01085J4215j40113p4826N1657p2335K7090M1959K4124k8708O3250R7916
13819C05314k5471j35572o069J75090L0578m2751J562n5842R3374M5018k1096
13808C64135L1667N3262K0163r3386P055J5948O9993O5135k7316Q0063L3248q324
13796F11643R7278K9330P9708M5459Q7595O4708j1388P0974L0530L3760j4579
13785A125018Q3279k4067M300J597l774N9942J74572J14779J27338J85264K94041
13774B142289P8540q2974K7703K40107J72166K47197K10647K34186L49504L20131
13764C939496K59634K46999L81252K82287L19416L47319L97904M82779M98467
$$ plain form
13755 7155553 7538516 7866917 8247818 8616660 8884500 9072594 9146001 9302452 9484139 9611246
13745 9611246 9652116 9762709 9732932 9765844 9940973 10041207 10178918 10325301 10401967 10628160
13735 10628160 10976255 11328195 11779280 12245089 12805828 13539500 14428571 15200005 16093515
13726 16093515 17163520 18178207 19353805 20584376 21846281 23215599 24553514 25801176
13718 25801176 26953646 28084529 29021749 29862843 30601118 31092398 31247965 31189823 30970593
13709 30970593 30651887 30171804 29709438 29207988 28575897 28019016 27498762 26985664 26467307
13700 26467307 26025906 25707719 25565289 25617925 25840625 26126398 26406490 26871040 27572117
13691 27572117 28383853 29373397 30617216 31918551 33278574 34867088 36514190 38205038
$$ packed form
13755G155553L82963L28401L80901L68842K67840J88094P3407J56451J81687J27107
13745I611246M0870J10593k9777L2912J75129J00234J37711J46383P6666K26193
13735A0628160L48095L51940M51085M65809N60739P33672Q89071P71434Q93510
13726A6093515J070005J014687J175598J230571J261905J369318J337915J247662
13718B5801176J152470J130883R37220Q41094P38275M91280J55567n8142k19230
13709C0970593l18706m80083m62366n01450o32091n56881n20254n13098n18357
13700B6467307m41401l18187j42430N2636K22700K85773K80092M64550P01077
13691B7572117Q11736R89544J243819J301335J360023J588514J647102J690848
$$ plain form
13683 38205038 39864842 41529432 43035374 44318818 45479963 46406417 47026075 47351952
13675 47351952 47290947 46902010 46317587 45442930 44431348 43176812 41794723 40353722 38930793
13666 38930793 37425482 36001722 34774339 33536838 32411109 31382405 30459334 29676085
13658 29676085 28968007 28438299 28172468 28039533 28026419 28084925 28365375 28740997 29278241 29795113
13648 29795113 30395297 31162919 31946789 32649037 33343171 33923875 34358168 34640473 34786178
13639 34786178 34624793 34353434 33901825 33149064 32319268 31232250 30175331 29035144 27741765
13630 27741765 26480322 25115238 23877220 22760057 21677535 20661425 19635139 18600430
13622 18600430 17616210 16829351 16214568 15623190 15005475 14397761 13956620 13583956 13301586
$$ packed form
13683C8205038J659804J664590J505942J283444J161145R26454O19658L25877
13675D7351952o1005l88937n84423q74657j011582j254536j382089j441001j422929
13666C8930793j505311j423760j227383j237501j125729j028704r23071p83249
13658B9676085p08078n29708k65831j32935j3114N8506K80450L75622N37244N16872
13648B9795113O00184P67622P83870P02248O94134N80704M34293K82305J45705
13639C4786178j61385k71359m51609p52761q29796j087018j056919j140187j293379
13630B7741765j261443j365084j238018j117163j082522j016110j026286j034709
13622A8600430r84220p86859o14783n91378o17715o07714m41141l72664k82370
$$ plain form
13613 13301586 13133593 12944799 12728828 12602882 12557051 12536568 12444619 12428932 12336298 12242826
13603 12242826 12175281 11867947 11439174 11137199 10832051 10503551 10087445 9619448 9219906
13594 9219906 8683993 8194088 7833603 7625198 7121384 6685838 6353494 6019347 5587594
13585 5587594 5163857 4830796 4588283 4416296 4163256 3941756 3649309 3491962 3437878 3352178
13575 3352178 3069113 2824125 2677759 2414791 2343154 2292472 2385053 2367745 2214060 2126908
13565 2126908 2085571 2196649 2174086 1980541 1884978 1931864 1902827 1959093 1983813 1977895 1886073
13554 1886073 1830016 1684474 1606852 1611974 1593628 1653675 1623272 1477094 1544632 1666809 1677346
13543 1677346 1804867 1869346 1790087 1711450 1712382 1715380 1772511 1723957 1809846 1847380 1966568
$$ packed form
13613A3301586j67993j88794k15971j25946m5831k0483r1949j5687r2634r3472
13603A2242826o7545l07334m28773l01975l05148l28500m16106m67997l99542
13594I219906n35913m89905l60485k08405n03814m35546l32344l34147m31753
13585E587594m23737l33061k42513j71987k53040k21500k92447j57347n4084q5700
13575C352178k83065k44988j46366k62968p1637n0682R2581j7308j53685q7152
13565B126908m1337J11078k2563j93545r5563M6886k9037N6266K4720n918r1822
13554A886073n6057j45542p7622N122j8346O0047l0403j46178O7538J22177J0537
13543A677346J27521O4479p9259p8637R32K998N7131m8554Q5889L7534J19188
$$ plain form
13532 1966568 2009797 2089023 2274404 2422363 2570473 2634625 2730459 2950853 3217249 3513181
13522 3513181 3801946 4047153 4393684 4961554 5576337 6284193 7228407 8405839 9719410
13513 9719410 11249627 13092478 15094444 17288124 20069450 23210340 27120767 32280368
13505 32280368 39305499 48607234 60888826 76440407 95235942 116682865 139963402
13498 139963402 163658402 185752531 204347851 217894473 225084548 225188635 218460485
13491 218460485 206080955 189288699 169958605 149827333 130549206 113195478 98351794
13484 98351794 86129254 76240170 68233544 61521004 55796040 50709763 45938248 41398956
13476 41398956 37158016 33156158 29343989 25886905 22895665 20288911 17926819 15740674
$$ packed form
13532A966568M3229P9226J85381J47959J48110O4152R5834K20394K66396K95932
13522C513181K88765K45207L46531N67870O14783P07856R44214J177432J313571
13513I719410J530217J842851K001966K193680K781326L140890L910427N159601
13505C2280368P025131R301735J2281592J5551581J8795535K1446923K3280537
13498A39963402K3695000K2094129J8595320J3546622P190075J04087o728150
13491B18460485j2379530j6792256j9330094k0131272j9278127j7353728j4843684
13484I8351794j2222540r889084q006626o712540n724964n086277m771515m539292
13476D1398956m240940m001858l812169l457084k991240k606754k362092k186145
$$ plain form
13468 15740674 13792688 12228598 10820090 9647913 8641041 7797947 6979655 6273895
13460 6273895 5608091 4971275 4408061 4013986 3689071 3394332 3173563 2902911 2642425
13451 2642425 2539764 2511305 2400619 2325194 2212707 2192255 1983468 1892312 1881121 1662011
13441 1662011 1538165 1452455 1346088 1325454 1261350 1063783 1007594 1013151 919326 975000 962884
13430 962884 848765 763227 709428 763160 756277 641334 601368 649969 642453 701728 731263
13419 731263 734415 616809 478511 424034 544903 760001 708089 576896 554350 587149 596917
13408 596917 521650 607826 755591 682080 519336 535754 551680 479359 445040 393668 340411
13397 340411 429060 382778 324629 460951 463725 450004 518400 467302 335334 333161 415737
$$ packed form
13468A5740674j947986j564090j408508j172177j006872q43094q18292p05760
13460F273895o65804o36816n63214l94075l24915k94739k20769k70652k60486
13451B642425j02661k8459j10686p5425j12487k0452k08787r1156j1191k19110
13441A662011j23846q5710j06367k0634o4104j97567n6189N557r3825N5674j2116
13430I62884j14119q5538n3799N3732o883j14943l9966M8601p516N9275K9535
13419G31263L152j17606j38298n4477J20869K15098n1912j31193k2546L2799R768
13408E96917p5267Q6176J47765p3511j62744J6418J5926p2321l4319n1372n3257
13397C40411Q8649m6282n8149J36322K774j3721O8396n1098j31968k173Q2576
$$ plain form
13386 415737 395004 328291 319643 385782 411007 379419 413615 420976 391977 386908 302510 432425
13374 432425 501465 499401 549932 598147 482297 401661 518585 576080 647531 567990 411848
13363 411848 436743 373771 368595 363817 367931 535720 538555 422611 363371 265353 233789 263533
13351 263533 318880 357170 363326 238979 189522 221791 312607 394161 399881 378542 250138
13340 250138 162636 78119 74244 169898 219709 136036 150054 157222 143277 142563 27946 151780
13328 151780 217522 155878 111779 129371 213485 225350 116509 20577 -92060 -38892 124833
13317 124833 238611 112412 108170 163335 132595 -23913 -778 -20682 -120852 -194889 -25162
13306 -25162 141365 222565 184712 121005 111657 104741 146373 133770 197212 157420 174064 153934
$$ packed form
13386D15737k0733o6713q648O6139K5225l1588L4196P361k8999n069q4398J29915
13374D32425O9040k064N0531M8215j15850q0636J16924N7495P1451p9541j56142
13363D11848K4895o2972n176m778M114J67789K835j15944n9240r8018l1564K9744
13351B63533N5347L8290O156j24347m9457L2269R0816Q1554N720k1339j28404
13340B50138q7502q4517l875R5654M9811q3673J4018P168j3945p14j14617J23834
13328A51780O5742o1644m4099J7592Q4114J1865j08841r5932j12637N3168J63725
13317A24833J13778j26199m242N5165l0740j56508K3135j9904j00170p4037J69727
13306b5162J66527Q1200l7853o3707r348o916M1632j2603O3442l9792J6644k0130
$$ plain form
13294 153934 134032 154987 122594 91933 117985 40217 42446 3013 -6244 198551 209641 203335
13282 203335 250745 298026 289284 236912 274866 260065 277836 245942 156879 176242 189073 113328
13270 113328 127906 176355 139916 153096 220394 233391 121884 53492 10254 6600 102094
13259 102094 136896 40699 9007 84184 238480 248430 35488 12557 20010 165438 196225
13248 196225 204050 200002 188058 223220 239310 248281 279770 210903 177160 220718 253220 233063
13236 233063 260113 325602 354895 361844 397588 313572 332990 331090 311824 217814 214669 229444
13224 229444 205578 241140 279648 195544 205419 205843 246676 228387 240941 269250 177745 100480
13212 100480 122323 176708 299539 341917 338801 301232 195792 179278 140450 164954 242795
$$ packed form
13294A53934j9902K0955l2393l0661K6052p7768K229l9433r257K04795J1090o306
13282B03335M7410M7281q742n2372L7954j4801J7771l1894q9063J9363J2831p5745
13270A13328J4578M8449l6439J3180O7298J2997j11507o8392m3238l654R5494
13259A02094L4802r6197l1692P5177J54296R950k12942k2931P453J45428L0787
13248A96225P825m048j1944L5162J6090Q971L1489o8867l3743M3558L2502k0157
13236B33063K7050O5489K9293O949L5744q4016J9418j900j9266r4010l145J4775
13224B29444k3866L5562L8508q4104R875M24M0833j8289J2554K8309r1505p7265
13212A00480K1843N4385J22831M2378l116l7569j05440j6514l8828K4504P7841
$$ plain form
13201 242795 229726 166983 115501 192710 337035 368326 413857 419529 358218 380369 347131
13190 347131 288148 366023 482141 583820 509524 472793 445231 408571 379154 371457 368322
13179 368322 352735 309208 359868 316938 273607 280753 349540 321954 263712 198999 218928 184258
13167 184258 96067 77767 64932 122901 82709 103682 133146 134533 26538 3077 129466
13156 129466 299345 458211 510512 395894 259788 201382 258149 328999 400120 432989 470771
13145 470771 415793 414769 320774 256902 304845 204283 189616 222637 233492 255172 251636 189967
13133 189967 216052 169033 66961 130968 155256 167680 209942 250811 230335 175134 136514
13122 136514 56085 43781 103099 188233 236490 226969 175635 137160 134086 61622 -65325 -39846
$$ packed form
13201B42795j3069o2743n1482P7209J44325L1291M5531N672o1311K2151l3238
13190C47131n8983P7875J16118J01679p4296l6731k7562l6660k9417p697l135
13179C68322j5587m3527N0660m2930m3331P146O8787k7586n8242o4713J9929l4670
13167A84258q8191j8300j2835N7969m0192K0973K9464J387j07995k3461J26389
13156A29466J69879J58866N2301j14618j36106n8406N6767P0850P1121L2869L7782
13145D70771n4978j024r3995o3872M7943j00562j4667L3021J0855K1680l536o1669
13133A89967K6085m7019j02072O4007K4288J2424M2262M0869k0476n5201l8620
13122A36514q0429j2304N9318Q5134M8257r521n1334l8475l074p2464j26947K5479
$$ plain form
13110 -39846 149415 240124 198539 174642 184726 147556 135197 49772 -2780 1687 -91796 -26104
13098 -26104 -24536 -108144 -30243 73399 102508 -3512 11307 -1873 46346 125342 52784
13087 52784 41743 105343 165719 166830 206107 233118 291956 391178 525047 573540 610745 719265
$$ packed form
13110c9846J89261R0709m1585k3897J0084l7170j2359q5425n2552M467r3483O5692
13098b6104J568q3608P7901J03642K9109j06020J4819j3180M8219P8996p2558
13087E2784j1041O3600O0376J111L9277K7011N8838R9222J33869M8493L7205J08520
$$ [...]
##END NTUPLES=NMR SPECTRUM
##END=
