##TITLE=Analysis number 313011
Compound Code km 10844
Project Code adrs
Chemist Name fudan
##JCAMPDX= 6.0         $$ Bruker NMR JCAMP-DX V2.0
##DATA TYPE= NMR SPECTRUM
##DATA CLASS= NTUPLES
##ORIGIN= Bruker BioSpin GmbH
##OWNER= NMR
$$ XWIN-NMR		Version 3.5
$$ Tue Aug 23 11:43:53 2005 GMT Daylight Time (UT+1h)  MAYBRIDGE\NMR@NMR_250MHZ
##.OBSERVE FREQUENCY= 250.131544655141
##.OBSERVE NUCLEUS= ^1H
##.ACQUISITION MODE= SIMULTANEOUS (DQD)
##.ACQUISITION SCHEME= undefined
##.AVERAGES= 16
##.DIGITISER RES= 18
##SPECTROMETER/DATA SYSTEM= dpx250
##.PULSE SEQUENCE= zg30
##.SOLVENT NAME= DMSO
##.SHIFT REFERENCE= (INTERNAL, DMSO, 0, 16.522)
##AUDIT TRAIL= $$ (NUMBER, WHEN, WHO, WHERE, WHAT)
$$ ##TITLE= Audit trail, XWIN-NMR		Version 3.5
$$ ##JCAMPDX= 5.01
$$ ##ORIGIN= Bruker BioSpin GmbH
$$ ##OWNER= NMR
$$ C:\u/data/dgb/nmr/ADRS/8360/pdata/1/auditp.txt
$$ ##AUDIT TRAIL=  $$ (NUMBER, WHEN, WHO, WHERE, WHAT)
(   1,<2005-08-23 11:43:17.63 +100>,<MAYBRIDGE\NMR>,<NMR_250MHZ>,
      <created by zg, POWCHK disabled, PULCHK disabled
       configuration hash MD5:
       62 19 C7 07 E1 42 D1 B7 37 6C 3D D0 77 39 F9 E6
       data hash MD5: 64K
       31 28 5C 61 2C E9 94 0E C3 E1 EB 3C 7A EA 7D C3>)
(   2,<2005-08-23 11:43:32.86 +100>,<MAYBRIDGE\NMR>,<NMR_250MHZ>,
      <Start of raw data processing
       ef LB = 0.3 FT_mod = 6 PKNL = 1 SI = 32K 
       data hash MD5: 32K
       C1 4B A3 88 91 A8 72 DC 76 C0 4C 4E 2F FC 5E 20>)
(   3,<2005-08-23 11:43:38.30 +100>,<MAYBRIDGE\NMR>,<NMR_250MHZ>,
      <apk 
       data hash MD5: 32K
       86 8F 5B 05 2F D6 88 AE 82 EF 69 B8 E7 8F A4 23>)
(   4,<2005-08-23 11:43:40.05 +100>,<MAYBRIDGE\NMR>,<NMR_250MHZ>,
      <abs ABSG = 5 
       data hash MD5: 32K
       CC 82 E1 96 35 98 81 E0 53 C1 10 B9 40 FD C7 5E>)
$$ ##END=
$$ 
$$ hash MD5
$$ 70 12 C6 F1 76 54 00 D5 56 3A CA 4F C6 B3 63 89
##$RELAX= 
##$RELAX= 
##$RELAX= 
##$RELAX= 
##$RELAX= 
##$RELAX= 
##$RELAX= 
$$ Bruker specific parameters
$$ --------------------------
##$DU= <C:\u>
##$EXPNO= 8360
##$NAME= <ADRS>
##$PROCNO= 1
##$TYPE= <nmr>
##$USER= <dgb>
##$AMP= (0..31)
100 100 100 100 100 100 100 100 100 100 100 100 100 100 100 100 100 100 
100 100 100 100 100 100 100 100 100 100 100 100 100 100 
##$AQSEQ= 0
##$AQ_mod= 3
##$AUNM= <au_zg>
##$AUTOPOS= <14 >
##$BF1= 250.13
##$BF2= 250.13
##$BF3= 250.13
##$BF4= 250.13
##$BF5= 500.13
##$BF6= 500.13
##$BF7= 500.13
##$BF8= 500.13
##$BYTORDA= 1
##$CFDGTYP= 0
##$CFRGTYP= 5
##$CHEMSTR= <none>
##$CNST= (0..31)
1 1 145 1 1 1 1 1 1 1 1 1 1 1 1 1 1 1 1 1 1 1 1 1 1 1 1 1 1 1 1 1 
##$CPDPRG= <>
##$CPDPRG1= <>
##$CPDPRG2= <>
##$CPDPRG3= <>
##$CPDPRG4= <mlev>
##$CPDPRG5= <mlev>
##$CPDPRG6= <mlev>
##$CPDPRG7= <mlev>
##$CPDPRG8= <mlev>
##$CPDPRGB= <>
##$CPDPRGT= <>
##$D= (0..31)
0 1 0 0 0 0 0 0 0 0.06 0 0 0 0 0 0 0.0002 0 0 0 0 0 0 0 0 0 0 0 0 0 0 
0 
##$DATE= 1124793795
##$DBL= (0..7)
120 120 120 120 120 120 120 120 
##$DBP= (0..7)
150 150 150 150 150 150 150 150 
##$DBP07= 0
##$DBPNAM0= <>
##$DBPNAM1= <>
##$DBPNAM2= <>
##$DBPNAM3= <>
$$ [...]
##$SUBNAM7= <"">
##$SUBNAM8= <"">
##$SUBNAM9= <"">
##$SW= 20.6930455092707
##$SWIBOX= (0..15)
0 0 3 0 0 0 0 0 0 0 0 0 0 0 0 0 
##$SW_h= 5175.983436853
##$TD= 65536
##$TD0= 1
##$TE= 295.16
##$TE2= 300
##$TE3= 300
##$TEG= 300
##$TL= (0..7)
0 120 120 120 120 120 120 120 
##$TP= (0..7)
150 150 150 150 150 150 150 150 
##$TP07= 0
##$TPNAME0= <>
##$TPNAME1= <>
##$TPNAME2= <>
##$TPNAME3= <>
##$TPNAME4= <>
##$TPNAME5= <>
##$TPNAME6= <>
##$TPNAME7= <>
##$TPOAL= (0..7)
0.5 0.5 0.5 0.5 0.5 0.5 0.5 0.5 
##$TPOFFS= (0..7)
0 0 0 0 0 0 0 0 
##$TUNHIN= 0
##$TUNHOUT= 0
##$TUNXOUT= 0
##$USERA1= <user>
##$USERA2= <user>
##$USERA3= <user>
##$USERA4= <user>
##$USERA5= <user>
##$V9= 5
##$VALIST= <valist>
##$VCLIST= <CCCCCCCCCCCCCCC>
##$VD= 0
##$VDLIST= <DDDDDDDDDDDDDDD>
##$VPLIST= <PPPPPPPPPPPPPPP>
##$VTLIST= <TTTTTTTTTTTTTTT>
##$WBST= 1024
##$WBSW= 4
##$XGAIN= (0..3)
0 0 0 0 
##$XL= 0
##$YL= 0
##$YMAX_a= 440567
##$YMIN_a= -498909
##$ZGOPTNS= <>
##$ZL1= 120
##$ZL2= 120
##$ZL3= 120
##$ZL4= 120
##$ABSF1= 16.522
##$ABSF2= -4.171173
##$ABSG= 5
##$ABSL= 3
##$ALPHA= 0
##$AQORDER= 0
##$ASSFAC= 0
##$ASSFACI= 0
##$ASSFACX= 0
##$ASSWID= 0
##$AUNMP= <proc_1d>
##$AZFE= 0.1
##$AZFW= 0.1
##$BCFW= 0
##$BC_mod= 0
##$BYTORDP= 0
##$COROFFS= 0
##$CY= 12.5
##$DATMOD= 1
##$DC= 0
##$DFILT= <>
##$DTYPP= 0
##$F1P= 14.0000005364418
##$F2P= -0.99999901652339
##$FCOR= 0.5
##$FTSIZE= 32768
##$FT_mod= 6
##$GAMMA= 0
##$GB= 0
##$INTBC= 1
##$INTSCL= 1
##$ISEN= 128
##$LB= 0.3
##$LEV0= 0
##$LPBIN= 0
##$MAXI= 10000
##$MC2= 0
##$MEAN= 0
##$ME_mod= 0
##$MI= 0
##$NCOEF= 0
##$NC_proc= -3
##$NLEV= 6
##$NOISF1= 0
##$NOISF2= 0
##$NSP= 0
##$NTH_PI= 0
##$NZP= 0
##$OFFSET= 16.522
##$PC= 1
##$PHC0= -89.07134
##$PHC1= 4.970924
##$PH_mod= 1
##$PKNL= yes
##$PPARMOD= 0
##$PSCAL= 4
##$PSIGN= 0
##$REVERSE= no
##$SF= 250.13
##$SI= 32768
##$SIGF1= 0
##$SIGF2= 0
##$SINO= 400
##$SIOLD= 32768
##$SREGLST= <1H.DMSO>
##$SSB= 0
##$STSI= 32768
##$STSR= 0
##$SW_p= 5175.98343685301
##$SYMM= 0
##$S_DEV= 0
##$TDeff= 65536
##$TDoff= 0
##$TI= <Analysis number 999999
Compound Code 99
Book Reference 9
Project Code 9>
##$TILT= no
##$TM1= 0
##$TM2= 0
##$TOPLEV= 0
##$USERP1= <user>
##$USERP2= <user>
##$USERP3= <user>
##$USERP4= <user>
##$USERP5= <user>
##$WDW= 1
##$XDIM= 32768
##$YMAX_p= 388810919
##$YMIN_p= -122227
$$ End of Bruker specific parameters
$$ ---------------------------------
##NTUPLES= NMR SPECTRUM
##VAR_NAME=  FREQUENCY,     SPECTRUM/REAL,   SPECTRUM/IMAG
##SYMBOL=    X,             R,               I
##VAR_TYPE=  INDEPENDENT,   DEPENDENT,       DEPENDENT
##VAR_FORM=  AFFN,          ASDF,            ASDF
##VAR_DIM=   32768,         32768,           32768
##UNITS=     HZ,            ARBITRARY UNITS, ARBITRARY UNITS
##FACTOR=    0.157963299565203, 1,           1
##FIRST=     4132.6476996994, 0,             0
##LAST=      -1043.33573715361, 0,           0
##MIN=       -1043.33573715361, -122227,     0
##MAX=       4132.6476996994, 388810919,     0
$$ Real data points
##PAGE= N=1
##DATA TABLE= (X++(R..R)), XYDATA
$$ [...]
22937 41112 9361 -19740 -12023 2616 18311 -855 -25368 -14644 -6897 7973 27921 27353
22925 27353 10522 -786 -26391 -50162 -35570 -15597 10080 -3150 3405 31422 30032 -13180
22913 -13180 -32615 -36008 -36948 -44956 -32270 -11538 22480 17750 -4908 1528 6331 -31187 -30103
22900 -30103 10499 26223 27885 25000 28790 16146 -9766 -17022 -24453 -21698 -3847 4727 24958
22887 24958 54378 46159 29990 13623 7621 30313 2111 875 -26360 -34231 -13492 6768
22875 6768 14123 18239 -6353 -48922 -28667 -33104 -29044 -12942 -16169 1055 4798 7962 5748
22862 5748 8271 -4330 -23096 -25776 -24606 -28813 -15552 14385 19377 28178 6372 -39973 -49686
22849 -49686 -72500 -72461 -28153 -27178 -33855 -31107 -7826 2348 -19325 -20025 -4652 -2659 18042 15485
22835 15485 15803 29802 13437 -9890 3356 -4893 -41743 -27634 -10167 1830 -8708 29063
22823 29063 36801 13596 -6578 -1263 31905 46788 46237 36539 53181 35218 16705 9315 44094
22810 44094 51409 31843 17209 -2148 -5404 -25898 -50623 -49027 -57336 -38373 -8494 20129
22798 20129 -17286 -8896 -6534 -8464 -3995 10821 8553 26425 -1749 -13549 2690 15257 -3999
22785 -3999 14464 26858 13374 -13117 -2545 16005 7932 -14794 -29748 -16310 -20827 -18426
22773 -18426 13250 -3679 -40254 -49682 -40737 -27323 -51793 -45130 -26366 3210 9547 7508 -14752
22760 -14752 -89 -7159 -36323 -63703 -39692 -33563 -56724 -32708 5537 36119 43844 56039
22748 56039 68256 75120 49486 42118 36448 42838 32694 9634 15634 27601 11954 -12774 -2605
22735 -2605 5991 -7511 819 4581 -16531 -216 -12449 -42127 -51706 -49956 -42517 -48273 -32452
22722 -32452 -31464 -19290 -8451 24648 54780 44357 821 -32703 -45727 -35171 6736 14781
22710 14781 -21754 -3712 42940 64364 37958 1841 -33887 -63121 -59158 -52130 -60661 -55091
22698 -55091 -32598 -12776 -18049 -31876 -4719 -2691 -7178 -4006 11060 5373 -3000 15793 17402
22685 17402 -15710 -27101 -12945 -4507 164 41561 46591 3150 -26870 -17575 -18552 -13593 -16688
22672 -16688 -14029 9631 6814 11358 16411 -4939 -28892 -19058 -10830 1811 16812 21547 24563
22659 24563 23000 30962 46173 55277 47210 35111 -5808 -18900 5110 4265 12618 6394 7685
22646 7685 7299 33049 18648 -4929 -17663 -28845 -31230 -34113 -23416 -19791 -23494 -36747 -16631
22633 -16631 -11958 -34099 -23420 -13064 -26365 -30572 -17626 -5564 -2702 15600 22485 -10938
22621 -10938 -27325 -13578 1989 450 28653 32012 -15850 -13807 -1462 10771 253 19816
22609 19816 24465 15568 -10188 -23973 -17030 9279 29222 18825 21602 22386 22962 -2153 3738
22596 3738 38582 43994 -6179 -15045 -19357 1493 9790 -23206 -40086 -29845 -25318 19119 47055
22583 47055 16012 10749 28618 26110 28093 35650 40655 6013 -17189 -17354 -13946 5088 4684 6928
22569 6928 -9241 7232 13801 -19428 -25919 -17605 -16898 -25086 -21928 -22620 -29325 -31465 -25053 -26315
22555 -26315 -19332 -6438 27193 24612 8787 -23435 -42435 -26586 795 23829 36319 55106
22543 55106 35301 -12965 -42344 -28215 2639 7584 -8632 -21175 -47130 -76513 -35899 10811
22531 10811 -3106 -32526 -6190 7528 -1521 -22004 -45272 -50090 -65022 -55593 -23716 7632
22519 7632 27926 29319 12691 6912 -20059 -45578 -47230 -59507 -40741 -31937 -27574 -26861 -26957 -31146
22505 -31146 -26723 -20821 -22431 4467 23262 3985 10980 17404 -2916 -12957 -27154 -39255 -38030
22492 -38030 -16269 -6641 -3200 -11413 -44381 -42480 -17375 -21313 -17184 -10507 9845 -8925 -41007
22479 -41007 -68594 -98429 -98499 -69212 -24335 854 -2047 -5677 -41490 -28997 24298 41212 15422
22466 15422 -6724 -3961 1901 -12589 -11153 -18798 -14152 29201 23692 -8252 -26346 -29832 -36186
22453 -36186 -46103 -26041 27496 58285 40956 27452 3535 564 -29563 -42591 -48284 -30800
22441 -30800 -19682 -34067 -61941 -62490 -57711 -31589 -27330 -13867 -18377 -22013 -34494 -43256 -32875
22428 -32875 -13845 -14324 2865 6909 -2453 -19535 -23587 -48040 -49418 -38667 -22095 -4324 -5080
22415 -5080 13387 23825 13215 -12109 -22394 -52137 -49705 -15462 23468 23190 -21218 -43178
22403 -43178 -37289 -18658 -2694 -20288 -20873 -20241 6886 29932 14952 24820 40493 4202 -899
22390 -899 7152 -31917 -39404 -55188 -47040 -26154 -21204 -46034 -37277 -19376 -27420 -53916 -38840
22377 -38840 -25746 -21910 -47538 -57824 -58300 -40604 -26241 -20313 5721 6797 -6869 -19670 -30109
22364 -30109 -30520 -17978 -42636 -49134 -26675 -25114 -31559 -25171 -16366 9917 36032 64261 26177
22351 26177 -15658 -25576 -25482 -2778 -13231 21564 23821 8737 -11512 -20359 27350 11248 22401
22338 22401 27924 992 -11398 10643 17521 -7593 -29990 -7200 16118 27259 25185 19663
22326 19663 -241 -2867 -2175 -17083 -11243 -1406 -6308 1052 -27057 -35507 -37779 -16999 -13616 -23659
22312 -23659 -16057 -515 20854 24588 29811 17497 1368 9457 12970 -21882 -27235 -17410 7184
22299 7184 39939 40337 25518 22480 49913 41170 42182 13543 23034 42824 29845 6627 -9725
22286 -9725 -12182 -17919 -25753 -25813 -18746 12999 15708 16616 28145 52214 51582 27521 -13108 -19750
22272 -19750 16316 13132 -26297 -8056 774 325 -7517 2053 18940 4687 -27462 -31819 4774
22259 4774 15783 -5999 -5030 -32768 -40964 -58055 -98744 -98719 -57249 -39864 -34582 -3440 20008
22246 20008 8626 -17406 -10241 11763 -14126 -11852 -28814 -29113 -28207 -10766 21301 -1158 -6179
22233 -6179 5565 18831 11420 5822 9920 -9959 -24775 -42549 -50741 -25071 -15580 12079 11758
22220 11758 3434 -17368 -34455 -40194 -4385 8120 6806 664 8629 -9868 -27584 -36240 -42255
22207 -42255 -37528 -35014 -33519 -43771 -29245 -44482 -46407 -46844 -46083 -30159 -18059 145 21955
22194 21955 25359 6767 -27188 -64692 -51160 -26691 -25197 -16023 -9406 -24157 -15874 -1019 -11064
22181 -11064 -5324 -983 -4036 1690 15486 24347 15953 -26000 -51633 -25962 -14717 -11784 -34462
22168 -34462 -4320 -9548 -22408 -3491 3409 41206 27960 12219 14558 9443 -7823 -120 23847
22155 23847 20249 -790 -30929 -7297 24358 4576 -5156 -1784 5983 32399 37932 13182 8979
22142 8979 20293 -14899 -37661 301 -8902 -2368 -12377 -13058 21139 34800 44735 28448 -17113
22129 -17113 -35297 -45044 -17613 14785 -9977 -13072 -14055 -13504 -21765 -13936 -295 5755 22706
22116 22706 -14601 -50799 -30193 -24264 -56787 -45522 -38912 -57685 -66863 -52979 -9544 34125
22104 34125 12694 44 5542 9053 4621 9544 12416 -6816 -13198 -22603 7885 21410 14612
22091 14612 27043 16150 25285 38290 39492 5374 -8454 -54874 -60683 -35612 -21624 -24388
22079 -24388 -27694 12473 32355 19604 15647 5993 -42369 -61634 -73103 -74062 -73617 -54697 -49870
22066 -49870 -33918 -30387 -23298 -14507 -14090 -27339 -25586 -10296 -2068 -12865 -6849 12207 15106
22053 15106 5334 11990 17757 27278 6006 -10052 294 10092 -4337 2730 18605 -13661 -23285
22040 -23285 -9225 11910 -4683 -12646 -22461 -42504 -52465 -26509 14426 15213 9256 17651 -11445
22027 -11445 -33540 -14899 -20354 -29952 -41801 -30310 7832 57799 57154 8593 -16175 -7461 -6240
22014 -6240 -19516 -13876 7836 -6894 -30462 -35941 -25991 -4744 8918 -5015 -7613 -36332 -69526
22001 -69526 -60092 -75192 -56039 -39228 -4216 2332 4402 -1513 -28 -10926 -41871 -45895 -5277
21988 -5277 1754 -5167 -20726 -12899 -3251 11888 6311 -25907 -36889 -50604 -54914 -35326 -15370
21975 -15370 2434 -19650 -7877 3440 8966 -5617 3788 9440 2753 13331 6818 -13690 -2929
21962 -2929 7514 -18257 -33567 6584 25832 38747 37580 24361 3839 -19957 -25785 -7862
21950 -7862 7498 -1689 -8677 -1104 -11140 -15706 -34470 -9812 3445 -11475 -13093 3092 9981
21937 9981 15231 11756 -17109 -6170 -3346 13134 16689 28361 30971 36403 50608 41567 34283
21924 34283 11613 8830 -17292 -23809 -43049 -38861 -11824 20080 49919 43246 21695 -2716
21912 -2716 -8690 21633 53989 57754 6128 -3397 1144 970 -4665 5066 11485 19690 9165 -12206
21898 -12206 -37992 -35910 -30955 -9241 -11343 -8017 -1409 -6756 -10087 -4733 -1900 8213 1428 2121
21884 2121 22770 39159 37127 3806 -16424 -26350 -7910 -12344 -7601 -21077 -27552 -23864 4628
21871 4628 -753 4081 -5147 -11119 12675 24225 38560 33149 2023 -25189 -26653 -14769 12979
21858 12979 39330 15518 13734 -540 8680 24780 22888 32664 63477 83827 59088 56011 43749
21845 43749 19863 21029 16647 9427 10942 639 -439 5348 12643 3260 -16461 -7304 -22896
21832 -22896 -52423 -33795 -15182 -8183 -18738 -21332 -23475 -25963 -24375 -43437 -51789 -47035 -37876
21819 -37876 -30665 -39488 -63760 -58056 -22358 -27796 -20897 25248 12035 10355 17019 -11686 -26378
21806 -26378 -13770 6175 14712 25016 24597 23745 35622 24887 1166 -58977 -90478 -77879 -50444
21793 -50444 -50555 -65435 -27274 14784 8774 -48140 -85220 -66432 -59456 -54800 -40937 -36584 -54420
21780 -54420 -35946 -24049 -12128 -19536 21297 8367 -2694 20098 28478 20270 38726 17220
21768 17220 -14686 -39952 -59314 -60020 -43957 -16382 20394 20698 -1756 -21800 -19202 -24652 -12810
21755 -12810 -20408 -40642 -25952 -12640 -6771 -6462 -10085 -8969 -6560 7859 4844 -17908 -26900
21742 -26900 -40528 -45413 -17869 -2067 -41272 -42785 -7622 25454 33058 20418 -23210 -18669
21730 -18669 -13123 -28974 -30017 313 -21980 -56571 -66697 -59479 -65922 -58024 -44573 -21252 -45034
21717 -45034 -73501 -63122 -50576 -21031 8235 21651 21484 -8439 -4129 -1962 -3157 -5910 -2855
21704 -2855 3981 6462 36516 36495 31969 29325 10757 13857 32053 25242 59303 78278 57294 59154
21690 59154 48756 24549 30675 24259 22469 33667 29493 10108 -9511 -20549 -35291 -46904
21678 -46904 -30371 3102 4354 -22389 -22064 551 -1109 -15020 -25065 -12551 -13550 9273 6347
21665 6347 -1626 -24179 -41380 -16049 -11230 -10468 5922 8689 9910 -13591 -16094 -20606 -22256 -12429
21651 -12429 1033 -6214 -35489 -26478 -29355 -20162 -43172 -31668 -4014 18483 12993 -10175 -24176
21638 -24176 2684 9893 15315 17552 25210 40510 13287 -5961 1014 36776 58282 52286 59624
21625 59624 60451 34774 14284 3598 -9269 -42385 -44928 -17117 -6213 6371 20717 19393
21613 19393 -1756 -8225 -664 -23748 -28893 -3535 8157 -10196 -3645 10085 -15547 -23482 -12714
21600 -12714 -33179 -29213 -14800 -2742 23224 31550 17640 -701 -8639 -20823 10937 -4015
21588 -4015 -14585 -27039 -49500 -50876 -51735 -46176 -48797 -48537 -4853 14946 24714 13124 6296 22320
21574 22320 6824 -2685 1462 13014 35886 42240 19155 11952 41721 48465 56019 45787 2320
21561 2320 -36456 -47733 -33619 -21239 -17231 -14988 -17304 -14038 -16746 -17880 12205 -15979 -21843
21548 -21843 -37671 -46410 -28759 -13753 -38233 -24707 -32709 -35833 -52525 -52304 -31333 -11704 12406
21535 12406 9068 84 -30713 -51443 -42075 -33678 -35721 -32538 -27745 -39631 -42672 -50801 -30435
21522 -30435 -18327 -16608 -11571 -10257 -739 982 -1343 9729 15930 -15125 -62433 -77228 -73310
21509 -73310 -64354 -43098 -9010 11746 11830 -4345 2790 26924 29746 26633 27571 614 -35136
21496 -35136 -57069 -21611 -20238 -1026 -8205 -5815 9287 -13375 -15678 -4788 -9975 -20077 -43654
21483 -43654 -61001 -51693 -33847 -13289 19108 34881 13511 -11551 -28560 -34828 -31997 -17306
21471 -17306 -4547 -2062 -15173 -12358 20719 28600 3365 -16819 -15073 -16837 -34805 -17171 7508
21458 7508 1656 4092 21996 28244 49482 13689 4359 14378 -15383 -47216 -44780 -37456 -25115
21445 -25115 -27182 -29507 -25120 -9833 -35185 -35501 -11757 -49745 -67931 -36949 -5406 -21191 -24453
21432 -24453 -14108 -55730 -58848 -972 10189 -6526 -24527 -44662 -62855 -24956 -28402 -41977
21420 -41977 -11632 24405 10798 12449 27039 18654 11377 -11322 -292 10483 11426 -14032 -38311
21407 -38311 -44722 -32543 9662 -5298 -23933 3665 17103 16349 27306 41480 46630 32653
21395 32653 12567 -15296 -8764 11650 11677 22138 15532 3553 -5794 -24801 -27595 -29453 -10568
21382 -10568 21474 25826 21825 14744 11423 -3804 -25793 -14181 24630 20387 1529 -32346 -41742
21369 -41742 -36031 -35405 -49276 -35847 -13845 22872 34581 25111 1083 4191 9971 20357 1367
21356 1367 -30461 -35777 -17979 26612 47225 47905 23850 -5343 -6442 5068 2042 -27037 -36093
21343 -36093 -33656 -18979 -4788 -222 10556 46490 68863 48329 16768 -824 -8346 3195
21331 3195 10347 10522 -17376 -22075 -8822 5662 -817 12836 1927 -26595 -40341 -50821 -55941
21318 -55941 -51662 -36308 -37700 -38306 -22412 -7023 6298 12604 -6081 -36958 -38990 -24437 4109
21305 4109 -6105 -20818 -42427 -47811 -2533 13628 -5634 -40427 -49424 -28893 -4080 25108
21293 25108 11385 21489 37579 58060 32021 -4674 -705 -23647 -26661 -8680 -2545 -10422
21281 -10422 -1482 25137 28959 22399 21475 -14174 -26913 -28550 -23724 -23360 -25002 -40563 -27907 -3195
21267 -3195 -18356 -49737 -45105 -12739 25755 24188 20040 16401 10315 2741 4361 20889 5277
21254 5277 -9844 -13105 5353 20968 -260 -9112 -317 2567 -13541 -4048 8472 2212 -10381
21241 -10381 -659 -11332 -31050 -36822 -47887 -27825 -21201 -26576 -35826 -12385 -12105 -12663 -9179 -10648
21227 -10648 -47 -19621 -38615 -34266 -47396 -29468 5377 -9812 -16755 -11086 -5836 -16908
21215 -16908 -22516 4012 13461 5133 -18372 -18853 -2863 -7571 838 -14103 -32540 -43899 -48798
21202 -48798 -59951 -60503 -28083 -2919 -4686 -5568 11385 5840 10779 -23875 -14985 -224 3391
21189 3391 5781 1653 6200 -26435 -39298 -46586 -40223 -34254 -23840 -23777 835 21429 13266 -17475
21175 -17475 -15236 -14812 -34120 -49064 -36191 -33776 -27939 -28787 15338 9361 15222 4074 -11218
21162 -11218 13224 13474 12825 14872 7343 -43442 -49639 -34233 -14336 6874 -21211 -45587 -25073
21149 -25073 -14117 2913 -2226 -16148 -4986 18735 24566 32508 22623 4673 11595 38752 -1103
21136 -1103 -29649 -42867 -25337 -6802 -5396 2676 27014 -2466 945 -927 -21517 -18933 -29100
21123 -29100 -22239 8861 31376 19447 12469 9028 13521 -6098 -18457 25794 28343 9091 -14881
21110 -14881 -14617 -14987 -38563 -35767 -17355 -25519 -28814 -23476 -14834 -22585 -21104 -27399 -30299 -14966
21096 -14966 -5228 30268 39615 -7542 -21172 621 -3129 -6770 -5210 -45095 -41188 -35169 -14014
21083 -14014 1585 18763 34628 15335 36968 43657 40960 46009 46619 19860 -16448 -47012 -57335
21070 -57335 -26178 -14680 22936 23319 -6097 -18321 -12392 -40410 -44507 -45913 -65769 -61644 -43149
21057 -43149 -32289 -14189 -1615 -1815 2791 -5008 3043 16488 -8568 -11921 -9407 -9967 -25124
21044 -25124 -29520 -25830 -32686 -26667 -27317 -9201 13873 44167 45665 46194 21222 27217 -10224 -18849
21030 -18849 -25274 -57371 -47228 -26999 -23677 -58009 -54935 -32317 -47451 -50290 -32731 -10777
21018 -10777 5132 -9464 7886 6381 7842 11337 2778 -7276 -22181 7202 27825 23939 25951
21005 25951 10465 13369 21279 8242 -29598 -28460 -32162 -41233 -40445 -26516 -16536 -36830 -39145
20992 -39145 -32397 -23876 -23657 -40755 -39519 -8735 -9256 12367 7399 5509 4934 4999 12626 16827 -13561
20977 -13561 -23370 -10206 34 -821 -4084 24493 36340 32853 37545 19473 5218 12892 5803
20964 5803 13093 -23732 -18585 38831 40876 35039 22488 21600 13482 -14225 -21139 -17301 92 4707
20950 4707 2344 20519 -17926 -38891 -34908 -34171 -36232 -26248 -24578 -14100 -9715 15546 8927 -25465
20936 -25465 -28092 -10598 -251 158 -12511 -10702 -8110 -10773 -5184 -18058 -5035 -8728 -26322
20923 -26322 -29095 -29951 -26844 -34931 -55697 -50083 -38087 -22032 -20610 -45421 -55146 -53770 -43102
20910 -43102 -46661 -30363 -28907 -42290 -36755 -53005 -21638 9964 3225 -15933 -35936 -52310
20898 -52310 -65499 -43426 -24150 59 18927 -806 -25011 -15353 2813 -4906 -11534 -2121
20886 -2121 26291 30333 29274 27258 22556 15614 -18765 -35891 -16010 -10204 -34820 -39465 -39694 -60484
20872 -60484 -48537 -33979 -38831 -43197 -42578 -33467 -58135 -61998 -53546 -30986 -13873 -23610 -17445
20859 -17445 -21848 -19837 -23333 29925 46305 33314 14351 -10774 -6463 7633 53612 60266 39230
20846 39230 12356 -9299 -20008 -43196 -28752 -14032 -36201 -39813 -19729 -29637 -46418 -41301
20834 -41301 -34342 -8713 -17326 -18588 -28436 -36573 -29406 -31962 -68366 -101795 -87728 -75750 -44114
20821 -44114 -32952 -36545 -45146 -32619 -45193 -52278 -49934 -23974 -11976 -30860 -49396 -36372
20809 -36372 -31176 -18920 -30200 -44933 -50462 -26095 -318 -309 -4058 -13198 -29875 -20442 -9248
20796 -9248 -440 6235 -8437 -22284 3075 29226 25182 -4233 -31885 -44190 -19870 3758
20784 3758 -9104 -12039 -26665 -36470 -74574 -57604 -40301 -40355 -50930 -45259 -55275 -52568 -42598
20771 -42598 -42823 -23041 -11089 -24377 -31069 -50190 -56684 -58145 -36090 -21886 -35314 -48559 -39857
20758 -39857 -20808 7176 13923 6329 -29617 -46527 -42556 -21482 -6856 -13930 -22384 -51945 -53415
20745 -53415 -46942 -37411 -25444 -43859 -40011 -33015 -32930 -23991 -15930 -9047 -26252 -24357 -26648 -4431
20731 -4431 -24126 -19011 -43640 -37082 -10269 -3584 1765 8449 8241 12348 10559 -589 -21976 -22555
20717 -22555 1454 9542 4548 -20186 -41323 -50761 -43011 -62242 -87914 -59299 -34422 -25347 -10914
20704 -10914 -15445 260 -1303 -7225 3608 -8569 -15910 -25964 -60644 -76390 -65664 -53101
20692 -53101 -51505 -43551 -32536 -32574 -32053 -29934 -42657 -30330 -34184 -78779 -92898 -55723 -22220
20679 -22220 -20161 -5125 -8539 -7473 -795 -12286 -31870 -37491 -56175 -50571 -49523 -31404 -32619
20666 -32619 -47220 -42461 -32513 -41547 -17388 12430 39881 28014 39687 31833 2010 -37479
20654 -37479 -23421 -23002 -34092 -20907 -15949 -8868 -777 7232 -17373 -27082 -12566 -13596 -8307
20641 -8307 -18489 -21428 -17693 -22554 -8991 22950 24821 6584 -13953 -8496 -24282 -56877 -75211
20628 -75211 -75536 -71948 -79453 -51560 -11339 4995 19807 22396 19158 8049 15830 6189 1587
20615 1587 -6227 -15491 -43467 -26632 -7370 6962 17657 24934 16803 4245 25119 24553 18564
20602 18564 -9560 -19066 -9718 -9150 10054 6199 -23839 -67722 -81087 -58641 -28993 -7352 17306
20589 17306 18294 33405 31033 18917 -4006 12488 7039 23916 41653 48691 26732 5123 -16020
20576 -16020 -14061 2142 1133 -10190 -17923 -3221 -18616 -26646 -27525 -19802 -4230 11705 17054
20563 17054 36898 45199 37393 18398 17908 17151 24711 30598 20038 35863 44577 15067 -14450
20550 -14450 -23589 -47335 -54375 -17482 -26544 -58920 -26568 13496 21101 18284 32061 10203 2377
20537 2377 -6025 -36698 -40674 -39170 -6153 -1677 -39890 -5898 24508 23394 11438 32418 39745
20524 39745 13417 1954 -1948 -32382 -35107 -511 -16421 -10849 4470 -15178 -28099 -30733
20512 -30733 -35802 -24776 8936 6409 6680 -1884 -16436 -17851 -21525 -13430 -5948 -5064 -22903 -38098
20498 -38098 -18715 8132 -9819 -34844 -8749 10050 -10182 16189 12362 7960 30963 34760
20486 34760 37932 20514 12501 -10241 -14496 -28622 -26539 7612 11932 -15485 -32071 -49657 -54414
20473 -54414 -27874 4217 12247 42045 13775 -1223 27088 51764 22623 2718 -7269 9186
20461 9186 22701 31331 30680 601 288 15296 12701 -6437 4004 20969 29595 8132 20272
20448 20272 21426 6427 9691 18523 3498 -23962 4645 28761 48075 48042 26517 16715 22692
20435 22692 4686 19323 47219 41512 42981 8886 16765 47678 24305 3528 -25447 -10553
20423 -10553 17157 17285 -7090 -14728 -12907 -8182 12586 3389 -419 -4167 9841 -11140 -28860
20410 -28860 -27003 -16656 -31385 -19374 -27662 -22741 4061 255 -42742 -61927 -55591 -26889 -17224
20397 -17224 -16384 -22109 -22197 -18662 -19298 3239 15550 -16497 -38637 -47891 -42104 -13633 -26876 -15893
20383 -15893 -21843 -50933 -60145 -40893 -48752 -34777 -24862 -39127 -37739 -30433 -12875 -8152 -23798
20370 -23798 431 8542 6279 8272 -4527 -321 25134 53082 29368 -15676 -55568 -77148
20358 -77148 -72650 -78443 -98067 -73847 -39910 -8840 8797 -7226 -16270 -24181 -44320 -28612
20346 -28612 -37229 -65658 -60692 -40900 -36391 -58964 -76408 -60330 -27824 -17516 -21358 -15978 4289
20333 4289 39842 53454 46995 19454 -10475 1895 11847 4814 5098 15716 19294 15228 11523
20320 11523 37967 39936 14769 15500 9577 -19930 -10834 -6267 -7561 -7398 -42822 -99994 -82595
20307 -82595 -52425 -43014 -13930 8934 3541 14464 15313 6242 1308 9644 9512 -2540 -25380
20294 -25380 -24620 -20927 -31411 17473 34223 27374 17508 -2907 -4791 -11248 -13277 -34456 -44277
20281 -44277 -32853 -14176 -10841 1072 -17468 -38322 -42869 -19445 8924 12068 22042 -822
20269 -822 -15561 -4901 14420 -2359 -6573 -27060 -27398 -8678 19314 59095 56997 36450 18344
20256 18344 10597 13395 -18402 -36589 -24968 -12769 -53704 -48188 -39135 -66756 -34063 -18582
20244 -18582 -18425 -48061 -26648 -10121 1106 4633 11018 -7390 -16015 -36430 -45140 -11126 22524
20231 22524 11298 -8021 -10395 -17024 -31018 -56662 -61916 -59737 -32072 -44778 -32574 -40323 -48627
20218 -48627 -53747 -59608 -18551 20398 39582 17493 639 22779 32135 15855 -9467 2031
20206 2031 -6830 -32842 -15983 -1417 -1552 7792 20149 13076 14580 8543 9965 12578 10579 50548
20192 50548 47573 27989 39071 2213 -27518 -31840 -25205 -16736 -3830 5615 -9767 -30866 -27360
20179 -27360 -12564 -9408 -18518 -16054 8448 -1467 -16275 -16427 -13344 -24333 -3450 -10383 -9491 -66
20165 -66 16090 11278 13660 24169 30156 17563 -7405 -38773 -49716 -21086 -2749 32255 46970
20152 46970 26751 -14015 5828 -3624 -55101 -48652 -28453 -20102 -19142 -18929 -19075 -24367 -8497 -3992
20138 -3992 -6464 -16615 -39536 -27678 18344 47471 47608 33050 -2846 -23413 -26585 9351 34025
20125 34025 10898 15983 -3278 -11854 -20192 -15608 -5937 -5034 6327 -13904 -13993 -27224 -33994 -54304
20111 -54304 -28629 -29972 -42776 -38280 -13662 -11491 -31517 -37747 -19102 27 10761 8503 12035
20098 12035 16790 36629 42102 53744 48193 24108 18803 35648 35029 24848 -4647 -1605 4572
20085 4572 5523 -24454 -24537 -8240 12394 25880 36085 10811 -2394 -10000 -14316 -29061 -26434
20072 -26434 -14635 -25813 -31349 -18801 -6337 -3093 -5528 -25170 -16845 1091 11398 15045 22314
20059 22314 24404 32634 30867 28598 -4394 -20532 -10234 -15830 1228 2745 16972 -22404 -27846
20046 -27846 -38992 -44779 -36192 -33235 -42634 -48133 -12255 5314 1909 27404 36026 19399 -87
20033 -87 -16750 -16392 -22005 -23063 -2657 -8301 -20371 -29413 -52054 -59189 -40908 -26005 -32443 -41053
20019 -41053 -46371 -28921 -20672 4211 17454 14193 9885 9484 -21428 -28103 4947 24149 9231
20006 9231 -5677 -32260 -38094 -42565 -46797 -48474 -40717 -48113 -86768 -66068 -34175 -46577 -48390
19993 -48390 -47742 -50886 -32178 -21283 -23064 -3801 -19491 -34164 -19794 4915 -4453 -14816 -3484
19980 -3484 -4989 3760 -5114 -13334 -19871 -10166 6504 450 5792 1927 8486 6200 4279 -233
19966 -233 6103 31777 24077 1527 -7692 -22898 -18090 -4061 -6971 -18948 -14613 -32072 -35242
19953 -35242 -52173 -34989 -21499 -2061 -5003 -38339 -38823 -65482 -77381 -56909 -37091 -29335
19941 -29335 -29139 -9430 10510 6506 -13216 -11272 -13500 -25392 -21074 -55977 -62328 -45574 -26915
19928 -26915 -15500 -40152 -41442 -19679 -17455 -18261 -16093 -24204 -2134 15946 39849 7360 -16338
19915 -16338 -34502 -11590 -4359 -6181 2588 15145 17335 11625 -7732 -14087 -7601 12574 10874
19902 10874 9123 -8112 -29955 -16107 -2409 -10906 -23254 -5873 -8118 -14204 1506 8611 -10623
19889 -10623 -27095 -19931 -10880 -9483 -15612 -11084 6264 14745 -4782 -30777 -24326 -38003 -60289
19876 -60289 -51297 -34754 -52665 -61737 -54190 -34253 -18747 -47674 -41870 -49848 -24799 -23700 -31289
19863 -31289 -21815 -23213 -18869 -23184 -24446 -21202 -25577 -18877 -44582 -37705 -28680 -20553 -6738 -8860
19849 -8860 -21513 -8923 14680 10131 9230 18882 17054 10819 11065 19731 23972 27894 1061 -10374
19835 -10374 -18356 -44680 -32267 -21383 -14850 -1329 21792 31661 28041 28126 58387 51428 32722
19822 32722 31219 22675 7387 -28922 -34763 -16417 -17478 -27908 -34280 -32609 -18393 -28684 -47001
19809 -47001 -57579 -37439 -12897 -19500 -30068 -27434 -25328 18066 22996 -9242 -22094 1719
19797 1719 479 7134 2160 4324 7840 3495 30362 40050 26414 5565 -2152 -23024 -43727
19784 -43727 -68576 -83515 -61592 -10558 11466 7969 4786 -6974 17018 36007 16654 -4206
19772 -4206 19529 38893 33934 841 3463 26051 24091 -8760 -9184 11270 42660 35541 -2453
19759 -2453 -19796 -23465 -40026 -67095 -50739 5482 12366 24728 14130 9405 7130 -4147 -16437
19746 -16437 -20726 -26487 -43922 -10394 31578 24118 11641 -7813 -8823 7880 10345 15830 5550
19733 5550 -11940 6128 -6184 -18483 -7430 11009 33072 -7126 -8298 -11686 4045 5661
19721 5661 6187 -4995 6422 10204 4241 12151 1339 -9550 17934 -8922 -21079 -22760 -9076
19708 -9076 -6492 -15812 9105 20092 18436 49698 47471 28774 29003 31006 50846 49187 14476
19695 14476 11420 29654 66062 75520 59139 47851 40184 49649 22345 -6899 -31974 10832
19683 10832 33753 22419 14416 4514 43138 40300 15005 -24638 -10914 23531 40192 46128
19671 46128 45291 23861 33707 15983 -15414 -20777 -486 20587 1056 -15543 -715 -10911
19659 -10911 -31827 -40331 -18152 -17439 -22506 -2475 -2763 -11239 -665 -19862 -23723 -683 13393
19646 13393 -4098 4087 -8830 -37417 -43971 -17194 -22240 -8434 -18991 -33490 -9062 18835
19634 18835 46850 36223 8236 -22068 -45976 -38117 -29792 -40363 -47079 -50436 -48244 -7189 3388
19621 3388 -19857 -11875 -23210 -15846 -17400 2272 31377 21215 -1261 -1845 -18069 -17612 -8987
19608 -8987 -48404 -66563 -67070 -48249 -29695 -52307 -27566 9385 11908 5163 18279 8956 2815
19595 2815 3349 -3804 17086 38304 28794 3876 3393 13580 -15570 -40865 -13496 9179 -1610
19582 -1610 3680 18839 22525 37985 2528 2195 19008 43238 55804 53854 85281 90898 99564
19569 99564 107738 121222 150340 195113 203265 212145 280221 301283 304156 327996 348130 365458
19557 365458 376853 392301 364300 319866 259085 230427 209197 181395 159054 134422 118419
19546 118419 105828 79034 61408 55281 31544 32652 50523 27459 7349 -2298 13841 21858
19534 21858 18675 54899 62991 28696 21967 9892 3046 1406 9346 13902 3882 -12944 643
19521 643 10763 13330 6643 -758 7147 -910 -19298 -2613 13721 31620 40675 46131 14415
19508 14415 -38226 -40229 -10897 7369 9942 -2172 2273 6143 -3626 -19908 -27796 -19482 -21835
19495 -21835 -11281 -7469 9270 5868 -5973 4081 3112 -11191 -2140 -10003 429 -10645 -20484
19482 -20484 8557 8200 13141 12108 -2314 -8439 -8478 11253 23098 24940 -965 -5003 -955 13392
19468 13392 5761 -1544 -11662 13793 44031 30802 49152 49268 25405 14671 15219 14995 -7604
19455 -7604 -39768 -35071 -4482 -13910 3673 15839 24013 40415 44026 42500 19917 24949 36935
19442 36935 20357 12660 5579 7125 12488 20915 26090 5747 -2715 -674 -31976 -51865 -46538
19429 -46538 -32915 -8429 23763 11073 -4699 -25745 -10527 3116 -2196 -32803 -32614 597
19417 597 56675 71759 37271 25946 10815 -2625 -19072 -24462 -22935 11322 -10501 -36603
19405 -36603 -26906 -32960 -34251 -41801 -33802 217 -7577 -10260 -17745 -23944 -35791 -28661 -43163 -17181
19391 -17181 18920 21071 -17941 -28440 -15327 -14373 -35043 -35264 -35815 -41303 -17328 12130 27834
19378 27834 2254 -21570 -26020 -6278 5711 8360 24263 15295 7180 -12784 -18074 10751 7939
19365 7939 11690 11712 13370 4329 -3490 -5709 -31207 -35700 -48084 -68144 -54220 -25822 -14917 -13048
19351 -13048 -9927 -24345 -34600 -36787 -19395 -6438 -1486 -134 36415 10938 -14914 -23104 25677
19338 25677 40773 34602 20394 16741 26206 31335 20510 20354 26438 37176 49538 36194 17986
19325 17986 -17591 -42398 -9168 -8985 4272 6188 6858 33487 46341 20632 38333 54085 37886
19312 37886 32071 33070 33852 23785 14184 -15 25455 37274 37893 28040 14653 13020 17727 25072
19298 25072 18966 9230 19867 36581 63555 67662 22036 -5749 -7869 -2032 6721 7413 12461
19285 12461 730 -6152 10324 8707 5443 12179 5991 4650 1594 -8198 -31798 -22935 7501
19272 7501 8488 12310 25860 36727 16242 -19155 -10402 27341 17601 19816 31924 64086 76527
19259 76527 49170 -7569 -25780 -7134 6143 1170 7951 19122 15130 -13637 -32961 -23186
19247 -23186 12101 2034 -26659 -35700 -33605 -13790 -6833 -33691 -26782 -8007 11058 20837 -12173
19234 -12173 -1966 34465 35718 54500 93131 59358 36514 54041 65463 68218 59106 63670
19222 63670 64112 94922 78916 48216 72865 79778 74665 50651 43641 53328 51716 69035 72361
19209 72361 41083 28910 16944 17326 21754 31477 36056 57242 23617 28476 55711 30914 27173
19196 27173 655 -6449 -15491 -11822 12629 29116 43749 31413 -8357 -42808 -46880 -30230
19184 -30230 6352 31975 43267 78809 117112 136229 113582 80147 70352 103119 106230 97514
19172 97514 72481 85950 88060 85826 89352 84082 66790 62625 17926 -1651 15957 52273 86472
19159 86472 102607 87865 65714 37429 10525 21433 36566 41719 53297 35607 19567 14870
19147 14870 22592 38244 41956 54585 63402 66275 63957 65699 61796 57267 39668 34288 43754 54416
19133 54416 45212 50499 47477 69239 62295 47385 40867 65485 67925 46375 29388 34793 38873
19120 38873 46027 53155 61445 69139 90989 114893 110072 131735 150230 161562 189395 223069 229367
19107 229367 228787 234471 265738 278227 291001 254235 241397 222524 207078 186592 156095 118289
19095 118289 122400 112476 135242 171646 149407 133517 122094 137923 123713 128700 167889 178741
19083 178741 149192 176753 188729 194832 204724 235180 238369 220946 220781 254681 268727 272296 242880
19070 242880 232601 234798 230097 237393 211483 190926 158432 159052 168153 151984 140638 124025 110059
19057 110059 126110 140540 155350 141333 137543 131631 141228 168453 184160 203439 227445 266229
19045 266229 295083 308658 319796 346047 355806 335085 292641 298575 294858 277207 244589 239252
19033 239252 207435 200426 229804 272278 284407 295938 307223 319146 293589 275711 273835 249131
19021 249131 231688 249620 271271 270637 264979 248879 244462 246893 239989 264925 263914 244436 265658
19008 265658 301688 294259 276235 237988 235456 252770 283864 326173 332612 339743 343690 368528
18996 368528 369658 368282 381701 386610 389136 371590 371464 416664 433936 422931 427076 464073 489898
18983 489898 507585 516660 546845 590444 627699 683486 716537 772834 803930 834879 864984 845961
18971 845961 804306 790681 805450 814212 778283 779178 811601 853097 922128 978630 1061973 1129819
18959 1129819 1173753 1238768 1337405 1456485 1550504 1627870 1726314 1771720 1818405 1887348 1947911
18948 1947911 1989085 2055558 2129226 2200301 2317901 2495345 2705538 2893151 3022319 3198903
18938 3198903 3464642 3821878 4270002 4827180 5533949 6495104 7785139 9583359 12016015
18929 12016015 15306164 19606884 24986505 31365832 38323727 45042408 50697226 55277222
18921 55277222 59907376 66130959 74204714 82029754 85888820 82645334 73273239 62458987
18913 62458987 54450781 49637012 46160200 42030303 36420314 29919851 23833950 19063690
18905 19063690 15733771 13469324 11919169 10860672 10103631 9594991 9254346 8942250 8650490
18896 8650490 8368176 8113875 7916443 7778501 7628296 7382306 7054798 6672352 6342454
18887 6342454 6049666 5783545 5531392 5235403 4955441 4691077 4461279 4222707 4034461
18878 4034461 3879753 3678223 3413195 3175150 2988526 2825392 2685469 2534416 2384358
18869 2384358 2257795 2125712 2015259 1903295 1820909 1709759 1618625 1524129 1414411 1358767
18859 1358767 1294314 1241458 1204070 1143258 1103807 1073109 1064318 1054642 1014533 1020468 1021843 1005573
18847 1005573 992598 992338 991713 963905 968117 993167 1018188 975470 904291 832340 782840 753475
18835 753475 691749 646411 613413 571058 541412 502348 497201 467393 440500 441871 417107 382837
18823 382837 327787 299376 289418 298934 320842 320698 313175 293113 292409 267139 239296 230234 224367
18810 224367 247447 247401 221674 198141 205048 246419 244356 242622 208378 180493 207089 200882 171904
18797 171904 159944 171046 197806 215341 193087 176312 188895 182525 185327 203071 206131 174389
18785 174389 123383 107292 99136 129020 136699 170811 194878 194381 179283 161631 180921 194777
18773 194777 231575 226237 218120 197732 177403 136270 133645 146063 142204 123801 111438 96244
18761 96244 77395 49276 41361 69756 85769 104964 94141 90276 91269 103261 123476 128963 116632
18748 116632 112544 132740 145630 134157 132129 146731 138371 118206 102694 84760 66674 53138
18736 53138 31958 19703 14072 -7144 -53280 -82393 -66106 -52466 -33483 -23721 -20408 3762
18724 3762 42776 86099 128927 153031 198327 215401 234529 243379 238446 249949 247356 287077
18712 287077 291322 275707 262280 233122 232331 217577 177000 166183 184467 181045 184416 186956 174868
18699 174868 176298 164623 158546 173015 166633 168241 180328 200866 189348 142120 121927 124231
18687 124231 144614 134808 120508 112968 118049 111264 112470 126312 123318 115453 122908 131059 105783
18674 105783 95427 94553 108925 119510 134135 161616 166115 140330 144494 156545 161251 159645 140979
18661 140979 138319 138364 146147 177738 205191 231601 256270 273739 278735 245245 215604 181714 183714
18648 183714 180085 136867 134189 153005 156722 147977 119122 117790 123954 95801 81679 77954 110078
18635 110078 135340 130627 98842 94398 112205 122861 124927 102036 85738 102834 128657 142146
18623 142146 160016 150016 127543 110248 117440 132728 130056 122076 86748 48250 27778 45686
18611 45686 73170 75077 62276 36099 35808 57571 73770 98696 115611 145115 210152 243574
18599 243574 279563 291432 286573 281345 273322 270826 256123 253106 239502 251995 269561 222611
18587 222611 226545 247701 227134 211702 206100 189550 196983 230975 199335 172725 176205 179515
18575 179515 188966 185603 198999 198285 191754 181789 207861 218817 211240 195231 208648 223453 229057
18562 229057 213265 193782 184129 168086 203704 196790 222244 248879 252019 259345 253310 249315 252297
18549 252297 246548 221592 222900 243796 250481 254517 268700 259399 249504 271619 302251 325861 342399
18536 342399 322404 310156 336551 346163 353506 361850 367898 348243 347146 339840 317313 322577 322971
18523 322971 313365 325419 362116 400377 394558 383013 369531 373965 369011 363623 388862 393767 423335
18510 423335 449697 453872 481070 523890 552500 584890 629696 712527 803569 915990 1026408
18499 1026408 1129242 1247269 1388792 1473424 1527708 1530816 1504057 1446820 1366504 1317645 1302836
18488 1302836 1328425 1382590 1449140 1524291 1627571 1779405 1917292 2072818 2239122 2457029
18478 2457029 2744396 3129429 3677366 4428611 5445600 6786245 8576385 11027796 14359758
18469 14359758 18759689 24509677 31762231 40041507 48162593 54076302 56160480 54309406
18461 54309406 48857935 40795801 31692836 23364419 17295658 13391359 10897951 9171682
18453 9171682 7942552 7037532 6387182 5897284 5540892 5257718 5023102 4892977 4838132
18444 4838132 4836439 4897048 4977909 4987787 4973160 4990065 4965013 4912197 4825366 4702420 4611517
18433 4611517 4545960 4451943 4325401 4226731 4120284 4006283 3958814 3997061 4128574 4342680
18423 4342680 4672195 5194756 5905418 6918647 8289478 10130547 12636584 16038994 20657903
18414 20657903 26713101 34448389 43608837 52928153 60271751 63554546 62338678 56896045
18406 56896045 48233427 38004625 28147474 20641015 15765527 12631786 10543830 9031382
18398 9031382 7918800 7127422 6501892 5985438 5567894 5264780 5004471 4801770 4622234
18389 4622234 4486816 4413838 4410245 4382659 4355454 4350018 4364941 4332851 4269779 4171652 4067238
18378 4067238 3897625 3653551 3428138 3203682 2952335 2696466 2447288 2244259 2083148
18369 2083148 1941219 1817392 1688395 1584362 1507872 1421013 1356909 1293396 1183169 1145627
18359 1145627 1121661 1050024 973095 918305 862005 827145 792988 761038 705701 658150 622130
18348 622130 605939 606027 573869 563535 529397 536142 514713 489094 460625 450351 448543 423870
18336 423870 410341 387303 347203 306543 298291 311078 302286 297746 276181 249589 223225 228074
18324 228074 230467 211511 231973 228337 217440 179746 156853 143660 177016 205029 190251 167058
18312 167058 157138 141126 133482 116029 101098 115915 89150 75510 75361 100042 138197 149708
18300 149708 167712 175983 185975 235709 277678 283426 287707 290820 310272 347615 370973 378598 371069
18287 371069 371899 390898 366727 374422 405011 441303 478532 446915 401592 362516 367483 379676
18275 379676 382548 353796 354267 392596 433108 459223 488464 499429 511718 499336 488779 436844
18263 436844 404696 421448 407962 389705 331979 302293 273031 245956 227443 187041 133638
18252 133638 119256 141137 148779 167798 188815 213329 232796 212906 219635 232652 252347 264812
18240 264812 297505 313981 329551 352150 363459 400745 391910 387487 374472 352724 326709 322125
18228 322125 311797 270849 233551 196397 206813 199188 191574 163001 118296 84700 109496 123891
18216 123891 143428 195240 237355 249244 286236 307189 339682 372599 392874 421725 441659
18205 441659 480690 533058 560687 583577 612545 600236 588415 597729 632157 626833 581630 518634
18193 518634 467273 418891 353241 301958 294498 292858 263170 252418 226209 182239 184183 225088
18181 225088 244918 250990 250990 254920 289862 338830 373943 411339 409478 397675 392158 373176 381466
18168 381466 389072 393533 368949 367092 371946 381245 368063 367002 353490 352161 332861 323397 309087
18155 309087 302422 279735 253984 253972 254689 270919 274663 285065 281222 286840 289618 285264 271724 245366
18141 245366 244127 251973 244934 279531 300996 293460 280333 264682 251628 258411 259527 271675 307620
18128 307620 337736 320452 298401 307574 312217 281676 267725 245869 224731 238552 264920 265444
18116 265444 247494 263617 270924 285747 304814 304417 291028 305548 320385 323860 294552 314403
18104 314403 286602 279051 279782 292086 307931 346911 377789 379366 368445 391870 390309 413968
18092 413968 407307 382718 355719 346977 331991 324314 329797 323150 329656 317006 303455 283533 301573
18079 301573 324318 314949 314438 335161 349670 356443 366766 409916 455504 459609 476490 523775
18067 523775 540914 521721 526763 531589 516440 512635 511388 491231 471479 485416 499042 516445
18055 516445 542960 587666 611677 643828 650639 616969 598985 613262 622674 606327 580475 575239
18043 575239 566896 542134 542972 568420 587704 561386 554533 568443 599008 623447 664076 651977
18031 651977 632980 620081 622090 617125 611869 629286 670282 678623 708610 744360 754678 758272
18019 758272 773162 827359 883942 923426 962988 1003894 1039428 1082692 1130871 1204787 1290969
18008 1290969 1376765 1469487 1583264 1750252 1982542 2199305 2470242 2782783 3152876 3563006
17998 3563006 4030554 4572965 5184890 5941670 6901947 8119201 9720579 11889620 14892827
17989 14892827 19034925 24511764 31503028 39790691 48304559 55400092 59421130 59687606
17981 59687606 56546733 50523413 42717654 35418104 30721792 29133726 30297357 33827244
17973 33827244 39525395 47049700 55234818 62208415 65807032 64869503 60065451 52491356
17965 52491356 43066960 33458006 25610647 20172331 16658058 14440133 13030926 12082331
17957 12082331 11331225 10706421 10143335 9561672 9005201 8463032 7939632 7459694 7049163
17948 7049163 6717300 6469651 6259949 6074756 5901091 5708247 5486493 5238051 4958949
17939 4958949 4649418 4358433 4071909 3799069 3557009 3319771 3126469 2970851 2819744
17930 2819744 2645976 2473003 2336896 2215420 2085449 2011395 1927806 1829098 1734622 1614412
17920 1614412 1527028 1477183 1415864 1334408 1256180 1209675 1168483 1138349 1085090 1028047 985370
17909 985370 948627 910796 874931 831841 809761 802844 787551 749629 715814 704950 690276 686608
17897 686608 693360 714979 729746 724248 714271 677610 668496 644582 593317 532122 489948 466459
17885 466459 440888 434675 421170 384254 337166 314978 301601 284467 284428 287004 282783 286686 264183
17872 264183 225932 223564 273601 276156 264728 224390 197507 206378 222221 228291 230717 194667
17860 194667 156747 176016 182191 181541 178834 178240 157653 157051 181048 196825 198117 213272 182112
17847 182112 157669 141108 147056 139755 120889 123169 145347 146462 155682 155885 136336 135507 136081 124269
17833 124269 131048 104712 72473 42184 17217 31355 31144 52136 60387 67811 101702 98708 87464
17820 87464 84229 99807 111761 104844 83585 50601 60032 81406 68346 86949 100156 107236
17808 107236 110592 121853 144758 158738 162641 176339 196560 168280 131157 120279 125624 103923
17796 103923 64673 972 -25016 -31751 -38591 -31563 -4666 8475 38762 78762 90087 102611
17784 102611 94946 58211 34163 40420 31759 16191 -12309 -13252 -7394 32663 87293 106800 90770
17771 90770 123270 142002 134019 154971 156876 163061 166777 154614 148013 162600 178058 182554 194352
17758 194352 175721 179082 151144 131009 139230 185000 211791 239918 230912 219603 202572 195581
17746 195581 205113 169305 142582 120157 107181 146586 187824 199878 231268 227725 234867 219045
17734 219045 210064 211613 223391 227372 200477 181615 169949 181821 190244 180946 175724 191955 218236
17721 218236 221138 215772 233947 231389 209965 197872 193104 157577 136348 117525 117849 135273 153202
17708 153202 147722 126765 150426 185002 183756 207859 226412 220970 208287 255698 324678 349627
17696 349627 346283 336203 301168 269338 282060 286174 268797 264123 257716 239475 222838 210162
17684 210162 189709 182535 190357 205676 215316 217805 186392 157228 169206 201450 201202 196303 179781
17671 179781 170407 153212 151382 182343 198471 185835 186169 204003 224194 217955 216207 175109 156803
17658 156803 163852 165166 155375 184960 206081 238072 271653 289404 303903 279109 262287 261402
17646 261402 272105 326618 326029 302088 280744 287520 336505 350791 379011 403844 403874 434175 429225
17633 429225 436935 439479 406038 388582 349650 336879 319839 314557 324219 333349 332735 352435 332253
17620 332253 310598 365668 370350 383731 406278 412352 398004 399886 385354 387074 378497 390682
17608 390682 413672 432311 430357 415603 402764 395388 408691 452253 460266 480514 495745 519893
17596 519893 576556 580293 627289 675753 743912 790892 842832 902201 924419 932896 933762 937615
17584 937615 978763 1061168 1143963 1263990 1401646 1556002 1733433 1915770 2123461 2387057
17574 2387057 2700645 3133140 3708539 4449438 5505455 6932397 8874622 11506604 15021565
17565 15021565 19462753 24978153 31297409 36943488 39614393 37329363 30688723 23445567
17557 23445567 18299198 15416213 14225452 14359847 15580220 17823554 21027678 25214345
17549 25214345 30268378 35240394 38077213 36744454 30871073 23279120 17098575 12991872
17541 12991872 10448625 8887784 7924543 7282474 6839420 6518930 6230155 5952718 5656609
17532 5656609 5378411 5115338 4898615 4719686 4573450 4483193 4445149 4473211 4529187 4654014
17522 4654014 4821962 4985386 5151591 5313979 5607136 6079393 6776328 7782206 9221837
17513 9221837 11293721 14088469 17698979 22242600 27604965 32783763 35882337 34964248
17505 34964248 29710054 22957891 17731019 14657746 13208185 13001895 13833592 15618655
17497 15618655 18279138 21811477 26258313 30974897 34270961 34158854 29596961 22494067
17489 22494067 16253094 12080182 9503153 7925324 6989059 6340877 5867821 5546504 5268280
17480 5268280 4962050 4674898 4416063 4129350 3856054 3626515 3437207 3280486 3198043 3131853
17470 3131853 3060674 3026078 3016284 3007907 2936195 2838495 2724481 2582461 2411372 2255767 2110930
17459 2110930 1951326 1810928 1698994 1601680 1536610 1458589 1378336 1312314 1256765 1230955 1160235
17448 1160235 1098318 1039280 973711 898497 822775 752072 710879 670698 633041 598305 593046
17437 593046 583133 553595 513640 515013 498268 466302 428101 418628 413161 371255 346716 330702
17425 330702 317929 290296 285125 275767 246296 234731 209080 197146 196004 194275 186750 202641
17413 202641 208670 182772 166087 159463 156537 125742 73762 48642 34733 24645 28951 45925
17401 45925 73289 97314 117662 101419 92202 95481 104723 116097 83105 36947 35287 21165
17389 21165 41325 64914 59061 60617 33933 32743 65905 88196 83904 106239 112810 78019 33398
17376 33398 38683 36564 22919 -3259 -17480 -12251 -8926 2839 14534 20135 46246 61317 67079
17363 67079 67153 56152 25076 6425 18601 -1380 -52285 -73505 -36376 8096 32854 18753
17351 18753 -9998 -11385 -28128 -11770 15098 15778 31678 24681 34917 46295 60465 64882 67070
17338 67070 85205 98845 64359 46840 69433 81091 94378 104860 105153 94581 112112 99389
17326 99389 70423 55351 41799 49813 91253 74197 37355 40765 26394 10541 5400 28161
17314 28161 31987 40371 40889 38456 40556 39995 -9708 -38697 -20976 10202 21009 2255 -22246
17301 -22246 6079 41970 11694 17841 18911 33878 47024 71761 105511 112406 108576 98779 102233
17288 102233 80964 70062 51318 54143 60679 65753 52483 78160 112381 83022 65758 54560
17276 54560 37163 30023 47576 44759 33226 31424 21642 -5667 25889 45303 43352 70929 93029
17263 93029 67267 19649 13410 -5202 -5347 31066 34400 -18832 -16453 -6980 -16068 -19623 -11252
17250 -11252 7061 18150 20579 24142 31785 28078 43648 33684 23997 43371 80974 68275 51316
17237 51316 32790 21099 20530 26258 13357 10087 7670 -5480 16824 14546 -10444 14041 19867
17224 19867 43408 48751 15541 -21919 -26216 6744 15888 17522 895 -7562 -9565 -4259 -12611
17211 -12611 -19191 3481 22916 36007 39071 35096 16191 -8374 -7320 22249 32881 15670
17199 15670 22778 16319 13183 -20147 -2844 10448 39896 58148 66267 53945 34309 39521 29242
17186 29242 31203 24443 12224 -956 -5700 7293 22790 19965 38755 62889 49318 12170
17174 12170 -4812 35794 54219 71736 62401 35779 5537 -204 -15976 -22551 -3810 4347
17162 4347 17015 61050 84059 51983 12566 34673 83687 89024 102143 87199 85283 72670
17150 72670 40006 38751 69470 75389 65750 62808 15494 -22649 -28551 -9037 18397 30399 21255
17137 21255 1344 74 33648 30233 -3890 -1742 -107 9022 25253 18410 27547 35013 44165
17124 44165 19570 32917 54825 53321 63305 77914 74033 50914 49563 38448 11265 16390 41015
17111 41015 63607 49143 21083 19606 42549 37159 51730 104878 116195 85953 81887 74695
17099 74695 38266 30134 47350 56830 32642 4408 20272 27266 6856 5930 -429 -14213 -7275
17086 -7275 14278 33273 49366 6168 6938 15262 9989 28511 55222 52869 7622 -1092 15441
17073 15441 31359 33906 10053 -7822 10536 19950 11144 14412 22567 14569 24097 35790 45676
17060 45676 45894 49589 66051 91301 136589 156566 182502 207882 233872 224849 222689 219771 163792
17047 163792 129381 145575 135782 105563 66322 75495 129339 162765 167728 160036 142367 137176
17035 137176 131814 122328 124517 106875 106673 94720 76989 75312 65268 59878 50108 27747 2237
17022 2237 24285 51057 51256 26799 13435 19109 36659 60555 67509 94706 90306 76165 68067
17009 68067 88267 130776 127433 106509 103901 97314 98171 102345 130187 129472 153135 192563 183415
16996 183415 149042 129157 113711 89875 66451 73231 78786 76280 97552 123774 142117 165027
16984 165027 164700 166683 185014 194478 179343 158429 108340 100543 116413 102102 72034 48995
16972 48995 52031 54569 40460 31387 61351 78806 48245 32506 50792 39384 32914 20663
16960 20663 20514 13968 11789 31465 55159 39986 40959 40651 36610 40427 9856 29906 22632 5418
16946 5418 9534 25765 33720 8385 -65 -8941 -7863 20744 3554 -30383 -55061 -57305 -38538
16933 -38538 -9097 17126 24538 34892 7604 -19428 -29355 -21281 -26278 -36008 -15422 -13293 9232
16920 9232 29907 17597 41842 43092 33801 54862 59092 46034 23141 3760 -15614 -27610
16908 -27610 -26497 -37360 -23566 -12213 10084 31269 16817 -1600 7981 23024 12316 -9680
16896 -9680 -17513 12640 10530 1355 12952 27221 39017 23360 -16071 -22970 -6032 -6851 -12484
16883 -12484 10161 4127 6672 30006 2860 -13205 -9643 -16075 -16731 17978 57162 64784 46721
16870 46721 44012 29855 6591 -7574 -14082 -13007 -21000 -21219 -19486 -29115 -22058 -21756 -10348 -10188
16856 -10188 -11302 -23975 -13879 4767 17924 7563 19372 29457 47925 37187 56023 69794
16844 69794 38681 25801 29705 14721 -32035 -32719 -16267 11781 36199 13511 14766 2802
16832 2802 -20257 -7525 -6099 -53908 -39882 -29827 -30608 -18408 -2928 12071 10062 -3275 314
16819 314 1242 22308 31200 14967 -3604 -3253 16820 52027 82120 114960 107501 93989 64074
16806 64074 22599 -1753 19916 37072 60018 42692 46828 57257 67362 62300 30807 29967
16794 29967 31151 47810 66589 59974 61513 86100 71656 62219 43276 31968 57381 57300 53562
16781 53562 21341 12918 46715 48489 31566 55203 73065 64819 40312 40237 47249 30982 34005
16768 34005 37987 34025 34804 28483 23492 36949 56716 50401 26294 13406 19769 38379 21270
16755 21270 9062 17423 31900 6823 12275 8201 15038 45491 30941 7353 23652 3740
16743 3740 12367 1736 -30512 -32895 21105 35889 34559 35076 9425 -17500 -7810 21303 30461
16730 30461 41388 21494 8131 6745 -9289 -7130 747 22810 36660 45525 32797 14848
16718 14848 15791 992 -4577 -40479 -48365 -33076 -27119 2112 28819 6134 -915 -27186 -22969
16705 -22969 -25111 -61121 -70120 -60297 -13219 12589 -11646 -19221 -30706 -26120 -20078 -3226 -5158
16692 -5158 -24978 -10085 29297 30177 42944 61648 54937 30049 42102 18237 -5851 848 -3042
16679 -3042 -13352 -25656 -20390 3111 -5970 -31382 -16304 23050 11772 14879 18353 32208 50879
16666 50879 46631 24008 43287 66357 87784 74413 44354 21536 9063 3919 -549 20548
16654 20548 7677 6087 20150 2824 26722 77389 110399 106603 97867 95256 90687 113576 101602
16641 101602 56149 39780 54935 60070 32787 6519 -11270 -7440 20921 42290 30493 34973
16629 34973 32485 8463 2899 -3382 -34060 -28764 -18356 -20752 19648 8791 2318 21225 45263
16616 45263 53026 69254 71560 50688 25163 -10081 -15027 10016 12435 11752 -961 142 -6788
16603 -6788 -8160 -15727 -15216 17366 21628 1156 -26464 -41551 -38730 -22149 -10315 -14376 5602
16590 5602 43922 57694 65288 43326 -17582 -45502 -34961 -39618 -35794 -33959 -29749 -31700 -20516
16577 -20516 -6605 -16961 -25286 -26020 -13590 6938 26236 41660 41263 8829 -1201 -10852 -2355
16564 -2355 -5323 -11032 -3459 -15518 -14967 241 -14602 -31571 -36265 -32538 -7142 4866 -21693
16551 -21693 -8080 156 1306 11349 8454 -10396 -18834 -31870 -25281 -15932 -12110 13170 33499
16538 33499 22578 -13676 1639 25068 -3983 9478 27900 44053 40642 28389 715 -31766
16526 -31766 -35470 -34295 -39200 -38338 -28034 -8731 -19170 -12387 -1508 -4680 -4663 5814 11873 19741
16512 19741 28304 -6874 -33409 -40517 -23078 -9579 -7696 -28369 -43385 -49876 -31101 124
16500 124 -4692 7996 -17323 -31464 4042 2133 -9014 13176 33790 53496 41307 16491
16488 16491 16570 -1276 3473 -30007 -27055 -11945 -13510 -23196 -37829 -46458 -43694 -13788 -4412 -24028
16474 -24028 -33530 -15489 -5139 -9240 -18130 -27667 -16724 -6369 -19706 -11478 -18644 -33609 -22352
16461 -22352 -4682 1383 -7192 -10705 -17097 -39545 -51510 -51412 -56446 -42785 -10463 6416 26108
16448 26108 33871 29810 1173 -11478 10419 11205 5520 -28850 -28028 -17164 -27010 3186 6074
16435 6074 -14283 -27617 -36639 -10907 -15550 -2327 24016 33006 25126 11567 -2704 13932 9477
16422 9477 11633 -492 -9600 -9062 26632 24795 17683 9888 21628 52386 48122 39334 11592 7697
16408 7697 14026 -6045 -37051 -28348 -11827 -1478 -16077 -2825 -9595 193 -8083 -48716 -39871
16395 -39871 -24754 -47806 -32491 -16123 -43166 -15226 5280 -497 2410 -15185 -24315 -15258
16383 -15258 -974 1415 8963 12394 16226 3015 -29837 -52083 -36375 -15781 -14497 7471 15172
16370 15172 21134 33593 15330 16140 -12141 -25821 -18188 -15190 -10979 -13170 -17552 -12130 -15576 -19119
16356 -19119 -12927 -2020 -154 -1478 4412 -2667 -12795 353 -15452 -46759 -43770 -50545 -45672
16343 -45672 -26169 -29058 -20145 -12777 -1204 834 15318 18162 -431 -24966 -33572 -23419 2821
16330 2821 15191 10572 -1698 19247 -4555 -39371 -58094 -56208 -34807 -14071 -29598 -41181
16318 -41181 -27892 -26799 -21659 -6 20389 22605 12549 53291 63833 22187 4642 -41612
16306 -41612 -38935 2088 -15899 -326 29689 28098 -6437 5090 -3421 -19833 -27196 -29296 -14172
16293 -14172 -8759 8406 20824 29561 25120 2170 -18347 -29768 -10898 -7811 -14183 9007 3986
16280 3986 -6081 -22239 -32453 -21807 -5900 -17678 -53395 -60444 -22594 6572 -17004 -26229
16268 -26229 -15550 -5213 -3955 1344 10010 595 10074 9674 -3227 13789 38803 22110 -16584
16255 -16584 -40475 -37823 -17208 -29670 -20590 -4705 319 -4279 -4950 -1020 -263 -6649 -16126 -29462
16241 -29462 -43645 -33702 -10285 -878 -10943 18182 32976 15662 -12275 -46481 -47442 -18754
16229 -18754 -3421 -11517 -33591 -27824 7347 -6210 -831 21270 7452 7549 -2541 -8271 -8314 -29406
16215 -29406 -56662 -31932 -20762 -17547 -14762 -8713 -16063 -29861 -52385 -51829 -44562 -38623 -22925
16202 -22925 -19339 -30094 -42753 -50234 -46784 -51656 -45844 -35921 -64681 -65907 -48366 -23179 4793
16189 4793 -14609 -33035 -32116 -26146 -8325 1344 -36903 -23467 -14083 -7669 12731 12773 -10546 -21858
16175 -21858 -7745 -4100 -33564 -38791 -30893 -16188 2824 -30872 -28651 5501 -9463 -5180 19005
16162 19005 25900 -1774 -13909 -769 -9343 -22435 -19029 -4205 3262 797 -13666 -8056 -24986
16149 -24986 -42663 -15076 -14924 -35113 -31210 -36145 -19719 -20533 -34968 -16438 -10256 -7455 -28766
16136 -28766 -35976 -27951 -26008 -37356 -52872 -62921 -76475 -86275 -80427 -79172 -80778 -84759 -73186
16123 -73186 -60686 -40216 5031 7113 -3043 2277 9067 -506 -28482 -22114 -28563 -45881 -51891
16110 -51891 -72450 -47947 -17194 6202 16537 12768 -13972 -40751 -43142 -28594 -15535 -3268
16098 -3268 -16059 -31771 -20077 16674 8377 -11875 -42509 -63083 -45385 -47189 -31460 -11873
16086 -11873 -19249 -18550 -13647 -30135 -35461 -21433 -19726 4171 5031 -11341 -5537 -7909 -13196 6984
16072 6984 -2585 -33768 -47831 -59382 -54183 -52752 -33276 -35806 -32700 -47191 -43893 -16496 -41609
16059 -41609 -69680 -62039 -21375 -8635 10467 3555 -26678 -39792 -27582 -28499 -16390 -16557 -13580
16046 -13580 -13763 -9105 -9996 864 1504 -13857 -36944 -18870 -19258 -18225 -11607 -9814 -26706 -14421
16032 -14421 8835 36477 61898 51061 32642 42483 55123 35600 10142 40177 41182 26557
16020 26557 4850 -10007 -4498 -3607 -119 21034 26859 4244 9581 25579 26150 15096 10207
16007 10207 27412 27749 28846 16334 -847 -50572 -40847 -20647 -7879 -29298 -41986 -32939 -18911
15994 -18911 -10860 22514 -1057 -368 10197 11989 -9967 -21313 -32566 -62273 -62873 -50771 -31861
15981 -31861 -31601 -66847 -47586 -44696 -48825 -20537 -2422 290 -2263 -4807 -12755 -550 7377
15968 7377 -22888 -22168 -30214 -43425 -46929 -59233 -28253 -20467 3764 22923 -7523 -42876 -57930
15955 -57930 -50848 -24302 -8768 -29980 -50662 -69623 -71827 -54664 -30347 -11048 883 8955
15943 8955 5760 24284 6582 28511 27029 26561 39088 9686 27680 32404 38269 35555 2830
15930 2830 -6977 -6597 6362 10816 5743 8818 4937 -1468 -4653 -3490 -2803 2813 -29169 -56466
15916 -56466 -66372 -25378 -1967 12267 9278 722 -1036 12646 18894 9799 7554 -4482 -2782
15903 -2782 -25982 -27342 -39717 -46221 -47470 -18649 4411 3263 20990 25734 12656 5175 17153
15890 17153 -2079 24971 28752 -11328 -35794 -34826 -27425 -14713 -12174 -5068 1250 -14383 -26639
15877 -26639 -20014 -20527 -26637 -23483 -21029 -13452 10956 -2382 -10354 -31945 -19144 -19498 -14959 -41349
15863 -41349 -68062 -88436 -62839 -6101 17050 28485 25280 15788 19016 11546 15455 17380 18299
15850 18299 -7693 -58654 -49769 -36755 -38980 -53782 -66716 -59590 -36519 -54602 -55084 -37281 -41973
15837 -41973 -49250 -53693 -58842 -39587 -35486 -23768 -5906 -7166 -31016 -20901 -17 3350 -4028
15824 -4028 -25317 -12746 -7064 11854 14996 -4186 -14370 -33697 -29551 -3568 26053 7616
15812 7616 2418 517 -41824 -62729 -37088 -16616 -29106 -47627 -31184 -24352 -27258 -28065 -36763
15799 -36763 -48280 -32638 -20217 -51554 -74355 -75088 -32903 -13369 -16496 -18714 -11070 -39134 -48780
15786 -48780 -49249 -48786 -23119 -43039 -73208 -53767 -42182 -37806 -40527 -37650 -38987 -15849 -19146
15773 -19146 -24046 -26209 -14986 4926 29294 6772 -14777 -20265 -11089 -3145 -17107 -23707 -5023
15760 -5023 -1350 15070 30157 25929 -1148 -10771 -18572 -12685 -29572 -51779 -76656 -59906 -47887
15747 -47887 -25977 -34685 -46117 -38098 -26865 -23255 -19615 -21290 -30572 -23905 -22322 -7876 7932
15734 7932 15516 46732 26716 7770 14083 4875 -14922 582 24462 23632 25501 27690 16699
15721 16699 18921 1421 15974 21518 6305 11248 -6969 -27322 -27467 -28870 -5906 29494 24418
15708 24418 9395 -22621 -29304 -10427 -1548 18431 30124 -3471 -20583 -24117 -16414 -17473 7412
15695 7412 1708 -11438 -24534 -45009 -12631 -20357 -49542 -52628 -43918 -48652 -39462 -37519 -50042
15682 -50042 -41495 -26963 -22879 8968 3222 -23459 -20390 -5300 -16318 -6530 19615 -28986 -56492
15669 -56492 -68364 -71883 -42218 -32049 -34947 -25659 -32337 -14102 -22359 -35062 -23989 -18156 -18542
15656 -18542 -14025 -6848 15132 5684 -23473 -36603 -50161 -42125 -20411 -21262 -23611 -14403 -16751
15643 -16751 -44249 -33411 -36257 -47615 -68599 -53349 -44893 -36265 -34827 -28450 -30199 -31329 -15675
15630 -15675 -34183 -32639 -12515 -47624 -15280 20149 22341 -18449 -15674 -880 6132 2510 1913
15617 1913 -916 -19057 -29123 -33755 -24811 10768 16399 -16680 -10738 4339 -10891 -34173 -51394
15604 -51394 -44863 -14998 2303 -10585 -7995 -13870 -20063 -12581 2011 -3377 13839 37820 27375
15591 27375 17299 24226 41252 26947 2099 -10389 -13998 -18404 -24947 602 14715 35566
15579 35566 32571 30927 6542 -6039 -11509 -41814 -37069 -55945 -55579 -52906 -54119 -57271 -49492 -24873
15565 -24873 -12671 -21620 -17689 -12889 -30012 -20968 -28888 -24553 -21893 -25136 -1549 4123 -13100
15552 -13100 -50629 -30781 3350 -9425 -9517 -12554 -51848 -80817 -44473 -16703 -30406 -33237 -46494
15539 -46494 -36940 2506 14865 28243 34645 8225 -1078 -30936 -52441 -71167 -65733 -40161
15527 -40161 -12951 -13111 -29918 -40621 -30808 -9759 -9630 -936 10136 -6587 -39025 -49810 -40201
15514 -40201 -39130 -71881 -94510 -109371 -79318 -64545 -61858 -45050 -41883 -64947 -82046 -63554
15502 -63554 -34709 -30191 -45453 -38723 -33178 -54547 -42788 -11853 2671 -39771 -56959 -34117
15490 -34117 -50647 -50455 -23561 -24784 -38651 -25968 23783 48328 50550 36330 30882 11214 10256
15477 10256 -3143 -17732 -8210 31641 24190 38681 30196 -5149 -4103 9319 30395 34859 31313
15464 31313 25567 28483 2284 2921 26311 40649 15076 14275 26943 25746 3381 -15936 -41734
15451 -41734 -36375 -10470 -11742 -32356 -49940 -28622 -50272 -57057 -47396 -22599 10772 47206
15439 47206 49737 15147 4048 31152 6371 -3096 -19696 586 10169 -12011 -68519 -68282 -21675
15426 -21675 -7690 -11866 -22498 -38840 -49426 -42140 -18050 1689 3006 2718 4169 -17154 -21389
15413 -21389 -13840 7937 531 -8246 418 13268 23747 31629 30378 25388 -16441 -13877 -1359
15400 -1359 -4736 -12174 8540 -4272 -11077 -14052 -29028 -28508 -17320 -19200 -1543 17232 13916
15387 13916 23993 1491 -20384 -28092 -28777 13267 6072 -5352 -4087 15120 4205 20283 12582
15374 12582 -12965 -38794 -28495 -3180 5761 5311 15520 3864 12189 25448 61273 62254 23121
15361 23121 32125 11942 -36380 -34000 -45943 -43881 -54686 -57243 -34378 -702 -24528 -59860
15349 -59860 -61858 -30204 -17009 -11887 -7473 -10363 -17586 -22447 -28533 -25822 -3734 -18714 -20695
15336 -20695 -31545 -46594 -45910 -22568 -18519 -33623 -32796 -13561 -8238 -7837 -27469 -34202 -42251 -45779
15322 -45779 -59070 -42219 -14661 16933 16151 7496 -11039 -24254 -56982 -66143 -38315 -24997
15310 -24997 -33664 -38038 -59448 -48284 -35671 -54599 -65894 -60481 -36451 -10850 1449 5023
15298 5023 4947 19294 27937 11389 9185 11234 29803 58566 42097 41623 11170 6062 24403 56479
15284 56479 19969 1487 671 -6826 -4856 10818 18191 37080 48544 46069 48712 6723 4196
15271 4196 38209 32474 34506 36219 32959 28691 43362 14529 -8949 -14907 -19060 -5840 -10690
15258 -10690 3233 20049 16721 5327 -8149 3208 19260 43862 21003 9033 10525 1257
15246 1257 -12880 -14705 -19771 -13465 -2337 3334 -15028 -18205 -2344 -18730 -35773 -11664 -11165
15233 -11165 1937 12882 8201 25984 17702 -9219 -15131 -12887 -4834 -8457 -23033 -35011 -34881
15220 -34881 -25908 -9065 -31088 -49467 -4706 -18752 -26235 -2150 9454 13196 29366 32753
15208 32753 28468 43698 43025 34126 6721 -6390 9147 3555 -9318 -16592 -15487 -18990 -19261 -30191
15194 -30191 -38364 2416 19949 26186 37566 44422 44788 32047 9007 -22016 -40665 -25308 11688
15181 11688 18622 -995 27811 21476 -4099 -32841 -36940 -22860 -2790 17118 12916 -10431
15169 -10431 8150 18460 22039 6129 -11299 -14811 -3094 6906 30341 45520 23170 -17350
15157 -17350 -37060 -12640 -2290 867 8753 7841 20109 -13948 -10615 -3747 7462 3146 4420
15144 4420 14618 9842 -12899 -45508 -41409 -19251 -3663 -39662 -51159 -26231 -16160 151
15132 151 -3461 -9434 -23155 -55705 -50906 -6147 -37187 -56753 -50583 -33692 -22386 -7643 21703
15119 21703 30385 27551 46956 58382 5380 12822 16522 4501 24148 34301 28163 8139 30969
15106 30969 23531 16007 305 230 16065 20827 16232 -9530 -24043 -28796 -50713 -45485 -10225
15093 -10225 -20175 -16721 -13735 9764 15128 -1628 200 8924 -412 7587 4090 5343 8385 -8280
15079 -8280 -6229 -14126 -13796 -30982 -17579 -5870 -16379 -25049 -31866 -30945 -37136 -6276 10016 -19334
15065 -19334 -38548 -26763 -30110 -49985 -42742 -2585 3602 -8929 -19632 -26805 -10709 -2378 -1719
15052 -1719 5548 5467 1853 15 -20832 -24518 -56347 -61645 -64053 -59432 -21526 -26508 -25560 -13959
15038 -13959 -19918 -24761 10480 23089 21885 26979 -11028 -67407 -78628 -55038 -888 -7647 -4653
15025 -4653 5137 -2398 8951 36188 46574 29475 8876 -20449 963 10472 2169 -19952 -12439
15012 -12439 -2941 -2231 -6476 -20621 4874 -24173 -30455 -31416 -24693 -289 12856 52330 71106
14999 71106 39333 749 16471 25542 -13037 -33518 -29416 -40727 -40211 -53070 -54093 -63652 -42740
14986 -42740 -20542 -11588 -20926 -8944 6500 28078 13704 14608 7773 -19470 -31024 -47303 -30976
14973 -30976 -11680 2758 10225 8806 9464 -12158 -59559 -61315 -59571 -47452 -37727 -34512 -30153
14960 -30153 -18562 1763 -7211 -18183 -25952 -14228 3583 -10257 -32248 -5623 12445 15662
14948 15662 -2464 2497 -18368 -32064 -30085 -10185 4964 -16659 -27002 3597 22575 17575
14936 17575 29110 34586 33012 23089 2752 2134 20327 20867 3630 -6275 -12527 -24091 -6274
14923 -6274 33914 58110 37783 -1098 -21449 2643 12589 2321 14998 25909 23731 37944
14911 37944 42442 27477 27023 15260 1130 -44381 -41529 -16448 -24250 -5810 4022 -12000 -18305
14898 -18305 -4133 7731 -1384 -22245 -11267 -25124 -36828 -39171 -20716 -35438 -39643 -51976
14886 -51976 -56224 -43993 -30572 -16584 -28472 -13660 22 -13162 -9046 -7559 -20141 -57944
14874 -57944 -63547 -13516 -20720 -5181 6429 9184 29052 20702 4587 -44080 -60567 -34269
14862 -34269 -31011 -19322 -25341 -4992 5651 17810 5209 14754 4632 17002 53184 63025
14850 63025 57709 61248 37828 46890 60977 29914 -13667 -30737 -27195 -8788 3019 -6405 -10229
14837 -10229 -25963 -40292 -17759 -6615 -21651 -23725 -13177 -17226 -26638 -46850 -70900 -54960
14825 -54960 -62166 -51585 8113 -5152 -44694 -74408 -47613 -9250 6110 16432 27412 19003
14813 19003 17198 12734 6079 6336 -13208 -18696 -33021 -52627 -26079 23961 40326 35678 36141
14800 36141 30139 29049 43992 23704 -8239 -26372 -39529 -27539 -14957 -44892 -37732 -9661
14788 -9661 2573 -21012 -38385 -57366 -52569 -53956 -54836 -38560 -42937 -40944 -35562 -45789 -52917
14775 -52917 -67960 -69553 -49228 -46714 -21260 2942 7210 26601 42215 47211 46348 40906 39426
14762 39426 33739 13136 10870 -633 -10693 9874 20231 3237 22258 18365 27338 6587
14750 6587 7175 38638 -7187 -20774 -13011 -4889 -13193 -4458 -9270 -22499 -4213 18280 28073
14737 28073 15363 5468 14010 20946 22833 25603 28160 2581 -4859 9994 15787 -4224 15795
14724 15795 7706 -13020 -1216 2409 -37227 -39426 -32682 -30788 4781 57772 63594 49726 62551
14711 62551 29724 15687 31397 21980 1560 9687 -11868 -1994 -6567 -12022 -8095 -23086 -14381
14698 -14381 8581 -235 -15873 -26613 -36330 -36279 -17560 13455 35849 45749 18254 12163 15570
14685 15570 19676 6702 -17559 -1706 13268 4583 11977 -1155 -26587 -40099 -29111 562
14673 562 -12159 -34914 -59268 -66158 -66273 -44524 -46863 -46918 -23401 11256 14361 -20886 -7304 13418
14659 13418 -1732 -16045 -4695 25112 48006 13757 -14520 -1975 -13592 -42019 -40918 -31123
14647 -31123 -27350 -19316 -32407 -28542 -9519 -20651 -28827 -49468 -38372 3084 14973 537
14635 537 -4658 -1388 9123 2319 -23770 -39751 -36368 -47181 -30306 1458 42667 34030 25950
14622 25950 33083 27969 48827 36332 5356 -17945 -6185 -7661 -10014 6898 6858 -6654 -3217
14609 -3217 12873 21332 -6737 2958 12612 -6278 -3520 11245 5754 14527 -3145 -20484 -14414
14596 -14414 -12030 -19515 29427 47618 13862 17455 5068 -21011 -27578 -11261 -16244 -12277 22348
14583 22348 23007 23794 32338 27459 29468 46126 24468 7595 29480 33457 18897 -1833 17293
14570 17293 8691 -9513 6402 18927 -3433 -27428 -24064 20069 2502 24188 48176 47901
14558 47901 67590 73457 65289 48074 43989 58048 55025 74600 86955 72252 41474 31021
14546 31021 27393 29322 39014 38553 34777 48558 54062 52218 69447 67331 58041 56505 56645 63804
14532 63804 73395 30922 28424 51698 46768 52755 62881 55065 39078 19502 14921 24991 40441
14519 40441 50818 38441 52138 59962 60826 31526 15038 218 6021 -5026 17621 32777
14507 32777 49413 28645 27020 48256 57683 48580 36566 47701 69992 51294 27582 21495
14495 21495 18574 29936 4462 -8568 4232 16862 2322 -1747 5447 1767 -5362 3514 6432
14482 6432 4335 16977 15561 16690 42888 29358 32244 45410 21549 23895 28688 19963 10094
14469 10094 5540 31474 21070 8345 14581 23717 25527 43244 56610 27150 -1450 -3600 53557
14456 53557 38900 41516 46615 45858 42597 17122 -2013 6071 27421 56247 62903 48612 32302
14443 32302 43596 35842 -5916 -13169 9575 11901 -5052 -28783 1497 58481 78466 45504
14431 45504 13520 18248 21155 23455 30068 3659 -800 -13136 -26602 -40997 -29532 -21038 -27451
14418 -27451 6693 44818 45657 27806 54084 27008 15995 18214 22392 18800 39785 33994 26035
14405 26035 28021 33043 44910 27056 10336 -11317 -2262 23792 19578 -6790 12059 16674 52213
14392 52213 42893 21573 7564 -12361 -25551 -34760 -48459 -31026 32500 37015 16776 11031
14380 11031 35104 22831 51330 67672 38495 17293 31976 46959 9651 28326 67781 73799
14368 73799 64130 67673 77543 66261 52069 63437 45581 43995 78340 85040 48944 59432 84439
14355 84439 70619 39521 36643 34316 30464 6889 20002 -11669 -9104 20539 23653 30367 24141
14342 24141 32079 30554 27991 27326 33828 61003 123685 102992 62210 32669 23280 25706 26565 4804
14328 4804 -19340 -23606 20540 28870 14345 13951 10087 30582 44449 5237 -14705 -10965 -3701
14315 -3701 -7306 -10198 7974 42430 38947 29962 26967 10615 9037 37709 60951 58828 55291
14302 55291 46089 1484 -5117 24520 31832 29817 2575 111 30804 34869 15514 -7974 -37478
14289 -37478 -45723 -17302 11528 33232 34400 25089 18881 5251 -21558 -19868 -10481 -8320 540
14276 540 -8073 3753 29715 18248 825 4044 -15306 -11616 -22421 -11375 5512 -6459 -26477
14263 -26477 -14571 -12426 12189 27580 25017 30194 14663 3637 27024 56448 42920 53543
14251 53543 91322 64335 44922 -2380 -40466 -27978 -9682 268 -7300 -21376 -23045 -23087 -6365
14238 -6365 5311 -25344 -37992 -17532 41743 61082 44743 38056 26343 36554 18092 8692
14226 8692 679 -36820 -25909 -25563 -19867 2047 25006 28056 18723 28425 42816 52485 63427
14213 63427 44694 16589 -11414 8256 6805 -16125 1849 20151 7493 -4752 7230 25699
14201 25699 19091 43363 39942 42261 41253 34009 15843 -9097 -27158 -46048 -44690 -31941 -25143
14188 -25143 -22952 -33072 -25883 -36950 -32426 -31603 -17907 -10699 -22805 -3571 18425 41391 26144
14175 26144 5916 -7588 12149 26943 -6755 -43817 -27054 -7614 5391 4233 596 2170
14163 2170 -3626 -7834 11800 25889 40751 39815 23002 37162 41611 41236 31442 9594 -15556
14150 -15556 -3547 1962 22828 24457 -10639 -34575 -45256 -53787 -41954 -48173 -36489 -21639
14138 -21639 -19147 3850 5264 -1313 -4810 24504 32657 -16439 -17574 -14948 25941 66340 73142
14125 73142 76939 79890 88448 72353 14967 24685 33190 40499 32687 41809 54347 50688 46984 49182
14111 49182 53092 63205 58908 48396 17237 -5776 -25340 -11591 7001 2616 9669 17310 25432
14098 25432 1772 -783 10214 37591 24688 65092 91341 109037 69177 13286 -275 6456
14086 6456 5 4468 20725 15936 -4783 -6235 -12352 -6149 15339 60804 55438 61740 33059
14073 33059 9250 10123 -8687 -20578 -17170 -26273 -16073 12954 7152 5862 28747 27297 27443
14060 27443 38702 53177 60105 59596 45346 28518 58362 51521 7009 2631 31106 32609 31545
14047 31545 26244 25085 48100 51812 58589 82474 40756 10820 13276 21540 24689 38543 27106
14034 27106 44608 72605 69998 61608 53558 44836 6184 -8266 -5266 -1912 8586 635 6598
14021 6598 8326 -9059 5643 27667 45039 43474 15564 29797 32671 36463 25953 40737 55922
14008 55922 27967 -1924 -5745 20803 33585 63863 64345 49663 31611 23554 11688 35545
13996 35545 50664 27379 9686 8774 17486 46921 42717 35127 14132 25154 2133 -1877 -4869
13983 -4869 107 10074 25419 19265 38854 46379 40566 38509 60350 39335 39619 30134 15097 -297
13969 -297 -23385 3371 16097 30588 44963 50400 46047 15687 19752 16436 7628 13621 31389
13956 31389 19748 5460 -15189 -22561 -19502 -11171 -11999 1308 -1532 12042 22459 23369 4587
13943 4587 1936 5688 -1628 962 9615 -19054 -23094 20863 28440 6819 -8976 -34977 -45199
13930 -45199 -18153 -7552 5549 -315 -2114 -434 -33429 -59190 -2755 4169 12165 9409 4489
13917 4489 13396 35505 54342 63496 49737 26587 -2651 -9211 -13117 13392 42546 34847 34620
13904 34620 13993 15275 24905 34583 42184 40862 57078 70176 47141 32802 2087 -12133 9483
13891 9483 18096 22545 24701 37207 58965 46206 38424 45303 80700 81134 51933 41966 32626 29301
13877 29301 31201 60965 45618 20831 28260 18300 43343 57994 30051 20374 3555 -6947
13865 -6947 -16308 1104 -1841 1651 16790 36362 36968 19810 4204 999 -10998 -28984 -15735
13852 -15735 17509 24325 21059 -759 17175 30855 11747 1906 -14649 -17327 6782 7056 35161
13839 35161 57580 61793 64390 66789 48506 40348 25395 24394 21303 2000 -9567 11437 34180
13826 34180 24016 25940 -2343 -53831 -81439 -63755 -31650 -27259 -36697 -18755 -34464 -39162
13814 -39162 -12488 11796 35560 32055 46905 28273 5625 -1850 -20676 -14455 -16556 10283
13802 10283 39655 27099 -19525 -23250 7271 38666 27681 -7808 20289 45510 46677 69021
13790 69021 73890 54189 40696 68209 46172 30364 36451 59115 20915 -14820 -52 53381
13778 53381 86187 57327 26609 19776 41822 52506 57235 46359 56534 59997 45569 8997
13766 8997 7477 -1906 -12964 7513 34157 60476 70989 57837 22964 7242 2451 -18085
13754 -18085 -33058 -23106 8126 2347 -5032 -5961 -5449 25964 26738 31029 40385 17667 9994 32021
13740 32021 37004 33249 28382 21362 -10523 -11937 3723 10281 41732 35856 -17981 -21480 -1326
13727 -1326 22839 30884 53855 70210 24502 -8186 8164 -7824 -4668 15756 6255 5786 28152
13714 28152 43305 25555 30524 38131 29676 40925 48300 -2881 -42335 -25385 -4909 -4988 -20422
13701 -20422 7669 19005 -4551 -27661 -22299 -4746 19588 26223 7461 -5125 -12602 -3680
13689 -3680 30551 38899 14366 -14224 -15947 -6659 11836 29369 40985 8045 -21746 -25147 -24119
13676 -24119 -35337 -28840 -22733 1162 21349 36043 34240 39286 45112 39919 38698 30662 34503
13663 34503 42075 19222 7856 29301 57437 64073 58498 47722 47758 52683 71334 95707 65209
13650 65209 35072 34252 69538 95757 109536 54236 19814 53430 92827 84958 72773 69357
13638 69357 83749 74204 39977 35225 41570 41212 26448 20754 40655 59652 68717 51658 43218
13625 43218 43624 27608 22213 38975 80401 90506 63123 49168 75015 57380 33490 38025
13613 38025 50157 43589 55730 102122 90657 55288 44964 57535 90754 73431 76439 73195
13601 73195 56001 47571 28667 27640 44761 53994 69129 80416 93764 133948 113920 63997
13589 63997 26326 20881 46841 79352 90532 104330 98197 97294 82162 64685 46877 58577
13577 58577 77808 55357 59725 58114 54678 80706 57256 46319 70402 59444 38055 53575
13565 53575 56938 58105 58569 79857 76649 65971 49443 50752 27050 29761 42219 41851 10854
13552 10854 22156 28878 45214 46486 42640 42971 49793 66957 63853 45633 39283 41706 54714
13539 54714 78277 87308 77210 79591 80110 75043 44359 44283 39161 71345 87555 74459 73983 70702
13525 70702 70088 94409 110177 110369 96039 94977 98924 69113 56201 69438 81417 67993 91756
13512 91756 98304 87451 58105 37132 46082 78654 73378 52011 37036 28536 6038 20011
13500 20011 13414 23465 43774 51081 60278 56326 50745 68319 82991 101586 110843 82972 67888
13487 67888 54781 24265 20816 21450 -1953 -8610 9269 41721 75929 75702 79986 73081 39796
13474 39796 33384 25743 10605 2190 35564 67960 104104 109854 81466 65364 41379 29503
13462 29503 29643 44551 36979 56642 49655 33271 31720 55160 50062 50251 54005 72683 86816
13449 86816 93578 66401 37292 39686 60210 54378 37303 41339 53947 72020 80111 61966 36907
13436 36907 28842 45186 49934 43092 39436 41083 46313 21530 42759 57945 66730 68044 65860
13423 65860 39452 14583 13171 37064 38846 37379 53491 22596 8686 31626 39665 52096
13411 52096 44563 -3185 -14309 -3268 -14899 -9383 4178 23354 40182 58478 64183 37674
13399 37674 17662 34803 45532 44345 54281 47380 57221 69248 68767 61888 51979 26976 376
13386 376 9719 28653 44300 22088 22812 28825 46698 55492 42932 31256 49419 62764 44101
13373 44101 37594 44350 40677 51500 71536 90712 74723 60339 39429 30937 35489 47415 70646
13360 70646 62781 29161 7300 16215 29023 16563 10036 400 -4268 4784 27874 41561 51443
13347 51443 60071 38303 20228 26907 44416 29421 29302 27576 -3551 2778 52650 67495 50049
13334 50049 41098 65509 52196 38721 80480 107356 103631 99367 75122 57928 29211 16769
13322 16769 21921 39651 72080 61672 55144 69246 49235 21685 -926 10100 25005 24078
13310 24078 13295 9336 2549 7498 27151 39643 43500 38316 21053 16026 47196 65915 76973
13297 76973 78515 48629 73993 89436 69176 58525 55018 58945 63386 58346 45453 42858 59664
13284 59664 71788 77696 81030 76973 105471 103470 46362 42116 37287 37772 32659 30299 42177 35876
13270 35876 44670 42567 40708 44622 89703 93563 59031 58640 91515 96723 72957 66235 61841 35031
13256 35031 13826 26924 36268 41957 60106 82749 81197 97146 93308 100598 79818 46316 20093
13243 20093 11527 43043 81445 76393 64280 71022 86190 93696 100150 104968 80633 89116 104801
13230 104801 80733 84288 90464 79559 77382 81637 96866 90250 60155 45051 39375 34594 41663
13217 41663 52726 46409 49702 54382 53854 60535 58049 69183 57102 51428 57134 49582 45827 46715
13203 46715 73459 89704 82914 74802 87664 117703 105784 110179 133075 162459 174219 187247
13191 187247 218198 215503 184612 148818 122113 90236 76878 78205 67192 48466 76055 106285
13179 106285 109615 111648 116355 118926 117829 97027 80269 82619 60701 71308 84638 99847 100407
13166 100407 114115 91499 101571 101528 94416 136785 138188 154189 190659 185659 198647 214134 216874
13153 216874 248789 310989 346979 402288 454444 492271 527200 491929 405288 354079 299437
13142 299437 240405 205568 191107 187748 158675 142135 144145 138232 120223 108932 85730 98577
13130 98577 104664 114325 147682 135633 123206 122880 109854 107871 109130 109215 133618 136140 131799 134555
13116 134555 134662 128748 145347 151378 149097 170865 200841 222424 275665 328064 379724 427536
13104 427536 460785 508383 505176 450679 393801 355464 341295 345192 348685 363272 422933 518544
13092 518544 607047 719708 889410 1093331 1327403 1593799 1832242 1972014 1925914 1714776
13082 1714776 1403161 1106810 854514 672516 538834 459801 406715 370705 333574 310761
13072 310761 288090 267144 266790 268188 271478 294227 291463 294395 288375 291182 300992 310885 304028 325917
13058 325917 361353 361149 331333 283893 259147 208044 172587 181706 186326 197073 213498 223193
13046 223193 226481 227615 221153 192161 134500 121438 146523 170519 162713 143356 131246 155574
13034 155574 158943 156777 152945 152019 156553 150854 143070 144794 153420 150720 159049 166421 160391 152906
13020 152906 150600 141374 127550 145369 174189 179901 168831 182608 151386 142381 157664 152719
13008 152719 154755 150761 120871 108874 126605 102999 99528 104688 78703 63624 74673 97979
12996 97979 108593 120706 100843 93281 73559 73673 93694 90711 95579 101234 111949 127050 141093
12983 141093 154595 152471 143894 143760 147687 123604 113848 132080 116720 87020 69704 89872 134153
12970 134153 116323 106865 108327 78093 79827 71295 73167 87240 97410 52100 35998 34262 65121
12957 65121 78891 61795 54533 53572 67833 82270 59293 37137 67171 127928 184360 225135
12945 225135 291184 339294 357235 356978 361164 359450 343711 326692 281194 272053 283061 268487
12933 268487 258267 268185 271745 246061 220542 204019 221085 249619 239228 226864 219382 237984
12921 237984 200012 185304 169921 149333 176781 194910 235960 240369 213538 201336 194614 178593
12909 178593 179209 185979 191936 204595 220593 239993 232928 234255 244322 223080 255978 306097 323382
12896 323382 315792 322476 338644 390503 411903 446073 486585 537311 550768 518304 497267 487473
12884 487473 471474 443640 391189 358640 318214 255320 212398 217001 233299 257017 267821 255507
12872 255507 251782 261804 265195 265718 237065 227247 227920 229214 258835 262075 234658 203581 241440
12859 241440 271298 267824 266946 284535 294363 310799 310151 305284 288175 306654 288084 291692 296807
12846 296807 272868 264108 247808 263367 267078 283968 308718 314407 330380 341072 343018 359976
12834 359976 370717 373788 365742 357697 363159 382306 440533 578004 739958 938674 1136988
12823 1136988 1274656 1354841 1342614 1246680 1116360 980971 903152 868959 851511 849388 865030
12812 865030 890486 903477 952080 979419 1047989 1115470 1173845 1216745 1249259 1265652 1255838 1265862
12800 1265862 1253265 1263140 1284597 1248669 1207968 1197718 1194176 1166460 1161133 1149139 1154726 1185483
12788 1185483 1166352 1116199 1050532 951425 878177 818426 766212 729742 760727 766835 748224
12777 748224 730635 707305 726981 741162 746996 743665 747203 760954 764984 770606 791094 821032
12765 821032 838088 903162 1031604 1157284 1297786 1439066 1544389 1602275 1578583 1511393
12755 1511393 1422665 1363730 1350820 1315353 1240425 1176436 1142332 1114376 1080162 1067757 1061217
12744 1061217 1093843 1095994 1110605 1148413 1196960 1189534 1208017 1264579 1291073 1320927 1351383 1350742
12732 1350742 1352997 1313064 1300768 1326464 1365666 1400954 1412651 1398464 1367871 1352873 1355698 1369988
12720 1369988 1382918 1429700 1453904 1446883 1471558 1506324 1539552 1571962 1622788 1675764 1747318
12709 1747318 1810095 1870947 1915346 1944044 1999768 2057383 2111524 2168596 2196419 2223939 2297654
12698 2297654 2395168 2528291 2694114 2854321 3003231 3134907 3228467 3248137 3189904 3107913
12688 3107913 3057980 3035805 3077893 3218956 3409630 3606751 3846914 4146381 4459074 4729453
12678 4729453 4866475 4841765 4691144 4452111 4216419 4093755 4039321 4017814 4055358 4116766
12668 4116766 4192726 4310187 4455976 4653062 4809212 4988806 5262431 5580767 5916573 6262637
12658 6262637 6634763 7055480 7576452 8213387 8915025 9741839 10710837 11886501 13302019
12649 13302019 15019399 17164674 19797812 22948922 26723010 31390470 37448314 45520586
12641 45520586 56447795 71360493 91715004 119273177 155418628 200839337 255368315
12634 255368315 314704208 365747340 388810919 367511384 305692339 229794526 166193266
12627 166193266 122400540 94175900 75896316 63611970 54959953 48609613 43870944
12620 43870944 40224123 37320684 34886712 32702589 30698655 28924202 27482782 26379515
12612 26379515 25533954 24901998 24478586 24270651 24195068 24010996 23475046 22519373 21329031
12603 21329031 20071406 18822447 17642718 16542890 15521533 14575591 13707003 12911204
12595 12911204 12170229 11491850 10850495 10299294 9777212 9286676 8852194 8404569 7954166
12586 7954166 7545313 7180911 6847340 6544293 6247989 5967972 5698427 5431658 5170389
12577 5170389 4930197 4690893 4474173 4280502 4129402 3988463 3847807 3726477 3637451 3551948
12567 3551948 3435781 3333701 3216897 3072373 2946967 2810928 2691679 2571619 2482874 2416558
12557 2416558 2378809 2348392 2322247 2273267 2216688 2167477 2124947 2103984 2137340 2165567 2182560
12546 2182560 2177161 2162725 2115574 2045328 1958865 1901019 1837797 1808045 1784548 1702464 1598843
12535 1598843 1526546 1476119 1428361 1380401 1344932 1319161 1311797 1319295 1332353 1352140 1384506 1389563
12523 1389563 1378760 1348811 1311712 1315040 1336164 1380165 1405917 1382817 1381958 1402098 1416585 1423554
12511 1423554 1435009 1439204 1467529 1484490 1506120 1531950 1546148 1499194 1409890 1337396 1271510
12500 1271510 1219106 1213493 1207601 1191562 1194627 1199519 1221751 1225487 1196599 1190337 1201812 1193262 1198052
12487 1198052 1215182 1220772 1214797 1251806 1248884 1204715 1191936 1168937 1103765 1020533 993407 1028590
12475 1028590 1066208 1109688 1207408 1311064 1389574 1451868 1475163 1513598 1540144 1534439 1553619
12464 1553619 1566281 1590499 1609854 1645147 1648570 1650574 1672814 1702484 1699249 1677823 1680884 1724476
12452 1724476 1769593 1759479 1773654 1772876 1742962 1688437 1629217 1624277 1587852 1557667 1576348 1680766
12440 1680766 1883872 2201082 2504016 2684685 2803497 2958672 3129664 3278138 3425815
12431 3425815 3583322 3779335 4006806 4232497 4550325 4912604 5298692 5745320 6254364
12422 6254364 6791049 7336235 7911269 8498690 9152138 9833894 10623592 11572177 12632326
12413 12632326 13790963 15185598 16913187 19071287 21823947 25357517 30012616 36073584
12405 36073584 43929572 53983248 66515102 81557541 98733798 116650511 132275623
12398 132275623 142031047 143892157 139984601 135783189 134937140 136663459 136856138 130983572
12390 130983572 117064824 97874193 78930852 63564660 52226006 44101702 38240177
12383 38240177 33939928 30705205 28265525 26390773 24888727 23694279 22671369 21823360
12375 21823360 21138399 20548815 19922423 19271717 18543553 17840696 17149528 16466060 15793106
12366 15793106 15093106 14333505 13571658 12801750 12089387 11442288 10850679 10314186 9811818
12357 9811818 9384193 8946077 8531606 8100805 7694353 7350605 7023293 6689436 6317433
12348 6317433 5927081 5561969 5255252 4977981 4702448 4453861 4216852 4011580 3839906
12339 3839906 3654456 3511732 3369229 3226973 3087714 2955268 2828196 2698133 2607417 2500671
12329 2500671 2370445 2245559 2153518 2092032 2012183 1885878 1766411 1689065 1650555 1619534
12319 1619534 1569501 1562313 1552616 1525139 1492592 1446610 1391980 1371607 1345727 1286796 1251005 1240025
12307 1240025 1204529 1163337 1127000 1110237 1054000 1004431 978430 953436 923108 904604 893388
12296 893388 887746 878352 853310 833062 834693 796597 750308 735472 716540 703083 687373 662503
12284 662503 638232 634963 635590 628742 608424 607068 624608 643595 646316 654843 648553 656227 663151
12271 663151 664551 628396 617478 626653 620466 604768 574554 557138 561151 534372 503377 502777 493067
12258 493067 487084 480188 472014 442042 446707 464734 453764 427431 417157 394986 367121 344966
12246 344966 342960 326793 311288 300187 282400 283211 276573 271862 250459 249329 288236 280241 285487
12233 285487 299957 332354 326708 336766 362338 343898 382777 424101 415051 406933 390655 398766
12221 398766 391113 367582 347697 340478 352890 328557 261776 231155 211183 194012 177823 133343
12209 133343 98925 91947 94553 111893 141771 179524 186168 185702 192572 236948 324351 385353 424801
12196 424801 460481 498990 519985 516611 518740 524808 503292 511952 510835 529054 541130 526673
12184 526673 511682 526591 567717 579781 626561 737730 911602 1094792 1291583 1506019
12174 1506019 1770382 2028105 2170023 2147308 1953742 1649270 1362870 1139364 988214 863727
12164 863727 792656 719570 648329 594064 540181 523079 548937 530181 512112 509995 528945 540585
12152 540585 520789 506622 507033 526667 591524 592249 557280 521089 491769 491766 481174 468292 422737
12139 422737 432540 461191 478631 487475 484750 461008 437823 420292 412311 400917 391845 389662 383102
12126 383102 402730 383090 375345 407214 448958 452373 461247 430237 394965 395352 364143 375604
12114 375604 408499 434445 431568 467189 464150 470194 469793 468410 451805 450230 464215 451832 458626
12101 458626 461992 450494 456960 468540 473380 426474 419999 438339 411688 355062 301140 293445
12089 293445 301853 332665 339289 339416 345447 354644 370643 380720 402599 412248 436315 485462 507965
12076 507965 519618 525975 551814 559997 547927 538412 556415 578040 595410 611809 576554 567402
12064 567402 586717 607740 620931 632164 672096 689518 684850 682248 671632 690683 689095 706757
12052 706757 698516 663748 662115 688498 697403 699081 712560 695731 669769 644603 647981 644911 676123
12039 676123 694058 688056 699443 745445 746308 754351 756340 731222 770429 806713 813096 817592 810043
12026 810043 808724 846739 889504 916553 900585 924729 944213 970448 987805 992534 1007103 1050875
12014 1050875 1072650 1102167 1145770 1173192 1189534 1201458 1200793 1217435 1267879 1311484 1351324 1430034
12002 1430034 1487501 1498421 1512139 1555583 1620871 1688000 1743602 1817008 1910984 1991402 2060035
11991 2060035 2150110 2248394 2374823 2531129 2653911 2744623 2791578 2899165 2995822 3073483
11981 3073483 3165647 3235458 3297899 3385818 3458671 3532881 3632401 3752550 3904569 4036225 4204531
11970 4204531 4399248 4593119 4835588 5107094 5411564 5721114 6051786 6413121 6838922
11961 6838922 7274552 7755424 8286936 8894098 9491823 10129722 10845170 11606041 12423606
11952 12423606 13306785 14264064 15245391 16211101 17235657 18235922 19201514 20089119 20916658
11943 20916658 21616081 22154934 22545956 22718231 22671764 22402351 21966301 21393576 20653240
11934 20653240 19819374 18956678 18090549 17211735 16316375 15437496 14569200 13764037 12995187
11925 12995187 12291186 11650319 11072873 10520620 9990925 9516071 9064242 8615903 8199359
11916 8199359 7817448 7480663 7173257 6862931 6556672 6277197 6007378 5762303 5519919
11907 5519919 5280290 5073171 4873081 4667989 4476425 4283787 4133122 3998791 3839865
11898 3839865 3669395 3512404 3367753 3232696 3114616 2994100 2874545 2769172 2655679
11889 2655679 2537340 2458968 2393655 2297178 2203667 2136669 2079628 2014945 1939151 1850362 1766625
11878 1766625 1681132 1609256 1590900 1561351 1523533 1452535 1378063 1332662 1303138 1269694 1205029
11867 1205029 1137070 1112902 1081372 1086352 1084048 1056901 1014640 983886 973664 918495 878600 853444
11855 853444 824444 777958 759377 758228 760239 751517 732523 723824 709200 709215 688903 646455 614655
11842 614655 588773 564860 569469 575261 557967 524372 535603 549121 547381 516957 478886 445343
11830 445343 422367 410574 428928 433693 450578 427541 432949 429022 433705 430056 418455 397709
11818 397709 393789 393412 392628 363768 358613 390422 390805 347240 326239 337470 348720 323673 315430
11805 315430 294462 276905 288454 292659 283739 272643 302340 320262 309703 285364 266447 248673
11793 248673 231144 249792 247336 234478 255053 235710 218039 249851 265659 278930 268537 269297
11781 269297 247196 216512 212361 235730 203243 208655 202083 167051 160377 164434 151343 132181
11769 132181 121507 131644 133035 134239 140629 174137 191745 201128 184200 157276 145797 118669
11757 118669 85556 88263 114436 113851 114244 120560 139070 144176 143117 127025 122255 106695 95887
11744 95887 105674 96891 71454 70898 96014 116010 119350 137518 149033 101114 88140 99871 89778
11731 89778 96055 84808 68620 68305 90316 91954 93022 81288 75752 73558 63477 63640 90735
11718 90735 131726 114505 84952 85190 112348 109789 94048 91725 128409 142897 104672 84313
11706 84313 98710 113465 117940 121062 113393 109615 94099 81525 100308 102700 80805 62985 59676
11693 59676 73575 72389 65935 72871 93008 101888 111385 111474 104034 103343 110895 139531 161362 134442
11679 134442 87600 65326 39846 69636 81366 51708 55961 69424 66233 47720 69121 71150
11667 71150 69983 65954 35418 25551 21993 27330 52036 84831 81162 77744 71273 53489 50542
11654 50542 62707 80344 89123 100051 101263 73826 39172 24721 64837 110312 111033 97740
11642 97740 78431 89530 91069 76426 58787 50303 32970 66566 54112 22111 17399 35449
11630 35449 50437 37157 46556 53169 68424 67990 67965 75226 51938 58669 49171 49342 65257 80416
11616 80416 84587 86013 72703 58243 39141 55153 73079 85154 89422 99261 55861 25108
11604 25108 48460 61621 63819 75440 68005 74785 71882 48788 62816 63637 45068 37959 39343
11591 39343 22177 18178 18285 32262 75935 74377 81688 64176 31989 42134 69056 85296 78177
11578 78177 63908 20690 11225 31549 41421 40621 21470 37973 63399 68242 76937 53151 22412
11565 22412 20813 27316 30859 36076 30443 37840 39907 14642 28656 57903 69483 59252 53974
11552 53974 46087 42318 48386 54031 57585 42689 34502 38753 42178 27879 18103 51071 65426
11539 65426 30475 2749 18819 41262 66660 85939 50512 30809 12515 22948 25722 -3578
11527 -3578 -1260 24053 39443 41235 57251 84468 105707 76341 67741 78094 60132 62204 49014
11514 49014 27110 51943 62525 43325 50584 73406 53720 42529 53716 67153 55783 37997
11502 37997 45723 61950 54747 61487 62746 54237 56807 49021 46485 73695 85141 99331 128199
11489 128199 136068 107134 73529 67753 51092 56798 56279 38013 43227 55032 49573 59751 39686
11476 39686 16903 40322 66744 85434 78438 74310 85809 54169 51684 72282 69599 64298 102057
11463 102057 103826 82235 87124 132901 201304 275396 314573 326112 316640 258789 204035 166887
11451 166887 144213 110856 101565 93618 67558 79132 93866 92160 99235 93480 98992 90996 65926
11438 65926 62118 66414 49039 57966 63819 56445 51783 60406 55870 79831 102745 100587 82415
11425 82415 88849 81101 54807 39068 21165 25312 13708 18972 39096 46064 52099 72943 72710
11412 72710 64440 55920 26877 26626 48181 32508 21283 13778 -17250 -13157 -27028 -34114 20637
11399 20637 49290 87083 64101 7009 -16020 -36356 -37345 8225 35027 29742 5169 -20483
11387 -20483 -1634 17029 36642 50592 51600 54819 60567 57174 45921 51692 71236 83308 54170
11374 54170 35429 12378 8024 11620 44621 64993 59180 51345 46576 47758 39174 24721 30482
11361 30482 -5104 -13239 17907 36360 29755 39285 61557 77110 71509 70158 45885 38649 16071
11348 16071 22198 22169 16412 16807 29781 28367 29201 54348 22189 11001 22854 36793 39634 17053
11334 17053 19192 16342 18493 36527 55908 73139 33208 45026 93536 70817 22235 10793
11322 10793 19166 17150 29045 39585 36370 46285 46218 42001 70712 63298 27180 38356 40314 23657
11308 23657 25364 8685 622 1089 12451 16740 -3784 -31024 -32586 8974 22271 27978 19262
11295 19262 25014 22017 14794 2414 -23614 -34013 -7821 34945 29956 -1407 12661 32583
11283 32583 38214 19669 39902 55895 45638 35672 48481 80603 68217 31996 41541 44470
11271 44470 36315 40070 49034 37268 18861 19174 50051 99244 78879 74736 106306 122346 102798
11258 102798 54232 15059 13645 40925 33252 37075 38610 33736 69644 76377 72068 101862 100332
11245 100332 82093 47707 25849 39039 40158 26947 33987 48115 52266 24323 21589 32740
11233 32740 28225 42112 56586 61608 59609 15640 -2477 26203 27798 10357 29932 48110
11221 48110 63164 74372 57314 82981 106037 70318 14578 -6457 -4688 21184 24672 33584
11209 33584 45836 39713 48314 45738 42779 47466 49376 59308 57583 48702 43674 40991 42597 69116
11195 69116 81276 67452 75614 73304 67436 55823 32619 4687 -2638 22565 19945 -1126 19972
11182 19972 47018 48834 38954 46782 32126 1926 -530 33648 66322 73548 64456 68449 62157
11169 62157 53462 90155 99764 74858 65578 61476 61638 60987 68286 50575 42169 41868 30864 28576
11155 28576 30036 29259 24989 -8873 -4478 22730 25255 29037 34541 27872 55993 24795 21483 24746
11141 24746 26780 36460 49288 56186 64166 72344 62014 75304 70740 59861 58339 49915 65097
11128 65097 51754 66192 108120 131061 153495 186692 207630 198679 243755 288859 294191 295730
11116 295730 282941 240843 204766 139301 114822 125454 78918 53973 81083 78769 61041 55073
11104 55073 62107 69437 80212 91259 93436 77828 72965 74415 68572 54540 43219 45785 34067
11091 34067 48519 64093 73059 87910 69970 47884 56853 44147 18661 12402 28747 76055
11079 76055 74146 74486 63468 66879 72564 92617 78178 58505 47601 34988 32787 50688 54038
11066 54038 55074 52868 68439 70151 58683 54248 60143 55743 58441 43850 42256 30722 18344
11053 18344 17171 -4527 -29661 -2632 37397 51855 34797 26017 37984 68987 81981 94425
11041 94425 108283 126983 96506 77664 85117 110030 141831 172398 166990 174398 210195 206321
11029 206321 163349 141991 136977 147644 178677 174216 201192 234045 266702 290316 290265 280977 252474
11016 252474 230997 188563 155257 140978 121486 120448 150885 177987 196698 174972 146644 133722
11004 133722 127939 96263 59890 59073 74520 71846 92121 126077 129529 87058 75360 65607 44963
10991 44963 49924 66103 62788 68452 80764 90035 91211 81542 83141 79107 75400 88605 92851 72078
10977 72078 83899 105570 85822 80820 82241 77158 58177 47150 59511 76714 73236 83749
10965 83749 82256 88297 93813 73574 74209 68208 54293 55725 68010 81398 56654 51355 52440
10952 52440 73036 85123 68037 61422 67805 76429 75247 90919 82296 106109 159754 145048 97328
10939 97328 102733 128471 107083 94971 109859 106216 85087 79926 107959 137276 111407 87277
10927 87277 110443 129613 104791 96445 121056 127566 126770 131126 110399 139229 141983 178300 195689
10914 195689 213222 191573 178610 174689 184023 200018 202768 219329 221717 247902 261275 281924
10902 281924 299477 309645 269756 230736 197644 224044 213695 194146 181811 175126 186697 181314
10890 181314 181391 153400 127074 161039 184686 183688 179053 166979 169609 174253 171841 163624 143374
10877 143374 142845 143596 136504 138677 110524 104177 89375 74004 70270 95342 109648 131712 124368
10864 124368 124164 113770 84687 65843 48621 42650 42857 52533 85459 111693 149679 173704 167732
10851 167732 153301 135766 118259 109085 108285 89736 71441 47127 42243 51706 38761 72177
10839 72177 80863 69243 72262 74635 61732 60092 80328 76373 61931 45785 53537 68807 79163
10826 79163 81843 90938 68765 65492 68099 59097 51984 29367 40324 44646 40871 47657 45497 20340
10812 20340 21664 41950 67012 86843 86285 73018 54800 69147 57906 45181 52168 80879
10800 80879 80774 84792 87726 98744 105288 103631 92235 81417 104886 139051 169704 180902 155795
10787 155795 138776 142496 140776 115092 118543 161829 178874 167548 188008 165254 152594 171655
10775 171655 192355 155755 137851 137875 168597 207781 199863 145476 106367 113234 110166 99035 117230
10762 117230 135624 154969 140194 142130 142851 147982 160818 156365 129319 121204 91120 96215 120764
10749 120764 131769 139228 146860 165728 152019 139733 136679 108996 115830 121693 131504 144873 170524
10736 170524 179658 134688 123551 94432 89756 144128 208271 175267 136695 161291 196451 185621
10724 185621 187812 178800 172068 190155 202571 189239 198007 207330 210005 196439 193287 190080 182439
10711 182439 186222 196605 186776 200295 226459 197075 162875 188330 191750 229716 251447 206702
10699 206702 210105 241378 237837 236246 213728 215078 261394 252656 244903 234221 242399 232504 217763
10686 217763 232322 231572 237769 228330 218854 228208 229009 232182 245991 256836 268961 301415 284522
10673 284522 294801 323568 368540 414357 452724 437997 419859 396664 363104 345070 361775
10662 361775 365858 368287 343565 335931 332048 369018 427494 450826 434762 433583 440120 441121 435775
10649 435775 433155 445253 444968 466085 497673 515366 511571 519052 541661 564931 569721 622314 673512
10636 673512 715320 739599 752892 820215 880282 936302 972302 1035915 1139134 1250603 1376396
10625 1376396 1531605 1767485 2044238 2379270 2814726 3409794 4114328 4995189 6111657
10616 6111657 7397401 8821322 10225611 11384229 12081619 12240762 12071759 11938759 12179696
10607 12179696 12882963 14132130 15952637 18266806 20884845 23392309 25238744 25836743
10599 25836743 25090119 23565223 22181652 21577471 21934474 23222804 25403777 28236464
10591 28236464 31356057 34083414 35568631 35115670 32658429 29172836 25989633 23742858
10583 23742858 22574683 22420506 23097846 24352660 25794480 26908493 27123850 25954819
10575 25954819 23509786 20538697 17877400 15976213 14813443 14238512 14089632 14184201 14419422
10566 14419422 14467174 14063338 13088208 11674736 10074628 8588073 7380884 6448218 5712127
10557 5712127 5145168 4693854 4377557 4079309 3851610 3654251 3479194 3296169 3119198
10548 3119198 2959798 2774352 2614782 2484236 2353789 2221819 2103575 2031286 1955316 1857222
10538 1857222 1728091 1622163 1520886 1440265 1380983 1304267 1254237 1157483 1071054 1018515 964296
10527 964296 914709 881589 830575 793231 726343 676874 639076 598829 550504 498760 462366
10516 462366 439867 425738 436434 436750 403709 358407 336712 326969 312628 305282 290638 268551
10504 268551 261154 243797 242128 227760 209159 218705 219210 197039 186770 164951 153431 171752
10492 171752 169396 175252 184363 155553 119405 82374 76612 90420 90817 100132 110972 72548 56741
10479 56741 86287 86958 89829 99138 113311 118617 87092 56357 50562 42945 50773 53349 52315 55852
10465 55852 62934 63420 68428 46963 31937 68709 77236 34722 18174 19314 35917 61833 64599
10452 64599 61499 63226 62520 65637 69946 46972 45408 48224 36445 40490 44473 41602 34712 32610
10438 32610 26529 25851 9024 -6178 -25596 -30391 -31347 -16842 -14196 7400 18934 18079 24426 -1432
10424 -1432 -6704 18153 49164 35712 37823 42429 26457 35781 47358 41479 37007 25114 22433
10411 22433 17381 -28255 -41482 -14665 6006 -11255 5558 12801 10776 -8884 -29028 -9291
10399 -9291 34997 26542 20672 27335 45533 59133 88288 64760 41061 54905 59608 38690 28627
10386 28627 15384 32879 30277 -10412 -3251 12229 8989 6903 -6746 -14338 -27313 -19496 22110
10373 22110 40596 61660 65361 24424 15538 46424 48890 28317 37007 49538 48708 48413 20041
10360 20041 -1508 1666 16542 31434 43072 33792 13239 42072 54892 42326 6390 -1382
10348 -1382 38339 35793 55959 47227 7197 1356 31725 16858 -2945 1823 9037 2217 1114
10335 1114 28159 52358 73230 60220 50845 38887 19175 29750 4645 -10972 11957 21431
10323 21431 33812 6087 -3069 -4067 -45779 -34958 -28266 -22448 -11758 4849 34416 44748 45701
10310 45701 19360 9366 4719 4573 -9204 -6258 3379 -2545 -20588 -17060 -27356 -32351 -45683
10297 -45683 -30292 -24926 -836 32823 23992 15719 33955 31838 12807 1860 28424 39667
10285 39667 30523 11752 1577 12890 33325 52680 61744 32999 18371 44757 69849 68583
10273 68583 66581 76184 35925 29846 30372 21375 8238 17944 61909 100925 119948 142220 161416
10260 161416 148100 154523 136375 103443 98444 100771 122096 144984 163531 169449 139721 115393
10248 115393 117363 121434 98488 81947 84800 92935 109152 140049 183945 214180 279332 351771
10236 351771 414294 470438 544073 591756 646284 653743 620541 557612 466423 351529 283603
10225 283603 217290 196945 165182 139736 141678 135527 138079 134804 148072 152573 147357 120800 97779
10212 97779 98801 98256 108555 96649 62482 62012 68601 78285 112992 99583 77903 48311 41818
10199 41818 51717 67046 44683 45666 53597 46714 76299 86524 18327 22274 60020 43376 48468
10186 48468 63193 72143 73547 59423 57352 82241 102508 83347 83372 70272 84363 113549 111044
10173 111044 116321 87793 67466 75226 101496 119996 166255 205883 194577 164853 152917 146843
10161 146843 152093 141442 147416 180649 167732 158181 191119 254175 320841 324621 321399 301045
10149 301045 268011 223266 225899 254448 256768 284672 336343 364604 384874 447181 484802 524539
10137 524539 585951 686159 808172 950608 1114441 1264174 1364123 1425126 1447848 1405411
10127 1405411 1383140 1323171 1208959 1072135 899294 722226 584098 489293 418354 365360
10117 365360 301339 264330 243390 218462 215233 228276 231074 225776 233015 212161 189318 208465
10105 208465 221410 230341 210118 188381 201974 216414 172449 158389 167779 157339 140358 131343
10093 131343 137306 154689 155691 154856 149849 147433 155028 174043 169564 132509 105611 103393 121759
10080 121759 119110 97010 113792 97209 78740 98650 115843 109740 97820 94153 100985 104586
10068 104586 124556 126386 141359 132877 127030 162750 190581 226609 277205 274745 270929 266148 245209
10055 245209 250635 277011 303655 328574 304105 234125 166611 151175 120795 95916 89212 115129
10043 115129 91237 85715 106442 68657 44271 56764 85124 109938 87832 103524 121206 74091
10031 74091 46871 1840 -12329 30676 34407 34463 12958 -26323 -5351 -618 9993 8488 32023
10018 32023 65237 74472 102575 90751 100009 87798 69600 75265 74708 73185 71318 65293 38669
10005 38669 334 -30524 -37663 -2058 19579 25645 7820 8356 5953 -1224 -6754 9992 -4980
9992 -4980 16317 64025 68421 64229 38957 10564 -5577 -5245 22187 39309 30387 34228 37330
9979 37330 15852 3299 28074 39863 32250 45913 55102 37491 30618 30715 31111 6910 -13488
9966 -13488 8065 15317 11222 30201 32314 21575 30578 11422 2686 -5531 2351 17031 16872 2736
9952 2736 -383 18725 31404 -7938 -23983 -21968 -33879 -32501 -30185 -16362 20132 10867 5140
9939 5140 -10084 9799 15876 6863 3524 26070 37043 33207 13692 7281 15222 2151 3742
9926 3742 -16057 -29137 -15573 -24846 -26481 -3540 17964 2859 10505 992 -17411 -19041 -19985
9913 -19985 -28515 -25252 -1375 43723 43111 42118 22993 24496 9666 2180 8806 12846 -7904 -4813
9899 -4813 4680 -3937 -6920 -7658 -30230 -30383 -27739 -7983 -26370 -56272 -33541 -9988 -21255 -12419
9885 -12419 -754 -30366 -44123 -21898 -8120 15366 39961 41904 29055 18436 15324 43724
9873 43724 37940 22781 18504 10669 -1831 -31143 -36772 -43112 -50267 -53679 -27741 5979 27310
9860 27310 37041 34597 49978 64181 52769 31959 22979 18849 21372 30417 25012 8969 570
9847 570 -3307 -4285 1516 -4637 9912 52605 49697 46918 30092 7084 4511 15379 -1340 -20983
9833 -20983 -6798 -4839 4819 12365 16026 15001 -8132 -33925 -33445 -21284 5486 13060 41258
9820 41258 61128 38658 -2538 -43101 -54697 -36572 3729 38628 9895 -24157 -10388 -4041
9808 -4041 -35466 -48154 -30552 -3967 11293 17438 16714 3736 -3673 10802 14422 26236 18222
9795 18222 4289 12778 31985 53627 50329 8550 -28841 -31156 -24393 -2296 14865 -4561 -9815
9782 -9815 -16699 -44322 -23839 -5341 9751 -7611 -18154 -23359 -14716 -25405 -28749 -21130 -54539
9769 -54539 -61300 -33967 13572 28121 -1421 -13158 14850 15312 -5726 -33115 -25032 -41934 -52542
9756 -52542 -27622 5389 26374 35029 23715 13416 -16844 -3967 1458 -13497 4843 16558
9744 16558 19390 44104 38356 14808 21282 2315 4938 18891 30693 23147 6224 -9035 -757
9731 -757 1313 -7469 -17318 7270 21300 15573 1531 -2959 22005 18356 7904 4077 4999 11709
9717 11709 -13566 -45279 -25193 -8494 297 7181 -7612 -34910 -52983 -45286 -37005 -17431 -31894
9704 -31894 -25898 -30233 -26973 4070 -11172 -20987 -8911 -5940 12582 6788 2071 788 -3970 -16837
9690 -16837 -4071 -11304 -12563 533 3449 -8393 8012 41572 21922 -11053 -26086 -17581 -22697
9677 -22697 -41238 -30812 -15494 -4184 -19373 -24841 -20562 -18738 -3312 -7642 17372 22148 19088
9664 19088 14162 19493 30170 34034 33136 31214 37817 59363 67243 87583 102301 121161 109492
9651 109492 56038 18681 9689 31320 16978 -12416 -25693 -40862 -25080 -4518 -25879 -39945
9639 -39945 -22586 1734 12411 -8657 -37867 -39387 -26352 -22994 -39007 -17234 15163 34164
9627 34164 36241 18308 -28662 -31095 -22351 -14731 -1666 -28865 -59283 -44202 -37470 -24603 -25601
9614 -25601 -25330 -3283 25268 31964 1073 -5540 22082 36481 24802 25219 19956 -8779 -1773
9601 -1773 9760 14038 25893 38515 47403 29846 19674 32114 31787 22968 22851 10486 -3590
9588 -3590 -30301 -10248 -8547 6663 4202 -5668 -2746 2759 -172 -22239 -22478 -41001 -54646 -54735
9574 -54735 -27020 -10554 -13787 -20427 -29519 -37772 -46161 -50098 -47786 -13120 -2199 11890 -548
9561 -548 -15545 -26062 -24560 -42211 -26372 -24147 -41664 -9253 -5977 -34278 -41535 -28361 -21906
9548 -21906 -33880 -49190 -57301 -65166 -47456 -16007 -25542 -41160 -28760 -28597 -4620 21350 28548
9535 28548 14652 -6121 -10538 25864 35681 1521 -8209 -9649 5158 6978 7444 3002 -33357
9522 -33357 -59180 -24232 -18606 -26793 -13119 -7793 29811 20037 11877 6378 6696 4396 11897 -292
9508 -292 -27019 -34272 -46999 -80589 -63796 -17349 -1818 -1554 -12341 -14807 -50122 -49897 -34270
9495 -34270 -33780 -49834 -40906 -11610 7 -7740 -50566 -57211 -22984 8045 11466 -3764 -50401
9482 -50401 -75782 -76866 -46732 -36232 -74782 -78113 -55763 -47840 -53924 -38213 -18913 -11105 -27011
9469 -27011 -12342 -12762 -45891 -65522 -43844 -35013 -7022 5438 4017 17687 33303 21897 14840
9456 14840 651 -5135 -33253 -28878 -27715 -18191 -13237 5290 -1928 -3284 -31177 -4514 4568
9443 4568 -263 -5994 -9976 -14499 1110 -23193 -10212 10205 8048 -7301 -6621 -22505 -49334
9430 -49334 -34189 -30541 -20245 -16794 -35208 -59353 -29751 -10462 -6888 39382 50766 21982
9418 21982 1127 -10402 8041 30791 55893 52655 27120 22257 16499 -14654 -8120 3381 -6614
9405 -6614 -21109 -22844 -25413 -8452 -3188 15427 32088 36375 21518 15699 18170 -12111 1628
9392 1628 2901 -9437 -8568 -3225 -10663 -34477 -27782 -33415 -14180 -13625 -11374 -8024 -18034 -14949
9378 -14949 -29768 -12461 3632 6666 -8340 -16529 -10986 1189 24759 15005 -19681 -22439 -13395
9365 -13395 -1363 -7656 -7295 -35955 -33711 -21990 -18328 6283 5097 -33736 -34348 -12041 -5397 -12551
9351 -12551 -15095 -14207 -26792 -62242 -71532 -25334 -10337 -18819 -28562 -13827 -1198 8603 12682
9338 12682 3294 -25736 -31648 -36852 -14137 4992 -8504 11797 21190 20216 19400 -9475 -22316
9325 -22316 493 24532 41228 37956 27828 30206 22496 34566 50872 29855 8220 17529 15051
9312 15051 -14103 -11253 -15848 9435 -1048 -9796 -7091 -3189 -11965 -13234 -20172 8910 26213
9299 26213 29510 38579 29617 9650 18185 10968 -2867 -26829 -32739 -41004 -53275 -29062 -3241
9286 -3241 20 6946 -4495 -3391 -15815 -35797 -32918 -8911 22828 40114 19714 15098 -26983
9273 -26983 -63557 -51909 -25608 9668 29664 26151 13949 15061 16700 25809 5784 -15600 -9031
9260 -9031 -15832 -16887 -11718 -2473 -9882 -14690 -15861 -7617 -2001 7025 4444 -13050 -7143 -23130
9246 -23130 -35775 -38534 -39593 -54800 -55811 -67338 -67683 -47450 -32684 -29733 -3855 18283 16729
9233 16729 26259 32602 34067 5197 -12495 -22410 -28499 1589 26404 34213 39353 30870 24834 17302
9219 17302 11129 10539 524 -12656 -2705 3991 4785 -6033 -2870 -4234 -21630 -22015 -27604 -20526
9205 -20526 -31703 -31576 -27734 -8478 -11539 -9539 5346 -4583 -10770 -35646 -59541 -57492 -48355 -48445
9191 -48445 -22498 -4131 -13039 -27600 -12756 -8881 -57674 -70331 -57745 -52300 -13758 26691
9179 26691 3735 -1181 -1458 -11851 3744 24628 -8468 -11352 -10461 -10235 -16013 -3765 -1956 9792
9165 9792 15801 16049 -6601 -9947 -8759 -13518 -26509 -15046 -9336 -23840 -16848 829 18709 14211
9151 14211 -10872 -39217 -28231 2010 23057 5220 4870 11632 -1798 4489 14627 31537 37652
9138 37652 12354 13107 7676 7005 -19050 -21713 -6112 -5469 -9905 -708 -18132 -44565 -46251 304
9124 304 -6792 -11684 -15084 -24603 -23311 -52249 -44974 -24031 -22105 -15668 532 20038 23988 21302
9110 21302 -3186 -18725 -12242 131 -11229 -8306 -34324 -19279 -14327 -7594 -16210 -8502 7139
9097 7139 18218 22691 -4963 -15340 -33630 -38462 -31314 -38174 -18353 -571 8270 1243 -28021
9084 -28021 -19064 -16812 -19890 -37567 -22342 7683 -5412 -10187 -37664 -58068 -48450 -25681 -28245
9071 -28245 -37688 -14175 28109 26738 40969 31737 4944 -2485 10592 -9840 -19155 -19126 13675
9058 13675 16513 36358 29148 43339 41203 28253 37144 10317 2682 14134 27375 54262 24569
9045 24569 -10687 -199 19330 18050 17452 -7906 -11962 5962 7519 -2161 -19759 -20856 -10918
9032 -10918 -7713 -10171 -23716 -4680 15882 8536 -690 -25037 -9248 30120 49364 26829 -9252
9019 -9252 -10741 -4548 10237 10555 7993 -5271 -9269 15661 19398 7730 -26843 -54648 -23212
9006 -23212 -947 16843 15051 27296 37268 24861 -5551 4456 -4642 -5284 -16420 -12554 -13991
8993 -13991 -4 -11741 -26098 -16195 -35210 -30267 -28257 -43256 -31940 -28839 -14530 -99 -15676
8980 -15676 -4170 16567 14121 -16715 -10447 -2781 3216 -4376 -3713 -15396 -25358 -10449 4996
8967 4996 -18658 -1960 -15307 -27375 -28807 -30712 -35538 -65823 -57357 3691 20107 14989 21509
8954 21509 6475 -8481 -20876 -12579 -29399 -58680 -70339 -57587 -57829 -55397 -40313 -34800 -67164
8941 -67164 -64024 -77275 -60558 -66048 -73149 -72322 -42805 -14187 -18955 -18029 -14308 166 13029 1672
8927 1672 -21255 -5602 -19099 -13325 -17179 4449 39506 21468 14485 4905 4594 32893 37933
8914 37933 33519 30701 26541 11216 2432 -22078 -16949 4616 -3296 -10214 -10785 -7413 -23435 -30305
8900 -30305 23452 57844 63312 53957 31627 -2440 -13642 2637 9835 7464 -19457 -33966 -28635
8887 -28635 -15564 -1443 3265 -7584 8923 -6859 -11378 -24910 -27971 3210 29773 14858
8875 14858 2424 -8465 -12393 -37679 -21868 -16410 -2748 -9 -1335 17148 6232 -17193 -13708
8862 -13708 15901 8480 25901 56912 51842 23983 21833 -1288 -32772 -58315 -53480 -53819 -37188
8849 -37188 -12677 6752 -6612 -23981 -26876 -22218 -14840 -444 7591 7324 -10311 8594 34983
8836 34983 65246 38242 4586 -1330 -7856 -19447 -13319 -23384 -26148 -39328 -43242 1163 32218
8823 32218 22413 14394 28590 21502 35925 30806 31850 29069 33740 21075 -7772 -9084 -7097 12996
8809 12996 6439 23028 -6602 -21275 -14179 -17393 -22181 -12235 -1108 14749 23059 -5542 -10363
8796 -10363 44249 70456 35905 13909 6205 26331 7759 -31544 -32575 -49684 -36279 -30092
8784 -30092 -40976 -12139 -10306 -19207 1464 19452 23884 -4930 1586 -410 4646 28049 37191
8771 37191 16600 -25643 -34714 -9019 -14442 -17154 -28082 -28347 -21360 -10882 2992 4317 -557
8758 -557 9162 14853 -6522 -16559 -10594 -6745 7217 -8716 -5166 13766 5669 10210 21944 29139
8744 29139 3173 16091 25676 36025 39676 61130 63703 45504 -1416 -17948 -2535 -4244 -2885
8731 -2885 -11149 -56863 -45526 -37580 -20159 -6076 1356 -7303 -7142 -7492 -26172 -12178 2703 42344
8717 42344 46331 35077 7829 6568 38837 74632 58209 32565 10082 14852 16311 10053 6624
8704 6624 10942 -3601 -18876 -44110 -45476 -18972 13533 24332 39679 28187 6951 8790 35237
8691 35237 38310 17645 2942 4497 -10455 -3154 20993 17182 9076 -5719 -7751 8728 3319
8678 3319 -23682 -16944 -2901 3726 18898 -13210 -37200 -31069 -32501 -18834 -22414 -22109 5659
8665 5659 16557 21558 51097 47335 28920 39246 45960 52625 48865 22508 12639 -1073 10408
8652 10408 15983 9979 9561 21846 2846 -12124 -17799 6207 29961 40579 38734 25584 3606
8639 3606 -29319 -33464 -30016 -53335 -38987 -14348 10336 22788 55339 54025 21199 -8003 -11778
8626 -11778 -4519 -8623 2734 19330 -3371 -2336 -23517 -24288 -1697 -18881 -12769 -1207 11460
8613 11460 30642 52115 59822 64423 46590 23598 11655 6533 14321 49533 48930 24477 16486
8600 16486 2373 -34190 -30676 -4313 -14434 -1917 -16652 -1390 20809 59572 75490 38729
8588 38729 -19065 -55896 -43408 -44137 -12620 32536 19968 -1112 771 9766 20324 10793 -592
8575 -592 29242 45575 43306 37610 50748 32654 7242 50033 71725 46292 33092 63384 94842
8562 94842 77619 82464 119735 165961 222524 268861 317964 402296 448407 429916 320263 241901
8550 241901 172686 155149 138053 133112 114250 85941 78288 78112 72091 39523 38013 32505 41106
8537 41106 20800 5242 38783 42842 51371 65643 72619 63693 55232 50280 57257 40057 24576
8524 24576 33439 48025 69397 75449 104821 136164 149618 165980 203917 260009 326191 432020
8512 432020 539621 693827 839388 893630 812192 615291 421701 272616 195255 164345
8502 164345 135811 106726 101905 88751 79442 56672 59026 93042 94424 79701 71537 72965 93046
8489 93046 107172 85099 52845 55327 80784 90861 73521 38964 31148 29094 10184 25495
8477 25495 35454 53276 79205 126435 168658 164499 151373 174643 207740 233602 290604 353929
8465 353929 417906 446734 403802 319873 260619 183599 113137 99167 112852 96071 66837 78596
8453 78596 36561 49116 77037 83417 70236 47835 53023 102212 112315 123921 113852 114530 152797
8440 152797 141390 117946 129132 150559 142374 88883 63948 65866 72956 65022 43698 34096 24685
8427 24685 32003 68436 68911 52270 45450 27295 30858 17510 -9028 -18595 -33793 -30014 -27257
8414 -27257 -28625 -15822 -164 22622 9507 -12320 -37996 -56680 -55953 -27297 4930 18839
8402 18839 19404 17414 14536 38604 57099 51631 35284 47682 46049 28603 17178 8412 7990 22816
8388 22816 47527 58337 55459 38244 -6828 -1769 9111 32095 58017 45134 41434 37434 30600
8375 30600 44307 55948 47086 33436 39645 68699 57293 50462 28099 12169 6572 1110 -2008
8362 -2008 21218 55125 53614 33298 23499 28028 35058 30471 45677 58704 85719 123325 183261
8349 183261 210682 279073 335194 372538 424179 383764 277997 181678 107462 56754 44961
8338 44961 35151 63949 75270 45500 25799 17847 13919 -3416 83 11469 28291 25927 -10049
8325 -10049 -28038 -18759 -12655 1302 13147 12699 -3938 16902 21861 26118 21968 39265 53365
8312 53365 40560 46759 76887 107729 134725 176646 228233 302819 408829 528284 697644
8301 697644 795587 809961 663859 445669 292094 167609 75016 58541 65496 41196 13979
8290 13979 16443 2934 10381 19952 35843 4362 -6342 17659 25221 17495 29861 64124 67166
8277 67166 80696 73789 39692 28999 16079 6425 28510 34902 27450 21425 20005 33034 63774
8264 63774 74927 81669 95257 120679 190938 270591 353119 413506 422582 337568 216092 140279
8252 140279 99825 61379 40567 37853 34174 50490 55967 62672 59592 50834 52341 66654 44436
8239 44436 22494 12340 9211 89 7884 45439 49033 24373 -5556 -5978 -9622 -25230 -37082
8226 -37082 -16964 -28647 -35606 -46672 -41930 -16837 19012 285 -26316 -8408 5798 5981 36843
8213 36843 25853 31753 35810 56885 73976 45740 7909 -10054 -30815 -19285 -2612 9057
8201 9057 -3267 -38360 -41922 -48891 -67482 -51679 14636 28691 -9847 -9286 -9112 -7493 13998
8188 13998 36082 24352 -11467 -18239 -19095 -15900 -25558 -15308 -15859 -23033 -12448 -22583 -10723
8175 -10723 4672 -11465 3253 1463 -42533 -39861 -62147 -57361 -30999 -12312 -18661 -19162 -25663
8162 -25663 -43720 -17846 11614 23017 23302 10791 11617 41599 75944 82205 42758 6025 -23369
8149 -23369 -55059 -37739 5650 11143 -5917 -12808 13190 27469 21832 33006 33816 33293 21655
8136 21655 41232 61874 72230 63285 60953 31827 -11730 -7818 -10247 -19972 1979 13728 4188
8123 4188 792 2724 -5181 -25505 -43184 -37524 -6050 -12466 -27439 -21822 -32668 -56116 -66736
8110 -66736 -55650 -51274 -28607 -2644 26665 37449 32052 -21941 -30764 -50682 -58822 -38155 -10403
8097 -10403 -6978 -33044 -29134 -24823 4242 14126 40763 46827 19900 19103 14370 9667 17710 30835
8083 30835 24875 31228 14829 5155 7261 5360 -542 7145 -7322 -16856 -17540 -2502 -23395 -15094
8069 -15094 5872 -18310 -15392 -19296 -26754 -14215 -7813 -2619 8520 15136 24706 39574 8434
8056 8434 -6148 -6529 -3871 -45741 -35731 4567 -10367 -20250 -13656 15385 16891 -5782 -38833
8043 -38833 -33977 -18223 -14689 4323 -20927 -30847 -26546 -18664 -12426 -3987 19437 -12274 -36524
8030 -36524 -43321 -29690 5045 16756 10108 26191 -1930 -20204 4668 34784 48546 25553
8018 25553 -17475 -41446 -29684 -31581 -7361 -16996 -34380 -49206 -23769 9250 1872 -8345
8006 -8345 -28215 -42660 -38669 -22072 -18605 8761 22977 53542 25445 -27811 -38175 -29680 -29424
7993 -29424 -23070 -8277 -25872 -26474 -37882 -28964 -46759 -59547 -39041 -31013 -39701 -17321 7327
7980 7327 4530 -33737 -38085 -16976 -32676 -66388 -62851 -61282 -49653 -37671 -63573 -50733 -48823
7967 -48823 -56434 -97057 -86597 -40253 -37609 -38373 -13693 -20843 -13006 -5260 9281 2424 -5385 -830
7953 -830 -12512 -23257 -14956 -32760 -39284 -32025 -32196 -40162 -31880 -1607 12089 6795 -4936 -18430
7939 -18430 -16248 -37267 -20932 1402 -12172 -28420 -44200 -36330 -25820 -29584 -48516 -43892 -46833
7926 -46833 -49933 -55799 -54575 -29064 -22728 -17357 -17120 -16251 -19655 -16195 -5771 11838 -16172 -23401
7912 -23401 -17930 -48873 -76154 -88184 -66088 -55045 -35369 -35642 -24797 14930 9882 -15392 -9659
7899 -9659 9218 22391 20230 27769 21725 10165 3641 -26572 -55530 -41063 -24349 -7694 -5348
7886 -5348 -30066 -49995 -46301 -42687 -54056 -55167 -61713 -71141 -66812 -51112 -32417 -6891 15608
7873 15608 21304 17176 -4226 5027 -13337 92 13616 4873 -12861 -30518 -42362 -42466 -42244
7860 -42244 -27697 -17932 -25138 -43268 -25317 -13291 -17439 -28091 -9007 -7289 -12002 -7700 -28743
7847 -28743 -33193 -23083 -12335 -47517 -72639 -79172 -68635 -66909 -59918 -16751 15633 31197 25934
7834 25934 13829 7148 2238 -25551 -29967 -57769 -64140 -66001 -62379 -77077 -50665 -18227 12358
7821 12358 26124 12322 17940 7724 28515 13364 3022 8604 -841 1944 13409 10405 -2907
7808 -2907 15000 29738 36096 19352 7015 -19670 785 13326 8453 23115 30885 33393 13025
7795 13025 -2544 -37127 -51899 -18233 -7275 -18050 -13392 -21884 -15150 1065 -21663 -20281 -24848
7782 -24848 -26634 -30700 -15104 -12063 -20858 -25787 -12480 -2069 32335 44140 35701 22332 13908
7769 13908 15373 32197 16293 -13188 -29413 1616 -1428 -11067 23205 45303 55232 53359 72533
7756 72533 89124 71833 34443 21882 -17847 -34568 -46226 -26494 -2355 -16833 -20859 -19852
7744 -19852 -48586 -67789 -54663 -31108 12759 12218 16915 21451 24395 -7798 -23346 -13095 27113
7731 27113 47757 17496 26719 43532 30989 2135 -22194 -34938 -46662 -48740 -34885 -29327
7719 -29327 -13498 15982 -4445 -20148 -55601 -41539 -40183 -52634 -46154 -61937 -43617 -3598
7707 -3598 -6863 13917 27127 3935 -1113 -5412 38610 42499 27191 5818 9929 -20459 -53012
7694 -53012 -57689 -46593 -23569 -4272 16901 25105 36312 -2182 -8316 -5322 -14924 -18728 7991
7681 7991 1345 -23357 -38989 -43397 -40152 -33587 -42946 -35359 -30295 -31750 -7629 418 12524 4435
7667 4435 -3382 -16063 -30628 -34838 -55393 -34171 -13464 -7808 -9000 -19405 -44566 -37766 -5614
7654 -5614 19988 24081 28 2051 -6470 -26632 -35082 -39518 -31716 -24860 15740 -9402 -27197
7641 -27197 -23666 -20170 17373 -17022 -39291 -16543 -3072 -3349 -4051 3789 8494 988 21987 33152
7627 33152 22646 22694 26654 42165 50268 7250 -2799 32097 21795 20429 5363 18404 13874
7614 13874 -30502 -30453 -20278 -4947 -7243 -30225 -21396 33197 35044 -9534 -22596 -13075 140
7601 140 -20733 -31834 -9520 4141 -14404 -26692 -15661 6283 11694 13993 2224 -26630 -57883
7588 -57883 -64125 -67365 -68461 -57890 -67196 -47458 -10997 5518 -19682 -23183 -24270 -11577 -35195
7575 -35195 -79124 -78857 -41915 -9002 -7475 -10621 -4015 18891 14981 -1322 -4951 -18239 -4316
7562 -4316 2192 -22254 -1528 44097 53289 40137 30228 -2120 -38597 -56791 -58743 -20753 -8069
7549 -8069 -3612 -16183 -13907 -177 -19287 -15788 -186 13806 22749 26657 31199 12567 -2284
7536 -2284 -271 5416 -252 3598 -7544 -36631 -52442 -33194 -34250 -26716 -27293 -11800 14480 27258
7522 27258 13550 4125 -12737 -36628 -51505 -46637 -12601 11972 -2915 -21894 -23808 -7212
7510 -7212 280 8364 4205 -8751 4488 11339 -19090 -11246 -2571 1045 2644 -6678 -18479 19801
7496 19801 38888 47967 39303 20893 28476 36486 21459 31512 23852 9645 -5015 243 -4086
7483 -4086 -15516 -32921 -24343 -32222 -26184 -4892 6188 5286 -18453 -32702 -30828 -26552 -22326 -3304
7469 -3304 7227 -4098 -5201 -30300 -39030 -20773 2153 24890 6576 8952 7056 -27942 -38634
7456 -38634 -31905 -22208 -2338 13164 -3451 -23192 -23040 11870 24096 34252 20725 -2449 -16793
7443 -16793 -29367 -16872 17913 12726 -11088 -27208 -23765 -17456 -15050 -63697 -80618 -27001 7902
7430 7902 16960 -7022 -36301 -24532 -20556 -18669 -29089 -43954 -60736 -61860 -44524 -23637 -13731
7417 -13731 9986 15165 -1741 -1291 7636 -39507 -69553 -73053 -61395 -54887 -39496 -30919 -21881
7404 -21881 -32333 -23682 12560 25124 3516 -9455 -1875 13668 15251 10039 -3883 -20161 -29321
7391 -29321 -18086 -25634 -65859 -51110 -23769 -14903 -20165 -42892 -55474 -70486 -74728 -52728 -23861
7378 -23861 -25036 -45593 -25480 7864 9854 378 -26029 -25173 -29378 -6733 -4466 -48514 -50556
7365 -50556 -23112 -17456 -39024 -31902 -25362 -7341 -9790 5138 6062 6729 -21481 -14880 -22475 -5845
7351 -5845 9420 3670 -862 -18069 -28130 -21663 -18747 -10653 11754 35417 44185 37566 26503
7338 26503 18753 17956 13640 4652 6115 -1639 -29304 -25726 -33108 -31818 -44529 -35243 -12881 -27426
7324 -27426 -22828 -28363 9809 24105 10593 -2344 -8977 20448 60544 60894 55160 44124 21582
7311 21582 -9190 -29619 -25671 -20678 -19047 -10617 -19884 3175 4773 6726 -17175 3090 16889
7298 16889 8267 11334 24691 32547 34577 8323 -12868 -26137 -16645 -27962 -40785 -33361 -801
7285 -801 16568 15351 34564 30448 41329 49473 20001 -6349 -19038 -29805 -35463 -20583 7673
7272 7673 17956 -268 -23393 -40184 -47147 -70004 -61258 -41057 -62153 -26767 -26179 -37887 -45635
7259 -45635 -41440 331 -20793 -31738 -41409 -48032 -41710 -3923 19987 32766 5390 -1355 19909
7246 19909 19489 -2621 -6428 -14057 -20469 -25455 -22502 12027 32761 17360 10736 14358 -7047 -21304
7232 -21304 -8245 -20364 -4737 -989 691 2317 -13788 -15716 -27340 -8191 -6900 -18721 -38189
7219 -38189 -37981 -13966 -42404 -57646 -30880 -9321 -5888 -11794 -14090 -7130 -2004 -6920 -12160 22069
7205 22069 29992 10949 -2461 -668 -17610 537 30857 -5750 -30184 -17150 17689 -16499
7193 -16499 -48853 -16364 -31552 -19205 -28152 -59510 -75352 -57191 -66295 -60658 -45641 -23492
7181 -23492 -1334 -9043 -5690 -2437 6897 -2451 -1788 -6421 -602 -8525 -18280 22982 65518 27962
7167 27962 20575 53938 22266 30935 17200 -13516 -33198 -9083 -6285 -1503 30166 24784 2997
7154 2997 -23266 -21593 4811 13105 25891 15990 -9931 -49288 -55166 -32268 -28890 -49233 -37932
7141 -37932 -36805 -46435 -7474 25110 19314 11326 -18785 -57487 -75528 -42846 -18623 -21011 -10469
7128 -10469 17673 -5516 -19833 -21844 -30005 -22262 -21133 -19558 -17512 -21540 -14703 -43016 -61607
7115 -61607 -51550 -39846 -60237 -51867 -26352 8795 11110 19246 15029 29941 48455 32095 21807
7102 21807 24542 1326 -10385 1168 21463 4509 -24701 -12783 18155 18081 -3344 -5227 11989
7089 11989 15772 11207 -41521 -53308 -43152 -15982 16605 3946 -21702 -16035 -33133 -22134
7077 -22134 -8175 -25790 -388 51980 47414 63603 51120 20422 2215 4689 -367 14909
7065 14909 13032 233 15916 24686 25715 18272 17502 43832 43176 21180 4192 5305 15662 6490
7051 6490 4687 18463 18667 -20693 -46224 -26862 -2953 -2126 7152 23967 3181 -27144 -30928
7038 -30928 -13643 -4984 -9066 -2494 7219 13206 -6557 -77 35368 33637 17747 3589 -28634
7025 -28634 2857 9727 -391 -6397 6132 27721 14304 13283 10927 19349 13655 8220 -2228
7012 -2228 -7190 -24269 -36462 -49329 -42529 -63403 -64591 -31187 -14326 -9666 4471 -529 -33578
6999 -33578 -38597 -8447 -5048 -6146 -12727 468 -12394 -24168 -21281 10450 28524 29479 736
6986 736 -5158 6715 3926 -639 -5003 -19527 -13116 -17448 -8175 -14600 -28783 -18845 -37288 -60837
6972 -60837 -50486 -48898 -56737 -50050 -49597 -35805 -31386 -10718 -1112 -13931 -45779 -32237 -15868
6959 -15868 15261 28389 8258 9278 1321 -9258 -12515 1874 -16116 -4018 19423 30952
6947 30952 23976 -11002 -22657 -402 24793 33188 25719 -5851 -8574 -18521 -31004 -32780 -42359
6934 -42359 -67854 -91284 -73227 -33407 -3174 -7503 -129 6 -31400 -49641 -25939 -11943 1289
6921 1289 14568 -3808 -2776 16906 23017 5616 1967 4742 14183 11919 -6912 -14903 -30583
6908 -30583 -21744 -16051 -17014 -3586 3469 -6615 15693 -1466 -24461 -4856 16696 21722 22333
6895 22333 22900 26470 36918 47312 23675 -15586 -11796 -511 5791 10082 14835 3875 -3700
6882 -3700 -17545 525 33132 13360 -6671 -8662 -30659 -34487 -31991 -51516 -48087 -33803 -13086
6869 -13086 4129 17554 3531 -1521 12058 19342 33662 12791 -1064 -16792 -20081 2045
6857 2045 29603 55250 55699 14291 7321 -23782 -57190 -58049 -43120 -37036 -13798 25306 34221
6844 34221 13516 19287 16017 6771 -22598 -25572 -2181 20858 5597 -22324 -37649 -25668 7602
6831 7602 4795 51 17437 65605 87803 104730 84520 81457 28499 -16003 -25364 -10102 -9556
6818 -9556 -26227 -38674 -35238 -28846 -13273 519 -2001 -5091 -1622 -42449 -55444 -41462 -523
6805 -523 23135 21760 26198 35836 9874 -8583 -22842 -19910 -6167 5831 -17400 -26490 501
6792 501 -34307 -43795 -41361 -48161 -41580 -59101 -38472 -48580 -52018 -76137 -70223 -44651 -31687
6779 -31687 -24263 2948 28072 15462 25717 32580 13384 -23619 -40817 -39786 -54198 -64351
6767 -64351 -53164 -51586 -32755 -22322 -18659 12609 29115 20961 -6023 -15683 -24820 -4639 -19713
6754 -19713 -25482 -15924 -12170 -27852 -29144 -29617 11671 25571 -10871 -10189 998 -15180 -8183 24085
6740 24085 10538 12537 -2919 2176 21265 18780 989 -37384 -20376 15131 -3980 -34953
6728 -34953 -41782 -37263 -40496 -24465 -36357 -57843 -76197 -84859 -68432 -53840 -40236 -9249 17183
6715 17183 12567 -19111 -52387 -51560 -26813 4421 -1898 -23377 -52510 -39568 -43187 -17588 10633
6702 10633 24071 13837 -4995 -17765 -3314 -212 -4889 -9145 5748 5933 -9898 -71280 -70218
6689 -70218 -14286 7534 -11306 -42954 -22166 8999 8346 -20171 -1484 25515 39444 35281
6677 35281 8288 -6260 -17747 -9452 1719 7497 2116 -2333 23363 -822 -28018 -48512 -20345
6664 -20345 14740 16084 16208 12938 -11660 -7573 -15380 3215 22522 1706 -24099 -31510 -15301
6651 -15301 1838 -7948 16035 21210 -21705 -38812 -21235 -6464 -10825 -3845 7276 -4550 -7799
6638 -7799 7326 -1171 -17393 10637 40652 55760 46225 36207 63400 78102 47310 14349
6626 14349 -3979 8592 48881 19643 -20733 -25137 -29585 -24759 -24874 -33012 -49590 -64044 -80502
6613 -80502 -53825 -12766 -26924 -47856 -44984 -25530 -24948 -1259 -39330 -68328 -69354 -47590 -41479
6600 -41479 -28630 -2777 -2271 -1125 29592 36518 17849 10190 17272 6613 -1820 -15307 -31493
6587 -31493 -34892 144 33053 2429 -19037 -1042 -18181 -30893 -45031 -22704 -19922 -34354
6575 -34354 -6431 13248 20217 2429 -7792 -3102 -20790 -20866 -11219 12520 15883 13511 15121 12112
6561 12112 5481 -16136 -45864 -31758 -33115 -29669 -20345 -8269 -9214 -6306 -3366 -8414 5587 10838
6547 10838 22105 21353 -1873 -7918 -27884 -67631 -85447 -54787 -41315 -59440 -73351 -74319 -63093
6534 -63093 -60590 -82512 -70145 -51097 -56648 -52844 -34430 -44534 -38175 -14849 8381 29004 22432
6521 22432 -15658 -33791 -48439 -54423 -42594 -34669 -973 -4028 -22736 -31804 -5572 10939 -4229
6508 -4229 -23655 -12197 -4222 -34861 -26554 5979 -7606 -22364 9976 23138 976 4294 -2162
6495 -2162 -12903 -10447 13642 20252 4638 -4316 -2145 9151 13201 -10092 -13043 -10495 2921
6482 2921 14488 11075 10640 15569 -24609 -23157 -3760 6819 -3626 -16738 -13089 10434 6458
6469 6458 10413 21488 20164 21228 -17529 -31307 -24266 -7441 12670 11940 -21176 -19313 4285
6456 4285 3359 -10019 -27136 -27009 9396 38679 25328 40121 59056 30339 9866 -11660 -22365
6443 -22365 -14466 -18967 -37293 -34727 -39251 -18896 -15389 -12156 -29171 -55284 -34720 -1853 -113
6430 -113 10782 9303 16085 20731 40237 43437 29079 19086 2673 -2360 -1641 -6540 -17688 -12302
6416 -12302 -18779 -13605 13446 25646 1743 -13483 -12476 737 19613 -5455 -13905 -23837 -2901
6403 -2901 -7191 -21124 -32124 -13055 -35246 -39588 -46413 -45857 -55717 -50439 -30511 2150 24255
6390 24255 14654 -16501 1371 25566 -31875 -51682 -30221 2023 -1065 -31911 -31351 9993 17433
6377 17433 5189 -11270 817 16157 13136 17981 28984 19844 4488 -1674 -7458 553 13810
6364 13810 43849 52001 18314 5534 26532 15571 14453 14690 4342 -2736 -9465 -14965 13714
6351 13714 1024 -9723 -10678 -13163 -7473 -306 -6429 -37589 -19613 4941 -977 -17393 -3717
6338 -3717 -29639 -54105 -31412 -15384 -26594 -18035 22396 39302 8591 6837 -4406 -14533
6326 -14533 -27309 -12243 3735 20183 23068 6932 5149 15367 10436 -13098 -11370 -2840 -2420
6313 -2420 -23283 -22246 -33415 -41615 -47282 -24315 -9728 -19061 -19347 -3898 10498 -9378 -26545
6300 -26545 -9376 16051 27392 44377 33107 5847 -31023 -19143 421 -29103 -30704 -28893
6288 -28893 -11813 3535 30471 25958 5710 -16486 -10209 7911 -12505 -47313 -37863 -42606 -35015
6275 -35015 -58945 -43411 4417 7808 27732 10132 -13541 -6357 25102 44719 65463 52662
6263 52662 32036 45352 40600 34405 16409 7142 -9319 -19299 2976 1901 -6920 -2826 17559
6250 17559 35197 20729 13236 12592 -5015 -34111 -19928 -25191 -60581 -56838 -15942 -9625 -4590
6237 -4590 -3776 12244 45972 37579 16813 10118 16744 -6987 -32672 -26821 -23099 -22804 -9329 -32995
6223 -32995 -32036 3222 296 -6563 -14003 7864 30935 20554 19755 13627 -22730 -27198 -5065 -9889
6209 -9889 -10884 -17319 4700 -8616 6491 34705 20621 13561 -6550 56 -23207 -37160 -21109
6196 -21109 30034 48399 16930 -23194 -37117 -12248 -3976 -3857 -4825 -11376 -17926 -19313 -17167 5426
6182 5426 14083 17549 9599 3548 -7165 -14100 -33130 -16096 1923 -8821 -19628 -27550 -30609
6169 -30609 -11813 174 -12287 -17855 -32736 -39323 -31262 -26757 -18565 -20378 -28485 6530 -20492
6156 -20492 -9519 -22696 -37771 -29217 -7601 -2856 -23057 -17060 -3269 15141 -4630 -12576 -8962
6143 -8962 -11495 9034 17654 30195 31266 31866 8053 -26606 -21305 -29282 -47615 -54385 -11578 -9560
6129 -9560 -11385 -21834 -27105 -11807 11179 20789 6848 -19468 -46629 -35299 -13100 16066 25715
6116 25715 1224 -14577 -7781 8053 1124 5793 6102 6093 -3495 10141 26040 39632 24554 21994
6102 21994 28491 20200 2031 -2317 8777 7901 -3884 -8581 -11109 -14847 -5493 -13680 -30972 -50763
6088 -50763 -26586 -10206 21947 508 -8 15449 17773 -714 7986 9399 25259 41500 10750
6075 10750 -20677 -37088 -33711 4342 -14946 -5686 16435 12666 7364 23804 2321 6034 18390
6062 18390 31065 32757 11465 17844 9017 -24658 -34727 -28804 -38372 -50017 -37943 -2877 31353
6049 31353 23567 21226 31179 36865 19717 10065 -19423 -6957 -11988 -23172 -10872 6611 -8962
6036 -8962 7282 -1162 11146 12635 7296 3799 868 505 24016 14912 -3552 -7921 5096 20901
6022 20901 15425 8869 23209 18787 -21460 -34768 -30159 -14929 -10297 -2164 3432 24435 19945
6009 19945 -8870 -24413 -16765 -8654 -23729 -9057 -7924 -9589 -8151 -25297 3693 23292 34078
5996 34078 48546 22450 10052 15793 -11997 -10702 -17845 -53630 -51744 -34277 -25482 -2709 12086
5983 12086 18139 11310 6721 -15478 -41437 -60368 -68134 -90219 -76961 -43617 -3050 18250 11169
5970 11169 13681 23337 13892 23208 32952 41083 38199 42081 21454 14984 9222 4373 -22910 -44469
5956 -44469 -33350 24338 4533 -30320 -33697 -17335 -40759 -17315 14756 1377 -27685 -9607
5944 -9607 -26283 -36138 -407 16934 -13190 8297 19810 9535 -353 -14543 -14232 -5093 -8117
5931 -8117 -5141 -17886 -19354 -26261 -27875 -20825 -12767 -15478 -37058 -35311 -51108 -78725 -52112 -47264
5917 -47264 -33233 -14437 3248 16974 13142 7872 -9274 9300 45098 52667 34667 -2395
5905 -2395 -23543 -50617 -31726 -13110 -8407 -3659 14665 11741 -2282 -10445 1055 23925 18185
5892 18185 13497 20371 11836 11474 -6075 -37452 -27041 -25515 2801 12919 16004 -4335 98
5879 98 -27452 -29122 -6370 3408 -1144 -15447 -8157 -20924 -32601 -23357 -18221 -10597 -23449 3804
5865 3804 -2577 -9773 -19655 1187 9312 -1283 -27320 -519 55683 41490 2897 -36774 -56690
5852 -56690 1076 10643 21464 13173 -9350 -9756 20865 15534 6664 620 1420 -12096 -6837 15401
5838 15401 30681 11456 -2670 27251 19115 -19685 -29127 -9725 -14106 -23251 -32135 -50469 -47772
5825 -47772 -39727 -51671 -51863 -8506 -4149 -14581 -5181 -6930 -6978 -33199 -30309 -24335 -17744 -11597
5811 -11597 -12417 10522 34625 -120 -1206 2475 -3841 -13997 -11363 -1827 -20014 -31901 -23893
5798 -23893 -402 11904 33008 36048 19897 9656 4751 22532 -2536 -16206 -34663 -55033
5786 -55033 -48450 -40698 -28103 -8835 17526 47402 28555 14272 17131 7355 -21394 -42111 -54741
5773 -54741 -25923 38381 56864 51257 1760 -2101 -1728 -2615 -676 -12430 -31305 -31486 9165 23790
5759 23790 25393 5286 -1697 20267 15178 252 -6980 -8949 -24864 -14963 -7781 3740 -4170
5746 -4170 -10776 -765 5087 -10394 -19420 -32665 -29080 -30477 -27665 -15920 4146 24904 21299
5733 21299 -11773 -31548 -30128 3650 20282 28869 24004 -3344 -858 -671 -808 -22170 -35939
5720 -35939 -38713 -51105 -37811 -16492 6238 6694 1303 2829 12038 18863 19884 -5249 2995 -5729
5706 -5729 7654 2325 -12327 -24185 -25145 -2521 32598 13781 -26032 -35857 -26524 -27863 -15666
5693 -15666 -18499 -13992 -7856 -24023 -20211 -3875 2064 -7477 -19944 -15302 -8185 -13785 -12229 -10548
5679 -10548 -20785 -32476 -14539 4627 -1349 5665 16771 24865 31519 32051 14547 1399 172
5666 172 3478 22302 24645 17746 36331 44232 37328 7833 -5692 12778 19752 11262 8238 493
5652 493 -3088 -12075 -17437 -6462 13807 4911 24290 17705 6982 31336 50865 36904 25497
5639 25497 -2195 -11835 -5586 -24012 -28681 -20976 -11853 1409 -4606 -679 -15319 4798 23706
5626 23706 16758 -2097 -16075 3171 14239 1378 -22885 -28463 -32916 -50427 -34207 -26018 -19127
5613 -19127 5344 8197 -281 -1713 19938 62971 29938 18092 33603 29376 36050 38268 14985
5600 14985 -11111 -15299 2543 -4433 -10595 -1015 12284 19583 23733 3268 19509 32441 7912
5587 7912 -4874 -8713 -12772 3743 -2537 -3844 -1505 -2916 9918 3768 5901 -13249 -50479 -54369
5573 -54369 -39944 -32817 -26976 -22945 -36017 -21959 -10349 6480 22885 6841 -8382 -41726
5561 -41726 -63893 -49141 -23410 -17220 -28460 -19856 -21332 -8769 2057 24851 12195 6665 -16945
5548 -16945 -10922 -1603 -6814 -13024 -10871 -1031 2572 12050 19308 636 -2357 24730 29527 12835
5534 12835 6830 -7608 -28294 -37562 -17745 -945 -3835 -21473 -12841 -2740 -6070 1853 9188
5521 9188 -25752 -27585 -35566 -30710 -59589 -55898 -1925 950 -175 4903 8711 11415 -744 -19293
5507 -19293 -5890 9781 14793 24354 -765 -18028 -8441 -24293 -47448 -56847 -48656 -18041 13022
5494 13022 29695 15107 7843 8275 -2055 -22708 -13895 603 -2815 3088 11784 -2649 -29604
5481 -29604 -30015 -36206 -40880 -22931 -18124 -16302 -13439 -9594 -28646 -39254 -32854 -6589 21746 10696
5467 10696 -1608 19046 14479 5971 -40 21695 37123 36747 9579 5064 13727 -16480 -39332
5454 -39332 -24596 715 -12585 18478 30469 -680 -12146 6020 13774 1745 7037 -6891
5442 -6891 -17134 -2484 593 -4324 373 27857 6606 4551 -5833 -12274 -14595 -31826 -18137
5429 -18137 -14115 -813 -455 -9474 804 34381 21689 312 -23133 -43300 -22879 -8358 8978
5416 8978 22560 24953 22767 8212 -13814 -2472 5015 2064 13998 21936 -9397 -31130 -33496
5403 -33496 -37238 -38489 -18252 -8611 2354 -2048 3722 24156 28827 22996 23918 15298 14613 -9180
5389 -9180 -11383 -501 -7239 -26681 -35326 -7368 10498 -1944 -15387 -24969 -27528 733 22456
5376 22456 -6683 -11848 -37843 -31502 840 16644 13376 7157 7752 4953 7228 18253 8802 13325
5362 13325 -5776 1607 27518 28759 22467 23012 5905 -28687 -23994 10483 6415 -39482 -40401 -32929
5348 -32929 -36977 -19614 -7937 9490 8110 -3071 -16295 -17185 -21637 -28702 -25834 -1460 17244
5335 17244 -61 -829 9221 24921 25614 -1442 9892 13600 7428 -1115 13776 32194 -2558
5322 -2558 -44332 -47991 -42062 -39017 -23576 -11065 -28309 -35685 -13396 14121 17323 10588 3960
5309 3960 -16712 -11713 1836 771 1417 -16 5914 7885 7275 5401 18009 6328 24566 4602
5295 4602 2602 21808 -7259 -7160 11353 23639 7189 18601 11295 6091 11293 40458 32810 12181
5281 12181 12045 32636 12775 -12971 -6325 5468 13113 6045 -10455 697 -4933 4864 3587
5268 3587 -5219 -26044 -15679 -9913 -6013 -6655 6948 16896 -2561 -36366 -51059 -39932 -36895
5255 -36895 -23259 -11851 -13630 -13513 -10012 -11383 -13377 -1979 5828 1981 -4825 14950 10980 -33818
5241 -33818 -41690 -2014 -6651 -17742 -3069 32975 30941 -4780 -25356 -20486 -19154 5098 17226
5228 17226 18307 20090 21874 13750 32044 38161 36513 30895 -662 -27788 -31359 -27073 -39653 -50530
5214 -50530 -35802 -34922 -64633 -80421 -49986 -35478 -15851 22062 33390 41410 24265 -7389
5202 -7389 -27562 -15818 -8540 -5329 13961 21589 5763 -16832 -20961 -14925 -6239 -16932 -26933
5189 -26933 -27910 -35419 -44958 -32076 4324 23989 22881 45483 45172 39478 27553 36819 73121 53434
5175 53434 11399 -27368 -28569 -15831 -31161 -45139 -36870 -27904 -17428 4765 9413 -1828 -37728
5162 -37728 -11358 18179 30134 17785 -17960 -36983 -42563 -53668 -43004 -19006 12079 16638
5150 16638 -3492 -12427 -27530 -36954 -38466 -26361 6579 33182 51552 52423 46535 27605 61
5137 61 5858 26343 27369 43837 33552 6850 -15449 -11144 -6071 -28216 -23930 -21468 -14310 -11873
5123 -11873 9937 30202 -20321 -58912 -49679 -32014 -23095 849 11604 26130 20029 -33957
5111 -33957 -66535 -62664 -49707 -21397 3465 21173 39397 22094 27126 23578 31268 35858 22810
5098 22810 -679 16312 22430 5231 -18285 -8229 -10261 -3169 -28845 -23778 -13502 -23506 -26927
5085 -26927 -17418 -15018 -8028 -5650 -19108 -29456 -902 3492 14858 5586 -28584 -25962 -16887
5072 -16887 1788 -6785 -15117 870 -2792 -323 -4954 -26845 -16135 22058 11647 5032 -10720
5059 -10720 -21681 -13589 -14761 -19125 -27796 -43844 -32111 -293 -23526 -67205 -69516 -48214 -6676
5046 -6676 5611 -15260 -15890 -4412 -22097 -27065 -39765 -51833 -34021 -11530 7638 11891 -5104
5033 -5104 -25158 -2216 24816 20674 33433 32615 13631 20662 1069 15255 3135 17625 13015
5020 13015 -275 -16061 -7419 17817 33806 23898 12429 -3672 -15988 10824 23638 15836
5008 15836 -13579 -20790 15240 66079 69768 38209 29351 6664 -18115 -7867 18442 12489 -8454
4995 -8454 -6940 -5176 -19943 -45815 -40958 -7212 14869 906 -22408 8491 22089 1071 -1967
4982 -1967 34291 42315 34831 29161 36959 27110 -3410 -30529 -6765 -8840 -2623 3628 11780 35874
4968 35874 52764 71436 78772 57988 13133 -23016 -24073 3679 3136 10131 723 -32348 -72525
4955 -72525 -57029 -61617 -52623 -39561 -31651 -26039 -4122 22882 16780 8500 22096 27505 7856
4942 7856 1879 -21265 -50170 -73489 -31201 25318 18624 -4865 -10586 -16922 -5495 16216 37116
4929 37116 52774 65149 85756 58423 14372 3408 -33326 -33569 -9716 -11795 -20370 -21951 8354
4916 8354 2345 -2153 11942 48769 45262 15456 -218 -3441 -6118 16561 19139 26611 26876 38854
4902 38854 44799 22651 22493 52568 64365 70990 61409 68016 72743 47407 28603 18855 20194 20888
4888 20888 10728 5135 34044 35907 33123 12106 3399 18149 7249 -12295 -31434 -30968 -16045
4875 -16045 -20691 -4868 3327 4575 -10224 328 43216 52172 51795 57177 31032 -6724 -23478
4862 -23478 -28541 -39942 -61346 -47436 -27708 -16325 -15519 -18113 -12890 -17632 -22268 -19194 -12570 -9695
4848 -9695 -12999 -3988 596 -12193 -235 22002 -2917 -20419 -27085 28183 33175 3916 -8505
4835 -8505 -10887 11470 25672 29139 12901 11038 -961 -26883 -48794 -51184 -45415 -2992 35017
4822 35017 44224 11772 -31488 -45994 -12028 -3823 -30126 -32939 -23743 -1338 -20525 -37204 -31865
4809 -31865 -12745 -4924 25406 29639 15846 5556 22880 20891 8688 -12160 -15344 -1928 8099
4796 8099 19590 5632 2143 21435 29553 19211 24180 11572 23553 29004 -3339 -11020 10287
4783 10287 16118 36238 28522 16103 34307 32494 10454 -463 -5814 8874 10293 14628 4203
4770 4203 -16162 -17850 -25752 -17919 -26311 -14697 -23931 -22391 -13151 11972 9322 6171 2699 9013
4756 9013 -17759 -7663 13639 20309 -3800 9289 13541 611 3230 9252 7457 5889 602
4743 602 12839 16722 30389 24736 29746 24514 18625 35530 3351 -12562 -9515 -20426 -38629
4730 -38629 -32142 -5574 -10543 -22297 -19725 -8223 -12249 -7150 -13242 -14045 -38240 -47344 -55873 -51532
4716 -51532 -43938 -32172 -7077 -25401 -61216 -74437 -57747 -48272 -36462 -40372 -34477 -11279 17859
4703 17859 12683 29192 55434 56491 49545 25979 5763 -11737 -23910 -14998 774 11892 -4953
4690 -4953 -7960 -25621 -9621 12046 28246 37139 -6587 -16933 12431 42501 35692 -13552 -20218
4677 -20218 -15734 -29286 -16433 -26422 -25424 -15215 -19785 397 14692 8110 3415 -12668 -26664
4664 -26664 -59553 -50416 -36463 -21064 -20211 -11168 -24302 -48595 -45774 -27299 -12032 3608 14520
4651 14520 -4803 13058 4981 15742 -4795 -25433 -31227 -29358 8402 -10891 -18757 -3770 1578
4638 1578 2295 15732 15209 53379 77983 69174 37890 42670 9323 -20970 -10596 -5940 3975 1082
4624 1082 -16861 -11267 -23640 5046 13644 5099 14671 5590 -31797 -29942 6150 5521 20234 7819
4610 7819 7245 22280 12708 1109 4035 -6737 -13399 3681 5738 7284 -50 13177 11563 -10769
4596 -10769 -19997 -4625 10564 12063 30634 18705 -26394 -20006 10568 -11791 -36143 -12804
4584 -12804 -15775 -21756 1766 23839 4612 -7902 -23399 -22603 9363 17914 10865 17491 9148
4571 9148 5632 14502 -9570 -25445 -32043 -40835 -65355 -71754 -28601 9199 15002 -2340 -315
4558 -315 11635 24123 58634 39833 4391 11060 -12269 -19213 -23936 -6653 -15111 -27146 -21644
4545 -21644 -17112 17683 42423 8443 -22812 -35987 -51982 -54221 -44502 -49948 -39426 -14673 -10475
4532 -10475 -36272 -41935 -32487 -15956 -14030 1976 4766 -6015 20929 35479 31253 10622 17320
4519 17320 23949 10620 23625 11008 -21998 -8100 13352 7207 1868 -17653 -16051 -3459 -6191
4506 -6191 -27091 -24045 -1146 19779 15296 4197 1143 -10284 -18868 -26857 -29200 -27186 -13979
4493 -13979 -18907 -39025 541 27025 25505 14253 24018 20420 5693 3197 -13356 -33697 -8157
4480 -8157 5738 -4812 -9588 -5765 -26545 -60130 -49991 -48263 -52663 -62459 -58295 -39473 -6531
4467 -6531 -9392 -1958 -8588 -7524 6229 27723 27067 9554 -15728 -23923 2740 339 -23510 -18574
4453 -18574 -2895 -15173 15059 8220 -797 11697 4096 -1109 4299 17787 4401 -3494 5287
4440 5287 27513 36036 57685 86739 68300 40428 40386 40698 20203 -12855 -44726 -54853 -31731
4427 -31731 -9220 2150 11392 -15084 -5890 10068 14399 25283 3027 -2817 3647 -20967 -23148
4414 -23148 -23467 -38096 -10243 9416 18077 24658 9397 -14617 -19656 -29041 -46737 -40500 -21885
4401 -21885 -10757 14174 17459 -1915 -30443 -22119 2058 16947 -6564 -6203 -9580 -21477 -45782
4388 -45782 -11231 10781 -6646 10967 23616 19241 5208 -30963 -43412 -23590 -12111 1265
4376 1265 -4101 -4418 -4489 -4500 -915 -11343 2799 -220 -28362 -1738 25689 19341 9794 1858 9675
4361 9675 35738 23064 -16199 -18205 8801 16438 -4109 3203 21067 26572 12701 16982 -4487
4348 -4487 -8234 201 -803 15075 23768 -8143 -27560 -24377 -7467 -20446 -30624 -17570 4546
4335 4546 12986 -703 3813 39439 36392 31808 23641 40907 42050 28704 26850 8006 -23278
4322 -23278 -11476 36334 19556 -5358 1902 24240 2625 -25069 -20029 -2756 13134 -6242
4310 -6242 -4047 -10069 -28504 -30793 -10519 -18157 -38607 -25829 -14019 -17110 -36563 -46611 -40373
4297 -40373 -33065 -26224 -17909 16094 21100 29324 44241 6224 -18398 -4706 2681 2258 -8051
4284 -8051 -4316 -40256 -71827 -65750 -41295 -17564 -12183 10118 9346 -2025 -13652 3951 -1943
4271 -1943 -39577 -49479 -49136 -43235 -31695 -27692 -10335 59570 63295 57605 30990 27130 12538 12380
4257 12380 15818 26439 24804 -4951 -18821 23202 41496 14835 1180 20959 516 1122 19230
4244 19230 -16301 -37907 -37153 -20622 -19694 -37184 -29949 2631 -5838 -42852 -71216 -93059 -57098
4231 -57098 -43176 -17978 -8252 -21567 -35728 -22699 10356 28863 17777 34865 18691 -7934
4219 -7934 -5335 -15051 1925 7726 19135 15960 13065 7883 31842 8897 -12357 2097 -4826
4206 -4826 5173 1108 -30997 -56696 -65315 -68448 -31384 -14011 -18007 -30636 -49561 -32867 -2433
4193 -2433 4741 -14951 -13687 13702 10408 -7889 -18419 -21008 -39531 -27045 -14480 -2872 6162
4180 6162 6050 7836 4667 30366 14628 13833 -10491 -32895 -59992 -74087 -39987 -11147 -22598
4167 -22598 -30795 -17166 15857 4545 -18559 -24504 -27102 -5898 2235 8694 21589 10333 3535
4154 3535 4890 25146 39365 49720 69650 74854 51605 30518 -7432 -36716 -32489 -11241 -10428
4141 -10428 -3163 -10209 -24089 -20473 -6907 23644 27542 13981 -3827 -11614 -3797 36879 37662
4128 37662 21057 24628 26415 -7955 -15228 -21411 -25491 -7735 3698 2804 5480 13406 23081 30983
4114 30983 13910 16535 25792 20250 13072 -12255 1192 8674 -8272 -4045 -990 -2769 -6218 -8887
4100 -8887 -6243 3112 19249 12269 -10748 3311 18621 19836 5872 22260 20330 14950 17073
4087 17073 -4704 -16309 -10932 -21594 -19467 2484 25327 28218 25437 41095 56087 35213 21014
4074 21014 6325 1311 -12138 -17397 -30631 -17145 -2308 -7219 7766 -29809 -20656 12713 18130
4061 18130 32715 28089 41661 30388 12150 -6961 -11216 -16333 -50793 -42607 -18859 12469 8738
4048 8738 -12249 -29829 -10484 24293 5986 -16489 -19613 3198 7131 -15861 -31098 -24722 -17771
4035 -17771 -19985 -21336 -12673 996 34458 29149 -995 -8907 -9492 17674 43740 43469 38400 -554
4021 -554 -29452 -7717 -3006 -373 -25772 -2984 -8566 -44975 -20605 431 5387 -10226 -7522
4008 -7522 3567 -5461 -10982 -4122 3589 -2878 -6932 8913 18873 6426 11338 -10396 -25963 -35946
3994 -35946 -12912 10010 27577 37942 33753 22348 24363 36312 24852 16766 30446 30286 4573
3981 4573 -11009 -12140 -9608 -10128 -11335 2994 21664 11217 -14282 -31170 -28933 -15311 -15436 -28591
3967 -28591 -13776 -20309 -1199 6317 33877 31489 -3721 -273 3007 -5355 -35186 -71228 -94392
3954 -94392 -65919 -41694 -24897 -19514 -13032 5161 -8471 -24658 -22787 -5532 -6477 32833 27296
3941 27296 6786 -28717 -25765 4182 36954 48418 35029 11672 720 17428 28621 16609
3929 16609 -3920 3438 7655 -8066 -35898 -29565 -9544 -14549 -19712 14876 44263 41183 -6015
3916 -6015 -14266 -10287 -18088 -24783 -8616 -5933 -14448 -8322 -13872 -24757 -15673 7049 16416 5487
3902 5487 -29879 -50163 -38290 -42491 -27028 -7547 -11538 1832 18898 29985 767 -34366
3890 -34366 -43713 -26409 -7850 -13620 -13191 -26603 -35956 -32563 -28381 -1955 12872 -9398 -32520
3877 -32520 -22702 7309 -17897 -17323 -15747 -11899 6673 -12548 2756 23859 29925 68432 62168
3864 62168 19218 -12416 -29410 -32223 -26673 -11934 1590 7149 16555 -1717 -6029 20978 18853
3851 18853 -4141 -655 5877 -8792 -24665 -55155 -67165 -56255 -25591 -30463 -17875 1388
3839 1388 19645 55752 67311 55658 38183 11900 -8838 6384 21450 45601 40908 13983
3827 13983 -11293 5940 19084 17604 2893 18234 41209 35056 -5321 -18238 198 -327 -7447
3814 -7447 2275 11562 17325 26211 33660 28299 36355 12843 -6934 -9962 126 -9908 -2120 -16973
3800 -16973 -5646 -10174 -11932 -7936 -24388 -33911 -20444 -1305 -18052 -13485 2722 -3624 -5863
3787 -5863 -14187 -21963 -3794 4263 -18083 -23625 -7019 472 -9801 -24955 -21133 2786 25144
3774 25144 18891 -411 -11390 -3458 5061 5609 -1034 -1042 7934 4122 11987 40796 45719 26239 -7443
3759 -7443 -25566 -8008 33614 55977 54306 19443 -750 -5145 -5199 6431 11519 44977 58111
3746 58111 44471 31511 46732 38691 24474 5707 -15257 -12019 -16531 -12274 44760 45591 29709
3733 29709 2603 -42484 -18284 -888 4656 -11638 -34050 -47688 -50578 -21422 -17667 -21199 -35315
3720 -35315 -16985 10165 17333 41513 60954 57615 30935 20736 4241 -900 -18086 -38427
3708 -38427 -21822 -10035 -27342 -30751 -2573 16999 33684 38077 19428 15251 34852 38690 -5674
3695 -5674 -32237 -27483 -11580 -12474 -11097 -7159 5165 10019 14813 -3128 -24589 -33846 -18936 -12544
3681 -12544 -13724 -7227 34034 41643 41757 66868 46571 52922 48246 31341 27247 -96 1031 13348
3667 13348 7995 -18406 -12956 -26477 -26855 -5286 -2209 25472 35806 25299 21411 2238 9303
3654 9303 1122 -9119 -29860 -21194 -23549 -4136 -230 14523 10785 -9312 -24596 -27654 -26872 -37421
3640 -37421 -26999 -16735 -31956 -37706 -20367 -39570 -65838 -73248 -31507 -17283 -4788 15253
3628 15253 16647 13133 -5768 -20903 -17221 -12491 3577 10718 17578 27378 31052 7204 -11456
3615 -11456 -4073 -10568 9998 31063 32156 -692 -3007 -25160 -28087 -4249 4516 -2261 -5668
3602 -5668 13943 47231 55239 45437 39414 -3883 -37145 -22862 -17923 -19375 -28127 -33173 -1512
3589 -1512 9661 35508 57164 18890 -953 -10339 140 3219 15457 5175 -4352 7288 -5320
3576 -5320 -19969 4521 7973 426 16755 12253 -17224 -14120 -196 37855 40193 16876 8798
3563 8798 -12593 -6078 29423 57730 65654 19961 16895 18963 9811 12209 4314 -11823 -17453 -2444
3549 -2444 35854 51202 17083 10225 -4263 4446 16226 14722 27450 45916 56751 65044 45681
3536 45681 5142 -36779 -48670 -21299 -4506 -14551 -32522 -42103 -29194 -802 2787 -4972
3524 -4972 2237 25212 26152 32284 10984 -7683 16307 53323 74779 80649 42319 16318 14622
3511 14622 -10078 -23562 -10454 8352 589 4861 15666 11417 -12877 -21509 -19869 -6210 4370
3498 4370 -26951 -39189 -11581 441 3022 308 -15015 -27146 -9457 411 19588 -4898 -38915
3485 -38915 -32100 -19838 -34023 -27690 -16853 -23442 -2643 29862 -5020 -11578 -39348 -32286 -9708
3472 -9708 8043 13119 2487 -13783 -26673 -19467 -7657 -10271 -9233 -14950 -9225 -9632 -119 7182
3458 7182 -6923 -187 12848 -7664 -484 7494 4145 -13590 -19802 6441 7373 -2275 13009 8911
3444 8911 11899 7924 15173 -18480 -45436 -36315 3909 18142 3956 -18745 -21357 -8331 768
3431 768 12401 35799 26379 13775 16111 27703 19796 24572 23003 8006 30673 36722 37827 22453
3417 22453 12039 -12705 -12075 20261 37578 22857 19148 -9368 -12813 -57477 -64056 -32373 -12411
3404 -12411 -30275 -62774 -58610 -10211 25676 33333 12105 8434 -5910 1216 13977 38704 26540
3391 26540 -11133 -25225 -34871 -38509 -37635 -28083 -53702 -60804 -22592 19614 41830 65461 64061
3378 64061 32291 21150 5027 -1568 -3287 4996 11099 -5646 -23521 -815 -19888 -40608 -19977
3365 -19977 -39726 -66523 -62494 -55161 -62874 -61453 -55638 -53488 -7440 10281 9614 42859 21329
3352 21329 -15536 -47332 -20141 -10096 -19693 -17142 20263 11529 8983 -197 4591 17881 28946
3339 28946 24096 11840 15233 21584 29194 27464 38803 13635 -4079 -11377 -6147 5045 28079
3326 28079 25637 27860 9584 -8912 -27485 -44247 -40723 -31664 -46009 -46965 -29883 7188 20648
3313 20648 4200 -13327 -1235 2653 33338 59343 56958 34043 10574 1528 -31214 -32128 -49213
3300 -49213 -6462 34542 44518 25370 -5122 -7739 30961 18732 -7103 -1878 -7568 -44251 -64811
3287 -64811 -43982 -25570 -26734 -21259 -34164 -30865 -26083 -32115 -45497 -40296 -14847 -20362 -51517
3274 -51517 -50656 -38985 -28418 -20626 10568 19154 12871 13351 -11772 -26887 -20008 -19808 -25980 -19024
3260 -19024 -2949 -12947 -10778 -14741 -2853 -5645 3438 3028 7465 -10248 3268 7655 -6568 -11259
3246 -11259 18004 38358 55713 45939 35182 6418 -4616 -23178 -34945 -8049 -17260 -51614
3234 -51614 -70022 -72973 -78791 -29755 12044 16420 31946 38885 25973 14850 -10514 -48971 -43576
3221 -43576 -25331 3031 6327 18291 6770 -18755 -3890 2953 -13093 -24780 -35114 -44381
3209 -44381 -41811 -20614 -19097 2174 -714 -17164 -17869 -19075 -23302 -280 -1397 -41719 -76056
3196 -76056 -67609 -65493 -54903 -20489 -12135 -27542 -63834 -30787 16299 25622 27769 39198 37813
3183 37813 1735 -3010 -3700 19412 9664 20828 26901 4928 1383 14832 22758 41440 431
3170 431 -25408 20318 42972 29048 15357 47645 69221 73398 59821 33704 16686 31182
3158 31182 49922 52201 49773 56011 26235 12654 4737 -18666 -4420 -7691 -11036 -21291 -14585
3145 -14585 -541 -14805 -52518 -35436 -44348 -49029 -30510 -35567 -51082 -58184 -57865 -22497 -12027
3132 -12027 740 24656 27752 8256 -24193 -6575 17202 2930 -646 796 -4194 -3936 14431
3119 14431 11549 16256 47247 43266 43015 42372 25959 -12733 -21755 -15634 -27535 -5368 29794 45786
3105 45786 53585 34174 1815 -17749 -28882 -57254 -64959 -62007 -33711 -4874 -2033 -25991 -30275
3092 -30275 -5136 14359 -8035 2444 4414 22637 11198 15447 27048 31075 30438 6333 1608
3079 1608 16607 -11224 -42307 -34572 19948 -15905 -47050 -35011 -12737 -12421 6757 6112 -8214
3066 -8214 7033 4788 14656 10089 29841 51398 53190 39082 19734 11712 39962 37100 -13897
3053 -13897 -48310 -21472 -15686 -29242 -21535 -32887 -44813 -13175 -1640 -9491 -14216 -23126 -15801
3040 -15801 -17307 -12925 4294 8486 13656 20685 4146 3916 5182 6516 28376 36942 54991 42561
3026 42561 32670 59106 20166 -9926 -5895 -8441 -12976 -7712 -4214 -25118 -16922 -13443 -13865 -13656
3012 -13656 -20079 -32252 -29923 -33976 -43782 -40289 -10509 -2648 17524 7373 1560 -4052 9142
2999 9142 10752 -16867 -3491 -5875 -4357 2629 -25617 -26277 -15598 15963 30160 21722 24048 28901
2985 28901 19456 13943 9187 25289 38299 44319 61672 36385 26647 31837 16650 24688 44686
2972 44686 60825 54754 38127 36296 35779 23762 26399 36350 15216 3230 -9001 14539 26268
2959 26268 32823 54925 82734 48483 3855 -1475 16927 21057 35958 32171 38483 53811 65426
2946 65426 44629 51363 65339 63991 15709 25528 57466 58423 46871 59039 65609 35669 21208
2933 21208 -14742 -28523 -32949 -10410 -18143 -57128 -62034 -38719 9341 14176 17140 3880 -17536
2920 -17536 -33699 -41072 -17890 5946 7075 8241 12629 13541 8530 7634 18859 45127 31677 22854
2906 22854 -8918 -15288 3267 -3120 -11196 -20639 -312 28211 21332 45358 21992 -3889 -18500
2893 -18500 9852 11152 4846 9720 -15945 -21953 1694 16610 27206 24195 31663 28925 8175
2880 8175 28244 23770 -17232 -25467 -6958 779 -8433 -13658 -18307 -15232 -12851 -24351 -25154 -16663
2866 -16663 -3479 15981 21897 3077 9900 1326 24667 16311 14329 31937 -2432 5845 5359
2853 5359 9147 18916 9886 -1556 -430 -17186 -13274 51198 79346 63562 72713 78009 50059
2840 50059 4207 -12121 -12168 -25570 -35720 -37670 -60677 -90735 -72511 -37156 -31883 -51766 -42135
2827 -42135 -17400 -11749 6752 -7714 5951 24456 27841 20217 16157 2359 -7130 -2733 9639
2814 9639 12126 18219 20160 4039 -38254 -24919 9527 25961 -14287 -20326 -37140 -48039 -52820
2801 -52820 -66120 -91962 -81886 -46251 -10215 -3746 -16510 -2186 -21174 -37209 -36329 16650
2789 16650 59527 32476 -6293 -16277 -18547 -7643 -2742 18418 25978 43285 17015 24717 5808
2776 5808 22076 52574 41931 31841 26892 43601 74768 79804 55570 23593 34932 35282 21723
2763 21723 23526 28422 41406 38471 3081 -22143 -20765 -22800 -24050 -14784 1925 18853 31446
2750 31446 42614 40066 39726 33348 38062 39937 19019 -28162 -51971 -31961 -8433 3694 732
2737 732 -9538 16332 35108 43022 26736 209 -2845 -9794 -8109 2819 13576 20017 41768
2724 41768 26692 9409 28119 8796 4935 -2709 8194 27474 18932 12803 -4880 -27310 -38845
2711 -38845 -7694 14224 33742 40525 38819 41639 23644 3925 10518 14023 54781 7232 -30688
2698 -30688 -40092 -56922 -53490 -31361 -19097 26140 62576 37501 6403 9455 34942 50712
2686 50712 13102 5183 -5356 -11202 -12287 17380 11532 19290 21508 37743 37377 34893 1127 -28145
2672 -28145 -60630 -56838 -60363 -52932 -23587 -13976 -13626 -22902 -2162 -17422 -12741 18662 6974
2659 6974 -26843 -28124 4473 25803 26816 -279 -7591 40654 50990 39563 23624 32583 46416
2646 46416 29043 33842 39525 28782 16429 6249 -7378 -18270 -512 -78 974 -225 11587
2633 11587 33623 41869 59588 70462 58320 62516 59678 46132 41763 56468 25695 1742 8865
2620 8865 6382 20912 50422 58384 51507 33208 40022 24329 27162 40614 52693 41859 45441
2607 45441 40548 51313 49584 40859 21629 4397 270 -22110 -15793 17988 19823 2483 -16122
2594 -16122 -38817 -9662 1568 1265 4360 5090 -4045 -14955 -20738 -5417 12243 12708 37967 57050
2580 57050 64098 51495 35627 33458 26580 -7287 -43227 -27283 -15130 4438 25613 17565 17224
2567 17224 8763 11984 -7385 -5382 -27973 -28386 -15387 -11527 -24732 -7899 12818 25947 23662
2554 23662 13866 -1601 -9304 2446 6912 5874 3292 -26279 -20748 -4178 12980 1963 -10136
2541 -10136 -13611 -6673 1464 1608 -9170 -20223 -29129 -20804 15380 22644 22682 -5213 -28964 -10542
2527 -10542 14205 -18891 -13823 -4320 7942 6107 -8839 -33832 -50003 -30719 -1254 -3983 -14142
2514 -14142 -7598 14843 13120 3948 -12769 -8438 12862 5303 10266 14923 10378 -10637 -14718 -22631
2500 -22631 -27745 -37114 -27110 -15155 -29576 -11906 19320 29935 36419 18922 -9004 12803
2488 12803 16802 25772 49288 26519 16426 39779 34437 10581 -21143 20395 41795 26648
2476 26648 32618 22691 -171 18462 34779 41972 28972 21182 41098 34922 1725 -12105 -64803
2463 -64803 -70504 -28593 -33581 -10975 32799 27544 9217 -11173 -20308 -31567 -9670 -28804 -31376
2450 -31376 -9081 -34558 -54235 -43707 -25440 -2262 12620 2533 -30698 -39742 -43109 -23210
2438 -23210 -39228 -46378 -46478 -46613 -55952 -43019 -33906 -4416 18535 14932 31637 8915 3763 2229
2424 2229 -28651 -35944 -5683 -8657 -8509 -14383 -27391 -27006 -46215 -38213 -7027 14502 7025 10821
2410 10821 24025 30731 9840 -17334 -32395 -34514 -37884 -25978 -32187 -38647 -55764 -63767 -35993
2397 -35993 -13819 -14966 -21186 -18800 -30667 -34893 -24111 -6351 202 -19741 -3350 17364 36012
2384 36012 49278 61608 48161 17579 426 5415 16656 35009 29458 32224 51117 36347
2372 36347 4670 -13435 13815 40130 2754 -21100 -22053 -14266 13991 -1148 -28319 -32127 -23259
2359 -23259 -18988 6107 15908 -12152 -30127 -11618 15417 20138 17116 -8142 -27205 -1794 -12903
2346 -12903 -21249 -6638 14816 13746 29881 34862 2190 11758 16899 -6001 -24586 -12944 -3509
2333 -3509 19547 1013 -25497 -31388 -22431 -17725 4796 8104 -14059 -7488 -2965 -33587 -49255
2320 -49255 -81286 -70224 -38913 4248 36006 34725 11963 11463 7233 9460 16939 13848 -6927
2307 -6927 -4251 -7730 -4919 -679 -2522 -14467 17492 29294 -1160 -8853 12236 7299 -6126
2294 -6126 -35084 -22162 -1607 76 -8341 -12542 948 21475 31894 19167 19397 -13263 -23331
2281 -23331 -24713 -18229 -41139 -50928 -35009 -4906 21790 45977 44320 33574 -3701 -10716 -21477
2268 -21477 -17172 -17841 -6164 -15413 -20420 -24065 -16835 9781 9646 -1064 14573 17992 -7759 10924
2254 10924 25144 7828 -15607 -32176 -11757 4959 17771 30432 34986 37404 52078 51090 44417
2241 44417 54189 43093 39742 28387 5097 -14268 -13755 749 20842 13864 28190 34760 46238
2228 46238 62925 41400 38059 49167 21317 -18357 -10302 -1993 12760 28264 46063 55291 54241
2215 54241 20428 -1187 -1130 11314 26965 46070 37762 34860 2224 -16128 -7524 -24540 -38324
2202 -38324 -28974 -21869 -32399 6124 16632 -4717 7132 17182 37895 19430 33991 36714
2190 36714 38701 33847 1462 -4949 -19267 4066 -21260 -35355 -19027 7727 4525 10608 -3592
2177 -3592 -31305 -41756 -24233 -36328 -38433 -23025 -3264 -28744 -9193 -6957 -10350 -4380 -6765
2164 -6765 10304 15446 -46011 -46789 -11414 -8923 -27415 -51191 -17325 -5361 27605 27231 17156
2151 17156 16728 11819 13825 2168 4424 14 -22970 4623 1514 -36060 -32615 882 -4592 -15598
2137 -15598 -29233 -35441 -34300 -6397 -164 9013 10226 20349 33986 24763 24154 12475 32502
$$ [...]
##END NTUPLES=NMR SPECTRUM
##END=
