##TITLE=Analysis number 321643
Compound Code cc 50922
Book Reference 486/42/1
Project Code adrs
Chemist Name simons
##JCAMPDX= 6.0         $$ Bruker NMR JCAMP-DX V2.0
##DATA TYPE= NMR SPECTRUM
##DATA CLASS= NTUPLES
##ORIGIN= Bruker BioSpin GmbH
##OWNER= nmr
$$ XWIN-NMR		Version 3.5
$$ Mon Aug 21 12:09:18 2006 GMT Daylight Time (UT+1h)  MAYBRIDGE\nmr@NMR_250MHZ
##.OBSERVE FREQUENCY= 250.131544655141
##.OBSERVE NUCLEUS= ^1H
##.ACQUISITION MODE= SIMULTANEOUS (DQD)
##.ACQUISITION SCHEME= undefined
##.AVERAGES= 16
##.DIGITISER RES= 18
##SPECTROMETER/DATA SYSTEM= dpx250
##.PULSE SEQUENCE= zg30
##.SOLVENT NAME= CDCl3
##.SHIFT REFERENCE= (INTERNAL, CDCl3, 0, 16.4597)
##AUDIT TRAIL= $$ (NUMBER, WHEN, WHO, WHERE, WHAT)
$$ ##TITLE= Audit trail, XWIN-NMR		Version 3.5
$$ ##JCAMPDX= 5.01
$$ ##ORIGIN= Bruker BioSpin GmbH
$$ ##OWNER= nmr
$$ C:\u/data/dgb/nmr/ADRS/1250/pdata/1/auditp.txt
$$ ##AUDIT TRAIL=  $$ (NUMBER, WHEN, WHO, WHERE, WHAT)
(   1,<2006-08-21 12:08:54.90 +100>,<MAYBRIDGE\nmr>,<NMR_250MHZ>,
      <created by zg, POWCHK disabled, PULCHK disabled
       configuration hash MD5:
       E2 DF 36 D8 04 B2 41 60 5A D7 A3 38 5A 4B D0 FE
       data hash MD5: 64K
       1B 9F B1 44 0B 90 4F C9 E2 8B 9E 46 70 55 23 25>)
(   2,<2006-08-21 12:09:07.29 +100>,<MAYBRIDGE\nmr>,<NMR_250MHZ>,
      <Start of raw data processing
       ef LB = 0.3 FT_mod = 6 PKNL = 1 SI = 32K 
       data hash MD5: 32K
       5D 3D C6 8C B9 C8 17 1F 84 29 03 E2 2B 04 B5 EF>)
(   3,<2006-08-21 12:09:09.09 +100>,<MAYBRIDGE\nmr>,<NMR_250MHZ>,
      <apk 
       data hash MD5: 32K
       C1 3B 28 F7 10 B5 D9 0A 9F 3D C3 D7 79 79 B0 34>)
(   4,<2006-08-21 12:09:09.84 +100>,<MAYBRIDGE\nmr>,<NMR_250MHZ>,
      <abs ABSG = 5 
       data hash MD5: 32K
       20 58 72 2E CF 67 99 E9 EE 80 B8 F3 83 B6 94 BE>)
$$ ##END=
$$ 
$$ hash MD5
$$ AE 1F 99 81 08 34 8E C7 47 1F BE 14 9D BC F2 DB
##$RELAX= 
##$RELAX= 
##$RELAX= 
##$RELAX= 
##$RELAX= 
##$RELAX= 
##$RELAX= 
$$ Bruker specific parameters
$$ --------------------------
##$DU= <C:\u>
##$EXPNO= 1250
##$NAME= <ADRS>
##$PROCNO= 1
##$TYPE= <nmr>
##$USER= <dgb>
##$AMP= (0..31)
100 100 100 100 100 100 100 100 100 100 100 100 100 100 100 100 100 100 
100 100 100 100 100 100 100 100 100 100 100 100 100 100 
##$AQSEQ= 0
##$AQ_mod= 3
##$AUNM= <au_zg>
##$AUTOPOS= <50 >
##$BF1= 250.13
##$BF2= 250.13
##$BF3= 250.13
##$BF4= 250.13
##$BF5= 500.13
##$BF6= 500.13
##$BF7= 500.13
##$BF8= 500.13
##$BYTORDA= 1
##$CFDGTYP= 0
##$CFRGTYP= 5
##$CHEMSTR= <none>
##$CNST= (0..31)
1 1 145 1 1 1 1 1 1 1 1 1 1 1 1 1 1 1 1 1 1 1 1 1 1 1 1 1 1 1 1 1 
##$CPDPRG= <>
##$CPDPRG1= <>
##$CPDPRG2= <>
##$CPDPRG3= <>
##$CPDPRG4= <mlev>
##$CPDPRG5= <mlev>
##$CPDPRG6= <mlev>
##$CPDPRG7= <mlev>
##$CPDPRG8= <mlev>
##$CPDPRGB= <>
##$CPDPRGT= <>
##$D= (0..31)
0 1 0 0 0 0 0 0 0 0.06 0 0 0 0 0 0 0.0002 0 0 0 0 0 0 0 0 0 0 0 0 0 0 
0 
##$DATE= 1156158533
##$DBL= (0..7)
120 120 120 120 120 120 120 120 
##$DBP= (0..7)
150 150 150 150 150 150 150 150 
##$DBP07= 0
##$DBPNAM0= <>
##$DBPNAM1= <>
$$ [...]
##$SUBNAM7= <"">
##$SUBNAM8= <"">
##$SUBNAM9= <"">
##$SW= 20.6930455092707
##$SWIBOX= (0..15)
0 0 3 0 0 0 0 0 0 0 0 0 0 0 0 0 
##$SW_h= 5175.983436853
##$TD= 65536
##$TD0= 1
##$TE= 295.16
##$TE2= 300
##$TE3= 300
##$TEG= 300
##$TL= (0..7)
0 120 120 120 120 120 120 120 
##$TP= (0..7)
150 150 150 150 150 150 150 150 
##$TP07= 0
##$TPNAME0= <>
##$TPNAME1= <>
##$TPNAME2= <>
##$TPNAME3= <>
##$TPNAME4= <>
##$TPNAME5= <>
##$TPNAME6= <>
##$TPNAME7= <>
##$TPOAL= (0..7)
0.5 0.5 0.5 0.5 0.5 0.5 0.5 0.5 
##$TPOFFS= (0..7)
0 0 0 0 0 0 0 0 
##$TUNHIN= 0
##$TUNHOUT= 0
##$TUNXOUT= 0
##$USERA1= <user>
##$USERA2= <user>
##$USERA3= <user>
##$USERA4= <user>
##$USERA5= <user>
##$V9= 5
##$VALIST= <valist>
##$VCLIST= <CCCCCCCCCCCCCCC>
##$VD= 0
##$VDLIST= <DDDDDDDDDDDDDDD>
##$VPLIST= <PPPPPPPPPPPPPPP>
##$VTLIST= <TTTTTTTTTTTTTTT>
##$WBST= 1024
##$WBSW= 4
##$XGAIN= (0..3)
0 0 0 0 
##$XL= 0
##$YL= 0
##$YMAX_a= 446469
##$YMIN_a= -557608
##$ZGOPTNS= <>
##$ZL1= 120
##$ZL2= 120
##$ZL3= 120
##$ZL4= 120
##$ABSF1= 16.45971
##$ABSF2= -4.233463
##$ABSG= 5
##$ABSL= 3
##$ALPHA= 0
##$AQORDER= 0
##$ASSFAC= 0
##$ASSFACI= 0
##$ASSFACX= 0
##$ASSWID= 0
##$AUNMP= <proc_1d>
##$AZFE= 0.1
##$AZFW= 0.1
##$BCFW= 0
##$BC_mod= 0
##$BYTORDP= 0
##$COROFFS= 0
##$CY= 12.5
##$DATMOD= 1
##$DC= 0
##$DFILT= <>
##$DTYPP= 0
##$F1P= 14.0000005364418
##$F2P= -0.99999901652339
##$FCOR= 0.5
##$FTSIZE= 32768
##$FT_mod= 6
##$GAMMA= 0
##$GB= 0
##$INTBC= 1
##$INTSCL= 1
##$ISEN= 128
##$LB= 0.3
##$LEV0= 0
##$LPBIN= 0
##$MAXI= 10000
##$MC2= 0
##$MEAN= 0
##$ME_mod= 0
##$MI= 0
##$NCOEF= 0
##$NC_proc= -3
##$NLEV= 6
##$NOISF1= 0
##$NOISF2= 0
##$NSP= 0
##$NTH_PI= 0
##$NZP= 0
##$OFFSET= 16.45971
##$PC= 1
##$PHC0= 146.974
##$PHC1= 7.977031
##$PH_mod= 1
##$PKNL= yes
##$PPARMOD= 0
##$PSCAL= 4
##$PSIGN= 0
##$REVERSE= no
##$SF= 250.13001557777
##$SI= 32768
##$SIGF1= 0
##$SIGF2= 0
##$SINO= 400
##$SIOLD= 32768
##$SREGLST= <1H.CDCl3>
##$SSB= 0
##$STSI= 32768
##$STSR= 0
##$SW_p= 5175.98343685301
##$SYMM= 0
##$S_DEV= 0
##$TDeff= 65536
##$TDoff= 0
##$TI= <Analysis number 999999
Compound Code 99
Book Reference 9
Project Code 9>
##$TILT= no
##$TM1= 0
##$TM2= 0
##$TOPLEV= 0
##$USERP1= <user>
##$USERP2= <user>
##$USERP3= <user>
##$USERP4= <user>
##$USERP5= <user>
##$WDW= 1
##$XDIM= 32768
##$YMAX_p= 354033161
##$YMIN_p= -117725
$$ End of Bruker specific parameters
$$ ---------------------------------
##NTUPLES= NMR SPECTRUM
##VAR_NAME=  FREQUENCY,     SPECTRUM/REAL,   SPECTRUM/IMAG
##SYMBOL=    X,             R,               I
##VAR_TYPE=  INDEPENDENT,   DEPENDENT,       DEPENDENT
##VAR_FORM=  AFFN,          ASDF,            ASDF
##VAR_DIM=   32768,         32768,           32768
##UNITS=     HZ,            ARBITRARY UNITS, ARBITRARY UNITS
##FACTOR=    0.157963299565203, 1,           1
##FIRST=     4117.06731046745, 0,            0
##LAST=      -1058.91612638556, 0,           0
##MIN=       -1058.91612638556, -117725,     0
##MAX=       4117.06731046745, 354033161,    0
$$ Real data points
##PAGE= N=1
##DATA TABLE= (X++(R..R)), XYDATA
$$ [...]
$$ plain form
25599 47644 9566 -20410 -17200 21956 49730 65715 27764 -5958 -17451 -12857 12179 1318
25587 1318 -9087 -19065 -42247 -50072 -20856 11724 27910 11525 10575 16373 41403 53107 40026
25574 40026 25797 11448 21186 8296 -131 -799 -23002 -13601 -15359 -804 -860 1912 -4259 -24650
25560 -24650 -58897 -41961 -24625 -5195 -9396 -3598 16257 -3278 -32552 -29007 -20180 -3879
25548 -3879 8377 17889 10398 7393 8533 -18240 -3791 21893 32784 31121 11921 -11830 2865
25535 2865 26 -22438 -19918 -26347 -5402 -6908 -14764 -7838 -5207 4972 17097 -1245 -37640
25522 -37640 -19040 -8204 -15329 775 15936 50965 56328 59298 42049 23910 6720 12208
25510 12208 24645 41219 24723 23851 25700 9869 -5524 -32690 -39644 -33343 -3731 2211 13643
$$ packed form
25599D7644l8078k9976L210L9156K7774J5985l7951l3722j1493M594K5036j0861
25587A318j0405r978k3182p825K9216L2580J6186j6385r50N798K5030J1704j3081
25574D0026j4229j4349R738j2890q427o68k2203R401j758J4555n6K772o171k0391
25560b4650l4247J6936J7336J9430m201N798J9855j9535k9274L545Q827J6301
25548c879J2256R512p491l005J140k6773J4449K5684J0891j663j9200k3751J4695
25535B865k839k2464K520o429K0945j506p856O926K631J0179J2125j8342l6395
25522c7640J8600J0836p125J6104J5161L5029N363K970j7249j8139j7190N488
25510A2208J2437J6574j6496q72J849j5831j5393k7166o954O301K9612N942J1432
$$ plain form
25497 13643 -1897 -26718 -31459 -45022 -53124 -38343 -18843 -4189 -32031 -62170 -59777 -27630
25485 -27630 -18939 -39787 -24664 -13148 -19858 -33515 -45306 -24325 -17864 -18983 6408 3974 -15921
25472 -15921 -26372 -7674 8526 32782 46121 28194 -12301 -7120 -3191 5729 10667 23013
25460 23013 17162 -4469 -57 -13642 -16244 1863 11139 36960 22247 4877 -4663 -5721 2620
25447 2620 3146 6535 26581 24357 14862 -8313 -11658 7296 38069 9817 -13414 -14723 -2082
25434 -2082 7264 -8113 -14895 -3819 -14875 -5921 19912 19786 17153 8189 -5247 -1232 -8635 -10699
25420 -10699 -4387 -6323 -19450 14038 48633 22472 23464 23614 14783 16345 8040 15194 27539 61901
25406 61901 62639 53157 47584 35603 9024 7916 -6141 10905 7143 6433 -16524 -9947 -94 -8644
$$ packed form
25497A3643j5540k4821m741j3563q102J4781J9500J4654k7842l0139K393L2147
25485b7630Q691k0848J5123J1516o710j3657j1791K0981O461j119K5391k434j9895
25472a5921j0451J8698J6200K4256J3339j7927m0495N181L929Q920M938J2346
25460B3013n851k1631M412j3585k602J8107R276K5821j4713j7370r540j058Q341
25447B620N26L389K0046k224r495k3175l345J8954L0773k8252k3231j309J2641
25434b082R346j5377o782J1076j1056Q954K5833j26k633q964j3436M015p403k064
25420a0699O312j936j3127L3488L4595k6161R92J50q831J562q305P154J2345L4362
25406F1901P38r482n573j1981k6579j108j4057J7046l762p10k2957O577R853q550
$$ plain form
25392 -8644 -11901 7145 3568 -15970 -41761 -26631 19717 30720 37036 25541 19547 9991 2224
25379 2224 8410 9953 8064 22863 54181 45139 27404 12857 7868 20349 21729 12035 8647
25366 8647 32074 42877 22405 22095 29928 7038 17573 25912 -7455 -15462 -5746 -1315 -3897
25353 -3897 22871 48709 41518 -11809 -1863 4411 -6903 -31535 -23076 -50991 -47572 -16241 -8065
25340 -8065 -34365 -17406 -19069 -19612 -8774 -19896 -24549 -13593 -18179 -18415 -14328 -5198 -4249 17055
25326 17055 20870 -547 -42820 -68974 -39883 -21681 -18436 -5978 36553 66367 36825 7130
25314 7130 -23325 -21615 -24745 -27545 -14889 11018 8138 -15316 -16006 -15629 -10279 -2720 7492 21357
25300 21357 21839 14678 36490 67075 41221 28845 30310 13892 2827 -36434 -50201 -14273
$$ packed form
25392h644l257J9046l577j9538k5791J5130M6348J1003O316j1495n994r556p767
25379B224O186J543j889J4799L1318r042j7735j4547m989J2481J380r694l388
25366H647K3427J0803k0472l10P833k2890J0535Q339l3367q007R716M431k582
25353c897K6768K5838p191n3327R946O274j1314k4632Q459k7915L419L1331Q176
25340h065k6300J6959j663n43J0838j1122m653J0956m586k36M087R130R49K1304
25326A7055L815k1417m2273k6154K9091J8202L245J2458M2531K9814k9542k9695
25314G130l0455J710l130k800J2656K5907k880k3454o90L77N350P559J0212J3865
25300B1357M82p161K1812L0585k5854j2376J465j6418j1065l9261j3767L5928
$$ plain form
25288 -14273 -12217 15482 -2813 -16393 16364 19361 -13407 -24506 -22648 5039 29083 24735
25276 24735 1041 -23374 -18943 -31569 -49690 -53748 -33125 -24294 -10623 -11922 -19342 17447 27778
25263 27778 31155 16446 -1897 25865 41184 14965 -13520 -45556 -23389 8215 28442 18714
25251 18714 23713 37718 21308 20157 36017 37987 38142 57559 52135 47748 44093 41312 44618 43837
25237 43837 18814 -11841 -30109 -573 17310 15877 3206 -25082 -51776 -22852 -7037 4860
25225 4860 18824 25695 1387 -16315 -22867 -36171 -11133 -7716 7228 -16175 -28391 -29788 -31203
25212 -31203 -15839 -3006 -6497 -20781 -23706 -21181 13076 24466 23021 21068 42702 24994 13155
25199 13155 22322 5928 -15498 -21173 -19880 -22659 -31357 -41219 -34795 6377 25468 15501 -13370
$$ packed form
25288a4273K056K7699j8295j3580L2757K997l2768j1099J858K7687K4044m348
25276B4735k3694k4415M431j2626j8121m058K0623Q831J3671j299p420L6789J0331
25263B7778L377j4709j8343K7762J5319k6219k8485l2036K2167L1604K0227r728
25251A8714M999J4005j6410j151J5860J970J55J9417n424m387l655k781L306p81
25237D3837k5023l0655j8268K9536J7883j433j2671k8288k6694K8924J5815J1897
25225D860J3964O871k4308j7702o552j3304K5038L417J4944k3403j2216j397j415
25212c1203J5364J2833l491j4284k925K525L4257J1390j445j953K1634j7708j1839
25199A3155R167j6394k1426n675J293k779q698r862O424M1172J9091r967k8871
$$ plain form
25186 -13370 -19811 -7130 10069 6295 -23404 -29332 -25377 -10364 -30539 -27284 -52553 -46095 -9588
25173 -9588 1925 25170 23897 16157 -766 1895 -14865 -32771 -3077 9257 13554 18847 7391
25160 7391 10178 10170 -2118 -5384 -23213 -30021 -15233 5933 16674 7518 24593 53526 54868 16990
25146 16990 -13808 -8764 -728 18220 26820 35897 26433 561 -25005 -8204 14662 -4837 -6492
25133 -6492 16470 19946 31548 36519 20959 21790 23923 13682 33992 48548 64109 52336 26182
25120 26182 13365 -19650 -25186 -1695 -15018 1136 13905 2489 -4956 -12949 -18560 -48101
25108 -48101 -51975 -39368 -16600 -623 1506 -369 2947 -9425 -37 33760 24189 565 -30718
25095 -30718 -35787 -27517 6088 27676 27333 22405 14901 21162 20689 40287 51110 37336 24745
$$ packed form
25186a3370o441J2681J7199l774k9699n928L955J5013k0175L255k5269O458L6507
25173i588J1513K3245j273p740j6923K661j6760j7906K9694J2334M297N293j1456
25160G391K787qj2288l266j7829o808J4788K1166J0741r156J7075K8933J342l7878
25146A6990l0798N044Q036J8948Q600R077r464k5872k5566J6801K2866j9499j655
25133f492K2962L476J1602M971j5560Q31K133j0241K0310J4556J5561j1773k6154
25120B6182j2817l3015n536K3491j3323J6154J2769j1416p445p993n611k9541
25108d8101l874J2607K2768J5977K129j875L316j2372R388L3797r571k3624l1283
25095c0718n069Q270L3605K1588l43m928p504O261m73J9598J0823j3774j2591
$$ plain form
25082 24745 9396 13481 3334 41109 52885 43463 24070 12369 1633 -22632 -5453 -8592
25070 -8592 -16476 -23041 12853 25603 8508 -12610 -24438 4939 28723 22623 46635 72899
25058 72899 78478 48607 38599 30853 1224 -8264 -23537 -34150 -15534 -8949 -2887 18536 20674
25045 20674 -997 -37903 -45437 -31955 -22371 -7000 5354 22503 12699 -22337 -35085 -45345
25033 -45345 -37449 -30113 -27181 -31359 -33133 -16444 3038 4112 16048 12665 28675 34815 26282
25020 26282 22494 9886 13966 20561 13521 7786 27233 34088 33498 25883 22321 -16609 -11387 12112
25006 12112 15656 14591 2522 -1219 -3566 -6701 575 -18662 -6059 -2808 4744 15371 -27
24993 -27 2725 8644 11434 24922 38054 53757 43469 44412 27596 -14747 -21573 -4004 9517
$$ packed form
25082B4745j5349M085j0147L7775J1776r422j9393j1701j0736k4265J7179l139
25070h592p884o565L5894J2750j7095k1118j1828K9377K3784o100K4012K6264
25058G2899N579k9871j0008p746k9629r488j5273j0613J8616O585O062K1423K138
25045B0674k1671l6906p534J3482R584J5371J2354J7149r804l5036j2748j0260
25033d5345P896P336K932m178j774J6689J9482J074J1936l383J6010O140q533
25020B6282l788j2608M080O595p040n735J9447O855n90p615l562l8930N222K3499
25006A2112L544j065j2069l741k347l135P276j9237J2603L251P552J0627j5398
24993b7K752N919K790J3488J3132J5703j0288R43j6816m2343o826J7569J3521
$$ plain form
24980 9517 20067 18338 2339 23724 41931 29151 27655 36749 39445 47612 53379 44498 33891
24967 33891 28186 34238 12732 7984 11261 1532 20724 14937 -1340 -8895 -17682 4875 9014
24954 9014 -5281 1681 -10064 -6570 -20330 -41964 -46893 -32688 -18978 -20505 1557 7507 7990
24941 7990 3741 4897 20702 11071 -8199 -29866 -22000 -5606 -11162 -17386 -9107 -14719 -12250 -27444
24927 -27444 -9841 29506 15770 -7396 -12680 943 15887 35417 7279 -3730 9084 16641
24915 16641 -3740 4245 1317 6450 -4135 -8788 -8436 -222 29844 46740 28116 12416 812
24902 812 -9342 -21226 -52383 -50024 -51040 -29247 -11642 1787 14313 3472 -18765 -3322
24890 -3322 22328 -17858 -29215 -8891 -689 -6650 12866 37771 73303 60086 19209 -10373
$$ packed form
24980I517J0550j729j5999K1385J8207j2780j496R094K696Q167N767q881j0607
24967C3891n705O052k1506m748L277r729J9192n787j6277p555q787K2557M139
24954I014j4295O962j1745L494j3760k1634m929J4205J3710j527K2062N950M83
24941G990m249J156J5805r631j9270k1667P866J6394n556o224Q279n612K469j5194
24927b7444J7603L9347j3736k3166n284J3623J4944J9530k8138j1009J2814P557
24915A6641k0381P985k928N133j0585m653L52Q214L0066J6896j8624j5700j1604
24902H12j0154j1884l1157K359j016K1793J7605J3429J2526j0841k2237J5443
24890c322K5650m0186j1357K0324Q202n961J9516K4905L5532j3217m0877k9582
$$ plain form
24878 -10373 -32857 -28461 -715 14824 29055 34186 40420 17337 25200 13897 -23149 -56242
24866 -56242 -70765 -62766 -45579 -8294 -14770 -50521 -54024 -5254 -9738 -44617 -56989 -43803
24854 -43803 -55982 -24899 7120 999 -36344 -61300 -60941 -36658 -11556 -376 -7450 -23846
24842 -23846 -41267 -38028 -2346 -69 -22121 -13358 17546 49498 37150 46259 36338 28611 46073
24829 46073 29403 11891 36454 45472 49161 36389 19689 30410 27218 8251 694 13910
24817 13910 15576 17126 21077 16228 16583 27370 40392 52031 27000 5454 21929 36345 42134
24804 42134 25257 22706 28196 20053 -12049 -1961 3634 33937 67591 41539 16450 31292
24792 31292 8672 4456 17188 -10480 -16634 -21885 -16728 -13653 -5980 6091 5900 -7121 -6664 -6692
$$ packed form
24878a0373k2484M396K7746J5539J4231N131O234k3083P863j1303l7046l3093
24866e6242j4523P999J7187L7285o476l5751l503M8770m484l4879j2372J3186
24854d3803j2179L1083L2019o121l7343k4956L59K4283K5102J1180p074j6396
24842b3846j7421L239L5682K277k2052Q763L0904L1952j2348R109r921p727J7462
24829D6073j6670j7512K4563R018L689j2772j6700J0721l192j8967p557J3216
24817A3910J666J550L951m849L55J0787J3022J1639k5031k1546J6475J4416N789
24804D2134j6877k551N490q143l2102J0088N595L0303L3654k6052k5089J4842
24792C1292k2620m216J2732k7668o154n251N157L075P673J2071j91j3021M57k8
$$ plain form
24778 -6692 -15567 -27371 7209 39317 31725 9783 -16470 -34372 -63429 -46289 -24724 -25781
24766 -25781 -32296 -24410 -1548 -713 -17725 -14624 4278 11542 17852 19186 9170 -15739 -6537
24753 -6537 4063 8653 2169 -10337 9022 -4928 -7292 1354 14979 1433 3375 -21622 -23914
24740 -23914 -46333 -44241 -10486 -21299 -15612 -7074 -606 -22148 -12980 -3435 -19889 -22769 -14131
24727 -14131 -7011 -3299 -11440 -28745 -11457 2 4547 -5530 3852 -701 -12879 -9976 4123
24714 4123 27700 26678 12413 -27313 -36703 -35980 -38583 -30029 -35606 -49797 -50870 -57367 -61097 -57142
24700 -57142 -21304 -12276 -16147 -14936 -5818 11279 16331 21641 39486 41748 36291 24376 38015
24687 38015 37302 25406 -7702 -34346 -42803 -54253 -70016 -58666 -42270 -34529 -813 -2421 3345
$$ packed form
24778f692q875j1804L4580L2108p592k1942k6253j7902k9057J7140K1565j057
24766b5781o515P886K2862Q35j7012L101J8902P264O310J334j0016k4909R202
24753f537J0600M590o484j2506J9359j3950k364Q646J3625j3546J942k4997k292
24740b3914k2419K092L3755j0813N687Q538O468k1542R168R545j6454k880Q638
24727a4131P120L712q141j7305J7288J1459M545j0077R382m553j2178K903J4099
24714D123K3577j022j4265l9726r390P23k603Q554n577j4191j073o497l730L955
24700e7142L5838R028l871J211R118J7097N052N310J7845K262n457j1915J3639
24687C8015p13j1896l3108k6644q457j1450j5763J1350J6396P741L3716j608N766
$$ plain form
24674 3345 2856 -7607 397 -5873 -32786 -16093 11237 22553 4608 -20837 -12677 5316 -7731
24661 -7731 -33913 -13958 16791 77142 75789 29908 66 -25243 -46737 -37080 -14060 -26116
24649 -26116 -33030 -24891 -4513 10531 4171 -12396 166 -16721 -4902 13206 14012 7575 8795
24636 8795 16022 12952 5284 1886 4405 -2427 -25881 1645 -7564 -27720 -29794 -26189 -23685 -29386
24622 -29386 -17339 -43413 -33112 -3891 -2000 2137 -425 1277 -4225 -6784 -4432 14784 16667
24609 16667 -2827 -18359 -9211 392 15094 47453 42478 25245 24053 16830 18886 3229 8280
24596 8280 -10306 -2627 3456 15919 27452 25056 28222 13248 3260 12755 6167 15453 12250 10216
24582 10216 24757 11512 -9852 6478 17824 -18312 -36426 -23786 -7444 3124 -7659 -277
$$ packed form
24674C345m89j0463Q004o270k6913J6693K7330J1316j7945k5445Q160J7993j3047
24661g731k6182J9955L0749O0351j353m5881k9842k5309k1494R657K3020j2056
24649b6116o914Q139K0378J5044o360j6567J2562j6887J1819J8108Q06o437J220
24636H795P227l070p668l398K519o832k3454K7526r209k0156k074L605K504n701
24622b9386J2047k6074J0301K9221J891M137k562J702n502k559K352J9216J883
24609A6667j9494j5532R148R603J4702L2359m975j7233j192p223K056j5657N051
24596H280j8586P679O083J2463J1533k396L166j4974r988R495o588R286l203k034
24582A0216J4541j3245k1364J6330J1346l6136j8114J2640J6342J0568j0783P382
$$ plain form
24570 -277 1822 -14151 14234 20916 14714 24872 32123 11649 13499 10349 10059 23388 2627 -14479
24556 -14479 -14459 -31086 -42038 -22431 -2621 -11700 -14449 -44150 -38680 -7284 -11860 7655 20796
24543 20796 15609 -23088 -11272 9579 36395 36352 28169 17082 8265 29393 15338 -1604 -6477
24530 -6477 -9367 -3793 -6726 -5059 -21790 -42800 -33792 -5630 4881 2610 -5035 7643 -6585
24517 -6585 -15779 5898 14413 27479 23735 502 -5555 12317 10204 309 -3456 6961 7914 -1525
24503 -1525 -19594 -9005 6891 -7479 -18539 -8656 -3160 -15856 -48777 -60532 -58830 -55147 -49369
24490 -49369 4204 42838 34466 21918 5506 2097 16022 29387 43452 18067 2013 -19992
24478 -19992 -34960 -23391 -24020 -22220 -12851 6387 -2697 -5705 -16820 -18977 2943 4500 2661
$$ packed form
24570b77K099j5973K8385O682o202J0158P251k0474J850l150k90J3329k0761j7106
24556a4479K0j6627j0952J9607J9810r079k749k9701N470L1396m576J9515J3141
24543B0796n187l8697J1816K0851K6816m3q183j1087q817K1128j4055j6942m873
24530f477k890N574k933J667j6731k1010R008K8162J0511k271p645J2678j4228
24517f585r194K1677Q515J3066l744k3233o057J7872k113r895l765J0417R53r439
24503a525j8069J0589J5896j4370j1060R883N496j2696l2921j1755J702L683N778
24490d9369N3573L8634q372j2548j6412l409J3925J3365J4065k5385j6054k2005
24478a9992j4968J1569o29J800R369J9238r084l008j1115k157K1920J557j839
$$ plain form
24465 2661 8309 23586 34768 19461 16600 16490 18347 -795 9952 15830 14378 3086 -87
24452 -87 -1206 16099 -2269 -22007 -10709 -5645 10139 23016 32491 29406 16788 6385 1456
24439 1456 11582 9318 10309 10909 36123 28107 -13625 -31845 -32894 -3172 18843 27901 5915
24426 5915 540 -12184 -39517 -31260 -26174 7506 21629 21299 -7757 -27277 -36850 -41196 -36484
24413 -36484 -39795 -50111 -26398 -22987 -10217 -28817 -44232 -19173 45973 45982 21589 7556 -11606
24400 -11606 -14687 2829 2906 -121 -6788 7927 7021 -7993 -15600 -16553 -6069 26273 46556 53970
24386 53970 54484 52870 44437 35548 33432 5202 -25035 -17935 4381 2549 -6702 -11837 -6328 11668
24372 11668 -4475 -17374 -26861 -52 17526 14596 19235 24819 28843 39858 27655 18733 19095
$$ packed form
24465B661N648J5277J1182j5307k861j10J857j9142J0747N878j452j1292l173
24452h7j119J7305j8368j9738J1298N064J5784J2877R475l085j2618j0403m929
24439A456J0126k264R91O00K5214q016m1732j8220j049K9722K2015R058k1986
24426E915n375j2724k7333Q257N086L3680J4123l30k9056j9520r573m346M712
24413c6484l311j0316K3713L411J2770j8600j5415K5059O5146Rk4393j4033j9162
24400a1606l081J7516P7l027o667J4715r06j5014p607r53J0484L2342K0283P414
24386E3970N14j614q433q889k116k8230l0237P100K2316j832r251n135N509J7996
24372A1668j6143j2899r487K6809J7578k930M639N584M024J1015j2203q922L62
$$ plain form
24359 19095 33932 25547 22122 13529 7202 -9985 -13580 -24439 -33943 1940 32954 8491 -23756
24346 -23756 -30006 -32816 -24922 -48005 -53747 -3235 27964 24666 28962 14806 1285 11905 19729
24333 19729 5078 4147 -19443 -35030 -18098 -38339 -39583 -23981 -47546 -9818 -26308 -40818
24321 -40818 -37559 -14348 -247 15703 18793 8136 3461 29112 33820 41741 40322 31663 26646
24308 26646 44123 36061 29196 16295 -16648 -10647 -1825 13328 21260 17990 15876 16042 2652
24295 2652 -17812 -35043 -40639 -18768 -42096 -43671 -40532 -36829 -19513 8680 4411 8835 2752
24282 2752 -3462 4104 9077 -11273 -21951 -19074 7568 17057 12029 -5530 -14250 -15418 -29682
24269 -29682 -10218 16812 10195 4072 -9046 -3937 24540 14949 -17790 -1889 18967 16561 13858
$$ packed form
24359A9095J4837q385l425q593o327j7187l595j0859r504L5883L1014k4463l2247
24346b3756o250k810P894k3083n742N0512L1199l298M296j4156j3521J0620P824
24333A9729j4651r31k3590j5587J6932k0241j244J5602k3565L7728j6490j4510
24321d0818L259K3211J4101J5950L090j0657m675K5651M708P921j419q659n017
24308B6646J7477q062o865j2901l2943O001Q822J5153P932l270k114J66j3390
24295B652k0464j7231n596K1871k3328j575L139L703J7316K8193m269M424o083
24282B752o214P566M973k0350j0678K877K6642R489n028j7559q720j168j4264
24269b9682J9464K7030o617o123j3118N109K8477r591l2739J5901K0856k406k703
$$ plain form
24256 13858 17160 9379 -10428 -31399 -7839 -6672 -51864 -49110 -46767 -43102 -18852 -1367 -666
24243 -666 -2183 1185 17320 18358 -4300 -11643 -18716 -26773 -41300 -21123 -13655 -42421 -35162 -3882
24229 -3882 -53 -2054 11592 17892 18652 6196 12559 10143 -23236 -46311 -42833 -50473 -14011 25749
24215 25749 46922 1528 -18331 -28825 -20682 -20644 -9718 7833 -13584 -45389 -68962 -66927 -50511
24202 -50511 -31653 -1668 -18889 -24159 -20991 -25730 -17691 -42011 -35460 -45829 -35946 1616 19282
24189 19282 4676 16584 38187 29655 13294 12014 -11169 -23344 -16648 -18903 -27390 -28437 -5086
24176 -5086 1823 4056 -33021 -40903 -14316 -17535 1354 21573 15062 25223 49387 65227 53092
24163 53092 13982 -9764 6325 40012 50893 52577 19595 -17471 -30559 2984 4531 -3798
$$ packed form
24256A3858L302p781j9807k0971K3560J167m5192K754K343L665K4250J7485P01
24243f66j517L368J6135J038k2658p343p073q057j4527K0177P468k8766P259L1280
24229c882L829k001J3646O300P60j2456O363k416l3379k3075L478p640L6462L9760
24215B5749K1173m5394j9859j0494Q143L8J0926J7551k1417l1805k3573K035J6416
24202e0511J8858K9985j7221n270L168m739Q039k4320O551j0369R883L7562J7666
24189A9282j4606J1908K1603q532j6361j280k3183j2175O696k255q487j047K3351
24176e086O909K233l7077p882K6587l219J8889K0219o511J0161K4164J5840j2135
24163E3092l9110k3746J6089L3687J0881J684l2982l7066j3088L3543J547q329
$$ plain form
24151 -3798 5412 11734 27223 9242 -13910 -22522 -7578 -7275 -3841 -29443 -31013 -22415 1226
24138 1226 3554 -11147 -22441 -40514 -56948 -81473 -73123 -61141 -69086 -71449 -45411 -36900 -18382
24125 -18382 -29563 -52966 -30293 -18545 -35262 -32757 -38524 -11466 356 -12073 -15276 -1125
24113 -1125 -12818 -44537 -42844 1657 25588 6633 4110 4211 -16186 -22654 -42115 -38188 -49842
24100 -49842 -48658 -30988 -29294 -21970 -5378 -11851 3876 -9332 -26331 -3925 10402 -23088
24088 -23088 -35471 -28657 -8333 -12334 -14958 -18069 -7093 24742 19935 21605 17885 20482 14729
24075 14729 -8742 -6119 -3170 -11484 8553 5465 -6933 -20383 -17605 -20960 -42061 -30926 -6272
24062 -6272 -16054 -14629 -2331 -4984 -17853 -41661 -44829 -26850 -19832 -34421 -31578 -25071 -11489
$$ packed form
24151c798R210O322J5489j7981k3152q612J4944L03L434k5602j570Q598K3641
24138A226K328j4701j1294j8073j6434k4525Q350J1982p945k363K6038Q511J8518
24125a8382j1181k3403K2673J1748j6717K505n767K7058J1822j2429l203J4151
24113a125j1693l1719J693M4501K3931j8955k523J01k0397o468j9461L927j1654
24100d9842J184J7670J694P324J6592o473J5727j3208j6999K2406J4327l3490
24088b3088j2383O814K0324m001k624l111J0976L1835m807J670l720K597n753
24075A4729k3471K623K949q314K0037l088j2398j3450K778l355k1101J1135K4654
24062f272r782J425J2298k653j2869k3808l168J7979P018j4589K843O507J3582
$$ plain form
24049 -11489 23911 54522 44777 9538 -26637 -35961 -18859 7083 14468 -5528 -14370 -25396
24037 -25396 -12259 -5684 -22557 -39598 -37692 -18448 -23542 -24044 -34140 -49488 -63362 -42837 -4709
24024 -4709 19960 34623 18163 -13692 -2284 -4838 -2376 -4744 -32152 -37615 -37037 -46625 -24225
24011 -24225 -15672 -4486 -3062 -8264 -2067 22708 27444 -3868 -46197 -37853 -31048 -35055 -70929
23998 -70929 -64382 -48453 -63856 -62412 -53997 -48076 -42938 -27075 -13403 6494 -5389 -13977 -42443
23985 -42443 -40799 -42609 -57942 -51573 -50501 -37976 -34946 -45420 -29510 -19415 -31353 -7662 14230
23972 14230 17076 8219 -10926 -31568 -37141 -33939 -7818 -8172 -1901 -14147 -21887 22372 17743
23959 17743 -35407 -26222 -7515 -5303 -23747 -27310 -21627 3194 27238 32876 1700 28564 21944
$$ packed form
24049a1489L5400L0611r745l5239l6175r324J7102K5942P385j9996q842j1026
24037b5396J3137O575j6873j7041J906J9244n094n02j0096j5348j3874K0525L8128
24024d709K4669J4663j6460l1855J1408k554K462k368k7408n463N78r588K2400
24011b4225Q553J1186J424n202O197K4775M736l1312m2329Q344O805m007l5874
23998g0929O547J5929j5403J444Q415N921N138J5863J3672J9897j1883q588k8466
23985d2443J644j810j5333O369J072J2525L030j0474J5910J0095j1938K3691K1892
23972A4230K846q857j9145k0642n573L202K6121l54O271j2246p740M4259m629
23959A7743n3150R185J8707K212j8444l563N683K4821K4044N638l1176K6864o620
$$ plain form
23946 21944 -4336 729 -13499 -47624 -17484 -24855 -5589 -2983 -20366 -13577 -18505 5778 42795
23933 42795 50151 31594 38474 34654 37888 8340 -27097 -19530 2394 4623 2863 13838 994
23920 994 -2542 -9854 3004 -7516 -6762 -3030 14567 -14144 -54997 -29841 -5843 5444 13187
23907 13187 16896 -6269 -31115 -23563 -28193 -19123 -19560 -244 -10681 -17417 -7922 -29978 -19614
23894 -19614 -38831 -44299 -15929 -22979 -39039 -33510 -44700 -42185 -24956 -20315 -20406 -13168 -22771 -21702
23880 -21702 -18978 -17362 8126 8165 -6186 3148 3016 -19357 -30985 -15485 2724 -11992 -19325
23867 -19325 -14781 -21610 -27017 -347 632 -32046 -9020 20711 17208 15095 7722 9238 8040 -3702
23853 -3702 26353 38604 -14104 -30956 -11032 -36878 -19816 -1873 -26339 -32318 -46607 -79175
$$ packed form
23946B1944k6280N065j4228l4125L0140p371J9266K606j7383O789m928K4283L7017
23933D2795P356j8557O880l820L234k9548l5437P567K1924K229j760J0975j2844
23920I94l536p312J2858j0520P54L732J7597k8711m0853K5156K3998J1287P743
23907A3187L709k3165k4846P552m630R070m37J9316j0437o736R495k2056J0364
23894a9614j9217n468K8370p050j6060N529j1190K515J7229M641r1P238r603J069
23880b1702K724J616K5488L9j4351R334j32k2373j1628J5500J8209j4716p333
23867a9325M544o829n407K6670R79l2678K3026K9731l503k113p373J516j198j1742
23853c702L0055J2251n2708j6852J9924k5846J7062J7943k4466n979j4289l2568
$$ plain form
23841 -79175 -75217 -101338 -85896 -49186 -28322 -16622 7966 18061 -5773 -13426 4635 26551
23829 26551 31319 -7525 -18471 -13078 -12036 6073 34448 22835 10231 -20721 -690 3411
23817 3411 -19871 -32253 -38886 -46249 -40158 -33024 -24623 -10740 -14745 -8087 -14981 -3087 -24588
23804 -24588 -43811 -31779 -53771 -81005 -79244 -60796 -54692 -18803 -15885 4640 13414 10327 8073
23791 8073 -14372 -22144 -29965 -24124 -5009 -16220 -20148 -7392 2639 2959 -9167 -17857 -32948
23778 -32948 -53561 -59746 -55047 -57856 -51188 -35049 -21518 -32170 -37397 -9208 13790 3343 -2787
23765 -2787 -27436 -9513 18855 28482 18994 24311 18566 -14985 -25616 -32005 -38610 -26543 -23178
23752 -23178 -2228 -2808 18072 23817 1495 -12492 -49426 -60103 -90806 -71534 -40473 -30473
$$ packed form
23841g9175L958k6121J5442L6710K0864J1700K4588J0095k3834p653J8061K1916
23829B6551M768l8844j0946N393J042J8109K8375j1613j2604l0952K0031M101
23817C411k3282j2382o633p363O091P134Q401J3883m005O658o894J1894k1501
23804b4588j9223J2032k1992k7234J761J8448O104L5889K918K0525Q774l087k254
23791H073k2445p772p821N841J9115j1211l928J2756J0031L20j2126q690j5091
23778c2948k0613o185M699k809O668J6139J3531j0652n227K8189K2998j0447o130
23765b787k4649J7923K8368R627r488N317n745l3551j0631o389o605J2067L365
23752b3178K0950n80K0880N745k2322j3987l6934j0677l0703J9272L1061J0000
$$ plain form
23740 -30473 -11303 -6757 -13570 -18848 -8521 -28225 -26112 -47669 -36538 -5914 9552 12091 -12063
23727 -12063 -28206 -41869 -48635 -39730 -11126 32208 29593 10973 -12054 -8055 4174 -1015 -9705
23714 -9705 -31117 -24967 -29064 -7426 13137 4928 2025 -20010 -25746 -35192 -18022 -915 -4265
23701 -4265 -12268 -43657 -42428 -44352 -21517 -18379 -12790 6272 713 -11060 -2432 -25325 -19891
23688 -19891 -8327 -28810 -49369 -45975 -27693 -11909 -22595 -11695 -27469 -51124 -31561 -19253
23676 -19253 -9853 24225 18534 -19595 -19586 -11827 -26914 -2995 15897 19232 37466 38952 12829
23663 12829 2934 -11390 -13162 -10649 -6700 18123 12075 -25559 -53579 -41196 -31853 -47973 -58515
23650 -58515 -47535 -47150 -17708 9735 -9986 -29287 -44835 -48431 -36144 -28495 -12649 -17029 -25549
$$ packed form
23740c0473J9170M546o813n278J0327j9704K113k1557J1131L0624J5466K539k4154
23727a2063j6143j3663o766Q905K8604M3334k615j8620k3027L999J2229n189q690
23714i705k1412O150m097K1638K0563q209k903k2035n736r446J7170J7107l350
23701d265q003l1389J229j924K2835L138N589J9062n559j1773Q628k2893N434
23688a9891J1564k0483k0559L394J8282J5784j0686J0900j5774k3655J9563J2308
23676a9253R400L4078n691l8129RP759j5087K3919J8892L335J8234J486k6123
23663A2829r895j4324j772K513L949K4823o048l7634k8020J2383R343j6120j0542
23650e8515J0980L85K9442K7443j9721j9301j5548l596J2287P649J5846m380q520
$$ plain form
23637 -25549 -12036 -9036 -17412 -13324 -7351 5164 16552 13567 11720 30706 -17478 -40060 -42968
23624 -42968 -29114 -20414 -30862 -48702 -36102 -30044 -9897 -5136 -9013 21183 5634 -6590
23612 -6590 -1469 14082 -1535 -1187 15313 24880 16370 -9321 -34386 -1519 16623 11579 21910
23599 21910 8776 13438 48405 48150 26002 13299 -9958 -24440 -7577 6799 29405 56086
23587 56086 54052 31438 -7812 -27814 -31678 -10969 -19444 -28929 -25868 -19595 -12524 -29251 -19900
23574 -19900 -4093 -13732 -18604 -36241 -22761 -38331 -44917 -46168 -25009 -5677 -8354 -276 -7868
23561 -7868 -15083 -24642 -33837 -29678 -29518 -18968 -18468 -16131 -21469 -1143 8190 7222 1131 -5533 -17466
23546 -17466 -1990 6258 5694 -2553 16858 35595 20161 -1734 8734 2631 -4937 -11560 -36644
$$ packed form
23637b5549J3513L000q376M088N973J2515J1388k985j847J8986m8184k2582k908
23624d2968J3854Q700j0448j7840J2600O058K0147M761l877L0196j5549j2224
23612f590N121J5551j5617L48J6500R567q510k5691k5065L2867J8142n044J0331
23599B1910j3134M662L4967k55k2148j2703k3257j4482J6863J4376K2606K6681
23587E6086k034k2614l9250k0002l864K0709q475r485L061O273P071j6727R351
23574a9900J5807r639m872j7637J3480j5570o586j251K1159J9332k677Q078p592
23561g868p215r559r195M159J60J0550N00K337n338K0326R333r68o091o664j1933
23546a7466J5476Q248n64q247J9411J8737j5434k1895J0468o103p568o623k5084
$$ plain form
23533 -36644 -45542 -39766 -39608 -20631 -30357 -16588 -18485 -31364 -21390 -12937 8214 25601 10508
23520 10508 -9289 -37349 -34660 -25475 -13583 -11193 -31115 -40605 -53949 -72690 -51811 -41859 -12121
23507 -12121 23801 22496 -7876 -38559 -45166 -22310 -24400 -33898 -6965 -8787 -7880 -8133 -17317 -20225
23493 -20225 -23172 -29214 -40195 -13003 1634 -2214 -17536 -22396 -2299 4108 7423 13688 19436
23480 19436 8207 -70 -1063 2334 -7369 -18144 -21384 -17239 -8480 -10776 -19587 -7552 -6652 20888
23466 20888 17327 -10174 -6142 -7587 -10895 -7568 -10777 -43956 -44237 -55062 -46047 -46455 -65232 -71554
23452 -71554 -52242 -39321 -52742 -44331 -18184 -22692 -16400 15844 26070 4163 -11704 -7115
23440 -7115 -33119 -17597 -332 31247 38596 14938 33362 29152 16491 2993 -11662 -36367
$$ packed form
23533c6644q898N776J58J8977r726J3769j897j2879R974Q453K1151J7387j5093
23520A0508j9797k8060K689R185J1892K390j9922r490j3344j8741K0879R952K9738
23507a2121L5922j305l0372l0683o607K2856k090r498K6933j822R07k53r184k908
23493b0225k947o042j0981K7192J4637l848j5322m860K0097O407L315O265N748
23480A9436j1229q277r93L397r703j0775l240M145Q759k296q811J2035R00K7540
23466B0888l561k7501M032j445l308L327l209l3179k81j0825R015m08j8777o322
23452g1554J9312J2921j3421Q411K6147m508O292L2244J0226k1907j5867M589
23440g115k6004J5522J7265L1579P349k3658J8424m210j2661j3498j4655k4705
$$ plain form
23428 -36367 -50195 -18731 -7539 -8807 3287 29909 34959 20617 53078 43959 6689 1391
23416 1391 -20069 -37295 -24563 -22595 -23199 -17013 -10298 -14641 -18002 -17824 -23723 -17776 -17419 -33423
23402 -33423 -14564 -7708 -9485 -5110 -18045 -25661 -2424 581 -18700 -12217 -12092 -16715 2954
23389 2954 16338 36057 32407 3169 -24537 -50672 -21987 -24588 -7370 1791 -28456 -11141
23377 -11141 -6830 6868 5653 -3697 -2061 7137 -7692 -25282 -49412 -61901 -34092 -13890 -12879
23364 -12879 -25146 -17523 -16286 -23937 -58288 -74862 -65010 -55520 -19301 -18438 -14714 -5600 -37622
23351 -37622 -55705 -22028 -8060 3813 -9195 -14083 -35302 -35164 -50431 -50858 -44057 -13319 -21940
23338 -21940 -43006 -63848 -55543 -26865 -17125 -2930 -775 5970 -3032 -32695 -22531 -9654 -9243
$$ packed form
23428c6367j3828L1464J1192j268J2094K6622N050j4342L2461r119l7270n298
23416A391k1460j7226J2732J968o04O186O715m343l361J78n899N947L57j6004
23402c3423J8859O856j777M375j2935p616K3237L005j9281O483J25m623J9669
23389B954J3384J9719l650k9238k7706k6135K8685k601J7218R161l0247J7315
23377a1141M311J3698j215r350J636R198j4829j7590k4130j2489K7809K0202J011
23364a2879j2267P623J237p651l4351j6574R852R490L6219Q63L724R114l2022
23351c7622j8083L3677J3968J1873j3008m888k1219J38j5267m27O801L0738q621
23338b1940k1066k0842Q305K8678R740J4195K155O745r002k9663J0164J2877M11
$$ plain form
23325 -9243 -19900 -11406 -20311 -36000 -42741 -37617 -43216 -67626 -26671 2018 -3890 -14801 -20199
23312 -20199 -6025 -1040 -26480 -38687 -41295 -53517 -31363 3401 25824 35847 29532 11399
23300 11399 -23618 -17087 -2791 7 15366 25433 9378 -10504 -35432 -43768 -40034 -49584 -47828
23287 -47828 -28794 -25411 -15433 -18025 -11902 7032 -8127 -11188 -12465 -18905 -36490 -43350 -49496
23274 -49496 -51992 -24492 -9301 -6076 13946 34065 14181 14356 -3537 -2814 -1983 3406 19777
23261 19777 18943 10571 -21176 -16287 -7588 -1258 3049 -12658 -33824 -59970 -38574 -37063 -22944
23248 -22944 -8292 -5779 -558 11051 26809 7521 -25532 1373 9277 763 16441 18736 -50
23235 -50 -946 1629 -30165 -54335 -42351 -33460 -37803 -23243 -10958 -17738 -42709 -78722 -65503
$$ packed form
23325i243j0657Q494q905j5689o741N124n599k4410M0955K8689n908j0911n398
23312b0199J4174M985k5440j2207k608j2222K2154L4764K2423J0023o315j8133
23300A1399l5017O531J4296K798J5359J0067j6055j9882k4928q336L734r550J756
23287d7828J9034L383R978k592O123J8934j5159l061j277o440j7585o860o146
23274d9496k496K7500J5191L225K0022K0119j9884J75j7893P23Q31N389J6371
23261A9777q34q372l1747M889Q699O330M307j5707k1166k6146K1396J511J4119
23248b2944J4652K513N221J1609J5758j9288l3053K6905P904q514J5678K295j8786
23235e0q96K575l1794k4170J1984Q891m343J4560J2285o780k4971l6013J3219
$$ plain form
23222 -65503 -37135 -23249 -27983 -44779 -50072 -6001 27461 15664 -2073 -26111 -45754 -25212
23210 -25212 -13913 -9240 -13959 -32499 -48548 -52029 -32046 -29162 -19182 -3183 -15279 -26215 -13945
23197 -13945 -19180 -42412 -65157 -60646 -66748 -53292 -38315 -14226 8614 -16720 -35588 -11140
23185 -11140 -3996 -12697 -18311 -22900 9586 24392 -33303 -45777 -29500 -18630 -22723 -10147 -2983
23172 -2983 -3084 -10082 -21184 -10664 3309 11670 22482 24051 -12616 -21586 -14526 -219 1354
23159 1354 -1655 -8185 -20111 -21823 -9527 -34219 -37793 -16810 -6544 13719 38917 33741 15457
23146 15457 13508 37671 46252 47887 9011 -5 17403 3188 15644 11937 -27929 -38605 -33668
23133 -33668 -25047 -20634 -11324 -1208 1744 -13453 -16528 -26549 -38883 -19198 -15054 -9921 -3642
$$ packed form
23222f5503K8368J3886m734j6796n293M4071L3462j1797j7737k4038j9643K0542
23210b5212J1299M673m719j8540j6049l481J9983K884R980J5999j2096j0936J2270
23197a3945n235k3232k2745M511o102J3456J4977K4089K2840k5334j8868K4448
23185a1140P144q701n614m589L2486J4806n7695j2474J6277J0870m093J2576P164
23172b983j01o998j1102J0520J3973Q361J0812J569l6667q970P060J4307J573
23159A354l009o530j1926j712J2296k4692l574K0983J0266K0263K5198n176j8284
23146A5457j949K4163Q581J635l8876r016J7408j4215J2456l707l9866j0676M937
23133c3668Q621M413R310J0116K952j5197l075j0021j2334J9685M144N133O279
$$ plain form
23120 -3642 -12490 -6763 12805 8126 -1819 -956 -1234 -6532 -14538 -41421 -10191 -12626 -58205 -66357
23106 -66357 -60486 -51284 -36358 1348 29466 28036 -12834 -9680 5922 8114 32006 36294 52563
23093 52563 39883 28043 8710 4570 28361 34324 12295 -3163 733 12506 24286 31120
23081 31120 24367 10665 1901 -407 -24356 -16388 11684 9203 -26528 -35906 -38270 -40377 -48526
23068 -48526 -46564 -32888 -13180 4999 11848 -3345 14494 12050 -2559 -13491 -13074 -13031 -3942
23055 -3942 14686 23268 10563 2257 -15159 -18337 -13817 -32426 -16593 10613 9418 -417 7360
23042 7360 14845 1457 5385 -22485 -24257 -10368 -32208 -34824 -39501 -53529 -48460 -41253 -23596
23029 -23596 -28137 -30197 -25996 -25802 -10060 6380 4688 -681 7689 -17982 -11412 11349 15249 16859
$$ packed form
23120c642q848N727J9568m679r945Q63k78n298q006k6883L1230k435m5579q152
23106f6357N871R202J4926L7706K8118j430m0870L154J5602K192K3892M288J6269
23093E2563j2680j1840j9333m140K3791N963k2029j5458L896J1773J1780O834
23081C1120o753j3702q764k308k3949P968K8072k481l5731r378k364k107q149
23068d8526J962J3676J9708J8179O849j5193J7839k444j4609j0932M17M3R089
23055c942J8628Q582j2705q306j7416l178M520j8609J5833K7206j195r835P777
23042G360P485j3388L928k7870j772J3889k1840k616m677j4028N069P207J7657
23029b3596m541k060M201J94J5742J6440j692n369Q370k5671O570K2761L900J610
$$ plain form
23015 16859 21518 27901 22033 -4646 -16751 -7654 2932 2759 -5317 -31859 -33220 -42003 -45354 -34141
23001 -34141 -17394 16230 8297 -17772 -3490 -9857 8626 6316 -2302 -6636 -15906 25845 6893
22988 6893 -26895 -57641 -24056 13944 14175 -12730 -22710 -25118 -32314 -10564 3427 -1641 2412
22975 2412 9466 15054 4812 -935 10756 -3531 -7963 18538 4790 -5745 -3064 -2127 -14016
22962 -14016 -39225 -36849 -36108 -42963 -37714 -61326 -80003 -50415 -21915 -6272 -26135 -9074 -11745
22949 -11745 -36674 -15863 22883 16220 11266 1949 2704 -3242 -23423 -25407 -32585 -53429 -62198
22936 -62198 -39638 -22688 -18137 -13933 -6515 -19065 -34162 -28727 1605 20354 16160 -9389 2814
22923 2814 22785 9390 -16987 -25652 -11462 3372 -17132 -26106 -36795 -74368 -71466 -59246
$$ packed form
23015A6859M659O383n868k6679j2105R097J0586j73q076k6542j361q783l351J1213
23001c4141J6747L3624p933k6069J4282o367J8483k310q618m334r270M1751j8952
22988F893l3788l0746L3585L8000K31k6905r980k408p196K1750J3991n068M053
22975B412P054N588j0242n747J1691j4287m432K6501j3748j0535K681R37j1889
22962a4016k5209K376P41o855N249k3612j8677K9588K8500J5643j9863J7061k671
22949a1745k4929K0811L8746o663m954r317P55n946k0181j984p178k0844q769
22936f2198K2560J6950M551M204P418j2550j5097N435L0332J8749m194k5549J2203
22923B814J9971j3395k6377q665J4190J4834k0504q974j0689l7573K902J2220
$$ plain form
22911 -59246 -49766 -26809 -16306 -34029 -25626 -21019 -38717 -31198 -7635 -36081 -56242 -62833 -60791
22898 -60791 -43695 -38998 -42566 -33775 -29664 -32650 -56852 -51345 -22046 -2743 -2937 -13930 -11442
22885 -11442 -15389 -41802 -46461 -45420 -36812 -44569 -35348 -17234 -51952 -42598 -36091 -41233 -48169 -63329
22871 -63329 -80627 -75335 -42718 -27994 -31910 -43287 -25736 7953 15287 -68 -11104 2225
22859 2225 -9537 -12599 -21371 -29420 -11224 1273 -9578 -45025 -43958 -32315 -12948 10102 420
22846 420 -4858 -10099 -12365 -2316 -4474 -25727 -38729 -36180 -55170 -73301 -60667 -28802 5365
22833 5365 37522 37270 18625 -1923 -23706 -14693 -4576 13766 -7565 -20298 -25984 -26852 -15091
22820 -15091 -23127 -2553 -11232 -7662 -16227 -33160 -10577 -19206 -11580 -6762 -32333 -40744 -24797
$$ packed form
22911e9246R480K2957J0503j7723Q403M607j7698P519K3563k8446k0161o591K042
22898f0791J7096M697l568Q791M111k986k4202N507K9299J9303j94j0993K488
22885a1442l947k6413m659J041Q608p757R221J8114l4718R354O507n142o936j5160
22871f3329j7298N292L2617J4724l916j1377J7551L3689P334j5355j1036J3329
22859B225j1762l062q772q049J8196J2497j0851l5447J067J1643J9367K3050r682
22846D20n278n241k266J0049k158k1253j3002K549j8990j8131J2634L1865L4167
22833E365L2157k52j8645k0548k1783R013J0117J8342k1331j2733n686q68J1761
22820a5091q036K0574q679L570q565j6933K2583q629P626M818k5571q411J5947
$$ plain form
22807 -24797 -31457 -55319 -49524 -37572 -46017 -60836 -61984 -17748 -6669 -20450 -6560 6577
22795 6577 -17832 -43239 -31442 -28519 -25684 -32603 -31298 -40280 -42038 -53924 -45054 -30963 -40379
22782 -40379 -30577 -23907 -32772 -47610 -51636 -52161 -53956 -72978 -41071 -14467 -15156 -9671 -46847 -61513
22768 -61513 -40704 -43713 -33452 -26704 -27229 -38260 -18144 6974 -2736 14486 26640 15677 9977
22755 9977 11714 4156 1180 -6790 2806 17601 2325 -4111 -6523 -42587 -39936 -19474 -21953 -27489
22741 -27489 -27891 -22665 -18904 -11797 -9325 13961 28657 22217 -19430 -9994 4913 16889 11496
22728 11496 24242 46011 26591 21726 65090 47789 -17962 -17353 3103 12146 -2823 -29362
22716 -29362 -13773 -14488 -17308 -521 -316 1912 3273 424 1445 29724 30811 37612 29960 22986
$$ packed form
22807b4797o660k3862N795J1952q445j4819j148M4236J1079j3781J3890J3137
22795F577k4409k5407J1797K923K835o919J305q982j758j1886Q870J4091r416
22782d0379R802O670q865j4838m026n25j795j9022L1907K6604o89N485l7176j4666
22768f1513K0809l009J0261O748n25j1031K0116K5118r710J7222J2154j0963n700
22755I977J737p558k976p970R596J4795j5276o436k412l6064K651K0462k479n536
22741b7489m02N226L761P107K472K3286J4696o440m1647R436J4907J1976n393
22728A1496J2746K1769j9420m865M3364j7301o5751O09K0456R043j4969k6539
22716b9362J5589p15k820J6787K05K228J361k849J021K8279J087O801p652o974
$$ plain form
22702 22986 12247 14249 -9002 -20349 -2554 -10655 -27046 -34444 -46452 -68393 -40284 -27830
22690 -27830 -24665 -12198 -11221 -1637 -4720 21558 21617 42979 57976 36796 3103 11472 18998 -992
22676 -992 -31564 -33429 -35086 -48027 -35115 -18988 -27165 -38911 -26445 -26270 -26161 -23341 -8348 12633
22662 12633 8706 13053 4077 -5276 13301 5493 -1839 -12676 -2894 1522 5951 -20245 -29886 -50436
22648 -50436 -59482 -41014 -43585 -43817 -38818 -26863 -17261 -7523 -21416 -35240 -21383 14484 15009
22635 15009 16311 -244 -9596 -29396 -53548 -37858 -13078 -25483 -36876 -31646 -9097 20376
22623 20376 13190 -715 -33451 -41386 -18041 -3501 -6626 -11393 -17324 4015 28462 21566 -1066
22610 -1066 -19674 -11992 -5004 12629 5840 -16530 -23565 -4544 -1609 -21240 -16198 -13996 897
$$ packed form
22702B2986j0739K002k3251j1347J7795q101j6391p398j2008k1941K8109J2454
22690b7830L165J2467R77R584l083K6278N9K1362J4997k1180l3693Q369P526j9990
22676i92l0572j865j657j2941J2912J6127q177j1746J2466J75J09K820J4993K0981
22662A2633l927M347q976r353J8577p808p332j0837R782M416M429k6196r641k0550
22648e0436r046J8468k571k32M999J1955R602R738j3893j3824J3857L5867N25
22635A5009J302j6555r352j9800k4152J5690K4780j2405j1393N230K2549K9473
22623B0376p186j3905l2736p935K3345J4540l125m767n931K1339K4447o896k2632
22610a066j8608P682O988J7633o789k2370p035J9021K935j9631N042K202J4893
$$ plain form
22597 897 7166 5799 -7230 -30121 -43263 -63082 -34153 -13732 8371 32289 35447 -17275 -35559
22584 -35559 -27176 -12388 -27421 -42276 -33102 -31290 -47300 -40364 -43575 -37786 -9179 -4195 -4056
22571 -4056 3041 -8600 -9009 -19104 1818 12986 -10553 -30905 -22848 -5927 2765 -7273 -10436
22558 -10436 415 -6374 8261 7998 4955 12718 12613 -19229 -12418 2644 -4967 -1347 -11217 -37890
22544 -37890 -71467 -70757 -53941 -15556 -20958 -16687 10290 433 -23716 -53165 -71002 -67447 -35991
22531 -35991 1856 6861 14341 10483 -20889 -17897 124 -4955 -23287 -47379 -41254 -29614 -21309
22518 -21309 -7251 15192 14731 -14806 -40062 -24241 2210 16159 3330 -1569 -6547 -19504
22506 -19504 -29525 -6725 12044 -9121 -7910 -2999 12424 30702 13824 -7987 -32312 -53155
$$ packed form
22597H97O269j367j3029k2891j3142j9819K8929K0421K2103K3918L158n2722j8284
22584c5559Q383J4788j5033j4855R174J812j6010O936l211N789K8607M984J39
22571d056P097j1641m09j0095K0922J1168k3539k0352Q057J6921Q692j0038l163
22558a0436J0851o789J4635k63l043P763j05l1842O811J5062p611L620r870k6673
22544c7890l3577P10J6816L8385n402M271K6977r857k4149k9449j7837L555L1456
22531c5991L7847N005P480l858l1372K992J8021n079j8332k4092O125J1640Q305
22518b1309J4058K2443m61k9537k5256J5821K6451J3949j2829m899m978j2957
22506a9504j0021K2800J8769k1165J211M911J5423J8278j6878k1811k4325k0843
$$ plain form
22494 -53155 -58440 -50237 -64344 -66108 -65544 -56847 -33305 -32708 -42821 -42509 -52830 -62409 -35974 4867
22480 4867 -17651 -17842 -33598 -56831 -44944 -24446 -20547 -9186 -21806 -27317 -19965 -8657 -10489
22467 -10489 -33227 -52682 -26203 -4093 10190 -424 -19510 -35377 -20591 -13463 -38939 -26225
22455 -26225 -29467 -17491 4853 19554 42430 24292 -3498 -29638 761 14608 -4241 -18415
22443 -18415 -7965 -11056 -4302 5061 -1238 -8392 -16021 877 5453 8420 4768 -26307 -45106
22430 -45106 -20163 8 -4647 -19931 -11492 -9832 -3346 -12442 -20497 -17535 -44778 -55668 -41193
22417 -41193 -4080 -12047 -10818 -6133 -3879 -16663 -44416 -35634 -17300 2718 -3530 -28433 -51200
22404 -51200 -42104 -12433 3429 4449 -32368 -40655 -31547 -23117 -39614 -46440 -51579 -67263 -66052
$$ packed form
22494e3155n285Q203j4107j764N64Q697K3542N97j0113L12j0321r579K6435M0841
22480D867k2518j91j5756k3233J1887K0498L899J1361j2620n511P352J1308j832
22467a0489k2738j9455K6479K2110J4283j0614j9086j5867J4786P128k5476J2714
22455b6225l242J1976K2344J4701K2876j8138k7790k6140L0399J3847j8849j4174
22443a8415J0450l091O754R363o299p154p629J6898M576K967l652l1075j8799
22430d5106K4943K0171m655j5284Q439J660O486r096q055K962k7243j0890J4475
22417d1193L7113p967J229M685K254j2784k7753Q782J8334K0018o248k4903k2767
22404e1200R096K9671J5862J020l6817q287R108Q430j6497o826n139j5684J211
$$ plain form
22391 -66052 -35879 -12159 -20790 -52831 -64372 -27828 11805 7768 -7611 -16975 -52814 -63883
22379 -63883 -30620 -6880 -6015 -4858 -28469 -66840 -79938 -55836 -25113 -8252 -5068 -17819
22367 -17819 -58480 -57768 -45388 -23320 12732 19064 26169 3880 -3868 -1122 8160 -2634 5818
22354 5818 21215 23204 27309 20893 -15653 -6942 9849 8989 7015 -9858 -2398 16793 771
22341 771 24597 -1767 -33087 -5623 1926 -9741 -27915 -19815 -28913 -19152 -18328 -25373 -17876 -13015
22327 -13015 -28057 -51576 -46918 -59847 -51778 -36332 -17967 -16187 -13216 -28551 -42664 -32766 -18366
22314 -18366 -11283 -2793 -29035 -40670 -37509 -7630 465 -8409 -33054 -23298 1300 16544 24954
22301 24954 14843 17511 13669 -19386 -10752 -27087 -26630 -27379 -24420 -13771 -11109 -12108 -8053 -25707
$$ packed form
22391f6052L0173K3720q631l2041j1541L6544L9633m037j5379r364l5839j1069
22379f3883L3263K3740Q65J157k3611l8371j3098K4102L0723J6861L184j2751
22367a7819m0661P12J2380K2068L6052O332P105k2289p748K746R282j0794Q452
22354E818J5397J989M105o416l6546Q711J6791q60j974j6873P460J9191j6022
22341G71K3826k6364l1320K7464P549j1667j8174Q100r098R761Q24p045P497M861
22327a3015j5042k3519M658j2929Q069J5446J8365J780K971j5335j4113R898J4400
22314a8366P083Q490k6242j1635L161K9879Q095q874k4645R756K4598J5244Q410
22301B4954j0111K668l842l3055Q634j6335M57p49K959J0649K662r99M055j7654
$$ plain form
22287 -25707 -15891 2497 -20855 -20041 -26597 -30410 -22989 -15946 -9469 -2572 23110 44917 35165 -10675
22273 -10675 -23798 -6438 11729 14511 -813 17260 10943 -9733 -5317 -18031 -40117 -45624
22261 -45624 -48550 -37781 -41528 -10412 8245 18379 32521 39664 31659 2482 -13823 -11987 -9819
22248 -9819 2680 20629 30567 7879 -20307 -35472 -53565 -40267 -32347 -23686 -10177 -6026 5045
22235 5045 12202 -15661 -49143 -42807 -22738 -23116 -9032 -14444 -20273 -23338 -19928 -38558 -25467
22222 -25467 -4525 -34692 -40615 -50368 -56305 -62418 -43630 -40388 -33760 -15273 13623 17318 4619
22209 4619 20670 28888 18745 -15754 -41855 -9393 2146 -27346 -40524 -38361 -30549 -16666
22197 -16666 -22756 -30468 -43256 -70148 -63379 -66988 -51214 -53550 -64904 -61670 -42476 -43745 -69041
$$ packed form
22287b5707R816J8388k3352Q14o556l813P421P043O477O897K5682K1807r752m5840
22273a0675j3123J7360J8167K782j5324J8073o317k0676M416j2714k2086n507
22261d5624k926J0769l747L1116J8657J0134J4142P143q005k9177j6305J836K168
22248i819J2499J7949R938k2688k8186j5165j8093J3298P920Q661J3509M151J1071
22235E045P157k7863l3482O336K0069l78J4084n412n829l065L410j8630J3091
22222b5467K0942l0167n923r753n937o113J8788L242O628J8487K8896L695j2699
22209D619J6051Q218j0143l4499k6101L2462J1539k9492j3178K163P812J3883
22197a6666o090p712j2788k6892O769l609J5774k336j1354L234J9194j269k5296
$$ plain form
22184 -69041 -66151 -46119 -41647 -34566 -23142 -16165 -6402 2755 10424 -7111 -12282 -6270 -20169
22171 -20169 -27600 -11115 10666 -5915 -39956 -76385 -63573 -39287 -30654 -8207 -18185 8452
22159 8452 16144 5873 1904 8722 18397 -2921 -1780 -756 -12967 3051 6192 1053 15711
22146 15711 13030 22887 24296 28923 20148 -2416 -20067 -12219 -7038 -21515 -2359 1090 7322
22133 7322 -1818 -3300 10089 21159 9587 -19706 -45661 -53516 -35290 -31113 -17517 -32770 -49932
22120 -49932 -39484 -28829 -38789 -37414 -20570 -11363 -8345 9112 323 -4457 -348 11438 1064
22107 1064 -18839 -22257 -33244 -39520 -54899 -61491 -51087 -37640 -21077 -28129 -27287 -13585 9547
22094 9547 20881 20900 17498 2014 -19921 -34274 -25816 2646 22499 6037 -27209 -47308 -29460
$$ packed form
22184f9041K890K0032M472P081J1424O977R763R157P669j7535n171O012j3899
22171b0169p431J6485K1781j6581l4041l6429J2812K4286Q633K2447r978K6637
22159H452P692j0271l969O818R675k1318J141J024j2211J6018L141n139J4658
22146A5711k681R857J409M627q775k2564j7651P848N181j4477J9156L449O232
22133G322r140j482J3389J1070j1572k9293k5955p855J8226M177J3596j5253j7162
22120d9932J0448J0655r960J375J6844R207L018J7457q789m780M109J1786j0374
22107A064j9903l418j0987o276j5379o592J0404J3447J6563p052Q42J3702K3132
22094I547J1334J9l402j5484k1935j4353Q458K8462J9853j6462l3246k0099J7848
$$ plain form
22081 -29460 -38558 -34519 -41582 -26876 -1269 -5225 -6664 4566 6921 15546 38345 44123 27093
22068 27093 -2962 -4576 8807 -6938 -16401 -15240 11546 -17021 -7566 16448 18328 16564 15154
22055 15154 1950 -24771 -29680 -14042 -22930 -13697 9208 12191 -12535 -27339 -25391 -15830 -32940
22042 -32940 -24457 6357 15875 13114 31663 32669 9163 -17850 -34115 -49069 -75870 -68556 -37098
22029 -37098 -59047 -51505 -17820 5651 29176 6518 -816 -9332 -16463 -13525 -20226 -22318 -40217
22016 -40217 -38375 -16219 -22589 -143 23307 568 -20099 -25907 -18397 -13238 1359 19712 5731
22003 5731 -11729 -30973 -1896 1732 -11955 6800 23509 -6194 -12743 -9278 -15259 -18357 -13863
21990 -13863 -28953 -48836 -45176 -17218 9031 -458 -18890 -37706 -24272 -18907 -21026 -26788 7346
$$ packed form
22081b9460r098M039p063J4706K5607l956j439J1230K355Q625K2799N778j7030
22068B7093l0055j614J3383j5745r463J161K6786k8567R455K4014J880j764j410
22055A5154j3204k6721m909J5638q888R233K2905K983k4726j4804J948R561j7110
22042c2940Q483L0814R518k761J8549J006k3506k7013j6265j4954k6801P314L1458
22029c7098k1949P542L3685K3471K3525k2658p334q516p131K938o701k092j7899
22016d0217J842K2156o370K2446K3450k2739k0667n808P510N159J4597J8353j3981
22003E731j7460j9244K9077L628j3687J8755J6709k9703o549L465n981l098M494
21990a3863j5090j9883L660K7958K6249r489j8432j8816J3434N365k119n762L4134
$$ plain form
21977 7346 9991 -9770 4641 -4702 -24083 -24097 -9835 -5117 -3386 -26537 -42771 -16255 211
21964 211 -26819 -42344 -16377 16494 8814 32101 11433 -2630 -20851 -32292 -18326 10420
21952 10420 16655 -17518 -27296 -20130 -38850 -33938 -21222 14751 14667 1490 3087 2560 -11915 -6892
21938 -6892 14421 18986 -8164 -7091 19477 10995 -10767 5729 13831 -6949 -28422 -8520 9021
21925 9021 2499 -14810 -43157 -58241 -34564 -7073 12485 20708 15818 -3355 -25283 -23200 -11769
21912 -11769 10117 -10704 -36389 -33181 -15661 4633 -14817 -9384 -49033 -77905 -66102 -70456
21900 -70456 -74450 -63732 -31561 -16725 -39998 -52328 -41528 -29620 -9110 11747 36043 31045
21888 31045 17257 30409 66324 58997 44278 4847 -9839 7926 4704 1725 23872 42838
$$ packed form
21977G346K645j9761J4411r343j9381j4J4262M718J731k3151j6234K6516J6466
21964B11k7030j5525K5967L2871p680K3287k0668j4063j8221j1441J3966K8746
21952A0420O235l4173r778P166j8720M912J2716L5973q4j3177J597n27j4475N023
21938f892K1313M565k7150J073K6568q482k1762J6496Q102k0780k1473J9902J7541
21925I021o522j7309k8347j5084K3677K7491J9558Q223m890j9173k1928K083J1431
21912a1769K1886k0821k5685L208J7520K0294j9450N433l9649k8872J1803m354
21900g0456l994J0718L2171J4836k3273j2330J0800J1908K0510K0857K4296m998
21888C1045j3788J3152L5915p327j4719l9431j4686J7765l222k979K2147J8966
$$ plain form
21876 42838 24313 -11264 -9434 23996 7773 -6031 4072 -362 9881 4339 15808 -8097
21864 -8097 -42320 -31912 -30186 -31183 -49637 -57253 -46019 -19739 -891 -7316 -25145 -40344 -16394
21851 -16394 -19029 -19543 -32482 -41805 -20927 -19647 -21234 -9254 -13104 16997 29092 9514 -22904
21838 -22904 -50856 -40290 -34581 -28927 -45459 -49764 -34874 -28736 -36293 -19926 2678 8199 30710
21825 30710 34216 8817 -21004 -38574 -42435 -40541 -29920 -34964 -22534 -22077 -44830 -41950 -29190
21812 -29190 -29226 -20418 -24671 -33419 -35054 -78464 -92877 -60949 -12597 -8111 -34251 -34260 -4430 2322
21798 2322 -6568 -14930 -29316 -38400 -13701 -17748 -13774 -10427 -22256 -23146 -24992 -31434 -4654 -10964
21784 -10964 -19400 -12785 -19765 -21459 -33453 -31217 -31151 -42557 -55089 -37658 -27510 -26294 -19035 1093
$$ packed form
21876D2838j8525l5577J830L3430j6223j3804J0103m434J0243n542J1469k3905
21864h097l4223J0408J726r97j8454p616J1234K6280J8848o425j7829j5199K3950
21851a6394k635n14j2939r323K0878J280j587J1980l850L0101J2095j9578l2418
21838b2904k7952J0566N709N654j6532m305J4890O138p557J6367K2604N521K2511
21825C0710L506k5399k9821j7570l861J894J0621n044J2430M57k2753K880J2760
21812b9190l6Q808m253q748j635m3410j4413L1928M8352M486k6140rK9830O752
21798B322q890q362j4386r084K4699m047L974L347j1829q90j846o442K6780o310
21784a0964q436O615o980j694j1994K236O6j1406j2532J7431J0148J216P259K0128
$$ plain form
21770 1093 4687 -17093 -44790 -46335 -46898 -41572 -36123 -23755 -35002 -29828 -34960 -24696 -16715 -15148
21756 -15148 -14557 -12797 -13695 -6658 7262 20599 31938 10804 9706 -5155 -28412 -13960 845
21743 845 11657 6839 14632 -8299 -3165 15998 -2150 -17785 -5766 8223 12514 -7144 -12741
21730 -12741 -10336 7294 986 -5245 -13565 -24368 -20343 -45404 -41558 -25158 -19339 -13781 35589
21717 35589 47972 33494 28102 1604 12932 32073 16880 28417 30401 27609 14393 10082
21705 10082 18205 5498 -2934 -14899 -11602 -26499 -39286 -17527 -15216 1032 19825 -503
21693 -503 -18719 -19860 -9737 -1990 -14508 -17856 -13284 -37865 -47737 -58639 -35914 -19351 -16561
21680 -16561 -16845 -8048 -11094 -52586 -42178 -18577 -26724 -35225 -18671 -11042 -12711 4604 2478
$$ packed form
21770A093L594k1780k7697j545n63N326N449J2368j1247N174n132J0264P981J567
21756a5148N91J760q98P037J3920J3337J1339k1134j098j4861k3257J4452J4805
21743H45J0812m818P793k2931N134J9163j8148j5635J2019J3989M291j9658n597
21730a2741K405J7630o308o231q320j0803M025k5061L846J6400N819N558M9370
21717C5589J2383j4478n392k6498J1328J9141j5193J1537J984k792j3216m311
21705A0082Q123j2707q432j1965L297j4897j2787K1759K311J6248J8793k0328
21693e03j8216j141J0123P747j2518l348M572k4581r872j0902K2725J6563K790
21680a6561k84Q797l046m1492J0408K3601q147q501J6554P629j669J7315k126
$$ plain form
21667 2478 -120 24363 13976 -7210 -13886 -14955 -19777 13623 13325 21200 51819 30701 21323
21654 21323 8022 -27498 -24943 -9882 -10086 -16904 -30274 -29843 -20615 -30403 -39320 -36716 -24568 -24662
21640 -24662 -30538 -41476 -37047 -23316 -17871 -22559 -22510 -3048 -18056 -24119 -11014 -7837 -14254 -11275
21626 -11275 -9355 -2632 6142 2207 -770 16671 15142 17634 4355 -2623 -5531 -13004 1802 -19056
21612 -19056 -34171 -11643 -2056 14672 3499 -2737 -5556 -3880 -3884 -7939 5033 9860 -6440 254
21598 254 -5261 -13422 -8316 5096 -13654 -30755 -128 52655 53878 32371 17764 -13962 -20751
21585 -20751 -29922 -28090 -16300 -17668 -34507 -19430 -24497 -22253 -27993 -17968 -20993 5691 16050
21572 16050 15374 -12317 -6340 14146 -1465 -7314 -11967 -25961 -37569 -33977 -33010 -11536 357
$$ packed form
21667B478k598K4483j0387k1186o676j069m822L3400k98P875L0619k1118r378
21654B1323j3301l5520K555J5061k04o818j3370M31R228r788q917K604J2148r4
21640b4662n876j0938M429J3731N445m688M9J9462j5008o063J3105L177o417K979
21626a1275J920O723Q774l935k977J7441j529K492j3279o978k908p473J4806k0858
21612a9056j5115K2528R587J6728j1173o236k819J676mm055J2972M827j6300O694
21598B54n515q161N106J3412j8750j7101L0627N2783J223k1507j4607l1726o789
21585b0751r171J832J1790j368j6839J5077n067K244n740J0025l025K6684J0359
21572A6050o76k7691N977K0486j5611n849m653j3994j1608L592R67K1474J1893
$$ plain form
21559 357 -3791 4725 10375 18278 17888 3252 -32823 -41792 -28801 5360 1243 -15410 -44940 -3097
21545 -3097 48147 40508 41897 59085 52355 10930 -25217 -61896 -67708 -78855 -80042 -66137 -30075
21532 -30075 -10823 6161 9462 -17778 -58377 -63138 -60193 -63231 -57088 -22285 -11326 15018 1982
21519 1982 -35863 -46594 -32254 -48632 -56216 -29666 -59809 -78968 -46675 -20520 -25402 -7012
21507 -7012 2438 -21990 -28076 -11616 -9958 -5613 -4565 -1046 -6819 -11517 -10328 -12266 -3477 -5772
21493 -5772 -4343 -17107 4495 -6353 -18261 -22929 -28079 -19245 -20397 -18923 5453 13683 -8808
21480 -8808 -25367 -27356 4162 11538 -7825 -20262 540 32116 33408 24383 10394 -27865 -42734
21467 -42734 -55656 -61099 -36024 -37117 -58657 -57164 -42014 -29066 -15518 -10962 -7122 11148 28585
$$ packed form
21559C57m148Q516N650P903l90j4636l6075q969J2991L4161m117j6653k9530M1843
21545c097N1244p639J389J7188o730m1425l6147l6679n812j1147j187J3905L6062
21532c0075J9252J6984L301k7240m0599m761K945l038O143L4803J0959K6344j3036
21519A982l7845j0731J4340j6378p584K6550l0143j9159L2293K6155m882J8390
21507g012R450k4428o086J6460J658M345J048L519n773m698J189j938Q789k295
21493e772J429j2764K1602j0848j1908m668n150Q834j152J474K4376Q230k2491
21480h808j6559j989L1518P376j9363j2437K0802L1576J292r025j3989l8259j4869
21467d2734j2922n443K5075j093k1540J493J5150J2948J3548M556L840J8270J7437
$$ plain form
21454 28585 8729 -13741 -36979 -6176 21537 16001 24140 491 -20810 -24694 -45586 -53118
21442 -53118 -24838 -15489 -18847 -16761 -17093 -15353 -9025 19167 24802 -14640 -2002 -7631 11176
21429 11176 6675 -11674 -12548 -11778 -32969 -44969 -40968 -4207 30331 38581 34992 15914 -33424
21416 -33424 -64681 -55966 -49524 -24590 -19452 -20513 -37530 -41822 -28413 -34112 -35215 -26137 -10828
21403 -10828 -7285 -25993 -29536 -32685 -12966 -15070 -10290 -3798 -3868 12863 7104 -3674 38378 5680
21389 5680 -41525 -32986 -15654 -6953 21608 44037 31096 32831 6488 -27269 -27776 -13831 -23700
21376 -23700 -11143 -17214 -44705 -23103 -25384 -31804 -42002 -37812 -44019 -33962 -43481 -51264 -44416
21363 -44416 -58068 -64944 -61522 -39015 -48589 -62498 -45597 -40240 -34035 -30973 -43830 -55701 -58292
$$ packed form
21454B8585j9856k2470k3238L0803K7713n536Q139k3649k1301l884k0892p532
21442e3118K8280R349l358K086l32J740O328K8192N635l9442J2638n629J8807
21429A1176m501j8349q74P70k1191j2000M001L6761L4538Q250l589j9078m9338
21416c3424l1257Q715O442K4934N138j061j7017m292J3409n699j103R078J5309
21403a0828L543j8708l543l149J9719k104M780O492p0J6731n759j0778M2052l2698
21389E680m7205Q539J7332Q701K8561K2429j2941J735k6343l3757n07J3945r869
21376b3700J2557o071k7491K1602k281o420j0198M190o207J0057r519p783O848
21363d4416j3652o876L422K2507r574j3909J6901N357O205L062j2857j1871k591
$$ plain form
21350 -58292 -72362 -63282 -60404 -54585 -46257 -44127 -35601 -30709 -9087 -10212 422 11908 2035
21337 2035 -19957 -34471 -31121 267 -15097 -36018 -24137 -25557 -45096 -59151 -27403 -4912
21325 -4912 17289 20715 15933 16122 24229 27397 13809 -15769 9687 10166 693 -948 3987 -7071
21311 -7071 -29548 -49818 -70041 -65176 -59672 -26272 -5980 -43681 -77516 -81537 -64212 -27309
21299 -27309 7523 25097 28656 9380 4233 -14091 -57040 -74157 -58059 -40166 -43839 -10827
21287 -10827 -2231 -29121 -37086 -49844 -51671 -15350 14377 49791 41347 3216 -29087 -14523
21275 -14523 -22519 -27994 -24274 608 28181 26876 9122 -16853 -35978 -73425 -46934 -19550
21263 -19550 -1793 11596 19125 -889 -20145 -13992 -11128 -3971 -2823 -7527 -20136 -5988 11399
$$ packed form
21350e8292j4070R080K878N819Q328K130Q526M892K1622j125J0634J1486r873
21337B035k1992j4514L350L1388j5364k0921J1881j420j9539j4055L1748K2491
21325d912K2201L426m782J89Q107L168j3588k9578K5456M79r473j641M935j1058
21311g071k2477k0270k0223M865N504L3400K0292l7701l3835m021J7325L6903
21299b7309L4832J7574L559j9276n147j8324m2949j7117J6098J7893l673L3012
21287a0827Q596k6890p965j2758j827L6321K9727L5414q444l8131l2303J4564
21275a4523p996n475L720K4882K7573j305j7754k5975j9125l7447K6491K7384
21263a9550J7757J3389P529k0014j9256O153K864P157J148m704j2609J4148J7387
$$ plain form
21250 11399 1052 7938 12906 1646 -21928 -70325 -81727 -48097 -33070 -41234 -33435 -27140 -10894
21237 -10894 -8063 -28856 -69968 -75980 -78761 -66905 -52937 -40756 -27949 -13122 -2874 -5440
21225 -5440 -10491 -2651 -18978 -27543 -10805 17385 20517 3370 -17803 -6853 8577 4059 -4586
21212 -4586 12099 9813 -13787 2824 8992 17832 6121 16369 20801 8443 -22844 -33563 -39622
21199 -39622 -61208 -60681 -20801 -23201 -17021 -671 982 -201 4958 -995 6792 10791 2305 -24184
21185 -24184 -44831 -28623 -22343 -31956 -41079 -51900 -47744 -43119 -39968 -21405 51 10020 3337
21172 3337 -23870 -40833 -44426 -20063 6870 15933 -5595 1390 4483 -12749 -28392 -7215 -7246
21159 -7246 -6852 -2386 -2091 19427 14594 16867 21492 12259 12681 18883 -894 4188 12844 25351 38481
$$ packed form
21250A1399j0347O886M968j1260k3574m8397j1402L3630J5027q164P799O295J6246
21237a0894K831k0793m1112o012k781J1856J3968J2181J2807J4827J0248k566
21225e440n051P840j6327q565J6738K8190L132j7147k1173J0950J5430m518q645
21212d586J6685k286k3600J6611O168Q840j1711J0248M432j2358l1287j0719o059
21199c9622k1586N27L9880k400O180J6350J653j183N159n953P787L999q486k6489
21185b4184k0647J6208O280r613r123j0821M156M625L151J8563K1456R969o683
21172C337k7207j6963l593K4363K6933R063k1528O985L093j7232j5643K1177l1
21159g246L94M466K95K1518m833K273M625r233M22O202j9777N082Q656J2507J3130
$$ plain form
21144 38481 21800 16800 -17221 -40289 -31296 -17842 11566 29865 3554 -35031 -54237 -31823
21132 -31823 -30021 -40219 -38982 -36649 -43860 -56852 -54164 -14038 22422 48539 55048 35803 -4222
21119 -4222 -8777 -3142 -24076 -20894 24260 34320 26058 19824 38174 33179 31054 40337 40222 12883
21105 12883 13084 43698 31561 25524 333 6895 35920 50197 27950 10247 -15086 -28451
21093 -28451 -18737 18022 29484 37664 25052 -5578 -8691 -17643 -5134 -13225 -6278 11984 -18937
21080 -18937 -30107 -14502 -3259 23764 27170 2837 -17167 5043 -459 11064 25313 25587
21068 25587 4543 -18113 3343 29230 16455 -4497 -2290 -22105 -40180 -27831 -13549 479
21056 479 4306 1892 -9755 -20943 -7214 119 -4712 -5566 3564 7553 21755 36259 50376 34417
$$ packed form
21144C8481j6681n000l4021k3068Q993J3454K9408J8299k6311l8585j9206K2414
21132c1823J802j0198J237K333p211j2992K688M0126L6460K6117O509j9245m0025
21119d222m555N635k0934L182M5154J0060q262o234J8350m995k125R283j15k7339
21105A2883K01L0614j2137o037k5191O562K9025J4277k2247j7703k5333j3365
21093b8451R714L6759J1462Q180j2612l0630l113q952J2509q091O947J8262l0921
21080a8937j1170J5605J1243K7023L406k4333k0004K2210n502J1523J4249K74
21068B5587k1044k2656K1456K5887j2775k0952K207j9815j8075J2349J4282J4028
21056D79L827k414j1647j1188J3729P333m831q54R130L989J4202J4504J4117j5959
$$ plain form
21042 34417 30224 19164 22608 11159 9517 17488 33749 51868 21516 6341 -2072 1659 361
21029 361 -17263 -25296 -37037 -18475 384 3324 4740 17416 19388 12105 -2288 11003 30130
21016 30130 33915 8305 -2127 838 -1280 -6397 -15758 -38113 -29780 -9936 16901 15530 13124
21003 13124 11941 17167 11112 5092 -2107 20729 22074 2232 -27296 -20684 17944 28808 17173
20990 17173 17736 17587 453 -9665 -20676 -6195 17333 28018 6834 2668 11956 3777 11536
20977 11536 21423 13729 23518 38108 49107 28705 6040 5244 -3240 -7846 -46239 -54557 -58593
20964 -58593 -35622 -30337 -10580 13521 3227 -714 9866 13776 -2486 -6233 -1350 -3312 10786
20951 10786 -1327 7182 20779 637 -2758 -17433 -35676 -52126 -41812 -31894 -25768 -3292
$$ packed form
21042C4417m193j1060L444j1449j642P971J6261J8119l0352j5175q413L731j298
21029C61j7624q033j1741J8562J8859K940J416J2676J972p283j4393J3291J9127
21016C0130L785k5610j0432K965k118n117r361k2355Q333J9844K6837j371k406
21003A3124j183N226o055o020p199K2836J345j9842k9528O612L8628J0864j1635
20990A7173N63j49j7134j0118j1011J4481K3528J0685k1184m166R288q179P759
20977A1536R887p694R789J4590J0999k0402k2665p96q484m606l8393q318m036
20964e8593K2971N285J9757K4101j0294l941J0580L910j6262l747M883j962J4098
20951A0786j2113Q509J3597k0142l395j4675j8243j6450J0314R918O126K2476
$$ plain form
20939 -3292 10600 7908 11520 28746 23179 35359 38801 26822 22671 22292 25337 20615 20404 5018
20925 5018 -12185 -15062 -1656 2067 16524 38535 22484 -5743 5949 7551 -9125 4450
20913 4450 27897 22287 -7007 -25620 -23373 -27330 -41797 -38739 -61924 -66789 -61208 -56077 -33562
20900 -33562 8458 15968 28345 10211 -2520 -8872 -5657 465 11617 10936 9087 -185 -17893
20887 -17893 -13063 -7915 26266 13762 12589 17504 1795 17870 36509 45401 36108 43206 24185
20874 24185 13441 5412 21786 35933 17967 -20749 -14880 7452 19995 28827 2425 -10923
20862 -10923 -2619 24355 62152 60294 32421 9396 -5802 15403 -2160 4433 14718 16339
20850 16339 29860 21828 19671 51682 65236 35602 45197 31607 24490 3388 -32513 -24089 -29835
$$ packed form
20939c292J3892k692L612J7226n567J2180L442j1979m151l79L045m722k11j5386
20925E018j7203k877J3406L723J4457K2011j6051k8227J1692J602j6676J3575
20913D450K3447n610k9294j8613K247l957j4467L058k3185m865N581N131K2515
20900c3562M2020P510J2377j8134j2731o352L215O122J1152o81j849r272j7708
20887a7893M830N148L4181j2504j173M915j5709J6075J8639Q892r293P098j9021
20874B4185j0744q029J6374J4147j7966l8716N869K2332J2543Q832k6402j3348
20862a0923Q304K6974L7797j858k7873k3025j5198K1205j7563O593J0285J621
20850A6339J3521q032k157L2011J3554k9634R595j3590p117k1102l5901Q424n746
$$ plain form
20837 -29835 -21820 -18752 -3133 -5852 -2336 3468 -37867 -54045 -18770 7678 16531 12382 17721
20824 17721 23905 20074 27142 8464 8398 3541 -3163 -3017 19883 312 -8505 -10046 -14598 -15591 -17535
20809 -17535 -20629 -11296 -2127 -9783 2370 35654 40050 33390 37051 49132 18776 9259 12992
20796 12992 9878 -12492 -17750 -15105 -3428 22736 35077 16827 17369 14638 -8218 -11741 14731
20783 14731 16786 22079 25596 10190 10569 35965 66982 56932 55746 80464 51298 28443 12702
20770 12702 -5622 19503 57671 50831 38599 25186 18353 4174 3178 -11752 -1520 7753 6693
20757 6693 21405 37390 53789 60059 26614 -9125 -2124 11454 3893 -37344 -29993 -388 14014
20744 14014 -3344 -4081 5655 30359 21374 4887 16868 12843 47496 50750 36606 23232 27748
$$ packed form
20837b9835Q015L068J5619k719L516N804m1335j6178L5275K6448Q853m149N339
20824A7721O184l831P068j8678o6m857o704J46K2900j9571q817j541m552r93j944
20809a7535l094R333R169p656J2153L3284M396o660L661J2081l0356r517L733
20796A2992l114k2370n258K645J1677K6164J2341j8250N42k731k2856l523K6472
20783A4731K055N293L517j5406L79K5396L1017j0050j186K4718k9166k2855j5741
20770A2702j8324K5125L8168o840j2232j3413o833j4179r96j4930J0232R273j060
20757F693J4712J5985J6399O270l3445l5739P001J3578p561m1237P351K9605J4402
20744A4014j7358p37R736K4704q985j6487J1981m025L4653L254j4144j3374M516
$$ plain form
20731 27748 40776 27471 50083 72382 64585 63830 46635 31131 54406 68039 63047 88480
20719 88480 85113 43633 2897 2671 42533 80337 90833 81728 56619 45986 34337 60991
20707 60991 50308 22290 29734 70014 80129 84588 68731 65051 77492 100852 93138 75310
20695 75310 84690 83001 99503 99449 72169 91594 89330 90865 102468 108743 99063 94000 87317 105506
20681 105506 139322 164756 151428 137624 116770 106797 98351 83135 81297 74330 51248 67771
20669 67771 91877 85240 71179 100365 134092 146882 158743 171991 185411 157556 158265 174207
20657 174207 177705 195857 206126 203632 191163 168215 187810 172512 161311 174912 201845 226633
20645 226633 225884 249615 266932 260836 271314 305795 296923 286530 288538 285818 310868 308394 290919
$$ packed form
20731B7748J3028j3305K2612K2299p797p55j7195j5504K3275J3633m992K5433
20719H8480l367m1480m0736k26L9862L7804J0496r105k5109j0633j1649K6654
20707F0991j0683k8018P444M0280J0115M459j5857l680J2441K3360p714j7828
20695G5310R380j689J6502n4k7280J9425k264J535J1603O275r680n063o683J8189
20681A05506L3816K5434j3328j3804k0854r973q446j5216j838o967k3082J6523
20669F7771K4106o637j4061K9186L3727J2790J1861J3248J3420k7855P09J5942
20657A74207L498J8152J0269k494j2469k2948J9595j5298j1201J3601K6933K4788
20645B26633p49K3731J7317o096J0478L4481q872j0393K008k720K5050k474j7475
$$ plain form
20632 290919 303601 315244 343415 360537 344166 343959 355808 358533 379948 386262 391944 381587
20620 381587 378931 396825 407716 413326 414205 419672 411510 403345 420182 418799 421182 470085 490941
20607 490941 508804 494375 481976 486340 516704 521618 546160 561423 559797 567034 568589 578948
20595 578948 602835 633022 649469 633595 652127 655454 661917 665631 673872 687631 700089 680556
20583 680556 697494 735333 739205 730956 697863 678892 677740 691905 695480 687792 720499 732995
20571 732995 733463 717730 704644 720317 743570 714488 699696 692791 683017 673973 685150 679546 676176
20558 676176 680700 690503 682816 660800 656304 631662 621698 621379 621609 604361 568818 571485 587847
20545 587847 604500 602740 600833 593108 600294 588390 570513 550368 536519 511840 500818 502881
$$ packed form
20632B90919J2682J1643K8171J7122j6371k07J1849K725K1415O314N682j0357
20620C81587k656J7894J0891N610Q79N467q162q165J6837j383K383M8903K0856
20607D90941J7863j4429j2399M364L0364M914K4542J5263j626P237J555J0359
20595E78948K3887L0187J6447j5874J8532L327O463L714Q241J3759J2458j9533
20583F80556J6938L7839L872q249l3093j8971j152J4165L575p688L2707J2496
20571G32995M68j5733j3086J5673K3253k9082j4792o905r774r044J1177n604l370
20558F76176M524R803p687k2016m496k4642r964l19K30j7248l5543K667J6362
20545E87847J6653j760j907p725P186j1904j7877k0145j3849k4679j1022K063
$$ plain form
20533 502881 497453 479402 449896 440943 477233 507363 495613 467209 452740 434096 443322 485365
20521 485365 483290 465838 419047 376353 395922 396839 375388 358809 377781 352887 371458 364099
20509 364099 349329 320588 290877 270586 266718 268530 280782 305344 297830 285421 287679 293478
20497 293478 260903 234429 208957 190743 192966 195738 196315 197842 199150 195522 184473 158315 154655
20484 154655 156461 170246 179040 190862 183538 207461 190961 161341 169401 175670 197548 208634
20472 208634 222931 216033 222367 210825 208309 192623 157966 131977 113071 110511 128096 118747
20460 118747 92413 87349 86191 117500 120813 98364 125879 113448 87453 85693 93832 98652 109753
20447 109753 100138 87790 102488 121145 103373 107722 137920 114317 126785 102164 92222 77517
$$ packed form
20533E02881n428j8051k9506q953L6290L0130j1750k8404j4469j8644R226M2043
20521D85365k075j7452m6791m2694J9569R17k1451j6579J8972k4894J8571p359
20509C64099j4770k8741k9711k0291l868J812J2252K4562p514j2409K258N799
20497B93478l2575k6474k5472j8214K223K772N77J527J308l628j1049k6158l660
20484A54655J806J3785Q794J1822p324K3923j6500k9620Q060O269K1878J1086
20472B08634J4297o898O334j1542k516j5686l4657k5989j8906k560J7585r349
20460A18747k6334n064j158L1309L313k2449K7515j2431k5995j760Q139M820J1101
20447A09753r615j2348J4698J8657j7772M349L0198k3603J2468k4621r942j4705
$$ plain form
20435 77517 72741 73905 78291 103004 109831 84579 73769 108407 97939 73289 104581 108654 107772
20422 107772 106581 102017 80648 97832 102217 104334 96704 85835 91443 90154 60876 68915 89159
20409 89159 68991 36018 59977 83370 90497 95640 76338 59640 51775 77486 78567 72411 72387
20396 72387 55325 54426 59669 57854 86083 102172 125494 113589 97539 80281 69846 79675 57630
20383 57630 51677 42856 44645 50618 46796 46349 34611 14175 11867 39175 46830 32297 44416
20370 44416 67496 61704 57633 50214 72306 60601 38190 25262 15208 3507 38563 51082
20358 51082 51347 37851 33467 18510 20282 49277 49999 43093 33343 52305 48310 25006 30775 26654
20344 26654 41076 48457 45588 49329 54116 52274 30830 -3167 -22484 -8817 5482 -650 -159
$$ packed form
20435G7517m776J164M386K4713O827k5252j0810L4638j0468k4650L1292M073q82
20422A07772j191m564k1369J7184M385K117p630j0869N608j289k9278Q039K0244
20409H9159k0168l2973K3959K3393P127N143j9302j6698p865K5711J081o156k4
20396G2387j7062q99N243j815K8229J6089K3322j1905j6050j7258j0435R829k2045
20383E7630n953q821J789N973l822m47j1738k0436k308K7308P655j4533J2119
20370D4416K3080n792m071p419K2092j1705k2411j2928j0054j1701L5056J2519
20358E1082K65j3496m384j4957J772K8995P22o906r750J8962l995k3304N769m121
20344B6654J4422P381k869L741M787j842k1444l3997j9317J3667J4299o132M91
$$ plain form
20331 -159 -4081 5131 17998 26444 13048 -4840 -3877 20871 15298 19576 29316 37398 21461 18707
20317 18707 10643 27023 48561 60925 97045 93339 44822 59080 27624 26509 51699 66378
20305 66378 42291 19750 39332 52669 49589 48171 45217 23436 5121 22451 44045 49002
20293 49002 47866 46996 52474 59796 39309 15100 -240 -2330 -13146 -5456 17057 41369 22690
20280 22690 37409 46951 37958 20654 -2226 16296 57305 97362 99163 82878 48298 35824
20268 35824 52784 44075 1938 -44362 -40631 -17917 5137 24809 17021 25622 18354 16744 35087
20255 35087 52539 28386 23120 44934 64027 41467 17119 26884 41471 50484 30811 32044
20243 32044 42404 33559 51871 61752 70543 76866 62254 70930 94408 80831 50554 54117 75145
$$ packed form
20331a59l922R212J2867Q446j3396j7888R63K4748n573M278R740Q082j5937k754
20317A8707q064J6380K1538J2364L6120l706m8517J4258l1456j115K5190J4679
20305F6378k4087k2541J9582J3337l080j418k954k1781j8315J7330K1594M957
20293D9002j136q70N478P322k0487k4209j5340k090j0816P690K2513K4312j8679
20280B2690J4719R542q993j7304k2880J8522M1009M0057J801j6285l4580j2474
20268C5824J6960q709m2137m6300L731K2714K3054J9672p788Q601p268j610J8343
20255C5087J7452k4153n266K1814J9093k2560k4348R765J4587R013j9673J233
20243C2044J0360q845J8312R881Q791O323j4612Q676K3478j3577l0277L563K1028
$$ plain form
20230 75145 70804 62505 44734 38835 48792 40493 35598 35008 63866 82794 74636 48606 54436 63171
20216 63171 36903 33421 43421 31632 47536 48446 57244 71127 58484 36895 23573 29729 39207
20203 39207 50016 42340 52575 66066 50177 37444 4838 -3715 24819 20376 50822 47709
20191 47709 50045 72316 89541 86663 62029 46966 48392 56655 63216 72266 64097 54099 75390
20178 75390 85320 77585 41461 42365 39475 51084 55327 60686 56251 57312 35636 37808 52177 52848
20164 52848 31011 33895 54070 51755 19924 5287 12368 54360 56911 22936 -1460 6067 18610
20151 18610 24758 39711 60780 72055 66006 28125 27287 64037 64688 72481 62000 42822 39930
20138 39930 42816 39842 29336 19485 41339 56814 62251 68579 61897 77394 97586 96103 108612
$$ packed form
20230G5145m341q299j7771n899R957q299m895n90K8858J8928q158k6030N830Q735
20216F3171k6268l482J0000j1789J5904R10Q798J3883j2643k1589j3322O156R478
20203C9207J0809p676J0235J3491j5889j2733l2606q553K8534m443L0446l113
20191D7709K336K2271J7225k878k4634j5063J426Q263O561R050q169r998K1291
20178G5390R930p735l6124R04k890J1609M243N359m435J061k1676K172J4369O71
20164E2848k1837K884K0175k315l1831j4637P081M1992K551l3975k4396P527J2543
20151A8610O148J4953K1069J1275o049l7881q38L6750O51P793j0481j9178k892
20138C9930K886k974j0506r851K1854J5475N437O328o682J5497K0192j483J2509
$$ plain form
20125 108612 115826 124494 127864 130661 148131 166322 199288 245931 283276 320721 357942 396309
20113 396309 422485 423638 428559 430102 454215 469957 489588 490313 513529 525717 492963 478624
20101 478624 440010 409752 408277 385300 371123 337272 313321 305817 288295 285499 266646 256281
20089 256281 267654 268151 262770 247260 236697 204906 191905 209165 228758 226671 229662 236950 224041
20076 224041 247953 240462 217025 193873 193114 207192 227381 234481 257450 290851 304761 333037
20064 333037 338296 363962 413628 451750 500819 538220 569379 616015 653268 656866 672861 689062
20052 689062 699067 684492 683186 638888 604486 577347 548934 499519 446652 411716 370355 326550
20040 326550 303252 275402 255315 249724 264328 254458 244171 234676 215588 219782 237711 229643
$$ packed form
20125A08612P214Q668L370K797J7470J8191L2966M6643L7345L7445L7221L8367
20113C96309K6176J153M921J543K4113J5742J9631P25K3216J2188l2754j4339
20101D78624l8614l0258j475k2977j4177l3851k3951p504j7522k796j8853j0365
20089B56281J1373M97n381j5510j0563l1791j3001J7260J9593k087K991P288j2909
20076B24041K3912p491k3437k3152p59J4078K0189P100K2969L3401J3910K8276
20064C33037N259K5666M9666L8122M9069L7401L1159M6636L7253L598J5995J6201
20052F89062J0005j4575j306m4298l4402k7139k8413m9415n2867l4936m1361m3805
20040C26550k3298k7850k0087n591J4604r870j0287r495j9088M194J7929q068
$$ plain form
20028 229643 205017 192203 186720 194103 188725 170621 154152 156502 161075 125169 115069 111638 129784
20015 129784 145543 119799 126672 123229 139588 160240 143044 140330 144902 132291 101366 121348
20003 121348 123989 78214 58773 62414 65178 97754 100096 83065 74525 102275 133592 133361 116793
19990 116793 104300 80951 98310 74804 40161 58115 75561 87376 96435 82068 98338 102344
19978 102344 103966 101260 109385 97740 93724 79433 90312 108485 124577 100642 78331 62490
19966 62490 67365 76003 77270 93872 78651 89364 121273 138259 147005 125532 120440 109381 84281
19953 84281 84156 94774 96745 113578 113405 87043 77153 91666 118935 94859 92428 87797 99032
19940 99032 111895 105634 91066 89662 81293 40497 37555 40170 22140 12619 43964 66226 57883
$$ packed form
20028B29643k4626j2814n483P383n378j8104j6469K350M573l5906j0100l431J8146
20015A29784J5759k5744O873l443J6359K0652j7196k714M572j2611l0925J9982
20003A21348K641m5775j9441L641K764L2576K342j7031q540K7750L1317k31j6568
19990A16793j2493k3349J7359k3506l4643J7954J7446J1815R059j4367J6270M006
19978A02344J622k706Q125j1645m016j4291J0879J8173J6092k3935k2311j5841
19966F2490M875Q638J267J6602j5221J0713L1909J6986Q746k1473n092j1059k5100
19953H4281j25J0618J971J6833j73k6362r890J4513K7269k4076k431m631J1235
19940I9032J2863o261j4568j404q369m0796k942K615j8030r521L1345K2262q343
$$ plain form
19927 57883 78975 81554 71765 69741 68517 90291 93224 93725 71348 72806 63687 80426 106772
19914 106772 122221 106256 62930 25213 23195 25402 68519 91811 107415 103407 61472 27422
19902 27422 41217 57548 76710 102044 80382 74695 81980 72656 81398 96204 92887 78544 50337
19889 50337 36698 60077 76680 76962 69720 76680 86676 75382 68048 67909 47405 50042 81037
19876 81037 92085 85873 69416 73894 76198 73773 53922 23879 -12075 -52134 -64800 -57336 -20950
19863 -20950 28018 38915 36112 63239 110136 124605 138908 139352 126680 124270 117252 119669 114670
19850 114670 113114 124832 114898 89271 130427 185947 194453 198570 199848 204021 213704 216957 227624
19837 227624 233379 251512 278327 312471 288975 279118 292587 311378 314688 299778 302602 350819
$$ packed form
19927E7883K1092K579r789k024j224K1774K933N01k2377J458r119J6739K6346
19914A06772J5449j5965m3326l7717k018K207M3117K3292J5604m008m1935l4050
19902B7422J3795J6331J9162K5334k1662n687P285r324Q742J4806l317j4343k8207
19889E0337j3639K3379J6603K82p242O960R996j1294p334j39k0504K637L0995
19876H1037J1048o212j6457M478K304k425j9851l0043l5954m0059j2666P464L6386
19863b0950M8968J0897k803K7127M6897J4469J4303M44j2672k410p018K417m999
19850A14670j556J1718r934k5627M1156N5520Q506M117J278M173R683L253J0667
19837B27624N755J8133K6815L4144k3496r857J3469J8791L310j4910K824M8217
$$ plain form
19825 350819 329211 305308 321480 334547 376022 418383 454494 488526 537533 577651 581736 588383
19813 588383 585593 533418 477967 454879 500311 615553 687473 683405 664604 650704 680853 656736
19801 656736 648022 625605 625558 624135 622649 631343 620322 595773 589557 576639 581626 592690 593621 621403
19787 621403 636183 630785 640655 643976 620021 582127 595370 637691 632557 623625 615557 608589 606540
19774 606540 622479 646639 626015 610222 623939 628431 616768 580118 568513 584709 606652 636963
19762 636963 618453 606576 581244 594783 615132 641916 620691 581012 564609 564908 542852 532729
19750 532729 497600 464718 441182 387891 317623 272768 281223 305819 315381 329927 353821 367781
19738 367781 348700 352208 370797 385933 400909 407074 364965 350465 347272 341271 344492 360105
$$ packed form
19825C50819k1608k3903J6172J3067M1475M2361L6111L4032M9007M0118M085O647
19813E88383k790n2175n5451k3088M5432J15242P1920m068j8801j3900L0149k4117
19801F56736q714k2417m7j423j486Q694j1021k4549o216j2918M987J1064R31K7782
19787F21403J4780n398R870L321k3955l7894J3243M2321n134q932q068o968k049
19774F06540J5939K4160k0624j5793J3717M492j1663l6650j1605J6196K1943L0311
19762F36963j8510j1877k5332J3539K0349K6784k1225l9679j6403K99k2056j0123
19750E32729l5129l2882k3536n3291p0268m4855Q455K4596R562J4546K3894J3960
19738C67781j9081L508J8589J5136J4976O165m2109j4500l193o001L221J5613
$$ plain form
19726 360105 380209 377771 394327 430982 468897 473834 455715 470022 467868 479118 517889 558954
19714 558954 580619 598175 642565 673047 713579 789469 860688 919862 1054285 1219466 1413504
19703 1413504 1702171 2097957 2615252 3230452 3851658 4415775 4805619 4876734 4539100 4006560
19693 4006560 3529089 3158620 2882116 2701960 2560745 2400393 2224746 2089274 1988921
19684 1988921 1907063 1859210 1787874 1684676 1581034 1495914 1444194 1410000 1395666 1398417 1383080
19673 1383080 1355077 1318009 1277599 1245083 1229583 1260217 1289644 1306811 1288769 1288321 1318625 1325922
19661 1325922 1328884 1355856 1342443 1330886 1368553 1368519 1327397 1319780 1360231 1399078 1436978 1472291
19649 1472291 1495123 1530353 1591650 1654955 1708957 1791477 1918450 2062706 2224603 2415885
$$ packed form
19726C60105K0104k438J6556L6655L7915M937j8119J4307k154J1250L8771M1065
19714E58954K1665J7556M4390L0482M0532P5890P1219N9174J34423J65181J94038
19703A413504K88667L95786N17295O15200O21206N64117L89844P1115l37634n32540
19693D006560m77471l70469k76504j80156j41215j60352j75647j35472j00353
19684A988921q1858m7853p1336j03198j03642q5120n1720l4194j4334K751j5337
19673A383080k8003l7068m0410l2516j5500L0634K9427J7167j8042m48L0304P297
19661A325922K962K6972j3413j1557L7667l4m1122p617M0451L8847L7900L5313
19649A472291K2832L5230O1297O3305N4002Q2520J26973J44256J61897J91282
$$ plain form
19639 2415885 2625981 2818621 3017890 3158776 3254364 3329985 3374028 3406201 3429529 3440473
19629 3440473 3449749 3469983 3492371 3524011 3587315 3671079 3772520 3881047 3968726 3993500 3977208
19618 3977208 3909850 3865912 3835111 3763425 3667019 3618165 3606001 3567158 3508921 3510895 3531522
19607 3531522 3585320 3623445 3660181 3715423 3761949 3850313 3942428 4043234 4179806 4308317 4469567
19596 4469567 4684305 4923494 5184526 5472570 5797676 6136301 6495311 6850096 7226714
19587 7226714 7679294 8194956 8807220 9467764 10211741 10994143 11876294 12903053 14044894
19578 14044894 15334679 16791696 18462421 20450489 22757897 25446954 28634688 32401065
19570 32401065 36912769 42399473 49173644 57576833 68167647 81851261 100030779 124505808
$$ packed form
19639B415885K10096J92640J99269J40886R5588P5621M4043L2173K3328J0944
19629C440473R276K0234K2388L1640O3304Q3764J01441J08527Q7679K4774j6292
19618C977208o7358m3938l0801p1686r6406m8854j2164l8843n8237J974K0627
19607C531522N3798L8125L6736N5242M6526Q8364R2115J00806J36572J28511J61250
19596D469567K14738K39189K61032K88044L25106L38625L59010L54785L76618
19587G226714M52580N15662O12264O60544P43977P82402Q82151J026759J141841
19578A4044894J289785J457017J670725J988068K307408K689057L187734L766377
19570C2401065M511704N486704O774171Q403189J0590814J3683614J8179518K4475029
$$ plain form
19562 124505808 157112625 198672868 247206524 295747414 334080700 354033161 345769141
19555 345769141 308818074 263680959 226171534 198924629 178918758 162225421 146616661
19548 146616661 131971521 118801803 107408706 97494654 88740241 81027159 74345311
19541 74345311 68639842 63657955 59105336 54925416 51230078 48071287 45360989 43091417
19533 43091417 41150373 39389696 37673892 35955276 34239921 32611874 31083174 29660150
19525 29660150 28385532 27237469 26172776 25167717 24238146 23445793 22759423 22100673 21442733
19516 21442733 20766697 20116391 19529786 18971817 18490982 18105871 17762058 17475605 17256677
19507 17256677 17051553 16860674 16742191 16687973 16740547 16807309 16906780 16948249 16865845 16678954
$$ packed form
19562A24505808L2606817M1560243M8533656M8540890L8333286J9952461q264020
19555C45769141l6951067m5137115l7509425k7246905k0005871j6693337j5608760
19548A46616661j4645140j3169718j1393097r914052q754413p713082o681848
19541G4345311n705469m981887m552619m179920l695338l158791k710298k269572
19533D3091417j941044j760677j715804j718616j715355j628047j528700j423024
19525B9660150j274618j148063j064693j005059r29571p92353o86370o58750o57940
19516B1442733o76036o50306n86605n57969m80835l85111l43813k86453k18928
19507A7256677k05124j90879j18483n4218N2574O6762R9471M1469q2404j86891
$$ plain form
19497 16678954 16399176 16020810 15586334 15107811 14627793 14171127 13739993 13339619 12987713
19488 12987713 12681530 12427467 12275653 12243076 12303421 12419625 12559629 12730702 12878928 12970263
19478 12970263 12962196 12803461 12501835 12096066 11601853 11062573 10507062 9972205 9512490 9094790
19468 9094790 8699582 8322299 7984313 7682061 7377536 7098829 6866733 6601500 6355538
19459 6355538 6100029 5860316 5684239 5485030 5306191 5152301 5022024 4920507 4817895
19450 4817895 4703253 4584365 4459327 4347831 4276510 4207984 4126128 4066944 4021667 3964748
19440 3964748 3935389 3931907 3916275 3879879 3831885 3805211 3807302 3795774 3789211 3797547 3827575 3871838
19428 3871838 3901880 3902659 3926276 3965247 4000629 4058644 4106197 4153857 4253689 4412820 4580016
$$ packed form
19497A6678954k79778l78366m34476m78523m80018m56666m31134m00374l51906
19488A2987713l06183k54063j51814l2577O0345J16204J40004J71073J48226R1335
19478A2970263q067j58735l01626m05769m94213n39280n55511n34857m59715m17700
19468I094790l95208l77283l37986l02252l04525k78707k32096k65233k45962
19459F355538k55509k39713j76077j99209j78839j53890j30277j01517j02612
19450D817895j14642j18888j25038j11496p1321o8526q1856n9184m5277n6919
19440C964748k9359l482j5632l6396m7994k6674K091j1528o563Q336L0028M4263
19428C871838L0042P79K3617L8971L5382N8015M7553M7660R9832J59131J67196
$$ plain form
19417 4580016 4703292 4760899 4663465 4395163 3991815 3629044 3376694 3200983 3041753 2884207
19407 2884207 2766374 2622318 2477834 2334091 2205708 2103107 1999602 1899680 1832085 1797438
19397 1797438 1786146 1770826 1692796 1604439 1569849 1550778 1532003 1517575 1492495 1450166 1402187
19386 1402187 1398370 1383705 1353792 1332774 1297909 1282652 1279672 1263068 1258112 1244553 1231828 1213591
19374 1213591 1190236 1180278 1179293 1198303 1231269 1205346 1133633 1091185 1017422 936395 919834 905616
19362 905616 885635 865145 862068 866158 864394 844622 816094 772664 761182 775707 764154 754762
19350 754762 726892 690469 660494 674413 727905 729860 714760 713376 722140 718649 721765 716518 685941
19337 685941 648079 645275 644686 645270 670914 656857 629276 601796 592103 573528 564657 563785 576433
$$ packed form
19417D580016J23276N7607r7434k68302m03348l62771k52350j75711j59230j57546
19407B884207j17833j44056j44484j43743j28383j02601j03505r9922o7595l4647
19397A797438j1292j5320p8030q8357l4590j9071j8775j4428k5080m2329m7979
19386A402187l817j4665k9913k1018l4865j5257k980j6604m956j3559j2725j8237
19374A213591k3355r958r85J9010L2966k5923p1713m2448p3763q1027j6561j4218
19362I05616j9981k0490l077M090j764j9772k8528m3430j1482J4525j1553r392
19350G54762k7870l6423k9975J3919N3492J955j5100j384Q764l491L116n247l0577
19337F85941l7862k804n89N84K5644j4057k7581k7480r693j8575q871q72J2648
$$ plain form
19324 576433 590252 596400 604718 603620 582344 570287 563613 566062 557855 552808 548055 533005 515380
19311 515380 493538 484943 474556 456674 453883 468114 471027 459311 442891 438326 447568 454708 461033
19298 461033 447943 446202 459556 430989 442645 463661 476307 484318 481784 483675 504808 477449
19286 477449 457967 423243 393757 362900 376060 383123 374979 347772 336841 348251 364140 342712
19274 342712 339628 320116 310165 303440 325706 320134 325070 312251 314112 326976 328403 325011 314896
19261 314896 290971 282625 302393 319322 303795 295592 285426 305825 346092 357245 348792 339715
19249 339715 368475 379221 390328 392055 375788 352252 342122 330504 343804 333634 298677 297962
19237 297962 285173 308426 328273 338319 331888 307021 274647 266055 257805 252156 248229 278006
$$ packed form
19324E76433J3819O148Q318j098k1276j2057o674K449q207n047m753j5050j7625
19311E15380k1842q595j0387j7882k791J4231K913j1716j6420m565R242P140O325
19298D61033j3090j741J3354k8567J1656K1016J2646Q011k534J891K1133k7359
19286D77449j9482l4724k9486l0857J3160P063q144k7207j0931J1410J5889k1428
19274C42712l084j9512r951o725K2266n572M936j2819J861J2864J427l392j0115
19261C14896k3925q346J9768J6929j5527q203j0166K0399M0267J1153q453r077
19249C39715K8760J0746J1107J727j6267k3536j0130j1618J3300j0170l4957p15
19237B97962j2789K3253J9847J0046o431k4867l2374q592q250n649l927K9777
$$ plain form
19225 278006 279194 279245 264157 274218 305182 317656 298465 278937 283251 277951 263185 282802 281908
19212 281908 271335 247757 210964 231819 279412 258994 224898 208214 199410 231088 262517 256707
19200 256707 255193 267989 266714 255130 270258 269731 275642 291286 299456 316589 333719 318771 311108
19187 311108 333232 345417 335865 341726 339374 347222 352757 336837 333134 360407 375547 362777 382815
19174 382815 357450 359300 376915 366052 355272 344842 342349 361087 358034 350222 315237 301194
19162 301194 309066 310779 333656 308276 292441 294504 290053 292101 289790 286109 265762 282024 295263
19149 295263 299418 303199 297362 276216 248960 280535 316619 347333 397926 384434 366914 370960
19137 370960 345404 342296 349582 355633 377235 390440 408007 415143 427231 414044 399243 434574
$$ packed form
19225B78006J188N1j5088J0061L0964J2474j9191j9528M314n300j4766J9617q94
19212B81908j0573k3578l6793K0855M7593k0418l4096j6684q804L1678L1429n810
19200B56707j514J2796j275j1584J5128n27N911J5644Q170J7133J7130j4948p663
19187C11108K2124J2185r552N861k352P848N535j5920l703K7273J5140j2770K0038
19174C82815k5365J850J7615j0863j0780j0430k493J8738l053p812l4985j4043
19162C01194P872J713K2877k5380j5835K063m451K048k311l681k0347J6262J3239
19149B95263M155L781n837k1146k7256L1575L6084L0714N0593j3492j7520M046
19137C70960k5556l108P286O051K1602J3205J7567P136J2088j3187j4801L5331
$$ plain form
19125 434574 452126 484418 514627 529620 525019 542649 551287 537498 521788 533278 550917 556548
19113 556548 534274 507124 505922 515643 515286 516640 519520 504463 474298 461553 462889 458532 467702
19100 467702 496017 491419 489534 488577 501218 514253 499757 507647 534915 531211 506446 492325 517695
19087 517695 543810 578544 620505 614965 600259 582421 613117 642319 673508 695358 687202 711608
19075 711608 746870 788050 805276 809720 853092 890294 941151 969467 1012321 1066946 1112699 1172104
19063 1172104 1223172 1253820 1303493 1366685 1418178 1466433 1503231 1519388 1505359 1495350 1505121
19052 1505121 1500926 1486570 1435058 1412797 1398007 1368403 1340356 1349791 1336803 1274828 1265361 1249655
19040 1249655 1208170 1210289 1218290 1198006 1188410 1185856 1202584 1224536 1212291 1198322 1183804 1165897
$$ packed form
19125D34574J7552L2292L0209J4993m601J7630Q638j3789j5710J1490J7639N631
19113E56548k2274k7150j202R721l57J354K880j5057l0165j2745J336m357R170
19100D67702K8315m598j885r57J2641J3035j4496P890K7268l704k4765j4121K5370
19087E17695K6115L4734M1961n540j4706j7838L0696K9202L1189K1850q156K4406
19075G11608L5262M1180J7226M444M3372L7202N0857K8316M2854N4625M5753N9405
19063A172104N1068L0648M9673O3192N1493M8255L6798J6157j4029j0009R771
19052A505121m195j4356n1512k2261j4790k9604k8047R435j2988o1975r467j5706
19040A249655m1485K119Q001k0284r596k554J6728K1952j2245j3969j4518j7907
$$ plain form
19028 1165897 1154518 1127230 1127772 1156594 1148598 1143434 1165358 1141582 1127939 1116403 1103211 1122100
19016 1122100 1138924 1134545 1137262 1165460 1186108 1197769 1213628 1242145 1279712 1269865 1267120 1261600
19004 1261600 1274170 1312001 1326884 1312637 1302378 1290813 1284342 1264408 1227381 1206303 1181937
18993 1181937 1114655 1060255 1034863 1010426 997158 966067 924669 887809 862323 831738 781845
18982 781845 752124 713368 714416 743423 761327 741060 702415 681373 643885 616087 595945 585297
18970 585297 550600 544709 533351 478891 463913 484850 502726 518765 530401 502039 475998 428616
18958 428616 402894 410632 409201 406757 408416 402416 399272 422360 415971 394010 371867 389011 382340
18945 382340 331925 342872 355443 321238 305463 303038 313845 334995 331562 296219 291089 290497
$$ packed form
19028A165897j1379k7288N42K8822p996n164K1924k3776j3643j1536j3192J8889
19016A122100J6824m379K717K8198K0648J1661J5859K8517L7567r847k745n520
19004A261600J2570L7831J4883j4247j0259j1565o471j9934l7027k1078k4366
18993A181937o7282n4400k5392k4437j3268l1091m1398l6860k5486l0585m9893
18982G81845k9721l8756J048K9007J7904k0267l8645k1042l7488k7798k0142j0648
18970E85297l4697n891j1358n4460j4978K0937J7876J6039J1636k8362k6041m7382
18958D28616k5722P738j431k444J659o000l144K3088o389k1961k2143J7144o671
18945C82340n0415J0947J2571l4205j5775k425J0807K1150l433l5343n130n92
$$ plain form
18933 290497 309398 306372 272758 245266 255021 255238 251407 238823 244688 231212 213489 194663 179743
18920 179743 196509 230097 231950 203688 207912 201759 212304 234484 262066 245750 254277 266988
18908 266988 239383 214142 221397 213724 180955 173658 174569 162391 175564 191796 169362 157929
18896 157929 176423 175530 172670 139549 145702 170836 165939 139997 154153 157080 158910 164876 163972
18883 163972 136537 144786 139880 109429 94163 103334 132308 144487 144133 131887 133050 112044 111305
18870 111305 150299 145100 116030 103256 88962 93660 110041 96629 102792 115236 112644 101889
18858 101889 108201 93030 86404 104320 134169 131724 102311 118800 118535 120948 107856 83772 78863
18845 78863 104796 89906 80231 93144 95390 125495 147015 133536 106605 104971 98841 94265 117887
$$ packed form
18933B90497J8901l026l3614k7492R755K17l831j2584N865j3476j7723j8826j4920
18920A79743J6766L3588J853k8262M224o153J0545K2180K7582j6316Q527J2711
18908B66988k7605k5241P255p673l2769p297R11j2178J3173J6232k2434j1433
18896A57929J8494q93k860l3121O153K5134m897k5942J4156K927J830N966r04
18883A63972k7435Q249m906l0451j5266R171K8974J2179l54j2246J163k1006p39
18870A11305L8994n199k9070j2774j4294M698J6381j3412O163J2444k592j0755
18858A01889O312j5171o626J7916K9849k445k9413J6489k65K413j3092k4084m909
18845G8863K5933j4890r675J2913K246L0105K1520j3479k6931j634o130m576K3622
$$ plain form
18832 117887 97920 87392 100281 101755 109375 137799 133105 114096 110442 95570 108328 105135
18820 105135 87907 103667 91509 95915 117353 91681 75905 80393 107781 116680 124298 120272
18808 120272 110035 79502 66062 44562 54080 56565 47559 51241 62794 64911 56704 95958 90018
18795 90018 72782 50414 45787 48257 51672 55889 58112 57222 68000 71036 87017 95035 69589
18782 69589 81269 75675 48761 56651 76243 72320 77734 74065 56310 76424 90220 71758 62445
18769 62445 75082 88181 119451 150505 160714 173755 183622 179471 169708 177291 167003 119406
18757 119406 104019 128279 109353 96697 83717 69521 91706 81337 52542 51502 72018 87108
18745 87108 94548 95567 94219 86368 84143 67018 73539 93374 77898 76426 79889 73355 68019 82974
$$ packed form
18832A17887j9967j0528J2889J474P620K8424m694j9009l654j4872J2758l193
18820A05135j7228J5760j2158M406K1438k5672j5776M488K7388Q899P618m026
18808A20272j0237l0533j3440k1500R518K485r006L682J1553K117q207L9254n940
18795I0018j7236k2368m627K470L415M217K223q90J0778L036J5981Q018k5446
18782F9589J1680n594k6914P890J9592l923N414l669j7755K0114J3796j8462r313
18769F2445J2637J3099L1270L1054J0209J3041R867m151r763P583j0288m7597
18757A19406j5387K4260j8926j2656j2980j4196K2185j0369k8795j040K0516J5090
18745H7108P440J019j348p851k225j7125O521J9835j5476j472L463o534n336J4955
$$ plain form
18731 82974 117013 116381 111650 95985 56322 40233 46857 70481 80241 80992 95980 81597 67117
18718 67117 60216 66838 62477 50966 30779 34326 38165 62600 69021 86468 81089 33175 12245
18705 12245 20972 46784 61479 52828 45009 54271 83416 64952 50703 60078 67225 63955 35617
18692 35617 35812 53237 70830 59135 62758 41931 21630 41519 27183 15750 23771 38483
18680 38483 49191 51231 54351 81708 64461 23179 33229 61915 56830 16752 7737 36959
18668 36959 54094 42469 31624 53636 70369 87282 76277 38841 23595 46017 59102 50207
18656 50207 68785 64832 53778 35291 46025 66514 76724 58310 41558 39679 60325 46235
18644 46235 40960 31112 26494 24218 35540 46327 55922 58822 86787 121828 95735 64828 53448
$$ packed form
18731H2974L4039o32m731j5665l9663j6089O624K3624R760P51J4988j4383j4480
18718F7117o901O622m361j1511k0187L547L839K4435O421J7447n379m7914k0930
18705A2245Q727K5812J4695q651p819R262K9145j8464j4249R375P147l270k8338
18692C5617J95J7425J7593j1695L623k0827k0301J9889j4336j1433Q021J4712
18680C8483J0708K040L120K7357j7247m1282J0050K8686n085m0078r015K9222
18668C6959J7135j1625j0845K2012J6733J6913j1005l7436j5246K2422J3085q895
18656E0207J8578l953j1054j8487J0734K0489J0210j8414j6752j879K0646j4090
18644D6235n275r848m618k276J1322J0787R595K900K7965L5041k6093l0907j1380
$$ plain form
18631 53448 45064 36548 17542 20587 14254 30596 57754 60617 61952 40546 23065 12619 8349
18618 8349 30742 50619 55492 39027 13803 -6674 4715 32383 31383 25967 34470 39646 39929
18605 39929 60718 78524 86175 91566 65860 79421 61108 26826 41905 32859 7195 -17376
18593 -17376 13876 37296 61850 48572 44234 41308 33140 24192 36363 37160 39867 38447 20224
18580 20224 -11363 -9581 7561 9484 8734 35732 62787 49890 33647 52804 47365 31968 -13843
18567 -13843 -5617 -23875 9599 47901 74985 89476 53847 18720 29788 42227 69279 64924
18555 64924 45882 74333 83235 46792 62646 87733 84349 51816 20544 10917 10494 21279 50884
18542 50884 50484 34010 10429 22779 32765 23080 21602 26047 17818 29320 21911 29421 29629 59992
$$ packed form
18631E3448q384q516j9006L045o333J6342K7158K863J335k1406j7481j0446m270
18618H349K2393J9877M873j6465k5224k0477J1389K7668j000n416Q503N176K83
18605C9929K0789J7806P651N391k5706J3561j8313l4282J5079r046k5664k4571
18593a7376L1252K3420K4554j3278m338k926q168q948J2171P97K707j420j8223
18580B0224l1587J782J7142J923p50K6998K7055j2897j6243J9157n439j5397m5811
18567a3843Q226j8258L3474L8302K7084J4491l5629l5127J1068J2439K7052m355
18555F4924j9042K8451Q902l6443J5854K5087l384l2533l1272r627m23J0785K9605
18542E0884m00j6474k3581J2350R986r685j478M445q229J1502p409P510K08L0363
$$ plain form
18528 59992 65204 52873 53903 46341 37187 37613 27692 47543 62260 44497 30742 14619 15722
18515 15722 32875 18880 33627 33248 34973 46913 34372 42240 47152 56489 63974 49221 47444
18502 47444 68468 66837 29663 9711 20180 37785 51215 47441 51739 49925 39577 69519
18490 69519 128065 126224 115983 88432 71180 77072 62020 17514 -5077 4821 36920 31473
18478 31473 38060 61323 59662 58857 45978 14434 17030 -2047 5832 47431 62949 46177 54719
18465 54719 49753 27333 5298 -901 2544 6528 35926 70583 53810 56366 74245 52660 37014
18452 37014 47051 40914 45866 26252 25043 37643 31311 35694 54851 46429 24360 9160 34022
18439 34022 42036 40076 49108 54697 64627 59069 46735 40259 38165 34294 43665 36618 -6423 -1434
$$ packed form
18528E9992N212j2331J030p562r154M26r921J9851J4717j7763j3755j6123J103
18515A5722J7153j3995J4747l79J725J1940j2541P868M912R337P485j4753j777
18502D7444K1024j631l7174j9952J0469J7605J3430l774M298j814j0348K9942
18490F9519N8546j841j0241k7551j7252N892j5052m4506k2591R898L2099n447
18478C1473O587K3263j661q05j2879l1544K596j9077P879M1599J5518j6772Q542
18465E4719m966k2420k2035o199L445L984K9398L4657j6773K556J7879k1585j5646
18452C7014J0037o137M952j9614j209J2600o332M383J9157q422k2069j5200K4862
18439C4022Q014j960R032N589R930n558j2334o476k094l871R371p047m3041M989
$$ plain form
18425 -1434 20360 19241 25866 17675 18057 41389 50866 41395 25424 9033 3437 704 9179 26962
18411 26962 44172 48060 40212 10188 11491 11494 12106 33090 40506 24580 24472 16997 24861 41863
18397 41863 49409 37997 35747 64031 44431 46007 45181 67327 74497 61868 42533 38455 32919
18384 32919 33069 58605 55746 41085 65476 52350 22015 22962 23990 -3274 -1443 25831 49342
18371 49342 59980 34256 29825 20703 26993 66624 55287 9172 2139 8268 9059 49648 63841
18358 63841 55776 50993 45275 30795 42860 46407 57283 62600 83878 49537 40941 55541 48164
18345 48164 29815 28046 17163 19099 26186 21151 31683 35241 54387 58902 63080 67804 53881
18332 53881 14353 15970 14626 14868 13345 28558 46219 74896 86788 71445 38138 44673 56567
$$ packed form
18425a434K1794j119O625q191L82K3332R477r471j5971j6391n596k733Q475J7783
18411B6962J7210L888p848l0024J303LO12K0984P416j5926j08p475P864J7002
18397D1863P546j1412k250K8284j9600J576q26K2146P170j2629j9335m078n536
18384C2919J50K5536k859j4661K4391j3126l0335R47J028k7264J831K7274K3511
18371D9342J0638k5724m431r122O290L9631j1337m6115p033O129P91M0589J4193
18358F3841q065m783n718j4480J2065L547J0876N317K1278l4341q596J4600p377
18345D8164j8349j769j0883J936P087n035J0532L558J9146M515M178M724j3923
18332E3881l9528J617j344K42j523J5213J7661K8677J1892j5343l3307O535J1894
$$ plain form
18319 56567 35288 20431 29027 27824 40203 43593 33528 23578 29988 74532 106701 55479 24414
18306 24414 25011 27230 31795 15402 15675 1561 -6364 2019 24868 40951 39120 21905 13227 15674
18292 15674 11885 -14980 -18397 -7665 -31050 -27667 -9266 -10520 -14579 -17860 11508 28462 24113
18279 24113 38351 30591 33793 35599 28036 15575 5025 -1868 -14724 -30652 -11567 913 27898
18266 27898 34431 51931 59304 33528 25011 18584 29791 44252 57761 31302 22222 39604 33287
18253 33287 25734 30075 29074 10425 -16922 -24399 -14263 -11551 -4015 -46705 -45316 -1835 20519
18240 20519 7228 -13583 14698 54079 49276 26512 29681 6068 2094 30997 85943 94265
18228 94265 50903 17033 2626 14973 41855 30665 17333 35231 59617 70683 64107 68066
$$ packed form
18319E6567k1279j4857Q596j203J2379L390j0065r950O410M4544L2169n1222l1065
18306B4414N97K219M565j6393K73j4114p925Q383K2849J6083j831j7215q678K447
18292A5674l789k6865l417J0732k3385L383J8401j254m059l281K9368J6954m349
18279B4113J4238p760L202J806p563j2461j0550o893j2856j5928J9085J2480K6985
18266B7898O533J7500P373k5776q517o427J1207J4461J3509k6459r080J7382o317
18253C3287p553M341j001j8649k7347p477J0136K712P536m2690J389M3481K2354
18240B0519j3291k0811K8281L9381m803k2764L169k3613l974K8903N4946Q322
18228I4265m3362l3870j4407J2347K6882j1190j3332J7898K4386J1066o576L959
$$ plain form
18216 68066 76103 69658 61706 42226 33700 29459 22440 53533 75528 66733 80327 71313 60261
18203 60261 56462 71996 66248 84191 60009 23051 8138 6678 533 58423 79507 41947
18191 41947 33278 11561 3458 19334 43057 38192 33469 52548 49617 59890 79193 78501 58372
18178 58372 51599 47844 53629 63825 66666 73900 63032 103102 120355 122168 113825 93012 92720
18165 92720 77892 85572 81494 53634 52642 58431 71997 72940 85277 86238 78182 76392 124157 119760
18151 119760 125986 135389 129514 154768 182620 159118 153231 181449 200875 193786 194664 203604 239143
18138 239143 263348 246177 239342 267613 304654 324766 366820 372510 372868 422362 488041 508519
18126 508519 533104 587098 638892 691789 769519 867909 981153 1127768 1323616 1545179 1829143
$$ packed form
18216F8066Q037o445p952j9480q526m241p019L1093K1995q795J3594r014j1052
18203F0261l799J5534n748J7943k4182l6958j4913j460o145N7890K1084l7560
18191D1947q669k1717q103J5876K3723m865m723J9079k931J0273J9303o92k0129
18178E8372o773l755N785J0196K841P234j0868M0070J7253J813q343k0813k92
18165I2720j4828P680m078k7860r92N789J3566R43J2337R61q056j790M7765m397
18151A19760O226R403n875K5254K7852k3502n887K8218J9426p089Q78Q940L5539
18138B39143K4205j7171o835K8271L7041K0112M2054N690L58M9494O5679K0478
18126E08519K4585N3994N1794N2897P7730R8390J13244J46615J95848K21563K83964
$$ plain form
18115 1829143 2149471 2546999 3091601 3801571 4737990 6075501 7929955 10402337 13488872
18106 13488872 16768072 19524305 21169689 21084667 18802686 15670204 13081537 11262002
18098 11262002 9982614 8937152 7989229 7074709 6261880 5620318 5069204 4575807 4132546
18089 4132546 3749374 3440406 3174666 2941454 2728416 2584274 2441957 2290348 2166443
18080 2166443 2074502 1987096 1914936 1839370 1779111 1678026 1586596 1517326 1438975 1398003 1330954
18069 1330954 1243721 1197278 1182816 1131618 1113262 1109333 1073807 1035492 975392 919156 886281
18058 886281 862921 853390 838868 801521 765535 733038 708487 682657 646288 638199 637553 637068 619203
18045 619203 608075 580103 550348 540369 528717 499927 471798 448152 452537 476921 457869 425511
$$ packed form
18115A829143L20328L97528N44602P09970R36419J337511J854454K472382L086535
18106A3488872L279200K756233J645384q5022k281981l132482k588667j819535
18098A1262002j279388j045462r47923r14520q12829o41562n51114m93397m43261
18089D132546l83172l08968k65740k33212k13038j44142j42317j51609j23905
18080B166443r1941q7406p2160p5566o0259j01085r1430o9270p8351m0972o7049
18069A330954q7233m6443j4462n1198j8356l929l5526l8315o0100n6236l2875
18058H86281k3360r531j4522l7347l5986l2497k4551k5830l6369q089o46m85j7865
18045F19203j1128k7972k9755r979j1652k8790k8129k3646M385K4384j9052l2358
$$ plain form
18033 425511 421082 417859 429661 405322 378448 354842 331759 338049 344631 328848 293025 302561
18021 302561 354989 335227 323818 297779 275892 259392 290509 299032 288457 294752 314821 318449
18009 318449 311462 297964 264911 254046 249338 209477 195741 207981 178421 128454 122750 153662
17997 153662 137667 121100 128220 160349 164626 168696 175601 188005 180095 171622 170310 168658 161308
17984 161308 172797 161523 170247 182121 199112 181594 145051 119662 109458 103159 110285 119910
17972 119910 130587 122839 150515 150353 165845 174578 166808 151267 140799 129725 94891 82319
17960 82319 71442 47114 63927 102036 102221 91416 67656 36610 40176 58577 81045 80767 80707
17947 80707 53916 57842 75301 83041 65892 38705 36640 63255 48114 12799 23525 37679
$$ packed form
18033D25511m429l223J1802k4339k6874k3606k3083O290O582j5783l5823R536
18021C02561N2428j9762j1409k6039k1887j6500L1117Q523j0575O295K0069L628
18009C18449o987j3498l3053j0865m708l9861j3736J2240k9560m9967n704L0912
17997A53662j5995j6567P120L2129M277M070O905J2404p910q473j312j652p350
17984A61308J1489j1274Q724J1874J6991j7518l6543k5389j0204o299P126R625
17972A19910J0677p748K7676j62J5492Q733p770j5541j0468j1074l4834j2572
17960H2319j0877k4328J6813L8109J85j0805k3760l1046L566J8401K2468k78o0
17947H0707k6791L926J7459P740j7149k7187k065K6615j5141l5315J0726J4154
$$ plain form
17935 37679 32292 48657 63980 63015 50308 73220 86390 68712 71630 85324 77173 89733 90998
17922 90998 99905 88758 73064 48442 39831 42691 50415 83510 88480 98742 96390 103559 90204
17909 90204 72325 86322 52664 38203 43138 54485 87682 77865 46050 40267 47452 62571
17897 62571 65931 87535 70616 49599 58128 54086 76839 68107 64243 72801 64888 61196 56491
17884 56491 46060 29857 12305 -1979 -26150 -26982 -26914 10643 22009 -6106 -18294 31090 47677
17871 47677 26377 32812 40005 41568 34908 10887 4211 -163 10202 42211 27804 2821 -6537
17858 -6537 -11885 2812 18464 12418 28614 42728 37735 -15514 -11419 8800 12469 11812 22506
17845 22506 -2899 -20076 -32111 -7428 15139 11368 -8337 -52174 -51875 -6066 28701 22898
$$ packed form
17935C7679n387J6365J5323r65j2707K2912J3170j7678K918J3694q151J2560J265
17922I0998Q907j1147j5694k4622q611K860P724L3095M970J0262k352P169j3355
17909I0204j7879J3997l3658j4461M935J1347L3197r817l1815n783P185J5119
17897F2571L360K1604j6919k1017Q529m042K2753q732l864Q558p913l692m705
17884E6491j0431j6203j7552j4284k4171q32O8L7557J1366k8115j2188M9384J6587
17871D7677k1300O435P193J563o660k4021o676m374J0365L2009j4407k4983r358
17858f537n348J4697J5652o046J6196J4114m993n3249M095K0219L669o57J0694
17845B2506k5405j7177j2035K4683K2567l771j9705m3837K99M5809L4767n803
$$ plain form
17833 22898 7963 20309 30826 36151 47392 27660 39566 58842 31599 13441 41039 68052
17821 68052 72899 36090 15738 26824 11527 -1652 -1775 3933 33027 48791 40132 27999 42713
17808 42713 37421 19865 27799 25158 24704 35627 50922 33904 42655 21204 11898 5050 20699
17795 20699 39315 30991 9947 150 -5737 16997 31358 50754 80157 83404 40413 10698
17783 10698 15469 10117 9201 20281 7448 1983 -15072 -31087 -24741 534 17065 26352 46032
17770 46032 49935 9264 837 -280 12460 27529 22059 -9095 -4451 8598 12918 17446 48248
17757 48248 58069 56429 31420 4654 -3754 -14231 -22444 4689 21380 18634 40495 33271 14951
17744 14951 11448 39326 50178 16935 -29173 -47068 -20409 1350 15912 41659 52088 47489
$$ packed form
17833B2898j4935J2346J0517N325J1241j9732J1906J9276k7243j8158K7598K7013
17821F8052M847l6809k0352J1086j5297j3179j23N708K9094J5764q659j2133J4714
17808D2713n292j7556P934k641m54J0923J5295j7018Q751k1451r306o848J5649
17795B0699J8616q324k1044r797n887K2734J4361J9396K9403L247m2991k9715
17783A0698M771n352r16J1080j2833n465j7055j6015O346K5275J6531R287J9680
17770D6032L903m0671q427j117J2740J5069n470l1154M644J3049M320M528L0802
17757D8248R821j640k5009k6766q408j0477q213K7133J6691k746K1861p224j8320
17744A4951l503K7878J0852l3243m6108j7895K6659K1759J4562K5747J0429m599
$$ plain form
17732 47489 44924 17041 -21875 -8060 3676 14771 5043 -23863 -28059 -31053 -33606 -26205 -23674
17719 -23674 -26469 -8577 940 -7664 -16084 -48925 -48122 -8965 11120 9839 -11558 -36923 -37600
17706 -37600 -35061 -25618 -30081 14277 3272 -21837 -28385 -9862 -7468 -18858 -12914 5746 7296
17693 7296 22799 18238 17799 16263 15361 45448 68938 63438 46814 14537 1025 -10735 17276
17680 17276 30453 7401 -8518 -41541 -46080 -42578 -28737 -25973 -30229 -24456 -38484 -21326 -823
17667 -823 20958 26592 20073 38148 35488 17581 12112 -3034 -3840 -16870 -14404 13271 10601 -35035
17653 -35035 -59657 -46214 -23457 -12952 -15151 -8629 12829 5150 -12353 -19629 -19842 -13138 21880
17640 21880 28667 11900 -2342 -2513 -3577 4551 29416 22562 4924 21948 23738 6305 -2023
$$ packed form
17732D7489k565k7883l8916J3815J1736J1095r728k8906m196k994k553P401K531
17719b3674k795J7892R517q604q420l2841Q03L9157K0085j281k1397k5365o77
17706c7600K539R443m463M4358j1005k5109o548J8523K394j1390N944J8660J550
17693G296J5503m561m39j536r02L0087K3490n500j6624l2277j3512j1760K8011
17680A7276J3177k3052j5919l3023m539L502J3841K764m256N773j4028J7158K0503
17667h23K1781N634o519J8075k660j7907n469j5146q06j3030K466K7675k670m5636
17653c5035k4622J3443K2757J0505k199O522K1458p679j7503p276k13O704L5018
17640B1880O787j6767j4242j71j064Q128K4865o854j7638J7024J790j7433q328
$$ plain form
17627 -2023 15239 6106 -4890 -28586 -34355 -16466 -7907 -29785 -17342 4951 21955 14067 11245
17614 11245 19672 8846 -4463 13061 12233 -2125 9766 -2744 -19950 -2391 18920 23574
17602 23574 37953 35478 41121 69837 50886 -296 266 24227 48342 54548 45072 37820 34616
17589 34616 36819 28074 17863 -11237 -25333 -18477 -9500 277 4527 24608 42245 42617 30151
17576 30151 821 -1649 -1750 -9413 -7574 -3122 -2322 -811 2634 21381 13533 12067 15403 11115
17562 11115 4543 4414 15196 50379 75203 57173 30947 23177 -686 -13676 -25016 -27762 -25693
17549 -25693 12566 24959 20810 -10933 -22254 -18536 -19384 -13321 11821 27844 14414 14694 29641
17536 29641 15725 -6387 -28169 8342 15921 13303 18966 54971 73846 52674 24326 14306
$$ packed form
17627b023J7262r133j0996k3696n769J7889Q559k1878J2443K2293J7004p888k822
17614A1245Q427j0826j3309J7524q28j4358J1891j2510j7206J7559K1311M654
17602B3574J4379k475N643K8716j8951n1182N62K3961K4115O206r476p252l204
17589C4616K203q745j0211k9100j4096O856Q977R777M250K0081J7637L72j2466
17576C0151k9330k470j01p663J839M452Q00J511L445J8747p848j466L336m288
17562A1115o572j29J0782L5183K4824j8030k6226p770k3863j2990j1340k746K069
17549b5693L8259J2393m149l1743j1321L718q48O063K5142J6023j3430K80J4947
17536B9641j3916k2112k1782L6511P579k618N663L6005J8875k1172k8348j0020
$$ plain form
17524 14306 2732 -412 -26219 -31294 -9999 -10614 -23387 -13323 -20579 -24189 -21381 -10327 8032
17511 8032 4244 -5184 -21567 -29789 -11710 -14825 -29290 -27742 -10742 -2747 8205 -2200 9340
17498 9340 -6013 -1415 30722 44143 36137 13287 1726 27282 25450 27652 18263 22286 34353
17485 34353 19185 -4044 -19735 -3960 11532 15988 16067 -222 4054 -44 1456 20125 -3473
17472 -3473 -34661 -26497 -22795 -23161 -9298 11821 4212 8447 -10718 -27829 -34553 -16489 31740
17459 31740 22025 11952 24118 53219 67480 78209 68924 30302 25458 45312 71281 61237
17447 61237 56000 63864 32042 8437 -245 48049 85214 106263 131357 148827 173180 172421 150549
17434 150549 113682 75400 47624 32376 11959 6799 9524 32430 36475 43890 44966 42830 11890
$$ packed form
17524A4306j1574l144k5807n075K1295o15j2773J0064p256l610K808J1054J8359
17511H032l788r428j6383q222J8079l115j4465J548J7000P995J0952j0405J1540
17498I340j5353M598L2137J3421q006k2850j1561K5556j832K202r389M023J2067
17485C4353j5168k3229j5691J5775J5492M456P9j6289M276m098J500J8669k3598
17472c473l1188Q164L702l66J3863K1119p609M235j9165j7111o724J8064M8229
17459C1740r715j0073J2166K9101J4261J0729r285l8622m844J9854K5969j0044
17447F1237n237P864l1822k3605q682M8294L7165K1049K5094J7470K4353p59k1872
17434A50549l6867l8282k7776j5248k0417n160K725K2906M045P415J076k136l0940
$$ plain form
17421 11890 -2253 -13781 5809 25970 37670 13763 10417 9461 30455 41573 38277 48870
17409 48870 3950 -23059 -24195 -27732 -22536 -45567 -54500 -43924 -30583 -20356 960 5499 1178
17396 1178 -14963 -24152 -13963 8033 13667 -460 -26242 -16270 -22597 -41342 -38103 1269 8062
17383 8062 13618 15856 26150 30832 32314 19617 -22388 -30720 -22246 -18815 15790 13259 6635 -15665
17369 -15665 -39065 -22721 -30349 -21281 -30667 -22886 16351 54947 49881 48968 64213 62895 51388
17356 51388 30668 18196 15537 10635 3036 19188 2981 18824 24636 14865 25267 16995 5352
17343 5352 -17165 -26409 7462 20711 23701 25916 6158 -15111 -13252 -6663 2067 5391 14796
17330 14796 14941 -18345 -1464 11337 -5284 -1493 15057 9508 36279 62402 55820 24755 1389
$$ packed form
17421A1890j4143j1528J9590K0161J1700k3907l346r56K0994J1118l296J0593
17409D8870m4920k7009j136l537N196k3031q933J0576J3341J0227K1316M539m321
17396A178j6141r189J0189K1996N634j4127k5782R972o327j8745L239L9372O793
17383H062N556K238J0294M682J482j2697m2005q332Q474L431L4605k531o624k2300
17369a5665k3400J6344p628R068r386P781L9237L8596n066r13J5245j318j1507
17356E1388k0720j2472k659m902p599J6152j6207J5843N812r771J0402q272j1643
17343E352k2517r244L3871J3249K990K215j9758k1269J859O589Q730L324R405
17330A4796J45l3286J6881J2801j6621L791J6550n549K6771K6123o582l1065k3366
$$ plain form
17317 1389 14072 22156 5201 -21640 -50256 -45725 -26638 -33737 -34309 -7815 19938 23316 11363
17304 11363 13089 3997 -30338 -24669 -2310 7054 -2446 -24081 -17768 9859 4064 -14638 -38707
17291 -38707 -14344 -2036 7242 25921 67240 85619 84484 41851 17143 6114 4174 -2677
17279 -2677 -16503 -21783 -17067 -13041 22152 15121 -31697 -32544 -34646 -51096 -36086 -16018 -25076
17266 -25076 -22377 -15551 -20563 -22793 -14738 -23495 -24499 -6867 -7704 -9875 -30896 -39719 -40826 -23363
17252 -23363 -18099 17408 42418 4214 -15100 18785 14436 -17928 -55183 -37000 -1140 -15074
17240 -15074 -15102 -6843 -11468 -5236 -15095 14833 53329 60303 63021 76561 72802 74808 54220 39254
17226 39254 47796 22421 -682 3285 17432 49861 48325 22781 18674 7269 5574 29557 36856
$$ packed form
17317A389J2683Q084j6955k6841k8616M531J9087p099n72K6494K7753L378j1953
17304A1363J726r092l4335N669K2359R364r500k1635O313K7627n795j8702k4069
17291c8707K4363J2308R278J8679M1319J8379j135m2633k4708j1029j940o851
17279b677j3826n280M716M026L5193p031m6818q47k102j6450J5010K0068r058
17266b5076K699O826n012k230Q055q757j004J7632q37k171k1021q823j107J7463
17252b3363N264L5507K5010l8204j9314L3885m349l2364l7255J8183L5860j3934
17240a5074k8Q259m625O232r859K9928L8496O974K718J3540l759K006k0588j4966
17226C9254Q542k5375k3103L967J4147L2429j536k5544m107j1405j695K3983P299
$$ plain form
17213 36856 40145 27953 15670 5115 1544 21968 25415 8644 16172 32450 36046 31857 28938
17200 28938 7785 -14573 -21810 -37404 -26817 -12952 1246 16876 7105 -12795 -29876 -34780
17188 -34780 -32815 -15391 -4053 18477 31542 2280 -16877 -17621 -26610 -25054 15000 38353 -15243
17175 -15243 -44766 -18426 -21502 -19412 -3023 15536 35476 19707 15539 10138 14738 10502 -21341
17162 -21341 10038 45597 22192 17999 10982 -18228 -14435 13955 -801 -14024 -19026 -19209 4139
17149 4139 25129 31132 35444 10741 11259 -6404 -16436 -23649 -8291 1864 7771 2209 980
17136 980 38817 58194 52405 28815 3977 -13084 -16070 -435 -629 -225 1626 16155 5653
17123 5653 -1828 -2995 -15409 -33311 -50127 -25452 -11366 9284 -3793 -29307 -30335 1353
$$ packed form
17213C6856L289j2192j2283j0555l571K0424L447j6771P528J6278L596m189k919
17200B8938k1153k2358p237j5594J0587J3865J4198J5630r771j9900j7081m904
17188c4780J965J7424J1338K2530J3065k9262j9157p44q989J556M0054K3353n3596
17175a5243k9523K6340l076K090J6389J8559J9940j5769m168n401M600m236l1843
17162b1341L1379L5559k3405m193p017k9210L793K8390j4756j3223n002j83K3348
17149D139K0990O003M312k4703N18j7663j0032p213J5358J0155N907n562j229
17136I80L7837J9377n789k3590k4838j7061k986J5635j94M04J851J4529j0502
17123E653p481j167j2414j7902j6816K4675J4086K0650j3077k5514j028L1688
$$ plain form
17111 1353 15377 4014 314 -2299 3395 18376 28724 2441 -32944 -23680 -1453 -20220 -32721
17098 -32721 -18327 14457 2830 -22418 -26514 -35252 -11054 25168 10774 13643 -7661 5063
17086 5063 9976 9410 -15180 -9593 -8821 -10014 19439 10336 -8722 6777 9146 -3741 9163 23617
17072 23617 51552 50078 30221 29083 20989 7135 8197 19507 22816 32154 15655 33208 49085
17059 49085 52286 21946 27390 12799 6423 16739 27917 9880 7624 38353 68329 42157
17047 42157 18668 -10347 12453 23247 3153 15973 23949 12353 7162 9875 20092 25775
17035 25775 25514 15789 -5035 -22776 -14495 -6491 12804 33244 2256 -3288 22155 25492 14479
17022 14479 3242 16426 50385 24447 10792 -1670 -26817 -49057 -46236 -25078 11536 21774
$$ packed form
17111A353J4024j1363l700k613N694J4981J0348k6283l5385R264K2227j8767j2501
17098c2721J4394L2784j1627k5248m096q738K4198L6222j4394K869k1304J2724
17086E063M913n66k4590N587P72j193K9453r103j9058J5499K369j2887J2904J4454
17072B3617K7935j474j9857j138q094j3854J062J1310L309R338j6499J7553J5877
17059D9085L201l0340N444j4591o376J0316J1178j8037k256L0729K9976k6172
17047D2157k3489k9015K2800J0794k0094J2820P976j1596n191K713J0217N683
17035B5775k61r725k0824j7741Q281Q004J9295K0440l0988n544K5443L337j1013
17022A4479j1237J3184L3959k5938j3655j2462k5147k2240K821K1158L6614J0238
$$ plain form
17010 21774 9144 -10576 -35881 -39491 -32126 -32652 -26754 -19128 -18524 -17979 -45539 -8879 36406 41680
16996 41680 58855 51467 16765 12085 25289 74 -33093 -37384 -43902 -38464 -43925 -54958 -54597
16983 -54597 -52070 -34690 -5310 -6509 -3267 26666 5773 -12315 4025 12127 8009 -26035 -41098
16970 -41098 -39313 -13658 10738 39249 36088 23739 12420 2121 197 6161 23419 48464
16958 48464 33170 34996 41201 41050 33254 24544 1411 -18811 -2370 -7955 -1348 -7429 -15819 -9226
16944 -9226 1036 1717 -3379 -18941 -38979 -36120 -19262 -16880 -31053 -42471 -51512 -39324 -33839
16931 -33839 -8941 -3581 -12469 -14958 -27017 -10591 -6648 -16166 -10116 -1488 14516 34545 -871
16918 -871 -3357 -8738 -2605 21419 35692 25045 3044 -7613 -15995 -7887 512 -27367 -43777
$$ packed form
17010B1774j2630j9720k5305l610P365n26N898P626O04N45k7560L6660M5285N274
16996D1680J7175p388l4702m680J3204k5215l3167m291o518N438n461j1033L61
16983e4597K527J7380K9380j199L242K9933k0893j8088J6340Q102m118l4044j5063
16970d1098J785K5655K4396K8511l161j2349j1319j0299j924N964J7258K5045
16958D8464j5294J826O205j51p796q710k3133k0222J6441n585O607o081q390O593
16944i226J0262O81n096j5562k0038K859J6858K382j4173j1418r041J2188N485
16931c3839K4898N360q888k489j2059J6426L943r518O050Q628J6004K0029l5416
16918h71k486n381O133K4024J4273j0647k2001j0657q382Q108Q399k7879j6410
$$ plain form
16905 -43777 -33669 3529 4513 -12996 -1380 7434 -19103 15087 5670 -10250 10469 1499 -15735
16892 -15735 -5351 -339 1389 8639 -23745 -42884 -22382 -3406 1204 -800 24156 7796 -11314
16879 -11314 12626 37859 37054 46287 20575 8314 12932 -410 -5024 19414 17631 -15708 -36322
16866 -36322 -8224 8754 47381 33250 18751 32062 41828 32801 18466 27168 26369 22940 27024
16853 27024 29339 47663 29310 15714 18960 38027 14649 -18611 -35471 -42228 -37307 -19781
16841 -19781 9293 3066 -21048 -27104 -19901 -17333 -30060 -52188 -23551 -18046 -13425 -16441 -1274
16828 -1274 284 239 25173 19078 22276 12395 1638 11091 -3884 1927 11860 12319 21386 43864
16814 43864 47516 8656 -2899 4257 54768 62563 66177 68284 51107 53031 45389 46192 34101
$$ packed form
16905d3777J0108L7198R84j7509J1616Q814k6537L4190r417j5920K0719q970j7234
16892a5735J0384N012J728P250l2384j9139K0502J8976M610k004K4956j6360j9110
16879a1314K3940K5233q05R233k5712j2261M618j3342m614K4438j783l3339k0614
16866c6322K8098J6978L8627j4131j4499J3311R766r027j4335Q702p99l429M084
16853B7024K315J8324j8353j3596L246J9067k3378l3260j6860o757M921J7526
16841a9781K9074o227k4114o056P203K568j2727k2128K8637N505M621l016J5167
16828a274J558m5K4934o095L198r881j0757R453j4975N811R933M59R067K2478
16814D3864L652l8860j1555P156N0511P795L614K107j7177J924p642Q03j2091
$$ plain form
16801 34101 22165 28507 5764 3470 -3352 -3626 -12876 -16189 -973 28824 37880 33767 22789
16788 22789 30196 28439 17844 22045 -878 18999 21882 20882 -6026 -23798 -11724 18540 24970
16775 24970 11910 -710 10162 -2087 -20282 -7865 2057 -4816 -1618 -11484 -17312 -24218 -29153
16762 -29153 -13193 2767 6144 26097 24599 8696 8953 32561 23372 17002 14453 21921 21967 10828
16748 10828 14071 15506 34452 28125 16761 -3871 -7778 -13136 26541 60118 62838 51226 44126
16735 44126 51669 49432 29931 2413 -10738 12269 32482 21944 2834 13603 9394 6703
16723 6703 3258 -23262 -23939 -10706 -13931 -4770 7316 3819 -23132 -41523 -49311 -51762 -39910
16710 -39910 -33472 -28337 -33648 -42107 -14780 13138 8168 -22456 -22513 -21567 -6031 7182 6320 -8977
$$ packed form
16801C4101j1936O342k2743k294o822k74r250l313J5216K9797R056m113j0978
16788B2789P407j757j0595M201k2923J9877K883j000k6908j7772J2074L0264O430
16775B4970j3060j2620J0872j2249j8195J2417R922o873L198r866n828o906m935
16762b9153J5960J5960L377J9953j498j5903K57K3608r189o370k549P468M6j1139
16748A0828L243J435J8946o327j1364k0632l907n358L9677L3577K720j1612p100
16735D4126P543k237j9501k7518j3151K3007K0213j0538j9110J0769m209k691
16723F703l445k6520o77J3233l225R161J2086l497k6951j8391p788k451J1852
16710c9910O438N135n311q459K7327K7918m970l0624n7R46J5536J3213q62j5297
$$ plain form
16696 -8977 -31592 -36933 -26223 18414 38144 30569 37553 44610 35303 32174 28657 39419 39684 51119
16682 51119 44826 43188 49119 46673 22422 -14293 -32046 -28149 -6106 -5470 -17631 7724 30667
16669 30667 29590 33136 20376 -2293 6833 15927 28042 33103 29887 32899 41063 65890 52071
16656 52071 53763 60302 54413 47415 48723 36269 25356 3979 5194 12762 19222 56315 70410
16643 70410 72384 63078 76135 73028 49921 32625 8708 -4395 5338 17564 10112 8319 17235
16630 17235 21136 29129 27663 40945 69597 78645 38766 28573 12416 7316 29856 57482 66506
16617 66506 89309 88172 69036 51260 27576 -28633 -1306 34925 44978 26624 25806 44032
16605 44032 54886 46590 32237 20629 26904 15544 4172 318 -3951 26940 51294 88090
$$ packed form
16696h977k2615n341J0710M4637J9730p575O984P057r307l129l517J0762K65J1435
16682E1119o293j638N931k446k4251l6715j7753L897K2043O36j2161K5355K2943
16669C0667j077L546j2760k2669R126R094J2115N061l216L012Q164K4827j3819
16656E2071J692O539n889o998J308j2454j0913k1377J215P568O460L7093J4095
16643G0410J974r306J3057l107k3107j7296k3917j3103R733J2226p452j793Q916
16630A7235L901P993j466J3282K8652R048l9879j0193j6157n100K2540K7626R024
16617F6506K2803j137j9136j7776k3684n6209K7327L6231J0053j8354q18J8226
16605D4032J0854q296j4353j1608O275j1360j1372l854m269L0891K4354L6796
$$ plain form
16593 88090 82992 66844 73707 64859 41730 62853 62619 31900 24792 19077 35177 44253 54671
16580 54671 55494 60266 77075 68614 77031 93368 88630 62996 30028 25105 56977 70957 81968
16567 81968 79015 57916 59987 68510 23731 1082 18086 22577 23808 37458 29060 27895 11156
16554 11156 26665 43665 20974 17791 37316 32553 34147 48818 54548 52645 57300 26661 24627
16541 24627 44210 47819 45313 48727 65134 58473 59396 71449 53181 35042 16950 -1123 7999
16528 7999 40198 68026 55805 36646 79121 63542 10095 -10930 -4748 -17918 -18701 7367
16516 7367 31331 24368 26908 10905 -3374 -13230 13473 40683 16233 19928 -2559 2510 51708
16503 51708 60519 50410 31997 6893 -1386 -5946 -9694 2287 -4101 -5534 -8441 7356 23897
$$ packed form
16593H8090n098j6148O863q848k3129K1123k34l0719p108n715J6100R076J0418
16580E4671Q23M772J6809q461Q417J6337m738k5634l2968m923L1872J3980J1011
16567H1968k953k1099K071Q523m4779k2649J7004M491J231J3650q398j165j6739
16554A1156J5509J7000k2691l183J9525m763J594J4671N730j903M655l0639k034
16541B4627J9583L609k506L414J6407o661R23J2053j8268j8139j8092j8073R122
16528G999L2199K7828j2221j9159M2475j5579n3447k1025O182j3170p83K6068
16516G367K3964o963K540j6003j4279r856K6703K7210k4450L695k2487N069M9198
16503E1708Q811j0109j8413k5104q279m560l748J1981o388j433k907J5797J6541
$$ plain form
16490 23897 41503 54610 57383 41329 24618 1703 -12654 14360 47686 61862 52335 35838
16478 35838 34449 41910 39464 14331 29844 16998 17095 28850 39708 40305 49829 47573 28193 23402
16464 23402 21985 -12255 -7350 -15815 -16759 -15066 -6158 -8976 -36179 -15430 2120 4561 2251 27915
16450 27915 17063 -6982 -2726 -7 12679 4093 -17328 -9152 21181 10511 8446 3952 5641
16437 5641 21563 20773 1580 6633 18074 39087 30870 24942 33110 7923 16173 11923 27895
16424 27895 48938 35962 31419 23581 8740 1806 -1871 1058 8570 15145 20342 37781 45517
16411 45517 35451 27614 25299 16836 -2052 8128 30755 24160 7417 -13941 -17637 19411 24798
16398 24798 18888 7663 16374 -10918 -23656 -33915 -26995 -14454 5208 -1506 -11225 7884 1008
$$ packed form
16490B3897J7606J3107K773j6054j6711k2915j4357K7014L3326J4176r527j6497
16478C5838j389P461k446k5133J5513j2846R7J1755J0858N97R524k256j9380m791
16464B3402j417l4240M905q465r44J693Q908k818k7203K0749J7550K441k310K5664
16450B7915j0852k4045M256K719J2686q586k1421Q176L0333j0670k065m494J689
16437E641J5922p90j9193N053J1441K1013q217n928Q168k5187Q250m250J5972
16424B7895K1043j2976m543p838j4841o934l677K929P512O575N197J7439P736
16411D5517j0066p837k315q463j8888J0180K2627o595j6743k1358l696L7048N387
16398B4798n910j1225Q711k7292j2738j0259O920J2541J9662o714r719J9109o876
$$ plain form
16385 1008 -8572 3213 7020 15541 18660 39722 42761 38657 12298 -21673 -4818 29086 28154
16372 28154 31971 18536 21289 -11460 -13684 -23761 -3765 -9999 -38266 -30213 -24126 -9266 12295
16359 12295 11900 -14693 -39427 -55911 -48943 -28544 -22725 -7608 -13077 -10018 -1459 -10840 -18304
16346 -18304 -23809 -8284 32451 48846 42267 36009 21531 7081 -9177 -8109 -26464 -26867 1789
16333 1789 13470 -318 -14740 2851 20077 6182 768 20757 6014 12430 -26532 -26558 -19332
16320 -19332 -29028 -14892 -17530 -15878 7141 1954 20914 32485 29558 14827 21496 40230 21652
16307 21652 -1467 -13568 -26772 -998 19429 41863 37238 1529 -6787 -1345 6686 819 -15867
16294 -15867 -36107 -27581 -25269 -25029 10984 -3119 -15924 -9139 -8139 397 -11307 -26986 -15717
$$ packed form
16385A008r580J1785L807Q521L119K1062L039m104k6359l3971J6855L3904r32
16372B8154L817j3435K753l2749k224j0077J9996o234k8267Q053O087J4860K1561
16359A2295l95k6593k4734j6484O968K0399N819J5117n469L059Q559r381p464
16346a8304n505J5525M0735J6395o579o258j4478j4450j6258J068j8355m03K8656
16333A789J1681j3788j4422J7591J7226j3895n414J9989j4743O416l8962k6P226
16320a9332r696J4136k638J652K3019n187J8960J1571k927j4731O669J8734j8578
16307B1652k3119j2101j3204K5774K0427K2434m625l5709q316N442Q031n867j6686
16294a5867k0240Q526K312K40L6013j4103j2805O785J000Q536j1704j5679J1269
$$ plain form
16281 -15717 11794 46016 6885 -14269 -7763 -14481 -32819 -32762 -17039 -18245 -19675 327 13842
16268 13842 2812 -3773 9211 16634 23451 29501 44827 59878 49210 38047 33020 42547 41727
16255 41727 37839 24704 -10855 -38694 -40729 -7832 -6879 -478 9460 10359 14687 12632 2652 -8893
16241 -8893 -3179 4180 1907 -31458 -50696 -42848 -11425 -35233 -25423 -9704 -28589 -34947 -21706
16228 -21706 -2937 -6730 4116 19928 24168 7540 14699 6796 1020 -10946 -11908 -42259 -62434
16215 -62434 -45044 -5866 -9854 -33644 -28500 -24551 -5708 -18126 -10667 15093 25660 23845 4631
16202 4631 741 15863 27428 19045 31821 10851 -19021 -26715 -15498 -10521 -23582 -9467 16183
16189 16183 30481 22292 22710 21760 -12629 -6153 18776 16246 -11139 -13213 -2355 -7838 -35424
$$ packed form
16281a5717K7511L4222l9131k1154O506o718j8338N7J5723j206j430K0002J3515
16268A3842j1030o585J2984P423O817O050J5326J5051j0668j1163n027R527q20
16255D1727l888j3135l5559k7839k035L2897R53O401R938Q99M328k055r980j1545
16241h893N714P359k273l3365j9238P848L1423k3808R810J5719j8885o358J3241
16228b1706J8769l793J0846J5812M240j6628P159p903n776j1966r62l0351k0175
16215f2434J7390L9178l988k3790N144L949J8843j2418P459K5760J0567j815j9214
16202D631l890J5122J1565q383J2776k0970k9872p694J1217M977j3061J4115K5650
16189A6183J4298q189M18r50l4389O476K4929k530k7385k074J0858n483k7586
$$ plain form
16176 -35424 -43650 -15748 4649 -4957 -12557 -19456 -626 -10750 -2311 4084 -7955 -17997 -24311
16163 -24311 -28717 1059 25381 22068 12534 402 -17778 -10007 5081 6772 -27314 -27802 12
16150 12 29082 30573 25656 26019 10527 -4056 -14984 1276 -1453 3569 9244 -2310 -20585 -21333
16136 -21333 -30045 -20120 -15002 10687 5587 -14873 -25469 22009 53764 36037 -18039 -19770 10374
16123 10374 40396 18774 -2916 11844 26497 27439 32635 39813 33973 28284 18571 10951 14776
16110 14776 10656 18738 19557 33704 35899 30800 36226 23323 16093 -7841 -20046 -35071 -35393 -21731
16096 -21731 -19262 -30828 -50327 -44780 -9051 13240 20837 30557 27489 18052 29768 24600 47417
16083 47417 46913 59148 40981 44038 58602 66294 48100 37067 9505 -2311 36562 46492 11493
$$ packed form
16176c5424q226K7902K0397r606p600o899J8830j0124Q439O395j2039j0042o314
16163b4311m406K9776K4322l313r534j2132j8180P771J5088J691l4086m88K7814
16150A2K9070J491m917L63j5492j4583j0928J6260k729N022N675j1554j8275p48
16136b1333q712R925N118K5689n100k0460j0596M7478L1755j7727n4076j731L0144
16123A0374L0022k1622k1690J4760J4653R42N196P178n840n689r713p620L825
16110A4776m120Q082Q19J4147K195n099N426j2903p230k3934j2205j5025l22J3662
16096b1731K469j1566j9499N547L5729K2291P597R720l068r437J1716n168K2817
16083D7417n04J2235j8167L057J4564P692j8194j1033k7562j1816L8873R930l4999
$$ plain form
16070 11493 -4355 -19655 -20914 -5786 21065 41271 27679 31400 20064 16703 4471 9167
16058 9167 5132 37453 39040 32406 22142 28575 4558 -16510 7838 -6264 11274 10800 18653
16045 18653 14151 9773 -7952 -21243 -17893 -6766 8838 29365 10446 -3192 -517 2936 3291
16032 3291 44036 57351 42858 48303 57732 55855 29864 -9287 -18598 -19516 -14006 10576 24262
16019 24262 25994 41157 42669 58380 39920 16801 10577 28389 37669 30756 12333 9140 9464
16006 9464 54632 66544 40499 7619 17659 61050 67990 66323 80608 49462 33588 27176
15994 27176 42476 65870 75158 54798 52406 58651 43492 29847 1829 -3914 -9178 -23168 -20968
15981 -20968 -10916 -7080 -1771 22861 18652 -6063 -18031 -20845 -27855 -11014 3157 9264 14499
$$ packed form
16070A1493j5848j5300j259J5128K6851K0206j3592L721j1336l361j2232M696
16058I167m035L2321J587o634j0264O433k4017k1068K4348j4102J7538m74P853
16045A8653m502m378j7725j3291L350J1127J5604K0527j8919j3638K675L453L55
16032C291M0745J3315j4493N445R429j877k5991l9151r311r18N510K4582J3686
16019B4262J732J5163J512J5711j8460k3119o224J7812R280o913j8423l193L24
16006I464M5168J1912k6045l2880J0040M3391O940j667J4285l1146j5874o412
15994B7176J5300K3394R288k0360k392O245j5159j3645k8018n743n264j3990K200
15981b0968J0052L836N309K4632m209k4715j1968k814p010J6841J4171O107N235
$$ plain form
15968 14499 10607 -4131 30262 32596 32446 29061 16850 -14392 -54943 -32560 5599 32571 40682
15955 40682 47388 26468 -5380 -9701 -32105 -22141 -2708 10540 38234 48597 36576 10239
15943 10239 8871 2399 54 4006 8442 28931 22483 10003 -3201 -46519 -59780 -36072 -5304
15930 -5304 5358 -30230 -23353 5785 6417 23391 43435 27372 5084 -11969 -15185 -14162 -10042
15917 -10042 -6337 15124 13502 4207 -2461 17625 -4967 -4789 30406 39949 4364 -21827 14207
15904 14207 18838 23464 -3316 -24788 -4012 3044 13246 6637 -6214 -19910 -56943 -26747
15892 -26747 24157 38092 44509 18140 -12697 8061 34609 44624 50797 49137 37200 15067
15880 15067 3814 -5364 -1840 -10460 -5796 1426 3924 6200 13230 -4746 -644 -1641 882 -17383
$$ packed form
15968A4499l892j4738L4393K334j50l385j2211l1242m0551K2383L8159K6972Q111
15955D0682O706k0920l1848m321k2404R964J9433J3248K7694J0363j2021k6337
15943A0239j368o472k345L952M436K0489o448j2480j3204m3318j3261K3708L0768
15930e304J0662l5588O877K9138O32J6974K0044j6063k2288j7053l216J023M120
15917a0042L705K1461j622r295o668K0086k2592J78L5195R543l5585k6191L6034
15904A4207M631M626k6780k1472K0776P056J0202o609j2851j3696l7033L0196
15892b6747N0904J3935O417k6369l0837K0758K6548J0015O173j660j1937k2133
15880A5067j1253r178L524q620M664P222K498K276P030j7976M102r97K523j8265
$$ plain form
15866 -17383 586 5694 18013 17035 -3402 4944 1745 -19230 -11919 -21162 -19756 -11081 -11749 -19859
15852 -19859 -23068 -25303 -26729 -47195 -37661 -30335 -30353 -32373 -10596 -11228 1963 10451 -5623 7979
15838 7979 17738 3463 -9403 -33251 -45537 -22638 -18773 -18173 -16475 -6687 392 17896 33698
15825 33698 41711 22363 35248 38800 42233 30122 19493 20698 25616 10468 16131 -8028 -22245
15812 -22245 -19573 -11056 -20986 -28930 -27574 -5278 7108 22721 5404 -14054 2056 13176 19771
15799 19771 33150 42104 21324 1095 -11572 -3309 -9973 -8223 -16520 -13801 -12507 -3358 6051
15786 6051 11080 -2073 7871 38509 22286 2234 -19878 -25002 -11857 -19206 -32863 -25684 -10405
15773 -10405 -7960 -6707 -12039 6743 -1827 -3794 13069 2500 -15704 14421 22726 -10964 -26925
$$ packed form
15866a7383J7969N108J2319r78k0437Q346l199k0975P311r243J406Q675o68q110
15852a9859l209k235j426k0466R534P326j8k020K1777o32J3191Q488j6074J3602
15838G979R759j4275j2866k3848j2286K2899L865O00J698R788P079J7504J5802
15825C3698Q013j9348J2885L552L433j2111j0629J205M918j5148N663k4159j4217
15812b2245K672Q517r930p944J356K2296J2386J5613j7317j9458J6110J1120O595
15799A9771J3379Q954k0780k0229j2667Q263o664J750q297K719J294R149R409
15786F051N029j3153R944L0638j6223k0052k2112n124J3145p349j3657P179J5279
15773a0405K445J253n332J8782q570j967J6863j0569j8204L0125Q305l3690j5961
$$ plain form
15760 -26925 -18779 4305 -32048 -17417 -8172 -7795 -12983 177 -6851 695 11507 -1991 -24333
15747 -24333 -19622 -12954 -48860 -53055 -33232 20168 57618 45379 8872 -3703 -1977 5406 -8910
15734 -8910 6355 19763 21260 21907 25174 36625 39698 23264 29736 13433 -5706 -1663 2693
15721 2693 -10357 -39000 -37267 -12803 17123 36137 25546 -7898 -6911 17418 28136 29449 31656
15708 31656 30353 22820 7845 21733 27750 11593 -4493 -31705 -42218 -36310 -2640 12900
15696 12900 3612 1966 22990 15942 5509 14125 17416 18609 10843 12588 16222 10531 6531 534
15682 534 966 11383 2440 -10202 -39912 -43904 -17869 13484 23541 27116 39121 39079 30863 20423
15668 20423 -16897 -25232 17162 27557 24462 5301 -21018 -45647 -38629 -31230 -13588 9114
$$ packed form
15760b6925Q146K3084l6353J4631R245L77n188J3160p028P546J0812j3498k2342
15747b4333M711O668l5906m195J9823N3400L7450j2239l6507j2575J726P383j4316
15734h910J5265J3408J497O47L267J1451L073j6434O472j6303j9139M043M356
15721B693j3050k8643J733K4464K9926J9014j0591l3444R87K4329J0718J313K207
15708C1656j303p533j4975J3888O017j6157j6086k7212j0513N908L3670J5540
15696A2900r288j646K1024p048j0433Q616L291J193p766J745L634n691m000n997
15682E34M32J0417q943j2642k9710l992K6035L1353J0057L575J2005m2q216j0440
15668B0423l7320q335M2394J0395l095j9161k6319k4629P018P399J7642K2702
$$ plain form
15656 9114 3368 7508 -3925 9462 30242 12913 8860 4530 5684 18019 41624 8776 -2502
15643 -2502 10914 19879 16432 -1623 -3893 -28361 -22167 -18129 -22506 -34918 -26856 -28652 1248
15630 1248 33267 30925 18907 11126 -11445 -22360 -8225 10861 9955 -4060 19862 24035 46994
15617 46994 58605 22102 -2836 11135 32464 37644 23818 51583 49643 7337 -12253 835
15605 835 -13350 -41297 -37051 -20886 -30662 -23913 -26169 4322 10478 15948 29084 22209 12629 34914
15591 34914 48663 31517 34815 32088 8718 -8284 27337 15226 7936 -9296 1782 20769
15579 20769 -2067 -15556 7667 31340 18510 -6470 1718 11915 20080 6127 -16876 -14318
15567 -14318 -10813 -1693 2552 10275 48834 43330 5207 -5554 14468 37612 35492 3156 -22122
$$ packed form
15656I114n746M140j1433J3387K0780j7329m053m330J154J2335K3605l2848j1278
15643b502J3416Q965l447j8055k270k4468O194M038m377j2412Q062j796K9900
15630A248L2019k342j2018p781k2571j0915J4135J9086r06j4015K3922M173K2959
15617D6994J1611l6503k4938J3971K1329N180j3826K7765j940m2306j9590J3088
15605H35j4185k7947M246J6165r776O749k256L0491O156N470J3136o875r580K2285
15591C4914J3749j7146L298k727k3370j7002L5621j2111p290j7232J1078J8987
15579B0769k2836j3489K3223K3673j2830k4980Q188J0197Q165j3953k3003K558
15567a4318L505R120M245P723L8559n504l8123j0761K0022K3144k120l2336k5278
$$ plain form
15554 -22122 -12890 -538 14032 1957 -25005 -1841 -8612 -16240 -29715 -26923 -14933 -11278 9741
15541 9741 13742 -24378 -51336 -53753 -19750 9554 3686 1876 10451 23279 8830 22051 49803
15528 49803 14698 -525 -5064 -15351 -13235 -1101 19561 22561 19065 25638 10909 15169 10598
15515 10598 30100 30136 7927 23632 36966 25033 35623 18873 -11920 -183 19460 14121
15503 14121 12420 -31587 -40690 -10906 30134 44414 47346 35978 11122 -8696 -10707 -5457 13547
15490 13547 27674 16967 12136 15092 11764 6740 25155 20070 10792 -10414 -6985 -3307 -18121
15477 -18121 -12375 -14761 -20591 -12846 -33209 -44448 -14847 337 -10079 -7802 -20481 -51449 -41313
15464 -41313 -10781 -1567 -22630 -5052 -7650 -2194 -9786 13178 25816 35140 49763 41012 27792
$$ packed form
15554b2122R232J2352J4570j2075k6962K3164o771p628j3475K792J1990L655K1019
15541I741M001l8120k6958k417L4003K9304n868j810Q575J2828j4449J3221K7752
15528D9803l5105j5223m539j0287K116J2134K0662L000l496O573j4729M260m571
15515A0598J9502L6k2209J5705J3334j1933J0590j6750l0793J1737J9643n339
15503A4121j701m4007r103K9784M1040J4280K932j1368k4856j9818k011N250J9004
15490A3547J4127j0707m831K956l328n024J8415n085r278k1206L429L678j4814
15477a8121N746k386n830P745k0363j1239K9601J5184j0416K277j2679l0968J0136
15464d1313L0532R214k1063J7578k598N456p592K2964J2638R324J4623q751j3220
$$ plain form
15451 27792 26128 8178 12271 42336 45124 33848 16436 12496 23042 43000 52185 52171 13280
15438 13280 -5021 -3102 -15300 -24595 -39979 -31022 -29109 -19617 -40429 -45743 -53155 -65089 -14831
15425 -14831 28213 27544 2491 -4505 -9546 3509 25060 23101 33549 32425 31236 9520 -4638
15412 -4638 -12904 -1887 7721 -1699 8157 29669 31726 33119 24187 21027 18942 30051 27340 882
15398 882 -7543 -13658 -29993 -14558 -23270 -46712 -41070 -9915 -8385 -25383 -34238 -8558 -12762
15385 -12762 -21287 -29085 -19103 -8615 4515 5272 1895 17989 10772 -10836 -18691 -30129 -4659
15372 -4659 21162 11785 1536 -21729 -22369 7701 40999 60426 58677 20326 -2762 -16269 -10889
15359 -10889 20805 45639 55559 36134 11694 -7834 2010 7391 -15531 -37435 -37391 -21541 -5467
$$ packed form
15451B7792j664j7950M093L0065K788j1276j7412l940J0546J9958R185j4l8891
15438A3280j8301J919j2198r295j5384Q957J913R492k0812n314p412j1934N0258
15425a4831M3044o69k5053o996n041J3055K1551j959J0448j124j189k1716j4158
15412d638q266J1017R608r420R856K1512K057J393q932l160k085J1109k711k6458
15398H82q425o115j6335J5435q712k3442N642L1155J530j6998q855K5680m204
15385a2762q525p798R982J0488J3130P57l377J6094p217k1608p855j1438K5470
15372d659K5821r377j0249k3265o40L0070L3298J9427j749l8351k3088j3507N380
15359a0889L1694K4834R920j9425k4440j9528R844N381k2922k1904M4J5850J6074
$$ plain form
15346 -5467 27430 21129 4166 5025 -11386 -10068 26948 21102 -8972 -5372 16048 22314 6661
15333 6661 -27059 -23514 -2413 -17306 -15754 16117 20406 17391 34964 38430 28911 18545 15072
15320 15072 17920 13807 11573 -1090 -31917 -26186 -36440 -35081 -21012 20676 39946 36094 54118
15307 54118 59739 35399 24247 13705 32677 25639 -1051 -3309 11129 -11631 -43410 -28481
15295 -28481 4739 41671 53743 45000 35213 22213 2670 -4604 -11404 6253 -24768 -38037
15283 -38037 -1353 5198 -17191 -12143 -10401 -10444 -29197 -52957 -46694 -34631 -18193 -39306 -72721
15270 -72721 -56815 -34984 -50671 -41483 -64558 -64548 -48668 -40565 -37778 -29859 -18769 -24102 -1893
15257 -1893 11407 -16773 -12360 -1186 -18096 -23438 -9287 -5245 18730 31436 27095 9685 -10213
$$ packed form
15346e467L2897o301j6963Q59j6411J318L7016n846l0074L600K1420O266j5653
15333F661l3720L545K1101j4893J552L1871M289l015J7573L466r519j0366l473
15320A5072K848m113k234j2663l0827N731j0254J359J4069M1688J9270l852J8024
15307E4118N621k4340j1152j0542J8972p038k6690k258J4438k2760l1779J4929
15295b8481L3220L6932J2072q743r787j3000j9543p274o800J7657l1021j3269
15283c8037L6684O551k2389N048J742m3j8753k3760O263J2063J6438k1113l3415
15270g2721J5906K1831j5687R188k3075J0J5880Q103K787P919J1090n333K2209
15257a893J3300k8180M413J1174j6910n342J4151M042K3975J2706m341j7410j9898
$$ plain form
15244 -10213 111 -9502 -3895 -1515 21785 -5112 -10739 -29594 -65738 -78740 -72392 -59519 -46568
15231 -46568 -43652 -45475 -58678 -44622 -39790 -32947 -1800 537 11485 8203 5421 14044 8088
15218 8088 20489 23799 15575 5519 16016 39594 44906 19046 -5535 1271 -6866 -25148 -28014
15205 -28014 -16862 -14379 -28054 -48194 -36712 -14849 -18161 -33652 -33095 -26971 -38844 -26070 -2748
15192 -2748 12046 2277 -17342 -8681 -630 2181 -16816 -19783 -26830 -7457 3756 8861 7616
15179 7616 1766 7412 -15811 -8833 -10084 10176 36123 27675 13617 9934 -440 -3928 -10684
15166 -10684 1728 3891 -23863 -28288 886 28965 29811 20462 18859 8450 15747 11444 9441
15153 9441 3388 -6286 -2842 21253 19464 -1457 -4006 -22405 -19977 -15677 23335 47078 35381
$$ packed form
15244a0213J0324r613N607K380K3300k6897n627j8855l6144j3002O348J2873J2951
15231d6568K916j823j3203J4056M832O843L1147K337J0948l282k782Q623n956
15218H088J2401L310q224j0056J0497K3578N312k5860k4581O806q137j8282k866
15205b8014J1152K483j3675k0140J1482K1863l312j5491N57O124j1873J2774K3322
15192b748J4794r769j9619Q661Q051K811j8997k967p047J9373J1213N105j245
15179G616n850N646k3223O978j251K0260K5947q448j4058l683j0374l488o756
15166a0684J2412K163k7754m425K9174K8079Q46r349j603j0409P297m303k003
15153I441o053r674L444K4095j789k0921k549j8399K428M300L9012K3743j1697
$$ plain form
15140 35381 33723 46465 69594 34325 13145 15094 18734 -5898 -31319 -5065 12592 26331
15128 26331 33897 24636 15732 -5908 -33672 -44571 -26440 -13412 -14676 -23884 -39248 -58346 -46100
15115 -46100 -22043 -12533 -9322 -16925 9727 28851 10595 10142 19827 17167 10890 11401 14910 24404
15101 24404 8949 11571 1245 -17829 -32320 -33882 6165 12533 -21208 -49458 -40516 -45450 -29857
15088 -29857 -40521 -24599 -24505 -20786 -7325 -1751 -19692 -4703 6341 7991 1025 -26489 -35316
15075 -35316 -27964 -26672 -34571 -17357 4684 6285 -5665 -14890 -9985 -20530 12777 3294 -11560
15062 -11560 -27909 -52304 -59996 -43031 -23636 -20308 -16950 -23242 -15664 -30451 -50124 -42212 -20450
15049 -20450 -16815 -11243 -5231 12325 -1490 -18421 -32104 -29633 -29559 -15024 -7262 -8752 16128
$$ packed form
15140C5381j658J2742K3129l5269k1180J949L640k4632k5421K6254J7657J3739
15128B6331P566r261q904k1640k7764j0899J8131J3028j264r208j5364j9098J2246
15115d6100K4057R510L211p603K6652J9124j8256m53R685k660o277N11L509R494
15101B4404j5455K622j0326j9074j4491j562M0047O368l3741k8250Q942m934J5593
15088b9857j0664J5922R4L719J3461N574j7941J4989J1044J650o966k7514q827
15075c5316P352J292p899J7214K2041J601j1950r225M905j0545L3307r483j4854
15062a1560j6349k4395p692J6965J9395L328L358o292P578j4787j9673P912K1762
15049b0450L635N572O012J7556j3815j6931j3683K471P4J4535P762j490K4880
$$ plain form
15036 16128 24689 35045 23712 -1383 -22964 -17213 12529 15689 -6360 -22317 -38799 -30352
15024 -30352 -44977 -44708 -57389 -58320 -39881 -24216 -5801 284 -8953 -26059 -20467 -36036 -32866
15011 -32866 -25628 -24447 -11567 -15095 -18491 -45616 -64397 -49598 -39421 -43494 -64500 -42762 -30933
14998 -30933 -35513 -52308 -43785 -15680 -3887 38121 60285 32492 14066 -11437 -27035 -70837
14986 -70837 -61872 -36354 -27888 6012 1042 -3861 8778 13140 24318 17801 -5020 -13182 -7768
14973 -7768 4486 -15569 -22191 -1340 -12100 -34040 -43487 -34595 -30495 -35750 -21260 -11381 -36066
14960 -36066 -48007 -36325 -4213 -741 7776 1293 -33001 -64734 -41504 -34624 -3020 12452
14948 12452 -13305 -32466 -11355 -2496 719 6258 9655 -6578 8344 10245 5215 20346 51728
$$ packed form
15036A6128Q561J0356j1333k5095k1581N751K9742L160k2049j5957j6482Q447
15024c0352j4625K69j2681r31J8439J5665J8415O085r237j7106N592j5569L170
15011c2866P238J181J2880l528l396k7125j8781J4799J0177m073k1006K1738J1829
14998c0933m580j6795Q523K8105J1793M2008K2164k7793j8426k5503j5598m3802
14986g0837Q965K5518Q466L3900m970m903J2639M362J1178o517k2821q162N414
14973g768J2254k0055o622K0851j0760k1940r447Q892M100n255J4490R879k4685
14960c6066j1941J1682L2112L472Q517o483l4294l1733K3230O880L1604J5472
14948A2452k5757j9161K1111Q859L215N539L397j6233J4922J901n030J5131L1382
$$ plain form
14935 51728 45355 65368 53410 -10275 -21404 -18422 -25780 -22346 2787 33370 34565 -1348 -5056
14922 -5056 -19083 -13318 -19072 -29673 -26607 -41953 -42401 -46859 -13250 5668 -162 -6342 -28584
14909 -28584 -17456 637 -24837 -54971 -51566 -54694 -41232 -6304 14827 12385 -14740 -41800
14897 -41800 -56565 -61063 -65552 -74411 -65640 -44385 -23364 -2555 -9357 -34780 -29396 -14089 -33342
14884 -33342 -31277 -35672 -38636 -25973 -30802 -13218 -2624 13381 -4090 -30207 -39572 -33617 -17665
14871 -17665 3179 2924 -10891 -7842 -30011 -24382 -18332 -16473 -32387 -41049 -23108 -13603 -21296
14858 -21296 -8444 -9565 9684 25372 3398 -1687 16271 3952 -16786 -22801 2648 23003
14846 23003 29481 12380 22523 28929 14514 13313 12093 14605 -3876 -22050 -37025 -31762 -21407
$$ packed form
14935E1728o373K0013j1958o3685j1129K982p358L434K5133L0583J195l5913l708
14922e056j4027N765n754j0601L066j5346m48m458L3609J8918n830o180k2242
14909b8584J1128J8093k5474l0134L405l128J3462L4928K1131k442k7125k7060
14897d1800j4765m498m489q859Q771K1255K1021K0809o802k5423N384J5307j9253
14884c3342K065m395k964J2663m829J7584J0594J6005j7471k6117r365N955J5952
14871a7665K0844k55j3815L049k2169N629O050J859j5914q662J7941R505p693
14858b1296J2852j121J9249J5688k1974n085J7958j2319k0738o015K5449K0355
14846B3003O478j7101J0143O406j4415j201j220K512j8481j8174j4975N263J0355
$$ plain form
14833 -21407 -30625 -59365 -58393 -44659 -17077 -14336 -5495 -15851 -6346 -22339 -64578 -70729 -65924
14820 -65924 -53044 -72236 -95552 -72250 -45822 -34306 -3004 15487 7991 -1572 -26144 -20531
14808 -20531 12222 28316 -11932 -13828 -3368 -15555 -17021 -9270 -1648 -4638 -25753 -33094 -43204
14795 -43204 -37759 -40872 -19834 13882 13465 -4956 -39796 -44875 -9559 8925 -22229 -55081 -64366
14782 -64366 -73954 -43252 -1515 6803 -7924 -22958 1486 -1228 -9286 -5568 -5193 -37143 -41947
14769 -41947 -41550 -29230 -31238 -25545 -20257 -21133 -17647 -31906 -40112 -7979 14392 38281 15216
14756 15216 -8525 -17768 -26334 -25960 -26403 -44159 -25162 -27930 -28510 -11890 -2464 24440 40900 17142
14742 17142 -3144 -19035 -21457 -15177 -4051 7443 -15423 -33646 -17468 1349 -13115 -13230
$$ packed form
14833b1407r218k8740R72J3734K7582K741Q841j0356R505j5993m2239o151M805
14820f5924J2880j9192k3316K3302K6428J1516L1302J8491p496r563k4572N613
14808b0531L2753J6094m0248j896J0460j2187j466P751P622k990k1115p341j0110
14795d3204N445l113K1038L3716m17j8421l4840n079L5316J8484l1154l2852r285
14782f4366r588L0702M1737Q318j4727j5034K4444k714q058L718L75l1950m804
14769d1947L97J2320k008N693N288q76L486j4259q206L2133K2371K3889k3065
14756A5216k3741r243q566L74m43j7756J8997k768n80J6620R426K6904J6460k3758
14742A7142k0286j5891k422O280J1126J1494k2866j8223J6178J8817j4464j15
$$ plain form
14730 -13230 9207 10192 -22 -13001 -4189 20005 10338 -11925 -12267 -28562 -42066 -20026 -22473
14717 -22473 -45185 -61175 -51419 -26821 -43144 -19329 -21538 -35556 -35205 -42402 -37921 -946 10871
14704 10871 -28192 -26499 -25061 -26385 -26166 -9573 5512 2423 -14342 -31565 -40583 -45435 -29231
14691 -29231 805 -17866 -28020 3112 7808 8415 24836 11061 -2267 -8093 -7526 -6763 -13506
14678 -13506 -30503 -48253 -31549 -31701 -41624 -58765 -72138 -74407 -44684 -3842 1009 -3912 -14120
14665 -14120 -9281 -8723 -12250 1063 -9206 -9963 10567 22589 15468 8394 -4075 -14654 -18924
14652 -18924 9084 13052 17787 -10086 -27243 -52012 -61326 -40127 -9893 -31327 -39377 -54805
14640 -54805 -39456 -13064 -13617 -33203 -9700 -11265 -4356 -23710 -37718 -55978 -67025 -41544
$$ packed form
14730a3230K2437R85j0214j2979Q812K4194r667k2263l42j6295j3504K2040k447
14717b2473k2712j5990R756K4598j6323K3815k209j4018L51p197M481L6975J1817
14704A0871l9063J693J438j324K19J6593J5085l089j6765j7223r018m852J6204
14691b9231L0036j8671j0154L1132M696O07J6421j3775j3328n826N67P63o743
14678a3506j6997j7750J6704j52r923j7141j3373k269K9723M0842M851m921j0208
14665a4120M839N58l527J3313j0269p57K0530J2022p121p074j2469j0579m270
14652a8924K8008L968M735k7873j7157k4769r314K1199L0234k1434q050j5428
14640e4805J5349K6392n53j9586K3503j565O909j9354j4008j8260j1047K5481
$$ plain form
14628 -41544 -20369 -31031 -49115 -44609 -51347 -45913 -37642 -48102 -40345 -44066 -48346 -40899 -37038
14615 -37038 -43770 -19458 -36400 -54788 -31516 -17666 1168 16299 22683 20560 39644 40624 33378
14602 33378 23809 33839 27082 -7244 -23098 -13830 -5981 10738 -9541 -28791 -16803 22932
14590 22932 34949 30760 964 -19319 -13862 -25491 -31197 -18621 -20837 -42365 -49588 -47456 -39793
14577 -39793 -27776 -33244 -24872 -11281 5011 -439 -1483 18567 19775 -14200 -2107 18617 -2475
14564 -2475 5731 20442 8542 8015 -5020 -11555 -8378 -13249 -17276 -10758 -25453 -32336 -12893 14786
14550 14786 10799 227 -17624 -17802 -5474 -12298 -24522 -12094 2530 299 -6242 -39837 -23797
14537 -23797 16498 19568 2824 -14012 -40867 -49616 -51080 -40392 -14165 2575 3536 -32912 -43790
$$ packed form
14628d1544K1175j0662j8084M506o738N434Q271j0460P757l721m280P447L861
14615c7038o732K4312j6942j8388K3272J3850J8834J5131O384k123J9084R80p246
14602C3378r569J0030o757l4326j5854R268P849J6719k0279j9250J1988L9735
14590B2932J2017m189k9796k0283N457j1629n706J2576k216k1528p223K132P663
14577c9793J2017n468Q372J3591J6292n450j044K0050J208l3975J2093K0724k1092
14564b475Q206J4711j1900n27j3035o535L177m871m027O518j4695o883J9443K7679
14550A4786l987j0572j7851j78J2328o824j2224J2428J4624k231o541l3595J6040
14537b3797M0295L070j6744j6836k6855q749j464J0688K6227J6740R61l6448j0878
$$ plain form
14524 -43790 -33880 -30987 -3193 4752 -1514 1834 -24565 -14422 -25613 -33760 -35389 -32050 -36373
14511 -36373 -43193 -55473 -51106 -41481 -56971 -79071 -77171 -72817 -69516 -50037 -41307 -10397 18727
14498 18727 -20414 -25474 -12537 -4190 5130 -15947 -35002 -40701 -45533 -17305 4372 13965 31125
14485 31125 41519 13851 -4741 -31418 -47474 -38881 -31012 -32332 -27223 -20671 -36931 -52059 -40906
14472 -40906 -35212 -41663 -27983 -24554 -37468 -28760 -22230 1116 29396 9470 9171 -5023 -32170
14459 -32170 -46157 -31928 -49337 -56215 -41471 -30376 -7483 -19381 -30004 -39823 -12330 1125
14447 1125 5290 13441 -8484 -24090 -9988 -11356 -28717 2855 25131 -17594 -27136 -11244 -7759
14434 -7759 -17820 -7198 602 11112 29875 33806 17138 2706 2664 -2574 -15052 -23061 -9742
$$ packed form
14524d3790R910K893K7794P945o266L348k6399J0143j1191q147j629L339m323
14511c6373o820j2280M367R625j5490k2100J900M354L301J9479Q730L0910K9124
14498A8727l9141n060J2937Q347R320k1077j9055n699m832K8228K1677R593J7160
14485C1125J0394k7668j8592k6677j6056Q593P869j320N109O552j6260j5128J1153
14472d0906N694o451J3680L429j2914Q708O530K3346K8280j9926k99j4194k7147
14459c2170j3987J4229j7409o878J4744J1095K2893j1898j0623r819K7493J3455
14447A125M165Q151k1925j5606J4102j368j7361L1572K2276m2725r542J5892L485
14434g759j0061J0622P800J0510J8763L931j6668j4432m2n238j2478q009J3319
$$ plain form
14421 -9742 6045 114 -4018 18570 -3770 -42749 -36869 -40918 -46315 -32229 -38569 -43834 -24489
14408 -24489 956 -19790 -33588 -16252 7212 3123 -22181 -1276 12359 18083 -6636 -18288
14396 -18288 -24521 -6514 9960 -853 -2809 -13488 -33074 -29984 -18092 1367 6175 -1900 2305
14383 2305 -5952 -3231 12201 11481 -4307 -16738 -4035 17524 -9516 -36440 -47590 -11771 -36624
14370 -36624 -67249 -101102 -86412 -42280 -21320 -5049 10964 -8413 -19743 -19569 -25072 -26640
14358 -26640 -29349 -12951 -24509 -34378 -17920 -15953 -17838 -34319 -16154 -2645 -10247 -43591 -42243
14345 -42243 -30763 -11987 -15954 -5683 8491 -9059 -24331 -22386 -8881 -19922 -2071 -141
14333 -141 12839 34989 16877 -24512 -16525 -8813 -24083 -42775 -42653 -12401 -3549 11047 24734
$$ packed form
14421i742J5787n931m132K2588k2340l8979N880m049n397J4086o340n265J9345
14408b4489K5445k0746j3798J7336K3464m089k5304K0905J3635N724k4719j1652
14396a8288o233J8007J6474j0813j956j0679j9586L090J1892J9459M808q075M205
14383B305q257K721J5432p20j5788j2431J2703K1559k7040k6924j1150L5819k4853
14370c6624l0625l3853J4690M4132K0960J6271J6013j9377j1330J74n503j568
14358b6640k709J6398j1558r869J6458J967j885j6481J8165J3509p602l3344J348
14345d2243J1480J8776l967J0271J4174j7550j5272J945J3505j1041J7851J930
14333a41J2980K2150j8112m1389P987P712j5270j8692J22L0252Q852J4596J3687
$$ plain form
14320 24734 18686 6818 3913 -13830 -30868 -16241 -1114 14823 38343 40716 16752 -10792
14308 -10792 -28134 -43181 -52280 -57316 -34773 -22772 2973 3340 -19324 -51254 -50557 -30475 -26909
14295 -26909 -44060 -48116 -54454 -48477 -18525 -21038 -9396 3984 10273 40134 38988 17820 -4522
14282 -4522 -2747 9470 17701 10244 -1974 -16180 -20600 -18948 -9670 631 -797 -14264 -16375
14269 -16375 -18607 -3810 -15411 -6050 -2755 -11869 -10904 11993 42241 55765 48815 32809 9861
14256 9861 -6077 -20430 -9153 10933 13688 -10799 -9511 9348 -9383 18246 -4065 -53759
14244 -53759 -52877 1097 15362 6705 -7476 5850 3405 15072 17875 29063 14785 3064 530
14231 530 7695 -9321 -19348 19455 44210 38365 27054 -3852 -38486 -38018 -30613 -30662 -24411 -14235
$$ packed form
14320B4734o048j1868k905j7743j7038J4627J5127J5937K3520K373k3964k7544
14308a0792j7342j5047r099n036K2543J2001K5745L67k2664l1930O97K0082L566
14295b6909j7151m056o338N977K9952k513J1642J3380O289K9861j146k1168k2342
14282d522J775J2217Q231p457j2218j4206m420J652R278J0301j428j3467k111
14269a6375k232J4797j1601R361L295r114R65K2897L0248J3524o950j6006k2948
14256I861j5938j4353J1277K0086K755k4487J288J8859j8731K7629k2311m9694
14244e3759Q82N3974J4265q657j4181J3326k445J1667K803J1188j4278j1721k534
14231E30P165j7016j0027L8803K4755n845j1311l0906l4634M68P405m9O251J0176
$$ plain form
14217 -14235 -25365 -35560 -24433 -29892 -14491 4261 -13145 -14199 -3488 -21011 -40175 -58712
14205 -58712 -37041 -24960 7966 -2343 -2997 24082 27203 14907 29964 48895 32262 31146
14193 31146 51836 14530 -8706 -1673 -27013 -29256 -44871 -17392 2274 -18457 -27070 -18560
14181 -18560 -5070 -18186 -34140 -46614 -55982 -58916 -38575 -14568 -15157 -3880 6891 -8306
14169 -8306 -7657 -22792 -30350 -8921 -13634 -29482 -47132 -40474 -28532 -13678 9874 1653 -1713
14156 -1713 10594 9686 7529 7467 19850 26360 4027 -23872 -27084 -15313 -31123 -29795 1589 -3683
14142 -3683 -10070 -16077 -4431 -759 -22317 -47933 -43792 -20348 -2799 -20842 -29727 -29696 -18849
14129 -18849 6330 -6981 -13115 1679 2660 -18222 -26861 -28113 -24808 -28471 -32056 -26397 -24627 -16724
$$ packed form
14217a4235j1130j0195J1127n459J5401J8752j7406j054J0711j7523j9164j8537
14205e8712K1671J2081L2926j0309o54K7079L121j2296J5057J8931j6633j116
14193C1146K0690l7306k3236P033k5340k243j5615K7479J9666k0731q613Q510
14181a8560J3490j3116j5954j2474r368k934K0341K4007n89J1277J0771j5197
14169h306O49j5135p558K1429m713j5848j7650O658J1942J4854K3552q221l366
14156a713J2307r08k157o2J2383O510k2333k7899l212J1771j5810J328L1384n272
14142c683o387o007J1646L672k1558k5616M141K3444J7549j8043q885L1J0847
14129a8849K5179j3311o134J4794R81k0882q639j252L305l663l585N659J770P903
$$ plain form
14115 -16724 -22203 -57230 -71813 -44048 -26678 -18776 -10800 -28156 -53527 -57978 -40064 -15377
14103 -15377 -29912 -41741 -28861 -23921 19483 26864 -13614 -52097 -71624 -62635 -20532 -10361
14091 -10361 683 -5594 -8885 -17005 -24289 -13497 6569 4904 -8125 -15099 -47439 -59238 -35912
14078 -35912 -19354 -5726 -6274 -14650 -8050 -19758 -29073 -65633 -72790 -68205 -55038 -27631 -14995
14065 -14995 -15095 -23948 -11168 3009 11782 20860 26058 15462 -17621 -7736 -11609 -43899 -50955
14052 -50955 -59328 -41909 -31329 -37347 -32504 -11029 3534 -11448 -15661 -31470 -31886 3528 7394
14039 7394 697 -5919 19309 26128 5610 -24758 -23247 -29397 -22159 -2644 -1542 -4645 -8162 -8708
14025 -8708 -3292 -21038 5009 38775 36554 6113 707 -6361 -46644 -45898 -37834 -38804 -36759 -38868
$$ packed form
14115a6724n479l5027j4583K7765J7370P902P976j7356k5371m451J7914K4687
14103a5377j4535j1829J2880M940M3404P381m0478l8483j9527Q989M2103J0171
14091a0361J1044o277l291q120p284J0792K0066j665j3029o974l2340j1799K3326
14078c5912J6558J3628n48q376O600j1708r315l6560p157M585J3167K7407J2636
14065a4995j00q853J2780J4177Q773R078N198j0596l3083R885l873l2290p056
14052e0955q373J7419J0580o018M843K1475J4563j4982m213j5809m16L5414L866
14039G394o697o616K5228O819k0518l0368J511o150P238J9515J102l103l517n46
14025h708N416j7746K6047L3766k221l0441n406p068m0283P46Q064r70K045k109
$$ plain form
14011 -38868 -29860 -45814 -24688 -3199 903 7590 13806 2761 -4962 -15562 2157 6571 6736
13998 6736 9284 -10061 -10359 -28766 -31915 -882 8257 22531 24529 35330 38509 11947 -13585
13985 -13585 -20687 -27183 -22591 -24876 -12727 -5862 -14775 -12574 -20381 -20991 -11735 -3600 -262 -3944
13971 -3944 -19555 -42904 -44938 -33983 -36185 -43084 -42506 -51041 -44153 -36816 -32194 -32341 -45267 -50181
13957 -50181 -55191 -92448 -93868 -61441 -45617 -20096 14567 26050 10706 9248 17372 8345 -1217
13944 -1217 -51490 -53765 -38756 2925 10205 958 14050 2738 -10651 -3708 12618 12948 431
13931 431 -15627 -32709 -30083 -22791 -11721 2496 -12030 -24943 -32566 -40305 -26129 -2936 -22339
13918 -22339 -29501 -1763 21501 -1539 -18171 -24016 -60511 -43612 -25338 -33303 -17928 -12191
$$ packed form
14011c8868R008j5954K1126K1489M102O687O216j1045p723j0600J7719M414J65
13998F736K548j9345k98j8407l149L1033R139J4274J998J0801L179k6562k5532
13985a3585p102o496M592k285J2149O865q913K201p807o10R256Q135L338l682
13971c944j5611k3349k034J0955k202o899N78q535O888P337M622j47j2926m914
13957e0181n010l7257j420L2427J5824K5521L4663J1483j5344j458Q124r027r562
13944a217n0273k275J5009M1681P280r247J3092j1312j3389O943J6326L30j2517
13931D31j6058j7082K626P292J1070J4217j4526j2913p623p739J4176K3193j9403
13918b2339p162K7738K3264k3040j6632n845l6495J6899J8274p965J5375N737
$$ plain form
13906 -12191 -31465 -42565 -17894 -15966 -34506 -69900 -45478 -6227 -12817 -38343 -21761 -21457
13894 -21457 -9410 -33432 -64377 -73968 -85675 -65391 -35344 -26235 10013 34116 51107 32652
13882 32652 26546 15024 256 1930 -7664 -24490 -23714 -9647 -15293 8385 31656 42965 23735
13869 23735 6715 -6238 -14964 -35808 -25743 -12000 -13065 -19780 -6491 24940 37568 26294
13857 26294 41132 22930 9334 10842 -5847 -26871 -23973 8981 16681 1244 -20673 -16216
13845 -16216 -6819 2152 -27284 -30560 -42031 -30548 -21409 -31108 -17216 -1507 15840 3924 -1348
13832 -1348 11906 19403 -3255 -11578 3491 4065 -14613 -30538 -22238 692 -12644 -33100 -46340
13819 -46340 -44570 -42457 -16512 -10664 -11642 -63309 -51777 -4384 -10516 -21021 -3857 27169 15725
$$ packed form
13906a2191j9274j1100K4671J928j8540l5394K4422L9251o590k5526J6582L04
13894b1457J2047k4022l0945r591j1707K0284L0047R109L6248K4103J6991j8455
13882C2652o106j1522j4768J674r594j6826P76J4067n646K3678K3271J1309j9230
13869B3735j7020j2953q726k0844J0065J3743j065o715J3289L1431J2628j1274
13857B6294J4838j8202j3596J508j6689k1024K898L2954P700j5437k1917M457
13845a6216R397Q971k9436l276j1471J1483R139r699J3892J5709J7347j1916n272
13832a348J3254P497k2658q323J5069N74j8678j5925Q300K2930j3336k0456j3240
13819d6340J770K113K5945N848r78n1667J1532M7393o132j0505J7164L1026j1444
$$ plain form
13806 15725 -18052 -47129 -48824 -56940 -57562 -51258 -51157 -50024 -36397 -22129 -26025 -22846 -11595 5610
13792 5610 -3612 -32551 -33941 -22125 -6219 17131 35559 20446 -6088 -25657 -67350 -44738
13780 -44738 -23765 -30346 -6931 16267 19709 32796 48864 21416 -13738 -27839 -25708 -31511
13768 -31511 -38252 -16803 -42639 -48400 -64964 -63282 -55805 -33179 -13596 -15049 -27131 -20864 -15319
13755 -15319 -13772 -20524 -10536 -19736 -31940 -43459 -18776 -984 -9000 -1644 -20294 -43361 -53402
13742 -53402 -50089 -23381 -1849 -14388 -17784 -29179 -22967 -26134 -43446 -50603 -41259 -41473 -53754
13729 -53754 -42238 -27894 -1728 11468 22975 3843 -33238 -26411 -20869 -23424 -29319 -24271 -8430
13716 -8430 -14620 -30756 -22348 -27374 -35799 -56788 -44539 -23543 -33991 -46757 15296 9103 -16127
$$ packed form
13806A5725l3777k9077j695q116o22O304J01J133J3627J4268l896L179J1251J7205
13792E610r222k8939j390J1816J5906K3350J8428j5113k6534j9569m1693K2612
13780d4738K0973o581K3415K3198L442J3087J6068k7448l5154j4101K131n803
13768c1511o741K1449k5836n761j6564J682P477K2626J9583j453j2082O267N545
13755a5319J547o752R988r200j2204j1519K4683J7792q016P356j8650k3067j0041
13742e3402L313K6708K1532j2539l396j1395O212l167j7312p157R344k14j2281
13729e3754J1516J4344K6166J3196J1507j9132l7081O827N542k555n895N048J5841
13716h430o190j6136Q408n026q425k0989J2249K0996j0448j2766O2053o193k5230
$$ plain form
13703 -16127 -19275 -37730 -32584 -33525 -41400 -35050 -22919 5476 28644 40982 46591 48225 60294
13690 60294 43945 22032 -11739 -6649 -2870 -9142 -7702 14367 7609 -31536 -42965 -35451 -26383
13677 -26383 -25751 -44210 -41999 -25597 -49614 -28992 -16585 -26504 -8564 -18387 -9979 -19220 -22447
13664 -22447 -21968 -19000 1722 11492 22486 37300 11044 -4432 7735 12037 27319 18641 10097
13651 10097 11775 13752 20647 10462 3940 13775 -2504 -15011 -32015 -26220 -37868 -19994 13448
13638 13448 22131 5138 11020 10607 -8478 -24020 -17239 -11591 8154 -4341 -2087 5950 17800
13625 17800 33243 20162 16693 -12795 -28721 -14088 -5104 11149 28540 22533 15819 1892
13613 1892 -653 -10080 -23844 1445 12729 19768 25900 21274 5518 6622 9416 -7778 -6799 2831
$$ packed form
13703a6127l148j8455N146r41p875O350J2131K8395K3168J2338N609J634J2069
13690F0294j6349k1913l3771N090L779o272J440K2069o758l9145j1429P514R068
13677b6383O32j8459K211J6402k4017K0622J2407r919J7940r823Q408r241l227
13664b2447M79K968K0722R770J0994J4814k6256j5476J2167M302J5282q678q544
13651A0097J678J977O895j0185o522R835j6279j2507j7004N795j1648J7874L3442
13638A3448Q683j6993N882m13j9085j5542O781N648J9745j2495K254Q037J1850
13625A7800J5443j3081l469k9488j5926J4633Q984J6253J7391o007o714j3927
13613A892k545r427j3764K5289J1284P039O132m626j5756J104K794j7194R79R630
$$ plain form
13599 2831 2648 16725 22628 25876 28511 74543 88992 71231 46873 42646 49595 41334 41464 37604
13585 37604 50779 66447 54769 50837 49901 48264 44907 22263 -916 -4170 31259 35795 28623
13572 28623 24967 19430 23963 27460 34995 34108 6438 -4790 -649 21688 11387 31009 45910
13559 45910 25746 12410 -7612 10562 -2131 -18410 -32346 -45825 -56306 -53438 -40788 -12719
$$ packed form
13599B831j83J4077N903L248K635M6032J4449j7761k4358m227O949q261J30l860
13585C7604J3175J5668j1678l932r36j637l357k2644k3179l254L5429M536p172
13572B8623l656n537M533L497P535q87k7670j1228M141K2337j0301J9622J4901
13559D5910k0164j3336k0022J8174j2693j6279j3936j3479j0481K868J2650K8069
$$ [...]
##END NTUPLES=NMR SPECTRUM
##END=
