##TITLE=Analysis number 322413
Compound Code cc 54901
Book Reference 461/66
Project Code adrs
Chemist Name toml
##JCAMPDX= 6.0         $$ Bruker NMR JCAMP-DX V2.0
##DATA TYPE= NMR SPECTRUM
##DATA CLASS= NTUPLES
##ORIGIN= Bruker BioSpin GmbH
##OWNER= nmr
$$ XWIN-NMR		Version 3.5
$$ Mon Sep 25 13:38:28 2006 GMT Daylight Time (UT+1h)  MAYBRIDGE\nmr@NMR_250MHZ
##.OBSERVE FREQUENCY= 250.131544655141
##.OBSERVE NUCLEUS= ^1H
##.ACQUISITION MODE= SIMULTANEOUS (DQD)
##.ACQUISITION SCHEME= undefined
##.AVERAGES= 16
##.DIGITISER RES= 18
##SPECTROMETER/DATA SYSTEM= dpx250
##.PULSE SEQUENCE= zg30
##.SOLVENT NAME= DMSO
##.SHIFT REFERENCE= (INTERNAL, DMSO, 0, 16.522)
##AUDIT TRAIL= $$ (NUMBER, WHEN, WHO, WHERE, WHAT)
$$ ##TITLE= Audit trail, XWIN-NMR		Version 3.5
$$ ##JCAMPDX= 5.01
$$ ##ORIGIN= Bruker BioSpin GmbH
$$ ##OWNER= nmr
$$ C:\u/data/dgb/nmr/ADRS/1320/pdata/1/auditp.txt
$$ ##AUDIT TRAIL=  $$ (NUMBER, WHEN, WHO, WHERE, WHAT)
(   1,<2006-09-25 13:37:58.20 +100>,<MAYBRIDGE\nmr>,<NMR_250MHZ>,
      <created by zg, POWCHK disabled, PULCHK disabled
       configuration hash MD5:
       E2 DF 36 D8 04 B2 41 60 5A D7 A3 38 5A 4B D0 FE
       data hash MD5: 64K
       8D 9D 33 BE E8 32 E8 1A F7 E1 64 13 34 C9 3E 52>)
(   2,<2006-09-25 13:38:17.00 +100>,<MAYBRIDGE\nmr>,<NMR_250MHZ>,
      <Start of raw data processing
       ef LB = 0.3 FT_mod = 6 PKNL = 1 SI = 32K 
       data hash MD5: 32K
       E4 E4 37 19 E8 BD 06 25 7A 6B 57 15 56 50 BA 04>)
(   3,<2006-09-25 13:38:19.35 +100>,<MAYBRIDGE\nmr>,<NMR_250MHZ>,
      <apk 
       data hash MD5: 32K
       AC A3 58 32 12 33 F5 7F 58 18 41 71 BE B6 3F 1F>)
(   4,<2006-09-25 13:38:20.10 +100>,<MAYBRIDGE\nmr>,<NMR_250MHZ>,
      <abs ABSG = 5 
       data hash MD5: 32K
       47 86 FD 76 07 C2 93 F4 B3 E4 EB D9 92 31 03 94>)
$$ ##END=
$$ 
$$ hash MD5
$$ 55 04 CB 50 35 5A 62 F0 48 F4 2A F4 E6 29 23 BE
##$RELAX= 
##$RELAX= 
##$RELAX= 
##$RELAX= 
##$RELAX= 
##$RELAX= 
##$RELAX= 
$$ Bruker specific parameters
$$ --------------------------
##$DU= <C:\u>
##$EXPNO= 1320
##$NAME= <ADRS>
##$PROCNO= 1
##$TYPE= <nmr>
##$USER= <dgb>
##$AMP= (0..31)
100 100 100 100 100 100 100 100 100 100 100 100 100 100 100 100 100 100 
100 100 100 100 100 100 100 100 100 100 100 100 100 100 
##$AQSEQ= 0
##$AQ_mod= 3
##$AUNM= <au_zg>
##$AUTOPOS= <34 >
##$BF1= 250.13
##$BF2= 250.13
##$BF3= 250.13
##$BF4= 250.13
##$BF5= 500.13
##$BF6= 500.13
##$BF7= 500.13
##$BF8= 500.13
##$BYTORDA= 1
##$CFDGTYP= 0
##$CFRGTYP= 5
##$CHEMSTR= <none>
##$CNST= (0..31)
1 1 145 1 1 1 1 1 1 1 1 1 1 1 1 1 1 1 1 1 1 1 1 1 1 1 1 1 1 1 1 1 
##$CPDPRG= <>
##$CPDPRG1= <>
##$CPDPRG2= <>
##$CPDPRG3= <>
##$CPDPRG4= <mlev>
##$CPDPRG5= <mlev>
##$CPDPRG6= <mlev>
##$CPDPRG7= <mlev>
##$CPDPRG8= <mlev>
##$CPDPRGB= <>
##$CPDPRGT= <>
##$D= (0..31)
0 1 0 0 0 0 0 0 0 0.06 0 0 0 0 0 0 0.0002 0 0 0 0 0 0 0 0 0 0 0 0 0 0 
0 
##$DATE= 1159187877
##$DBL= (0..7)
120 120 120 120 120 120 120 120 
##$DBP= (0..7)
150 150 150 150 150 150 150 150 
##$DBP07= 0
##$DBPNAM0= <>
##$DBPNAM1= <>
$$ [...]
##$SUBNAM7= <"">
##$SUBNAM8= <"">
##$SUBNAM9= <"">
##$SW= 20.6930455092707
##$SWIBOX= (0..15)
0 0 3 0 0 0 0 0 0 0 0 0 0 0 0 0 
##$SW_h= 5175.983436853
##$TD= 65536
##$TD0= 1
##$TE= 296.16
##$TE2= 300
##$TE3= 300
##$TEG= 300
##$TL= (0..7)
0 120 120 120 120 120 120 120 
##$TP= (0..7)
150 150 150 150 150 150 150 150 
##$TP07= 0
##$TPNAME0= <>
##$TPNAME1= <>
##$TPNAME2= <>
##$TPNAME3= <>
##$TPNAME4= <>
##$TPNAME5= <>
##$TPNAME6= <>
##$TPNAME7= <>
##$TPOAL= (0..7)
0.5 0.5 0.5 0.5 0.5 0.5 0.5 0.5 
##$TPOFFS= (0..7)
0 0 0 0 0 0 0 0 
##$TUNHIN= 0
##$TUNHOUT= 0
##$TUNXOUT= 0
##$USERA1= <user>
##$USERA2= <user>
##$USERA3= <user>
##$USERA4= <user>
##$USERA5= <user>
##$V9= 5
##$VALIST= <valist>
##$VCLIST= <CCCCCCCCCCCCCCC>
##$VD= 0
##$VDLIST= <DDDDDDDDDDDDDDD>
##$VPLIST= <PPPPPPPPPPPPPPP>
##$VTLIST= <TTTTTTTTTTTTTTT>
##$WBST= 1024
##$WBSW= 4
##$XGAIN= (0..3)
0 0 0 0 
##$XL= 0
##$YL= 0
##$YMAX_a= 236420
##$YMIN_a= -423429
##$ZGOPTNS= <>
##$ZL1= 120
##$ZL2= 120
##$ZL3= 120
##$ZL4= 120
##$ABSF1= 16.522
##$ABSF2= -4.171173
##$ABSG= 5
##$ABSL= 3
##$ALPHA= 0
##$AQORDER= 0
##$ASSFAC= 0
##$ASSFACI= 0
##$ASSFACX= 0
##$ASSWID= 0
##$AUNMP= <proc_1d>
##$AZFE= 0.1
##$AZFW= 0.1
##$BCFW= 0
##$BC_mod= 0
##$BYTORDP= 0
##$COROFFS= 0
##$CY= 12.5
##$DATMOD= 1
##$DC= 0
##$DFILT= <>
##$DTYPP= 0
##$F1P= 14.0000005364418
##$F2P= -0.99999901652339
##$FCOR= 0.5
##$FTSIZE= 32768
##$FT_mod= 6
##$GAMMA= 0
##$GB= 0
##$INTBC= 1
##$INTSCL= 1
##$ISEN= 128
##$LB= 0.3
##$LEV0= 0
##$LPBIN= 0
##$MAXI= 10000
##$MC2= 0
##$MEAN= 0
##$ME_mod= 0
##$MI= 0
##$NCOEF= 0
##$NC_proc= -6
##$NLEV= 6
##$NOISF1= 0
##$NOISF2= 0
##$NSP= 0
##$NTH_PI= 0
##$NZP= 0
##$OFFSET= 16.522
##$PC= 1
##$PHC0= 110.1976
##$PHC1= 82.51077
##$PH_mod= 1
##$PKNL= yes
##$PPARMOD= 0
##$PSCAL= 4
##$PSIGN= 0
##$REVERSE= no
##$SF= 250.13
##$SI= 32768
##$SIGF1= 0
##$SIGF2= 0
##$SINO= 400
##$SIOLD= 32768
##$SREGLST= <1H.DMSO>
##$SSB= 0
##$STSI= 32768
##$STSR= 0
##$SW_p= 5175.98343685301
##$SYMM= 0
##$S_DEV= 0
##$TDeff= 65536
##$TDoff= 0
##$TI= <Analysis number 999999
Compound Code 99
Book Reference 9
Project Code 9>
##$TILT= no
##$TM1= 0
##$TM2= 0
##$TOPLEV= 0
##$USERP1= <user>
##$USERP2= <user>
##$USERP3= <user>
##$USERP4= <user>
##$USERP5= <user>
##$WDW= 1
##$XDIM= 32768
##$YMAX_p= 410216452
##$YMIN_p= -23740750
$$ End of Bruker specific parameters
$$ ---------------------------------
##NTUPLES= NMR SPECTRUM
##VAR_NAME=  FREQUENCY,     SPECTRUM/REAL,   SPECTRUM/IMAG
##SYMBOL=    X,             R,               I
##VAR_TYPE=  INDEPENDENT,   DEPENDENT,       DEPENDENT
##VAR_FORM=  AFFN,          ASDF,            ASDF
##VAR_DIM=   32768,         32768,           32768
##UNITS=     HZ,            ARBITRARY UNITS, ARBITRARY UNITS
##FACTOR=    0.157963299565203, 1,           1
##FIRST=     4132.6476996994, 0,             0
##LAST=      -1043.33573715361, 0,           0
##MIN=       -1043.33573715361, -23740750,   0
##MAX=       4132.6476996994, 410216452,     0
$$ Real data points
##PAGE= N=1
##DATA TABLE= (X++(R..R)), XYDATA
$$ [...]
$$ plain form
25813 16048 15950 -192479 -264991 -508268 -623967 -467607 -289605 -123883 -80596 264942 258006
25802 258006 169003 143519 -34879 -117744 -267732 -34115 -51073 -90033 63262 -30002 -104039
25791 -104039 -163550 -213477 -374126 -366671 -360617 -241652 -90671 -327446 -287765 -122072 -227179
25780 -227179 -837197 -1139432 -985513 -599901 -560951 -806740 -886083 -763618 -1078044 -905311
25770 -905311 -994784 -821568 -466879 -104642 -212500 -295864 -496046 -688952 -543551 -421038
25760 -421038 -387063 -319530 -226689 -182824 -8347 -47188 -230534 -395452 -272909 -312869 -223401
25749 -223401 -223937 -288702 -364406 -134377 -113403 -114472 -144093 -364710 -554693 -614811 -510405
25738 -510405 -544713 -625715 -710527 -359623 -116599 -321568 -389628 -347604 112807 335261
$$ packed form
25813A6048r8k08429p2512k43277j15699J56360J78002J65722M3287L45538o936
25802B58006q9003k5484j78398q2865j49988K33617j6958l8960J53295r3264p4037
25791a04039n9511m9927j60649P455O054J18965J50981k36775L9681J65693j05107
25780b27179o10018l02235J53919L85612L8950k45789p9343J22465l14426J72733
25770i05311q9473J73216L54689L62237j07858q3364k00182j92906J45401J22513
25760d21038L3975O7533R2841M3865J74477l8841j83346j64918J22543l9960Q9468
25749b23401n36o4765p5704K30029K0974j069k9621k20617j89983o0118J04406
25738e10405l4308q1002q4812L50904K43024k04969o8060M2024M60411K22454
$$ plain form
25728 335261 162633 -30414 -286371 -492227 -552783 -408468 -380281 -257604 -84345 195599
25718 195599 121172 341550 480901 149180 30214 150313 -121330 -140309 -200971 -231486
25708 -231486 -344378 -234510 -41848 -122269 -6763 35175 -147364 -384648 -202699 -169418
25698 -169418 -239974 -243758 -429081 -488472 -457211 -448679 -148534 24743 -93504 -96768 -331108
25687 -331108 -460954 -485709 -603257 -583153 -544358 -557550 -460677 -531865 -580649 -234902 -151621
25676 -151621 -232654 -367102 -313507 -384568 -391191 -73958 183116 129477 -36821 -456633 -364168
25665 -364168 -292884 -407704 -334364 -154254 -92303 -120255 -5200 -491335 -682118 -534097
25655 -534097 -339878 -358187 -526962 -300837 -273673 -485690 -460394 -255596 -235022 -760522
$$ packed form
25728C35261j72628j93047k55957k05856o0556J44315K8187J22677J73259K79944
25718A95599p4427K20378J39351l31721j18966J20099k71643j8979o0662l0515
25708b31486j12892J09868J92662q0421J15506M1938j82539k37284J81949L3281
25698a69418p0556l784j85323n9391L1261Q532L00145J73277j18247l264k34340
25687c31108j29846k4755j17548K0104L8795j3192R6873p1188m8784L45747Q3281
25676a51621q1033j34448N3595p1061o623L17233K57074n3639j66298m19812R2465
25665c64168P1284j14820P3340J80110O1951k7952J15055m86135j90783J48021
25655e34097J94219j8309j68775K26125K7164k12017K5296K04798K0574n25500
$$ plain form
25645 -760522 -751578 -571795 -398697 -277206 -258036 -164154 -232529 -347792 -469460 -227341
25635 -227341 -149332 -317330 -399978 -555098 -536904 -397215 -349385 -222407 -13326 -172219
25625 -172219 -457822 -579118 -525292 -595704 -748196 -227472 -75055 -309698 -828974 -1005304
25615 -1005304 -830467 -527878 -412708 -585766 -642847 -468532 -387469 -205469 20830 113154
25605 113154 -36534 -250291 -297742 -157002 24110 -130451 -224482 -128038 2448 -34965
25595 -34965 72198 -157847 -451036 -494602 -766280 -836403 -682529 -346270 -264521 -387415
25585 -387415 -289575 -158299 -39648 -177355 -457022 -625210 -687416 -667639 -668846 -486716
25575 -486716 -420309 -389065 -368423 -460351 -461455 -631877 -472738 -79176 42888 -224279 -380692
$$ packed form
25645g60522Q944J79783J73098J21491J9170R3882o8375j15263j21668K42119
25635b27341P8009j67998q2648j55120J8194J39689M7830J26978K09081j58893
25625a72219k85603j21296N3826p0412j52492N20724J52417k34643n19276j76330
25615a005304J74837L02589J15170j73058n7081J74315Q1063J82000K26299R2324
25605A13154j49688k13757m7451J40740J81112j54561r4031R6444J30486l7413
25595c4965J07163k30045k93189m3566k71678p0123J53874L36259Q1749j22894
25585c87415R7840J31276J18651j37707k79667j68188o2206J9777j207J82130
25575d86716O6407L1244K0642r1928j104j70422J59139L93562J22064k67167j56413
$$ plain form
25564 -380692 -579768 -591609 -167403 160503 72086 -71664 -101458 -140771 -297250 -515794
25554 -515794 -862017 -602134 -172432 357616 434325 296578 102274 -42422 -26031 -248665
25544 -248665 -507504 -625231 -813976 -732248 -649378 -535460 -507997 -611928 -294753 -5087
25534 -5087 -1757 -225251 -149940 -201431 -396803 -308019 -413280 -440745 -373021 -474072 -499989
25523 -499989 -281740 -227449 -306948 -342677 -405154 -596899 -687905 -681833 -579466 -504225 -605730
25512 -605730 -532634 -561067 -483154 -328279 -293728 -484573 -389336 -27518 250656 109087
25502 109087 -406492 -497866 -644067 -684547 -633185 -597967 -646658 -415316 -516726 -568247 -651766
25491 -651766 -706968 -395187 -124443 -158902 -285028 -386251 -421589 -445495 -383671 -396400 -495315
$$ packed form
25564c80692j99076j1841M24206L27906q8417j43750k9794l9313j56479k18544
25554e15794l46223K59883M29702N30048P6709j37747j94304j44696J6391k22634
25544b48665k58839j17727j88745Q1728Q2870J13918K7463j03931L17175K89666
25534e087L330k23494P5311n1491j95372Q8784j05261k7465O7724j01051k5917
25523d99989K18249N4291p9499l5729o2477j91745r1006O072J02367P5241j01505
25512f05730P3096k8433P7913J54875L4551j90845R5237L61818K78174j41569
25502A09087n15579r1374j46201m0480N1362L5218m8691K31342j01410n1521q3519
25491f51766n5202L11781K70744l4459j26126j01223l5338k3906O1824j2729r8915
$$ plain form
25480 -495315 -605729 -737372 -827480 -652892 -971454 -1325822 -889723 -816037 -868844 -772545
25470 -772545 -620993 -775631 -786700 -737020 -691983 -890313 -486953 -410260 -582416 -498339
25460 -498339 -635625 -734847 -530840 -339634 -15271 1497 118457 -181680 -165506 -34205
25450 -34205 195508 -94652 -322741 -239833 40448 -225707 -561350 -667639 -377150 -237543
25440 -237543 -42220 -12851 -166829 4327 -105397 -245377 -87200 81691 262325 -7577
25430 -7577 -397889 -732852 -755887 -593038 -349771 80195 312888 -62148 -247781 -134381
25420 -134381 -168649 -226939 -385419 -441628 -177829 26919 -1983 -62865 -282541 -440588
25410 -440588 -123933 -9512 -31333 -593183 -552115 -209139 182016 450373 248525 -2998
$$ packed form
25480d95315j10414j31643r0108J74588l18562l54368M36099P3686n2807R6299
25470g72545J51552j54638j1069M9680M5037j98330M03360P6693j72156Q4077
25460d98339j37286r9222K04007J91206L24363J6768J16960l00137J6174J31301
25450c4205K29713k90160k28089Q2908K80281k66155l35643j06289K90489J39607
25440b37543J95323K9369j53978J71156j09724j39980J58177J68891J80634k69902
25430g577l90312l34963k3035J62849K43267M29966K32693l75036j85633J13400
25420a34381l4268n8290j58480n6209K63799K04748k8902o0882k19676j58047
25410d40588L16655J14421k1821n61850M1068L42976L91155K68357k01848k51523
$$ plain form
25400 -2998 -436162 -484521 -689434 -657193 -677292 -227006 -71127 -462895 -666723 -179126
25390 -179126 -240168 -208163 -474892 -684020 -713286 -767613 -481411 -470473 -385624 -376332 -127007
25379 -127007 11307 -36551 -69220 -281078 -370364 -313995 -108196 -264061 -371829 -430405
25369 -430405 -304219 -359982 -465656 -416776 -203151 -518857 -632800 -610185 -447244 -193701
25359 -193701 -142617 -197854 -290219 -290779 -100925 254107 335949 146006 -196945 -189999 -508969
25348 -508969 -428979 -297518 -653647 -931657 -1017821 -923174 -872824 -602306 -287482 -196380
25338 -196380 -125691 -579967 -950370 -1105990 -843933 -555341 -562113 -316121 -302088 -615634
25328 -615634 -595469 -203335 66260 -11724 455916 441813 37725 -272742 -406441 -197794
$$ packed form
25400b998m33164m8359k04913L2241k0099M50286J55879l91768k03828M87597
25390a79126o1042L2005k66729k09128k9266n4327K86202J0938Q4849R292K49325
25379a27007J38314m7858l2669k11858q9286N6369K05799j55865j07768n8576
25369d30405J26186n5763j05674M8880K13625l15706j13943K2615J62941K53543
25359a93701N1084n5237r2365n60J89854L55032Q1842j89943l42951O946l18970
25348e08969P9990J31461l56129k78010q6164R4647N0350K70518L14824R1102
25338a96380P0689m54276l70403j55620K62057K88592o772K45992J4033l13546
25328f15634K0165L92134K69595p7984M67640j4103m04088l10467j33699K08647
$$ plain form
25318 -197794 -105375 -222018 -230655 -188581 -155033 -398679 -341660 -596702 -538640 -448404 -719469
25307 -719469 -645943 -896582 -797289 -819478 -1059849 -1273995 -974464 -693416 -698820 -650289 -618498
25296 -618498 -245583 -264985 -206715 -380449 -409679 -230609 -376390 -645896 -703413 -954386
25286 -954386 -1221585 -1255108 -1007837 -576765 -543450 -637899 -890599 -594502 -457576 -433110
25276 -433110 -768652 -1023500 -916682 -644173 -167384 118216 138063 -116638 -429958 -761232
25266 -761232 -997968 -1194233 -891798 -742282 -676457 -601709 -390616 -637271 -759855 -795355
25256 -795355 -624824 -653392 -726855 -500247 -463814 -390684 -542135 -546695 -174351 -55061 92768
25245 92768 5559 -282677 -358503 -185272 -282812 -277288 -733012 -1026744 -1291982 -1449009 -954484
$$ packed form
25318a97794R2419j16643q637M2074L3548k43646N7019k55042N8062R0236k71065
25307g19469P3526k50639R9293k2189k40371k14146K99531K81048n404M8531L1791
25296f18498L72915j9402N8270j73734k9230J79070j45781k69506n7517k50973
25286i54386k67199l3523K47271M31072L3315r4449k52700K96097J36926K4466
25276d33110l35542k54848J06818K72509M76789K85600J9847k54701l13320l31274
25266g61232k36736j96265L02435J49516O5825P4748K11093k46655j22584l5500
25256g95355J70531k8568p3463K26608L6433P3130j51451m560L72344J19290J47829
25245I2768q7209k88236p5826J73231r7540N524m55724k93732k65238j57027M94525
$$ plain form
25234 -954484 -989886 -1268531 -1000546 -797252 -731440 -839864 -572446 -419781 -438393 -608503
25224 -608503 -95274 195394 154491 -12713 -248747 -183434 -195118 -440139 -543746 -848219
25214 -848219 -998889 -876335 -821073 -813795 -838020 -963878 -1093512 -855939 -729358 -932285
25204 -932285 -678844 -313805 -337544 -459860 -605765 -529937 -430925 -521472 -583217 -565864 -509880
25193 -509880 -633318 -538966 -609379 -642341 -476536 -397493 -469477 -148118 -330860 -535692
25183 -535692 -535322 -461114 -291104 -299214 -451783 -943412 -669403 -488587 -539517 -406321 -268904
25172 -268904 -312596 -10449 -107364 -471720 -633425 -638465 -541502 -459543 -503139 -296036 -182374
25161 -182374 -99007 -421909 -716007 -790777 -853473 -822495 -881211 -1168230 -1037783 -952370 -1124867
$$ packed form
25234i54484l5402k78645K67985K03294O5812j08424K67418J52665j8612j70110
25224f08503N13229K90668m0903j67204k36034O5313j1684k45021j03607l04473
25214h48219j50670J22554N5262P278k4225j25858j29634K37573J26581k02927
25204i32285K53441L65039k3739j22316j45905P5828R9012r0547o1745J7353N5984
25193e09880j23438R4352p0413l2962J65805P9043p1984L21359j82742k04832
25183e35692L70P4208J70010q110j52569m91629K74009J80816n0930J33196J37417
25172b68904m3692L02147r6915l64356j61705n040R6963Q1959m3596K07103J13662
25161a82374Q3367l22902k94098p4770o2696L0978n8716k87019J30447Q5413j72497
$$ plain form
25150 -1124867 -941130 -841646 -802309 -886373 -856530 -876299 -778253 -753181 -729833 -810080 -721519
25139 -721519 -592610 -632329 -562881 -373917 -433218 -952489 -1188710 -891947 -871812 -505389
25129 -505389 -303808 -259722 -381799 -384025 -532381 -596508 -289012 -582163 -779538 -394716
25119 -394716 37300 127899 -324601 -936418 -900637 -751363 -652510 -423072 -458510 -677970
25109 -677970 -689200 -570804 -645607 -521307 -426734 -543894 -544918 -520262 -623515 -430983 -451288
25098 -451288 -385059 -297135 -477527 -762869 -828192 -564328 -600538 -652209 -923925 -954040 -709254
25087 -709254 -753002 -636723 -362519 -370304 -299814 -304904 -290908 -242478 -36016 69134 -268014
25076 -268014 -320448 -285853 -739511 -878988 -528610 -124814 61352 -189100 -514997 -544833
$$ packed form
25150a124867J83737R9484L9337q4064K9843j9769R8046K5072K3348q0247Q8561
25139g21519J28909l9719O9448J88964n9301n19271k36221K96763K0135L66423
25129e05389K01581M4086j22077k226j48356o4127L07496k93151j97375L84822
25119c94716M32016R0599m52500o11817L5781J49274R8853K29438l5438k19460
25109f77970j1230J18396p4803J24300R4573j17160j024K4656j03253J92532k0305
25098d51288O6229Q7924j80392k85342o5323K63864l6210n1671k71716l0115K44786
25087g09254m3748J16279K74204p785P0490n090J3996M8430K06462J05150l37148
25076b68014n2434L4595m53658j39477L50378M03796J86166k50452l25897k9836
$$ plain form
25066 -544833 -286709 -450812 -621646 -586510 -519942 -626278 -668766 -597327 -470250 -560016
25056 -560016 -445801 -108967 -27274 21906 831 -244893 -45047 50504 -129602 -206442
25046 -206442 -534800 -724294 -597982 -563173 -490934 -324472 -395088 -208336 -240346 -556914
25036 -556914 -877496 -937162 -951615 -1020253 -929959 -917226 -1053665 -699595 -633533 -588510 -690584
25025 -690584 -574647 -470835 -425730 -520773 -458130 -539933 -611345 -818030 -985331 -988963 -950567
25014 -950567 -1080121 -1090886 -870836 -592316 -517441 -520038 -489026 -378905 -550974 -480754 -558179
25003 -558179 -481255 -451603 -310234 -390234 -746043 -790982 -723364 -687565 -742942 -809563 -674411
24992 -674411 -749656 -608737 -205805 -504991 -482556 -244308 -484300 -494148 -509288 -504940 -411109
$$ packed form
25066e44833K58124j64103j70834L5136O6568j06336m2488P1439J27077q9766
25056e60016J14215L36834Q1693M9180k1075k45724J99846R5551j80106p6840
25046b06442l28358j89494J26312L4809P2239J66462p0616J86752l2010l16568
25036e56914l20582n9666j4453o8638R0294J2733j36439L54070O6062M5023j02074
25025f90584J15937J03812M5105r5043O2643q1803p1412k06685j67301l632L8396
25014i50567j29554j0765K20050K78520P4875k597L1012J10121j72069P0220p7425
25003e58179P6924K9652J41369q0000l55809m4939O7618L5799n5377o6621J35152
24992f74411p5245J40919M02932k99186K2435K38248k39992r848j5140M348R3831
$$ plain form
24981 -411109 -423609 -264510 -455755 -917642 -1062272 -1113822 -771300 -411892 -188947 -300783
24971 -300783 -372389 -637814 -620408 -396033 -333159 -267481 -498799 -660569 -708220 -610222 -297932
24960 -297932 -94231 -156334 -221155 -407224 -544275 -842586 -700972 -761471 -849717 -817963
24950 -817963 -545678 -610156 -604505 -822662 -820087 -440776 -286959 -483140 -841034 -680807
24940 -680807 -469276 -502851 -337552 -423735 -279814 26127 -155611 -405348 -507402 -528962
24930 -528962 -518985 -454127 -418254 -305822 -599699 -1072226 -1018156 -744317 -181324 -173273 -222729
24919 -222729 -688880 -954912 -880630 -817932 -616633 -437189 -607951 -525556 -122484 -196178
24909 -196178 -493612 -316754 57255 12990 -41461 -160467 -277868 -241664 -680061 -920313
$$ packed form
24981d11109j2500J59099j91245m61887j44630n1550L42522L59408K22945j11836
24971c00783p1606k65425J7406K24375O2874O5678k31318j61770m7651R7998L12290
24960b97932K03701o2103o4821j86069j37051k98311J41614o0499q8246L1754
24950h17963K72285o4478N651k18157K575L79311J53817j96181l57894J60227
24940f80807K11531l3575J65299q6183J43921L05941j81738k49737j02054k1560
24930e28962R977O4858L5873J12432k93877m72527N4070K73839N62993Q051m9456
24919b22729m66151k66032P4282O2698K01299J79444j70762Q2395M03072p3694
24909a96178k97434J76858L74009m4265n4451j19006j17401L6204m38397k40252
$$ plain form
24899 -920313 -881144 -676806 -573281 -381781 -127229 -271634 -578348 -590548 -643826 -535422
24889 -535422 -615533 -661174 -749696 -699814 -795614 -841973 -617132 -734960 -1097288 -1178396 -972946
24878 -972946 -968247 -711654 -821330 -893003 -547816 -472591 -699533 -815964 -735199 -673589 -717097
24867 -717097 -874022 -927473 -856863 -711875 -507659 -622507 -522891 -502234 -682267 -519905
24857 -519905 -717113 -638539 -446523 -444551 -739409 -678594 -274702 -35925 -197523 -484691
24847 -484691 -464356 -264796 -104449 -346277 -519376 -415542 -315954 -376398 -298728 -572063
24837 -572063 -698969 -652727 -653298 -538520 -411978 -341562 -343619 -359668 -381850 -325844 -90487
24826 -90487 -179792 -330867 -650149 -739634 -685913 -622557 -386395 -222309 -266733 -210944 -150192
$$ packed form
24899i20313L9169K04338J03525J91500K54552j44405l06714j2200n3278J08404
24889e35422q0111m5641q8522M9882r5800m6359K24841j17828l62328q1108K05450
24878i72946M699K56593j09676p1673L45187P5225k26942j16431Q0765O1610m3508
24867g17097j56925n3451P0610J44988K04216j14848R9616K0657j80033J62362
24857e19905j97208P8574J92016J972k94858O0815M03892K38777j61598k87168
24847d84691K0335J99560J60347k41828j73099J03834R9588o0444P7670k73335
24837e72063j26906M6242n71J14778J26542P0416k057j6049k2182N6006K35357
24826i0487q9305j51075l19282q9485N3721O3356K36162J64086m4424N5789O0752
$$ plain form
24815 -150192 -288027 -189675 -405895 -482138 -335872 -291707 -478834 -814412 -960208 -801565
24805 -801565 -392190 -230719 -326475 -295148 -318940 -322080 -460772 -619386 -711696 -778754 -418195
24794 -418195 -577809 -996670 -722242 -402363 -231165 -160244 -164534 -374828 -533818 -719899
24784 -719899 -753229 -834594 -803568 -799897 -747939 -630443 -356625 -419751 -348338 -154606 -463182
24773 -463182 -558383 -685435 -718363 -651085 -307227 -126097 -255631 -502687 -154830 -52154
24763 -52154 -384938 -481565 -195242 -31922 -13073 125957 309264 391610 367022 123908
24753 123908 45416 -308140 -465942 -306796 -364045 -422495 -480824 -558192 -712707 -584765
24743 -584765 -389452 -197070 -437831 -867253 -1078200 -1173477 -821526 -765500 -595915 -604958
$$ packed form
24815a50192j37835R8352k16220p6243J46266M4165j87127l35578j45796J58643
24805h01565M09375J61471r5756L1327k3792l140j38692j58614r2310o7058L60559
24794d18195j59614m18861K74428L19879J71198P0921m290k10294j58990j86081
24784g19899l3330q1365L1026L671N1958J17496K73818o3126P1413J93732l08576
24773d63182r5201j27052l2928O7278L43858J81130j29534k47056L47857J02676
24763e2154l32784r6627K86323J63320J8849J39030J83307Q2346k4588k43114
24753A23908p8492l53556j57802J59146n7249n8450n8329p7368j54515J27942
24743e84765J95313J92382k40761m29422k10947r5277L51951N6026J69585r043
$$ plain form
24733 -604958 -557183 -643151 -588274 -268199 -383208 -709458 -494413 -281381 -460753 -317801
24723 -317801 -380514 -583595 -476030 -473513 -577937 -641993 -503909 -495096 -443040 -342047 -746224
24712 -746224 -918138 -978171 -898396 -532071 -597418 -770488 -644033 -422692 -432281 -615541
24702 -615541 -513435 -390577 -202832 18774 -295328 -574805 -377920 -494621 -645227 -539075
24692 -539075 -764734 -896832 -1014591 -881787 -899250 -749836 -995010 -1058137 -559808 -166596
24682 -166596 -234195 -308989 -637806 -598660 -344749 -345807 -519107 -763459 -940385 -845573 -746155
24671 -746155 -621650 -703884 -712609 -601140 -657268 -744860 -737552 -579651 -328317 -382600 -700186
24660 -700186 -669026 -833541 -957395 -572809 -378279 -319802 -468505 -154047 -60062 -542745
$$ packed form
24733f04958M7775q5968N4877L20075j15009l26250K15045K13032j79372J42952
24723c17801o2713k03081J07565K517j04424o4056J38084Q813N2056J00993m04177
24712g46224j71914o0033P9775L66325o5347j73070J26455K21341r589j83260
24702f15541J02106J22858J87745K21606l14102k79477J96885j16701j50606J06152
24692e39075k25659j32098j17759J32804j7463J49414k45174o3127M98329L93212
24682a66596o7599p4794l28817L9146K53911j058j73300k44352j76926R4812R9418
24671g46155J24505q2234q725J11469n6128q7592P308J57901K51334n4283l17586
24660g00186L1160j64515j23854L84586J94530N8477j48703L14458R3985m82683
$$ plain form
24650 -542745 -508211 -474991 -483983 -281799 -291271 -621545 -779112 -560968 -406116 -297247 -511277
24639 -511277 -404599 -487174 -478277 -647179 -1003009 -730373 -525978 -522139 -456852 -777168 -794893
24628 -794893 -865931 -732752 -582570 -384941 -342096 -247451 -325560 -739988 -1024293 -842149
24618 -842149 -605295 -588174 -175231 -65488 -99063 -385681 -198881 -254645 -189374 66544
24608 66544 -60871 -369182 -519815 -312310 -268360 -298764 -393591 -452487 -562583 -680829
24598 -680829 -1003821 -947689 -792456 -725313 -651174 -1014261 -1225380 -698214 -494446 -304880
24588 -304880 -367915 -175967 -30997 -111327 -88136 -108434 -53246 -158043 -89387 -567372 -1103360
24577 -1103360 -1418604 -1087102 -751170 -976763 -1008076 -803337 -640197 -688242 -879921 -1067270
$$ packed form
24650e42745L4534L3220q992K02184r472l30274j57567K18144J54852J08869k14030
24639e11277J06678q2575Q897j68902l55830K72636K04395L839O5287l20316j7725
24628g94893p1038J33179J50182J97629M2845R4645p8109m14428k84305J82144
24618h42149K36854J7121M12943J09743l3575k86618J86800n5764O5271K55918
24608F6544j27415l08311j50633K07505M3950l0404r4827n8896j10096j18246
24598f80829l22992N6132J55233O7143P4139l63087k11119N27166K03768J89566
24588c04880o3035J91948J44970q0330K3191k0298N5188j04797O8656m77985n35988
24577a103360l15244L31502L35932k25593l1313K04739J63140m8045j91679j87349
$$ plain form
24567 -1067270 -1080240 -899313 -624792 -847867 -892049 -1031216 -749213 -498590 -731425 -749774
24557 -749774 -358109 -250126 -123344 -95255 -130178 -269500 -666659 -565985 -380097 -307210
24547 -307210 -449760 -646952 -566423 -395117 -680878 -1112856 -968997 -855942 -1018162 -800560
24537 -800560 -372377 -361071 -203564 -165633 -230786 -240348 -434069 -559568 -629885 -650254 -481402
24526 -481402 -461253 -167117 -176574 -307666 -318639 -403213 -539063 -739787 -1153446 -1248566 -1119771
24515 -1119771 -1279825 -1156334 -626389 -75501 -257134 -601301 -493355 -268890 -125205
24506 -125205 -218535 -222367 -301917 -537857 -549630 -407378 -665083 -628958 -516147 -592077 -667938
24495 -667938 -309078 -334909 -686142 -814669 -1068573 -1190967 -854229 -584229 -581095 -739439
$$ packed form
24567a067270j2970J80927K74521k23075m4182j39167K82003K50623k32835j8349
24557g49774L91665J07983J26782K8089l4923j39322l97159J00674J85888P2887
24547c07210j42550j97192Q0529J71306k85761m31978J43859J13055j62220K17602
24537h00560M28183J1306J57507L7931o5153r562j93721j25499p0317k0369J68852
24526d81402K0149K94136r457j31092j0973q4574j35850k00724m13659r5120J28795
24515a119771j60054J23491N29945N50888j81633l44167J07946K24465J43685
24506a25205r3330l832p9550k35940j1773J42252k57705L6125J12811p5930p5861
24495f67938L58860k5831l51233j28527k53904j22394L36738K70000L134j58344
$$ plain form
24485 -739439 -833698 -494246 -496521 -629446 -365437 -397074 -443852 -396532 -645276 -745825 -718392
24474 -718392 -440539 -497363 -500119 -679305 -736207 -515369 -442769 -502293 -1033641 -1254457 -936465
24463 -936465 -313710 -196609 -591814 -731023 -561942 -449360 -219186 -194182 -586338 -796176
24453 -796176 -926465 -1243369 -1358142 -1278226 -1120585 -859492 -604494 -819319 -961129 -905444
24443 -905444 -1023040 -862520 -601593 -513454 -575076 -851507 -842319 -257988 -295156 -749751
24433 -749751 -731922 -506355 -109774 -47089 -189179 -454189 -618012 -723340 -919704 -675791
24423 -675791 -265497 -53447 -26812 -370719 -613137 -720466 -737465 -681280 -448843 -314600
24413 -314600 -525334 -485870 -827384 -658265 -722538 -924861 -866606 -656458 -425604 -311822
$$ packed form
24485g39439r4259L39452k275j32925K64009l1637m6778M7320k48744j00549K7433
24474g18392K77853n6824k756j79186n6902K20838P2600n9524n31348k20816L17992
24463i36465O22755J17101l95205j39209J69081J12582K30174K5004l92156k09838
24453g96176j30289l16904j14773P9916J57641K61093K54998k14825j41810N5685
24443i05444j17596J60520K60927Q8139o1622k76431R188N84331l7168m54595
24433g49751J7829K25567L96581O2685j42090k65010j63823j05328j96364K43913
24423f75791M10294K12050K6635l43907k42418j07329j6999N6185K32437J34243
24413c14600k10734L9464l41514J69119o4273k02323N8255K10148K30854J13782
$$ plain form
24403 -311822 -659908 -1048153 -1028032 -908625 -786968 -988065 -945880 -313781 -230838 -411832
24393 -411832 -410888 -641376 -618756 -561913 -720920 -1174777 -1088562 -917563 -1140298 -1105517 -1292285
24382 -1292285 -865391 -356069 -180275 -294642 128471 58185 -210199 -379050 -613633 -626873
24372 -626873 -719047 -762031 -787634 -635573 -576472 -150436 107876 254485 118864 -382380
24362 -382380 -584429 -451243 -520170 -569191 -682474 -835835 -602655 -380258 -644990 -805048
24352 -805048 -1029859 -957982 -789101 -899258 -867904 -760905 -823011 -784282 -638210 -523790
24342 -523790 -330555 -158046 -289149 -710278 -1036003 -995275 -1206048 -1065745 -627890 -456952
24332 -456952 -483128 -380112 -212729 -527064 -757092 -937231 -838508 -784749 -959113 -991678
$$ packed form
24403c11822l48086l88245K0121J19407J21657k01097M2185O32099Q2943j80994
24393d11832R44k30488K2620N6843j59007m53857Q6215J70999k22735L4781j86768
24382a292285M26894N09322J75794j14367M23113p0286k68384j68851k34583j3240
24372f26873r2174m2984k5603J52061N9101M26036K58312J46609j35621n01244
24362c82380k02049J33186o8927m9021j13283j53361K33180K22397k64732j60058
24352h05048k24811P1877J68881j10157L1354J06999o2106L8729J46072J14420
24342e23790J93235J72509j31103m21129l25725M0728k10773J40303M37855J70938
24332d56952k6176J03016J67383l14335k30028j80139R8723N3759j74364l2565
$$ plain form
24322 -991678 -639369 -284552 -609710 -839031 -693228 -513584 -608361 -580640 -436634 -406996
24312 -406996 -593585 -476863 -652762 -874885 -829021 -776933 -461287 -278044 -455724 -631569
24302 -631569 -905466 -702860 -239813 -51167 -220699 -161121 -289310 -418749 -159557 43113
24292 43113 363431 201302 86471 52775 -357871 -651514 -460786 -294256 -255840 -246850
24282 -246850 11528 121925 -43855 35090 -137905 -168696 -192369 -598964 -1012762 -1184323
24272 -1184323 -1276850 -1197399 -1185960 -469704 -550782 -677245 -388403 -328825 -250136 -319198 -423332
24261 -423332 -514304 -604858 -361383 -286983 -561261 -884106 -599231 -146502 -295323 -589024
24251 -589024 -389733 -55614 -32628 -361289 -611874 -865112 -745761 -549644 -416644 -220599
$$ packed form
24322i91678L52309L54817l25158k29321J45803J79644r4777K7721J44006K9638
24312d06996j86589J16722j75899k22123M5864N2088L15646J83243j77680j75845
24302f31569k73897K02606M63047J88646j69532N9578j28189j29439K59192K02670
24292D3113L20318j62129j14831l3696m10646k93643J90728J66530L8416Q990
24282b46850K58378J10397j65780P8945j72995l0791k3673m06595m13798j71561
24272a184323r2527P9451J1439P16256q1078j26463K88842N9578P8689o9062j04134
24261d23332r0972r0554K43475P4400k74278l22845K84875M52729j48821k93701
24251e89024J99291L34119K2986l28661k50585k53238J19351J96117J33000J96045
$$ plain form
24241 -220599 -531637 -822579 -623897 -673465 -166688 -176452 -275009 -21240 -31723 -537826
24231 -537826 -843472 -902563 -641314 -641370 -686175 -574961 -519848 -580220 -604294 -495694 -289243
24220 -289243 -508630 -908133 -1177544 -1127457 -1045113 -851785 -792676 -786653 -836537 -999930 -1171144
24209 -1171144 -1218359 -1026270 -958790 -886429 -593878 -337239 -739621 -1064502 -953286 -807451
24199 -807451 -786636 -667411 -334282 -502211 -832926 -681012 -674178 -803039 -774285 -485419
24189 -485419 -147017 -250501 -366769 -461890 -210222 -309558 3846 -44578 -181239 -471154
24179 -471154 -810588 -930897 -881967 -777854 -902895 -850971 -884733 -643756 -352410 -246783
24169 -246783 -334535 -540053 -548282 -665383 -821480 -833788 -440202 -221076 -125293 -409030
$$ packed form
24241b20599l11038k90942J98682m9568N06777r764r8557K53769j0483n06103
24231e37826l05646n9091K61249n6m4805J11214N5113o0372k4074J08600K06451
24220b89243k19387l99503k69411N0087Q2344J93328N9109O023m9884j63393j71214
24209a171144m7215J92089O7480P2361K92551K56639m02382l24881J11216J45835
24199h07451K0815J19225L33129j67929l30715J51914O834j28861K8754K88866
24189d85419L38402j03484j16268r5121K51668r9336L13404m8424j36661k89915
24179d71154l39434j20309M8930J04113j25041N1924l3762K40977K91346J05627
24169b46783q7752k05518q229j17101j56097j2308L93586K19126R5783k83737
$$ plain form
24159 -409030 -426172 -470564 -397398 -517735 -297762 -110241 -233403 -627171 -675430 -898744
24149 -898744 -1211962 -1247020 -1094431 -672768 -249680 -224963 -185821 -94807 -513451 -824853
24139 -824853 -747405 -695134 -586508 -678308 -659644 -465176 -708600 -779074 -748399 -655129 -730681
24128 -730681 -687219 -588461 -501798 -685119 -628912 -565094 -524351 -644892 -551964 -716045 -1000412
24117 -1000412 -976464 -784082 -657522 -337541 -62892 94577 146417 84060 42157 -235478
24107 -235478 -611398 -994400 -1113825 -1006770 -694610 -582911 -83221 -17022 58761 -328053
24097 -328053 -439531 -483490 -630551 -702350 -449693 -324182 -300456 -340142 -498159 -666656
24087 -666656 -259474 -174131 -332588 -219505 -303331 -391348 -128472 -268447 -505692 -743896
$$ packed form
24159d09030j7142m4392P3166j20337K19973J87521j23162l93768m8259k23314
24149h98744l13218l5058J52589M21663M23088K4717L9142R1014m18644l11402
24139h24853P7448N2271J08626r1800J8664J94468k43424p0474L0675R3270p5552
24128g30681M3462R8758Q6663j83321N6207O3818M0743j20541R2928j64081k84367
24117a000412K3948J92382J26560L19981K74649J57469N1840o2357m1903k77635
24107b35478l75920l83002j19425J07055L12160J11699M99690O6199P5783l86814
24097c28053j11478m3959j47061p1799K52657J25511K3726l9686j58017j68497
24087f66656M07182Q5343j58457J13083q3826q8017K62876j39975k37245k38204
$$ plain form
24077 -743896 -825961 -493274 -107369 67390 -422130 -659004 -472478 -167271 134407 152447
24067 152447 -212193 -358875 -554100 -275274 -138469 -171461 -383179 -602282 -575854 -702453
24057 -702453 -216359 -33494 -39664 -165746 -115171 -42634 -289384 -419263 -264386 -469243
24047 -469243 -545251 -626561 -700759 -642830 -849489 -813248 -763001 -933254 -1023955 -864464 -725176
24036 -725176 -635205 -527535 -692756 -506867 -162492 -105826 -220007 -129784 -195454 -249976
24026 -249976 -354139 -575985 -883968 -985328 -1179283 -913384 -680687 -473851 -518420 -313612
24016 -313612 -36113 -143922 -255642 -227028 -214299 -287814 -279498 -733305 -746782 -657276 -839835
24005 -839835 -483610 -336846 -196211 -55478 -21877 -310789 -588998 -805817 -694214 -547963
$$ packed form
24077g43896q2065L32687L85905J74759m89520k36874J86526L05207L01678J8040
24067A52447l64640j46682j95225K78826J36805l2992k11718k19103K6428j26599
24057g02453M86094J82865o170j26082N0575P2537k46750j29879J54877k04857
24047d69243p6008q1310p4198N7929k06659L6241N0247j70253r0701J59491J39288
24036g25176Q9971J07670j65221J85889L44375N6666j14181R0223o5670n4522
24026b49976j04163k21846l07983j01360j93955K65899K32697K06836m4569K04808
24016c13612K77499j07809j11720K8614J2729p3515Q316m53807j3477Q9506j82559
24005h39835L56225J46764J40635J40733L3601k88912k78209k16819J11603J46251
$$ plain form
23995 -547963 -388336 -369137 -380102 -399243 -149615 1083 -255800 -526438 -446264 -198069
23985 -198069 -108157 208470 133243 -216294 -666593 -638875 -374946 -141714 -176178 -370536
23975 -370536 -494633 -408058 -539113 -579857 -556308 -711335 -727933 -484592 -369233 -451974
23965 -451974 -483193 -367804 -565242 -711369 -678721 -561568 -478959 -304823 -301571 -261792 -667071
23954 -667071 -516396 -285326 -123746 -90926 -96145 -329319 -493094 -504542 -219022 -147959
23944 -147959 -465463 -596607 -404678 -176137 -348671 -212108 -374614 -599938 -341310 -62643
23934 -62643 51739 -211956 -773615 -784063 -580274 -502769 -398038 -491266 -615295 -638091
23924 -638091 -421520 -127157 -129600 -55753 96933 -264974 -369971 -459723 -670892 -647206
$$ packed form
23995e47963J59627J9199j0965j9141K49628J50698k56883k70638Q0174K48195
23985a98069Q9912L16627p5227l49537m50299K7718K63929K33232l4464j94358
23975c70536j24097Q6575j31055m0744K3549j55027j6598K43341J15359q2741
23965d51974l1219J15389j97438j46127L2648J17153Q2609J74136L252L9779m05279
23954f67071J50675K31070J61580L2820n219k33174j63775j1448K85520P1063
23944a47959l17504j31144J91929K28541j72534J36563j62506k25324K58628K78667
23934f2643J14382k63695n61659j0448K03789P7505J04731r3228j24029k2796
23924f38091K16571K94363k443P3847J52686l61907j04997q9752k11169K3686
$$ plain form
23914 -647206 -363068 -258329 -439410 -494863 -512785 -476371 -914414 -587401 -441035 -781184
23904 -781184 -720249 -344876 -8006 -163848 -191745 -228801 -415052 -410604 -114693 -224602
23894 -224602 -301538 -428876 -461723 -323786 -276298 -200470 -390959 -792900 -742080 -806315 -629142
23883 -629142 -516357 -317781 -580678 -484709 -192194 -88654 -28155 -160522 -557358 -642798
23873 -642798 -364337 -225359 -452920 -790559 -428940 -389821 -910041 -1171681 -1042663 -768508
23863 -768508 -493729 -372337 -254771 -394740 -482500 -405062 -335311 -599209 -944045 -1034520
23853 -1034520 -1044028 -939926 -611949 -331408 -153586 -322422 -182749 -230279 -96861 -343462
23843 -343462 -643782 -681749 -352488 127292 129312 -30754 143199 38653 93247 -286802
$$ packed form
23914f47206K84138J04739j81081n5453j7922L6414m38043L27013J46366l40149
23904g81184O0935L75373L36870j55842k7897l7056j86251M448K95911j09909
23894b24602p6936j27338l2847J37937M7488P5828j90489m01941N0820o4235J77173
23883f29142J12785J98576k62897R5969K92515J03540O0499j32367l96836q5440
23873f42798K78461J38978k27561l37639L61619L9119n20220k61640J29018K74155
23863g68508K74779J21392J17566j39969q7760P7438O9751k63898l44836r0475
23853a034520r508J04102L27977K80541J77822j68836J39673m7530J33418k46601
23843c43462l00320l7967L29261M79780K020j60066J73953j04546N4594l80049
$$ plain form
23833 -286802 -461741 -352098 -421873 -633222 -466434 -240502 -136305 36839 -106407 -504051
23823 -504051 -637934 -483517 -266395 -492441 -421959 -439352 -869652 -874776 -884224 -757140 -619426
23812 -619426 -278008 -422197 -753086 -981086 -669886 -520527 -436330 -473015 -643450 -791309
23802 -791309 -412983 -246951 -375947 -334279 -610699 -768419 -742081 -622147 -740557 -805258
23792 -805258 -442296 2317 -188507 -348502 -397583 -505700 -296335 -303233 -194702 -320100
23782 -320100 -508689 -359030 -248130 -352493 -537700 -366213 -188349 -29215 -128708 -515758
23772 -515758 -687705 -644232 -379998 -194708 -31874 243049 100053 -271954 -248903 -439034
23762 -439034 -502974 -408096 -361188 -204500 -526960 -675057 -779100 -745799 -547555 -824567
$$ packed form
23833b86802j74939J09643o9775k11349J66788K25932J04197J73144j43246l97644
23823e04051j33883J54417K17122k26046P0482j7393m30300n124r448J27084J37714
23812f19426L41418j44189l30889k28000L11200J49359Q4197l6685j70435j47859
23802g91309L78326J66032j28996M1668k76420j57720K6338J19934j18410o4701
23792h05258L62962M44613j90824j59995m9081j08117K09365o898J08531j25398
23782c20100j88589J49659J10900j04363j85207J71487J77864J59134r9493l87050
23772e15758j71947M3473K64234J85290J62834K74923j42996l72007K3051j90131
23762d39034o3940R4878M6908J56688l22460j48097j04043L3301J98244k77012
$$ plain form
23752 -824567 -1148650 -948848 -724662 -338546 -193152 -319079 -746625 -901940 -617068 -229968
23742 -229968 -22421 200197 -408418 -854757 -581105 -266639 -341226 -525010 -439817 -543696
23732 -543696 -649837 -525735 -640522 -554252 -523449 -415310 -336801 -580810 -653268 -729392
23722 -729392 -616961 -602536 -717332 -907867 -1162997 -940936 -403712 -625494 -720273 -593109
23712 -593109 -392427 -245531 -27182 -340536 -415392 -271270 -269379 -528849 -536297 -209385
23702 -209385 -30029 -148115 -59027 -211737 -585 606680 679318 331672 32232 -300613
23692 -300613 -232643 -167168 -153868 -311353 -246918 -112457 -271179 -433698 -432153 -399230 -447886
23681 -447886 -314320 -189963 -148192 -322762 -404390 -281601 -647305 -1185154 -1217799 -568767
$$ packed form
23752h24567l24083J99802K24186L86116J45394j25927m27546j55315K84872L87100
23742b29968K07547K22618o08615m46339K73652L14466p4587j83784Q5193j03879
23732e43696j06141J24102j14787Q6270L0803J08139P8509k44009p2458p6124
23722g29392J12431J4425j14796j90535k55130K22061N37224k21782r4779J27164
23712e93109K00682J46896K18349l13354p4856J44122J891k59470p448L26912
23702b09385J79356j18086Q9088j52710K11152O07265P2638l47646k99440l32845
23692c00613O7970O5475J3300j57485O4435J34461j58722j62519J545L2923m8656
23681d47886J33566J24357M1771j74570q1628J22789l65704n37849l2645O49032
$$ plain form
23671 -568767 -615149 -753362 -971724 -612592 -463710 -589957 -509500 -697465 -1051389 -667670
23661 -667670 -513932 -535542 -466332 -4756 12258 -460488 -655473 -512415 -260837 -23496
23651 -23496 182060 28937 -4106 -565751 -558851 -560496 -644616 -456688 -354228 -176908 70418
23640 70418 20093 -122294 25392 -198774 -218255 -325721 -576423 -708987 -403724 -346438
23630 -346438 -544956 -443308 -523607 -587245 -371303 -288559 -300038 -320099 -387952 -433732 -464392
23619 -464392 -540105 -549355 -223742 -71416 -72110 -83935 -307326 -440947 -640403 -658763 -353807
23608 -353807 -576442 -575235 -552279 -499749 -219059 -425047 -620719 -738462 -469798 -287077
23598 -287077 -359165 -333961 -97717 -84317 -209762 -199559 86917 273040 371379 319128 -22850
$$ packed form
23671e68767m6382j38213k18362L59132J48882j26247Q0457j87965l53924L83719
23661f67670J53738k1610O9210M61576J7014m72746j94985J43058K51578K37341
23651b3496K05556j53123l3043n61645O900j645q4120J87928J02460J77320K47326
23640G0418n0325j42387J47686k24166j9481j07466k50702j32564L05263N7286
23630c46438j98518J01648q0299o3638K15942Q2744j1479k0061o7853m5780l0660
23619d64392p5713r250L25613J52326o94j1825k23391j33621j99456j8360L04956
23608c53807k22635J207K2956N2530K80690k05988j95672j17743K68664J82721
23598b87077p2088K5204K36244J3400j25445J0203K86476J86123R8339n2251l41978
$$ plain form
23587 -22850 -382388 -458478 -435177 -681715 -657053 -904770 -787227 -441790 -566489 -1022363
23577 -1022363 -1219295 -1200775 -998891 -1035069 -982470 -719959 -642073 -659888 -780219 -744604
23567 -744604 -1043363 -874987 -593192 -766962 -771243 -738082 -657477 -842674 -1201151 -1423870
23557 -1423870 -1254251 -944989 -482188 -467417 -560046 -469222 -296103 -335943 -503654 -785389
23547 -785389 -795682 -707510 -534149 -471448 -159136 -80812 -295437 -572994 -827624 -911639
23537 -911639 -840803 -801188 -366978 -186421 -370283 -354263 -163881 -173902 -377813 -632161
23527 -632161 -616356 -458062 -440882 -455638 -358075 -295123 -353785 -368794 -380483 -579012 -406770
23516 -406770 -617002 -416237 152310 562652 377522 -214192 -829106 -825571 -477357 -461345
$$ packed form
23587b2850l59538p6090K3301k46538K4662k47717J17543L45437j24699m55874
23577a022363j96932J8520K01884l6178N2599K62511P7886j7815j20331L5615
23567g44604k98759J68376K81795j73770m281L3161Q0605j85197l58477k22719
23557a423870J69619L09262M62801J4771r2629R0824J73119l9840j67711k81735
23547g85389j0293Q8172J73361O2701L12312P8324k14625k77557k54630q4015
23537i11639P0836L9615M34210J80557j83862J6020J90382j0021k03911k54348
23527f32161J5805J58294J7180j4756R7563O2952n8662j5009j1689j98529J72242
23516d06770k10232K00765N68547M10342j85130n91714o14914L535L48214J6012
$$ plain form
23506 -461345 -535654 -538477 -721345 -712251 -615294 -597262 -752418 -562775 -420239 -626026 -720154
23495 -720154 -390320 -212243 -187021 -377243 -318304 -503915 -604294 -600511 -867615 -1312843
23485 -1312843 -1220256 -1038825 -936452 -442701 -99392 -164654 -354072 -227329 -627026 -768718
23475 -768718 -628948 -609348 -739493 -1001746 -960660 -682363 -823576 -619949 -679703 -441217
23465 -441217 -178173 -747005 -1177515 -998553 -608497 -327865 -137880 21546 -339745 -242951
23455 -242951 -254365 -273742 -561118 -500570 -385875 -226437 -187583 -57417 -109978 -276877
23445 -276877 -838155 -755450 -347282 -350013 -562546 -617099 -495380 -536137 -794782 -859344 -691515
23434 -691515 -730470 -710301 -574742 -271371 -270191 -292911 -340515 -780020 -1021189 -993831 -1024582
$$ packed form
23506d61345p4309k823j82868R094R6957J8032j55156J89643J42536k05787r4128
23495g20154L29834J78077K5222j90222N8939j85611j00379L783k67104m45228
23485a312843R2587J81431J02373M93751L43309o5262j89418J26743l99697j41692
23475g68718J39770J9600j30145k62253M1086K78297j41213K03627n9754K38486
23465d41217K63044n68832m30510J78962L90056K80632J89985J59426l61291R6794
23455b42951j1414j9377k87376O0548J14695J59438L8854J30166n2561j66899
23445b76877n61278Q2705M08168k731k12533n4553J21719m0757k58645o4562J67829
23434f91515l8955K0169J35559L03371J180k2720m7604m39505k41169K7358l0751
$$ plain form
23423 -1024582 -1029483 -844362 -682158 -331835 -744 11907 -9674 392915 362494 85233
23413 85233 -261394 -192462 235226 454343 75012 -414113 -567472 -672549 -626557 -737899
23403 -737899 -630623 -370976 72702 -318820 -630289 -471210 -299358 -154223 -120486 -162142
23393 -162142 -232790 -56098 -61477 185814 10963 -371479 -345123 -259993 -165953 -405919 -465592
23382 -465592 -145442 -273729 -307231 -415226 -151246 -47032 -186732 -370239 -322941 -265805
23372 -265805 -181671 -34691 -145820 -253986 -164120 -291091 -393664 -485540 -275511 111588
23362 111588 -172197 -161149 -424317 -546802 -464535 -316517 -116239 -325179 -373387 -498891
23352 -498891 -878269 -983170 -1101753 -1029770 -1092949 -751983 -303480 -86073 -95685 -211325
$$ packed form
23423a024582m901J85121J62204L50323L31091J2651k1581M02589l0421k77261
23413H5233l46627O8932M27688K19117l79331m89125j53359j05077M5992j11342
23403g37899J07276K59647M43678l91522l11469J59079J71852J45135L3737m1656
23393a62142p0648J76692n379K47291j74851l82442K6356Q5130R4040k39966n9673
23382d65592L20150j28287l3502j07995K63980J04214j39700j83507M7298N7136
23372b65805Q4134J46980j11129j08166Q9866j26971j02573r1876K10029L87099
23362A11588k83785J1048k63168j22485Q2267J48018K00278k08940m8208j25504
23352d98891l79378j04901j18583P1983o3179L40966M48503K17407r612j15640
$$ plain form
23342 -211325 -304733 -289640 -220226 -27464 191524 252460 52900 -181669 -135620 14399
23332 14399 324882 88663 -15104 -107965 3951 -100976 -217317 -429216 -199504 124157
23322 124157 208872 28194 -72092 -120242 -156396 -240979 -664480 -829005 -874258 -979690
23312 -979690 -829562 -804254 -875565 -810673 -539351 -610114 -620888 -494403 -479302 -777883 -909169
23301 -909169 -826272 -621597 -313897 -467771 -588006 -400179 -175199 -270467 -101359 63131
23291 63131 -233317 -363961 -386684 -528040 -557460 -430940 -493401 -558652 -393899 -350680 -89554
23280 -89554 -52371 -31091 -201757 -26096 4606 -85799 -273132 -426157 -548729 -332583
23270 -332583 -365575 -376532 -43542 -205500 -413982 -320358 -368008 -452984 -507883 -624775 -516183
$$ packed form
23342b11325r3408J5093O9414J92762K18988O0936j99560k34569M6049J50019
23332A4399L10483k36219j03767r2861J11916j04927j16341k11899K29712L23661
23322A24157Q4715j80678j00286m8150l6154q4583m23501j64525m5253j05432
23312i79690J50128K5308p1311O4892K71322p0763j0774J26485J5101k98581j31286
23301i09169Q2897K04675L07700j53874j20235J87827K24980r5268J69108J64490
23291F3131k96448j30644k2723j41356k9420J26520o2461o5251J64753M3219K61126
23280h9554L7183K1280j70666J75661L0702r0405j87333j53025j22572K16146
23270c32583l2992j0957L32990j61958k08482R3624m7650q4976n4899j16892J08592
$$ plain form
23259 -516183 -337490 -20019 -469018 -673252 -538586 -278321 -294756 -59888 242179 87241
23249 87241 -248967 -146423 -9185 -56040 84874 172819 -203253 -452946 -478547 -425478
23239 -425478 -397118 -393076 -333588 -116446 -4301 207080 452197 226447 -33589 179308
23229 179308 308038 296063 424307 68028 -14443 24526 -323199 -301138 -346141 -164984
23219 -164984 -191799 -144549 64693 -62948 -262058 -790882 -1119923 -1220733 -1330613 -1453140
23209 -1453140 -963669 -326559 -89195 -123246 -73876 25366 255011 327669 321956 289569 18900
23198 18900 -171160 -317003 -412758 -558800 -370698 -138674 -352450 -665792 -511696 -629343
23188 -629343 -550023 -472308 -590239 -611219 -570451 -351190 -38069 92434 294907 281082
$$ packed form
23259e16183J78693L17471m48999k04234J34666K60265j6435K34868L02067j54938
23249H7241l36208J02544J37238m6855J40914Q7945l76072k49693k5601N3069
23239d25478K8360M042N9488K17142J12145K11381K45117k25750k60036K12897
23229A79308J28730j1975J28244l56279q2471L8969l47725K2061m5003J81157
23219a64984k6815M7250K09242j27641j99110n28824l29041j00810j09880j22527
23209a453140M89471O37110K37364l4051M9370R9242K29645P2658n713l2387k70669
23198A8900j90060j45843r5755j46042J88102K32024k13776l13342J54096j17647
23188f29343P9320P7715j17931k0980M0768K19261L13121J30503K02473j3825
$$ plain form
23178 281082 269716 35876 -80611 -230890 -668621 -761957 -373925 -223587 -78457 -305176
23168 -305176 -154497 -347794 -789789 -889434 -550413 -392151 -118443 -92008 -231321 -396763
23158 -396763 -558474 -442598 -386358 -491041 -306499 -142635 103660 -158214 -269710 -359289
23148 -359289 -257613 -216158 41299 85988 -312582 -197209 -23493 9541 192818 263548
23138 263548 276296 304709 34525 -262882 -467208 -602522 -493236 -541619 -518255 -37507
23128 -37507 295123 -89157 -378216 -570956 -480085 -468463 -413211 -608989 -631218 -393619
23118 -393619 -242419 -94215 131654 131255 11256 -63660 -19170 55542 186535 -81636 -49686
23107 -49686 12819 -28115 -249106 -396675 -426138 -330245 -322089 -163544 -228573 -456316 -393329
$$ packed form
23178B81082j1366k33840j16487j50279m37731r3336L88032J50338J45130k26719
23168c05176J50679j93297m41995r9645L39021J58262K73708K6435j39313j65442
23158c96763j61711J15876N6240j04683J84542J63864K46295k61874j11496q9579
23148c59289J01676M1455K57457M4689l98570J15373J73716L3034J83277P0730
23138B63548J2748K8413k70184k97407k04326j35314J09286m8383K3364M80748
23128c7507L32630l84280k89059j92740R0871J1622N5252j95778k2229K37599
23118c93619J51200J48204K25869l99j19999p4916M4490P4712J30993k68171L1950
23107d9686O2505m0934k20991j47569k9463R5893Q156J58545o5029k27743O2987
$$ plain form
23096 -393329 -235800 124412 215792 24645 142610 70808 -129457 -347743 -80201 -123471
23086 -123471 -156039 -57011 303662 431876 525748 128775 -541049 -847892 -717005 -445819
23076 -445819 -356790 -493137 -432202 -566612 -604716 -570468 -531706 -517681 -250707 -199943 -287959
23065 -287959 -303573 -440122 -624569 -635753 -555032 -679877 -594837 -294011 -59050 -56346 -42898
23054 -42898 214646 -14304 -76308 -209514 -343352 -720383 -699067 -548481 -474324 -419807
23044 -419807 -375624 -340027 -356238 -661568 -992344 -1062272 -1205685 -767157 -401881 -331725
23034 -331725 -319074 -576552 -856659 -834161 -524017 -376030 -371662 -189884 -295099 -190609
23024 -190609 -330449 -245909 -186485 -121602 -36365 -41010 -440561 -500228 -297623 -204005 -189752
$$ packed form
23096c93329J57529L60212R1380j91147J17965p1802k00265k18286K67542m3270
23086a23471l2568R9028L60673J28214R3872l96973o69824l06843J30887K71186
23076d45819Q9029j36347O0935j34410l8104L4248L8762J4025K66974N0764q8016
23065b87959j5614j36549j84447j1184Q0721j24845Q5040L00826K34961K704J3448
23054d2898K57544k28950o2004j33206j33838l77031K1316J50586P4157N4517
23044d19807M4183L5597j6211l05330l30776o9928j43413M38528L65276P0156
23034c31725J2651k57478k80107K2498L10144J47987M368J81778j05215J04490
23024a90609j39840Q4540N9424O4883Q5237m645l99551n9667K02605R3618J4253
$$ plain form
23013 -189752 -281761 -486196 -117238 -114335 -130547 -338469 -487954 -299978 -172473 -12968
23003 -12968 226568 375122 432769 354011 -13519 -59800 -97190 -9968 4966 2141 -2414
22992 -2414 192449 251191 -65557 -235724 -256979 -156087 -145271 -136940 41919 289884 81075
22981 81075 379204 476333 223854 -4135 -187192 -441571 -135626 -5342 -13597 22167
22971 22167 128644 253998 471040 565745 294812 243004 -4972 -459231 -635101 -471238
22961 -471238 -11496 241807 115237 12139 -179862 -274099 -56381 21708 -185378 -525655
22951 -525655 -456780 -294536 -290799 -115968 219613 383903 -162555 -482704 -601158 -352932
22941 -352932 -217428 -158237 -345119 -368653 -372649 -300125 -223350 144827 187341 53624 110494
$$ packed form
23013a89752r2009k04435L68958K903j6212k07922j49485J87976J27505J59505
23003a2968K39536J48554N7647p8758l67530m6281l7390Q7222J4934k825m555
22992b414J94863N8742l16748j70167k1255J00892J0816Q331J78859K47965k08809
22981H1075K98129R7129k52479k27989j83057k54379L05945J30284q255L5764
22971B2167J06477J25354K17042R4705k70933n1808k47976m54259j75870J63863
22961d71238M59742K53303j26570j03098j92001r4237K17718P8089k07086l40277
22951e25655O8875J62244L737J74831L35581J64290n46458l20149j18454K48226
22941c52932J35504N9191j86882k3534l996P2524P6775L68177M2514j33717N6870
$$ plain form
22930 110494 32386 -364217 -343291 -18702 -88687 -382109 -298875 -247543 -361061 -405753 -445885
22919 -445885 -747291 -961658 -1031829 -649836 -266267 -282746 -562277 -459705 -362660 -114046
22909 -114046 -174176 -529807 -649787 -411172 -563702 -912718 -709587 -314245 -122925 -298001
22899 -298001 -69362 167725 1215 -282273 -340941 -372922 -219952 -97199 234811 337145
22889 337145 50758 73820 -17923 -162452 -133360 -222182 -297438 -608200 -424818 -319255
22879 -319255 -193582 -524937 -586292 -614642 -666814 -455262 -625686 -626514 -441538 -124387 -131395
22868 -131395 -359476 -335342 -223151 -465341 -482602 -362781 -478678 -359149 -426911 -747225
22858 -747225 -1236660 -862708 -499488 -606129 -552565 -321205 -496164 -793907 -784252 -734101
$$ packed form
22930A10494p8108l96603K0926L24589o9985k93422Q3234N1332j13518m4692m0132
22919d45885l01406k14367p0171L81993L83569j6479k79531J02572R7045K48614
22909a14046o0130l55631j19980K38615j52530l49016K03131L95342J91320j75076
22899b98001K28639K37087j66510k83488n8668l1981J52970J22753L32010J02334
22889C37145k86387K3062r1743j44529K9092q8822p5256l10762J83382J05563
22879c19255J25673l31355o1355k8350n2172K11552j70424q28J84976L17151p008
22868a31395k28081K4134J12191k42190j7261J19821j15897J19529o7762l20314
22858g47225m89435L73952L63220j06641N3564K31360j74959k97743R655N0151
$$ plain form
22848 -734101 -690548 -410430 -136516 -479144 -674160 -314358 160819 -177459 -536850 -565852
22838 -565852 -492084 -384123 -357265 -522554 -544443 -332364 -239609 -267496 -380623 -245839
22828 -245839 -212111 -506217 -563156 -576839 -189640 291037 209521 177541 363492 311986 -187246
22817 -187246 -485171 -423734 -75798 322567 182354 61456 -383463 -367008 -22903 123364
22807 123364 191877 274395 381710 145416 -287363 -565117 -667821 -748085 -284703 -43343
22797 -43343 -9069 -50324 118602 -6770 25049 -103542 -26872 -23569 -286686 -651518 -797408
22786 -797408 -656479 -275312 -15048 157298 112841 -61140 -170379 -86629 304929 403943
22776 403943 157623 -123230 -10876 308337 36720 -589939 -766030 -180128 -214679 -101438
$$ packed form
22848g34101M3553K80118K73914l42628j95016L59802M75177l38278l59391k9002
22838e65852P3768J07961K6858j65289k1889K12079R2755k7887j13127J34784
22828b45839L3728k94106n6939j3683L87199M80677q1516l1980J85951n1506m99232
22817a87246k97925O1437L47936L98365j40213j20898m44919J6455L44105J46267
22807A23364O8513Q2518J07315k36294m32779k77754j02704q0264M63382K41360
22797d3343L4274m1255J68926j25372L1819j28591P6670L303k63117l64832j45890
22786g97408J40929L81167K60264J72346m4457j73981j09239Q3750L91558R9014
22776D03943k46320k80853J12354L19213k71617o26659j76091N85902l4551J13241
$$ plain form
22766 -101438 -553404 -869396 -866045 -613958 -598860 -750651 -912757 -684053 -649443 -535737
22756 -535737 -399019 -444954 -536482 -745392 -989482 -962743 -854987 -816034 -814611 -699352 -551976
22745 -551976 -410383 -167940 -84239 -255488 -333579 -376413 -425626 -179661 -20074 -191052
22735 -191052 -463809 -415529 -654905 -894109 -852814 -833027 -559672 -279325 -157230 -451412
22725 -451412 -331319 -370157 -380598 -307175 -353472 -365787 -588497 -741921 -465318 -562772 -660651
22714 -660651 -366042 -552515 -681664 -693888 -604298 -464718 -107585 142493 -46666 -147931
22704 -147931 -55532 -244834 -333408 -342063 -150596 120080 137044 -122843 -437454 -314351
22694 -314351 -364778 -427768 -168662 -43800 62279 -161359 -602615 -732501 -627416 -617316
$$ packed form
22766a01438m51966l15992L351K52087J5098j51791j62106K28704L4610J13706
22756e35737J36718m5935r1528k08910k44090K6739J07756L8953J423J15259J47376
22745e51976J41593K42443Q3701j71249p8091m2834m9213K45965J59587j70978
22735a91052k72757M8280k39376k39204M1295J9787K73355K80347J22095k94182
22725d51412J20093l8838j0441P3423m6297j2315k22710j53424K76603r7454r7879
22714f60651K94609j86473j29149j2224Q9590J39580L57133K50078j89159j01265
22704a47931R2399j89302q8574q655J91467K70676J6964k59887l14611J23103
22694c14351n0427o2990K59106J24862J06079k23638m41256j29886J05085J0100
$$ plain form
22684 -617316 -402620 -382629 -750056 -547577 -323910 -443776 -541367 -417051 -518199 -624778
22674 -624778 -564947 -811801 -705858 -472312 -246733 70510 90446 -117306 2901 58881
22664 58881 -108212 -258045 -276876 -359879 -584570 -213942 55059 -112072 -104421 -259949
22654 -259949 -529152 -528588 -630470 -724718 -844076 -635643 -189443 -242003 -877549 -882162 -562995
22643 -562995 -439677 -480634 -275738 -377105 -557207 -632162 -317480 -282941 -202508 -220877
22633 -220877 -192921 -153145 -376616 -800340 -846347 -774006 -499342 -204893 -150830 -473020
22623 -473020 -149953 -191111 -276803 -74726 203485 -58424 -235718 -209670 -151516 -249354
22613 -249354 -390089 -483813 -1009013 -1252649 -891667 -577680 -377965 -165364 -223003 -250504
$$ packed form
22684f17316K14696J9991l67427K02479K23667j19866r7591J24316j01148j06579
22674f24778N9831k46854J05943K33546K25579L17243J9936k07752J20207N5980
22664E8881j67093j49833j8831q3003k24691L70628K69001j67131P651j55528
22654b59949k69203N64j01882r4248j19358K08433M46200n2560o35546m613L19167
22643e62995J23318m0957K04896j01367j80102p4955L14682L4539Q0433j8369
22633b20877K7956L9776k23471m23724m6007P2341K74664K94449N4063l22190
22623d73020L23067m1158q5692K02077K78211k61909j77294K6048N8154r7838
22613b49354j40735r3724n25200k43636L60982L13987J99715K12601n7639k7501
$$ plain form
22603 -250504 -141058 119909 60783 179386 57031 -5522 139289 324308 541919 371545
22593 371545 -52743 -227271 107046 47048 -251947 -164691 60992 193396 614627 234157
22583 234157 161678 -18290 -447589 -523856 -452755 -243066 -368072 -28612 33628 -178393
22573 -178393 -185008 -59905 -283801 -430538 -417583 -165172 34222 -226366 -412444 -571111
22563 -571111 -394092 -132233 -45415 -139919 -125782 3244 -58186 27336 -455622 -617859
22553 -617859 -493364 -604506 -652868 -646927 -737835 -567215 -371115 -289543 -604068 -954117
22543 -954117 -788549 -603248 -573713 -651632 -378707 -547094 -376900 -70690 94510 35617
22533 35617 142906 -49231 -471533 -718639 -558720 -411156 -343242 135670 216792 243732
$$ packed form
22603b50504J09446K60967n9126J18603j22355o2553J44811J85019K17611j70374
22593C71545m24288j74528L34317n9998k98995Q7256K25683J32404M21231l80470
22583B34157p2479j79968m29299p6267P1101K09689j25006L39460O2240k12021
22573a78393o615J25103k23896j46737J2955K52411J99394k60588j86078j58667
22563e71111J77019K61859Q6818r4504J4137J29026o1430Q5522m82958j62237
22553f17859J24495j11142m8362N941r0908J70620J96100Q1572l14525l50049
22543i54117J65568J85301K9535p7919K72925j68387J70194L06210J65200n8893
22533C5617J07289j92137m22302k47106J59919J47564O7914M78912Q1122K6940
$$ plain form
22523 243732 -281355 -476268 -362900 65297 493811 305947 -55108 170037 171620 -122965
22513 -122965 -412380 -665143 -222098 138873 21147 123280 20969 -24763 2527 93491
22503 93491 164163 -190592 -424625 -154158 47835 204812 257061 175763 2779 52047
22493 52047 139634 241771 287185 71939 -26981 88157 356217 382882 -138638 -361363
22483 -361363 -170787 -87527 -232795 -235747 -9543 257905 253114 -102302 -59057 -230826 -484284
22472 -484284 -216570 -131668 -223234 -141252 -200565 -542387 -638623 -477678 -352179 -354685 -411916
22461 -411916 -623921 -485101 -187793 -293289 49248 -68846 -67197 277312 332239 223341
22451 223341 281641 196946 -77425 -455348 -171581 74755 149020 108530 -31652 -92051
$$ packed form
22523B43732n25087j94913J13368M28197M28514j87864l61055K25145J583k94585
22513a22965k89415k52763M43045L60971j17726J02133j02311m5732K7290R0964
22503I3491P0672l54755k34033K70467K01993J56977N2249q1298j72984M9268
22493E2047Q7587J02137M5414k15246r8920J15138K68060K6665n21520k22725
22483c61363J90576Q3260j45268k952K26204K67448m791l55416M3245j71769k53458
22472d84284K67714Q4902r1566Q1982n9313l41822r6236J60945J25499k506n7231
22461d11916k12005J38820K97308j05496L42537j18094J649L44509N4927j08898
22451B23341N8300q4695k74371l77923K83767K46336P4265m0490j40182o0399
$$ plain form
22441 -92051 8915 -110178 -513554 -723021 -637345 -512578 -149863 -80700 110596 25117
22431 25117 104851 349191 206708 104387 36580 -87315 -171818 -601691 -527155 -470538 -230502
22420 -230502 -292566 -764265 -852541 -811848 -645627 -347478 -413522 -398046 -235997 -285192 -199380
22409 -199380 -34502 -123654 -447332 -426102 -289497 -126764 -64563 -55178 149009 247633 209055
22398 209055 213766 -70044 102837 138458 -258059 -493457 -377855 -317694 -279116 -62579
22388 -62579 224870 93850 238637 447002 268177 38792 -298317 -567031 -768216 -892446
22378 -892446 -686857 -402435 -140522 -38499 25302 321026 471503 358918 112422 8437
22368 8437 -153508 -137613 -315583 -475002 -384757 -173171 -324812 -212592 -54112 -132945
$$ packed form
22441i2051J00966j19093m03376k09467Q5676J24767L62715O9163J91296q5479
22431B5117P9734K44340j42483j02321o7807j23895q4503m29873P4536N6617K40036
22420b30502o2064m71699q8276M0693J66221K98149o6044J5476J62049m9195Q5812
22409a99380J64878q9152l23678K1230J36605J62733O2201R385K04187R8624l8578
22398B09055M711k83810J72881L5621l96517k35398J15602O0161L8578K16537
22388f2579K87449j31020J44787K08365j78825k29385l37109k68714k01185j24230
22378h92446K05589K84422K61913J02023O3801K95724J50477j12585k46496j03985
22368H437j61945J5895j77970j59419R0245K11586j51641J12220J58480p8833
$$ plain form
22358 -132945 38731 84019 -17214 -84102 102884 327879 451292 65345 -72728 -219605
22348 -219605 -140116 136858 167731 126137 165399 327636 167230 -229751 -151627 189031
22338 189031 -163592 -394467 -386697 -340043 -251540 -288082 -367025 -269596 -106664 -315332 -185784
22327 -185784 -552556 -398000 -578325 -652206 -520986 -426132 79750 51485 88083 -84025
22317 -84025 -604465 -916521 -749402 -487393 -603786 -705181 -230216 -202900 -404297 -345401
22307 -345401 -323953 -349173 -375528 -297386 103092 432304 -27536 -357925 -259788 -151162
22297 -151162 79096 -63427 -239144 -451806 -329150 -256061 -68145 362782 645823 369994
22287 369994 -11447 -31235 -188177 -302953 -410850 -381886 -385395 -307310 -335867 -228986 -20375
$$ packed form
22358a32945J71676M5288j01233o6888J86986K24995J23413l85947j38073j46877
22348b19605P9489K76974L0873m1594L9262J62237j60406l96981P8124L40658
22338A89031l52623k30875P770M6654Q8503l6542p8943R7429J62932k08668J29548
22327a85784l66772J54556j80325p3881J31220R4854N05882k8265L6598j72108
22317h4025n20440l12056J67119K62009j16393j01395M74965K7316k01397N8896
22307c45401K1448k5220k6355P8142M00478L29212m59840l30389R8137J08626
22297a51162K30258j42523j75717k12662J22656P3089J87916M30927K83041k75829
22287C69994l81441j9788j56942j14776j07897K8964l509P8085k8557J06881K08611
$$ plain form
22276 -20375 11027 -133031 -383098 -582553 -835016 -933582 -599717 -338392 -76771 2362
22266 2362 -107141 -371140 -277413 -138806 15143 16061 -268510 -519755 -388001 -326907 -381064
22255 -381064 -110216 -163940 -206284 55515 36829 -128003 -222061 -368570 -309690 -254294 -280852
22244 -280852 -313180 -156577 -147428 -8740 106913 -54460 -193238 1754 229659 106028
22234 106028 282741 46591 37344 77474 17662 14040 -126416 -221974 -89012 107433 309583
22223 309583 32930 -152036 -267210 -311506 28708 233747 442453 485679 333288 -30472
22213 -30472 -132749 -234733 -390424 -507227 -555019 -340332 2368 195611 113536 43567
22203 43567 184225 -126991 -220039 79020 287356 187181 -220409 -258231 81264 256328
$$ packed form
22276b0375L1402j44058k50067j99455k52463r8566L33865K61325K61621P9133
22266B362j09503k63999R3727J38607J53949R18k84571k51245J31754O1094n4157
22255c81064K70848n3724m2344K61799j8686j64832r4058j46509N8880N5396k6558
22244b80852l2328J56603R149J38688J15653j61373j38778J94992K27905j23631
22234A06028J76713k36150r247M0130n9812l622j40456r5558J32962J96445K02150
22223C09583k76653j84966j15174m4296L40214K05039K08706M3226j52391l63760
22213c0472j02277j01984j55691j16803m7792K14687L42700J93243q2075o9969
22203D3567J40658l11216r3048K99059K08336j00175m07590l7822L39495J75064
$$ plain form
22193 256328 -232783 -253704 179378 182714 -32448 50866 66360 16014 265060 370855 263359
22182 263359 392633 348871 -49814 -145253 15314 -37825 -230013 -323530 -403429 -433106 -526529
22171 -526529 -648205 -487728 -484576 -507237 -657879 -373687 -541444 -461535 -215639 31999
22161 31999 116145 -181948 -455440 -667725 -745978 -678858 30209 -129017 -40395 592826
22151 592826 726072 586249 556593 227170 -124121 20643 296213 172553 23437 71841
22141 71841 92707 -170283 -481675 -447556 -566797 -570066 -453414 -557402 -342420 -38903
22131 -38903 -279863 -394678 -196133 -225178 -140254 96154 -11729 -11290 40226 -2192 -16395
22120 -16395 -277981 -244274 9445 -12579 296731 306892 128707 149357 187290 498713 551159
$$ packed form
22193B56328m89111k0921M33082L336k15162Q3314J5494n0346K49046J05795j07496
22182B63359J29274m3762l98685r5439J60567n3139j92188r3517p9899k9677r3423
22171e26529j21676J60477L152k2661j50642K84192j67757P9909K45896K47638
22161C1999Q4146k98093k73492k12285p8253O7120P09067j59226Q8622O33221
22151E92826J33246j39823k9656l29423l51291J44764K75570j23660j49116M8404
22141G1841K0866k62990l11392L4119j19241l269J16652j03988K14982L03517
22131c8903k40960j14815J98545k9045Q4924K36408j07883M39N1516m2418j4203
22120a6395k61586L3707K53719k2024L09310J0161j78185K0650L7933L11423N2446
$$ plain form
22109 551159 371037 384664 117954 -98161 48758 231567 40449 -423787 -246358 -193531
22099 -193531 -216100 -259278 -247234 -103519 -138494 -43691 302896 660568 726457 544891 246272
22088 246272 269511 496479 632577 377387 132832 -301232 -426003 -279026 -152856 -37873
22078 -37873 333636 567571 467994 372190 275756 216621 -20842 37900 207429 182303 157248
22067 157248 121919 -5812 16037 20798 8168 113143 239080 200514 -83789 -148265 -160359
22056 -160359 -221627 -393119 -476568 -592484 -217416 30760 294743 297223 103346 123479
22046 123479 -122355 -556913 -419804 -272176 -179916 -565220 -634871 -575831 -284425 -119582
22036 -119582 -199862 -132063 12991 98434 294518 94534 52332 190621 -98736 -699256
$$ packed form
22109E51159j80122J3627k66710k16115J46919J82809j91118m64236J77429N2827
22099a93531k2569m3178J2044J43715l4975R4803L46587L57672O5889j81566k98619
22088B46272K3239K26968J36098k55190k44555m34064j24771J46977J26170J14983
22078c7873L71509K33935r9577r5804r6434n9135k37463N8742J69529k5126k5055
22067A57248l5329j27731K1849M761j2630J04975J25937l8566k84303o4476j2094
22056a60359o1268j71492q3449j15916L75068K48176K63983K480j93877K0133
22046A23479k45834m34558J37109J47628R2260l85304o9651N9040K91406J64843
22036a19582q0280O7799J45054Q5443J96084j99984m2202J38289k89357o00520
$$ plain form
22026 -699256 -890032 -894272 -645225 -403918 -163004 -316339 -625832 -599082 -238318 -271628
22016 -271628 -51206 -115413 -178506 -588795 -762252 -954759 -774213 -532966 -524836 -366394
22006 -366394 -72077 111642 -55782 -86598 58193 139608 278408 319191 405989 313449
21996 313449 434501 241681 -92868 -278148 -257882 -441166 -243757 -190494 -57232 82992
21986 82992 -69943 248852 327692 192217 -14080 -314057 -583637 -521663 -527982 -485919 -122158
21975 -122158 -143023 -465620 -428956 -61103 -90467 -143988 -136347 -336242 -553013 -464423 -274928
21964 -274928 26029 460506 150424 -374883 -472004 -538676 -456876 -283725 -93192 -34397
21954 -34397 182557 265323 268384 76696 135097 481245 772898 694120 428424 340664 64140
$$ packed form
22026f99256j90776m240K49047K41307K40914j53335l09493K6750L60764l3310
22016b71628K20422o4207o3093m10289j73457j92507J80546K41247Q130J58442
22006c66394K94317J83719j67424l0816J44791Q1415J38800M0783Q6798r2540
21996C13449J21052j92820l34549j85280K0266j83284J97409N3263J33262J40224
21986H2992j52935L18795P8840j35475k06297k99977k69580O1974o319M2063L63761
21975a22158k0865l22597L6664L67853k9364n3521P641j99895k16771Q8590J89495
21964b74928L00957M34477l10082n25307r7121o6672Q1800J73151J90533N8795
21954c4397K16954Q2766L061j91688N8401L46148K91653p8778k65696q7760k76524
$$ plain form
21943 64140 -59264 39526 -121630 -152947 -201525 -266945 -209491 82147 34488 -146150 24973
21932 24973 82443 -227088 -379607 77214 -44796 -30617 -30492 105626 491893 598343 574346
21921 574346 578175 499832 513021 399998 491850 258354 87844 55851 113287 204102 -25993
21910 -25993 -285779 -185190 104257 115559 2282 191340 197732 91 -376142 -256045
21900 -256045 79820 188256 311431 692659 697745 738327 372157 207871 380325 180109
21890 180109 51423 55587 163125 146051 -202134 -168506 -76170 124961 140133 93463 249939
21879 249939 454439 391737 341783 67190 37686 231880 167093 192106 189143 453059 362069
21868 362069 101798 -407006 -227653 327662 763474 782066 705877 905360 986836 762324
$$ packed form
21943F4140j23404R8790j61156l1317m8578o5420N7454K91638m7659j80638J71123
21932B4973N7470l09531j52519M56821j22010J4179J25J36118L86267J06450k3997
21921E74346L829p8343J3189j13023R1852k33496j70510l1993N7436R0815k30095
21910b5993k59786J00589K89447J1302j13277J89058O392j97641l76233J20097
21900b56045L35865J08436J23175L81228N086M0582l66170j64286J72454k00216
21890A80109j28686M164J07538j7074l48185L3628R2336K01131J5172m6670J56476
21879B49939K04500o2702m9954k74593k9504J94194o4787K5013k963K63916r0990
21868C62069k60271n08804J79353N55315M35812J8592p6189J99483Q1476k24512
$$ plain form
21858 762324 586946 257436 306578 303235 1477 -408071 -407426 -498447 -334317 113929 321744
21847 321744 340416 399516 644092 373547 260755 114458 -112511 354741 422701 304016
21837 304016 173043 89132 20659 52884 134659 33598 -170548 -13720 89174 41706
21827 41706 209817 313992 195511 -61213 216062 228557 3401 -420947 -226537 304567
21817 304567 349348 481391 554149 201313 63751 302869 410702 508931 432515 73448
21807 73448 -23156 159839 83907 86322 360466 302669 270959 599928 648655 339194 251747
21796 251747 309239 449289 338231 227339 150475 -6507 61757 181646 286259 334080
21786 334080 164875 -133081 -14596 413102 552543 893014 954444 479572 354921 482188
$$ packed form
21858G62324j75378l29510M9142l343l01758m09548O45r1021J64130M48246K07815
21847C21744J8672N9100K44576k70545j12792j46297k26969M67252O7960j18685
21837C04016j30973q3911o8473L2225Q1775j01061k04146J56828J02894m7468
21827D1706J68111J04175j18481k56724K77275J2495k25156m24348J94410N31104
21817C04567M4781J32043P2758l52836j37562K39118J07833R8229p6416l59067
21807G3448r6604J82995p5932K415K74144n7797l1710L28969M8727l09461q7447
21796B51747N7492J40050j11058j10892p6864j56982O8264J19889J04613M7821
21786C34080j69205k97956J18485M27698J39441L40471O1430m74872j24651J27267
$$ plain form
21776 482188 534663 728382 448345 124988 55359 188305 130756 222278 267907 74156
21766 74156 168784 72879 34859 378263 564705 520523 387359 -118352 -519569 -391050
21756 -391050 122549 261011 103641 -92447 306502 903527 733505 402446 202801 23611
21746 23611 62707 60531 -338056 -246847 114071 367292 324835 245075 651257 596464 357489
21735 357489 414643 439218 237722 92876 295154 533608 668539 589257 419784 380152
21725 380152 338647 400745 395827 227819 -39502 -348871 -654041 -383116 -46564 102062
21715 102062 442634 234076 21300 52341 249213 572017 682761 648175 679665 538152
21705 538152 257380 191406 65147 399434 860840 869101 240242 -40334 253041 540401
$$ packed form
21776D82188N2475J93719k80037l23357o9629J32946n7549R1522M5629j93751
21766G4156R4628r5905l8020L43404J86442m4182j33164n05711m01217J28519
21756c91050N13599J38462j57370j96088L98949N97025j70022l31059j99645j79190
21746B3611L9096k176l98587R1209L60918K53221m2457p9760M06182n4793k38975
21735C57489N7154K4575k01496j44846K02278K38454J34931p9282j69473l9632
21725C80152m1505O2098m918j68008k67321l09369l05170K70925L36552J48626
21715A02062L40572k08558k12776L1041J96872L22804J10744l4586L1490j41513
21705E38152k80772o5974j26259L34287M61406Q261o28859k80576K93375K87360
$$ plain form
21695 540401 489543 676608 757630 932000 927805 1050904 870551 580240 417858 253216
21685 253216 82088 2388 138837 196329 268881 283756 400756 616982 188760 -380446
21675 -380446 -388730 47596 22451 -203870 -121007 -197785 -168242 -65968 -146159 -48032 228721
21664 228721 122589 -43937 -280951 -287022 -171539 22372 70812 183991 267727 403032
21654 403032 189690 75525 -54595 -138744 -54323 85213 135565 2547 -108230 399465
21644 399465 508103 309251 471381 689952 494346 239670 91879 20005 -142881 -366975
21634 -366975 -252769 -6846 402629 509013 509816 610591 716057 819863 1065103 786139
21624 786139 331729 324265 84972 -22184 474287 653157 617772 737602 583079 502208
$$ packed form
21695E40401n0858J87065Q1022J74370m195J23099j80353k90311j62382j64642
21685B53216j71128p9700J36449N7492P2552J4875J17000K16226m28222n69206
21675c80446q284M36326k5145k26321Q2863p6778K9543J02274q0191R8127K76753
21664B28721j06132j66526k37014o071J15483J93911M8440J13179Q3736J35305
21654D03032k13342j14165j30120q4149Q4421J39536N0352j33018j10777N07695
21644C99465J08638j98852J62130K18571j95606k54676j47791p1874j62886k24094
21634c66975J14206K45923M09475J06384Q03J00775J05466J03806K45240k78964
21624G86139m54410p464k39293j07156M96471J78870l5385J19830j54523q0871
$$ plain form
21614 502208 456897 327725 95173 -5198 89848 29632 311313 97341 -68671 232698
21604 232698 468314 403739 437798 690041 725914 657053 543398 379809 128214 196627
21594 196627 100769 119999 1070 -260077 -159607 -358499 -254494 109418 360037 433522
21584 433522 82907 184264 206016 279115 395979 235093 90563 420525 392294 304685
21574 304685 468383 398070 564451 686359 934700 740605 646029 893813 930814 607321
21564 607321 355768 325962 319188 260510 96875 394077 288175 410894 615071 719637
21554 719637 462457 248441 605471 628740 508718 278960 622279 613723 844100 648008
21544 648008 391497 602107 670482 599256 547266 539517 659754 691439 578736 533679 704619
$$ packed form
21614E02208m5311j29172k32552j00371R5046o0216K81681k13972j66012L01369
21604B32698K35616o4575L4059K52243L5873o8861j13655j63589k51595O8413
21594A96627r5858J9230j18929k61147J00470j98892J04005L63912K50619P3485
21584D33522l50615J01357K1752P3099J16864j60886j44530L29962k8231q7609
21574C04685J63698p0313J66381J21908K48341j94095r4576K47784L7001l23493
21564F07321k51553k9806o774n8678j63635K97202j05902J22719K04177J04566
21554G19637k57180k14016L57030K3269j20022k29758L43319q556K30377j96092
21544F48008k56511K10610O8375p1226n1990p749J20237L1685j12703m5057J70940
$$ plain form
21533 704619 846190 1180838 1018181 1099076 1146597 1233896 1838631 1890123 1717111 1672416
21523 1672416 1678255 2140553 2672622 2526470 2305236 2132282 2297174 2292566 2146821 1838972
21513 1838972 1707062 2225688 2423353 2196118 2200632 2222187 2257839 2080012 2012072 1985412
21503 1985412 2038882 1754572 1631651 1775402 1864424 1778955 1663717 1682823 1656331 1443405
21493 1443405 1426834 1098632 877036 864127 1008826 769756 751718 1016674 1120408 1252000
21483 1252000 1444498 1373370 1253362 948663 991646 1068209 640720 343391 714087 863376
21473 863376 1149418 1358353 1150570 1217695 1200270 1095761 913641 722513 718382 748133
21463 748133 550724 306733 21593 -191526 77833 555395 767751 489452 379356 147146
$$ packed form
21533G04619J41571L34648j62657Q0895M7521Q7299O04735N1492j73012m4695
21523A672416N839M62298N32069j46152k21234j72954J64892m608j45745l07849
21513A838972j31910N18626J97665k27235M514K1555L5652j77827o7940k6660
21503A985412N3470k84310j22921J43751Q9022q5469j15238J9106k6492k12926
21493A443405j6571l28202k21596j2909J44699k39070j8038K64956J03734J31592
21483A252000J92498p1128j20008l04699M2983P6563m27489k97329L70696J49289
21473H63376K86042K08935k07783O7125j7425j04509j82120j91128m131K9751
21463G48133j97409k43991k85140k13119K69359M77562K12356k78299j10096k32210
$$ plain form
21453 147146 -236195 -162969 171219 458560 790695 768075 841889 938968 800630 702608
21443 702608 630967 599653 576464 464282 461362 204581 256941 460894 710909 499029 245927
21432 245927 244943 213168 134031 238999 367875 482928 613017 600017 558732 771071 1167362
21421 1167362 1319729 1102352 398118 247588 740517 629910 403457 465282 376971 284866
21411 284866 480706 484458 516990 626671 330973 652866 838648 865956 532212 547678
21401 547678 462694 535897 836109 1064122 955073 822733 466862 318843 446336 753427
21391 753427 789522 617728 935742 864931 581253 452570 156214 211717 269065 182539
21381 182539 410118 353829 -130091 17413 292171 798515 667276 738613 575925 468247
$$ packed form
21453A47146l83341P3226L34188K87341L32135k2620P3814R7079j38338r8022
21443G02608p1641l1314k3189j12182k920k56781N2360K03953K50015k11880k53102
21432B45927r84l1775p9137J04968J28876J15053J30089j3000m1285K12339L96291
21421A167362J52367k17377p04234j50530M92929j10607k26453O1825q8311r2105
21411B84866J95840L752L2532J09681k95698L21893J85782K7308l33744J5466
21401E47678q4984P3203L00212K28013j09049j32340l55871j48019J27493L07091
21391G53427L6095j71794L18014p0811k83678j28683k96356N5503N7348q6526
21381A82539K27579n6289m83920J47504K74758N06344j31239P1337j62688j07678
$$ plain form
21371 468247 345508 413415 364587 415073 454033 261574 77536 73995 297042 460346 449422
21360 449422 396301 202097 307347 472644 513676 522190 471753 51420 86902 240042 298483
21349 298483 383038 685235 1021142 1017488 692168 416597 636568 373610 281308 434647
21339 434647 578346 897880 1027680 920228 1016702 809188 502034 346579 512168 521333
21329 521333 590700 463490 687557 616093 386573 -164143 146876 369346 552899 367160
21319 367160 257304 607668 863845 952924 829817 949810 1068733 574030 33049 111647
21309 111647 -19046 52934 502850 798875 973863 1095248 822871 613251 593160 605135
21299 605135 616911 582888 817313 801707 982470 829646 901960 898728 814506 703675 660409
$$ packed form
21371D68247j22739O7907m8828N0486L8960j92459j84038l541K23047J63304j0924
21360D49422n3121j94204J05250J65297M1032Q514n0437m20333L5482J53140N8441
21349B98483Q4555L02197L35907l654l25320k75571K19971k62958r2302J53339
21339D34647J43699L19534J29800j07452R6474k07514l07154j55455J65589R165
21329E21333O9367j27210K24067p1464k29520n50716L11019K22470J83553j85739
21319C67160j09856L50364K56177Q9079j23107J19993J18923m94703n40981P8598
21309A11647j30693P1980M49916K96025J74988J21385k72377k09620k0091J1975
21299F05135J1776l4023K34425j5606J80763j52824P2314l232q4222j10831m3266
$$ plain form
21288 660409 511207 690469 799039 642147 610631 661960 699102 1034382 998359 757098
21278 757098 950784 818797 655686 809294 830199 1028779 985974 1122070 1072345 945779
21268 945779 527027 314922 651969 988927 1081664 1368201 1530876 1340468 1025108 790561
21258 790561 515623 516014 643723 473618 584460 1036717 1258902 1499447 1551221 1282370
21248 1282370 1064036 1133182 1183889 1463485 1169658 648388 1047642 1390409 1282516 807658
21238 807658 728851 798767 1167411 1466694 1685191 1468505 1362266 1136498 742485 548995
21228 548995 778580 839848 688904 632445 880794 1068842 1264674 1429630 1329253 1316404
21218 1316404 1485965 1699475 1664908 1574100 1728161 1841846 1587671 1535855 1670102 1646755
$$ packed form
21288F60409j49202J79262J08570j56892l1516N1329L7142L35280l6023k41261
21278G57098J93686j31987j63111J53608K0905J98580m2805J36096m9725j26566
21268I45779m18752k12105L37047L36958R2737K86537J62675j90408l15360k34547
21258G90561k74938L91J27709j70105J10842M52257K22185K40545N1774k68851
21248A282370k18334O9146N0707K79596k93827n21270L99254L42767j07893m74858
21238H07658p8807O9916L68644K99283K18497k16686j06239k25768l94013j93490
21228E48995K29585O1268j50944n6459K48349J88048J95832J64956j00377j2849
21218A316404J69561K13510l4567r0808J54061J13685k54175n1816J34247k3347
$$ plain form
21208 1646755 1699379 1199114 1060883 1182556 1406761 1355555 1609717 2051205 1931661 1992704
21198 1992704 1936333 1740592 1912730 1917341 1780752 1531082 1872924 1940267 1615472 1853216
21188 1853216 2175159 2533244 2629017 2748102 2797811 2707534 2679144 2688395 3053226 3207261
21178 3207261 3153198 3027240 2654497 2651876 3078835 3271767 3698949 3643040 3496194 3759680
21168 3759680 3732661 3570045 3632770 3391645 2854587 2726364 2724442 2669990 2541674 2468079
21158 2468079 2396446 2341988 2135900 1938715 1762028 1628789 1346549 1444581 1714304 1880701
21148 1880701 1931383 2009061 1931034 2086634 2231786 2421292 2491988 2391753 1985685 1744626
21138 1744626 1772957 2107239 2352734 2369464 2224396 2289314 2232332 2096519 2176839 2535072
$$ packed form
21208A646755N2624n00265j38231J21673K24205n1206K54162M41488j19544O1043
21198A992704n6371j95741J72138M611j36589k49670L41842O7343l24795K37744
21188A853216L21943L58085R5773J19085M9709r0277k8390R251L64831J54035
21178C207261n4063j25958l72743k621M26959J92932M27182n5909j46846K63486
21168C759680k7019j62616O2725k41125n37058j28223j922n4452j28316p3595
21158B468079p1633n4458k06088j97185j76687j33239k82240R8032K69723J66397
21148A880701N0682P7678p8027J55600J45152J89506P0696j00235m06068k41059
21138A744626K8331L34282K45495J6730j45068O4918n6982j35813Q0320L58233
$$ plain form
21128 2535072 2435588 2091234 1964441 2099110 2177804 2006507 1760068 2054490 2137395 2329945
21118 2329945 2426127 2481111 2533714 2218130 1666441 1882802 1795763 1633188 1556567 1667999
21108 1667999 1815688 1637528 1461959 1621874 1659982 1808600 1788355 1550050 1149418 1326851
21098 1326851 1579761 2084450 2390042 2576136 2099163 2069175 2582498 2778450 2619980 2628696
21088 2628696 2544031 2551465 2852271 2934941 2960362 2965297 2867722 2781110 3020776 3370975 3114681
21077 3114681 3115270 3776225 4064660 3672226 3312023 3283837 3491015 3768167 3861677 4032423
21067 4032423 4284031 4168776 4222514 4011380 3840731 4148989 4305034 4496296 4603226 4730842
21057 4730842 5047270 5163836 5164453 5182922 5389363 5651921 6231070 6511795 6575791 6678087
$$ packed form
21128B535072r9484l44354j26793J34669P8694j71297k46439K94422Q2905J92550
21118B329945R6182N4984N2603l15584n51689K16361q7039j62575p6621J11432
21108A667999J47689j78160j75569J59915L8108J48618k0245k38305m00632J77433
21098A326851K52910N04689L05592J86094m76973k9988N13323J95952j58470Q716
21088B628696q4665P434L00806Q2670K5421M935r7575q6612K39666L50199k56294
21077C114681N89O60955K88435l92434l60203k8186K07178K77152R3510J70746
21067D032423K51608j15255N3738k11134j70649L08258J56045J91262J06930J27616
21057D730842L16428J16566O17J8469K06441K62558N79149K80725O3996J02296
$$ plain form
21047 6678087 6618568 6702373 7040453 7108332 7159620 7075485 6879781 6552448 6391881 6710560
21037 6710560 7301790 7726554 8319313 8354054 7704298 6789720 6751281 7437661 7923892 7469947
21027 7469947 7408390 7125160 6805333 6633458 6448827 6506831 6735821 6639993 6707176 6412053
21017 6412053 6087588 6134650 6213111 6603941 6565315 6693968 6579723 6858823 7278029 7280801
21007 7280801 7224768 7125819 7152393 7304166 7885702 7978645 7776588 7933543 8531292 9009435
20997 9009435 9435035 9783285 9970466 10134809 10025250 10379491 10724458 10994832 11492450
20988 11492450 12037245 12473594 12693352 12968033 13327286 13572058 13974384 14249721 14825609
20979 14825609 14972650 15325351 16137188 16856701 17884071 19432542 20973339 22284822 23546379
$$ packed form
21047F678087n9519Q3805L38080O7879N1288q4135j95704l27333j60567L18679
21037F710560N91230M24764N92759L4741o49756r14578l8439O86380M86231m53945
21027G469947o1557k83230l19827j71875j84631N8004K28990r5828O7183k95123
21017F412053l24465M7062P8461L90830l8626J28653j14245K79100M19206K772
21007G280801n6033r8949K6574J51773N81536R2943k02057J56955N97749M78143
20997I009435M25600L48250J87181J64343j09559L54241L44967K70374M97618
20988A1492450N44795M36349K19758K74681L59253K44772M02326K75337N75888
20979A4825609J47041L52701Q11837P19513J027370J548471J540797J311483J261557
$$ plain form
20970 23546379 25111966 27116806 29316917 32040416 34920960 38459363 42776574 48734820
20962 48734820 55893040 64098254 73847794 85230234 98289843 112769752 128596496
20955 128596496 145803997 164098879 187273829 220190490 265423571 312586094 333202124
20948 333202124 319511822 303011838 309566315 339387999 367546377 358814186 319555560
20941 319555560 287277883 275133071 281478082 304778605 343346809 378287083 373395910
20934 373395910 332549812 299686194 294537616 307376099 309853719 274598922 218071891
20927 218071891 172552541 144614046 127702223 115677567 105072534 95623464 87876280
20920 87876280 81444944 76042019 71121982 66203849 61540508 57543617 53699665 49917679
$$ packed form
20970B3546379J565587K004840K200111K723499K880544L538403M317211N958246
20962D8734820P158220Q205214R749540J1382440J3059609J4479909J5826744
20955A28596496J7207501J8294882K3174950L2916661M5233081M7162523K0616030
20948C33202124j3690302j6499984O554477K9821684K8158378q732191l9258626
20941C19555560l2277677j2144812O345011K3300523L8568204L4940274m891173
20934C73395910m0846098l2863618n148578J2838483K477620l5254797n6527031
20927B18071891m5519350k7938495j6911823j2024656j0605033r449070p747184
20920H7876280o431336n402925m920037m918133m663341l996891l843952l781986
$$ plain form
20912 49917679 47021006 44473341 41760288 38720988 36351910 34416412 32655076 31147848
20904 31147848 29434928 27560556 26280771 25232803 24418513 23817016 23135708 22090172
20896 22090172 20803499 19913156 19175124 18003193 16964199 16367027 15600709 15081864 14544201
20887 14544201 13750405 13205830 12684024 12123514 11488422 11210501 10568145 9821478 9297169
20878 9297169 9168582 8726425 8525038 8591769 8197623 7770732 7284705 6846560 6608077 6321583
20868 6321583 5990150 5868887 5613995 5267453 5134343 5061988 4755811 4793803 4488882 3961939
20858 3961939 3742726 3847548 3796115 3672084 3362508 3174118 3369627 3493546 3200516 2787956
20848 2787956 2933225 2837351 2528603 2211891 2482104 2353918 2142909 2056773 1864185 1955287
$$ packed form
20912D9917679k896673k547665k713053l039300k369078j935498j761336j507228
20904C1147848j712920j874372j279785j047968q14290o01497o81308j045536
20896B2090172j286673q90343p38032j171931j038994n97172p66318n18845n37663
20887A4544201p93796n44575n21806n60510o35092k77921o42356p46667n24309
20878I297169j28587m42157k01387O6731l94146m26891m86027m38145k38483k86494
20868F321583l31433j21263k54892l46542j33110p2355l06177L7992l04921n26943
20858C961939k19213J04822n1433j24031l09576j88390J95509J23919k93030m12560
20848B787956J45269r5874l08748l16712K70213j28186k11009q6136j92588R1102
$$ plain form
20838 1955287 1977478 2260864 2193549 1848273 1412510 1220273 1250222 1136716 1432545 1645897
20828 1645897 1615964 1410357 1337214 1370913 1162393 1181086 1291973 1382463 1214536 1235305
20818 1235305 947040 772909 523143 212217 95603 273317 660121 977475 835478
20809 835478 460608 224193 282657 439753 523355 591764 876799 839863 561406 324550
20799 324550 117919 28588 25792 -286755 -244777 277150 454278 226620 79861 -252663
20789 -252663 -346884 -144973 108671 161509 193777 172815 417020 640594 566470 238222
20779 238222 -488245 -1112346 -1163846 -716463 -484862 -551009 -849769 -802458 -1033471 -1313477
20769 -1313477 -1274840 -991845 -570002 -616561 -533308 -113550 -318317 -768271 -1121283 -1068945
$$ packed form
20838A955287K2191K83386o7315l45276m35763j92237K9949j13506K95829K13352
20828A645897k9933k05607p3143L3699k08520J8693J10887R0490j67927K0769
20818A235305k88265j74131k49766l10926j16614J77714L86804L17354j41997
20809H35478l74870k36415N8464J57096Q3602O8409K85035l6936k78457k36856
20799C24550k06631q9331k796l12547M1978N21927J77128k27658j46759l32524
20789b52663r4221K01911K53644N2838L2268k0962K44205K23574p4124l28248
20779B38222p26467o24101n1500M47383K31601o6147k98760M7311k31013k80006
20769a313477L8637K82995M21843m6559Q3253M19758k04767m49954l53012N2338
$$ plain form
20759 -1068945 -828747 -806849 -664048 -582982 -797074 -844804 -865899 -964173 -986587 -964667 -1398218
20748 -1398218 -1165576 -1029984 -1047737 -1150588 -1151424 -1150899 -1061383 -1201449 -1242702 -1290309 -978523
20737 -978523 -838648 -954270 -986409 -884110 -971467 -1101271 -1090040 -1017958 -1112079 -1035623 -1382860
20726 -1382860 -1471162 -1291840 -1044415 -754672 -482815 -697012 -1048093 -1095883 -1106211 -1095619
20716 -1095619 -1271383 -1432652 -1204152 -1092270 -984848 -802022 -630096 -697005 -1155894 -1112889
20706 -1112889 -969799 -1365115 -1056765 -830284 -903158 -1001785 -830737 -582415 -495471 -290924
20696 -290924 -274887 -509220 -574068 -840567 -829669 -718219 -649838 -690614 -656988 -348320 -262127
20685 -262127 -492713 -61566 348524 1020980 1100327 1333003 1714926 2106450 2731064 3131075
$$ packed form
20759a068945K40198K1898J42801Q1066k14092m7730k1095r8274k2414K1920m33551
20748a398218K32642J35592j7753j02851q36N25Q9516j40066m1253m7607L11786
20737i78523J39875j15622l2139J02299q7357j29804J1231P2082r4121P6456l47237
20726a382860q8302J79322K47425K89743K71857k14197l51081m7790j0328J0592
20716a095619j75764j61269K28500J11882J07422J82826J71926o6909m58889M3005
20706a112889J43090l95316L08350K26481p2874r8627J71048K48322Q6944K04547
20696b90924J6037k34333o4848k66499J0898J11450O8381m0776L3626L08668Q6193
20685b62127k30586M31147M10090O72456P9347K32676L81923L91524O24614M00011
$$ plain form
20675 3131075 2968669 2824686 3160912 3608640 3606085 3092729 2181682 1832666 1722997 1872568
20665 1872568 2529024 2642437 2853192 3329784 3785219 3691705 3508569 3303060 3056859 2660814
20655 2660814 2041334 1320383 828099 655263 620096 674845 549500 650097 429506 121702
20645 121702 247464 352297 -45834 -206644 -84961 -67632 -218631 -207156 -365288 -588692
20635 -588692 -746724 -657358 -727856 -661482 -572532 -620624 -360248 -280955 -302270 -460381 -664091
20624 -664091 -697765 -828496 -771897 -638136 -467741 -600718 -344654 -190887 -386161 -766169
20614 -766169 -805613 -775573 -590564 -681472 -724840 -847826 -951226 -1004228 -1186750 -1121767 -777487
20603 -777487 -674839 -658033 -642160 -863445 -1038198 -1102875 -1314806 -1179273 -1311228 -1505996
$$ packed form
20675C131075j62406j43983L36226M47728k555n13356r11047l49016j09669J49571
20665A872568O56456J13413K10755M76592M55435r3514j83136k05509k46201l96045
20655B660814o19480p20951m92284j72836l5167N4749j25345J00597k20591l07804
20645A21702J25762J04833l98131j60810J21683J7329j50999J1475j58132k23404
20635e88692j58032Q9366p0498O6374Q8950m8092K60376P9293k1315j58111k03710
20624f64091l3674j30731N6599J33761J70395j32977K56064J53767j95274l80008
20614g66169l9444L0040J85009r0908m3368j22986j03400n3002j82522O4983L44280
20603g77487J02648J6806J5873k21285j74753o4677k11931J35533j31955j94768
$$ plain form
20593 -1505996 -1575702 -1148908 -1024229 -1145193 -1286358 -1218182 -856904 -658967 -687765 -947969
20583 -947969 -944839 -1130781 -1432904 -1537488 -1538040 -1197415 -1124585 -785471 -587431 -241013 -287340
20572 -287340 -808709 -984727 -747820 -688035 -512248 -296686 -289352 -526784 -594583 -640384
20562 -640384 -707589 -958277 -981444 -853450 -883745 -579049 -567232 -684240 -475516 -639401
20552 -639401 -664488 -449983 -685425 -914091 -832416 -902753 -888000 -826686 -925105 -372461 -88829
20541 -88829 -155797 -414917 -501790 -739774 -829811 -1066259 -1270533 -870943 -517250 -851755
20531 -851755 -960453 -816608 -883111 -789431 -574954 -550855 -598655 -906005 -1108988 -761576
20521 -761576 -853890 -799260 -998374 -1263916 -1306563 -924422 -716238 -770539 -710154 -685084 -818756
$$ packed form
20593a505996o9706M26794J24679j20964j41165O8176L61278J97937k8798k60204
20583i47969L130j85942l02123j04584n52L40625P2830L39114J98040L46418m6327
20572b87340n21369j76018K36907N9785J75787K15562P334k37432o7799m5801
20562f40384o7205k50688k3167J27994l0295L04696J1817j17008K08724j63885
20552f39401k5087K14505k35442k28666Q1675p0337J4753O1314r8419N52644K83632
20541h8829o6968k59120q6873k37984r0037k36448k04274L99590L53693l34505
20531h51755j08698J43845o6503R3680K14477K4099m7800l07350k02983L47412
20521g61576r2314N4630j99114k65542m2647L82141K08184n4301O0385K5070j33672
$$ plain form
20510 -818756 -730492 -504217 -519073 -628329 -471130 -488947 -579438 -837526 -654677 -443380
20500 -443380 -525372 -1080451 -1207668 -820545 -289183 -261001 -465760 -554879 -528905 -441689
20490 -441689 -493887 -764162 -849178 -678604 -495934 -609738 -735647 -680115 -624577 -433365
20480 -433365 -724808 -885568 -985007 -1216862 -1009667 -1070627 -893221 -413423 -307878 -428491
20470 -428491 -604714 -598948 -692631 -837169 -792951 -980898 -1006643 -1068132 -1124306 -812095 -586753
20459 -586753 -441100 -614361 -999558 -963488 -626396 -275450 -395584 -390231 -353582 -470760
20449 -470760 -340158 -223711 -455448 -668384 -647473 -624049 -692437 -558342 -670190 -702833
20439 -702833 -775147 -792472 -720545 -408757 -340146 -431849 -639741 -771692 -678599 -898778 -1187997
$$ packed form
20510h18756Q8264K26275j4856j09256J57199j7817r0491k58088J82849K11297
20500d43380q1992n55079j27217L87123N31362K8182k04759q9119K5974Q7216
20490d41689n2198k70275q5016J70574J82670j13804j25909N5532N5538J91212
20480d33365k91443j60760r9439k31855K07195o0960J77406M79798J05545j20613
20470d28491j76223N766r3683j44538M4218j87947k5745o1489n6174L12211K25342
20459e86753J45653j73261l85197L6070L37092L50946j20134N353L6649j17178
20449d70760J30602J16447k31737k12936K0911K3424o8388J34095j11848l2643
20439g02833p2314j7325P1927L11788O8611r1703k07892j31951R3093k20179k89219
$$ plain form
20428 -1187997 -739836 -577977 -859712 -857783 -869379 -708473 -670411 -738628 -550185 -402366
20418 -402366 -345837 -399227 -358659 -252033 -323821 -439823 -583931 -462926 -323535 -220513
20408 -220513 -400875 -208333 -332318 -439023 -483654 -599952 -531918 -438665 -662613 -651505
20398 -651505 -644301 -540037 -587285 -205765 271368 229311 -19656 -18992 -149814 -257619 -163332
20387 -163332 -70672 -135383 61436 213621 114288 94967 202338 103788 -67091 10661 -49008
20376 -49008 -125583 107406 109519 -86310 118359 629634 1051297 1453253 1486944 1466287 1267625
20365 1267625 1217929 1421428 1241859 1118678 1104956 1316188 1065748 930037 1026037 1426072
20355 1426072 1826314 1734921 1624338 1723791 1522888 1403925 1184965 856595 676633 697209
$$ packed form
20428a187997M48161J61859k81735J929j1596J60906L8062o8217J88443J47819
20418d02366N6529n3390M0568J06626p1788j16002j44108J21005J39391J03022
20408b20513j80362J92542j23985j06705m4631j16298O8034R3253k23948J1108
20398f51505P204J04264m7248L81520M77133m2057k48967O64j30822j07805R4287
20387a63332R2660o4711J96819J52185r9333j9321J07371r8550j70879P7752n9669
20376d9008p6575K32989K113j95829K04669N11275M21663M01956L3691k0657j98662
20365A267625m9696K03499j79569j23181j3722K11232k50440j35711R6000M00035
20355A426072M00242r1393j10583R9453k00903j18963k18960l28370j79962K0576
$$ plain form
20345 697209 592153 686155 978529 1065651 821552 736929 261140 78101 446214 764585
20335 764585 979308 968414 970001 995562 509127 11647 143861 454281 388929 581959
20325 581959 755367 1141550 1329961 1228512 1155346 1034574 1078776 965498 746971 956341
20315 956341 963535 981377 946925 984401 1123019 1249612 1417279 1181831 810987 696260
20305 696260 747928 756311 208132 -31644 8981 122055 401780 568853 612343 392447
20295 392447 351666 690328 655057 674971 860064 835137 712554 213664 99244 113577
20285 113577 -3474 369397 391192 211283 414801 553453 622246 608417 840229 743833
20275 743833 428955 340676 516075 879935 1451980 1728212 1892634 1258683 1137808 960140
$$ packed form
20345F97209j05056R4002K92374Q7122k44099q4623m75789j83039L68113L18371
20335G64585K14723j0894J587K5561m86435m97480J32214L10420o5352J93030
20325E81959J73408L86183J88411j01449p3166j20772M4202j13278k18527K09370
20315I56341P194J7842l4452L7476J38618J26593J67667k35448l70844j14727
20305F96260N1668Q383n48179k39776M0625J13074K79725J67073M3490k19896
20295C92447m0781L38662l5271J9914J85093k4927j22583m98890j14420J4333
20285A13577j17051L72871K1795j79909K03518J38652O8793j3829K31812r6396
20275G43833l14878q8279J75399L63860N72045K76232J64422o33951j20875j77668
$$ plain form
20265 960140 549530 1044888 1357881 1399750 1495387 1251880 1212537 1463757 1477700 1685036
20255 1685036 1351662 938975 883790 692388 595492 1037368 1093356 950583 809340 687071
20245 687071 721190 493816 391891 458042 456608 504080 950573 943358 479894 429828 445207
20234 445207 470910 -4980 -171580 126790 162557 86299 434108 433910 11726 -188471 -136281
20223 -136281 -271790 -335006 119792 743724 628412 483162 603249 618144 590724 426929
20213 426929 209220 318735 303675 315356 354945 723685 969033 1095305 1173877 1239240
20203 1239240 920662 434391 52587 30187 -108021 -371517 -255658 -288782 15852 95344
20193 95344 36384 -72620 -288406 -530620 -230679 -219117 -162643 125519 -15859 126014
$$ packed form
20265I60140m10610M95358L12993M1869R5637k43507l9343K51220J3943K07336
20255A685036l33374m12687n5185j91402r6896M41876N5988j42773j41243j22269
20245F87071L4119k27374j01925O6151j434M7472M46493p215m63464n0066J5379
20234D45207K5703m75890j66600K98370L5767p6258L47809j98m22184k00197N2190
20223a36281j35509o3216M54798O23932j15312j45250J20087J4895k7420j63795
20213D26929k17709J09515j5060J1681L9589L68740K45348J26272P8572O5363
20203A239240l18578m86271l81804k2400j38208k63496J15859l3124L04634P9492
20193I5344n8960j09004k15786k42214K99941J1562N6474K88162j41378J41873
$$ plain form
20183 126014 -13455 -421318 -457411 -74226 348029 265461 15587 -255331 -428582 -76102
20173 -76102 121534 -98451 -36886 109025 80728 -96549 -402297 -653463 -495016 -205114
20163 -205114 -358410 -392268 148518 285325 155909 647537 696766 790878 1153480 1151478
20153 1151478 931845 1010535 1335203 1182883 1061575 846657 634909 481189 142228 12654
20143 12654 -168860 -180314 -170396 -63606 -207290 -60669 -88336 144004 286582 665509
20133 665509 402837 156478 -77436 21827 205787 264799 215647 146372 -169820 -356153
20123 -356153 -417121 -384380 -397574 -149964 -136614 4165 213701 221119 494424 240210 101815
20112 101815 88194 232102 90369 322576 329192 424007 336374 404423 212881 -178968 -93737
$$ packed form
20183A26014j39469m07863l6093L83185M22255q2568k49874k70918j73251L52480
20173g6102J97636k19985O1565J45911k8297j77277l05748k51166J58447K89902
20163b05114j53296l3858N40786J36807j29416M91628M9229R4112L62602k002
20153A151478k19633P8690L24668j52320j21308k14918k11748j53720l38961j29574
20143A2654j81514j1454R918J06790j43684J46621k7667K32340J42578L78927
20133F65509k62672k46359k33914R9263J83960N9012m9152o9275l16192j86333
20123c56153o0968L2741j3194K47610J3350J40779K09536P418K73305k54214j38395
20112A01815j3621J43908j41733K32207O616R4815q7633O8049j91542l91849Q5231
$$ plain form
20101 -93737 -33073 -17231 -124340 -82311 279461 408194 544263 473416 269770 340669 411963
20090 411963 506204 586582 804136 765237 766948 563911 422169 137508 152421 25749 35184
20079 35184 228767 421408 431475 178077 232548 255406 -11800 300754 246166 183470 6931
20068 6931 -220688 1575 72633 249260 220186 -1175 103187 80460 276441 708136
20058 708136 598004 422984 363570 445823 591185 342310 401795 662578 870521 624921
20048 624921 591726 740832 795785 688828 829725 743515 752327 810052 850204 685358 485732
20037 485732 205345 290939 479553 539215 962768 1227428 1155086 857765 656100 601700
20027 601700 721339 707287 758265 649628 886321 1028284 1120017 1052321 1364590 1670456
$$ packed form
20101i3737O0664J5842j07109M2029L61772J28733J36069p0847k03646P0899P1294
20090D11963R4241Q0378K17554l8899J711k03037j41742k84661J4913j26672R435
20079C5184J93583J92641J0067k53398N4471K2858k67206L12554n4588o2696j76539
20068F931k27619K22263P1058J76627k9074k21361J04362k2727J95981M31695
20058G08136j10132j75020n9414Q2253J45362k48875N9485K60783K07943k45600
20048F24921l3195J49106N4953j06957J40897q6210Q812N7725M0152j64846j99626
20037D85732k80387Q5594J88614N9662M23553K64660p2342k97321k01665n4400
20027F01700J19639j4052N0978j08637K36693J41963R1733o7696L12269L05866
$$ plain form
20017 1670456 1443841 1485120 1302690 1289464 1332573 1533097 1420728 1247977 1273266 1344701
20007 1344701 1290535 1263754 1468763 1605101 1515010 1358497 1548185 1497683 1242483 1598104
19997 1598104 1220909 1196967 1034716 1093509 1044560 1246383 1377956 1320081 1367727 1247092
19987 1247092 955887 721992 643573 896081 760198 768288 901149 948045 935372 1063308
19977 1063308 909401 847788 871255 1250110 1348726 1133634 754536 665353 806527 1166779
19967 1166779 1400105 1693643 1874943 1585804 1579873 1678596 1505309 1355357 1247753 1264367
19957 1264367 1263754 1214723 1259827 1783706 1958139 1836215 1732563 1836192 1614133 1540930
19947 1540930 1540239 1248621 1276131 1499321 1451032 1348084 1756743 1841776 2123684 2048066 1787334
$$ packed form
20017A670456k26615M1279j82430j3226M3109K00524j12369j72751K5289P1435
20007A344701n4166k6781K05009J36338r0091j56513J89688n0502k55200L55621
19997A598104l77195k3942j62251N8793m8949K01823J31573n7875M7646j20635
19987A247092k91205k33895p8419K52508j35883Q090J32861M6896j2673J27936
19977A063308j53907o1613K3467L78855R8616k15092l79098q9183J41174L60252
19967A166779K33326K93538J81300k89139n931R8723j73287j49952j07604J6614
19957A264367o13m9031M5104N23879J74433j21924j03652J03629k22059p3203
19947A540930o91k91618K7510K23190m8289j02948M08659Q5033K81908p5618k60732
$$ plain form
19936 1787334 1739944 1692901 1950207 2034463 1622814 1542415 1651410 2021811 2328018 2121247
19926 2121247 1999963 2105890 2035663 1834497 1793019 2191556 2281626 2243935 2189962 2247547
19916 2247547 2438429 2416614 2310821 2430594 2902918 3185811 3184957 2940986 2748995 2738483
19906 2738483 2407373 2369497 2356344 2087120 1981439 2325665 2675972 2863970 3054758 3382503
19896 3382503 3459908 3327994 3138998 2836463 2838508 2648454 2656347 2548220 2532781 2612851 2845857
19885 2845857 2979062 3099784 3175640 3186910 2870607 2538635 2396396 2478988 2800868 2861947
19875 2861947 3219836 3393105 3590406 3207221 2857532 3189185 3300434 3006057 3368960
19866 3368960 3704255 3691446 3780043 4230699 4782204 4867490 4763356 4914032 5251396 5575907
$$ packed form
19936A787334m7390m7043K57306Q4256m11649q0399J08995L70401L06207k06771
19926B121247j21284J05927p0227k01166m1478L98537R0070l7691n3973N7585
19916B247547J90882k1815j05793J19773M72324K82893q54k43971j91991j0512
19906B738483l31110l7876j3153k69224j05681L44226L50307J87998J90788L27745
19896C382503P7405j31914j88996l02535K045j90054P893j08127j5439Q0070K33006
19885B845857J33205J20722P5856J1270l16303l31972j42239Q2592L21880O1079
19875B861947L57889J73269J97301l83185l49689L31653J11249k94377L62903
19866C368960L35295j2809Q8597M50656N51505Q5286j04134J50676L37364L24511
$$ plain form
19856 5575907 5459198 5247381 5051032 4933972 4868143 5060446 5324578 5354475 5296405 5567536
19846 5567536 5900632 6096653 6352410 6929404 6531119 6298564 6429516 6716748 6897758
19837 6897758 7224090 7764878 8285324 8332957 8479708 8399679 8075204 8354653 8885601 9263394
19827 9263394 10031700 10394358 10890721 11497433 12237696 13189976 14203536 15195461 15715448
19818 15715448 16167540 17158371 18707299 20858092 23813816 28028779 33038569 38789312
19810 38789312 45248132 51981960 59465423 67926734 76793726 86035729 96046522 107233347
19802 107233347 123081193 149388059 188092633 226382084 229835896 194047456 155720867
19795 155720867 134323647 125712158 123834600 125363517 128679763 133262895 140419964 153307629
$$ packed form
19856E575907j16709k11817j96349j17060o5829J92303K64132K9897n8070K71131
19846E567536L33096J96021K55757N76994l98285k32555J30952K87232J81010
19837F897758L26332N40788N20446M7633J46751q0029l24475K79449N30948L77793
19827I263394P68306L62658M96363O06712P40263R52280J013560R91925N19987
19818A5715448M52092R90831J548928K150793K955724M214963N009790N750743
19810C8789312O458820O733828P483463Q461311Q866992R242003J0010793J1186825
19802A07233347J5847846K6306866L8704574L8289451L453812l5788440l8326589
19795A55720867k1397220q611489j877558J528917L316246M583132P157069J2887665
$$ plain form
19787 153307629 175940179 208179692 232022083 217969841 173490046 132652107 106582424
19780 106582424 91286517 81493489 74751520 69473633 65121746 61567129 58418307 55543827
19772 55543827 52548275 49918768 47863139 46461694 45011199 43286539 42136569 41785208
19764 41785208 42389161 43548720 45394271 48225512 52126735 57263732 63040646 69630626
19756 69630626 77226163 85886208 95834848 106164612 116935088 128281865 141527093
19749 141527093 162575556 196826814 242513850 273358317 256486981 210339133 173970951
19742 173970951 155165456 148419641 148504707 151449012 155941876 161659993 171275120 189570504
19734 189570504 221068472 260405212 275253359 238690428 181750168 139629062 114539739
$$ packed form
19787A53307629K2632550L2239513K3842391j4052242m4479795m0837939k6069683
19780A06582424j5295907r793028o741969n277887m351887l554617l148822k874480
19772E5543827k995552k629507k055629j401445j450495j724660j149970l51361
19764D1785208O03953J159559J845551K831241L901223N136997N776914O589980
19756F9630626P595537Q660045R948640J0329764J0770476J1346777J3245228
19749A41527093K1048463L4251258M5687036L0844467j6871336m6147848l6368182
19742A73970951j8805495o745815Q5066K944305M492864N718117R615127J8295384
19734A89570504L1497968L9336740J4848147l6562931n6940260m2121106k5089323
$$ plain form
19727 114539739 99130963 89063948 81785845 75696428 70497917 66077605 62327884 58143179
19719 58143179 53530317 49218248 45858074 43092356 40480097 37922267 35436372 33539601
19711 33539601 31905884 30220300 28611631 27137729 25844401 24944341 23799316 22836460
19703 22836460 22284561 21905147 21541994 21196876 20920330 19899220 18260035 17074136 16337713
19694 16337713 15766865 15417012 15042213 14813777 14545762 13907190 13421786 13127258 12798725
19685 12798725 12911525 13100287 12956721 11834667 11040301 10659675 10626937 10001708 8914360
19676 8914360 8489907 8364435 8040103 7672285 7584680 7376572 6899255 6637707 6684790 6331137
19666 6331137 6099612 6188015 6012765 5754527 5997665 5835869 5532955 5186782 5192296 5023882
$$ packed form
19727A14539739j5408776j0067015p278103o089417n198511m420312l749721m184705
19719E8143179m612862m312069l360174k765718k612259k557830k485895j896771
19711C3539601j633717j685584j608669j473902j293328r00060j145025r62856
19703B2836460n51899l79414l63153l45118k76546j021110j639185j185899p36423
19694A6337713n70848l49853l74799k28436k68015o38572m85404k94528l28533
19685A2798725J12800J88762j43566j122054p94366l80626l2738o25229j087348
19676H914360m24453j25472l24332l67818q7605k08108m77317k61548M7083l53653
19666F331137k31525Q8403j75250k58238K43138j61796l02914l46173N514j68414
$$ plain form
19656 5023882 4771109 4484517 4094967 3948571 3822193 3511900 3633433 3856930 3760168 3509531
19646 3509531 3463645 3428963 3240489 2865773 2572950 2360944 2266360 2442756 2541892 2208211
19636 2208211 2061827 2163854 2136378 2239102 2541773 2466451 2139644 2033216 1903152 1697887
19626 1697887 1560413 1760699 1683698 1572720 1489329 1295697 1347986 1269250 1455464 1285907
19616 1285907 965061 1182205 1221027 1198856 1414448 1074235 796312 767542 1124813 1116007
19606 1116007 964325 999793 898502 645130 479974 630214 1239858 1715647 1812008 1363598
19596 1363598 1202213 1000928 610238 135446 212324 734962 722936 421711 605999 177733
19586 177733 188273 358134 290768 283461 628439 932118 947545 1015911 794969 681249 826932
$$ packed form
19656E023882k52773k86592l89550j46396j26378l10293J21533K23497r6762k50637
19646C509531m5886l4682j88474l74716k92823k12006r4584J76396R9136l33681
19636B208211j46384J02027k7476J02724L02671p5322l26807j06428j30064k05265
19626A697887j37474K00286p7001j10978q3391j93632N2289p8736J86214j69557
19616A285907l20846K17144L8822k2171K15592l40213k77923k8770L57271q806
19606A116007j51682L5468j01291k53372j65156J50240O09644M75789R6361m48410
19596A363598j61385k01285l90690m74792P6878N22638j2026l01225J84288m28266
19586A77733J0540J69861o7366p307L44978L03679J5427O8366k20942j13720J45683
$$ plain form
19575 826932 1142214 1229492 1425463 1906058 2037879 2268400 2458144 2183622 1659879 1715044
19565 1715044 1716362 1731301 1925157 1991902 1546471 1386929 1140605 836590 858020 826535
19555 826535 642091 663894 582254 725725 577558 407477 464364 484296 425566 78526
19545 78526 107772 127260 209663 382957 357974 -182 -236082 -346105 -172644 55435
19535 55435 -52757 -115529 -617948 -804027 -612611 -227933 9032 314944 190533 438086
19525 438086 594459 519707 358074 499457 627307 559475 456233 154251 197336 652780
19515 652780 600466 375698 494417 561253 578263 345239 -79816 -387369 -233204 28323
19505 28323 38867 79443 218070 146536 187231 426770 416836 244404 78866 -36168 -32803
$$ packed form
19575H26932L15282Q7278J95971M80595J31821K30521J89744k74522n23743N5165
19565A715044J318J4939J93856O6745m45431j59542k46324l04015K1430l1485
19555H26535j84444K1803q1640J43471j48167j70081N6887J9932n8730l47040
19545G8526K9246J9488Q2403J73294k4983l58156k35900j10023J73461K28079
19535E5435j08192o2772n02419j86079J91416L84678K36965L05912j24411K47553
19525D38086J56373p4752j61633J41383J27850o7832j03242l01982M3085M55444
19515F52780n2314k24768J18719O6836J7010k33024m25055l07553J54165K61527
19505B8323J0544M0576J38627p1534M0695K39539r934j72432j65538j15034L365
$$ plain form
19494 -32803 -7303 -237183 -162829 -14196 -154475 -45288 10515 7792 -11893 4766 -27071
19483 -27071 137714 402669 372658 2319 -60172 143478 460300 699920 467329 -111526
19473 -111526 56570 -5394 -166032 85840 259779 329621 314895 127875 556201 646559
19463 646559 412671 364018 671312 877795 1019639 1482469 1721325 1948477 2056700 2108875
19453 2108875 2015382 2034842 2086754 1416774 1432360 1700405 1478492 1277374 1068800 779998
19443 779998 714437 341716 136890 360941 600328 727402 388196 -2743 -274250 286798
19433 286798 445397 555905 648978 523180 326738 138564 124508 409388 480434 374641
19423 374641 694086 720236 576490 132000 449018 411389 619036 746306 812948 786552
$$ packed form
19494c2803K5500k29880P4354J48633j40279J09187N5803k723j9685J6659l1837
19483b7071J64785K64955l0011l70339o2491K03650L16822K39620k32591n78855
19473a11526J68096o1964j60638K51872J73939O9842j4726j87020M28326R0358
19463F46559k33888m8653L07294K06483J41844M62830K38856K27152J08223N2175
19453B108875r3493J9460N1912o69980J5586K68045k21913k01118k08574k88802
19443G79998o5561l72721k04826K24051K39387J27074l39206l90939k71507N61048
19433B86798J58599J10508R3073j25798j96442j88174j4056K84880P1046j05793
19423C74641L19445K6150j43746m44490L17018l7629K07647J27270O6642k6396
$$ plain form
19413 786552 736369 780698 775681 886764 614319 805377 1055941 1153366 1125251 1197349 1567020
19402 1567020 1909280 1812324 1763023 1840095 2330778 2212177 1657073 1035111 979795 817028
19392 817028 883743 898010 937856 1234817 1269933 1100411 718307 825461 949694 842161
19382 842161 601936 336488 18285 82636 -148076 -70654 339039 593891 720895 507875
19372 507875 524601 587339 367934 235959 328133 367574 428690 507330 364377 91205 -48641
19361 -48641 -43771 96252 240826 241270 332588 299966 245002 235746 223143 -71852 -110541 121354
19349 121354 122972 199816 390740 345316 620158 1150923 1082324 717444 512675 184037
19339 184037 219183 285757 30103 -119340 204042 282057 291121 329589 301683 466288 573861
$$ packed form
19413G86552n0183M4329n017J11083k72445J91058K50564R7425k8115P2098L69671
19402A567020L42260r6956m9301P7072M90683j18601n55104o21962n5316j62767
19392H17028O6715J4267L9846K96961L5116j69522l82104J07154J24233j07533
19382H42161k40225k65448l18203O4351k30712P7422M09693K54852J27004k13020
19372E07875J6726O2738k19405j31975R2174L9441O1116P8640j42953k73172j39846
19361d8641M870J40023J44574M44R1318l2622n4964r256j2603k94995l8689K31895
19349A21354J618P6844J90924m5424K74842N30765o8599l64880k04769l28638
19339A84037L5146O6574k55654j49443L23382P8015R064L8468k7906J64605J07573
$$ plain form
19328 573861 613299 928724 1068265 963740 1043357 995288 956976 686062 765801 957117
19318 957117 1331048 1258486 1087776 1080834 976151 1180900 1474236 1664019 1797937 1659668
19308 1659668 1543062 1673577 2109643 2007705 1800433 1716914 1743865 1798490 2012069 1951513
19298 1951513 2236533 2202215 1887921 1550872 1602435 1686762 1765249 1930525 2058165 1983152
19288 1983152 2069754 1752018 1865400 2088502 2199303 2127524 1924815 2190815 2187743 2025827
19278 2025827 2048368 1989682 2179717 2545677 2613508 2647608 2565871 2628873 2681556 2697921 2810822
19267 2810822 2907393 2776994 2498762 2545007 2666756 3040310 3531304 3455985 3296400 3181491
19257 3181491 3006654 3080197 3072707 2763841 2365699 2389189 2860309 2981991 2880670 2796698
$$ packed form
19328E73861L9438L15425J39541j04525P9617m8069l8312k70914P9739J91316
19318I57117L73931p2562j70710o942j04683K04749K93336J89783J33918j38269
19308A659668j16606J30515M36066j01938k07272q3519K6951N4625K13579o0556
19298A951513K85020l4318l14294l37049N1563Q4327P8487J65276J27640p5013
19288A983152Q6602l17736J13382K23102J10801p1779k02709K66000l072j61916
19278B025827K2541n8686J90035L65960O7831L4100q1737O3002N2683J6365J12901
19267B810822R6571j30399k78232M6245J21749L73554M90994p5319j59585j14909
19257C181491j74837P3543p490l08866l98142K3490M71120J21682j01321q3972
$$ plain form
19247 2796698 2721832 2743949 2708079 3031415 3495976 3616329 3661801 3905432 4237006 4548330
19237 4548330 4226973 4287942 4562328 4733854 5089398 5447754 5734950 5871575 5933742 6110730
19227 6110730 6350543 6522969 6639637 6821173 7137465 7421818 7611290 8285406 9046820
19218 9046820 10126952 11023509 11872567 12701984 13455320 14066707 15135284 16349473 17691858
19209 17691858 19199161 21333773 24479557 28322769 33233309 39267966 46565972 55378108
19201 55378108 65823700 77991045 92279794 108069325 125016469 143143474 163787491
19194 163787491 192271713 235330136 294283559 348242396 361351043 341367315 335319990
19187 335319990 364076572 404649758 408977716 370294683 335428685 334640230 365586396
$$ packed form
19247B796698p4866K2117l5870L23336M64561J20353M5472K43631L31574L11324
19237D548330l21357O0969K74386J71526L55544L58356K87196J36625O2167J76988
19227F110730K39813J72426J16668J81536L16292K84353J89472O74116P61414
19218I046820J080132Q96557Q49058Q29417P53336O11387J068577J214189J342385
19209A7691858J507303K134612L145784L843212M910540O034657P298006Q812136
19201E5378108J0445592J2167345J4288749J5789531J6947144J8127005K0644017
19194A63787491K8484222M3058423N8953423N3958837J3108647j9983728o047325
19187C35319990K8756582M0573186M327958l8683033l4865998p88455L0946166
$$ plain form
19180 365586396 405347923 410216452 371325419 335154202 333355484 352124930 347364505
19173 347364505 296970582 233306991 188093379 161377942 144531616 131967277 121435225
19166 121435225 111982112 103718590 96826084 90665144 84591764 78705001 73312769 68743740
19158 68743740 64737748 60953685 57422780 54134566 51067937 48541873 46229548 44163023
19150 44163023 42327223 40369842 38736665 37614910 36517460 35003578 33398678 32380588
19142 32380588 31660185 30350672 28719011 27155347 26313998 25984747 25131863 24094148 23129040
19133 23129040 22648090 21978159 21225833 20357802 19873334 19287470 18873045 17879429 17015628
19124 17015628 16676131 16279317 15782196 15515912 14985114 14676798 14268595 13928936 13480482
$$ packed form
19180C65586396L9761527M868529l8891033l6171217j798718J8769446m760425
19173C47364505n0393923o3663591m5213612k6715437j6846326j2564339j0532052
19166A21435225r453113q263522o892506o160940o073380n886763n392232m569029
19158F8743740m005992l784063l530905l288214l066629k526064k312325k066525
19150D4163023j835800j957381j633177j121755j097450j513882j604900j018090
19142C2380588p20403j309513j631661j563664q41349l29251q52884j037715r65108
19133B3129040m80950o69931p52326q68031m84468n85864m14425r93616q63801
19124A7015628l39497l96814m97121k66284n30798l08316m08203l39659m48454
$$ plain form
19115 13480482 13181555 12673804 12444179 12126102 11686136 11182589 10864139 10752014 10446805
19106 10446805 10392901 10288702 10063973 9893633 9827215 9986791 9748575 9211114 9129498 9258429
19096 9258429 9227637 8961567 8928852 8838110 9012709 8718340 8321378 8097954 7837252 7703065
19086 7703065 7707458 7815883 8067508 8155019 7903552 7868471 7970943 8164415 8189428 8505722
19076 8505722 8685187 8969081 9192015 9628756 10322532 10989023 11318972 11812094 13031647
19067 13031647 13922067 14787193 16283813 17766454 19351134 21093103 23525526 27113144
19059 27113144 31547403 37253215 44193928 52692983 62351829 73604793 86886939 101711117
19051 101711117 117685248 134885325 154037317 177931839 210784122 252340163 292879759
$$ packed form
19115A3480482k98927n07751k29625l18077m39966n03547l18450j12125l05209
19106A0446805n3904j04199k24729j70340o6418J59576k38216n37461q1616J28931
19096I258429l0792k66070l2715r0742J74599k94369l96962k23424k60702j34187
19086G703065M393J08425K51625Q7511k51467l5081J02472J93472K5013L16294
19076H505722J79465K83894K22934M36741O93776O66491L29949M93122J219553
19067A3031647Q90420Q65126J496620J482641J584680J741969K432423L587618
19059B7113144M434259N705812O940713Q499055R658846J1252964J3282146J4824178
19051A01711117J5974131J7200077J9151992K3894522L2852283M1556041M0539596
$$ plain form
19044 292879759 314794955 307801440 286230046 275150448 282333957 291868786 281390680
19037 281390680 245041316 199085901 161740003 137526685 121592415 110312764 101015228
19030 101015228 93010279 86059195 80024316 74623684 69635691 65082253 60753980 56673705
19022 56673705 53339301 50434070 47672104 45414670 43542529 41703876 39998046 38700714
19014 38700714 37856267 37542038 37730725 37685469 37934574 38705798 40420493 43045730 46502036
19005 46502036 50793436 56303756 63106275 71488006 81470813 92798195 105400487 119090313
18997 119090313 133397651 151175262 175335339 209337217 250103079 280833370 284375677
18990 284375677 265655002 248737096 249429927 262161171 264808558 241402019 200534952
$$ packed form
19044B92879759K1915196o993515k1571394j1079598P183509R534829j0478106
19037B81390680l6349364m5955415l7345898k4213318j5934270j1279651r297536
19030A01015228q004949o951084o034879n400632m987993m553438m328273m080275
19022E6673705l334404k905231k761966k257434j872141j838653j705830j297332
19014C8700714q44447l14229J88687m5256K49105P71224J714695K625237L456306
19005D6502036M291400N510320O802519Q381731R982807J1327382J2602292J3689826
18997A19090313J4307338J7777611K4160077L4001878M0765862L0730291L542307
18990B84375677j8720675j6917906O92831J2731244K647387k3406539m0867067
$$ plain form
18983 200534952 161609754 134110569 116585037 104720358 95605631 87334493 80205885
18976 80205885 74442833 69130162 63884129 59474883 55518478 51643468 48396406 45248584
18968 45248584 42321933 39735973 37901664 36149217 33969357 31739301 29673641 28465339
18960 28465339 27219315 25830975 24719892 23970866 23305377 22534046 21640096 20736871 20030729
18951 20030729 18945965 18444270 17863782 17354535 16686581 15873865 15218125 14744757 14217748
18942 14217748 13816592 13351997 12776595 11896943 11116039 11246121 10969795 10781865 10331428
18933 10331428 9954808 9489709 8853265 8435973 8431945 8175013 8201462 8240254 7900147 7419191
18923 7419191 7280560 7022805 7301987 7073103 6637867 6697521 6549434 6382608 6149311 6094640
$$ packed form
18983B00534952l8925198k7499185j7525532j1864679r114727q271138p128608
18976H0205885n763052n312671n246033m409246l956405l875010l247062l147822
18968D5248584k926651k585960j834309j752447k179860k230056k065660j208302
18960B8465339j246024j388340j111083p49026o65489p71331q93950r03225p06142
18951B0030729j084764n01695n80488n09247o67954q12716o55740m73368n27009
18942A4217748m01156m64595n75402q79652p80904J30082k76326j87930m50437
18933A0331428l76620m65099o36444m17292m028k56932K6449L8792l40107m80956
18923G419191j38631k57755K79182k28884m35236N9654j48087j66826k33297n4671
$$ plain form
18913 6094640 6040471 5602786 5548500 5548164 5671650 5670958 5326886 5112382 4455869 4184183 4298277
18902 4298277 4412126 4297040 4097613 4160801 4369523 4489991 4398533 3801017 3552306 3773446
18892 3773446 3916913 3625101 3409094 3003886 2612350 2771252 2779986 2663948 2416152 2392334
18882 2392334 2193425 2529204 2533942 2391878 2036828 2078641 1971492 2341179 2339512 2255520
18872 2255520 2242834 2082006 2059813 1989368 2100498 2450742 2466106 2080729 1776965 1597762
18862 1597762 1531751 1724022 1756823 1624925 1547217 1213631 1440637 1562962 1575019 1426610
18852 1426610 1688879 1763655 1491571 1452291 1092792 889867 1048634 1076268 868824 1077411
18842 1077411 997700 870922 1010076 1123649 947627 712497 608528 603679 720452 822982
$$ packed form
18913F094640n4169m37685n4286l36J23486o92l44072k14504o56513k71686J14094
18902D298277J13849j15086j99427O3188K08722J20468r1458n97516k48711K21140
18892C773446J43467k91812k16007m05208l91536J58902Q734j16038k47796k3818
18882B392334j98909L35779M738j42064l55050M1813j07149L69687j667q3992
18872B255520j2686j60828k2193p0445J11130L50244J5364l85377l03764j79203
18862A597762o6011J92271L2801j31898p7708l33586K27006J22325J2057j48409
18852A426610K62269P4776k72084l9280l59499k02925J58767K7634k07444K08587
18842A077411p9711j26778J39154J13573j76022k35130j03969m849J16773J02530
$$ plain form
18832 822982 539829 412454 433756 235921 583013 548939 365886 99938 -255142 -108951
18822 -108951 191684 507856 545001 648376 627734 434771 474042 410165 363003 402893 493851
18811 493851 394005 178270 308177 173008 249983 544794 539001 159128 101674 87873 166543
18800 166543 157750 227125 44668 -198269 -48412 137229 584207 595110 299652 54435
18790 54435 142418 206140 110438 7389 284024 -184951 -306924 -274515 -501742 -257288
18780 -257288 -229943 -362131 -558503 -660869 -724703 -837404 -620511 -471813 -536687 -533704
18770 -533704 -752285 -651696 -504629 -357503 -535988 -724533 -815057 -701204 -899211 -745485
18760 -745485 -661643 -393841 -218402 -315878 -242117 -66852 324596 304272 268040 387026
$$ packed form
18832H22982k83153j27375K1302j97835L47092l4074j83053k65948l55080J46191
18822a08951L00635L16172L7145J03375k0642j92963L9271o3877m7162L9890R0958
18811D93851r9846k15735J29907j35169P6975K94811n793l79873n7454j3801P8670
18800A66543q793O9375j82457k42937J49857J85641M46978J0903k95458k45217
18790E4435Q7983O3722r5702j03049K76635m68975j21973L2409k27227K44454
18780b57288K7345j32188j96372j02366o3834j12701K16893J48698o4874K983
18770e33704k18581J00589J47067J47126j78485j88545r0524J13853j98007J53726
18760g45485Q3842K67802J75439r7476P3761J75265L91448k0324l6232J18986
$$ plain form
18750 387026 446512 209507 214271 460441 941932 1262813 1656964 1860982 1818465 2234905
18740 2234905 3191008 3377291 3178833 2919690 3024221 3034565 2889991 2441462 1862311 1228776
18730 1228776 615455 496289 635750 941896 1301335 981114 559179 540190 370432 494647
18720 494647 460229 769492 1203150 1188037 1056227 831994 933304 1094292 1008975 390553
18710 390553 532464 564860 769149 948154 1098936 1018150 1109625 997966 1234717 1044543
18700 1044543 1147445 1386343 1389949 1780949 1959329 1967533 2001275 2150441 2321802 2714322
18690 2714322 3017121 3380260 3493456 3628695 3466920 3147739 3174965 3572412 3424190 2397438
18680 2397438 1825713 1426645 1545749 1371612 952581 303912 48558 -36987 82280 384884
$$ packed form
18750C87026N9486k37005M764K46170M81491L20881L94151K04018m2517M16440
18740B234905R56103J86283j98458k59143J04531J0344j44574m48529n79151o33535
18730A228776o13321j19166J39461L06146L59439l20221m21935j8989j69758J24215
18720D94647l4418L09263M33658j5113j31810k24233J01310J60988q5317o18422
18710C90553J41911L2396K04289J79005J50782q0786R1475j11659K36751j90174
18700A044543J02902K38898L606L91000J78380Q204L3742J49166J71361L92520
18690B714322L02799L63139J13196J35239j61775l19181K7226L97447j48222j026752
18680B397438n71725l99068J19104j74137m19031o48669k55354q5545J19267L02604
$$ plain form
18670 384884 309049 278040 329941 324947 361882 106742 -304000 -251347 -244043 -391455 -176164
18659 -176164 16995 346983 479589 300738 -90542 -397995 -311996 -84840 -199103 -453742
18649 -453742 -378816 -172902 -10727 -142170 -77260 -12514 -335397 -546067 -538490 -356196
18639 -356196 -296643 -95254 121821 218223 -117546 -185456 -419205 -658743 -433071 -390879
18629 -390879 -514232 -484064 -276558 -611523 -820845 -641455 -580560 -583089 -638192 -720406 -887161
18618 -887161 -1081781 -1135183 -822473 -547705 -506150 -499596 -326168 -317328 -367245 -271663 -452824
18607 -452824 -348253 -468974 -758636 -527477 -299399 -301152 -506025 -548188 -558196 -172686
18597 -172686 -24220 -247462 -494199 -689031 -828042 -852143 -1005086 -900862 -977179 -744238
$$ packed form
18670C84884p5835l1009N1901m994L6935k55140m10742N2653P304j47412K15291
18659a76164J93159L29988J32606j78851l91280l07453Q5999K27156j14263k54639
18649d53742P4926K05914J62175j31443O4910O4746l22883k10670P577J82294
18639c56196N9553K01389K17075R6402l35769o7910k33749k39538K25672M2192
18629c90879j23353L0168K07506l34965k09322J79390O0895k529n5103q2214j66755
18618h87161j94620n3402L12710K74768M1555O554J73428Q840m9917R5582j81161
18607d52824J04571j20721k89662K31159K28078j753k04873m2163j0008L85510
18597a72686J48466k23242k46737j94832j39011k4101j52943J04224p6317K32941
$$ plain form
18587 -744238 -616628 -154068 -332591 -514034 -975904 -1152995 -904729 -754805 -1055816 -1054431
18577 -1054431 -1140250 -876884 -1063796 -1079766 -901130 -542659 -594821 -740611 -584706 -684518
18567 -684518 -734601 -877813 -940138 -733147 -610661 -543372 -339513 -541593 -492262 -506422
18557 -506422 -764875 -751496 -521556 -651928 -976247 -674011 -499026 47142 56653 -174786
18547 -174786 -150770 -125392 490 29854 176718 178771 474844 420618 122121 -105932 355835
18536 355835 605411 505889 519071 900452 1235194 1609762 1814356 1731492 1698402 1637500
18526 1637500 2178081 2391740 2243871 1789690 1635544 1474714 1615004 1889891 1771967
18517 1771967 1784065 2020545 2229125 2020645 1855660 2055388 1996044 2073060 2007312 1825381
$$ packed form
18587g44238J27610M62560j78523j81443m61870j77091K48266J49924l01011J385
18577a054431q5819K63366j86912j5970J78636L58471n2162j45790J55905r9812
18567f84518n0083j43212o2325K06991J22486O7289K03859k02080M9331j4160
18557e06422k58453J3379K29940j30372l24319L02236J74985N46168R511k31439
18547a74786K4016K5378J25882K9364J46864K053K96073n4226k98497k28053M61767
18536C55835K49576r9522J3182L81381L34742L74568K04594q2864l3090o0902
18526A637500N40581K13659j47869m54181j54146j60830J40290K74887j17924
18517A771967J2098K36480K08580k08480j64985J99728n9344P7016o5748j81931
$$ plain form
18507 1825381 1631768 1376840 997824 747833 634143 259703 412206 312305 96215 139236
18497 139236 -125594 -109118 -157249 128121 540805 673515 675005 244368 -128758 -307539
18487 -307539 -490809 -582112 -323605 -207150 -183177 -253909 -646674 -456528 12194 138717
18477 138717 556166 1088268 1316017 1501871 1778458 1994479 2144817 2394786 3193852 4003798
18467 4003798 5003717 5755550 5834618 5672987 5001620 4028675 3439545 3105911 2931900 2595419
18457 2595419 2584024 2764514 2955248 2605583 2052173 1524258 1385421 1603976 1588382 1410355
18447 1410355 1195655 472463 16870 -16133 52225 118773 292277 653220 755242 872026
18437 872026 507117 75115 193157 275083 471489 745280 384777 -248791 -547507 -556774
$$ packed form
18507A825381j93613k54928l79016k49991j13690l74440J52503r9901k16090M3021
18497A39236k64830J6476m8131K85370M12684J32710J490m30637l73126j78781
18487c07539j83270r1303K58507J16455K3973p0732l92765J90146M68722J26523
18477A38717M17449N32102K27749J85854K76587K16021J50338K49969P99066Q09946
18467D003798R99919P51833P9068j61631o71367r72945n89130l33634j74011l36481
18457B595419j1395J80490J90734l49665n53410n27915j38837K18555j5594j78027
18447A410355k14700p23192m55593l3003O8358O6548J73504L60943J02022J16784
18437H72026l64909m32002J18042Q1926J96406K73791l60503o33568k98716r267
$$ plain form
18427 -556774 -439556 -309834 -192147 -134814 161078 52082 -44394 -133337 -141487 -155326 -700130
18416 -700130 -867164 -394087 -130128 -164995 -487806 -592368 -425419 -207673 -289462 -260906
18406 -260906 -231972 -24358 41350 447357 697679 253079 -5678 103300 57747 225436
18396 225436 372840 305341 -8461 -129491 60273 -24159 -449722 -367391 -371299 -331488 -168915
18385 -168915 -56516 -61848 6375 -14702 -349409 -610039 -952486 -615198 -51254 -104715
18375 -104715 12618 -210397 -410038 -276536 -319229 -417611 -630127 -676685 -499599 -346822
18365 -346822 -341873 -343500 -483010 -206121 -16845 71682 -97910 -255628 -480561 -409378 196669
18354 196669 280969 279655 86969 20109 212833 101452 25685 -293955 -476026 -196309
$$ packed form
18427e56774J17218J29722J17687N7333K95892j08996r6476q8943q150j3839n44804
18416g00130j67034M73077K63959l4867l22811j04562J66949K17746q1789K8556
18406b60906K8934K07614O5708M06007K50322m44600k58757J08978m5553J67689
18396B25436J47404o7499l13802j21030J89764q4432m25563Q2331l908L9811J62573
18385a68915J12399n332O8223k1077l34707k60630l42447L37288N63944n3461
18375a04715J17333k23015j99641J33502m2693r8382k12516m6558J77086J52777
18365c46822M949j627j39510K76889J89276Q8527j69592j57718k24933P1183O06047
18354A96669Q4300j314j92686o6860J92724j11381p5767l19640j82071K79717
$$ plain form
18344 -196309 72142 136582 -42831 82844 -271730 -322835 -191914 -50976 65003 -374820
18334 -374820 -640797 -532344 -285062 -276629 -576008 -896283 -881051 -861254 -802798 -650387
18324 -650387 -205553 150417 67876 -103894 -289368 -508025 -651283 -416409 -373477 -863596
18314 -863596 -1063517 -909891 -734053 -612151 -412980 -288757 -426590 -1113428 -1360265 -1013766
18304 -1013766 -803160 -493551 -477844 -569456 -645119 -434242 -262769 54184 -8960 -521313
18294 -521313 -561357 -260631 142832 -76798 -249823 -134190 21303 -303699 -141060 -385120
18284 -385120 -286578 -79697 -115275 -171667 -417880 -80097 294432 122383 -284343 -123954
18274 -123954 73907 181339 -165670 -87162 164273 386654 666454 700758 678602 795449
$$ packed form
18344a96309K68451O4440j79413J25675l54574n1105J30921J40938J15979m39823
18334c74820k65977J08453K47282Q433k99379l20275J5232J9797N8456J52411
18324f50387M44834L55970q2541j71770j85474k18657j43258K34874M2932m90119
18314h63596j99921J53626J75838J21902J99171J24223j37833o86838k46837L46499
18304a013766K10606L09609J5707r1612p5663K10877J71473L16953o3144n12353
18294e21313m0044L00726M03463k19630j73025J15633J55493l25002J62639k44060
18284c85120R8542K06881l5578n6392k46213L37783L74529j72049m06726J60389
18274a23954J97861J07432l47009P8508K51435K22381K79800L4304k2156J16847
$$ plain form
18264 795449 867517 964805 791294 783622 911915 714448 434309 218743 167383 212331 226335
18253 226335 337190 303970 251583 -19254 -51028 -117201 279340 468670 456141 432456 432713
18242 432713 213208 247954 464632 467773 509137 464815 555759 589218 512457 548257 254988
18231 254988 246112 433582 946183 976610 634972 64853 113365 -33489 -31223 369304 708994
18220 708994 981865 629018 283874 522117 264692 46553 106012 27302 -253774 -81837
18210 -81837 142555 267582 125320 358714 217589 -59466 162260 616572 611385 567229
18200 567229 643587 661371 1044487 1064380 1081487 1070223 1428594 2041549 2290835 2353445 2467535
18189 2467535 2708890 3585495 3895885 4239588 5039417 5567057 6252897 6914325 7878850
$$ packed form
18264G95449P2068R7288j73511p672J28293j97467k80139k15566n1360M4948J4004
18253B26335J10855l3220n2387k70837l1774o6173L96541J89330j2529k3685K57
18242D32713k19505L4746K16678L141M1364m4322R0944L3459p6761L5800k93269
18231B54988q876J87470N12601L0427l41638n70119M8512j46854K266M00527L39690
18220G08994K72871l52847l45144K38243k57425k18139N9459p8710k81076J71937
18210h1837K24392J25027j42262K33394j41125k77055K21726M54312n187m4156
18200E67229P6358J7784L83116J9893J7107j1264L58371O12955K49286O2610J14090
18189B467535K41355Q76605L10390L43703P99829N27640O85840O61428R64525
$$ plain form
18180 7878850 8402392 9265562 10204230 11502047 13041890 15088580 17574099 21209832 26398646
18171 26398646 33293832 40828455 49854235 60572661 73171107 87443018 102763987
18164 102763987 118509635 136193069 158931468 192089905 238842347 287032250 309840410
18157 309840410 296231309 272994659 272028221 291306074 299341124 272322523 224247074
18150 224247074 184919714 164066820 156038744 154511843 156851771 162316454 170522494 181034733
18142 181034733 192111522 205206968 224685764 256767110 303708364 349697017 363042845
18135 363042845 338552508 311241039 310212300 326589409 326262783 288900468 233904056
18128 233904056 189201817 160223067 141824563 129217519 119659950 111135269 103289399
$$ packed form
18180G878850N23542Q63170R38668J297817J539843K046690K485519L635733N188814
18171B6398646O895186P534623R025780J0718426J2598446J4271911J5320969
18164A02763987J5745648J7683434K2738399L3158437M6752442M8189903K2808160
18157C09840410j3609101k3236650r66438J9277853Q035050k7018601m8075449
18150B24247074l9327360k0852894q028076j526901K339928N464683Q206040J0512239
18142A81034733J1076789J3095446J9478796L2081346M6941254M5988653J3345828
18135C63042845k4490337k7311469j028739J6377109l26626l7362315n4996412
18128B33904056m4702239k8978750j8398504j2607044r557569q524681p845870
$$ plain form
18121 103289399 96489901 90343481 84539854 79183356 73893107 68909266 64353702 61204813
18113 61204813 58517107 55305109 52322038 49592112 47488015 45923835 44108751 42320850
18105 42320850 40528006 38342278 36648155 35468848 33876474 32244515 30471340 28890111
18097 28890111 27807232 26715472 25824701 24725841 23697008 23159482 22599194 21539694
18089 21539694 20777653 20143466 19498453 19014760 18414611 18044631 17493037 16799581 16372980
18080 16372980 16137472 15724241 15248295 14911920 14147114 14224572 14143015 13735107 13367520 12859594
18070 12859594 12432578 12274616 11812311 11366418 11180664 11169705 11048737 10357468 9852146
18061 9852146 9704201 9763606 9314354 9416034 9163238 8636363 8382418 8265002 8065487 8085535
$$ packed form
18121A03289399o799498o146420n803627n356498n290249m983841m555564l148889
18113F1204813k687706l211998k983071k729926k104097j564180j815084j787901
18105D2320850j792844k185728j694123j179307j592374j631959j773175j581229
18097B8890111j082879j091760q90771j098860j028833n37526n60288j059500
18089B1539694p62041o34187o45013m83693o00149l69980n51594o93456m26601
18080A6372980k35508m13231m75946l36375p64806P7458q1557m07908l67587n07926
18070A2859594m27016j57962m62305m45893j85754j0959j20968o91269n05322
18061I852146j47945N9405m49252J01680k52796n26875k53945j17416j99515K0048
$$ plain form
18051 8085535 7821185 7261734 7144811 7122898 6987174 6797490 6881490 6950232 6544156 6376064
18041 6376064 6363769 6151617 6179914 6058351 6049088 5824453 5689511 5639398 5523624 5632940
18031 5632940 5863581 5495931 5334876 5227690 5104115 4941583 4709783 4659055 4521573 4476514
18021 4476514 4620969 4177074 3673913 3752360 3793865 3762270 3894351 3871187 3828565 3752770
18011 3752770 3585053 3536043 3568617 3307404 3437281 3719175 3875616 3770143 3789094 3383959
18001 3383959 3229384 3250082 3042082 2514836 2048800 2439283 2926108 3291465 3248826 3027855
17991 3027855 2693052 2489651 2732482 2757936 2488918 2312227 2261397 2427776 2398954 2392364
17981 2392364 2390502 2414366 2173985 2186834 2205723 2019659 2051131 2041109 2267785 2538145 2512808
$$ packed form
18051H085535k64350n59451j16923k1913j35724j89684Q4000O8742m06076j68092
18041F376064j2295k12152K8297j21563r263k24635j34942n0113j15774J09316
18031E632940K30641l67650j61055j07186j23575j62532k31800n0728j37482m5059
18021D476514J44455m43895n03161P8447M1505l1595J32081k3164m2622p5795
18011C752770j67717m9010L2574k61213J29877K81894J56441j05473J8951m05135
18001C383959j54575K0698k08000n27246m66036L90483M86825L65357m2639k20971
17991C027855l34803k03401K42831K5454k69018j76691n0830J66379k8822o590
17981B392364j862K3864k40381J2849J8889j86064L1472j0022K26676K70360k5337
$$ plain form
17970 2512808 1956379 1780144 1732896 1751341 1807663 2179251 2272088 1723960 1315433 1773764
17960 1773764 1880312 1660236 1714863 1902102 1967437 1905655 1841393 1849031 1788161 1727759 1582922
17949 1582922 1410078 1037887 1221491 1483434 1186906 975334 1053636 1113613 1042250 992263
17939 992263 1170265 878793 800917 1007269 957359 879925 996463 1003536 1381662 1151337
17929 1151337 662603 411084 244244 240114 476462 248336 514304 650659 796129 648914
17919 648914 578170 364909 427315 515165 346841 407140 280311 99673 -45193 115413
17909 115413 329792 524441 630670 367328 266944 65917 137890 512882 864098 827311
17899 827311 376744 454342 472870 271803 161243 117148 103936 132562 -148728 -184681 -309927
$$ packed form
17970B512808n56429j76235m7248J8445N6322L71588R2837n48128m08527M58331
17960A773764J06548k20076N4627J87239O5335o1782o4262P638o0870o0402j44837
17949A582922j72844l72191J83604K61943k96528k11572P8302N9977p1363m9987
17939I92263J78002k91472p7876K06352m9910p7434J16538P073L78126k30325
17929A151337m88734k51519j66840m130K36348k28126K65968J36355J45470j47215
17919F48914p0744k13261O2406Q7850j68324O0299j26829j80638j44866J60606
17909A15413K14379J94649J06229k63342j00384k01027P1973L74992L51216l6787
17899H27311m50567P7598J8528k01067j10560m4095j3212K8626k81290l5953j25246
$$ plain form
17888 -309927 -394724 -277258 -55109 475514 708084 487841 280125 222265 296169 348414
17878 348414 390449 462307 776697 612972 448574 392692 305587 98294 20139 99357 82210
17867 82210 33050 229588 227242 118955 -133959 -89835 243701 163880 -67059 -337993 -73893
17856 -73893 400233 526239 463736 636676 422383 182065 26784 -129716 -282511 140554
17846 140554 259966 -91440 -89639 -83133 71703 -203174 -468378 -234783 68421 219172
17836 219172 574034 466040 357891 336258 536377 547827 510085 667122 588461 727473
17826 727473 514953 317391 723425 1083901 859107 498816 510837 719037 712886 697006
17816 697006 813441 908656 598167 685786 962528 1085548 1132750 1044426 947109 719282
$$ packed form
17888c09927q4797J17466K22149N30623K32570k20243k07716n7860P3904N2245
17878C48414M2035P1858L14390j63725j64398n5882q7105k07293p8155P9218j7147
17867H2210m9160J96538k346j08287k52914M4124L33536p9821k30939k70934K64100
17856g3893M74126J26006o2503J72940k14293k40318j55281j56500j52795M23065
17846A40554J19412l51406J801O506J54836k74877k65204K33595L03204J50751
17836B19172L54862j07994j08149k1633K00119J1450l7742J57037p8661J39012
17826G27473k12520j97562M06034L60476k24794l60291J2021K08200o151j5880
17816F97006J16435R5215l10489Q7619K76742J23020M7202q8324r7317k27827
$$ plain form
17806 719282 830408 915753 910364 750921 505171 849919 796380 541277 513660 714164
17796 714164 829021 884190 962007 1129187 967585 762342 214226 25787 223191 292682
17786 292682 150246 -148423 -369236 -324809 -230085 -62995 -184819 83808 290115 117327
17776 117327 -60818 -73228 -25538 -63913 -114744 50198 -312343 -540051 -784782 -1045818
17766 -1045818 -959326 -928453 -816781 -962503 -628133 -409422 16629 -172652 -436069 -251957
17756 -251957 10794 -207232 -395929 -311379 -243961 -107674 -47050 -381763 -290943 -203091
17746 -203091 -22536 -292341 -714197 -583387 -543796 -664850 -605199 -658739 -668345 -392295
17736 -392295 -73971 38425 -131909 76839 110436 -236367 -605819 -641725 -293369 -283692
$$ packed form
17806G19282J11126Q5345n389j59443k45750L44748n3539k55103k7617K00504
17796G14164J14857N5169P7817J67180j61602k05243n48116j88439J97404O9491
17786B92682j42436k98669k20813M4427R4724J67090j21824K68627K06307j72788
17776A17327j78145j2410M7690l8375n0831J64942l62541k27708k44731k61036
17766a045818Q6492L0873J11672j45722L34370K18711M26051j89281k63417J84112
17756b51957K62751k18026j88697Q4550O7418J36287O0624l34713R0820Q7852
17746b03091J80555k69805m21856J30810L9591j21054N9651n3540r606K76050
17736c92295L18324J12396j70334K08748L3597l46803l69452l5906L48356R677
$$ plain form
17726 -283692 -473004 -360739 -81843 -137171 -263220 -362200 -197201 -35478 -260378 -317412
17716 -317412 -433879 -598187 -311415 -469200 -564966 -703595 -987204 -453100 -196047 -459870
17706 -459870 -366119 -422351 -586291 -788160 -777639 -872560 -1122537 -824508 -418461 -436307
17696 -436307 -135171 74781 -205579 -245492 -219154 -461729 -362985 -438936 -646278 -477054
17686 -477054 -119744 -71372 -329264 -550852 -676991 -692318 -963902 -816265 -764113 -1039972
17676 -1039972 -1052932 -605368 -152496 -343701 -336676 -42820 8494 7457 -205143 -327378
17666 -327378 -136044 -429137 -668798 -714503 -860991 -1011513 -1375689 -1482298 -1161096 -809800
17656 -809800 -593467 -806143 -1155172 -981724 -685123 -615836 -787739 -816506 -861088 -797767
$$ packed form
17726b83692j89312J12265K78896n5328j26049r8980J64999J61723k24900n7034
17716c17412j16467j64308K86772j57785r5766j38629k83609N34104K57053k63823
17706d59870R3751n6232j63940k01869J0521r4921k49977K98029M06047j7846
17696d36307L01136K09952k80360l9913K6338k42575R8744p5951k07342J69224
17686d77054L57310M8372k57892k21588j26139j5327k71584J47637N2152k75859
17676a039972j2960M47564M52872j91205P025K93856N1314j037k12600j22235
17666c27378J91334k93093k39661m5705j46488j50522l64176j06609L21202L51296
17656h09800K16333k12676l49029J73448K96601O9287j71903k8767m4582O3321
$$ plain form
17646 -797767 -817371 -974214 -662855 -384356 -520111 -701268 -678899 -658598 -459346 -173243
17636 -173243 -312854 -600226 -627127 -603161 -369081 -104652 -38264 37809 -158858 -366340
17626 -366340 -487579 -367097 -130173 -271646 -118912 -121643 -398011 -371359 -296794 -171218
17616 -171218 -252813 -208327 -123975 -71458 -447613 -573934 -274924 -234484 -275718 -277755 79380
17605 79380 243728 71929 55747 389904 387991 486578 589819 597942 931105 1113535 1043403
17594 1043403 1186737 1599134 1514650 917399 370809 304655 549466 712112 512393 557362
17584 557362 1042290 1134735 1130421 840315 756055 774208 704413 562131 621482 1001636 1446830
17573 1446830 1703370 1781859 1842326 1675784 1230888 829616 785400 825677 644196 504791
$$ packed form
17646g97767j9604j56843L11359K78499j35755j81157K2369K0301J99252K86103
17636a73243j39611k87372k6901K3966K34080K64429O6388P6073j96667k07482
17626c66340j21239J20482K36924j41473J52734k731k76368K6652P4565J25576
17616a71218q1595M4486Q4352N2517l76155j26321K99010M0440m1234k037L57135
17605G9380J64348j71799j6182L34157j913R8587J03241Q123L33163J82430p0132
17594A043403J43334M12397q4484n97251n46590o6154K44811J62646j99719M4969
17584E57362M84928R2445m314k90106q4260J8153o9795j42282N9351L80154M45194
17573A446830K56540P8489O0467j66542m44896m01272m4216M0277j81481j39405
$$ plain form
17563 504791 411843 177848 16281 -345968 -103602 155672 101054 85310 23797 -424174
17553 -424174 -1020051 -1020706 -1256514 -1147016 -892362 -676939 -793782 -1395059 -1275406 -597794
17543 -597794 -588218 -568893 -522079 -552631 -636177 -570990 -604553 -693886 -504009 -151655 -170816
17532 -170816 -510279 -669575 -790132 -741241 -571687 -444890 -817968 -1137657 -1157962 -895176
17522 -895176 -978184 -1347016 -1320903 -1110870 -1009549 -778254 -737773 -1203386 -978740 -618346
17512 -618346 -463021 -477340 -724867 -1082587 -841917 -885845 -998448 -1151884 -1200763 -984414
17502 -984414 -748732 -698040 -941260 -831614 -888931 -821212 -961983 -1012929 -911417 -1099420
17492 -1099420 -966903 -658811 -554109 -399907 -463599 -817862 -904449 -1254067 -1372766 -1217447
$$ packed form
17563E04791r2948k33995j61567l62249K42366K59274n4618j5744o1513m47971
17553d24174n95877o55k35808J09498K54654K15423j16843o01277J19653O77612
17543e97794R576J9325M6814l0552q3546O5187l3563q9333J89877L52354j9161
17532a70816l39463j59296j20557M8891J69554J26797l73078l19689k0305K62786
17522h95176q3008l68832K6113K10033J01321K31295M0481m65613K24646L60394
17512f18346J55325j4319k47527l57720K40670m3928j12603j53436m8879K16349
17502i84414K35682N0692k43220J09646n7317O7719j40771n0946J01512j88003
17492a099420J32517L08092J04702J54202o3692l54263q6587l49618j18699J55319
$$ plain form
17482 -1217447 -1251533 -1162797 -1340783 -1340698 -1163940 -1136371 -1165774 -1060249 -972074 -1287934 -1636504
17471 -1636504 -1705300 -1713167 -1963287 -2025392 -1726624 -1438549 -1457773 -1574140 -1073537 -905288
17461 -905288 -927682 -651536 -659139 -799314 -863085 -967708 -1045698 -1125167 -975806 -892285 -1087822
17450 -1087822 -1159880 -1147467 -1289469 -1305872 -1281518 -1241464 -1533900 -1676784 -1676126 -1308671 -1341166
17439 -1341166 -1266216 -1169173 -1111445 -1488409 -1806489 -1968891 -1961685 -1948316 -1860038 -2014448 -2286805
17428 -2286805 -2126655 -1766347 -1461411 -1243940 -1122761 -1285433 -1173026 -1325026 -1304983 -1096665
17418 -1096665 -1099390 -1021773 -1029956 -1072460 -1204810 -1548231 -1744789 -1548837 -1677080 -1885728
17408 -1885728 -1937586 -1856150 -1745797 -1492654 -1361172 -1202832 -1412400 -1712479 -1959194 -1822998
$$ packed form
17482a217447l4086Q8736j77986Q5J76758K7569k9403J05525Q8175l15860l48570
17471a636504o8796p867k50120o2105K98768K88075j9224j16367N00603J68249
17461i05288k2394K76146p603j40175o3771j04623p7990p9469J49361Q3521j95537
17450a087822p2058J2413j42002j6403K4354M0054k92436j42884O58L67455l2495
17439a341166P4950R7043N7728l76964l18080j62402P206J3369Q8278j54410k72357
17428b286805J60150L60308L04936K17471J21179j62672J12407j52000K0043K08318
17418a096665k725P7617q183m2504j32350l43421j96558J95952j28243k08648
17408a885728n1858Q1436J10353K53143J31482J58340k09568l00079k46715J36196
$$ plain form
17398 -1822998 -1377426 -1362712 -1430869 -1486571 -1541821 -1469302 -1357261 -1393000 -1138905 -968795
17388 -968795 -1008467 -960568 -804249 -673465 -958936 -1092128 -1529654 -1640110 -1313724 -1135157
17378 -1135157 -1253135 -1272943 -1100096 -847573 -855066 -921388 -1067353 -1306035 -1310624 -1232336 -1258924
17367 -1258924 -1087441 -1082426 -1335367 -1426443 -1430178 -1504543 -1519599 -1489624 -1652106 -1769097 -1296238
17356 -1296238 -887196 -752287 -1075097 -1492694 -1764340 -1596107 -1389979 -1532661 -1372550
17347 -1372550 -1109377 -1670136 -2032073 -1899760 -1681958 -1477247 -1690741 -1360062 -1316135 -1159665
17337 -1159665 -1409175 -1431819 -1189260 -1321157 -1193118 -1154395 -1374526 -1561867 -1443370 -1363410
17327 -1363410 -1463841 -1441284 -1530264 -1252979 -1199724 -1237498 -1579821 -1796059 -1780228 -1575439
$$ packed form
17398a822998M45572J4714o8157n5702n5250P2519J12041l5739K54095J70110
17388i68795l9672M7899J56319J30784k85471j33192m37526j10456L26386J78567
17378a135157j17978j9808J72847K52523p493o6322j45965k38682m589P8288k6588
17367a258924J71483N015k52941r1076l735p4365j5056K9975j62482j16991M72859
17356a296238M09042J34909l22810m17597k71646J68233K06128j42682J60111
17347a372550K63173n60759l61937J32313K17802K04711k13494L30679M3927J56470
17337a159665k49510k2644K42559j31897J28039L8723k20131j87341J18497P9960
17327a363410j00431K2557q8980K77285N3255l7774l42323k16238J5831K04789
$$ plain form
17317 -1575439 -1617416 -1602030 -1608112 -1913900 -1594177 -1424575 -1639222 -1961600 -2208378 -1931977
17307 -1931977 -1946552 -1723383 -1753625 -1724824 -1981223 -2203408 -1845813 -1443516 -1313582 -1180539
17297 -1180539 -742806 -347290 120369 354750 513217 1163216 1725505 2293321 3035508
17288 3035508 3500982 3715664 4419515 5394863 7043356 9248958 12711830 17356114 23003742
17279 23003742 30015388 38010915 46096245 55257537 65300995 76270732 86943858 97731547
17271 97731547 112476272 139887802 188354418 254200889 289712023 255666784 201629489
17264 201629489 171152754 160308782 159522835 163077566 171197001 190315859 227597885
17257 227597885 282095237 320979182 301661676 250595892 213735167 196608789 190487443
$$ packed form
17317a575439m1977J5386o082l05788L19723J69602k14647l22378k46778K76401
17307a931977j4575K23169l0242K8801k56399k22185L57595M02297J29934J33043
17297a180539M37733L95516M67659K34381J58467O49999N62289N67816P42187
17288C035508M65474K14682P03851R75348J648493K205602L462872M644284N647628
17279B3003742P011646P995527Q085330R161292J0043458J0969737J0673126J0787689
17271I7731547J4744725K7411530M8466616O5846471L5511134l4045239n4037295
17264B01629489l0476735j0843972p85947L554731Q119435J9118858L7282026
17257B27597885N4497352L8883945j9317506n1065784l6860725j7126378o121346
$$ plain form
17250 190487443 190274907 197649023 218548525 258585615 309338529 327113086 288885996
17243 288885996 239964737 210468256 197060551 191226342 188649504 191130274 204336402
17236 204336402 236262625 286413990 315756109 277826493 211607717 166100212 140266450
17229 140266450 124901356 114462961 106053938 98524007 92269412 87752383 83875562 79213542
17221 79213542 74107271 69480105 65592565 62186515 58943636 55783305 52910765 50442135
17213 50442135 48732066 46884678 44563577 42268017 40481479 38981348 37517489 36040360
17205 36040360 34823087 33556169 32593800 31420812 30331829 29419091 28389648 27589397
17197 27589397 26976091 26002846 25221209 24562327 23795256 22916838 22266615 21442363 20780268
$$ packed form
17250A90487443k12536P374116K0899502M0037090N0752914J7774557l8227090
17243B88885996m8921259k9496481j3407705n834209k576838K480770J3206128
17236B04336402L1926223N0151365K9342119l7929616o6218776m5507505k5833762
17229A40266450j5365094j0438395q409023p529931o254595m517029l876821m662020
17221G9213542n106271m627166l887540l406050l242879l160331k872540k468630
17213E0442135j710069j847388k321101k295560j786538j500131j463859j477129
17205C6040360j217273j266918r62369j172988j088983r12738j029443q00251
17197B7589397o13306r73245p81637o58882p67071q78418o50223q24252o62095
$$ plain form
17188 20780268 20436652 19541693 18607678 18082138 17540836 17012646 16867189 16523647 16076963
17179 16076963 15867496 15584472 15179877 14826087 14323524 14037035 13885636 13846526 13699480
17170 13699480 13404809 12838479 12677630 12457387 11888813 11468788 11143128 10804804 10447535
17161 10447535 9939643 9625470 9239751 9266321 9253957 9266785 9276404 9201176 8913060 8727090
17151 8727090 8791591 8326887 7969001 7985864 7603950 7620763 7623311 7372219 7179506 7162601
17141 7162601 7108407 7152383 7210899 7279804 7096820 6775921 6698795 6967185 7106586 6831881
17131 6831881 6606447 6474948 6175688 5845784 5909942 5907247 5706192 5315309 5334830 5422727
17121 5422727 5269000 4993351 5005299 5470294 5784831 5828324 5579135 5331484 5356657 5231061
$$ packed form
17188B0780268l43616q94959r34015n25540n41302n28190j45457l43542m46684
17179A6076963k09467k83024m04595l53790n02563k86489j51399l9110j47046
17170A3699480k94671n66330j60849k20243n68574m20025l25660l38324l57269
17161A0447535n07892l14173l85719K6570j2364J2828R619p5228k88116j85970
17151H727090O4501m64704l57886J6863l81914J6813K548k51092j92713j6905
17141G162601n4194M3976N8516O8905j82984l20899p7126K68390J39401k74705
17131F831881k25434j31499k99260l29904O4158k695k01055l90883J9521Q7897
17121E422727j53727k75649J1948M64995L14537M3493k49189k47651K5173j25596
$$ plain form
17111 5231061 5165384 5273078 5417510 5020189 4513348 4208632 4082736 4405932 4606858 4355756
17101 4355756 4031143 3852072 3979350 4077498 4245230 4385583 4327271 4152598 3849564 3487644
17091 3487644 3436506 3758724 3927817 3620781 3541150 3561824 3440772 3419665 3407760 3479984
17081 3479984 3069678 3048536 3015220 2982792 2901144 2789653 2945078 2943345 2962831 2728683 2605221
17070 2605221 2717254 2387062 2515756 2768033 3005822 2790323 2837167 2722375 2543447 2437086
17060 2437086 2693156 2899443 2831611 2878848 2731993 2543434 2250141 2396797 2493745 2313669
17050 2313669 1878140 2202707 2409345 2495930 2422692 2211290 1821691 1961104 2410741 2298173
17040 2298173 1953034 1656942 1909498 1935007 1755056 1680163 1570561 1596398 1659055 1544282
$$ packed form
17111E231061o5677J07694J44432l97321n06841l04716j25896L23196K00926k51102
17101D355756l24613j79071J27278R8148J67732J40353n8312j74673l03034l61920
17091C487644n1138L22218J69093l07036p9631K0674j21052k1107j1905P2224
17081C479984m10306k1142l3316l2428q1648j11491J55425j733J9486k34148j23462
17070B605221J12033l30192J28694K52277K37789k15499M6844j14792j78928j06361
17060B437086K56070K06287o7832M7237j46855j88559k93293J46656R6948j80076
17050B313669m35529L24567K06638Q6585p3238k11402l89599J39413M49637j12568
17040B298173l45139k96092K52556K5509j79951p4893j09602K5837O2657j14773
$$ plain form
17030 1544282 1398233 1380522 1750098 1857172 1785670 1802719 1798796 1832311 1660470 1687015 1301701
17019 1301701 878756 1012426 1239685 1372555 1298343 1310219 1059754 912985 950229 877366
17009 877366 970027 1113044 1217982 1174229 1230696 1745492 1649926 1580024 1526176 1273534 1080192
16998 1080192 1386691 1377550 1401800 1567735 1387370 1041474 1062256 1472403 1471241 1492277 1182669
16987 1182669 1062605 1045923 1150645 1304780 1453711 1130490 815152 783651 942400 505207
16977 505207 586139 502950 549482 711863 966350 1141067 1035482 869881 642522 810772
16967 810772 942985 890959 1088822 1348486 1700357 1581597 1571487 1423693 1170077 1174063
16957 1174063 1139419 1076158 909573 585548 871666 1152424 1036826 877227 1052530 952867
$$ packed form
17030A544282j46049j7711L69576J07074p1502J7049l923L3515j71841K6545l85314
17019A301701m22945J33670K27259J32870p4212J1876k50465j46769L7244p2863
17009H77366R2661J43017J04938m3753N6467N14796r5566o9902n3848k52642j93342
16998A080192L06499r141K4250J65935j80365l45896K0782M10147j162K1036l09608
16987A182669j20064j6682J04722J54135J48931l23221l15338l1501J58749m37193
16977E05207Q0932q3189M6532J62381K54487J74717j05585j65601k27359J68250
16967H10772J32213n2026J97863K59664L51871j18760j0110j47794k53616L986
16957A174063l4644o3261j66585l24025K86118K80758j15598j59599J75303r9663
$$ plain form
16947 952867 945865 859299 774483 782914 762244 694860 742535 751722 660668 653237 1029007 1379621
16935 1379621 1436223 1702820 1761226 1119930 1112911 1041899 1076052 894507 580360 303125
16925 303125 402098 492078 696743 664217 398469 271144 125634 -7812 36299 10561
16915 10561 275496 597290 597306 618822 561564 486226 800429 991591 908264 842499 852885
16904 852885 1061169 1249352 1402903 1383882 821996 511485 543533 454541 588050 511720
16894 511720 481088 541407 364987 202086 202058 396067 415258 365491 215118 138368 34451
16883 34451 8585 -60576 234994 445251 504833 838177 951706 901163 969499 800002 411025
16872 411025 184917 -90010 30632 280565 254722 510430 542758 608756 872928 862105
$$ packed form
16947I52867p002q6566q4816Q431k0670o7384M7675R187r1054p431L75770L50614
16935A379621N6602K66597N8406o41296p019p1012L4153j81545l14147k77235
16925C03125R8973Q9980K04665l2526k65748j27325j45510j33446M4111k5738
16915A0561K64935L21794J6K1516n7258p5338L14203J91162q3327o5765J0386
16904H52885K08284J88183J53551j9021n61886l10511L2048q8992J33509p6330
16894E11720l0632O0319j76420j62901k8J94009J9191m9767j50373p6750j03917
16883C4451k5866o9161K95570K10257N9582L33344J13529n0543O8336j69497l88977
16872D11025k26108k74927J20642K49933k5843K55708L2328O5998K64172j0823
$$ plain form
16862 862105 815067 789203 895239 1025421 902100 722262 713263 736397 971489 808185
16852 808185 730145 546015 454174 402721 616277 761846 650675 545935 585000 396257
16842 396257 22956 -82708 275453 464775 291603 -46014 24393 163946 31092 329036
16832 329036 613117 789694 583818 415091 379891 678399 757508 353378 253204 504024
16822 504024 366600 492159 571318 474616 250394 387734 495074 547920 638762 286274
16812 286274 251048 330183 287819 254673 347623 137999 -34998 -295745 -68603 57032
16802 57032 229622 499218 285243 123621 1836 138873 188553 27232 -125742 -135169
16792 -135169 399669 925291 839565 695828 596165 247966 316306 256942 240366 288974 432259
$$ packed form
16862H62105m7038k5864J06036J30182j23321j79838q999K3134K35092j63304
16852H08185p8040j84130r1841n1453K13556J45569j11171j04740L9065j88743
16842C96257l73301j05664L58161J89322j73172l37617P0407J39553j32854K97944
16832C29036K84081J76577k05876j68727l5200K98508P9109m04130j00174K50820
16822E04024j37424J25559P9159r6702k24222J37340J07340N2846R0842l52488
16812B86274l5226P9135m2364l3146R2950k09624j72997k60747K27142J25635
16802E7032J72590K69596k13975j61622j21785J37037M9680j61321j52974r427
16792a35169N34838N25622q5726j43737r9663l48199O8340n9364j6576M8608J43285
$$ plain form
16781 432259 459202 338796 309349 53046 -69432 -49705 83622 553371 775065 873805
16771 873805 840719 624172 616443 563109 188305 -171262 -375266 -132391 408468 307124
16761 307124 -179750 -251037 -194857 -65623 36332 270511 293634 -194001 -216682 100150
16751 100150 160424 458094 298645 304605 285521 452375 879783 798537 365722 4208
16741 4208 -9271 -26726 -56013 -319905 -213703 54502 -194274 -59992 -158383 -144817 230704
16730 230704 211471 466068 708835 400856 54917 -18111 19546 184389 516935 544792
16720 544792 511598 281214 181858 -347891 -174998 -143096 -321917 -136352 263959 319093
16710 319093 668619 986054 1185168 1551496 1774076 1774720 1681852 1391520 1238968 1302047
$$ packed form
16781D32259K6943j20406k9447k56303j22478J9727J33327M69749K21694R8740
16771H73805l3086k16547p729n3334l74804l59567k04004K42875N40859j01344
16761C07124m86874p1287N6180J29234J01955K34179K3123m87635k2681L16832
16751A00150O0274K97670j59449N960j9084J66854M27408q1246m32815l61514
16741D208j3479j7455k9287k63892J06202K68205k48776J34282r8391J3566L75521
16730B30704j9233K54597K42767l07979l45939p3028L7657J64843L32546K7857
16720E44792l3194k30384r9356n29749J72893L1902j78821J85565M00311N5134
16710C19093L49526L17435J99114L66328K22580O44r2868k90332j52552O3079
$$ plain form
16700 1302047 1468240 1342584 1259246 1450287 1451954 1388697 1780983 1681491 1456768 1176539
16690 1176539 1392945 1628623 1361240 1230034 1301652 1054361 1089729 1359177 1723711 1977885
16680 1977885 1932523 1567140 1261872 1066678 1201378 1297636 1182532 1042881 1072833 1080100
16670 1080100 1368600 1505530 1497813 1546680 1249488 907494 561715 617699 448993 260615
16660 260615 116806 208444 345220 446041 406607 104919 221983 583858 242118 215530
16650 215530 566193 927676 821882 743383 624864 393073 78346 2122 -35359 53470
16640 53470 256315 187606 73502 130721 -20331 -150420 -249151 -294714 -220500 179910 177141
16629 177141 299045 613711 486710 471615 539362 340417 343301 415082 366862 210819 368649
$$ packed form
16700A302047J66193j25656q3338J91041J667o3257L92286r9492k24723k80229
16690A176539K16406K35678k67383j31206P1618k47291L5368K69448L64534K54174
16680A977885m5362l65383l05268j95194J34700R6258j15104j39651K9952P267
16670A080100K88500J36930p717M8867k97192l41994l45779N5984j68706j88378
16660B60615j43809R1638J36776J00821l9434l01688J17064L61875l41740k6588
16650B15530L50663L61483j05794p8499j18519k31791l14727p6224l7481Q8829
16640E3470K02845o8709j14104N7219j51052j30089r8731m5563P4214M00410k769
16629A77141J21904L14666j27001j5095O7747j98945K884P1781m8220j56043J57830
$$ plain form
16618 368649 299235 209954 263293 688800 662451 236589 283817 482305 301803 -111039
16608 -111039 -305532 46999 700392 945080 660116 267214 -67129 -392959 68416 551375
16598 551375 419063 275092 360035 165035 124275 -144845 -192239 -18678 105860 260533
16588 260533 234464 161460 275397 506946 339286 443674 339325 195226 163988 380284
16578 380284 335844 462681 207679 92303 -110767 -45320 -117199 41203 267206 233117
16568 233117 140589 179310 277443 201802 321998 132449 266258 55700 -69552 95631
16558 95631 124395 -278764 -375569 -444924 -908881 -681414 -204704 115854 285137 285156 230525
16547 230525 95356 356945 26796 7744 239971 -40570 121848 324030 401611 331348
$$ packed form
16618C68649o9414q9281N3339M25507k6349m25862M7228J98488j80502m12842
16608a11039j94493L52531O53393K44688k84964l92902l34343l25830M61375M82959
16598E51375j32312j43971Q4943j95000m0760k69120m7394J73561J24538J54673
16588B60533k6069p3004J13937K31549j67660J04388j04349j44099l1238K16296
16578C80284m4440J26837k55002j15376k03070O5447p1879J58402K26003l4089
16568B33117r2528L8721R8133p5641J20196j89549J33809k10558j25252J65183
16558I5631K8764m03159r6805o9355m63957K27467M76710L20558J69283J9n4631
16547B30525j35169K61589l30149j9052K32227k80541J62418K02182P7581p0263
$$ plain form
16537 331348 62473 -177371 -134246 -159802 210872 478175 759451 636959 427613 291013
16527 291013 167939 58859 156831 458796 434483 8560 -261183 -213063 -164153 -284245
16517 -284245 -161203 159115 -87649 -164040 -126449 -286269 -96436 -8293 -277797 -447009
16507 -447009 -663493 -457345 -173215 -135997 -106019 -7878 198073 59554 -99926 -375711
16497 -375711 -376644 152196 188824 -188686 -266069 164051 119282 -99843 -29021 -46758 -113619
16486 -113619 -111493 -201653 -203727 -126177 66207 184745 420803 834612 435188 281454 147746
16475 147746 240498 248734 -247137 -15817 226014 237554 113315 -123155 -110877 425561
16465 425561 425251 -18002 31789 404742 310057 229440 252965 -10285 -412490 -131961 -247074
$$ packed form
16537C31348k68875k39844M3125k5556L70674K67303K81276j22492k09346j36600
16527B91013j23074j09080R7972L01965k4313m25923k69743M8120M8910j20092
16517b84245J23042L20318k46764p6391L7591j59820J89833Q8143k69504j69212
16507d47009k16484K06148K84130L7218K9978R8141K05951j38519j59480k75785
16497c75711r33N28840L6628l77510p7383M30120m4769k19125P0822j7737o6861
16486a13619K126r0160k074P7550J92384J18538K36058M13809l99424j53734j33708
16475A47746R2752Q236m95871K31320K41831J1540j24239k36470J2278N36438
16465D25561l10m43253M9791L72953r4685q0617K3525k63250m02205K80529j15113
$$ plain form
16454 -247074 -326700 15576 -32789 -273204 -183932 79768 160914 205203 78612 137759 324014
16443 324014 431524 400184 151842 -219287 -405827 -401634 -140499 5940 -188544 -427144
16433 -427144 -462120 -534380 -242563 -198662 -327099 -181418 -239632 -459868 -662968 -692117
16423 -692117 -654510 -473946 -636038 -470609 -534859 -715078 -585298 -108217 102416 -308118
16413 -308118 -433074 -211662 38939 150178 78099 52784 65601 55800 -385043 -814102
16403 -814102 -242518 -196743 -76004 102369 16858 -236885 -380745 -274911 87785 267824
16393 267824 107399 21659 -246372 -506813 -474566 -105713 -228516 -251143 -344265 -366812
16383 -366812 -515195 -544111 -56000 268543 309167 -9310 43665 279638 371832 191864
$$ packed form
16454b47074p9626L42276m8365k40415Q9272K63700Q1146M4289j26591N9147J86255
16443C24014J07510l1340k48342l71129j86540M193K61135J46439j94484k38600
16433d27144l4976p2260K91817M3901j28437J45681n8214k20236k03100k9149
16423f92117L7607J80564j62092J65429o4250j80219J29780M77081K10633m10534
16413c08118j24956K21412K50601J11239p2079k5315J2817r801m40843m29059
16403h14102N71584M5775J20739J78373q5511k53743j43860J05834L62696J80039
16393B67824j60425q5740k68031k60441L2247L68853j22803k2627r3122k2547
16383c66812j48383k8916M88111L24543M0624l18477N2975K35973R2194j79968
$$ plain form
16373 191864 73578 -118062 -374590 -301074 -32658 -216433 -357675 -91099 73982 -2951
16363 -2951 -89768 -147884 -158611 190142 359015 246282 169246 27866 44763 64611 68621
16352 68621 167848 -190083 -555480 -687573 -150823 100033 -209198 -350841 -177579 -145181
16342 -145181 -317257 -580410 -613546 -272031 -212588 -353749 -509305 -525748 -683695 -669203
16332 -669203 -439968 -178149 126529 198480 127059 -136895 13995 4774 -125040 -136855
16322 -136855 -282928 -507592 -559629 -313432 -376193 -346731 -425648 -386970 -289938 -166468 -353709
16311 -353709 -235354 -191788 -229850 -128991 -67596 -120857 -166550 -347413 -406050 -425398 -334070
16300 -334070 -326226 -387191 -748077 -554522 -617838 -795146 -673768 -274356 -162367 -512092
$$ packed form
16373A91864j18286j91640k56528P3516K68416j83775j41242K66576J65081p6933
16363b951q6817n8116j0727L48753J68873j12733p7036j41380J6897J9848M010
16352F8621R9227l57931l65397j32093N36750K50856l09231j41643J73262L2398
16342a45181j72076k63153l3136L41515N9443j41161j55556j6443j57947J4492
16332f69203K29235K61819L04678P1951p1421k63954J50890r221j29814j1815
16322a36855j46073k24664n2037K46197o2761K9462p8917L8678R7032J23470j87241
16311c53709J18355M3566l8062J00859O1395n3261m5693j80863n8637j9348R1328
16300c34070P844o0965l60886J93555o3316j77308J21378L99412J11989l49725
$$ plain form
16290 -512092 -612611 -730198 -569136 -27628 172337 191837 -32869 -24667 141522 49112
16280 49112 69291 192878 134267 -32323 33491 -146811 -152342 -314069 -324594 -91027 -59609
16269 -59609 3613 137577 220656 -196469 -280632 -299038 -24360 -170079 -26160 44723 -180575
16258 -180575 -148756 -26590 -2269 -57778 -393620 -686565 -344824 -185135 -71288 -168577
$$ packed form
16290e12092j00519j17587J61062N41508J99965J9500k24706Q202J66189r2410
16280D9112K0179J23587n8611j66590O5814j80302n531j61727j0525K33567L1418
16269e9609O3222J33964Q3079m17125q4163j8406K74678j45719J43919P0883k25298
16258a80575L1819J22166K4321n5509l35842k92945L41741J59689J13847r7289
$$ [...]
##END NTUPLES=NMR SPECTRUM
##END=
