##TITLE=Analysis number 322470
Compound Code cc 55614
Book Reference 423/102
Project Code adrs
Chemist Name bruced
##JCAMPDX= 6.0         $$ Bruker NMR JCAMP-DX V2.0
##DATA TYPE= NMR SPECTRUM
##DATA CLASS= NTUPLES
##ORIGIN= Bruker BioSpin GmbH
##OWNER= nmr
$$ XWIN-NMR		Version 3.5
$$ Wed Sep 27 11:47:19 2006 GMT Daylight Time (UT+1h)  MAYBRIDGE\nmr@NMR_250MHZ
##.OBSERVE FREQUENCY= 250.131544655141
##.OBSERVE NUCLEUS= ^1H
##.ACQUISITION MODE= SIMULTANEOUS (DQD)
##.ACQUISITION SCHEME= undefined
##.AVERAGES= 16
##.DIGITISER RES= 18
##SPECTROMETER/DATA SYSTEM= dpx250
##.PULSE SEQUENCE= zg30
##.SOLVENT NAME= CDCl3
##.SHIFT REFERENCE= (INTERNAL, CDCl3, 0, 16.522)
##AUDIT TRAIL= $$ (NUMBER, WHEN, WHO, WHERE, WHAT)
$$ ##TITLE= Audit trail, XWIN-NMR		Version 3.5
$$ ##JCAMPDX= 5.01
$$ ##ORIGIN= Bruker BioSpin GmbH
$$ ##OWNER= nmr
$$ C:\u/data/dgb/nmr/ADRS/1480/pdata/1/auditp.txt
$$ ##AUDIT TRAIL=  $$ (NUMBER, WHEN, WHO, WHERE, WHAT)
(   1,<2006-09-27 11:46:51.10 +100>,<MAYBRIDGE\nmr>,<NMR_250MHZ>,
      <created by zg, POWCHK disabled, PULCHK disabled
       configuration hash MD5:
       E2 DF 36 D8 04 B2 41 60 5A D7 A3 38 5A 4B D0 FE
       data hash MD5: 64K
       C8 A3 0D 74 2D AF 99 7F D4 D8 EE 57 B8 11 F4 2B>)
(   2,<2006-09-27 11:47:07.12 +100>,<MAYBRIDGE\nmr>,<NMR_250MHZ>,
      <Start of raw data processing
       ef LB = 0.3 FT_mod = 6 PKNL = 1 SI = 32K 
       data hash MD5: 32K
       AB 52 08 93 48 9E BC 9B C4 40 96 BE 63 88 3A 07>)
(   3,<2006-09-27 11:47:08.91 +100>,<MAYBRIDGE\nmr>,<NMR_250MHZ>,
      <apk 
       data hash MD5: 32K
       BB 50 FB B2 52 4A A4 50 CA 0A CB C9 F7 48 F2 E4>)
(   4,<2006-09-27 11:47:09.95 +100>,<MAYBRIDGE\nmr>,<NMR_250MHZ>,
      <abs ABSG = 5 
       data hash MD5: 32K
       4B 29 DF 80 E3 D8 52 D3 28 98 59 DD CE B2 A9 FC>)
$$ ##END=
$$ 
$$ hash MD5
$$ 11 9C 2A A7 6D 19 56 64 AB 35 CE 49 67 8D 2F 16
##$RELAX= 
##$RELAX= 
##$RELAX= 
##$RELAX= 
##$RELAX= 
##$RELAX= 
##$RELAX= 
$$ Bruker specific parameters
$$ --------------------------
##$DU= <C:\u>
##$EXPNO= 1480
##$NAME= <ADRS>
##$PROCNO= 1
##$TYPE= <nmr>
##$USER= <dgb>
##$AMP= (0..31)
100 100 100 100 100 100 100 100 100 100 100 100 100 100 100 100 100 100 
100 100 100 100 100 100 100 100 100 100 100 100 100 100 
##$AQSEQ= 0
##$AQ_mod= 3
##$AUNM= <au_zg>
##$AUTOPOS= <17 >
##$BF1= 250.13
##$BF2= 250.13
##$BF3= 250.13
##$BF4= 250.13
##$BF5= 500.13
##$BF6= 500.13
##$BF7= 500.13
##$BF8= 500.13
##$BYTORDA= 1
##$CFDGTYP= 0
##$CFRGTYP= 5
##$CHEMSTR= <none>
##$CNST= (0..31)
1 1 145 1 1 1 1 1 1 1 1 1 1 1 1 1 1 1 1 1 1 1 1 1 1 1 1 1 1 1 1 1 
##$CPDPRG= <>
##$CPDPRG1= <>
##$CPDPRG2= <>
##$CPDPRG3= <>
##$CPDPRG4= <mlev>
##$CPDPRG5= <mlev>
##$CPDPRG6= <mlev>
##$CPDPRG7= <mlev>
##$CPDPRG8= <mlev>
##$CPDPRGB= <>
##$CPDPRGT= <>
##$D= (0..31)
0 1 0 0 0 0 0 0 0 0.06 0 0 0 0 0 0 0.0002 0 0 0 0 0 0 0 0 0 0 0 0 0 0 
0 
##$DATE= 1159354008
##$DBL= (0..7)
120 120 120 120 120 120 120 120 
##$DBP= (0..7)
150 150 150 150 150 150 150 150 
##$DBP07= 0
##$DBPNAM0= <>
##$DBPNAM1= <>
$$ [...]
##$SUBNAM7= <"">
##$SUBNAM8= <"">
##$SUBNAM9= <"">
##$SW= 20.6930455092707
##$SWIBOX= (0..15)
0 0 3 0 0 0 0 0 0 0 0 0 0 0 0 0 
##$SW_h= 5175.983436853
##$TD= 65536
##$TD0= 1
##$TE= 295.16
##$TE2= 300
##$TE3= 300
##$TEG= 300
##$TL= (0..7)
0 120 120 120 120 120 120 120 
##$TP= (0..7)
150 150 150 150 150 150 150 150 
##$TP07= 0
##$TPNAME0= <>
##$TPNAME1= <>
##$TPNAME2= <>
##$TPNAME3= <>
##$TPNAME4= <>
##$TPNAME5= <>
##$TPNAME6= <>
##$TPNAME7= <>
##$TPOAL= (0..7)
0.5 0.5 0.5 0.5 0.5 0.5 0.5 0.5 
##$TPOFFS= (0..7)
0 0 0 0 0 0 0 0 
##$TUNHIN= 0
##$TUNHOUT= 0
##$TUNXOUT= 0
##$USERA1= <user>
##$USERA2= <user>
##$USERA3= <user>
##$USERA4= <user>
##$USERA5= <user>
##$V9= 5
##$VALIST= <valist>
##$VCLIST= <CCCCCCCCCCCCCCC>
##$VD= 0
##$VDLIST= <DDDDDDDDDDDDDDD>
##$VPLIST= <PPPPPPPPPPPPPPP>
##$VTLIST= <TTTTTTTTTTTTTTT>
##$WBST= 1024
##$WBSW= 4
##$XGAIN= (0..3)
0 0 0 0 
##$XL= 0
##$YL= 0
##$YMAX_a= 327193
##$YMIN_a= -420582
##$ZGOPTNS= <>
##$ZL1= 120
##$ZL2= 120
##$ZL3= 120
##$ZL4= 120
##$ABSF1= 16.522
##$ABSF2= -4.171173
##$ABSG= 5
##$ABSL= 3
##$ALPHA= 0
##$AQORDER= 0
##$ASSFAC= 0
##$ASSFACI= 0
##$ASSFACX= 0
##$ASSWID= 0
##$AUNMP= <proc_1d>
##$AZFE= 0.1
##$AZFW= 0.1
##$BCFW= 0
##$BC_mod= 0
##$BYTORDP= 0
##$COROFFS= 0
##$CY= 12.5
##$DATMOD= 1
##$DC= 0
##$DFILT= <>
##$DTYPP= 0
##$F1P= 14.0000005364418
##$F2P= -0.99999901652339
##$FCOR= 0.5
##$FTSIZE= 32768
##$FT_mod= 6
##$GAMMA= 0
##$GB= 0
##$INTBC= 1
##$INTSCL= 1
##$ISEN= 128
##$LB= 0.3
##$LEV0= 0
##$LPBIN= 0
##$MAXI= 10000
##$MC2= 0
##$MEAN= 0
##$ME_mod= 0
##$MI= 0
##$NCOEF= 0
##$NC_proc= -5
##$NLEV= 6
##$NOISF1= 0
##$NOISF2= 0
##$NSP= 0
##$NTH_PI= 0
##$NZP= 0
##$OFFSET= 16.522
##$PC= 1
##$PHC0= 145.9765
##$PHC1= 6.071639
##$PH_mod= 1
##$PKNL= yes
##$PPARMOD= 0
##$PSCAL= 4
##$PSIGN= 0
##$REVERSE= no
##$SF= 250.13
##$SI= 32768
##$SIGF1= 0
##$SIGF2= 0
##$SINO= 400
##$SIOLD= 32768
##$SREGLST= <1H.CDCl3>
##$SSB= 0
##$STSI= 32768
##$STSR= 0
##$SW_p= 5175.98343685301
##$SYMM= 0
##$S_DEV= 0
##$TDeff= 65536
##$TDoff= 0
##$TI= <Analysis number 999999
Compound Code 99
Book Reference 9
Project Code 9>
##$TILT= no
##$TM1= 0
##$TM2= 0
##$TOPLEV= 0
##$USERP1= <user>
##$USERP2= <user>
##$USERP3= <user>
##$USERP4= <user>
##$USERP5= <user>
##$WDW= 1
##$XDIM= 32768
##$YMAX_p= 489176854
##$YMIN_p= -462713
$$ End of Bruker specific parameters
$$ ---------------------------------
##NTUPLES= NMR SPECTRUM
##VAR_NAME=  FREQUENCY,     SPECTRUM/REAL,   SPECTRUM/IMAG
##SYMBOL=    X,             R,               I
##VAR_TYPE=  INDEPENDENT,   DEPENDENT,       DEPENDENT
##VAR_FORM=  AFFN,          ASDF,            ASDF
##VAR_DIM=   32768,         32768,           32768
##UNITS=     HZ,            ARBITRARY UNITS, ARBITRARY UNITS
##FACTOR=    0.157963299565203, 1,           1
##FIRST=     4132.6476996994, 0,             0
##LAST=      -1043.33573715361, 0,           0
##MIN=       -1043.33573715361, -462713,     0
##MAX=       4132.6476996994, 489176854,     0
$$ Real data points
##PAGE= N=1
##DATA TABLE= (X++(R..R)), XYDATA
$$ [...]
17407C66030K525q12O4849k8690M7804J14433Q856l9168J1282O3725L3318j7143
17395F27009M523M6368n4070k1185k2175J1709K01808J31761m20q7116j8525n971
17383H13716j41620j78688j70179p5739N555K994L5557O5047R0404K4433j92210
17372B79270m0010O4284j05988k6377J04873L5859j38727r6898q9239K7361L4014
17361D8422Q4495o0151o5784O8227J35514J10492J9871K7442J20937J11856Q2113
17350F83434O3505O5219O5646m723K5001O0776K0294n9131j14789K7187R94m3357
17338G90056r0470J9003R728J1290J2364o5746M7425N0266L6421Q8117m9861o0856
17326G97737j17210r2870j69978M4989N9163k0781J01358O8929K2250p1440j21937
$$ y = [366030, 368555, 367743, 432592, 403902, 451706, 566139, 574995, 535827, 547109, 610834, 644152, 627009, 631532, 677900, 623830, 602645, 580470, 592179, 793987, 925748, 925328, 838212, 819687, 813716, 672096, 493408, 323229, 247490, 253045, 256039, 291596, 356643, 447047, 471480, 279270, 239260, 303544, 197556, 171179, 276052, 311911, 173184, 76286, -12953, 14408, 48422, 132917, 72766, 6982, 75209, 210723, 321215, 341086, 368528, 489465, 601321, 683434, 746939, 812158, 877804, 873081, 898082, 958858, 979152, 920021, 805232, 832419, 833413, 790056, 699586, 718589, 728317, 739607, 751971, 686225, 733650, 783916, 820337, 908454, 858593, 797737, 680527, 587657, 417679, 462668, 521831, 501050, 602408, 671337, 693587, 622147, 500210]
17315E00210k8007k517o3857J9715N1014N247m0004o1832j38431L6163P8894P3177
17303D29772j36230m3566j9075K0113j22147n573l3568K3984N2010n8226O8262
17292A75756J01901n1666Q6160o2329m0821k0092l1902j09176N9103J26050J32678
17281C65662j8653o7820n295N4877j19172j60409J20347J79690M4631l9914Q7760
17270D41704j14542j2953O985r9266K0572P1638l5696J2321k5922r7327M1171
17259B08685J6370l1275m9649J01561M2577k2846L72o0964k8218O1596L2284J1052
17247B81545M5305n6282j47852J2287j7509P8095M6855O9524J46477L1602j29534
17236C60513o4344L9004J245K6200M664O4042J14550O4812J76514j0137n8603
$$ y = [500210, 472203, 469686, 405829, 425544, 476558, 481805, 441801, 379969, 241538, 277701, 356595, 429772, 293542, 249976, 230901, 251014, 128867, 123294, 89726, 113710, 165720, 107494, 175756, 277657, 225991, 312151, 249822, 209001, 188909, 157007, 47831, 106934, 232984, 365662, 347009, 279189, 273894, 328771, 209599, 49190, 169537, 349227, 393858, 353944, 441704, 327162, 314209, 321194, 221928, 242500, 314138, 278442, 290763, 264841, 167514, 208685, 225055, 193780, 144131, 245692, 288269, 265423, 265795, 204831, 176613, 238209, 270493, 281545, 326850, 270568, 122716, 135003, 117494, 195589, 242444, 311968, 458445, 490047, 360513, 296169, 335173, 336418, 362618, 367282, 431324, 545874, 610686, 787200, 777063, 718460]
17225G18460n0870J59J38070O2768m470R7535N9055K8271M5903j40841q9260L5473
17213I00253J6290j27439K7590O0336N197j9473j8046j4802j12548M0977J43816
17202I02151r3970o7079P551L6055J20330j1940r2116J11100J17059K2041l2637
17191A018545N2879J34056P3404R2028R4520R9962J2100J34359J79110J28283
17181B019246J34791P0482J04242J67989L49549M04669M16099O11771N61973O20043
17171E460854R63883J384461J500459K335347L401032M440225M544340K975168
17163B7005769J95177k394689l248803k550938j042867L92023J485164K977505
17155B2818341M780996P872311J3044954K1937815L4345340M6293888M9088169
$$ y = [718460, 667590, 667749, 805819, 868587, 864117, 961652, 1020707, 1048978, 1094881, 954040, 864780, 900253, 916543, 789104, 816694, 877030, 882227, 862754, 844708, 829906, 717358, 758335, 902151, 808181, 741102, 748653, 784708, 905038, 893098, 800982, 912082, 1029141, 1051182, 1018545, 1071424, 1205480, 1278884, 1370912, 1465432, 1565394, 1577494, 1711853, 1890963, 2019246, 2154037, 2224519, 2328761, 2496750, 2846299, 3250968, 3667067, 4278838, 4840811, 5460854, 6424737, 7809198, 9309657, 11645004, 15046036, 19486261, 24030601, 27005769, 27200946, 24806257, 21557454, 19006516, 17963649, 18355672, 19840836, 22818341, 27599337, 35471648, 48516602, 70454417, 104799757, 151093645, 200181814]
17148B00181814L5308149Q931501j8937355l3442249l4597119k9507387k4383079
17141A03554275j9028526j2726713o295565j5756N169103Q040357O488821N14640
17133H5700636p190334j2556763j3032507j0369663p187151m618886l066405j961816
17125B5717111j395814j288017r65503o75743n02505k39000j5859N1093L11263
17116B0997026N05883Q09912J573039K598741M470765P285426J0419543J2456795
17108F1117130J1199071N959234r67490o202640o464566k694325K872594Q921618
17100G3740626J4859513K0406819K5343321K9988897L1930719K7323065J0859630
17093B34452590j3382354l4658235m2223327l5939703k4887063j5588364r991781
$$ y = [200181814, 235489963, 244421464, 225484109, 192041860, 157444741, 127937354, 103554275, 84525749, 71799036, 65503471, 65487715, 70656818, 78697175, 85185996, 85700636, 78510302, 65953539, 52921032, 42551369, 35364218, 30745332, 27678927, 25717111, 24321297, 23033280, 22067777, 21392034, 20889529, 20650529, 20634670, 20685763, 20997026, 21502909, 22312821, 23885860, 26484601, 30955366, 38240792, 48660335, 61117130, 72316201, 78275435, 77307945, 71105305, 64640739, 61946414, 64819008, 73740626, 88600139, 109006958, 134350279, 164339176, 196269895, 223592960, 234452590, 221070236, 186412001, 144188674, 108248971, 83361908, 67773544, 57781763]
17086E7781763o735289m553328l136108k209910j111937j08660P87715J292496
17078D2006742M61617j422911l366165m502548m088247l014665k108248j588152
17070B2377423j411833j116366r22161q25782p18862o76930m38932k98921k07754
17061A5759882j23305m3927J51366K79142M83007L48510J37816J44113J75483
17052A7312087J45519O1414L25640M86902N14328O27504O76115P09954P12011
17043B1571474M13633K2472l09924q95845j341748j543155j318380j285537j091550
17034A4221440q31522n33223n43628o64781n85377l70404k72597l60912k97797
17025I761199j93677l77865l04553n26916m84940m41200j86648k37148k79621
$$ y = [57781763, 51046474, 46493146, 43357038, 41147128, 40035191, 39926531, 40714246, 42006742, 42468359, 41045448, 37679283, 33176735, 29088488, 26073823, 23965575, 22377423, 20965590, 19849224, 18927063, 18101281, 17382419, 16705489, 16266557, 15967636, 15759882, 15636577, 15592650, 15744016, 16023158, 16506165, 16854675, 16992491, 17136604, 17312087, 17457606, 17519020, 17844660, 18331562, 18845890, 19473394, 20149509, 20859463, 21571474, 21985107, 22007579, 21697655, 20801810, 19460062, 17916907, 16598527, 15312990, 14221440, 13389918, 12856695, 12313067, 11648286, 11062909, 10692505, 10419908, 10058996, 9761199, 9567522, 9189657, 8885104, 8358188, 7873248, 7432048, 7245400, 7008252, 6728631]
17016F728631l13037k69995j47421j90680k30229q2714j27527j34256k46511k10979
17006D775282j01310L6583j94955j84656k18432o3252P4310j10328j51873r7301
16996C764068n8250j00749r5231O8082r2150m4071j22219j88841m6568J82120
16986C266191J49197m1613k41721q4690J3385k3451k58245j17656o5052M1274
16976B637619J1235j76884j56094l5333k6280n7832J0836l9757K4564j4873L1111
16965B208312l6206j55095j06094o7642Q3761m5482o879N4613m8164j09086k3776
16954A748262j00515j68106n2943N7815r2634j16149j51436J80J43987k061m4294
16943A222106M5477j9456n6785J9370p6924o5394n0505O821K8281K4425j0152
$$ y = [6728631, 6415594, 6145599, 5998178, 5807498, 5577269, 5494555, 5367028, 5232772, 4986261, 4775282, 4673972, 4710555, 4515600, 4330944, 4112512, 4049260, 4123570, 4013242, 3861369, 3764068, 3705818, 3605069, 3509838, 3577920, 3485770, 3441699, 3319480, 3130639, 3084071, 3266191, 3415388, 3373775, 3132054, 3047364, 3060749, 3037298, 2779053, 2661397, 2596345, 2637619, 2648854, 2471970, 2315876, 2280543, 2254263, 2196431, 2207267, 2167510, 2192074, 2177201, 2208312, 2172106, 2017011, 1910917, 1843275, 1927036, 1881554, 1874675, 1929288, 1881124, 1772038, 1748262, 1647747, 1479641, 1426698, 1484513, 1391879, 1275730, 1124294, 1124474, 1268461, 1266400, 1222106, 1267583, 1248127, 1191342, 1210712, 1133788, 1068394, 1017889, 1024710, 1052991, 1077416, 1067264]
16932A067264j2883q3885L7530R1779M0394j05780q1468q2822m1679O8706J07917
16921A005073j5450q278M525P7223j43048o2156J21994o2402j75903j14570l341
16910F23667K3628n9300M424n8937j16042O8255M6274J07660P8007O3027r8322
16899F82341r3508l292P2130j24846r9534j836q7801j2739r0325K5443J28854
16888C94887O696K1150M3474J681j40684J3185R2743M0028m8450k376p3888m918
16876C43528O0924o1733m8441O8590O4109l1525l2900l8415N4561J59184j13374
16865D24508o3437M8439o2216j57908k7100J03705O1667q8624k9871L9667r1966
16854A56864m7961k6037J06657l8273j39357J49821M9693P2987m2995j0348M217
$$ y = [1067264, 1054381, 970496, 1008026, 1099805, 1140199, 1034419, 952951, 870129, 828450, 897156, 1005073, 989623, 981345, 985870, 1063093, 920045, 857889, 979883, 917481, 741578, 627008, 623667, 647295, 587995, 592419, 533482, 417440, 485695, 531969, 639629, 717636, 780663, 682341, 588833, 585541, 657671, 532825, 433291, 431455, 343654, 330915, 240590, 266033, 394887, 401583, 422733, 466207, 467888, 327204, 340389, 433132, 473160, 424710, 422334, 348446, 343528, 404452, 342719, 294278, 362868, 426977, 395452, 362552, 324137, 378698, 537882, 424508, 361071, 409510, 347294, 189386, 162286, 265991, 327658, 239034, 209163, 248830, 156864, 108903, 82866, 189523, 151250, 11893, 161714, 211407, 284394, 241399, 231051, 235268]
16843B35268Q4553J3759q8268l1191m2262p3226J31531J13324J15696L3781m2630
16832D50335j01991K804n5058q2572j38363j15992J38498Q361P1593l1079K792
16821A49328Q8903P2609q5316r3052q8445k8068K9661R6014K8094m8968j29645
16810h885J4253N4414l2081O1520M4050l45Q328L1042m5086m384R0708j693K8370
16797B40211p1662j12182K2875L527l43j932Q9977L1495j7116J26225J1656k5260
16785B97471m7968n3410P4885M0168p4751j39326j0959j8223j5363P3402M4562
16774A70488N0794k2178K118n0983o7072M2179O0539m2478K561M7609J4775Q270
16762B16622r0491J1928J22196p2941o8468M8150j7520M5420j1437k6752j9738
$$ y = [235268, 319821, 333580, 245312, 214121, 171859, 98633, 230164, 343488, 459184, 492965, 450335, 348344, 351148, 296090, 213518, 75155, -40837, 97661, 106022, 177615, 146536, 149328, 238231, 310840, 225524, 132472, 44027, 15959, 45620, 141634, 169728, 120760, -8885, 5368, 59782, 27701, 89221, 133271, 132926, 141254, 172296, 127210, 122826, 213534, 211841, 240211, 168549, 56367, 79242, 82769, 82426, 80494, 170471, 201966, 184850, 311075, 322731, 297471, 249503, 196093, 270978, 311146, 236395, 97069, 86110, 67887, 52524, 125926, 170488, 221282, 199104, 201222, 150239, 83167, 125346, 185885, 143407, 145968, 193577, 208352, 216622, 126131, 138059, 260255, 187314, 118846, 166996, 149476, 194896, 183459, 156707, 136969]
16751A36969J6221r480o4419j218l8810J9816r2686m876n348j5778J21838j230
16739F0999p3845n1103J4312M162J15748J36447R57p224O7044r6112j96875m2300
16727f7790o6914L1594J3269J9438M9546k8541m9782M2028R8711R5812J1054J1838
16715A60263j07231j7183R8679K0257m3918p9582j61935P2134K8768O9299N1033
16704I0584q1342j14673J4027N9031R6599O3012Q1838M8455j41754m2933l750
16693F9094j8250q190j10127J5326k0480R2535M2922O4275J92452K1004j81939
16682A58622j69041r0129M0650J34357J3058K9491j5998R18P3744R3204n4748
16671B14128q3936K4555L7094m901n1432k9637k7400J30054K19587J92304J19000
$$ y = [136969, 153190, 143710, 79291, 78073, 39263, 59079, -33607, -38483, -43831, -59609, 62229, 60999, -12846, -63949, -49637, -45475, 70273, 206720, 207677, 200453, 267497, 171385, -25490, -67790, -134704, -103110, -89841, -70403, -20857, -49398, -99180, -57152, 41559, 137371, 148425, 160263, 53032, 35849, 134528, 154785, 110867, 31285, -130650, -58516, -29748, 39551, 90584, 9242, -105431, -91404, -32373, 64226, 127238, 209076, 257531, 115777, 72844, 69094, 50844, 42654, -67473, -52147, -72627, 19908, 62830, 127105, 319557, 340561, 158622, -10419, -100548, -59898, 74459, 87517, 117008, 101010, 101928, 175672, 268876, 214128, 130192, 154747, 191841, 186940, 135508, 105871, 78471, 208525, 428112, 620416, 739416]
16660G39416j6796l6335O3391j38160j01819L8952N3710l2214K384n3992j0909
16649E07628O6533P6678O1618j9423k2403r2542j4070j10589j33966l4040r8928
16638A86496M6132N4282o0690l8686n8638k5361M0462j7021q0640J15239k5479
16627A36096O4627M9178k4036p0047M6645p7136k4748J7931O0822j1179l1969
16616A36184Q737J37126J34746J07269J82193R4512m3249n7341L7637J2984K5838
16605G76636q5190m7608L650j4720j91746L0525Q5004j6712j9811j0858q0336
16594D28834q4616l0838J03222K29789R6643o0923n5991j58755r3602o6028J02335
16583D10070N634j94415n6888R9116O1279l4912o8943J2510o7497m2497R3191
$$ y = [739416, 722620, 686285, 749676, 611516, 509697, 548649, 602359, 570145, 572529, 518537, 507628, 574161, 650839, 712457, 693034, 670631, 578089, 564019, 453430, 319464, 285424, 186496, 232628, 286910, 226220, 187534, 128896, 103535, 143997, 126976, 46336, 161575, 136096, 200723, 249901, 225865, 155818, 202463, 125327, 100579, 118510, 179332, 168153, 136184, 144921, 282047, 416793, 524062, 706255, 800767, 757518, 700177, 737814, 750798, 776636, 691446, 643838, 647488, 632768, 441022, 471547, 556551, 539839, 520028, 509170, 428834, 344218, 313380, 416602, 646391, 743034, 682111, 626120, 467365, 373763, 307735, 410070, 415704, 221289, 164401, 263517, 324796, 289884, 220941, 233451, 165954, 123457, 216648]
16572B16648q459j6067M8627k838M4068O2580j09202l7670j31119q334j5162O8882
16560A11954Q2112J5822o9170l7544O7773n0599j468L2296k9299R1544J36067
16549C49488j3874m1852j2712o1856N1482J31304J26982j13076j31666n3898l9126
16538A91196L2777P1213N9214j8244n1625o3546p9295l1146j34458r8301l9064
16527a61279J82183J9164o4797o0041L3434q0825p4008M4062P0843J36128M4206
16516H9070j00283m6253j1359P507q0210p7989J16170J48370J48625p7258o6217
16505E0173k7771k7440M430p802J09807J13308q7504j27472j0479Q024M5596j5638
16493B7232k9785j39827P2495Q5899o430n0724K909m3282M9703J4250p499J60574
$$ y = [216648, 208189, 192122, 240749, 237911, 281979, 344559, 235357, 197687, 66568, 58234, 43072, 111954, 194066, 209888, 140718, 103174, 170947, 120348, 118880, 151176, 121877, 213421, 349488, 335614, 293762, 281050, 219194, 270676, 401980, 528962, 415886, 284220, 230322, 191196, 223973, 295186, 354400, 336156, 284531, 220985, 141690, 110544, -23914, -122215, -161279, 20904, 40068, -24729, -84770, -51336, -132161, -206169, -162107, -91264, 44864, 89070, -11213, -57466, -68825, -61318, -141528, -219517, -103347, 45023, 193648, 116390, 50173, 22402, -5038, -608, -8410, 101397, 214705, 127201, -271, -10750, -2726, 42870, 27232, -2553, -142380, -69885, 16014, 9584, -41140, -38231, -81513, -31810, -17560, -25059, 135515]
16481A35515J84251l4640k05248o5524R7532j12641k7725O8960o550p3879J4822
16470b5127k2566o9514R7709L9942k9510j9165J5095J3444m7480l256l9918N9289
16458c1057J03358l2783j4517K0110K3893M6994N6587j7647j18361j3111M4032
16447F7498K7583q8412j23467m6820k7519j89L0346J4724J24310K6495n3143l2053
16435h0647n4469r5067P2649R2226M7295P7490Q7399j15685o3629j1632R7710
16424E3640L6857j13160L1152k9333q8780R2152Q619O3356Q5611J08104P9733
16413C27951M4309m5367l6050j10871p1976m1526j30483n1316n7050M8645j29937
16402b53671j08713l3289K6815J34177R9642J53191J27130j56931r5238N2625
$$ y = [135515, 319766, 285126, 79878, 14354, 111886, -755, -28480, 40480, 33930, -39949, -25127, -47693, -117207, -19498, 20444, -9066, -28231, -13136, 308, -47172, -50428, -90346, -31057, 72301, 39518, 25001, 45111, 69004, 115998, 172585, 154938, 36577, 23466, 67498, 95081, 6669, -116798, -163618, -191137, -191326, -160980, -146256, -21946, 4549, -48594, -80647, -135116, -230183, -157534, -65308, -18013, 59477, 146876, 31191, -32438, -44070, 53640, 90497, -22663, 8489, -20844, -109624, -17472, -8853, 54503, 140114, 248218, 327951, 372260, 326893, 290843, 179972, 107996, 66470, -64013, -115329, -172379, -123734, -253671, -362384, -395673, -368858, -234681, -135039, 18152, 145282, -11649, -106887, -54262]
16392e4262q310p1039J2053L4188q714R2836J51361J2439o3995l6978L8909K5778
16380A24266K1093n5200j13470M399R489P910O803p2933m8577N3402J11839J5256
16368F4277n1169n3959p367K7257K7081K8257p9866k7089K7756J17421J8789O8488
16356A59876j6018o5184j92830j10267J6552J18000o0258p1057P9403j3523j2577
16345a67883O0043O8048L4412n0520r026k1757r9583L3104L848N5599K0951J23404
16333E0640K886j40022M4243O6345R6555q0527o0940P6927J34441J11174n9648
16322B42074m2769j81934j66619k7793m1729m4602j8020o7813P9429M2128R020
16311b18628O0413J14612P1215r9003q4440R8973Q8204N8448N8616l7462q6515
$$ y = [-54262, -62572, -133611, -121558, -87370, -96084, -3248, 148113, 160552, 96557, 59579, 98488, 124266, 145359, 90159, -23311, -18912, -9423, -1513, 5290, -67643, -116220, -62818, 49021, 64277, 13108, -40851, -48218, -20961, 6120, 34377, -45489, -72578, -44822, 72599, 91388, 159876, 143858, 78674, -114156, -224423, -207871, -89871, -150129, -221186, -141783, -155306, -167883, -107840, -39792, -5380, -55900, -64926, -86683, -186266, -153162, -149314, -93715, -72764, 50640, 53526, -86496, -42253, 24092, 120647, 40120, -20820, 56107, 190548, 301722, 242074, 199305, 17371, -149248, -177041, -218770, -263372, -281392, -349205, -269776, -227648, -218628, -158215, -43603, 27612, -71391, -155831, -56858, 31346, 89794, 148410, 110948, 24433]
16300B4433k7124L2934m757J2744L1671j832P5677o2316Q0632K8653k36835j03084
16288a49204J3443M3614Q5602J05653q2673j31094j07050K8313N0066J39274R3363
16277H9307p0713p9196l4279M6855R6575l6675o2073k1278L8800M3597m3367p8656
16265a11103N1866o8404L850k8187q5559L4390R8392K4053N8656J7857J05765
16254A01576O3814k2242p1365p8368Q0382P8993l2538j71632o3365M2418N7218
16243a5109J65608N261j9097r9468o9071O0112N1583n7013l4358N4209n139m988
16231C2530m1651m9407j23014M4861j3186J0731J20250M4258m6426J1057N2012
16220D2015P5447J19553J12398N9481o6650j01371j02934r3998q0502K0997L723
$$ y = [24433, -2691, 30243, 25486, 38230, 69901, 68069, 143746, 81430, 162062, 190715, -46120, -149204, -135761, -92147, -6545, 99108, 16435, -114659, -221709, -193396, -143330, -4056, 89307, 18594, -60602, -94881, -48026, 48549, 11874, -50199, -71477, -32677, 10920, -32447, -111103, -59237, -127641, -123791, -151978, -237537, -203147, -104755, -80702, -22046, -4189, 101576, 165390, 143148, 71783, -6585, 73797, 152790, 120252, -51380, -114745, -72327, -15109, 150499, 155760, 136663, 37195, -31876, 28236, 79819, 22806, -11552, 42657, 37518, 32530, -9121, -58528, -181542, -136681, -149867, -139136, -18886, 25372, -21054, -9997, 42015, 117462, 237015, 349413, 408894, 342244, 240873, 137939, 43941, -36561, -15564, -11841]
16209a1841o19Q230L4259J9662M1961L6263J0635j17853o5422l0337J02397N2680
16197H0015q7067k2316j28051k4128J02462m829m0344j9600p7398M1271J23733
16186e6252N7394j46790j76001J59322M4865j01424P0304Q0113N9247L1571j61988
16175a39639p6752J14496J50413K8220n2766M8254M4220j20069j95643Q9741P133
16164a02392j16529j3582Q6876P488n2497Q0740N123J80942P7737p2024m1372
16153D0510r2282j5464R5786N5530j23982j3236n100k9476P4831j5722j7027O4745
16141A9113j0210M0564r9416K0176k3161J14104K9539K7944p6179L1780l4814
16130C9440l3948j15432J3653J5978L8807L0224j6601N7287J4386j16180j26154
$$ y = [-11841, -12460, -4230, 30029, 49691, 91652, 127915, 138550, 20697, -44725, -75062, 27335, 80015, -7052, -29368, -157419, -181547, -79085, -83914, -124258, -143858, -221256, -179985, -56252, 1142, -145648, -321649, -162327, -117462, -218886, -148582, -68469, -9222, 22349, -139639, -216391, -101895, 48518, 76738, 23972, 72226, 116446, -3623, -199266, -109525, -102392, -218921, -232503, -145627, -138139, -190636, -109896, -104773, 76169, 153906, 81882, 40510, -51772, -67236, 28550, 84080, -39902, -53138, -58238, -87714, -12883, -28605, -45632, 19113, 8903, 49467, -49949, -29773, -52934, 61170, 90709, 118653, 42474, 74254, 39440, 5492, -109940, -96287, -80309, -41502, -11278, -27879, 29408, 43794, -72386, -198540]
16119a98540j00059K9878J53963J6209L3381r8296j9438M5684j9693M8113L1784
16108g7014J2050O1991J7689m0707K365J1593k0701N3043n0086N46n5001M1821
16096d2411R4635j32857j44662n7468J09800Q9540J03304K4763K8818j91817o7202
16085a85557M705O2276J32859K9195M0203o864K736R8837M5463j77812o5010M0701
16073B1732o8330p9259M5058Q4596K3705l4908q4824l1710R3264Q8414r5815p4110
16061a12187n5936N0090n2540k3869Q5174J64923K7325O1264o836k6811l0724
16050G9873m895j2058K7198m685o9952j75806j21831M4008J90801J11747M8780
16039A13180n897p7337O0638O0993j00480j00804k6684N0621R822r1044j08930
$$ y = [-198540, -298599, -268721, -114758, -98549, -65168, -163464, -182902, -137218, -156911, -108798, -77014, -64964, -2973, 14716, -25991, -23626, -12033, -32734, 20309, -29777, -29231, -84232, -42411, 52224, -80633, -225295, -282763, -172963, -83423, 19881, 44644, 73462, -118355, -185557, -180852, -118576, 14283, 43478, 83681, 76817, 79553, 178390, 223853, 46041, -18969, 21732, -46598, -125857, -80799, 3797, 27502, -7406, -92230, -123940, -30676, 57738, -38077, -112187, -168123, -118033, -170573, -194442, -109268, 55655, 82980, 144244, 137408, 110597, 79873, 74978, 62920, 90118, 85433, 15481, -160325, -282156, -238148, -47347, 64400, 113180, 107283, 29946, 90584, 151577, 51097, -49707, -76391, -25770, -15948, -106992, -215922]
16028b15922R1200P5822P4336j30284o1690j1837q4132R1834J54135Q1801J8477
16017H3740j92924j8138k2998j8914J60363J38123q4736j63115J172P4717n6608
16006i9318q4140P6025J26885J15067M5093j85356k4289J28599n066k1094o3110
15995I296q7422L1326n2016K7022L3392k6233N8295L3638P636J832P2279k7256
15983H1789j39097j4115m6262j07130P929M5998P2524p205j7391L1250J7987J25320
15971E1597l9108o5281j1642o7109N841Q2357o9139j44068P5836P0142R3004K1935
15959D365J1644j16927j01887n67m3290l3506J79136M5949n7729J34521j8135
15948C574l9239P8248J5339p0389Q2030J897k326L1407m8969p0747M2040K5972
$$ y = [-215922, -124722, -48900, 25436, -104848, -166538, -178375, -262507, -170673, -16538, 65263, 83740, -109184, -127322, -150320, -169234, -8871, 129252, 44516, -118599, -117427, -42710, -99318, -183458, -107433, 19452, 134519, 179612, -5744, -30033, 98566, 93500, 72406, 9296, -78126, -46800, -98816, -71794, -38402, -64635, -6340, 27298, 34934, 36766, 109045, 81789, -57308, -71423, -117685, -224815, -216886, -170888, -98364, -105569, -122960, -91710, -73723, 51597, 12489, -52792, -64434, -131543, -125702, -43345, -112484, -256552, -180716, -110574, -17570, 4365, 16009, -100918, -202805, -203372, -246662, -280168, -101032, -55083, -112812, 21709, 3574, -35665, 42583, 57922, -12467, 69563, 71460, 69134, 100541, 51572, -19175, 22865, 48837]
15936D8837J413P3068q1927m0347j08608o3960j4962K4925q8554J56748K54624
15925A61257K5538r8704o374N964n6204j25248L0866j1165J19178J2506N9093
15914A16707k105j91646o3874J38971N3349K018L5070m3722p7039p7910n261j01674
15902b17116j9961J00056J73017J06154K3081m3489o0267j4970K9404L6427N6769
15891A69105J3913k06020j77165J43408J14639L6949p8017p2424J00675J12526
15881A57589m7749k0271l343n7003l8042M6731K9689j25164k2263J12653M5261
15870G8088m5274k3984n5645j14067p6772O5508J30243j5076k3506n217K6426
15859e9276P4882p1280l6958n8404J2369Q4565k9443j0774M4872J34351m0515
$$ y = [48837, 50250, 123318, 41391, 1044, -107564, -171524, -186486, -161561, -250115, -93367, 161257, 186795, 88091, 81717, 87681, 31477, -93771, -62905, -74070, 45108, 57614, 116707, 114602, -77044, -140918, -1947, 51402, 53420, 88490, 44768, -32271, -110181, -115442, -217116, -237077, -137021, 35996, 142150, 165231, 121742, 61475, 46505, 75909, 112336, 169105, 183018, -23002, -200167, -56759, 57880, 94829, 16812, -55612, 45063, 157589, 109840, 89569, 86226, 29223, -8819, 37912, 67601, -57563, -79826, 32827, 78088, 32814, 8830, -46815, -160882, -237654, -172146, -41903, -56979, -80485, -85702, -59276, 15606, -55674, -92632, -151036, -138667, -54102, -83545, -94319, -49447, 84904, 44389]
15848D4389M0187o9953k4098l6759J4219n5376p1303J30045j6121k3549p5150
15837a43469P4599p279j5704J5017l824n9524O3549j3933n581M0471p996J03604
15825C9930Q9684n8579l3695Q6279l2344m0136p565J9920k784j6029M2084j3534
15813G3231l4615m568q4660M8832L9323k0302P774l3144P3220L8199o3843Q52
15801D0299J48011m1488j43713J0659L6879p5963M4758m4020R5776M9864k5954
15790I5108K1370J4511m6171L9939l315K5882O3671J6289o7705N5502j2384r1483
15778A11214j07615j39243J8681K15141J9799j11119j18162M5074R5715N5900
15768H5385j58368m3854Q8693Q10j8403K5528J02620K3911n4497k11608p4098
$$ y = [44389, 84576, 14623, -9475, -46234, -32015, -87391, -158694, -28649, -44770, -68319, -143469, -68870, -76149, -91853, -76836, -80660, -140184, -76635, -90568, -96149, -55678, -63674, 39930, 129614, 71035, 37340, 123619, 91275, 51139, 43574, 63494, 60710, 44681, 86765, 73231, 38616, 34048, -50612, -1780, 37543, 17241, 25015, -8129, 65091, 103290, 39447, 40299, 188310, 146822, 3109, 13768, 50647, -25316, 19442, -24578, 71198, 121062, 95108, 116478, 130989, 84818, 124757, 121442, 147324, 210995, 227284, 159579, 215081, 202697, 111214, 3599, -135644, -116963, 98178, 117977, 6858, -111304, -66230, 29485, 85385, -72983, -116837, -28144, -27334, -45737, -20209, 82411, 106322, 51825, -159783, -233881]
15757b33881k6491P8045J02314k7936N1379m2698n8555l9028J0631J15518j2458
15746h3160k8922J6833K5474J09159j5980q2017m0857J4879K7643J2925j8325
15735f2348j2599M469j9058M1520M917P2040N8920O834o3991l0039J25862l788
15723A22739m6422j2849j13299k9792O0210j4626O7502M6136m8877L057M9586
15712H3365L9987o5543n9784r1312j06547Q6734M6443m4073m9874R487O5575K7048
15700e8494J00141J05398p1932j33116O4264J37975j01541j76657J24949P9955
15690G0942K6426M2465j19319j04261J764J02391Q2596K1142J2882j20965k2524
15679f461M0420n2722q9666j4579P2415l3488m4022r102j01283q8489Q3145J44638
$$ y = [-233881, -260372, -182327, -80013, -107949, -56570, -99268, -157823, -196851, -186220, -70702, -83160, -112082, -95249, -69775, 39384, 23404, -58613, -99470, -84591, -56948, -44023, -62348, -74947, -70478, -89536, -48016, -43099, 28941, 87861, 94695, 30704, 665, 126527, 122739, 76317, 63468, -49831, -79623, -19413, -34039, 33463, 79599, 30722, 33779, 83365, 123352, 57809, -1975, -93287, -199834, -113100, -66657, -110730, -160604, -151117, -85542, -58494, 41647, 147045, 75113, -58003, 6261, 144236, 42695, -133962, -9013, 70942, 97368, 139833, 20514, -83747, -81983, 20408, 103004, 124146, 137028, 16063, -6461, 33959, -18763, -108429, -123008, -50593, -84081, -128103, -137205, -238488, -326977, -243832, -99194]
15667i9194L6745N1124J1268J957j13097m3765N5323O2609k3554M360m2189R6019
15655b394P5940q2155K6499J38059j05197k5520M5114N0035J28212J5263k8184
15644B35672j5411j31814p566m1121j71750q2973n1000J01531P600k8867J0161
15633a75538o3808J4737R6516N4380J8100J2034O5200K0969k726J5328o2848m7282
15621e4938J62438O3524O770j00163M293o5142n7750M8789n3865j3407P8488j1621
15609G416j4526J243K3104q462O84n9808r4501l0631J67780R6441j00315j75786
15597a87361q002L9617Q6156M0697l485j3796o8175l8989q4144P7972M5720r841
15585a23631J3032N9578q7321m8579Q5521L2695N6885J24401N217n3741L4596
$$ y = [-99194, -62449, -11325, -57, 1900, -111197, -154962, -99639, -37030, -60584, -56224, -98413, -2394, 73546, -8609, 17890, 155949, 50752, 25232, 70346, 120381, 248593, 263856, 235672, 220261, 88447, 80881, 39760, -131990, -214963, -265963, -164432, -156832, -185699, -175538, -239346, -224609, -128093, -73713, -55613, -43579, 21621, 42590, 39864, 55192, -7656, -54938, 107500, 171024, 177794, 77631, 81924, 16782, -40968, 7821, -46044, -59451, 19037, 7416, -7110, -5867, 17237, 8775, 9459, -50349, -144850, -175481, -7701, 88740, -11575, -187361, -195363, -155746, -69590, -28893, -32378, -46174, -114349, -153338, -237482, -159510, -113790, -123631, -110599, -51021, -138342, -186921, -101400, -68705, -11820, 112581, 117798, 64057, 98653]
15574I8653r2216j03308L4671L9347Q2069J0446Q0488j4886o0900L3657K0668
15563A28689p291k1548j75884j8325O2759J79473J46184K8426r2084p3006q2731
15552G4662M4466K894k3158j46944q2773j1552R0655L1389J3847J6440k8305p7357
15540i5736o0505l7526p9690P2794J06315R5369o5280K2032O9320k1598l8061
15529c2566q2120n0174L1196k4078J1179r096Q0649p1899m8696R1012O4057R6698
15517E6162K6463j15506q2128j867m3178k2307Q1282p122n558l3483K4788N9662
15505f2792j1920J4734P0632M5601j35838k5971L8954L6730p2834p4183l3175
15494b10062J54518M4000j25041K6866J6368J6042j19242K0184J27482J81487
$$ y = [98653, 6437, -96871, -62200, -22853, 59216, 69662, 150150, 135264, 74364, 108021, 128689, 121398, 99850, -76034, -94359, -31600, 147873, 294057, 322483, 230399, 157393, 74662, 119128, 122022, 98864, -48080, -130853, -142405, -51750, -20361, -6514, 9926, -18379, -95736, -156241, -193767, -273457, -200663, -94348, 1021, -64259, -42227, 27093, 5495, -32566, -114686, -164860, -133664, -157742, -146563, -155659, -75010, -146909, -195605, -104593, -40536, 56162, 82625, -32881, -115009, -116876, -160054, -182361, -101079, -108201, -113759, -147242, -122454, -62792, -74712, -59978, 10654, 56255, -79583, -105554, -66600, -29870, -102704, -176887, -210062, -55544, -11544, -136585, -109719, -93351, -77309, -196551, -176367, -48885, 132602]
15484A32602l9517q9891r3565J18825J0448j18708K1097M9993j0051k4038J07430
15473F4625o3379r0449O6014K8933l6171j8178N8340p706q6331J2288M5997l207
15461b9224L942j1899l5385n6962j3642M3660J16605M8552m9919m2816p4924R3182
15449h830J50021l7917k6133o7348j4977M749j4317Q9662Q08p5132l1592j02587
15437a33593n5815K1863J09749J31638j26378N178M6170l2565l8466M206j0791
15426g8804J48859O0134K4293o5949j88965r0469R2702K2732k7387k1312J88535
15415F4369J0248l4808j16474M1553Q4572j17519m2237P5561r0084o6298Q5507
15404a05610J15072j31279j18760P4495L7817j2466n5420N24N03N1016k4038P3631
$$ y = [132602, 93085, 3194, -90371, 28454, 38902, -79806, -58709, -8716, -18767, -42805, 64625, 1246, -89203, -23189, 5744, -30427, -48605, 9735, 2029, -84302, -72014, -26017, -29224, -25282, -37181, -72566, -129528, -143170, -99510, 17095, 65647, 15728, -27088, -102012, -8830, 141191, 103274, 77141, 9793, -5184, -435, -14752, 74910, 75718, 586, -31006, -133593, -189408, -167545, -57796, 73842, -52536, -47358, -1188, -33753, -72219, -68013, -78804, 70055, 130189, 154482, 88533, -100432, -190901, -98199, -75467, -102854, -124166, 64369, 74617, 39809, -76665, -35112, 49460, -68059, -110296, -34735, -124819, -191117, -105610, 9462, -121817, -240577, -166082, -128265, -140731, -196151, -195627, -195124, -144108, -168146, -94515]
15392i4515K4540R6164j970O1803M7324K962r6167m7247K5814R5710N6164L1954
15380B02536N6854r2646p8850o9472p4976N0487J16657J1475L1236p4435k2866
15369E6000J933l5567q4207Q1716K6975M0021j6488j43570r9076o0067R6661J6451
15357a19218Q7793l0169k7902l2275m5129O6073P0229Q1425j418q6700P471l5644
15345f5464q2488k6423k8513M3908K9393J31819O9639p9613o7004l3829j17565
15334b26140J35441R6631J7900m5389q775Q5392L972m2879J5950j775K7288k6314
15322C1302l3385N1964o1070J00192K0727j03483j15828o7474P3046O6030j4669
15311e2648R4447M7721j20728j12450n6227j5081n1590N0675N0446J8050J03758
$$ y = [-94515, -69975, 26189, 24219, 86022, 133346, 136308, 40141, -7106, 18708, 114418, 170582, 202536, 259390, 166744, 87894, 18422, -56554, -6067, 110590, 122065, 153301, 78866, 56000, 57933, 22366, -61841, 19875, 46850, 86871, 70383, -73187, -172263, -232330, -135669, -119218, -31425, -61594, -89496, -121771, -166900, -100827, -30598, 50827, 49409, -37291, -29820, -65464, -147952, -174375, -202888, -158980, -129587, 2232, 71871, -7742, -74746, -108575, -226140, -90699, 5932, 23832, -21557, -30332, 55060, 59032, 16153, 32103, 30328, 57616, 31302, -2083, 49881, -11189, 89003, 109730, 6247, -109581, -177055, -104009, -37979, -52648, 41799, 89520, -31208, -143658, -199885, -214966, -266556, -215881, -165435, -147385, -43627]
15300d3627N5288m3556j5836N5944p288M6496J88675R5719j96152j08298q3794
15289e6429N1219N9828J08623l6963M1739J6946o9214n2935j07278L9729l8043
15278d2778n3820j15521N8429l0028n7148R7586J27078K8322n1211P0240O0454
15267I1603K2059Q442m0611M4554k2441l073k0294K8222k3230o2317l5779n9724
15255g2589n7244q2595K9460k3732p03K14948M2557o7996K2294J1029q5149l4103
15243a03823r449J3405l430Q8938m6388j3114M1316P8917M7796k1218o1654J858
15231A3154J6326J1972J4701l8948o8776Q015J45150M5567q2581j01657j10376
15220a47453j0673L3151L1842M1127P918L8149M0253m7535M1842P2778o4576r3116
$$ y = [-43627, 11661, -31895, -47731, 8213, 925, 47421, 236096, 331815, 135663, 27365, -56429, -5210, 54618, 163241, 126278, 168017, 184963, 115749, 62814, -44464, -4735, -42778, -96598, -212119, -153690, -183718, -240866, -143280, -16202, 12120, -39091, 31149, 91603, 113662, 122104, 81493, 126047, 103606, 100533, 80239, 108461, 85231, 22914, -12865, -72589, -129833, -212428, -182968, -206700, -207403, 7545, 50102, -17894, 4400, 15429, -69720, -103823, -113272, -99867, -103297, -14359, -60747, -73861, -32545, 46372, 94168, 72950, 11296, 13154, 29480, 41452, 56153, 17205, -51571, -43556, 101594, 147161, 64580, -37077, -147453, -158126, -124975, -93133, -52006, -44088, -5939, 34314, -13221, 28621, 101399, 36823, -56293]
15208e6293M9990l054N1292K4086l0460J5415P292K7491q0451J6619K6457J5720
15196F4104j19636j50228J8258M2607Q2613R3679K8620p7017q6388k8401R0737
15185d1052Q9818l0740j17587k1858j1530J27236o518m5581K7266J9614K0257
15174I325q8390n4712J25147n3969P6901Q5348m7439m6783N0672P4188o5653l4241
15162C0394p9438J8743P3550M305j02097o6690J1780q0896k4611J27811J09687
15151B2538R2899p8714j48035m8056k1103J04847K9231R9083r0627j60169j8445
15140b16551R927Q7939J42492J7360L792J00612j1070j37650r4646m0741m0035
15129a78571k3194m0199N2417M7665m549j4071R2352p3914P430L9004p119K1486
$$ y = [-56293, -6303, -9357, 41935, 66021, 35561, 50976, 58268, 85759, 5308, 21927, 48384, 64104, -55532, -205760, -187502, -144895, -62282, 31397, 60017, -17000, -103388, -131789, -41052, 48766, 18026, -99561, -121419, -132949, -5713, -12231, -57812, -30546, -10932, 9325, -79065, -133777, -8630, -62599, 14302, 99650, 52211, 5428, 56100, 130288, 64635, 30394, -49044, -30301, 43249, 47554, -54543, -121233, -109453, -190349, -214960, -87149, 22538, 115437, 36723, -111312, -159368, -180471, -75624, -46393, 52690, -37937, -198106, -216551, -206624, -118685, 23807, 41167, 44959, 145571, 134501, -3149, -97795, -138536, -178571, -201765, -241964, -189547, -141882, -146431, -160502, -68150, -142064, -134634, -95630, -102749, -81263]
15117h1263J20035J05105M392m9748q813O9622m437m5026j9319p9810p9068L551
15105f4779M4289Q0302j2035j5478l2976l1121m3015n6570j4548J23901J2853
15094i177m3298j2945l0729k5271M5272o7817m551K4585j7819r2418J10749J805
15082a21614r7096l9282P2812J54959J09563Q065l0719j44767m4112P6364J3844
15071d1983r5841j32290k5706R1977M2050L6974N8159k2497N011l1748m31P0664
15059d5661K2578j7184J56354J20188o3589k2647M363l2362P2899p3336o102j2619
15047A02882M6948r1024l2184J8426N9112j117o3232K562J7346l1749n9279J0573
15035b0736n6767j07991p1667L0926J25363J29813O5475O4300j74577j62752J5672
$$ y = [-81263, 38772, 143877, 148269, 98521, 89708, 159330, 154893, 109867, 90548, 10738, -68330, -64779, -20490, 59812, 47777, 32299, -677, -31798, -74813, -131383, -145931, -22030, -9177, -52475, -65420, -96149, -121420, -76148, -143965, -148516, -123931, -141750, -234168, -123419, -121614, -218710, -257992, -185180, -30221, 79342, 87407, 56688, -88079, -132191, -55827, -41983, -137824, -270114, -295820, -203843, -161793, -124819, -66660, -89157, -84146, -115894, -116325, -45661, -23083, -40267, 116087, 236275, 172686, 150039, 154402, 122040, 194939, 121603, 115501, 102882, 149830, 58806, 26622, 45048, 104160, 103043, 39811, 42373, 59719, 27970, -31309, -20736, -77503, -185494, -257161, -226235, -100872, 28941, 94416, 158716, -15861, -178613, -162941]
15024a62941J64297Q0079J17514k6284j06159j02461N8514n7608j82748K5411
15014a92386M3898k4356M3084j0077J22876n4244m8024J14514j0521p0404N5348
15003c0292O3851j17211j19468J25336N6176k532o5970l3815N9326j7541m5510
14992a27650j8743K2591M9031J1822O613R7498n299p3081j24743j24813O9337
14981b17437J27573K8879n2121j0504Q0791J19426M4415m3206l5856j28202j14666
14970b00908J93884R1572J10850p3140j21479m0813K384K2584O9313l7079J1314
14959B8482q0894L0523O1772k1630j24033o3943Q4136N8863m9336j68643o0249
14948c04952K01051Q8456O3842O0520m8626l0231j11116j79151J34641L2952P0379
$$ y = [-162941, 1356, 81435, 198949, 172665, 66506, -35955, 22559, -35049, -217797, -192386, -148488, -172844, -129760, -139837, -16961, -71205, -119229, -4715, -15236, -85640, -30292, 33559, -83652, -203120, -77784, -21608, -24140, -90110, -123925, -64599, -82140, -127650, -146393, -123802, -74771, -62949, -56336, 41162, 35863, -37218, -161961, -286774, -217437, -89864, -60985, -113106, -123610, -42819, 76607, 121022, 77816, 41960, -86242, -200908, -7024, 84548, 195398, 122258, 779, -40034, -37650, -15066, 54247, 17168, 28482, -52412, -21889, 39883, 18253, -105780, -169723, -85587, -26724, -76060, -244703, -304952, -103901, -15445, 48397, 108917, 60291, 30060, -81056, -260207, -125566, -92614, -22235]
14937b2235J40161L5837l3527o5853K5719P4550r9807L997l415n8997o642m457
14925a4669o965n4243n7536J4857n109P6778J34875K4836n942P9332N1711q993
14913B28932j37893j66619j49824l3067Q2485J33183O2593o44l4421p4595j2360
14902a02230K1306J04606Q5159k6805o9567J11417m2505N8051Q3091m1302m7719
14891A33502L2495J8524o9128l7544O0389K2300j13725j8690O7113j26750p5861
14880a07375k5000j6050N017Q5927L078k596j9797N6432M3755P227M9952R2606
14868A73176j0594j47857P688Q1175K4125l2182j07044r5940j16606R8211O8841
14857e7007O2561r1650k8708J4367J35452O3004q4930n2265m9573J8003P6405
$$ y = [-22235, 117926, 153763, 120236, 54383, 80102, 154652, 54845, 58842, 55427, -3570, -10212, -14669, -21634, -75877, -133413, -118556, -123665, -46887, 87988, 112824, 106882, 186214, 237925, 228932, 91039, -75580, -225404, -258471, -175986, -42803, 19790, 19146, -15275, -89870, -102230, -80924, 23682, 108841, 82036, 12469, 123886, 81381, 139432, 222523, 181221, 133502, 165997, 184521, 115393, 77849, 138238, 160538, 46813, 28123, 95236, -31514, -107375, -132375, -148425, -143408, -57481, -54403, -56999, -76796, -20364, 23391, 30618, 80570, 173176, 162582, 14725, 22413, 103588, 127713, 95531, -11513, -107453, -224059, -125848, -57007, 5554, -86096, -114804, -100437, 35015, 98019, 13089, -39176, -88749, -70746, 5659]
14846E659l6914p2489N1493O8028o1500m571J0180n0082p9139N397O7756K0303
14834g5879n8722m2940J8497J05505l2894r8270O483N1002R7076N346O193k6181
14822d4784J4322q6486K2650N3093j04557J0400N0497j0686l0174N8331M7889
14811a9505l0891j8345j21542J2108M7495L3761P0252N2414L692q0699J08623
14800E7363N2999m9378n1197o258L9569M587r3811J4883l1139o8021N3662k815
14788g9556j703L3045J22376O0383n155j7001l285n0952m2979l0259K4163j5652
14776f575l4828L4987J12338K6179l7129q9164k8427n287n7642R9712Q2185Q3465
14764A79814n8424l7304o5635o8411Q1454K8289o7772O7060J09087j11790k06028
$$ y = [5659, -31255, -103744, -52251, 15777, -45723, -50294, -40114, -90196, -169335, -163938, -96182, -75879, -134601, -177541, -159044, -53539, -86433, -184703, -178220, -127218, -30142, -24796, -18603, -44784, -30462, -116948, -94298, -41205, -145762, -135362, -84865, -95551, -125725, -67394, -19505, -50396, -68741, -190283, -178175, -130680, -96919, -26667, 25747, 29439, -51260, 57363, 110362, 60984, 9787, 3529, 43098, 47685, -46126, -31243, -62382, -130403, -76741, -79556, -81259, -48214, 74162, 134545, 129390, 112389, 109104, 58152, 15173, -15086, 9077, -6575, -41403, -6416, 105922, 132101, 94972, 5808, -22619, -27906, -85548, 14164, 96349, 179814, 121390, 84086, 18451, -49960, 31494, 59783, -7989, 59071, 168158, 56368, -149660]
14753a49660K9777J96213l1912k07220l3713K4360K9465J05140r4676o4543J09582
14742h7187Q7249j02558p2750J40314J10038L225j2645m5379m2005r8170P6424
14731d3444j4071M2205M3310N547O489l8236O9706J17687O368j23616o4805L0731
14719C7871P7345m6153m8083r0711p9837K5068L4978J5362L5154J23428k9912
14708E4510l9044o381R3907j7318n5410o4055L0727n0570K2115J68168q166m9111
14696G9372O3957j30315j71714K50P642O4297M2865R7156m1882P095L5144m7749
14684F118n8429J9664j55142j12965R7102R4471P8864K5165J5462K5110j04786
14673f9366j32648L6761j6753M0520l5033M6311O4511N0856P917k254k5463k4411
$$ y = [-149660, -119883, 76330, 44418, -162802, -196515, -172155, -142690, -37550, -132226, -196769, -87187, 62, -102496, -175246, -34932, 75106, 78331, 65686, 20307, -21698, -119868, -43444, -57515, -15310, 28000, 33547, 40036, 1800, 71506, 189193, 195561, 71945, 7140, 37871, 115216, 69063, 20980, -69731, -149568, -124500, -89522, -74160, -39006, 84422, 54510, 15466, 9085, 102992, 85674, 30264, -33791, -3064, -53634, -31519, 136649, 128483, 79372, 143329, 13014, -158700, -158450, -150808, -86511, -43646, 53510, 11628, 18723, 53867, 6118, -52311, -32647, -187789, -300754, -203652, -109181, -30317, -5152, 10310, 35420, -69366, -202014, -165253, -182006, -141486, -176519, -130208, -65697, -14841, -6924, -9178, -34641, -59052]
14661e9052l0168J92l1823q6416k4634J89292J59523j16633o2131J30353N2791
14650A21294o9679J03367n4220p0013p5264P0723j1116j20414j24103R7177K1895
14639a10353K5828K9024o7889q3484n1516K4255Q3698J30837Q3233k1897j02663
14628f0927L2413O2557p9554j41970Q0353P7536P1289J45563p173o0687p7567
14617D1833l4608j8640O0704R0889N1912L1242k02318q8800O1052J006q5380J9247
14605g1861O2146q6453R792L6184o4013N389J40236j9324j9014l2068O0006l9186
14593a8166M2864m3242l2727m5867M1069N9955j6718l4812k3783o6838J90742
14582E2477o4158j75191N6653j40169k593J03524N8813L1493M6191J01736l5215
$$ y = [-59052, -89220, -89028, -120851, -207267, -231901, -42609, 116914, 281, -61850, 68503, 121294, 51615, 154982, 100762, 30749, -44515, 26208, 15092, -105322, -229425, -132248, -110353, -84525, -55501, -123390, -206874, -258390, -234135, -150437, -19600, 63633, 41736, -60927, -28514, 34043, -45511, -187481, -107128, -29592, 41697, 187260, 180087, 119400, 41833, 7225, -11415, 49289, 140178, 192090, 223332, 21014, -67786, -6734, -5728, -91108, -71861, -9715, -96168, -86376, -50192, -114205, -108816, 31420, 12096, -6918, -38986, 21020, -18166, 24698, -18544, -51271, -97138, -56069, 3886, -12832, -47644, -71427, -138265, 52477, -11681, -186872, -130219, -270388, -272981, -169457, -110644, -79151, -32960, 68776, 33561]
14571C3561k8953n6361n1611l1534j4993N8014J00084K632l0314l9138n349n8540
14559a22502J7486j07321k9664L6251k2702J67295J94130N252K2135j25738p8967
14548d4345L0513N6132l4342k300k3941O5675Q9749j0162n2640l3981k8986o9634
14536e8262L2109m4356j60425N3403J09663M0431q5955O5810j3315L9039J08231
14525H6373J8298l8062j02082o2928J28605n2071n9168j0141K6586m133o963J34530
14513E8844j5809o4883p801p6997J7028R6524P5757l8210k0831k3134m0050L8007
14501a555q5079J9741P0895J1938p8299M4224O0506M034J14360m4115J6194q7823
14489D5021k8275l926J1060q3127j0085J02688P7884p0963o8817m7920J20153
$$ y = [33561, 4608, -51753, -103364, -134898, -149891, -91877, 8207, 10839, -19475, -58613, -63962, -122502, -105016, -212337, -242001, -205750, -228452, -61157, 132973, 138225, 160360, 34622, -44345, -13832, 42300, 7958, 5658, -18283, 47392, 137141, 126979, 74339, 40358, 11372, -58262, -26153, -70509, -230934, -177531, -67868, -27437, -113392, -47582, -60897, -21858, 86373, 104671, 66609, -35473, -98401, 30204, -21867, -81035, -91176, -64590, -68723, -75686, 58844, 43035, -21848, -29649, -106646, -89618, 6906, 82663, 44453, 23622, 488, -39562, -1555, -86634, -66893, 4002, 15940, -62359, -18135, 42371, 46405, 160765, 116650, 132844, 45021, 16746, 12820, 23880, -59247, -69332, 33356, 111240, 40277, -28540, -76460, 43693]
14478D3693K4829o072K8714j13661r3215k052R6862k2311k8258P1985O1874L700
14466F6088O591L4512k9212n7885J03206n961k9409r0787q4207r616K824L6904
14454e6952l2119j7797k0072P606R3828M8686k0323l7257k1249N1526j11160r4397
14442b09680J50692R4041m2199R8622J09320r1349k7693l8267O8140P7879j31065
14431E8441j44378j42834O9141N1043j6127l5271Q8943J39393o3839k4245j4475
14420c4208o87L9855j4785j0396J8268n6611j10165J2202L9851O7832Q4530o5615
14408b9929l1628j38407j26520R2125J61910L321l5492M9813l0613o0291o859
14397a52570P0642Q3231N8754R7536o8368j02244O9583M4572j19980j08476J05586
$$ y = [43693, 68522, 62450, 91164, -22497, -115712, -117764, -20902, -43213, -71471, 514, 62388, 66088, 72679, 107191, 77979, 20094, 123300, 117339, 87930, -2857, -87064, -96680, -93856, -56952, -89071, -106868, -126940, -119334, -25506, 23180, 2857, -34400, -55649, -4123, -115283, -209680, -58988, 35053, -7146, 91476, 200796, 109447, 81754, 43487, 111627, 189506, 58441, -85937, -228771, -159630, -108587, -124714, -159985, -71042, 68351, 4512, -19733, -34208, -34895, 4960, -9825, -20221, -1953, -58564, -168729, -156527, -116676, -48844, 35686, -29929, -61557, -199964, -326484, -234359, -72449, -69128, -104620, -54807, -85420, -145711, -152570, -81928, 1303, 60057, 157593, 89225, -13019, 56564, 101136, -18844, -127320, -21734]
14386b1734Q0853M9570r5018n9093n1700p1851K1908P4235M3924P7949O2861j8459
14374I3445O3233Q836j0631r6435n0320n1746o2664k5885J7185M9264N7910M6817
14362C9009L2063J4642j8909M6170n439j21174o2265J54818p2669j29916M3935
14351g9735M2094J08579p0325j31232J4607K6578J02314N8020j19561j70306K3140
14340a95827k1553J3552J03198j7786Q9675k2645N191m3435p89M1623r1075k3359
14328a63230Q8776J80501m894k6992m0570j44818M2604j4456o255J12384J580
14317B4630r9655j09876k3740J00145R1336n1078K7711l4420j0261J1090P9568
14306E450l5867J7775o788m8596k7390O4827J20347R7936r1000j02895j4510R31
$$ y = [-21734, 59119, 108689, 13671, -45422, -97122, -168973, -147065, -72830, -28906, 49043, 111904, 93445, 156678, 165514, 154883, 58448, 8128, -43618, -106282, -132167, -114982, -65718, -7808, 39009, 71072, 85714, 66805, 112975, 107536, -13638, -75903, 78915, 6246, -123670, -79735, -37641, 70938, 613, -130619, -116012, -89434, 12880, 70900, -48661, -218967, -195827, -217380, -203828, -100630, -118416, -28741, -51386, -46195, -89630, -90419, -48796, -139871, -163230, -74454, 106047, 101153, 74161, 33591, -111227, -68623, -83079, -89334, 23050, 24630, -75025, -184901, -208641, -108496, -17160, -68238, -40527, -74947, -85208, -74118, 5450, -30417, -12642, -19430, -68026, -95416, -30589, 89758, 187694, 96694, -6201, -20711, -19780]
14294a9780L3227n731P800J17358m1128j53854j20393r0108N1821O4642j6704
14283a72850R2147M5624m5397m97r312J02435O229l9159J28840J08991J0376q0825
14271A46602j23068j41923m2246J81290K0641J0308n7240j15649R833O2282J05045
14260E5875L6138N0869J3087j9882l9376j35565j20628N59O2029k8632j10317
14249b35843J17083R3478l3804n9512N5951J7645q1136Q872q507K7090k1480m3227
14237a63390O0022J54514n0533l3797J7240k5485j5146M0199j9102l8835k5417
14226i9730j6284O391O9190n8368K680P0960J60943R995r8906j22091K5211k3702
14214g3711K3050k11J6027r448K8114K05j04413m6697O2257J7550m9060j042K5304
$$ y = [-19780, 13447, 7716, 15516, 132874, 91746, -62108, -182501, -272609, -220788, -156146, -172850, -80703, -35079, -80476, -80973, -90285, 12150, 18379, -20780, 108060, 217051, 227427, 146602, 23534, -118389, -160635, 20655, 41296, 51604, -5636, -121285, -111452, -49170, 55875, 92013, 142882, 155969, 136087, 96711, -38854, -159482, -158923, -96894, -125526, -235843, -118760, -25282, -59086, -118598, -62647, -45002, -126138, -117266, -125773, -98683, -120163, -163390, -103368, 51146, 613, -33184, -15944, -41429, -56575, -16376, -35478, -74313, -99730, -116014, -109623, -40433, -98801, -96121, -25161, 135782, 145777, 46871, -75220, -50009, -73711, -50661, -50872, -34845, -44293, -16179, -15974, -120387, -167084, -104827, -87277, -136337, -137379, -112075]
14201a12075J58329k5738r1684N901Q2203N700n7176M4205j7073r7091K7459J0718
14189f6322K6831P2567r3026j1990R1447k0575M1229r72p4879j4870k6809K8372
14177d8997L2014j41955J2120P9170j14776k5924N4902j2196j0739O1060M8901
14166f6420M5264J091j20547j24820J20601K26311m2382q9689p4287J10111j2685
14155b7452n0677K3890N8528j51291m6110M870R470p9504K4486J7887M814R7465
14143a13624l0841K0156N3576L7692M166O1365k7312L2363p774j35334N5064J37365
14131H6862r7801r0594j58417l6032J64798N298k3946l1296J13988R3985m5287
14120a8442k3773l2000j0541j6808m3896J9322R8966L0972J6124j6922L995k0549
$$ y = [-112075, 46254, 20516, -71168, -65267, 16936, 22636, -34540, 9665, -7408, -104499, -77040, -66322, -39491, 33076, -59950, -71940, 19507, -1068, 40161, 39189, -35690, -50560, -77369, -48997, -16983, -158938, -146818, -67648, -182424, -208348, -153446, -165642, -176381, -115321, -66420, -21156, -20065, -140612, -265432, -144831, 81480, 39098, -50591, -124878, -14767, -27452, -78129, -54239, 4289, -147002, -193112, -188242, -178772, -258276, -233790, -215903, -211089, -113624, -144465, -124309, -70733, -33041, -28875, 32490, 5178, 37541, 29767, -105567, -50503, 86862, -10939, -101533, -259950, -295982, -131184, -125886, -149832, -181128, -67140, 26845, -18442, -42215, -74215, -84756, -101564, -145460, -126138, -27172, 3800, 19924, 3002, 6997, -13552]
14108a3552m450P2180K5237n5549l7536j6182j15452P6110N5240j4669k5028Q2209
14096B8558L0343k8576L3545k5823l8898j6381k4176k4093l818N3098N3409q6297
14084d9109k2949l4365J5804J4044M8017k8353j1039M3655j12532L2738O5159
14073c8930J11895m8549r7362M9387P1211n8248j2903q6664n3440K831J14271
14062d6501K8521m1232r5645k4719L6514Q3779M9891M264k5225K5268K7269n920
14050A6264L5976j8559k2705r464q141l8864j35406K4295J66776J77071j36892
14039E0351j08495k8381K4373o9419q270J64426p8391J0493J28883q705j3309
14028F3556M3967P2591l7991l7906r6238p1359K0355n5559n0277Q6673q4882p9952
$$ y = [-13552, -18002, 54178, 79415, 23866, -13670, -29852, -145304, -69194, -13954, -28623, -53651, 28558, 58901, 30325, 63870, 38047, -851, -17232, -41408, -65501, -69319, -16221, 37188, -49109, -72058, -106423, -90619, -76575, -28558, -56911, -67950, -24295, -136827, -104089, -38930, 72965, 24416, -72946, -23559, 47652, -10596, -23499, -110163, -163603, -160772, -46501, -17980, -59212, -154857, -179576, -143062, -59283, -9392, -5128, -30353, -5085, 22184, 16264, 52240, 33681, 10976, 1512, -6629, -45493, -180899, -156604, 10172, 187243, 50351, -58144, -86525, -62152, -131571, -139841, 24585, -53806, -43313, 85570, 76865, 63556, 107523, 180114, 142123, 104217, 7979, -63380, -43025, -98584, -148861, -62188, -147070, -227022]
14016b27022P0740R3577J9859k5298k0192K9179J6204k8126l498L7357L2652M9982
14004D5414q9718r0329M3173J2129N3374O2440l5973Q91N4260J2421l2617n659
13992B9806j1404j05856m7546o8393R0405O7610J15595J32280P4081j57044o8234
13981E1300J09967j43807j66791M2546R5962r602O8481J2805L5901J4209r9120
13970A1851l0824O3279Q6900o714N1005j09029q0382o3737K5763Q5604P0564J8108
13958A22388p0062n4787p2634j00234l6167J59240N8013o4995q0079J3284J43159
13947A7126o7826o8775P2229O4373l8009O6494K3149K1511j05609J6911K8388
13936B9962p0952k8886O4650l5364l6033k3664q128m8052O003j9862p3133n025
$$ y = [-227022, -156282, -62705, -42846, -68144, -88336, -59157, -42953, -71079, -74577, -37220, -4568, 45414, -44304, -134633, -91460, -79331, -25957, 36483, 510, 1401, 55661, 68082, 35465, 29806, 18402, -87454, -135000, -203393, -112988, -45378, 70217, 202497, 276578, 119534, 51300, 161267, 17460, -149331, -106785, -10823, -20425, 48056, 60861, 96762, 110971, 11851, -18973, 44306, 131206, 124492, 175497, 66468, -13914, -77651, -51888, 33716, 104280, 122388, 52326, -2461, -75095, -175329, -211496, -52256, 5757, -59238, -139317, -126033, 17126, -50700, -119475, -47246, 17127, -20882, 45612, 68761, 90272, -15337, 1574, 29962, -40990, -69876, -5226, -40590, -76623, -100287, -108415, -156467, -150464, -170326, -243459, -248484]
13924b48484j8382K1038R5468Q3376O80r731J5108J97J3918n3753M4780j9466
13912g5251o0827r608O3226J02688o1241m4082O5565J7210q4830J05824P6069
13901I4743j27954n4340o988j5898l3379M4698N865O5211O9180n8534l2245R51
13889d8690k4799M4126k6807m0712R9970R792q8939j6860J15816p1080n5620p1710
13877a75513O9901k2628j20928O4389J7160o7541J28899j6973K4659Q0092p3415
13866i1898r8237m9505J2868M4817m7745k0183J18572J04376n1267r8981M5341
13855a31842J64454k4435p6106L3857j6975j7040J4948K715r1652j56924O6670
13844b32330J38030J9062k7836R6036q344o8067N0151M1350p0788K0854J5152
$$ y = [-248484, -266866, -245828, -150360, -66984, -66304, -76035, -60927, -60730, -46812, -100565, -55785, -75251, -136078, -145686, -82460, 20228, -41013, -85095, -19530, -2320, -87150, 18674, 94743, -33211, -87551, -94539, -110437, -143816, -99118, -93253, -28042, 41138, -17396, -49641, -48690, -73489, -29363, -56170, -96882, 3088, 12880, -76059, -92919, 22897, -48183, -103803, -175513, -105612, -128240, -249168, -184779, -167619, -235160, -106261, -123234, -98575, -18483, -91898, -190135, -239640, -226772, -181955, -229700, -249883, -131311, -26935, -78202, -177183, -131842, 32612, 8177, -67929, -34072, -51047, -68087, -53139, -50424, -142076, -299000, -232330, -94300, -75238, -103074, -7038, -15382, -83449, -33298, 8052, -62736, -41882, -26730]
13833b6730l3739k6473M6366K7283P5785N9502m1293j0938o0337r6297M149r831
13821i2553q5752j25799j0787J4076J422P3165J24610J31430Q5462M7843k0088
13810A43029K3500J1094j16411p2912l2547L5213O8493K4740p5983p2844j44473
13799b09101q5499J45479J31285R9163n3088j11930j1760L9819R9782l8511j12986
13788a07347j43306R6467M8961J2469m7770J11556J25626K8074M441j05416o8828
13777d5073p4897Q2308J57498K9188l5531j24472L492J01058j6832j2836j70515
13766a06612N7777J23478J5760o5305j78453m0244Q2287j7932R635J25358L0317
13755C6066o8066r9941j9971J1159J08087K5742R7280n0492p1380K7307J3791
$$ y = [-26730, -60469, -86942, -40576, -13293, 62492, 121994, 80701, 69763, 9426, -86871, -82722, -92553, -178305, -304104, -314891, -300815, -299393, -226228, -101618, 29812, 115274, 163117, 143029, 166529, 177623, 61212, -11700, -44247, -9034, 59459, 84199, 8216, -64628, -209101, -294600, -149121, -17836, 81327, 28239, -83691, -95451, -55632, 44150, 5639, -107347, -250653, -154186, -105225, -92756, -140526, -28970, 96656, 124730, 129171, 23755, -45073, -119970, -37662, 119836, 149024, 113493, -10979, -7487, 93571, 76739, 63903, -106612, -48835, 74643, 90403, 25098, -153355, -193599, -111312, -129244, -119609, 5749, 36066, -32000, -131941, -151912, -140753, -32666, -6924, 90356, 39864, -31516, -4209, 9582]
13744I582r97j7850k4884O4332J04576K01323r0849j69730j73932N666N8327R0820
13732E6384n545o0587l1210j12338K2001R5469N1688Q4917o9555R4726J44282
13721B70232p0057j40319Q7463P673o5190p8275O8K403M3198k0983K3720J5796
13709G5729m5603j16820L7558L6473k5899N3614m58n8196M9553l9246n7547R104
13697h1738R6122J3831K2643k8899L8848q232K989K0550R6250M9606o1700j36497
13685B3773l1915r3539m8350M1532n1627m3183j2119K28890N8233l6475J51979
13674A87199J08009j18927l8124k0601j18041j19103q491J57158j9449r8695R2611
13663C546R6205k4618k6514J4240N485K0460n8263m6188n6321J9665o6422M1542
$$ y = [9582, 8585, -9265, -34149, 30183, 134759, 336082, 245233, 75503, -98429, -92763, -34436, 56384, 50839, -9748, -40958, -153296, -131295, -35826, 15862, 100779, 31224, 125950, 270232, 200175, 59856, 147319, 154992, 89802, 11527, 11595, 13998, 57196, 36213, 59933, 75729, 30126, -86694, -49136, -12663, -38562, 15052, 14594, -43602, 5951, -33295, -90842, -81738, 14384, 28215, 50858, 21959, 60807, 52575, 55564, 76114, 172364, 221970, 160270, 23773, -8142, -101681, -150031, -108499, -160126, -203309, -215428, 13462, 71695, 35220, 187199, 295208, 176281, 138157, 117556, -485, -119588, -128079, 29079, 9630, -89065, 3546, 99751, 75133, 48619, 62859, 68344, 88804, 30541, -15647, -71968, -52303, -118725, -77183]
13651g7183K4601j28273l1878L1189M2953J2487J32154l9977j2768J4340Q8661
13640E6306k0675P7537Q4503p8152j26096q6062L0419M7212N4818J06570l0867
13629A15513l6082o6769L4737J1468L7082j5165o7362k9020m2235p494l6327j1880
13617a13534j5284J04969J69108m4185j41895j5100K1109j9040p516j09258n5770
13606b26396Q6594N7944L8156j37223m7936l0746J51205J15043K9163n4449o4275
13595h2920K5275J0025J6258L5732k9555p1390J2677j39687r58N1842R959K08710
13583D5968L0708r4114j06446o0172O1004R9117m6364p3726k8456P9934l3127
13572a25674J65338P4715n8208q6906N7324k3454o5964J13904O2263n1516j3521
$$ y = [-77183, -52582, -180855, -212733, -181544, -138591, -126104, 6050, -33927, -46695, -32355, 56306, 35631, 113168, 197671, 119519, -6577, -92639, -62220, -15008, 39810, 146380, 115513, 79431, 12662, 47399, 58867, 95949, 80784, 13422, -15598, -57833, -65327, -101654, -113534, -128818, -23849, 145259, 101074, -40821, -55921, -34812, -53852, -61368, -170626, -226396, -139802, -81858, -43702, -180925, -228861, -259607, -108402, 6641, 35804, -18645, -82920, -57645, -47620, -31362, 4370, -25185, -96575, -83898, -223585, -224543, -172701, -162742, 45968, 76676, -17438, -123884, -184056, -123052, -23935, -70299, -144025, -172481, -92547, -125674, 39664, 114379, 56171, -30735, 26589, 3135, -62829, 51075, 113338, 61822, 48301]
13561D8301l4393j0262K666p0542l7586J08352m688j7339L1319P0419j9576K9514
13549I6185n999o5078r0057n7620R9686K9708O3154P9906j58652q3069Q0j2278
13537a04034J4046j8794P5613o2843p5273J14679q2957j2236M297J1051P974L5056
13525i3421R2855M5218q6894O5601N2697J1870j14760r4351L7505p4701k3781
13514a82162O5599O2598J21651K654m7659n2468o5372j560k2481J014J9197Q1728
13502a7261J27338J1866p8402M1131J7059J6539M587l9060o6061j21712K0275
13491h3701K5189o0260P2014L5709n8725Q364P9315Q8857m6793p5296J3719N0479
13479D8871L2248J5533P2084j0119q8962Q1230J14444P9510N3018J0476o1829
$$ y = [48301, 13908, 3646, 6312, -64230, -101816, 6536, 1848, -15491, 15828, 86247, 66671, 96185, 90186, 25108, -64949, -122569, -22883, 6825, 69979, 149885, -8767, -91836, -91756, -104034, -89988, -108782, -33169, -96012, -171285, -56606, -139563, -151799, -147502, -136451, -128477, -93421, -566, 44652, -42242, 23359, 76056, 87926, -26834, -121185, -83680, -158381, -182162, -116563, -53965, 67686, 70340, 22681, -29787, -95159, -96719, -119200, -118186, -98989, -17261, 110077, 121943, 43541, 84672, 101731, 118270, 122857, 83797, 17736, -103976, -83701, -58512, -118772, -46758, -11049, -69774, -61410, 17905, 106762, 59969, -15327, -1608, 48871, 81119, 96652, 168736, 158617, 69655, 150885, 265329, 344839, 397857, 408333, 346504]
13468C46504k7239M3716O635k0316m7006n4451n9930j12527n7819j2066K3297
13457B8798m5709J4980m9282R7619L3544k3067M3967o5601N0986J31800k6173
13446A91862n6910o5055L0478P3605j25132j7393O0194M6737k7286r5960Q2202
13435I7342j35728j17522p1592O1999J27327K04129Q8399k920p1709p8385k77
13424A01063L1079k1627o3408N7288K667j29563N0614J48676n257r6080n3139
13413B2313m5659M9158q2747p0058J41931J62888k5443n4615k0360k375j2216
13402F2817L787N9678p4845q9486r8610l1016Q2117J08209Q3193P6154l1020p1998
13390G8980K7941J23510Q5714o6594n4714q9646m1550J7892j6204k3940M1781
$$ y = [346504, 319265, 362981, 369616, 349300, 302294, 247843, 187913, 75386, 17567, 5501, 28798, -16911, -1931, -51213, 46406, 79950, 56883, 100850, 35249, 86235, 218035, 191862, 134952, 69897, 100375, 173980, 48848, 31455, 91649, 138386, 111100, 15140, 97342, -38386, -155908, -227500, -165501, -38174, 165955, 254354, 251434, 179725, 101340, 101063, 132142, 110515, 47107, 104395, 107062, -22501, 28113, 176789, 171532, 75452, 22313, -23346, 25812, -56935, -126993, 14938, 177826, 152383, 97768, 77408, 75033, 62817, 66604, 126282, 51437, -38049, -136659, -167675, -85558, 22651, 105844, 181998, 150978, 78980, 106921, 230431, 316145, 249551, 194837, 105191, 63641, 81533, 65329, 41389, 83170]
13379H3170L9818J2418M6950M4338j00694q6619j7461q0999k7857Q3213J7876
13368A4153J0652O8913M3345q2083k2089N2602l706n0597p11n0243N4047J18604
13356A52887O1618p4302j04900l7241j4018N7248K4957j45820o600J28118L8523
13345H0470k6898m3013j26535k1862m5740L3773p4122r1079P6266J53383Q1865
13334c492J8996n8159R0695n9925j06512j370J69084m2662k0743k5776M2078M4743
13322D6957P1755j28455L4678Q8852l039q944M3156p7448p0766M1376p3488Q2322
13310D6956P3983L8323j7131l5083L997J22665j2328m8338P3726M0564J177n6666
13298B31845q9920j9807j10829j7644K4724J08069j8874q0377L928m204k0241
$$ y = [83170, 122988, 135406, 182356, 226694, 126000, 39381, 21920, -59079, -86936, -3723, 14153, 24805, 93718, 137063, 54980, 32891, 85493, 81787, 31190, 30479, -19764, 34283, 152887, 214505, 140203, 35303, -1938, -15956, 41292, 66249, -79571, -86171, 41947, 80470, 53572, 10559, -115976, -137838, -183578, -149805, -223927, -315006, -238740, -85357, -3492, 15504, -42655, 48040, -11885, -118397, -119767, 49317, 6655, -14088, -39864, 2214, 46957, 118712, -9743, 24935, 113787, 110748, 101804, 144960, 67512, -3254, 38122, -35366, 46956, 120939, 159262, 142131, 107048, 111045, 233710, 221382, 173044, 246770, 287334, 288511, 231845, 141925, 122118, 11289, -6355, 18369, 126438, 107564, 27187, 31115, 26911, 6670]
13287F670o4585K7682O4794j21652q9424k8495J74349K35642O8623K8381k39354
13276F2631p7142m143J67886j8676o0606J6437p762R4738p869j9265q2339j2758
13264E1132Q1532N7163o3242P687R2001M4384n734m5429r2264j8460r6916N0099
13252F1953J02133K2491l4531L0684R6051r0130q8901q6005J55317K4436K1941
13241B15439l8563n0328j02113m2251j3660R9833k6745L3343J28672m0509j37169
13230B5949J5073J34821L4247m9036n6534P5348L8137m922J4439N396k2445j02303
13218A08170J57439l6571r1894q2242N885P3042L5688j13758Q352P5385m3252
13207I6244K9343L6777j05241k8599J11257P6280k4864m4345r5473N970J2860
$$ y = [6670, -57915, -30233, 34561, -87091, -176515, -205010, -30661, 204981, 273604, 301985, 62631, -14511, -18654, 149232, 130556, 69950, 86387, 78625, 173363, 165494, 146229, 63890, 51132, 132664, 189827, 126585, 134272, 226273, 270657, 264923, 219494, 127230, 108770, 11854, 61953, 164086, 186577, 152046, 182730, 278781, 188651, 99750, 13745, 169062, 193498, 215439, 176876, 126548, 24435, -17816, -31476, 68357, 41612, 74955, 203627, 163118, 25949, 41022, 175843, 210090, 161054, 104520, 179868, 218005, 213083, 227522, 232918, 210473, 108170, 265609, 229038, 137144, 54902, 60787, 133829, 169517, 55759, 64111, 139496, 96244, 125587, 162364, 57123, 28524, 139781, 216061, 191197, 146852, 51379, 57349, 70209]
13196G0209L1285k0837m114O9408j1631n9088L2326J498j71514j24719P2993J11006
13184c178N9196J16016r7467J18631n453j67794J1704j7683m7852M2892J32587
13173A41599K3694m6350j0728k9123j65286k4507P0705J16905k8530l6445q1673
13162f9739k9464J67293J57329j25678j05232p2850J5031P9967P921n1229M8592
13151B1941J12994N2591O0040K6050p8127j84186p0945K3802R009M9239l6955
13140a4547j0091o4327K6566L1369Q6123j0312p1389Q502N4061n6266J2406O3583
13128E5678k9935Q5932J00212k8725j9318p7466m812P1268M9667j65297l5383
13117A821Q2129m6626J2993N2924l5351k0526Q2911K1890m2396n5364N2492Q9024
$$ y = [70209, 101494, 80657, 76543, 145951, 134320, 75232, 107558, 109056, -62458, -187177, -114184, -3178, 56018, 172034, 74567, 193198, 187745, 19951, 31655, 13972, -33880, 9012, 141599, 165293, 118943, 108215, 79092, -86194, -110701, -39996, 76909, 48379, 11934, -69739, -99203, 68090, 225419, 99741, -5491, -78341, -63310, 16657, 24578, -26651, 21941, 134935, 187526, 247566, 273616, 195489, 11303, -59642, -35840, -26831, 22408, -14547, -24638, -88965, -62399, -31030, 55093, 44781, -26608, -18106, 35955, -20311, -7905, 55678, 25743, 111675, 211887, 183162, 163844, 86378, 81566, 152834, 202501, 37204, 1821, 83950, 37324, 50317, 103241, 67890, 47364, 130275, 152165, 109769, 54405, 106897, 195921]
13105A95921K5225m1719l370R2173j65519o7958O1991n338N8427j02390m656J7153
13093E9940K9823L4603k40764n2463R6814L2313k691P2435M9358J63974J00419
13082C43761r0026j27111p1163q985R4797J00740K0575k2157j10119r5854Q4726
13071A19184J52404k7931m4223r321O6640m09p9312k6835N6248j9919P0541J77996
13059D35063n3029j58732o979m4745j46376m0037N9439j7698P1673M1941p2598
13048F7922k9649N54o1534k4470l6204K7600J07227J31113K20323j5422k34896
13037A52564j16704k2814J26839P990J4968J3555o6959O4429J20168M0914j91479
13026A43471j60740j8472j15960j23794J60613K38025N7424J11460r3746l5711
$$ y = [195921, 221146, 179427, 176057, 268230, 102711, 34753, 96744, 91406, 149833, 47443, 42787, 59940, 89763, 124366, -116398, -168861, -72047, -39734, -42425, 30010, 79368, 243342, 343761, 253735, 126624, 55461, 46476, 141273, 242013, 262588, 240431, 130312, 34458, 119184, 271588, 243657, 199434, 190113, 256753, 256344, 177032, 150197, 206445, 186526, 257067, 435063, 382034, 223302, 216323, 171578, 25202, -14835, 44604, 26906, 98579, 140520, 67922, 38273, 38827, -22707, -47177, -83381, -55781, 51446, 182559, 402882, 387460, 152564, 35860, 13046, 139885, 147875, 162843, 176398, 109439, 173868, 294036, 334950, 143471, -17269, -35741, -151701, -275495, -114882, 123143, 180567, 292027, 198281, 162570]
13016A62570k5362l4889R8248L0929m5673q6396j1759m3707O0179M417p6887K1487
13004E3157N5215n8325l1499J29664L8192k6496l4363p8228P1565J03720l408
12993B19194q4605p3487r9202K3939Q6843O5678m447l1919L2226P3549J69293
12982C77062J6919j18128q5050K7835o9653k0900j4013Q22m6653J9858r1529r3484
12970i6914J20470M4324M7090J43043k451n2581P1991j29865j15334m1574j9741
12959c1542P0554m626j307R9408j0974O5262K9077O4065q3260j17183o3017P5592
12947I2049L2013j1972n2470M5597P9262K2062Q9192j2459L6316o5745j03335
12936A50510r0226m9108m6718J2017J25883O3892j9398j11309j20716R710J38944
$$ y = [162570, 137208, 102319, 200567, 231496, 185823, 99427, 87668, 43961, 104140, 108557, 31670, 53157, 108372, 50047, 18548, 148212, 186404, 159908, 125545, 47317, 118882, 222602, 219194, 134589, 61102, -38100, -14161, 72682, 138360, 133913, 101994, 134220, 207769, 377062, 393981, 275853, 190803, 218638, 148985, 128085, 114072, 114894, 68241, 88099, -3430, -96914, 23556, 67880, 114970, 258013, 255562, 202981, 274972, 145107, 29773, -11801, -31542, 39012, 34386, 33079, 132487, 121513, 186775, 215852, 279917, 196657, 79474, 16457, 92049, 124062, 112090, 59620, 105217, 184479, 206541, 295733, 283274, 319590, 253845, 150510, 60284, 11176, -35542, -23525, 102358, 166250, 146852, 35543, -85173, -75463, 63481]
12925F3481J29006R8518N4624j66159j85290k8409O7297Q0467L6988m8323o105
12914I6095o7252L7975K3969l0594J15355P4937n5411N055N186J22328l7231l9715
12902B50697j00460q3709N428M1684J0371L4240R0326o906j53728p1217J08847
12891A25573J15730r7807o0384O8440l5819M1525K8344n1859k2647J3236J4059
12880A38391j9077k9155L6254J5971L0571J13339p0789m3730j7604O6218P6206
12869B96595j0814k3662j8723j24866l9518M3415O490N971Q4855O5300p4872o2191
12857A47980k7367L596l9299M6884K2222L8221M9989K8888r9638L5336K7486l7868
12845A96430J0248N1810o7482k3791L0426R2867J20178P3053J6320p0141Q2181
$$ y = [63481, 192487, 291005, 345629, 179470, -5820, -34229, 33068, 113535, 150523, 102200, 96095, 28843, 66818, 90787, 60193, 175548, 250485, 195074, 200129, 205315, 327643, 290412, 250697, 150237, 66528, 71956, 113640, 124011, 158251, 248577, 241671, 87943, 16726, 125573, 241303, 143496, 83112, 151552, 115733, 157258, 185602, 133743, 111096, 124332, 138391, 119314, 90159, 126413, 142384, 172955, 286294, 215505, 171775, 154171, 220389, 296595, 285781, 262119, 243396, 118530, 79012, 122427, 128917, 134888, 219743, 285043, 210171, 147980, 120613, 124209, 84910, 131794, 154016, 192237, 242226, 271114, 171476, 206812, 234298, 196430, 206678, 258488, 191006, 167215, 197641, 290508, 410686, 483739, 500059, 429918, 512099]
12834E12099J7486j22834J578M1595j3349p4927q4049J05166J02023k8916j45184
12823C10688j48603j03242M1418P7740R3133R946q0901n5568j04099K5796O7262
12812A33570J2861P4927K2311q7508j15458M2111L2769N9570k8541j05k7664n6934
12800F1909P0064Q220j00096j31714J11464J17844j9799J09658N4408K1245N6403
12789C59606R633n3370N8911O1091M4439L8500o2048m0616q7636q0099M902L8469
12777B91782Q5601r4432o9041N411N190L5082Q3963P9465o6115j19659J375j095
12765B37527M709J61384j45425j96628K0159O5148N7555P8367k1581l1381O0607
12754B90441J26488O4690k1615j55840j40903K8442R5115N2208N5409l093L7064
$$ y = [512099, 529585, 406751, 408329, 449924, 436575, 361648, 277599, 382765, 484788, 455872, 310688, 162085, 58843, 100261, 178001, 271134, 281080, 200179, 144611, 40512, 66308, 133570, 146431, 221358, 243669, 156161, 40703, 82814, 115583, 175153, 146612, 146507, 118843, 61909, 131973, 140193, 40097, -91617, 19847, 137691, 117892, 227550, 281958, 303203, 359606, 369239, 315869, 374780, 435871, 480310, 518810, 456762, 416146, 328510, 248411, 253313, 291782, 377383, 282951, 213910, 219321, 224511, 259593, 343556, 423021, 356906, 237247, 238622, 237527, 242236, 403620, 258195, 61567, 81726, 146874, 204429, 282796, 261215, 229834, 290441, 416929, 481619, 460004, 304164, 163261, 191703, 286818, 339026, 394435, 391342, 428406]
12743D28406m3186n6398R4371j6527K0924j2705j17231j15471J06578q3302R1910
12732B97369L9566R0590o6146j01849o1398Q1630J07804K6616n9792l8423K8826
12721C44793m6798j0659Q99K4259K7082Q5274L0741k6773N0805j88699j4160R9677
12709C76441R6093l7321m5277R6799J27603K05954q785j87420j34790m961j2773
12698D71563j45109l6390M6240J65520J43818m1844j44749q8557n312J36859k4175
12687D77864j735L3351k6058o6757o6260Q6829R9613M0293o6388L5810L0137M0369
12675F17068O2450j21501M9273M2828J2664m7944L9448P191p8926j04210q2834
12664C95507l9948j6080O6244M4853q2597k672R6580J6566q2185M0973P9445M4292
$$ y = [428406, 385220, 328822, 423193, 406666, 427590, 414885, 297654, 182183, 288761, 205459, 297369, 336935, 427525, 361379, 259530, 198132, 279762, 387566, 414182, 354390, 315967, 344793, 297995, 287336, 288235, 312494, 339576, 424850, 455591, 428818, 479623, 290924, 276764, 376441, 472534, 435213, 389936, 486735, 614338, 820292, 811507, 624087, 489297, 484336, 471563, 326454, 290064, 336304, 501824, 645642, 603798, 459049, 370492, 365180, 502039, 477864, 476129, 509480, 483422, 416665, 350405, 437234, 536847, 577140, 510752, 546562, 576699, 617068, 679518, 558017, 607290, 650118, 662782, 614838, 654286, 661477, 582551, 478341, 395507, 355559, 339479, 405723, 450576, 367979, 365307, 461887, 478453, 396268, 437241, 516686, 560978]
12652E60978k368l9552K779J14691J2114k251J4130j3441j3890O038K7192q6707
12640E79713N5588Q0749j7209j28342J15805N6699j2023o953N7868L2429L2069
12629H46393O8699j18827M218L3788k7958j15854Q0893n2302J0768J16734p1398
12618G75154k1112K5163k4014l0194l8550k7683n9605k0721R607J02958M9071
12607G40074m735R3668Q4824L3931K9012j7414q189j4552L6257R933j25687n5506
12595H01616P8857J1904q3123J3247L1102L5630O950l068P8256M8470Q796P9508
12583A108145O2404o6910Q076M1756J05621m7883r9787o6413N097K58850J82870
12572A491826k9119q207K1710Q137p0681J72623J48258J71438K60067K22285M48585
$$ y = [560978, 558610, 519058, 521837, 636528, 648642, 646391, 660521, 647080, 633190, 639228, 666420, 579713, 635301, 716050, 698841, 570499, 686304, 743003, 730980, 724027, 781895, 814324, 846393, 915092, 796265, 800483, 834271, 806313, 690459, 771352, 719050, 729818, 846552, 775154, 754042, 779205, 755191, 724997, 686447, 658764, 599159, 578438, 588045, 691003, 740074, 735339, 829007, 913831, 947762, 976774, 959360, 951171, 936619, 972876, 982809, 857122, 801616, 880473, 892377, 809254, 822501, 853603, 889233, 896183, 893115, 971371, 1019841, 1028637, 1108145, 1170549, 1103639, 1111715, 1153471, 1259092, 1211209, 1111422, 1045009, 1050106, 1308956, 1491826, 1462707, 1454500, 1476210, 1484347, 1413666, 1586289, 1734547, 1905985, 2166052, 2388337, 2836922]
12561B836922M58028L24540L30769J50541o2695q4566k50572l29242l45134k90305
12551B738286k38845j40398k03248k87977n9016k0627m5199Q1725q1718j46375
12541A596608l4783K295O125N1045o1198J9685J3762o5106k5063N0872J6071J08726
12529A679039K6869J5425R8124J6779n6589p991J3410j0444l5712K3821q2879
12518A679852k8460J14573J56189J6872l2646J34804L4663k3501j57250L2373
12508A927469J36826J54446J6301n0979q2925L609Q7299N3606L9048q2154n7805
12497B144741K8212O8955J8124n3834n1783P9262m5656q4290j1681J2265K02706
12486B307021O4491J7270j30182N6553K27004M4732p9406o0133r025P143R267
$$ y = [2836922, 3294950, 3619490, 3950259, 4100800, 4038105, 3953539, 3702967, 3373725, 3028591, 2738286, 2499441, 2359043, 2155795, 1867818, 1808802, 1788175, 1742976, 1824701, 1742983, 1596608, 1561825, 1564120, 1570245, 1621290, 1560092, 1579777, 1593539, 1528433, 1503370, 1554242, 1570313, 1679039, 1705908, 1721333, 1819457, 1836236, 1779647, 1771656, 1785066, 1774622, 1738910, 1762731, 1679852, 1651392, 1765965, 1922154, 1939026, 1906380, 2041184, 2075847, 2052346, 1895096, 1927469, 2064295, 2218741, 2235042, 2184063, 2101138, 2104747, 2192046, 2245652, 2284700, 2202546, 2144741, 2172953, 2241908, 2260032, 2206198, 2154415, 2233677, 2188021, 2103731, 2092050, 2104315, 2307021, 2371512, 2388782, 2258600, 2315153, 2542157, 2586889, 2507483, 2447350, 2438325, 2445468, 2454735]
12475B454735M2142J32499Q7425l9420J179N536L3365M9217J24451K43448Q4547
12464C219124j25407j21957K6208R3726J77003O6244K7078j3808k0483Q9481p933
12453C409276K1351K3713k7903M9413K5876M6011J18783J55400O8981J40907O0519
12442D092327P6312k6451N4637j0305q0828q6066J44972J00192J13345R4601J35498
12431D608234j7472K8897J59277J84579M0488P6226J13323J04062Q10N4918J64935
12420E518277J77223J06882P3074n755O3492M7741Q5971K49349J47461P4349J02046
12409F640110J00580J81770K81777J45696Q9665J35153J31960K46968K57947J18836
12399H330462J62277J96853J91933J86759J42868L0588J7219j7773L53046L91396
$$ y = [2454735, 2496877, 2629376, 2716801, 2677381, 2678560, 2684096, 2717461, 2766678, 2891129, 3134577, 3219124, 3093717, 2971760, 2997968, 3091694, 3268697, 3334941, 3362019, 3348211, 3327728, 3417209, 3409276, 3430627, 3454340, 3426437, 3475850, 3501726, 3547737, 3666520, 3821920, 3890901, 4031808, 4092327, 4168639, 4142188, 4196825, 4186520, 4105692, 4019626, 4164598, 4264790, 4378135, 4472736, 4608234, 4590762, 4619659, 4778936, 4963515, 5004003, 5080229, 5193552, 5297614, 5298424, 5353342, 5518277, 5695500, 5802382, 5875456, 5869701, 5933193, 5980934, 6066905, 6316254, 6463715, 6538064, 6640110, 6740690, 6922460, 7204237, 7349933, 7439598, 7574751, 7706711, 7953679, 8211626, 8330462, 8492739, 8689592, 8881525, 9068284, 9211152, 9241740, 9258959, 9241186, 9594232, 9985628]
12389I985628J98115K18995O1626J97794L00539L23689M30035L22777L06117K88490
12379A2633805K31895L02722J59098K28190K41651K99284K79401L50863M35358
12370A5162267M97134M09540L39410N33965N76571M20880L73885M76190N40243
12361A9330085N20085O11673O46633O35582O25653N96998O90972O59119O81698
12352B4998498O46934Q75607J050483R11668R14639R70539J007607J019617R95591
12343C3391183J087992J020580J047105J176145J248316J212765J329681J477736
12335D2991503J393310J223762J436716J572547J388020J349147J462271J588096
12327E4405372J580933J384940J437803J417609J290809J329094J135403J098245
$$ y = [9985628, 10183743, 10402738, 10464364, 10662158, 10962697, 11286386, 11716421, 12039198, 12345315, 12633805, 12865700, 13168422, 13327520, 13555710, 13797361, 14096645, 14376046, 14726909, 15162267, 15659401, 16068941, 16408351, 16942316, 17518887, 17939767, 18313652, 18789842, 19330085, 19850170, 20461843, 21108476, 21744058, 22369711, 22966709, 23657681, 24316800, 24998498, 25645432, 26521039, 27571522, 28483190, 29397829, 30368368, 31375975, 32395592, 33391183, 34479175, 35499755, 36546860, 37723005, 38971321, 40184086, 41513767, 42991503, 44384813, 45608575, 47045291, 48617838, 50005858, 51355005, 52817276, 54405372, 55986305, 57371245, 58809048, 60226657, 61517466, 62846560, 63981963, 65080208]
12319F5080208J072775J064889R90860P83008P21954O77001N57941M11742L20975
12310G1681353N4644j36864j19376l26347m24203m52437m28982o05633q50971
12301F8391184r97456q60875r32675j093130j030548r07380j019308j304365j190642
12292E9054805j175538j079266j168737j092890j034407j051720j046315j100020
12284E0305912r77333j048955q69009q72866q28823j060017q96598o72396p97532
12275D2282383o91590o75347o88987p84604o20853n71169n74923o71881n45138
12266C6457891o38292o18515n74687n93590o04114n89167n18715m64496n68907
12257C1287408n87717m69268m97378m11239l81526m22427n55235n05686n28633
$$ y = [65080208, 66152983, 67217872, 68208732, 68991740, 69713694, 70390695, 70948636, 71360378, 71681353, 71735997, 71599133, 71479757, 71153410, 70729207, 70276770, 69847788, 69242155, 68391184, 67393728, 66532853, 65600178, 64507048, 63476500, 62569120, 61549812, 60245447, 59054805, 57879267, 56800001, 55631264, 54538374, 53503967, 52452247, 51405932, 50305912, 49328579, 48279624, 47410615, 46537749, 45708926, 44648909, 43752311, 43079915, 42282383, 41590793, 40915446, 40226459, 39441855, 38821002, 38249833, 37674910, 37003029, 36457891, 35819599, 35201084, 34626397, 34032807, 33428693, 32839526, 32320811, 31856315, 31287408, 30699691, 30230423, 29733045, 29321806, 28940280, 28517853, 27962618, 27456932, 26928299]
12248B6928299m99173n19936n86282n56559m13504l73278m47178l55935l31784
12239B2844670l54345l95914m55787m42316k66045k94714l12894m43254m37430
12230A9441971k68812j87495l24244l42003l57859k57009k70337k46840k01309
12221A6986063l46372k29247j82308j54789j55889l08926l21284k88500k50357
12212A4748391k25662k10018j95229k54507k26876j85236k47871j90600j00211
12203A2912181j66274j12000m7650j84685l02062k11845j13190j52031k48539
12194A1373905k06193k70758j22350j98428j86006o1345j12625r8534j49329j63652
12184I804685Q5936J52880R4337k3808q1718p908J63199K75090K10481J64474
$$ y = [26928299, 26429126, 25909190, 25322908, 24766349, 24352845, 23979567, 23532389, 23176454, 22844670, 22490325, 22094411, 21638624, 21196308, 20930263, 20635549, 20322655, 19879401, 19441971, 19173159, 18985664, 18661420, 18319417, 17961558, 17704549, 17434212, 17187372, 16986063, 16639691, 16410444, 16228136, 16073347, 15917458, 15608532, 15287248, 14998748, 14748391, 14522729, 14312711, 14117482, 13862975, 13636099, 13450863, 13202992, 13012392, 12912181, 12745907, 12633907, 12586257, 12401572, 12099510, 11887665, 11774475, 11622444, 11373905, 11167712, 10896954, 10774604, 10576176, 10390170, 10328825, 10216200, 10117666, 9968337, 9804685, 9890621, 10043501, 10137838, 10114030, 10032312, 10024404, 10187603, 10462693, 10673174, 10837648]
12174A0837648K25919K82109L66511M12268L65206M81696P66539J043030J126092
12165A5907018J682572K279020K620696K733200K952517K814080K800001K847685
12157C6636789K888303L694701N508585Q748532J4620128K4021577L7105609N1691397
12149A84915621O4082198P0144023O8012130N6912549L6586746Q523587k1133390
12142D68043464m5295909n9640621o5027859o2772287n3856925m0625094k7323030
12135A13501739j7541875j1437755p738475n465872m350036l859548l802304l767586
12127E5538288l832778l948938l858591l592133l101914k605609k147714j818693
12119C0631918j339208j022804r19627q58980p57042p15131m50611l72223k62540
$$ y = [10837648, 11063567, 11345676, 11712187, 12124455, 12489661, 12971357, 13737896, 14780926, 15907018, 17589590, 19868610, 22489306, 25222506, 28175023, 30989103, 33789104, 36636789, 39525092, 43219793, 48728378, 57476910, 72097038, 96118615, 133224224, 184915621, 248997819, 319141842, 387153972, 444066521, 480653267, 489176854, 468043464, 422747555, 363106934, 298079075, 235306788, 181449863, 140824769, 113501739, 95959864, 84522109, 76783634, 71317762, 66967726, 63108178, 59305874, 55538288, 51705510, 47756572, 43897981, 40305848, 37203934, 34598325, 32450611, 30631918, 29292710, 28269906, 27350279, 26491299, 25734257, 25019126, 24568515, 24196292, 23933752]
12110B3933752l2546J11806L68677M73447O96913Q80391R26281J095952J368376
12101B9823049J780923K108858K269056K456871K539259K677037K562708J972487
12093D8190248J128852K63731n74635j554549k272698k833123k923520k760368
12085C6663938k592214k201857j963715j744242j596434j385844j271360j227051
12077B2681221j095992j016543r63023p79194q09056q43247q62602n73863m59185
12068A5278516n47495m49609m97785m55591m37415l22302k07016l06372k01688
12059A1853243k24737l20479k48658j70444l23796k80999j66535l21760k17909
12050I577926k14908j57202j66997k39756o0473q2047k9139o9571q9820k58012
$$ y = [23933752, 23901206, 24013012, 24381689, 24855136, 25552049, 26432440, 27358721, 28454673, 29823049, 31603972, 33712830, 35981886, 38438757, 40978016, 43655053, 46217761, 48190248, 49319100, 49582831, 49008196, 47453647, 45180949, 42347826, 39424306, 36663938, 34071724, 31869867, 29906152, 28161910, 26565476, 25179632, 23908272, 22681221, 21585229, 20568686, 19605663, 18826469, 18017413, 17174166, 16311564, 15737701, 15278516, 14731021, 14281412, 13783627, 13328036, 12890621, 12568319, 12361303, 12054931, 11853243, 11628506, 11308027, 11059369, 10888925, 10565129, 10284130, 10117595, 9795835, 9577926, 9363018, 9205816, 9038819, 8799063, 8738590, 8656543, 8627404, 8557833, 8468013, 8210001]
12040H210001k46073j23478k08132j88739k67051j04384k63118k40870j33735
12031F434421r7608j8172j06184j76978o3417j51070j53498M0978P9705O4994
12021E853171J34962J85474J91331L61407J34626r4885j54180j87342q7574k16576
12011F120414m28478l85896j84240j40437j91742j93830k27761k01408j26673
12002D039949k1296p8278r2238j89456j25110j3598l0084J8941p5433n0452m8855
11991C334090o254k6020p4490o7541J9599O8356L0173j458j0061j84719j11148
11980B970527L0336J19970J25196J20344J87557R7269J06175J71481Q4802m2398
11970C971259j77309j82481j02628l7217j15955j90520j03163N7474k944j85316
$$ y = [8210001, 7963928, 7840450, 7632318, 7443579, 7176528, 7072144, 6809026, 6568156, 6434421, 6336813, 6318641, 6212457, 6035479, 5972062, 5820992, 5667494, 5708472, 5788177, 5853171, 5988133, 6173607, 6364938, 6726345, 6860971, 6766086, 6611906, 6424564, 6336990, 6120414, 5691936, 5306040, 5121800, 4981363, 4789621, 4595791, 4368030, 4166622, 4039949, 4018653, 3940375, 3848137, 3658681, 3533571, 3519973, 3489889, 3508830, 3433397, 3382945, 3334090, 3327836, 3301816, 3227326, 3159785, 3179384, 3247740, 3277913, 3276455, 3266394, 3081675, 2970527, 3000863, 3120833, 3246029, 3366373, 3553930, 3651199, 3757374, 3928855, 4013657, 3971259, 3793950, 3611469, 3508841, 3471624, 3355669, 3165149, 3061986, 3119460, 3116516, 2931200]
11960B931200j61460j00816n5787k4163j2814l2843j86415k31426j24540k4345
11950A976591L2381J8208n344j2617j71673j29224j7048J1022k076r6217j14228
11939A489775M0340Q308l8525R990n3737K7994j14949j12233n5632J62526J7783
11928A381640j5386o9115o4690O1804o1812K38n2486M8933M565r2922l0349N923
11916A116343M9268R7780Q951m8464n7638n4426K8523L321l1500R6288k2068j51393
11904A034985j52160o7480j1372P2014J09688M0894R221L0588J49160N1530J18399
11893A385467K2885j17394k43512r3714m9314n5542q133N615m5048n6169J9487
11882G64628N6402J8152p5161m1475k0278P5370J8648o3374q835J18143Q335n6000
$$ y = [2931200, 2769740, 2668924, 2613137, 2588974, 2576160, 2543317, 2356902, 2125476, 2000936, 1976591, 2008972, 2027180, 2021836, 2009219, 1837546, 1708322, 1691274, 1702296, 1700220, 1604003, 1489775, 1530115, 1538423, 1499898, 1509888, 1456151, 1484145, 1369196, 1256963, 1201331, 1363857, 1381640, 1366254, 1297139, 1232449, 1294253, 1232441, 1232679, 1180193, 1229126, 1233691, 1140769, 1110420, 1116343, 1165611, 1263391, 1272342, 1223878, 1166240, 1111814, 1140337, 1143658, 1112158, 1208446, 1186378, 1034985, 882825, 815345, 803973, 875987, 985675, 1026569, 1035790, 1066378, 1215538, 1267068, 1385467, 1408352, 1290958, 1047446, 953732, 904418, 848876, 840743, 846358, 801310, 745141, 764628, 821030, 839182, 764021, 722546, 702268, 777638, 796286, 732912, 724077, 842220, 850555, 794555]
11870G94555o6444k393P6175r9690r0343P9338N0512L6590P1405m1783k3010J4334
11858G99246m5642o8012j2021o7121p5689M9724J9188n1511P024Q6194N8846J37604
11846H37830n9716j06479k7686m273J17698Q1876p8090p1353Q6943j4508K1842
11835G84084L5251l1877m221o7804o0959P871P868R0628O7971o5616O2819o5663
11823G60352j43666Q7253N8918m8044n6704j04286j20519j8609l2743r826K3499
11812C95625K8232K9447O3714n1811m2873K4659k9745p2963r7066M6198J26846
11801D20263O6391p6020j69074J6709J0757J02261O2374p4024o0260l0219L8427
11790C07585o033m0422M6869O8146J4541k2688j35447P076J57071K3847L2585
$$ y = [794555, 728111, 725718, 801893, 702203, 611860, 691198, 741710, 778300, 849705, 807922, 784912, 799246, 753604, 685592, 673571, 606450, 530761, 580485, 599673, 548162, 555186, 641380, 700226, 837830, 778114, 671635, 643949, 639676, 757374, 839250, 761160, 689807, 776750, 762242, 784084, 819335, 787458, 783237, 715433, 654474, 662345, 670213, 760841, 828812, 763196, 826015, 760352, 616686, 703939, 762857, 714813, 658109, 553823, 433304, 414695, 381952, 372126, 395625, 423857, 453304, 517018, 465207, 422334, 446993, 417248, 344285, 247219, 293417, 420263, 486654, 410634, 241560, 258269, 269026, 371287, 433661, 359637, 299377, 269158, 307585, 301552, 261130, 307999, 376145, 390686, 367998, 232551, 239627, 396698, 420545, 453130]
11779D53130k2396J2376j23188j025j27005p479J40762N9398j6059m0758m6659
11768B81097n0807K9145O9422J10797J23145J4693r8406j08346N9386J26291N6721
11757F13138j68823j87666m4007j05913j9583Q0551J11659M5579J6795O7557J17476
11746E26763j7882n6457Q8142p4219j825M4226O3843k4622k6721o8967J5627J30959
11734E98867P9796M7373J85494J92038J91576K47402M57358L93422K12925J42989
11724B749240O5731n1375l00272l32278k01849k16472m06557l42362r0288j08806
11714G64712p3846l001P613R127J1641p5004m4344J6491o2103N8444o7534r9604
11702D42592J5238k938J8668l1877N1434n7047J2124N9857k18746j3670R2746
$$ y = [453130, 430734, 443110, 319922, 318897, 191892, 184413, 325175, 384573, 368514, 327756, 281097, 230290, 259435, 328857, 439654, 562799, 577492, 479086, 370740, 430126, 556417, 613138, 444315, 256649, 212642, 106729, 87146, 167697, 279356, 324935, 341730, 409287, 526763, 508881, 452424, 540566, 466347, 464522, 508748, 572591, 547969, 521248, 452281, 467908, 598867, 678663, 726036, 911530, 1103568, 1295144, 1542546, 1999904, 2393326, 2606251, 2749240, 2814971, 2763596, 2463324, 2131046, 1929197, 1712725, 1306168, 963806, 873518, 764712, 690866, 687865, 695478, 704605, 716246, 641242, 596898, 613389, 551286, 609730, 542196, 442592, 457830, 454892, 473560, 441683, 493117, 436070, 448194, 508051, 289305, 275635, 368381]
11691C68381J13553l6368j2258j3432K8084j8363j27846l3434K3421R744j693
11680B99789n8602L2394J15162o7745l1164P7602O8067o039M9576J0737M6648
11669E36425j9449r4811m8752Q251L0328L6751M2577n9977N0743P2155o7142r8365
11657C88734j38361q8794N4599O8878M8495Q7446L2500k7946j00502j6324P108
11646C15833j9152O5894J3128j00896k2533k8026Q8172J29047O2171N450n1912
11635D57176n825K1000n3869o2925j6750j3106J972q9031P2368o3346p8243Q3750
11623B53171O9518k6836N1234l9959J4870J51992K4821q3123m4621k572k8622
11612C39873o7282q3738j2477J17265P3392q5166n499O1865j31112j00752K5606
$$ y = [368381, 481934, 445566, 433308, 419876, 447960, 429597, 301751, 268317, 291738, 301482, 299789, 241187, 273581, 388743, 320998, 289834, 367436, 435503, 429464, 479040, 489777, 536425, 516976, 422165, 373413, 381664, 411992, 448743, 491320, 431343, 482086, 554241, 487099, 388734, 250373, 161579, 216178, 285056, 333551, 420997, 453497, 425551, 325049, 308725, 315833, 296681, 362575, 375703, 274807, 252274, 224248, 312420, 441467, 503638, 509088, 457176, 451351, 472351, 418482, 355557, 338807, 325701, 327673, 238642, 311010, 247664, 169421, 253171, 322689, 295853, 347087, 307128, 321998, 473990, 498811, 415688, 371067, 368495, 339873, 272591, 188853, 176376, 293641, 367033, 281867, 276368, 338233, 207121, 106369, 131975]
11601A31975l5957J19676J30802m8251j56065k817O2530m3453r8900l829M6693
11590A02404o3162P069R1330J32757K6601Q7313k1593j58727R047J05920O3511
11579C82470M1539q1239k9464l6818K4333Q2629m4586o5870J4728J4310j38108
11568A63924J535M8514j42896R703J15333K860j7736o4792L2633N1646L4447O5460
11556C00631k6339m7125m2183j8423J01512Q6565o8397j5877Q032n228J9348p8382
11544B14134K4098l6201j10241K2788M5210o6580l7175M6873J10455O4233K415
11533B80009m1854j52648l7954M6594k4782R415o4679j2331l5969J01961R6699
11522A64461j14850R1653J6762K40J6598L1093j0481p6542m4580o4134j9167J0825
$$ y = [131975, 96018, 215694, 346496, 298245, 142180, 139363, 201893, 158440, 59540, 55711, 102404, 39242, 46311, 137641, 270398, 296999, 384312, 362719, 203992, 213039, 318959, 382470, 424009, 342770, 313306, 276488, 300821, 383450, 338864, 272994, 287722, 302032, 163924, 165459, 213973, 71077, 80780, 196113, 198973, 181237, 116445, 149078, 200724, 235171, 300631, 274292, 227167, 184984, 166561, 268073, 354638, 286241, 270364, 278396, 273168, 292516, 214134, 238232, 202031, 91790, 114578, 159788, 93208, 56033, 102906, 213361, 277594, 280009, 238155, 85507, 47553, 94147, 69365, 78780, 14101, 1770, -34199, 67762, 164461, 49611, 141264, 158026, 158266, 174864, 205957, 195476, 118934, 74354, 10220, -8947, 1878]
11510A878J01404o786l3987o2393j14286j4628K33666J66138o5707M1468n2892
11499A93875j05413o8747j0783M7736N7338L086O3203M3344k4967J9436o1006
11488A57102M0703p2427j5283r3767l1639P6139J3162L9320N6018K5934K1114
11477B16376r0679p6721j6489M2287L8567j07429K109n8778J0897K7567l1248
11466d3541J08634L9258p8512M6716J4033J5222M7587j9137r3750o5724j06505
11455a35719L5806K7855K5788P3302R4910j15499K6432J04584m6358L6880R5345
11444B23326p103l2512o7571n2188K3226K7206l978n1276m5652O4151n5306J03691
11432A26014L3213l007M2809J00032P5814o8297j93458k33594p3105O7966J42757
$$ y = [1878, 103282, 96496, 62509, 116, -114170, -128798, 104868, 271006, 205299, 246767, 193875, 88462, 19715, 8932, 56668, 114006, 117092, 180295, 223639, 198672, 218108, 157102, 197805, 125378, 110095, 16328, -15311, 60828, 73990, 113310, 169328, 195262, 216376, 125697, 48976, 32487, 74774, 113341, 5912, 8021, -50757, -39860, -12293, -43541, 65093, 104351, 25839, 72555, 86588, 101810, 149397, 130260, 36510, -29214, -135719, -99913, -72058, -46270, 27032, 121942, 6443, 32875, 137459, 91101, 127981, 223326, 216223, 183711, 116140, 63952, 87178, 114384, 110406, 59130, 13478, 77629, 22323, 126014, 159227, 156220, 199029, 299061, 374875, 306578, 113120, -120474, -193579, -125613, 17144]
11421A7144J77051J01991q90j48751q6874M2152n7017n0443K4890J2660K3608
11410E5521l2985J5934R3121j3770p20P0796n9070r3693j6932n3585K1197K8022
11398A3836M5757M0249P0124n3942K9395M8787J4142j03938N6971j2114j6980
11387A32287K9395R012k5382N4873J1750k2409j11479j01309n8297P2565J13834
11376A04840L5798q2777R3275J67842J08228j00135j06320j8709N2644l1257p0324
11365A53105j00497r9923N4398O3432j048Q9189R9198m7565j30166m4546l1490
11354D087Q9764M3497J2405j11159p2117J0137K5973J47441M730k3331P0098m0044
11342A61481M4883L0772o5679m2737J7841N292k1506o7006m5311r325O2322J04984
$$ y = [17144, 194195, 296186, 295296, 146545, 59671, 101823, 44806, -5637, 19253, 31913, 55521, 22536, 38470, 131591, 117821, 117101, 187897, 128827, 35134, 18202, -35383, -14186, 13836, 59593, 99842, 169966, 116024, 145419, 194206, 208348, 104410, 161381, 149267, 132287, 161682, 170694, 145312, 200185, 211935, 189526, 78047, -23262, -81559, -8994, 104840, 140638, 57861, 151136, 318978, 427206, 327071, 220751, 202042, 254686, 223429, 153105, 52608, -47315, 7083, 70515, 69467, 158656, 257854, 210289, 80123, 35577, 4087, 93851, 137348, 149753, 38594, -33523, -23386, 2587, 150028, 154758, 131427, 201525, 161481, 206364, 237136, 171457, 128720, 146561, 151853, 130347, 63341, 18030, 8705, 71027, 176011]
11330A76011L3932M6567n2077q6918j7038K1317p9368n9109K6619K6031M3002
11319G8969l3709O648O5797J39711q529j8466m487O9760l2405K5864N0099j53834
11307A85418m6613J7476O0598o0589k7964q7381p4271k3749j7738O2578J48777
11296A36542r556M8210M8483N2684J4365N7918J41375J96551K69393K69488N3254
11285A278707K7438n0187j65625j79187k20564k71547j68187K5481n8101m474
11275B13754o2207M0362k5073o1170J1838J87770N6771j05389k04213n5951K6040
11264B2532o908n4180l7628M8348R6498N4248P0978Q8520K5237L0177o0744p7558
11252A99520K7636m3327r2646J62100M9543l4696p6786j4752M7421J5097l3216
$$ y = [176011, 209943, 256510, 204433, 117515, 100477, 121794, 42426, -16683, 9936, 35967, 78969, 45260, 51908, 117705, 257416, 248887, 230421, 225934, 295694, 263289, 289153, 339252, 185418, 138805, 156281, 216879, 156290, 128326, 40945, -33326, -57075, -74813, -12235, 136542, 126986, 175196, 223679, 276363, 290728, 348646, 490021, 686572, 955965, 1225453, 1278707, 1306145, 1255958, 1090333, 911146, 690582, 419035, 250848, 276329, 218228, 213754, 151547, 191909, 166836, 105666, 117504, 305274, 362045, 256656, 52443, -3508, 22532, 15624, -38556, -76184, -27836, 68662, 122910, 193888, 282408, 307645, 337822, 277078, 199520, 227156, 183829, 91183, 253283, 302826, 268130, 191344, 176592, 224013, 239110, 205894]
11241B05894o5370m079J0508M3110J2518j1097j0507q4308q400R2725J02153j4407
11229B68740q3275k0775O6340P144k1690k3928J3192l7013O9515q1257J2242l5969
11217A33266n5284Q1304j22922q5373q111P127r399K11775J37947j9750o0708
11206B09872P203N5175j0769L1301O7409m9632n1593N574Q846k0337j9667q1798
11194A51584O5291K444L599k811J59271J42644O7494n210k9004l1926j1860L4644
11182E46160K27339K7803Q8190K57004L35269M22061M43832K38972j55371k42177
11172B189082q0148k07046j87313o4690o4867q2556k04758j30961M0478M6878
11162A254099J21562M9501j5457M4329k4674J2759r2144O9293N8284k7149K956
$$ y = [205894, 140524, 136445, 146953, 190063, 202581, 191484, 180977, 96669, 88269, 180994, 283147, 268740, 185465, 164690, 231030, 238174, 216484, 192556, 205748, 168735, 238250, 156993, 169235, 133266, 77982, 159286, 36364, -49009, -57120, -49993, -59392, 152383, 290330, 270580, 209872, 217075, 272250, 261481, 292782, 360191, 310559, 258966, 264540, 273386, 253049, 233382, 151584, 216875, 219319, 222918, 220107, 379378, 522022, 589516, 584306, 555302, 523376, 511516, 546160, 773499, 801302, 889492, 1146496, 1481765, 1903826, 2347658, 2586630, 2431259, 2189082, 2108934, 1901888, 1714575, 1649885, 1585018, 1502462, 1297704, 1166743, 1207221, 1254099, 1375661, 1425162, 1409705, 1454034, 1429360, 1442119, 1349975, 1419268, 1477552, 1450403, 1453359]
11151A453359M466R7670K31035J01805N7764M3076o3573j9342O4514n3361k1028
11140A896385J74719K03654N7003J65474J87767K36352L85012L65268J46133k8225
11130C789542k27314k72673l24516k16115r4258J3869J16396l190j36146j66238
11120B479357n9177j7712k0523Q2671O829j84009j90694J89196M2694o5578j23106
11109B139948r2638j03900n8603o3300l4661j14587M8851N7909j4041k7085K6632
11098A764525N7492n121J55266J52735j3437m2828O4586J42075J35067m8187j51433
11087B210740j78184k67736k52011j81031j686l3490o1124N1106M1582N1289q7742
11076A291713j12707j06471m7672O7748Q0139L7145o1123p3914r442j17129r8565
$$ y = [1453359, 1457825, 1555495, 1786530, 1888335, 1946099, 1989175, 1925602, 1906260, 1970774, 1917413, 1896385, 2071104, 2274758, 2331761, 2497235, 2685002, 2921354, 3306366, 3671634, 3817767, 3789542, 3562228, 3289555, 2965039, 2748924, 2654666, 2668535, 2784931, 2781741, 2645595, 2479357, 2420180, 2402468, 2381945, 2464616, 2471445, 2287436, 2096742, 2285938, 2328632, 2263054, 2139948, 2047310, 1943410, 1884807, 1821507, 1786846, 1672259, 1721110, 1779019, 1764978, 1737893, 1764525, 1822017, 1816896, 1972162, 2124897, 2111460, 2068632, 2133218, 2275293, 2410360, 2362173, 2210740, 2032556, 1764820, 1512809, 1331778, 1330092, 1296602, 1235478, 1286584, 1328166, 1379455, 1291713, 1179006, 1072535, 1024863, 1092611, 1172750, 1209895, 1148772, 1074858, 1065416, 948287, 849722]
11065H49722O8513P0646j04944m8666k7801j6032j62957q513p2216m4801K8217
11054E31168Q286j03252M050L4899Q8900R9954J0819o4991j9279l5982K8510J14811
11042F97893J27767j1148q7135L7869q4156q7634O7471M9652j42795k2923J3670
11031E58531l8538k4370j14682L8126Q9756p9256j11395l0103L7484l4511l7689
11020B53353L4668K4862n8032o5298m5698K3483M0080Q6778L985o7171j39886
11009I1124M3409J06012M8709J07911l3008n2736L1526j49191k5759J64056J01348
10998D33401q6918l8508p3349r3063K5424K23357R9990j8881L2729R1348J37650
10987G33180j6810q3110l8407k3282j4573j4242K5247k2739r737K6527P2342P5383
$$ y = [849722, 918235, 988881, 883937, 835271, 807470, 791438, 628481, 619968, 547752, 502951, 531168, 539454, 436202, 440252, 475151, 564051, 664005, 674824, 609833, 590554, 554572, 583082, 697893, 825660, 814512, 727377, 765246, 681090, 593456, 660927, 710579, 567784, 544861, 558531, 519993, 495623, 380941, 419067, 508823, 429567, 318172, 288069, 325553, 291042, 253353, 288021, 312883, 254851, 189553, 143855, 167338, 207418, 294196, 298181, 231010, 91124, 134533, 240545, 289254, 397165, 364157, 311421, 342947, 193756, 167997, 332053, 433401, 346483, 307975, 234626, 141563, 166987, 390344, 490334, 471453, 504182, 595530, 733180, 716370, 633260, 594853, 571571, 556998, 542756, 568003, 545264, 535527, 562054, 634396, 709779]
10975G09779M0469m0880l0251M1464K0721o8304j69802J4049Q2079N1028k3824
10964F26528j4227j4929j57856l6491J65759J58120N0314k4543j33349k451O2183
10953F79058J71970J20381J60000L991N2866K47671J25075J12886K4822k44048
10943A454672j67363l7943j26421j71230j13116J00758J00971N97o1617q6893
10933H92415N2985P8280J63720j0380j92505n3631J7115n5582j56606j4591J85436
10922I06656j24014q3373R4966q6768m7720L6867q640L2110j089L9052n5045J04796
10910H07798j37169k4761J18331J27109j2203O4278J3022j08535p6095j76702
10900E95073j3875J02730j04077K6458J08235n0894j13077L046q7300j39881O8999
$$ y = [709779, 750248, 709368, 679117, 720581, 741302, 672998, 503196, 517245, 599324, 650352, 626528, 612301, 597372, 439516, 403025, 568784, 726904, 777218, 752675, 619326, 616875, 679058, 851028, 971409, 1131409, 1135400, 1188266, 1435937, 1561012, 1673898, 1698720, 1454672, 1287309, 1249366, 1122945, 951715, 838599, 939357, 1040328, 1040925, 979308, 892415, 945400, 1023680, 1187400, 1177020, 984515, 930884, 947999, 892417, 735811, 721220, 906656, 782642, 699269, 794235, 707467, 659747, 696614, 687974, 720084, 718995, 758047, 703002, 807798, 670629, 645868, 764199, 891308, 879105, 943383, 956405, 847870, 771775, 595073, 581198, 683928, 579851, 606309, 714544, 663650, 550573, 553619, 466319, 326438, 395437]
10889C95437J16275m7814j13743o2828n3042j6565L5638p979M9031l2145k7078
10878B35187K8116q3563l6150P328K2529J49745J22516l5147J6454j00330j72694
10867A53991J24936R0804k41412j63353r2215q3817R3325Q5890R4556P8030j02467
10856C8268K6949N5395K7787M2385j385m1698R7476L3092j4706Q6908m1755n1040
10844B57676j8377j72474L253J13425N125l4940r897j45370p2566J76911l9399
10833F3367R119J57462J12916k4057p5031m0176J2726l9370N9467J291n1081k2132
10821A64501J27780J18688j01375n7443o0390P7868P6702n1154m3707Q4870Q8129
10810D24469Q36P9054M110j07608p5799j1589p3869k3222N290N4271L6125K5405
$$ y = [395437, 511712, 463898, 350155, 287327, 234285, 217720, 253358, 245379, 294410, 262265, 235187, 263303, 179740, 143590, 150918, 173447, 323192, 445708, 410561, 427015, 326685, 153991, 278927, 369731, 128319, -35034, -127249, -211066, -117741, -31851, 62705, 140735, 38268, 65217, 120612, 148399, 190784, 189399, 147701, 245177, 278269, 263563, 350471, 308716, 257676, 239299, 66825, 70078, 183503, 188628, 153688, 143791, -1579, -74145, 102766, 63367, 72486, 229948, 342864, 318807, 243776, 203600, 216326, 176956, 236423, 237714, 186633, 164501, 292281, 410969, 309594, 252151, 191761, 269629, 346331, 295177, 251470, 336340, 424469, 425305, 504359, 508469, 400861, 325062, 313473, 239604, 216382, 221672, 275943, 312068, 337473]
10798C37473O5558M5006n1648n2371l0786k8292j85108K3094P1967O3660k6380
10787B32173J1390J2479q643l7665k9242J22405M5633q3596p8808J6779L815O2042
10775B68762Q5516j42327m8686M2543j18307J5735J03747L6328j43033m7434R4260
10764A47104N5815J26381J5757j00361L4328J15217K6071K1823P414Q5059p4265
10753D60343r2945N9573J11093j06261j0473j36072J2941J52121N4446j21123
10743C83643k9540q780Q176j06080q2410l5809k9679p6710M7743J01679Q3587
10732B55820N9709l5348Q869L2171P9630n0003j03967l407J47448Q9362j0555
10721D69729m7925l98j21376p3025N3713l9696L2494R7689o39k7743N369m0547
$$ y = [337473, 403031, 448037, 396389, 344018, 313232, 284940, 99832, 122926, 194893, 258553, 232173, 243563, 256042, 247399, 209734, 180492, 302897, 348530, 264934, 186126, 202905, 206720, 268762, 354278, 211951, 163265, 205808, 87501, 103236, 206983, 243311, 100278, 52844, 147104, 202919, 329300, 345057, 244696, 279024, 394241, 420312, 442135, 449549, 534608, 460343, 367398, 426971, 538064, 431803, 421330, 285258, 298199, 450320, 504766, 383643, 354103, 345323, 353499, 247419, 165009, 129200, 99521, 22811, 70554, 172233, 255820, 315529, 280181, 289050, 321221, 400851, 350848, 246881, 243474, 390922, 480284, 469729, 421804, 421406, 300030, 227005, 280718, 241022, 273516, 371205, 370566, 342823, 348192, 307645]
10709C07645K52034J16633j59823p8542M8800l6583o9396M4010J36237M4939p1481
10698E34473P9798J455k4347L6173j6132p9298n3628J6671p4571j78860K8970
10687B70704J35022J36127m0802n8110k2565k938R3883J54667m6891k1369l2049
10676E65679j5986k9185J32030j5250j48212r1462Q5234R8714O5406j8077P018
10665F35909J02482J50032l5654m1547N2280J87898M3526L0409R2925M6184N0895
10654A315339J57803O2569Q162J68817K08363J64405O7418J31815k8979j10466
10644B145246p7200k6391r7253l1216l448K24284J75472O2733N5752m0386m5794
10633B341799R6327O8311K7122K5720J52800K41927l1970q2741j01323J5809p9256
$$ y = [307645, 559679, 676312, 516489, 437947, 486747, 450164, 380768, 424778, 561015, 605954, 534473, 614271, 615726, 591379, 627552, 611420, 532122, 478494, 495165, 420594, 241734, 270704, 405726, 541853, 501051, 442941, 420376, 417438, 511321, 665988, 619097, 597728, 565679, 549693, 520508, 652538, 637288, 489076, 397614, 482848, 581562, 646968, 628891, 635909, 738391, 888423, 852769, 811222, 863502, 1051400, 1094926, 1125335, 1218260, 1264444, 1315339, 1473142, 1535711, 1543873, 1712690, 1921053, 2085458, 2152876, 2284691, 2255712, 2145246, 2068046, 2041655, 1944402, 1913186, 1909738, 2134022, 2309494, 2372227, 2427979, 2387593, 2341799, 2438126, 2506437, 2533559, 2559279, 2712079, 2954006, 2922036, 2839295, 2737972, 2753781, 2674525]
10622B674525k3374J0324k7862q1913K5041R8067K18393K24084J75967O8745J18018
10611C480015K04073L89943L86531L93499L31554L13186K27858J91424K04305
10602F122388J60642K26152J48121J61805L50165Q23426J008268J050509J169662
10593A1221138J102478O41423M74889N19053N86865N50509L35251K48828K50982
10584A5931416M16405L52207j79328p28856q32798p28786m05787j00547L63722
10575A4087648O77704J050701J324755J805459K522289L712714N786556Q950831
10567C9918657J3206540J6481148J5895318J0217011J353933n927991q621514
10560H2523102o658190k176328K461847N431545O288545M879369J663006j592664
$$ y = [2674525, 2651151, 2661475, 2633613, 2551700, 2576741, 2674808, 2893201, 3117285, 3293252, 3361997, 3480015, 3684088, 4074031, 4460562, 4854061, 5185615, 5498801, 5726659, 5918083, 6122388, 6283030, 6509182, 6657303, 6819108, 7169273, 7992699, 9000967, 10051476, 11221138, 12323616, 12965039, 13439928, 13958981, 14545846, 15096355, 15431606, 15680434, 15931416, 16347821, 16700028, 16520700, 15791844, 14959046, 14230260, 13824473, 13723926, 14087648, 14765352, 15816053, 17140808, 18946267, 21468556, 25181270, 30967826, 39918657, 53125197, 69606345, 85501663, 95718674, 97072607, 91144616, 82523102, 75864912, 73688584, 76150431, 81581976, 87870521, 92749890, 94412896, 92820232]
10552I2820232l402696k553063K37915K675254K687602N85918j584128j679446
10544H9787588O64394L824332O276159P943816Q271309O462111K860817p43691
10536A25346835k672579k027551N25937L285023N235860O233416O094022N129465
10528A47150428L699887L152211N536667J1654739J9528168K5557379K5560972
10521B41840451J5702082r74381j7377574k3182893j8339023j1022310n954258
10514A80692094l024957j528419j088099j681804k717469l350049k101026M40859
10506A65641130J202393r46743m911778p858936q233339p487923o340736m998857
10498A26065211l171194p11069J479681J581507l64678l038427l561516j168358
$$ y = [92820232, 89417536, 86864473, 87102388, 89777642, 92465244, 93051162, 91467034, 89787588, 90451982, 94276314, 100552473, 108496289, 116767598, 123229709, 126090526, 125346835, 122674256, 120646705, 121172642, 124457665, 129693525, 135926941, 142020963, 147150428, 150850315, 154002526, 159539193, 171193932, 190722100, 216279479, 241840451, 257542533, 256568152, 239190578, 216007685, 197668662, 186646352, 180692094, 177667137, 176138718, 175050619, 173368815, 170651346, 167301297, 165200271, 165641130, 166843523, 165896780, 160985002, 153126066, 144892727, 137404804, 131064068, 126065211, 122894017, 122182948, 123662629, 125244136, 124879458, 121841031, 118279515, 117111157]
10490A17111157K390348M900294N042898K781910o45295l778388n731774m140848
10482A17930302P09885P442830J2839528J2827151N183577p586403j8059883k0404075
10474A10882912j6443105j1316144p311081m615037l039783k313077k120901k016047
10466F1707737j872549j650842j282863p55795k92994j1667q3232j96134m52298
10457E5109363n30131o07398n51217q00773j191803j498797j481342j195295j253589
10448D5999018j641223j954570j924669j521446j168024j056619r13516r24963
10440C4893988q15870m69403l67224l12180m44081p35247q70459q78820q86776
10431B9113928p69337n51894l54462m64557m87672m76623p97709r32245j131099
$$ y = [117111157, 119501505, 124401799, 129444697, 132226607, 131581312, 127802924, 122071150, 117930302, 118640187, 126083017, 138922545, 151749696, 156933273, 149346870, 131286987, 110882912, 94439807, 83123663, 75812582, 71197545, 68157762, 65844685, 63723784, 61707737, 59835188, 58184346, 56901483, 56145688, 55852694, 55841027, 55757795, 55561661, 55109363, 54579232, 53971834, 53420617, 52619844, 51428041, 49929244, 48447902, 47252607, 45999018, 44357795, 42403225, 40478556, 38957110, 37789086, 36732467, 35818951, 34893988, 34078118, 33608715, 33241491, 32929311, 32485230, 31749983, 30879524, 30000704, 29113928, 28344591, 27792697, 27438235, 26973678, 26486006, 26009383, 25211674, 24279429, 23148330]
10422B3148330j140234r85467q10261o30388n98432n36120n54907n46688m66980
10413A6878853l93587m86736m49434m17275k40920j26876k44192k54925l32169
10404A3932739l52989m05587k38945l00761k30315M2091J6707o1945j09652j00273
10394A2191070j74382m79129m86230n79333n56044l52301k37794k27705k62019
10385H836133l19417k32436j65431k13412l15580l20595j67566j36112p1070m5639
10375F848875j22612j63647r8752j23256j01663k10443k24148j57014p1048l6203
10365E540089p0712j14975o2560q3221j26566k40532k44529r485N3357j4084m8753
10354D578029j01188j03227j35067j22924L7171j547n5051j40532k2792j78309
$$ y = [23148330, 22008096, 21022629, 20212368, 19581980, 18983548, 18447428, 17892521, 17345833, 16878853, 16485266, 15998530, 15549096, 15131821, 14890901, 14764025, 14519833, 14264908, 13932739, 13579750, 13174163, 12935218, 12634457, 12404142, 12446233, 12462940, 12400995, 12291343, 12191070, 12016688, 11537559, 11051329, 10471996, 9915952, 9563651, 9325857, 9098152, 8836133, 8516716, 8284280, 8118849, 7905437, 7589857, 7269262, 7101696, 6965584, 6894514, 6848875, 6726263, 6562616, 6463864, 6340608, 6238945, 6028502, 5804354, 5647340, 5576292, 5540089, 5469377, 5354402, 5291842, 5208621, 5082055, 4841523, 4596994, 4587509, 4640866, 4626782, 4578029, 4476841, 4373614, 4238547, 4115623, 4152794, 4151247, 4096196, 3955664, 3932872, 3754563]
10344C754563j81741r7586j08049j5541Q53M3570O4921j1252n6008l0581j03452
10333C259697k9248j29753j75387k79265Q8874J6706j20693p5452r4163o3856
10323B397460k8030k8104l0058l5204j11802r5755k9017j5670k4385N9654m6204
10312B012885m7286p4771n0519j00574L1224J892q4033n9980j3659J3779o6420
10301A562538m4474o1055j08060n3430O9404j4627N512n1771K7948O1364Q543
10290A401892j32374N5538J15571m1183L9553m0716k6856m3227p0621j34587j70603
10279I52387k6831O8859q2468o2899k3086K0513L5156L6419k0383O498M4015j7550
10267I30630q200N292q3811L7612l0925n5469j0449N3772j00516j10863L1607
$$ y = [3754563, 3572822, 3475236, 3367187, 3351646, 3352499, 3396069, 3460990, 3449738, 3393730, 3363149, 3259697, 3230449, 3100696, 2925309, 2646044, 2734918, 2751624, 2630931, 2555479, 2461316, 2397460, 2369430, 2341326, 2311268, 2276064, 2164262, 2068507, 2039490, 2023820, 1999435, 2059089, 2012885, 1965599, 1890828, 1840309, 1739735, 1770959, 1772851, 1688818, 1628838, 1615179, 1628958, 1562538, 1518064, 1457009, 1348949, 1295519, 1364923, 1350296, 1355808, 1304037, 1331985, 1393349, 1401892, 1269518, 1325056, 1440627, 1399444, 1438997, 1398281, 1371425, 1328198, 1257577, 1122990, 952387, 925556, 994415, 911947, 849048, 825962, 846475, 881631, 918050, 897667, 904165, 948180, 930630, 922430, 927722, 843911, 881523, 850598, 795129, 784680, 838452, 737936, 627073, 658680]
10256F58680J07821K6945N4339P9739j3415m7212q559q5082j33489N7602J33768
10245H31137n0112m3200q098L971k13597l3456J74285L4157j17171j1059P0653
10234F37510P4336k484p9847O6968j9742p2818J13661L5431j11617n7465J13254
10223F97187L0839M6437l0873j24196j08946J6335J44554p0903n0960L4022r9719
10212D83777o9945m8356m1463J7211K6388O5714n0975J6082J3493J18550j8111
10201E12365o4962j3683o1676j5899O9503J50453K4j51808j5943M0737r0983K2456
10189C80584N8321P1469O0344j01110o2839n4222k2197P4940O1625K9546p9548
10178D16913j29018r6686M6300R6326J9056N7017Q7746j9355P9199n4336j09022
$$ y = [658680, 766501, 793446, 847785, 927524, 914109, 866897, 858338, 773256, 639767, 697369, 831137, 781025, 737825, 729727, 733698, 520101, 486645, 660930, 695087, 577916, 566857, 637510, 711846, 709362, 629515, 696483, 676741, 603923, 717584, 753015, 641398, 583933, 697187, 728026, 774463, 743590, 619394, 510448, 526783, 671337, 600434, 549474, 583496, 483777, 413832, 365476, 324013, 341224, 367612, 433326, 382351, 398433, 411926, 530476, 512365, 447403, 433720, 372044, 356145, 425648, 576101, 576125, 424317, 408374, 449111, 358128, 380584, 438905, 510374, 570718, 469608, 406769, 352547, 330350, 405290, 466915, 496461, 416913, 287895, 191209, 237509, 333835, 352891, 409908, 497654, 478299, 557498, 503162, 394140]
10167C94140k5691K2861K1526o0442l7741K8114j4512J2341J00375L4217N6133
10156E31321Q8503o6588O166R7845J40591j6023j11828N834q1590j56922p4368
10145C62941l5642n9359J11207R6901o0787K1659k0814Q2327O1195p0149N586
10134D95065l7591Q0647J07994L3554l7268j02688Q1835J00542l0879n0055j0880
10123F30276l884n1460J45021Q201K6854j6810M0135Q2783P58j17784p4250n3898
10111F15942L7862O4241O313K1819K4771Q1061J21708n5279Q5045J6303m815J03697
10099A118668J2553o2781q2145m4404k3609R7824J32421K12842J37033O3712J77397
10088A739511R7758n1614N9623j05065p9533j74757j66867r9048l0166K8502j36705
$$ y = [394140, 368449, 391310, 412836, 352394, 314653, 342767, 328255, 340596, 440971, 475188, 531321, 619824, 553236, 559402, 657247, 797838, 781815, 669987, 675821, 594231, 437309, 362941, 327299, 267940, 379147, 476048, 415261, 436920, 416106, 498433, 559628, 489479, 495065, 457474, 538121, 646115, 679669, 642401, 539713, 621548, 722090, 691211, 641156, 630276, 626392, 574932, 719953, 728154, 755008, 738198, 778333, 861116, 861874, 744090, 669840, 615942, 653804, 718045, 724358, 746177, 770948, 852009, 973717, 918438, 1003483, 1019786, 1014971, 1118668, 1131221, 1068440, 986295, 941891, 918282, 1016106, 1148527, 1361369, 1498402, 1562114, 1739511, 1837269, 1785655, 1845278, 1740213, 1660680, 1485923, 1319056, 1220008, 1189842, 1218344, 1081639]
10077A081639O911q708N6565O8262o5294m4692K8184m5139p885r247j36509o6292
10065H57795N4197P862j11725L245J05582j08442q2679P4423N2865J8995Q9037
10054I61155Q5105M2419k2379J08326K19398M05824M62091K83652n3455m60999
10044B031137m10034l72971l04194k25296j30833j8136J27047K0504m5363n0310
10034F21551K6827o7025n9282J6112k2509O8418J08978j23155j7659M6258k0686
10023E77828n1379q6018n693L2077K1121J0093N4380N9905m7955p9039l0420j1924
10011D42976R0603o1428L6085J37517l9239L009n8242q7597j03735p3691J04100
10000C90358J93553J1388j28369l1194K8801P3775n7787j15446j09268K1834J13878
$$ y = [1081639, 1088550, 1079842, 1136407, 1204669, 1139375, 1094683, 1122867, 1077728, 1069843, 1060596, 924087, 857795, 911992, 919854, 808129, 811374, 916956, 808514, 725835, 800258, 853123, 872118, 961155, 1046260, 1088679, 1066300, 1174626, 1394024, 1799848, 2261939, 2545591, 2492136, 2031137, 1621103, 1248132, 943938, 718642, 587809, 569673, 696720, 717224, 671861, 621551, 648378, 581353, 522071, 538183, 515674, 584092, 693070, 569915, 552256, 598514, 577828, 526449, 440431, 434738, 466815, 487936, 498029, 552409, 612314, 564359, 485320, 454900, 442976, 533579, 472151, 508236, 645753, 606514, 609523, 551281, 463684, 359949, 286258, 390358, 583911, 595299, 466930, 435736, 464537, 538312, 480525, 365079, 255811, 277645, 391523]
9989C91523M4282n8123r8129k5174L9306k0605L4746M3642J0822J6016j0549n428
9977C62329l3695j29830j0870J2737J68993Q7221j66673L3440m0785q1011R4188
9966B96044J67172M8126o9861j9438n9796j21128N9332L9029M067L7634P1645
9955D52826l1160j38852r7097m529O5066j7668j6771J28038N4479j00509n1046
9944B42777m4953r8737j3231K870O051j8991O0292J13828R2509P1169L7997q135
9932D43446M848o3423j5932r3955l8704K8181J2155l7850J5494J05384M2021l6185
9920C65480j0338L2257l8804L4000l2422M2746j161m6119J33600R6760n7604j36987
9908C81408l0849l7696P7218J06705M951r2165R485k2761K8650Q2524j424m8039
$$ y = [391523, 435805, 377682, 279553, 254379, 293685, 273080, 307826, 351468, 362290, 378306, 367757, 362329, 328634, 198804, 187934, 200671, 369664, 456885, 290212, 323652, 282867, 201856, 296044, 463216, 511342, 441481, 422043, 362247, 241119, 300451, 339480, 343547, 381181, 452826, 421666, 282814, 185717, 181188, 246254, 228586, 211815, 339853, 394332, 293823, 242777, 197824, 99087, 85856, 88726, 94777, 75786, 136078, 249906, 342415, 413584, 451581, 443446, 448294, 384871, 368939, 274984, 236280, 264461, 276616, 238766, 254260, 359644, 401665, 365480, 355142, 387399, 348595, 382595, 350173, 392919, 391758, 345639, 479239, 575999, 518395, 381408, 350559, 312863, 390081, 496786, 501737, 409572, 419057, 396296, 424946, 507470, 506046, 458007]
9896D58007l280j9180j30765K0222P1343o9430r105K790n6918n1390P7331R8706
9884C88331M9135n9741N3983J04025L423J475K2341L5955L7708Q2934n4562l3747
9872F31260K9799N7630J0527K8178J23810Q4261J63885J79395K15446M26544O89234
9861B639969J030412J184748J333699J160254R59289N76224k1016p87817j100700
9852F975062j036188j065986j200660r16613n76568l39809k74931j65799q2117
9843A316391j32507m6620K9773N0595N0073K5483n6671n750O8509J8256p234p2649
9831A237649j90575k04190p3343J87167J24862J37439m4675k728J53103O5567
9821A390276p7307k8291m8787M233J4362K2504J17534N1145M2459K00777J17583
$$ y = [458007, 454727, 435547, 304782, 325004, 396347, 326917, 317812, 320602, 263684, 212294, 289625, 388331, 437466, 377725, 431708, 535733, 539156, 540631, 562972, 598927, 636635, 719569, 665007, 631260, 661059, 718689, 729216, 757394, 881204, 965465, 1129350, 1308745, 1524191, 1950735, 2639969, 3670381, 4855129, 6188828, 7349082, 8308371, 8884595, 8863579, 8075762, 6975062, 5938874, 4872888, 3672228, 2755615, 2179047, 1839238, 1564307, 1398508, 1316391, 1183884, 1137264, 1167037, 1217632, 1267705, 1293188, 1236517, 1230767, 1299276, 1317532, 1310298, 1237649, 1047074, 842884, 769541, 956708, 1081570, 1219009, 1174334, 1171606, 1324709, 1390276, 1312969, 1284678, 1235891, 1240124, 1254486, 1276990, 1394524, 1445669, 1488128, 1688905, 1806488]
9810A806488K7279P2116j7164K1069k8591o1100L8427k135j4061K8908J13713
9799A984949j42618j91878K2712j7413p0408r6933j16258l3989q3573j2711M3295
9788A285175M8221M0537j48204j45127p0830K3243J12894j6134L337N325o9375
9777A069062k1399K5145n1200N5942M5736J08376q8948j3555J8183L5723J32225
9766A315290J10233O4812J24033M3800j3982k7465q5642j17334n9223M3399k355
9755A395566r4646P7923J14965o6084K3334Q4845J17666K7965o9075p3715q1585
9744A457159O8728p3627j18224n1774p8746p4755n5123k7919j19345N1739J22678
9733A100791n3130r6064L1784J7587n0274J4724M9400L9614L0237M5716R4007
$$ y = [1806488, 1833767, 1905883, 1888719, 1909788, 1881197, 1820097, 1858524, 1856389, 1842328, 1871236, 1984949, 1842331, 1650453, 1673165, 1655752, 1585344, 1488411, 1372153, 1338164, 1254591, 1241880, 1285175, 1333396, 1373933, 1225729, 1080602, 1009772, 1033015, 1145909, 1129775, 1133112, 1138437, 1069062, 1047663, 1072808, 1021608, 1077550, 1123286, 1231662, 1142714, 1129159, 1147342, 1183065, 1315290, 1425523, 1490335, 1614368, 1658168, 1644186, 1616721, 1531079, 1413745, 1354522, 1397921, 1395566, 1300920, 1378843, 1493808, 1427724, 1451058, 1535903, 1653569, 1681534, 1612459, 1538744, 1457159, 1525887, 1452260, 1334036, 1282262, 1203516, 1128761, 1073638, 1045719, 926374, 978113, 1100791, 1047661, 951597, 983381, 1000968, 950694, 965418, 1014818, 1054432, 1084669, 1130385, 1224392]
9722A224392J00287O0924R751J53809J61579l8232j52482K0483N3950J9783k8902
9711A585342L9282J62301P2870K9329O2006m388r701O8919J35568l1066k21000
9700A889462n8099q2210j12604l3805p8305P451j3856j9327M0610P5022j7296
9689A597043j64103o1236P403K9665K2806j6847l460K8509L1271O9394R0856N1833
9677A683134R9697j6349J25801J01274l7334m557J77808R6371N2181n2963O8249
9666B293312J06408j32286o0383J9326J7301j20609K1637J83903J41098n0748
9656B418959q4248m4258k5529L6046L0508n9517K7665p9279Q2262L7138l9444
9645B300303J705n7582L5219J64992R8627J25436J28863M4264k744O4954N7592
$$ y = [1224392, 1324679, 1385603, 1395354, 1549163, 1710742, 1672510, 1520028, 1540511, 1594461, 1614244, 1585342, 1624624, 1786925, 1859795, 1889124, 1951130, 1946742, 1937041, 2005960, 2141528, 2110462, 1889462, 1831363, 1749153, 1636549, 1602744, 1524439, 1531890, 1518034, 1498707, 1539317, 1614339, 1597043, 1432940, 1371704, 1379107, 1408772, 1431578, 1414731, 1411271, 1439780, 1471051, 1540445, 1631301, 1683134, 1782831, 1766482, 1892283, 1993557, 1956223, 1951666, 2129474, 2225845, 2278026, 2225063, 2293312, 2399720, 2267434, 2207051, 2226377, 2243678, 2123069, 2144706, 2328609, 2469707, 2418959, 2334711, 2290453, 2264924, 2300970, 2331478, 2271961, 2299626, 2220347, 2302609, 2339747, 2300303, 2302008, 2244426, 2279645, 2444637, 2543264, 2668700, 2797563, 2841827, 2839083, 2904037, 2961629]
9634B961629P0810n0680J15982L6930P2365j514Q505P964J05662O1344p2412j08493
9622C208092l5726n2895m6885j8403O2268J56219N0297L9463N743K9553J05481
9611C503207J92895R110P7806Q8287K52147J35106P0967J62805K29404K41340
9601D963074N087l3655N1653K9625N4747J11844J52705K10494J2268M781J22299
9590E684922n8676J20085J69957P4431J54181J11088j39291p2173P3820R2653
9580F210997P6798J65245J01718l7469J22738J50053J08638J41328J00138j16539
9570G023645N2494K21511K33020Q8842P3116L9509O9963O6631M7710J16810J94558
9559H227809O5440J6860O5971J30005R8852K0016q6194k07761q3596l0013j25503
$$ y = [2961629, 3032439, 2981759, 3097741, 3134671, 3207036, 3205522, 3214027, 3221991, 3327653, 3388997, 3316585, 3208092, 3172366, 3119471, 3072586, 3054183, 3116451, 3272670, 3322967, 3362430, 3368173, 3397726, 3503207, 3696102, 3705212, 3783018, 3871305, 4123452, 4258558, 4329525, 4492330, 4721734, 4963074, 4968161, 4934506, 4986159, 5015784, 5070531, 5182375, 5335080, 5545574, 5557842, 5562623, 5684922, 5626246, 5746331, 5916288, 5990719, 6144900, 6255988, 6116697, 6044524, 6118344, 6210997, 6287795, 6453040, 6554758, 6517289, 6640027, 6790080, 6898718, 7040046, 7140184, 7023645, 7076139, 7297650, 7530670, 7619512, 7692628, 7732137, 7802100, 7868731, 7916441, 8033251, 8227809, 8293249, 8310109, 8376080, 8506085, 8604937, 8624953, 8538759, 8330998, 8247402, 8217389, 8091886]
9548H091886j57741o2594n1013M7806n2234j40083j90319r5019J4154N630o1611
9537G348862K282K4792l4063L3078J5045L1744J23715j58598p1800K7991M566
9526G347614J65710J04915K31890J09205K01546J46543K46135M82381N13604L57141
9516I906684L8221k38285k65023m18442m19525k97805l07124k37321j65077j81853
9506G414450p8218l6779K9700n0955J9318J65166R3423K04428K88865M47513P38150
9495I235061J053974J416562J552411J235280O44480J23154j95453m30421o00140
9486A4034908q67673p51423o27920o15267n61739l58386k47873j50757j54193
9477I699677j40250m2409R9047L18360L01938K63028M85998N16217N32185P72877
$$ y = [8091886, 7934145, 7871551, 7820538, 7868344, 7816110, 7676027, 7485708, 7390689, 7404843, 7410473, 7348862, 7351144, 7375936, 7341873, 7374951, 7389996, 7421740, 7545455, 7386857, 7315057, 7343048, 7347614, 7513324, 7618239, 7850129, 7959334, 8160880, 8307423, 8553558, 9035939, 9549543, 9906684, 9944905, 9706620, 9441597, 9023155, 8603630, 8305825, 7998701, 7761380, 7596303, 7414450, 7336232, 7299453, 7329153, 7278198, 7297516, 7462682, 7556105, 7760533, 8049398, 8496911, 9235061, 10289035, 11705597, 13258008, 14493288, 15137768, 15260922, 15065469, 14635048, 14034908, 13167235, 12415812, 11787892, 11172625, 10610886, 10252500, 10004627, 9853870, 9699677, 9559427, 9517018, 9616065, 9934425, 10236363, 10499391, 10985389, 11501606, 12033791, 12806668]
9467A2806668R92865J562482K018278K098877J507359N62184n02983j326032j371455
9458A8348243r27649o93401o07136k44043K02388O78808J137108J737706K443031
9449B2075055L401126M621421O488742Q834143J1963806J5658585J7672700J5205580
9441A05921158P355307k983662j0401966j1641822q912760n526787k470916K08161
9433G1546713K905889M816838M622460L255763K264976L138415N219630P234516
9425A05005200R226092J1244544J1231019Q189356K697339k466431m312027l929014
9417A36886078l403904m172671n541745n620202m248583j913916J164536M111511
9409A17261104N393636N152874M356223M755077O871525J0512642J5842794K3223582
$$ y = [12806668, 13799533, 15362015, 17380293, 19479170, 20986529, 21548713, 21045730, 19719698, 18348243, 17420594, 16727193, 16120057, 15876014, 16078402, 16757210, 17894318, 19632024, 22075055, 25476181, 30097602, 36586344, 45420487, 57384293, 73042878, 90715578, 105921158, 113276465, 110292803, 99890837, 88249015, 79336255, 73809468, 71338552, 71546713, 74452602, 79269440, 83891900, 87147663, 89412639, 92551054, 97770684, 105005200, 114231292, 125475836, 136706855, 144896211, 147593550, 145127119, 140815092, 136886078, 133482174, 129309503, 123767758, 118147556, 113898973, 111985057, 113149593, 117261104, 122654740, 127807614, 132163837, 136918914, 143790439, 154303081, 170145875, 193369457]
9401A93369457L2612095L9613163L5719306J6354166j1226816l2737174l8554999
9394B35149198l3969431k6441923j8409610j0281302l534380Q1521L3176k562289
9386A40064960n521460o017246l315546P12082M287681O210580O914381P105126
9378A50440558P660012P929572O181903J686170m301174r895044j2873545j2985985
9370A33842467j0972598p871860m278857j816125j545394k768710m044911l797419
9362I6746593k003964P74124L624555O695171R685977J0859859P978272O30081
9354A34990668q295319j4049507j4428677j1548039q225727n656776l973325l006803
9346F5806495k622331k650783k570403k393297k156554j758866j311652p59974
$$ y = [193369457, 225981552, 265594715, 301314021, 317668187, 306441371, 273704197, 235149198, 201179767, 174737844, 156328234, 146046932, 142512552, 142594073, 142627249, 140064960, 134543500, 128526254, 125210708, 125922790, 130210471, 136421051, 143335432, 150440558, 158100570, 166030142, 172212045, 173898215, 169597041, 159701997, 146828452, 133842467, 122869869, 114998009, 110719152, 108903027, 107357633, 104588923, 100544012, 96746593, 94742629, 95516753, 99141308, 105836479, 115522456, 126382315, 134360587, 134990668, 126695349, 112645842, 98217165, 86669126, 78443399, 72786623, 68813298, 65806495, 63184164, 60533381, 57962978, 55569681, 53413127, 51654261, 50342609, 49582635]
9338D9582635l52362j3068J1402k29177p41377j389902j797227j968394j729924
9329D1372606j113569r88398p86787p10335o87163o67655n43858o12869q81152
9320C4380820r10825q75586q75497o67707m90739m03029k75213j41620j20789
9311B9619815J45232M03296N25651M82745K01249l44025p55032j144057j433011
9302B7701863j654158j718548j544118j330302j172375p80181p32841p23400p33043
9293A7312897o60022n49733n47974l18800j69102j35817O211K4543j37776j40816
9283A4683611K144j03019M4638j9909r7327m12003m39955o61316o51996n20867
9273A1824001l53311j94782j54809k11646k94125j39523M6082J8495J31341M04585
$$ y = [49582635, 49230273, 49217205, 49228607, 48999430, 48258053, 46868151, 45070924, 43102530, 41372606, 40259037, 39270639, 38483852, 37773517, 37086354, 36418699, 35874841, 35261972, 34380820, 33469995, 32594409, 31718912, 31051205, 30560466, 30157437, 29882224, 29740604, 29619815, 29765047, 30168343, 30693994, 31176739, 31377988, 31033963, 30278931, 29134874, 27701863, 26047705, 24329157, 22785039, 21454737, 20282362, 19502181, 18769340, 18045940, 17312897, 16652875, 16103142, 15555168, 15236368, 15067266, 14931449, 14937660, 14962203, 14824427, 14683611, 14685755, 14582736, 14627374, 14607465, 14510138, 14098135, 13658180, 12996864, 12344868, 11824001, 11470690, 11275908, 11121099, 10909453, 10615328, 10475805, 10521887, 10540382, 10671723, 11076308]
9263A1076308L95363L23621K19868k34525n54897q45216p81891n01888l99978
9254H696765k63311l62595l05601j09292j08164k1429p8011p4859j64858j16843
9244G091802j31995p3730j19204q6572l6818o7916J770j33923k52668j40972o8347
9233E981427j88129j75028k81197l04808M1893P4959J1052l2227o6804N79n9015
9222E002702M2750J24472N303L0659j72769q2156m7317k38136l48234k87490j09304
9211C920480p0j59281k31852j15697o3521k8596j2050p2019o6964r884q5927q5234
9199B989385o5230q7561L086l8884k00419n7012m5177k599N3199L9110l4201k02064
9187B351633j52672j14047M7202j0080J7673o7340j31401j41186j5663m6153J7282
$$ y = [11076308, 11471671, 11795292, 12015160, 11780635, 11225738, 10380522, 9598631, 9096743, 8696765, 8433454, 8070859, 7765258, 7655966, 7547802, 7526373, 7448362, 7373503, 7208645, 7091802, 6959807, 6886077, 6766873, 6680301, 6643483, 6575567, 6577337, 6443414, 6190746, 6049774, 5981427, 5793298, 5618270, 5337073, 5032265, 5074158, 5149117, 5160169, 5127942, 5061138, 5061717, 5002702, 5045452, 5169924, 5175227, 5205886, 5033117, 4950961, 4903644, 4665508, 4317274, 4029784, 3920480, 3920410, 3761129, 3529277, 3413580, 3350059, 3321463, 3309413, 3237394, 3170430, 3160546, 3074619, 2989385, 2924155, 2836594, 2839680, 2800796, 2600377, 2543365, 2498188, 2495589, 2548788, 2587898, 2553697, 2351633, 2198961, 2084914, 2132116, 2122036, 2139709, 2072369, 1940968, 1799782, 1784119, 1737966, 1755248]
9176A755248J1895j44361q5426J4803l753j20769L9773l8173J46031J14434j86934
9165A502768j88667K823n4463j295n944o1327j4084k2810l9167m0183K7189k2867
9153A081973N3889O0531q052j52782o1563L230M0722n6198M4595L6492K4760L1356
9141A098953L362P1481r7642n8622n8803l1149j5379q487P4402n725Jo6556n3885
9128H51951L0936O5911p6260m4999R0584O8360m2823j54199j20311k2456J05783
9117G52477P4109M3011p1020n4654m0578P3050M7145L5584M5079k4039n0463k2527
9105H07174P585r2393o0855M5302J71708n4919q7480l1001j2335L1219k2562j13935
9093E87508n5457O1895j4038P9029M0100q8028p7545l242J00176Q1616j0561j05530
$$ y = [1755248, 1767143, 1622782, 1537356, 1552159, 1548406, 1427637, 1467410, 1429237, 1575268, 1689702, 1502768, 1314101, 1316924, 1262461, 1261166, 1255222, 1193895, 1179811, 1157001, 1117834, 1077651, 1104840, 1081973, 1135862, 1196393, 1188341, 1035559, 973996, 977226, 1017948, 961750, 1006345, 1042837, 1067597, 1098953, 1102315, 1173796, 1076154, 1017532, 958729, 927580, 912201, 903714, 978116, 972391, 972392, 905836, 851951, 882887, 948798, 872538, 827539, 918123, 986483, 943660, 789461, 669150, 646694, 752477, 826586, 869597, 798577, 743923, 703345, 776395, 823540, 859124, 904203, 880164, 829701, 807174, 814759, 722366, 661511, 706813, 878521, 823602, 736122, 705121, 692786, 724005, 701443, 587508, 532051, 593946, 579908, 658937, 699037, 611009, 533464, 530222, 630398, 712014, 701453, 595923]
9081E95923P4202J02105R0597j33126n2674l694M6144Q9838P2766J5468k3575
9070H73974O4139N9331j29879j63389q0174j05474r669j0189O949q0248k295n5477
9058C67599J8313m767M1008r3473o4308N2328J78926M5504L0125l50N9085K3762
9046F53752m9081j46595r1440J10390J23296K3280j14839j05939n8903J7441J47488
9035E08850K04149l4217N782J8990O4521K12529L13743J9301q1299K4332q2660
9024A174021k04069j55882j08581l5526R57l1382L0626J3782q1484p1379o1281
9013D69802M3036P3699K1364R0439M1984l0647m6073j6932p214N3021P6741J4953
9001G84173j66297j58929J35006K18578M6700k6455q1554m8328j5303P4608r670
$$ y = [595923, 670125, 772230, 862827, 729701, 677027, 673333, 719477, 809315, 882081, 897549, 873974, 938113, 997444, 867565, 704176, 624002, 518528, 508859, 498670, 505619, 425371, 423076, 367599, 385912, 381145, 422153, 328680, 264372, 316700, 495626, 541130, 571255, 570905, 629990, 653752, 604671, 458076, 366636, 477026, 600322, 623602, 508763, 402824, 343921, 361362, 508850, 712999, 678782, 684564, 703554, 768075, 980604, 1294347, 1313648, 1232349, 1256681, 1174021, 969952, 814070, 705489, 669963, 670920, 639538, 670164, 683946, 602462, 531083, 469802, 512838, 586537, 607901, 698340, 740324, 709677, 663604, 646672, 639458, 692479, 769220, 784173, 617876, 458947, 593953, 812531, 859231, 832776, 751222, 702894, 687591, 762199, 752529]
8990G52529j0805l625j889m1819P4126J10440O1080R8385J08564r420o7936n7694
8978A011936n3128l8421K8245j08667J1799N6153J0849r532O2071m528j8218j1373
8966I37186R306j09841p3680m3197o5965R62o4729K9686n8618k1620k4266P8229
8954E93453O2148q6814r4057N6956M0136O71j37022j90616j5280k5084Q7033P7888
8942C69412l253Q4416R3781k0456Q5076J0774N5340P1370K1113N1387l713J5235
8930H30482O9383J8762n4769l3683j41302R2801K8584N3097l0082p3772p9825
8919F79676J163k9472o5406l0925j15118j26220q1927K726J05799M2780k0791
8908C62285l7211r5720m8052J00637K2016J684R6504M62k5554M9349O7052q838
$$ y = [752529, 741724, 738099, 736210, 694391, 768517, 878957, 940037, 1038422, 1146986, 1137566, 1069630, 1011936, 958808, 920387, 948632, 839965, 851764, 907917, 918766, 909234, 971305, 966777, 948559, 937186, 946492, 836651, 762971, 719774, 653809, 654771, 590042, 619728, 561110, 539490, 515224, 593453, 655601, 568787, 474730, 531686, 571822, 572493, 435471, 244855, 229575, 204491, 291524, 369412, 366159, 450575, 544356, 523900, 608976, 619750, 675090, 746460, 767573, 818960, 815247, 830482, 899865, 918627, 863858, 830175, 688873, 781674, 810258, 863355, 833273, 759501, 679676, 680839, 651367, 585961, 555036, 439918, 313698, 231771, 234497, 340296, 383076, 362285, 325074, 229354, 181302, 281939, 303955, 305639, 402143, 402605, 377051, 426400, 493452, 484614]
8896D84614n8628l0564k6241j15152o4658K8310O7536J60445K5203m3233p6895
8885C50737J3571r0741m3737N6513M7111J9353J21311m0335j00305p1716K3078
8874B84840n8238P2884M5620N2851Q25l6743q00p7621m5971J3065P3379j12450
8862B11641k6212J44200M7162j28116j9616n786p1302k9632o5067j04944N9209
8851A1537J86155J0970n3386P4932r3546k6091l0653n8480j01576J9051k7692
8840h8779O7517L9251J0620n1807J6796J15637R6962J4828k3083m7035Q8617l551
8828B35973r2869N4529M1914J8908r6614p0458J29446q8704m5039p2405N2611
8817F7292K9224q4286n4530J76258J24157q15j3059q6163o7157J3467j9881j05535
$$ y = [484614, 425986, 395422, 369181, 254029, 189371, 217681, 285217, 445662, 470865, 427632, 350737, 364308, 273567, 229830, 286343, 333454, 352807, 474118, 433783, 333478, 261762, 284840, 226602, 299486, 345106, 397957, 398782, 362039, 361239, 283618, 237647, 250712, 324091, 211641, 185429, 329629, 376791, 248675, 229059, 223273, 151971, 122339, 57272, -47672, 11537, 197692, 208662, 155276, 230208, 136662, 110571, 79918, 21438, -80138, -61087, -88779, -21262, 17989, 28609, -23198, -6402, 109235, 206197, 221025, 197942, 150907, 239524, 235973, 143104, 197633, 239547, 258455, 161841, 91383, 220829, 132125, 87086, 14681, 67292, 96516, 12230, -42300, 133958, 258115, 257300, 244241, 158078, 90921, 104388, 84507, -21028]
8805b1028J7816N0492L3786q1222J4674M3434M7114J4401r6406m2270l5820n1351
8793a06380P1580K8453R6393L1456M2385O4590K5663p27j08779l3944n0128o5413
8781d851N6758J4862j9465q2673M5720M3868o4527p704P3899j02460J20634J3234
8769H7295l6311K2497N1635J7977J06695L8163r7995o4277J1818l5914o749N6117
8757A50951P6002P817k3314O784O1839n7851J31086L8434j03123m6879r3204m1317
8745A07225l5118K7096l2825P223N0892Q068M5005j2192j2595j30772k5276n848
8733i117J28531Q4201J8073o9856k01422J3J30057k1187P9704N821j1688L392
8721A36522K7462N939M8935j904K7364J17827l6869j20835l95O421K0647N2969
$$ y = [-21028, -3212, 47280, 81066, -156, 14518, 57952, 105066, 119467, 23061, -19209, -55029, -106380, -34800, -6347, 90046, 121502, 163887, 228477, 254140, 253413, 144634, 110690, 60562, -4851, 51907, 66769, 47304, -35369, 10351, 54219, -10308, -18012, 55887, -46573, 74061, 87295, 50984, 73481, 125116, 143093, 249788, 287951, 189956, 125679, 137497, 101583, 94834, 150951, 226953, 234770, 211456, 218240, 280079, 222228, 353314, 391748, 288625, 241746, 148542, 107225, 72107, 99203, 66378, 73601, 124493, 132561, 177566, 165374, 152779, 22007, -3269, -9117, 119414, 203615, 221688, 151832, -49590, -49577, 80480, 59293, 138997, 144818, 133130, 136522, 163984, 169923, 218858, 216954, 244318, 362145, 325276, 204441, 204046, 210467, 231114, 284083]
8709B84083J46587r8494L642o2617q339r1837K4245L3319n4668k2232n1301N7146
8697A59534Q5869l8925p7429m2285l2676l1384m923O8091N4349m6530m0409r999
8685D3283o7151n937L6554J09908P5733n2481m2892K8749n7965r6453m2663k392
8673g3707J19043J08772J1443m8097o372q7797p5801J14931J04632o1917Q1122
8662A86252R6679n4862r6867k0448M4620K7423P6310p3m7436l8988j11100N2177
8650A13687j8072M8286O5334o557p8024J9885j0353O3245K5018N18q49n4303p9598
8637H8217q3331Q7857j9328N0052M4711K127o0879R9532O5440r6004O3484M1291
8625B83169n7258N6163m3000l8470j51968R1548J15256R1124L0219r0706j09850
$$ y = [284083, 430670, 332176, 335818, 273201, 264862, 173025, 197270, 230589, 175921, 153689, 102388, 159534, 245403, 206478, 129049, 86764, 54088, 22704, 17781, 85872, 140221, 93691, 53282, 43283, -23868, -29805, 6749, 116657, 192390, 139909, 97017, 125766, 67801, -28652, -71315, -73707, 45336, 154108, 165551, 117454, 111082, 23285, -52516, 62415, 167047, 105130, 186252, 282931, 228069, 131202, 110754, 155374, 182797, 259107, 259034, 211598, 172610, 61510, 113687, 95615, 143901, 209235, 202678, 124654, 144539, 134186, 197431, 222449, 222967, 222118, 167815, 88217, 4886, 92743, 73415, 123467, 168178, 170305, 109426, 208958, 274398, 178394, 241878, 283169, 225911, 282074, 239074, 200604, 48636, 140184, 255440, 346564, 376783, 286077, 176227]
8614A76227M3894l2700N5809N637P530N1536Q6527M3237m974J8978q5586j15049
8602B51066P440Q0304N4694m662j23064P2658J232m1375J34904J55367k9823r2198
8590D66543o3660l9792p6827n5267J9526L6464j17449J39514J87814J2513j85507
8579C23872j03286r2854m8965J13987P2152r994M4988J04158j27083j79516j97392
8568i9933N4604J00657Q0749R7797l5256j6880l4407r9720Q8234J1468k22439
8557g5126J5943N5365J21852J37334Q0563j06515n5847J29918L5140j12191Q4618
8546C11054J2246q7333n6516P8947J5976J9067O1691j15320j01644M2273j50382
8535C0059j02436O6322J44018R0626Q499J69616L7629l4751j80501n640N4524
$$ y = [176227, 220121, 187421, 243230, 248867, 256397, 307933, 394460, 437697, 432723, 451701, 366115, 251066, 258506, 338810, 393504, 388842, 265778, 338436, 339668, 298293, 433197, 588564, 558741, 466543, 402883, 363091, 286264, 230997, 250523, 286987, 169538, 309052, 496866, 509379, 323872, 220586, 127732, 78767, 192754, 264906, 254912, 299900, 404058, 276975, 97459, -99933, -45329, 55328, 136077, 233874, 198618, 181738, 147331, 47611, 135845, 147313, -75126, -59183, -3818, 118034, 255368, 335931, 229416, 173569, 303487, 338627, 226436, 311054, 323300, 235967, 179451, 258398, 274374, 293441, 355132, 239812, 138168, 180441, 30059, -72377, -6055, 137963, 228589, 237088, 406704, 444333, 409582, 229081, 223441, 277965]
8524B77965M1549q4881o9178m2861M6238m9676N8826O0377j8574P1213m1390j04098
8512A45510o6700O3529Q9197j8785l4872j25913N808J5620J55J64056l0682j10074
8500I6849q818j4058n3943J03827O0768j20964o7835R0820K669k0861j13999J41828
8488I6283J41589Q0799n3269k28853j09606K2691N4631J38419q4972j64364j7085
8477a23737L0941K245J53972K09453L7545L6996l1130j1124L5567m3718j15098
8466A81912p5120j2262M1281P3090Q6869k1317l6695p4292l8841N2983o0724n9332
8454E7552N2722j8472O640L2833O5438o0875j44626N9579Q3397R5871J0835m8351
8442A92543l7336l5986j9698k5833L5064r2897J0367O4094M3694p658k251M8740
$$ y = [277965, 319514, 234633, 165455, 122594, 168832, 119156, 177982, 238359, 219785, 290998, 249608, 145510, 78810, 142339, 231536, 212751, 177879, 51966, 57774, 73394, 73549, 237605, 206923, 96849, 88031, 73973, 20030, 123857, 184625, 63661, -4174, 86646, 89315, 68454, -45545, 96283, 237872, 318671, 265402, 36549, -73057, -50366, 4265, 142684, 57712, -106652, -123737, -92796, -90551, 63421, 272874, 310419, 347415, 316285, 305161, 340728, 297010, 181912, 106792, 94530, 135811, 208901, 295770, 274453, 237758, 163466, 124625, 177608, 116884, 57552, 110274, 91802, 98442, 131275, 196713, 135838, -8788, 50791, 134188, 230059, 240894, 192543, 155207, 119221, 99523, 73690, 108754, 15857, 26224, 90318, 134012, 126354, 124103, 172843]
8430A72843J5673n4954j88018P986J06358J07986l3645q666l177m2609n2032O4940
8418I2685P9065K0186j40000n7137j01176J8080Q7235J60849O4764L318l0160
8407A97709k960O743J2771o3503j29230R8768N6783p4075o6674l7706n1298r0566
8395a43238m7081k8973R1261J35133o474o0305j2958K8381J21208K5209k156p8439
8383B1568K1617Q9002j92294k8516J825J10100R5435M0539M996J0832J0823j63073
8371B2854j09924J04865M4360j3856n1957O7524J18730J30185n5718p5372r8860
8360H2831l4363P5977r8634K2740m1536l8387N197K8033N3848M1795k3804O0606
8348A34303J01637J1260j9589m7863p9629o5804r3745K48627N9981l9196j00430
$$ y = [172843, 188516, 133562, -54456, -46470, 59888, 167874, 134229, 125563, 122386, 79777, 27745, 92685, 171750, 191936, 51936, -5201, -106377, -88297, -1062, 159787, 224551, 227869, 197709, 194749, 201492, 214263, 150760, 21530, 120298, 177081, 103006, 36332, -1374, -52672, -143238, -190319, -219292, -128031, 7102, 628, -59677, -72635, -44254, 76954, 102163, 100007, 21568, 43185, 132187, -60107, -88623, -86798, 23302, 118737, 159276, 164272, 175104, 185927, 22854, -87070, 17795, 62155, 48299, -3658, 63866, 182596, 312781, 257063, 181691, 82831, 48468, 124445, 25811, 48551, 7015, -31372, -26175, 1858, 55706, 97501, 73697, 134303, 235940, 247200, 227611, 179748, 100119, 34315, -59430, 189197, 249178, 209982, 109552]
8337A09552j33677j25802J21539k57J4546J05123P1693m1734O7589K9474j70846
8326D7200q5494m5759L9284J29726P6508r7952P066m5266K9973k175k1914m0745
8314i548P9622j05708l6598O1459P7394n4904P2213N0666l6961j67457M9311Q6316
8302F5805j73365j01946M3772J19025N4082O9928Q6125R0632o2444q7780o876
8291I6958M868L165K152j5117l7791N2447J1295Q0707j21740n5890j1852k6226
8279a7024l4055Q558J41393Q9135k9609k8054m9575m4158k476l4622q9944p5960
8267a66391l9861R9769Q4235L8672j21857l3630N5546K4144Q8829o9102N205J6339
8255a8102O3489l29J0391N2143m5100q8831O7823N6523N2313r1764j16446r2786
$$ y = [109552, -24125, -149927, -28388, -28645, -14099, 91024, 162717, 120983, 188572, 218046, 47200, -38294, -84053, -44769, 84957, 161465, 63513, 70579, 25313, 55286, 53111, 31197, -9548, 70074, -35634, -72232, -10773, 66621, 11717, 83930, 134596, 97635, -69822, -20511, 65805, -107560, -209506, -165734, -46709, 7373, 77301, 163426, 254058, 191614, 103834, 96958, 101826, 104991, 107143, 92026, 54235, 106682, 117977, 198684, 76944, 21054, 9202, -17024, -51079, -42521, 98872, 188007, 158398, 130344, 80769, 36611, 34135, -487, -90431, -166391, -206252, -106483, -22248, 16424, -105433, -139063, -83517, -59373, 29456, -39646, -34441, -18102, 45387, 45058, 55449, 107592, 62492, -26339, 41484, 98007, 150320, 58556, -57890, -150676]
8243a50676K7022p197J04256R5720M5043J1053l4796J5635o3320j71882m8214
8232a77356O8719J90747Q2131m9214M381p0879k8822k7361L4219J8558M874N2381
8220A02378m6289k3082q390O1499l6748P668k6948M577P2746l3142p7119l7930
8208d0780L525N8680K7525l1785m5515j3737o9876L254j11829M4991J11809Q9032
8196B5294k8404O6460N9086m6668j5623J5151O4133K6277p4805N6995O747N6438
8184B11081K0876M7893j07109q7321R447p8294O405J24475l3679j47230K5525
8173g931M8766N722L4916M3590o0165q9040J0703Q4107N6270j30049l2892q5843
8161a21846M4223R507P0900O27p6379L2052M8839J11294j1906n6898R2178R393
$$ y = [-150676, -123654, -130851, -26595, 69125, 114168, 125221, 90425, 106060, 42740, -129142, -177356, -108637, 82110, 164241, 115027, 119408, 48529, 19707, -7654, 26565, 45123, 49997, 102378, 56089, 33007, 24617, 86116, 49368, 57036, 30088, 34665, 107411, 74269, -2850, -40780, -37255, 21425, 48950, 17165, -28350, -42087, -111963, -108709, -220538, -175547, -63738, 25294, -3110, 63350, 122436, 75768, 60145, 75296, 139429, 165706, 90901, 147896, 154643, 211081, 231957, 279850, 172741, 85420, 94867, 16573, 22978, 147453, 113774, -33456, -7931, 40835, 46557, 81473, 125063, 64898, -24142, -13439, 70668, 126938, -3111, -36003, -121846, -77623, -68116, 2784, 3411, -72968, -40916, 7923, 119217, 107311, 50413, 142591, 151984]
8149A51984L8631m0297r3503o7136P3132R4752o9245r2492p3360J06936p8225
8138d8823J6543m1446k4594n6090M006J22671J55777L3150N2674q5185j07390
8127B1293n7646J5846J13223J02074k467m4716l5217n714j661m7163n6008k832
8115i88q2513j42568K3213J20990K9196L3849m2944o3191q9100j46919M6106R6300
8103b18569J03506P2531n7332K9437q1939j35R3040r418j05243m7107Q811J24111
8091h8307m734p987R7347n4824J5336L1928M870J3751p6709j4201J82407L9080
8079A37957k6839l3187q1606r9472j2685J30045r106M7488Q9088m0864k7566O801
8067H0054m5130l0871j561J4501l8154k5450l5124L8494J3479M5105p7364K0921
$$ y = [151984, 190615, 150318, 56815, -10321, 62811, 157563, 88318, -4174, -77534, 29402, -48823, -32280, -73726, -98320, -154410, -150404, -27733, 128044, 161194, 213868, 128683, 21293, -36353, -20507, 92716, 194790, 192323, 147607, 112390, 106676, 105015, 57852, 1844, -988, -83501, -226069, -202856, -81866, -52670, -18821, -61765, -124956, -214056, -360975, -314869, -218569, -115063, -42532, -99864, -70427, -152366, -152501, -59461, -68879, -174122, -221229, -212418, -88307, -93041, -101028, -3681, -58505, -43169, -11241, -6371, 7380, -69329, -83530, 98877, 137957, 111118, 77931, -3675, -103147, -115832, 14213, 5107, 52595, 141683, 100819, 73253, 80054, 34924, 4053, 2492, 16993, -21161, -46611, -81735, -43241, -29762, 15343, -62021, -41100]
8055d1100q1368p4680J1752J06950j20218j70181R069J13092N1928Q3834Q9465
8044b1457k0657j1242L3063Q7882O3413q817N3247k2578j78758J8357N4659J07117
8032A54229N5942j8404r7727r8938l8513j8949o4788o2275O7230m4902L7184Q0529
8020d9382J92573j0949r1924j14751J3998p3561O2274P5609K2869J2025K7031
8009F5812L7708J3318P372r2173k9152K1798J01050J01954J05419o2957r2505
7998A77644Q6264M7807M6478L8656j53129j04623L1937m7292r8170L4380j082
7987E8870N3381L7344k1707N0482N3612J28780l6501m9984j21861j25398j5349
7976A1669M6036L698Q8470L1643l8107o7247p2382R4535O9981q8497L4408L9661
$$ y = [-41100, -122468, -197148, -185396, -78446, -198664, -368845, -359776, -246684, -194756, -110922, -21457, -42114, -53356, -20293, 67589, 131002, 122185, 175432, 152854, -25904, -7547, 47112, 154229, 210171, 191767, 94040, -4898, -43411, -62360, -127148, -189423, -122193, -167095, -129911, -49382, 143191, 132242, 40318, -74433, -60435, -133996, -71722, 3887, 26756, 38781, 65812, 103520, 116838, 124210, 32037, 2885, 24683, 125733, 227687, 333106, 270149, 177644, 263908, 311715, 358193, 396849, 243720, 139097, 171034, 123742, 25572, 59952, 58870, 112251, 149595, 127888, 178370, 231982, 360762, 324261, 274277, 152416, 27018, 11669, 57705, 61403, 149873, 181516, 143409, 76162, 3780, 98315, 168296, 79799, 114207, 153868]
7964A53868J7521n8896k145J6171L0008l8691m1598k7335R1896k33j15316Q2086
7952A07336M1813M6663K6943J4458M9097J5787p1750k4307n0176j32564r4736
7941g1436J26087k2739l3883k1745J111J48896O2898o632j10055o6648K2396K63889
7929B92139J19160r5370q0538l1945L7168k1617r7650J11472Q344P8697l8238
7918B81622M495m7380j72844l6173J3285J1941J5915m7528R7369P5218j20625
7907G5295M5040q877n2910J30357l540J576M2913j13427q3345m790O839j1324
7895B3807R6394K0758j40161j09566L3212M7083l1566M9878J18208L9342J05273
7884B52662N0678m0296j3453P3055N9238j20802j97802j9122J27416Q3379n6881
$$ y = [153868, 171389, 112493, 110348, 126519, 156527, 117836, 76238, 48903, 140799, 140566, 25250, 107336, 149149, 195812, 222755, 237213, 286310, 302097, 230347, 206040, 155864, 23300, -71436, 54651, 31912, -1971, -23716, -22605, 126291, 189189, 182557, 72502, 5854, 28250, 292139, 411299, 315929, 235391, 203446, 240614, 218997, 121347, 232819, 241163, 319860, 281622, 286117, 238737, 65893, 29720, 43005, 54946, 70861, 23333, 120702, 195920, 75295, 120335, 111458, 58548, 188905, 185365, 186941, 229854, 116427, 33082, 28292, 35131, 23807, 120201, 140959, 798, -108768, -75556, -28473, -60039, -10161, 108047, 147389, 252662, 303340, 263044, 249591, 322646, 381884, 261082, 63280, 44158, 171574, 254953, 198072]
7873A98072n5157j2560L6144p8104j4001k4176p0099j04693q1091p0689M0689
7862b35665J20913J21090m3397l6192k8432p1589L7994J53623P4334k7281o3166
7851B232j15039p9846k6925K6919J03808N3996n0122k9418l0409J35800N6573
7840D7569K948l6027m0322l1107K3944L5385L4444m4054o6240m4149N2464N1845
7828a3300p5669N8399j18004n9434l4086L2279J01846J40353K3015K8290o3190
7817B0499l4078J3405J17326J45532q664j39740l8496P0936N1519k8652k485q290
7805A58812n4734r3736q6306n6463O1022K0417J19406J00110M3027m1788l5457
7794A34310j11260M7410o4133j67747R99J12237J30522k211q20o0716L5723k7157
$$ y = [198072, 142915, 130355, 166499, 88395, 74394, 50218, -19881, -124574, -205665, -276354, -235665, -114752, 6338, -37059, -73251, -101683, -173272, -135278, 18345, 92679, 65398, 2232, -112807, -192653, -219578, -192659, -88851, -34855, -84977, -114395, -144804, -9004, 47569, 50517, 14490, -25832, -56939, -32995, 2390, 36834, -7220, -73460, -117609, -65145, -13300, -88969, -30570, -148574, -208008, -242094, -209815, -107969, 32384, 55399, 83689, 20499, -13579, -174, 117152, 262684, 254020, 114280, 75784, 146720, 198239, 169587, 167102, 158812, 104078, 10342, -75964, -132427, -71405, -50988, 68418, 168528, 211555, 169767, 134310, 23050, 70460, 6327, -161420, -160421, -48184, 82338, 80127, 79307, 18591, 54314, 27157]
7782B7157q584L3261R8801k1542k3009K8486Q6551N0141j73386r4274J10690J30198
7770B44490o5740r9878j22779J1093K9619L0539L9801m7251j25647l2228p607
7759a45588L0021J27778j1097q1526M4295O043r0722j1586r536J42352Q9054j18182
7747b8694q0221P6451O2822L3978K0551n5511K9985k1615o6686p0932J8662P3107
7735h103O5297L6619j03108k2041J04540N6867n4020l0286M9149J11861o7414
7724A39361j48721M8129k3643k9100M982K5545J06327r3159J2266o8976j11756
7713a38745J28826J119r8199P4933P3694O5006k0479q4526J8334k5504m3620K534
7701d6627P6102m1976m6335J39659P9687Q0857Q0139m7876j73331n6818m5711
$$ y = [27157, 18573, 51834, 150635, 129093, 106084, 134570, 221121, 271262, 97876, 3602, 114292, 244490, 178750, 78872, -43907, -32814, -3195, 27344, 67145, 19894, -105753, -137981, -145588, -115567, 12211, 1114, -80412, -36117, -30074, -120796, -132382, -141918, 434, 89488, -28694, -108915, -32464, 30358, 64336, 84887, 29376, 59361, 37746, -28940, -99872, -81210, -8103, 57194, 93813, -9295, -31336, 73204, 130071, 76051, 45765, 94914, 206775, 139361, -9360, 38769, 15126, -13974, -8992, 16553, 122880, 29721, 41987, -26989, -138745, -9919, -8800, -106999, -32066, 41628, 106634, 86155, 1629, 19963, -5541, -49161, -46627, 29475, -12501, -58836, 80823, 160510, 241367, 321506, 273630, 100299, 43481, -2230]
7690b230M5058l387k118k3565q4063K1540j00395k4728l0789Q8460J83987N0437
7678A18207k8754n3802Q186L7489r0574o8201J4013M5253n5322n5344J18770R7182
7666H7103m8878n4422Q0308M2941J4615m0229j32543p123M9141L4122k6429q6804
7654h8198j44454P2234O7693J1361Q1235M2595r1868n2147K7579j9028J2068N2840
7642b8090K4320J30748j1196m4399j9392p1657N1078R1285O5131K8803j1694J1838
7630B16775l7271q3515p8684q56m2624K4472P5732K3935L6977j07054L4359j07081
7618d4835k6231O9557M3421l5508J6093R3410J04104j43031j18092k2419L806
7607e9725m0177L6289J28148J09657p9472j04086N7762J5483M7084p8842j66251
$$ y = [-2230, 42828, 39441, 37323, 13758, -70305, -48765, -149160, -173888, -204677, -116217, 67770, 118207, 89453, 35651, 43837, 81326, -9248, -77449, -63436, -18183, -73505, -128849, -10079, 87103, 38225, -16197, 64111, 107052, 121667, 81438, -51105, -58228, -9087, 25035, -1394, -88198, -232652, -160418, -92725, -81364, -129, 42466, -49402, -101549, -73970, -92998, -80930, -28090, -3770, 126978, 115782, 71383, 51991, -19666, 31412, 122697, 187828, 216631, 204937, 216775, 179504, 95989, 17305, 16449, -26175, -1703, 74029, 97964, 134941, 27887, 62246, -44835, -71066, -1509, 41912, 6404, 22497, 115907, 220011, 76980, -41112, -63531, -59725, -99902, -63613, 64535, 174192, 94720, -9366, 48396, 63879, 110963, 32121, -134130]
7596a34130n1414M0487P5124L3407n0599K3179p2772m70N1582p7216l0120N8384
7584a34558L9575M1923O3363o2291j59333L1114P5248J22039J35957r3475j08136
7573d8574r9691N2766l0742P65k4786L8640j5301l0660J16675L9271M3010M1293
7561H2666L9639k8428j04989o9847L2468Q4771r0069q3619l8633l3457q2200m3442
7549c35140K9068M5578Q3193K4602L3399J24656M451P2610J0521Q319M5668J2400
7537A59325M5769m9448j01043L5696P6802k7932p4288k6582N0189l8227l8181
7526A2080j4930J3437r0745M7402J5635l3967P7457j20571k4251O750k2536o9107
7514b03346l2346l810P6634R1319O4677J23311q872m5579N279m7546j02677R076
$$ y = [-134130, -185544, -145057, -69933, -36526, -87125, -63946, -136718, -137188, -85606, -162822, -192942, -134558, -94983, -53060, 10303, -51988, -211321, -180207, -104959, 17080, 153037, 59562, -48574, -148265, -95499, -126241, -125476, -150262, -111622, -126923, -157583, -40908, -1637, 41373, 82666, 122305, 93877, -11112, -80959, -48491, 36280, -53789, -137408, -176041, -209498, -291698, -335140, -306072, -260494, -177301, -152699, -119300, 5356, 9807, 82417, 92938, 101257, 146925, 159325, 205094, 155646, 54603, 90299, 167101, 139169, 64881, 38299, 88488, 50261, 12080, -2850, 10587, -80158, -32756, -17121, -51088, 26369, -94202, -118453, -111703, -134239, -203346, -235692, -239502, -162868, -71549, -6872, 116439, 107567, 61988, 67267, 19721, -82956, -73880]
7502g3880R3718K3089P892L4154q8090j30326J6241M9113l935q544j16368N7825
7490a39111K0494J62740K1902J00840o7138j01498j10306n58P3112j3884K8416
7479b4991j5370o7012j25351k9503n5250L0909J32142r97J6699J08390M0054M8138
7467E7858K965J3913R2136K0409l9846m8498o9907p0441l2081J26868j1141O3342
7455A05577j45226j21763m3472O4121N4062J04810K7942m5482l6678l6369o2545
7444a35023L6878J38612J1262n119L4826L0249j38568j45540Q027m7335Q0558
7433a31173Q7955r664K316J2153L6053l8122J9183J45519J2306j78395j80516
7422b22385J39850Q4881n9510n8817N9023j00k8591k4316K7062J75881O1449q5227
$$ y = [-73880, 19838, 42927, 50819, 84973, -3117, -133443, -117202, -68089, -72024, -80568, -196936, -139111, -118617, 44123, 66025, 166865, 99727, -1771, -112077, -112635, -39523, -53407, -24991, -40361, -107373, -232724, -262227, -317477, -286568, -154426, -155423, -138724, -30334, 9720, 57858, 60823, 74736, 166872, 187281, 147435, 98937, 29030, -41411, -73492, 53376, 42235, 105577, -39649, -161412, -204884, -140763, -86701, 18109, 46051, 569, -36109, -72478, -135023, -98145, 40467, 51729, 46610, 81436, 111685, -26883, -172423, -164396, -211731, -131173, -43218, -52882, -50566, -38413, -2360, -40482, -21299, 124220, 136526, -41869, -222385, -82535, 2346, -57164, -115981, -56958, -57058, -85649, -109965, -82903, 92978, 154427, 69200]
7410F9200j06501L5855Q2956j14053m2267p4869J3959J27739o2306J78094L9310
7399A47117j45655m75L6828N5130M6767n1611j83684O561J00366p1368L526O029
7387e0469j02244n6741k1967K8959Q4342Q6692J83160k3417J4823L3878p1547
7376A05469p6433j7762l0161K0111O4180r8592j28475N3232J6090O7607J33695
7365A08961j6620p7687J5916O048j75910l1948J33882Q7403R3922R8355J14j14006
7353A28430j51438p9560j7344l5469p526r3341J23668N7317M6095L1100O4613
7342F6545j41266m9732l1655O5246O3957r1709M0744R184q8556R6877m2751q4444
7330a87560J8019J1756J24075K7366n8476j8642M858R2002O6230J29281j9427
$$ y = [69200, -37301, -1446, 81510, -32543, -74810, -149679, -135720, -7981, -70287, 107807, 147117, 1462, 987, 37815, 92945, 139712, 88101, -95583, -89022, 11344, -60024, -56498, -50469, -152713, -209454, -231421, -202462, -118120, -31428, 151732, 128315, 143138, 177016, 105469, 29036, 11274, -18887, 1224, 65404, -33188, -161663, -108431, -92341, -24734, 108961, 92341, 14654, 30570, 36618, -139292, -171240, -37358, 50045, 143967, 242322, 242436, 128430, -23008, -102568, -119912, -155381, -162907, -256248, -132580, -75263, -29168, 1932, 66545, -74721, -124453, -156108, -90862, -26905, -118614, -77870, -68686, -157242, -60365, -103116, -187560, -169541, -157785, -33710, -6344, -64820, -83462, -78604, 13398, 79628, 208909, 189482]
7319A89482q9779J2726o0751p0555J46510J9938j42402O082l1032j8527n1206
7308h9514j9159n3047j58254l0183J74267J532j11545P6860R9248k9476m2014
7297a81285O4368r6138k7519P4042J27666J5101q4641j6434l6415j16311m7293
7286c24859J14098J24927Q0543k0875p6582o8034R9432J45947J910o8745j2736
7275d974l2830n7119L2010N6681J57681P511j50304k3819n9384m1877l668M4359
7263g5733m0226N2062L1141l4746K3570K0958o4479L0502o0056N825n6630k3932
7251a91744M6299j7202P984L5458P3563J30655m7215j06130L883n3109M9912R2323
7239B4677K1866j9942k9656q7374l6070k7373p444m241K2083M5051K0624r8498
$$ y = [189482, 99703, 112429, 51678, -18877, 127633, 147571, 5169, 11251, -19781, -38308, -89514, -108673, -161720, -319974, -350157, -175890, -174358, -285903, -209043, -109795, -139271, -181285, -116917, -213055, -240574, -166532, -38866, -23765, -108406, -124840, -161255, -277566, -324859, -210761, -85834, -5291, -26166, -102748, -170782, -71350, 74597, 76507, 7762, -4974, -37804, -94923, -62913, -6232, 151449, 158960, 8656, -15163, -74547, -116424, -120092, -75733, -115959, -63897, -32756, -67502, -43932, -22974, -87453, -56951, -117007, -111182, -167812, -191744, -145445, -162647, -154663, -119205, -45642, 85013, 37798, -68332, -64449, -117558, -67646, 24677, 46543, 26601, -3055, -90429, -126499, -153872, -161316, -165557, -143474, -98423, -77799, -176297]
7227a76297n4416L0486J20609K45K7643J4513o7078j0510J03261m4667k8575l7332
7215a22118l0069M5477L3630J0161j8190K5888J21160Q3201k1448o8340M1146
7204A00498n1645o2745l6249P6300m9514l2767L2444k0554q4006k1371J8181l6617
7192a68045j01083n396J49390N7891p2851m2122l6800J00648J29060j02764O5781
7181b6291O5466p65K4592M5894K0973m2253k1714l1216j06469n9138J45654K6606
7169D1339j25037n8637M7493J5071K1521M7221j21264q9303J0602O6495N6186
7158h8313j5762j20196O9800R3625J0202m9113o8198M1020l050l9094L4956R2597
7146d1526J01303Q6275M6362q9656K8728k9757k2040L1623L3115j85640j2634
$$ y = [-176297, -230713, -200227, -79618, -79373, -51730, -37217, -104295, -114805, -11544, -56211, -84786, -122118, -152187, -106710, -73080, -62919, -81109, -55221, 65939, 149140, 127692, 59352, 100498, 48853, -13892, -50141, 26159, -23355, -56122, -23678, -44232, -128238, -149609, -131428, -168045, -269128, -274524, -125134, -67243, -140094, -182216, -219016, -118368, 10692, -92072, -26291, 39175, 38410, 63002, 108896, 129869, 87616, 65902, 34686, -71783, -130921, 14733, 41339, -83698, -142335, -94842, -79771, -58250, -11029, -132293, -221596, -210994, -144499, -88313, -104075, -224271, -154471, -60846, -50644, -99757, -167955, -126935, -129985, -169079, -134123, -41526, 59777, 146052, 192414, 102758, 131486, 101729, 79689, 111312, 144427, -41213, -53847]
7135e3847J0627p0337j4172R1631R142l1093j8898l3735m7019N5590k061r0370
7123a94542L3882Q2630m9790N2372J8535q0873k1697j4391K1479L2013J08662
7112a1720L6709k983q3094K8046q9113p1557m4442Q7557J33307o0690r6282J2927
7100a61335J00607Q433m3145R0716n651j38396K6384J03990N2590O17J45015O7517
7088B47342j00384r0653q4930M13M705k6787N9839O1353M9523M1663o7660r0205
7076D219p0272q7564j2383J13424J5115j6679q790J7582J1601l9457o2827K3238
7064a12793M9418j7854L2759N539j5310L7326m1259L2991k1253k5846J91132R8974
7052B13824q4071o119k9027l7179j15629J62116K4480n7709q401m6190q4312L7292
$$ y = [-53847, -43220, -113557, -127729, -36098, -26956, -58049, -76947, -110682, -157701, -102111, -104172, -194542, -160660, -78030, -127820, -75448, -56913, -137786, -159483, -173874, -152395, -120382, -11720, 24989, 22006, -61088, -33042, -122155, -193712, -238154, -150597, -17290, -77980, -174262, -161335, -60728, -52295, -95440, -4724, -10375, -148771, -122387, -18397, 34193, 34810, 179825, 247342, 146958, 56305, -28625, -28212, -23507, -50294, 9545, 70898, 120421, 162084, 94424, 4219, -66053, -153617, -166000, -52576, -37461, -54140, -62930, -45348, -33747, -73204, -136031, -112793, -63375, -81229, -48470, -42931, -58241, -20915, -62174, -29183, -50436, -76282, 114850, 213824, 129753, 123634, 94607, 57428, -58201, 103915, 128395, 70686, 62285, 16095, -68217, -30925]
7040c0925L5018J9871l1363r0857M2419O5186O7130n416m1409J0633j4199M3547
7028F9635r977o551j6248l1122m4184p0786q1116m433o0985q4117m6082J7261
7016c68705J17071P2046J39887k3938j42400M4154Q4894O6595N9818R2336L7345
7005A79103l2369L2825J906j66518j10273o204J1136l6357P6113M0902n359N1085
6993C5990m7413M0997M5677n1699n697p392p4962J736n2548J9208Q7371J4259
6981E527r8069M9478n0941Q1354O3548j17781j45135K0586J06945R9850M2016
6970E7378R2738K571l1916k0348O2670Q9136Q245j18278j91473m9700J46567p203
6958D0387j49666n0969K8619M4978J8035O7517J05409j7748j31743j1029J11923
$$ y = [-30925, 4093, 23964, -7399, -98256, -55837, 9349, 76479, 71063, 29654, 40287, 26088, 69635, 59658, 53107, 36859, 5737, -38447, -109233, -190349, -194782, -255767, -339884, -385966, -368705, -251634, -179588, -39701, -63639, -206039, -161885, -76991, -10396, 49422, 141758, 179103, 146734, 179559, 181465, 14947, -95326, -101530, -90394, -126751, -50638, -9736, -15095, 35990, -11423, 29574, 75251, 23552, 17855, 10463, -64499, -62763, -115311, -96103, -8732, 5527, -92542, -43064, -94005, -12651, 50897, -66884, -212019, -191433, -84488, 15362, 57378, 150116, 152687, 120771, 100423, 163093, 252229, 260474, 142196, -49277, -98977, 47590, 40387, -109279, -160248, -131629, -86651, -68616, -1099, 104310, 86562, -45181, -56210, 55713]
6947E5713n4594N4304N2593m4786p343r6784j9493k9080j9639L1645O418J48365
6935G7319J1219k0769l6818o0654o7948N5821J0579r1013q3155J46231J60673
$$ y = [55713, 1119, 55423, 108016, 63230, 55887, -40897, -60390, -89470, -109109, -77464, -71046, 77319, 88538, 67769, 30951, -29703, -97651, -41830, -31251, -122264, -205419, -59188, 101485]
$$ [...]
##END NTUPLES=NMR SPECTRUM
##END=
