##TITLE=Analysis number 322419
Compound Code cc 57816
Book Reference 449/154
Project Code adrs
Chemist Name davee
##JCAMPDX= 6.0         $$ Bruker NMR JCAMP-DX V2.0
##DATA TYPE= NMR SPECTRUM
##DATA CLASS= NTUPLES
##ORIGIN= Bruker BioSpin GmbH
##OWNER= nmr
$$ XWIN-NMR		Version 3.5
$$ Tue Sep 26 08:37:27 2006 GMT Daylight Time (UT+1h)  MAYBRIDGE\nmr@NMR_250MHZ
##.OBSERVE FREQUENCY= 250.131544655141
##.OBSERVE NUCLEUS= ^1H
##.ACQUISITION MODE= SIMULTANEOUS (DQD)
##.ACQUISITION SCHEME= undefined
##.AVERAGES= 16
##.DIGITISER RES= 18
##SPECTROMETER/DATA SYSTEM= dpx250
##.PULSE SEQUENCE= zg30
##.SOLVENT NAME= CDCl3
##.SHIFT REFERENCE= (INTERNAL, CDCl3, 0, 16.4549)
##AUDIT TRAIL= $$ (NUMBER, WHEN, WHO, WHERE, WHAT)
$$ ##TITLE= Audit trail, XWIN-NMR		Version 3.5
$$ ##JCAMPDX= 5.01
$$ ##ORIGIN= Bruker BioSpin GmbH
$$ ##OWNER= nmr
$$ C:\u/data/dgb/nmr/ADRS/1360/pdata/1/auditp.txt
$$ ##AUDIT TRAIL=  $$ (NUMBER, WHEN, WHO, WHERE, WHAT)
(   1,<2006-09-26 08:37:05.18 +100>,<MAYBRIDGE\nmr>,<NMR_250MHZ>,
      <created by zg, POWCHK disabled, PULCHK disabled
       configuration hash MD5:
       E2 DF 36 D8 04 B2 41 60 5A D7 A3 38 5A 4B D0 FE
       data hash MD5: 64K
       92 DF 6D B2 62 D1 4A 0A F7 A4 F3 24 8F 66 EB 42>)
(   2,<2006-09-26 08:37:17.77 +100>,<MAYBRIDGE\nmr>,<NMR_250MHZ>,
      <Start of raw data processing
       ef LB = 0.3 FT_mod = 6 PKNL = 1 SI = 32K 
       data hash MD5: 32K
       83 96 88 80 C0 9F 8E 5C 4C 14 A3 00 23 0B D7 C4>)
(   3,<2006-09-26 08:37:19.41 +100>,<MAYBRIDGE\nmr>,<NMR_250MHZ>,
      <apk 
       data hash MD5: 32K
       87 15 43 1E 52 B8 34 56 08 FC 6B 30 EA 2E 24 37>)
(   4,<2006-09-26 08:37:20.13 +100>,<MAYBRIDGE\nmr>,<NMR_250MHZ>,
      <abs ABSG = 5 
       data hash MD5: 32K
       73 4C E6 2C 00 FD EF B1 C9 05 64 95 2D 7D F2 20>)
$$ ##END=
$$ 
$$ hash MD5
$$ E6 29 FD 58 CE 5C 42 03 57 56 1B 85 AE 6B D3 2D
##$RELAX= 
##$RELAX= 
##$RELAX= 
##$RELAX= 
##$RELAX= 
##$RELAX= 
##$RELAX= 
$$ Bruker specific parameters
$$ --------------------------
##$DU= <C:\u>
##$EXPNO= 1360
##$NAME= <ADRS>
##$PROCNO= 1
##$TYPE= <nmr>
##$USER= <dgb>
##$AMP= (0..31)
100 100 100 100 100 100 100 100 100 100 100 100 100 100 100 100 100 100 
100 100 100 100 100 100 100 100 100 100 100 100 100 100 
##$AQSEQ= 0
##$AQ_mod= 3
##$AUNM= <au_zg>
##$AUTOPOS= <38 >
##$BF1= 250.13
##$BF2= 250.13
##$BF3= 250.13
##$BF4= 250.13
##$BF5= 500.13
##$BF6= 500.13
##$BF7= 500.13
##$BF8= 500.13
##$BYTORDA= 1
##$CFDGTYP= 0
##$CFRGTYP= 5
##$CHEMSTR= <none>
##$CNST= (0..31)
1 1 145 1 1 1 1 1 1 1 1 1 1 1 1 1 1 1 1 1 1 1 1 1 1 1 1 1 1 1 1 1 
##$CPDPRG= <>
##$CPDPRG1= <>
##$CPDPRG2= <>
##$CPDPRG3= <>
##$CPDPRG4= <mlev>
##$CPDPRG5= <mlev>
##$CPDPRG6= <mlev>
##$CPDPRG7= <mlev>
##$CPDPRG8= <mlev>
##$CPDPRGB= <>
##$CPDPRGT= <>
##$D= (0..31)
0 1 0 0 0 0 0 0 0 0.06 0 0 0 0 0 0 0.0002 0 0 0 0 0 0 0 0 0 0 0 0 0 0 
0 
##$DATE= 1159256224
##$DBL= (0..7)
120 120 120 120 120 120 120 120 
##$DBP= (0..7)
150 150 150 150 150 150 150 150 
##$DBP07= 0
##$DBPNAM0= <>
##$DBPNAM1= <>
$$ [...]
##$SUBNAM7= <"">
##$SUBNAM8= <"">
##$SUBNAM9= <"">
##$SW= 20.6930455092707
##$SWIBOX= (0..15)
0 0 3 0 0 0 0 0 0 0 0 0 0 0 0 0 
##$SW_h= 5175.983436853
##$TD= 65536
##$TD0= 1
##$TE= 295.16
##$TE2= 300
##$TE3= 300
##$TEG= 300
##$TL= (0..7)
0 120 120 120 120 120 120 120 
##$TP= (0..7)
150 150 150 150 150 150 150 150 
##$TP07= 0
##$TPNAME0= <>
##$TPNAME1= <>
##$TPNAME2= <>
##$TPNAME3= <>
##$TPNAME4= <>
##$TPNAME5= <>
##$TPNAME6= <>
##$TPNAME7= <>
##$TPOAL= (0..7)
0.5 0.5 0.5 0.5 0.5 0.5 0.5 0.5 
##$TPOFFS= (0..7)
0 0 0 0 0 0 0 0 
##$TUNHIN= 0
##$TUNHOUT= 0
##$TUNXOUT= 0
##$USERA1= <user>
##$USERA2= <user>
##$USERA3= <user>
##$USERA4= <user>
##$USERA5= <user>
##$V9= 5
##$VALIST= <valist>
##$VCLIST= <CCCCCCCCCCCCCCC>
##$VD= 0
##$VDLIST= <DDDDDDDDDDDDDDD>
##$VPLIST= <PPPPPPPPPPPPPPP>
##$VTLIST= <TTTTTTTTTTTTTTT>
##$WBST= 1024
##$WBSW= 4
##$XGAIN= (0..3)
0 0 0 0 
##$XL= 0
##$YL= 0
##$YMAX_a= 498706
##$YMIN_a= -589257
##$ZGOPTNS= <>
##$ZL1= 120
##$ZL2= 120
##$ZL3= 120
##$ZL4= 120
##$ABSF1= 16.45488
##$ABSF2= -4.238293
##$ABSG= 5
##$ABSL= 3
##$ALPHA= 0
##$AQORDER= 0
##$ASSFAC= 0
##$ASSFACI= 0
##$ASSFACX= 0
##$ASSWID= 0
##$AUNMP= <proc_1d>
##$AZFE= 0.1
##$AZFW= 0.1
##$BCFW= 0
##$BC_mod= 0
##$BYTORDP= 0
##$COROFFS= 0
##$CY= 12.5
##$DATMOD= 1
##$DC= 0
##$DFILT= <>
##$DTYPP= 0
##$F1P= 14.0000005364418
##$F2P= -0.99999901652339
##$FCOR= 0.5
##$FTSIZE= 32768
##$FT_mod= 6
##$GAMMA= 0
##$GB= 0
##$INTBC= 1
##$INTSCL= 1
##$ISEN= 128
##$LB= 0.3
##$LEV0= 0
##$LPBIN= 0
##$MAXI= 10000
##$MC2= 0
##$MEAN= 0
##$ME_mod= 0
##$MI= 0
##$NCOEF= 0
##$NC_proc= -5
##$NLEV= 6
##$NOISF1= 0
##$NOISF2= 0
##$NSP= 0
##$NTH_PI= 0
##$NZP= 0
##$OFFSET= 16.45488
##$PC= 1
##$PHC0= 146.4895
##$PHC1= 7.290079
##$PH_mod= 1
##$PKNL= yes
##$PPARMOD= 0
##$PSCAL= 4
##$PSIGN= 0
##$REVERSE= no
##$SF= 250.130016786523
##$SI= 32768
##$SIGF1= 0
##$SIGF2= 0
##$SINO= 400
##$SIOLD= 32768
##$SREGLST= <1H.CDCl3>
##$SSB= 0
##$STSI= 32768
##$STSR= 0
##$SW_p= 5175.98343685301
##$SYMM= 0
##$S_DEV= 0
##$TDeff= 65536
##$TDoff= 0
##$TI= <Analysis number 999999
Compound Code 99
Book Reference 9
Project Code 9>
##$TILT= no
##$TM1= 0
##$TM2= 0
##$TOPLEV= 0
##$USERP1= <user>
##$USERP2= <user>
##$USERP3= <user>
##$USERP4= <user>
##$USERP5= <user>
##$WDW= 1
##$XDIM= 32768
##$YMAX_p= 469776524
##$YMIN_p= -425766
$$ End of Bruker specific parameters
$$ ---------------------------------
##NTUPLES= NMR SPECTRUM
##VAR_NAME=  FREQUENCY,     SPECTRUM/REAL,   SPECTRUM/IMAG
##SYMBOL=    X,             R,               I
##VAR_TYPE=  INDEPENDENT,   DEPENDENT,       DEPENDENT
##VAR_FORM=  AFFN,          ASDF,            ASDF
##VAR_DIM=   32768,         32768,           32768
##UNITS=     HZ,            ARBITRARY UNITS, ARBITRARY UNITS
##FACTOR=    0.157963299565203, 1,           1
##FIRST=     4115.85935077466, 0,            0
##LAST=      -1060.12408607835, 0,           0
##MIN=       -1060.12408607835, -425766,     0
##MAX=       4115.85935077466, 469776524,    0
$$ Real data points
##PAGE= N=1
##DATA TABLE= (X++(R..R)), XYDATA
$$ [...]
21090 11290 -29111 -125368 -156177 -66359 46161 88584 18598 13771 43677 147811 253567
21079 253567 243628 180171 109732 113164 165712 126949 106162 109899 38347 -11539 -27559 -47804
21067 -47804 -91817 -76153 -55431 -75118 20204 76103 61886 4651 -71338 -81948 -25891 -4800
21055 -4800 44827 13204 -2218 50568 77356 64492 148518 150150 128428 146570 138468 142854
21043 142854 78357 155665 175746 37375 55098 113697 135352 135722 25688 112673 119976 428
21031 428 -60512 33725 -1098 16459 58893 57085 -1591 -98693 -69119 -9689 38298 -46155
21019 -46155 -57782 -44306 -28951 46262 77010 -12368 21119 90850 109146 111719 45412 -66838
21007 -66838 -87598 -123297 -134085 -101752 -67533 48181 -8192 -140138 -314366 -264918 -177625
20996 -177625 -152279 -59276 49830 136190 71755 28705 62817 124117 93551 104124 107673
20985 107673 136720 148859 91005 53525 2958 13771 6699 -19661 -26581 1401 10424 22678
20973 22678 1901 89754 171752 142886 82314 -8364 -1593 64572 180835 86870 8289 12626
20961 12626 -13244 34473 97046 23745 70570 3080 -91226 -30072 -117922 -90967 -52732 11215
20949 11215 -7606 -80087 9188 27677 -45761 -81234 -10079 27967 1652 -35956 -18473 47778
20937 47778 49661 -109724 -171756 -118638 -103324 -39627 68777 -37473 -142068 -119783 -12520
20926 -12520 -8700 -57135 -85826 -133222 -167015 -136282 -90480 -63351 -11213 -81275 -37873 52184
20914 52184 109471 124062 245417 230746 -23996 -98906 -26508 -37464 -126396 -189792 -80438
20903 -80438 78053 98474 22489 -114578 -90231 -2636 -67806 -20808 16070 -26373 74444
20892 74444 83047 23230 50480 21226 -27918 -16244 31117 -98125 -177221 -144489 11939
20881 11939 15655 -72107 -116389 -88162 -10310 140905 170379 107683 68305 101488 99677 94111
20869 94111 91894 9684 -28308 -100539 -68033 -54797 21040 82080 43038 63763 74154 19116
20857 19116 321 -14169 143123 120309 138412 70337 -78937 -82569 -72101 -61694 -73337
20846 -73337 -49868 -74389 -19146 -6976 -14211 -40194 -73808 -160767 -103303 -28648 -8672 5136
20834 5136 17616 -41423 -103538 -39896 -73411 -44995 -17918 31931 44747 74323 68606 76219
20822 76219 112974 115735 40059 -83190 -183104 -107197 16483 -8926 -79112 -66317 -104453
20811 -104453 -70143 -47092 -99904 -87876 -18830 -104921 -204791 -180775 -12891 93541 76312
20800 76312 -19118 -52318 -95807 -58575 14215 -34350 10714 128911 66481 57682 57580 18727
20788 18727 31705 48427 41380 -21288 -121525 -112369 -170110 -45269 115060 113790 24594 29965
20776 29965 75609 126959 132639 129376 80194 -39520 -135170 -132387 -46650 75187 185544 137819
20764 137819 52983 67495 17911 -41972 -99219 -43215 49294 171156 203772 125222 -6759
20753 -6759 47191 53115 41829 28896 9383 8434 -20102 -97466 -196958 -229112 -225978 -168353 -39596
20740 -39596 -53496 -71839 -2967 10382 -26115 -74642 -13855 101094 126300 147202 143210 102772
20728 102772 141867 103024 35317 -5584 29271 14340 66018 116677 -13955 -90336 -110811
20717 -110811 -100272 33593 151007 86416 -18749 -18644 35993 105409 115622 13336 -73989
20706 -73989 111782 174584 101395 154708 169635 164119 42228 -16275 -2969 39508 127570
20695 127570 93342 12340 -5468 -52879 -79993 -35828 -81724 -99262 -145444 -153258 -64892 -27603
20683 -27603 -89893 -187316 -153607 -77829 -25877 -30041 25590 20650 -15170 -15894 104891 100990
20671 100990 24511 28760 20935 -12007 -132725 -146105 -66937 -103594 -108529 -46633 36677 117486
20659 117486 138707 144179 82124 56443 111103 79403 122403 41023 -21236 -20103 49581 35110
20647 35110 12057 47361 16280 -31064 -102430 -56139 -25305 -29569 -88515 -23019 -86221 -134513
20635 -134513 -3172 139490 158066 59602 -3397 57195 66681 -56212 -36822 22035 72790
20624 72790 19758 11489 45644 10603 81407 263246 119887 -18676 -84688 -99142 -87289
20613 -87289 -24667 -78195 -200101 -274072 -230737 -127669 -114512 -43372 7136 46431 106832
20602 106832 148416 113698 61551 101497 89963 78598 50713 -57288 -164257 -112338 -59911
20591 -59911 -61720 -61020 -199723 -184669 -33997 10442 20566 48219 34530 59407 85083 48064
20579 48064 45485 26594 -25096 -19484 14606 -73489 -70084 -40106 51166 82130 124783 245256
20567 245256 159825 18592 43637 86189 5467 -10073 -31974 -10397 125389 156997 120099
20556 120099 129861 128868 142809 160078 130287 147361 173335 293491 126797 6293 2241 84188
20544 84188 149372 66900 37515 67583 6542 -23144 59478 120495 132395 57146 36618 -1790
20532 -1790 16151 13913 64738 192284 143195 91435 68218 73806 104775 155311 119284 122196
20520 122196 17314 -69857 -96806 -114262 -89158 -50841 -5084 55736 108554 82293 39871
20509 39871 13156 6696 91021 165211 182230 149946 109183 107961 146738 59643 5828 -16131
20497 -16131 -4912 52491 59658 22795 52352 139695 226208 191253 108289 63436 54284 91857
20485 91857 43789 -4253 22592 83303 35011 72815 150019 186965 127525 -19868 -33458
20474 -33458 -21787 12795 -24174 42952 77558 107737 166903 88552 74828 305 -53353 -66627
20462 -66627 -114854 12429 4805 45907 48972 9547 -51708 -88732 15786 126713 133909 68524
20450 68524 46040 20136 -32586 -60850 5692 115693 83556 5026 -41654 34440 115041
20439 115041 115960 63972 -92907 -14568 -37032 -86445 -46153 57120 132472 130496 51539 26731
20427 26731 -118543 -39032 25674 35352 119047 137892 33807 161261 351005 301447 102834
20416 102834 57607 114531 122802 105093 58086 25104 123248 40559 9294 54108 -27366 26060
20404 26060 64361 33562 56913 45847 47362 54877 48865 41353 92701 113668 156709 181043
20392 181043 183422 65883 -52796 -98669 -58415 100607 62641 -19166 4588 -15056 55355
20381 55355 92780 118469 105793 210647 244973 123856 65617 -16785 12727 35360 -33937
20370 -33937 -85416 21960 30299 64974 180612 260963 217284 108419 -4820 -80495 -58924
20359 -58924 75216 147394 48212 126824 174022 175352 99234 96543 66148 155981 198610 124541
20347 124541 73526 24153 6682 27297 -30388 20478 74255 43068 -62938 -153072 -8143
20336 -8143 -12052 -80862 -51455 -7884 -74285 -156423 -28228 -39496 -40445 -149608 -119881 -107985
20324 -107985 -127636 -47236 35018 30668 -45386 -99082 -76727 -75536 -27175 -86665 -99404 -13567
20312 -13567 -58794 -111039 -101255 -132738 -127426 -115156 -45164 16746 24974 -46911 -108885 -96097
20300 -96097 -135969 -133645 -113848 -97266 -111843 7699 160183 174897 167487 157083 125899 173755
20288 173755 100073 199903 171537 78119 34663 -86819 -97975 118 61739 32928 -14787
20277 -14787 -46591 18510 -6874 -66916 -38346 -8687 6915 113279 225453 245535 121647
20266 121647 -102488 -68666 -113238 -99011 -17058 48713 1718 -47233 -30560 -54939 15909
20255 15909 45116 -130469 -60681 -49518 -30521 43554 100599 120632 20050 540 80734
20244 80734 -6062 19761 18314 21124 77235 144135 208040 150691 143394 67636 49732 61167
20232 61167 -6014 -41447 70769 124682 110955 113665 97187 156769 177756 159763 31406
20221 31406 -66089 -19892 26574 107359 -134 -58565 -91078 -101700 -93068 -110281 -46418 -85973
20209 -85973 -60163 -75943 -58615 -186124 -273407 -185417 -49331 95987 89644 -8969 -96959
20198 -96959 -16918 28660 -38431 -14566 23830 64866 54139 18144 1680 -19515 11161 93644
20186 93644 137411 189976 183537 59725 70371 75964 56071 -30395 -141498 -203647 -114299 -183131
20174 -183131 -213890 -116289 -109248 -35928 -26742 -118020 -77003 33755 53973 -1569 61131 157672
20162 157672 151129 83711 60211 103078 156953 117707 122419 171360 79019 39512 60 -42537
20150 -42537 2010 9878 40584 79715 29014 39386 8918 -28974 47925 11987 -45447 -43663
20138 -43663 -28581 -9560 33171 -147078 -219039 -125066 9556 105993 92439 851 44717
20127 44717 37905 -45650 -158718 -135634 -161134 -179742 -115353 -125766 -59269 -6567 5729 -40633
20115 -40633 -59977 -74606 -93178 -87183 -204609 -213339 -162449 -149101 -200065 -120970 -48130 17153
20103 17153 84100 52926 2775 -10502 67493 130190 98771 49063 23359 60410 139253 132517
20091 132517 79832 96834 24055 -124814 -183091 -211768 -41576 59609 39733 -91964 -254301
20080 -254301 -237194 -130812 -124493 -63061 32451 -18488 -64981 7603 120103 103036 126242
20069 126242 94668 -35008 14407 45501 -22563 -146949 -153343 -156643 -160351 -154766 -140782 -82788
20057 -82788 -14534 -19479 -96565 -179841 -51848 -26007 -41154 -105540 -55271 16756 30853 -56541
20045 -56541 -84792 -69379 -167043 -242741 -300972 -243708 14695 131111 107823 187629 151354
20034 151354 -22564 13618 -45239 -66316 -30929 -4290 -1017 -81102 24792 145743 182719
20023 182719 92171 -40093 28457 35364 15165 70653 237985 254619 132444 130385 177614
20012 177614 251959 239068 54804 18671 82871 151625 157489 50752 -21916 -87191 -147719
20001 -147719 -166449 -211369 -292611 -215534 -172918 -124509 -83155 -57391 -48359 -67181 20225 -24743
19989 -24743 4823 10001 70133 27082 70818 71562 97761 107824 7918 6319 62185 140796
19977 140796 133770 56269 25831 84114 167879 247970 203300 125284 21071 -6864 112953
19966 112953 235247 331588 288046 94159 -77700 -87868 33189 9516 8756 144596 167912
19955 167912 125984 119737 149749 222690 96133 -22374 1798 21485 -24570 14801 79085
19944 79085 116706 107754 196829 240952 135388 147159 160261 166070 107001 51225 47188 65274
19932 65274 151439 213093 215575 94191 75842 92953 129485 34575 -25971 -88392 -111902 -60402
19920 -60402 -75761 58703 195279 216371 87247 84968 18138 5487 20311 15831 -69736
19909 -69736 -60115 -86858 -182464 -128937 -11169 -79368 -76509 -19741 -56729 -83746 -17381 -17778
19897 -17778 -56027 -78677 -105227 -130313 -91533 -19293 76734 172271 108536 100581 179955 156529
19885 156529 129961 83583 21270 -139176 -84390 45525 152487 201388 113757 6693 50022
19874 50022 8731 29331 21157 102105 72958 89484 45942 112635 129759 151867 186780 82506
19862 82506 3644 17772 17682 16089 69807 53589 32364 -67774 -190453 -154583 -154656 -154821 -129626
19849 -129626 -629 85449 160222 194226 190881 160781 99350 26161 -8005 -86896 -67999
19838 -67999 -44309 -68051 -62470 66140 43468 51462 34106 119333 68027 -37164 52729 66234
19826 66234 28500 68370 49720 144338 81322 170030 136202 72479 51762 56759 -74294 -63824
19814 -63824 -15949 19980 127532 285024 269025 256133 156032 35908 -29161 29520 109717
19803 109717 138026 84369 -3775 31813 61841 53703 -15041 63895 228162 303500 268392
19792 268392 178902 105592 -1272 -40850 29701 69256 31164 51830 127779 136780 116871
19781 116871 68739 84829 11900 46647 40433 17900 -40635 -112319 -43180 40441 47308 42213
19769 42213 60161 53097 73642 196219 252724 181263 103240 91413 194928 154699 78558
19758 78558 165247 172670 1098 -23925 2726 -724 -6021 25338 -54455 12981 22605 -3735
19746 -3735 -25213 -131795 -145932 -96076 -70987 -5966 -15146 -46716 66755 241402 263811
19735 263811 141596 94744 149458 158258 146675 135153 201502 215513 310022 335187 366842
19724 366842 219810 105014 128152 91521 44659 52757 76926 80014 44960 26585 44030
19713 44030 15910 15109 -28981 -187339 -114692 -7591 62810 15126 21464 24661 -103672 -138793
19701 -138793 -98994 -45705 -57872 -8397 -51580 -1188 52195 91142 78219 33035 64241
19690 64241 91754 72545 153328 191956 188801 65679 -6899 128958 122701 -5775 -53183
19679 -53183 47736 4563 -73152 -26054 -26614 -30340 -21553 63716 29589 58457 170452 211558
19667 211558 109019 23557 96633 200101 203845 85436 77471 93663 164414 190830 264814
19656 264814 172674 28248 24998 63377 71792 68469 48167 29058 -18582 -66470 -23857 72220
19644 72220 154110 141034 130407 151401 81096 -12089 -34278 33497 97839 112128 80385 65587
19632 65587 89777 182186 179859 22108 -98248 -170979 -125789 -18962 -1955 16206 22444
19621 22444 46014 85150 100531 -35459 18141 83730 -23632 -64460 46170 86605 -1385
19610 -1385 37544 179711 220706 187243 129602 190194 241080 240258 301679 366336 200508 43259
19598 43259 -49034 -14668 -11314 71261 170511 213929 79552 19419 25278 -54956 -58886 129033
19586 129033 225045 210139 114961 140111 189756 250671 227284 162599 79204 73506 140359 197686
19574 197686 244240 342701 317507 271426 208126 175710 165386 137705 89140 149457 193551
19563 193551 139755 58760 105051 91193 2453 -10020 -47042 -47970 -66561 58801 18086 -51204
19551 -51204 26566 123167 98054 114393 45306 -87130 -88713 -37091 29653 47725 76597 78639
19539 78639 157761 196870 229071 150186 69026 70029 126364 81828 4187 75535 64616 25334
19527 25334 6233 -4287 76292 258774 321709 349085 366130 397960 419876 462966 497856
19516 497856 568433 621161 744326 763856 698976 693162 727591 765025 737515 810557 905489
19505 905489 947533 834639 782063 725780 706805 729850 763839 842715 925616 1084094 1059223
19494 1059223 1085837 965533 821426 760576 762350 766935 691378 619242 548687 548155 566906 559725
19482 559725 526284 529600 477991 431876 397918 552067 510790 438746 324647 243709 156177
19471 156177 258875 310381 306010 274927 267666 297581 368284 366073 379761 320068 243844 229154
19459 229154 335995 333288 267350 346757 348938 337265 312114 299687 238241 108792 100376 217678
19447 217678 303027 274528 265327 233009 214041 307224 249021 262274 290447 408435 316049
19436 316049 199870 244780 255680 146827 190236 221141 298107 414979 434127 341724 273925
19425 273925 172028 116174 137942 134609 151653 173659 175428 158490 234577 232937 264385 180661
19413 180661 168004 291316 328268 285535 312877 230543 202748 237636 289140 311626 319397
19402 319397 129433 -375 100005 295619 367823 286929 214350 173693 199831 158239 160562
19391 160562 184606 183186 245237 185876 236295 290141 242541 297770 435834 418113 411902 257007
19379 257007 250671 310718 199696 219177 337104 358079 423495 457666 544045 569307 497717
19368 497717 597861 666160 694343 710584 629241 569987 645465 696588 726011 772652 874001
19357 874001 885198 797810 858984 769888 770841 934815 1036527 1016060 861199 739299 681617
19346 681617 690953 750864 715266 650581 628088 693687 612820 561147 568905 700571 817683
19335 817683 755331 727624 660228 615131 539613 530068 577989 595412 561425 546765 500238 548987
19323 548987 496757 448629 436909 565749 604216 593594 549770 560366 584818 716975 848059
19312 848059 907325 955070 979494 930424 911051 883865 907135 998076 966379 942188 1069661
19301 1069661 1136669 1195055 1181852 1275590 1337050 1308421 1308693 1338550 1316070 1218664 1136991 1057406
19289 1057406 1063314 960229 892277 798397 803586 806104 741971 735771 628504 592527 579540 537527
19277 537527 530984 539973 518578 556713 604876 649294 645825 589025 584675 573973 575450 626374
19265 626374 567833 599700 631744 676958 598035 468910 424868 344564 430295 410853 373193
19254 373193 434493 428815 409766 474957 508806 435008 347854 399835 486201 400951 383209 427925
19242 427925 413531 309527 227280 217891 267666 431299 507068 596985 540767 500388 492654
19231 492654 471189 432446 447841 403978 375684 409225 437160 385011 349338 465183 594425
19220 594425 684539 635919 564152 575233 503952 388158 372879 368798 306615 348515 362066
19209 362066 472150 578134 574796 465818 447888 514929 538485 452346 437522 524985 493222
19198 493222 432529 397752 580021 549338 432344 376746 367042 406359 575372 637361 609953
19187 609953 595549 533819 440238 338979 282091 273388 305401 324402 385690 427191 367212
19176 367212 399892 414966 498683 589422 681093 742549 615366 581062 588614 558210 546523
19165 546523 507704 568700 594186 462942 426892 394180 493406 445809 347573 396320 446988
19154 446988 466706 343227 403193 504841 600775 569998 560078 552228 465373 345096 297665
19143 297665 298503 452075 523649 569447 589547 642472 575227 515106 584827 669371 675885 664430
19131 664430 662477 690884 722983 705119 645427 649072 593642 576163 683046 696882 664625 668684
19119 668684 628352 658706 755750 733363 695711 703454 768791 748500 844679 817892 736906 744061
19107 744061 793075 836937 858837 940056 961836 946964 932240 938787 751677 725360 692851
19096 692851 748066 762378 901112 1013851 962827 991339 983953 979500 1038647 1106517 1091100
19085 1091100 1136031 1166916 1174082 1117483 1048946 972285 1062305 1164169 1163182 1128420 1108244 1147615
19073 1147615 1389490 1530719 1459629 1252827 1151690 1248278 1316484 1273660 1289701 1340350
19063 1340350 1286482 1255838 1114994 1065064 1127616 1181807 1278973 1315396 1354167 1294698 1316727
19052 1316727 1342674 1347492 1363665 1432556 1472724 1470217 1458810 1478460 1442900 1383166 1463700 1486600
19040 1486600 1488713 1543276 1544929 1569785 1557046 1558669 1776654 1893034 1966986 2066315 2033000
19029 2033000 1929623 2135261 2351103 2504378 2529582 2555925 2654994 2835819 3053977 3222967
19019 3222967 3428982 3673257 3970879 4300107 4721147 5179688 5641898 6240306 6883891
19010 6883891 7465477 8097215 8761629 9557212 10571116 11752384 13186146 15110745 17509542
19001 17509542 20560012 24528569 29433550 35763640 43515720 52660397 62570108 72946934
18993 72946934 84250117 96733199 109095784 119301182 126448782 133250741 139071292
18986 139071292 141591036 142093292 141983688 143411615 144967885 144817434 145517093 148963534
18978 148963534 155397364 163426017 170501902 174375463 176628003 179142240 178909340 174421358
18970 174421358 166195190 156629144 147001514 134261378 119738153 107078657 96782062
18963 96782062 87859577 79872365 73102328 68055815 64491967 61776290 59541270 57644444
18955 57644444 55909184 54187190 52298255 50252346 48118562 45950823 43620567 41243115
18947 41243115 38935045 36688248 34686902 32739815 30872603 29208085 27824270 26590319
18939 26590319 25412315 24462204 23605223 22854193 22050589 21414391 20878013 20307798 19773868
18930 19773868 19164736 18750475 18409275 17956584 17580564 17255811 16883684 16483339 16062429
18921 16062429 15692900 15255871 14938579 14807374 14570322 14249498 13903263 13561618 13123639
18912 13123639 12806455 12581851 12218032 11882398 11559742 11214446 10901592 10560782 10249165
18903 10249165 9963825 9664447 9366617 9066855 8819304 8588076 8364446 8281854 8113465
18894 8113465 7924156 7621007 7414844 7306509 7218135 7059283 6924506 7051001 7070610 7058987
18884 7058987 7028482 6921960 6863333 6958362 7002400 7074681 7159651 7261125 7386394 7603293
18874 7603293 7910999 8166490 8273681 8530209 8835422 9335509 9961295 10751902 11833144
18865 11833144 13085409 14666788 16688098 19225692 22629508 26803603 32010380 38404299
18857 38404299 45868680 53419134 60417297 68014722 76526201 83394104 85355850 84219493
18849 84219493 84503591 85351190 82992388 77255404 72796935 71258291 71444212 72180736 73228726
18840 73228726 75497137 79630541 84528455 86924198 85447207 83420270 82450929 80025068
18832 80025068 73787905 65978062 59689718 54467836 49486266 44755722 40939588 38237320
18824 38237320 36329702 34936579 33836615 32967075 32274094 31573950 30909190 30254437 29545206
18815 29545206 28926231 28532974 28140141 27831403 27779758 28127071 29005283 30226518 31989615
18806 31989615 34422633 37806301 42432642 48277498 55279163 62785515 70022043 77472994
18798 77472994 86039663 94374108 98851493 98511330 97915874 98902397 98274059 93010232 86858016
18789 86858016 83976897 83603332 84169247 85186735 87092555 90806646 96228943 100528577
18781 100528577 100458896 97856278 96263553 94624425 89283805 80188972 71751734 65015475
18773 65015475 58848590 52736265 47443395 43467454 40563650 38457021 36874214 35591991
18765 35591991 34527504 33626511 32745132 31706380 30482545 29250637 27870930 26446386
18757 26446386 25032959 23758176 22573286 21486894 20408222 19228447 18299769 17483136
18749 17483136 16747788 16028010 15462772 14940496 14294979 13724489 13398110 13031975 12610814
18740 12610814 12266210 12054992 11896783 11551422 11211288 11045742 10935694 10750628 10432123
18731 10432123 10250885 10039953 9703657 9438597 9318326 9158483 8904493 8723759 8380532
18722 8380532 8162729 7976030 7852888 7609150 7370776 7271643 7176726 6916093 6627297 6420289
18712 6420289 6221227 5951552 5824366 5598073 5361282 5174207 5024516 4942961 4946357 4885915
18702 4885915 4648712 4469397 4393746 4373890 4249061 4109707 4001055 3829581 3621916 3500107
18692 3500107 3556809 3641729 3536506 3434306 3283615 3241508 3283774 3209646 3073888 2966123
18682 2966123 2875529 2907867 2972315 2955672 2748021 2701796 2701798 2672787 2610715 2476192 2364962
18671 2364962 2406569 2532247 2508191 2452178 2395388 2230840 2225077 2254669 2291437 2272940 2236173
18660 2236173 2218212 2069217 2050080 2104019 2056487 2071457 2059374 1880926 1806310 1696804 1666844
18649 1666844 1664927 1726315 1700244 1653907 1739646 1731396 1635741 1637816 1461899 1345635 1330770
18638 1330770 1319579 1283033 1300450 1306976 1278009 1240074 1223900 1211094 1251148 1284524 1154087
18627 1154087 1069756 981368 856083 817622 916869 926402 944495 951816 899224 980166 1072100
18616 1072100 1066659 1153241 1118215 974776 1022728 1151904 1291141 1380166 1440192 1440060 1345457
18605 1345457 1279240 1221526 1223095 1200311 1106061 1133166 1140137 1079753 1117646 1135904 1190441 1156304
18593 1156304 1152355 1273235 1297862 1096194 974158 962814 864023 822182 817413 783526 702044
18582 702044 647883 585393 564729 543619 433887 462273 538705 592672 604549 620600 615336
18571 615336 509627 326306 269612 343391 329854 414066 496809 403294 405930 353145 409165
18560 409165 356951 365203 454272 460880 503248 511717 521709 554285 632131 712717 768667 828458
18548 828458 872850 834016 778668 743239 751665 824400 766351 702547 715534 745626 654225 655965
18536 655965 681794 672904 643553 712023 708485 662029 614430 583178 697335 605486 570823 570212
18524 570212 534578 544022 589439 590210 526402 448696 452274 459959 421599 428549 426227 412459 380171
18511 380171 300795 343003 300269 216771 229270 224294 102854 147360 167311 176153 288703
18500 288703 343394 381067 381982 436180 437417 352470 362834 288638 186917 241915 337078 312189
18488 312189 249368 213151 230299 241340 297081 181531 136041 85286 -25049 20295 17271
18477 17271 110357 125388 116865 227679 265971 246945 248268 269999 321289 384624 362927 439509
18465 439509 545175 616863 618348 684672 740808 781541 906963 945493 882853 961069 993024
18454 993024 1012059 1063160 1026008 941158 962096 910210 905207 966376 1012228 1001822 918109 892784
18442 892784 877052 888936 879750 954386 840485 752776 649407 541293 444027 369689 381585
18431 381585 390525 371674 440309 386852 400363 397583 451569 456582 496795 543873 574281 594348
18419 594348 501486 492726 446201 319305 284814 248688 274922 339291 241119 270683 292928
18408 292928 285085 202611 228369 179817 154363 139653 193027 308164 216709 179571 146249
18397 146249 100550 91097 116998 129809 206281 240633 176948 155336 99726 22275 82460 156580
18385 156580 153766 96751 81032 167617 178438 56005 -21776 68622 121384 88343 123890
18374 123890 146560 160013 128698 151524 217407 251570 90441 60372 80840 43230 78137
18363 78137 150493 91938 24968 4569 -32314 46540 184917 215680 133812 81179 66266
18352 66266 189433 224223 201438 143457 130809 155584 184756 310157 409202 375759 368472
18341 368472 385170 440248 393532 414469 428537 478704 584420 610219 743781 902705 1079534
18330 1079534 1261705 1304999 1233738 1258189 1278029 1225763 1211323 1102108 1073663 1241046 1347831
18319 1347831 1344803 1160873 963600 919942 994954 1009454 965382 964327 989692 976689 767752
18308 767752 656045 566759 522116 446191 378492 309963 272622 383425 394602 369358 325035
18297 325035 351508 389610 287022 354724 358057 429451 406824 501485 560959 548203 541803 495082
18285 495082 571421 667554 620262 577726 606839 705612 783667 816700 887057 845507 978170
18274 978170 1145437 1224069 1202023 1221901 1146714 1081462 1109661 1236344 1341594 1365009 1389340
18263 1389340 1301009 1205439 1148732 1121681 1022654 820236 750097 788287 757534 698561 748477
18252 748477 693515 724187 772769 725118 676987 762380 737825 584790 388890 372687 336751
18241 336751 385000 481182 473947 487307 443818 407985 459075 555695 539369 359422 235871
18230 235871 228687 206775 169567 138286 79150 167510 191521 198672 213064 192486 231719 251332
18218 251332 305985 312717 272524 304304 379787 416213 408291 398549 329345 326293 316801 210170
18206 210170 182979 310676 385252 386274 357600 387870 437544 426549 326580 331108 258209 219680
18194 219680 319355 240645 261292 263827 239467 234241 268990 279557 243715 242002 225086 173946
18182 173946 163952 189906 201890 235536 295502 336928 260075 116261 213432 244577 226091
18171 226091 263061 298103 318379 299596 266867 315293 393641 339388 324587 299819 341616
18160 341616 409389 524893 459665 395949 429718 447136 332185 232250 296534 440080 478323
18149 478323 386476 386357 371635 327307 296503 266828 303831 347905 409017 502416 606682 609022
18137 609022 533298 595001 603757 665571 575965 515520 571195 701292 803154 879247 1021916
18126 1021916 1171526 1377526 1566917 1687811 1956678 2342845 2717874 3077068 3710493
18117 3710493 4592986 5503009 6561370 8164222 10535248 13741848 17692324 22485098
18109 22485098 28849966 37198160 48679729 64233515 83118122 97273036 87125019
18102 87125019 57052932 36216436 25410932 19571415 16247514 14156607 12956695 12456829
18094 12456829 12300946 12257971 12398590 12592540 13087341 13543170 13909122 14022596 13754583
18085 13754583 13236780 12548859 11609702 10562653 9654380 8849940 8178100 7500196 6951544
18076 6951544 6587660 6223085 5836598 5488743 5269658 5007585 4689865 4430685 4145027
18067 4145027 4011909 3969613 3835260 3577061 3563666 3605430 3603468 3677648 3695065 3508487 3395815
18056 3395815 3413410 3300885 3109806 3070940 2993891 2852620 2748374 2686899 2771773 2761196
18046 2761196 2715780 2645725 2647391 2695266 2741702 2632092 2488955 2377900 2361672 2294007 2230951
18035 2230951 2198889 2182605 2090896 1901872 1714459 1588113 1552451 1626930 1696151 1712862 1609317
18024 1609317 1535761 1430427 1379615 1307439 1132763 1098519 1091546 1048998 1106618 1091262 1011395
18013 1011395 967403 1007839 1036113 1059077 983582 988326 954747 995334 1061074 987827 909653
18002 909653 817596 819409 766914 772386 857768 935623 1031555 1103158 983300 818596 832032
17991 832032 810267 711166 567519 571068 593132 662011 662300 685483 672372 610764 671136 651745
17979 651745 562059 520469 530062 633584 603833 498052 504018 702987 700410 543498 418436
17968 418436 421946 493389 546245 519178 447311 437539 426980 459566 482889 507496 568268 569551
17956 569551 538752 547913 463276 448703 409124 408614 488342 572375 579461 634524 688880 719505
17944 719505 700253 702016 843218 908561 916131 908577 882411 820771 737074 664053 689223 591016
17932 591016 447713 412943 488095 625733 731592 732793 821625 865164 818315 874827 834660
17921 834660 720532 683825 665256 680634 696155 693245 586859 501659 535258 683196 700843
17910 700843 651025 656266 661190 596727 740549 793170 656417 683365 747973 787225 682364
17899 682364 669687 655571 839901 972000 863418 851959 898103 949313 1004400 1085237 1078156
17888 1078156 1061727 1119278 1069905 1218840 1168041 1105270 1086896 985110 933314 943942 1015912
17877 1015912 1066132 974572 1053792 1121974 1106307 1073013 1101097 1073726 1156732 1244754 1330244
17866 1330244 1381365 1388355 1383740 1397266 1472864 1468787 1435367 1394483 1455784 1597859 1668005 1655583
17854 1655583 1674311 1656022 1610768 1755363 1864035 2042966 2162958 2237556 2311234 2493067
17844 2493067 2786548 3033325 3279283 3528085 3791140 4037899 4329261 4722171 5116161
17835 5116161 5540129 5947440 6539530 7164347 7870421 8640256 9602974 10870720 12585423
17826 12585423 14730190 17320213 20730692 25263001 30962096 38036489 46481270 56166578
17818 56166578 66769802 78251275 90474045 102963261 114673820 124255704 131359326
17811 131359326 136272366 138714143 137954875 133838596 127275547 119147605 109607701 98989048
17803 98989048 88115250 78120512 69735945 62742065 56677914 51781500 48002297 45506189
17795 45506189 43951909 42817085 41852843 40928797 39985468 39003140 37873258 36602729 35108371
17786 35108371 33616255 32153238 30739535 29331652 27948640 26666996 25523950 24573825
17778 24573825 23795554 23285026 22789643 22545880 22503289 22819470 23662562 24946422 26575764
17769 26575764 28867251 32050457 36243665 41518112 48128116 56010705 64939764 74823762
17761 74823762 85522457 96631812 107480559 116957741 124161189 129258858 132237501 132717470
17753 132717470 130173873 124825767 117693742 109514346 100364637 90366788 80706441 72100281
17745 72100281 64897871 58823377 53714065 49628370 46690220 44561292 43034768 41899504
17737 41899504 40801501 39637293 38406744 37106230 35812661 34267745 32605046 30942594
17729 30942594 29228236 27557033 25878947 24255594 22828738 21692118 20445463 19238550
17721 19238550 18167196 17220927 16385666 15747881 15064899 14447255 14050494 13543383 13103702
17712 13103702 12675726 12186254 11784460 11524028 11156347 10918852 10741211 10555396 10328002
17703 10328002 10105592 9960689 9770217 9506900 9336409 9354279 9227663 8880128 8640193
17694 8640193 8577620 8439161 8238449 8107537 7844521 7577274 7432141 7237600 6989264 6705856
17684 6705856 6515026 6349473 6189391 6120463 5934794 5623113 5409633 5205559 5087736 4990921
17674 4990921 4775805 4629651 4434685 4307089 4242537 4016155 3757008 3622426 3524749 3573147
17664 3573147 3533938 3335298 3197310 3162473 3160627 3120030 3126674 3102406 3026989 2883156 2781739
17653 2781739 2737941 2720050 2700013 2628853 2510192 2413036 2376525 2302942 2267373 2334823 2277952
17642 2277952 2244166 2260735 2235453 2278473 2199070 2168049 2176521 2144722 2011842 1987619 1987481 2040797
17630 2040797 2001348 1932563 1946466 1975563 1877621 1832818 1801855 1882726 1841993 1726412 1645609
17619 1645609 1578879 1510745 1506612 1507730 1453595 1430838 1400671 1192911 1166497 1209177 1056308
17608 1056308 924874 904513 956213 918196 960786 952509 851581 894981 909409 824619 876529
17597 876529 904951 885333 917284 1009036 1038333 1051729 945778 839224 786714 730538 742346
17586 742346 849409 855390 807906 787139 771562 691204 608594 611692 636815 664429 647206 512332
17574 512332 421104 426324 426033 580388 660775 653926 623140 599746 556688 607962 685555 694370
17562 694370 655270 661854 617666 563017 562784 555736 555425 493485 352671 326035 324235 318374 305540
17549 305540 395284 464351 434857 385269 288387 256136 337737 376464 441146 421534 261502
17538 261502 161752 68900 85374 157385 77438 16055 47193 39242 49720 105257 247953
17527 247953 290389 210919 150402 140808 123724 88486 105229 269698 421109 379878 446852
17516 446852 513504 429043 455249 618245 697293 744684 852424 986201 1114000 1058316 1069266
17505 1069266 1055701 1101745 969659 832960 740314 627379 559304 543677 519020 459412 420430
17494 420430 444083 501532 458928 368492 353815 333502 155038 54149 11753 97366 155918
17483 155918 81871 196591 258955 204454 207760 161827 144595 67962 84383 111267 43367
17472 43367 -5614 89525 181275 156621 169700 302024 298286 305591 345603 270464 195821 124002
17460 124002 182422 349623 388684 469400 454972 559515 632364 742543 860175 951346 881368
17449 881368 830526 790642 776541 778233 768918 781838 810698 824989 730229 690889 796156 885877
17437 885877 854975 704915 443982 283274 235521 292272 305766 319558 381840 352476 207267
17426 207267 222241 201103 163358 112676 171698 156867 57584 61274 47309 -16431 84982
17415 84982 113061 103384 213492 359843 312410 256331 219038 187519 252753 272214 228214
17404 228214 251603 326966 280347 142901 26312 -4416 -36917 -24512 -44291 -76507 -153982
17393 -153982 -69699 -62560 -21157 -38215 27855 12260 -107921 -204705 -98082 -59440 -11270
17382 -11270 90738 52992 3057 -132964 -188881 -77779 -38706 13684 -25856 32890 73593
17371 73593 1423 -46947 87573 89624 24393 -35305 80154 135770 -11862 -133280 -106325
17360 -106325 -39666 -16600 -37196 -28374 25596 -58199 -155421 -55708 -148006 -193263 -178615 -107982
17348 -107982 -98958 -199024 -235373 -253415 -172666 -79267 -15962 24431 -19493 -67028 -36924
17337 -36924 -7410 38586 -1519 31636 135872 156124 129594 75620 158430 108679 110397 53337
17325 53337 -31575 -10675 118900 184937 152345 51664 63979 79960 62276 109493 248443
17314 248443 242213 201147 231585 233095 198301 208528 273547 208874 209184 181022 217119 205033
17302 205033 160638 222703 184863 303721 366026 447887 495598 525317 506172 595883 680646
17291 680646 635021 627179 783636 743790 657609 621230 563547 408691 387594 351892 323904
17280 323904 234423 293545 249674 232926 154989 55780 115955 101431 124688 203667 167297
17269 167297 130539 45193 176353 186755 113014 13289 99356 172726 145851 125845 94052
17258 94052 78236 65978 153871 136672 97401 60804 79535 141751 156061 49492 38530
17247 38530 151709 138465 176290 261735 370531 449050 499500 527792 555027 646575 681063
17236 681063 783541 866447 785189 668483 572578 574442 544175 472918 413339 369478 269034
17225 269034 297429 390953 345849 218453 208832 344636 293161 245905 154144 4646 249
17214 249 106530 189763 111391 37828 127336 151342 73374 36107 23694 48839 36994 89681
17202 89681 171505 189476 196608 64829 -71007 15979 90294 66619 -15408 -42441 -31430
17191 -31430 -7909 23889 154943 148872 43463 -52677 -147816 -96960 -102910 -96200 -25540 -41399
17179 -41399 -102312 -129484 -82446 8673 37369 -5508 12126 -43149 -72787 3504 -80365 -164046
17167 -164046 -211775 -134800 -28248 3747 65485 107807 115525 84823 47046 -2299 91250
17156 91250 74919 31185 94047 118085 -32259 -75750 -50461 -93641 -171167 -218359 -268711
17145 -268711 -202422 -130916 -186644 -248852 -136603 -57499 -53798 -22041 -56863 -82494 -113086
17134 -113086 -37367 -12713 -50535 -203893 -162868 -14200 16052 -36973 29386 -61128 -50061
17123 -50061 -149450 -101600 -2250 36908 -50308 -31468 15062 93838 55536 75676 73935 -20483
17111 -20483 -41600 -29836 -64644 -31236 109721 190274 86585 -65726 -88508 -73966 -98842
17100 -98842 -111652 -186292 -157538 -61368 -35944 545 22135 73542 86654 -7310 -16620 -123334
17088 -123334 -93565 -7237 -106323 -157150 -62432 21300 17795 2954 139022 66578 -2279
17077 -2279 14837 65327 -66437 -111268 -80697 -110618 -97236 4597 -55272 -95503 -29990
17066 -29990 -25531 18111 6438 -40505 -135600 -216883 -190390 -149640 -139142 -95452 -53978 -104122
17054 -104122 -117918 -156128 -167235 -124234 -53101 4149 30704 56485 -23591 -10316 -7837 -41647
17042 -41647 -78276 -184094 -128594 -39145 74842 152370 115987 21155 -44130 35832 14226
17031 14226 -196529 -249526 -194429 -205142 -173402 -123907 -96734 -135537 -75114 -104996 -178240
17020 -178240 -107048 -135222 -136908 -23098 23569 4770 18975 101922 51038 -12638 -49137
17009 -49137 -96475 -127231 -147953 -312740 -323208 -266100 -237749 -232633 -155318 -173976 -180991 -181936
16997 -181936 -327885 -213941 -122608 -138513 -93532 -174399 -165175 -148374 -60090 -75114 -62904
16986 -62904 -82589 -110360 1538 30722 66074 -52814 -70255 -82910 -74623 -137433 -193491
16975 -193491 -273180 -218363 -133401 -42385 5912 5957 -20174 -134037 -157625 -160605 -148197 -112789
16963 -112789 -159102 -242035 -143106 -125184 -101484 -144213 -180797 -223035 -276158 -317988 -194533
16952 -194533 -181085 -136139 -99130 -14200 -15325 -56617 -124225 -190739 -210040 -223192 -156704 -126155
16940 -126155 -45567 4899 90786 124637 -27694 -107691 -102785 -208105 -172155 -148583 -154252
16929 -154252 -158373 -144710 -172542 -157541 -257365 -283325 -186288 -130710 -138197 -156132 -89175 -100036
16917 -100036 -184043 -203418 -192635 -143538 -151512 -244217 -180373 25 -55989 -144301 -256869
16906 -256869 -230349 -172643 -191162 -148850 -110636 -146655 -203734 -213784 -243374 -279031 -283814 -172641
16894 -172641 -45918 25626 38793 48420 77580 -29632 -63917 -30511 -47799 -102649 -177352
16883 -177352 -226199 -101269 -84386 -94489 -48616 1775 -75270 -30599 98318 131074 -19124
16872 -19124 -49577 22328 80997 78795 -8046 -165588 -108830 1079 19473 21736 -163344
16861 -163344 -276670 -253655 -271344 -260217 -169569 -117645 18268 -79766 -151916 -81063 -42312
16850 -42312 -15369 7133 -1200 12748 -26302 37855 82159 41077 -11401 -2612 48977 52690
16838 52690 -3523 -43421 -169123 -232064 -222528 -252836 -212364 -128292 -158492 -183639 -178121 -162313
16826 -162313 -83414 -3657 -22125 36 -16690 -89781 -242808 -147131 -11317 -6080 -1443
16815 -1443 -164932 -205765 -188376 -120053 -63671 -49628 -23872 -32467 -83727 -188526 -133107 -112131
16803 -112131 -2872 2504 28651 54708 -58705 -93763 -50244 -13938 -18778 -22342 -17868 -10485
16791 -10485 5889 64528 45675 109216 87858 96634 115446 119278 17068 -13783 66283 3556
16779 3556 -47268 -74250 -144318 -135311 -94370 -34134 5372 -30604 -110322 -169657 -224910 -195353
16767 -195353 -129900 -69759 -106268 -144024 -158434 -100705 43666 -14300 19159 94927 21280
16756 21280 -91852 -142814 -121288 -54031 -141556 -289433 -276758 -147963 -21947 -30250 -34266
16745 -34266 4986 159 -80840 -122295 -98253 -164461 -223809 -244162 -176582 -154080 -199255 -246545
16733 -246545 -230645 -234628 -221059 -146123 -60036 -32425 -41538 -142982 -175209 -58226 -97865
16722 -97865 -259546 -357373 -305933 -301006 -185719 -131139 -122122 -128142 -73037 -155255 -104104 -39916
16710 -39916 -92523 -182806 -217542 -171604 -136763 60643 79524 -20054 -75348 -75721 48321 3442
16698 3442 -9035 -12386 119270 123290 69070 20355 31598 46040 129656 78578 59122 8033
16686 8033 -31914 -115909 -253268 -215634 -140044 -7005 66484 70370 58088 27303 -69817 -116802
16674 -116802 -214193 -156940 15272 -9166 -42004 -38206 -52132 -98527 -102718 -117657 -93831 -81402
16662 -81402 -61270 -26625 -14057 -16225 -30234 33952 41035 31222 -22024 -52734 -106422 -98310
16650 -98310 -17068 -38667 -11550 -65219 -74684 -73897 -38698 81095 177335 220553 124985 724
16638 724 -136108 -32726 35772 -170156 -308033 -227689 -78664 33633 -52524 -38891 -4655
16627 -4655 -29742 -59469 -129806 -78732 -4269 -96431 -99084 -5843 32730 -20686 -143833 -248839
16615 -248839 -135258 -30490 81645 127077 148282 208381 179531 140536 157394 -22440 -129167
16604 -129167 -50902 19976 157495 202313 170770 131251 125289 150174 168016 190897 166588
16593 166588 152241 29025 -117487 -119554 -94390 -39629 -52711 -68835 -35701 7892 -41408
16582 -41408 -10210 31085 45541 3521 -41709 49391 144185 35683 44203 23945 -25122 -47268
16570 -47268 -77655 -76616 70129 154809 7468 -1304 -58313 -180558 -154146 -86191 -91369 -75795
16558 -75795 -118529 -145162 -60948 11669 41379 -14776 24453 -69484 -162392 -127409 -35016 -69500
16546 -69500 -262957 -252883 -141349 -115778 -850 52196 91994 42437 -67251 -112745 -118205
16535 -118205 -118525 -80171 -113265 -134150 -121656 8161 94066 63872 -7847 -136585 -195103
16524 -195103 -177538 -130628 -76695 -34640 -12004 -43066 -12348 -51739 -122718 -19816 84377
16513 84377 67712 42392 64125 -550 -52736 -18460 -21431 2971 -4180 72514 203028 136053
16501 136053 55130 37994 85450 153946 41704 -83947 -132061 -176797 -100246 -47580 -26391
16490 -26391 -29721 -9308 -20595 -64745 -78075 -79974 -23746 102150 147449 147193 148006 71182 -78903
16477 -78903 -148143 -151057 -193378 -262030 -280457 -355219 -425766 -310600 -59664 -23403 -23369 -27589
16465 -27589 -39862 -43207 -28901 -88407 -27651 -58472 -47385 21514 -13550 -121285 -147346 -144020
16453 -144020 -160392 -136162 -53011 143758 119547 81433 74470 12959 71857 141611 7796
16442 7796 -47551 -78244 -110668 -76600 4898 126024 189045 15881 -98355 -89545 -120442
16431 -120442 -49252 -17487 -89308 -163365 -103105 -54600 8568 -43262 -181340 -211713 -185333
16420 -185333 9025 35754 -21160 -87517 -50365 -18865 -56314 -101862 -108461 -86065 -108219
16409 -108219 -138237 -138964 -64510 6925 54517 -2475 24995 4470 19157 7229 12879 -107181
16397 -107181 -254967 -332896 -288923 -113618 -21156 126133 69140 -180852 -320943 -261831
16387 -261831 -150044 -114244 -170320 -138773 -144955 -76430 -40079 -46028 -25751 35356 188818
16376 188818 165318 113226 52581 24247 2620 -69916 -140709 -113044 14175 90968 105652
16365 105652 48238 59384 84162 -17590 -52194 31761 83978 77163 809 -69193 -126729
16354 -126729 -198199 -184730 -162943 -97125 -104405 -54391 -106669 -188053 -192861 -110061 -58115 33756
16342 33756 71823 67282 110384 -25669 -92365 -41325 4795 -119155 -204523 -180641 -212963
16331 -212963 -79836 13193 104040 46145 -108450 -97777 -75650 -99084 -93461 -96364 -84678
16320 -84678 -25508 32536 104196 161898 123341 3624 -42494 -26093 -44708 -92427 -86485 -90925
16308 -90925 -156556 -170211 -64582 -44329 -158751 -160134 -141964 -64991 -154553 -132651 -44902
16297 -44902 -110393 -70571 63786 -12422 42330 40719 -22333 12924 -48217 -129017 -254253
16286 -254253 -341994 -343598 -359292 -264673 -141569 -94742 -26071 30444 -84841 -100503 -149392
16275 -149392 -198767 -212368 -133857 -117284 -128522 -94179 -8490 -33347 7049 -49276 -73016
16264 -73016 -33720 -22705 73801 73272 103194 142267 88131 55961 34522 67462 -18913 -17118
16252 -17118 19293 28612 -147549 -166435 -138396 -206720 -148208 -94457 -65759 -50298 51239
16241 51239 165169 224870 188918 47986 -116050 -66953 40194 114303 137836 145130 96490
16230 96490 76313 -21275 -59832 -19014 -109388 -114587 -22272 74883 69425 5745 -16084 -44548
16218 -44548 -16292 24436 -96830 -168188 -117598 -3617 69724 103969 115060 12452 -35406
16207 -35406 -59817 -73203 -56096 -10312 -100786 -133237 -147333 -222832 -210775 -167103 -196153 -268986
16195 -268986 -138866 -128050 -224972 -163029 -117704 -126553 -97833 545 96955 83962 38923
16184 38923 -5568 27420 55627 -18920 -70208 -32967 7924 11267 25840 121204 84769 43560
16172 43560 18574 25739 -87274 -211942 -231562 -164165 -88576 -36929 32557 51054 -21591
16161 -21591 23000 71893 10381 -50295 67631 136615 156515 1239 -142248 -200370 -142864
16150 -142864 -39339 -56310 -37568 -60754 -5761 55100 108279 -3297 -36916 -352 46325
16139 46325 57771 32878 18477 -58092 -42824 -41404 -25379 -84085 -150238 -116822 -79904 -3096
16127 -3096 -11859 -20266 -24390 -84111 -127399 -13943 47160 -66597 -201694 -330322 -328140 -207768
16115 -207768 -59124 -30741 40234 29198 -125808 -238910 -226590 -146352 -6364 3196 41952
16104 41952 13029 -60161 -11296 11062 -27865 54017 56787 32079 -22029 -50776 46736 115628
16092 115628 -43210 -109020 10363 127153 84916 173228 191605 227008 203879 146413 124646
16081 124646 160722 146881 67857 4619 -110441 -171544 -37637 -71708 -6255 16438 23674
16070 23674 -28886 -119982 -39233 -73275 -148442 -235295 -173654 -10505 85087 198490 99859
16059 99859 -102429 -146574 -172018 -120873 -158511 -186321 -228541 -228871 -79140 -1133 31058 -22438
16047 -22438 2619 66961 -62347 -147239 -144997 -11079 -40204 -119579 -112139 -3830 57654
16036 57654 31594 -71326 -89232 15171 -59653 -133501 -63998 -84518 -178351 -187171 -247231
16025 -247231 -236211 -113364 110432 119548 12216 -197975 -239725 -230194 -187668 -150872 -86637
16014 -86637 -78284 -41699 -49263 -88185 -124428 -194287 -135703 -97605 -201973 -219935 -146415 -117808
16002 -117808 -187261 -97473 -29734 6592 -114573 -208239 -135762 -153101 -139884 -146523 -122437
15991 -122437 -49877 -31045 -53140 -39340 7321 -19713 7682 55977 50819 -43505 -27988 -30915
15979 -30915 -68188 -104877 -157248 -204534 -176987 -109215 -121750 -4307 -6527 -3265 -69119 -62794
15967 -62794 21073 16571 -19024 52074 72788 144767 201916 33239 -62311 23603 23809 24529
15955 24529 91211 157575 -2104 -80534 -152582 -183223 -200427 -208408 -155264 -226475 -308718 -299413
15943 -299413 -218997 -100902 -55769 -41946 -82505 -123312 -148770 -151645 -76054 8925 -6770
15932 -6770 39438 27431 -45843 -128297 -86644 -23874 75270 63078 -96166 -209646 -265064
15921 -265064 -321605 -284033 -211064 -222819 -248086 -268809 -121558 -35630 192 23087 36416
15910 36416 -25933 -98352 -65251 -101341 -160707 -225891 -206782 -17190 120712 201418 195255
15899 195255 116956 104103 -502 -127734 -77780 -53176 -23118 66524 111933 2135 -8181
15888 -8181 -47522 -101261 -50114 -84970 -94432 -31547 13994 76214 -60407 -92945 -75470 -6682
15876 -6682 71819 235872 242186 155578 107449 104113 71016 27314 86330 134694 37626 10525
15864 10525 4197 41866 41675 87635 112213 62160 143014 149461 24634 -36815 18715 62902
15852 62902 99083 40389 -57594 -95140 -82509 -131276 -203944 -164358 -90564 -107304 -147728 -115063
15840 -115063 -85549 -46045 -42079 -87578 -81062 -28297 -50262 -114832 -221626 -199752 -159587 -179163
15828 -179163 -66872 -19968 16468 -17994 -170391 -163309 -67859 24675 71216 767 -26916
15817 -26916 -40825 -13566 37037 157317 202205 147945 100462 27411 -34623 -20183 -40772
15806 -40772 14898 -49907 -132262 -141004 -93243 -15837 122430 31518 -5616 -2740 17031 3513
15794 3513 -100015 -110989 -163298 -139833 -54835 -114118 -55137 142643 139295 35282 25534 -39688
15782 -39688 -9749 71832 26683 20848 -96455 -94883 -103843 -41604 12085 28331 -82582 -158526
15770 -158526 -159826 -154229 -129087 -85548 -55954 -139429 -202998 -156347 -199794 -214876 -109933 -85172
15758 -85172 -106868 -144299 -181697 -80313 70886 88828 36544 50105 -2422 -74436 -111670
15747 -111670 -81785 -87039 -91121 2188 104010 39331 96370 90283 87036 49080 3782 -21630
15735 -21630 35250 -31197 -137878 -86289 18627 74867 41589 23068 -68520 -25737 44854
15724 44854 -4398 -87495 -149286 -161996 -176954 -109727 13528 -42955 -63473 -176863 -159391
15713 -159391 -132565 -168052 -202052 -178473 -103610 6044 33217 3049 -58668 -51622 538
15702 538 5449 5745 48533 29965 12924 23908 11526 102323 31100 -63260 37925 98513
15690 98513 33128 28143 64518 41485 -66277 -76578 -91972 -118535 -148060 -150373 -81279 -67846
15678 -67846 -230325 -224621 -154706 -115485 -60467 39031 17781 125891 42325 -19122 -34032
15667 -34032 13300 -39705 -129592 -66406 76163 59606 44643 10448 10669 -54106 -69180 -103839
15655 -103839 -207293 -279769 -274502 -239101 -135355 -44813 -67048 -109880 -234817 -183245 -79924
15644 -79924 -43575 -14406 -99108 -135860 -120868 -189044 -149107 -32238 -74206 -96661 -170865
15633 -170865 -192818 -46468 90610 69007 16220 -26825 115407 162520 75183 76842 117091
15622 117091 149368 132991 91840 43378 -43469 -91353 -93656 -84236 -83241 -113148 -210616 -186894
15610 -186894 -148183 -76621 -135277 -91057 9060 79775 115576 97436 -44255 -152129 -142681
15599 -142681 -86483 -767 -27902 -71795 -103683 -132789 -146785 -36367 -55821 -138019 -214213
15588 -214213 -212148 -209402 -272751 -311350 -265060 -125793 -162354 -136992 -124861 -103168 -60547 36248
15576 36248 76083 77986 21027 4831 37505 37920 42581 29628 -43150 -161706 -141191 -204350
15564 -204350 -229913 -109743 -17522 -65437 -130579 -121434 -66667 -86980 -171686 -308746 -298278
15553 -298278 -228411 -208757 -203155 -123554 -113097 -29174 16616 -1634 48761 112859 148317 118125
15541 118125 -32127 -139400 -32410 90945 116752 214819 257598 38591 -134057 -147506
15531 -147506 -72934 -8429 -11934 19180 83807 28661 35338 142842 144056 40407 48074 17435
15519 17435 58086 58776 31679 61086 42903 86474 -3116 48564 80697 124740 53789 22199
15507 22199 -33162 -98086 -144069 -190580 -173619 16174 190049 80159 -7041 26653 -49908
15496 -49908 -180512 -129566 -51810 -33717 25237 24268 122195 139141 48301 43140 66541 78833
15484 78833 98396 97236 28292 82431 16654 14328 -29559 -47043 -26626 9514 79369 34437
15472 34437 60471 190914 205782 105429 41929 -17588 -4281 -46860 -22925 -76486 -39467
15461 -39467 -58487 -118979 -163778 -196302 -22754 120613 126241 148917 141358 -2185 -67724
15450 -67724 -53598 -68052 -83073 -74497 -68264 52143 27048 36955 111655 170108 172863 68511
15438 68511 -71233 -206860 -227370 -147053 -134288 -66482 -26765 -93432 -136228 -188263 -40411
15427 -40411 65427 112077 24462 -167292 -173977 -38020 119096 115512 77146 98904 119613
15416 119613 64846 40902 -64247 -108331 -48009 -155373 -95890 72651 162978 124255 95354
15405 95354 67988 -50790 -203455 -241231 -241237 -159383 40911 17088 -46460 59532 136514 110553
15393 110553 42296 19560 8229 11022 -24362 -37975 72200 67542 -13286 -92070 -92886 -60530
15381 -60530 -72986 -85360 32423 32542 79023 123031 68915 138297 127733 -2675 -52248 -21681
15369 -21681 37369 -16523 -97345 -74938 -111889 -104379 -77068 -6591 -21527 -63444 -114146 -85930
15357 -85930 2495 85168 145212 178265 103429 -20379 -141522 -188439 -190925 -146829 -133584
15346 -133584 -69325 -1078 -3408 -22996 29064 88853 92336 141882 93238 117553 154497 122941
15334 122941 42530 39377 106723 76286 -19599 2963 63802 19231 -98292 -235294 -244747
15323 -244747 -224570 -128085 -20952 68602 153709 102386 32433 -61748 -132731 -114970 -180187
15312 -180187 -29291 73845 49014 21794 -5589 -54431 -3567 20865 -24581 -91972 -140027
15301 -140027 -195715 -327136 -385000 -301330 -206020 -119528 -159166 -124255 -32679 8384 44202
15290 44202 157907 154853 62774 15535 109874 97119 31799 137040 184664 176524 122800 24853
15278 24853 -16223 -124049 29916 190431 146739 78101 87155 7778 -1275 -32467 106561
15267 106561 102041 28260 21857 58205 66169 92624 37233 -58035 34675 39455 67770 91131
15255 91131 -788 -88098 -199528 -188713 -81262 86725 52640 151969 76139 -50390 -33347
15244 -33347 29425 48845 67308 -10221 -146515 -178245 -87443 -43077 101157 242063 187576
15233 187576 183441 73932 -52025 14768 85910 -19220 11199 44758 82393 100247 62649
15222 62649 40338 61981 -31875 -60666 -30771 -11195 16931 168451 124068 41377 -76413
15211 -76413 -126410 -129163 -27477 -5599 75823 79112 7971 69261 88161 57438 -22574 -62101
15199 -62101 -76854 -6006 -30226 -46412 27431 88612 -18322 -106164 -64067 1338 220 23634
15187 23634 24328 -31194 -46600 -138904 -149370 -108762 -85044 -89726 -96209 -91948 -76726 -125195 -99767
15174 -99767 -140454 -76152 -109609 -213068 -18582 -86632 -230141 -175311 31966 95910 54231
15163 54231 43555 66495 50470 -50062 -121122 -130609 -87882 -9306 116239 90790 36134
15152 36134 57193 136863 141166 131918 124134 120926 -32676 -99228 -75660 -68343 -32880 29950
15140 29950 -72141 -92402 -11256 97348 103453 84385 110474 39857 -116335 -96600 40529
15129 40529 -39998 -137280 -194054 -134523 -134670 -108854 -116286 -152407 -204182 -187495 -37341 -89366
15117 -89366 -144143 -132618 37668 200559 252302 235540 214016 116116 70485 129794 112427
15106 112427 -39 -117583 -104516 -87454 -46543 -2344 42992 46457 -10016 44867 116609
15095 116609 81998 146252 98832 22183 75686 87533 61101 35220 81544 -819 -70564
15084 -70564 -72421 10572 -64746 -164967 -127496 -84163 -63357 -27370 -28213 -20999 -40552 -21981
15072 -21981 -23508 -149591 -143009 66226 197172 143450 349 13833 -77551 -90009 -122828
15061 -122828 -148421 -51626 -18123 36529 86538 52164 -114880 -90355 -44804 -36185 -97609
15050 -97609 -123079 -103445 -82027 -33763 -51196 -31150 -62090 -119124 -135436 -49353 16990 -38782
15038 -38782 -17037 -16222 -144130 -66057 39501 63719 -120761 -187443 -103765 16456 85843
15027 85843 71911 -8038 -81957 -120208 -51484 2477 -97199 -99954 42815 25485 -27996 -21782
15015 -21782 42032 21491 -61873 -100005 -91187 -27444 -21575 -54075 -28648 65435 155317 196682
15003 196682 177564 108755 96147 -12435 -55982 42887 111283 77423 13849 -45423 -20709
14992 -20709 -4764 51625 -54305 -25432 28024 22179 9344 81964 88747 129201 167742 193624
14980 193624 200738 263276 171062 182297 192291 14247 -79228 -58228 10670 -1935 72446 58613
14968 58613 -73829 -120579 -83346 -31543 102916 145002 125346 101221 54023 133155 87307
14957 87307 78136 46804 59785 27216 -7316 51338 79928 -2628 -60791 -11603 -24808 -139733
14945 -139733 -209973 -258928 -169124 50624 161188 129594 140467 40163 -77624 -48174 38400
14934 38400 80968 91121 101464 46090 40859 45050 38631 40449 38991 4005 -68692 -68893 -65971
14921 -65971 -28703 24704 1602 -42864 -54247 -81280 -109048 -46994 43215 130526 127785 117798
14909 117798 71216 36636 -67020 -161936 -139773 -60590 -146856 -177949 -166340 -80900 1582
14898 1582 -55347 -2702 17377 147041 231048 212501 183799 41498 10431 -53321 -129401
14887 -129401 -181744 -49708 104381 193724 186908 59680 -59443 -34981 -118925 -146770 -68255
14876 -68255 -12647 -79551 -31384 8399 27274 -82154 -62401 -29533 27358 87501 161162
14865 161162 9057 14738 102797 39066 -24015 2456 -2995 -132159 -113601 -3095 12001
14854 12001 5143 30446 96761 133926 121689 34464 -4113 -36856 -41098 -11391 49865 54652
14842 54652 -127385 -135308 -26711 -713 122501 151639 47303 -14392 18471 54451 -62830
14831 -62830 -15132 78009 -409 -47302 -81134 -65577 59680 111809 54881 -12448 -68619
14820 -68619 -98371 -82573 -11240 104643 15236 -148423 -188732 -162139 -5513 13885 108893
14809 108893 65079 41973 -34671 8308 10299 24336 25306 -35618 -62240 -75044 22149 85010
14797 85010 49009 -30124 -2749 51581 154571 116723 110361 125905 73426 158208 143388 145524
14785 145524 107880 117703 182573 146446 40854 539 88010 105188 34751 -10509 -46954
14774 -46954 -121488 -230093 -317736 -268753 -82955 33257 23015 126698 144566 119623 170379
14763 170379 140732 146899 81072 -3948 -101561 -103175 -37956 29334 64223 23790 -9869 -130684
14751 -130684 -155659 -235155 -195537 -107136 -85104 -19296 50177 63003 -56654 -194720 -102716
14740 -102716 -20418 -45215 -31996 -58360 -2810 9915 10084 -12161 36132 3591 -24930 45765
14728 45765 59009 -38662 -168490 -140458 -53170 37605 91819 141707 45472 -57494 -136015
14717 -136015 -93235 37983 106105 55545 153496 150714 192555 192489 142313 148645 107004 92720
14705 92720 70290 347 -57751 -6201 -17034 72361 75107 162624 231994 246520 179319 124290
14693 124290 14487 41880 140431 113971 169781 223824 186539 202900 103110 14219 7848
14682 7848 2898 -2626 4323 75086 46438 -31076 -135014 -124027 -124223 -95003 -38636 -10444 70145
14669 70145 17910 -50943 79212 142220 52885 -34062 38713 84208 74071 -37968 -85807
14658 -85807 -12439 -870 -78401 -80288 -45336 -9991 22472 32617 -14191 37919 73115 76037
14646 76037 11417 -20003 79309 104675 68374 51499 19241 42702 -16555 -88237 -64807 -12979
14634 -12979 -2174 17527 80855 126643 130719 71524 10257 59274 65367 -57022 -18127 -14804
14622 -14804 25843 -22096 -130548 -175322 -68688 28164 119925 51585 6008 -21704 -73023
14611 -73023 -118875 -201794 -219503 -162218 -175694 -100810 -92548 -80096 -48578 6511 -28477 -122492
14599 -122492 -135764 -86145 -118164 -123344 -90250 -15719 -15316 -69084 -84227 14368 -22622 -101938
14587 -101938 -158224 -130861 -97223 17520 20728 43300 62468 78507 103388 103997 78547 75852
14575 75852 24729 -6389 -20066 -42304 -92656 -96286 -70687 -64643 -19100 67686 99223 157818
14563 157818 94520 -4801 -43054 -51633 -65342 -60594 -7860 -84711 -56195 7990 46744 17502
14551 17502 -29388 49179 175988 155771 135329 74378 115183 187236 198930 168932 176278 114443
14539 114443 109617 97941 98049 131443 126380 74135 79130 20433 -81753 -35160 -61899 -31185
14527 -31185 -44243 -95571 -34581 30383 -39459 -41184 -38937 -58911 -81487 -31816 -79714 -24870
14515 -24870 31453 30107 90674 114852 132361 157622 114707 29975 41855 -84272 -17322 54373
14503 54373 26978 60618 10475 -54998 -88772 -81909 -137067 -161803 -124723 -57148 -120453 -128795
14491 -128795 -109125 -60957 36403 58178 102897 30892 2973 -4518 -36792 -36118 -8179 32920
14479 32920 -21806 -38638 56497 62000 -5144 126403 165280 172974 190919 133967 105563 138876
14467 138876 125893 98601 -27800 -97050 -63341 -32401 -43364 -133760 -229098 -178481 -161387
14456 -161387 -95978 -8261 85234 -7487 -110673 -52000 -74510 -7400 28959 -89938 2121
14445 2121 37344 -6988 -35480 -3376 21351 -25591 12538 31726 75436 134156 235940 191162
14433 191162 125389 115280 166734 37759 16753 168888 194092 45509 -21171 55590 -12332
14422 -12332 13399 42338 147056 176745 121963 51797 -70417 -124331 -117298 -70287 15937
14411 15937 -7218 -27928 -76129 -49332 49782 109509 114240 138080 106082 78453 107814 147345
14399 147345 103694 31702 51847 80420 111373 101279 113321 92789 101530 73224 21445 -32768
14387 -32768 42941 164391 300342 280642 252267 225487 139389 9831 -163925 -255157 -136775
14376 -136775 -15560 20412 -118364 -86231 -107576 -116538 -229378 -225176 -107437 -13460 -101597
14365 -101597 -128606 -90822 -12774 41100 56052 53111 -76755 -68477 -39597 -50187 30100 46883
14353 46883 -12652 -22441 24389 21503 -77562 -31689 5996 69277 101096 63933 55705 75286
14341 75286 42724 85296 43748 12664 59144 106375 164995 83498 -15311 97110 176756
14330 176756 163048 243176 224678 28201 -27883 117622 115569 235946 274959 364518 324550
14319 324550 259074 229020 166977 46946 31407 4643 58592 40242 6461 11929 -16748
14308 -16748 -34701 71454 82134 151371 125718 -34970 -81083 -75127 -79042 9798 55198 66665
14296 66665 34365 -11029 -14378 -186496 -266957 -236875 -171295 -65375 57739 169276 242520
14285 242520 44970 -66578 -26113 -23736 -49698 -19241 29604 -46874 -95299 -37370 34640
14274 34640 96758 76235 55551 6008 6216 -53312 -118187 -96675 -81646 -80498 54627 72546
14262 72546 24720 -63565 -95328 -72800 -14556 -33776 -49803 -93865 -34007 20327 -45022 -93872
14250 -93872 -150639 6242 118362 85784 85487 39870 -55610 90304 113835 -57920 -99742
14239 -99742 -79651 -97503 -88877 -102638 24709 76055 105887 162911 162847 140778 304251 340695
14227 340695 273038 142630 124178 99468 99110 73298 47053 134012 61172 69229 101955 116568
14215 116568 112702 179137 257896 240843 211750 115801 70906 -11677 -58577 31288 111848 83803
14203 83803 -32769 -57792 -93303 70614 103024 134707 204541 147140 -39616 -102475 -68578
14192 -68578 -77867 -58315 92295 57139 -5939 -2575 5103 6279 -27334 -111337 -118766 -101612
14180 -101612 80290 171783 123157 65843 21056 1461 147891 135959 -2420 -18625 -81832
14169 -81832 -162237 -138045 -94921 -85486 -98385 7887 144432 245789 223470 109393 21897
14158 21897 44115 -30322 -83761 67738 87956 91259 19730 -53988 -6337 53448 32663 19230
14146 19230 -53773 -85512 -101506 -41477 85273 94351 2589 -53808 28490 176904 137911
14135 137911 119686 108383 124855 104425 16547 -64655 -53045 -25725 20982 44683 77290
14124 77290 96199 85755 113064 65748 63425 6064 88219 121855 18043 -16442 873 46153
14112 46153 133893 110508 128361 147531 139470 26420 -109737 -172143 -153635 -154680 -160703 -31647
14100 -31647 47958 65202 158084 127735 124209 76342 -91093 -83669 7053 21219 -3353 -21843
14088 -21843 119708 167051 146825 65850 93803 107372 80056 234365 276947 211627 161675
14077 161675 180111 220947 148938 125399 87311 14554 -56801 2088 11341 -49475 23896 110501
14065 110501 129786 187721 245733 148617 -48810 -36774 109981 273527 195957 120126 166414
14054 166414 209788 108713 1461 -122832 -2243 33652 -9832 -12168 12333 -9165 114020
14043 114020 280166 289204 146336 197812 222980 136619 33606 27022 -16054 -59067 -51542
14032 -51542 21992 -16647 18750 35914 20358 83930 114254 179488 80923 6943 -28283 -52277
14020 -52277 -103191 -151708 -116021 -4407 39777 104477 130912 116044 -13619 -55144 -71037
14009 -71037 -79087 -25298 42907 -50974 -17030 23777 -27629 -102103 -114099 -27176 20314 62676
13997 62676 75884 72465 70791 91338 89941 156661 219128 111096 56688 88061 61033 70146
13985 70146 82804 115282 112423 39804 35836 -51659 -140402 -89331 -46151 -64269 -81210 -163104
13973 -163104 -153626 -173571 -65008 26510 57930 -43010 -76170 -82963 -91588 -156765 -161673 -56294
13961 -56294 -24857 -55562 -13635 26710 -30414 18646 69858 62798 36986 55505 17615 -26980
13949 -26980 32876 -24139 -48680 -55217 -73135 -16976 79612 77508 22648 70800 -394 54265
13937 54265 101992 186652 90608 -3165 -104546 -42566 -7529 17586 -73321 -65592 -103636 -161629
13925 -161629 -109720 26301 53014 -19048 -23586 64276 170954 233653 150567 33324 81184
13914 81184 176847 147515 167337 207441 322249 211534 95478 75604 142663 97464 5475
13903 5475 2838 83144 112227 88697 -6143 -5055 103600 47624 11558 13253 14462 65300
13891 65300 152100 187314 242859 255710 230930 65738 -55193 -125495 -107632 -119018 -43651
13880 -43651 29402 69224 88672 56549 138815 150960 129287 138845 55233 69646 117577 71055
13868 71055 -68218 -92473 -123772 -3084 119517 55190 -15797 20068 165454 -22352 -92990
13857 -92990 -85952 -83767 -21240 41171 95310 27335 110028 224419 268729 200140 242968 319679
13845 319679 174619 94132 88008 153813 173770 134018 63068 28694 -37067 -43243 -61877 -50042
13833 -50042 64941 61728 -3559 50542 77777 57910 54756 92348 16706 13306 121724 216600
13821 216600 214597 163567 239398 200602 56060 -60998 -162369 -143381 -16589 84403 -32127
13810 -32127 -190838 -123146 14893 48529 11265 -37056 -51071 -50358 -90219 -153404 -107925 -691
13798 -691 -5600 -464 13385 -40674 -31259 -13025 4127 53379 128342 201623 254047 212771 178778
13785 178778 172206 107245 115694 136093 151730 186614 286648 293928 247138 198042 77960 -7520
13773 -7520 -53656 -48956 62117 48097 23500 72538 24376 -7246 -108263 -84663 -128527 -87014
13761 -87014 -15983 49982 70753 151089 144229 104293 162761 144242 162042 148127 71787 -38229
13749 -38229 -106120 36429 92792 149096 159751 114779 115611 220018 257275 172755 154098 180409
13737 180409 208541 238696 182092 33302 -22531 867 91836 118254 65624 -3820 -18206
13726 -18206 24544 -34731 -82457 61567 100546 6698 -60474 -109717 -12616 105657 27278
13715 27278 -10443 52934 108668 96093 183894 181229 148506 164230 104854 131357 99007 154031
13703 154031 196603 95707 -52848 -6223 27753 78213 254513 345278 228167 66781
13693 66781 59211 116646 29988 -47172 -78377 24717 35371 48611 140378 204064 164998 167050
13681 167050 167914 98448 86129 17311 2016 158833 128062 77838 156085 180713 119386 77871
13669 77871 45463 62046 66820 134012 139396 105335 95277 131269 230922 226696 220205 234253
13657 234253 160688 103993 212311 278249 254819 334252 345202 332510 269687 257990 237062
13646 237062 190733 95740 165510 253675 284181 210308 114663 107636 66194 -106179 -97636 40579
13634 40579 91030 136026 81394 -40654 -81492 -110521 -38896 68966 79885 77770 58512
13623 58512 82157 149429 226244 241844 183778 71117 82158 95071 81982 97985 106950 146475
13611 146475 165974 196004 190913 109689 69676 94989 71539 135438 292196 361563 287740
13600 287740 107514 11561 96955 144257 79370 47335 106787 77382 46366 86895 131522
13589 131522 84805 81719 104541 197420 234116 183250 260081 322381 368961 274469 285987 311754
13577 311754 274192 212918 194117 103909 61585 123471 147971 101041 81585 114380 186635
13566 186635 199100 101848 80784 156659 119939 56248 61753 32796 139340 150402 143273 138821
13554 138821 153847 138719 177185 206530 209289 234254 103572 12602 -49801 -151611 -2461
13543 -2461 79518 66926 33359 2459 74624 102186 180349 168262 52633 35673 201334
13532 201334 315030 385929 302896 188478 145511 151512 166100 122021 211746 120919 -17380
13521 -17380 -66061 -22843 67122 106315 157776 156659 77916 85775 70489 56397 120674 233059
13509 233059 308434 220384 53894 -54022 -43559 59979 147447 210188 198469 272440 376080
13498 376080 364301 262348 246802 261415 252963 215861 207475 185356 143293 259827 316736
13487 316736 339551 237935 198909 278711 265593 226065 104382 69633 134496 104003 80945
13476 80945 84695 68500 -58841 -19371 -27557 51439 154177 107980 225551 274906 239220
13465 239220 285193 372330 387246 409218 394599 265084 114416 51394 142299 299068 278485
13454 278485 195935 147041 154881 156556 150149 142840 173915 182343 181303 211359 122308 166797 302947
13441 302947 359626 459938 486323 425646 394709 526401 438917 486038 419411 243017 215752
13430 215752 207270 226343 129490 112527 281639 284827 306756 316144 316365 337453 270905 270971 210447
13417 210447 233396 321328 298535 229001 166112 205340 281832 381143 328909 303198 334296
13406 334296 430752 503476 575327 573431 435895 307669 295392 327501 257662 137650 108610
13395 108610 111324 182621 210210 234491 212079 143351 131341 112611 125334 116719 105464 146269
13383 146269 206943 212813 201096 152322 186525 188408 128918 116667 123789 122837 188537 233714
13371 233714 107156 184262 311365 263769 214968 201657 274483 365094 379334 358484 377554
13360 377554 254112 252768 296682 331204 334234 246079 271384 263796 234265 185313 276768 272069
13348 272069 273018 386645 369879 343966 376558 375302 288921 230503 250847 238377 218836 220612
13336 220612 184747 153585 225225 244232 225109 119490 69273 57980 118712 201107 207643
13325 207643 216463 169639 128324 66997 29593 -34601 -62406 -44458 795 89366 173639 294202
13313 294202 306527 261040 239914 302592 219645 220932 254524 317767 350197 406113 522566
13302 522566 478504 473727 524114 588152 613527 530342 456292 416157 543875 582961 563588
13291 563588 641859 756121 708293 650939 741666 798726 779084 856696 989135 1245034 1461591
13280 1461591 1625874 1753376 1887918 1952596 2030462 1917968 1742418 1607500 1459046 1261547
13270 1261547 1217985 1271664 1344123 1404226 1439057 1429917 1441136 1546429 1661746 1793142 1836306
13259 1836306 1838292 1855933 1957009 2018664 1893832 1920789 2027261 2142623 2193955 2280593 2388846
13248 2388846 2372665 2362859 2371766 2304341 2131931 2043727 1947479 1815364 1838950 1795814 1792324
13237 1792324 1839824 1819662 1752663 1906214 1988945 1997922 1991485 1906154 1863499 1807669 1744148
13226 1744148 1747530 1695713 1721304 1896420 2122222 2268562 2358662 2575869 2706390 2674696
13216 2674696 2409050 2062677 1825807 1712185 1592891 1615438 1485373 1376520 1309687 1312050
13206 1312050 1248292 1163736 1078099 962946 1012113 1024511 1031738 1037071 1144847 1165578 1112508
13195 1112508 1062343 1066282 960387 959756 921318 926885 954586 806139 773357 814559 788054 764969
13183 764969 727137 758321 710349 725716 720921 677881 630698 617517 591316 617882 606355 570411
13171 570411 518183 536403 558193 592721 527537 698440 715794 615755 625037 673546 673336 634602
13159 634602 610188 605371 554885 589948 630619 631994 549755 453726 482528 520509 513814 546551
13147 546551 574773 639560 759888 722012 601750 572737 488934 588293 649905 689562 686553
13136 686553 737544 755721 705572 675253 568146 431001 520211 640744 691132 737048 665615
13125 665615 611653 739069 820691 886600 787985 636698 629421 668585 615115 643532 634219
13114 634219 617382 631663 570012 489830 472831 595179 703322 653813 671461 691988 619148
13103 619148 687267 679565 564817 541354 604127 626853 590974 646105 720205 662710 602922
13092 602922 639382 799733 929943 854844 802849 755165 723100 646619 692623 767583 699130
13081 699130 624930 738976 882516 1043320 1002177 923457 895088 902959 839874 858110 801259
13070 801259 831109 822852 857653 908237 1045664 993676 908982 918270 1021755 1071943 1057767
13059 1057767 1070961 1050443 957959 941988 875652 881167 974537 922564 887516 938170 1046111
13048 1046111 994390 960211 843167 801677 858331 963309 970335 991379 924404 942036 937823
13037 937823 977189 1052542 1126209 1119125 1144800 1161244 1160229 1059343 1021735 1124140 1122230 920805
13025 920805 980878 1078090 1031457 1073795 1151135 1147581 1222462 1199738 1145962 1188508 1222056 1207435
13013 1207435 1092201 1063167 1071097 1205661 1248805 1260144 1188913 1040139 1017209 1016669 1092215
13002 1092215 1123119 1128946 1109141 1100686 1068270 996449 963361 906531 927864 954390 992355 1032543
12990 1032543 1015958 945189 966105 1022819 1091343 1091384 1182348 1164040 1164167 1097647 1083924 996811
12978 996811 943240 978277 1095552 1133264 1121172 1107726 1178089 1118082 1054730 1024641 1000958
12967 1000958 919509 843290 796635 825255 901259 988643 1182987 1266319 1234026 1164972 1267185
12956 1267185 1512405 1458124 1404308 1390536 1461652 1470739 1381076 1423803 1559480 1670796 1836023
12945 1836023 1914078 2002288 2174337 2230922 2236866 2252160 2158790 2102671 2102627 2097609 1996928 1985557
12933 1985557 1995671 2018097 2051513 2160365 2285004 2372228 2349659 2404084 2425907 2395861 2470062
12922 2470062 2440865 2369197 2368098 2450211 2432364 2416956 2412245 2585434 2743362 2849195 2819431
12911 2819431 2779771 2837799 2865773 2860541 2902990 2933946 3080466 3141307 3250405 3439881 3488641
12900 3488641 3532717 3582749 3662982 3801787 3882530 3913956 3858705 3842985 3836580 3759124 3709599
12889 3709599 3750421 3839160 3933905 3968840 4049646 4228394 4452837 4458835 4457221 4495174 4622553
12878 4622553 4671797 4630012 4703997 4852544 5072772 5071058 5062386 5129437 5263811 5377572 5506078
12867 5506078 5572544 5773247 5833192 5982805 6107288 6292836 6500975 6700199 7000220 7266504
12857 7266504 7600343 7925938 8222104 8554141 8991316 9395694 9849980 10450067 11158125
12848 11158125 11970641 12703038 13653361 14941543 16461317 18226723 20359792 22727793
12840 22727793 25490837 28618118 32223210 36546178 41809960 48637483 57225099 68079958
12832 68079958 81824092 99154567 120497000 146361503 177134054 212558703 251510978
12825 251510978 290641800 323774751 340925005 333266742 303309735 264414777 227695967
12818 227695967 198002073 177069031 164363524 158936507 159721172 165571885 175828707
12811 175828707 189802864 206732410 226035939 246304611 265411701 281238850 292789560
12804 292789560 300438737 306115144 312099612 319485092 329704582 343888287 362046882
12797 362046882 383037058 403502139 419297973 425936415 420178183 402905994 379513114
12790 379513114 356474930 337203540 322866419 313940662 309765187 309406075 311282955 313723910
12782 313723910 315714432 315876746 312691154 304860616 293289588 280277482 268277538 259631832
12774 259631832 255623876 256971076 264087005 277439980 297308791 323922638 356569136
12767 356569136 393359471 429775216 458254141 469776524 456266043 417082035 363907796
12760 363907796 311265980 266946013 232225767 205813220 186099074 171795692 161663420
12753 161663420 154584508 149491237 145809406 143144104 140967619 138672700 135842677 132133087
12745 132133087 127661392 122623888 117082613 111369397 105703490 100280876 95312814 90845553
12737 90845553 86593952 82501776 78776173 75338007 72226294 69360020 66516672 63993568
12729 63993568 61564387 59301229 57411252 55681979 53935900 52220467 50666333 49130268
12721 49130268 47666588 46290012 45005038 43721386 42523632 41387260 40364525 39283894
12713 39283894 38403366 37548021 36775056 36034259 35299743 34654479 33920226 33183812 32443365
12704 32443365 31678303 30879764 30108220 29372988 28594861 27694694 26984702 26356012 25733629
12695 25733629 25081034 24276074 23505962 22774809 22122449 21383581 20670234 20058198 19515025
12686 19515025 19102674 18652291 18223238 17736030 17273881 16854671 16467611 16172352 15815145
12677 15815145 15420240 15163552 14887643 14523067 14280922 14014191 13734427 13498475 13292642
12668 13292642 13041380 12787913 12612550 12417123 12142367 11931655 11692941 11500050 11254779
12659 11254779 11108305 10947027 10735425 10620737 10506725 10307712 10178081 10172931 10145090 10056560
12649 10056560 9979194 10015867 10077145 10116511 9974994 9871367 9768468 9586454 9309903 9011937
12639 9011937 8776777 8526837 8311249 8213772 8122443 7960474 7645427 7449730 7352999 7271998
12629 7271998 7101739 6967973 6797174 6602143 6380819 6201219 6126071 6047601 5796783 5607114
12619 5607114 5435185 5337666 5286658 5246906 5209734 5127528 5093031 5167788 5061663 4934272 4803835
12608 4803835 4662319 4555812 4452083 4443084 4398807 4394188 4269097 4140478 4119352 4129597 4070020
12597 4070020 4079676 3952019 3897547 3771648 3655860 3596506 3455841 3446980 3325560 3150373
12587 3150373 3007298 2889927 2930819 2911814 2886376 2820410 2767253 2634885 2503737 2355889
12577 2355889 2370453 2388897 2416782 2395892 2334107 2266477 2210517 2081806 1974197 2020726 2129732
12566 2129732 2157148 2080603 1984481 1937215 1904501 1849188 1730397 1655727 1608473 1600719 1593100
12555 1593100 1571858 1715745 1627571 1580706 1607751 1404630 1354090 1339383 1316361 1387445 1362732
12544 1362732 1326084 1293381 1316692 1340439 1357147 1370431 1257638 1158600 1060701 1015797 1047376
12533 1047376 1022472 976642 1008215 1157705 1149019 1097871 1110431 1024679 1005134 963213 886903
12522 886903 865317 917317 973470 974835 939403 952119 821343 834146 1033139 1120645 1041825
12511 1041825 928978 780122 772819 883734 926505 909465 877452 845736 860163 896181 920633
12500 920633 928164 911656 785535 690472 718641 886542 894099 815089 799562 814852 842253
12489 842253 967607 1063492 994057 905699 890677 841419 899540 916493 964628 977868 885160
12478 885160 862659 864561 849147 793468 796972 871883 857109 815567 847740 1015132 1062818 1115163
12466 1115163 1133443 1109983 982142 844558 833711 871327 813574 766704 928273 980136 940906
12455 940906 908604 929647 1004253 1040568 1029364 984227 992384 958355 963917 1108315 1167219 1176748
12443 1176748 1209030 1280103 1318294 1281181 1288538 1243710 1274012 1238050 1217030 1111613 1017658
12432 1017658 920356 916314 998234 1010408 912493 903157 1073122 1089188 1030563 903567 828088
12421 828088 830183 879900 940655 876698 735903 825867 939364 1104692 1118606 1120494 1019009
12410 1019009 1007154 1250043 1344887 1402440 1408382 1304982 1206708 1066590 870832 935059 907342
12399 907342 831968 840409 760896 759972 668410 660453 781653 867357 880623 757137 696445 716536
12387 716536 830182 813994 742152 631983 669335 781719 819514 809528 794309 800500 776170
12376 776170 831123 833754 841907 922539 1017500 1185867 1293234 1355126 1352160 1485048 1598882
12365 1598882 1631764 1781369 1938509 1977496 1898674 1703859 1509528 1388842 1337931 1363065
12355 1363065 1461711 1457125 1396963 1466005 1628287 1748640 1923750 2007096 1954186 2148695 2367435
12344 2367435 2454014 2638678 2903211 3212733 3493136 3744644 3986549 4267567 4474380 4457419
12334 4457419 4441109 4299195 4058829 3834080 3616993 3333119 3029780 2965014 3111935 3129375
12324 3129375 3178094 3324805 3394961 3502989 3475983 3377042 3398368 3320911 3269396 3277216 3363102
12313 3363102 3409376 3401366 3406250 3527086 3754347 4119524 4430872 4656575 5009401 5101390
12303 5101390 4986741 4830559 4465283 4162510 3838826 3544434 3307730 3083918 2950232
12294 2950232 2805473 2724189 2696151 2661108 2579094 2493259 2471214 2316438 2236001 2161251 2236590
12283 2236590 2410255 2357630 2292017 2313137 2448477 2474393 2480029 2554269 2484879 2510355 2448368
12272 2448368 2354803 2268925 2101880 1942031 1712405 1522252 1501061 1475747 1498621 1489510 1456609
12261 1456609 1401783 1214845 1083269 1146729 1288629 1223126 1218299 1177231 1083257 970866 1021464
12250 1021464 1047996 1101142 996379 864726 918484 933690 894039 822746 790741 861900 940834
12239 940834 893751 907192 1052171 1033430 879261 849742 827538 803103 860575 907229 874190
12228 874190 816681 686951 718619 869170 879220 684146 663834 626268 588920 547524 597498
12217 597498 710709 638452 480109 455337 472676 548508 576288 563701 476550 443538 517225
12206 517225 539758 508672 563987 540941 528839 484776 537005 627278 717065 730962 754830
12195 754830 762834 740617 682814 633566 568159 651377 734473 746584 746046 833105 935468 779361
12183 779361 698847 758607 796155 730387 682912 678743 698835 745660 754539 679774 704773 669482
12171 669482 708948 735721 713419 665336 726178 752153 736741 706886 698121 704064 706298 756706
12159 756706 745665 766252 865992 867936 843217 763957 863412 894924 958185 914995 835536 876210
12147 876210 908205 926603 890986 938841 921800 955525 1085480 969863 722360 562202 705436
12136 705436 789799 969184 1060298 1138383 1142853 1014147 920418 932295 964581 995554 1077497
12125 1077497 1065403 1044441 1017865 913233 831931 775158 876691 984879 1049654 1097075 1189474
12114 1189474 1097946 1095427 1095859 1079575 1113286 1139701 1118400 1035361 959731 928228 994173 1085975
12102 1085975 1126935 1116008 1039654 1067313 1058503 927583 866336 919143 1077922 1127223 1099582
12091 1099582 959237 928232 975577 1081175 1094009 1237936 1347236 1268445 1270071 1215417 1047455
12080 1047455 951348 978392 1022666 1019460 1009784 955243 877907 917008 975468 953802 890609 911484
12068 911484 958198 893841 895765 945238 907341 893483 859680 844481 844406 893974 932988 931862
12056 931862 931792 947496 1055660 1121740 1053942 1017683 1065969 1080879 1164132 1146231 1193224 1197809
12044 1197809 1298122 1388884 1404617 1468786 1566538 1611011 1683211 1737621 1823228 1789504 1613492
12033 1613492 1596581 1736350 1953281 2145735 2251134 2393207 2624898 2835499 2931118 2944651
12023 2944651 2871839 2853766 2707047 2655871 2600774 2548650 2431562 2370103 2314726 2385211 2524322
12012 2524322 2606431 2542061 2538699 2673709 2757805 2676172 2636772 2624638 2671566 2613373 2546382
12001 2546382 2560735 2534708 2628832 2762474 2961206 2959068 2985865 3128035 3170677 3253774 3338132
11990 3338132 3284819 3209690 3287277 3499577 3642826 3700287 3665664 3688569 3810416 3946255
11980 3946255 3996735 4078682 4222448 4233728 4190513 3930794 3917089 3912232 3885084 3998217 4066014
11969 4066014 4168291 4268472 4285918 4383681 4542959 4708912 4748108 4829194 4832811 4864873 4911631
11958 4911631 4969572 5088833 5123170 5154887 5203890 5347755 5502496 5563740 5612074 5803869
11948 5803869 6087568 6344139 6601355 6704217 6792702 7026233 7294603 7602616 7928489 8270343
11938 8270343 8587446 8943859 9422913 9884576 10472507 11146243 11837780 12793038 13850017
11929 13850017 15032905 16504046 18231458 20194438 22458416 25240050 28700547 32692710
11921 32692710 37461287 43354152 50538672 59548583 70878078 85041056 102700149 124329408
11913 124329408 150640058 182048497 218285875 258316453 299220591 335399521 359306679
11906 359306679 363963015 348374073 318534579 283480244 249992897 222033993 201530239
11899 201530239 189083433 184361888 186387441 194222747 206907571 223115933 241039022
11892 241039022 258431456 273311946 284311542 291442755 295147619 295937283 295112134 295030933
11884 295030933 298060444 306354166 321325346 343264876 370792444 400489061 427162082
11877 427162082 444737747 448528901 437399363 414802507 387289339 361271472 340991913
11870 340991913 327675062 320492481 317312536 315745006 313762239 310005351 303604928 294655334
11862 294655334 283534678 271445090 259814899 250531876 245069674 243936171 247504753
11855 247504753 256073358 269526668 287802626 310554945 336631224 363700247 388038222
11848 388038222 404554109 407449624 392910466 362107052 321423573 279525077 242567038
11841 242567038 212836368 190109105 173078804 160515507 151313488 144481603 139450979
11834 139450979 135625875 132472154 129652380 126942831 123940063 120313766 116206490 111789951
11826 111789951 107136109 102286722 97508799 92980699 88732543 84816973 81091860 77460884
11818 77460884 74036397 70941807 68049846 65359886 62815443 60431607 58340337 56314423
11810 56314423 54569243 52816745 51128443 49498390 47993673 46570336 45325435 44087615
11802 44087615 42844789 41814675 40607674 39431645 38441030 37533911 36634946 35863411 35182261
11793 35182261 34482289 33825918 33320055 32697881 32060964 31429602 30778582 29861049 29027928
11784 29027928 28209694 27469264 26742296 26041784 25424269 24844517 24251723 23503580 22759939
11775 22759939 22038332 21409196 20791542 20237430 19665920 19077330 18633164 18093847 17648061
11766 17648061 17268913 17028288 16723716 16286618 16081770 15858173 15483148 15006738 14677600
11757 14677600 14429438 14163730 13913314 13612333 13313354 13130793 12946253 12666450 12455455
11748 12455455 12211110 11985365 11727957 11489309 11400999 11206782 10975892 10697500 10463425
11739 10463425 10299164 10099845 9918599 9749812 9706038 9569823 9328362 9152975 9158425 9186516
11729 9186516 9109401 8998678 8819259 8777629 8646451 8516100 8357979 8207623 8013342 7902044
11719 7902044 7776604 7583536 7322723 7189167 7161331 7095321 6837300 6575830 6415233 6380256
11709 6380256 6236971 6044213 5878739 5775318 5816374 5733345 5582111 5401951 5356083 5336397
11699 5336397 5247234 5254489 5107747 4948374 4855330 4747365 4665908 4559997 4487677 4539881 4513555
11688 4513555 4440050 4289640 4160440 4224388 4187855 4165518 4200825 4163207 4117831 4149889 4118180
11677 4118180 4177407 4487754 4695063 4770228 5050426 5395133 5743939 6291042 7139343 8240944
11667 8240944 9753220 11687135 14054676 16764981 19061017 20185912 19513376 17164083
11659 17164083 14006318 10958938 8679449 7132123 6209652 5608853 5160345 4987055 4940066
11650 4940066 4880738 4932503 4991126 5004725 4957664 4816880 4679406 4526018 4313900 4094450
11640 4094450 3897615 3633261 3370565 3322090 3324463 3165624 2941122 2693329 2481967 2337976
11630 2337976 2207227 2280379 2294933 2177298 2042964 2033652 1911325 1930584 1950618 1920814 1933263
11619 1933263 1898785 1902191 1820648 1704796 1504642 1308925 1213228 1206603 1398968 1541189 1563049
11608 1563049 1470653 1398180 1429455 1400447 1329178 1359291 1360074 1359225 1454406 1475286 1330667 1240192
11596 1240192 1156910 1130996 1101817 1150742 1149690 1139083 1110369 1113875 1178067 1101102 965204
11585 965204 929046 936182 867529 837402 908488 870126 931520 839413 702352 569372 547313
11574 547313 550477 626129 781688 849741 818226 825832 802593 785808 751143 726264 615204
11563 615204 649909 759343 788854 793426 809557 626640 553353 483259 457782 443775 442051
11552 442051 412811 390780 386829 430086 435116 509903 579232 640913 625955 534562 517822 590790
11540 590790 592857 589337 603044 656714 663917 609403 522878 566174 531994 506364 489057 392253
11528 392253 398286 379680 369258 476207 444613 343081 269845 274884 362624 366250 294249 346495
11516 346495 279443 250047 281205 194290 246286 281531 340061 393920 443168 378067 191842
11505 191842 217632 353587 365352 265927 137316 129922 298797 435159 312980 181665
11495 181665 174584 314359 496643 460268 371128 447859 462615 515682 474136 495650 539623
11484 539623 600617 739192 741175 871601 1079892 1270647 1269895 1280670 1403973 1496928 1681210
11473 1681210 1879250 2026015 2134302 1960537 1875996 1764347 1642245 1540115 1388388 1375281
11463 1375281 1335670 1338577 1352848 1419863 1376471 1482123 1620961 1625030 1620940 1746830 1808514
11452 1808514 1761575 1849308 1901104 1922497 1893737 1847827 1890626 2141528 2292466 2254016 2293863
11441 2293863 2356383 2226474 2173066 2207538 2100773 1975850 1913687 2027167 2043499 1996847
11431 1996847 1982043 1882831 1833476 1815972 1791051 1741572 1615345 1570831 1480085 1335804 1245447
11420 1245447 1345929 1522599 1517170 1583209 1723532 1895365 2097718 2151022 2222211 2160260
11410 2160260 2056044 1910885 1761241 1560751 1319820 1142992 1066207 1018493 1018123 1019219 977837
11399 977837 848470 839507 868976 845050 792339 767701 746478 666182 563329 491860 422678
11388 422678 484103 558220 536513 441716 342536 265254 286842 292692 266447 289509 336255 419510
11376 419510 387781 374535 293620 231862 255827 343584 411691 232845 114826 141982 108189
11365 108189 113848 180149 224402 115861 126403 166272 191432 291146 391359 437850 379689
11354 379689 320122 346784 319374 319920 336832 374688 424286 412215 417812 354248 260967 247235
11342 247235 159731 137734 206780 239518 186696 123189 59059 17942 178492 266311 220578
11331 220578 151138 148949 94678 7733 93240 220456 264628 267375 192850 165407 189204 226299
11319 226299 226589 234826 270762 293220 152098 127966 198121 291871 354631 268252 365565 403224
11307 403224 348309 277362 226045 176838 113249 225902 339498 363649 515985 677239 701866
11296 701866 842396 980173 1227842 1641360 2264380 2955979 3488376 3624317 3493413 3289945
11286 3289945 2881064 2239507 1583981 1235025 1043417 942178 899662 833123 789985 785303
11276 785303 694661 773074 778391 681914 658358 658940 570922 579249 621306 652824 599633 536608
11264 536608 475921 461971 553628 496026 450320 393700 277754 332169 410453 473907 417821
11253 417821 347358 288917 346058 323261 213643 278462 306160 245295 195135 173970 297403
11242 297403 303953 179237 122850 153584 118640 74447 137980 121343 40374 40129 43909 88034
11230 88034 194264 262659 222844 191898 135954 120349 158706 186068 283762 339202 157173
11219 157173 87273 168242 145333 120614 51846 5787 65239 144690 178599 245666 276436
11208 276436 298999 214643 46625 -83016 -173062 -116630 -3385 22546 126067 95855 115353
11197 115353 84800 169365 139443 36327 64781 65517 9693 -14395 24020 -21209 -116492 -6338
11185 -6338 150501 202177 197568 342080 499902 534515 611995 722423 937829 1180081 1604460
11174 1604460 2198088 2746062 3154971 3284203 3119599 2982921 2871326 2674951 2013766
11165 2013766 1319486 953785 827633 845520 789004 738523 776281 825948 788743 786432 716314
11154 716314 709509 669330 624785 614844 523216 529276 492054 383837 348552 257117 337569 362120
11142 362120 317183 238590 321666 319839 332495 342994 268201 258400 212916 194641 170513 263025
11130 263025 186519 184250 172558 225294 115279 121451 203457 189412 133509 102609 72945 177954
11118 177954 128907 63344 19366 10676 117574 281829 251586 93805 124 -18627 -24066
11107 -24066 125147 215175 304465 325442 314566 206474 118146 91680 63335 61758 93310
11096 93310 84451 34556 20260 44938 199268 222857 232617 191983 97270 38550 48106 55614
11084 55614 33829 31392 3403 -12915 99417 239344 162269 96593 -2552 -47942 -943
11073 -943 50319 50946 -8162 62399 135463 137148 118144 118474 16113 9892 -54032 -50286 -82403
11060 -82403 -46478 81177 50041 -31976 103019 118886 42077 28012 -32310 -131775 -121539
11049 -121539 -70939 -68446 -36172 31716 -10894 4766 26516 -5185 -10315 -141921 -203431 -119740
11037 -119740 -185376 -226022 -179126 -58351 -14933 15470 31632 -13026 -1321 -79410 -94004
11026 -94004 -8642 -40642 -86935 -136963 -190826 -218663 -245866 -279207 -259079 -257719 -175722 -110947
11014 -110947 -65987 -49925 -43750 -66348 -164210 -161813 -119480 -111846 -98134 -27350 27014 -34752
11002 -34752 -125377 -57977 -36798 -123862 -276802 -241699 -134867 -56265 -34691 42400 113269
10991 113269 58980 54374 53862 -65105 -147993 -125195 -155961 -143776 -35354 -5196 9619 67929
10979 67929 23503 -41174 82668 50483 -4118 20258 52217 50877 -60405 -46951 -37483 34474
10967 34474 86253 237216 281229 179438 17374 -113075 -114866 -36285 45896 91977 173180
10956 173180 179930 137825 138246 65675 65772 97946 101514 102051 140749 188720 141307 29242 28142
10943 28142 47540 35901 48964 50510 -20170 -90960 -27732 63135 3398 -82671 -66305 -103448
10931 -103448 -95795 -19611 19234 38538 -16317 106472 99070 -21033 -80262 -124583 -111296
10920 -111296 -58707 -59597 -137590 -129010 -22024 1329 10618 -59368 -114500 -65658 -70929 -39283
10908 -39283 -42818 -63915 -143299 -176651 -131391 -102275 -36650 -18554 68119 -131069 -282018
10897 -282018 -345204 -249050 -89753 -82718 -163391 -107170 -47626 -51562 -121466 -271492 -269940 -161010
10885 -161010 -136334 -197981 -178335 -39779 65991 91092 39011 90001 100164 98179 75128
10874 75128 -29903 -98859 -37748 -49119 -48362 19313 31718 29093 -81755 -171501 -215698 -46322
10862 -46322 -68095 -91521 -87904 -109749 -42381 -67622 -74583 -30479 9827 64958 -10694 -61933
10850 -61933 -101476 -58885 -63249 -107606 46533 66888 10271 -88404 -125190 -124711 -140276 -38235
10838 -38235 79117 77632 -60380 -75484 515 6867 22871 -50346 18881 -45759 -183181
10827 -183181 -176437 -191760 -123956 24394 -78014 -129556 -30602 -11624 24134 87337 116499
10816 116499 175870 174529 183322 159266 16977 -15903 -8555 -45856 -103997 -64150 -72820 -107597
10804 -107597 -143683 -226415 -141078 -37397 -31707 -125852 -106982 -35772 -46062 -8202 -92630
10793 -92630 -95212 -93817 -69943 -97597 -176885 -203356 -149784 -83542 -109821 -87453 -8246 36208
10781 36208 -14952 -81298 -165360 -165219 -76059 -52085 -106669 -125472 -132792 -159559 -163719 -133507
10769 -133507 -157430 -115754 -21735 -140209 -178564 -113240 -118881 -214007 -153597 -108093 -120387
10758 -120387 -163243 -70760 20607 97544 108034 69358 -13925 -124265 -101400 -35168 44394
10747 44394 46144 68891 34485 -68210 -120979 -2661 115384 44818 27898 77297 71874
10736 71874 60601 155518 232414 167345 -25259 -65099 -112057 -134420 -86363 -159799 -202616
10725 -202616 -133076 -83729 -41468 22733 82446 81864 64814 43581 172766 87927 -16303
10714 -16303 27581 128991 29637 -89398 -86027 -40982 -22789 -62773 -124654 -19112 66779
10703 66779 -1756 -10907 -63416 -215835 -76089 -110850 -245720 -249092 -152039 -174972 -218802
10692 -218802 -225201 -172101 -78718 29233 99793 142514 133169 80402 21377 99649 93281 22098
10680 22098 -51735 -52672 97487 116493 77476 -17240 -17304 75087 41987 -92099 -150521 -142689
10668 -142689 -266989 -242815 -172182 -37617 -19099 -158655 -136092 -110362 -93487 -104699 10308
10657 10308 23943 19532 35135 96002 93308 151427 170037 44705 -48967 -58874 188106 240532
10645 240532 85028 20061 -68478 -134112 -83149 -2719 38470 18493 -53682 -70200 -53491
10634 -53491 -63505 -121847 -149983 -66612 -22805 -17385 -103524 -113260 -88113 -59712 -47354 -27451
10622 -27451 21606 85215 63904 144379 179340 55454 110905 185174 136253 139760 117475 202153
10610 202153 191259 76211 -38764 -72683 -30185 23485 71204 83943 10092 -64613 -217445
10599 -217445 -285476 -327610 -188742 -166836 -221494 -245697 -87460 37428 55811 35530 18263
10588 18263 36691 -36768 -36840 3537 -21872 -7246 30529 6177 19609 -32175 -122024 -75714
10576 -75714 -76871 -79011 -86558 -42198 11916 70681 118127 80025 -10672 -12267 -51707 -70852
10564 -70852 -66916 17103 152435 65321 -51872 -136906 -192059 -174376 -85028 33559 169973
10553 169973 113839 54618 -83486 -126604 -50970 -8870 -44280 -76797 26499 68293 62019
10542 62019 76788 112905 53624 22311 -7648 -6722 -67305 -96841 -166913 -322211 -287806 -204713
10530 -204713 -110907 -132897 -132585 -136328 -137193 -200589 -174025 -158113 -144704 -79972 -36354 -40876 11948
10517 11948 54075 75228 -31782 -38725 -85086 -87217 -120711 -48109 50781 -37505 -137907 -116992
10505 -116992 -70248 33559 45986 82743 -20059 -74500 -55610 8555 53452 -117773 -191766
10494 -191766 -229300 -275909 -277124 -141588 38255 168589 232351 155148 19807 -37220 -46008
10483 -46008 -52777 5805 63218 20367 -526 55033 85117 152874 64795 67456 67470 95703 126239
10470 126239 159727 64339 -47495 -3294 26025 85500 114594 79206 61054 59537 89572
10459 89572 50689 22858 -36729 -38630 -46906 -29327 28843 27027 77680 36252 83636 123081
10447 123081 63484 29765 -28658 -137578 -53619 30335 36883 45108 -52608 -96632 -101206 41545
10435 41545 226506 203331 64920 17429 76017 50044 55137 188359 259985 236814 124318
10424 124318 86808 68582 73636 46544 8042 -6594 59828 47694 114500 96540 77898 64480
10412 64480 95869 65430 68657 18734 -13760 -51251 -30432 -135466 -157907 -119049 -81410 -22661
10400 -22661 -89477 -140366 -125231 5111 15841 -15717 -59175 -48681 67379 101257 150433
10389 150433 144138 156480 212783 234160 82760 90227 73789 65148 169625 201200 130329 138100
10377 138100 85125 67933 -23570 -167278 -205499 -49782 61864 100590 26807 -42510 -2093
10366 -2093 -33816 11966 -48010 -35276 43318 17397 46399 123031 104154 2374 -90445 -159551
10354 -159551 -138893 -143314 -61614 -23528 -27236 -40032 -94899 -47966 -41716 -9843 129996 26121
10342 26121 10652 60686 13841 61579 75179 49888 -50472 -84585 -105207 -114710 -193514 -78188
10330 -78188 -74616 -60676 -175152 -237687 -197686 -133315 -185931 -177162 -69481 -34799 19244 31914
10318 31914 -55588 -31622 -56143 -110869 -155240 -103536 -80810 -68888 3810 -25920 -136859
10307 -136859 -210211 -176335 -100818 -37113 -86113 -166339 -149962 -155742 -122442 -151630 -117077 -5324
10295 -5324 61259 15503 -49941 -81399 -40910 -60675 -38552 25663 53889 -109839 -101009 41167
10283 41167 -873 18148 2301 13984 81228 90876 52092 54892 34520 -26466 -58038 -75331
10271 -75331 -121912 -80190 5625 40939 -63535 -48079 -170489 -222222 -93248 -5041 47698
10260 47698 -2630 -3078 -152297 -226463 -137519 -32886 44889 -13776 -84790 -128491 -74272 34636
10248 34636 52450 -5887 24666 8802 31683 14942 -77782 -64596 -162111 -130158 -22457
10237 -22457 -42922 -7960 40535 65814 77244 55512 52620 24149 -117856 -69213 142818
10226 142818 177032 90821 -83925 -254587 -201599 -25363 27108 -43020 41620 113097 892
10215 892 -61605 -46260 42433 50272 43721 16877 93256 186774 232645 119532 -931 -18633
10203 -18633 3741 5466 -24667 -104506 -77959 -6128 40070 63578 -13406 -54601 -35179 -7955
10191 -7955 -66986 -37806 -2386 -4709 -39872 -7812 -124471 -52266 15295 94319 192753 133971
10179 133971 51645 43210 29517 41405 -681 25702 191016 217983 60151 57005 6976
10168 6976 -40064 -29929 7185 66683 112711 47358 -120770 -122237 -210159 -268989 -194831 -113691
10156 -113691 -75853 -202408 -236040 -194113 -13994 71491 85612 112136 113279 37585 -29673
10145 -29673 -34462 -45361 -32627 49615 48700 40999 19213 22897 48562 -79810 -165081 -183368
10133 -183368 -217097 -147876 -125651 -139287 -130052 -126481 -119008 -99649 -19310 112171 69165 -20247
10121 -20247 -3767 23151 48957 -43654 -170879 -75375 -582 55243 181730 213948 236264
10110 236264 119029 31631 40791 132215 51931 -72441 40269 107948 150329 144337 98043
10099 98043 -48384 -31033 162733 154322 -20286 -195184 -168152 -138772 -104987 -32374 -87415
10088 -87415 -123557 30480 106766 132940 145424 126845 92856 47458 -39585 -168462 -236025
10077 -236025 -155057 -15013 37945 -88750 -84556 -34565 -29132 -2840 129522 63830 1792
10066 1792 -35587 56944 -46595 -35328 -26481 -31981 -66802 -116264 -5131 7493 27498 69800
10054 69800 109579 149309 152833 53654 -70842 -100413 -165314 -162849 -196541 -157607 -72979 47253
10042 47253 181681 115006 72755 76362 35975 60822 63247 188516 251712 206706 182469 4976
10030 4976 -64627 -14321 -58574 -130482 38121 126614 22925 -26941 -43626 -58014 49638
10019 49638 27832 -1742 36090 30047 -19858 -58476 -36334 -11121 -33341 31966 52418 -8867
10007 -8867 -81775 -55267 -89252 -29964 64401 158978 59407 94998 143602 116704 84221 108882
9995 108882 84456 63569 108311 60726 -15504 -7089 98358 92675 90279 34564 -29727 -23664
9983 -23664 -23898 -29582 -35135 -76008 -46969 -38104 -88473 -58601 90672 81119 -7649 284 78918
9970 78918 41308 -58404 -43393 130335 94350 88798 64757 -8118 -8067 -51982 22649 15065 5167
9957 5167 50375 34646 126358 100644 53320 38050 -2378 117814 185211 -9343 -18818 42659
9945 42659 34308 -29050 69708 103576 92356 113613 66608 -106946 -109360 -90093 -109008 -177822
9933 -177822 -144381 -70805 52486 196600 164155 75367 60843 36885 32561 -57996 -114285
9922 -114285 -113992 -44629 13944 112892 129294 91153 19798 11247 -21936 143967 210623 188996
9910 188996 207120 249506 309196 295695 243379 201136 147156 129907 35281 49895 26613 45737
9898 45737 96685 27171 54154 78782 139257 165633 87448 23853 4734 56872 77365 52157
9886 52157 65897 83414 193859 151844 167079 128214 89001 34705 23460 89072 129512 151628
9874 151628 133497 -7266 24637 31325 37329 159871 231465 178045 36372 79873 99972
9863 99972 85791 116864 97277 78314 134156 164218 96565 40260 71921 81640 168851 331940
9851 331940 388954 325517 137452 -80821 -9529 -20712 -15011 -15754 -38602 3058 121113 148565
9839 148565 175670 89443 53007 3450 -36190 -70910 -44560 3873 53209 -5863 -48344 -36098
9827 -36098 -60508 -98827 -106531 23670 -14243 -129386 -95845 892 -13073 -29591 -20249 60793
9815 60793 9882 11595 44386 2062 70954 169553 132430 160463 189577 161100 121331 37924
9803 37924 -584 64135 118090 252790 281002 369958 356932 384793 329788 226091 219060 232918
9791 232918 267826 134808 49729 134842 77816 26503 17370 88811 211171 215934 180256 156454
9779 156454 136865 115536 100167 99960 41065 2534 33692 68954 88972 86080 57949 24867
9767 24867 -43381 -60610 -18981 49437 170452 228819 224745 90836 4280 -34025 6769 54655
9755 54655 66214 110517 108180 182038 201565 250967 267933 259032 330760 320906 224954 135709
9743 135709 37044 48060 139444 105392 91701 56213 59913 -30620 -98151 1440 114068 134460
9731 134460 79247 116251 180052 269873 225501 175884 141570 202748 212723 188180 153766 48599
9719 48599 140459 259781 196198 143483 109820 271179 300330 184749 209883 244645 159818
9708 159818 160855 282286 298358 235227 207837 133423 50856 72223 64435 61563 119015 161152
9696 161152 142141 81247 63924 98774 88529 -423 -109516 -172174 -72936 81598 182901
9685 182901 152038 41304 19858 -40178 3708 -13774 5537 36826 43394 31969 7209 3906
9673 3906 53967 98589 95904 25721 46451 84212 115719 105648 110644 136582 154228 96331
9661 96331 134546 155818 141139 204648 171088 77989 50332 98078 77923 149347 112028 144542
9649 144542 137513 276991 213132 169672 100911 74071 47408 102354 24201 -55287 58584
9638 58584 312521 270622 227136 187723 175138 44015 244108 404069 383631 364093 370477
9627 370477 280592 206665 252749 263575 221575 136194 73008 138369 190529 195152 269921 236942
9615 236942 179776 174743 255033 297317 216402 295500 264795 137106 199338 296939 198750 163725
9603 163725 141811 113529 121141 64079 89183 199305 230262 141517 173811 134387 57797 63665
9591 63665 126993 158942 130667 100465 156238 163684 224263 332457 320866 240980 237423 225963
9579 225963 114594 53399 83924 153062 197522 255128 248300 228371 357439 433623 347059
9568 347059 315086 321041 329162 385765 318717 240167 285186 156581 49295 61287 136373 216862
9556 216862 346291 336332 291188 165636 175822 166094 81197 208158 187395 200961 248755
9545 248755 193913 149241 161769 176373 198425 177285 177402 141249 243525 219241 283488 329586
9533 329586 338541 387572 405498 295060 317308 320729 312741 256197 260967 258433 278818 324409
9521 324409 261950 248256 163739 197686 272080 244429 188396 173906 283422 314756 297779
9510 297779 238530 207049 203214 296112 370944 340624 371017 447141 427375 387570 384104 401646
9498 401646 393342 331210 339771 378117 318220 196172 182218 296096 412811 505180 478863
9487 478863 382305 362091 375813 351107 337627 278918 228798 171259 176299 273247 318490 405828
9475 405828 538744 561898 599729 579150 549959 518341 558341 460999 390792 443113 434134 499817
9463 499817 557739 517475 382185 421199 500299 554271 536309 535242 503856 465428 509194 437090
9451 437090 435721 435947 543033 703621 693004 762500 749648 662142 685025 667574 632915 668331
9439 668331 644012 593293 622964 758497 812244 753840 713236 652674 700237 756867 733280
9428 733280 735683 742315 739366 855293 825033 727667 752883 803612 943678 1025702 985770 774983
9416 774983 751054 794922 842514 878522 846985 837856 754731 745564 804046 825867 851147 815548
9404 815548 752622 813977 919309 1036201 1063521 1085766 1037515 922386 894494 958756 894546
9393 894546 879750 930791 986021 1024880 993385 1050060 1070226 1014598 1028377 948618 894526 913630
9381 913630 868148 898353 892245 998138 1104403 1073566 1162590 1273132 1180549 1173512 1234481
9370 1234481 1277478 1320389 1334986 1314152 1229239 1199187 1233138 1249306 1268220 1350173 1291271
9359 1291271 1251479 1258682 1210710 1294747 1365560 1396225 1441726 1477011 1486608 1427569 1378710 1491117
9347 1491117 1523328 1412250 1441355 1473123 1406922 1595642 1622016 1652855 1705828 1697289 1582413
9336 1582413 1501113 1634648 1641394 1539868 1561913 1506750 1575758 1646367 1579392 1665569 1758965
9325 1758965 1838723 1877280 1846599 1748244 1665371 1715188 1775705 1857254 1834013 1859725 1900478
9314 1900478 1988811 2085336 2103904 2084711 2078623 2117396 2076249 2041594 2137693 2062390 2081700 2117316
9302 2117316 2114804 2196235 2251127 2197741 2100818 2116383 2169260 2221059 2208912 2212400 2127093 2184637
9290 2184637 2365279 2374803 2293621 2278749 2348218 2390100 2427232 2440681 2380450 2384990 2299527 2241148
9278 2241148 2259752 2394190 2299438 2266015 2217487 2114964 2206121 2396962 2464906 2424839 2415630
9267 2415630 2426746 2384272 2279433 2313799 2290206 2271085 2396638 2369421 2384709 2397847 2312374
9256 2312374 2287590 2352479 2272071 2250196 2252681 2251252 2331242 2363989 2376800 2325507 2274366 2227887
9244 2227887 2089760 2157746 2135628 2042269 1981577 1924862 2079091 2124134 2072588 2039520 1939391
9233 1939391 1969508 2028138 2041553 2019124 2034351 2030054 2049281 1914089 1833453 1830651 1869600 1767768
9221 1767768 1862105 1846888 1855408 1821612 1799885 1802511 1739474 1751410 1710186 1634365 1691300 1714345
9209 1714345 1789188 1779452 1739565 1792058 1800064 1812692 1746929 1734118 1721496 1697853 1720311 1793652
9197 1793652 1749297 1709402 1717464 1686754 1666851 1697907 1642839 1521199 1548900 1633860 1563808
9186 1563808 1521427 1546689 1499730 1506771 1519264 1566465 1556325 1537207 1548681 1470457 1390446 1337132
9174 1337132 1155418 1080764 1148682 1303827 1321459 1311409 1296514 1228416 1121940 1133994 1131095
9163 1131095 1116417 1077602 1056624 1003023 985522 996587 1112189 1120513 1073284 1007522 989181
9152 989181 974612 1059536 1108106 1192576 1172190 1070707 1031471 1045178 1022406 996197 1047676
9141 1047676 1104321 1073678 1018185 970772 874194 773044 855790 853148 891108 960790 875968
9130 875968 861642 852556 766541 776995 755512 697551 868830 910711 834644 693173 709126
9119 709126 784334 791385 826369 864021 840439 796760 805083 844620 838328 708467 587594 589109
9107 589109 648231 623145 624904 669251 573041 538852 538894 528552 516071 536144 611258 748578
9095 748578 781629 712743 664755 571336 452284 446088 478402 503104 542855 595786 657703 572257
9083 572257 520654 529008 455232 413487 368071 450213 453433 529503 548004 535768 541357 495207
9071 495207 329640 223340 230523 262186 322439 411168 567282 549705 522461 532140 461069
9060 461069 367067 437584 552590 530075 483904 351370 377539 407907 452768 400753 352041
9049 352041 337991 440864 503567 432437 461416 490805 474786 475222 449551 446620 381122 414211
9037 414211 529261 544815 513152 426937 357921 371606 473968 518784 530039 584121 551307
9026 551307 448608 339299 311622 335903 380765 447492 522171 553498 492571 292109 221527
9015 221527 208600 259913 290589 333889 393411 350563 383482 381021 316363 297552 375492 412500
9003 412500 373303 416014 348110 255410 144519 196099 211550 125181 102595 55127 49986 74026
8991 74026 206305 316047 334599 321150 319917 412587 414651 471667 434383 377758 323918 340527
8979 340527 210490 210906 280387 361798 435104 331414 224078 113869 179676 103767 119317
8968 119317 238696 242219 128967 93596 154197 196864 276512 266765 303540 387336 295917 309175
8956 309175 329381 269360 199177 229584 255682 300845 324270 271711 242033 215062 57033
8945 57033 -25629 -969 38437 149135 122824 87068 199870 218767 153225 134700 152609
8934 152609 85278 179297 204318 186178 139048 166299 131479 63306 42502 68635 62867 186397
8922 186397 242982 159324 120255 141354 175424 178229 265754 262328 273513 275594 327907 416143
8910 416143 435566 291908 192613 204195 133729 138831 198651 189967 215354 204174 193597 291372
8898 291372 332475 330067 304755 247854 281074 332469 301774 342126 373600 330349 213739 233871
8886 233871 325536 295624 209594 243556 309520 398757 340902 277148 217613 192552 166124 230624
8874 230624 163597 141318 113609 227090 294981 292240 313503 438729 569972 594745 527122
8863 527122 422732 335852 235616 283568 302344 343253 346144 291111 201680 218144 232490
8852 232490 212481 162953 125510 80737 9536 7035 4174 39115 82293 43574 97140 107627
8840 107627 183386 202916 224528 203343 147797 62086 81073 81051 75573 137723 94642 44906
8828 44906 96072 119260 6052 -71521 80019 100564 32519 57850 -53162 -30982 46283
8817 46283 33375 11683 122120 97200 53767 102650 56362 26800 25892 132184 177632 267807
8805 267807 334737 302605 154985 108212 95618 52842 100431 127867 83376 50762 162881
8794 162881 205868 161477 131175 -19531 93407 155118 -5918 -17796 41799 63694 24193
8783 24193 -1651 4213 96127 78561 35318 2330 10132 3794 42555 83790 125330 206950
8771 206950 304949 279439 136289 86960 106790 145129 91109 -9861 -63932 -60636 -18574
8760 -18574 80925 149761 72639 -20345 -103839 -125903 -68304 -45982 -131490 -84144 39738 214906
8748 214906 329988 331345 330571 313780 160022 90227 175075 126094 100031 79764 138877 183338
8736 183338 100533 68017 151674 103582 58491 102748 120924 144395 147915 56448 -69188 -48929
8724 -48929 1177 29751 104242 36316 40791 834 -74098 -72549 10048 -7996 -69353 -202618
8712 -202618 -238404 -66272 35241 136426 256049 328276 135453 84101 -7485 34392 87983
8701 87983 42414 53061 17505 -15510 -78048 -61755 -21652 -34844 -59700 -55352 -169237 -151200
8689 -151200 -73739 31918 36921 42456 109717 90625 77047 -11299 -79906 -97752 -96073 -84372
8677 -84372 -91141 57128 67307 43314 33052 120384 181441 219977 197633 205022 220833 124665
8665 124665 182345 140143 155912 265252 351623 299276 180692 131400 264845 405979 288973
8654 288973 224456 215264 72240 24614 65227 110364 137946 172214 149530 26168 3437
8643 3437 67120 107545 119210 149876 107641 57617 25881 -30337 -11446 19707 42233 33592
8631 33592 -109 63203 222472 267261 256219 194957 240827 253597 161592 99575 77131 182469
8619 182469 145617 60998 97715 209619 294647 297913 282591 283636 216004 134134 133292 64937
8607 64937 21139 24682 19545 -834 -71215 -11376 104906 85545 148746 169936 136551 222583
8595 222583 377380 442179 334569 287107 288013 329570 361583 319561 316355 438912 457067 400617
8583 400617 411360 353003 276605 212862 213052 168923 75906 42101 52606 159493 218834 322827
8571 322827 401836 382260 419009 441919 374470 288805 173040 106040 87518 152631 212702
8560 212702 227858 144843 64895 -37892 -12139 99627 226179 317316 323654 206530 129610
8549 129610 91448 143351 170466 131680 177100 201615 93335 112099 128326 70006 -22329
8538 -22329 -14567 -31849 101505 119968 93171 94760 193642 157612 93006 81043 98646 43301
8526 43301 33070 40349 88538 127160 105717 59943 119329 117033 189244 244441 272379 255485
8514 255485 206170 53669 65513 62987 57081 48225 98756 87784 59428 132859 128371 127011
8502 127011 24839 5125 11553 52075 86277 -13170 3326 -18311 -33685 2204 8523 -39037
8490 -39037 -22874 -69467 -25462 142997 179106 226698 190723 215340 125430 97419 93701 54824
8478 54824 -12913 -114015 -52303 73167 25398 77767 221996 336367 294998 227807 200281
8467 200281 86637 -2930 -57634 -50626 20322 140182 171440 282039 304154 273053 130217
8456 130217 120808 122581 61383 -16359 -24520 24897 34016 119399 181455 181672 239868 246884 193875
8443 193875 168855 99381 75786 95651 121037 204846 266450 184038 -3743 -34818 -7033
8432 -7033 3969 2162 150853 186580 137516 94587 156599 226334 140754 85002 78118 44631
8420 44631 104398 124500 107881 -17650 44531 183529 179984 120164 149367 117108 112746 65997
8408 65997 -23523 -42152 27464 140744 132918 158795 64878 14146 -7320 -31702 -95179 -191648
8396 -191648 -175229 -105885 5191 98965 125884 25874 64023 41129 -5971 -14680 -39551
8385 -39551 20048 -61196 -95433 -134722 -84990 87301 166079 97503 5071 -86291 -92964 35141
8373 35141 199192 277935 227714 137240 109886 91493 77476 89738 81138 -62696 -20211 94410
8361 94410 102247 -49140 -191835 -167578 -68447 44956 81334 168380 96248 106430 37911
8350 37911 -78171 -157711 -58466 38322 69820 80337 25474 -25227 -72856 -108707 49166
8339 49166 154394 85918 25042 96102 81197 60728 -3503 -134851 -182027 -113289 -62625
8328 -62625 -45200 -123187 -82303 -106611 -137198 -214513 -298537 -175247 -62374 -15534 -19191 -78546
8316 -78546 -42970 65332 71298 78320 -19897 15492 56046 44416 20861 -65849 -131726 -129427
8304 -129427 -28964 26225 -48099 -26243 7839 -902 15011 22666 59832 138790 173834 147744
8292 147744 128557 83362 35487 63261 114876 91519 20248 389 -24701 -8861 34936 100423
8280 100423 111830 157446 76357 -38290 -51042 -15685 49096 13451 -43326 -59293 -115147
8269 -115147 -126379 -55220 -4493 -37621 22425 -5358 -37441 -23758 77206 119880 -8402
8258 -8402 -24839 42825 -34553 -88136 -96639 -132497 -135980 1209 176644 154712 53694 31593
8246 31593 43370 -77626 -82840 -125397 -187080 -168432 -166185 -200124 -205769 -211462 -114672 16874
8234 16874 -45323 -70896 -119608 -32824 -195270 -146508 -53088 -43807 42112 -16166 5713 29333
8222 29333 -12365 -5980 34984 8096 -78956 -3879 43619 -22922 -35258 -446 35567 65927
8210 65927 120069 41058 -27884 -57246 -22101 146166 233779 49661 -63492 -69561 -99473
8199 -99473 -8005 130858 110688 93555 92683 126793 83668 37151 -102383 -204341 -163753 27703
8187 27703 -91117 -105785 21987 240510 221606 141912 69232 97366 85858 4345 47952
8176 47952 -46491 -27841 41369 124754 43988 -19246 10056 16145 103491 134783 163345 174840
8164 174840 75211 -54608 -53112 11647 51643 80682 159354 14945 -87355 -23964 116294
8153 116294 141415 44507 -21186 52143 169802 179887 149578 98169 52183 -86664 -60626
8142 -60626 -78512 -82587 -123359 -7734 6283 -26128 -88690 -67370 -52904 -15700 -31255 -153718
8130 -153718 -137733 3670 46829 20945 94797 120682 140154 201771 151260 112506 112435 44574
8118 44574 8683 -43627 -24645 -74358 -59415 -86469 -51126 8957 9244 -73062 -16500 96838
8106 96838 187070 123860 111528 122021 44985 28638 75520 102411 143444 89425 49448 35567
8094 35567 43696 -44800 -60197 -11076 62204 95475 164796 204248 180895 155211 245305 234117
8082 234117 188046 257069 105372 75084 49255 4302 -48380 3721 150501 231558 271453
8071 271453 223779 110501 80963 139951 32429 -166152 -116861 -137207 -107935 35340 74270
8060 74270 200802 76388 38620 9850 -56043 35719 118300 164093 172773 153771 90318 38433
8048 38433 -2717 -21785 -44688 -20867 -9619 -100703 -64948 -48108 -100921 -131947 -70476 32201
8036 32201 -66844 -19736 3777 -69774 -32593 -51289 -11004 -23393 -25141 21408 38608 29012
8024 29012 -61309 -31211 36012 89834 106178 76633 28404 45974 92235 57507 39914 -18087
8012 -18087 -133136 -102104 -90050 -114387 -72189 -83923 -93331 69330 130164 30286 -33860 3466
8000 3466 -2012 -63588 -50090 31242 13097 11372 91638 98139 88992 37602 8192 35557 -34990
7987 -34990 -86089 -133537 -33447 63757 26490 -196068 -187768 9892 140287 188736 104983
7976 104983 -51250 -111339 -18878 -56817 -64147 -102191 -82227 -86482 -749 62774 161933 248891
7964 248891 317908 229245 147716 75361 35015 -49142 7228 63858 110883 39047 -58098 -51562
7952 -51562 -52796 -51170 -77520 -196852 -179655 -178528 -143489 -83594 64374 156905 105489 97911
7940 97911 60399 -19706 -19705 32265 30867 62211 22566 30220 -21178 -106294 -66502 -61289 40829
7927 40829 98397 -15767 34257 56997 24595 55006 131994 86468 101146 180873 209233 114951
7915 114951 77382 67382 18409 -68445 -86712 42123 38229 62587 87508 142636 185167 53705
7903 53705 -99888 -125641 -159975 -146729 -228922 -151680 -34452 37109 22992 55593 -11930
7892 -11930 -54811 -44239 -56862 -12430 91273 -5428 -33973 -26359 -29496 -28029 -936 51483
7880 51483 41397 -42189 -43603 -72477 -143831 -142639 -71017 -21702 71346 77823 27964 9640
7868 9640 28612 16603 -73598 -91440 -59582 -30744 -29108 -34019 33816 57841 -33174 -36019 -33279
7855 -33279 45915 31468 -8803 30115 136986 118549 -2532 -52923 -13568 -27058 -52080
7844 -52080 -52816 8435 67238 20563 -22875 -48485 -36359 43388 1801 -16355 -3381 -63993
7832 -63993 24836 65140 96828 70646 30538 2766 -114313 -180289 -170718 -122494 -51369 14932
7820 14932 56833 64417 34676 97618 84254 23952 -13089 -40936 40805 55191 125784 88924
7808 88924 14643 36819 90150 126750 128579 104926 85170 99529 44409 23934 71952 56579
7796 56579 -79824 -74333 -10858 39060 45580 -16193 42402 104806 34085 -52444 -32764 -1764
7784 -1764 14115 16272 -69260 -70349 -44395 -62295 -50112 65732 161856 155903 129385 124753 77455
7771 77455 15571 -24371 -20643 -26223 9820 -23730 48236 83604 61226 49293 27581 43988
7759 43988 27940 -1864 -61519 -98580 -110926 -52947 -39717 28017 14862 -57168 -58881 50298
7747 50298 73853 159636 153083 28114 9528 13379 18986 -76410 -182834 -204323 -118290 -79879
7735 -79879 -66226 -9439 61046 -15906 -22648 10339 63476 51303 132462 180168 105338 72064
7723 72064 133291 186607 139698 65407 -28294 -142048 -180004 -98258 -130370 -152166 -89612 -14817
7711 -14817 -91798 -84905 37720 49166 -22184 -150571 -216305 -162691 -67728 13157 10463 16125
7699 16125 13661 48672 141252 171949 132121 54129 83000 59092 -36671 -160585 -262648 -231741
7687 -231741 -85516 100182 70520 -58616 -111208 -19556 -8254 -35137 -88426 -112709 -3084
7676 -3084 38092 42314 34992 117126 155106 94089 53696 43570 13382 -42249 -138181 -173782
7664 -173782 -62576 -55678 -42366 61036 90672 78778 4869 -16323 38230 117429 26169
7653 26169 -93028 -113866 -97027 -67885 -53575 -112322 -173619 -102826 -64631 -31742 59938 65512
7641 65512 57307 37201 52816 24675 246 28889 -45947 -72831 -71370 -90358 -64486 -53072
7629 -53072 4558 57377 39020 -9586 -111296 -180452 -159944 -127749 -49082 -103481 -97038 40835
7617 40835 135402 66560 -95064 -104489 -119083 -286750 -292371 -67935 107972 64498 26945
7606 26945 78006 6152 -43000 3957 -36917 -88514 -172733 -171517 -105723 9260 -14282 -27834
7594 -27834 -43943 -105390 -91863 -30603 -18703 49801 89669 126177 38787 115939 242374 119432
7582 119432 48005 49945 29737 68945 164047 118196 31195 67085 3118 -34427 2131 101643
7570 101643 65975 -79567 -147041 -145244 -94010 -55802 -768 39057 38387 74702 28500 -2773
7558 -2773 52790 12480 -7746 -45463 -9568 54278 143010 228084 236677 126039 75223 28880
7546 28880 59549 3429 -16032 -1734 5255 48983 79022 59324 47495 -33300 -6155 -27354
7534 -27354 -68059 140869 199384 212349 102485 92798 70031 40161 -47438 -188666 -207937
7523 -207937 -115936 58367 100658 47402 64305 84813 -12432 -29722 31305 46119 39095 -13316
7511 -13316 44169 103425 190053 172357 99947 46771 -63718 -163031 -202382 -166060 -162762 -231364
7499 -231364 -144523 -97382 4781 79858 1365 -91321 -103929 10913 47122 68664 177340
7488 177340 210828 76021 63056 50830 -71297 -101496 -37949 10749 -943 -12981 42294
7477 42294 -3832 -128668 -156252 -183236 -128331 -90177 -96193 -148305 -249631 -245576 -122793 -75127
7465 -75127 -94751 -52523 -61444 -51471 -40212 17174 -42747 -82407 -7941 65973 65571 42689 -29007
7452 -29007 -159044 -233543 -207099 -185488 -199776 -147088 -199645 -110380 -83692 -7510 45242 -12038
7440 -12038 -50049 -9181 -1181 -49166 -14091 34042 46714 34495 -62263 -126454 -130241 -169912
7428 -169912 -98116 -43225 38130 -64852 -150052 -223377 -250922 -233725 -58799 -18205 90328
7417 90328 148728 78281 23846 132850 207861 112858 -9115 -20203 -43673 -79077 -164097
7406 -164097 -119442 -104736 -152327 -216415 -173747 -123250 -92194 -159910 -172565 -189489 -135433 29201
7394 29201 57281 -38492 -93406 -92372 -88789 -105358 -51624 -67776 -67034 2708 71852 123303 85148
7381 85148 99517 107382 156482 136292 136520 105142 7435 12798 38316 -11440 -180493 -124690
7369 -124690 10205 7422 41267 54359 4453 -12212 -30737 -9166 25657 12762 -47560 -55635
7357 -55635 -13644 -13146 1814 49683 89147 29608 -117552 -125699 -111816 -151548 -94676 -53526
7345 -53526 -104011 -64372 -47053 -39735 48973 -22204 -90523 -80363 -101939 -22806 49793 144337
7333 144337 103535 110128 33560 -66666 -15448 -62762 -197547 -206045 -223884 -193936 -61264
7322 -61264 31084 141626 169113 94517 49507 15602 42617 128087 164547 138528 94019 69855
7310 69855 56829 -106482 -62035 -164623 -151112 30868 43067 9422 -40968 -125879 -25446
7299 -25446 25194 -66385 -154786 -162004 -156774 -130544 -142751 -118638 -159539 -153463 -101901 20579
7287 20579 102405 -26565 -20870 50497 87679 105329 68589 28146 4499 68515 82116 48399
7275 48399 53102 -17909 35473 139513 127507 61162 -55460 -196789 -119500 -112587 -151738 -230741
7263 -230741 -263549 -159372 -83061 -129567 -27669 -61402 -133886 -103277 -131904 -105715 -48900
7252 -48900 -47650 -23866 46357 -31574 -52709 -5428 -88510 -67927 -20949 -15242 -15337 -48773 -110908
7239 -110908 -244265 -261030 -205478 -208708 -144024 -92212 -62132 -67423 -26296 -32126 34819 106430
7227 106430 91675 91544 100532 142752 133982 64745 -7188 18478 20531 -44510 -74533 -21549 16863
7214 16863 2725 -97385 -73952 37086 135240 -8068 -56935 -69472 3005 98646 65602
7203 65602 87818 107217 91563 26241 -91198 -134713 -36109 -9617 -129282 -243294 -304830
7192 -304830 -205788 -187159 -188787 -158620 -193245 -178085 -22615 -3620 -8151 -478 40740 -61797
7180 -61797 -127533 -67270 27193 55336 117117 58612 -117653 -203834 -138044 -68957 -131171 -156262
7168 -156262 -21545 -58223 -75625 23388 112021 43844 88219 159939 194235 124704 67461
7157 67461 17391 -32381 -108383 -91513 -83054 -21247 -35156 -162995 -276233 -245520 -45854
7146 -45854 83867 57233 29675 30028 49608 61850 31988 97101 19088 -80688 -36272 -35004
7134 -35004 30888 -6646 -110100 -62585 -50539 17653 38223 -119009 -160999 -106665 -135658
7123 -135658 -113820 26870 8144 -34531 -80418 -131509 -159846 -64148 -52882 -207431 -219903
7112 -219903 -155901 -120792 -150134 -202791 -96508 -97274 -79460 -55973 -139512 -110810 38047 132212
7100 132212 126798 86480 45400 23142 -20290 -18030 30335 -79180 -131062 -91549 19150 37893
7088 37893 93521 117108 169594 140067 41873 -46585 -36633 -74186 -1982 -37412 -80544 -57552
7076 -57552 47886 180389 14765 -151046 -151937 -99751 -16244 68625 121797 4497 -17919
7065 -17919 55817 70217 94450 104118 -6870 98850 67021 -70508 -81415 25523 -53824
7054 -53824 -83204 -23939 -75987 -103321 -52250 -82243 -31788 -47706 -55404 -89941 -47027 67803
7042 67803 104613 33239 996 94533 134509 150279 146822 112394 74265 155800 -15971 -104918
7030 -104918 -4722 31222 85359 96595 -5507 63159 73860 37067 -51979 -100250 -95982
7019 -95982 -138168 -21039 -22734 34732 93496 71547 -31567 60042 66558 75244 42868 125618
7007 125618 149756 -68703 -122713 -115256 -91692 -82162 -126070 -182947 -156849 -177115 -149173 -103473
6995 -103473 -39330 55637 120953 41400 -26297 -75165 -23290 -84404 -126568 -70386 -97470 -159845
6983 -159845 -111955 -27826 -91868 -165902 -94120 -107338 -96992 -80989 -41714 -86903 -176942 -192579
6971 -192579 -135866 -133464 -115585 -235118 -285179 -202427 -197252 -185451 -155566 -126175 -97460 -57215
6959 -57215 -68348 -35168 -125077 -202201 -144536 -5670 -64034 -42126 -131627 -136301 -119595 -86838
6947 -86838 -16843 49253 -101899 -173973 -224738 -221448 -83389 -74259 -168768 -178075 -182686 -142464
6935 -142464 -38097 -110630 -112825 -65302 647 -40473 -53582 -144588 -192999 -236182 -238361 -92845
6923 -92845 17726 26418 -6835 -24191 5423 -82458 -40622 -12486 90771 125950 9896
6912 9896 -39150 -77546 -162213 -165496 -240530 -232125 -239629 -119501 -56662 -45410 2435 23400
6900 23400 -50916 -72178 -102902 -180823 -215270 -139199 -61116 -35748 -5353 19083 47734 89876
6888 89876 157100 131223 69623 21637 124303 155715 111473 122537 118712 -17004 -93404 -87168
6876 -87168 -49192 -27767 30894 35409 -40082 -50061 -104017 -106742 -105055 -45446 61659 88687
6864 88687 98758 60571 4426 46197 6799 -17263 127556 46532 -3962 29644 -2343 24529
6852 24529 33964 15992 58697 64491 73852 -46655 -110759 -41949 51287 113293 85108 77093
6840 77093 3648 -67167 -18827 -117516 -149634 -130856 24318 39439 -78926 -96302 -51655
6829 -51655 13156 25986 -64358 -132551 -145837 -182006 -73927 400 47165 28838 49760 -48533
6817 -48533 -120830 -51795 34364 14883 -28498 -69751 -208835 -219872 -154941 -71441 -59964 40975
6805 40975 143988 27153 -20046 -5165 82390 -16712 -174132 -217850 -217604 -120742 31867
6794 31867 74460 50433 -54749 -187708 -222787 -237078 -201417 -167577 -272919 -271388 -192848
6783 -192848 -215777 -185271 -87632 -64665 -66041 56971 181819 261350 214508 94726 102897
6772 102897 47842 63089 60938 -12681 -85676 -15079 -15857 -55438 -109145 -86768 -34893 -124798
6760 -124798 -118562 -69269 38736 73029 30392 34146 -41592 -78791 -49427 -46027 -79493 -107393
6748 -107393 -115300 -43127 62324 41674 37498 156933 152569 -5315 28490 150405 156027 119344
6736 119344 38629 -18213 34058 37106 108712 57586 37934 16884 84638 203161 258572 177890
6724 177890 185138 224427 276824 305560 494133 624954 641957 682539 801479 930827 1046800
6713 1046800 1165893 1250359 1277068 1022139 730068 545671 399542 266551 245089 270050
6703 270050 152611 110873 68279 118469 115449 203895 169189 49728 51827 182283 206248
6692 206248 223239 216512 141579 78830 105685 191142 216117 262551 215811 170533 75835 33764
6680 33764 62877 29824 52691 8933 -19151 95489 98775 71308 -15100 24920 23068 -15877
6668 -15877 -50832 -53690 1947 112409 91238 21375 -13280 -60239 -120262 -32115 116164 164263
6656 164263 81255 -2992 -120798 -59906 21102 15544 65118 56903 7123 -48454 -18438 -190
6644 -190 59675 84210 32788 43060 -11657 -18915 16853 150816 156526 34729 -68603 68070
6632 68070 71434 -16635 -47038 -107158 -65357 38244 149349 149890 66338 123871 99534 42665
6620 42665 9553 -42677 -12257 65059 1672 -36919 -34809 19547 87023 53976 65183 -22833
6608 -22833 -27864 -8891 -146311 -148481 -121531 -104957 -6232 -114869 -170269 -220349 -146253 -109393
6596 -109393 -65318 -29056 101249 92416 -3794 55131 76930 13261 8385 -107154 -136712 -138792
6584 -138792 -139015 -146329 -153412 -122054 -50441 -86764 -151096 -186914 -150492 -59360 -12010 -11221 -100719
6571 -100719 -100739 80269 148286 220358 152391 26028 42401 123715 173757 114125 -18891 -130329
6559 -130329 -148145 -103366 -49976 -68775 -84972 -78225 -17301 -43454 -49365 -57199 -74026 -40595
6547 -40595 53729 38825 38735 29464 37160 -10393 -17393 -37794 -43669 60716 59991 1291 25754
6534 25754 159793 161266 156395 113154 133846 160099 127707 67354 -38759 -40868 -40466 -55607
6522 -55607 -21898 -53132 -72075 -49716 -65794 -256324 -269337 -198657 -50821 -18086 -67324
6511 -67324 -91029 -145894 -103073 -94851 -81426 -38217 58014 -8384 -84540 -81079 -98323 -67469
6499 -67469 -55552 -87136 -152841 -113136 -48263 88045 136445 42558 -91968 -155113 -198460
6488 -198460 -176935 -195491 -281145 -301283 -250252 -106309 -46612 -43954 -53086 80110 122935 98173
6476 98173 140895 79948 19336 -61784 -76447 -111680 -26268 7263 -20837 50568 -29510 44281
6464 44281 127721 -5880 -7636 -13597 -21085 -5247 20922 -27684 -37037 21465 78810 110067
6452 110067 -2168 -208894 -219377 -122663 -97373 -59756 -69005 -24517 -48175 -12707 63765
6441 63765 64463 -92369 -130821 -76470 -66062 -121202 -6951 113536 97754 46375 -69148
6430 -69148 -3990 -15093 -55304 -74950 -78416 9001 66450 122243 106140 42983 16434 109193
6418 109193 205964 236610 227235 245710 146731 68068 11672 2234 60575 148901 226500 121736
6406 121736 115902 50218 -23766 -10853 -29337 19966 99186 206419 109379 52946 96059 -42701
6394 -42701 -86816 -90526 -91810 -31345 104759 143992 47340 -52529 12252 -33608 -79348 64550
6382 64550 120205 138213 202842 132535 -96062 -151180 -98845 -90523 -63950 -269 -15400 -41341
6370 -41341 -72493 -66107 -152527 -102621 -38730 59557 135278 105713 64091 49877 84612 95142
6358 95142 89448 -32734 -127406 -74409 -33273 11990 108616 82725 10815 20360 88480 72323
6346 72323 36414 42674 10147 79448 103106 1829 -26116 -28710 -49665 -82000 -77213 -70882
6334 -70882 -18653 -79389 -171093 -206578 -183574 -4831 -36470 -26313 -74025 -1360 98474 72114
6322 72114 -85919 -31807 90697 58625 100101 113397 90040 -11706 -100501 -135600 -154137
6311 -154137 -163527 -128893 -116695 -193989 -190614 -199219 -291986 -349864 -362730 -347716 -293749 -296506
6299 -296506 -274985 -150054 -136137 -154616 -64542 54494 -9327 -3474 36860 -34327 -112308
6288 -112308 -183278 -196057 -156580 -106015 -78131 -98283 17322 129306 48681 77676 58917
6277 58917 17290 -76279 -175668 -205793 -106305 -52422 -58533 -115799 -77311 -168777 -121111 -126776
6265 -126776 -109441 -50531 -1640 84410 82189 8106 -34470 -14158 29259 19612 65488 145748
6253 145748 33712 -65406 -18596 -50207 502 52229 -57256 -116382 -84865 -21208 49731
6242 49731 25150 -14897 -42501 17902 94126 136177 24807 -95357 -102392 -167801 -34811
6231 -34811 66832 71985 6422 -50964 -112305 -179692 -243993 -255625 -140030 -117787 -112959 -94652
6219 -94652 -158995 -151255 -109350 -87520 -27731 57465 71286 91908 15544 45029 125844 124898
6207 124898 84272 21089 44230 -3896 -132538 -144197 -150171 -139048 50442 105805 -52454
6196 -52454 -145829 -147590 -177787 -109697 37248 74674 24929 13889 62784 66143 121502 31400
6184 31400 -26101 -145661 -151560 19322 88429 146441 97217 138908 161665 38774 -32489
6173 -32489 -84396 -65616 -110030 -88564 -59032 -61732 -134290 -223853 -256643 -263454 -149884 -110459
6161 -110459 -57852 -101207 -166843 -126751 -149237 -79923 -49990 27070 -42332 -23927 -52317 -56031
6149 -56031 7562 71375 126168 175007 105440 13571 -71070 -70699 -32814 24684 -41059 -32853
6137 -32853 -88122 -74577 -20123 -17665 -90022 -96437 -15553 -118297 -211686 -156310 -88871 -32018
6125 -32018 -29100 66142 115638 76254 32544 5658 129379 193069 140308 86891 25011 -8975
6113 -8975 -73676 -65875 20977 109689 111098 133088 47522 -96251 -56352 -97188 -92251 -65362
6101 -65362 -105572 -91171 -29237 51091 105109 83703 45974 104650 50223 42916 1313 -10072
6089 -10072 -66029 -30726 -44156 37781 91564 171794 170520 198586 29021 -138280 -222179 -280822
6077 -280822 -338513 -222490 -160802 -139791 -88474 -26767 85600 32816 -87531 -53404 -112370
6066 -112370 -92258 -22781 46391 80008 175558 140564 21626 -119450 -35168 42925 16594
6055 16594 -1760 14662 1028 19923 990 -120565 -120386 -48471 -3284 22184 -15946 -46676
6043 -46676 28101 41179 48716 1128 -37253 16431 38647 -34418 -153327 -160407 -249061 -242028
6031 -242028 -97817 -137973 -175736 -66483 -17503 -45430 48044 218606 278140 196227 117117
6020 117117 136632 126943 26259 -21388 16292 3038 -83766 -65566 -53668 -160027 -155925 -108617
6008 -108617 -61114 -76008 -121011 -114821 -114148 -140857 -224574 -198861 -122274 -101875 -51846 4810
5996 4810 18556 47541 -10842 8670 94892 38902 -3936 -27788 56727 61582 -68772 -281601
5984 -281601 -233025 -16990 10641 -160908 -209647 -145855 -224344 -117533 13864 114183 51298
5973 51298 -10834 60627 92670 52199 5391 2785 -46751 -162666 -213444 -209936 -145765 54288
5961 54288 -7413 -148616 -181295 -114785 -46851 -17034 14629 -15450 -95106 -120093 -94561 -170748
5949 -170748 -173214 -94351 -34255 -6505 34168 24635 -80353 -124569 -189294 -163289 -37020 -33870
5937 -33870 -44433 -83697 -87652 22548 86650 7642 -14882 -120764 -144269 -110275 -71520 -73086
5925 -73086 -65045 -54053 -169171 -152501 -165967 -213603 -188483 -141973 -23579 73792 23075 27395
5913 27395 -29627 -70099 -57140 65052 167332 94544 62794 538 15079 -67079 -123858
5902 -123858 -104538 -10203 2752 13891 89457 23259 -81311 -88427 -47293 -30866 -143577
5891 -143577 -177786 -221105 -180540 -84984 -53658 -8342 15500 -18094 -50933 -58000 -44894 -49568
5879 -49568 -16235 -7435 40744 100854 78280 73485 -14122 -20421 12175 35454 23008 -12179
5867 -12179 -94365 -24152 27057 -3088 -49572 -30961 -9392 74430 75200 24901 -58191 -172427
5855 -172427 -154155 -60150 -60428 -67598 -25752 -66787 -30342 -4760 -86169 -104587 -92573 -114800
5843 -114800 -125514 -138309 -135212 -77665 -135068 -54895 25871 55068 34064 0 28057 165236
5831 165236 160628 33171 87983 168251 66173 20182 72957 4214 -9671 69757 60240 106248
5819 106248 145667 117357 46801 24842 16798 -103685 -170973 -192845 -174536 -86852 10763 100451
5807 100451 -5703 -30928 9055 -14621 -6022 -2992 -30928 52101 137112 156045 58366 21440
5795 21440 88067 154736 98623 2984 -76501 -121546 -92224 -109335 -121662 -143518 -67635 49088
5783 49088 70480 112681 191296 188024 216027 159484 75361 60324 131938 147713 90248 118434
5771 118434 255167 196367 72430 94327 56402 -2830 31208 27067 -71236 -141648 -73373
5760 -73373 -46942 -59605 -23927 -1573 46809 89049 115366 7080 14976 68588 41991 6251
5748 6251 66079 -54278 -33359 23569 -10748 -54043 16187 63403 -17450 -58262 -23031 -71296
5736 -71296 18612 56332 -6588 31867 2102 -69480 -127516 -175647 30467 57399 25201 29065
5724 29065 17280 61613 44228 -24252 16361 35685 58829 38199 -20478 -93021 -120897 -133843
5712 -133843 -77145 54399 43989 -4488 -38666 -136911 -180538 -56552 70069 95519 124530
5701 124530 210906 238270 128651 78295 -16644 -101613 -131064 -126464 -59366 -33677 -53137 -31262
5689 -31262 -49519 31139 26898 6867 37229 60157 4303 69773 106227 102543 123077 151158
5677 151158 174297 121586 96186 86662 -13159 9070 -27237 -85970 -41263 27386 76925 149579
5665 149579 9107 -105609 -89590 -42590 80532 41947 19953 -7298 -53176 -37257 -91556
5654 -91556 -139719 -137208 -82345 -73889 53352 72057 -109316 -80528 -61451 -83365 -90382 2043
5642 2043 54841 8013 -41640 -134214 -139842 -61218 -27640 -34546 -11925 11054 92066 183419
5630 183419 31449 -107277 -77559 58258 71412 81626 -49737 -191137 -157794 -151851 -194570
5619 -194570 -164144 -22615 96562 208747 165842 96703 -80925 -254141 -268441 -279530 -214862
5608 -214862 -16451 46674 -143155 -166522 -109079 -50717 -58052 83795 152304 156401 131241
5597 131241 155027 144878 103150 10263 -116299 -12986 59474 4317 81612 66007 85194
5586 85194 914 -115116 -188445 -200585 -103306 -56109 -12152 -33607 -128820 -226690 -140291 37481
5574 37481 178335 81882 37804 -21219 -80406 -80393 -169770 -176870 -111692 -38978 -14220 -56462
5562 -56462 -14677 -85294 -172334 -151177 -128056 -103513 -48975 -30411 76119 -20432 -84063 -163282
5550 -163282 -205428 -167531 -14373 25762 -91517 -45635 -121283 -158321 -172320 -213590 -124777
5539 -124777 -87121 -9274 -13762 -11442 93200 68959 95266 138517 117496 157733 123542 85990
5527 85990 35900 114672 19000 -101482 -92652 -92186 -68343 -71995 -198481 -219548 -143186 -88286
5515 -88286 -91729 -150581 -111216 -53868 -83986 -120453 -117658 -24157 -51036 -184662 -67578 -79503
5503 -79503 -76511 -72479 -61557 -47548 -7599 -5409 -10483 -16615 -11083 -14671 -17845 -28074 -193633
5490 -193633 -253038 -110232 46963 55868 -64638 -126903 1524 117341 61112 72917 44266
5479 44266 91877 143790 139669 189493 313599 363021 292310 281570 249006 115417 6584
5468 6584 -85811 -49161 -2730 -67577 -85987 -118596 -53181 -25717 -133819 -153105 -186636 -234810
5456 -234810 -157077 -29993 -14298 75877 -43952 -186669 -177439 -108836 -97991 -21067 -33828
5445 -33828 -45115 -121340 -200902 -163594 -33330 -6584 -106117 -45042 30284 -90287 -207772
5434 -207772 -152432 -45181 99593 55034 -2533 -28971 -19173 114235 131391 75622 78422
5423 78422 847 -35269 -77645 -88601 -180731 -274344 -229230 -168902 -225562 -255022 -239411 -271767
5411 -271767 -267329 -324235 -287050 -136620 -17870 116692 92081 -5509 43379 30290 -38404
5400 -38404 -59966 -101489 -75664 -99654 -71125 -41454 -16576 6037 38684 25870 -42561 -45254
5388 -45254 72592 102114 89633 133742 134882 160151 154128 74107 40105 44580 92848 43983
5376 43983 42241 82615 -9364 -43292 -68574 -28368 -212238 -160458 -77579 24307 -45785 -84088
5364 -84088 -143438 -100472 -70185 55253 176464 90518 -4071 86634 107268 46942 26194
5353 26194 -42679 -120846 -58860 -33594 60252 106301 68603 -6484 -32280 -80239 -170223 -149250
5341 -149250 -93048 -60380 -49257 -31059 -3808 -11954 -6145 -34531 -24507 7521 -18946 50123
5329 50123 99501 61457 -17865 17722 36072 -25117 -25524 19524 22407 -46419 56304 166665
5317 166665 46821 -58055 102240 85151 -72410 -157167 -168388 -234149 -137726 -23790 8553
5306 8553 909 24576 1603 -87321 -132192 -53283 12533 12719 41528 9787 -1056 16263 -9400
5293 -9400 -97084 -85713 -133511 -121597 -34982 17195 -10303 43140 8989 -22823 19285 78535
5281 78535 91037 71356 28182 16739 46387 149448 197454 121377 24465 50583 94392 8675
5269 8675 31465 213607 211934 150738 145890 107142 47876 65708 -12047 -92110 75971 141216
5257 141216 100308 -17413 10482 -140385 -165068 -115296 -77218 -107174 -138989 -164062 -117714
5246 -117714 -184213 -131462 -90917 -48266 -50246 -97783 -29944 -64841 7330 130999 242476
5235 242476 127404 59596 -5034 -24006 47986 74234 8312 -106422 -245297 -300215 -238752
5224 -238752 -241773 -106864 -26054 -95482 -88150 -38010 45724 6173 124902 93321 -32656
5213 -32656 -124893 -110243 -117596 -85714 14518 10419 76806 117139 160275 140719 49795 -81132
5201 -81132 -147364 -158139 -248109 -132752 -60401 -14059 18689 -18380 20064 60161 16023 34570
5189 34570 57838 -49612 -5015 94040 51993 1879 54432 107231 193798 159977 85507 24734
5177 24734 14310 48318 27233 -35981 -62364 -19524 -55385 -65333 28963 83031 141887 108169
5165 108169 38956 -81763 -166876 -93349 -50778 -100002 -75510 -15895 -131803 -150076 -92243
5154 -92243 13284 -2513 21555 25790 83602 154977 57542 -25012 -22032 -97062 -71869 -142985
5142 -142985 -162946 -196194 -193620 -295728 -293388 -207616 -236047 -134640 -152539 -117789 -182924 -156919
5130 -156919 -163765 -132179 -86538 -34123 72347 100091 -21121 -6980 33216 77050 75095 -49435
5118 -49435 -27551 -14792 -94459 -76754 -82970 -103325 -81301 -106748 -88618 124062 126986 166888
5106 166888 194589 134692 -12042 -119802 -141390 -125776 -221761 -161373 -85445 -18579 33366
5095 33366 41642 48029 96333 89318 -37304 -113823 -36040 11888 73542 101203 68364 -1499
5083 -1499 -38219 -69946 -46100 43602 90641 29490 -87510 -58983 -64908 -7260 -40242 -45387
5071 -45387 -14265 -67462 -13499 -3074 78726 -31695 -164045 -137911 -43166 34487 -56940
5060 -56940 -126868 -206500 -197801 -92547 -23872 106241 131294 106543 171711 -27008 -80511
5049 -80511 -41814 -32111 76802 125730 154703 273985 208941 102070 100150 128954 16577
5038 16577 45312 24217 35645 -58315 -115938 -35942 -56399 -131804 -90179 -32726 -1036 -84039
5026 -84039 -109769 98243 192500 -22388 -29668 53999 120984 153814 96445 41614 -14068 -12713
5014 -12713 87760 93600 -83702 -94932 103561 41770 19196 52534 99926 59070 62579 -46082
5002 -46082 21183 35104 -23375 -7874 18293 -131442 -230507 -210848 -32973 107174 91715
4991 91715 -13141 -21525 -30955 -59944 -86052 -6945 12530 63736 205165 326428 230781 80192
4979 80192 72008 88837 171521 135877 59256 -91314 -197688 -171198 -100549 -81882 -178704 -298935
4967 -298935 -289846 -124847 -43714 61777 133994 100179 16899 -86186 -42261 -78784 -163531
4956 -163531 -181790 -171844 -155776 -260246 -164818 -3189 -35158 -79505 -69912 -246296 -331335
4945 -331335 -265828 -173365 -76767 -34211 -88646 20975 118094 87926 -9468 -40729 -63184
4934 -63184 -133759 -64853 34344 -18718 62524 78760 18257 19002 -80761 -191793 -179506 -123262
4922 -123262 -32131 86545 51365 75396 38519 12418 -37832 -51277 123436 151809 134077
4911 134077 45721 -14293 -78104 -115220 -107738 27201 27802 67421 133580 204356 138332 10693
4899 10693 -27649 11552 -39785 -6885 -18012 -18047 -30198 -79493 -136355 -165230 -127109 -2911
4887 -2911 133717 17931 -12896 90267 157856 98526 143420 86893 -2750 -29335 372
4876 372 -7804 -30699 -74591 -16037 -2062 -3488 -16659 -39571 -67627 24541 34645 -25936 -70409
4863 -70409 -160139 -149142 -52917 25570 19332 69172 41867 -15694 -102769 -32887 139084 198343
4851 198343 174958 62431 23517 -21400 -102683 -59112 -92020 -130534 -172443 -207462 -167004
4840 -167004 -149316 -106261 -61489 -49698 -10358 17938 -2763 -10807 16508 -32117 -34819 -19643
4828 -19643 -47709 -83284 -11350 -22012 -1674 28612 42511 -9498 -88779 -159967 -106326 -61263
4816 -61263 -37323 5447 -36432 -89997 -57714 -104642 -87993 -154719 -103937 -49275 16562 28333
4804 28333 30956 82291 109073 42615 28590 -80670 -96719 -59352 53185 60919 -17051 -124313
4792 -124313 -153011 -109335 -58015 -24142 57589 78863 54388 -32793 -22741 -37912 403 27334
4780 27334 -86326 -41334 -49765 -64704 -36149 -28135 4960 -58244 -39112 -36096 61589 240505
4768 240505 222179 24456 89357 103052 8291 32466 66921 -20208 -72615 -53673 -13909
4757 -13909 72276 45176 21718 -5551 -100879 -171586 -204554 -245791 -251122 -180832 -154118 -92694
4745 -92694 -22457 -31225 34602 61926 94369 91345 -28603 -246010 -324408 -274239 -180069 -46227
4733 -46227 -39340 -69235 -23596 -92795 -208152 -199277 -106110 -96842 -160644 -147683 63339 200662
4721 200662 157240 204405 75575 44924 22516 -44474 -135615 -136826 -87472 -111044 -80198 13462
4709 13462 37035 57569 88054 98734 54853 28185 52552 133491 100516 -12043 -51360 -36135
4697 -36135 22782 84535 73085 -83807 -114027 -104198 -67910 41787 107560 91002 -55580
4686 -55580 -69148 -15633 46391 75226 69689 193586 183497 64867 61387 67695 45798 48154
4674 48154 42890 -51218 -84308 -37918 -42579 -47803 303 -122204 -177406 -97649 -80962 -10488
4662 -10488 -80763 -130663 -186674 -304008 -326335 -260749 -214711 -195431 -125069 -536 14256
4651 14256 -26164 -107019 -94187 -102978 -149340 -94747 -66081 -168892 -182164 -178835 -160504 -190536
4639 -190536 -136367 -95842 -133185 -137992 -124652 -138188 -84609 -7841 79589 7364 -19583 -27218
4627 -27218 -79504 -59786 -23678 -4380 32934 -8482 -59256 -3329 27370 28756 100427 133983
4615 133983 14542 -1948 -65710 -45067 4077 -36181 -39476 34788 52336 51501 141569 124686
4603 124686 49064 -13275 -17438 -114920 21064 157028 10715 -90708 -78827 -61534 -116450
4592 -116450 -144657 -95488 -119051 -150709 -129863 -114172 -172967 -102394 -47947 -10853 34315 41839
4580 41839 140402 186856 217541 166944 139052 99252 64591 30104 -12193 18589 -16907 -35168
4568 -35168 -104310 -127196 -82253 -20172 -101448 -64446 -59474 -32438 26405 11093 -7893 -7516
4556 -7516 1912 26758 25380 31907 27924 33457 9769 -134674 -230907 -174878 -172977 -176759 -109535
4543 -109535 -21404 -28513 -82442 -57974 68970 18988 -45757 -1226 -2530 -16987 58109 30990
4531 30990 -105889 -188946 -199804 -105672 -101646 -107933 -64669 -2319 71009 -63595 -117337 81363
4519 81363 223682 249421 250635 223605 230936 186820 116706 43947 100254 19895 20603 65329
4507 65329 6238 57580 31521 -51127 4544 -50909 -49567 83581 175914 65955 8426 54910
4495 54910 136565 126369 -13215 -77183 23945 12429 -103640 -124972 -105271 -80926 -163559
4484 -163559 -169030 -119462 -84908 -50824 -99425 -139269 -46923 77638 83713 20852 -38351 -122619
4472 -122619 -231126 -213237 -101032 57941 164104 57218 -137601 -114874 -78533 -129695
4462 -129695 -55320 -4290 -21691 6049 49628 -7260 -69305 1555 62210 -12001 -60638 -12887
4450 -12887 58080 -9896 -156067 -164726 -68190 -119508 -87206 53010 32739 7663 28576 19956
4438 19956 -59480 -152288 -220082 -171605 -133556 -31655 -62039 -180244 -242269 -255568 -221778
4427 -221778 -58839 -56582 -73486 -83126 -62794 -69135 -19997 29539 83302 109097 61702 173660
4415 173660 289281 196357 45242 67598 67615 46259 -11693 1622 -29679 -102964 -136195 -188999
4403 -188999 -210272 -97587 -55041 -113417 -108312 8810 151204 105268 23427 22944 21232 -34085
4391 -34085 -71037 -108437 -109648 102452 110371 16270 -66302 6560 59590 102153 160938 106738
4379 106738 63835 24140 -14527 -18207 -60503 44204 134206 194084 173280 232302 295909 274719
4367 274719 190206 18461 -125736 -121972 -91756 -99456 -116773 -84651 -15814 -44631 -44881 26667
4355 26667 -90047 -105626 -19546 -94840 -197847 -216510 -285273 -309666 -216250 -139475 -59978
4344 -59978 -74838 -124091 -64814 20663 1321 -109984 -88322 -127675 -16540 -4848 2669 51384
4332 51384 1227 -28149 -33826 -36343 -178667 -205243 -158780 -269262 -210665 -143500 -50307 69273
4320 69273 70188 1267 -33446 23306 6882 -52101 -42962 -30741 29312 -106 -19838 -37418
4308 -37418 -44770 -38499 -91258 -8286 9347 -30734 100267 128822 106903 90734 144570 126789
4296 126789 9382 -35340 -33194 87114 51045 -37924 -131529 -170632 -152206 -30846 44775
4285 44775 -63068 -9734 -13461 56157 34128 -100409 -122696 -115931 -166099 -142066 -105615 -108847
4273 -108847 -49930 -9031 -109108 -40207 136673 150946 44008 -10870 43459 169406 102344
4262 102344 20792 75184 38440 22458 16101 32214 27390 135002 162171 152572 60827 98791
4250 98791 61340 -46986 -58205 -27060 -24886 42542 13686 -16751 -42356 -41400 18123 32799
4238 32799 25288 -9006 -82559 -127990 -55050 61654 19211 -33956 -121186 -170834 -16300 74357
4226 74357 106983 125722 144925 119935 82388 24694 -54378 -72448 -37669 -57555 -81372 -79270
4214 -79270 -153197 -151226 -191926 -261556 -198278 -127259 -92624 -60892 963 84141 241385 315605
4202 315605 164227 108608 31250 -16966 6351 140304 54028 21191 10623 -13006 -79084
4191 -79084 65170 157945 233501 147782 73460 -2954 -39371 -5695 -7352 77663 134754 135660
4179 135660 150033 256804 208276 94105 9128 -72175 -89864 -77168 -72814 -45875 -9483
4168 -9483 27438 -36218 -35827 -3040 37817 68510 -12512 25582 48353 -6500 -96426 1006
4156 1006 88479 180092 108500 -16327 -124214 -151596 25516 133281 218100 156081 81677
4145 81677 76996 136219 91576 7264 53041 132028 -32511 -84583 -60324 10886 96369 66539
4133 66539 37658 -86527 -206850 -216772 -238583 -290445 -314040 -179311 53140 39228 -67412
4122 -67412 -74877 -26540 39158 67680 164371 200767 96375 40774 36891 60259 93348 42919
4110 42919 78530 58063 8547 626 -60726 -52504 16203 49202 -33054 58005 45994 -15536
4098 -15536 52145 21491 7034 -47477 3181 35929 89404 81337 47152 48041 152035 158814
4086 158814 -17396 -147558 -95658 23525 78747 52639 24471 -19415 20410 22349 37200
4075 37200 -39012 -27019 -35807 15955 59197 22866 45483 18379 -87953 -154666 -69193 -6669
4063 -6669 -24752 31218 126155 115557 164335 190516 90155 102792 141122 113262 188609 54352
4051 54352 -70 12722 -45774 64936 17112 2529 82163 85253 24346 -65115 -42360 -13911
4039 -13911 -42093 -21458 -119464 -86903 -9083 4129 34178 110909 74031 79882 116718 79775
4027 79775 -14549 -70667 -56943 39224 152927 164363 175965 92600 -3477 -104628 -79579
4016 -79579 -114 85317 179383 181024 113340 48714 -45239 -41468 -52722 -153868 -274688 -311878
4004 -311878 -157308 -34100 -60170 -56806 -200937 -254088 -157388 -83943 -78095 -13144 45070
3993 45070 102322 61437 -2800 -80017 -61050 -96262 -42050 -41000 -72071 -7436 22111 -22461
3981 -22461 -119555 -176928 -54921 -29793 55919 68848 62252 128218 67828 13886 -22688 -126020
3969 -126020 -41525 43260 -96282 -197873 -161920 -40390 64218 131331 117466 106038 131824
3958 131824 -53988 -34038 -60564 -142866 -114335 -99073 -134137 -75909 -85294 -65142 -21701 -25809
3946 -25809 -84998 -50364 41098 27396 60340 105542 94763 19482 60629 141186 113155 8857
3934 8857 -75139 22396 4167 -58336 -51517 -35838 -76815 -92896 -48175 -84356 -54835 -125018
3922 -125018 -84194 -4228 22115 -17578 32555 1066 -63601 51339 82044 162304 104898
3911 104898 74373 96146 160487 84305 16630 20356 -2605 43292 136715 177550 164890 157230
3899 157230 74269 70494 49932 -32769 -113823 39196 57909 83845 55582 144889 166744 147106
3887 147106 108742 98954 89860 65200 41952 121077 92065 73122 -30546 -89340 -35353 81959
3875 81959 97164 14035 -50625 -31233 -48544 -70112 -40014 -63465 -120668 -76240 90116 189172
3863 189172 181081 157326 177724 206777 165754 99331 172919 211897 105013 -66861 -17684
3852 -17684 111153 46198 -4262 -17330 47246 63862 50902 95007 117683 103255 167159 258820
3840 258820 207725 91782 16619 -57959 -29599 26889 -7574 -52368 -74509 -10789 63048
3829 63048 -38194 -75647 -73943 -146808 -102920 -82904 -4074 19752 42149 75570 115103 88004
3817 88004 31380 -28640 54646 147369 120031 -28912 45657 60048 4 -18746 -92956 -122084
3805 -122084 -139307 -134079 -34552 59700 132626 139572 130853 80943 84119 -31105 -124387 -92270
3793 -92270 -79572 -72983 -24697 -122698 -113495 -93096 -130448 -138724 -98504 -120826 -156712 -56893
3781 -56893 -7587 -23677 -42123 64243 -16700 -31085 -71167 -166984 -65630 2013 -21243
3770 -21243 -74035 -27627 -25624 63982 114260 44313 14846 -7372 -72606 -112831 -73129 -1165
3758 -1165 40248 22316 5373 56349 40667 25013 40373 13366 25857 -45581 -115177 -131060
3746 -131060 -127042 -21461 -29730 -15080 -34173 -5438 17359 75702 140325 159584 95575 58264
3734 58264 7390 -43984 -33862 -75078 901 82075 56449 47610 198449 230973 79726 -1743
3722 -1743 -30166 -33516 -7414 -4558 -62979 -33835 -76740 -81452 -83133 -20418 -91376 -41677 8685
3709 8685 -44086 -83613 -163682 -156991 -82382 -123136 -254341 -214240 -178647 -164526 -52096 -67286
3697 -67286 -47219 -46 51864 4144 1610 3474 8987 8475 -45236 -38280 107355 197198 205095
3684 205095 261885 204931 95645 -29814 -103119 -136241 1888 155539 79663 -18674 1810
3673 1810 26899 33733 48096 64508 90203 90145 9630 -63635 -47541 34026 57635 132831 168303
3660 168303 104453 42299 10018 -9815 -117198 38697 142997 144304 151033 105247 29568
3649 29568 -13205 -50734 -22442 -21698 -131430 -55949 117001 80082 45470 51885 95804 133814
3637 133814 159130 64920 13711 78400 143821 114636 12606 -43228 -14746 101342 239977
3626 239977 253365 177675 110640 60715 105952 196875 167976 114477 42979 -2246 -199153
3615 -199153 -261993 -154348 -22964 -37132 47964 122799 38560 -81431 -172434 -214945 -113845
3604 -113845 -78603 -152956 -164286 -138364 -84572 -105628 -102842 -122806 -101588 -156164 -86096 37310
3592 37310 148296 153761 124660 126068 100808 35771 28301 85439 18134 25631 139067 64599
3580 64599 4206 5818 7505 16980 29539 61692 64246 21424 -4166 4301 -66719 -65317 12619
3567 12619 -40148 -27729 -15065 -75756 -179751 -97159 -70159 -116788 -69743 18006 108980 105151
3555 105151 7883 -13434 -67440 -148826 -171859 -163733 -58634 -140734 -190082 -66907 49115
3544 49115 43134 -1097 24651 103194 94778 61273 62871 70994 75404 -88159 -205710 -110123
3532 -110123 33424 117675 73884 55854 68952 152117 98707 12014 128273 136042 11972
3521 11972 142929 190679 57423 19789 -81640 -144920 -142941 -115324 -39374 -21738 -29128 7930
3509 7930 -33509 -53105 -65071 -96258 -37491 43922 2379 -962 -66151 34451 152022 216146
3497 216146 217328 156125 108878 11785 -15050 52463 155162 183494 146734 81399 -149825
3486 -149825 -292512 -213191 -145893 -156468 -190951 -38711 61292 199812 296407 222049 209128
3475 209128 26388 -72411 -84059 -99713 -36874 8893 -17175 -90480 30088 100482 38269
3464 38269 -15590 107523 78103 -7198 -136912 -132377 -39470 4413 -71665 -74706 -13917 66967
3452 66967 96172 156982 199696 120540 93202 72725 183566 179776 147836 213804 196985 104476
3440 104476 11279 48490 73466 88452 106726 61131 41142 28529 56601 101237 138038 207992
3428 207992 217446 180461 149465 55857 -2016 -10415 -75552 -71346 13030 130135 45232 -74767
3416 -74767 -103858 -24202 -22513 67667 21541 -41942 -36555 21203 46124 -3928 -21854 -25262
3404 -25262 -66657 -2160 -76607 -194334 -170779 -118635 -59942 -11134 -73641 -47700 25433 -22539
3392 -22539 -79169 -14485 -15236 73999 130794 50448 -21164 -14630 51335 21428 -18628 -70983
3380 -70983 -123069 -112086 -197685 -189186 -164275 -141718 -126987 -61697 74921 131777 96448 74914
3368 74914 86538 -33275 -32380 -87230 -147784 -110809 -63976 -65196 20125 -24055 7526 -11078
3356 -11078 -38530 -191190 -213064 -95979 58347 33707 -14260 65358 19936 -66370 22249
3345 22249 -9275 -64271 -92400 -154981 -116982 -129544 -85788 27124 85113 84629 9236 -8198
3333 -8198 -4706 -2507 -7796 12107 -24964 27947 52957 140791 176147 21795 -115067 -76162
3321 -76162 -71609 -11813 8657 21927 8479 -40730 -14274 -80380 -115207 -142209 -160499 -125562
3309 -125562 2447 58973 -17549 20144 39881 89430 33324 24941 4135 29695 58028 59208
3297 59208 85607 10480 -100682 -122508 19592 197815 134925 -13327 -106995 -59630 -123279
3286 -123279 -52254 -32059 -69251 -142204 -168617 -144546 -94901 -28869 62027 163874 242930
3275 242930 175551 140642 104784 51156 16272 -760 -8826 -4455 75433 81372 31234 -9062
3263 -9062 -46123 -95937 -150098 -146573 -32989 -95128 -48629 5934 77746 154307 75157 -55442
3251 -55442 -212997 -269144 -181714 -198730 -110424 -50335 -96914 -54604 -83148 36508 234511
3240 234511 242683 189456 194571 157457 120931 36668 -13904 -75805 -86527 -147199 -79906 -128838
3228 -128838 -58891 -75959 -79609 -71794 37180 115430 52342 -42450 -69629 -121660 -70262 -48326
3216 -48326 -93654 -117783 -75964 -40792 -25896 20382 -2185 -41410 -30853 -17625 12810 23252
3204 23252 36655 38587 73436 16248 -2210 85978 71453 57697 -67050 -58604 -92338 -117032
3192 -117032 -113534 -73211 -19981 -47303 -43846 -30631 6913 -58122 -137090 -110919 -141531 -39891
3180 -39891 46844 -3027 -7199 84391 209292 161765 138028 46447 -35687 -15644 1159 -105022
3168 -105022 -113323 -109727 -140518 -28672 40658 -81035 -111437 -68398 -131673 -178878 -133938 -96072
3156 -96072 -86342 -94276 -82857 -63336 -49612 -82963 -201925 -143630 -45387 -56450 -138295 -119009
3144 -119009 -86473 -122922 -99018 62651 134668 147330 122909 24899 -88139 -172298 -105110
3133 -105110 -4719 -9021 21343 37580 62566 -64683 -118297 -21394 80309 -73452 -229902
3122 -229902 -153436 47330 160737 31522 -30696 -77226 -30795 -27994 -17198 -12988 -75564
3111 -75564 -68594 78705 54029 -22851 87928 230824 145954 31709 -781 -68616 -50516
3100 -50516 -27193 -54465 -149078 -170260 -210586 -170294 -65963 8522 80840 70004 -53112
3089 -53112 -34789 87868 134312 98918 102517 68006 84937 33290 56892 76195 167189 220013
3077 220013 175369 137547 117510 65577 65359 118131 27559 -57074 -14980 -4180 -45504 -43510
3065 -43510 -60134 17912 40278 64841 89054 -34148 -65824 -69731 -50159 -7721 -27359 -24216
3053 -24216 2120 6952 -66101 -33578 8038 -78920 -106578 -48270 69362 98691 75738 57264
3041 57264 41845 110997 71824 16202 -10312 -86366 -5744 78798 69525 111739 163875 181970
3029 181970 110056 -4214 -108087 -80839 9388 27239 22360 104587 144110 69695 13643
3018 13643 -71532 -59476 27016 54452 134544 196990 58563 -71775 -98651 4661 -5578
3007 -5578 -66590 9972 118300 129168 76801 41018 65034 2292 103378 73556 60064 117981
2995 117981 97915 66348 127375 106730 125271 24217 -105538 32125 218267 260198 122337
2984 122337 -51348 -86930 -45539 -34919 88167 45341 95202 107491 109312 66776 118544
2973 118544 185913 138622 64151 -149308 -206319 -134047 -84903 -77089 -70774 31273 -13026 -102136
2961 -102136 -115398 -112292 -170989 -209516 -148407 -93688 -23128 14328 151320 189991 153650 105558
2949 105558 97547 98122 14795 -43346 -30928 -81883 -21233 -46842 -2382 22531 7710 82440
2937 82440 31147 34181 55177 103508 102234 86327 68240 -42237 -93911 -135323 -79059 -17279
2925 -17279 -21743 -1720 -45047 -12044 -1201 24534 8018 -81345 -132182 -122582 14894 -26673
2913 -26673 32549 110530 76951 18548 -88948 -123280 -40561 -49981 -66032 -78157 -61491 856
2901 856 -56197 -47427 32456 109715 58918 -382 -3423 82583 -11635 -39870 -171 42651 45509
2888 45509 56290 106411 132127 150739 106209 6478 -94758 -45142 -92644 -104242 -153931 -122460
2876 -122460 -170675 -268725 -251814 -188252 -70016 -107636 -93917 -90108 -38866 -83568 -142299 -118536
2864 -118536 -154441 -93126 54417 56902 26199 40291 102811 38661 7658 40212 6909 -82481
2852 -82481 -127139 -152602 18139 113252 182329 231341 166385 92170 90794 51590 -108837 -144834
2840 -144834 -145922 -211942 -159248 -103818 -116791 -88039 -13981 55218 65869 32442 -13585 -18225
2828 -18225 5942 67070 65609 23349 108605 116422 23126 -43052 29380 51682 30128 46242
2816 46242 -48744 -132551 -34333 91470 20028 -74271 -48078 -93395 -107347 59299 90216
2805 90216 129080 165163 30021 -658 5864 -25875 -17490 71778 103414 74797 -15050 -7847
2793 -7847 -16745 -18188 -40893 -63895 -20316 32321 -13823 23295 79266 -45106 -61652 26797
2781 26797 71246 67562 137121 116444 131422 99783 61810 87722 103724 17968 109964 187823
2769 187823 164806 92347 66234 -3867 6195 28132 67 -4357 -42750 -75678 -135061 -208396
2757 -208396 -112672 -8678 6581 -94255 -280881 -375025 -297383 -225070 -205760 -216455 -120221
2746 -120221 -93327 -58661 -55058 10228 77574 54313 -2242 -70681 -61634 -50722 -87280 -19193
2734 -19193 33035 17037 -13920 77297 7187 -27099 -83934 -58868 -108955 -87654 -51226 -32442
2722 -32442 12522 15564 -84346 -82527 -18967 28909 -48088 11407 54681 40714 39665 61795
2710 61795 46336 29092 -49743 -100371 -81652 -9082 -15401 -131053 -158186 53200 53381 24082
2698 24082 119244 192635 239795 199873 185634 142170 196372 123126 -79327 -203832 -170369
2687 -170369 -48115 102371 164687 181428 162008 89039 10628 -15037 -63107 -130620 -91490
2676 -91490 -118978 -55547 19117 75924 -34276 -207176 -140818 -122508 90141 293313 262063
2665 262063 165011 88288 78418 116000 147437 54178 -23337 -41095 -68365 -99512 19949 152139
2653 152139 160457 29239 -29097 -61528 -20280 90271 86192 36907 -15989 -91246 -118795 -192556
2641 -192556 -160808 -103725 -32212 -79749 -107424 -62356 39384 55763 54258 -6347 54281 40729
2629 40729 66847 82176 131787 65296 3047 1434 18713 -58886 -55501 -115739 -58384 32600
2617 32600 17490 21944 37241 94687 83997 55273 48423 140771 144710 104965 142318 123375
2605 123375 38878 46104 73865 46471 41447 69247 -4464 -55898 -122524 -142669 -1257 73876
2593 73876 84036 67235 5288 -5389 -956 -34533 -68996 -17011 -68814 -117724 -128022 -39513
2581 -39513 3884 -46323 26348 70407 -52485 -97481 -39204 106133 83169 77146 103799 162202
2569 162202 274241 160999 154127 122770 73357 58424 51541 93854 97977 32806 83700 204203
2557 204203 51767 -19207 -73284 38619 33949 3048 21282 53206 15020 17176 57257 -36890
2545 -36890 -28385 37708 2618 26291 162364 229619 174284 174621 158101 21941 29141 -20896
2533 -20896 -171076 -195163 -186778 -110721 -70146 -112244 -77929 -11710 -88772 -108359 -125597 8664
2521 8664 144525 137218 182596 20004 -82436 -84234 -69376 -35233 37915 74059 130368 88214
2509 88214 -773 -42056 -67085 -126617 -116058 -107252 -113588 -72669 -34590 -43507 -25079 63583
2497 63583 16163 -112573 -147154 -55548 -24468 -35808 -29712 -93260 -191710 -192150 -221415 -190107
2485 -190107 -77745 -63966 4562 141099 200957 128102 49080 135743 137388 117213 153820
2474 153820 31036 5029 78949 95155 176610 69073 -15058 70258 107670 54973 57563
2463 57563 123384 108122 20365 -58277 -85755 -3998 106579 188243 52347 -64884 -112981
2452 -112981 -89300 -74924 28619 98480 128292 100439 122458 112482 101211 112714 165672 76160
2440 76160 9246 -48276 42275 100124 58871 96376 144278 135042 141794 86269 9215 13618
2428 13618 93037 42507 110653 138927 437 -58223 -73846 -96335 -137171 -49536 23815 84907
2416 84907 28904 125633 132486 15650 76713 51334 -2084 -28347 -7952 24817 15025 -49515
2404 -49515 -20402 17260 60888 100680 8576 -51559 -52148 -51065 -66371 -91516 -111734 -133354
2392 -133354 -92164 -55390 -47704 -21830 -9710 84177 58436 11696 -61987 -31573 -64407 74566
2380 74566 149567 89152 39688 107414 106192 89389 39324 -37813 -108723 -74772 5690 -1886
2368 -1886 -51080 -27127 61910 31366 -38616 57422 57832 18699 75658 63414 28566 -34930
2356 -34930 -15341 89150 92987 73695 36498 -3263 -2554 40180 112932 70548 -2647 -37544
2344 -37544 -43135 15855 67169 71557 117480 130948 236059 318462 268175 171742 109049 39877
2332 39877 64340 113498 -377 -1957 54718 71464 72485 53314 113552 123799 43636 -134403
2320 -134403 -144003 -25193 86055 163919 66434 -29740 8821 27012 -31989 -75158 -35958
2309 -35958 139151 112037 94476 50887 -1219 -40247 -10978 46573 -19583 -102958 -59922 141548
2297 141548 244203 209463 140731 41475 -48625 -161991 -22904 -50257 -105196 -114643 -155207
2286 -155207 -162469 -140897 -2609 36969 26886 121742 211530 194678 207332 254205 172094 67824
2274 67824 90315 84669 101713 68655 49436 204449 139627 70148 30771 30191 -39622 -30818
2262 -30818 15633 67889 56500 -10371 -22433 4552 -23441 -39014 -18550 35081 61603 -19762
2250 -19762 -91370 -158150 -117466 -16087 -49102 -87036 -60948 -12689 -42455 23417 80514 99629
2238 99629 -79267 -148602 -105194 18797 41787 -37133 -21372 54374 25178 82015 124526
2227 124526 108932 15874 -84936 -67517 5345 15790 -42486 -1022 29452 17210 21415 26051
2215 26051 12351 32838 72594 98957 41881 -159107 -29214 66284 71908 61856 124996 97876
2203 97876 72137 41901 13280 93497 55438 108379 141719 94641 -33811 -39823 -94958 -142774
2191 -142774 -151106 -10142 111846 -25742 -137871 -143618 -138383 -59132 -34243 56501 73211
$$ [...]
##END NTUPLES=NMR SPECTRUM
##END=
