##TITLE=Analysis number 320773
Compound Code cc 60323
Book Reference 470/45
Project Code adrs
Chemist Name mikem
##JCAMPDX= 6.0         $$ Bruker NMR JCAMP-DX V2.0
##DATA TYPE= NMR SPECTRUM
##DATA CLASS= NTUPLES
##ORIGIN= Bruker BioSpin GmbH
##OWNER= nmr
$$ XWIN-NMR		Version 3.5
$$ Mon Jul 10 11:05:09 2006 GMT Daylight Time (UT+1h)  MAYBRIDGE\nmr@NMR_250MHZ
##.OBSERVE FREQUENCY= 250.131544655141
##.OBSERVE NUCLEUS= ^1H
##.ACQUISITION MODE= SIMULTANEOUS (DQD)
##.ACQUISITION SCHEME= undefined
##.AVERAGES= 16
##.DIGITISER RES= 18
##SPECTROMETER/DATA SYSTEM= dpx250
##.PULSE SEQUENCE= zg30
##.SOLVENT NAME= CDCl3
##.SHIFT REFERENCE= (INTERNAL, CDCl3, 0, 16.4555)
##AUDIT TRAIL= $$ (NUMBER, WHEN, WHO, WHERE, WHAT)
$$ ##TITLE= Audit trail, XWIN-NMR		Version 3.5
$$ ##JCAMPDX= 5.01
$$ ##ORIGIN= Bruker BioSpin GmbH
$$ ##OWNER= nmr
$$ C:\u/data/dgb/nmr/ADRS/2530/pdata/1/auditp.txt
$$ ##AUDIT TRAIL=  $$ (NUMBER, WHEN, WHO, WHERE, WHAT)
(   1,<2006-07-10 11:04:45.98 +100>,<MAYBRIDGE\nmr>,<NMR_250MHZ>,
      <created by zg, POWCHK disabled, PULCHK disabled
       configuration hash MD5:
       E2 DF 36 D8 04 B2 41 60 5A D7 A3 38 5A 4B D0 FE
       data hash MD5: 64K
       7C 26 1B 3C A1 B4 88 61 AA DA EC DF 98 20 BB 70>)
(   2,<2006-07-10 11:04:59.67 +100>,<MAYBRIDGE\nmr>,<NMR_250MHZ>,
      <Start of raw data processing
       ef LB = 0.3 FT_mod = 6 PKNL = 1 SI = 32K 
       data hash MD5: 32K
       DA 4E 39 3F 18 7F 02 3C 06 0A 8A 24 4E B8 57 C8>)
(   3,<2006-07-10 11:05:01.21 +100>,<MAYBRIDGE\nmr>,<NMR_250MHZ>,
      <apk 
       data hash MD5: 32K
       2D 76 FD 18 52 D7 BA CD 22 C9 79 0E E4 A7 64 19>)
(   4,<2006-07-10 11:05:01.95 +100>,<MAYBRIDGE\nmr>,<NMR_250MHZ>,
      <abs ABSG = 5 
       data hash MD5: 32K
       49 FA 3F 30 2E 41 E1 8C F1 A2 CA 8B 70 A0 30 86>)
$$ ##END=
$$ 
$$ hash MD5
$$ E8 40 8E 48 F6 6F 93 EC FC 3D 3A E9 8C E2 28 87
##$RELAX= 
##$RELAX= 
##$RELAX= 
##$RELAX= 
##$RELAX= 
##$RELAX= 
##$RELAX= 
$$ Bruker specific parameters
$$ --------------------------
##$DU= <C:\u>
##$EXPNO= 2530
##$NAME= <ADRS>
##$PROCNO= 1
##$TYPE= <nmr>
##$USER= <dgb>
##$AMP= (0..31)
100 100 100 100 100 100 100 100 100 100 100 100 100 100 100 100 100 100 
100 100 100 100 100 100 100 100 100 100 100 100 100 100 
##$AQSEQ= 0
##$AQ_mod= 3
##$AUNM= <au_zg>
##$AUTOPOS= <7 >
##$BF1= 250.13
##$BF2= 250.13
##$BF3= 250.13
##$BF4= 250.13
##$BF5= 500.13
##$BF6= 500.13
##$BF7= 500.13
##$BF8= 500.13
##$BYTORDA= 1
##$CFDGTYP= 0
##$CFRGTYP= 5
##$CHEMSTR= <none>
##$CNST= (0..31)
1 1 145 1 1 1 1 1 1 1 1 1 1 1 1 1 1 1 1 1 1 1 1 1 1 1 1 1 1 1 1 1 
##$CPDPRG= <>
##$CPDPRG1= <>
##$CPDPRG2= <>
##$CPDPRG3= <>
##$CPDPRG4= <mlev>
##$CPDPRG5= <mlev>
##$CPDPRG6= <mlev>
##$CPDPRG7= <mlev>
##$CPDPRG8= <mlev>
##$CPDPRGB= <>
##$CPDPRGT= <>
##$D= (0..31)
0 1 0 0 0 0 0 0 0 0.06 0 0 0 0 0 0 0.0002 0 0 0 0 0 0 0 0 0 0 0 0 0 0 
0 
##$DATE= 1152525884
##$DBL= (0..7)
120 120 120 120 120 120 120 120 
##$DBP= (0..7)
150 150 150 150 150 150 150 150 
##$DBP07= 0
##$DBPNAM0= <>
##$DBPNAM1= <>
$$ [...]
##$SUBNAM7= <"">
##$SUBNAM8= <"">
##$SUBNAM9= <"">
##$SW= 20.6930455092707
##$SWIBOX= (0..15)
0 0 3 0 0 0 0 0 0 0 0 0 0 0 0 0 
##$SW_h= 5175.983436853
##$TD= 65536
##$TD0= 1
##$TE= 295.16
##$TE2= 300
##$TE3= 300
##$TEG= 300
##$TL= (0..7)
0 120 120 120 120 120 120 120 
##$TP= (0..7)
150 150 150 150 150 150 150 150 
##$TP07= 0
##$TPNAME0= <>
##$TPNAME1= <>
##$TPNAME2= <>
##$TPNAME3= <>
##$TPNAME4= <>
##$TPNAME5= <>
##$TPNAME6= <>
##$TPNAME7= <>
##$TPOAL= (0..7)
0.5 0.5 0.5 0.5 0.5 0.5 0.5 0.5 
##$TPOFFS= (0..7)
0 0 0 0 0 0 0 0 
##$TUNHIN= 0
##$TUNHOUT= 0
##$TUNXOUT= 0
##$USERA1= <user>
##$USERA2= <user>
##$USERA3= <user>
##$USERA4= <user>
##$USERA5= <user>
##$V9= 5
##$VALIST= <valist>
##$VCLIST= <CCCCCCCCCCCCCCC>
##$VD= 0
##$VDLIST= <DDDDDDDDDDDDDDD>
##$VPLIST= <PPPPPPPPPPPPPPP>
##$VTLIST= <TTTTTTTTTTTTTTT>
##$WBST= 1024
##$WBSW= 4
##$XGAIN= (0..3)
0 0 0 0 
##$XL= 0
##$YL= 0
##$YMAX_a= 445479
##$YMIN_a= -644769
##$ZGOPTNS= <>
##$ZL1= 120
##$ZL2= 120
##$ZL3= 120
##$ZL4= 120
##$ABSF1= 16.45555
##$ABSF2= -4.237623
##$ABSG= 5
##$ABSL= 3
##$ALPHA= 0
##$AQORDER= 0
##$ASSFAC= 0
##$ASSFACI= 0
##$ASSFACX= 0
##$ASSWID= 0
##$AUNMP= <proc_1d>
##$AZFE= 0.1
##$AZFW= 0.1
##$BCFW= 0
##$BC_mod= 0
##$BYTORDP= 0
##$COROFFS= 0
##$CY= 12.5
##$DATMOD= 1
##$DC= 0
##$DFILT= <>
##$DTYPP= 0
##$F1P= 14.0000005364418
##$F2P= -0.99999901652339
##$FCOR= 0.5
##$FTSIZE= 32768
##$FT_mod= 6
##$GAMMA= 0
##$GB= 0
##$INTBC= 1
##$INTSCL= 1
##$ISEN= 128
##$LB= 0.3
##$LEV0= 0
##$LPBIN= 0
##$MAXI= 10000
##$MC2= 0
##$MEAN= 0
##$ME_mod= 0
##$MI= 0
##$NCOEF= 0
##$NC_proc= -4
##$NLEV= 6
##$NOISF1= 0
##$NOISF2= 0
##$NSP= 0
##$NTH_PI= 0
##$NZP= 0
##$OFFSET= 16.45555
##$PC= 1
##$PHC0= 161.1622
##$PHC1= 7.998542
##$PH_mod= 1
##$PKNL= yes
##$PPARMOD= 0
##$PSCAL= 4
##$PSIGN= 0
##$REVERSE= no
##$SF= 250.130016620543
##$SI= 32768
##$SIGF1= 0
##$SIGF2= 0
##$SINO= 400
##$SIOLD= 32768
##$SREGLST= <1H.CDCl3>
##$SSB= 0
##$STSI= 32768
##$STSR= 0
##$SW_p= 5175.98343685301
##$SYMM= 0
##$S_DEV= 0
##$TDeff= 65536
##$TDoff= 0
##$TI= <Analysis number 999999
Compound Code 99
Book Reference 9
Project Code 9>
##$TILT= no
##$TM1= 0
##$TM2= 0
##$TOPLEV= 0
##$USERP1= <user>
##$USERP2= <user>
##$USERP3= <user>
##$USERP4= <user>
##$USERP5= <user>
##$WDW= 1
##$XDIM= 32768
##$YMAX_p= 348435914
##$YMIN_p= -113885
$$ End of Bruker specific parameters
$$ ---------------------------------
##NTUPLES= NMR SPECTRUM
##VAR_NAME=  FREQUENCY,     SPECTRUM/REAL,   SPECTRUM/IMAG
##SYMBOL=    X,             R,               I
##VAR_TYPE=  INDEPENDENT,   DEPENDENT,       DEPENDENT
##VAR_FORM=  AFFN,          ASDF,            ASDF
##VAR_DIM=   32768,         32768,           32768
##UNITS=     HZ,            ARBITRARY UNITS, ARBITRARY UNITS
##FACTOR=    0.157963299565203, 1,           1
##FIRST=     4116.02680492945, 0,            0
##LAST=      -1059.95663192356, 0,           0
##MIN=       -1059.95663192356, -113885,     0
##MAX=       4116.02680492945, 348435914,    0
$$ Real data points
##PAGE= N=1
##DATA TABLE= (X++(R..R)), XYDATA
$$ [...]
$$ plain form
15790 -12776 -29339 -18841 30077 18817 2664 -1365 -31044 -51961 -50238 -17992 6940 4737
15778 4737 -16303 -21790 -13716 -13560 -11833 -35725 -28799 -9279 -10128 -39655 -35026 -29818 -48633 -67995
15764 -67995 -62600 -27728 -23967 -3912 -5507 -14256 -22899 22155 37037 5499 -53181 -69984 -87263
15751 -87263 -77925 -74171 -86050 -80844 -66949 -39421 -54923 -53087 -21718 -3277 -1982 -23456 -31922
15738 -31922 -44591 -51328 -69799 -58603 -61487 -64366 -35823 -59041 -77339 -102657 -94430 -73311
15726 -73311 -47568 -39269 -46881 -61285 -56959 -48214 -15354 -2195 -18099 -39865 -11385 -1789 -23036
15713 -23036 -38508 -34731 -16452 -35423 -55890 -49295 -42343 -68955 -70074 -34121 -45809 -42372 -29709
15700 -29709 -36737 -22652 -14885 -22299 -17104 -19670 -39657 -24614 -18809 -37492 -6465 -1463 1079
$$ packed form
15790a2776j6563J0498M8918j1260j6153m029k9679k0917J723L2246K4932k203
15778D737k1040n487Q074J56J727k3892O926J9520q49k9527M629N208j8815j9362
15764f7995N395L4872L761K0055j595q749q643M5054J4882l1538n8680j6803j7279
15751h7263R338L754j1879N206J3895K7528j5502J836L1369J8441J295k1474q466
15738c1922j2669o737j8471J1196k884k879K8543k3218j8298k5318Q227K1119
15726g3311K5743Q299p612j4404M326Q745L2860J3159j5904k1766K8480R596k1247
15713b3036j5472L777J8279j8971k0467O595O952k6612j119L5953j1688L437J2663
15700b9709p028J4085P767p414N195k566j9987J5043N805j8683L1027N002K542
$$ plain form
15687 1079 20611 26865 7789 3915 -4127 11108 941 -11418 -10268 -20102 -27742 -2674 6180
15674 6180 -10916 -21519 -43913 -28135 -37945 -18363 -9858 716 12356 14502 -13469 -46188
15662 -46188 -68066 -75660 -62759 -43789 -38173 -8123 3159 6231 14793 -5497 -20703 -17579 -33017
15649 -33017 -57368 -42559 -16896 -18662 -17036 -12795 -41929 -51224 -58590 -62028 -38640 -55038 -70593
15636 -70593 -40548 -4970 -393 449 -43721 -62727 -55957 -9704 41826 48704 26057 8574 -18003
15623 -18003 -27974 -10141 12961 16772 11687 21031 45751 40236 1386 -20768 -43475 -70743 -85122
15610 -85122 -75575 -49519 -7235 -17578 -16664 4579 -11892 -39258 -40921 -13923 -5282 -27061 -44156
15597 -44156 -30483 -27800 7752 28436 11484 123 -32072 -42983 -55854 -48019 -11124 15824
$$ packed form
15687A079J9532O254j9076l874q042J5235j0167j2359J150r834p640K5068Q854
15674F180j7096j0603k2394J5778r810J9582Q505J0574J1640K146k7971l2719
15662d6188k1878p594J2901J8970N616L0050J1282L072Q562k0290j5206L124j5438
15649c3017k4351J4809K5663j766J626M241k9134r295p366l438K3388j6398j5555
15636g0593L0045L5578M577Q42m4170j9006O770M6253N1530O878k2647j7483k6577
15623a8003r971J7833K3102L811n085R344K4720n515l8850k2154k2707k7268j4379
15610h5122R547K6056M2284j0343R14K1243j6471k7366j663K6998Q641k1779j7095
15597d4156J3673K683L5552K0684j6952j1361l2195j0911j2871P835L6895K6948
$$ plain form
15585 15824 9412 -8315 -38982 -43764 -43296 -38097 -54807 -58991 -56669 -47106 -29753 -39201 -45642 -33975
15571 -33975 -28744 -29304 -28081 -37394 -44268 -59110 -40583 -35972 -47367 -16568 35333 12691 -14026
15558 -14026 -2161 -13823 -26337 -44835 -54322 -54912 -59960 -73794 -51435 -48344 -58919 -70683 -83603
15545 -83603 -55558 -20245 -11878 -38497 -61145 -55536 -49302 -71248 -71946 -44177 -16466 -8467 -7090
15532 -7090 -11623 -25390 -19782 -17027 -12117 -4452 681 -5860 -11488 -16493 -49139 -47707 -20286 -10256
15518 -10256 -14328 -27070 -34580 -24487 -17233 -21841 -35900 -68440 -81173 -95502 -112968 -96426
15506 -96426 -75200 -60558 -72124 -95725 -70380 -45230 -39353 -37502 -30942 -30471 -42039 -53110 -54218
15493 -54218 -28904 -26170 -36720 -43607 -28105 -17489 -12784 -548 11616 -4350 -11156 -9113 -41141
$$ packed form
15585A5824o412j7727l0667m782M68N199j6710m184K322R563J7353r448o441J1667
15571c3975N231n60J223r313o874j4842J8527M611j1395L0799N1901k2642k6717
15558a4026J1865j1662j2514j8498r487n90n048j3834K2359L091j0575j1764j2920
15545h3603K8045L5313Q367k6619k2648N609O234k1946o98K7769K7711P999J377
15532g090m533j3767N608K755M910P665N133o541n628n005l2646J432K7421J0030
15518a0256m072j2742p510J0093P254m608j4059l2540j2733j4329j7466J6542
15506i6426K1226J4642j1566k3601K5345K5150N877J851O560M71j1568j1071j108
15493e4218K5314K734j0550o887J5502J0616M705J2236J2164j5966o806K043l2028
$$ plain form
15480 -41141 -45214 -12362 -32476 -51286 -58588 -71760 -63233 -52169 -37213 -26549 -40405 -21686
15468 -21686 -33845 -33253 -10311 -8139 224 -13465 -27266 -25623 -15654 -696 -7598 -9638 -29902
15455 -29902 -38418 -44899 -43039 -61726 -88988 -84922 -77038 -74946 -47283 -20082 -17190 13549 27839
15442 27839 12914 12533 15607 9712 -3328 -1122 -5322 8991 -13852 -33367 -25640 -28420 -19713
15429 -19713 -10453 -25213 -32593 -31487 -18018 12365 1431 10222 3241 -22296 -57335 -56869 -54628
15416 -54628 -32495 -25885 -35457 -32449 -56312 -22940 -69 -7805 -20937 -29321 -30152 -21416 -26827
15403 -26827 -51636 -51045 -64243 -43791 -42980 -35199 -31395 -31793 -48537 -68716 -86391 -60720 -31116
15390 -31116 -9687 -16250 -4946 -9142 -18539 -28911 -47793 -35518 -26210 -47691 -37680 -24858
$$ packed form
15480d1141m073L2852k0114j8810p302j3172Q527J1064J4956J0664j3856J8719
15468b1686j2159N92K2942K172Q363j3689j3801J643R969J4958o902k040k0264
15455b9902q516o481J860j8687k7262M066P884K092K7663K7201K892L0739J4290
15442B7839j4925l81L074n895j3040K206m200J4313k2843j9515P727k780Q707
15429a9713R260j4760p380J106J3469L0383j0934Q791o981k5537l5039M66K241
15416e4628K2133O610r572L008k3863L3372K2871p736j3132q384q31Q736n411
15403b6827k4809N91j3198K0452Q11P781L804l98j6744k0179j7675K5671K9604
15390c1116K1429o563J1304m196r397j0372j8882J2275R308k1481J0011J2822
$$ plain form
15378 -24858 -9438 832 -10099 -8288 13267 20710 3203 1421 -5845 -21884 -20247 -9126 -5473
15365 -5473 -10376 -1377 -9209 -17466 18326 16633 -18617 -27834 -18439 -5069 875 3688 -15029 -30135
15351 -30135 -35315 -49785 -48709 -62624 -73108 -68852 -56288 -20505 -22808 -70774 -87549 -108338
15339 -108338 -96166 -78663 -43379 -11293 13862 24932 6103 -25459 -9239 -40414 -57960
15328 -57960 -60579 -61125 -47044 -35331 -46899 -78759 -46259 -23603 -18038 -14593 -32501 -53247 -42855
15315 -42855 -23945 -7667 -15290 -26085 -19575 -23207 -41316 -35474 -22533 -27680 -11899 -20893 -38651
15302 -38651 -39646 -41232 -35871 -21278 -13613 15246 15979 -15601 -303 8584 -35694 -52430 -39959
15289 -39959 3808 31217 24365 18621 -68 -1589 -18203 -25803 -35043 -50376 -22127 -3253 -11212
$$ packed form
15378b4858J5420J0270j0931J811K1555P443j7507j782p266j6039J637J1121L653
15365e473m903Q999p832q257L5792j693l5250r217R395J3370N944K813j8717j5106
15351c0135n180j4470J076j3915j0484M256J2564L5783k303m7966j6775k0789
15339a08338J2172J7503L5284L2086K5155J1070j8829l1562J6220l1175j7546
15328e7960k619n46J4081J1713j1568l1860L2500K2656N565L445j7908k0746J0392
15315d2855J8910J6278p623j0795O510l632j8109N842J2941n147J5781q994j7758
15302c8651r95j586N361J4593P665K8859P33l1580J5298Q887m4278j6736J2471
15289c9959M3767K7409o852n744j8689j521j6614p600r240j5333K8249J8874p959
$$ plain form
15276 -11212 -43310 -37335 -33637 -11028 26395 7618 -23056 -37111 -48159 -48285 -23345 -25852 -19302
15263 -19302 -8807 -2341 29948 26916 22235 6075 -28907 -69480 -43155 -23767 -38482 -15778
15251 -15778 8318 9705 17934 17554 23009 35400 29248 -8539 -40030 -23105 -2562 12125 -16381
15238 -16381 -42212 -50477 -9914 12477 -17716 -1356 -2439 -24820 -28536 -8211 -28271 -52238
15226 -52238 -14094 -17417 -20668 -16555 -14725 -22018 -28898 -44187 -27986 10851 1255 -19441 -18464
15213 -18464 -22688 -50819 -66089 -56582 -24019 12604 4672 -8548 -22616 -28135 -33555 -21937 -10285
15200 -10285 11025 36132 31377 12056 17664 7450 -35058 -59244 -62758 -46150 -4028 -3074 -37175
15187 -37175 -38295 -44638 -77369 -71082 -45215 -47773 -64217 -55498 -33288 -37658 -51919 -33786 -38747
$$ packed form
15276a1212l2098N975L698K2609L7423j8777l0674j4055j1048j26K4940k507O550
15263a9302J0495O466L2289l032m681j6160l4982m0573K6325J9388j4715K2704
15251a5778K4096J387Q229l80N455J2391o152l7787l1491J6925K0543J4687k8506
15238a6381k5831q265M0563K2391l0193J6360j083k2381l716K0325k0060k3967
15226e2238L8144l323l251M113J830p293o880j5289J6201L8837r596k0696R77
15213a8464m224k8131j5270R507L2563L6623p932j3220j4068n519n420J1618J1652
15200a0285K1310K5107m755j9321N608j0214m2508k4186l514J6608M2122R54l4101
15187c7175j120o343l2731O287K5867k558j6444Q719K2210m370j4261J8133m961
$$ plain form
15174 -38747 -31377 -29689 -92333 -80319 -51287 -41140 -42264 -43061 -52592 -61861 -43866 -28771 -34573
15161 -34573 -29328 -14025 -12255 -38605 -36070 -29299 -36364 -32572 -52137 -46324 -43683 -24370 -1441
15148 -1441 -39462 -74723 -77281 -51945 -27578 -27855 -53824 -72207 -35383 -6415 -12210 -22217 -34249
15135 -34249 -49626 -23636 -10678 19368 13630 7244 -13195 -47456 -34502 6114 21584 7010
15123 7010 -7580 -38000 -48406 -60216 -65553 -49805 -43468 -46895 -37427 -36896 -33198 -21896 -16734
15110 -16734 -10596 -28575 -19122 -1727 -22983 -53354 -43135 -48138 -45338 -26837 -21002 -28037 -38020
15097 -38020 -27214 -8373 -38461 -76882 -87478 -73089 -48935 -20210 -40575 -22580 13248 14982
15085 14982 -3088 -1961 7872 -1037 4892 -12428 -24202 -35407 -22802 -25890 -45123 -60224 -61267
$$ packed form
15174c8747P370J688o2644J2014K9032J0147j124p97r531r269J7995J5095n802
15161c4573N245J5303J770k6350K535O771p065L792j9565N813K641J9313K2929
15148a441l8021l5261k558K5336K4367k77k5969j8383L6824K8968n795j0007j2032
15135c4249j5377K5990J2958L0046n738o386k0439l4261J2954M0616J5470j4574
15123G010j4590l0420j0406j1810n337J5748O337l427R468N31L698J1302N162
15110a6734O138j7979R453J7395k1256l0371J0219n003K800J8501N835p035r983
15097c8020J0806J8841l0088l8421j0596J4389K4154K8725k0365J7995L5828J734
15085A4982j8070J127R833q909N929j7320j1774j1205J2605l088j9233j5101j043
$$ plain form
15072 -61267 -47350 -41810 -33441 -52346 -83155 -80625 -71392 -77369 -46247 -2322 6303 34755 33658
15059 33658 3412 -10040 -21607 -13111 36343 30089 14041 -31978 -39139 -33612 -13545 -23960
15047 -23960 -43211 -63950 -53040 -33407 -24224 -23071 -36206 -53240 -42552 -27528 -39206 -56469
15035 -56469 -57916 -42720 -45999 -39502 -39361 -25491 -12473 -10907 -9601 14969 14060 1875 -16893
15022 -16893 -25052 -18295 -9369 -30008 -63236 -61847 -48248 -29345 -17626 -10772 -13524 -3662 -21091
15009 -21091 13920 15132 -16705 -36719 -3061 13029 -11417 -15391 -9205 10644 -395 -10822
14997 -10822 -37047 -79755 -75477 -54606 -55799 -42584 -55441 -51193 -46538 -42002 -20009 -2491 -1537
14984 -1537 551 -19683 -52989 -68636 -82912 -56511 -47745 -38422 -15255 -4841 -7065 -8438 -10678
$$ packed form
15072f1267J3917N540Q369j8905l0809K530R233n977L1122M3925Q625K8452j097
15059C3658l0246j3452j1567Q496M9454o254j6048m6019p161N527K0067j0415
15047b3960j9251k0739J0910J9633R183J153j3135j7034J0688J5024j1678j7263
15035e6469j447J5196l279O497J41J3870J3018J566J306K4570r09j2185j8768
15022a6893q159O757Q926k0639l3228J389J3599J8903J1719O854k752R862j7429
15009b1091L5011J212l1837k0014L3658J6090k4446l974O186J9849j1039j0427
14997a0822k6225m2708M278K0871j193J3215j2857M248M655M536K1993J7518R54
14984a537K088k0234l3306j5647j4276K6401Q766R323K3167J0414k224j373k240
$$ plain form
14971 -10678 -5306 1260 -8321 -39684 -36850 -24322 -2433 23185 7787 4527 11782 11496 8486
14958 8486 -4458 -4970 -28616 -26967 7171 5378 22016 13133 13748 4914 -8966 -38033 -68045
14945 -68045 -52838 -18097 -3415 -1867 31584 34140 11577 24252 12817 -7033 4875 2178
14933 2178 18953 29957 27175 3839 -30510 -33359 -21444 -17777 -31022 -38289 -12217 -2113 -9164
14920 -9164 -6736 11553 -3078 -4869 26361 44648 31463 11641 17135 5851 41280 73891
14908 73891 41259 -7247 -21153 6832 34359 27763 731 -9596 -23515 -47986 -50075 -34792
14896 -34792 -18813 -5358 -7430 -39942 -77299 -74786 -52258 -32635 -35950 -33077 -37805 -49895 -60116
14883 -60116 -49797 -37625 -26783 -50583 -28553 -31459 -20904 -35281 -39319 -24626 -38610 -32844
$$ packed form
14971a0678N372O566r581l1363K834J2528K1889K5618j5398l260P255k86l010
14958H486j2944n12k3646J649L4138j793J6638q883O15q834j3880k9067l0012
14945f8045J5207L4741J4682J548L3451K556k2563J2675j1435j9850J1908k697
14933B178J6775J1004k782k3336l4349k849J1915L667j3245p267K6072J0104p051
14920i164K428J8289j4631j791L1230J8287j3185j9822N494j1284L5429L2611
14908G3891l2632m8506j3906K7985K7527o596k7032j0327j3919k4471k089J5283
14896c4792J5979J3455k072l2512l7357K513K2528J9623l315K873m728j2090j0221
14883f0116J0319J2172J0842k3800K2030k906J0555j4377m038J4693j3984N766
$$ plain form
14871 -32844 -30208 -11521 -1119 3460 -37914 -78874 -62948 -37581 -33500 -28653 -5211 9738
14859 9738 -17333 -67591 -76755 -69462 -61857 -71255 -39781 -11159 -29664 -34373 -21583 -14820 -11798
14846 -11798 -688 2495 42080 35207 15961 2165 -20562 -12734 -1116 7044 12452 -9777 -13672
14833 -13672 542 -2461 -5293 -9212 -11186 -15075 -11539 -6545 -29356 -59322 -57384 -55408 -51648 -21718
14819 -21718 10477 30921 3323 -5265 20770 13326 -6301 4647 -6114 2094 19843 43188
14807 43188 65062 83475 85124 102732 96443 84108 69327 45475 34602 41835 -314 -22703
14795 -22703 -22552 -4603 9192 11773 1122 5412 -8573 2249 -14203 23337 47869 38430 47774
14782 47774 45358 15738 6309 5748 -8660 -6532 -28217 -31210 -32687 -35780 -30654 -31534 -12245 -16770
$$ packed form
14871c2844K636J8687J0402M579m1374m0960J5926K5367M081M847K3442J4949
14859I738k7071n0258r164P293P605r398L1474K8622j8505m709J2790O763L022
14846a1798J1110L183L9585o873j9246j3796k2727P828J1618Q160N408k2229l895
14833a3672J4214l003k832l919j974l889L536M994k2811k9966J938J976L760K9930
14819b1718L2195K0444k7598q588K6035p444j9627J0948j0761Q208J7749K3345
14807D3188K1874J8413J649J7608o289j2335j4781k3852j0873P233m2149k2389
14795b2703J51J7949J3795K581j0651M290j3985J0822j6452L7540K4532r439R344
14782D7774k416k9620r429n61j4408K128k1685k993j477l093N126q80J9289m525
$$ plain form
14768 -16770 -7512 -13425 19194 36850 13711 1507 -9030 -23379 -21406 10707 -14533 201
14756 201 14965 23461 8938 2396 -10235 -19736 -14678 8759 -7168 -4833 10594 -12055 -38814
14743 -38814 -37711 -40893 -32181 -30479 -40485 -38904 -15219 -18652 -23122 -35201 -38830 -55278 -39483
14730 -39483 -44087 -49658 -42307 -20186 -3301 -36768 -57045 -36074 -25649 -23084 -19159 734 -8478
14717 -8478 -51384 -62612 -34858 -20106 -24936 -35326 -18123 -10885 -35992 -48959 -56942 -42689
14705 -42689 -40879 -27050 -15777 -6018 -15835 -27289 -6673 -10667 22879 41622 33030 10336 -11362
14692 -11362 -13261 -5820 -5587 -23889 -13513 -6072 12884 16646 -13475 -7225 3453 5159 15632
14679 15632 -2310 -11810 7111 28814 45498 53959 48491 46857 20410 -15581 -15611 -36502 -62647
$$ packed form
14768a6770R258n913L2619J7656k3139j2204j0537j4349J973L2113k5240J4734
14756B01J4764Q496j4523o542j2631r501N058K3437j5927K335J5427k2649k6759
14743c8814J103l182Q712J702j0006J581K3685l433m470j2079l629j6448J5795
14730c9483m604n571P351K2121J6885l3467k0277K0971J0425K565L925J9893r212
14717h478m2906j1228K7754J4752m830j0390J7203P238k5107j2967p983J4253
14705d2689J810J3829J1273R759r817j1454K0616l994L3546J8743q592k2694k1698
14692a1362j899P441K33j8302J0376P441J8956L762l0121O250J0678J706J0473
14679A5632j7942r500J8921K1703J6684Q461n468j634k6447l5991l0k0891k6145
$$ plain form
14666 -62647 -44830 -23695 -15446 -42054 -57513 -54052 -20708 32678 22243 9858 -4601 -20630
14654 -20630 -37851 -48782 -57551 -60930 -33183 -16289 -21940 -24102 -10302 -14828 -7619 -10539 -15181
14641 -15181 -7055 8702 11599 7598 -6117 -19585 -36945 -25601 -23468 -47544 -32911 -20580
14629 -20580 -3349 -36287 -43544 -21947 -1023 88 -21384 -46271 -19955 20076 14330 -18974
14617 -18974 -39302 -22733 -16669 -20233 -29321 -48225 -25851 -13165 869 6561 -3307 -13395 -6251
14604 -6251 -36045 -55676 -69469 -71534 -64155 -34332 -32731 -36927 -59689 -43150 -48489 -24936 -5
14591 -5 2026 3196 -26227 -19858 -18644 -34186 -24017 -18698 -31838 -28003 -10204 11268 -640 -24296
14577 -24296 -31869 -21724 -15366 -5899 11341 2609 -4701 -13343 -4132 -7745 -34539 -7991 -21376
$$ packed form
14666f2647J7817K1135Q249k6608j5459L461L3344N3386j0435j2385j4459j6029
14654b0630j7221j0931q769l379K7747J6894n651k162J3800m526P209k920m642
14641a5181Q126J5757K897m001j3715j3468j7360J1344K133k4076J4633J2331
14629b0580J7231l2938p257K1597K0924J111k1472k4887K6316M0031n746l3304
14617a8974k0328J6569O064l564r088j8904K2374J2686J4034N692r868j0088P144
14604f251k9794j9631j3793k065P379K9823J601m196k2762J6539n339K3553K4931
14591eK031J170k9423O369J214j5542J0169N319j3140L835J7799K1472j1908k3656
14577b4296p573J0145O358R467J7240q732p310q642R211l613k6794K6548j3385
$$ plain form
14564 -21376 -33437 -23167 -23992 -34419 -21347 -34084 -52954 -41259 -9872 -15208 -6763 -21181
14552 -21181 -39383 -47451 -65782 -63286 -63883 -40112 -33871 -44148 -13947 -6224 -9809 -22623 -7762
14539 -7762 4380 -1666 -2541 -4348 -8725 -5915 -35406 -24911 -26078 -26561 -36526 -25209 -21773 3692
14525 3692 23213 12188 1449 15087 -2444 -5561 -8830 -11234 -7720 11553 19008 28684 13288
14512 13288 9975 29298 5939 -12067 -41030 -54153 -52990 -35946 -28992 -5371 -9204 -22141
14500 -22141 -21380 -37408 -25539 -48549 -32152 -26022 -45529 -44080 -31120 -36747 -22541 -24206 -9246
14487 -9246 23569 -15489 -51765 -61076 -48227 -58930 -65212 -54614 -65244 -84976 -99708 -87731
14475 -87731 -75118 -44486 -32065 -63727 -80956 -81911 -44880 -33776 -13232 -22221 -36525 -26982
$$ packed form
14564b1376j2061J0270q25j0427J3072j2737j8870J1695L1387n336Q445j4418
14552b1181j8202q068j8331K496n97K3771O241j0277L0201P723l585j2814J4861
14539g762J2142o046q75j807m377K810k9491J0495j167m83r965J1317L436K5465
14525C692J9521j1025j0739J3638j7531l117l269k404L514J9273P455R676j5396
14512A3288l313J9323k3359j8006k8963j3123J163J7044O954K3621l833j2937
14500b2141P61j6028J1869k3010J6397O130j9507J449J2960n627J4206j665J4960
14487i246L2815l9058l6276r311J2849j0703o282J0598j0630j9732j4732J1977
14475h7731J2613L0632J2421l1662j7229r55L7031J1104K0544q989j4304R543
$$ plain form
14463 -26982 -14808 -1905 -13296 -23897 -16538 -11367 -1757 303 -39373 -61245 -52912 -45887 -49001
14450 -49001 -59888 -39623 -35025 -55199 -41410 -19709 2261 -12396 -48168 -50160 -27375 -12361
14438 -12361 -13081 -14559 -6256 -8045 -28014 -33270 -32083 -27637 -13917 -7981 -16400 -19162 -29706 -11672
14424 -11672 -12375 -29115 -17949 -14381 -9464 -19646 -11949 -16391 -29536 -43457 -51310 -45745 -40213
14411 -40213 -13814 -19508 -27487 -9705 -3956 9517 16530 -18599 1183 16023 11144 28649 36197
14398 36197 24927 23763 -191 -21631 -22342 -27383 -23645 -33751 -7792 10757 13358 19872 -20532
14385 -20532 -31843 -8139 -13424 -10971 -25410 -16601 -19719 -2992 14971 10929 -2293 9056 10442
14372 10442 1190 -22469 -30416 -24982 -4465 -7425 -19977 -10541 -31621 -46247 -31293 -13894 -19907
$$ packed form
14463b6982J2174J2903j1391j0601P359N171R610K060l9676k1872Q333P025l114
14450d9001j0887K0265M598k0174J3789K1701K1970j4657l5772j992K2785J5014
14438a2361p20j478Q303j789j9969n256J187M446J3720N936q419k762j0544J8034
14424a1672p03j6740J1166L568M917j0182P697m442j3145j3921p853N565N532
14411d0213K6399n694p979J7782N749J3473P013l5129J9782J4840m879J7505P548
14398C6197j1270j164k3954k1440p11n041L738j0106K5959J8549K601O514m0404
14385b0532j1311K3704n285K453j4439Q809l118J6727J7963m042j3222J1349J386
14372A0442r252k3659p947N434K0517k960j2552R436k1080j4626J4954J7399o013
$$ plain form
14359 -19907 -52551 -40319 -26565 -9797 -29694 -65964 -43041 -16495 -20428 -32766 -35029 -1882
14347 -1882 6578 15703 9934 9556 4426 -6871 -15450 1681 31413 59439 59206 38333 -8929 575
14333 575 21938 21412 11561 3417 5352 -6893 -27761 -19974 -18875 -42461 -54727 -46599 -32259 10844
14319 10844 35933 3404 -13312 -4535 15308 24279 -3804 -47263 -28810 -17221 -47532 -63744
14307 -63744 -53231 -43759 -40319 -38357 -45448 -27610 -43342 -53549 -56011 -21147 -12252 -14547 -39540
14294 -39540 -59056 -43493 -57866 -63950 -36551 -14676 9999 22069 10095 -13766 -29831 -34445
14282 -34445 -26359 -24033 -24504 -67781 -73083 -64678 -19373 -1599 -18536 -11267 2761 160 -58 -20101
14268 -20101 -20244 -8755 -10557 -5204 17135 9054 -12548 -12795 -3010 -11477 -5179 8795 9753 -16154
$$ packed form
14359a9907l2644J2232J3754J6768j9897l6270K2923K6546l933j2338k263L3147
14347a882Q460R125n769l78n130j1297q579J7131K9732K8026k33k0873m7262R504
14333E75K1363n26r851q144J935j2245k0868P787J099k3586j2266Q128J4340M3103
14319A0844K5089l2529j6716Q777J9843Q971k8083m3459J8453J1589l0311j6212
14307f3744J0513R472L440J962p091J7838j5732j0207k462L4864Q895k295k4993
14294c9540j9516J5563j4373o084K7399K1875K4675J2070j1974k3861j6065m614
14282c4445Q086K326m71m3277n302Q405M5305J7774j6937P269J4028k601k18k0043
14268b0101j43J1489j802N353K2339q081k1602k47R785q467O298J3974R58k5907
$$ plain form
14254 -16154 -15676 1126 10220 11812 24183 34057 23375 16118 12039 18576 30073 10427 -13352
14241 -13352 11311 28447 5838 -36048 -51641 -27133 -1654 -6884 -7504 24079 5568 -40417
14229 -40417 -29092 -1196 34641 42422 18982 8405 -1859 -10760 -23955 -43944 -29922 -14411
14217 -14411 10486 -5099 -2526 5673 1892 3989 22038 32202 20264 5574 -9888 -4378 5663
14204 5663 4480 19062 32469 15662 -7387 -33775 -32146 -14279 8680 26102 28764 14296
14192 14296 -4568 -7106 -6372 -13420 -2452 1657 -18971 -12816 -31350 -58442 -31616 9224 29895
14179 29895 6055 -46564 -54503 -29040 -12169 -18064 -29366 -11591 -12349 -15099 -11698 -3020 -4724
14166 -4724 632 -4333 -14934 -513 14354 5168 2288 106 19132 57644 38859 6636 -6936
$$ packed form
14254a6154M78J6802R094J592J2371R874j0682p257m079O537J1497j9646k3779
14241a3352K4663J7136k2609m1886j5593K4508K5479n230o20L1583j8511m5985
14229d0417J1325K7896L5837P781k3440j0577j0264q901j3195j9989J4022J5511
14217a4411K4897j5585K573Q199l781K097J8049J0164j1938j4690j5462N510J0041
14204E663j183J4582J3407j6807k3049k6388J629J7867K2959J7422K662j4468
14192A4296j8864k538P34p048J0968M109k0628O155j8534k7092K6826M0840K0671
14179B9895k3840n2619p939K5463J6871n895j1302J7775p58k750L401Q678j704
14166d724N356m965j0601J4421J4867r186k880k182J9026L8512j8785l2223j3572
$$ plain form
14153 -6936 -3957 7312 1704 -11584 4547 46599 39085 12781 -5282 -27857 -3278 -3976 -5982
14140 -5982 2509 -1118 -2362 3438 5013 -3151 -21260 -14694 -19799 -17656 1014 -2727 -33931 -37363
14126 -37363 -4445 -21989 -48740 -22561 -3710 15928 13340 19896 23350 19204 15158 -2199 -31903
14113 -31903 -34147 -8264 -9687 -28220 -45425 -60846 -27561 -19720 -17491 -6739 5199 15664
14101 15664 784 -12614 -1393 12718 5955 -7300 -14479 -37066 -44683 -8726 18265 21984
14089 21984 18398 20526 26027 10246 16940 7319 -9132 2821 21141 6377 -21227 -45948 -42838
14076 -42838 -33492 -32362 -40810 -37839 -9677 30307 16260 4067 3334 21162 3986 -725 -3615
14063 -3615 6538 3198 8656 -13185 -11338 27348 26965 7160 -21232 -42706 -38704 -37315 -9378
$$ packed form
14153f936K979J1269n608j3288J6131M2052p514k6304j8063k2575K4579o98k006
14140e982Q491l627j244N800J575q164j8109O566n105K143J8670l741l1204l432
14126c7363L2918j7544k6751K6179J8851J9638k588O556L454m146m046j7357k9704
14113c1903k244K5883j423j8533j7205j5421L3285P841K229J0752J1938J0465
14101A5664j4880j3398J1221J4111o763j3255p179k2587p617L5957K6991L719
14089B1984l586K128N501j5781O694r621j6451J1953J8320j4764k7604k4721L110
14076d2838R346J130q448K971K8162L9984j4047j2193p33J7828j7176m711k890
14063c615J0153l340N458k1841J847L8686l83j9805k8392k1474M002J389K7937
$$ plain form
14050 -9378 12320 31194 18630 -20217 -14760 5958 19098 14211 5241 1336 -25511 -40156 -32999
14037 -32999 -13095 -23708 -13277 16693 38932 32187 21625 37839 32740 29136 33875 41440 27704
14024 27704 18695 5849 -1143 1458 -12796 -9222 22192 28574 27689 36312 53370 62093 41203
14011 41203 52267 65591 46041 54101 26113 -14196 -2225 -3255 -4436 -29775 -23831 -44399
13999 -44399 -18249 -9765 18111 32921 38020 44252 32255 31317 19408 26619 9357 26275 33077
13986 33077 12892 -3745 -21654 4472 4298 35364 48137 45266 45105 40761 45847 63081 43351
13973 43351 39171 51374 45445 21689 24442 40350 50161 65342 58776 71201 89325 89289 85280
13960 85280 91631 131954 161883 177934 166674 168331 173993 172589 178128 161849 139256 89696 53537
$$ packed form
14050i378K1698J8874j2564l8847N457K0718J3140m887q970l905k6847j4645P157
14037c2999J9904j0613J0431K9970K2239o745j0562J6214n099l604M739P565j3736
14024B7704r009j2846o992K601j4254L574L1414O382q85Q623J7058Q723k0890
14011D1203J1064J3324j9550Q060k7988m0309J1971j030j181k5339N944k0568
13999d4399K6150Q484K7876J4810N099O232j1997r38j1909P211j7262J6918O802
13986C3077k0185j6637j7909K6126j74L1066J2773k871j61m344N086J7234j9730
13973D3351m180J2203n929k3756K753J5908R811J5181o566J2425J8124l6m009
13960H5280O351M0323K9929J6051j1260J657N662j404N539j6279k2593m9560l6159
$$ plain form
13947 53537 41117 56877 79072 61182 40777 29546 32615 42463 51876 34049 28989 50063
13935 50063 71860 84473 80500 76533 54661 31152 28552 26700 29066 58696 66518 75976 60151
13922 60151 67541 94203 105140 125164 130261 138784 159013 217831 303336 373353 432191 463401
13910 463401 478582 482831 470906 447552 373471 294712 249429 217978 149809 118697 80927 44029
13898 44029 55409 79992 111879 112964 85328 56255 47649 59633 80710 89972 94122 108064
13886 108064 96354 94235 84934 77610 77634 88389 78577 99006 131069 126907 120478 100532 94671
13873 94671 99035 106025 129740 182753 279492 367263 446516 474010 479393 495436 495595 480320 433111
13860 433111 366850 265905 195371 138386 117782 132155 126582 119617 139174 138030 116172 81525
$$ packed form
13947E3537j2420J5760K2195j7890k0405j1231L069R848R413j7827n060K1074
13935E0063K1797J2613l973l967k1872k3509k600j852K366K9630P822R458j5825
13922F0151P390K6662J0937K0024N097Q523K0229N8818Q5505P0017N8838L1210
13910D63401J5181M249j1925k3354p4081p8759m5283l1451o8169l1112l7770l6898
13898D4029J1380K4583L1887J085k7636k9073q606J1984K1077R262M150J3942
13886A08064j1710k119r301p324K4J0755r812K0429L2063m162o429j9946n861
13873I4671M364O990K3715N3013R6739Q7771P9253K7494N383J6043J59j5275m7209
13860D33111o6261j00945p0534n6985k0604J4373n573o965J9557j144k1858l4647
$$ plain form
13848 81525 72489 74740 89402 89205 75826 73393 74744 74698 74957 75778 98168 114022 91836 63330
13834 63330 61451 37124 34669 56670 53628 93075 101285 105738 108858 98028 88832 123925 153088
13821 153088 160908 147391 184119 205044 198890 173320 139658 89392 71906 69795 66387 66568 52708
13808 52708 74630 49835 59954 68926 77362 89442 49443 48424 53755 61205 78303 78927 55605
13795 55605 50116 47909 39222 74484 94891 66542 60778 47991 39607 53595 49434 52859 41550
13782 41550 34025 47117 50128 60604 51208 42024 27760 27731 20458 7181 5956 -7492 -11670 -2203
13768 -2203 20953 28717 13406 8876 16763 58479 84084 47295 40566 25004 17342 41226 18553
13755 18553 -3256 -29901 -43283 -26971 -8544 -4863 -3949 26606 47455 47812 72496 94560 89119
$$ packed form
13848H1525r036K251J4662j97j3379k433J351m6K59Q21K2390J5854k2186k8506
13834F3330j879k4327k455K2001l042L9447Q210M453L120j0830r196L5093K9163
13821A53088P820j3517L6728K0925o154k5570l3662n0266j7486k111l408J81j3860
13808E2708K1922k4795J0119Q972Q436J2080l9999j019N331P450J7098O24k3322
13795E5605n489k207q687L5262K0407k8349n764j2787q384J3988m161L425j1309
13782D1550p525J3092L011J0476r396r184j4264k9p273j3277j225j3448m178R467
13768b203K3156P764j5311m530P887M1716K5605l6789o729j5562p662K3884k2673
13755A8553k1809k6645j3382J6312J8427L681R14L0555K0849L57K4684K2064n441
$$ plain form
13742 89119 50556 27894 22016 35167 50724 43117 26944 28745 2479 18782 51396 46864
13730 46864 33086 18218 34657 58559 72221 76041 73266 72886 59971 72582 89572 59202
13718 59202 29069 -8483 7851 19863 29734 27254 21187 3150 13883 32239 26303 10215
13706 10215 28424 58763 90509 113774 145344 133957 119364 104142 90254 86988 71850 70658
13694 70658 76398 58358 42459 42760 59125 80921 78870 136651 145145 135427 125999 83813 85882
13681 85882 83491 91128 92634 109680 102256 95868 84220 74508 77314 81693 93083 115885 109550
13668 109550 94378 79566 66549 54769 70941 88580 125156 143775 109532 133197 153246
13657 153246 108292 105920 124262 154018 155865 131104 127235 148929 158919 163654 153914 141166 114764
$$ packed form
13742H9119l8563k2662n878J3151J5557p607j6173J801k6266J6303L2614m532
13730D6864j3778j4868J6439K3902J3662L820k775l80j2915J2611J6990l0370
13718E9202l0133l7552J6334J2012R871k480o067j8037J0733J8356n936j6088
13706A0215J8209L0339L1746K3265L1570j1387j4593j5222j3888l266j5138j192
13694G0658N740j8040j5899L01J6365K1796k051N7781Q494r718r428m2186K069
13681H5882k391P637J506J7046p424o388j1648r712K806M379J1390K2802o335
13668A09550j5172j4812j3017j1780J6172J7639L6576J8619l4243K3665K0049
13657A53246m4954k372J8342K9756J847k4761l869K1694R990M735r740j2748k6402
$$ plain form
13644 114764 76861 90425 91943 105049 101656 123305 110447 90402 92219 90187 70029 59374
13632 59374 41349 53100 74293 69003 93277 92030 91632 122776 127938 112156 117007 134392 111816
13619 111816 70680 71397 81809 128006 128795 133862 152177 173391 209268 222976 198570 181014
13607 181014 186870 205139 210825 222688 257512 272485 265540 238947 285993 351345 361524 367401
13595 367401 387981 452090 503975 523135 551328 586991 574183 554721 551659 597303 672919 785741
13583 785741 880291 934412 935582 914784 878766 834730 738496 591885 510555 463127 402424
13572 402424 348230 299510 285881 300440 341795 363952 364059 391902 415909 432356 459951 463853
13560 463853 475877 509609 520931 562421 582622 582980 599475 659693 789335 921005 1129483
$$ packed form
13644A14764l7903J3564J518J3106l393K1649j2858k0045J817k032k0158j0655
13632E9374j8025J1751K1193n290K4274j247l98L1144N162j5782M851J7385k2576
13619A11816m1136P17J0412M6197P89N067J8315K1214L5877J3708k4406j7556
13607A81014N856J8269N686J1863L4824J4973o945k6593M7046O5352J0179N877
13595C67401K0580O4109N1885J9160K8193L5663j2808j9462l062M5644P5616J12822
13583G85741R4550N4121J170k0798l6018m4036r6234j46611q1330m7428o0703
13572D02424n4194m8720j3629J4559M1355K2157J07K7843K4007J6447K7595L902
13560D63853J2024L3732J1322M1490K0201L58J6495O0218J29642J31670K08478
$$ plain form
13549 1129483 1374207 1495574 1553685 1589882 1648489 1717810 1737811 1672125 1670271 1853811 2205329
13538 2205329 2515472 2632468 2608938 2577482 2608944 2509355 2162997 1718265 1451308 1304038
13528 1304038 1223958 1147067 1100682 1126379 1143090 1162194 1199611 1264265 1273293 1306768 1409593
13517 1409593 1471124 1521623 1589963 1679038 1773281 1904265 2067888 2266508 2507883 2816203
13507 2816203 3198493 3725709 4449748 5292184 6206848 7321502 8812751 10974243 14131785
13498 14131785 18463564 23524698 27994900 30565826 31553070 31940264 31953027 30535906 26672678
13489 26672678 21588223 17202881 13912758 11487116 9824013 8663162 7834043 7230755
13481 7230755 6768769 6414264 6149559 5922662 5778012 5662390 5572618 5507274 5480107 5478304
$$ packed form
13549A129483K44724J21367N8111L6197N8607O9321K0001o5686j854J83540L51518
13538B205329L10143J16996k3530l1456L1462r9589l46358m44732k66957j47270
13528A304038q0080p6891m6385K5697J6711J9104L7417O4654R028L3475J02825
13517A409593O1531N0499O8340Q9075R4243J30984J63623J98620K41375L08320
13507B816203L82290N27216P24039Q42436R14664J114654J491249K161492L157542
13498A4131785M331779N061134M470202K570926R87244L87194J2763j417121l863228
13489B6672678n084455m385342l290123k425642j663103j160851q29119o03288
13481G230755m61986l54505k64705k26897j44650j15622q9772o5344k7167j803
$$ plain form
13471 5478304 5507617 5589894 5713334 5877854 6132253 6437761 6817217 7313926 7964306 8856190
13461 8856190 10028294 11461876 13239540 15507036 18532178 22760085 28889625 38002084
13453 38002084 51245741 68139714 83829849 92073301 93441655 92901997 92904146 90010567
13445 90010567 78234508 60461957 45573556 35693216 29233479 24888363 21843924 19645334
13437 19645334 17986235 16635451 15501181 14557146 13801589 13200807 12648794 12097431 11641022
13428 11641022 11249888 10893259 10605172 10404225 10262730 10233388 10290288 10407697 10629280 10952427
13418 10952427 11439626 12135351 13096374 14336854 15930571 18025861 20872304 24949216
13410 24949216 30921605 39793399 52761118 69656350 85963881 94905571 96382742 95474008
$$ packed form
13471E478304K9313Q2277J23440J64520K54399L05508L79456M96709O50380Q91884
13461H856190J172104J433582J777664K267496L025142M227907O129540R112459
13453C8002084J3243657J6893973J5690135Q243452J368354n39658K149k893579
13445I0010567j1776059j7772551j4888401r880340o459737m345116l044439k198590
13437A9645334j659099j350784j134270r44035p55557o00782n52013n51363m56409
13428A1641022l91134l56629k88087k00947j41495k9342N6900J17409K21583L23147
13418A0952427M87199O95725R61023J240480J593717K095290K846443M076912
13410B4949216N972389Q871794J2967719J6895232J6307531Q941690J477171r08734
$$ plain form
13402 95474008 95161174 92593067 81347947 63146312 47346953 36880044 30155390 25635224
13394 25635224 22477422 20178783 18475042 17070827 15807917 14731988 13880383 13116641
13386 13116641 12413210 11763828 11168291 10590559 10083618 9655163 9284454 8968257 8694838
13377 8694838 8499342 8355601 8225752 8130933 8148579 8243261 8414202 8691381 9089110 9717948
13367 9717948 10588716 11852287 13734602 16530707 20592820 25769165 30702346 33596411
13359 33596411 34301484 34111396 33788205 32574277 28966686 23462067 18370313 14784486
13351 14784486 12337146 10657751 9447029 8518821 7826186 7279022 6776846 6329955 5942039
13342 5942039 5614387 5299404 5008475 4732429 4485985 4239092 4024151 3822125 3637617
$$ packed form
13402I5474008l12834k568107j1245120j8201635j5799359j0466909o724654m520166
13394B5635224l157802k298639j703741j404215j262910j075929q51605p63742
13386A3116641p03431o49382n95537n77732n06941m28455l70709l16197k73419
13377H694838j95496j43741j29849r4819J7646R4682J70941K77179L97729O28838
13367I717948Q70768J263571J882315K796105M062113N176345M933181K894065
13359C3596411P05073j90088l23191j213928l607591n504619n091754l585827
13351A4784486k447340j679395j210722r28208o92635n47164n02176m46891l87916
13342E942039l27652l14983k90929k76046k46444k46893k14941k02026j84508
$$ plain form
13333 3637617 3467616 3316982 3189172 3093310 2961470 2843662 2741818 2631519 2514138 2434434
13323 2434434 2352470 2274787 2204955 2125046 2057190 1977771 1901040 1829383 1749934 1683326 1665739
13312 1665739 1640661 1602534 1563101 1537362 1532124 1488405 1422946 1384977 1335075 1285833 1231082
13301 1231082 1155441 1109791 1060771 1032536 978368 935497 913713 877082 811742 773774 779445
13290 779445 796625 794274 777144 754653 718489 698829 658745 650606 620368 641985 647668 633641
13278 633641 619950 591786 602224 607419 571192 539698 513098 484783 472635 461311 441497 431567
13266 431567 438825 436617 432830 419259 428397 423775 388837 362720 384758 396551 372131 341361
13254 341361 313104 311417 312576 315934 341577 325989 324495 301893 284463 271301 271587 259637 267053
$$ packed form
13333C637617j70001j50634j27810r5862j31840j17808j01844j10299j17381p9704
13323B434434q1964p7683o9832p9909o7856p9419p6731p1657p9449o6608j7587
13312A665739k5078l8127l9433k5739n238m3719o5459l7969m9902m9242n4751
13301A231082p5641m5650m9020k8235n4168m2871k1784l6631o5340l7968N671
13290G79445J7180k351j7130k2491l6164j9660m0084q139l0238K1617N683j4027
13278F33641j3691k8164J0438N195l6227l1494k6600k8315j2148j1324j9814r930
13266D31567P258k208l787j3571R138m622l4938k6117K2038J1793k4420l0770
13254C41361k8257j687J159L358K5643j5588j494k2602j7430j3162K86j1950P416
$$ plain form
13241 267053 270435 250001 243695 249794 269909 311103 316480 284416 236005 262235 282208 267164
13229 267164 271007 250582 214029 194115 211632 266468 280426 270667 252726 260110 296595 366167
13217 366167 410781 447393 464611 460402 457908 455238 446483 419940 349974 260965 204626 188403
13205 188403 167513 143098 150815 136883 127182 145344 149787 165023 191314 186635 200286 228907
13193 228907 249250 249821 279418 307327 352362 407691 403912 411543 411174 403331 382575 359659 339710
13180 339710 299615 266247 256679 256601 275779 334583 427842 587244 765867 925516 1031130
13169 1031130 1078650 1092542 1066783 1019368 933864 768086 590450 464012 413249 385203 380657
13158 380657 379131 369334 342422 315812 313948 308499 305536 320735 312416 332820 388543 466150 578886
$$ packed form
13241B67053L382k0434o306O099K0115M1194N377l2064m8411K6230J9973j5044
13229B67164L843k0425l6553j9914J7517N4836J3958r759j7941P384L6485O9572
13217C66167M4614L6612J7218m209k494k670q755k6543o9966q9009n6339j6223
13205A88403k0890k4415P717j3932r701J8162M443J5236K6291m679J3651K8621
13193B28907K0343N71K9597K7909M5035N5329l779P631l69p843k0756k2916j9949
13180C39710m0095l3368r568p8J9178N8804R3259J59402J78623J59649J05614
13169A031130M7520J3892k5759m7415q5504j65778j77636j26438n0763k8046m546
13158C80657j526r797k6912k6610j864n449k963J5199q319K0404N5723P7607J12736
$$ plain form
13145 578886 698819 830825 922487 970796 958645 945839 932790 878284 746806 623214 515365
13134 515365 444686 409846 370174 364313 388340 455214 589246 752733 899626 1002989 1046869
13123 1046869 1060118 1063478 1041949 970792 796287 626922 519818 412543 372282 353499 352997
13112 352997 354405 344900 301036 270795 256797 270070 263722 280550 335090 354189 401320 474807
13100 474807 563267 689451 793271 881801 926373 955588 937311 861027 729125 601799 503151
13089 503151 423584 358805 306249 259607 253166 275313 317430 380840 431341 459021 456285 444329
13077 444329 440293 412827 350397 276327 260532 255424 241928 237120 205356 190700 199926 187021
13065 187021 159571 159094 165138 163211 166542 153794 154374 139409 154684 185398 222191 260455 313503
$$ packed form
13145E78886J19933J32006R1662M8309j2151j2806j3049n4506j31478j23592j07849
13134E15365p0679l4840l9672n861K4027O6874J34032J63487J46893J03363M3880
13123A046869J3249L360k1529p1157j74505j69365j07104j07275m0261j8783n02
13112C52997J408r505m3864l0241j3998J3273o348J6828N4540J9099M7131P3487
13100D74807Q8460J26184J03820Q8530M4572K9215j8277p6284j31902j27326r8648
13089E03151p9567o4779n2556m6642o441K2147M2117O3410N0501K7680k736j1956
13077D44329m036k7466o2430p4070j5795n108j3496m808l1764j4656R226j2905
13065A87021k7450m77O044j927L331j2748N80j4965J5275L0714L6793L8264N3048
$$ plain form
13052 313503 363247 382403 362719 350787 326088 313274 253850 208925 177903 160572 131274
13041 131274 107205 115452 123699 144187 146282 154229 158307 154256 147550 128748 125722 136044 148236
13028 148236 167730 177723 200497 243213 241852 211930 201127 197819 178512 180340 204389 158762
13016 158762 125763 119209 93236 66352 53632 73249 100098 75446 73610 79481 68958 55155
13004 55155 71535 77165 75577 87458 99384 84875 72653 88269 72182 96744 111439 117135
12992 117135 116315 129079 133090 144487 137026 139409 187470 219084 278724 358221 429229 483758
12980 483758 510455 506538 504970 508936 460947 365769 288543 211831 196406 183505 169653 154263
12968 154263 117996 80069 81537 97784 113205 139341 170219 175078 165817 123972 94345 94482
$$ packed form
13052C13503M9744J9156j9684j1932k4699j2814n9424m4925l1022j7331k9298
13041A31274k4069Q247Q247K0488K095P947M078m051o706j8802l026J0322J2192
13028A48236J9494R993K2774M2716j361k9922j0803l308j9307J828K4049m5627
13016A58762l2999o554k5973k6884j2720J9617K6849k4652j836N871j0523j3803
13004E5155J6380N630j588J1881J1926j4509j2222J5616j6087K4562J4695N696
12992A17135q20J2764M011J1397p461K383M8061L1614N9640P9497P1008N4529
12980D83758K6697l917j568L966m7989r5178p7226p6712j5425j2901j3852j5390
12968A54263l6267l7927J468J6247J5421K6136L0878M859r261m1845k9627J37
$$ plain form
12956 94482 98370 86169 89255 79733 96740 104584 110783 89403 72220 53106 94619 124985 143609
12943 143609 171003 196754 233570 265667 312225 393468 489464 525400 516698 500349 474225 476380
12931 476380 464875 414344 353228 284575 229472 194544 173548 169881 191810 158641 134936 132103
12919 132103 147750 174129 123689 107677 92031 65108 49762 56444 56688 89324 110864 88323
12907 88323 55174 62630 100382 121364 131113 140337 108691 107665 136075 114995 114251 100476 121056
12894 121056 146266 190708 218877 247622 219946 172325 165354 195278 207810 183358 164170 140879
12882 140879 105392 93458 68251 63137 54679 50184 58838 37318 10312 23852 44045 77766
12870 77766 80407 89256 87519 53285 51805 67028 61201 46204 20605 20586 26689 -21557 -7670
$$ packed form
12956I4482L888j2201L086r522J7007P844O199k1380j7183j9114M1513L0366J8624
12943A43609K7394K5751L6816L2097M6558Q1243R5996L5936q702j6349k6124K155
12931D76380j1505n0531o1116o8653n5103l4928k0996l667K1929l3169k3705k833
12919A32103J5647K6379n0440j6012j5646k6923j5346O682K44L2636K1540k2541
12907H8323l3149P456L7752K0982R749R224l1646j026K8410k1080p44j3775K0580
12894A21056K5210M4442K8169K8745k7676m7621o971K9924J2532k4452j9188k3291
12882A40879l5487j1934k5207n114q458m495Q654k1520k7006J3540K0193L3721
12870G7766K641Q849j737l4234j480J5223n827j4997k5599j9O103m8246J3887
$$ plain form
12857 -7670 41219 55678 61576 68574 72098 83574 101970 97118 57145 51249 49961 72685 55466
12844 55466 63239 72586 50499 31329 31123 10389 -7077 35728 76886 92674 70280 49388
12832 49388 56960 73281 56527 70155 79500 51951 30693 34675 53460 66445 72228 38804
12820 38804 21255 20615 28149 25626 9429 33481 68647 87019 74943 88414 98943 96050 94973
12807 94973 79858 78229 81425 78671 72758 54089 65489 70645 78783 65778 70853 74559 67071
12794 67071 93875 112136 91430 106087 117026 139206 167196 169007 159117 136926 130362 154769
12782 154769 202943 234219 277313 309824 327967 336150 321645 311444 298871 288281 245559 221066
12770 221066 213486 186120 150522 157669 190027 193481 179253 177905 197073 210332 206763 219686
$$ packed form
12857g670M8889J4459N898O998L524J1476J8396m852l9973n896j288K2724j7219
12844E5466P773R347k2087j9170k06k0734j7466M2805M1158J5788k2394k0892
12832D9388P572J6321j6754J3628R345k7549k1258L982J8785J2985N783l3424
12820C8804j7549o40P534k523j6197K4052L5166J8372j2076J3471J0529k893j077
12807I4973j5115j629L196k754n913j8669J1400N156Q138j3005N075L706p488
12794F7071K6804J8261k0706J4657J0939K2180K7990J811r890k2191o564K4407
12782A54769M8174L1276M3094L2511J8143Q183j4505j0201j2573j0590m2722k4493
12770B21066p580k7366l5598P147L2358L454j4228j348J9168J3259l569J2923
$$ plain form
12758 219686 254694 271340 255980 243890 242054 280871 309810 282445 301025 332268 327378 306045
12746 306045 316065 312141 293709 276329 307751 326505 336543 334862 322782 290806 283980 266864
12734 266864 246961 237789 235222 234963 234035 224401 231897 248783 219984 212682 223801 232340 256899
12721 256899 296047 319455 350551 370142 384695 393525 345667 335309 350426 340027 303021 270089
12709 270089 274970 246928 214088 192249 170894 164258 165044 153593 121769 129331 141062 139193 130898
12696 130898 106402 128636 141987 148608 173999 182132 185913 184139 133791 93256 104497 111502
12684 111502 100963 122633 136199 140911 141158 142899 129608 141328 129373 122062 123995 135956 163606
12671 163606 201963 233850 252799 288218 319428 339401 356219 346540 328262 304803 285680 252514
$$ packed form
12758B19686L5008J6646j5360j2090j836L8817K8939k7365J8580L1243m890k1333
12746C06045J0020l924j8432j7380L1422J8754J0038j681j2080l1976o826j7116
12734B66864j9903r172k567k59r28r634P496J6886k8799p302J1119Q539K4559
12721B56899L9148K3408L1096J9591J4553Q830m7858j0358J5117j0399l7006l2932
12709B70089M881k8042l2840k1839k1355o636P86j1451l1824P562J1731j869q295
12696A30898k4496K2234J3351O621K5391Q133L781j774n0348m0535J1241P005
12684A11502j0539K1670J3566M712K47J741j3291J1720j1955p311J933J1961K7650
12671A63606L8357L1887J8949L5419L1210J9973J6818r679j8278k3459j9123l3166
$$ plain form
12659 252514 229441 217775 188239 170785 136795 122652 121138 155227 159944 162903 169580 148668
12647 148668 147681 144290 161194 180167 187173 205063 221819 246575 265315 248316 273547 306177
12635 306177 321242 356704 364706 384009 433757 473662 496419 555827 597047 604626 610273 618004
12623 618004 617043 587238 526834 450445 392854 373973 332961 300509 274727 264362 284262 271466
12611 271466 264851 246167 225049 206044 196491 209413 213689 234246 246505 248428 223090 245872
12599 245872 243621 258482 257586 228455 220236 241452 250491 287573 321691 348713 387528 445453
12587 445453 471436 441692 427057 442427 430415 406032 384881 387884 370615 343086 298693 300491
12575 300491 279707 271589 248353 231678 250247 294209 265770 243391 247466 245068 261111 280975
$$ packed form
12659B52514k3073j1666k9536j7454l3990j4143j514L4089M717K959O677k0912
12647A48668r87l391J6904J8973P006J7890J6756K4756J8740j6999K5231L2630
12635C06177J5065L5462Q002J9303M9748L9905K2757N9408M1220P579N647P731
12623F18004r61k9805o0404p6389n7591j8881m1012l2452k5782j0365J9900j2796
12611B71466o615j8684k1118j9005r553J2922M276K0557J2259J923k5338K2782
12599B45872k251J4861q96k9131q219K1216R039L7082L4118K7022L8815N7925
12587D45453K5983k9744j4635J5370j2012k4383k1151L003j7269k7529m4393J798
12575C00491k0784q118k3236j6675J8569M3962k8439k2379M075k398J6043J9864
$$ plain form
12563 280975 295558 310847 260996 241369 230307 205014 192741 220515 220634 254289 263472 248956
12551 248956 223628 199683 184248 161279 185768 217358 226624 211685 251290 259333 223512 198406
12539 198406 186523 197924 218734 193260 187493 180193 180844 181447 203813 191567 184493 179629 193006
12526 193006 217906 227523 214178 226596 226296 228806 228832 214836 184506 191222 210894 239341 271969
12513 271969 260513 234129 245475 273781 282504 285762 299560 319314 325074 331313 358543 390410
12501 390410 400461 398908 399448 391169 400769 434100 444262 454761 547189 603558 588059 623379
12489 623379 649350 680053 689929 685316 661560 663271 631788 579057 546010 497819 496176 477776
12477 477776 441628 444173 402142 380172 385557 405683 405401 391534 402041 409441 411137 418435 437580
$$ packed form
12563B80975J4583J5289m9851j9627j1062k5293j2273K7774J19L3655R183j4516
12551B48956k5328k3945j5435k2969K4489L1590R266j4939L9605Q043l5821k5106
12539A98406j1883J1401K0810k5474n767p300O51O03K2366j2246p074m864J3377
12526A93006K4900R617j3345J2418l00K510K6j3996l0330O716J9672K8447L2628
12513B71969j1456k6384J1346K8306Q723L258J3798J9754N760O239K7230L1867
12501C90410J0051j553N40q279R600L3331J0162J0499R2428N6369j5499L5320
12489F23379K5971L0703R876m613k3756J711l1483n2731l3047m8191j643j8400
12477D77776l6148K545m2031k1970N385K0126k82j3867J0507P400J696P298J9145
$$ plain form
12464 437580 441231 424074 409674 415645 451540 436291 445332 447554 434336 435068 453460 464098 472639
12451 472639 456635 450783 469154 491113 521762 529381 506971 477019 495585 520545 510550 510671
12439 510671 496642 490299 491853 458745 455521 482950 537275 555422 538083 534278 544278 552638
12427 552638 534035 543426 563066 559640 544676 538451 561624 567861 597624 590461 583158 614463 637044
12414 637044 642746 664011 681479 700393 708346 719869 719115 722133 747978 767053 780662 796203
12402 796203 829969 901040 946517 960761 972811 1000794 1070163 1109097 1146270 1176342 1200976
12391 1200976 1239444 1282565 1310293 1349716 1413902 1483064 1557555 1631021 1705691 1780494 1870248
12380 1870248 1963340 2083407 2222513 2380996 2574087 2779477 2976831 3236036 3548432 3901304
$$ packed form
12464D37580L651j7157j4400N971L5895j5249R041K222j3218P32J8392J0638Q541
12451D72639j6004n852J8371K1959L0649P619k2410k9952J8566K4960r995J21
12439E10671j4029o343J554l3108l224K7429N4325J8147j7339l805J0000Q360
12427E52638j8603R391J9640l426j4964o225K3173O237K9763p163p303L1305K2581
12414F37044N702K1265J7468J8914P953J1523p54L018K5845J9075J3609J5541
12402G96203L3766P1071M5477J4244J2050K7983O9369L8934L7173L0072K4634
12391A200976L8468M3121K7728L9423O4186O9162P4491P3466P4670P4803Q9754
12380A870248R3092J20067J39106J58483J93091K05390J97354K59205L12396L52872
$$ plain form
12370 3901304 4306501 4799786 5404451 6096382 6897372 7847405 9051859 10609677 12556549
12361 12556549 15031158 18202906 22216073 27106727 32649003 38364349 43722957 48207859
12353 48207859 51477305 53325453 53685915 52499655 49934599 46317952 42166522 38058716
12345 38058716 34402763 31357522 28931194 27122449 25923826 25332258 25438103 26224372
12337 26224372 27599093 29513447 31773458 34141761 36465468 38686414 40805942 42852400
12329 42852400 44869387 46909535 49007189 51176883 53358258 55406334 57009400 57951198
12321 57951198 58073812 57359258 55944480 54095231 52099287 50089538 48303165 46772138
12313 46772138 45409721 44096630 42720692 41208556 39472903 37523836 35481099 33483825
$$ packed form
12370C901304M05197M93285O04665O91931Q00990R50033J204454J557818J946872
12361A2556549K474609L171748M013167M890654N542276N715346N358608M484902
12353D8207859L269446J848148L60462j186260k565056l616647m151430m107806
12345C8058716l655953l045241k426328j808745j198623n91568J05845P86269
12337B6224372J374721J914354K260011K368303K323707K220946K119528K046458
12329D2852400K016987K040148K097654K169694K181375K048076J603066R41798
12321E7951198J22614p14554j414778j849249j995944k009749j786373j531027
12313D6772138j362417j313091j375938j512136j735653j949067k042737j997274
$$ plain form
12305 33483825 31719177 30452161 29835081 29930789 30776806 32371283 34729778 37798480 41626872
12296 41626872 46119047 51031273 55897335 60080375 62957298 64245572 63826716 61756445
12288 61756445 58182541 53325817 47590924 41607219 35998769 31140193 27187150 24090480
12280 24090480 21692286 19804437 18230732 16928687 15845532 14956625 14158264 13437745
12272 13437745 12790477 12201297 11653214 11148338 10694413 10314844 9962022 9613949 9317953
12263 9317953 9063057 8848338 8673870 8558342 8507623 8485849 8513134 8584850 8722496 8922715
12253 8922715 9188292 9565408 10092400 10772121 11672081 12860987 14402338 16460085 19255935
12244 19255935 23003654 27799220 33519537 39709586 45585242 50360886 53585617 54998145
$$ packed form
12305C3483825j764648j267016o17080R5708Q46017J594477K358495L068702L828392
12296D1626872M492175M912226M866062M183040K876923J288274m18856k070271
12288F1756445l573904m856724n734893n983705n608450m858576l953043l096670
12280B4090480k398194j887849j573705j302045j083155q88907p98361p20519
12272A3437745o47268n89180n48083n04876m53925l79569l52822l48073k95996
12263I317953k54896k14719j74468j15528n0719k1774K7285P1716J37646K00219
12253H922715K65577L77116N26992O79721Q99960J188906J541351K057747K795850
12244A9255935L747719M795566N720317O190049N875656M775644L224731J412528
$$ plain form
12236 54998145 54582811 52361993 48392530 43169359 37448310 32000733 27355480 23699688
12228 23699688 20948352 18913428 17454215 16397989 15608860 15051358 14650069 14353073 14190900
12219 14190900 14136726 14228060 14439262 14803425 15348765 16032497 16923635 18070042 19430327
12210 19430327 21044428 23015384 25415500 28501135 32555375 37908682 44815571 53371994
12202 53371994 63268848 73720791 83578295 91704603 97249375 99757681 99060988 95167648
12194 95167648 88369426 79461508 69640941 60098660 51687746 44784724 39386407 35226144
12186 35226144 32018206 29517012 27495513 25772404 24245112 22860094 21609761 20469587
12178 20469587 19486062 18633448 17948203 17443896 17082331 16842533 16763465 16864002 17173085
$$ packed form
12236E4998145m15334k220818l969463n223171n721049n447577m645253l655792
12228B3699688k751336k034924j459213j056226p89129n57502m01289k96996j62173
12219A4190900n4174R1334K11202L64163N45340O83732Q91138J146407J360285
12210A9430327J614101J970956K400116L085635M054240N353307O906889Q556423
12202E3371994R896854J0451943R857504Q126308N544772K508306o96693l893340
12194I5167648o798222q907918r820567r542281q410914o903022n398317m160263
12186C5226144l207938k501194k021499j723109j527292j385018j250333j140174
12178B0469587r83525q52614o85245n04307l61565k39798p9068J00537L09083
$$ plain form
12169 17173085 17725190 18577128 19876111 21749670 24332088 27841344 32433450 38060164
12161 38060164 44321055 50450832 55529190 58882974 60334393 59865364 57492898 53263091
12153 53263091 47539602 41059530 34765541 29375905 25094379 21847406 19416602 17562017
12145 17562017 16144046 15029477 14103604 13297797 12576885 11922497 11342736 10767907 10207627
12136 10207627 9683617 9188535 8704580 8237401 7822117 7436118 7094104 6787544 6476375
12127 6476375 6202843 5964476 5775547 5572981 5387825 5239781 5085297 4904458 4791225
12118 4791225 4672857 4517524 4362949 4182799 4029382 3902038 3778427 3649364 3510695
12109 3510695 3394156 3319433 3251336 3168822 3074507 2995126 2927442 2874051 2838870 2774009 2713658
$$ packed form
12169A7173085N52105Q51938J298983J873559K582418L509256M592106N626714
12161C8060164O260891O129777N078358L353784J451419m69029k372466m229807
12153E3263091n723489o480072o293989n389636m281526l246973k430804j854585
12145A7562017j417971j114569r25873q05807p20912o54388n79761n74829n60280
12136A0207627n24010m95082m83955m67179m15284l85999l42014l06560l11169
12127F476375k73532k38367j88929k02566j85156j48044j54484j80839j13233
12118D791225j18368j55333j54575j80150j53417j27344j23611j29063j38669
12109C510695j16539p4723o8097q2514r4315p9381o7684n3391l5181o4861o0351
$$ plain form
12098 2713658 2674509 2619973 2535665 2447960 2350350 2265158 2178927 2071361 1978299 1904594 1881686
12087 1881686 1847879 1809261 1735238 1684180 1682148 1654689 1627272 1598543 1546860 1508356 1480473
12076 1480473 1487181 1461403 1408489 1380950 1334315 1296058 1270309 1224206 1201302 1183495 1129794
12065 1129794 1105623 1078658 1065752 1076092 1057267 1040943 1042461 1053813 1011701 967310 910655
12054 910655 858670 828547 802296 771489 731056 740972 741321 734149 701939 672233 648461 593422
12042 593422 556602 554620 580987 571484 549475 542688 538534 528758 543316 535737 526187 518396 511771
12029 511771 501631 498384 467853 488264 528576 514660 464562 405339 383317 400049 432380 448839
12017 448839 460183 461218 470537 465073 444874 433131 412641 391318 376841 377732 372793 381611 377250
$$ packed form
12098B713658l9149n4536q4308q7705r7610q5192q6231j07566r3062p3705k2908
12087A881686l3807l8618p4023n1058k032k7459k7417k8729n1683l8504k7883
12076A480473O708k5778n2914k7539m6635l8257k5749m6103k2904j7807n3701
12065A129794k4171k6965j2906J0340j8825j6324J518J1352m2112m4391n6655
12054I10655n1985l0123k6251l0807m0433R916L49p172l2210k9706k3772n5039
12042E93422l6820j982K6367r503k2009o787m154r776J4558p579r550p791o625
12029E11771j0140l247l0531K0411M0312j3916n0098n9223k2022J6732L2331J6459
12017D48839J1344J035R319n464k0199j1743k0490k1323j4477Q91m939Q818m361
$$ plain form
12004 377250 375121 370830 355893 324102 311868 331979 343960 325528 302178 289041 268181 272806
11992 272806 294357 312860 312777 315213 281948 268946 289248 317569 336602 333122 329274 329512 324365
11979 324365 304856 302045 275476 285858 280809 257333 251326 259010 258100 270226 245521 248940 267386
11966 267386 270445 248235 227601 232817 210707 204155 228244 260369 232658 209178 204568 195919
11954 195919 165309 140383 175181 158747 129167 132323 142738 142987 163944 205313 230319 236044
11942 236044 222084 200944 174814 189581 221734 237997 240903 211410 193143 190671 192966 200666
11930 200666 209240 209221 213922 227494 281616 311461 357608 388704 417763 417230 439093 439962 420222
11917 420222 379612 363542 360635 349487 322423 289777 290449 296360 305580 299675 269353 232407 244376
$$ packed form
12004C77250k129m291j4937l1791j2234K0111J1981j8432k3350j3137k0860M625
11992B72806K1551J8503q3K436l3265j3002K0302K8321J9033l480l848K38n147
11979C24365j9509k811k6569J0382n049k3476o007P684r10J2126k4705L419J8446
11966B67386L059k2210k0634N216k2110o552K4089L2125k7711k3480m610q649
11954A95919l0610k4926L4798j6434k9580L156J0415K49K0957M1369K5006N725
11942B36044j3960k1140k6130J4767L2153J6263K906k9493j8267k472K295P700
11930B00666Q574j9M701J3572N4122K9845M6147L1096K9059n33K1863Q69j9740
11917D20222m0610j6070k907j1148k7064l2646O72N911R220n905l0322l6946J1969
$$ plain form
11904 244376 242109 254939 284720 297860 316550 318510 326689 371001 371816 397034 436693 466119
11892 466119 453666 440122 470519 484600 449144 423776 405114 394409 376877 355678 312320
11881 312320 283093 312033 322776 312217 282787 268888 261256 235343 231344 253611 265459 293562
11869 293562 298978 277295 290927 315803 324177 343293 397801 413986 424688 456077 473443 468602
11857 468602 424047 399750 383836 345588 324046 301218 281634 256273 227642 205350 192258
11846 192258 206078 232681 212919 230912 200405 147819 164504 162177 170029 160164 146612 143893
11834 143893 131385 129794 160623 154883 142626 153831 156211 131248 144331 175860 191257 186548
11822 186548 207961 197525 169270 133806 153365 173404 187848 170328 151995 157381 174265 174879
$$ packed form
11904B44376k267J2830K9781J3140J8690J960Q179M4312Q15K5218L9659K9426
11892D66119j2453j3544L0397J4081l5456k5368j8662j0705j7532k1199m3358
11881C12320k9227K8940J0743j0559k9430j3899p632k5913l999K2267J1848K8103
11869B93562N416k1683J3632K4876Q374J9116N4508J6185J0702L1389J7366m841
11857D68602m4555k4297j5914l8248k1542k2828j9584k5361k8631k2292j3092
11846A92258J3820K6603j9762J7993l0507n2586J6685k327P852r865j3552k719
11834A43893j2508j591L0829n740j2257J1205K380k4963J3083L1529J5397m709
11822A86548K1413j0436k8255l5464J9559K0039J4444j7520j8333N386J6884O14
$$ plain form
11810 174879 155632 193067 213969 249563 260717 284889 342334 360716 376851 374888 357177 342795
11798 342795 317903 268599 240109 201057 180268 186719 224610 234510 196871 163368 167675 166501
11786 166501 168131 179767 186339 191648 183721 167760 173394 161638 143080 147919 168415 182908 210348
11773 210348 219360 234132 283940 324582 358586 390928 435122 458130 488740 514804 587034 633954
11761 633954 605833 560739 561307 523578 468548 404188 355830 352041 331302 325962 316215 274454
11749 274454 230924 230329 226318 222712 227158 234490 240148 248673 239338 222998 206331 196720 213019
11736 213019 186530 202678 235465 237704 225523 224107 252296 280674 318532 354109 380259 395381
11724 395381 403576 428568 430939 406570 393164 407604 401404 333383 300049 282784 257507 235657
$$ packed form
11810A74879j9247L7435K0902L5594J1154K4172N7445J8382J6135j963j7711j4382
11798C42795k4892m9304k8490l9052k0789O451L7891R900l7639l3503M307j174
11786A66501J630J1636O572N309p927j5961N634j1756j8558M839K0496J4493K7440
11773B10348R012J4772M9808M0642L4004L2342M4194K3008L0610K6064P2230M6920
11761F33954k8121m5094N68l7729n5030o4360m8358l789k0739n340r747m1761
11749B74454m3530n95m011l606M446P332N658Q525r335j6340j6667r611J6299
11736B13019k6489J6148L2787K239j2181j416K8189K8378L7858L5577K6150J5122
11724C95381Q195K4992K371k4369j3406J4440o200o8021l3334j7265k5277k1850
$$ plain form
11712 235657 217666 195662 203015 227514 227176 209944 188824 173610 173719 159281 147304 131410
11700 131410 148423 166433 165426 153983 108182 110256 115824 111604 128894 127951 147497 146155 124578
11687 124578 122120 134625 125306 95162 85166 94614 105767 80800 41661 48871 69728 83369
11675 83369 90511 94751 92089 103230 122647 146092 151424 127568 122728 121472 119783 110670 84640
11662 84640 61016 46294 42217 50720 67475 85654 98529 93433 72168 37864 33185 45666
11650 45666 68280 51560 39008 42779 56950 49911 70564 86498 106432 78053 65381 50215
11638 50215 55559 45244 58073 68816 76430 68831 87953 87908 60772 60481 28177 23590 37241
11625 37241 17280 -10146 -24648 -1892 7738 28257 23072 34373 38040 4753 -17647 -15443
$$ packed form
11712B35657j7991k2004P353K4499l38j7232k1120j5214J09j4438j1977j5894
11700A31410J7013J8010j007j1443m5801K074N568m220J7290r43J9546j342k1577
11687A24578k458J2505r319l0144r996R448J1153k4967l9139P210K0857J3641
11675H3369P142M240k662J1141J9417K3445N332k3856m840j256j689r113k6030
11662H4640k3624j4722m077Q503J6755J8179J2875n096k1265l4304m679J2481
11650D5666K2614j6720j2552L771J4171p039K0653J5934J9934k8379j2672j5166
11638E0215N344j0315J2829J0743P614p599J9122m5k7136k91l2304m587J3651
11625C7241j9961k7426j4502K2756R630K0519n185J1301L667l3287k2400K204
$$ plain form
11613 -15443 17815 13131 10398 -1599 19439 6559 18031 24815 19569 7560 8280 -16276 -15905
11600 -15905 -152 63691 75730 64679 59683 37974 35661 56791 60261 63347 60082 48264 46577
11587 46577 40822 43301 31179 13357 34865 41548 42886 66444 42264 14144 19674 15405 3170
11574 3170 5657 24336 55386 72569 86800 76951 60222 45320 33344 11114 32423 63016
11562 63016 48575 14814 29014 50966 27462 -6438 -8808 2712 14583 5182 3362 13169
11550 13169 -2349 -16849 -8483 39152 56614 48818 58746 64559 61486 48298 31958 26334 27368
11537 27368 34612 7436 -26374 -44102 -27228 -4056 6090 -374 -19130 -18583 4001 8066 17124
11524 17124 41037 41107 57517 46841 28622 30774 48629 48022 26980 30383 24689 20528 34101
$$ packed form
11613a5443L3258m684k733j1997K1038j2880J1472O784n246j2009P20k4556L71
11600a5905J5753O3843J2039j1051m996k1709k313K1130L470L086l265j1818j687
11587D6577n755K479j2122j7822K1508O683J338K3558k4180k8120N530m269j2235
11574C170K487J8679L1050J7183J4231r849j6729j4902j1976k2230K1309L0593
11562F3016j4441l3761J4200K1952k3504l3900k370J1520J1871r401j820R807
11550A3169j5518j4500Q366M7635J7462p796R928N813l073j3188j6340n624J034
11537B7368P244k7176l3810j7728J6874K3172J0146o464j8756N47K2584M065R058
11524A7124K3913P0J6410j0676j8219K152J7855o07k1042L403n694m161J3573
$$ plain form
11511 34101 54832 27736 30546 53793 87834 94286 90541 82260 67315 59919 63827 77630 100015
11498 100015 82188 45898 60641 62540 62158 45765 41764 39071 47515 67472 60490 48654 63520
11485 63520 58377 66219 42501 29636 47536 33829 1849 7236 2999 14732 49898 69286
11473 69286 98604 105172 99469 83846 50684 73263 58255 77118 87094 87768 62918 64250 45956
11460 45956 52685 53035 28521 23870 35027 32806 32173 58583 32146 44561 64117 77813 80620
11447 80620 79396 86407 73008 40906 14723 21911 38438 63625 69399 80103 95524 90462 86552
11434 86552 75742 56818 49907 34952 63361 81389 81329 73196 79892 90825 108462 151313 167523
11421 167523 176640 192103 207095 210221 202466 194340 194451 178551 159526 147725 136005 151736 125192
$$ packed form
11511C4101K0731k7096K810K3247L4041O452l745q281j4945p396L908J3803K2385
11498A00015j7827l6290J4743J899l82j6393m001k693Q444J9957o982j1836J4866
11485F3520n143P842k3718j2865J7900j3707l1980N387m237J1733L5166J9388
11473F9286K9318O568n703j5623l3162K2579j5008J8863R976O74k4850J332j8294
11460D5956O729L50k4514m651J1157k221o33K6410k6437J2415J9556J3696K807
11447H0620j224P011j3399l2102k6183P188J6527K5187N774J0704J5421n062l910
11434H6552j0810j8924o911j4955K8409J8028o0q133O696J0933J7637M2851J6210
11421A67523R117J5463J4992L126p755q126J11j5900j9025j1801j1720J5731k6544
$$ plain form
11408 125192 130679 127967 116377 140164 181403 179694 179122 165430 168969 169239 186867 191113 188610
11395 188610 198813 218373 235247 240462 251689 262492 287310 305199 315525 298434 326535 347121
11383 347121 367564 352834 357673 344623 336529 335678 322473 304281 293449 261587 233534 235057
11371 235057 230815 205529 211669 205463 208207 233713 234191 215544 220485 247747 267980 280405 290720
11358 290720 283629 274572 249036 224098 243547 259140 280436 298882 305721 283816 260361 212638
11346 212638 166006 163969 155311 147619 147540 160499 136626 99352 77193 97325 141431 152229 180154
11333 180154 194297 172471 174417 165511 149442 155018 189442 193316 218981 227331 216650 276274
11321 276274 364273 397951 416497 462869 490458 509812 496613 449004 410195 386111 378251 356373
$$ packed form
11408A25192N487k712j1590K3787M1239j709n72j3692L539K70J7628M246k503
11395A88610J0203J9560J6874N215J1227J0803K4818J7889J0326j7091K8101K0586
11383C47121K0443j4730M839j3050q094q51j3205j8192j0832l1862k8053J523
11371B35057m242k5286O140o206K744K5506M78j8647M941K7262K0233J2425J0315
11358B90720p091r057k5536k4938J9449J5593K1296J8446O839k1905k3455m7723
11346B12638m6632k037q658p692p9J2959k3873l7274k2159K0132M4106J0798K7925
11333A80154J4143k1826J946q906j6069N576L4424L874K5665Q350j0681N9624
11321B76274Q7999L3678J8546M6372K7589J9354j3199m7609l8809k4084p860k1878
$$ plain form
11309 356373 334342 310111 292319 258676 218868 178830 186811 214785 254738 259664 257796 280958
11297 280958 297241 299791 284639 289694 336926 330628 307197 311768 330381 363597 392042 404624
11285 404624 413513 445397 460240 434896 409554 381945 378914 391079 387498 376672 359804 354490
11273 354490 333371 305489 274627 253947 251548 242366 221273 222244 237761 222925 214589 228629
11261 228629 266542 293560 300586 310885 313922 339929 390753 405791 420293 421285 425857 436714
11249 436714 405579 372554 323806 283148 269663 234098 244418 241403 198847 202760 212867 224009
11237 224009 211835 194431 158832 161449 141262 138764 142281 163010 190986 188511 156333 135106
11225 135106 137065 141469 142060 119348 138427 186578 177774 162486 145293 157985 161486 138794 86000
$$ packed form
11309C56373k2031k4231j7792l3643l9808m0038P981K7974L9953M926j868K3162
11297B80958J6283K550j5152N055M7232o298k3431M571J8613L3216K8445J2582
11285D04624Q889L1884J4843k5344k5342k7609l031J2165l581j0826j6868n314
11273C54490k1119k7882l0862k0680k399r182k1093R71J5517j4836q336J4040
11261B28629L7913K7018P026J0299L037K6007N0824J5038J4502R92M572J0857
11249D36714l1135l3025m8748m0658j3485l5565J0320l015m2556L913J0107J1142
11237B24009j2174j7404l5599K617k0187k498L517K0729K7976k475l2178k1227
11225A35106J959M404N91k2712J9079M8151q804j5288j7193J2692L501k2692n2794
$$ plain form
11212 86000 66418 83283 96756 102834 84762 86668 102996 94217 80398 98762 101917 130030
11200 130030 122955 116967 133025 121229 111669 104974 121159 146823 135305 130895 126157 112348 90278
11187 90278 88145 90949 90156 48349 12727 34655 86775 81424 54698 70831 97711 115751 128126
11174 128126 145323 153265 148509 186864 225594 275217 309548 348676 389337 449711 448946 461405
11162 461405 482468 459098 423250 383304 346794 312717 298737 274888 250559 247741 213247 228814
11150 228814 246169 217176 154789 125256 114745 106174 129375 160717 152266 139748 130915 134692
11138 134692 156645 183234 189888 222007 248589 277455 271893 247242 254609 228125 204596 214519
11126 214519 198840 191590 195784 200728 193362 178858 175589 193399 222626 220759 238554 220610 195164
$$ packed form
11212H6000j9582J6865J3473O078j8072J906J6328q779j3819J8364L155K8113
11200A30030p075n988J6058j1796r560o695J6185K5664j1518m410m738j3809k2070
11187I0278k133K804p93m1807l5622K1928N2120n351k6726J6133K6880J8040J2375
11174A28126J7197P942m756L8355L8730M9623L4331L9128M0661O0374p65J2459
11162D61405K1063k3370l5848l9946l6510l4077j3980k3849k4329k818l4494J5567
11150B28814J7355k8993o2387k9533j0511q571K3201L1342q451j2518q833L777
11138A34692K1953K6589O654L2119K6582K8866n562k4651P367k6484k3529R923
11126B14519j5679p250M194M944p366j4504l269J7810K9227j867J7795j7944k5446
$$ plain form
11113 195164 194705 202238 193676 199229 175514 140024 136446 158724 177834 172758 206007 227373 183932
11100 183932 188640 182252 160050 166784 175412 178831 180979 192519 220020 243506 232333 247221 263858
11087 263858 274162 295313 319935 346784 335729 324313 320593 305743 290097 304961 297604 311562
11075 311562 350952 373020 381755 400424 418464 430177 468423 499058 488693 453395 444610 451646
11063 451646 475721 483696 461356 409197 395370 417820 416409 452738 484016 482709 496629 560158
11051 560158 635639 671343 689443 723354 718343 744760 755973 713754 691392 659767 631166 631641
11039 631641 644374 634181 621724 632620 658848 636775 638231 656411 630637 600119 597098 576739
11027 576739 544409 504291 470749 439640 467064 474155 459173 454916 439578 440433 472861 503610
$$ packed form
11113A95164m59P533q562N553k3715l5490l578K2278J9110n076L3249K1366m3441
11100A83932M708o388k2202O734Q628L419K148J1540K7501K3486j1173J4888J6637
11087B63858J0304K1151K4622K6849j1055j1416l720j4850j5646J4864p357J3958
11075C11562L9390K2068Q735J8669J8040J1713L8246L0635j0365l5298q785P036
11063D51646K4075P975k2340n2159j3827K2450j411L6329L1278j307J3920O3529
11051E60158P5481L5704J8100L3911n011K6417J1213m2219k2362l1625k8601M75
11039F31641J2733j0193j2457J0896K6228k2073J456J8180k5774l0518l021k0359
11027E76739l2330m0118l3542l1109K7424P091j4982m257j5338Q55L2428L0749
$$ plain form
11015 503610 519110 534380 556807 559870 538075 556146 558675 555359 582058 609380 616861 615017
11003 615017 608803 635750 651742 680144 688580 671238 640132 606710 605484 584992 566747 563046
10991 563046 538786 520269 539415 530105 542514 530683 537815 555151 568645 540041 531031 520055
10979 520055 516344 515304 507414 480187 488118 492714 480304 488873 493916 509945 495937 516243 530489
10966 530489 537544 562056 584234 593905 616971 612943 620694 624466 638089 648959 660827 677436
10954 677436 698996 718190 730440 773359 805386 820036 805699 813128 837697 871900 904447 935166
10942 935166 980079 1014514 1038292 1062754 1118222 1169947 1230102 1300404 1371693 1442886 1526148
10931 1526148 1628170 1734596 1840647 1980346 2113418 2251756 2451295 2649327 2843310
$$ packed form
11015E03610J5500J5270K2427L063k1795J8071K529l316K6699K7322P481j844
11003F15017o214K6947J5992K8402Q436j7342l1106l3422j226k0492j8245l701
10991E63046k4260j8517J9146r310J2409j1831P132J7336J3494k8604r010j0976
10979E20055l711j040p890k7227P931M596j2410Q569N043J6029j4008K0306J4246
10966E30489P055K4512K2178R671K3066m028P751L772J3623J0870J1868J6609
10954F77436K1560J9194J2250M2919L2027J4650j4337P429K4569L4203L2547L0719
10942I35166M4913L4435K3778K4462N5468N1725O0155P0302P1289P1193Q3262
10931A526148J02022J06426J06051J39699J33072J38338J99539J98032J93983
$$ plain form
10922 2843310 3083934 3360528 3688306 4037527 4418875 4886608 5467259 6154100 7033473
10913 7033473 8094115 9411037 11065658 13163202 15832843 19242601 23466512 28536496
10905 28536496 34259780 40244753 46009808 50986302 54755884 57093450 57826475 56893041
10897 56893041 54409276 50778171 46445047 41934775 37727787 34085948 31091364 28829259
10889 28829259 27378986 26688267 26842740 27833816 29526119 31621411 33797432 35829534
10881 35829534 37593874 39065029 40270823 41317678 42346450 43653665 45468304 47871896
10873 47871896 50750272 53784892 56501149 58475708 59465432 59438351 58433619 56595305
10865 56595305 54247808 51816607 49624500 47818357 46276057 44825853 43310701 41596359
$$ packed form
10922B843310K40624K76594L27778L49221L81348M67733N80651O86841Q79373
10913G033473J060642J316922J654621K097544K669641L409758M223911N069984
10905B8536496N723284N984973N765055M976494L769582K337566P33025r33434
10897E6893041k483765l631105m333124m510272m206988l641839k994584k262105
10889B8829259j450273o90719J54473R91076J692303K095292K176021K032102
10881C5829534J764340J471155J205794J046855J028772J307215J814639K403592
10873D7871896K878376L034620K716257J974559R89724k7081j004732j838314
10865E6595305k347497k431201k192107j806143j542300j450204j515152j714342
$$ plain form
10857 41596359 39678690 37580653 35307030 32958741 30863873 29325916 28559530 28633664
10849 28633664 29463354 31017144 33225771 36094739 39528788 43410278 47546377 51580306
10841 51580306 55028324 57437425 58476036 58059944 56208742 53048625 48831289 43886248
10833 43886248 38643755 33565450 29060870 25320203 22340945 19970547 18078777 16532668
10825 16532668 15263556 14211153 13316454 12528818 11849653 11212317 10631183 10093699 9611447
10816 9611447 9115897 8663300 8265707 7895178 7576284 7262851 6970590 6698085 6430515
10807 6430515 6216296 5995882 5786704 5591153 5403620 5218834 5073133 4945727 4805231
10798 4805231 4646358 4491040 4320250 4200804 4082127 3931971 3817231 3728246 3618262 3525597
$$ packed form
10857D1596359j917669k098037k273623k348289k094868j537957p66386P4134
10849B8633664Q29690J553790K208627K868968L434049L881490M136099M033929
10841E1580306L448018K409101J038611m16092j851202l160117m217336m945041
10833D3886248n242493n078305m504580l740667k979258k370398j891770j546109
10825A6532668j269112j052403q94699p87636o79165o37336n81134n37484m82252
10816I611447m95550m52597l97593l70529l18894l13433k92261k72505k67570
10807F430515k14219k20414k09178j95551j87533j84786j45701j27406j40496
10798D805231j58873j55318j70790j19446j18677j50156j14740q8985j09984r2665
$$ plain form
10788 3525597 3451113 3353008 3261316 3213980 3174998 3124227 3090216 3068922 3101346 3136761 3195749
10777 3195749 3316497 3495750 3698886 3869195 3982526 4026944 4007624 3922397 3801942 3605677
10767 3605677 3333074 3087272 2876810 2679305 2526922 2445446 2411071 2418143 2430083 2416140
10757 2416140 2427128 2455783 2519461 2530939 2568619 2636419 2742551 2879915 3027505 3199220
10747 3199220 3373189 3623731 3920194 4300435 4740467 5297468 5986069 6938261 8263531
10738 8263531 10215109 13231693 18257402 27208154 42162873 58832361 65847783 64166263
10730 64166263 61805669 63609543 66723522 58223278 39292843 26117113 19237304 15371510
10722 15371510 12973530 11406884 10330132 9542370 8949271 8495073 8088693 7754062 7414037
$$ packed form
10788C525597p4484r8105r1692m7336l8982n0771l4011k1294L2424L5415N8988
10777C195749J20748J79253K03136J70309J13331M4418j9320q5227j20455j96265
10767C605677k72603k45802k10462j97505j52383q1476l4375P072J1940j3943
10757B416140J0988K8655O3678J1478L7680O7800J06132J37364J47590J71715
10747C199220J73969K50542K96463L80241M40032N57001O88601R52192J325270
10738H263531J951578L016584N025709Q950752J4954719J6669488P015422j681520
10730F4166263k360594J803874L113979q500244j8930435j3175730o879809l865794
10722A5371510k397980j566646j076752p87762n93099m54198m06380l34631l40025
$$ plain form
10713 7414037 7082771 6769485 6477047 6173511 5888811 5616180 5403277 5215574 5068745
10704 5068745 4944346 4803225 4666600 4564617 4442632 4324640 4232379 4136249 4037233 3996051
10694 3996051 3954659 3906673 3893688 3880918 3845443 3832210 3812298 3801105 3825010 3866790 3872679
10683 3872679 3918294 4013149 4105042 4235719 4431050 4627847 4844625 5048070 5270820 5508344
10673 5508344 5770098 6068250 6413249 6822166 7303136 7909869 8701690 9711236 11039738
10664 11039738 12760841 14998810 17931914 21661724 26170782 31192031 36259888 40995307
10656 40995307 44963809 47799115 49212730 49072186 47493405 44796584 41424351 37804117
10648 37804117 34362995 31479465 29279793 27691359 26549052 25742557 25154460 24744243
$$ packed form
10713G414037l31266l13286k92438l03536k84700k72631k12903j87703j46829
10704E068745j24399j41121j36625j01983j21985j17992r2261r6130r9016m1182
10694C996051m1392m7986j2985j2770l5475j3233j9912j1193K3905M1780N889
10683C872679M5615R4855R1893J30677J95331J96797K16778K03445K22750K37524
10673E508344K61754K98152L44999M08917M80970O06733P91821J009546J328502
10664A1039738J721103K237969K933104L729810M509058N021249N067857M735419
10656D0995307L968502K835306J413615j40544j578781k696821l372233l620234
10648C7804117l441122k883530k199672j588434j142307q06495n88097m10217
$$ plain form
10640 24744243 24502410 24540598 24943024 25865627 27272629 29063433 31092404 33118142 34983077
10631 34983077 36617236 37999931 39219681 40471691 41933969 43758997 46047836 48694967
10623 48694967 51441164 54004138 55954892 56920254 56792544 55582765 53363739 50498784
10615 50498784 47406218 44492218 42104248 40436316 39496891 39125984 39055730 38968742 38617388
10606 38617388 37888356 36679567 35109717 33400087 31688275 30182904 29109140 28575677
10598 28575677 28620517 29142519 29983336 31109799 32546841 34419536 36849518 40010517 43903238
10589 43903238 48374746 53018782 57270283 60565264 62396261 62524450 60941459 57665798
10581 57665798 52963034 47303370 41328213 35607118 30671810 26674246 23468810 20929476
$$ packed form
10640B4744243k41833L8188M02426R22603J407002J790804K028971K025738J864935
10631C4983077J634159J382695J219750J252010J462278J825028K288839K647131
10623D8694967K746197K562974J950754R65362j27710j209779k219026k864955
10615E0498784l092566k914000k387970j667932r39425l70907p0254q6988l51354
10606C8617388p29032j208789j569850j709630j711812j505371j073764n33463
10598B8575677M4840N22002Q40817J126463J437042J872695K429982L160999L892721
10589D3903238M471508M644036M251501L294981J830997J28189j582991l275661
10581E7665798m702764n659664n975157n721095m935308l997564l205436k539334
$$ plain form
10573 20929476 18910347 17328342 16013758 14926651 13980064 13136114 12421836 11782554 11194761
10564 11194761 10652903 10143252 9665955 9189264 8783269 8408608 8009801 7625055 7297973
10555 7297973 6983782 6681553 6362939 6104823 5871295 5636110 5419756 5235295 5044069
10546 5044069 4863615 4673635 4513552 4356936 4198919 4046796 3925703 3812326 3696312
10537 3696312 3563496 3443638 3337226 3234902 3118434 3017684 2941812 2886590 2799755 2704454
10527 2704454 2593916 2528569 2466048 2415308 2368633 2317707 2274187 2228655 2167413 2107538 2079819
10516 2079819 2049156 1979870 1916317 1872252 1792469 1738433 1692813 1646848 1616631 1580110 1533940
10505 1533940 1526306 1531285 1502920 1453192 1452300 1456602 1418042 1378319 1349069 1320568 1293183 1295063
$$ packed form
10573B0929476k019129j582005j314584j087107r46587q43950p14278o39282n87793
10564A1194761n41858n09651m77297m76691m05995l74661l98807l84746l27082
10555G297973l14191l02229l18614k58116k33528k35185k16354j84461j91226
10546E044069j80454j89980j60083j56616j58017j52123j21093j13377j16014
10537C696312j32816j19858j06412j02324j16468j00750p5872n5222q6835r5301
10527B704454j10538o5347o2521n0740m6675n0926m3520m5532o1242n9875k7719
10516B079819l0663o9286o3553m4065p9783n4036m5620m5965l0217l6521m6170
10505A533940p634M979k8365m9728q92M302l8560l9723k9250k8501k7385J880
$$ plain form
10493 1295063 1301107 1296792 1297622 1301777 1334088 1377702 1387819 1417452 1458186 1470186 1471948 1444089
10481 1444089 1475291 1530599 1560544 1524131 1479225 1426861 1369652 1364225 1349430 1288297 1264010
10470 1264010 1255817 1257779 1261949 1270680 1276395 1283443 1275321 1266269 1267574 1224885 1205645 1238816 1265068
10457 1265068 1277094 1287898 1293113 1313957 1285216 1294070 1310499 1323379 1348637 1382245 1437668 1443072
10445 1443072 1467428 1527679 1563968 1567828 1549289 1521082 1477220 1433441 1413818 1393765 1359539
10434 1359539 1341336 1331617 1310262 1322546 1350597 1355542 1364748 1389457 1433039 1466019 1485500 1545653
10422 1545653 1607425 1675203 1683098 1700687 1749251 1784799 1806360 1832566 1803878 1771680 1779937 1773650
10410 1773650 1764425 1737927 1726992 1752339 1789163 1853162 1930019 1993408 2039622 2112862 2206923
$$ packed form
10493A295063O044m315Q30M155L2311M3614J0117K9633M0734J2000J762k7859
10481A444089L1202N5308K9945l6413m4906n2364n7209n427j4795o1133k4287
10470A264010q193J962M170Q731N715P048q122r052J305m2689j9240L3171K6252
10457A265068J2026J0804N215K0844k8741Q854J6429J2880K5258L3608N5423N404
10445A443072K4356O0251L6289L860j8539k8207m3862m3779j9623k0053l4226
10434A359539j8203r719k1355J2284K8051M945R206K4709M3582L2980J9481O0153
10422A545653O1772O7778P895J7589M8564L5548K1561K6206k8688l2198Q257o287
10410A773650r225k6498j0935K5347L6824O3999P6857O3389M6214P3240R4061
$$ plain form
10399 2206923 2343374 2498533 2615707 2709039 2789956 2919130 3038844 3175253 3295857 3424824
10389 3424824 3614194 3810735 4040013 4308153 4606959 4990996 5412518 5847877 6328659
10380 6328659 6835680 7444894 8163471 9015389 9941277 11071843 12436562 14019542 15725889
10371 15725889 17469196 19257912 21274890 23658084 26535866 29976457 34160093 39589906
10363 39589906 46911992 56893655 70787944 90471442 118789813 159225766 212994793
10356 212994793 272335009 319427207 342704709 348435914 348422282 343584244 320751802 272054882
10348 272054882 213441366 164346092 129474219 105586466 89034488 77307693 68803426
10341 68803426 62543737 57910417 54461320 51726896 49317243 47052511 44948850 42871624
$$ packed form
10399B206923J36451J55159J17174R3332Q0917J29174J19714J36409J20604J28967
10389C424824J89370J96541K29278K68140K98806L84037M21522M35359M80782
10380F328659N07021O09214P18577Q51918R25888J130566J364719J582980J706347
10371A5725889J743307J788716K016978K383194K877782L440591M183636N429813
10363C9589906P322086R981663J3894289J9683498K8318371M0435953N3769027
10356B12994793N9340216M7092198K3277502N731205j3632m838038k2832442m8696920
10348B72054882n8613516m9095274l4871873k3887753j6551978j1726795q504267
10341F8803426o259689m633320l449097k734424k409653k264732k103661k077226
$$ plain form
10333 42871624 40731231 38460120 36156127 33982907 31939076 30026643 28272082 26643685
10325 26643685 25096133 23634475 22287079 21082377 19954332 18952586 18054186 17232389
10317 17232389 16478894 15762623 15133223 14574801 14059500 13542782 13059984 12574756 12152915
10308 12152915 11798016 11382087 10951038 10553252 10160141 9824401 9552185 9246958 8946645
10299 8946645 8723529 8480924 8225284 7994179 7826578 7619474 7402196 7153598 6924056
10290 6924056 6661139 6419394 6213121 5999861 5757409 5537113 5375176 5207070 5047183
10281 5047183 4895725 4758280 4614156 4466221 4325277 4227894 4160973 4087794 4004774 3936354
10271 3936354 3873892 3822525 3740575 3636430 3534654 3439525 3331835 3228492 3150029 3084054
$$ packed form
10333D2871624k140393k271111k303993k173220k043831j912433j754561j628397
10325B6643685j547552j461658j347396j204702j128045j001746q98400q21797
10317A7232389p53495p16271o29400n58422n15301n16718m82798m85228m21841
10308A2152915l54899m15929m31049l97786l93111l35740k72216l05227l00313
10299H946645k23116k42605k55640k31105j67601k07104k17278k48598k29542
10290F924056k62917k41745k06273k13260k42452k20296j61937j68106j59887
10281E047183j51458j37445j44124j47935j40944r7383o6921p3179q3020o8420
10271C936354o2462n1367q1950j04145j01776r5129j07690j03343p8463o5975
$$ plain form
10261 3084054 3033075 3010870 3010314 2968805 2933887 2870923 2807596 2750299 2666426 2575687 2472836
10250 2472836 2334966 2223703 2141479 2065097 1971020 1887788 1828925 1743078 1680417 1628158 1572076
10239 1572076 1543450 1506666 1480252 1463679 1455841 1456875 1452294 1449521 1449922 1419883 1370059 1309501
10227 1309501 1262805 1237369 1232177 1220695 1166158 1096644 1079439 1062777 1062552 1071047 1054920 1049020
10215 1049020 1058060 1077440 1097003 1154175 1167164 1168938 1190359 1186380 1158076 1138482 1135401 1115395
10203 1115395 1092937 1096732 1064883 1059269 1077381 1100771 1081730 1061600 1069678 1053533 1035967 1038504
10191 1038504 1035209 1055839 1059966 1062838 1078395 1105570 1083176 1066865 1079525 1126198 1130722 1127269
10179 1127269 1114549 1091404 1068781 1044539 1039152 1080995 1112671 1097536 1103940 1107092 1086662 1089093
$$ packed form
10261C084054n0979k2205n56m1509l4918o2964o3327n7297q3873r0739j02851
10250B472836j37870j11263q2224p6382r4077q3232n8863q5847o2661n2259n6082
10239A572076k8626l6784k6414j6573p838J034m581k773M01l0039m9824o0558
10227A309501m6696k5436n192j1482n4537o9514j7205j6662k25Q495j6127n900
10215A049020R040J9380J9563N7172J2989J774K1421l979k8304j9594l081k0006
10203A115395k2458L795l1849n614J8112K3390j9041k0130Q078j6145j7566K537
10191A038504l295K0630M127K872J5557K7175k2394j6311J2660M6673M524l453
10179A127269j2720k3145k2623k4242n387M1843L1676j5135O404L152k0430K431
$$ plain form
10167 1089093 1130875 1114528 1128897 1117084 1078176 1053154 1014512 951735 905568 872034 865097
10156 865097 846053 830198 837509 819636 814748 811366 787415 757059 731413 713776 695664 674390
10144 674390 683910 686644 695445 707727 717933 704615 701598 717172 740236 773072 822603 890514
10132 890514 953340 980336 989416 969905 926384 918693 873134 798384 742666 682731 632252 607866
10120 607866 574064 548739 516336 504238 505501 503843 490744 468515 455543 442226 461224 475365
10108 475365 466132 480362 499120 505539 532534 545759 495461 450440 437239 432339 429663 431905
10096 431905 441600 421769 400961 414904 414024 403034 414674 428171 391064 356990 351355 355223
10084 355223 332608 332287 335370 341953 307695 277715 306558 312359 320300 318397 304572 308410 311513
$$ packed form
10167A089093M1782j6347J4369j1813l8908k5022l8642o2777m6167l3534o937
10156H65097j9044j5855P311j7873m888l382k3951l0356k5646j7637j8112k1274
10144F74390R520K734Q801J2282J0206j3318l017J5574K3064L2836M9531O7911
10132H90514O2826K6996R080j9511m3521p691m5559p4750n5718n9935n0479k4386
10120F07866l3802k5325l2403j2098J263j658j3099k2229j2972j3317J8998J4141
10108D75365r233J4230J8758O419K6995J3225n0298m5021j3201m900k676K242
10096D31905R695j9831k0808J3943q80j0990J1640J3497l7107l4074n635L868
10084C55223k2615l21L083O583l4258k9980K8843N801P941j903j3825L838L103
$$ plain form
10071 311513 357725 380744 363509 346240 336179 321256 312079 329151 309454 286422 303615 344641
10059 344641 338660 320500 324108 314759 317390 356034 391376 387977 416350 450834 446588 443593 423715
10046 423715 421190 443245 447926 434555 398676 397769 365273 363691 373988 388860 391986 392210 398859
10033 398859 429859 424472 389180 389773 375163 375305 380378 395507 409787 396982 380879 388433 422339
10020 422339 429584 428361 440281 440877 452556 457085 480929 470378 481511 515082 526020 526087 524660
10007 524660 535697 560088 599986 626544 630589 645978 673304 673920 658466 625408 619867 609395
9995 609395 602158 597152 612020 626407 606443 577858 566959 571799 606331 619142 590926 581317
9983 581317 582194 627488 680231 681038 688336 683277 697131 710952 725700 735467 716839 742572 782252
$$ packed form
10071C11513M6212K3019j7235j7269j0061j4923r177J7072j9697k3032J7193M1026
10059C44641n981j8160L608r349K631L8644L5342l399K8373L4484m246k995j9878
10046D23715k525K2055M681j3371l5879r07l2496j582J0297J4872L126K24O649
10033C98859L1000n387l5292N93j4610J42N073J5129J4280j2805j6103P554L3906
10020D22339P245j223J1920N96J1679M529K3844j0551J1133L3571J0938O7j427
10007E24660J1037K4391L9898K6558M045J5389K7326O16j5454l3058n541j0472
9995F09395p237n006J4868J4387j9964k8585j0899M840L4532J2811k8216r609
9983E81317Q77M5294N2743Q07P298n059J3854J3821J4748R767j8628K5733L9680
$$ plain form
9970 782252 792922 819308 823083 839671 876043 919479 926413 941667 969897 989549 1001438 1006376
9958 1006376 1014744 1019643 1021939 1003606 998547 1002166 1032192 1076226 1115408 1118562 1147871 1197654 1238690
9945 1238690 1242476 1257761 1285790 1312571 1346129 1402723 1473904 1558794 1676738 1781234 1897074
9934 1897074 2084012 2340727 2613706 2890572 3170830 3364936 3468716 3521242 3524753 3459058
9924 3459058 3322848 3150131 2976058 2877999 2837643 2794996 2772217 2801833 2841923 2878059 2961795
9913 2961795 3057749 3148012 3247625 3361773 3478876 3633465 3765661 3904942 4052938 4198537
9903 4198537 4396867 4599869 4811952 5019409 5297761 5564730 5847063 6155611 6458849 6804718
9893 6804718 7177519 7572840 8000246 8486544 8911222 9349855 9813487 10312656 10812952 11323051
$$ packed form
9970G82252J0670K6386L775J6588L6372M3436O934J5254K8230J9652J1889M938
9958A006376Q368M899K296j8333n059L619L0026M4034L9182L154K9309M9783M1036
9945A238690L786J5285K8029K6781L3558N6594P1181Q4890J17944J04496J15840
9934A897074J86938K56715K72979K76866K80258J94106J03780N2526L511o5695
9924C459058j36210j72717j74073r8059m0356m2647k2779K9616M0090L6136Q3736
9913B961795R5954R0263R9613J14148J17103J54589J32196J39281J47996J45599
9903D198537J98330K03002K12083K07457K78352K66969K82333L08548L03238L45869
9893F804718L72801L95321M27406M86298M24678M38633M63632M99169N00296N10099
$$ plain form
9883 11323051 11867016 12430155 12994600 13517980 14012700 14494159 14912184 15272374 15609107
9874 15609107 15921601 16175245 16377054 16545687 16687378 16833149 17051881 17367718 17788366
9865 17788366 18442830 19433372 20668457 22041399 23329237 24255196 24705674 24732017 24355408
9856 24355408 23563600 22361424 20827916 19218356 17819166 16752603 15985173 15382851 14881230
9847 14881230 14494884 14167729 13902918 13636299 13464283 13416902 13579614 14002961 14690571 15607770
9837 15607770 16730502 17974231 19108200 19925141 20509755 21073340 21708121 22307612 22849835
9828 22849835 23689814 25071590 26982387 29274816 31752791 34207580 36496666 38499008
9820 38499008 40083443 40964936 40967929 40259885 39165307 37806626 36165163 34368384 32548680
$$ packed form
9883A1323051N43965N63139N64445N23380M94720M81459M18025L60190L36733
9874A5609107L12494K53644K01809J68633J41691J45771K18732L15837M20648
9865A7788366O54464R90542J235085J372942J287838R25959M50478K6343l76609
9856B4355408p91808j202176j533508j609560j399190j066563p67430o02322n01621
9847A4881230l86346l27155k64811k66619j72016m7381J62712M23347O87610R17199
9837A5607770J122732J243729J133969Q16941N84614N63585O34781N99491N42223
9828B2849835Q39979J381776J910797K292429K477975K454789K289086K002342
9820C8499008J584435Q81493K993p08044j094578j358681j641463j796779j819704
$$ plain form
9811 32548680 30857371 29363109 27995034 26769149 25756130 24969869 24321879 23883262 23744244
9802 23744244 23930711 24444023 25206400 26046771 26767408 27377505 28030324 28823573 29821734
9793 29821734 30947764 32253016 33774750 35521690 37407448 39336022 41257711 42922473
9785 42922473 44186603 45183178 45974535 46476901 46508370 45983276 44966432 43574559 41942218
9776 41942218 40242851 38455004 36475340 34421484 32572907 31043914 29781886 28562169
9768 28562169 27186390 25837687 24817887 24181465 23850115 23815832 23990259 24318939 24801512
9759 24801512 25476646 26263272 27048631 27846390 28691228 29607805 30601161 31685632 32841652
9750 32841652 33983110 34909868 35470730 35574687 35235537 34492400 33422781 32002806 30215362
$$ packed form
9811C2548680j691309j494262j368075j225885j013019p86261o47990m38617j39018
9802B3744244J86467N13312P62377Q40371P20637O10097O52819P93249R98161
9793B9821734J126030J305252J521734J746940J885758J928574J921689J664762
9785D2922473J264130R96575P91357N02366L1469n25094j016844j391873j632341
9776D1942218j699367j787847j979664k053856j848577j528993j262028j219717
9768B8562169j375779j348703j019800o36422l31350l4283J74427L28680M82573
9759B4801512O75134P86626P85359P97759Q44838R16577R93356J084471J156020
9750C2841652J141458R26758N60862J03957l39150p43137j069619j419975j787444
$$ plain form
9741 30215362 28212360 26256475 24503479 23006713 21705963 20596544 19627404 18695556
9733 18695556 17775537 16841199 15956694 15135680 14285001 13385783 12581535 11939201 11493009
9724 11493009 11209973 11016885 10860311 10753544 10673241 10634502 10641663 10728532 10919914 11270514
9714 11270514 11855620 12691301 13680164 14609758 15253445 15529249 15461373 15058488 14335660 13253020
9704 13253020 11872825 10405316 9076176 8022866 7186358 6514280 6004790 5576422 5208598
9695 5208598 4913732 4667218 4417625 4219383 4047621 3866648 3696609 3550718 3400916 3266984
9685 3266984 3139683 2995520 2868084 2767574 2679086 2615454 2528253 2449387 2361925 2267559 2198400
9674 2198400 2135505 2073110 2026343 1971178 1919416 1841102 1788318 1748356 1726738 1703425 1654318
$$ packed form
9741C0215362k003002j955885j752996j496766j300750j109419r69140r31848
9733A8695556r20019r34338q84505q21014q50679q99218q04248o42334m46192
9724A1493009k83036j93088j56574j06767q0303l8739P161Q6869J91382L50600
9714A1270514N85106Q35681R88863R29594O43687K75804o7876m02885p22828j082640
9704A3253020j380195j467509j329140j053310q36508o72078n09490m28368l67824
9695E208598k94866k46514k49593j98242j71762j80973j70039j45891j49802j33932
9685C266984j27301j44163j27436j00510q8488o3632q7201p8866q7462r4366o9159
9674B198400o2895o2395m6767n5165n1762p8314n2784l9962k1618k3313m9107
$$ plain form
9663 1654318 1594921 1539765 1508765 1465861 1434982 1415753 1403101 1362685 1344525 1322341 1313086 1306225
9651 1306225 1259943 1236681 1224430 1211136 1203636 1185926 1166189 1130030 1083293 1095894 1100069 1086817
9639 1086817 1067623 1027354 1043963 1033799 1034772 992866 970649 952293 907144 889971 898711 890455
9627 890455 900205 902370 892087 895206 904508 909435 900526 905009 897632 899575 850508 838805 849633
9614 849633 864525 861913 869480 825697 800625 819695 851647 869501 850743 825819 817720 831907
9602 831907 842958 827619 798479 777204 785982 811466 831983 816855 832869 868274 872279 862751
9590 862751 853829 854705 827221 799993 774669 776167 788049 797660 790767 796104 799563 758477 718944
9577 718944 696405 719185 728371 736257 730813 745182 735598 742996 744010 740151 723133 694070 694668
$$ packed form
9663A654318n9397n5156l1000m2904l0879j9229j2652m0416j8160k2184r255o861
9651A306225m6282k3262j2251j3294p500j7710j9737l6159m6737J2601M175j3252
9639A086817j9194m0269J6609j0164R73m1906k2217j8356m5149j7173Q740q256
9627H90455R750K165j0283L119R302M927q909M483p377J943m9067j1703J0828
9614H49633J4892k612P567m3783k5072J9070L1952J7854j8758k4924q099J4187
9602H31907J1051j5339k9140k1275Q778K5484K0517j5128J6014L5405M005r528
9590H62751q922Q76k7484k7228k5324J498J1882R611o893N337L459m1086l9533
9577G18944k2539K2780R186P886n444J4369r584P398J014l859j7018k9063N98
$$ plain form
9564 694668 690677 653071 649540 643167 647540 634396 643002 678758 686580 678725 669088 685367 713986
9551 713986 723834 703712 701373 673516 636234 654223 668092 682987 674366 651065 645599 636379 630943
9538 630943 595943 576224 551137 523061 544359 540107 523039 484169 478215 503304 514051 521366
9526 521366 532282 509166 514885 521816 499571 473254 449554 469307 480148 483338 498013 513314
9514 513314 499662 442503 409206 437894 464257 478528 476975 466362 477609 431601 391805 362034
9502 362034 345976 355632 367954 364686 371084 393813 376409 363306 363252 363768 354766 330147 317406
9489 317406 307096 303301 288462 281753 271645 277977 276727 290723 292265 266175 235331 245652 274003
9476 274003 295089 304161 334962 343287 318913 298336 309225 317337 287034 264743 262553 274684
$$ packed form
9564F94668l991l7606l531o373M373j3144Q606L5756P822p855r637J6279K8619
9551G13986R848k0122k339k7857l7282J7989J3869J4895q621k3301n466r220n436
9538F30943l5000j9719k5087k8076K1298m252j7068l8870n954K5089J0747P315
9526E21366J0916k3116N719O931k2245k6317k3700J9753J0841L190J4675J5301
9514E13314j3652n7159l3297K8688K6363J4271j553j0613J1247m6008l9796k9771
9502C62034j6058R656J2322l268O398K2729j7404j3103n4N16r002k4619j2741
9489C17406j0310l795j4839o709j0108O332j250J3996J542k6090l0844J0321K8351
9476B74003K1086R072L0801Q325k4374k0577J0889Q112l0303k2291k190J2131
$$ plain form
9464 274684 286025 300701 303541 298072 288103 288754 276218 320237 324705 301663 311653 320258 309754
9451 309754 287305 277243 299179 291570 261589 234629 264723 272772 275481 282078 296971 296056 280582
9438 280582 276580 277651 279231 305437 319931 313298 297849 292974 322028 341950 315179 307240 320913
9425 320913 351343 366141 346826 345957 355411 377885 408752 438282 423732 383645 356097 342659
9413 342659 325706 323219 302056 302126 302235 293761 308004 317867 327227 314155 335348 343098 343140 328027
9399 328027 309689 304898 308170 298019 276095 262567 272990 296502 295279 328946 359340 369284
9387 369284 346596 362109 366627 372325 398779 396850 372685 367728 360828 363575 360069 359214 330505
9374 330505 302698 306091 328666 337464 318272 283779 272217 275339 265637 259287 268386 273550 257906
$$ packed form
9464B74684J1341J4676K840n469r969O51j2536M4019M468k3042R990Q605j0504
9451C09754k2449j0062K1936p609k9981k6960L0094Q049K709O597J4893r15j5474
9438B80582m002J071J580K6206J4494o633j5449m875K9054J9922k6771p939J3673
9425C20913L0430J4798j9315q69R454K2474L0867K9530j4550m0087k7548j3438
9413C42659j6953k487k1163P0J09q474J4243R863R360j3072K1193P750M2j5113
9399C28027j8338m791L272j0151k1924j3528J0423K3512j223L3667L0394R944
9387C69284k2688J5513M518N698K6454j929k4165m957o900K747l506q55k8709
9374C30505k7807L393K2575Q798j9192l4493j1562L122r702o350R099N164j5644
$$ plain form
9361 257906 257509 236832 235576 235603 239126 263505 298840 326884 324090 302987 280030 301315 319279
9348 319279 309452 322482 349751 328980 310030 301857 280632 289861 297985 298193 307985 302187 298684
9335 298684 279761 287891 275130 244382 220387 208496 210692 193499 197231 172702 162364 174827
9323 174827 181651 207694 191578 153290 139094 120776 136165 162834 174224 183633 180713 195126
9311 195126 173870 154000 127303 139535 191180 187458 183260 186678 170167 133049 115162 115455 116996
9298 116996 142222 148510 128148 146175 129587 107407 120483 149599 131931 132013 126712 97695 61787
9285 61787 57865 40946 62842 75099 76366 89314 129210 164701 154033 122744 116159 103256
9273 103256 97979 81210 98215 101136 111054 112797 111627 119521 100288 87566 78928 79223 85161 104100
$$ packed form
9361B57906l97k0677j256K7L523K4379L5335K8044k794k1103k2957K1285J7964
9348C19279r827J3030K7269k0771j8950q173k1225R229Q124K08R792n798l503
9335B98684j8923Q130j2761l0748k3995j1891K196j7193L732k4529j0338J2463
9323A74827O824K6043j6116l8288j4196j8318J5389K6669J1390R409k920J4413
9311A95126k1256j9870k6697J2232N1645l722m198L418j6511l7118j7887K93J541
9298A16996K5226O288k0362J8027j6588k2180J3076K9116j7668Q2n301k9017l5908
9285F1787l922j6919K1896J2257J267J2948L9896L5491j0668l1289o585j2903
9273A03256n277j6769J7005K921R918J743j170P894j9233j2722q638K95N938J8939
$$ plain form
9259 104100 86530 72949 66921 92917 73863 48472 73301 61197 48419 74837 71596 74519
9247 74519 86581 78479 67224 73051 89364 92108 80799 73172 67936 61162 57894 82771 114795
9234 114795 101547 101927 127233 109288 106076 100872 79888 69816 69678 76825 82970 87284 60430
9221 60430 39894 63778 43943 51814 86193 99357 87922 84378 78770 78442 74902 59114 45434
9208 45434 52863 81667 89426 104226 121462 111890 102055 112513 133719 165970 177531 191503 260786
9195 260786 340789 419504 486595 529027 556338 548359 549160 552654 534035 441049 337264 268949
9183 268949 236564 225022 207674 218257 208397 195362 185978 186505 194119 153969 136126 135265 151462
9170 151462 126235 91233 110155 124331 128011 133485 144320 150187 152883 149217 170612 173186 177962
$$ packed form
9259A04100j7570j3581o028K5996j9054k5391K4829j2104j2778K6418l241K923
9247G4519J2062q102j1255N827J6313K744j1309p627n236o774l268K4877L2024
9234A14795j3248L80K5306j7945l212n204k0984j0072j38P147O145M314k6854
9221F0430k0536K3884j9835P871L4379J3164j1435l544n608l28l540j5788j3680
9208D5434P429K8804P759J4800J7236r572r835J0458K1206L2251J1561J3972O9283
9195B60786Q0003P8715O7091M2432K7311p979Q01L494j8619r2986j03785o8315
9183B68949l2385j1542j7348J0583r860j3035r384N27P614m0150j7843q61J6197
9170A51462k5227l5002J8922J4176L680N474J0835N867K696l666K1395K574M776
$$ plain form
9157 177962 197041 230388 259950 288113 319560 378833 504575 649614 828117 1031351 1108692
9146 1108692 1113240 1124231 1137251 1080309 941024 755021 593399 497645 395006 352315 325170
9135 325170 297544 290053 284298 290255 285846 260594 225513 217489 208724 208975 217576 218619 218687 193351
9121 193351 178507 197639 178929 154689 158676 153684 125273 155774 192379 206951 214639 229376
9109 229376 233208 232314 264537 326127 371836 450807 519034 570298 602204 594250 593326 565872 494087
9096 494087 383081 289337 241066 202815 163254 115372 98160 129321 142950 151920 130268 110892
9084 110892 108543 135123 168730 185101 190323 187333 172806 161658 164779 179754 175810 167048 152111
9071 152111 130581 110031 119214 142088 135071 124601 105236 83795 78551 85474 88824 101814 108398
$$ packed form
9157A77962J9079L3347K9562K8163L1447N9273J25742J45039J78503K03234P7341
9146A108692M548J0991J3020n6942j39285j86003j61622r5754j02639m2691k7145
9135C25170k7626p491n755N957m409k5252l5081q024q765K51Q601J043O8k5336
9121A93351j4844J9132j8710k4240L987m992k8411L0501L6605J4572P688J4737
9109B29376L832q94L2223O1590M5709P8971O8227N1264L1906p954r24k7454p1785
9096D94087j11006r3744m8271l8251l9561m7882j7212L1161J3629Q970k1652j9376
9084A10892k349K6580L3607J6371N222k990j4527j1148L121J4975l944q762j4937
9071A52111k1530k0550R183K2874p017j0470j9365k1441n244O923L350J2990O584
$$ plain form
9058 108398 93818 80176 67261 71976 81756 63314 67702 84365 135955 141405 112594 109867 124697
9045 124697 159381 158884 159571 145236 132770 143927 177965 183758 156569 141798 99628 98058 86426
9032 86426 89263 103638 105294 112545 137628 134671 124494 104621 122364 126114 123448 120360 134359
9019 134359 132269 130035 137258 120091 102531 87195 101507 109223 89876 107418 124899 124654 136980
9006 136980 167598 196208 191605 197562 209889 208562 214909 232057 209547 192793 178488 173673 176037
8993 176037 163813 178577 191858 199415 190223 182514 175174 161947 154472 156354 189319 191016 183017
8980 183017 166115 131950 110792 123592 128272 122657 113605 136023 116605 107392 91051 76431
8968 76431 105221 98038 82805 82264 49401 52830 98180 91010 104642 150172 163321 129938 136317
$$ packed form
9058A08398j4580j3642j2915M715R780j8442M388J6663N1590N450k8811k727J4830
9045A24697L4684m97O87j4335j2466J1157L4038N793k7189j4771m2170j570j1632
9032H6426K837J4375J656P251K5083k957j0177j9873J7743L750k666l088J3999
9019A34359k090k234P223j7167j7560j5336J4312P716j9347J7542J7481k45J2326
9006A36980L0618K8610m603N957J2327j327O347J7148k2510j6754j4305m815K364
8993A76037j2224J4764J3281P557r192p709p340j3227p475J882L2965J697p999
8980A83017j6902l4165k1158J2800M680n615r052K2418j9418r213j6341j4620
8968G6431K8790p183j5233n41l2863L429M5350p170J3632M5530J3149l3383O379
$$ plain form
8955 136317 129261 127493 138288 164527 164409 194134 222148 193904 194971 235328 240191 211478 170577
8942 170577 140837 148401 172167 188070 174862 127079 121022 117385 90239 51523 51538 70276 67641
8929 67641 70121 97011 104255 121891 146733 166747 164332 177519 180923 205238 211710 197116 165924
8916 165924 124597 103726 83563 100623 108334 115539 160950 200126 203780 186791 196274 213431
8904 213431 216431 225735 223566 205279 191888 199704 200420 177479 183347 163008 144349 134164 129684
8891 129684 144524 167540 184375 178114 214890 226082 250435 286316 275477 285688 320346 335163
8879 335163 342609 339429 335070 350334 317252 311022 321606 327152 312983 342933 377487 409312 453613
8866 453613 492311 508807 554780 626876 651450 672186 695930 714909 739924 769487 830964 932386
$$ packed form
8955A36317p056j768J0795K6239j18K9725K8014k8244J067M0357M863k8713m0901
8942A70577k9740P564K3766J5903j3208m7783o057l637k7146l8716J5J8738k635
8929F7641K480K6890P244J7636K4842K0014k415J3187L404K4315O472j4594l1192
8916A65924m1327k0871k0163J7060P711P205M5411L9176L654j6989R483J7157
8904B13431L000R304k169j8287j3391P816P16k2941N868k0339j8659j0185m480
8891A29684J4840K3016J6835o261L6776J1192K4353L5881j0839J0211L4658J4817
8879C35163P446l180m359J5264l3082o230J0584N546j4169K9950L4554L1825M4301
8866D53613L8698J6496M5973P2096K4574K0736K3744J8979K5015K9563O1477J01422
$$ plain form
8854 932386 1069437 1243301 1487603 1768947 1984066 2174934 2386284 2738668 3171092 3403762
8844 3403762 3310822 3110592 3006233 2997993 2851666 2420012 2018653 1778044 1604388 1486413
8834 1486413 1412208 1387859 1372175 1376007 1389876 1402279 1427514 1482865 1537479 1622588 1706727 1800128
8822 1800128 1944588 2103767 2226768 2327662 2424988 2564792 2765394 3013025 3281929 3619850
8812 3619850 4033643 4490244 5038929 5735549 6642935 7814658 9180785 10581176 12058728
8803 12058728 13949086 16616795 20154373 24311381 29386387 36945554 48904385 65928407
8795 65928407 84037128 95444159 98332010 97698526 97781238 96951482 88288561 70691923
8787 70691923 53109957 40678417 32629093 27304299 23640210 21077473 19224845 17859555
$$ packed form
8854I32386J37051J73864K44302K81344K15119J90868K11350L52384M32424K32670
8844C403762r2940k00230j04359q240j46327m31654m01359k40609j73656j17975
8834A486413p4205k4349j5684L832J3869J2403K5235N5351N4614Q5109Q4139R3401
8822A800128J44460J59179J23001J00894R7326J39804K00602K47631K68904L37921
8812C619850M13793M56601N48685O96620R07386J171723J366127J400391J477552
8803A2058728J890358K667709L537578M157008N075006P559167J1958831J7024022
8795F5928407J8108721J1407031K887851o33484Q2712q29756q662921j7596638
8787G0691923j7581966j2431540q049324n324794l664089k562737j852628j365290
$$ plain form
8779 17859555 16885869 16179050 15623227 15155225 14704435 14233588 13843604 13495953 13169349
8770 13169349 12939294 12859905 12923636 13118068 13443094 13966448 14694479 15699318 16936670
8761 16936670 18408157 20170547 22319392 25072576 28721385 33690110 40500013 50148630
8753 50148630 64917171 88572647 124116263 164485666 190238837 195867569 193581604
8746 193581604 194597033 196557989 180590700 141392837 103200223 77460054 61309285
8739 61309285 50816818 43720454 38711790 35060274 32343662 30240137 28574832 27174320
8731 27174320 25919678 24720766 23555271 22317161 21133207 20085956 19191383 18385115
8723 18385115 17744915 17278284 16930937 16674830 16564638 16609612 16733447 17006661 17493026 18210379
$$ packed form
8779A7859555r73686p06819n55823m68002m50790m70847l89984l47651l26604
8770A3169349k30055p9389O3731J94432L25026N23354P28031J004839J237352
8761A6936670J471487J762390K148845K753184L648809M968725O809903R648617
8753E0148630J4768541K3655476L5543616M0369403K5753171N628732k285965
8746A93581604J015429J960956j5967289l9197863l8192614k5740169j6150769
8739F1309285j0492467p096364n008664l651516k716612k103525j665305j400512
8731B7174320j254642j198912j165495j238110j183954j047251q94573q06268
8723A8385115o40200m66631l47347k56107j10192M4974J23835K73214M86365P17353
$$ plain form
8713 18210379 19240575 20678959 22751348 25791111 30329068 37313253 48038468 63371096
8705 63371096 80910598 93741954 98125862 97767492 97379705 96839853 90013451 73748517
8697 73748517 55848064 42743303 34250897 28665197 24849980 22138750 20124637 18591827
8689 18591827 17363150 16339117 15455193 14633750 13883865 13148007 12434119 11723984 11028713
8680 11028713 10377842 9825721 9322895 8871977 8482886 8112480 7769159 7443053 7153275
8671 7153275 6891653 6648459 6412217 6196613 5960030 5709965 5522948 5377020 5211436 5037419
8661 5037419 4858292 4688060 4534832 4422286 4305313 4201163 4107380 3977221 3873814 3746332
8651 3746332 3656240 3599832 3520129 3430786 3340128 3253846 3165480 3057377 2977013 2923333 2875097
$$ packed form
8713A8210379J030196J438384K072389L039763M537957O984185J0725215J5332628
8705F3371096J7539502J2831356M383908l58370l87787n39852o826402j6264934
8697G3748517j7900453j3104761q492406n585700l815217k711230k014113j532810
8689A8591827j228677j024033q83924q21443p49885p35858p13888p10135o95271
8680A1028713o50871n52121n02826m50918l89091l70406l43321l26106k89778
8671G153275k61622k43194k36242k15604k36583k50065j87017j45928j65584j74017
8661E037419j79127j70232j53228j12546j16973j04150r3783j30159j03407j27482
8651C746332r0092n6408p9703q9343r0658q6282q8366j08103q0364n3680m8236
$$ plain form
8640 2875097 2833949 2829898 2882786 3022701 3245137 3488216 3659907 3703594 3653646 3617340 3556702
8629 3556702 3353040 3000468 2640231 2386743 2260936 2139181 1996936 1879488 1782255 1717197
8619 1717197 1698675 1644397 1576314 1527348 1461109 1430927 1417272 1390843 1383770 1367625 1370129 1351610
8607 1351610 1343769 1337306 1341486 1349738 1357742 1321973 1308435 1304158 1330844 1363146 1403144 1467095 1545362
8594 1545362 1683144 1909574 2308336 2885315 3615719 4173823 4378673 4391135 4413320 4425828
8584 4425828 4233494 3567929 2900249 2429496 2111136 1908165 1762985 1614573 1516790 1435220
8574 1435220 1355954 1273384 1182325 1148896 1139753 1098008 1056630 1016800 986423 954845 940363 907008
8562 907008 886637 882547 857097 863406 833491 825459 851063 850547 842394 829121 832161 842359 895458
$$ packed form
8640B875097m1148m051N2888J39915K22436K43079J71691M3687m9948l6306o0638
8629C556702k03662l52572l60237k53488j25807j21755j42245j17448r7233o5058
8619A717197j8522n4278o8083m8966o6239l0182j3655k6429p073j6145K504j8519
8607A351610p841o463M180Q252Q004l5769j3538m277K6686L2302L9998O3951P8267
8594A545362J37782K26430L98762N76979P30404N58104K04850J2462K2185J2508
8584D425828j92334o65565o67680m70753l18360k02971j45180j48412r7783q1570
8574A435220p9266q2570r1059l3429r143m1745m1378l9830l0377l1578j4482l3355
8562I07008k0371m090k5450O309k9915q032K5604n16q153j3273L040J0198N3099
$$ plain form
8549 895458 961432 1051452 1235943 1471858 1785140 2073066 2217192 2186428 2132100 2108921 2053996
8538 2053996 1810668 1450153 1157458 1011604 927014 850906 792064 750475 698146 671856 625567
8527 625567 588530 568629 558501 514200 515348 510759 499676 476945 468216 475629 497930 475823
8515 475823 457921 487929 488729 469459 472383 450766 426065 404626 405217 390974 353206 326539 319372
8502 319372 310203 310899 312712 310927 323373 333149 315519 320273 329576 326416 281443 233369 232166 262209
8488 262209 274998 270252 217681 192943 216531 219072 223511 217237 178011 158275 155463 147823 169649
8475 169649 195987 202235 190561 199639 206314 206785 206207 197216 160496 132287 141189 141359 124959 142082
8461 142082 157363 127332 97026 108218 141241 129289 136346 148989 144964 169214 169900 176918 201166
$$ packed form
8549H95458O5974R0020J84491K35915L13282K87926J44126l0764n4328k3179n4925
8538B053996k43328l60515k92695j45854q4590p6108n8842m1589n2329k6290m6289
8527F25567l7037j9901j0128m4301J148m589j1083k2731q729P413K2301k2107
8515D75823j7902L0008Q00j9270K924k1617k4701k1439N91j4243l7768k6667p167
8502C19372r169O96J813j785J2446R776j7630M754R303l160m4973m8074j203L0043
8488B62209J2789m746n2571k4738K3588K541M439o274l9226j9736k812p640K1826
8475A69649K6338O248j1674R078O675M71n78q991l6720k8209Q902J70j6400J7123
8461A42082J5281l0031l0306J1192L3023j1952P057J2643m025K4250O86P018K4248
$$ plain form
8448 201166 202100 179466 190883 215454 268359 268358 234125 213438 186421 196745 196790 196969 163152 120420
8434 120420 123011 116529 119043 144251 141899 137860 113185 106093 96120 109884 113702 100606 122498
8421 122498 133862 113850 108380 111964 135174 144295 121368 120565 96751 96023 90660 96149 103767 117005
8407 117005 133858 146277 159657 168285 161057 180294 209594 218801 213851 215133 225182 247204 274803
8394 274803 327575 379399 461417 564456 641306 664367 680722 679030 667260 637825 599009 505621
8382 505621 420797 371140 337484 273812 272135 270205 254503 258934 245616 238009 226458 218664 208408
8369 208408 191320 175784 169233 158959 169278 171493 156662 153961 159047 174314 215161 254412
8357 254412 268867 277356 268018 282351 282622 300097 334359 388567 471423 551011 732068 981169
$$ packed form
8448B01166R34k2634J1417K4571N2905jl4233k0687k7017J0324M5J79l3817m2732
8434A20420K591o482K514K5208k352m039k4675p092r973J3764L818j3096K1892
8421A22498J1364k0012n470L584K3210R121k2927q03k3814p28n363N489P618J3238
8407A17005J6853J2419J3380Q628p228J9237K9300R207m950J282J0049K2022K7599
8394B74803N2772N1824Q2018J03039P6850K3061J6355j692j1770k9435l8816r3388
8382E05621q4824m9657l3656o3672j677j930j5702M431j3318p607j1551p794j0256
8369B08408j7088j5536o551j0274J0319K215j4831k701N086J5267M0847L9251
8357B54412J4455Q489r338J4333K71J7475L4262N4208Q2856P9588J81057K49101
$$ plain form
8345 981169 1153214 1213130 1215908 1227198 1257409 1191180 995196 798502 637417 521423 487290
8334 487290 424600 378060 350090 313678 315358 295682 298016 313552 280108 263604 260668 263969
8322 263969 255550 250029 265958 250195 243087 252613 233339 221403 184000 171450 190372 212227
8310 212227 217471 241118 245256 272797 288104 298122 326923 400792 477243 592109 681093 742896
8298 742896 798127 828646 818533 771519 665445 588286 524296 478369 451621 419095 380878
8287 380878 328111 314461 314432 303975 294542 286446 300449 282467 268420 261511 275308 246762 177269
8274 177269 159846 167799 159310 143447 137055 138313 156809 171256 179556 164860 162874 174346 142968
8261 142968 128120 125117 143017 134379 118667 95320 111312 155924 200410 246573 277354 307566
$$ packed form
8345I81169J72045N9916K778J1290L0211o6229j95984j96694j61085j15994l4133
8334D87290o2690m6540k7970l6412J680j9676K334J5536l3444j6504k936L301
8322B63969q419n521J5929j5763p108R526j9274j1936l7403j2550J8922K1855
8310B12227N244K3647M138K7541J5307J0018K8801P3869P6451J14866Q8984O1803
8298G42896N5231L0519j0113m7014j06074p7159o3990m5927k6748l2526l8217
8287C80878n2767j3650k9j0457r433q096J4003j7982j4047o909J3797k8546o9493
8274A77269j7423P953q489j5863o392J258J8496J4447Q300j4696j986J1472l1378
8261A42968j4848l003J7900q638j5712k3347J5992M4612M4486M6163L0781L0212
$$ plain form
8249 307566 302470 309159 279811 265213 275744 256616 245826 231300 176498 165353 180075 218964
8237 218964 226352 211644 224795 221035 209335 207365 180910 125036 124374 146301 163408 148902 124664
8224 124664 114321 127361 117085 115073 132994 153246 144928 116750 135336 161803 131452 115459
8212 115459 112566 95716 113551 111487 104185 88683 97502 139248 181102 181651 144965 138095 148480
8199 148480 140630 136008 148085 142234 159467 158173 152535 122278 130802 149614 151744 148450 125867
8186 125867 145516 138785 119921 121312 122945 131214 137687 119491 91420 59413 73996 81808 76581
8173 76581 72887 77205 60898 47762 71629 73652 70075 104395 98963 92125 114699 130644 105285
8160 105285 78633 73767 114898 117197 115443 99683 77560 102837 132521 161573 148845 125311
$$ packed form
8249C07566n096O689k9348j4598J0531j9128j0790j4526n4802j1145J4722L8889
8237B18964P388j4708J3151l760j1700j970k6455n5874o62K1927J7107j4506k4238
8224A24664j0343J3040j0276k012J7921K0252q318k8178J8586K6467l0351j5993
8212A15459k893j6850J7835k064p302j5502Q819M1746M1854N49l6686o870J0385
8199A48480p850m622J2077n851J7233j294n638l0257Q524J8812K130l294k2583
8186A25867J9649o731j8864J391J633Q269O473j8196k8071l2007J4583P812n227
8173G6581l694M318j6307j3136K3867K023l577L4320n432o838K2574J5945k5359
8160A05285k6652m866M1131K299j754j5760k2123K5277K9684K9052j2728k3534
$$ plain form
8148 125311 143063 132147 130682 132445 124730 122787 112888 119869 100717 110458 92126 106963 115310
8135 115310 95268 85301 67722 52872 66477 47433 24798 26195 19552 17915 25126 47561 70150
8122 70150 49033 44623 46099 49539 47915 27159 38267 39319 16240 10204 27439 81789 115985
8109 115985 105127 107648 87372 81525 79830 76705 81534 93489 89110 71036 64687 93772 85623
8096 85623 70295 84721 82541 71847 68820 65444 62331 33070 30997 35489 54081 65814 63159
8083 63159 58849 84015 96367 59625 34583 45802 48121 73325 62446 28646 37929 34244 21822
8070 21822 36937 44224 44517 63971 85475 97518 66179 45772 28159 34418 58089 28583 45331
8057 45331 66542 42805 31327 43124 39594 55188 46468 49528 56720 61396 52966 74145 77949
$$ packed form
8148A25311J7752j0916j465J763p715j943r899O981j9152R741j8332J4837Q347
8135A15310k0042r967j7579j4850J3605j9044k2635J397o643j637P211K2435K2589
8122G0150k1117m410J476L440j624k0756J1108J052k3079o036J7235N4350L4196
8109A15985j0858K521k0276n847j695l125M829J1955m379j8074o349K9085q149
8096H5623j5328J4426k180j0694l027l376l113k9261k073M492J8592J1733k655
8083F3159m310K5166J2352l6742k5042J1219K319K5204j0879l3800R283l685j2422
8070B1822J5115P287K93J9454K1504J2043l1339k0407j7613O259K3671k9506J6748
8057D5331K1211k3737j1478J1797l530J5594q720L060P192M676q430K1179L804
$$ plain form
8044 77949 70392 77516 48922 37638 31539 42085 53732 63738 68704 111357 130346 109882 66425
8031 66425 42389 33763 24585 43663 59741 76004 81430 82931 69474 65379 76980 83141 81258
8018 81258 74766 68741 72770 79607 95082 69247 56853 60739 55219 40263 27735 26484 35870
8005 35870 42647 50244 60688 68290 49595 92520 116099 108847 84594 80671 77171 88522 74230
7992 74230 35990 36826 56090 87297 79934 75540 39402 39991 98574 127099 89401 70973 69479
7979 69479 52932 49214 60024 23984 22732 40989 41667 41813 41567 44482 41800 5480 -9222 891
7965 891 33380 23400 19255 21753 16747 17650 26122 44701 55802 73520 77072 68604 41028 61346
7951 61346 105613 121392 102303 79909 82970 90347 101282 115233 94795 87269 113126 98486
$$ packed form
8044G7949p557P124k8594j1284o099J0546J1647J0006M966M2653J8989k0464m3457
8031F6425k4036q626r178J9078J6078J6263N426J501j3457m095J1601O161j883
8018H1258o492o025M029O837J5475k5835j2394L886n520j4956j2528j251R386
8005C5870O777P597J0444P602j8695M2925K3579p252k4253l923l500J1351j4292
7992G4230l8240Q36J9264L1207p363m394l6138N89N8583K8525l7698j8428j494
7979F9479j6547l718J0810l6040j252J8257O78J46k46K915k682l6320j4702J0113
7965H91L2489r980m145K498n006R03Q472J8579J1101J7718L552q468k7576K0318
7951F1346M4267J5779j9089k2394L061P377J0935J3951k0438p526K5857j4640
$$ plain form
7939 98486 92464 85354 69411 57036 45694 40428 67880 87879 51878 51228 61419 69727 77519
7926 77519 48766 71998 86502 66318 63703 80255 88676 77619 64317 85971 78802 79725 80870
7913 80870 74183 85959 74302 72268 103770 111642 97423 73410 76005 96313 92936 85377 82837
7900 82837 63624 31926 21321 37319 38967 17118 42350 56488 64005 62082 61476 82564 79190
7887 79190 77252 72523 103186 91404 32722 1738 10879 15174 1508 14729 38962 52208 49724
7874 49724 73269 85684 79090 59284 58160 54856 46246 41524 35382 17374 11613 18324 35831
7861 35831 37760 19958 4841 8652 4785 -2415 8483 35574 63795 77151 83075 61569 42197
7848 42197 25869 9676 18954 14975 6270 -9429 -28054 -38738 -14431 -6237 -8963 -29581 -37299
$$ packed form
7939I8486o022p110j5943j2375j1342n266K7452J9999l6001o50J0191Q308P792
7926G7519k8753K3232J4504k0184k615J6552Q421j1057j3302K1654p169R23J145
7913H0870o687J1776j1657k034L1502P872j4219k4013K595K0308l377p559k540
7900H2837j9213l1698j0605J5998J648k1849K5232J4138P517j923o06K1088l374
7887G9190j938m729L0663j1782n8682l0984R141M295j3666J3221K4233J3246k484
7874D9724K3545J2415o594j9806j124l304q610m722o142j8008n761O711J7507
7861C5831J929j7802j5117L811l867p200J0898K7091K8221J3356N924k1506j9372
7848D2197j6328j6193R278l979q705j5699j8625j0684K4307Q194k726k0618p718
$$ plain form
7835 -37299 -34931 -24075 -22073 -12414 -3318 -18498 -5181 30668 60297 29520 40615 53453 52923
7822 52923 70662 57614 32642 14280 23958 22175 17490 34660 62390 61364 39969 42143 51170
7809 51170 67021 55956 65488 73695 59253 37404 2466 -8366 -979 27556 42133 28119
7797 28119 6088 8515 31446 -9109 -5751 19037 38218 51517 50559 35026 47892 23504 13384
7784 13384 21024 21023 13441 -1347 -16760 -10701 -1643 5725 -2929 -10409 -18505 -9267 -4965 -21090 -33777
7769 -33777 -25378 -18537 7465 19430 33297 16430 -7387 -19391 -24048 -25812 -3789 -16495 -20961
7756 -20961 -30940 -18261 -22509 -21588 -14724 6438 -12507 -22775 -18344 7916 28761 23507 28867
7743 28867 25756 25291 42602 17163 -23766 -27616 -36711 -41122 5667 20418 -11060 -22867 -9942
$$ packed form
7835c7299K368J0856K002R659R096j5180J3317L5849K9629l0777J1095J2838n30
7822E2923J7739j3048k4972j8362R678j783m685J7170K7730j026k1395K174R027
7809E1170J5851j1065R532Q207j4442k1849l4938j0832P387K8535J4577j4014
7797B8119k2031K427K2931m0555L358K4788J9181J3299r58j5533J2866k4388j0120
7784A3384P640jp582j4788j5413O059R058P368q654p480q096R238M302j6125j2687
7769c3777Q399O841K6002J1965J3867j6867k3817j2004m657j764K2023j2706m466
7756b0961r979J2679m248R21O864K1162j8945j0268M431K6260K0845n254N360
7743B8867l111m65J7311k5439m0929l850r095m411M6789J4751l1478j1807J2925
$$ plain form
7730 -9942 -8055 -1749 3027 30740 43959 22051 28897 47787 51380 41491 7360 9068 2574 6746
7716 6746 10252 23553 28591 14550 14914 -9580 -32829 -17457 -16411 -17706 8516 22812 -10313
7703 -10313 -2308 -7349 8758 26864 14925 -12224 -19513 -33103 -34537 -19851 -15601 -57651 -68071
7690 -68071 -44290 -11201 -5834 1874 6441 22619 14054 -21737 -3825 26279 27767 5462 -5190
7677 -5190 -5397 7043 20875 34805 34568 9644 15692 36455 38619 9494 -6435 -11242 -28808
7664 -28808 -13068 16281 27779 11079 14113 29521 37333 18330 38287 34866 -1804 10101
7652 10101 51012 45714 32940 20099 617 -5296 -4396 -306 14564 24993 33533 24580 -11361
7639 -11361 -2216 28752 39413 25833 2495 19826 13379 20096 12540 10202 11909 -17214 -22147
$$ packed form
7730i942J887O306M776K7713J3219k1908O846J8890L593r889l4131J708o494M172
7716F746L506J3301N038j4041L64k4494k3249J5372J046j295K6222J4296l3125
7703a0313Q005n041J6107J8106j1939k7149p289j3590j434J4686M250m2050j0420
7690f8071K3781L3089N367P708M567J6178q565l5791J7912L0104J488k2305j0652
7677e190k07J2440J3832J3930k37k4924O048K0763K164k9125j5929m807j7566
7664b8808J5740K9349J1498j6700L034J5408P812j9003J9957l421l6670J1905
7652A0101M0911n298j2774j2841j9482n913R00M090J4870J0429Q540q953l5941
7639a1361R145L0968J0661j3580k3338J7331o447O717p556k338J707k9123m933
$$ plain form
7626 -22147 -24056 -9323 15028 20039 18090 27556 25015 6367 18945 13542 -14358 -20575 -5810
7613 -5810 -4099 -5283 -19727 -10015 -6512 -22860 -35182 -47291 -31674 -7839 -3893 -10977 -30358
7600 -30358 -22731 20031 24799 -14408 -54838 -69130 -28929 8032 1406 -10935 -31131 -30861 -31599
7587 -31599 -23157 -6362 -13816 -6845 2299 -11375 -28099 -13240 -6051 -4854 5158 -4761 -31933
7574 -31933 -54049 -42516 -27242 -6475 -9647 -4088 -20617 -40986 -26999 -11306 -19061 -10457 -24153
7561 -24153 -24393 6708 19221 10724 11431 10147 -7380 -12189 -11937 13845 11293 -9294 -10713 14309
7547 14309 46708 59543 54818 23254 16334 31194 29422 7844 -1896 -13379 -12705 9598 -4493
7534 -4493 -35263 -23707 -11426 -20952 -8679 8032 7490 10780 10127 19017 17384 30060 28189 20162
$$ packed form
7626b2147j909J4733K4351N011j949R466k541j8648J2578n403k7900o217J4765
7613e810J711j184j4444R712L503j6348j2322j2109J5617K3835L946p084j9381
7600c0358P627M2762M768l9207m0430j4292M0201L6961o626j2341k0196K70p38
7587c1599Q442J6795p454O971R144j3674j6724J4859P189J197J0012r919k7172
7574c1933k2116J1533J5274K0767l172N559j6529k0369J3987J5693p755Q604j3696
7561b4153k40L1101J2513q497P07j284j7527m809K52K5782k552k0587j419K5022
7547A4309L2399J2835m725l1564o920J4860j772k1578r740j1483O74K2303j4091
7534d493l0770J1556J2281r526J2273J6711n42L290o53Q890j633J2676j871q027
$$ plain form
7520 20162 34965 20536 18333 12357 29277 892 -27872 -13155 -18149 -27661 -13663 -5831 -24763
7507 -24763 -27097 -11406 22903 34553 22427 -3369 -7416 18045 10466 -6615 -17947 -9048 -5077
7494 -5077 2433 -5430 -11681 -27661 -11959 -8990 -1855 -7445 -6443 2534 3632 -18279 -26237 -19276
7480 -19276 -33922 -18923 13065 28511 12429 5774 16693 28323 13357 22796 29450 23841 29467
7467 29467 35451 1949 1237 12659 9617 10065 430 2267 -21866 -56331 -31197 -4015 -3912 21575
7453 21575 20496 4043 -11714 15040 18794 -6659 -24903 -54808 -67117 -51549 -38543 -29313
7441 -29313 -10813 2876 -5806 -20172 -13829 7669 106 -11883 -13521 29565 40676 26893 -6182
7428 -6182 -7056 740 14280 31218 27197 18991 15025 11035 19599 9265 -7574 -15802 -18107 -11832
$$ packed form
7520B0162J4803j4429k203n976J6920k8385k8764J4717m994r512J3998P832j8932
7507b4763k334J5691L4309J1650j2126k5796m047K5461p579j7081j1332Q899L971
7494e077P510p863o251j5980J5702K969P135n590J002Q977J098k1911p958O961
7480a9276j4646J4999L1988J5446j6082o655J0919J1630j4966R439O654n609N626
7467B9467N984l3502p12J1422l042M48r635J837k4133l4465K5134K7182J03K5487
7453B1575j079j6453j5757K6754L754k5453j8244k9905j2309J5568J3006R230
7441b9313J8500J3689q682j4366O343K1498p563j1989j638M3086J1111j3783l3075
7428f182q74P796J3540J6938m021q206l966l990Q564j0334j6839q228k305O275
$$ plain form
7414 -11832 -34240 -23022 191 -10124 3072 20037 20879 21026 18533 12310 -13767 -13253 -15427 -26915
7400 -26915 -22947 -9024 -11858 -12969 -7052 11249 22861 8499 17167 41678 23772 3528 5970
7387 5970 -22165 -32976 -18185 -1512 24974 18498 2054 7872 -1451 -522 -5309 -2576 -25238
7374 -25238 -22591 -25615 -36590 -20024 -9785 -20211 -39021 -39147 -35122 3700 20033 14747 15803
7361 15803 -4513 -14446 -15030 -8156 -15461 -26045 -55014 -33848 -11729 -44947 -61283 -51342 -46761
7348 -46761 -45629 -23492 4794 8427 17874 42007 31295 21598 -5497 -21412 -24622 1218 -12119
7335 -12119 -6723 11120 -881 -2483 4354 1913 -9385 -16526 -33445 -15804 -20965 -26737 -6835
7322 -6835 -16778 348 22188 47561 50600 33763 33445 2037 7809 17340 22641 42614 26028
$$ packed form
7414a1832k2408J1218K3213j0315J3196J6965Q42J47k493o223k6077N14k174j1488
7400b6915L968J3923k834j111N917J8301J1612j4362Q668K4511j7906k0244K442
7387E970k8135j0811J4791J6673K6486o476j6444N818r323R29m787K733k2662
7374b5238K647l024j0975J6566J0239j0426j8810j26M025L8822J6333n286J056
7361A5803k0316r933n84O874p305j0584k8969K1166K2119l3218j6336R941M581
7348d6761J132K2137K8286L633R447K4133j0712r697k7095j5915l210K5840j3337
7335a2119N396J7843j2001j602O837k441j1298p141j6919J7641n161n772J9902
7322f835r943J7126K1840K5373L039j6837l18l1408N772R531N301J9973j6586
$$ plain form
7309 26028 -1084 -4584 15251 30667 17660 -1777 10943 53777 39534 19163 13351 -4437
7297 -4437 -30049 -24463 17185 35198 12827 14028 -3440 1523 26518 43634 57871 52581 51673
7284 51673 44373 3222 -5483 117 24395 32184 24227 21325 13269 46267 40399 12535 35714
7271 35714 26197 6068 23979 43425 22957 26096 16943 -3041 -4292 17936 8236 12681 15930
7258 15930 -18940 -39608 -28089 26069 63262 43461 54455 66848 31724 9478 -4248 -19498
7246 -19498 -34770 -24401 -17100 -17291 2514 12220 4385 -8477 -17204 8313 20752 21871 -7829
7233 -7829 -4642 -9259 -37727 -54668 -42422 -16299 -3426 2079 4058 24028 6864 -6719 420
7220 420 17084 25828 25337 23403 -2172 -31227 -28774 -10754 10068 20291 27478 39921 25369
$$ packed form
7309B6028k7112l500J9835J5416j3007j9437J2720M2834j4243k0371n812j7788
7297d437k5612N586M1648J8013k2371J201j7468M963K4995J7116J4237n290r08
7284E1673p300m1151q705N600K4278P789p957k902q056L2998n868k7864K3179
7271C5714r517k0129J7911J9446k0468L139r153j9984j251K2228r700M445L249
7258A5930l4870k0668J1519N4158L7193j9801J0994J2393l5124k2246j3726j5250
7246a9498j5272J0369P301j91J9805R706p835j2862q727K5517J2439J119k9700
7233g829L187m617k8468j6941J2246K6123J2873N505J979J9970j7164j3583P139
7220D20J6664Q744m91j934k5575k9055K453J8020K0822J0223P187J2443j4552
$$ plain form
7207 25369 37995 34763 34249 19954 7118 -20473 -11010 6458 -7351 -55207 -44997 -44390 -24393
7194 -24393 -1001 23967 3286 -25671 -7960 31359 56191 50748 32875 -10783 -9117 26856
7182 26856 2510 12478 40278 2716 -1152 -18307 -8437 22629 30377 23045 33695 41079 29611
7169 29611 11721 40886 26934 6689 8498 26929 15954 15722 17387 12778 -4362 10653 28491
7156 28491 35851 19136 25713 17865 -6299 -45657 -53843 -25158 -10868 -3304 -6203 -6491 5147
7143 5147 -8899 1566 -10497 -14685 -21181 2408 18155 29299 29192 24111 14242 5766 15370 -4740
7129 -4740 -26422 -2262 24082 11366 -7417 -17891 -13350 -23770 -23793 -27576 -37673 -31451 -10808
7116 -10808 -20573 -47115 -38511 -32919 -18726 -12213 -8854 -12986 -38955 -38643 -19925 -4429 -11523 -6979
$$ packed form
7207B5369J2626l232n14j4295j2836k7591R463J7468j3809m7856J0210O07J9997
7194b4393K3392K4968k0681k8957J7711L9319K4832n443j7873m3658J666L5973
7182B6856k4346R968K7800l7562l868j7155R870L1066P748p332J0650P384j1468
7169B9611j7890K9165j3952k0245J809J8431j0975k32J665m609j7140J5015J7838
7156B8491P360j6715O577p848k4164l9358q186K8685J4290P564k899k88J1638
7143E147j4046J0465j2063m188o496K3589J5747J1144j07n081r869q476R604k0110
7129d740k1682K4160K6344j2716j8783j0474M541j0420k3l783j0097O222K0643
7116a0808r765k6542Q604N592J4193O513L359m132k5969L12J8718J5496p094M544
$$ plain form
7102 -6979 -29078 -28226 -31502 -32318 -14188 -12188 26095 49883 27695 25927 36139 17664 28704
7089 28704 37775 30780 8468 6681 14790 2242 14748 39237 61643 60772 49710 24829 9999
7076 9999 14272 17718 36478 10651 -6385 5328 -16548 -21093 -18660 -8682 -11421 -32275 -29481
7063 -29481 -14542 -14176 -10782 -38097 -48284 -13736 23649 50768 48450 22027 8598 15155 38493
7050 38493 48766 8061 -22535 6120 42236 34914 55568 58266 46120 4342 -15276 -3828
7038 -3828 5457 25469 28914 37626 42581 7086 8936 13098 16822 1020 -4884 6925 17262 46027
7024 46027 42789 33413 7581 4927 13523 5787 2431 -5357 8574 28888 29333 6155 -18755 -23788
7010 -23788 -19691 -14353 -5983 11096 22400 10677 -1409 -11189 -13814 -24939 -18429 -12089 7619
$$ packed form
7102f979k2099Q52l276q16J8130K000L8283K3788k2188j768J0212j8475J1040
7089B8704R071o995k2312j787Q109j2548J2506K4489K2406q71j1062k4881j4830
7076I999M273L446J8760k5827j7036J1713k1876m545K433R978k739k0854K794
7063b9481J4939L66L394k7315j0187L4548L7385K7119k318k6423j3429O557K3338
7050C8493J0273m0705l0596K8655L6116p322K0654K698j2146m1778j9618J1448
7038c828R285K0012L445Q712M955l5495J850M162L724j5802n904J1809J0337K8765
7024D6027l238r376k5832k654Q596p736l356p788J3931K0314M45k3178k4910n033
7010b3788M097N338Q370J7079J1304j1723j2086r780k625j1125O510O340J9708
$$ plain form
6997 7619 -12798 -47860 -10440 17653 14498 21271 30271 40264 19868 13220 27659 49283 44391
6984 44391 10692 22604 29136 44349 19115 8366 -566 -8890 10151 22454 5275 -8173
6972 -8173 -20326 13912 -658 8521 18184 4216 -44765 -52445 -8049 11416 18342 18170 43403
6959 43403 38683 33280 53474 61325 42579 31851 13283 -35001 -39587 -21484 -15068 -8164 8728
6946 8728 28532 45421 57974 41726 11889 3106 13504 24341 -4963 -23106 -434 15699
6934 15699 9238 -7035 -27389 -8456 12745 13311 -16185 -19867 -8710 -2951 7023 7937 18367
6921 18367 15003 21513 35011 33970 27455 11144 8498 40620 42101 22921 6961 -5487 -11
6908 -11 245 -16223 -20863 -18366 -19719 -20305 -29615 -8301 -6243 -18867 -20008 11745 32679 33228 17152
$$ packed form
6997G619k0417l5062L7420K8093l155O773R000R993k0396o648J4439K1624m892
6984D4391l3699J1912O532J5213k5234j0749q932q324J9041J2303j7179j3448
6972h173j2153L4238j4570R179R663j3968m8981p680M4396J9465O926j72K5233
6959D3403m720n403K0194P851j8746j0728j8568m8284m586J8103O416O904J6892
6946H728J9804J6889J2553j6248k9837q783J0398J0837k9304j8143K2672J6133
6934A5699o461j6273k0354J8933K1201N66k9496l682J1157N759R974R14J0430
6921A8367l364O510J3498j041o515j6311k646L2122J481j9180j5960j2448N476
6908a1K56j6468m640K497j353n86r310K1314K058j2624j141L1753K0934N49j6076
$$ plain form
6893 17152 6057 12588 16908 23611 21724 26511 15131 15127 12433 31895 24178 12663 29520 22660
6879 22660 -12065 -6736 8023 -2196 -4500 31655 37586 6893 2906 7179 26766 47912 46560
6866 46560 26157 30925 38546 41719 20684 24448 53046 77811 69231 53704 47692 29660 42692
6853 42692 64252 68421 63429 45788 30349 25158 -2596 -25853 -33412 -36155 -39828 -40373 -28787
6840 -28787 -12896 7772 1838 4318 7159 11901 17284 6626 10810 6251 11173 24783 33558 33094
6826 33094 33395 32348 25606 51953 52690 53631 27250 -8740 -12044 893 -5086 -701 -13921 -13195
6812 -13195 -13488 -13089 5682 14339 13052 46329 66318 58598 36544 42901 43603 29965 26899 39250
6798 39250 42064 27313 13770 4450 23791 12260 -3480 -27775 -11853 8324 -25663 -21389
$$ packed form
6893A7152j1095O531M320O703j887M787j1380mk694J9462p717j1515J6857o860
6879B2660l4725N329J4759j0219k304L6155N931l0693l987M273J9587K1146j352
6866D6560k0403M768P621L173k1035L764K8598K4765q580j5527o012j8032J3032
6853D2692K1560M169m992j7641j5439n191k7754k3257p559k743l673n45J1586
6840b8787J5891K0668n934K480K841M742N383j0658M184m559M922J3610Q775m64
6826C3094L01j047o742K6347P37R41k6381l5990l304J2937n979M385j3220P26
6812a3195k93L99J8771Q657j287L3277J9989p720k2054O357P02j3638l066J2351
6798C9250K814j4751j3543r320J9341j1531j5740k4295J5922K0177l3987M274
$$ plain form
6786 -21389 -12185 -9535 -14079 -2510 -17 8500 -196 -14497 2230 11074 9820 3131 -1512 -16322
6772 -16322 -27584 -2380 29482 37996 -788 20671 30692 40594 48522 58746 42329 15623
6760 15623 -955 11363 24048 25899 57226 70719 65289 66975 57147 56895 64396 70772 71260 67418
6746 67418 84281 99716 98737 105560 110432 81142 111225 148959 193054 269067 319699 363269 386477
6733 386477 398840 405096 369493 312616 279177 289381 324580 332972 351724 378077 409079 461571
6721 461571 535952 649190 790592 986381 1288351 1731654 2390201 3354984 4627362 5901951
6711 5901951 6566997 6591725 6448430 6397623 6299271 5478332 4061857 2891058 2167419 1717218
6701 1717218 1421937 1227431 1087596 998340 924338 836649 786023 768804 727913 709283 672937
$$ packed form
6786b1389R204K650m544J1569K493Q517q696j4301J6727Q844j254o689m643j4810
6772a6322j1262K5204L1862Q514l8784K1459J0021R902P928J0224j6417k6706
6760A5623j6578J2318J2685J851L1327J3493n430J686r828k52P501O376M88l842
6746F7418J6863J5435r79O823M872k9290L0083L7734M4095P6013N0632M3570K3208
6733C86477J2363O256l5603n6877l3439J0204L5199Q392J8752K6353L1002N2492
6721D61571P4381J13238J41402J95789L01970M43303O58547R64783J272378J274589
6711E901951O65046K4728j43295n0807r8352q20939j416475j170799p23639m50201
6701A717218k95281j94506j39835q9256p4002q7689n0626j7219m0891j8630l6346
$$ plain form
6690 672937 625412 635171 614722 612377 599942 571623 554149 554184 530324 463495 440817 398685 345019
6677 345019 327771 306821 246641 242956 274769 290913 291838 288051 283242 292088 277417 265224 242723
6664 242723 213793 193597 196306 164089 153142 149132 123506 112183 129072 178320 180043 134666
6652 134666 111719 116249 131484 136488 124884 119752 109709 108193 117925 126957 113915 81669 73098
6639 73098 70878 51918 35772 53151 67046 76865 63127 53829 38153 43390 82761 118826 116335
6626 116335 68820 59651 55597 50167 50336 54615 74342 56848 34476 23642 32889 47718 60016
6613 60016 58766 55876 61610 42844 30217 20600 3147 -24524 -31526 -12007 26459 43740 47968
6600 47968 39910 56655 43959 35036 23892 6561 -1669 9966 26316 18468 20649 17010 -10154
$$ packed form
6690F72937m7525R759k0449k345j2435k8319j7474L5k3860o6829k2678m2132n3666
6677C45019j7248k0950o0180l685L1813J6144R25l787m809Q846j4671j2193k2501
6664B42723k8930k0196K709l2217j0947m010k5626j1323J6889M9248J723m5377
6652A34666k2947M530J5235N004j1604n132j0043j516R732R032j3042l2246q571
6639G3098k220j8960j6146J7379J3895R819j3738r298j5676N237L9371L6065k491
6626A16335m7515r169m054n430J69M279J9727j7494k2372j0834R247J4829J2298
6613F0016j250k890N734j8766j2627r617j7453k7671p002J9519L8466J7281M228
6600D7968q058J6745j2696q923j1144j7331q230J1635J6350p848K181l639k7164
$$ plain form
6587 -10154 -12042 -23946 -10363 12617 30661 20964 10088 32876 41343 35051 13110 12035 6656
6574 6656 -9908 -7632 3181 23256 -12901 -30686 -14617 336 9855 27239 25373 25407 29752
6561 29752 32853 13502 9493 30845 42154 18711 -14300 -12669 -4859 -16564 -11095 -23313 -22862
6548 -22862 -32340 -21665 -16300 -5163 -14103 -10877 5508 38023 31026 -4574 2699 -10099 -26899
6535 -26899 1006 17475 3028 -31102 -27745 -11746 2605 16651 13029 7865 2516 36412 46403
6522 46403 44168 49969 38058 5104 -20562 -25375 -27634 792 17067 23651 26688 25902 50179
6509 50179 43906 25811 3939 -17592 -22939 -21522 -10626 21247 10215 -11487 -21988 -19253 1331
6496 1331 -16478 -21221 -11900 -9371 44372 68863 42581 32304 35543 30081 27920 34726 33051 30376
$$ packed form
6587a0154j888j1904J3583K2980J8044r697j0876K2788Q467o292k1941j075n379
6574F656j6564K276J0813K0075l6157j7785J6069J4953R519J7384j866L4M345
6561B9752L101j9351m009K1352J1309k3443l3011J631P810j1705N469j2218M51
6548b2862r478J0675N365J1137q940L226J6385L2515o997l5600P273j2798j6800
6535b6899K7905J6469j4447l4130L357J5999J4351J4046l622n164n349L3896R991
6522D6403k235N801j1911l2954k5666m813k259K8426J6275O584L037p86K4277
6509E0179o273j8095k1872k1531n347J417J0896L1873j1032k1702j0501K735K0584
6496A331j7809m743R321K529N3743K4491k6282j0277L239n462k161O806j675k675
$$ plain form
6482 30376 10420 -6503 16848 19895 14182 1410 -14626 4652 -16549 -16514 -23558 -12987 -49618
6469 -49618 -49717 -27885 -39099 -28453 -3343 -12912 -7471 -10200 -18146 183 -7710 -10643 1640 27949
6455 27949 20 -36541 -33123 -34800 -32361 -21071 -12109 -8533 3213 -3962 -11335 -10601 -1423 -14394
6441 -14394 -1392 23199 13739 13107 9252 -8633 -24085 -21819 7452 19324 30352 11482 -36032
6428 -36032 -65645 -45259 -20458 -6106 -14321 -31602 -37859 -25574 -19795 -50061 -74664 -52542
6416 -52542 -49902 -34712 -19441 -23752 -13903 -2231 16782 2388 -18510 -372 13446 10052 -3757
6403 -3757 -1538 7243 20208 21248 42514 40251 18150 6366 -13357 -44707 -39029 -31783 -5071
6390 -5071 7498 -8417 -21823 7429 26020 29976 25937 28013 33939 37126 19423 4552 -6257
$$ packed form
6482C0376j9956j6923K3351L047n713j2772j6036J9278k1201L5p044J0571l6631
6469d9618r9K1832j1214J0646K5110r569N441k729p946J8329p893k933J2283K6309
6455B7949k7929l6561L418j677K439J1290Q962L576J1746p175p373P34R178j2971
6441a4394J3002K4591r460o32l855j7885j5452K266K9271J1872J1028j8870m7514
6428c6032k9613K0386K4801J4352q215j7281o257J2285N779l0266k4603K2122
6416e2542K640J5190J5271m311R849J1672J9013j4394k0898J8138J3818l394j3809
6403c757K219Q781J2965J040K1266k263k2101j1784j9723l1350N678P246K6712
6390e071J2569j5915j3406K9252J8591L956m039K076N926L187j7703j4871j0809
$$ plain form
6377 -6257 -10752 -38546 -45729 -38978 -5769 15299 11182 -17803 -28669 -2986 1960 -21090 -42381
6364 -42381 -41649 -22545 -30004 -33976 -22281 -26358 -37914 -23501 -13440 -6409 -13358 -28967 -10573
6351 -10573 -4479 -2530 11071 7401 -27297 -45769 -3165 6116 -10067 24814 7989 -7113 13387
6338 13387 29393 24068 23495 30321 34304 56437 78647 64002 56544 38457 27168 16895 24519
6325 24519 40751 48291 28115 23220 3276 -14221 -34904 -11425 -2000 -3281 -12421 -13363 6531
6312 6531 -5529 -11859 7759 7530 -19736 -703 -5012 -12863 387 16535 36811 30483 24304
6299 24304 3608 18002 49795 71774 75051 65666 68748 43647 11774 -7293 18634 33363
6287 33363 21705 26650 43959 27552 4464 1344 -7599 -8673 3884 -8581 21321 39044 29614
$$ packed form
6377f257m495k7794p183O751L3209K1068m117k8985j0866K5683M946k3050k1291
6364d2381P32J9104p459l972J1695m077j1556J4413J0061P031o949j5609J8394
6351a0573O094J949J3601l670l4698j8472M2604R281j6183L4881j6825j5102K0500
6338A3387J6006n325n73O826L983K2133K2210j4645p458j8087j1289j0273P624
6325B4519J6232P540k0176m895j9944j7497k0683K3479R425j281r140r42J9894
6312F531j2060o330J9618k29k7266J9033m309p851J3250J6148K0276o328o179
6299B4304k0696J4394L1793K1979L277r385L082k5101l1873j9067K5927J4729
6287C3363j1658M945J7309j6407k3088l120q943j074J2557j2465K9902J7723r430
$$ plain form
6274 29614 59870 64179 42525 25708 18750 -578 8436 35046 43603 22436 8373 -13796 -16917
6261 -16917 -25907 -19676 -11673 20831 35476 62061 45054 36322 -4499 -310 -757 -1249 22112 31167
6247 31167 37100 34356 2341 -14913 4478 12231 -6568 -3140 2328 920 18801 44181 22788
6234 22788 -2496 -2309 -26253 -70626 -49460 -14047 -7742 3146 -24562 -61278 -64048 -43502 -14365
6221 -14365 -14542 -28860 -31536 -40910 -33526 -26983 -25839 -19231 -9231 2162 -5376 2905 2038 -10932
6207 -10932 9037 12251 26080 31359 9830 5255 -13574 -12927 -3074 6122 6338 -10863 -16589 -21592
6193 -21592 -1752 -20579 -13432 -16821 -613 2565 18583 31868 13189 -11385 -10467 -30975 -31372
6180 -31372 -29802 -6719 5353 -8131 -7057 -26744 -31816 1064 23725 10598 -8508 -5918 -17316
$$ packed form
6274B9614L0256M309k1654j6817o958j9328R014K6610Q557k1167j4063k2169l121
6261a6917q990O231Q003L2504J4645K6585j7007q732m0821M189m47m92K3361R055
6247C1167N933k744l2015j7254J9391P753j8799L428N468j408J7881K5380k1393
6234B2788k5284J87k3944m4373K1166L5413O305J0888k7708l6716k770K0546K9137
6221a4365j77j4318k676r374P384O543J144O608J0000J1393p538Q281q67j2970
6207a0932J9969L214J3829N279k1529m575j8829O47R853R196K16j7201n726n003
6193b1592J9840j8827P147l389J6208L178J6018J3285j8679k4574R18k0508l97
6180c1372J570K3083J2072j3484J074j9687n072L2880K2661j3127j9106K590j1398
$$ plain form
6167 -17316 -44722 -21621 -5709 -30124 -39179 -11896 -21654 -22848 -8152 20028 7256 14890 1211
6154 1211 -11024 -6904 -14097 -4239 -10849 -20161 -20967 -49395 -48302 -32555 -37859 -55971 -37156 -4623
6140 -4623 11598 19611 -2061 -16454 -631 -37933 -67283 -66901 -77404 -64066 -39231 -45721 -40607
6127 -40607 -40148 1252 15616 30697 32770 17222 36440 35176 51818 61235 22723 -8031 -14086
6114 -14086 -24914 -21697 -19850 -7029 -21971 -35395 -46968 -52364 -27892 -11014 3946 -6963
6102 -6963 -37016 -23372 9332 19725 3981 -2319 -40189 -19420 4141 15994 26058 26501 32374
6089 32374 19686 13704 18152 -4134 -36323 -34966 -28060 -13366 -3468 8273 7747 -696 -12418
6076 -12418 -21284 -870 -3877 -37744 -77039 -68491 -38092 -37123 -18508 -14462 -25241 -21887 -46443
$$ packed form
6167a7316k7406K3101J5912k4415r055K7283r758j194J4696K8180j2772P634j3679
6154A211j2235M120p193R858o610r312q06k8428J093J5747n304j8112J8815L2533
6140d623J6221Q013k1672j4393J5823l7302k9350L82j0503J3338K4835o490N114
6127d0607M59M1400J4364J5081K073j5548J9218j264J6642R417l8512l0754o055
6114a4086j0828L217J847J2821j4942j3424j1573n396K4472J6878J4960j0909
6102f963l0053J3644L2704J0393j5744o300l7870K0769K3561J1853J0064M43N873
6089C2374j2688n982M448k2286l2189J357O906J4694R898J1741n26q443j1722
6076a2418q866K0414l007l3867l9295Q548L0399R69J8615M046j0779L354k4556
$$ plain form
6063 -46443 -36421 23208 9277 2609 12933 5480 3299 31153 7437 -20990 -26493 -28571 -9312
6050 -9312 -16983 -37984 -33089 -19186 -21380 -579 1904 -30772 -14462 25101 37658 38916 50558
6037 50558 64961 47515 40 -34595 -25017 -35648 -37985 -7848 -1143 -17193 1617 -10001
6025 -10001 -12948 -5496 13374 -11402 -3249 5611 -2467 -40262 -74364 -84527 -56360 -25237 -28621
6012 -28621 -35603 -60989 -78168 -41887 -26713 -3714 -15112 -13612 -6237 -24362 -46659 -51539 -29725
5999 -29725 -28301 -51032 -37411 6100 6727 13675 27576 30643 51895 38318 21940 8572 10551
5986 10551 20848 23756 18195 27376 44624 33356 45435 34172 29003 21355 3465 -7489 -6390
5973 -6390 -38063 -60420 -49667 -35687 -19577 -7034 15876 1285 -7983 22585 526 -51834
$$ packed form
6063d6443J0022N9629j3931o668J0324p453k181K7854k3716k8427n503k078J9259
6050i312p671k1001M895J3903k194K0801K483l2676J6310L9563J2557J258J1642
6037E0558J4403j7446m7475l4635R578j0631k337L0137O705j6050J8810j1618
6025a0001k947P452J8870k4776Q153Q860q078l7795l4102j0163K8167L1123l384
6012b8621o982k5386j7179L6281J5174K2999j1398J500P375j8125k2297m880K1814
5999b9725J424k2731J3621M3511O27O948J3901L067K1252j3577j6378j3368J979
5986A0551J0297K908n561R181J7248j1268J2079j1263n169p648j7890j0954J099
5973f390l1673k2357J0753J3980J6110J2543K2910j4591r268L0568k2059n2360
$$ plain form
5961 -51834 -62180 -60133 -47848 -50576 -25237 6736 3121 5307 31740 15833 23212 11757 -12101
5948 -12101 4348 15539 -6252 -27870 -10392 -2573 10205 -6398 -9028 33536 22126 -8688
5936 -8688 -7233 -24203 -9419 3324 18291 11408 14299 21212 17177 21107 19789 18116 23970 18034
5922 18034 20747 16305 4305 -7977 49 -2122 -1694 -694 -10608 -4530 9238 19433 -11213 -20202
5908 -20202 -17815 -9362 -22571 -15492 5432 -9205 -14806 -18193 -3783 3171 5929 -7123 -3085
5895 -3085 -2505 -22713 -26292 -15730 -10787 10837 30104 3659 11702 -24607 -59269 -54887 -48401
5882 -48401 -42183 -15358 -8837 5761 25966 5225 4197 19223 22224 17844 26873 13657 19547
5869 19547 23933 -292 -9369 -10947 -23093 -43791 -15669 9245 550 -16655 -31304 -22988 -16342
$$ packed form
5961e1834j0346K047J2285k728K5339L1973l615K186K6433j5907P379j1455k3858
5948a2101J6449J1191k1791k1618J7478P819J2778j6603k630M2564j1410l0814
5936h688J455j6970J4784J2743J4967o883K891O913m035L930j318j673N854n936
5922A8034K713m442j2000j2282Q026k171M28J000r914O078J3768J0195l0646q989
5908b0202K387Q453j3209P079K0924j4637n601l387J4410O954K758j3052M038
5895c085N80k0208l579J0562M943K1624J9267k6445Q043l6309l4662M382O486
5882d8401O218K6825O521J4598K0205k0741j028J5026L001m380R029j3216N890
5869A9547M386k4225r077j578j2146k0698K8122K4914q695j7205j4649Q316O646
$$ plain form
5856 -16342 -18663 -27638 -256 3258 -9766 -23526 -29755 -52486 -79331 -68962 -10966 -623 -385
5843 -385 5136 9103 1126 5821 49791 59340 36051 13160 3602 -20539 -5749 -12486 -11459 -240
5829 -240 27767 48066 41229 30685 12988 -18003 -39661 -47138 -40638 -45855 -49234 -63995 -36091
5816 -36091 -46821 -29332 -38281 -23413 -20420 -17884 -5027 24564 15414 -12663 -23294 4147 -6754
5803 -6754 -28305 -37610 -6854 -21464 -45698 -66859 -62479 -22616 4069 17305 -4801 -2213 -9511
5790 -9511 -28065 -21155 -14888 -31100 -22020 -25613 -37589 -39426 -50462 -63459 -52526 -5090 10072
5777 10072 15821 13568 13118 163 -24387 -12968 -15466 -19938 -15890 -11166 5697 15350 40919 42557
5763 42557 17861 28793 49621 59068 39329 -4821 -40418 -28852 14870 22634 12510 5142
$$ packed form
5856a6342k321q975K7382L514j3024j3760o229k2731k6845J0369N7996J0343K38
5843c85N521L967p977M695M3970R549k3289k2891r558k4141J4790o737J027J1219
5829b40K8007K0299o837j0544j7697l0991k1658p477O500n217l379j4761K7904
5816c6091j0730J7489q949J4868K993K536J2857K9591r150k8077j0631K7441j0901
5803f754k1551r305L0756j4610k4234k1161M380L9863K6685J3236k2106K588p298
5790i511j8554O910O267j6212R080l593j1976j837j1036j2997J0933M7436J5162
5777A0072N749k253m50j2955k4550J1419k498m472M048M724J6863R653K5569J638
5763D2557k4696J0932K0828R447j9739m4150l5597J1566M3722P764j0124p368
$$ plain form
5751 5142 -2626 4613 10950 10022 -9480 -12046 -48448 -59123 -54167 -36161 3761 23814 36978
5738 36978 48203 53128 61471 45475 38094 34062 21033 2699 -25717 -48497 -32851 -17473 -21319
5725 -21319 -30191 -9411 21095 10539 3910 1575 -13639 -31716 -17654 -41412 -29513 10434
5713 10434 29753 22603 17788 10503 -14634 -22794 -39723 -58649 -44785 -2751 8268 4861 -7453
5700 -7453 -45872 -39644 -492 55354 52381 16769 -5486 -9151 6336 13814 6502 -12912 17338
5687 17338 29902 19095 18177 7964 -5826 -6781 -26361 -25649 -33278 -39180 -46741 -25815 -26910 -5398
5673 -5398 -7827 -20798 -46290 -63686 -92974 -76028 -27852 -6174 -5552 1054 -21956 -34663 -12640
5660 -12640 -12104 -23484 -39049 -50826 -51649 4934 35360 19216 23194 30894 13964 6367 15709
$$ packed form
5751E142p768P239O337r28j9502k566l6402j0675M956J8006L9922K0053J3164
5738C6978J1225M925Q343j5996p381m032j3029j8334k8416k2780J5646J5378l846
5725b1319q872K0780L0506j0556o629k335j5214j8077J4062k3758J1899L9947
5713A0434J9319p150m815p285k5137q160j6929j8926J3864M2034J1019l407j2314
5700g453l8419O228L9152N5846k973l5612k2255l665J5487P478p312j9414L0250
5687A7338J2564j0807r18j0213j3790r55j9580P12p629n902p561K0926j095K1512
5673e398k429j2971k5492j7396k9288J6946M8176K1678O22O606k3010j2707K2023
5660a2640N36j1380j5565j1777q23N6583L0426j6144L978P700j6930p597R342
$$ plain form
5647 15709 12234 9111 15457 15072 -137 -13632 2496 939 25049 30486 298 -41038 -45561
5634 -45561 -48792 -62048 -47145 -9386 16149 -7245 -11338 11421 10920 12936 16356 -3766 -11432
5621 -11432 10767 1459 -38085 -52392 -50848 -51614 -45356 -43545 -35998 -39461 -45398 -31004 4131 23602
5607 23602 169 -21236 -24358 2335 2301 6862 -12303 -14070 -10405 -11076 14789 9577 -3482 18924
5593 18924 5222 -15942 -24463 -16732 5595 -18763 -29704 -18258 -5451 -301 11079 14236 22980
5580 22980 -16328 -33847 -14093 4163 -22477 -12299 -2905 -8819 -87 18622 6644 -11517
5568 -11517 -29063 -33241 -4510 4458 -23570 -33292 -24261 -46340 -29183 4912 -12567 -25079 -27482
5555 -27482 -11414 -1094 6288 -19982 2417 23473 17383 3506 2035 -29438 -37819 -25411 -7153
$$ packed form
5647A5709l475l123O346l85j5209j3495J6128j557K4110N437l0188m1336m523
5634d5561l231j3256J4903L7759K5535k3394m093K2759n01K016L420k0122p666
5621a1432K2199r308l9544j4307J544p66O258J811P547l463n937J4394L5135J9471
5607B3602k3433k1405l122K6693l4M561j9165j767L665o71K5865n212j3059K2406
5593A8924j3702k1164q521P731K2327k4358j0941J1446J2807N150J1380L157Q744
5580B2980l9308j7519J9754J8256k6640J0178R394n914Q732J8709j1978j8161
5568a1517j7546m178K8731Q968k8028r722R031k2079J7157L4095j7479j2512k403
5555b7482J6068J0320P382k6270K2399K1056o090j3877j471l1473q381J2408J8258
$$ plain form
5542 -7153 -2446 3611 7036 715 9395 22099 14533 -12219 -30525 -15951 -4906 2988 30754
5529 30754 41541 39316 21696 14852 -3307 -18584 -18863 -1450 -7156 -12037 -15908 -13886 -26163
5516 -26163 -17077 -17450 5897 17785 2529 -8723 -27102 -31489 -35802 -34639 -20892 -18212 -21085
5503 -21085 51 50495 74706 83627 43182 14025 -14248 -27127 3064 39047 54668 33570
5491 33570 13250 14255 17942 26384 29337 8297 -587 37263 38799 10558 494 6030 -18513
5478 -18513 -25555 -9450 -24612 -31216 -14144 -11405 -17980 -26866 -19848 -21614 434 -4945 -29696
5465 -29696 -13004 -14517 -44402 -52707 -33706 -13786 -25301 -40399 -37586 -48534 -28730 -26236 -41265
5452 -41265 -11558 20023 6973 -25922 -34994 1427 10466 12934 24730 22214 1741 -2346 24005
$$ packed form
5542g153M707O057L425o321Q680J2704p566k6752j8306J4574J1045P894K7766
5529C0754J0787k225j7620o844j8159j5277k79J7413n706m881l871K022j2277
5516b6163R086l73K3347J1888j5256j1252j8379m387m313J163J3747K680k873
5503b1085K1136N0444K4211Q921m0445k9157k8273j2879L0191L5983J5621k1098
5491C3570k0320J005L687Q442K953k1040q884L7850J536k8241j0064N536k4543
5478a8513p042J6105j5162o604J7072K739o575q886P018j766K2048n379k4751
5465b9696J6692j513k9885q305J9001J9920j1515j5098K813j0948J9804K494j5029
5452d1265K9707L1581j3050l2895r072L6421R039K468J1796k516k0473m087K6351
$$ plain form
5439 24005 32707 40802 41587 26169 20947 42523 26576 -997 -1485 -16312 -38544 -8009 -7003
5426 -7003 -25225 -36381 -31371 -12956 -13811 -16647 -36094 -25859 -14535 1856 -10665 -28236 5463
5413 5463 29787 6789 -21673 -18268 16422 31496 10118 12122 23158 27169 31934 20036 -16219
5400 -16219 -16789 -51 782 -16762 -33315 -22933 -32176 -27225 -19240 -2537 -4471 237 -9536 -30506
5386 -30506 -38423 -39596 -39350 -29593 -33101 -47661 -37371 -16329 -34245 -36592 -31158 -50127 -44964 -9170
5372 -9170 14718 7913 -4585 -6647 7155 13767 13261 22464 -21004 -62687 -46873 -7520 -3267
5359 -3267 2698 17534 17224 7620 5813 -22040 -42274 -7364 1294 16371 30184 24317 -34
5346 -34 573 20333 -16246 -37992 -26768 -5128 10945 23495 14975 16657 46868 52768 47124 58617
$$ packed form
5439B4005Q702Q095P85j5418n222K1576j5947k7573m88j4827k2232L0535J006
5426g003j8222j1156N010J8415q55k836j9447J0235J1324J6391j2521j7571L3699
5413E463K4324k2998k8462L405L4690J5074k1378K004J1036M011M765j1898l6255
5400a6219n70J6738Q33j7544j6553J0382r243M951P985J6703j934M708r773k0970
5386c0506p917j173K46R757l508j4560J0290K1042j7916k347N434j8969N163L5794
5372i170K3888o805j2498k062J3802O612n06R203m3468m1683J5814L9353M253
5359c267N965J4836l10r604j807k7853k0234L4910Q658J5077J3813n867k4351
5346c4O07J9760l6579k1746J1224K1640J6073J2550q520J682L0211N900n644J1493
$$ plain form
5332 58617 36415 -10658 -28728 -40015 -48739 -29860 -15244 -35573 -21260 15151 -557 -47161
5320 -47161 -54201 -23344 708 5937 4668 7026 5530 19664 7196 3114 944 -21987 -25536
5307 -25536 1790 -5492 -27512 -61355 -55143 -37286 -21910 -3516 13266 -5053 -4436 1169 8479
5294 8479 2531 23064 5492 -30840 -18588 11930 1811 -17418 -22065 -7523 -17523 -42748
5282 -42748 -49256 -59509 -78192 -51908 -15398 -2412 -9921 -14347 -23520 -9974 -32418 -28528 -6388
5269 -6388 12132 12290 17824 34373 41565 12773 -19896 -17557 1171 22382 36363 24498 -6592
5256 -6592 -11312 -11267 -9011 -19949 -21212 -16589 8882 18896 11024 12655 3353 -5198 -3850 16134
5242 16134 11669 -10461 10265 38911 24959 7059 5030 -15166 -49815 -29684 -17081 -21810
$$ packed form
5332E8617k2202m7073j8070j1287q724J8879J4616k0329J4313L6411j5708m6604
5320d7161p040L0857K4052N229j269K358j496J4134j2468m082k170k2931l549
5307b5536K7326p282k2020l3843O212J7857J5376J8394J6782j8319O17N605P310
5294H479n948K0533j7572l6332J2252L0518j0119j9229m647J4542j0000k5225
5282d2748o508j0253j8683K6284L6510J2986p509m426r173J3546k2444L890K2140
5269f388J8520J58N534J6549P192k8792l2669K339J8728K1211J3981j1865l1090
5256f592m720M5K256j0938j263M623K5471J0014p872J631r302q551J348J9984
5242A6134m465k2130K0726K8646j3952j7900k029k0196l4649K0131J2603m729
$$ plain form
5230 -21810 -26629 -42588 -66445 -53694 -48881 -49291 -14921 -447 13431 17413 10895 -676 -11588
5217 -11588 -7333 -12785 -19257 -33515 -10261 11507 21336 21830 38145 30948 31915 45321 32938 -14041
5203 -14041 -20634 -12511 -36055 -36229 -14511 -18232 -27415 3044 -8847 -19021 -10486 -16123 -7028 -12036
5189 -12036 -13138 -6952 77 12078 20627 2729 -17734 -12992 -8909 -7953 -5580 -1621 17510 1414
5175 1414 -17794 -30060 2204 35215 36649 11958 -8372 5829 -12710 -37021 -14831 -4999
5163 -4999 9541 35179 19292 -18492 -30353 -24651 -1840 -11593 -47390 -36957 -42129 -34916 -29006
5150 -29006 -18999 -9004 -12593 -20268 -32175 -32293 -31354 -35920 -40163 -49458 -58242 -71304 -51048 -47555
5136 -47555 -58789 -57588 -45205 -28061 16206 16545 22234 23383 12799 -4904 5897 23263 36039
$$ packed form
5230b1810m819j5959k3857J2751M813m10L4370J4474J3878L982o518j1571j0912
5217a1588M255n452o472j4258K3254K1768R829M94J6315p197R67J3406j2383m6979
5203a4041o593Q123k3544j74K1718l721r183L0459j1891j0174Q535n637R095n008
5189a2036j102O186P029J2001Q549j7898k0463M742M083R56K373L959J9131j6096
5175A414j9208j2266L2264L3011J434k4691k0330J4201j8539k4311K2190R832
5163d999J4540K5638j5887l7784j1861N702K2811r753l5797J0433n172P213N910
5150b9006J0007R995l589p675j1907j18R39m566m243r295q784j3062K0256L493
5136d7555j1234J201J2383J7144M4267L39N689J149j0584j7703J0801J7366J2776
$$ plain form
5123 36039 51548 31633 5370 3807 2199 -601 6849 512 -11875 -14729 -12564 -16970 10800
5110 10800 10295 30902 29513 29262 7550 -1911 -2745 3305 -5697 -3724 -2259 -6690 -15795 -22161 -30047
5095 -30047 -28436 -41179 -17252 -9059 -8234 16195 13613 1487 13845 24324 38448 51567 49488
5082 49488 16014 -26475 -50061 -57741 -54883 -13850 28028 -13016 -42843 -17754 21557 29405
5070 29405 25856 17003 10065 7880 18082 28647 47227 38459 33694 40042 55626 45436 33241
5057 33241 39642 42858 20643 -603 30044 36706 29251 30739 23862 11194 15027 -13113 -36641
5044 -36641 -22102 26072 44881 13032 2583 -18085 -40874 -38748 -49888 -69615 -60456 -27989
5032 -27989 -25496 -40120 -36916 5762 43089 29838 26699 20330 33004 36054 10357 -5878 -4493
$$ packed form
5123C6039J5509j9915k6263j563j608k800P450o337j2387k854K165m406K7770
5110A0800n05K0607j389k51k1712r461q34O050r002J973J465m431r105o366p886
5095c0047J611j2743K3927Q193Q25K4429k582j2126J2358J0479J4124J3119k079
5082D9488l3474m2489k3586p680K858M1033M1878m1044k9827K5089L9311P848
5070B9405l549q853o938k185J0202J0565J8580q768m765O348J5584j0190j2195
5057C3241O401L216k2215k1246L0647O662p455J488o877j2668L833k8140k3528
5044c6641J4539M8174J8809l1849j0449k0668k2789K126j1140j9727R159L2467
5032b7989K493j4624L204M2678L7327j3251l139o369J2674L050k5697j6235J385
$$ plain form
5019 -4493 12369 54593 73683 45037 7032 -17190 -14639 13222 -7393 -1361 -3737 -22368 -47225
5006 -47225 -56065 -51126 -47161 -43965 -33963 -51493 -59158 -52530 -20610 -27694 -32391 -11281 -8693 -16208
4992 -16208 6712 24789 -5619 10056 15717 9735 1124 7703 -1383 -876 -17308 -24659 19613
4979 19613 -2660 -35968 -21207 -2952 -19586 -36836 -49263 -23899 -22193 -33286 -6560 -1817
4967 -1817 -18903 -37566 -28709 -21381 -5768 -20519 -46342 -43892 -22216 -19438 -37027 -6659 5447
4954 5447 8047 22200 16198 7456 -18574 -31710 -24580 -29956 -15993 4868 18302 38098 25777
4941 25777 3793 -9672 -14308 -21879 -17578 -9788 -5715 20333 22345 5283 5255 3793 -12090 -49219
4927 -49219 -52952 -38243 -33887 -2004 -12892 -14877 -27434 -39046 -24407 2641 9663 14671 -7708
$$ packed form
5019d493J6862M2224J9090k8646l8005k4222K551K7861k0615O032k376j8631k4857
5006d7225q840M939L965L196J0002j7530p665O628L1920p084m697K1110K588p515
4992a6208K2920J8077l0408J5675N661n982q611O579r086N07j6432p351M4272
4979A9613k2273l3308J4761J8255j6634j7250j2427K5364J706j1093K6726M743
4967a817j7086j8663Q857P328J5613j4751k5823K450K1676K778j7589L0368J2106
4954E447K600J4153o002q742k6030j3136P130n376J3963K0861J3434J9796j2321
4941B5777k1984j3465m636p571M301P790M073K6048K012j7062k8j462j5883l7129
4927d9219l733J4709M356L1883j0888j985j2557j1612J4639K7048P022N008k2379
$$ plain form
4914 -7708 -36771 -19129 -7805 -5200 -16767 9966 -11683 -23985 -12165 -21488 -12534 -7235 -14793
4901 -14793 -22454 -29266 -27366 -12242 41675 31677 -2133 -26307 -63493 -40922 -6735 9428 -20336
4888 -20336 -21090 -32623 -46257 -37918 -30297 -23951 -38453 -37045 -38666 -56997 -33270 -7048 -16430
4875 -16430 -45154 -41772 -38483 -24468 2855 -10046 -17496 -15632 -35659 -32406 6821 12337 19155
4862 19155 33505 25822 4669 -1038 -22934 -2079 21619 -8927 -33452 -55551 -42239 -17196
4850 -17196 14100 26009 2050 6134 -18148 -31769 6918 44557 41535 44758 12929 -6297
4838 -6297 -3519 -6033 8479 1511 -5882 -34727 -75093 -79558 -52087 -1006 11468 -5663 -1481
4825 -1481 -8209 -14371 -12810 -30422 -15232 -7348 6579 11403 10141 12918 -11326 -16052 -39119 -26625
$$ packed form
4914g708k9063J7642J1324K605j1567K6733k1649j2302J1820r323Q954N299p558
4901a4793p661o812J900J5124N3917r998l3810k4174l7186K2571L4187J6163k9764
4888b0336p54j1533j3634Q339P621O346j4502J408j621j8331K3727K6222r382
4875a6430k8724L382L289J4015K7323j2901p450J864k0027L253L9227N516O818
4862A9155J4350p683k1153n707k1896K0855K3698l0546k4525k2099J3312K5043
4850a7196L1296J1909k3959M084k4282j3621L8687L7639l022L223l1829j9226
4838f297K778k514J4512o968p393k8845m0366m465K7471N1081J2474j7131M182
4825a481o728o162J561j7612J5190P884J3927M824j262K777k4244m726k3067J2494
$$ plain form
4811 -26625 -57713 -41359 -18442 -35313 -34307 -30359 -31678 -37391 -30781 -29182 -26243 -34614 -5164
4798 -5164 18986 17772 2176 3292 -7870 -21336 -11085 -609 -14200 -6402 -2628 -16641 -18834
4785 -18834 -3080 9646 6296 15576 23869 20518 279 9279 7414 10176 7032 -5079 11887
4772 11887 14212 -15909 -26902 -38986 -45634 -84909 -74569 -50156 -38712 -39554 -53481 -75166 -65568
4759 -65568 -29782 17371 33111 27023 9794 9754 24714 21193 5380 -276 3765 9961 7592 3588
4745 3588 3800 -18606 -1643 11051 -7050 6084 24885 10076 1278 -3279 11416 16339 -26502
4732 -26502 -44027 -17200 3018 -1975 12793 1998 -10669 -33324 -33749 -41971 -45977 -53131 -48765
4719 -48765 -52042 -36700 -12903 -24972 -28722 -15001 -29964 -35891 -11908 17076 51703 48573 51307
$$ packed form
4811b6625l1088J6354K2917j6871J006L948j319n713O610J599K939q371K9450
4798e164K4150j214j5596J116j1162j3466J0251J0476j3591P798L774j4013k193
4785a8834J5754J2726l350R280Q293l351k0239R000j865K762l144j2111J6966
4772A1887K325l0121j0993j2084o648l9275J0340K4413J1444q42j3927k1685R598
4759f5568L5786M7153J5740o088j7229m0J4960l521j5813n656M041O196k369m004
4745C588K12k2406J6963J2694j8101J3134J8801j4809q798m557J4695M923m2841
4732b6502j7525K6827K0218m993J4768j0795j2667k2655m25q222m006p154M366
4719d8765l277J5342K3797j2069l750J3721j4963n927K3983K8984L4627l130K734
$$ plain form
4706 51307 38349 19473 -31587 -18455 16423 33879 40617 15517 -27256 -64523 -56790 -26176
4694 -26176 4024 13271 -25526 -36062 -22626 -17843 -14729 6336 12956 15471 -17551 -35291 -26760
4681 -26760 -27042 -22183 -15957 -23483 -29778 -20037 -1019 6248 -7050 -14543 5702 -4236 -22859 -54437
4667 -54437 -49915 -18605 4074 -9475 -15690 -4278 15967 28230 16704 13352 33850 37322 34326
4654 34326 35438 30378 10598 -10010 -18933 -26619 -31500 -41781 -67252 -52865 -4576 21296 20582
4641 20582 -2267 2 -19461 -12780 10935 16696 3211 1535 -12077 -6369 11679 4470 -10846
4628 -10846 -31575 -28440 -39874 -20741 82 4887 -1569 -18898 -31462 -9015 -8891 -17040 -38744
4615 -38744 -19783 13407 -7887 5113 48339 34747 15571 23590 33939 57390 50830 43785
$$ packed form
4706E1307j2958j8876n1060J3132L4878J7456O738k5100m2773l7267P733L0614
4694b6176L0200R247l8797j0536J3436M783L114K1065O620K515l3022j7740Q531
4681b6760k82M859O226p526o295R741J9018P267j3298p493K0245r938j8623l1578
4667e4437M522L1310K2679j3549o215J1412K0245J2263j1526l352K0498L472k996
4654C4326J112n060j9780k0608q923p686m881j0281k5471J4387M8289K5872p14
4641B0582k2849K269j9463O681K3715N761j3485j676j3612N708J8048p209j5316
4628a0846k0729L135j1434J9133K0823M805o456j7329j2564K2447J24q149k1704
4615c8744J8961L3190k1294J3000M3226j3592j9176Q019J0349K3451o560p045
$$ plain form
4603 43785 23576 21460 16671 6990 29879 39613 17286 450 9708 10555 -14503 -31060 -47172
4590 -47172 -29048 -24912 -12684 -12630 -12563 -8878 -24537 -55348 -51157 -15940 13092 40470 53256 34780
4576 34780 25913 7533 -3389 530 8823 27630 18142 -6569 10097 13268 15503 -4358 -47638
4563 -47638 -52864 -19533 -3663 -10687 -26664 -12651 -5719 -5703 2453 16400 9771 -10121 -21931
4550 -21931 -27317 -32167 5137 37570 10059 -26868 -55104 -50752 -21704 14503 26351 27625 43497
$$ packed form
4603D3785k0209k116m789r681K2889R734k2327j6836R258Q47k5058j6557j6112
4590d7172J8124M136J2228N4O7L685j5659l0811M191L5217K9032K7378J2786j8476
4576C4780q867j8380j0922L919Q293J8807r488k4711J6666L171K235j9861m3280
4563d7638n226L3331J5870p024j5977J4013O932J6Q156J3947o629j9892j1810
4550b1931n386m850L7304L2433k7511l6927k8236M352K9048L6207J1848J274J5872
$$ [...]
##END NTUPLES=NMR SPECTRUM
##END=
