##TITLE=Analysis number 321999
Compound Code cc 61911
Project Code adrs
Chemist Name endeavour
##JCAMPDX= 6.0         $$ Bruker NMR JCAMP-DX V2.0
##DATA TYPE= NMR SPECTRUM
##DATA CLASS= NTUPLES
##ORIGIN= Bruker BioSpin GmbH
##OWNER= nmr
$$ XWIN-NMR		Version 3.5
$$ Fri Sep  8 08:50:36 2006 GMT Daylight Time (UT+1h)  MAYBRIDGE\nmr@NMR_250MHZ
##.OBSERVE FREQUENCY= 250.131544655141
##.OBSERVE NUCLEUS= ^1H
##.ACQUISITION MODE= SIMULTANEOUS (DQD)
##.ACQUISITION SCHEME= undefined
##.AVERAGES= 16
##.DIGITISER RES= 18
##SPECTROMETER/DATA SYSTEM= dpx250
##.PULSE SEQUENCE= zg30
##.SOLVENT NAME= CDCl3
##.SHIFT REFERENCE= (INTERNAL, CDCl3, 0, 16.522)
##AUDIT TRAIL= $$ (NUMBER, WHEN, WHO, WHERE, WHAT)
$$ ##TITLE= Audit trail, XWIN-NMR		Version 3.5
$$ ##JCAMPDX= 5.01
$$ ##ORIGIN= Bruker BioSpin GmbH
$$ ##OWNER= nmr
$$ C:\u/data/dgb/nmr/ADRS/350/pdata/1/auditp.txt
$$ ##AUDIT TRAIL=  $$ (NUMBER, WHEN, WHO, WHERE, WHAT)
(   1,<2006-09-08 08:50:10.98 +100>,<MAYBRIDGE\nmr>,<NMR_250MHZ>,
      <created by zg, POWCHK disabled, PULCHK disabled
       configuration hash MD5:
       E2 DF 36 D8 04 B2 41 60 5A D7 A3 38 5A 4B D0 FE
       data hash MD5: 64K
       89 74 60 43 1F C0 1F FC EA 4A 74 EB 47 2D A4 EB>)
(   2,<2006-09-08 08:50:26.67 +100>,<MAYBRIDGE\nmr>,<NMR_250MHZ>,
      <Start of raw data processing
       ef LB = 0.3 FT_mod = 6 PKNL = 1 SI = 32K 
       data hash MD5: 32K
       ED E5 76 40 30 8F D3 E8 D9 64 D9 81 2F AF 74 2F>)
(   3,<2006-09-08 08:50:28.67 +100>,<MAYBRIDGE\nmr>,<NMR_250MHZ>,
      <apk 
       data hash MD5: 32K
       BE 4C A9 26 58 F7 35 2E 84 3A 47 B2 C2 C0 24 6A>)
(   4,<2006-09-08 08:50:29.52 +100>,<MAYBRIDGE\nmr>,<NMR_250MHZ>,
      <abs ABSG = 5 
       data hash MD5: 32K
       5E F9 EF B4 B1 76 78 E4 C6 42 87 07 4D B1 8A B1>)
$$ ##END=
$$ 
$$ hash MD5
$$ 8B 98 36 97 E2 94 C9 A7 41 68 F0 39 F3 AE 29 2D
##$RELAX= 
##$RELAX= 
##$RELAX= 
##$RELAX= 
##$RELAX= 
##$RELAX= 
##$RELAX= 
$$ Bruker specific parameters
$$ --------------------------
##$DU= <C:\u>
##$EXPNO= 350
##$NAME= <ADRS>
##$PROCNO= 1
##$TYPE= <nmr>
##$USER= <dgb>
##$AMP= (0..31)
100 100 100 100 100 100 100 100 100 100 100 100 100 100 100 100 100 100 
100 100 100 100 100 100 100 100 100 100 100 100 100 100 
##$AQSEQ= 0
##$AQ_mod= 3
##$AUNM= <au_zg>
##$AUTOPOS= <3 >
##$BF1= 250.13
##$BF2= 250.13
##$BF3= 250.13
##$BF4= 250.13
##$BF5= 500.13
##$BF6= 500.13
##$BF7= 500.13
##$BF8= 500.13
##$BYTORDA= 1
##$CFDGTYP= 0
##$CFRGTYP= 5
##$CHEMSTR= <none>
##$CNST= (0..31)
1 1 145 1 1 1 1 1 1 1 1 1 1 1 1 1 1 1 1 1 1 1 1 1 1 1 1 1 1 1 1 1 
##$CPDPRG= <>
##$CPDPRG1= <>
##$CPDPRG2= <>
##$CPDPRG3= <>
##$CPDPRG4= <mlev>
##$CPDPRG5= <mlev>
##$CPDPRG6= <mlev>
##$CPDPRG7= <mlev>
##$CPDPRG8= <mlev>
##$CPDPRGB= <>
##$CPDPRGT= <>
##$D= (0..31)
0 1 0 0 0 0 0 0 0 0.06 0 0 0 0 0 0 0.0002 0 0 0 0 0 0 0 0 0 0 0 0 0 0 
0 
##$DATE= 1157701809
##$DBL= (0..7)
120 120 120 120 120 120 120 120 
##$DBP= (0..7)
150 150 150 150 150 150 150 150 
##$DBP07= 0
##$DBPNAM0= <>
##$DBPNAM1= <>
##$DBPNAM2= <>
$$ [...]
##$SUBNAM7= <"">
##$SUBNAM8= <"">
##$SUBNAM9= <"">
##$SW= 20.6930455092707
##$SWIBOX= (0..15)
0 0 3 0 0 0 0 0 0 0 0 0 0 0 0 0 
##$SW_h= 5175.983436853
##$TD= 65536
##$TD0= 1
##$TE= 295.16
##$TE2= 300
##$TE3= 300
##$TEG= 300
##$TL= (0..7)
0 120 120 120 120 120 120 120 
##$TP= (0..7)
150 150 150 150 150 150 150 150 
##$TP07= 0
##$TPNAME0= <>
##$TPNAME1= <>
##$TPNAME2= <>
##$TPNAME3= <>
##$TPNAME4= <>
##$TPNAME5= <>
##$TPNAME6= <>
##$TPNAME7= <>
##$TPOAL= (0..7)
0.5 0.5 0.5 0.5 0.5 0.5 0.5 0.5 
##$TPOFFS= (0..7)
0 0 0 0 0 0 0 0 
##$TUNHIN= 0
##$TUNHOUT= 0
##$TUNXOUT= 0
##$USERA1= <user>
##$USERA2= <user>
##$USERA3= <user>
##$USERA4= <user>
##$USERA5= <user>
##$V9= 5
##$VALIST= <valist>
##$VCLIST= <CCCCCCCCCCCCCCC>
##$VD= 0
##$VDLIST= <DDDDDDDDDDDDDDD>
##$VPLIST= <PPPPPPPPPPPPPPP>
##$VTLIST= <TTTTTTTTTTTTTTT>
##$WBST= 1024
##$WBSW= 4
##$XGAIN= (0..3)
0 0 0 0 
##$XL= 0
##$YL= 0
##$YMAX_a= 492341
##$YMIN_a= -485315
##$ZGOPTNS= <>
##$ZL1= 120
##$ZL2= 120
##$ZL3= 120
##$ZL4= 120
##$ABSF1= 16.522
##$ABSF2= -4.171173
##$ABSG= 5
##$ABSL= 3
##$ALPHA= 0
##$AQORDER= 0
##$ASSFAC= 0
##$ASSFACI= 0
##$ASSFACX= 0
##$ASSWID= 0
##$AUNMP= <proc_1d>
##$AZFE= 0.1
##$AZFW= 0.1
##$BCFW= 0
##$BC_mod= 0
##$BYTORDP= 0
##$COROFFS= 0
##$CY= 12.5
##$DATMOD= 1
##$DC= 0
##$DFILT= <>
##$DTYPP= 0
##$F1P= 14.0000005364418
##$F2P= -0.99999901652339
##$FCOR= 0.5
##$FTSIZE= 32768
##$FT_mod= 6
##$GAMMA= 0
##$GB= 0
##$INTBC= 1
##$INTSCL= 1
##$ISEN= 128
##$LB= 0.3
##$LEV0= 0
##$LPBIN= 0
##$MAXI= 10000
##$MC2= 0
##$MEAN= 0
##$ME_mod= 0
##$MI= 0
##$NCOEF= 0
##$NC_proc= -5
##$NLEV= 6
##$NOISF1= 0
##$NOISF2= 0
##$NSP= 0
##$NTH_PI= 0
##$NZP= 0
##$OFFSET= 16.522
##$PC= 1
##$PHC0= -9.544141
##$PHC1= 12.30001
##$PH_mod= 1
##$PKNL= yes
##$PPARMOD= 0
##$PSCAL= 4
##$PSIGN= 0
##$REVERSE= no
##$SF= 250.13
##$SI= 32768
##$SIGF1= 0
##$SIGF2= 0
##$SINO= 400
##$SIOLD= 32768
##$SREGLST= <1H.CDCl3>
##$SSB= 0
##$STSI= 32768
##$STSR= 0
##$SW_p= 5175.98343685301
##$SYMM= 0
##$S_DEV= 0
##$TDeff= 65536
##$TDoff= 0
##$TI= <Analysis number 999999
Compound Code 99
Book Reference 9
Project Code 9>
##$TILT= no
##$TM1= 0
##$TM2= 0
##$TOPLEV= 0
##$USERP1= <user>
##$USERP2= <user>
##$USERP3= <user>
##$USERP4= <user>
##$USERP5= <user>
##$WDW= 1
##$XDIM= 32768
##$YMAX_p= 409453898
##$YMIN_p= -119787
$$ End of Bruker specific parameters
$$ ---------------------------------
##NTUPLES= NMR SPECTRUM
##VAR_NAME=  FREQUENCY,     SPECTRUM/REAL,   SPECTRUM/IMAG
##SYMBOL=    X,             R,               I
##VAR_TYPE=  INDEPENDENT,   DEPENDENT,       DEPENDENT
##VAR_FORM=  AFFN,          ASDF,            ASDF
##VAR_DIM=   32768,         32768,           32768
##UNITS=     HZ,            ARBITRARY UNITS, ARBITRARY UNITS
##FACTOR=    0.157963299565203, 1,           1
##FIRST=     4132.6476996994, 0,             0
##LAST=      -1043.33573715361, 0,           0
##MIN=       -1043.33573715361, -119787,     0
##MAX=       4132.6476996994, 409453898,     0
$$ Real data points
##PAGE= N=1
##DATA TABLE= (X++(R..R)), XYDATA
$$ [...]
$$ plain form
15650 44673 23043 28498 35227 26080 27061 47384 59627 67444 53336 41276 34143 18190 -16609
15637 -16609 -13684 6707 -5531 25978 56792 77864 54183 -5282 10165 44361 11642 -20792
15625 -20792 -13059 13325 11909 19757 43806 30864 15976 15099 7084 9513 34465 20970 9186
15612 9186 3586 15209 5342 -4386 3712 15270 -12460 -5375 15524 18646 17435 9829 7581 -3908
15598 -3908 5539 43577 58529 56991 36049 33536 52060 74830 61724 61584 69791 84340 98530
15585 98530 102744 127331 123686 143195 117176 76127 73917 79986 87957 108423 132010 155480 149445
15572 149445 111504 90624 100667 104534 108315 109949 87188 103441 107973 75234 39677 12912
15560 12912 20165 31570 43246 50749 14888 13923 800 -7165 -11184 5204 21687 19804 18029
$$ packed form
15650D4673k1630N455O729r147R81K0323J2243P817j4108j2060p133j5953l4799
15637a6609K925K0391j2238L1509L0814K1072k3681n9465J5447L4196l2719l2434
15625b0792P733K6384j416P848K4049j2942j4888q77q015K429K4952j3495j1784
15612I186n600J1623r867r728Q098J1558k7730P085K0899L122j211p606k248j1489
15598c908R447L8038J4952j538k0942k513J8524K2770j3106j40Q207J4549J4190
15585I8530M214K4587l645J9509k6019m1049k210O069P971K0466K3587K3470o035
15572A49445l7941k0880J0043L867L781J634k2761J6253M532l2739l5557k6765
15560A2912P253J1405J1676P503l5861r65j3123p965m019J6388J6483j883j775
$$ plain form
15547 18029 13057 645 26973 37824 24639 47004 51350 53055 69551 30461 32831 52538
15535 52538 36618 36852 28283 51791 63055 37940 662 -10675 8290 17939 26327 31283 13217
15522 13217 15513 10318 -11152 -25123 -16924 -10428 2534 9617 12474 -17799 2091 10187 15245
15509 15245 21735 50610 41174 4034 -12958 -22347 -2009 23710 2275 -17569 -30259 -30303 -31346
15496 -31346 -17831 -8017 4874 6210 -2829 -25479 -16155 -9350 -8434 9985 12035 -11483 -24397
15483 -24397 -27369 -15627 -22075 -40001 5554 20980 13913 -3727 -2732 -3277 -8785 2448 10933
15470 10933 376 -14534 -11607 -5718 -5972 9608 4367 -23136 -41528 -9334 -19926 -19574 -21813
15457 -21813 -27589 -2268 7330 1689 -5883 -12655 -24642 -14392 5168 19546 13685 14250 -6308
$$ packed form
15547A8029m972j2412K6328J0851j3185K2365M346J705J6496l9090K370J9707
15535E2538j5920K34q569K3508J1264k5115l7278j1337J8965R649Q388M956j8066
15522A3217K296n195k1470j3971Q199O496J2962P083K857l0273J9890Q096N058
15509A5245O490K8875r436l7140j6992r389K0338K5719k1435j9844j2690m4j043
15496c1346J3515R814J2891J336r039k2650R324O805R16J8419K050k3518j2914
15483b4397k972J1742o448j7926M5555J5426p067j7640R95n45n508J1233Q485
15470A0933j0557j4910K927N889k54J5580n241k7503j8392L2194j0592L52k239
15457b1813n776K5321R598n641p572o772j1987J0250J9560J4378n861N65k0558
$$ plain form
15444 -6308 -21260 -18447 1886 18020 9634 -19571 -29841 -51185 -51950 -37712 -40945 -44863 -51359
15431 -51359 -48935 -7303 -10777 -17642 -11743 15934 11848 15744 7679 -15347 -34985 -57365 -36510
15418 -36510 4917 17640 8148 -33982 -33893 -26131 -20105 5883 4867 21913 36360 12811 -5740
15405 -5740 19035 5470 -5940 13180 37032 56443 44903 16543 7086 6345 14023 27154 6554
15392 6554 -10027 -20604 -44090 -67515 -64328 -18769 -9824 -11716 -23837 -21341 -6482 18908 16247
15379 16247 33019 34103 43002 51329 46963 37181 12823 -6352 16152 25926 4826 1551 4536
15366 4536 -10871 5594 18528 6736 4694 12300 25605 29180 12239 -8492 3977 24246
15354 24246 26215 114 -45530 -59002 -46287 -27317 -8586 11371 20439 29676 4462 -7355
$$ packed form
15444f308j4952K813K0333J6134q386k9205j0270k1344p65J4238l233l918o496
15431e1359K424M1632l474o865N899K7677m086L896q065k3026j9638k2380K0855
15418c6510M1427J2723r492m2130Q9P762O026K5988j016J7046J4447k3549j8551
15405e740K4775j3565j1410J9120K3852J9411j1540k8360r457p41P678J3131k0600
15392F554j6581j0577k3486k3425L187M5559Q945j892j2121K496J4859K5390k661
15379A6247J6772J084Q899Q327m366r782k4358j9175K2504R774k1100l275K985
15366D536j5407J6465J2934j1792k042P606J3305L575j6941k0731J2469K0269
15354B4246J969k6101m5644j3472J2715J8970J8731J9957R068R237k5214j1817
$$ plain form
15342 -7355 -19040 10489 28654 26442 16905 22675 37905 18546 19936 7886 -10388 -26811 -4527
15329 -4527 1987 -2880 -20601 -13697 6978 9685 3261 27971 24151 28373 16601 -5942 -11168
15316 -11168 5240 -1329 -2389 -29708 -25043 -7131 12219 20125 2587 -9792 -12811 5971 12689
15303 12689 -6576 -12311 3834 15924 24786 33207 19087 5534 12067 41675 54012 21044
15291 21044 5049 5370 -7199 13665 4360 -20244 -13097 -17987 -21805 5333 14493 15535 6003
15278 6003 -13846 -16560 -1102 12867 9534 15846 27522 32999 1836 -14633 -8132 4971 28876
15265 28876 46794 36612 55228 81608 69664 72209 45466 45670 61132 35753 -13812 -37786
15253 -37786 -33326 -6772 42251 60571 47862 37746 50817 43323 -5173 -23762 -3434 15838
$$ packed form
15342g355j1685K9529J8165k212r537N770J5230j9359J390j2050j8274j6423K2284
15329d527O514m867j7721O904K0675K707o424K4710l820M222j1772k2543n226
15316a1168J6408o569j060k7319M665J7912J9350P906j7538j2379l019J8782O718
15303A2689j9265n735J6145J2090Q862Q421j4120j3553O533K9608J2337l2968
15291B1044j5995L21j2569K0864r305k4604P147m890l818K7138R160J042r532
15278F003j9849k714J5458J3969l333O312J1676N477l1163j6469O501J3103K3905
15265B8876J7918j0182J8616K6380j1944K545k6743K04J5462k5379m9565k3974
15253c7786M460K6554M9023J8320j2709j0116J3071p494m8496j8589K0328J9272
$$ plain form
15241 15838 24524 5798 15357 31899 35463 31099 2393 -13934 12947 19838 21731 2926 -14179
15228 -14179 -4479 -8241 8651 21003 22870 6378 7496 106 -13486 -31388 -7478 9178 1350
15215 1350 -5421 -4157 -25536 -53385 -53654 -33281 -11361 -7417 -29914 -25375 -25731 -38701 -13768
15202 -13768 18200 1900 -24485 -29370 -30790 -41785 -61685 -37846 -11753 -26579 -53618 -47249
15190 -47249 -15597 14402 34135 38888 16570 13446 4353 -23624 -11386 10144 19486 20535 17922
15177 17922 891 -1766 -5839 -26544 -37418 1112 9079 14303 21550 13581 -9256 -26250 -470
15164 -470 16540 8098 -7403 -43526 -46054 -20229 23786 51257 54534 30059 11589 15727 10584
15151 10584 -2823 13521 -9664 -16710 19721 9595 -15531 -25914 -31935 -25609 -26932 -29680 -29389
$$ packed form
15241A5838Q686j8726R559J6542L564m364k8706j6327K6881O891J893j8805j7105
15228a4179R700l762J6892J2352J867j6492J118p390j3592j7902K3910J6656p828
15215A350o771J264k1379k7849k69K0373K1920L944k2497M539l56j2970K4933
15202a3768L1968j6300k6385m885j420j0995j9900K3839K6093j4826k7039O369
15190d7249L1652K9999J9733M753k2318l124r093k7977J2238K1530R342J049k613
15177A7922j7031k657m073k0705j0874L8530P967N224P247p969k2837j6994K5780
15164d70J7010q442j5501l6123k528K5825M4015K7471L277k4475j8470M138n143
15151A0584j3407J6344k3185p046L6431j0126k5126j0383o021O326j323k748K91
$$ plain form
15138 -29389 6000 10817 11204 -4411 -11626 21753 24255 18177 10591 -3516 -5045 8196 19941
15125 19941 8070 2751 9413 8744 13532 8760 -16232 -39495 -5873 -11977 -7706 -12164 -6636 -1632
15111 -1632 7492 15091 23750 11856 -27752 -22758 11356 21425 2326 -33861 -53906 -64475 -65597
15098 -65597 -62567 -30474 -31118 -25316 -95 14585 -6635 -30612 -2959 -11753 -1663 -10593 -7535
15085 -7535 -17780 -9197 -15026 -36614 -37029 -11242 -9138 -3541 21373 29902 10657 4524 -5405 -6962
15071 -6962 9745 21736 18192 28576 44118 43280 21246 4663 -845 -12934 -14103 13938 18007
15058 18007 10353 2253 -21994 107 -15116 -32176 -31590 -30758 -3625 5135 10361 21484 17710
15045 17710 26250 29372 21775 28514 28388 35825 44230 38037 29566 13384 8162 33305 51651 30616
$$ packed form
15138b9389L5389M817L87j5615p215L3379K502o078p586j4107j529J3241J1745
15125A9941j1871n319O662o69M788m772k4992k3263L3622o104M271m458N528N004
15111a632R124P599Q659j1894l9608M994L4114J0069j9099l6187k0045j0569j122
15098f5597L030L2093o44N802K5221J4680k1220k3977K7653q794J0090q930L058
15085g535j0245Q583n829k1588m15K5787K104N597K4914Q529j9245o133r929j557
15071f962J6707J1991l544J0384J5542q38k2034j6583n508j2089j169K8041M069
15058A8007p654q100k4247K2101j5223j7060N86Q32K7133Q760N226J1123l774
15045A7710Q540L122p597O739j26P437Q405o193q471j6182n222K5143J8346k1035
$$ plain form
15031 30616 5466 -3377 -31337 -53849 -69799 -56550 -40672 -58047 -34069 7331 31753 19385
15019 19385 26004 28939 18312 28912 24318 5413 -9946 -13870 -23828 -15838 -16816 -34360 -32231
15006 -32231 -11952 6068 11085 8827 -9757 -7444 -8320 -16028 -26249 -13497 665 -4479 -5311
14993 -5311 -16464 -38488 -35360 -52367 -66389 -60863 -64241 -55524 -68638 -62082 -45167 -19139 -16347
14980 -16347 14030 23228 10780 20864 14673 -19871 -22987 -3919 -5836 11388 18958 -2864 -8787
14967 -8787 26 -3854 -9145 8412 37195 34528 26432 7444 9155 -13194 -50452 -38593 -16136
14954 -16136 -16053 -28975 -42375 -13742 -9300 -16801 -2478 24970 22062 6268 -4836 -2336 4629
14941 4629 -6188 -13504 1302 -6320 -35411 -27182 -23592 -43074 -58686 -10349 4448 -24606 -46314
$$ packed form
15031C0616k5150q843k7960k2512j5950J3249J5878j7375K3978M1400K4422j2368
15019A9385O619K935j0627J0600m594j8905j5359l924r958P990r78j7544K129
15006c2231K0279J8020N017k258j8584K313q76p708j0221J2752J4162n144q32
14993e311j1153k2024L128j7007j4022N526l378Q717j3114O556J6915K6028K792
14980a6347L0377R198j2448J0084o191l4544l116J9068j917J7224P570k1822n923
14967h787Q813l880n291J7557K8783k667q096j8988J711k2349l7258J1859K2457
14954a6136Q3j2922j3400K8633M442p501J4323K7448k908j5794j1104K500O965
14941D629j0817p316J4806p622k9091Q229L590j9482j5612M8337J4797k9054k1708
$$ plain form
14928 -46314 -37271 -9997 -7642 -16263 -23658 -18875 -23965 -20693 -9094 -2022 -14776 -45485 -59196
14915 -59196 -60264 -37191 -1328 466 8865 9431 8619 1783 -11132 -3304 15775 18955 4056 -4873
14901 -4873 -15224 -5933 -3230 -15530 2473 24891 -9285 -28886 -24183 -34506 -61350 -32729
14889 -32729 -2342 -7179 -8919 -14423 -23723 -25914 6845 44080 18001 4471 5492 23125 41519
14876 41519 45709 40906 20804 -2963 10497 8607 -6502 -12873 -11568 3856 13676 6145 -768
14863 -768 -4078 3259 14867 42881 33664 21621 10435 -3656 -16731 7569 25766 24058 24715
14850 24715 18449 -6107 3644 24146 859 -31526 -59260 -51135 -10146 18780 26313 17220 -8001
14837 -8001 -26564 -16224 -9861 -3472 -44649 -75020 -68676 -23667 -9002 2490 -5314 3657 7599
$$ packed form
14928d6314R043K7274K355q621p395M783n090L272J1599P072j2754l0709j3711
14915e9196j068K3073L5863J794Q399N66q12o836j2915P828J9079L180j4899q929
14901d873j0351R291K703j2300J8003K2418l4176j9601M703j0323k6844K8621
14889c2729L0387m837j740n504r300k191L2759L7235k6079j3530J021J7633J8394
14876D1519M190m803k0102k3767J3460j890j5109o371J305J5424R820p531o913
14863g68l310P337J1608K8014r217j2043j1186j4091j3075K4300J8197j708O57
14850B4715o266k4556R751K0502k3287l2385k7734Q125M0989K8926P533r093k5221
14837h001j8563J0340O363O389m1177l0371O344M5009J4665J1492p804Q971L942
$$ plain form
14824 7599 -3434 978 5652 -6884 7014 16251 5139 21061 21761 27284 28630 4814 -17636
14811 -17636 -14349 -9093 -3515 -2649 27574 41006 38326 22626 35781 34513 32962 34546 28458 28006
14797 28006 35841 9611 -4205 -18538 -31909 -18071 -7606 1871 6239 19198 31481 25035
14785 25035 43972 50736 11760 19193 17644 8660 -14936 -28285 -16315 -32317 -21068 -10250
14773 -10250 -4345 -20166 -18130 618 2220 6211 26895 38756 1397 -15131 -12321 -4647 -27202
14760 -27202 6792 60186 62899 40175 21576 13880 7661 1185 708 -4466 6323 6736 -7680
14747 -7680 -15002 -24464 -15854 -180 29736 31258 14717 31992 55773 54689 35514 44525 49736
14734 49736 42369 25487 28644 23323 41560 50477 35011 36792 48285 9933 -11084 9169 20637
$$ packed form
14824G599j1033M412M674j2536J3898R237j1112J5922P00N523J346k3816k2450
14811a7636L287N256N578Q66L0223J3432k680j5700J3155j268j551J584o088m52
14797B8006P835k6230j3816j4333j3371J3838J0465R477M368J2959J2283o446
14785B5035J8937O764l8976P433j549q984k3596j3349J1970j6002J1249J0818
14773a0250N905j5821K036J8748J602L991K0684J1861l7359j6528K810P674k2555
14760b7202L3994N3394K713k2724j8599p696o219o476m77n174J0789M13j4416
14747g680p322r462Q610J5674K9916J522j6541J7275K3781j084j9175R011N211
14734D9736p367j6882L157n321J8237Q917j5466J781J1493l8352k1017K0253J1468
$$ plain form
14721 20637 7170 -4560 15611 35274 36220 9967 -3027 2904 3250 10422 28750 14990 -19245
14708 -19245 -26946 1375 36409 32443 13712 37365 35330 16632 39495 52225 23488 33148
14696 33148 54952 36131 17037 10921 3959 5166 37319 48303 30446 29212 20800 -1947 -13560
14683 -13560 -13704 -3723 12509 41516 59247 24727 822 9554 -3925 -13723 -17336 -1599 5970
14670 5970 22176 17998 7700 14286 16052 8095 -15131 -37646 -37936 -21552 7569 13972 14009 14392
14656 14392 40119 37056 47867 35556 9223 12398 8351 8467 5345 13556 12281 36691 51061
14643 51061 33924 36020 16000 -5358 -23912 -25062 -38738 -33300 5574 12195 8812 14002 38506
14630 38506 28207 9754 7108 -5660 10042 42681 51874 32847 -4323 -6449 23920 37545
$$ packed form
14721B0637j3467j1730K0171J9663R46k6253j2994N931L46P172J8328j3760l4235
14708a9245p701K8321L5034l966j8731K3653k035j8698K2863J2730k8737R660
14696C3148K1804j8821j9094o116o962J207L2153J0984j7857j234q412k2747j1613
14683a3560j44R981J6232K9007J7731l4520k3905Q732j3479r798l613J5737P569
14670E970J6206m178j0298O586J766p957k3226k2515k90J6384K9121O403L7L83
14656A4392K5727l063J0811j2311k6333L175m047J16l122Q211j275K4410J4370
14643E1061j7137K096k0020k1358j8554j150j3676N438L8874O621l383N190K4504
14630C8506j0299j8453k646j2768J5702L2639R193j9027l7170k126L0369J3625
$$ plain form
14618 37545 34942 14435 9252 4200 38511 31376 40882 44610 41685 63029 45863 20673 28183
14605 28183 44404 42792 48913 32572 6893 849 1822 13753 26980 43789 43352 33473 13692
14592 13692 32770 39464 31576 -1845 -20889 -13869 -12874 -2206 26851 31946 42799 31043 12045
14579 12045 24601 23606 -5649 -22898 -10709 19071 28833 35794 77709 79538 70223 71058 71544 86172
14565 86172 79218 77117 53171 29079 23593 22923 -5481 -5949 18912 -7494 -9058 51687 91541
14552 91541 98767 69395 33081 -666 8015 -797 -18135 -22379 -20381 -26435 -25862 -36192 -29164
14539 -29164 -36448 -30669 175 8842 29844 25641 6081 -26453 10169 38480 5779 -22074
14527 -22074 -26132 -22862 21777 39007 24836 18870 30902 27027 7241 20618 47645 50988 29419
$$ packed form
14618C7545k603k0507n183n052L4311p135R506L728k925K1344j7166k5190P510
14605B8183J6221j612O121j6341k5679o044R73J1931J3227J6809m37r879j9781
14592A3692J9078O694p888l3421j9044P020R95J0668K9057N095J0853j1756j8998
14579A2045J2556r95k9255j7249J2189K9780R762O961M1915J829r315Q35M86J4628
14565H6172o954k101k3946k4092n486o70k8404m68K4861k6406j564O0745L9854
14552I1541P226k9372l6314l3747Q681q812j7338m244J998o054N73j0330P028
14539b9164p284N779L0844Q667K1002m203j9560l2534L6622K8311l2701k7853
14527b2074m058L270M4639J7230j4171n966J2032l875j9786J3377K7027L343k1569
$$ plain form
14514 29419 26686 39934 27284 20323 11136 -3681 -3119 6602 -820 7469 29374 36412 20604
14501 20604 -2413 -4213 -21001 -38793 -12874 11960 7376 -11007 -11124 5267 15790 20131 45766
14488 45766 54628 50389 35174 3324 7928 19047 33198 42483 18057 17513 24953 30365 48880
14475 48880 57022 45053 1266 6508 39705 59353 35041 -696 34428 60590 57496 48927
14463 48927 67376 83819 69629 74513 61524 33691 38451 35324 34435 11632 33653 25455 -11710
14450 -11710 -21594 18363 70793 83552 53047 42644 48070 74713 75656 44910 33903 47551
14438 47551 50644 70127 77591 39999 21913 13581 7503 -17185 -19386 36176 22368 24459 49786
14425 49786 57136 65323 52638 28866 5495 18532 56808 72306 82573 85265 85569 75851 98157
$$ packed form
14514B9419k733J3248j2650o961r187j4817N62R721p422Q289K1905P038j5808
14501B0604k3017j800j6788j7792K5919K4834m584j8383j17J6391J0523M341K5635
14488D5766Q862m239j5215l1850M604J1119J4151R285k4426n44P440N412J8515
14475D8880Q142j1969m3787N242L3197J9648k4312l5737L5124K6162l094q569
14463D8927J8449J6443j4190M884j2989k7833M760l127q89k2803K2021q198l7165
14450a1710r884L9957N2430J2759l0505j0403N426K6643R43l0746j1007J3648
14438D7551L093J9483P464l7592j8086q332o078k4688k201N5562j3808K091K5327
14425D9786P350Q187j2685k3772k3371J3037L8276J5498J0267K692L04r718K2306
$$ plain form
14412 98157 111574 115507 117356 120078 99216 73250 79321 89650 73480 45614 28534 20713 53843
14399 53843 92718 127275 138171 116786 109576 93544 84667 83510 88953 60845 23452 15902 30307
14386 30307 26742 29260 36035 43730 52191 54322 32739 44561 83292 87963 70184 101806 134371
14373 134371 127728 97858 83534 80561 60976 61042 53937 57527 57350 73271 82700 70698 55140
14360 55140 55595 67635 60548 78114 87498 82127 68748 56420 69671 66325 83364 89101 83743
14347 83743 75346 67210 61784 69579 73164 68711 72072 69805 73172 67548 72312 95718 80470 47820
14333 47820 45304 64744 76750 116252 120640 99794 91723 113395 109571 88771 81258 84989 82592
14320 82592 86346 129448 148965 146607 108130 87721 76162 75796 84974 93604 71303 67716 87957
$$ packed form
14412I8157J3417L933J849K722k0862k5966O071J0329j6170k7866j7080p821L3130
14399E3843L8875L4557J0896k1385p210j6032q877j157N443k8108l7393p550J4405
14386C0307l565K518O775P695Q461K131k1583J1822L8731M671j7779L1622L2565
14373A34371o643k9870j4324k973j9585O6p105L590j77J5921R429j2002j5558
14360E5140M55J2040p087J7566R384n371j3379j2328J3251l346J7039N737n358
14347H3743q397q136n426P795L585m453L361k267L367n624M764K3406j5248l2650
14333D7820k516J9440J2006L9502M388k0846q071K1672l824k0800p513L731k397
14320H2592L754M3102J9517k358l8477k0409j1559l66R178Q630k2301l587K0241
$$ plain form
14307 87957 107121 119652 107605 92716 100538 101530 106969 139312 169129 165275 157000 150725 129329
14294 129329 124503 126411 98020 80446 92848 97146 90751 99785 104660 106297 128217 129814 104714
14281 104714 100679 93527 104273 102241 112694 168399 178151 164687 152961 161149 140127 131654 145833
14268 145833 153465 158813 152264 138740 143206 109713 97555 118912 132605 122575 130246 129562 121488
14255 121488 122767 139392 179810 245547 237326 244907 246255 259916 275515 266722 263396 241902 214823
14242 214823 217379 208012 194148 187768 168784 168001 179865 201511 200522 197845 210175 214146 199190
14229 199190 201822 227180 252475 263906 278697 280687 287975 309870 299473 310913 332579 363781
14217 363781 381495 396891 422482 418222 428470 423468 416694 384890 388934 402542 394419 414353
$$ packed form
14307H7957J9164J2531j2047j4889P822R92N439L2343K9817l854q275o275k1396
14294A29329m826J908k8391j7574J2402M298o395R034M875J637K1920J597k5100
14281A04714m035p152J0746k032J0453N5705R752j3464j1726Q188k1022q473J4179
14268A45833P632N348o549j3524M466l3493j2158K1357J3693j0030P671o84q074
14255A21488J279J6625M0418O5737q221P581J348J3661J5599q793l326k1494k7079
14242B14823K556r367j3864o380j8984p83J1864K1646r89k677J2330L971j4956
14229A99190K632K5358K5295J1431J4791J990P288K1895j0397J1440K1666L1202
14217C63781J7714J5396K5591m260J0248n002o774l1804M044J3608q123J9934
$$ plain form
14205 414353 426534 422161 437227 453699 464729 471785 473939 469459 458024 460469 445993 410838
14193 410838 419373 387753 369699 373333 370502 376890 363403 351858 417692 456494 444717 457262
14181 457262 498796 522260 555169 586325 655990 720932 764963 784195 790504 799003 785003 721272
14169 721272 655697 616637 572621 533078 507015 475171 421699 432907 448173 434962 423984
14158 423984 422911 427438 432337 438412 456598 467512 457460 444476 436941 456297 482292 483686 491053
14145 491053 510299 526893 554069 565264 560720 555622 536775 503112 439921 392939 378180 383340
14133 383340 410198 428080 404083 418647 446929 439668 433589 445008 480415 486704 454798 434990
14121 434990 394239 370461 346003 316760 313133 301167 292049 286240 269428 244363 229651 223823
$$ packed form
14205D14353J2181m373J5066J6472J1030P056K154m480j1435K445j4476l5155
14193D10838Q535l1620j8054L634k831O388j3487j1545O5834L8802j1777J2545
14181D57262M1534K3464L2909L1156O9665O4942M4031J9232O309Q499j4000o3731
14169G21272o5575l9060m4016l9543k6063l1844n3472J1208J5266j3211j0978
14158D23984j073M527M899O075J8186J0914j0052j2984p535J9356K5995J394P367
14145D91053J9246J6594K7176J1195m544n098j8847l3663o3191m6982j4759N160
14133C83340K6858J7882k3997J4564K8282p261o079J1419L5407O289l1906j9808
14121D34990m0751k3778k4458k9243l627j1966r118n809j6812k5065j4712n828
$$ plain form
14109 223823 236220 248826 251309 268932 315549 355953 355746 340297 321205 327563 352791 338758
14097 338758 323349 329909 309763 295543 271639 278762 271259 228730 200235 191555 187890 197434 190236
14084 190236 200512 198747 167698 145110 157494 167405 177799 179385 169697 196847 195397 182285
14072 182285 205120 208439 193180 162228 137748 149946 152333 137018 145020 151306 160556 175401
14060 175401 178283 165358 174223 164914 163471 186390 199382 183664 168833 143574 112038 130237
14048 130237 149987 145237 174910 171907 159260 178006 187451 193387 191560 187020 174597 168821 150658
14035 150658 165079 173714 169415 165631 155282 159512 159718 147494 173934 163651 173232 171352 174980
14022 174980 207685 238758 232712 204524 174299 138103 133849 151163 157577 181299 185900 177774
$$ packed form
14109B23823J2397J2606K483J7623M6617M0404k07j5449j9092O358K5228j4033
14097C38758j5409O560k0146j4220k3904P123p503m2529k8495q680l665R544p198
14084A90236J0276j765l1049k2588J2384R911J0394J586r688K7150j450j3112
14072A82285K2835L319j5259l0952k4480J2198K387j5315Q002O286R250J4845
14060A75401K882j2925Q865r309j443K2919J2992j5718j4831k5259l1536J8199
14048A30237J9750m750K9673l003j2647J8746R445N936j827m540j2423n776j8163
14035A50658J4421Q635m299l784j0349M230K06j2224K6440j0283R581j880L628
14022A74980L2705L1073o046k8188l0225l6196m254J7314O414K3722M601q126
$$ plain form
14010 177774 171117 170142 159948 180332 170448 171293 182876 178174 172895 167663 159819 161282 189344 217574
13996 217574 196174 162217 172548 226319 233525 208297 188354 190655 211813 207926 207164 199470 174836
13983 174836 160441 160553 150412 178683 194672 187071 177797 180555 179389 190172 204180 232400 245620
13970 245620 227960 215940 209572 217815 229329 259054 282894 290233 249159 249453 249311 261267 283633
13957 283633 297693 284840 262173 243709 233092 202580 220527 245089 283884 299871 273872
13946 273872 242911 261403 278726 272498 270792 259944 248966 234821 226439 209428 198212 209946
13934 209946 228567 237897 198016 219531 255165 232230 245341 266498 239883 217815 237594 256587
13922 256587 273761 281084 274530 263744 258620 257793 250121 229516 235919 260056 244116 242453 241454
$$ packed form
14010A77774o657r75j0194K0384r884Q45J1583m702n279n232p844J463K8062K8230
13996B17574k1400l3957J0331N3771P206k5228j9943K301K1158l887p62p694k4634
13983A74836j4395J12j0141K8271J5989p601r274K758j166J0783J4008K8220J3220
13970B45620j7660j2020o368Q243J1514K9725K3840P339m1074K94j42J1956K2366
13957B83633J4060j2853k2667j8464j0617l0512J7947K4562L8795J5987k5999
13946B73872l0961J8492J7323o228j706j0848j0978j4145q382j7011j1216J1734
13934B09946J8621R330l9881K1515L5634k2935J3111K1157k6615k2068J9779J8993
13922B56587J7174P323o554j0786n124q27p672k0605O403K4137j5940j663r99
$$ plain form
13909 241454 232724 245315 256386 282158 286350 285217 283831 279617 292680 310656 309220 321569 317230
13896 317230 309007 306292 304930 296166 293025 282541 261262 294923 294766 274202 268251 273392 278999
13883 278999 311547 336546 319559 291382 252133 301357 318964 314072 310478 296906 320787 342887
13871 342887 386930 412995 406219 428940 437574 450185 449315 419019 382597 361635 382378 392201
13859 392201 372527 366050 391499 435648 434991 436818 450300 452740 473598 506431 520003 534123
13847 534123 539196 560611 581212 611705 677639 718894 723173 753427 791422 809955 844579 915043
13835 915043 971764 1040918 1153412 1235918 1325119 1390460 1445991 1463881 1450937 1425828 1352098
13824 1352098 1290310 1195507 1147977 1132275 1098825 1082159 1075583 1124896 1170669 1192968 1211343
$$ packed form
13909B41454q730J2591J1071K5772M192j133j386m214J3063J7976j436J2349m339
13896C17230q223k715j362q764l141j0484k1279L3661j57k0564n951N141N607
13883B78999L2548K4999j6987k8177l9249M9224J7607m892l594j3572K3881K2100
13871C42887M4043K6065o776K2721Q634J2611q70l0296l6422k0962K0743R823
13859C92201j9674o477K5449M4149o57J827J3482K440K0858L2833J3572J4120
13847E34123N073K1415K0601L0493O5934M1255M279L0254L7995J8533L4624P0464
13835I15043N6721O9154J12494Q2506Q9201O5341N5531J7890j2944k5109p3730
13824A352098o1788r4803m7530j5702l3450j6666o576M9313M5773K2299J8375
$$ plain form
13813 1211343 1279138 1339039 1393493 1460279 1511530 1543015 1584597 1614955 1657922 1694140 1737067
13802 1737067 1820534 1937665 2097227 2220256 2294381 2376461 2445745 2544154 2634926 2728222 2815319
13791 2815319 2919204 3049171 3228746 3415301 3625044 3875874 4155479 4492996 4938437
13782 4938437 5559292 6416600 7526959 9008330 10845530 13020713 15406564 17806527
13774 17806527 19934888 21504682 22305722 22194718 21212689 19624646 17675469 15625274
13766 15625274 13768942 12229702 11021471 10147788 9583556 9261465 9099082 9110134 9210702
13757 9210702 9379743 9615464 9935392 10346465 10865955 11540633 12439668 13690053 15402098
13748 15402098 17771051 20978783 25176905 30492611 36827195 43769197 50641666 56529627
$$ packed form
13813A211343O7795N9901N4454O6786N1251L1485M1582L0358M2967L6218M2927
13802A737067Q3467J17131J59562J23029P4125Q2080O9284R8409R0772R3296Q7097
13791B815319J03885J29967J79575J86555K09743K50830K79605L37517M45441
13782D938437O20855Q57308J110359J481371J837200K175183K385851K399963
13774A7806527K128361J569794Q01040j11004r82029j588043j949177k050195
13766A5625274j856332j539240j208231q73683n64232l22091j62383J1052J00568
13757I210702J69041K35721L19928M11073N19490O74678Q99035J250385J712045
13748A5402098K368953L207732M198122N315706O334584O942002O872469N887961
$$ plain form
13740 56529627 60618856 62370736 61885833 59607820 56369583 53210275 50699194 48818111
13732 48818111 47373561 46150629 44892741 43380542 41667675 39843975 37912699 36005137
13724 36005137 34150821 32288998 30498431 28859711 27457405 26451851 25917954 25883370
13716 25883370 26421380 27574264 29467632 32173194 35743487 40172917 45377496 51056784
13708 51056784 56821897 62365463 67568900 72550483 77445824 82344054 87092568 91220744
13700 91220744 94056143 94868938 93047505 88763190 83091805 76900702 70784458 65113902
13692 65113902 59967982 55423272 51421056 47806878 44606431 41894860 39679546 38024263
13684 38024263 36793079 35771104 34759821 33753483 32854014 32200426 31966335 32268219 33171391
$$ packed form
13740E6529627M089229J751880m84903k278013l238237l159308k511081j881083
13732D8818111j444550j222932j257888j512199j712867j823700j931276j907562
13724C6005137j854316j861823j790567j638720j402306j005554n33897l4584
13716B5883370N38010J152884J893368K705562L570293M429430N204579N679288
13708E1056784N765113N543566N203437M981583M895341M898230M748514M128176
13700I1220744K835399Q12795j821433m284315n671385o191103o116244n670556
13692F5113902n145920m544710m002216l614178l200447k711571k215314j655283
13684C8024263j231184j021975j011283j006338q99469o53588k34091L01884R03172
$$ plain form
13675 33171391 34812893 37339895 40973903 45779005 51654195 58079505 64247201 69322583
13667 69322583 72460558 73202607 71712617 68640877 64867565 61289965 58422716 56167346
13659 56167346 54299582 52594226 50777303 48684328 46420749 44044731 41632483 39205513
13651 39205513 36759703 34290881 31831121 29465847 27256794 25296043 23613856 22215372
13643 22215372 21098457 20211418 19464631 18912526 18499857 18232651 18200508 18421737 18917661
13634 18917661 19751077 20985642 22559374 24449001 26494795 28467028 30011553 30843817
13626 30843817 30833152 29936132 28212654 25977907 23512018 21094969 18888199 17043032
13618 17043032 15531038 14331516 13414301 12684289 12091211 11572984 11149362 10789886 10418658
$$ packed form
13675C3171391J641502K527002L634008M805102N875190O425310O167696N075382
13667F9322583L137975P42049j489990l071740l773312l577600k867249k255370
13659E6167346j867764j705356j816923k092975k263579k376018k412248k426970
13651C9205513k445810k468822k459760k365274k209053j960751j682187j398484
13643B2215372j116915q87039p46787n52105m12669k67206l2143K21229M95924
13634A8917661Q33416J234565J573732J889627K045794J972233J544525Q32264
13626C0843817j0665q97020j723478k234747k465889k417049k206770j845167
13618A7043032j511994j199522r17215p30012n93078n18227m23622l59476l71228
$$ plain form
13609 10418658 10068776 9723246 9368456 9023359 8700033 8412624 8121918 7796267 7505406
13600 7505406 7232174 6964470 6709255 6501658 6313502 6146224 5974270 5783679 5578656
13591 5578656 5414763 5247798 5080270 4919105 4777867 4675786 4548910 4402529 4303327 4208841
13581 4208841 4137353 4075721 4009176 3932883 3895608 3898010 3875952 3827817 3780037 3687935 3612843
13570 3612843 3521159 3437508 3315290 3199736 3118683 3013560 2892337 2805505 2728431 2652680
13560 2652680 2555474 2501093 2425986 2343362 2273900 2214879 2158364 2101975 2065564 2022783 1936538
13549 1936538 1858404 1801603 1749874 1691122 1633945 1596260 1546055 1501588 1471844 1444458 1415253
13538 1415253 1399119 1339920 1280053 1236066 1244897 1213862 1183470 1151488 1105062 1088012 1084075 1049194
$$ packed form
13609A0418658l49882l45530l54790l45097l23326k87409k90706l25651k90861
13600G505406k73232k67704k55215k07597j88156j67278j71954j90591k05023
13591E578656j63893j66965j67528j61165j41238j02081j26876j46381r9202r4486
13581D208841p1488o1632o6545p6293l7275K402k2058m8135m7780r2102p5092
13570C612843r1684q3651j22218j15554q1053j05123j21223q6832p7074p5751
13560B652680r7206n4381p5107q2624o9462n9021n6515n6389l6411m2781q6245
13549A936538p8134n6801n1729n8752n7177l7685n0205m4467k9744k7386k9205
13538A415253j6134n9199n9867m3987Q831l1035l0392l1982m6426j7050l937l4881
$$ plain form
13526 1049194 1025616 998243 930251 902402 897539 902867 873456 857071 830793 795678 752518 725101
13514 725101 719736 703149 662571 641827 638705 609551 571462 577936 588287 570248 571316 541298
13502 541298 533929 552146 560696 565381 538103 501781 492344 481666 439650 408141 421104 448238
13490 448238 441045 414664 391615 379683 371135 366561 370406 356801 384518 393937 383529 373449
13478 373449 368604 329683 309576 318723 318090 298488 273013 277125 262149 245745 241374 242552 258789
13465 258789 258025 222251 214675 234865 222800 174736 147640 157223 193961 213036 210827 192991
13453 192991 198504 194874 164777 164378 167770 123284 122890 137329 125500 134361 116679 114073 125856
13440 125856 119802 119499 120487 110991 86539 102467 114153 114430 139467 131536 125992 135076 143357 113616
$$ packed form
13526A049194k3578k7373o7992k7849m863N328k9411j6385k6278l5115m3160k7417
13514G25101n365j6587m0578k0744l122k9154l8089O474J0351j8039J068l0018
13502E41298p369J8217Q550M685k7278l6322r437j0678m2016l1509J2963K7134
13490D48238p193k6381k3049j1932q548m574L845j3605K7717R419j0408j0080
13478C73449m845l8921k0107R147o33j9602k5475M112j4976j6404m371J178J6237
13465B58789p64l5774p576K0190j2065m8064k7096R583L6738J9075k209j7836
13453A92991N513l630l0097l99L392m4486l94J4439j1829Q861j7682k606J1783
13440A25856o054l03R88r496k4452J5928J1686K77K5037p931n544R084Q281k9741
$$ plain form
13426 113616 97270 105092 112445 126471 131839 118633 86713 64848 57263 56582 57037 49070 33596
13413 33596 52665 37079 25003 38373 49196 75478 62466 53324 41162 27904 25459 13877
13401 13877 8023 21787 46434 34843 29802 32778 4586 -6989 -11783 -2935 12102 -5026 -28932
13388 -28932 -39139 -50302 -41677 -14136 -39885 -40581 -19912 -17796 -4960 -16697 -43597 -41006 -41741
13375 -41741 -45548 -38439 -34119 -39274 -44460 -56877 -31344 -6228 -114 -18240 -34395 -19058 -21479
13362 -21479 -7397 6138 840 -6306 -6115 -28208 -41795 -34316 -29038 -21307 -20557 -25942 -40986 -48672
13348 -48672 -49172 -52913 -18339 -160 7693 478 -40944 -65488 -51464 -40833 -23054 -44295 -51643
13335 -51643 -67708 -67331 -41207 -48462 -62913 -93296 -83004 -57982 -69864 -55398 -66031 -59581
$$ packed form
13426A13616j6346P822P353J4026N368j3206l1920k1865p585o81M55p967j5474
13413C3596J9069j5586j2076J3370J0823K6282j3012r142j2162j3258k445j1582
13401A3877n854J3764K4647j1591n041K976k8192j1575m794Q848J5037j7128k3906
13388b8932j0207j1163Q625K7541k5749o96K0669K116J2836j1737k6900K591p35
13375d1741l807P109M320n155n186j2417K5533K5116O114j8126j6155J5337k421
13362b1479J4082J3535n298p146J91k2093j3587P479N278P731P50n385j5044p686
13348d8672n00l741L4574J8179P853p215m1422k4544J4024J0631J7779k1241p348
13335e1643j6065L77K6124p255j4451l0383J0292K5022j1882J4466j0633O450
$$ plain form
13323 -59581 -59560 -46997 -59160 -56669 -27285 5779 -9044 -11511 9802 -15293 -19190 -2049 -10905
13310 -10905 1318 -13957 -20054 -48887 -44171 -40525 -13241 -2761 -15768 -7371 24722 44103
13298 44103 20289 9565 -2453 7900 37533 49276 53683 47639 75097 84940 65357 44876
13286 44876 36092 34540 40191 14078 15066 22447 16445 23993 40143 35873 57399 53367 36990 39807
13272 39807 90387 91965 55001 48436 34871 18046 18996 45710 76514 96534 120304 162378
13260 162378 212825 239124 257623 281655 300553 327472 333226 315509 288193 277545 271902 260510
13248 260510 227270 200876 157856 122764 141182 153536 133470 110311 108408 117660 108706 101110
13236 101110 100125 66642 62014 92792 137010 139477 152152 161646 186253 210984 259416 305683
$$ packed form
13323e9581K1J2563j2163K491K9384L3064j4823k467K1313k5095l897J7141q856
13310a0905J2223j5275o097k8833M716L646K7284J0480j3007Q397L2093J9381
13298D4103k3814j0724j2018J0353K9633J1743M407o044K7458R843j9583k0481
13286D4876q784j552N651k6113R88P381o002P548J6150m270K1526m032j6377K817
13272C9807N0580J578l6964o565j3565j6825R50K6714L0804K0020K3770M2074
13260A62378N0447K6299J8499K4032J8898K6919N754j7717k7316j0648n643j1392
13248B60510l3240k6394m3020l5092J8418J2354k0066k3159j903R252q954p596
13236A01110r85l3483m628L0778M4218K467J2675R494K4607K4731M8432M6267
$$ plain form
13224 305683 338940 378598 413937 418684 441326 473781 466318 478315 498006 487000 444447 423899
13212 423899 401768 364867 305487 247930 247935 243675 228710 197448 191262 181704 169629 123887 96200
13199 96200 110961 111326 100808 104027 108697 134462 154405 155256 191342 222954 243293 271531 318486
13186 318486 357476 394554 438369 428977 396575 381987 340197 321347 319442 270652 231506 218307
13174 218307 192725 189064 177586 187930 173134 160903 180144 158884 123936 116355 93043 72223
13162 72223 74116 95240 106655 98286 61917 55648 66975 88401 105489 99300 79108 77127 75715
13149 75715 104810 103819 132775 148906 132999 130459 127044 118548 110785 102784 86403 74945 70431
13136 70431 63034 54182 63441 79150 70472 62864 69412 54792 48915 85135 74738 51946 47156
$$ packed form
13224C05683L3257L9658L5339M747K2642L2455p463J1997J9691j1006m2553k0548
13212D23899k2131l6901n9380n7557Nm260j4965l1262o186r558j2075m5742k7687
13199I6200J4761L65j0518L219M670K5765J9943Q51L6086L1612K0339K8238M6955
13186C18486L8990L7078M3815r392l2402j4588m1790j8850j905m8790l9146j3199
13174B18307k5582l661j1478J0344j4796j2231J9241k1260l4948p581k3312k0820
13162G2223J893K1124J1415q369l6369o269J1327K1426J7088o189k0192j981j412
13149G5715K9095r91K8956J6131j5907k540l415q496p763q001j6381j1458m514
13136G0431p397q852R259J5709q678p608O548j4620n877L6220j0397k2792m790
$$ plain form
13123 47156 31986 19779 22723 11223 7201 1078 -2489 12747 11281 18992 26475 38271 39587
13110 39587 19191 15101 8775 11067 32524 25202 26091 9807 -32385 -28099 -30579 -8457 -252
13097 -252 -4327 13145 -20865 -34429 -11403 -3926 -24008 -21074 7862 22254 3911 -6801 -5502
13084 -5502 8451 32437 51966 27414 19599 210 -8083 -9782 15057 42672 40560 13316 -5400
13071 -5400 -46132 -39847 -21661 -5563 -9114 -33332 -44801 -30788 -39762 -39614 -60516 -63308 -58975
13058 -58975 -43735 -51481 -53364 -65873 -51083 -58125 -60421 -31560 -20803 -11619 -14375 -16685 -8936
13045 -8936 -19440 -35569 -24703 15154 37582 7070 -28682 -42379 -40408 -20520 6839 -1283
13033 -1283 13477 11385 -19761 -5715 9992 -7827 -15657 4834 -6383 -19458 -26229 -28906 -28826
$$ packed form
13123D7156j5170j2207K944j1500m022o123l567J5236j466P711P483J1796J316
13110C9587k0396m090o326K292K1457p322Q89j6284m2192M286k480K2122Q205
13097b52m075J7472l4010j3564K3026P477k0082K934K8936J4392j8343j0712J299
13084e502J3953K3986J9529k4552p815j9389q293j699K4839K7615k112k7244j8716
13071e400m0732O285J8186J6098l551k4218j1469J4013q974J48k0902k792M333
13058e8975J5240p746j883j2509J4790p042k296K8861J0757R184k756k310P749
13045h936j0504j6129J0866L9857K2428l0512l5752j3697J971J9888K7359q122
13033a283J4760k092l1146J4046J5707j7819p830K0491j1217j3075o771k677Q0
$$ plain form
13020 -28826 -66905 -84380 -83360 -68907 -41563 -60622 -62773 -48200 -57904 -39025 11332 -1515
13008 -1515 -16300 -39023 -50425 -55073 -53164 -46544 -15598 -38398 -53172 -10977 9015 -2752
12996 -2752 10942 4023 -26123 -38987 -53122 -42556 -47085 -44712 -34367 -21276 -30353 -35243 -32699
12983 -32699 -52500 -52521 -55446 -31197 -28944 -18743 -10338 -13669 -36047 -40375 -23400 -36444 -30659
12970 -30659 -23633 -18962 -18111 -13228 -2469 -4994 -24009 -23220 -23781 -14412 -9712 -15607 -4223 6836
12956 6836 5603 5495 19476 -2219 -35821 -41322 -53294 -79454 -67135 -56925 -76858 -82184 -59280
12943 -59280 -26529 -12099 -33070 -24246 -29681 -29657 -30976 -43003 -65475 -65959 -61405 -43513 -31057
12930 -31057 -30042 -27210 -28485 -32402 -27425 -44949 -75131 -111326 -90855 -67274 -70284 -55487 -32819
$$ packed form
13020b8826l8079j7475J020J4453K7344j9059k151J4573r704J8879N0357j2847
13008a515j4785k2723j1402m648J909O620L0946k2800j4774M2195J9992j1767
12996b752J3694o919l0146j2864j4135J0566m529K373J0345J3091r077m890K544
12983c2699j9801k1k925K4249K253J0201Q405l331k2378m328J6975j3044N785
12970c0659P026M671Q51M883J0759k525j9015P89n61R369M700n895J1384J1059
12956F836j233j08J3981k1695l3602n501j1972k6160J2319J0210j9933n326K2904
12943e9280L2751J4430k0971Q824n435K4j319j2027k2472m84M554J7892J2456
12930c1057J015K832j275l917M977j7524l0182l6195K0471K3581l010J4797K2668
$$ plain form
12917 -32819 -40790 -67024 -76241 -72502 -34510 2412 13628 -7013 3966 3817 -24341 -20196 -4126
12904 -4126 -16723 -50916 -28524 -12 34035 28667 4385 -11645 -34274 -46990 -39350 -47215
12892 -47215 -45084 -46750 -49643 -42195 -54750 -62319 -44924 -43822 -35268 923 3878 22866 13434
12879 13434 17924 8962 5581 -17498 -5103 1224 -15165 -10641 -1316 -2072 -13107 20987 29401
12866 29401 6179 6389 16583 26452 37385 44104 33773 14777 -1723 -8109 -35717 -23384 -11551
12853 -11551 4692 2870 -1634 -3946 -25841 -22656 -7417 -12679 -11998 5104 21536 30646 6264
12840 6264 2004 13887 22510 27074 12994 -2110 18512 2328 -6719 14413 36368 27832 1455
12827 1455 -40768 -44635 -20392 -41890 -38396 -7352 17970 3153 -4521 -23431 276 8553 -26217
$$ packed form
12917c2819p971k6234r217L739L7992L6922J1216k0641J0979j49k8158M145J6070
12904d126j2597l4193K2392K8512L4047n368k4282j6030k2629j2716P640p865
12892d7215K131j666k893P448j2555p569J7395J102Q554L6191K955J8988r432
12879A3434M490q962l381k3079J2395O327j6389M524R325p56j1035L4094Q414
12866B9401k3222K10J0194R869J0933O719j0331j8996j6500o386k7608J2333J1833
12853a1551J6243j822m504k312k1895L185J5239n262O81J7102J6432R110k4382
12840F264m260J1883Q623M564j4080j5104K0622j6184r047K1132K1955q536k6377
12827A455m2223l867K4243k1498L494L1044K5322j4817p674j8910K3707Q277l4770
$$ plain form
12814 -26217 -65390 -53355 -17652 -8051 -11358 5244 -2960 -5842 -24824 -20840 -5792 -14878 -16416
12801 -16416 -10356 -6579 -12504 -4746 4230 3256 634 4526 -6570 -32723 -18679 -1476 6280 10576
12787 10576 -33479 -32715 -31073 -29249 -28815 -39336 -48367 -46234 -36765 -41858 -51260 -39866 -8285 1892
12773 1892 -19265 -36501 -62825 -57614 -35682 -15554 -34227 -32515 -30262 -26183 3289 1034 -18609
12760 -18609 -15493 548 -18969 -58168 -55885 -38911 -64867 -81905 -69962 -69819 -36147 -30690 -44218
12747 -44218 -26075 -24492 -26155 -19521 -25913 -13183 14090 -23524 -32923 -31305 -17214 3525 17854
12734 17854 13726 6787 -14561 -32029 -25307 -1485 6105 12795 -5471 -10062 -16458 -33907 -3764
12721 -3764 37104 28325 3937 20068 35633 47627 68712 99876 158263 174334 104436 67640
$$ packed form
12814b6217l9173J2035L5703R601l307J6602q204k882j8982L984J5048r086j538
12801a6416O060L777n925P758Q976r74k622L892j1096k6153J4044J7203P756M296
12787A0576m4055P64J642J824M34j0521r031K133R469n093r402J1394L1581J0177
12773A892k1157j7236k6324N211K1932K0128j8673J712K253M079K9472k255j9643
12760a8609L116J6041j9517l9199K283J6974k5956j7038J1943J43L3672N457j3528
12747d4218J8143J583j663O634o392J2730K7273l7614r399J618J4091K0739J4329
12734A7854m128o939k1348j7468O722K3822P590O690j8266m591o396j7449L0143
12721c764M0868q779k4388J6131J5565J1994K1085L1164N8387J6071o9898l6796
$$ plain form
12709 67640 44486 59243 86662 109344 81091 48643 23747 14760 9740 -17742 -9862 7143
12697 7143 2133 -8460 -10610 -18788 -10244 -11834 2901 24150 28167 16054 16316 3922 -4555 -24533
12683 -24533 -26910 -30913 -44869 -35256 3885 -1223 -8924 -5531 9208 -6407 -6947 9512 -1874
12670 -1874 -16033 -6600 -8589 10557 16974 -4224 -35811 -46540 -26003 -13394 11910 27840
12658 27840 13179 526 -9259 -16335 -257 6433 -3165 -19750 -27637 -5448 -2170 7011 -5141
12645 -5141 -15569 8859 -1919 1875 3421 16481 4787 -18545 -22805 -15637 -30745 -30314 -10057
12632 -10057 -18412 -26219 3742 10203 22733 25323 14412 -5628 8372 32742 -3733 -19206
12620 -19206 570 -1856 -9850 -330 -6215 -31621 -43409 -16483 -8512 -12289 -24897 -21223 -6162
$$ packed form
12709F7640k3154J4757K7419K2682k8253l2448k4896q987n020k7482P880J7005
12697G143n010j0593k150q178Q544j590J4735K1249M017j2113K62j2394q477j9978
12683b4533k377m003j3956R613L9141n108p701L393J4739j5615n40J6459j1386
12670a874j4159R433j989J9146O417k1198l1587j0729K0537J2609K5304J5930
12658B7840j4661j2653r785p076J6078O690r598j6585p887K2189L278R181j2152
12645e141j0428K4428j0778L794J546J3060j1694k3332m260P168j5108M31K0257
12632a0057q355p807K9961O461J2530K590j0911k0040J4000K4370l6475j5473
12620a9206J9776k426p994R520n885k5406j1788K6926P971l777j2608L674J5061
$$ plain form
12607 -6162 -2543 -18051 -13140 22379 12421 -17454 -16086 20473 30005 27297 27256 -1274 -28582 -30902
12593 -30902 -23071 -14373 -29653 -25669 -13161 8761 32786 56110 35909 36013 47576 9784 -36432
12580 -36432 -27299 13622 34521 35996 19344 -3964 -14759 -27529 -1255 32917 28980 24461
12568 24461 13840 32777 44508 41028 62829 79211 94390 84338 121842 95969 67304 55340
12556 55340 51110 36911 12606 18721 23938 24658 35568 49789 29310 2563 -78 3374 19041
12543 19041 25543 32931 15547 2336 4760 10607 21162 12642 10765 24450 27419 12230 13898
12530 13898 38750 57894 75162 97198 122502 122204 131338 138138 138395 152279 141576 140458 131105
12517 131105 118201 114399 123271 126324 139952 96072 73697 75680 60772 65956 80060 71504 73601
$$ packed form
12607f162L619j5508M911L5519r958k9875J368L6559R532k708m1k8530k7308k320
12593c0902P831Q698j5280L984J2508K1922K4025K3324k0201J04J1563l7792m6216
12580c6432R133M0921K0899J475j6652k3308j0795j2770K6274L4172l937m519
12568B4461j0621J8937J1731l480K1801J6382J5179j0052L7504k5873k8665j1964
12556E5340m230j4199k4305O115N217P20J0910J4221k0479k6747k641L452J5667
12543A9041O502P388j7384j3211K424N847J0555q520j877J3685K969j5189J668
12530A3898K4852J9144J7268K2036K5304k98R134O800K57J3884j0703j118r353
12517A31105j2904l802Q872L053J3628m3880k2375J983j4908N184J4104q556K097
$$ plain form
12504 73601 85159 104142 87207 59274 51734 56820 66058 76490 81466 72260 78395 89352 86691
12491 86691 97236 105367 96727 71259 81602 66151 39552 40990 72313 130323 172086 205033
12479 205033 204530 186057 205375 202941 215928 223257 212607 192635 203623 233611 215454 190642
12467 190642 179721 170148 151233 168798 195603 195982 219259 264291 284718 281422 293004 309021
12455 309021 305527 309479 332451 287560 240808 196452 211406 205536 194516 209532 233832 254233
12443 254233 270780 293502 313927 333242 383692 449883 469619 499499 542531 563924 576050
12432 576050 546117 513809 499249 474352 444942 403593 345386 329103 329142 327666 322100 325527 343371
12419 343371 333087 317471 316690 318285 343715 355770 355738 387519 433203 416754 383554 381599 412822
$$ packed form
12504G3601J1558J8983j6935k7933p540N086R238J0432M976r206O135J0957k661
12491H6691J0545Q131q640k5468J0343j5451k6599J438L1323N8010M1763L2947
12479B05033n03j8473J9318k434J2987P329j0650j9972J0988K9988j8157k4812
12467A90642j0921r573j8915J7565K6805L79K3277M5032K0427l296J1582J6017
12455C09021l494L952K2972m4891m6752m4356J4954n870j1020J5016K4300K0401
12443B54233J6547K2722K0425J9315N0450O6191J9736K9880M3032K1393J2126
12432E76050k9933l2308j4560k4897k9410m1349n8207j6283L9j476n566L427J7844
12419C43371j0284j5616p81J595K5430J2055l2L1781M5684j6449l3200j955L1223
$$ plain form
12406 412822 410230 421584 446827 492139 538875 551861 575265 580954 568162 549205 542554 546785
12394 546785 515740 491330 470088 447308 457722 431036 397443 395509 420365 435342 471876 515112
12382 515112 586911 642588 698070 763595 838358 899191 894957 866025 843754 823154 759612 674985
12370 674985 616816 579685 541140 492355 430481 438548 477712 442075 400210 390511 409043 438253
12358 438253 487248 516803 539821 584373 609385 597872 584353 561336 556196 515183 472434 448601
12346 448601 461005 472366 469378 472586 484227 470190 459403 460040 451257 395451 362490 326373
12334 326373 291691 308910 292366 281171 298704 308184 314551 328426 350346 360490 351086 369240
12322 369240 399344 463720 526618 551452 532550 526966 506493 480867 429510 390277 385340 404729
$$ packed form
12406D12822k592J1354K5243M5312M6736J2986K3404N689j2792j8957o651M231
12394E46785l1045k4410k1242k2780J0414k6686l3593j934K4856J4977L6534M3236
12382E15112P1799N5677N5482O5525P4763O0833m234k8932k2271k0600o3542q4627
12370F74985n8169l7131l8545m8785o1874Q067L9164l5637m1865r699J8532K9210
12358D38253M8995K9555K3018M4552K5012j1513j3519k3017n140m1013m2749k3833
12346D48601J2404J1361k988L208J1641j4037j0787O37q783n5806l2961l6117
12334C26373l4682J7219j6544j1195J7533R480O367J3875K1920J0144r404J8154
12322C69240L0104O4376O2898K4834j8902n584k0473k5626n1357l9233m937J9389
$$ plain form
12310 404729 368945 330529 284009 295994 281376 241010 242335 255492 285574 297368 326624 328537
12298 328537 334312 349967 354096 368521 358778 353420 322465 300264 275121 250634 226050 196181
12286 196181 190560 168086 143337 116043 96591 118234 106170 112727 132343 115543 108749 121930
12274 121930 125933 102118 76753 58992 52540 70988 71973 87571 76982 64563 57786 63123 74599
12261 74599 45575 45345 73446 77886 68927 79758 85461 91245 74219 70011 85279 102438 93037
12248 93037 70404 43489 38692 43135 60141 36940 28908 26751 43297 40722 20641 20405 34603
12235 34603 58245 89338 59921 53304 77219 78668 72002 57511 39277 17060 21882 60088
12223 60088 60957 69538 71568 50923 31917 20713 41566 44051 57784 66632 69351 89436 97754
$$ packed form
12310D04729l5784l8416m6520J1985j4618m0366J325J3157L0082J1794K9256J913
12298C28537N775J5655M129J4425r743n358l0955k2201k5143k4487k4584k9869
12286A96181n621k2474k4749k7294j9452K1643j2064O557J9616j6800o794J3181
12274A21930M003k3815k5365j7761o452J8448R85J5598j0589j2419o777N337J1476
12261G4599k9024k30K8101M440q959J0831N703N784j7026m208J5268J7159r401
12248I3037k2633k6915m797M443J7006k3201q032k157J6546k575k0081k36J4198
12235C4603K3642L1093k9417o617K3915J449o666j4491j8234k2217M822L8206
12223F0088Q69Q581K030k0645j9006j1204K0853K485J3733Q848K719K0085Q318
$$ plain form
12210 97754 68534 39264 31408 33504 51701 56107 58472 29543 19716 25892 499 26385 58728
12197 58728 51964 37255 23361 20626 37364 50997 44308 41359 49263 91787 105032 105183 86405
12184 86405 94723 64121 38862 40435 49632 42938 39212 59096 55708 19622 24814 50811 42940
12171 42940 34470 55338 61035 57127 72081 66492 69452 58194 41178 42668 35375 38978 35667
12158 35667 43539 70549 59374 46315 34150 40798 38100 24490 40022 30468 29752 10857 -18937
12145 -18937 -7035 21849 34639 47342 55610 37773 14776 24360 55407 46573 40271 60999
12133 60999 76140 83008 87227 62976 65197 99362 122483 126780 136398 133594 128175 119886 95660
12120 95660 83314 93611 113688 105486 72249 56015 53744 39832 42415 63252 54008 43167
$$ packed form
12210I7754k9220k9270p856K096J8197M406K365k8929r827O176k5393K5886L2343
12197E8728o764j4709j3894k735J6738J3633o689k949P904M2524J3245J51j8778
12184H6405Q318l0602k5259J573R197o694l726J9884l388l6086N192K5997p871
12171D2940q470K0868N697l908J4954n589K960j1258j7016J490p293L603l311
12158C5667P872K7010j1175j3059j2165O648k698j3610J5532r554p16j8895k9794
12145a8937J1902K8884J2790J2703Q268j7837k2997R584L1047q834o302K0728
12133F0999J5141O868M219k4251K221L4165K3121M297R618k804n419q289k4226
12120I5660j2346J0297K0077q202l3237j6234k271j3912K583K0837r244j0841
$$ plain form
12108 43167 35590 21910 8401 1190 6745 32419 36411 32361 51389 70019 65957 58679 63582
12095 63582 59257 52654 45995 58571 99163 125407 124639 123015 111813 105570 110827 112877 148150
12082 148150 141315 131370 125170 130310 110868 128528 127307 132001 147472 145989 117454 124574 96007
12069 96007 66200 72267 98752 123985 104355 99668 131245 161545 156532 123993 121823 127730 107429
12056 107429 102208 90499 67932 43504 52312 71587 67246 85094 81928 104937 102152 82996
12044 82996 100504 142689 162450 173366 181000 187586 194997 178463 171139 164950 133096 107643 103486
12031 103486 74409 75757 93963 105837 75775 53573 42529 92410 132170 122297 93488 76069
12019 76069 73691 78262 84035 63413 45207 50602 53321 43043 73680 122705 113201 90309 89774
$$ packed form
12108D3167p577j3680j3509p211N555K5674L992m050J9028J8630m062p278M903
12095F3582m325o603o659J2576M0592K6244p68j624j1202o243N257K050L5273
12082A48150o835r945o200N140j9442J7660j221M694J5471j483k8535P120k8567
12069I6007k9807O067K6485K5233j9630m687L1577L0300n013l2539k170N907k0301
12056A07429n221j1709k2567k4428Q808J9275m341J7848l166K3009k785j9156
12044H2996J7508M2185J9761J0916P634O586P411j6534p324o189l1854k5453m157
12031A03486k9077J348J8206J1874l0062k2202j1044M9881L9760r873k8809j7419
12019G6069k378M571N773k0622j8206N395K719j0278L0637M9025r504k2892n35
$$ plain form
12006 89774 96426 105116 93916 97809 101544 111970 138120 154452 154901 122301 110528 106395 121946
11993 121946 121649 105337 113657 114003 109315 79939 80890 87834 71764 92245 96473 73165 69160 84120
11979 84120 64966 68811 57871 48425 53049 52905 25537 52505 52221 46403 41908 48400 63670 94625
11965 94625 97911 106356 100419 117303 130177 141131 134191 114525 119845 102446 75562 83199 89125
11952 89125 108285 121424 111242 128904 144305 146169 149500 163110 180619 187713 196227 207425
11940 207425 181541 149828 143358 131929 132803 138147 157931 153000 134893 134475 114297 91296 103424
11927 103424 123156 106113 85643 91119 111732 111054 107416 83268 78945 81505 72042 70923 68236
11914 68236 71181 69739 78393 93150 110555 100364 115878 118205 93466 87667 131817 139160 123033
$$ packed form
12006H9774O652Q690j1200L893L735J0426K6150J6332M49l2600j1773m133J5551
11993A21946k97j6312Q320L46m688k9376R51O944j6070K0481M228k3308m005J4960
11979H4120j9154L845j0940r446M624j44k7368K6968k84n818m495O492J5270L0955
11965I4625L286Q445n937J6884J2874J0954o940j9666N320j7399k6884P637N926
11952H9125J9160J3139j0182J7662J5401J864L331J3610J7509P094Q514J1198
11940B07425k5884l1713o470j1429Q74N344J9784m931j8107m18k0178k3001J2128
11927A03424J9732j7043k0470N476K0613o78l638k4148m323K560r463j119k687
11914F8236K945j442Q654J4757J7405j0191J5514K327k4739n799M4150P343j6127
$$ plain form
11901 123033 151640 166459 162284 158902 151695 152276 154549 133108 138446 159110 149688 166531 176399
11888 176399 177435 190503 200199 201914 200463 197757 160179 144256 115909 109574 118988 105397 107403
11875 107403 101411 89840 68748 51589 37038 57255 91148 102059 117792 115793 117782 113271
11863 113271 114201 112267 131025 151080 160393 158392 143782 123056 129317 128160 113930 110986 124227
11850 124227 111420 115640 120669 129217 155163 173258 187458 204131 219159 237322 219701 193059
11838 193059 147539 155996 149927 145307 145446 159304 150948 144427 152447 145245 118917 143681 156830
11825 156830 172267 179159 176167 158433 151151 163949 154964 157473 153427 178954 174510 148796 141421
11812 141421 137413 139098 130080 134046 119775 148956 183031 216565 227941 216445 229912 237444
$$ packed form
11901A23033K8607J4819m175l382p207N81K273k1441N338K0664r422J6843R868
11888A76399J036J3068R696J715j451k706l7578j5923k8347o335R414j3591K006
11875A07403n992j1571k1092j7159j4551K0217L3893J0911J5733j999J989m511
11863A13271R30j934J8758K0055R313k001j4610k0726O261j157j4230k944J3241
11850A24227j2807M220N029Q548K5946J8095J4200J6673J5028J8163j7621k6642
11838A93059m5520Q457o069m620J39J3858q356o521Q020p202k6328K4764J3149
11825A56830J5437O892k992j7734p282J2798q985K509m046K5527m444k5714p375
11812A41421m008J685r018L966j4271K9181L4075L3534J1376j1496J3467P532
$$ plain form
11800 237444 290493 378041 473415 544458 577797 589870 570280 518483 476485 415633 393116
11789 393116 383855 350552 323849 342006 338971 327071 319322 304463 293687 294820 252019 207520
11777 207520 230538 240213 230850 230600 211282 205851 211508 207320 190035 189633 189627 178759 176275 185482
11763 185482 163219 143332 121627 190233 226291 232665 267565 295204 319681 403608 471379 552730
11751 552730 604690 618961 603570 574242 523257 453416 413971 374004 332140 297891 281938
11740 281938 279116 259256 237023 255350 255515 259219 227594 209636 213352 188964 166723 160468 171859
11727 171859 183467 176754 183718 185948 192529 200806 221491 228225 238473 244676 251770 267648 296521
11714 296521 351641 379635 407289 437696 458033 450220 429851 421335 439785 467688 508790 544188
$$ packed form
11800B37444N3049Q7548R5374P1043L3339J2073j9590n1797m1998o0852k2517
11789C93116r261l3303k6703J8157l035j1900p749j4859j0776J133m2801m4499
11777B07520K3018R675r363k50j9318n431N657m188j7285m02oj0868k484R207
11763A85482k2263j9887k1705O8606L6058O374L4900K7639K4477Q3927O7771Q1351
11751E52730N1960J4271j5391k9328n0985o9841l9445l9967m1864l4249j5953
11740B81938k822j9860k2233J8327J65L704l1625j7958L716k4388k2241o255J1391
11727A71859J1608o713O964K230O581Q277K0685O734J0248O203P094J5878K8873
11714B96521N5120K7994K7654L0407K0337p813k0369q516J8450K7903M1102L5398
$$ plain form
11702 544188 546512 554690 537634 489993 474813 407011 340671 341381 358068 394491 370754 371322 368706
11689 368706 354651 350511 352179 342063 334833 315577 284284 285687 278241 251163 248031 230783 225258
11676 225258 234303 261103 261991 241949 233426 228169 233598 229924 223429 198981 198667 206033 212987 242472
11662 242472 275783 262943 254412 259489 270931 249072 255507 253709 308821 367097 401901 420246
11650 420246 487220 554537 593772 663027 723544 769268 804562 794214 742485 661502 580790
11639 580790 516303 443407 399533 412873 398811 372857 401751 466378 513335 534158 532035 508293
11627 508293 473712 438306 391017 353291 347143 346066 330999 321490 310876 309197 284495 300043
11615 300043 335702 371588 386366 385066 376476 383123 393415 414905 443834 476145 513341 591015
$$ packed form
11702E44188K324Q178j7056m7641j5180o7802o6340P10J6687L6423k3737N68k616
11689C68706j4055m140J668j0116p230j9256l1293J403p446k7078l132j7248n525
11676B25258R045K6800Q88k0042q523n257N429l674o495k4448l14P366O954K9485
11662B42472L3311j2840q531N077J1442k1859O435j798N5112N8276L4804J8345
11650D20246O6974O7317L9235O9255O0517M5724L5294j0348n1729q0983q0712
11639E80790o4487p2896m3874J3340j4062k5954K8894O4627M6957K0823k123k3742
11627E08293l4581l5406m7289l7726o148j077j5067r509j0614j679k4702J5548
11615C00043L5659L5886J4778j300q590O647J0292K1490K8929L2311L7196P7674
$$ plain form
11603 591015 712241 869375 983329 1076178 1094729 1027482 898511 784191 671903 568091
11593 568091 501906 454008 426301 448155 456074 438264 416339 381230 352701 354172 386305 416410
11581 416410 396207 378277 344206 323897 312294 322298 330591 343726 340805 302249 298463 337644
11569 337644 366469 345690 349375 344257 350295 354872 407166 422607 420512 436244 483240 543447
11557 543447 597955 682556 782743 879673 965268 1083491 1240228 1382980 1491939 1552588
11547 1552588 1535623 1486765 1434106 1403114 1427969 1534577 1722147 1947327 2144647 2309247
11537 2309247 2456671 2551537 2587483 2606990 2599142 2507736 2332451 2091215 1910890 1840840 1851334
11526 1851334 1894121 1997156 2130761 2334206 2548682 2698228 2810931 2833395 2727812 2584573
$$ packed form
11603E91015J21226J57134J13954R2849J8551o7247j28971j14320j12288j03812
11593E68091o6185m7898k7707K1854P919j7810k1925l5109k8529J471L2133L0105
11581D16410k0203j7930l4071k0309j1603J0004Q293J3135k921l8556l786L9181
11569C37644K8825k0779L685n118O038M577N2294J5441k095J5732M6996O0207
11557E43447N4508Q4601J00187R6930Q5595J18223J56737J42752J08959O0649
11547A552588j6965m8858n2659l0992K4855J06608J87570K25180J97320J64600
11537B309247J47424R4866L5946J9507p848r1406j75285k41236j80325p0050J0494
11526A851334M2787J03035J33605K03445K14476J49546J12703K2464j05583j43239
$$ plain form
11516 2584573 2450750 2331291 2205614 2052468 1891003 1754622 1670931 1636426 1656870 1682140
11506 1682140 1751513 1824155 1848077 1791697 1683432 1580552 1531477 1494707 1521719 1513863 1528926
11495 1528926 1524066 1432563 1314334 1205889 1101654 1020573 995961 963944 907474 855744 821949
11484 821949 839308 860357 872284 889519 876475 853282 868878 856692 837440 828244 805968 792456
11472 792456 774334 770689 788132 836621 821022 805878 787680 778094 761197 758657 786248 815673
11460 815673 823425 819226 805156 810051 820602 823955 811085 823688 832105 831616 835951 854013 830203
11447 830203 804457 804212 768790 705760 657243 628719 616261 607833 588561 603360 629845 624235
11435 624235 631700 664259 686679 753229 782181 814040 847888 884465 899658 938022 1002470 1077310
$$ packed form
11516B584573j33823j19459j25677j53146j61465j36381q3691l4505K0444K5270
11506A682140O9373P2642K3922n6380j08265j02880m9075l6770K7012p856J5063
11495A528926m860r1503j18229j08445j04235q1081k4612l2017n6470n1730l3795
11484H21949J7359K1049J1927J7235j3044k3193J5596j2186j9252r196k2276j3512
11472G92456j8122l645J7443M8489j5599j5144j8198r586j6897k540K7591K9425
11460H15673P752m199j4070M895J0551L353j2870J2603Q417m89M335J8062k3810
11447H30203k5746k45l5422o3030m8517k8524j2458q428j9272J4799K6485n610
11435F24235P465L2559K2420O6550K8952L1859L3848L6577J5193L8364O4448P4840
$$ plain form
11423 1077310 1139732 1195972 1205205 1169952 1119089 1099193 1107196 1140293 1135939 1132908 1141397 1102806
11411 1102806 1041777 1000532 941673 915350 883601 860272 828952 813648 820188 824109 813113 833334
11399 833334 845832 872953 955792 1036921 1155880 1315867 1546559 1898068 2381531 2999353
11389 2999353 3643525 4233009 4694178 4524452 3616428 2772506 2246356 1940261 1703929
11380 1703929 1560382 1452567 1358504 1287225 1220443 1150102 1104010 1050334 1000925 952578 927658
11369 927658 910649 888052 859150 814730 788043 755568 728860 696350 695474 685031 683056 675420
11357 675420 686507 717668 695967 676950 672236 673786 676734 660183 650978 655379 661745 647091 634522
11344 634522 598123 586130 594087 599927 584504 551642 552804 556302 567892 564157 542827 530489
$$ packed form
11423A077310O2422N6240R233l5253n0863j9896Q003L3097m354l031Q489l8591
11411A102806o1029m1245n8859k6323l1749k3329l1320j5304O540L921j0996K0221
11399H33334J2498K7121Q2839Q1129J18959J59987K30692L51509M83463O17822
11389B999353O44172N89484M61169j69726r08024q43922n26150l06095k36332
11380A703929j43547j07815r4063p1279o6782p0341m6092n3676m9409m8347k4920
11369I27658j7009k2597k8902m4420k6687l2475k6708l2510q76j0443j975p636
11357F75420J1087L1161k1701j9017m714J550K948j6551r205M401O366j4654j2569
11344F34522l6399j1993P957N840j5423l2862J162L498J1590l735k1330j2338
$$ plain form
11332 530489 516280 516588 532345 529360 532244 553377 579794 608000 620188 594466 587520 568550
11320 568550 576712 619339 608774 606874 585201 544783 558560 579174 612420 631312 643965 653420
11308 653420 677968 677740 658967 658725 669319 675855 662666 663519 646482 626989 595810 599172 618270
11295 618270 636256 662219 650553 613025 602460 616731 627681 620884 630957 628225 592943 566384
11283 566384 567816 574221 571037 581498 587102 588466 635552 659505 691040 740728 745856 756497 727545
11270 727545 685736 665531 682091 714294 694675 645066 619919 609705 624187 637887 632082 614181
11258 614181 595647 593133 595276 594628 599534 583087 576547 612274 631357 612920 592338 597501 612745
11245 612745 625586 633384 644459 679367 694395 714711 749370 791840 813168 833747 853990 848770
$$ packed form
11332E30489j4209L08J5757k985K884K1133K6417K8206J2188k5722o946j8970
11320E68550Q162M2627j0565j900k1673m0418J3777K0614L3246J8892J2653R455
11308F53420K4548k28j8773k42J0594O536j3189Q53j7037j9493l1179L362J9098
11295F18270J7986K5963j1666l7528j0565J4271J0950o797J0073k732l5282k6559
11283E66384J432O405l184J0461N604J364M7086K3953L1535M9688N128J0641k8952
11270G27545m1809k0205J6560L2203j9619m9609k5147j0214J4482J3700n805j7901
11258F14181j8534k514K143o48M906j6447o540L5727J9083j8437k0582N163J5244
11245F12745J2841P798J1075L4908J5028K0316L4659M2470K1328K0579K0243n220
$$ plain form
11233 848770 869022 856144 824095 829139 825202 852100 884075 901066 904046 892840 862398 826311
11221 826311 809566 820410 802108 805509 794297 776754 789634 857574 898053 918863 909029 936210
11209 936210 1002449 1032188 1008772 998812 998302 1012806 1016659 1028750 1018843 1040965 1069363 1060554 1075264
11196 1075264 1071589 1071749 1088504 1133412 1176628 1213279 1262858 1300873 1338334 1396935 1434689 1440858
11184 1440858 1421390 1407915 1401376 1423552 1444615 1459475 1485732 1532405 1627999 1704428 1785197
11173 1785197 1879517 1942449 1972953 2031354 2080592 2135416 2166958 2170396 2176585 2191097 2214225 2205364
11161 2205364 2187622 2142770 2125753 2101947 2105850 2085674 2051896 1998666 1989154 2007615 2046026 2082397
11149 2082397 2097681 2116940 2154389 2205762 2279913 2340020 2404916 2515305 2627272 2749325 2881748
$$ packed form
11233H48770K0252j2878l2049N044l937K6898L1975J6991K980j1206l0442l6087
11221H26311j6745J0844j8302L401j1212j7543J2880O7940M0479K0810r834K7181
11209I36210O6239K9739k3416r960n10J4504L853J2091r907K2122K8398q809J4710
11196A075264l675J60J6755M4908M3216L6651M9579L8015L7461N8601L7754O169
11184A440858j9468j3475o539K2176K1063J4860K6257M6673R5594P6429Q0769
11173A785197R4320O2932L0504N8401M9238N4824L1542L438O189J4512K3128q861
11161B205364j7742m4852j7017k3806L903k0176l3778n3230r512J8461L8411L6371
11149B082397J5284J9259L7449N1373P4151O0107O4896J10389J11967J22053J32423
$$ plain form
11138 2881748 3024272 3150910 3282039 3423405 3518518 3626202 3787226 3946290 4084368 4173725
11128 4173725 4242494 4320187 4466682 4664596 4899016 5177985 5502136 5931247 6463331 7121289
11118 7121289 7929395 8969960 10321191 12093669 14329805 17018199 20201617 23906757
11110 23906757 28021799 32284502 36384111 40101822 43066379 45079955 46356713 47244389
11102 47244389 47987992 48730325 49358258 49545714 48907030 47179371 44425515 40997599 37014558
11093 37014558 32972140 29758854 27689669 26671731 26598933 27313628 28720007 30683472
11085 30683472 33065078 35769054 38682699 41752097 44848229 47899394 50863347 53707797
11077 53707797 56706132 60046626 63661491 67391457 71125139 74552565 77334049 79567608
$$ packed form
11138B881748J42524J26638J31129J41366R5113J07684J61024J59064J38078Q9357
11128D173725O8769P7693J46495J97914K34420K78969L24151M29111N32084O57958
11118G121289Q08106J040565J351231J772478K236136K688394L183418L705140
11110B3906757M115042M262703M099609L717711K964557K013576J276758Q87676
11102D7244389P43603P42333O27933J87456o38684j727659k753856l427916l983041
11093C7014558m042418l213286k069185j017938p2798P14695J406379J963465
11085C0683472K381606K703976K913645L069398L096132L051165K963953K844450
11077E3707797K998335L340494L614865L729966L733682L427426K781484K233559
$$ plain form
11069 79567608 81427643 82910892 83673539 83426624 82101682 79842986 77304599 74995227
11061 74995227 73065322 71183744 68992623 66120657 62298329 57632447 52726166 48131010
11053 48131010 44198371 41076860 38784395 37312544 36620315 36699766 37647545 39553616 42465140
11044 42465140 46283053 50780738 55385776 59452797 62597328 64558803 65444142 65818291
11036 65818291 66176932 66855195 68051324 69703573 71374748 72469495 72775855 72350768 71276373
11027 71276373 70092999 69500214 69915450 71545737 74290483 77657677 81065181 84113438
11019 84113438 86284504 87249947 87341871 86984125 86496097 86316841 86610707 86870964 86400634
11010 86400634 84694244 81224277 75947970 69596327 62989252 56881973 51928049 48350937
$$ packed form
11069G9567608J860035J483249P62647k46915j324942k258696k538387k309372
11061G4995227j929905j881578k191121k871966l822328m665882m906281m595156
11053D8131010l932639l121511k292465j471851o92229P9451R47779J906071K911524
11044D2465140L817913M497685M605038M067021L144531J961475Q85339L74149
11036F5818291L58641O78263J196129J652249J671175J094747L06360m25087j074395
11027G1276373j183374n92785M15236J630287K744746L367194L407504L048257
11019H4113438K171066R65443R1924l57746m88028j79256K93866K60257m70330
11010H6400634j706390l469967n276307o351643o607075o107279m953924l577112
$$ plain form
11002 48350937 46035549 44801098 44457391 44975055 46368708 48639976 51812340 55841435
10994 55841435 60740250 66491695 72937844 80002283 87895045 96937041 107259364 118535434
10986 118535434 129909394 140190288 148225371 153645711 156774373 158441441 159398303 159535072
10978 159535072 157800512 152938608 144923160 135243606 125107767 114737263 104166609
10971 104166609 93791548 84309274 76162854 69473247 64219184 60236842 57299442 55180807
10963 55180807 53783675 53135242 53309727 54447950 56741979 60292380 65164556 71276293
10955 71276293 78193670 85278752 91755836 96994750 100616275 102747472 103751178 104143922
10947 104143922 104579704 105094756 104881385 103085848 99398001 93718302 86347630 78201360
$$ packed form
11002D8350937k315388j234451l43707N17664J393653K271268L172364M029095
10994E5841435M898815N751445O446149P064439P892762R041996J0322323J1276070
10986A18535434J1373960J0280894Q035083N420340L128662J667068R56862J36769
10978A59535072j734560m861904q015448r679554j0135839j0370504j0570654
10971A04166609j0375061r482274q146420o689607n254063l982342k937400k118635
10963E5180807j397132o48433J74485J138223K294029L550401M872176O111737
10955G1276293O917377P085082O477084N238914L621525K131197J003706L92744
10947A04143922M35782N15052k13371j795537l687847n679699p370672q146270
$$ plain form
10939 78201360 70223171 62961450 56716145 51449807 47087924 43484103 40569662 38201400
10931 38201400 36213555 34456362 32846554 31330381 29915492 28575933 27338401 26225207
10923 26225207 25210223 24268537 23407115 22586105 21802441 21084303 20447909 19868748 19263489
10914 19263489 18685046 18167204 17674917 17179413 16685152 16225709 15843430 15504214 15231312
10905 15231312 14973742 14721139 14503581 14353809 14297268 14333252 14505967 14773311 15095002 15404601
10895 15404601 15574642 15499859 15178966 14672435 14061944 13466735 12923217 12425259 11935784
10886 11935784 11448485 11020477 10612263 10220350 9847290 9458025 9080482 8710253 8392377
10877 8392377 8132387 7835112 7562621 7330621 7148532 6978903 6816210 6661762 6508266
$$ packed form
10939G8201360p978189p261721o245305n266338m361883l603821k914441k368262
10931C8201400j987845j757193j609808j516173j414889j339559j237532j113194
10923B6225207j014984r41686q61422q21010p83664p18138o36394n79161o05259
10914A9263489n78443n17842m92287m95504m94261m59443l82279l39216k72902
10905A5231312k57570k52603k17558j49772n6541L5984J72715K67344L21691L09599
10895A5404601J70041p4783l20893n06531o10491n95209n43518m97958m89475
10886A1935784m87299m28008m08214l91913l73060l89265l77543l70229l17876
10877H392377k59990k97275k72491k32000j82089j69629j62693j54448j53496
$$ plain form
10868 6508266 6363512 6248953 6155531 6129189 6147551 6232979 6336999 6494384 6676069 6837921
10858 6837921 6928740 6862890 6668219 6374585 6017715 5662409 5303248 5003814 4799463 4624642
10848 4624642 4484443 4381694 4307118 4202090 4098617 4018704 3958261 3890550 3808683 3754617
10838 3754617 3691726 3624180 3586349 3559508 3525036 3486098 3477287 3464911 3441520 3409469 3407327 3367979
10826 3367979 3293634 3234551 3189474 3138285 3101606 3066649 3034299 2981811 2902850 2822184 2793985
10815 2793985 2757501 2706563 2717290 2726802 2716451 2718069 2748205 2758477 2769971 2809060 2849168 2885267
10803 2885267 2967405 3030539 3089808 3174965 3310960 3487124 3669422 3821345 3952073 4112529
10793 4112529 4289044 4395909 4498125 4563689 4558698 4525419 4460372 4351493 4236985 4167751
$$ packed form
10868F508266j44754j14559r3422k6342J8362Q5428J04020J57385J81685J61852
10858F837921R0819o5850j94671k93634l56870l55306l59161k99434k04351j74821
10848D624642j40199j02749p4576j05028j03473p9913o0443o7711q1867n4066
10838C754617o2891o7546l7831k6841l4472l8938q811j2376k3391l2051k142l9348
10826C367979p4345n9083m5077n1189l6679l4957l2350n2488p8961q0666k8199
10815B793985l6484n0938J0727R512j0351J618L0136J0272J1494L9089M0108L6099
10803B885267Q2138O3134N9269Q5157J35995J76164J82298J51923J30728J60456
10793D112529J76515J06865J02216O5564m991l3279o5047j08879j14508o9234
$$ plain form
10783 4167751 4102816 4035634 4001947 3992253 4067454 4179511 4332739 4477073 4594873 4689831 4684502
10772 4684502 4592527 4426706 4264260 4179437 4106943 4101593 4144871 4182856 4268033 4404546 4589842
10761 4589842 4793271 5024788 5274336 5554941 5846979 6075335 6299589 6569256 6816409
10752 6816409 7097874 7458907 7961844 8586899 9417691 10507065 11929329 13809663 16301793
10743 16301793 19571392 23801849 29114569 35643619 43495701 52605455 62569625 72559314
10735 72559314 81275258 87300272 90172406 90115231 87595501 83130021 76886703 69285268
10727 69285268 61181203 53473828 46969189 41957295 38078732 35010715 32620934 30934273
10719 30934273 29948302 29556425 29710812 30357092 31507204 33278857 35756926 39143143 43650242
$$ packed form
10783D167751o4935o7182l3687r694P5201J12057J53228J44334J17800R4958n329
10772D684502r1975j65821j62446q4823p2494n350M3278L7985Q5177J36513J85296
10761D589842K03429K31517K49548K80605K92038K28356K24254K69667K47153
10752F816409K81465L61033N02937O25055Q30792J089374J422264J880334K492130
10743A6301793L269599M230457N312720O529050P852082R109754R964170R989689
10735G2559314Q715944O025014K872134n7175k519730m465480o243318p601435
10727F9285268q104065p707375o504639n011894l878563l068017k389781j686661
10719C0934273r85971l91877J54387O46280J150112J771653K478069L386217M507099
$$ plain form
10710 43650242 49588920 57118347 66257722 76905182 88796294 101317112 113818865
10703 113818865 126004469 137618767 148403855 157523292 163253404 163692346 159281527 152545903
10695 152545903 145422134 138809770 132822070 126964222 120480578 113038361 105054828 97257626
10687 97257626 90080342 83519985 77225611 70941312 65017949 60036115 56246482 53478685
10679 53478685 51436582 49959408 49165815 49159133 50090965 52212534 55772221 61103720 68416726
10670 68416726 77637135 88266579 99134077 108880011 116636531 121691953 124230336 125268815
10662 125268815 125006434 123341666 120264096 115517191 108950646 101408616 94226044 87839735
10654 87839735 82596157 79129169 77581901 77482407 78220634 79106688 79865471 80308423 80194604
$$ packed form
10710D3650242N938678P529427R139375J0647460J1891112J2520818J2501753
10703A13818865J2185604J1614298J0785088R119437N730112M38942m410819o735624
10695A52545903p123769o612364n987700n857848o483644p442217p983533p797202
10687I7257626p177284o560357o294374o284299n923363m981834l789633k767797
10679E3478685k042103j477174p93593o682R31832K121569L559687N331499P313006
10670F8416726R220409J0629444J0867498R745934P756520N055422K538383J038479
10662A25268815k62381j664768l077570m746905o566545p542030p182572o386309
10654H7839735n243578l466988j547268r9494P38227Q86054P58783M42952j13819
$$ plain form
10645 80194604 79552576 78485823 76920957 74594858 71443045 67569068 62855756 57683832
10637 57683832 52614266 48169288 44670367 42129673 40386602 39318300 38813964 38825130
10629 38825130 39417707 40656194 42605797 45388251 48966413 53325802 58262439 63337774
10621 63337774 68009207 71745785 74405098 76126749 77000413 77070254 76500362 75310684 73455062
10612 73455062 71101802 69041109 68181262 68784933 70479857 72752483 75217350 77524990
10604 77524990 79471025 80655911 80455747 78670165 76112550 73570080 71114575 68302962
10596 68302962 64777054 60476680 55814526 51401981 47608006 44336769 41485451 39266442
10588 39266442 37935736 37539341 38147753 39800087 42612507 46698026 52018232 58452485
$$ packed form
10645H0194604o42028j066753j564866k326099l151813l873977m713312n171924
10637E7683832n069566m444978l498921k540694j743071j068302n04336J1166
10629C8825130N92577J238487J949603K782454L578162M359389M936637N075335
10621F3337774M671433L736578K659313J721651Q73664O9841n69892j189678j855622
10612G3455062k353260k060693q59847O03671J694924K272626K464867K307640
10604G7524990J946035J184886k00164j785582k557615k542470k455505k811613
10596F8302962l525908m300374m662154m412545l793975l271237k851318k219009
10588C9266442j330706l96395O08412J652334K812420M085519N320206O434253
$$ plain form
10580 58452485 65816654 73427317 80307861 85844727 89788621 91479758 90551099 87325115
10572 87325115 82266682 75339903 67191613 59050374 51718730 45662676 40916167 37150939
10564 37150939 34054509 31388084 29092577 27160603 25582033 24276112 23137279 22090189
10556 22090189 21114135 20219435 19401963 18662912 17924265 17215154 16495842 15881102 15331733
10547 15331733 14794208 14283116 13844204 13457930 13062591 12676290 12332551 12015379 11758436
10538 11758436 11519017 11252985 10991773 10755910 10558699 10353958 10169056 10001978 9880574
10529 9880574 9789734 9683456 9608735 9525791 9474374 9479918 9475555 9427382 9401817 9348971 9276984
10518 9276984 9156429 9023809 8870599 8687239 8514179 8276491 8039891 7807707 7533751
$$ packed form
10580E8452485P364169P610663O880544N536866L943894J691137r28659l225984
10572H7325115n058433o926779q148290q141239p331644o056054m746509l765228
10564C7150939l096430k666425k295507j931974j578570j305921j138833j047090
10556B2090189r76054q94700q17472p39051p38647p09111p19312o14740n49369
10547A5331733n37525n11092m38912l86274l95339l86301l43739l17172k56943
10538A1758436k39419k66032k61212k35863j97211k04741j84902j67078j21404
10529I880574r0840j06278p4721q2944n1417N544m363m8173k5565n2846p1987
10518I276984j20555j32620j53210j83360j73060k37688k36600k32184k73956
$$ plain form
10509 7533751 7317415 7147879 6965586 6854717 6756264 6665104 6547763 6433756 6297010 6138123
10499 6138123 5993022 5834538 5692842 5559053 5395480 5197943 5019361 4866041 4717570
10490 4717570 4554935 4427283 4290320 4190066 4076223 3986022 3930036 3838800 3740993 3675410
10480 3675410 3630987 3592441 3529200 3460437 3408428 3351696 3268531 3181581 3176928 3154161 3087215
10469 3087215 3023635 2945710 2878031 2808947 2760335 2709358 2647887 2596124 2584419 2560431 2519733
10458 2519733 2505921 2503761 2488024 2450988 2423131 2413940 2389822 2388613 2381345 2369488 2344237 2321761
10446 2321761 2316729 2344668 2382456 2419444 2477804 2528825 2609136 2724109 2873386 3063299 3294995
10435 3294995 3539084 3834823 4208552 4634059 5087049 5528407 5896420 6155619 6276212
$$ packed form
10509G533751k16336j69536j82293j10869r8453r1160j17341j14007j36746j58887
10499F138123j45101j58484j41696j33789j63573j97537j78582j53320j48471
10490D717570j62635j27652j36963j00254j13843r0201n5986r1236r7807o5583
10480C675410m4423l8546o3241o8763n2009n6732q3165q6950m653k2767o6946
10469C087215o3580p7925o7679o9084m8612n0977o1471n1763j1705k3988m0698
10458B519733j3812k160j5737l7036k7857r191k4118j209p268j1857k5251k2476
10446B321761n032K7939L7788L6988N8360N1021Q0311J14973J49277J89913K31696
10435C294995K44089K95739L73729M25507M52990M41358L68013K59199J20593
$$ plain form
10426 6276212 6248689 6085869 5774358 5378879 4955295 4538603 4183933 3864268 3555885 3304731
10416 3304731 3127314 3019015 2936343 2892551 2890568 2868242 2859348 2896369 2942894 2987162 3047658
10405 3047658 3136942 3245133 3356634 3434396 3489846 3535160 3619648 3699308 3755000 3768949 3743161
10394 3743161 3700161 3596910 3450607 3354284 3307888 3286534 3302679 3328563 3355700 3433204 3532426
10383 3532426 3652291 3807746 3974217 4185515 4480371 4839417 5306469 5966302 6796299
10374 6796299 7868508 9098067 10452875 11826865 13131522 14206618 14978106 15386854
10366 15386854 15431848 15120601 14490576 13567268 12484297 11394043 10458373 9738438 9258882
10357 9258882 8955555 8785452 8702470 8687618 8765567 8916155 9107938 9443790 9929727 10642466
$$ packed form
10426F276212k7523j62820l11511l95479m23584m16692l54670l19665l08383k51154
10416C304731j77417j08299q2672m3792j983k2326q894L7021M6525M4268O0496
10405C047658Q9284J08191J11501P7762N5450M5314Q4488P9660N5692J3949k5788
10394C743161m3000j03251j46303r6323m6396k1354J6145K5884K7137P7504R9222
10383C532426J19865J55455J66471K11298K94856L59046M67052O59833Q29997
10374F796299J072209J229559J354808J373990J304657J075096P71488M08748
10366A5386854M4994l11247o30025r23308j082971j090254r35670p19935m79556
10357I258882l03327j70103q2982j4852P7949J50588J91783L35852M85937P12739
$$ plain form
10347 10642466 11628751 12845925 14306959 15910873 17454970 18737560 19588944 19864590
10339 19864590 19459679 18472553 17301178 16307858 15638672 15194535 14932157 14925673 15126584
10330 15126584 15568912 16206823 17044031 18120184 19432196 21064819 23082243 25446276
10322 25446276 28280211 31817303 36361183 42370792 50404532 61143422 75186796 93212745
10314 93212745 115472338 141006784 167826602 193865424 215692136 226784253 222885644
10307 222885644 206758967 184127014 159611050 136390739 116693635 101479094 90501154
10300 90501154 83007875 77986531 74607975 72349373 70873483 69897415 69383645 69637368
10292 69637368 70958650 73604564 77852753 84146320 93014401 105078793 121049091 141427148
$$ packed form
10347A0642466R86285J217174J461034J603914J544097J282590Q51384K75646
10339A9864590m04911r87126j171375r93320o69186m44137k62378o484K00911
10330A5126584M42328O37911Q37208J076153J312012J632623K017424K364033
10322B5446276K833935L537092M543880O009609Q033740J0738890J4043374J8025949
10314I3212745K2259593K5534446K6819818K6038822K1826712J1092117l898609
10307B22885644j6126677k2631953k4515964k3220311j9697104j5214541j0977940
10300I0501154p493279n021344l378556k258602j475890r76068n13770K53723
10292F9637368J321282K645914M248189O293567Q868081J2064392J5970298K0378057
$$ plain form
10284 141427148 166402320 195904706 229455469 265674150 302122484 335985926 365321886
10277 365321886 388445134 403385003 407607906 399945510 384830019 369805979 359358018
10270 359358018 353350207 348054185 337648781 317480609 288242476 256578656 228301860
10263 228301860 204878502 186200655 172325413 163245985 158835006 158622767 161897902 167738311
10255 167738311 174923923 182229366 188575009 192784181 193969772 193039097 192893480 196742236
10247 196742236 206768821 223925144 248316498 279253169 314704550 350815287 382226693
10240 382226693 403365522 409453898 396660633 365035616 322638469 280197860 243839109
10233 243839109 214975637 193336002 178343954 169234385 165118572 165010710 167765320 172093359
$$ packed form
10284A41427148K4975172K9502386L3550763L6218681L6448334L3863442K9335960
10277C65321886K3123248J4939869M222903p662396j5115491j5024040j0447961
10270C59358018o007811n296022j0405404k0168172k9238133l1663820k8276796
10263B28301860k3423358j8677847j3875242r079428m410979k12239L275135N840409
10255A67738311P185612P305443O345643M209172J185591r30675j45617L848756
10247A96742236J0026585J7156323K4391354L0936671L5451381L6110737L1411406
10240C82226693K1138829O088376j2793265l1625017m2397147m2440609l6358751
10233B43839109k8863472k1639635j4992048r109569m115813j07862K754610M328039
$$ plain form
10225 172093359 176824353 180437154 180685906 175250359 164712129 152851481 142431203 134510680
10217 134510680 129612121 127855416 129209969 133244698 138969216 144941355 149347593 150321637
10209 150321637 146716576 139064055 129701491 121505363 115992187 113475076 113912181 117133306
10201 117133306 122663711 129272904 135110799 138367048 137723826 132132680 121485833 108260823
10193 108260823 95838636 85796214 78143418 72322434 67735610 64121435 61377455 59301827
10185 59301827 57789894 56634259 55708831 54891954 54042190 53002973 51633267 49815094
10177 49815094 47576547 45121880 42628370 40339322 38323857 36593719 35083500 33773035
10169 33773035 32672970 31686883 30748876 29824568 28899718 28052552 27305510 26576627 25869234
$$ packed form
10225A72093359M730994L612801K48752n435547j0538230j1860648j0420278p920523
10217A34510680m898559j756705J354553M034729N724518N972139M406238R74044
10209A50321637l605061p652521r362564q196128n513176k517111M37105L221125
10201A17133306N530405O609193N837895L256249o43222n591146j0646847j3225010
10193A08260823j2422187j0042422p652796n820984m586824l614175k743980k075628
10185E9301827j511933j155635r25428q16877q49764j039217j369706j818173
10177D9815094k238547k454667k493510k289048k015465j730138j510219j310465
10169C3773035j100065r86087r38007r24308r24850q47166p47042p28883p07393
$$ plain form
10160 25869234 25194434 24564304 23980961 23433943 22985984 22592564 22209566 21894669 21615034
10151 21615034 21325716 20950773 20494356 19998453 19531602 19146040 18822740 18605709 18547136
10142 18547136 18661317 18983260 19541918 20359593 21272836 22137938 22857818 23178094 22787096
10133 22787096 21737551 20365722 18914273 17546427 16359563 15365766 14545294 13900086
10125 13900086 13386224 12944780 12586373 12265845 11977519 11786490 11648286 11553936 11519115 11556658
10115 11556658 11709620 12011510 12462389 12973498 13452779 13843994 14076236 13973747 13640224
10106 13640224 13302801 13028048 12834949 12661185 12534813 12407223 12256482 12044574 11685684
10097 11685684 11187579 10648533 10103771 9572483 9033627 8507711 8054654 7673519 7375596
$$ packed form
10160B5869234o74800o30130n83343n47018m47959l93420l82998l14897k79635
10151B1615034k89318l74943m56417m95903m66851l85562l23300k17031n8573
10142A8547136J14181L21943N58658Q17675R13243Q65102P19880L20276l90998
10133B2787096j049545j371829j451449j367846j186864r93797q20472o45208
10125A3900086n13862m41444l58407l20528k88326j91029j38204r4350l4821L7543
10115A1556658J52962L01890M50879N11109M79281L91215K32242j02489l33523
10106A3640224l37423k74753j93099j73764j26372j27590j50741k11908l58890
10097A1685684m98105n39046n44762n31288n38856n25916m53057l81135k97923
$$ plain form
10088 7375596 7147705 6962078 6798393 6679044 6575150 6499651 6422581 6344430 6264264 6183474
10078 6183474 6090330 5975283 5828210 5697099 5580106 5488672 5382890 5239075 5058677 4876871
10068 4876871 4728000 4616164 4518377 4486094 4495910 4545680 4617774 4716510 4817902 4901939 4936418
10057 4936418 4910120 4854931 4767800 4637427 4488827 4304468 4146425 3981211 3857785 3801667
10047 3801667 3737007 3723662 3743472 3759756 3792653 3800599 3799661 3779371 3771274 3727101 3676512 3602421
10035 3602421 3552004 3498728 3448818 3407151 3372200 3300030 3254404 3157698 3094742 3092315 3097572 3128230
10023 3128230 3174729 3259180 3341093 3440720 3571925 3666125 3711494 3794257 3879615 3959302 4029650
10012 4029650 4048260 4019421 3956359 3871035 3824147 3863176 3966087 4097392 4207223 4240753 4168807
$$ packed form
10088G375596k27891j85627j63685j19349j03894p5499p7070p8151q0166q0790
10078F183474r3144j15047j47073j31111j16993r1434j05782j43815j80398j81806
10068D876871j48871j11836r7787l2283R816M9770P2094R8736J01392Q4037L4479
10057D936418k6298n5189q7131j30373j48600j84359j58043j65214j23426n6118
10047C801667o4660j3345J9810J6284L2897P946r38k0290q097m4173n0589p4091
10035C602421n0417n3276m9910m1667l4951p2170m5626r6706o2956k427N257L0658
10023C128230M6499Q4451Q1913R9627J31205R4200M5369Q2763Q5358P9687P0348
10012D029650J8610k8839o3062q5324m6888L9029J02911J31305J09831L3530p1946
$$ plain form
10001 4168807 4018475 3833729 3664769 3518435 3411205 3351904 3293703 3237105 3167783 3104041
9991 3104041 3022940 2979560 2931304 2925182 2885516 2846763 2779024 2765346 2825571 2880353 2962094 3018779
9979 3018779 3055650 3067021 3017966 2942396 2917434 2884623 2841671 2771310 2687674 2620045 2572913
9968 2572913 2535200 2501697 2515321 2546406 2578091 2613077 2666794 2704822 2702371 2703160 2711585 2747546
9956 2747546 2803546 2839656 2890216 2901369 2857967 2772360 2631776 2487990 2361933 2272854 2240942
9945 2240942 2272409 2346811 2453660 2575196 2703419 2852362 3018244 3150590 3254811 3332270
9935 3332270 3381078 3416852 3469359 3508459 3511237 3456424 3405095 3334111 3244443 3182041 3134913 3124498
9923 3124498 3101455 3033377 2941061 2836159 2750957 2708700 2664959 2600866 2525296 2451958 2350126
$$ packed form
10001D168807j50332j84746j68960j46334j07230n9301n8201n6598o9322o3742
9991C104041q1101m3380m8256o122l9666l8753o7739j3678O0225N4782Q1741N6685
9979C018779L6871J1371m9055p5570k4962l2811m2952p0361q3636o7629m7132
9968B572913l7713l3503J3624L1085L1685L4986N3717L8028k451P89Q425L5961
9956B747546N6000L6110N0560J1153m3402q5607j40584j43786j26057q9079l1912
9945B240942L1467P4402J06849J21536J28223J48943J65882J32346J04221P7459
9935C332270M8808L5774N2507L9100K778n4813n1329p0984q9668o2402m7128j0415
9923C124498k3043o8078r2316j04902q5202m2257m3741o4093p5570p3338j01832
$$ plain form
9912 2350126 2224136 2127280 2066464 2030717 1965663 1903162 1877296 1887849 1887985 1884959 1890308 1902349
9900 1902349 1912163 1961164 2026770 2113699 2224014 2349687 2423499 2472782 2483439 2411889 2304990
9889 2304990 2176020 2051678 1952036 1888825 1832586 1805514 1812072 1813528 1815628 1841854 1893503 1956668
9877 1956668 2024887 2039416 1999201 1954996 1900953 1900070 1937865 2020384 2116335 2248874 2398206
9866 2398206 2518797 2619395 2710070 2807797 2858192 2903096 2945543 2951981 2923462 2826435 2701824
9855 2701824 2614310 2546502 2510017 2527802 2599904 2656270 2711707 2720410 2643450 2500421 2351144
9844 2351144 2240547 2186261 2174972 2192988 2238973 2235775 2149623 2065592 1988032 1921881 1847045
9833 1847045 1830805 1847137 1892467 1965870 2081671 2203443 2331497 2468852 2610908 2740691
$$ packed form
9912B350126j25990r6856o0816l5747o5054o2501k5866J0553J36l026N349J2041
9900A902349R814M9001O5606Q6929J10315J25673P3812M9283J0657p1550j06899
9889B304990j28970j24342r9642o3211n6239k7072O558J456K100K6226N1649O3165
9877A956668O8219J4529m0215m4205n4043q83L7795Q2519R5951J32539J49332
9866B398206J20591J00598R0675R7727N0395M4904M2447O438k8519r7027j24611
9855B701824q7514o7808l6485J7785P2102N6366N5437Q703p6960j43029j49277
9844B351144j10597n4286j1289J8016M5985l198q6152q4031p7560o6151p4836
9833A847045j6240J6332M5330P3403J15801J21772J28054J37355J42056J29783
$$ plain form
9823 2740691 2786016 2783548 2709247 2587469 2389319 2159114 1946329 1767145 1663927 1565752
9813 1565752 1483709 1432492 1406156 1381503 1387927 1417447 1454807 1529499 1576877 1612494 1668895 1705020
9801 1705020 1676986 1650113 1616202 1638559 1705956 1746889 1698547 1644916 1571009 1477919 1383959
9790 1383959 1296063 1243007 1203255 1169644 1153648 1148412 1143800 1159800 1207817 1276751 1358270 1417092
9778 1417092 1415936 1354531 1289240 1241307 1162610 1126757 1084023 1040715 1028982 1024446 1025367 1046362
9766 1046362 1025891 995120 977257 977469 973362 975246 968959 972963 967751 934779 921080 891945 875884
9753 875884 863644 836505 808575 776439 764654 757634 727603 714865 719790 715955 683657 651570
9741 651570 607442 589591 590574 596474 599621 580999 565224 582347 607889 615044 621570 620553 625292
$$ packed form
9823B740691M5325k468p4301j21778j98150k30205k12785j79184j03218r8175
9813A565752q2043n1217k6336k4653O424K9520L7360P4692M7378L5617N6401L6125
9801A705020k8034k6873l3911K2357O7397M0933m8342n3631p3907r3090r3960
9790A383959q7896n3056l9752l3611j5996n236m612J6000M8017O8934Q1519N8822
9778A417092j156o1405o5291m7933p8697l5853m2734m3308j1733m536R21K0995
9766A046362k0471l0771j7863K12m107J884o287M004n212l2972j3699k9135j6061
9753H75884j2240k7139k7930l2136j1785p020l0031j2738M925l835l2298l2087
9741F51570m4128j7851R83N900L147j8622j5775J7123K5542P155O526j017M739
$$ plain form
9728 625292 632931 666454 699813 706319 723889 737863 725776 734221 738899 782581 796390 818394
9716 818394 824678 835479 841328 800104 776148 760850 735111 715620 703278 709682 704360 713401 716860
9703 716860 717924 710064 711059 705036 687024 676446 687427 736237 778053 798087 810606 797961 791188
9690 791188 788817 770160 714035 721519 756602 769337 741748 735761 707656 661332 630858 608962
9678 608962 580730 576931 572517 572438 585222 631685 668590 700479 724958 767684 780036 759291 761540
9665 761540 751683 736891 754247 742427 758568 790073 815599 831296 850150 881914 932153 1002242
9653 1002242 1033703 1052792 1084457 1122372 1154321 1162922 1194986 1236534 1250543 1210708 1128078 1045857
9641 1045857 1016545 983875 956912 933890 866100 830521 818996 807309 774383 737237 710461
$$ packed form
9728F25292P639L3523L3359O506J7570J3974j2087Q445M678M3682J3809K2004
9716H18394O284J0801N849m1224k3956j5298k5739j9491j2342O404n322R041L459
9703G16860J064p860R95o023j8012j0578J0981M8810M1816K0034J2519j2645o773
9690G91188k371j8657n6125P484L5083J2735k7589n987k8105m6324l0474k1896
9678F08962k8232l799m414p9J2784M6463L6905L1889K4479M2726J2352k0745K249
9665G61540r857j4792J7356j1820J6141L1505K5526J5697J8854L1764N0239P0089
9653A002242L1461J9089L1665L7915L1949Q601L2064M1548J4009l9835q2630q2221
9641A045857k9312l2670k6963k3022o7790l5579j1525j1687l2926l7146k6776
$$ plain form
9630 710461 711904 684173 673780 690091 707801 699534 673902 634191 620305 620706 638950 622660
9618 622660 577606 569531 587393 610634 617332 633200 643739 636995 653665 643559 628240 657874
9606 657874 676391 733876 793828 833403 878486 898496 944372 1040430 1157721 1245521 1292445
9595 1292445 1296669 1292677 1258259 1233718 1202100 1210098 1225981 1221514 1205992 1152099 1115610 1052161
9583 1052161 986549 947696 926588 922287 909095 882854 899924 926535 967722 1027979 1088907 1164466
9571 1164466 1235180 1307884 1375939 1399787 1428282 1432232 1397847 1387171 1416378 1389159 1391847 1389608
9559 1389608 1349418 1295733 1245334 1217753 1160632 1087164 1029068 968753 937977 922720 918026 886679
9547 886679 873371 857668 820232 809257 796411 790652 796411 819097 833897 821808 810602 796372
$$ packed form
9630G10461J443k7731j0393J6311J7710q267k5632l9711j3886M01J8244j6290
9618F22660m5054q075J7862K3241O698J5868J0539o744J6670j0106j5319K9634
9606F57874J8517N7485N9952L9575M5083K0010M5876R6058J17291Q7800M6924
9595A292445M224l992l4418k4541l1618P998J5883m467j5522n3893l6489o3449
9583A052161o5612l8853k1108m301j3192k6241J7070K6611M1187O0257O0928P5559
9571A164466P0714P2704O8055K3848K8495L950l4385j0676K9207k7219K688k239
9559A389608m0190n3685n0399k7581n7121p3468n8096o0315l0776j5257m694l1347
9547H86679j3308j5703l7436j0975j2846n759N759K2686J4800j2089j1206j4230
$$ plain form
9535 796372 807006 824419 844796 852691 875158 905504 1011184 1124691 1268606 1395959 1530133
9524 1530133 1694985 1867435 2028535 2207428 2366118 2608622 2832871 2992569 3087905 3114638
9514 3114638 3130058 3163109 3212469 3211868 3213680 3180798 3083322 2952119 2787404 2584148 2405368
9503 2405368 2252006 2114806 1984278 1848807 1702675 1560581 1441444 1351754 1261964 1202695
9493 1202695 1128196 1100379 1044049 979291 953691 938728 913525 919623 915406 894239 869714 873160
9481 873160 866834 849728 808762 809715 833567 857937 859407 869202 880134 905288 918630 910173 876275
9468 876275 860157 864767 862034 879910 888637 910613 895647 863420 841147 794148 726629 699520
9456 699520 668581 647196 630062 594595 561591 540040 520426 558095 587269 560088 562559 555036
$$ packed form
9535G96372J0634J7413K0377P895K2467L0346J05680J13507J43915J27353J34174
9524A530133J64852J72450J61100J78893J58690K42504K24249J59698R5336K6733
9514C114638J5420L3051M9360o01J812l2882r7476j31203j64715k03256j78780
9503B405368j53362j37200j30528j35471j46132j42094j19137q9690q9790n9269
9493A202695p4499k7817n6330o4758k5600j4963k5203O098m217k1167k4525L446
9481H73160o326j7106m0966R53K3852K4370J470R795J0932K5154J3342q457l3898
9468H76275j6118M610k733J7876Q727K1976j4966l2227k2273m6999o7519k7109
9456F99520l0939k1385j7134l5467l3004k1551j9614L7669K9174k7181K471p523
$$ plain form
9444 555036 542444 536964 534430 529098 548164 550299 533579 555090 562688 555106 518933 492363 478890
9431 478890 490968 502502 508131 495837 476822 462458 468093 433963 409989 415697 425630 442333
9419 442333 442637 421754 421402 409117 401240 381210 380615 393115 384564 361983 337883 314367 312425
9406 312425 331529 366814 377960 387016 420883 454224 500690 582290 652640 696297 762473 852544
9394 852544 944462 988965 978427 930245 842967 768815 703849 635133 574990 537695 517249 535513
9382 535513 540374 552478 546556 583575 653868 683435 734942 809431 895434 934685 959812 978949
9370 978949 965820 878603 801862 715114 663923 578871 518209 481868 478836 471067 453280 449477
9358 449477 426699 439333 458041 467094 434904 442954 471713 485401 474047 461758 466790 451408
$$ packed form
9444E55036j2592n480k534n332J9066K135j6720K1511P598p582l6173k6570j3473
9431D78890J2078J1534N629j2294j9015j4364N635l4130k3974N708R933J6703
9419D42333L04k0883l52j2285p877k0030n95J2500q551k2581k4100k3516j942
9406C12425J9104L5285J1146R056L3867L3341M6466Q1600P0350M3657O6176R0071
9394H52544R1918M4503j0538m8182q7278p4152o4966o8716o0143l7295k0446J8264
9382E35513M861J2104n922L7019P0293K9567N1507P4489Q6003L9251K5127J9137
9370I78949j3129q7217p6741q6748n1191q5052o0662l6341l032p769j7787l803
9358D49477k2778J2634J8708R053l2190Q050K8759J3688j1354j2289N032j5382
$$ plain form
9346 451408 458094 487705 513306 527160 558010 600061 647415 717492 799085 878067 964979 1078233
9334 1078233 1199178 1263106 1273193 1241367 1186828 1135349 1096088 1034410 954753 887248 849218
9323 849218 828742 803810 809783 843324 894362 958091 1065943 1194857 1351207 1518634 1658873
9312 1658873 1734148 1789228 1818848 1816677 1734278 1595623 1427647 1252524 1104423 994274 904459
9301 904459 863481 822109 784723 770077 770736 797371 823808 857350 913283 939757 953088 979421
9289 979421 987236 953408 874806 798888 735394 698834 676646 629727 605816 611093 629169 634471
9277 634471 675151 734148 752308 756088 806732 872688 914044 941019 937599 887026 852675 813429
9265 813429 764169 706643 655827 640911 680170 738951 777777 830020 892153 967704 1068803
$$ packed form
9346D51408O686K9611K5601J3854L0850M2051M7354P0077Q1593P8982Q6912J13254
9334A078233J20945O3928J0087l1826n4539n1479l9261o1678p9657o7505l8030
9323H49218k0476k4932N973L3541N1038O3729J07852J28914J56350J67427J40239
9312A658873P5275N5080K9620k171q2399j38655j67976j75123j48101j10149q9815
9301I04459m0978m1372l7386j4646O59K6635K6437L3542N5933K6474J3331K6333
9289I79421P815l3828p8602p5918o3494l6560k2188m6919k3911N277J8076N302
9277F34471M0680N8997J8160L780N0644O5956M1356K6975l420n0573l4351l9246
9265H13429m9260n7526n0816j4916L9259N8781L8826N2243O2133P5551J01099
$$ plain form
9254 1068803 1203282 1339026 1488627 1597815 1682192 1714531 1670035 1574601 1437223 1281013
9244 1281013 1155642 1071158 996761 943554 895095 856709 826334 815580 835047 913822 992981
9233 992981 1050409 1101631 1160675 1209393 1241816 1261208 1242081 1211069 1132598 1059101 990027 899819
9221 899819 821173 757810 700912 641734 605411 599365 587314 567974 567474 548857 516209 466812
9209 466812 491229 497030 499017 510761 487356 498543 477947 455003 455504 454383 445986 465280 506598
9196 506598 551503 560385 569787 609753 664100 710787 784149 842503 853079 865945 800203 742040
9184 742040 718059 676524 644074 636655 627722 596777 561965 534557 553488 569145 581767 633965
9172 633965 691313 726878 788122 861335 911672 952317 921549 853595 782152 730399 679967 645517
$$ packed form
9254A068803J34479J35744J49601J09188Q4377L2339m4496r5434j37378j56210
9244A281013j25371q4484p4397n3207m8459l8386l0375j0754J9467P8775P9159
9233I92981N7428N1222N9044M8718L2423J9392j9127l1012p8471p3497o9074r0208
9221H99819p8646o3363n6898n9178l6323o046j2051j9340n00j8617l2648m9397
9209D66812K4417N801J987J1744k3405J1187k0596k2944N01j121q397J9294M1318
9196E06598M4905Q882R402L9966N4347M6687P3362N8354J0576J2866o5742n8163
9184G42040k3981m1535l2450p419q933l0945l4812k7408J8931J5657J2622N2198
9172F33965N7348L5565O1244P3213N0337M0645l0768o7954p1443n1753n0432l4450
$$ plain form
9160 645517 628963 637243 623953 625247 629286 615237 602644 621817 634985 650800 662585 673452
9148 673452 681445 669678 681014 699589 723950 776098 808444 805410 821455 859553 906508 938593
9136 938593 974649 1027778 1079228 1137728 1173752 1211656 1266543 1328760 1406630 1467997 1540187 1631457
9124 1631457 1705497 1778290 1864784 1936671 1996061 2085594 2199716 2292617 2358943 2425829 2515016
9113 2515016 2570974 2623655 2678180 2728385 2766776 2763393 2763194 2746949 2737727 2717831 2688865 2645792
9101 2645792 2599987 2581948 2563081 2545592 2505692 2461153 2433731 2388872 2345271 2267371 2197166
9090 2197166 2129845 2062924 2009103 1974192 1936290 1915451 1885059 1845334 1807338 1760045 1726964
9079 1726964 1673279 1658902 1662438 1642600 1585531 1520485 1478673 1434366 1403766 1382869 1364039 1337685
$$ packed form
9160F45517j6554Q280j3290J294M039j4049j2593J9173J3168J5815J1785J0867
9148F73452P993j1767J1336J8575K4361N2148L2346l034J6045L8098M6955L2085
9136I38593L6056N3129N1450N8500L6024L7904N4887O2217P7870O1367P2190R1270
9124A631457P4040P2793Q6494P1887N9390Q9533J14122R2901O6326O6886Q9187
9113B515016N5958N2681N4525N0205L8391l383j99j6245r222j9896k8966m3073
9101B645792m5805j8039j8867j7489l9900m4539k7422m4859m3601p7900p0205
9090B197166o7321o6921n3821l4911l7902k0839l0392l9725l7996m7293l3081
9079A726964n3685j4377L536j9838n7069o5046m1812m4307l0600k0897j8830k6354
$$ plain form
9067 1337685 1322455 1286644 1246104 1198733 1169645 1125661 1101810 1127881 1130402 1113872 1064072 1064289
9055 1064289 1096270 1091872 1074764 1073367 1079839 1124139 1140542 1162277 1182059 1157083 1123909 1068900
9043 1068900 1033605 1016140 997018 956487 946340 955340 924205 884277 880204 877647 887200 906115
9031 906115 895846 856254 845828 869008 930000 968555 972318 939670 932645 942677 925744 903428
9019 903428 891152 853458 840643 825801 811853 806715 789284 765342 791228 782393 780929 773190
9007 773190 811289 850877 869669 860331 869912 848602 821853 841150 891372 904952 862952 844076
8995 844076 839016 829345 804044 806978 825704 801883 794928 797276 822501 841720 863888 873929 879623
8982 879623 909833 960577 984122 1004443 994032 955993 920321 899454 890063 873296 893223 896154
$$ packed form
9067A337685j5230l5811m0540m7371k9088m3984k3851K6071K521j6530m9800K17
9055A064289L1981m398j7108j397O472M4300J6403K1735J9782k4976l3174n5009
9043A068900l5295j7465j9122m0531j0147R000l1135l9928m073k557R553J8915
9031I06115j0269l9592j0426K3180O0992L8555L763l2648p025J0032j6933k2316
9019I03428j2276l7694j2815j4842j3948n138j7431k3942K5886q835j464p739
9007G73190L8099L9588J8792r338R581k1310k6749J9297N0222J3580m2000j8876
8995H44076n060r671k5301K934J8726k3821o955K348K5225J9219K2168J0041N694
8982H79623L0210N0744K3545K0321j0411l8039l5672k0867r391j6767J9927K931
$$ plain form
8970 896154 870145 865071 873078 858937 845327 847739 845653 832695 799627 815934 808522 780296 761225
8957 761225 740103 751578 756204 762631 767148 755065 747241 736916 735692 702078 678432 658595 651839
8944 651839 647064 666710 688008 712233 755870 767157 780526 804288 820192 814301 791387 792660
8932 792660 779515 771106 764437 751095 739199 723580 704735 686425 655986 639119 621333 617761
8920 617761 646544 665510 639370 605570 560534 566805 573324 561512 535689 529743 502183 477747
8908 477747 461250 457577 475485 484796 491809 509941 507214 491659 475060 478709 470429 468483 482311
8895 482311 490863 498463 518583 517462 557395 575127 567202 540997 540150 483769 454985 462858 466947
8882 466947 457521 417941 416826 439379 462892 476304 504720 495340 505380 500014 491717 493678 486238
$$ packed form
8970H96154k6009n074Q007j4141j3610K412k086j2958l3068J6307p412k8226j9071
8957G61225k1122J1475M626O427M517j2083p824j0325j224l3614k3646j9837o756
8944F51839m775J9646K1298K4225M3637J1287J3369K3762J5904n891k2914J273
8932G92660j3145q409o669j3342j1896j5619j8845j8310l0439j6867j7786l572
8920F17761K8783J8966k6140l3800m5036O271O519j1812k5823n946k7560k4436
8908D77747j6497l673J7908R311P013J8132k727j5555j6599L649q280j946J3828
8895D82311Q552P600K0120j121L9933J7732p925k6205q47n6381k8784P873M089
8882D66947r426l9580j115K2553K3513J3412K8416r380J0040n366q297J961p440
$$ plain form
8869 486238 466935 456818 449534 417778 394841 380753 381589 409985 415504 427321 412303 395183
8857 395183 409205 417875 432940 488248 529709 573857 661774 727186 796374 863762 884164 867510
8845 867510 824669 767820 722840 684419 649197 580649 538106 522575 499148 475862 498031 522328
8833 522328 545807 539626 551953 581838 595003 612891 619602 632917 619255 615312 653771 750341
8821 750341 892662 1005765 1138825 1261860 1320890 1257517 1105615 941550 850703 825333
8811 825333 755950 722622 693472 684340 656831 594435 571316 574874 555694 567695 577630 563517
8799 563517 553810 577716 578376 574014 570612 577304 594606 602507 624752 651193 686136 720129 704143
8786 704143 681474 650497 598023 545597 522201 504216 487449 479503 491955 505065 516275 513397
$$ packed form
8869D86238j9303j0117p284l1756k2937j4088Q36K8396N519J1817j5018j7120
8857C95183J4022Q670J5065N5308M1461M4148Q7917O5412O9188O7388K0402j6654
8845H67510m2841n6849m4980l8421l5222o8548m2543j5531k3427k3286K2169K4297
8833E22328K3479o181J2327K9885J3165J7888O711J3315j3662l943L8459R6570
8821G50341J42321J13103J33060J23035N9030o3373j51902j64065r0847k5370
8811H25333o9383l3328k9150r132k7509o2396k3119L558j9180J2001R935j4113
8799E63517r707K3906O60m362l402O692J7302P901K2245K6441L4943L3993j5986
8786G04143k2669l0977n2474n2426k3396j7985j6767p946J2452J3110J1210k878
$$ plain form
8774 513397 533017 531129 533872 526022 512238 495573 482030 434986 363469 336941 332458 368431
8762 368431 401590 386029 366019 348521 350137 396314 402190 392560 368376 370071 396945 433301
8750 433301 442122 449804 422247 407669 392586 378422 379469 342682 331640 332906 342899 379317 379291
8737 379291 394277 408206 408236 432812 437060 435828 451772 462973 463533 451804 425512 430721 432672
8724 432672 437967 445985 443616 441259 427979 427108 459553 501291 549684 602291 628330 659208 718415
8711 718415 772989 803700 781853 781049 779113 751519 747151 783335 816545 868016 928853 1007933
8699 1007933 1100629 1208985 1355263 1546865 1819757 2191428 2658339 3256356 4038056 5056887
8689 5056887 6304876 7682449 9049546 10332324 11433517 11998504 11484917 9914579 8040909
$$ packed form
8774E13397J9620j888K743p850j3784j6665j3543m7044p1517k6528m483L5973
8762C68431L3159j5561k0010j7498J616M6177N876r630k4184J695K6874L6356
8750D33301Q821P682k7557j4578j5083j4164J047l6787j1042J266R993L6418k6
8737C79291J4986J3929L0K4576M248j232J5944J1201N60j1729k6292N209J951
8724D32672N295Q018k369k357j3280q71L2445M1738M8393N2607K6039L0878N9207
8711G18415N4574L0711k1847q04j936k7594m368L6184L3210N1471O0837P9080
8699A007933R2696J08356J46278J91602K72892L71671M66911N98017P81700J018831
8689E056887J247989J377573J367097J282778J101193N64987n13587j570338j873670
$$ plain form
8680 8040909 6494648 5287994 4359326 3710002 3279487 3003279 2793954 2628143 2495846
8671 2495846 2413790 2364978 2363545 2350712 2366553 2400475 2454832 2430747 2313587 2109988 1898781
8660 1898781 1718764 1578127 1480152 1418662 1350000 1297184 1276650 1269198 1274806 1283319 1230455 1179915
8648 1179915 1157959 1170742 1181128 1236914 1352231 1493715 1655731 1848429 1947563 1941619 1839820
8637 1839820 1630872 1394511 1224137 1111711 1057070 1012300 946784 874142 840804 831902 830744
8626 830744 837224 833628 814008 804035 781807 807497 857220 908816 966854 1024731 1100281 1186944
8614 1186944 1253008 1310585 1287556 1186943 1064117 957776 888596 833580 801405 775028 754717
8603 754717 720542 688695 653507 626485 629299 614307 620796 615155 606131 625838 635964 627376 622806
$$ packed form
8680H040909j546261j206654r28668o49324m30515k76208k09325j65811j32297
8671B495846q2056m8812j433j2833J5841L3922N4357k4085j17160k03599k11207
8660A898781j80017j40637r7975o1490o8662n2816k0534p452N608Q513n2864n0540
8648A179915k1956J2783J0386N5786J15317J41484J62016J92698R9134n944j01799
8637A839820k08948k36361j70374j12426n4641m4770o5516p2642l3338q902j158
8626H30744O480l596j9620r973k2228K5690M9723N1596N8038N7877P5550Q6663
8614A186944O6064N7577k3029j00613j22826j06341o9180n5016l2175k6377k0311
8603G54717l4175l1847l5188k7022K814j4992O489n641r024J9707J0126q588m570
$$ plain form
8590 622806 587083 579770 572981 561674 561126 535662 540401 557294 580680 607238 626004 645101 640486
8577 640486 657450 687917 735723 798283 913933 1113662 1340117 1577584 1794750 1926296
8567 1926296 1878688 1670822 1438399 1270288 1154095 1070997 1012031 986146 970751 950186 952110
8556 952110 920686 923432 912189 962492 1005534 1018212 1043226 1081129 1114219 1135259 1133391 1082776
8544 1082776 996204 928207 852401 805064 777728 724035 678456 652012 649923 671614 652513 645657
8532 645657 635846 659724 678605 684392 737942 835923 942675 1051713 1107191 1145246 1166764 1119485
8520 1119485 1007446 910144 881604 868460 836316 833551 869681 936020 1061963 1265875 1500744
8509 1500744 1723583 1916052 2032980 1940366 1783928 1680974 1670467 1712599 1734558 1676199
$$ packed form
8590F22806l5723p313o789j1307n48k5464M739J6893K3386K6558J8766J9097m615
8577F40486J6964L0467M7806O2560J15650J99729K26455K37467K17166J31546
8567A926296m7608k07866k32423j68111j16193q3098n8966k5885j5395k0565J924
8556I52110l1424K746j1243N0303M3042J2678K5014L7903L3090K1040j868n0615
8544A082776q6572o7997p5806m7337k7336n3693m5579k6444k089K1691j9101o856
8532F45657r811K3878J8881N787N3550R7981J06752J09038N5478L8055K1518m7279
8520A119485j12039r7302k8540j3144l2144k765L6130O6339J25943K03912K34869
8509A500744K22839J92469J16928r2614j56438j02954j0507M2132K1959n8359
$$ plain form
8499 1676199 1522533 1338262 1203542 1117409 1049100 990046 928165 900419 882005 838003 817047
8488 817047 792881 791506 778916 761071 751424 739394 716104 684886 698505 695908 703910 717210
8476 717210 718674 722425 744154 758946 778417 859616 987195 1139445 1311885 1494202 1677978
8465 1677978 1850692 1892800 1719568 1450220 1242869 1144518 1121922 1134809 1155120 1177158 1153402
8454 1153402 1089774 998631 917133 874023 859972 839680 832772 790245 728792 704140 672421 665231
8442 665231 629913 618606 617542 596613 556424 550682 549998 556584 559607 531362 545204 558311 519100
8429 519100 498515 505297 491061 498952 500769 480552 476307 470529 445681 411045 394493 406513 410272
8416 410272 402155 396794 367151 381285 411343 413854 424063 447380 470562 441591 426103 428708
$$ packed form
8499A676199j53666j84271j34720q6133o8309n9054o1881k7746j8414m4002k0956
8488H17047k4166j375j2590j7845r647j2030k3290l1218J3619k597Q002J3300
8476G17210J464L751K1729J4792J9471Q1199J27579J52250J72440J82317J83776
8465A677978J72714M2108j73232k69348k07351r8351k2596J2887K0311K2038k3756
8454A153402o3628r1143q1498m3110j4051k0292o908m2527o1453k4652l1719p190
8442F65231l5318j1307j064k0929m0189n742o84O586L023k8245J3842J3107l9211
8429E19100k0585O782j4236P891J817k0217m245n778k4848l4636j6552J2020L759
8416D10272q117n361k9643J4134L0058K511J0209K3317K3182k8971j5488K605
$$ plain form
8404 428708 428022 421724 410115 389184 378952 383027 347372 335552 338238 343699 357290 363457 394643
8391 394643 398778 405763 428693 421428 409498 369119 353989 375926 362794 356564 353779 333714 317692
8378 317692 324175 344450 362018 375815 347182 368091 358772 329606 295907 275109 277613 300876
8366 300876 319645 333632 349184 366252 396805 391128 400991 399305 398932 418665 391710 377711 380437
8353 380437 367213 346427 354858 381954 385086 389156 409294 405069 405982 399396 398365 411653 409735
8340 409735 380417 359520 314741 310514 329453 319679 301302 282512 279144 312630 315469 318839 307745
8327 307745 293063 294898 285514 284032 267249 258107 245603 232150 264319 278562 247247 223501
8315 223501 232852 234178 237630 241012 245352 249519 255283 283079 290404 278799 276220 294453 319108
$$ packed form
8404D28708o86o298j1609k0931j0232M075l5655j1820K686N461J3591O167L1186
8391C94643M135O985K2930p265j1930m0379j5130K1937j3132o230k785k0065j6022
8378C17692O483K0275J7568J3797k8633K0909r319k9166l3699k0798K504K3263
8366C00876J8769J3987J5552J7068L0553n677R863j686l73J9733k6955j3999K726
8353C80437j3224k0786Q431K7096L132M070K0138m225R13o586j031J3288j918
8340D09735k9318k0897m4779m227J8939r774j8377j8790l368L3486K839L370j1094
8327C07745j4682J835r384j482j6783r142j2504j3453L2169J4243l1315k3746
8315B23501R351J326L452L382M340M167N764K7796P325j1605k579J8233K4655
$$ plain form
8302 319108 297224 253393 260907 252333 237962 263592 280719 264593 235015 244265 266302 282444
8290 282444 313080 317564 315769 329485 333036 328862 331041 340133 324217 313128 322698 320556 307823
8277 307823 300646 294140 269903 253761 246696 246535 241667 255677 270201 321612 355027 373666 365241
8264 365241 355499 377123 367085 360150 374922 357943 351595 355247 356342 323403 279678 289936 332150
8251 332150 323509 316381 325569 347522 371713 389740 422934 457463 475372 466653 467485 463594 434512
8238 434512 427862 430342 425030 437237 437261 425322 434655 461556 472304 463702 475149 482276 513902
8225 513902 573411 654987 767851 951862 1214667 1553463 1932875 2296585 2522148 2414055
8215 2414055 2067205 1688031 1387827 1201226 1055408 951327 867352 780309 715966 665178
$$ packed form
8302C19108k1884m3831P514q574j4371K5630J7127j6126k9578R250K2037J6142
8290B82444L0636M484j795J3716L551m174K179R092j5916j1089R570k142j2733
8277C07823p177o506k4237j6142p065j61m868J4010J4524N1411L3415J8639q425
8264C65241r742K1624j0038o935J4772j6979o348L652J095l2939m3725J0258M2214
8251C32150q641p128R188K1953K4191J8027L3194L4529J7909q719Q32l891k9082
8238D34512o650K480n312J2207K4j1939R333K6901J0748q602J1447P127L1626
8225E13902N9509Q1576J12864J84011K62805L38796L79412L63710K25563j08093
8215B414055l46850l79174l00204j86601j45818j04081q3975q7043o4343n0788
$$ plain form
8205 665178 674650 661126 674370 686477 679532 653743 633347 624782 594961 570515 560733 541863
8193 541863 555727 548619 527100 532302 560244 556629 520229 477435 469924 483606 499939 503816 538061
8180 538061 536346 516330 508048 498123 466740 466964 467057 451743 421969 428481 437991 423952 375804 376723
8166 376723 436041 437363 426629 417486 396556 394915 383787 389178 443772 481890 485618 493649 496955
8153 496955 515447 488274 454143 433849 443942 497151 512775 523063 507621 533846 569553 614781
8141 614781 691858 775193 853966 904759 941988 985092 977741 952450 866850 785360 702828 649613
8129 649613 610964 581496 574221 570017 600173 606442 584416 598874 605484 579336 620665 671606
8117 671606 689759 713594 709192 648839 631681 619865 595025 583834 585847 607877 618498 628306
$$ packed form
8205F65178R472j3524J3244J2107o945k5789k0396q565k9821k4446r782j8870
8193E41863J3864p108k1519N202K7942l615l6400m2794p511J3682J6333L877L4245
8180E38061j715k0016q282r925l1383K24R3j5314k9774O512R510j4039m8148R19
8166C76723N9318J322j0734r143k0930j641j1128N391N4594L8118L728Q031L306
8153D96955J8492k7173l4131k0294J0093N3209J5624J0288j5442K6225L5707M5228
8141F14781P7077Q3335P8773N0793L7229M3104p351k5291q5600q1490q2532n3215
8129F49613l8649k9468p275m204L0156O269k2026J4458O610k6148M1329N0941
8117F71606J8153K3835m402o0353j7158j1816k4840j1191K013K2030J0621R808
$$ plain form
8105 628306 634436 631686 653555 691768 728418 739905 748363 763851 817930 899542 1005756 1146776
8093 1146776 1347434 1548332 1762759 1914221 1932887 1770026 1533693 1309485 1106981 974967
8083 974967 923776 894388 867104 864547 854568 832604 829441 817384 796002 778579 783352 781265 765493
8070 765493 743563 710723 718377 725413 722632 754599 771209 783215 770908 741425 737797 746759 727345
8057 727345 716295 722884 746426 797514 847138 897185 948496 1015644 1094650 1203552 1329181
8046 1329181 1457328 1599964 1817294 2007609 2153878 2268580 2341106 2343989 2246846 2058847
8036 2058847 1821340 1613529 1471324 1369211 1310455 1272776 1237034 1203106 1143519 1121070 1104391
8025 1104391 1087259 1126566 1181046 1234813 1293210 1341741 1400232 1434144 1431867 1402090 1345372 1325425
$$ packed form
8105F28306O130k750K1869L8213L6650J1487Q458J5488N4079Q1612J06214J41020
8093A146776K00658K00898K14427J51462J8666j62861k36333k24208k02504j32014
8083I74967n1191k9388k7284k557r979k1964l163j2057k1382j7423M773k087j5772
8070G65493k1930l2840P654P036k781L1967J6610J2006j2307k9483l628Q962j9414
8057G27345j1050O589K3542N1088M9624N0047N1311O7148P9006J08902J25629
8046A329181J28147J42636K17330J90315J46269J14702P2526K883r7143j87999
8036B058847k37507k07811j42205j02113n8756l7679l5742l3928n9587k2449j6679
8025A104391j7132L9307N4480N3767N8397M8531N8491L3912k277k9777n6718j9947
$$ plain form
8013 1325425 1366994 1428816 1555993 1773980 1953480 2136221 2320893 2412310 2338113 2239439
8003 2239439 2168184 2168042 2229233 2295734 2374423 2382350 2326324 2180440 1965328 1767314 1628209
7992 1628209 1535409 1466778 1445294 1429856 1391082 1330977 1291115 1288582 1243717 1224423 1234496 1268107
7980 1268107 1269443 1258465 1321320 1425447 1484653 1450287 1372848 1327698 1314731 1336299 1383255
7969 1383255 1453034 1585305 1760078 1881487 1953792 1912693 1739400 1546660 1376752 1259108
7959 1259108 1164717 1076168 1058925 1077669 1071241 1058308 997276 974669 939333 892122 843122 831676
7947 831676 814595 774467 749831 720510 692495 689424 683099 666319 651301 637835 598529 599697
7935 599697 582039 574804 585981 587344 571700 562005 573499 565908 561348 549239 542597 552647 539135
$$ packed form
8013A325425M1569O1822J27177K17987J79500J82741J84672R1417p4197r8674
8003B239439p1255j42O1191O6501P8689P927n6026j45884k15112j98014j39105
7992A628209r2800o8631k1484j5438l8774o0105l9862k533m4865j9294J0073L3611
7980A268107J336j0978O2855J04127N9206l4366p7439m5150j2967K1568M6956
7969A383255O9779J32271J74773J21409P2305m1099j73293j92740j69908j17644
7959A259108r4391q8549j7243J8744o428j2933o1032k2607l5336m7211m9000j1446
7947H31676j7081m0128k4636k9321k8015l071o325j6780j5018j3466l9306J168
7935E99697j7658p235J1177J363j5644r695J1494p591m560j2109o642J0050j3512
$$ plain form
7922 539135 530220 534798 494142 492141 500487 470304 474290 503468 533247 525432 523652 515633 499888
7909 499888 485743 452950 416898 405535 401810 429360 468107 501646 540818 553509 538683 517156
7897 517156 483127 469825 457414 466868 502191 483164 450116 441211 475566 491214 502897 485376
7885 485376 493891 499151 483786 502252 493237 478579 468698 438862 443681 452427 421580 410958 398940
7872 398940 392231 380713 372523 354837 343267 370488 359967 330502 305630 325687 331081 325134
7860 325134 288092 237383 250219 270247 279617 279785 274342 282621 290316 265614 292119 285273 275965
7847 275965 271704 256658 251850 253029 247849 237284 261268 261522 242714 237031 220016 216088 232127
7834 232127 200296 178592 181689 212230 219824 210628 224829 253813 248201 274419 253246 210343
$$ packed form
7922E39135q915M578m0656k001Q346l0183L986K9178K9779p815j780q019j5745
7909D99888j4145l2793l6052j1363l725K7550L8747L3539L9172J2691j4826k1527
7897E17156l4029j3302j2411R454L5323j9027l3048q905L4355J5648J1683j7521
7885D85376Q515N260j5365J8466r015j4658r881k9836M819Q746l0847j0622j2018
7872C98940o709j1518q190j7686j1570K7221j0521k9465k4872K0057N394n947
7860C25134l7042n0709J2836K0028R370J68n443Q279P695k4702K6505o846r308
7847B75965m261j5046m808J179n180j0565K3984K54j8808n683j7015l928J6039
7834B32127l1831k1704L097L0541P594r196J4201K8984n612K6218k1173m2903
$$ plain form
7822 210343 228248 249335 259453 251351 230181 214342 206691 201812 204133 208605 205955 213183 201813
7809 201813 188223 144173 152930 171453 166948 148210 143410 165316 156934 148771 145172 123625 117862
7796 117862 117645 123767 101892 75724 68585 79714 77609 87018 103489 129577 149798 131692 147060
7783 147060 143861 164157 194652 202396 197977 181947 191862 174114 173057 175724 176672 162009 156610
7770 156610 119139 123489 128452 110293 108942 118947 133444 130102 134176 145032 165218 142981 109341
7757 109341 100723 102654 116414 128920 108178 76919 69555 81222 86737 99429 92583 76520 66768
7744 66768 57709 56311 77693 71400 31386 50960 61212 39673 24579 36513 67317 51409
7732 51409 61711 79013 82823 98089 97309 77052 52317 38812 30266 18643 45880 50517 57499
$$ packed form
7822B10343J7905K1087J0118q102k1170j5839p651m879K321M472k650P228j1370
7809B01813j3590m4050Q757J8523m505j8738m800K1906q382q163l599k1547n763
7796A17862k17O122k1875k6168p139J1129k105R409J6471K6088K0221j8106J5368
7783A47060l199K0296L0495P744m419j6030R915j7748j057K667R48j4663n399
7770A56610l7471M350M963j8159j351J0005J4497l342M074J0856K0186k2237l3640
7757A09341q618J931J3760J2506k0742l1259p364J1667N515J2692o846j6063r752
7744F6768r059j398K1382o293m0014J9574J0252k1539j5094J1934L0804j5908
7732E1409J0302J7302L810J5266p80k0257k4735j3505q546j1623K7237M637O982
$$ plain form
7719 57499 58126 53405 75258 73791 43598 64164 85862 76928 64704 59726 25998 32848 65129
7706 65129 59019 44844 44252 37006 47855 43543 46070 61845 64597 75735 72833 46200 57352
7693 57352 76766 71902 81242 71809 94518 96533 68044 61585 60247 40296 32009 24314 39868
7680 39868 56309 73046 82979 85778 59756 52426 58159 57145 31436 13469 23170 52152 72715
7667 72715 87224 91657 93080 48102 32209 35698 41319 35933 12792 20179 2854 16258 26273
7654 26273 17398 35262 28893 17103 29633 23441 26664 29963 25146 38153 22793 22169 48341
7641 48341 51486 52187 62707 76312 82865 90714 95015 88533 91494 73988 67243 70867 82012 68296
7627 68296 62995 60404 55031 43604 33831 37498 26315 17471 59364 71952 48186 53800 59480
$$ packed form
7719E7499O27m721K1853j467l0193K0566K1698q934j2224m978l3728O850L2281
7706F5129o110j4175n92p246J0849m312K527J5775K752J1138k902k6633J1152
7693E7352J9414m864R340r433K2709K015k8489o459j338j9951q287p695J5554
7680C9868J6441J6737R933K799k6022p330N733j014k5709j7967R701K8982K0563
7667G2715J4509M433J423m4978j5893L489N621n386k3141P387j7325J3404J0015
7654B6273q875J7864o369j1790J2530o192L223L299m817J3007j5360o24K6172
7641D8341L145P01J0520J3605O553P849M301o482K961j7506o745L624J1145j3716
7627F8296n301k591n373j1427r773L667j1183q844M1893J2588k3766N614N680
$$ plain form
7614 59480 55628 41299 57720 70891 55218 47787 50810 52112 54091 56804 71029 68195 78472
7601 78472 82083 71493 37451 35601 52398 25297 27873 28249 26681 52196 52703 45154 25700 13668
7587 13668 31650 32762 162 8564 9107 17641 2268 -14879 -15836 -29170 -46040 -18077 -9822
7574 -9822 -15260 -2906 -6476 -2713 1985 15910 35429 14531 6008 2623 -30770 -25731 -9841
7561 -9841 8177 10763 12744 16145 13752 4161 11767 7013 18501 35282 34173 35303 70558 80912
7547 80912 86825 62797 48902 37693 50972 51769 46163 41905 43581 43190 49507 41132 29322 45483
7533 45483 31653 24202 17033 -1203 -12829 -1459 -3042 -2727 2931 -11441 -15420 -14646 -24702 -26064
7519 -26064 -23270 -3195 33287 7204 10251 37306 43027 48911 73675 72234 59310 48186 20410
$$ packed form
7614E9480l852j4329J6421J3171j5673p431L023J302J979K713J4225k834J0277
7601G8472L611j0590l4042j850J6797k7101K576L76j568K5515N07p549j9454j2032
7587A3668J7982J112l2600Q402N43Q534j5373j7147r57j3334j6870K7963Q255
7574i822n438J2354l570L763M698J3925J9519k0898q523l385l3393N039J5890
7561i841J8018K586J981L401k393r591P606m754J1488J6781j109J130L5255J0354
7547H0912N913k4028j3895j1209J3279P97n606m258J676l91O317q375j1810J6161
7533D5483j3830p451p169j8236j1626J1370j583L15N658j4372l979P74j0056j362
7519b6064K794K0075L6482k6083L047K7055N721N884K4764j441j2924j1124k7776
$$ plain form
7506 20410 -12299 -34935 -31413 -6440 5635 5725 -5623 -12676 -18971 -22220 -23387 -22679 -12886 -3539
7492 -3539 -1628 7625 21214 19058 19834 17551 -9450 868 24308 32671 25024 14668 16795 17752
7478 17752 30443 39527 24181 47309 76360 70270 43705 41095 40001 44370 51208 30196 -4644
7465 -4644 -12519 -2017 -11705 4486 26961 44724 30619 29415 32927 34493 21401 1633 -28346
7452 -28346 -6577 2358 3988 1901 -8591 6590 9142 -6714 -10577 -24988 -10828 -21450 -45396
7439 -45396 -51557 -25058 -1656 1489 5211 12379 16295 26230 37266 47128 52027 30563 9021
7426 9021 15498 16463 17205 17745 42615 43203 38902 24993 615 15912 20107 2075 -7054 30937
7412 30937 47023 42664 57759 42942 17966 20760 30304 40431 37270 13468 15389 48288 76081
$$ packed form
7506B0410l2709k2636L522K4973J2075R0j1348p053o295l249j167P08R793R347
7492c539J911R253J3589k156P76k283k7001J0318K3440Q363p647j0356K127R57
7478A7752J2691R084j5346K3128K9051o090k6565k610j094M369O838k1012l4840
7465d644p875J0502r688J6191K2475J7763j4105j204L512J566j3092j9768k9979
7452b8346K1769Q935J630k087j0492J5181K552j5856l863j4411J4160j0622k3946
7439d5396o161K6499K3402L145L722P168L916R935J1036R862M899k1464k1542
7426I021O477R65P42N40K4870N88m301j3909k4378J5297M195j8032r129L7991
7412C0937J6086m359J5095j4817k4976K794R544J0127l161k3802J921L2899K7793
$$ plain form
7399 76081 69399 56922 30836 10405 22297 15272 31054 32838 25836 40442 59967 67250 48384
7386 48384 16374 -1389 -12932 8491 -7316 -18371 -14930 -2502 14042 22215 20242 28581 56284
7373 56284 50392 18594 31007 41277 35115 43879 40098 43396 7946 16265 29160 37539 50010
7360 50010 33795 -625 -7542 1176 -15499 4448 3112 -17792 -23329 -1095 22149 29061 3529
7347 3529 -29072 -31317 -16461 -10883 -26793 -22494 -6745 2609 6354 -7516 -6370 15456 35842
7334 35842 18354 12414 306 26262 32737 6420 1529 18671 2022 818 -4198 30406 28881
7321 28881 39755 55159 28590 1358 -30187 -34303 -13620 14048 13855 -6690 1770 -15858 16944
7308 16944 23587 -6385 2271 8300 910 20907 11160 15565 40181 55158 57261 41767 21559
$$ packed form
7399G6081o682j2477k6086k0431J1892p025J5782J784p002J4606J9525P283j8866
7386D8384l2010j7763j1543K1423j5807j1055L441J2428J6544Q173j973Q339K7703
7373E6284n892l1798J2413J0270o162Q764l781L298l5450Q319J2895Q379J2471
7360E0010j6215l4420o917Q718j6675J9947j336k0904n537K2234K3244O912k5532
7347C529l2601k245J4856N578j5910M299J5749R354L745j3870J146K1826K0386
7334C5842j7488n940j2108K5956O475k6317m891J7142j6649j204n016L4604j525
7321B8881J0874J5404k6569k7232l1545m116K0683K7668j93k0545Q460j7628L2802
7308A6944O643k9972Q656O029p390J9997r747M405K4616J4977K103j5494k0208
$$ plain form
7295 21559 37836 27676 19922 10635 -5036 -5665 7370 41152 53504 74546 87033 53603 -3328
7282 -3328 -25037 -10053 9825 28356 22449 6890 2575 33967 37540 42289 60058 56796 63497
7269 63497 74089 53983 44354 45413 31925 44732 40808 -975 -18291 -29985 -41027 -24602
7257 -24602 -6798 -13319 -2917 9096 20192 36404 41695 33747 16944 -8586 -8922 -6221 -15056
7244 -15056 -20731 -18695 -12772 -11537 -4333 28813 34446 22487 20263 4169 16753 57834 56895 71488
7230 71488 81103 73341 34805 36167 53174 33710 9960 5611 -27727 -20792 11549 2290 -17299
7217 -17299 -3810 -6613 -13618 -22284 -10370 -6774 -12529 1115 29384 27516 1678 -11156 -7097
7204 -7097 11037 24596 16482 5558 5620 9970 36120 32280 8633 25256 22140 32652 57477
$$ packed form
7295B1559J6277j0160p754r287j5671o29J3035L3782J2352K1042J2487l3430n6931
7282c328k1709J4984J9878J8531n907j5559m315L1392L573M749J7769l262O701
7269F3497J0592k0106r629J059j3488J2807l924m1783j7316j1694j1042J6425
7257b4602J7804o521J0402J2013J1096J6212N291p948j6803k5530l36K701q835
7244a5056n675K036N923J235P204L3146N633j1959k224j6094J2584M1081r39J4593
7230G1488R615p762l8536J362J7007j9464k3750m349l3338O935L2341r259j9589
7217a7299J3489k803p005q666J1914L596n755J3644K8269j868k5838j2834M059
7204g097J8134J3559q114j0924O2M350K6150l840k3647J6623l116J0512K4825
$$ plain form
7191 57477 52055 37583 45501 49699 39700 17790 -1587 -8022 -958 -8915 -17431 -13779 18912 13531
7177 13531 5861 -14507 -16679 1940 -14674 -20372 5039 11374 -11853 -1299 12246 30120 9305
7164 9305 -19550 -16013 -16647 -18795 -10043 22459 21694 9236 21880 -3701 -43849 -44773 -14970 15019
7150 15019 42008 32141 41751 26820 14102 9540 -15226 -15053 -15514 -12470 -4154 -10022 -18133 446
7136 446 -37767 -21453 7075 -9320 -27856 -42623 -43051 -35232 -28970 -3670 19514 16020 -14885
7123 -14885 -4477 12057 30601 40918 30422 6332 16361 40951 26537 8749 1029 -11259
7111 -11259 -32884 -24580 -11139 -7121 6253 248 -9296 -31764 -27490 12996 17339 45 18608
7098 18608 9912 -293 4888 -7203 1888 8557 24909 19871 7076 -2681 -11400 -11283 -4709 8288
$$ packed form
7191E7477n422j4472P918M198r999k1910j9377o435P064p957q516L652L2691n381
7177A3531p670k0368k172J8619j6614n698K5411O335k3227J0554J3545J7874k0815
7164I305k8855L537o34k148Q752L2502p65j2458J2644k5581m0148r24K9803K9989
7150A5019K6989r867R610j4931j2718m562k4766J73m61L044Q316n868q111J8579
7136D46l8213J6314K8528j6395j8536j4767m28P819O262K5300K3184l494l0905
7123a4885J0408J6534J8544J0317j0496k4090J0029K4590j4414j7788p720j2288
7111a1259k1625Q304J3441M018J3374o005r544k2468M274M0486M343j7294J8563
7098A8608q696j0205N181j2091R091O669J6352n038j2795r757q719J17O574J2997
$$ plain form
7084 8288 42579 30326 6703 -19284 -28046 -20627 -8628 36054 57265 69208 46036 25752
7072 25752 23515 29388 33411 21180 4933 1655 9443 12078 -1308 -12209 -14768 -13642 11117
7059 11117 4567 -22142 -16978 -28204 -10847 -11991 -16604 -14942 5928 15845 22816 4093 -5752
7046 -5752 -6917 -9887 -3406 19064 29875 16689 -4131 -16621 33257 40005 21572 -4127 -17366
7033 -17366 -19395 -26971 -20993 -50531 -28380 -4803 2019 -27867 -3998 14696 8743 12863 30363
7020 30363 34098 -4435 -46735 -31754 -5096 9671 16252 24343 15208 17086 23323 8076 -11833
7007 -11833 -30288 -24339 -10873 7667 10262 6854 -5405 -44802 -78425 -22702 29599 25738 28032
6994 28032 7013 10770 37001 77618 67763 39675 24071 49727 88015 83311 71631 46437
$$ packed form
7084H288L4291j2253k3623k5987q762P419J1999M4682K1211J1943k3172k0284
7072B5752k237N873M023j2231j6247l278P788K635j3386j0901k559J126K4759
7059A1117o550k6709N164j1226J7357j144m613J662K0870R917O971j8723r845
7046e752j165k970O481K2470J0811j3186k0820j2490M9878O748j8433k5699j3239
7033a7366k029p576N978k9538K2151K3577O822k9886K3869J8694n953M120J7500
7020C0363L735l8533m2300J4981K6658J4767O581Q091r135J878O237j5247j9909
7007a1833j8455N949J3466J8540K595l408j2259l9397l3623N5723N2301l861K294
6994B8032k1019L757K6231M0617r855k8088j5604K5656L8288m704j1680k5194
$$ plain form
6982 46437 27627 41751 53191 51715 42859 67034 81928 67750 55298 33399 5366 1671
6970 1671 12112 15013 13941 -22312 -41338 -23860 -16963 -15309 -8526 -2736 -16494 1892 17795
6957 17795 58208 50136 28623 5682 -12569 -20339 6915 18680 23374 26695 18511 -1935 -6139
6944 -6139 2382 16540 42963 34834 28357 33215 23506 14510 4027 15554 -249 -29122 -32866
6931 -32866 -27840 2497 14939 11056 -1230 21337 53274 59857 64129 65311 56995 66736 61603
6918 61603 33075 16785 30601 49145 50898 50335 8564 -7252 -14910 -10264 -6646 -26976 -8643
6905 -8643 2508 -4245 -36589 -41538 -29290 -13419 -13864 -6798 -3497 2690 -9971 -15041 -14814 -24957
6891 -24957 -14665 -15606 -29378 -32001 -10545 17138 32469 30919 19799 7373 21379 26988 10258
$$ packed form
6982D6437j8810J4124J1440j476q856K4175J4894j4178j2452k1899k8033l695
6970A671J0441K901j072l6253j9026J7478O897J654O783N790j3758J8386J5903
6957A7795M0413q072k1513k2941j8251p770K7254J1765M694L321q184k0446m204
6944f139Q521J4158K6423q129o477M858r709q996j0483J1527j5803k8873l744
6931c2866N026L0337J2442l883j2286K2567L1937O583M272J182q316R741n133
6918F1603k8528j6290J3816J8544J753n63m1771j5816p658M646L618k0330J8333
6905h643J1151o753l2344m949J2248J5871m45P066L301O187j2661n070K27j0143
6891b4957J0292r41j3772k623K1456K7683J5331j550j1120j2426J4006N609j6730
$$ plain form
6878 10258 28974 23477 8373 36712 15715 3624 -11913 -20837 -12647 -5614 -15005 -1137 -7982
6865 -7982 -8787 919 28008 15996 27080 6867 2125 -7488 -23373 -595 -19627 -35867 -8625
6852 -8625 -4558 -12505 -38487 -28842 3501 41409 46123 30299 20187 25947 -4737 -7592 24303
6839 24303 -1359 -30058 -8782 49337 72989 61906 55596 43208 4639 -8300 21992 44101
6827 44101 69033 59666 18479 11573 22362 29122 21449 29475 35464 25258 8480 -1516 4955
6814 4955 18113 8264 22512 42328 33886 25158 -4584 -14941 -13987 -26012 -16035 -4251 -18527
6801 -18527 -31309 -37258 -18538 12421 32851 34441 31797 19359 11263 -1401 1481 8757 11267
6788 11267 10845 4548 8648 16449 35866 29197 11298 -16659 -19823 338 16906 36039 23775
$$ packed form
6878A0258J8716n497j5104K8339k0997j2091j5537q924Q190P033r391J3868o845
6865g982q05R706K7089j2012J1084k0213m742r613j5885K2778j9032j6240K7242
6852h625M067p947k5982R645L2343L7908M714j5824j0112N760l0684k855L1895
6839B4303k5662k8699K1276N8119K3652j1083o310j2388l8569j2939L0292K2109
6827D4101K4932r367m1187o906J0789O760p673Q026N989j0206j6778r996O471
6814D955J3158r849J4248J9816q442q728k9742j0357R54j2025R977J1784j4276
6801a8527j2782n949J8720L0959K0430J590k644j2438q096j2664K882P276K510
6788A1267m22o297M100P801J9417o669j7899k7957l164K0161J6568J9133j2264
$$ plain form
6775 23775 1526 -21521 -40233 -13497 -7171 -27618 -59958 -46520 -29376 -38424 -23915 -523
6763 -523 -913 24 10319 10312 -10351 -18335 -16649 -14431 21899 46839 42145 40964 47960 32375 -10208
6748 -10208 -11132 5974 15384 38679 54400 14000 -47571 -32889 4421 14776 24768 42762 61146
6735 61146 65712 79649 60602 18737 -4842 -11955 9223 23530 30064 19624 20668 41120 70570
6722 70570 82089 60491 44835 38069 22138 25924 25980 4935 12673 13675 27711 31585 17853
6709 17853 32490 48201 40178 -8740 -29219 -39896 -54478 -30517 -23899 -15710 30188 20696 -1891
6696 -1891 -20329 -40122 -52215 -52952 -30357 -38910 -59699 -56701 -38604 -20017 474 -14992 -24130
6683 -24130 -12329 10061 27344 22544 10277 7614 17807 316 -27764 -48619 -55349 -32674
$$ packed form
6775B3775k2249k3047j8712K6736O326k0447l2340J3438J7144r048J4509K3392
6763e23l90R37J0295pk0663p984J686K218L6330K4940m694j181O996j5585m2583
6748a0208r24J7106R410K3295J5721m0400o1571J4682L7310J0355R992J7994J8384
6735F1146M566J3937j9047m1865k3579p113K1178J4307O534j0440J044K0452K9450
6722G0570J1519k1598j5656o766j5931L786N6k1045P738J002J4036L874j3732
6709A7853J4637J5711q023m8918k0479j0677j4582K3961O618Q189M5898r492k2587
6696a891j8438j9793j2093p37K2595q553k0789K998J8097J8587K0491j5466r138
6683b4130J1801K2390J7283m800j2267k663J0193j7491k8080k0855o730K2675
$$ plain form
6671 -32674 -4219 25922 29078 12632 18869 45605 38230 19783 -16716 -30422 -9823 19037
6659 19037 25456 34297 15294 -10158 -17686 -7916 3231 -6443 14608 27098 34363 58205 50013
6646 50013 33163 -1486 -13012 -4482 6107 19420 42753 23922 18742 9967 -3569 24873
6634 24873 43769 36805 59648 33049 30838 28937 9896 200 33058 48053 29062 20499 5126
6621 5126 6210 -11189 -42313 -32179 -29965 -8176 2131 -17330 -51478 -45151 -523 -17460 -43655
6608 -43655 -27101 13484 22615 -1661 -16042 -26218 -4214 13326 -4451 -6053 21274 26507
6596 26507 -2430 -2034 -10852 -16597 7925 -3890 -8946 15472 29905 23288 9791 20085 -8967
6583 -8967 894 16127 147 -6315 -18742 -20354 -3279 34934 43986 23588 -22702 -51193 -83394
$$ packed form
6671c2674K8455L0141L156j6446O237K6736p375j8447l6499j3706K0599K8860
6659A9037O419Q841j9003k5452p528R770J1147r674K1051J2490P265K3842q192
6646E0013j6850l4649j1526Q530J0589J3313K3333j8831n180q775j3536K8442
6634B4873J8896o964K2843k6599k211j901j9041r696L2858J4995j8991q563j5373
6621E126J084j7399l1124J0134K214K1789J0307j9461l4148O327M4628j6937k6195
6608d3655J6554M0585R131k4276j4381j0176K2004J7540j7777j602K7327N233
6596B6507k8937L96q818n745K4522j1815n056K4418J4433o617j3497J0294k9052
6583h967R861J5233j5980o462j2427j612J7075L8213R052k0398m6290k8491l2201
$$ plain form
6570 -83394 -119787 -85272 -32621 -15290 2058 -4064 -34957 -38490 -9611 -15365 -16172 -4481 14381
6557 14381 22604 8491 -21198 -14266 -24334 -33370 697 24694 17329 24757 23433 46297 54008
6544 54008 61778 45701 -1054 -14655 10777 -7224 -37291 -46073 -32611 -44994 -54459 -61728 -54096
6531 -54096 -31902 4105 -774 -6322 5070 13952 26964 32694 38645 48761 38726 -9592 -11722
6518 -11722 17105 12896 3216 723 -2327 616 605 7010 13254 16721 33977 68104 53624 6392
6504 6392 15438 35248 22825 5070 -15438 -18990 6367 29084 19088 -7356 -745 -2244 -17474
6491 -17474 -15279 2472 27327 60090 62205 52871 50736 22217 -3338 -41027 -35754 -26552 4050
6478 4050 38028 17113 15117 12199 -12321 -9015 -8479 -12373 -20640 -31394 -40798 -51323 -39565 -18636
$$ packed form
6570h3394l6393L4515N2651J7331J7348o122l0893l533K8879n754q07J1691J8862
6557A4381Q223j4113k9689O932j0068r036L4067K3997p365P428j324K2864P711
6544E4008P770j6077m6755j3601K5432j8001l0067q782J3462j2383r465p269P632
6531e4096K2194L6007m879n548J1392Q882J3012N730N951J0116j0035m8318k130
6518a1722K8827m209r680k493l050K943j1O405O244L467J7256L4127j4480m7232
6504F392R046J9810j2423j7755k0508l552K5357K2717r996k6444O611j499j5230
6491a7474K195J7751K4855L2763K115r334k135k8519k5555l7689N273R202L0602
6478D050L3978k0915j996k918k4520L306N36l894q267j0754r404j0525J1758K0929
$$ plain form
6464 -18636 -19186 -66387 -64382 -59384 -24998 12016 24615 35291 16579 16881 3599 -20826 -28505
6451 -28505 -37934 -34998 -34416 -19626 1713 6935 9479 -7272 -8426 8923 26029 40921 55408
6438 55408 69224 54763 44907 37148 13964 -7163 6535 3407 -8790 -18474 5456 -18750 -21584
6425 -21584 -15422 -553 -15858 -25768 -15102 -11321 -37618 -42659 -10981 18693 44595 13140 20715
6412 20715 38611 26851 37380 39434 36524 47402 54148 30473 25938 16037 -3680 -15816 -15484
6399 -15484 -17804 -19490 -19306 -1128 13886 20949 22958 944 -8086 -6616 -9797 -31677 -37387 -29431
6385 -29431 -28303 -36234 -49237 -68868 -47000 -55935 -84269 -58043 -4075 9518 23288 16351 2440
6372 2440 -27662 -27969 -16889 -26724 -28481 -6560 -1626 -5033 -1597 539 15382 -8095 -28767 -30160
$$ packed form
6464a8636n50m7201K005M998L4386L7014J2599J0676j8712L02j3282k4425p679
6451b8505r429K936N82J4790K1339N222K544j6751j154J7349J7106J4892J4487
6438E5408J3816j4461r856p759k3184k1127J3698l128j2197r684K3930k4206k834
6425b1584O162J4869j5305r910J0666L781k6297n041L1678K9674K5902l1455P575
6412B0715J7896j1760J0529K054k910J0878O746k3675m535r901j9717j2136L32
6399a5484k320j686J84J8178J5014P063K009k2014r030J470l181k1880n710P956
6385b9431J128p931j3003j9631K1868q935k8334K6226N3968J3593J3770o937j3911
6372B440l0102l07J1080r835j757K1921M934l407L436K136J4843k3477k0672j393
$$ plain form
6358 -30160 -45755 -51575 -42291 -50176 -22387 -4143 -12745 -14314 2834 17750 37644 37047 19842
6345 19842 -12682 6828 12287 -1020 -12103 -24118 -2469 4187 -8952 17074 16757 -9311 -14678
6332 -14678 1654 11600 -16498 -35838 -30309 -39928 -24564 20 -1070 5661 12854 11880 -5496
6319 -5496 -13150 338 264 1281 -20706 -34957 -44544 -60257 -49653 -36084 -12043 14994 5774
6306 5774 -6540 -20993 -38931 -21896 22428 26514 -304 -11337 -5280 -385 15290 30512 37722
6293 37722 24757 -10343 -34684 -16253 -24467 -41425 -52316 -63445 -39895 -8654 15167 12356
6281 12356 -3154 4978 -15481 -28568 -31902 -14181 14848 13876 332 -7537 -29262 -25451 -10799
6268 -10799 -27812 -36148 -13374 -6142 -20108 -8046 -1107 -16252 -9423 -12936 13330 28454 15089
$$ packed form
6358c0160j5595n820R284p885K7789J8244q602j569J7148J4916J9894n97j7205
6345A9842l2524J9510N459j3307j1083j2015K1649O656j3139K6026l17k6068n367
6332a4678J6332R946k8098j9340N529r619J5364K4584j090O731P193r74j7376
6319e496p654J3488p4J017k1987j4251r587j5713J0604J3569K4041K7037r220
6306E774j2314j4453j7938J7035M4324M086k6818j1033O057M895J5675J5222P210
6293C7722j2965l5100k4341J8431q214j6958j0891j1129K3550L1241K3821k811
6281A2356j5510Q132k0459j3087l334J7721K9029r72j3544p869k1725L811J4652
6268a0799j7013q336K2774P232j3966J2062O939j5145O829l513K6266J5124j3365
$$ plain form
6255 15089 17704 15504 1849 -5936 8963 16391 -5612 -10052 -28285 -22404 -30306 -7828 15187
6242 15187 21434 26727 19470 20636 14788 -6833 26642 50893 41225 41428 11134 -25960 -30488 -24787
6228 -24787 -16066 28459 10144 -13621 -1590 -9180 -13741 -10738 -10655 13974 12715 -18800 -25734 -36584
6214 -36584 -15510 -28845 -27077 -2066 6532 6417 20467 5490 -25 29198 56578 55168 18531
6201 18531 13606 11112 13052 18087 11147 -4609 -7011 -1167 14119 27883 12438 15511 27817
6188 27817 42118 39707 24759 -2199 11826 13126 637 15927 18113 2766 -18835 -21780 -13584
6175 -13584 -21435 -15653 -14318 -1024 5062 12943 42590 33187 39461 28413 20195 23600 9903 8915
6161 8915 -10102 -30465 -12707 -5979 -132 30401 32993 20130 25254 35848 28458 44015 57445
$$ packed form
6255A5089K615k200j3655p785J4899P428k2003m440j8233N881p902K2478K3015
6242A5187O247N293p257J166n848k1621L3475K4251r668K03l0294l7094m528N701
6228b4787Q721M4525j8315k3765J2031p590m561L003Q3K4629j259l1515o934j0850
6214c6584K1074j3335J768K5011Q598j15J4050j4977n515K9223K7380j410l6637
6201A8531m925k494J940N035o940j5756k402N844J5286J3764j5445L073J2306
6188B7817J4301k411j4948k6958J4025J300j2489J5290K186j5347k1601k945Q196
6175a3584p851N782J335J3294O086P881K9647r403O274j1048q218L405j3697r88
6161H915j9017k0363J7758O728N847L0533K592j2863N124J0594p390J5557J3430
$$ plain form
6148 57445 54153 40615 11026 -3218 -2008 5908 23119 38741 41617 5979 -25417 -29259 -13694
6135 -13694 -8376 -25042 -28565 -62576 -56501 -34230 -27556 -45317 -30478 -28924 -34460 -37404 -28548
6122 -28548 -43930 -60985 -50692 -23351 13542 14441 -11445 -41560 -35570 -26595 -36559 -40027 -66901
6109 -66901 -67268 -34227 -28966 -29291 -43001 -56318 -46691 -31558 -30961 -14321 6821 -10923 -20645 -11839
6095 -11839 1551 18132 24888 41432 43272 37412 1325 -14045 -10138 -4774 -39878 -42428 -11973
6082 -11973 12918 17985 37790 46604 33422 10776 -4406 8653 15655 18526 -6900 -22011 5682
6069 5682 22917 38930 37821 26499 2063 -6079 -7547 5755 18429 10994 3001 -7073 -11352
6056 -11352 -813 -149 -1482 3096 13431 31836 40123 25956 -21231 -26233 -23059 -45701 -43809
$$ packed form
6148E7445l292j3538k9589j4244J210P916J7211J5622K876l5638l1396l842J5565
6135a3694N318j6666l523l4011O075K2271O674j7761J4839J554n536k944Q856
6122b8548j5382j7055J0293K7341L6893Q99k5886l0115N990Q975r964l468k6874
6109f6901l67L3041N261l25j3710j3317R627J5133N97J6640K1142j7744r722Q806
6095a1839J3390J6581O756J6544J840n860l6087j5370L907N364l5104k550L0455
6082a1973K4891N067J9805Q814j3182k2646j5182J3059P002K871k5426j5111K7693
6069E682J7235J6013j109j1322k4436q142j468J3302J2674p435p993j0074m279
6056a1352J0539O64j333M578J0335J8405Q287j4167m7187n002L174k2642J892
$$ plain form
6043 -43809 -42844 -3282 16959 11353 8146 -9501 -6658 15045 7405 13431 15794 10415 21134 35532
6029 35532 15788 22243 19621 17149 29689 33687 17616 -2501 -922 -17462 -13345 21453 30258
6016 30258 36878 32309 45319 44996 9551 1853 11571 -19438 -50404 -62236 -65006 -37345 -4827
6003 -4827 -3904 9892 37238 37709 12688 13556 -1832 -25106 -14534 -21057 -42629 -44990 -35016 -36241
5989 -36241 -14661 10506 28541 25291 24446 -12464 -32001 -14715 -25941 -55481 -55769 -40899 -40817
5976 -40817 -26226 -13850 3709 29006 21648 11055 7777 14871 15411 9610 -2687 -8156 -13556
5963 -13556 -5082 -18046 -7074 -4613 -30364 -37186 -27564 -16325 3924 12508 -2824 -17124 -37483
5950 -37483 -20237 -5659 -28658 -11779 -4374 6564 12573 16631 23474 -12678 -30772 -7756 4865
$$ packed form
6043d3809R65L9562K0241n606l207j7647K843K1703p640O026K363n379J0719J4398
6029C5532j9744O455k622k472J2540L998j6071k0117J579j6540M117L4798Q805
6016C0258O620m569J3010l23l5445p698R718l1009l0966j1832k770K7661L2518
6003d827R23J3796K7346M71k5021Q68j5388k3274J0572o523k1572k361R974j225
5989c6241K1580K5167J8035l250q45l6910j9537J7286j1226k9540k88J4870Q2
5976d0817J4591J2376J7559K5297p358j0593l278P094N40n801j2297n469n400
5963a3556Q474j2964J0972K461k5751o822R622J1239K0249Q584j5332j4300k0359
5950c7483J7246J4578k2999J6879P405J0938O009M058O843l6152j8094K3016J2621
$$ plain form
5937 4865 1085 6410 5606 2748 1484 -38828 -35637 1828 16723 44604 38018 43081 22715 -10542
5923 -10542 -29862 19067 30616 38851 17814 -4967 -5340 -2136 -1138 -19711 -25703 9247 22581
5910 22581 28006 7078 10561 -11875 -5875 10305 8071 20995 24950 29349 38472 15960 13086
5897 13086 23504 11107 12591 26383 24107 10403 522 6406 14922 23772 42594 34494 29330
5884 29330 7785 -2684 32266 60513 52278 33026 3604 -8739 -15927 -19966 -29955 -28815 4834
5871 4834 8498 217 -19647 -34902 6278 27489 8594 9359 -15662 -24366 -22427 -18330 -18747 -28204
5857 -28204 -34411 -11063 9982 37721 48581 45189 26207 26825 20322 16004 34283 40422 30138
5844 30138 9780 -9298 2339 3138 5310 17547 -16515 -17852 -6183 7613 -3025 1646 17629
$$ packed form
5937D865l780N325q04k858j264m0312L191L7465J4895K7881o586N063k0366l3257
5923a0542j9320M8929J1549Q235k1037k2781l73L204R98j8573n992L4950J3334
5910B2581N425k0928L483k2436O000J6180k234J2924L955M399R123k2512k874
5897A3086J0418j2397J484J3792k276j3704r881N884Q516Q850J8822q100n164
5884B9330k1545j0469L4950K8247q235j9252k9422j2343p188m039r989J140L3649
5871D834L664q281j9864j5255M1180K1211j8895P65k5021q704J939M097m17r457
5857b8204o207K3348K1045K7739J0860l392j8982O18o503m318J8279O139j0284
5844C0138k0358j9078J1637P99K172J2237l4062j337J1669J3796j0638M671J5983
$$ plain form
5831 17629 31932 24941 18315 15759 -1934 -13077 -6400 4310 20472 -5334 -27143 -32053 -30392
5818 -30392 -39057 -57647 -49222 16355 26446 -6779 -15793 -11119 -14447 21115 49065 40032 -2167
5805 -2167 -21372 -428 30169 23252 5132 -17344 -31458 -46329 -66143 -44845 374 39790
5793 39790 37722 19606 8701 14178 5084 -18218 -30923 -29808 -17624 -15065 12910 17875 10746
5780 10746 -4431 3750 12909 22674 6031 5769 26294 5920 -12236 19290 32103 2049 6612
5767 6612 23903 4831 10647 24974 30975 25430 25668 7482 -20278 3324 3561 6376 15019 17618
5753 17618 -3254 -5337 312 19383 46170 55330 36067 24405 17167 7197 -13264 -17753 7982
5740 7982 32779 46166 32527 21829 11563 -13805 -10414 14681 22075 15219 13637 11002 33195
$$ packed form
5831A7629J4303o991o626k556j7693j1143O677J0710J6162k5806k1809m910J661
5818c0392q665j8590Q425O5577J0091l3225r014M674l328L5562K7950r033m2199
5805b167j9205K0944L0597o917j8120k2476j4114j4871j9814K1298M5219L9416
5793C9790k068j8116j0905N477r094k3302j2705J115J2184K559K7975M965p129
5780A0746j5177Q181R159R765j6643k62K0525k0374j8156L1526J2813l0054M563
5767F612J7291j9072N816J4327O001n545K38j8186k7760K3602K37K815Q643K599
5753A7618k0872k083N649J9071K6787R160j9263j1662p238r970k0461m489K5735
5740G982K4797J3387j3639j0698j0266k5368L391K5095P394o856j582k635K2193
$$ plain form
5727 33195 30483 32265 25316 13417 15652 39661 54514 42074 35506 28657 37138 44943 23425
5714 23425 17224 8145 9786 3893 20818 26846 9904 8608 13047 913 -9477 -37087 -18402
5701 -18402 -2587 10121 9836 2736 -1940 31681 65020 71562 31310 6824 2718 -20022 -2339
5688 -2339 -1039 -31409 -31331 -26863 -45765 -49693 -13298 21371 13056 -15254 -48432 -20926 -23713 -32004
5674 -32004 -8997 31760 27597 25548 13970 -22107 -38036 -7532 -22086 -29415 -9869 17042
5662 17042 194 -10497 14595 128 -10336 -14339 6733 30864 44378 36144 18208 20594
5650 20594 -11509 -21495 -1256 7433 27969 23762 6488 5975 11742 16658 -205 -33685 -29332
5637 -29332 -6557 -1853 -11660 -7788 11962 27421 17191 20587 28211 41370 58562 36252 5310
$$ packed form
5727C3195k712J782o949j1899K235K4009J4853j2440o568o849Q481P805k1518
5714B3425o201r079J641n893J6925O028j6942j296M439j2134j0390k7610J8685
5701a8402J5815J2708k85p100m676L3621L3339O542m0252k4486m106k2740J7683
5688b339J300l0370P8M468j8902l928L6395L4669q315k8310l3178K7506k787q291
5674c2004K3007M0757m163k049j1578l6077j5929L0504j4554p329J9546K6911
5662A7042j6848j0691K5092j4467j0464m003K1072K4131J3514q234j7936K386
5650B0594l2103r986K0239Q689K0536m207j7274n13N767M916j6863l3480M353
5637b9332K2775M704r807L872J9750J5459j0230L396P624J3159J7192k2310l0942
$$ plain form
5624 5310 -8640 -27515 -53600 -31703 -16194 -24133 -14309 -20462 -24643 -34671 -36147 -43724 -51259
5611 -51259 -60548 -42751 -54177 -47923 -35415 -10865 127 -3714 -26127 -38747 -46488 -35077 -24121
5598 -24121 -20898 -11399 -23532 -12977 -30594 -19491 -31967 -28261 -23553 11632 23872 -89 -5980
5585 -5980 -13856 -3558 -27356 -41976 -29707 -9549 -6513 -15037 -31585 -12476 13591 19003 40335
5572 40335 16843 35369 34716 13169 -4542 5267 -17696 -12828 -24346 -10998 -10548 -11297 -20695 -4032
5558 -4032 15482 11940 16349 13730 -17919 -6864 11104 12301 6007 4392 13206 8233 11427 27328
5544 27328 38683 49986 29904 25279 19300 21343 26399 9183 31465 24262 11394 10444 10655 4068
5530 4068 17337 22765 24267 4692 7561 15368 -3241 893 -2702 -3242 21300 29151 41282 50797
$$ packed form
5624E310j3950j8875k6085K1897J5509p939R824o153m181j0028j476p577p535
5611e1259r289J7797j1426O254J2508K4550J0992l841k2413j2620p741J1411J0956
5598b4121L223R499j2133J0555j7617J1103j2476L706M708L5185J2240k3961n891
5585e980p876J0298k3798j4620J2269K0158L036q524j6548J9109K6067N412K1332
5572D0335k3492J8526o53k1547j7711R809k2963M868j1518J3348M50p49r398J6663
5558d032J9514l542M409k619l1649J1055J7968J197o294j615Q814m973L194J5901
5544B7328J1355J1303k0082m625n979K043N056j7216K2282p203j2868r50K11o587
5530D068J3269N428J502j9575K869P807j8609M134l595n40K4542P851J2131R515
$$ plain form
5516 50797 36835 17126 16572 27062 27613 24431 28469 7634 14555 37154 26091 28644 20765 13599
5502 13599 15652 -3858 -105 13925 -11622 -37054 -14640 17908 51086 42319 20176 15117 -18024
5489 -18024 -40982 -31046 -14502 -10690 -8901 21895 42632 17177 5274 -6266 -3452 4540 -2308
5476 -2308 -6233 -10305 -1681 -4944 -32548 -48611 -28252 -20953 -35469 -43067 -32172 -21916 -15770
5463 -15770 -12384 -17729 -28379 -28250 -2563 15931 -420 5636 8826 11509 17012 -1102 -50114
5450 -50114 -80159 -69002 -35275 -24894 -21757 -13514 -28143 -39529 -30354 -14002 16206 22836 -10227
5437 -10227 -14024 -7792 803 -10897 36670 41310 23946 12557 12096 13986 5260 -5245 -18213
5424 -18213 -14619 -2004 1798 -21796 -19524 867 5791 -19550 -32878 -29954 -34471 -12042 24953
$$ packed form
5516E0797j3962j9709n54J0490N51l182M038k0835O921K2599j1063K553p879p166
5502A3599K053j9510L753J4030k5547k5432K2414L2548L3178q767k2143n059l3141
5489a8024k2958R936J6544L812J789L0796K0737k5455j1903j1540K814P992o848
5476b308l925m072Q624l263k7604j6063K0359P299j4516p598J0895J0256O146
5463a5770L386n345j0650J29K5687J8494j6351O056L190K683N503j8114m9012
5450e0114l0045J1157L3727J0381L137Q243j4629j1386R175J6352L0208O630l3063
5437a0227l797O232Q595j1700M7567M640j7364j1389m61J890q726j0505j2968
5424a8213L594J2615L802k3594K272K0391M924k5341j3328K924m517K2429L6995
$$ plain form
5411 24953 39348 15306 -4986 -3900 6012 -1557 -4681 -23182 -17194 21343 15843 200 -8862
5398 -8862 -16338 -28626 -20279 -21121 -33645 -30936 -26856 -14358 12240 21261 -1587 1658 4830 -1468
5384 -1468 -5974 6809 -19934 -54699 -63474 -47302 -44932 -45353 -19015 3072 27762 24767 17645
5371 17645 29189 -12980 -37398 -50980 -30233 -27123 -20217 -6993 5166 9453 -8743 -21304
5359 -21304 5190 12201 24914 17810 31553 38759 20257 -5259 -43685 -41126 -18035 -8899 -1287
5346 -1287 28847 24081 13400 42454 26921 12233 30430 48318 64992 64024 53948 40395 43910
5333 43910 39647 47626 30323 14949 4488 1838 29603 29883 4080 -13839 -3723 -3122 20089
5320 20089 -17327 -6099 27068 12054 9517 23751 22372 41863 27372 34520 61145 47433
$$ packed form
5411B4953J4395k4042k0292J086R912p569l124j8501N988L8537n500j5643r062
5398h862p476j2288Q347q42j2524K709M080J2498K6598R021k2848L245L172o298
5384a468m506J2783k6743l4765q775J6172K370m21K6338K2087K4690k995p122
5371A7645J1544m2169k4418j3582K0747L110O906J3224J2159M287j8196j2561
5359b1304K6494P011J2713p104J3743P206j8502k5516l8426K559K3091R136P612
5346a287L0134m766j0681K9054j5533j4688J8197J7888J6674r68j0076j3553L515
5333D3910m263P979j7303j5374j0461k650K7765K80k5803j7919J0116O01K3211
5320B0089l7416J1228L3167j5014k537J4234j379J9491j4491P148K6625j3712
$$ plain form
5308 47433 54195 32119 6186 -6403 -11399 5415 32719 48351 43203 31472 -1246 -16029
5296 -16029 13770 4205 14929 1865 7593 10865 4823 -16024 -12385 -12723 727 10014 3881 25132
5282 25132 8128 -28918 -19149 17653 11765 17330 22275 49435 20139 15856 5499 18233 5747
5269 5747 -18497 -14774 -34218 -19532 -14428 -59017 -44907 -17344 -4744 13457 -811 -10272 13674
5256 13674 34599 35237 38156 30963 24453 23108 9956 24579 25829 24517 -5171 -25044 -22668 19675
5242 19675 14044 -8016 -31666 -43784 -8145 37020 21949 206 19607 31624 15182 -2164
5230 -2164 19815 50451 57008 57559 24975 -8889 -7390 9192 23615 26141 792 31532 36990
5217 36990 25605 24550 38004 14187 5633 5244 957 17571 -162 -19360 18977 23300 8766
$$ packed form
5308D7433O762k2076k5933j2589m996J6814K7304J5632n148j1731l2718j4783
5296a6029K9799r565J0724j3064N728L272o042k0847L639l38J3450R287o133K1251
5282B5132j7004l7046R769L6802n888N565M945K7160k9296m283j0357J2734j2486
5269E747k4244L723j9444J4686N104m4589J4110K7563J2600J8201j4268r461K3946
5256A3674K0925O38K919p193o510j345j3152J4623J250j312k9688j9873K376M2343
5242A9675n631k2060k3650j2118L5639M5165j5071k1743J9401J2017j6442j7346
5230b164K1979L0636O557N51l2584l3864J499J6582J4423K526k5349L0740N458
5217C6990j1385j055J3454k3817q554l89m287J6614j7733j9198L8337M323j4534
$$ plain form
5204 8766 -245 1005 -9567 -12889 -3560 -24123 -21664 -5975 13014 14840 5144 9104 21917 13989
5190 13989 -12098 17203 19677 17672 18596 -13328 -16856 10678 7843 -17166 -18330 -34092 -33603 -2553
5176 -2553 4161 -17009 -20219 995 12346 -19467 -23425 4792 20610 16477 1473 4376 9212
5163 9212 9500 2309 6576 14862 11332 13589 20109 9255 13275 24531 21863 21421 36362 30186 11774
5148 11774 -9079 -2628 18723 -1051 -1027 6627 -4969 -3836 -4318 40152 52863 42373 30088
5135 30088 -8051 -31214 -29476 -38284 -31873 4090 15547 823 -14252 -23760 -1385 12910 6288
5122 6288 5220 16483 14840 -10000 -19225 -18020 -10559 835 -7500 4254 4739 7140 28694 35406
5108 35406 48420 43947 34326 -702 -33882 -27626 -16665 -20074 -39541 -37582 -2618 342 -18856
$$ packed form
5204H766r011J250j0572l322R329k0563K459J5689J8989J826r696L960J2813p928
5190A3989k6087K9301K474k005R24l1924l528K7534k835k5009j164j5762M89L1050
5176b553O714k1170l210K1214J1351l1813l958K8217J5818m133j5004K903M836
5163I212K88p191M267Q286l530K257O520j0854M020J1256k668m42J4941o176j8412
5148A1774k0853O451K1351j9774K4P654j1596J133m82M4470J2711j0490j2285
5135C0088l8139k3163J738q808O411L5963J1457j4724j5075r508K2375J4295o622
5122F288j068J1263j643k4840r225J205P461J1394q335J1754M85K401K1554O712
5108C5406J3014m473r621l5028l3180O256J0961l409j9467J959L4964K960j9198
$$ plain form
5095 -18856 -29352 -37187 -50023 -63407 -71466 -65364 -69904 -51924 -24138 -13141 -24913 -57108 -47718
5082 -47718 -31598 17526 32958 9975 4420 4385 3975 22597 38733 30780 17738 693 -6153
5069 -6153 14931 18962 1992 15834 51848 35710 -17528 -28206 -6873 9826 5745 6599 -17688
5056 -17688 -29773 -29185 -20867 -33465 -50229 -57553 -45701 -25625 12164 -3187 -19870 -30047 -22928
5043 -22928 -7207 -3239 -16718 -7964 -23229 -22644 -33662 -25884 8435 5756 -441 3566 -1544 12114
5029 12114 18023 38673 32119 23223 8529 11478 25315 24474 10252 5084 -134 14633 29023
5016 29023 52150 71773 56584 20834 2679 -13946 4615 29685 35117 11388 -8296 1102
5004 1102 1134 -2967 20413 25971 11963 3605 -12670 -31967 -20846 3758 -6345 11570 6728
$$ packed form
5095a8856j0496p835j2836j3384q059O102m540J7980K7786J0997j1772l2195R390
5082d7718J6120M9124J5432k2983n555l5m10J8622J6136p953j3042j7045o846
5069f153K1084M031j6970J3842L6014j6138n3238j0678K1333J6699m081Q54k4287
5056a7688j2085N88Q318j2598j6764p324J1852K0076L7789j5351j6683j0177P119
5043b2928J5721L968j3479Q754j5265N85j1018P778L4319k679o197M007n110J3658
5029A2114N909K0650o554q896j4694K949J3837q41j4222n168n218J4767J4390
5016B9023K3127J9623j5189l5750j8155j6625J8561K5070N432k3729j9684R398
5004A102L2m101K3380N558j4008q358j6275j9297J1121K4604j0103J7915m842
$$ plain form
4991 6728 4917 4859 5347 8612 22917 32003 17024 -1562 4974 507 9626 10581 -5085 -43210 -74014
4976 -74014 -69906 -31129 -20464 -26010 -24118 -22765 -24391 -14459 -23597 -26758 -19343 -34423 -43113 -46545
4962 -46545 -54393 -49697 -62141 -68265 -51442 -29247 -13260 -23017 -9277 22267 21648 33798 25509
4949 25509 4540 4266 11338 -1018 -22858 -59280 -65885 -47130 -49935 -55772 -31053 -19079 -26663
4936 -26663 -16799 -26384 -51947 -46681 -29939 -1333 27663 37813 23825 3867 16382 4281
4924 4281 -7515 5444 -38 -10023 -20122 -38332 -15424 -14207 -18958 -15615 -25745 -44651 -54007
4911 -54007 -44546 -34566 -30755 -44355 -26075 -15258 -7932 11374 42331 29512 -1205 15084 42307
4898 42307 34143 15892 17630 6781 -13444 -22364 7587 40433 42761 27686 7749 -1457 -26815
$$ packed form
4991F728j811n8M88L265J4305R086j4979j8586O536m467R119R55j5666l8125l0804
4976g4014M108L8777J0665n546J892J353j626R932r138l161P415j5080q690l432
4962d6545p848M696j2444o124J6823K2195J5987r757J3740L1544o19J2150q289
4949B5509k0969k74P072j2356k1840l6422o605J8755k805n837K4719J1974p584
4936b6663R864r585k5563N266J6742K8606K8996J0150j3988j9958J2515j2101
4924D281j1796J2959n482r985j0099j8210K2908J217m751L343j0130j8906r356
4911e4007R461R980L811j3600J8280J0817P326J9306L0957j2819l0717J6289K7223
4898D2307q164j8251J738j0849k0225q920K9951L2846K328j5075j9937r206k5358
$$ plain form
4885 -26815 -40222 -47445 -19803 -3480 -25656 -49996 -55740 -26284 -10569 -19913 -38350 -33852 -11515
4872 -11515 -2769 -1061 -36039 -34178 -11985 -5479 -6328 25912 25721 27967 30153 323 5496 16645
4858 16645 11650 18603 14155 1195 10614 12717 -1354 -11896 -6054 -9199 -24001 -22898 -30489 -42519
4844 -42519 -20550 11922 21088 13480 -10669 -35980 -38191 -47708 -57106 -59028 -46541 -13760 6339
4831 6339 9859 12269 42014 16933 -5625 -5073 -4998 -4683 -5773 -4627 -6005 17828 21240 11764 -10995
4816 -10995 -7885 5197 12789 6730 14031 2764 2051 2452 6376 -10937 -4242 -12916 -9055 17659
4802 17659 17959 19273 -92 -1204 608 -12782 -23970 -39505 -40080 -29981 -38792 -39240 -17884 -23832
4788 -23832 -41932 -62292 -45252 -11062 -10349 -24662 -20045 -15755 16955 52336 49217 51625 17753
$$ packed form
4885b6815j3407p223K7642J6323k2176k4340n744K9456J5715r344j8437M498K2337
4872a1515Q746J708l4978J861K2193O506q49L2240j91K246K186k9830N173J1149
4858A6645m995O953m448j2960R419K103j4071j0542N842l145j4802J103p591j2030
4844d2519K1969L2472R166p608k4149k5311k211r517r398j922J2487L2781K0099
4831F339L520K410K9745k5081k2558N52P5L15j090J146j378K3833L412r476k2759
4816a0995L110J3082P592o059P301j1267p13M01L924j7313O695q674L861K6714
4802A7659L00J314j9365j112J812j3390j1188j5535n75J0099q811m48K1356n948
4788b3832j8100k0360J7040L4190P13j4313M617M290L2710L5381l119K408l3872
$$ plain form
4775 17753 18210 31607 50413 37260 28388 37577 60782 28966 -7377 -15333 -15275 -9013 425 -2413
4761 -2413 86 13415 28773 45459 36226 47583 44778 48144 35518 30713 19846 4256 17353
4748 17353 -777 -326 3647 3657 58100 56153 16696 10456 -17339 -32745 -24136 -19016 -23132 -27734
4734 -27734 -24134 -7136 -6869 -9520 -22122 -50227 -51166 -33129 -29850 -32581 -12911 -2420 3461 11975
4720 11975 23917 36763 28534 21994 11490 18602 31284 26264 17888 -7326 -26939 -30753 -29414
4707 -29414 -27980 -41345 -41352 -13847 -5838 13392 9132 -35592 -62167 -35274 -20422 -30271 -23210 -29683
4693 -29683 -36055 -29492 -30763 -47691 -55233 -45640 -39198 -43655 -45046 -31550 -40419 -53086 -52390 -45545
4679 -45545 -58165 -40130 -24176 -21290 -536 -35474 -43359 -37182 -44612 -40359 -40997 -53601 -36310
$$ packed form
4775A7753M57J3397J8806j3153q872R189K3205l1816l6343p956N8O262R438k838
4761b413K499J3329J5358J6686r233J1357k805L366j2626m805j0867j5590J3097
4748A7353j8130M51L973J0N4443j947l9457o240k7795j5406Q609N120m116m602
4734b7734L600J6998K67k651j2602k8105r39J8037L279k731J9670J0491N881Q514
4720A1975J1942J2846q229o540j0504P112J2682n020q376k5214j9613l814J339
4707b9414J434j3365pK7505Q009J9230m260m4724k6575K6893J4852r849P061o473
4693b9683o372O563j271j6928p542R593O442m457j391J3496q869j2667O96O845
4679d5545j2620J8035J5954K886K0754l4938p885O177p430M253o38j2604J7291
$$ plain form
4666 -36310 -8950 2168 -1838 -3520 14356 -653 -28350 -3610 -12028 -11535 -13362 -7076 -20122
4653 -20122 -8435 453 -21431 -25008 -12901 -10233 9610 32220 36022 1513 -11359 145 -5667
4640 -5667 -6456 -17568 -10342 -15756 -28447 -44039 -53491 -38668 -15662 8984 33678 30300 35138
4627 35138 37419 49090 45222 3251 -8774 -10462 11969 18232 15641 26400 36873 27705 21825
4614 21825 20443 14103 6642 8350 19976 32698 30712 25600 39453 10928 4226 11031 8711 -11548
4600 -11548 -10455 29633 20300 -13643 -23047 -17281 -2115 12601 -8503 10109 40369 15792 -19933
4587 -19933 -4972 7078 8693 12859 4898 10729 -360 -7943 8004 -21793 -43147 -28493 -11284
4574 -11284 -18935 -35101 -24821 5696 3017 7914 37512 55806 47249 35585 10775 21466 39205
$$ packed form
4666c6310K7360J1118m006j682J7876j5009k7697K4740q418M93j827O286j3046
4653b0122J1687Q888k1884l577J2107K668J9843K2610L802l4509j2872J1504n812
4640e667p89j1112P226n414j2691j5592r452J4823K3006K4646K4694l378M838
4627C5138K281J1671l868m1971j2025j688K2431O263k591J0759J0473r168n880
4614B1825j382o340p461J708J1626J2722j986n112J3853k8525o702O805k320k0259
4600a1548J093M0088r333l3943r404N766J5166J4716k1104J8612L0260k4577l5725
4587a9933J4961J2050J615M166p961N831j1089p583J5947k9797k1354J4654J7209
4574a1284p651j6166J0280L0517k679M897K9598J8294q557j1664k4810J0691J7739
$$ plain form
4561 39205 30754 36397 35882 40994 40230 20906 20764 21517 433 -10449 -24878 -49161 -58350 -39062
4547 -39062 -3139 10213 -23475 -44232 -45507 -37102 -49240 -41142 -37468 -9346 -11537 -10049 -28699
4534 -28699 -49655 -26968 -3180 -13074 -3118 15725 22826 -18932 -26515 -20041 -13105 -1533 14243
4521 14243 16994 13139 17383 8716 -12381 -2860 7362 15847 13497 5145 -12645 673 30364
4508 30364 45360 21412 10998 -14058 -31876 -46887 -23401 19746 -4491 -12249 -17504 -10083
4496 -10083 -23390 -21489 -16387 -8887 -19425 -27329 -46137 -9294 32731 19920 3900 -2018 -15154
4483 -15154 -18300 5407 12558 13913 2022 -17841 -33352 -27884 -3650 9304 22442 24623 7637
4470 7637 -1087 8061 -12570 -19759 -17713 -7051 8049 10912 -2063 -6869 -23962 7711 41498
$$ packed form
4561C9205q451N643n15N112p64j9324j42P53k1084j0882j4429k4283r189J9288
4547c9062L5923J3352l3688k0757j275Q405j2138Q098L674K8122k191J488j8650
4534b8699k0956K2687K3788r894R956J8843P101m1758p583O474O936J1572J5776
4521A4243K751l855M244q667k1097R521J0222Q485k350q352j7790J3318K9691
4508C0364J4996k3948j0414k5056j7818j5011K3486M3147k4237p758n255P421
4496a0083j3307J901N102P500j0538p904j8808L6843M2025j2811j6020n918j3136
4483a5154l146K3707P151J355j1891j9863j5511N468K4234J2954J3138K181j6986
4470G637q724R148k0631p189K046J0662J5100K863j2975m806j7093L1673L3787
$$ plain form
4457 41498 16961 -26054 -29443 -12810 18025 8913 -645 7871 -17822 -22805 4879 -16211 -29098
4444 -29098 -22763 -28493 -20222 -7816 -1128 18216 20351 20825 31131 8065 -26195 -30270 -5917
4431 -5917 -13071 -22664 -19514 -14046 -6865 -13272 -13558 680 21387 -3763 -12621 -9424 -26380 -14075
4417 -14075 -4295 -5825 -10040 10875 29596 19634 -3361 8429 7335 -5813 -24945 -23352 -4445
4404 -4445 -5067 -11869 -12848 1119 18153 9660 18574 20088 14177 7068 -13276 -10718 -10338 -46011 -48165
$$ packed form
4457D1498k4537m3015l389J6633L0835r112r558Q516k5693m983K7684k1090j2887
4444b9098O335n730Q271J2406O688J9344K135M74J0306k3066l4260m075K4353
4431e917p154r593L150N468P181o407k86J4238K0707k5150q858L197j6956J2305
4417a4075R780j530m215K0915J8721r962k2995J1790j094j3148j9132J593J8907
4404d445o22o802r79J3967J7034q493Q914J514n911p109k0344K558L80l5673k154
$$ [...]
##END NTUPLES=NMR SPECTRUM
##END=
