##TITLE=316684	km 05812	adrs	fudan
##JCAMPDX= 6.0         $$ Bruker NMR JCAMP-DX V2.0
##DATA TYPE= NMR SPECTRUM
##DATA CLASS= NTUPLES
##ORIGIN= Bruker BioSpin GmbH
##OWNER= nmr
$$ XWIN-NMR		Version 3.5
$$ Wed Jul 12 08:25:46 2006 GMT Daylight Time (UT+1h)  MAYBRIDGE\nmr@NMR_250MHZ
##.OBSERVE FREQUENCY= 250.131544655141
##.OBSERVE NUCLEUS= ^1H
##.ACQUISITION MODE= SIMULTANEOUS (DQD)
##.ACQUISITION SCHEME= undefined
##.AVERAGES= 16
##.DIGITISER RES= 18
##SPECTROMETER/DATA SYSTEM= dpx250
##.PULSE SEQUENCE= zg30
##.SOLVENT NAME= DMSO
##.SHIFT REFERENCE= (INTERNAL, DMSO, 0, 16.522)
##AUDIT TRAIL= $$ (NUMBER, WHEN, WHO, WHERE, WHAT)
$$ ##TITLE= Audit trail, XWIN-NMR		Version 3.5
$$ ##JCAMPDX= 5.01
$$ ##ORIGIN= Bruker BioSpin GmbH
$$ ##OWNER= nmr
$$ C:/u/data/dgb/nmr/ADRS/15171/pdata/1/auditp.txt
$$ ##AUDIT TRAIL=  $$ (NUMBER, WHEN, WHO, WHERE, WHAT)
(   1,<2006-01-24 11:58:46.65 +000>,<MAYBRIDGE\nmr>,<NMR_250MHZ>,
      <created by zg, POWCHK disabled, PULCHK disabled
       configuration hash MD5:
       62 19 C7 07 E1 42 D1 B7 37 6C 3D D0 77 39 F9 E6
       data hash MD5: 64K
       5F 86 43 61 7E BA 63 75 0C 08 0B 26 C0 EA 93 AE>)
(   2,<2006-01-24 11:59:01.29 +000>,<MAYBRIDGE\nmr>,<NMR_250MHZ>,
      <Start of raw data processing
       ef LB = 0.3 FT_mod = 6 PKNL = 1 SI = 32K 
       data hash MD5: 32K
       4E CA 7F EB EC 99 CD BF 0A 6E A4 7C 44 F6 E6 8D>)
(   3,<2006-01-24 11:59:05.54 +000>,<MAYBRIDGE\nmr>,<NMR_250MHZ>,
      <apk 
       data hash MD5: 32K
       D6 17 C0 8F 8D F8 70 26 24 D3 26 44 09 B2 EB 8D>)
(   4,<2006-01-24 11:59:08.75 +000>,<MAYBRIDGE\nmr>,<NMR_250MHZ>,
      <abs ABSG = 5 
       data hash MD5: 32K
       66 E8 99 F0 42 7D 43 5D 9D 75 36 57 9F 9A 63 39>)
$$ ##END=
$$ 
$$ hash MD5
$$ 1E 74 BE 42 69 AF D2 86 94 9E 91 0A 75 CA 97 3B
##$RELAX= 
##$RELAX= 
##$RELAX= 
##$RELAX= 
##$RELAX= 
##$RELAX= 
##$RELAX= 
$$ Bruker specific parameters
$$ --------------------------
##$DU= <C:\Restored>
##$EXPNO= 15171
##$NAME= <ADRS>
##$PROCNO= 1
##$TYPE= <nmr>
##$USER= <dgb>
##$AMP= (0..31)
100 100 100 100 100 100 100 100 100 100 100 100 100 100 100 100 100 100 
100 100 100 100 100 100 100 100 100 100 100 100 100 100 
##$AQSEQ= 0
##$AQ_mod= 3
##$AUNM= <au_zg>
##$AUTOPOS= <9 >
##$BF1= 250.13
##$BF2= 250.13
##$BF3= 250.13
##$BF4= 250.13
##$BF5= 500.13
##$BF6= 500.13
##$BF7= 500.13
##$BF8= 500.13
##$BYTORDA= 1
##$CFDGTYP= 0
##$CFRGTYP= 5
##$CHEMSTR= <none>
##$CNST= (0..31)
1 1 145 1 1 1 1 1 1 1 1 1 1 1 1 1 1 1 1 1 1 1 1 1 1 1 1 1 1 1 1 1 
##$CPDPRG= <>
##$CPDPRG1= <>
##$CPDPRG2= <>
##$CPDPRG3= <>
##$CPDPRG4= <mlev>
##$CPDPRG5= <mlev>
##$CPDPRG6= <mlev>
##$CPDPRG7= <mlev>
##$CPDPRG8= <mlev>
##$CPDPRGB= <>
##$CPDPRGT= <>
##$D= (0..31)
0 1 0 0 0 0 0 0 0 0.06 0 0 0 0 0 0 0.0002 0 0 0 0 0 0 0 0 0 0 0 0 0 0 
0 
##$DATE= 1138103919
##$DBL= (0..7)
120 120 120 120 120 120 120 120 
##$DBP= (0..7)
150 150 150 150 150 150 150 150 
##$DBP07= 0
##$DBPNAM0= <>
##$DBPNAM1= <>
##$DBPNAM2= <>
##$DBPNAM3= <>
##$DBPNAM4= <>
##$DBPNAM5= <>
##$DBPNAM6= <>
$$ [...]
##$SUBNAM7= <"">
##$SUBNAM8= <"">
##$SUBNAM9= <"">
##$SW= 20.6930455092707
##$SWIBOX= (0..15)
0 0 3 0 0 0 0 0 0 0 0 0 0 0 0 0 
##$SW_h= 5175.983436853
##$TD= 65536
##$TD0= 1
##$TE= 294.16
##$TE2= 300
##$TE3= 300
##$TEG= 300
##$TL= (0..7)
0 120 120 120 120 120 120 120 
##$TP= (0..7)
150 150 150 150 150 150 150 150 
##$TP07= 0
##$TPNAME0= <>
##$TPNAME1= <>
##$TPNAME2= <>
##$TPNAME3= <>
##$TPNAME4= <>
##$TPNAME5= <>
##$TPNAME6= <>
##$TPNAME7= <>
##$TPOAL= (0..7)
0.5 0.5 0.5 0.5 0.5 0.5 0.5 0.5 
##$TPOFFS= (0..7)
0 0 0 0 0 0 0 0 
##$TUNHIN= 0
##$TUNHOUT= 0
##$TUNXOUT= 0
##$USERA1= <user>
##$USERA2= <user>
##$USERA3= <user>
##$USERA4= <user>
##$USERA5= <user>
##$V9= 5
##$VALIST= <valist>
##$VCLIST= <CCCCCCCCCCCCCCC>
##$VD= 0
##$VDLIST= <DDDDDDDDDDDDDDD>
##$VPLIST= <PPPPPPPPPPPPPPP>
##$VTLIST= <TTTTTTTTTTTTTTT>
##$WBST= 1024
##$WBSW= 4
##$XGAIN= (0..3)
0 0 0 0 
##$XL= 0
##$YL= 0
##$YMAX_a= 365649
##$YMIN_a= -377121
##$ZGOPTNS= <>
##$ZL1= 120
##$ZL2= 120
##$ZL3= 120
##$ZL4= 120
##$ABSF1= 16.522
##$ABSF2= -4.171173
##$ABSG= 5
##$ABSL= 3
##$ALPHA= 0
##$AQORDER= 0
##$ASSFAC= 0
##$ASSFACI= 0
##$ASSFACX= 0
##$ASSWID= 0
##$AUNMP= <proc_1d>
##$AZFE= 0.1
##$AZFW= 0.1
##$BCFW= 0
##$BC_mod= 0
##$BYTORDP= 0
##$COROFFS= 0
##$CY= 12.5
##$DATMOD= 1
##$DC= 0
##$DFILT= <>
##$DTYPP= 0
##$F1P= 14.0000005364418
##$F2P= -0.99999901652339
##$FCOR= 0.5
##$FTSIZE= 32768
##$FT_mod= 6
##$GAMMA= 0
##$GB= 0
##$INTBC= 1
##$INTSCL= 1
##$ISEN= 128
##$LB= 0.3
##$LEV0= 0
##$LPBIN= 0
##$MAXI= 10000
##$MC2= 0
##$MEAN= 0
##$ME_mod= 0
##$MI= 0
##$NCOEF= 0
##$NC_proc= -3
##$NLEV= 6
##$NOISF1= 0
##$NOISF2= 0
##$NSP= 0
##$NTH_PI= 0
##$NZP= 0
##$OFFSET= 16.522
##$PC= 1
##$PHC0= 230.2668
##$PHC1= 6.585468
##$PH_mod= 1
##$PKNL= yes
##$PPARMOD= 0
##$PSCAL= 4
##$PSIGN= 0
##$REVERSE= no
##$SF= 250.13
##$SI= 32768
##$SIGF1= 0
##$SIGF2= 0
##$SINO= 400
##$SIOLD= 32768
##$SREGLST= <1H.DMSO>
##$SSB= 0
##$STSI= 32768
##$STSR= 0
##$SW_p= 5175.98343685301
##$SYMM= 0
##$S_DEV= 0
##$TDeff= 65536
##$TDoff= 0
##$TI= <Analysis number 999999
Compound Code 99
Book Reference 9
Project Code 9>
##$TILT= no
##$TM1= 0
##$TM2= 0
##$TOPLEV= 0
##$USERP1= <user>
##$USERP2= <user>
##$USERP3= <user>
##$USERP4= <user>
##$USERP5= <user>
##$WDW= 1
##$XDIM= 32768
##$YMAX_p= 566220212
##$YMIN_p= -340979
$$ End of Bruker specific parameters
$$ ---------------------------------
##NTUPLES= NMR SPECTRUM
##VAR_NAME=  FREQUENCY,     SPECTRUM/REAL,   SPECTRUM/IMAG
##SYMBOL=    X,             R,               I
##VAR_TYPE=  INDEPENDENT,   DEPENDENT,       DEPENDENT
##VAR_FORM=  AFFN,          ASDF,            ASDF
##VAR_DIM=   32768,         32768,           32768
##UNITS=     HZ,            ARBITRARY UNITS, ARBITRARY UNITS
##FACTOR=    0.157963299565203, 1,           1
##FIRST=     4132.6476996994, 0,             0
##LAST=      -1043.33573715361, 0,           0
##MIN=       -1043.33573715361, -340979,     0
##MAX=       4132.6476996994, 566220212,     0
$$ Real data points
##PAGE= N=1
##DATA TABLE= (X++(R..R)), XYDATA
$$ [...]
18631B689k0735j3282J8620R528J8466K256J0417n886l7224n9754j561N7925J5083
18618c458N580K0680J770J289J2405O211j8245q928j0072k7248n333J6737K9017
18605B0405k509J871p689K5582M080k0932k6202m0368p997K6870K5718K932Q866
18592A0627j3335j746Q974J8040k1074j8898M2745R429k2520J9320J6679m6538
18580A703j3015M5353K8410l2988j3585j8153l4431q03k6133j036L5175K8464
18568a039j6775p253n552J7539L2275k1372O258q514R19j2571k7283j1293J025
18555e3636j0076Q342j358l656K8362N4379P634j5291q686n1254k1829j5614R901
18542g2782K1134J5454K5657m895k2189k6475j8150J5943L5908J4404J76J6559
$$ y = [2689, -18046, -31328, -12708, -3180, 15286, 17542, 27959, 22073, -15151, -74905, -76466, -18541, -3458, 2122, 22802, 24572, 25861, 38266, 44477, 26232, 17304, 7232, -20016, -25349, -8612, 20405, 17896, 19767, 12078, 37660, 41740, 20808, -5394, -45762, -53759, -26889, -1171, 1761, 10627, -2708, -4454, 4520, 22560, 1486, -17412, 25333, 34762, 12242, 31562, 48241, 1703, -11312, 34041, 62451, 29463, 15878, -2275, -36706, -37509, -63642, -64678, -29503, -1039, -17814, -25067, -30619, -13080, 19195, -2177, 4081, -4433, -3514, -16085, -43368, -54661, -53636, -63712, -55370, -56728, -60384, -32022, 22357, 29991, 14700, 6014, -45240, -67069, -82683, -72782, -51648, -36194, -10537, -15432, -37621, -64096, -82246, -66303, -30395, -15991, -15815, 744]
18530G44m136n452R632k186r093l5357K8575N3707J5782j3115J3728M435m2333
18517A4931n4505r13l575L236j080N997J5890J525k463M1950k6013m4904r854
18504e9778j5115J5370o780J8386R490K9355Q849J8281L188K658K7905j4197k6827
18491A0785l5461j5107K1297m044j2083P123J3893K3105L1242K5517j4939k8144
18479B3184l2797k7057l5411L466K0100J3290k0469O97L4471M850k4348j1556
18467e1580l2688J1198L9603J8342K3573j15k4579j1698K8209M4884P069k0804
18455C1414k3305o046N330m606j9082j8766J0738R843k2240l033J2813j0824k60
18442c8024J3808J9856K8713k4706k6086j9751l1959J9523K8540J6763J1431j2288
$$ y = [744, -3392, -8844, 788, -1398, -10491, -45848, -17273, 36434, 52216, 39101, 52829, 57264, 14931, -39574, -40487, -44062, -40826, -41906, -35909, -20019, -18494, -20957, 20993, -5020, -49924, -59778, -74893, -59523, -66303, -47917, -38427, -9072, -223, 18058, 21246, 23904, 51809, 37612, 10785, -24676, -39783, -18486, -22530, -34613, -27490, -13597, 9508, 40750, 66267, 51328, 23184, -9613, -36670, -72081, -68615, -48515, -35225, -55694, -54997, -20526, -15676, -40024, -51580, -84268, -73070, -33467, -15125, 8448, 8333, -16246, -27944, 265, 45149, 52218, 31414, 8109, 2063, 7393, 2787, -16295, -35061, -24323, -14480, -36720, -39753, -26940, -37764, -38024, -24216, -4360, 24353, -353, -26439, -46190, -78149, -58626, -30086, -13323, -1892, -14180]
18430a4180j7368L220j4174J0374J4128K8957J9595L3277K5853l8575l8213K7948
18418D0842J0178j9927K5930k8078l3372j6915P480p925R479M3715J7195J785
18406E0387m2040j1050L1916j6419l1812J7566m968J3415j2544k4170o92m563
18394c4974J2468K3726L1258J6759K0534l0952k9828M42j8253j402L0013M379
18382B4170j4483j1481J260l1027j795L1526K0581j3920j0559M66l273M989L1470
18369B7924R064n702n235j9009J151j247J8326o712j5720L4620J0435R942L0960
18356H8797K3211K7324M5974M7819M7780P4853J08883J57265J22832K3062q3390
18345F84410j30687j35735j16776q1412k8723k1642l8308l957J823n1579m7411
$$ y = [-14180, -31548, -28328, -42502, -32128, -18000, 10957, 30552, 63829, 89682, 51107, 12894, 40842, 51020, 31093, 57023, 28945, -4427, -21342, -13862, -21787, -12308, 31407, 48602, 50387, 8347, -2703, 29213, 12794, -19018, -1452, -6420, 6995, -5549, -29719, -30411, -34974, -22506, 1220, 32478, 49237, 69771, 38819, 8991, 9433, -8820, -10222, 19791, 24170, 9687, -1794, -534, -31561, -33356, -1830, 18751, 4831, -5728, -5262, -8535, -3546, 27924, 36988, 31286, 26051, 7042, 8193, 6946, 25272, 18560, 2840, 37460, 47895, 57837, 88797, 112008, 139332, 185306, 233125, 280905, 355758, 464641, 621906, 744738, 767800, 684410, 553723, 417988, 301212, 219800, 191077, 169435, 131127, 127170, 128993, 77414, 30003]
18334C0003k3655J6535P464p125j7120L269j5793j9956j1736Q107K1800N1956
18322D3749l5398l0884P005J6047n332o816j2236K1485n768k3385J3355K4875
18310F697J5023R287L271n058j9717l046j9136O178L1614Q883k0514j5564l277
18297e359l2692j4691M0303P452n74M04k4171j5303L0189L6722M686m6967J905
18284a8096k198J8705k1702r984K4171J659J7964K9789j6220m2666Q775l6647
18272d6450k6083J0385K8507M688j8342q147K9021P344j70p507J3832L1849n50
18259A8377J1881J9068P920J0465l7015q661o678j8356m1211j6050O040J9736
18247c4484K4627p635n606L1488k8075n690L0046q495j1446L9866J339p082l0936
$$ y = [30003, 6348, 22883, 30347, 23222, 6102, 9371, -6422, -26378, -38114, -30007, -8207, 43749, 8351, -22533, -15528, 519, -4813, -11629, -23865, -2380, -8148, -31533, -18178, 6697, 21720, 31007, 34278, 29220, 9503, 6457, -12679, -6501, 25113, 33996, 13482, -2082, -5359, -38051, -52742, -12439, -4987, -5561, -5157, -29328, -44631, -14442, 22280, 26966, -20001, -18096, -20294, -1589, -23291, -33275, -9104, -7445, 10519, 40308, 24088, -18578, -9803, -46450, -72533, -62148, -33641, -28953, -47295, -55442, -26421, -19077, -19247, -26754, -12922, 18927, 18377, 30258, 49326, 57246, 67711, 30696, 22035, 15357, -2999, -44210, -60260, -54220, -34484, -9857, -17492, -23098, 8390, -19685, -25375, 4671, -3824, -15270, 24596, 25935, 18853, -12083]
18234a2083k0665J2845l900j7809N650K4461K4625j3835j1552j3662l0690K5133
18222c1482k534Q686l688j8283J2131K7816N367n445j4701M506J1948j0197K487
18209a3389k106P889K333j2820J4097j8813M1027L5158l8986l9722k394k235P664
18196b2297L780L4918L0252j9213k3197M920P129j2949k976l316J2338j9710n937
18183a6258K92R303q877n989j2727K8017r25k9589j7342l46j2459K5064L952Q640
18169b9244P832l754Q552J2418J6387K0339j9760j9149j5084O543k3439K2919
18157a5440N1480K0582P744J5614l0337j5185m907K4492k87q462k5337k0537k3747
18144b4327K2168j3028N854J7165J1360j0696k7991J5507O775k4837k1845J6338
$$ y = [-12083, -32748, -19903, -23803, -41612, -35962, -11501, 13124, -711, -12263, -25925, -56615, -31482, -34016, -25330, -29018, -47301, -35170, -7354, -1987, -7432, -22133, -17627, -5679, -15876, -13389, -15495, -7606, -5273, -18093, -3996, -22809, 18218, 53376, 14390, -25332, -27726, -29961, -22297, -18517, 16401, 46653, 27440, 4243, 9163, 16292, 3343, 367, -2949, 9389, -10321, -16258, -15966, -6663, -15540, -21529, -34256, -6239, -7164, -36753, -54095, -54441, -66900, -41836, -37884, -29244, -21412, -25166, -16614, -4196, 12191, 32530, 12770, -6379, -21463, -14920, -38359, -15440, 36040, 56622, 64366, 79980, 49643, 34458, 29551, 54043, 53756, 45294, 19957, -580, -24327, -2159, -15187, -9333, 7832, 19192, 8496, -19495, -3988, 2787, -22050, -43895, -27557]
18132b7557J0801K054k3839j0619j3734r949N1806J0495j0845M021J5885j358
18120b839j2054K5813J7960l340R95L68k756j7308J2134Q373l7414M074L1362
18107B5368j3688O051K0573k5053j1607j4380j3018j9303K6171O085O133p59J9514
18094A2087k661K03O011J6082k5570l0057p502M358k6490j8704L8819K5912m824
18081a2336k4868J7949Q943R966K4478k2712r880k9367P497K3664N148P170K4014
18068B9666J5965j0957O154k2354m3967k27J9688m284J2563L6864p376j6393K1857
18055C7199p930l0120j3823n760j2334J7181Q686j5831j7011l829m671M3431J3796
18042H984K3460n212l6141J8249k3135l4571q520K549J9483K2531K4669K2702
$$ y = [-27557, -16756, -14702, -38541, -49160, -62894, -72843, -21037, -10542, -21387, -17366, -1481, -2839, -14893, 10920, 28880, 25540, 26535, 26903, 24147, 6839, 18973, 27346, -10068, -5994, 25368, 11680, 17731, 38304, 13251, 1644, -12736, -25754, -45057, -18886, -12801, -6668, -7427, 12087, 9426, 9629, 15640, 31722, 6152, -23905, -31407, -27049, -53539, -72243, -33424, -7512, -12336, -37204, -19255, -10312, -346, 24132, 1420, -8460, -37827, -30330, -6666, -1518, 5652, 29666, 45631, 34674, 40828, 18474, -25493, -25720, -6032, -10316, 2247, 39111, 31735, 15342, 37199, 29269, -851, -14674, -20434, -32768, -15587, -6901, -22732, -39743, -43572, -48243, -4812, 8984, 32444, 27232, -8909, 9340, -13795, -48366, -56886, -54337, -34854, -12323, 12346, 35048]
18030C5048p107l4639J5857L061m060J572K6557R185l1051l3917k5876j2862k5624
18017h3856Q004M5189J885K8645J1472N642j2875J0211J8017j1860l016M781k578
18004A9661K8380j0347j7935R88R42O906l764j7448J229J3852R222j2894j963
17991A6829Q743K3522K617l950n789m3299j4372K2329J7931J5137K752q873k4078
17978I499l7221j2839K352J1952J5251K187j7918M781p841p971O231J981o940
17965c6496K097j5731K5238L4356J761m0045k7584R617J2266L0868k176j658J3431
17952E944k2268J2489K9218m126n26K2454m2220j3801m95J1346Q544L9615j4776
17939C1398n736j0435j2419j228J6800K556j686J7083O089j3196j9750j0359L729
$$ y = [35048, 27941, -6698, 9159, 12220, 8160, 9732, 36289, 45474, 14423, -19494, -45370, -58232, -83856, -75852, -30663, -28778, -133, 11339, 16981, 4106, 14317, 32334, 20474, 17458, 22239, 19661, 48041, 37694, 19759, 20747, 21689, 28595, 24831, 7383, 8612, 22464, 31686, 18792, 16829, 25572, 49094, 51711, 47761, 41972, -1327, -15699, 6630, 24561, 39698, 42450, 33577, 9499, -27722, -40561, -38209, -26257, -11006, -8819, -26737, -21956, -29797, -37768, -31537, -29556, -36496, -34399, -50130, -24892, 9464, 11225, -28820, -56404, -46787, -34521, -3653, -5829, -7487, 5944, -16324, -3835, 25383, 21257, 20731, 43185, 965, -12836, -13331, -1985, 6559, 46174, 31398, 25662, 15227, 2808, 1580, 18380, 20936, 19250, 36333, 42422, 29226, 9476, -883, 2846]
17926B846J5765n456l2023L932J6978l248k4827j7210J2428P714k155L2165j5485
17913h576k3133Q279J9848L351l3717j6592k5143P340n282Q291M7633R838q983
17900a6846M914L709J7643k455p075l0604r30M4803N548j6047k3593k04j921j6006
17886c9064q657J9697j7354M097J2780K3204o093M739K3360k1746j1564j2604
17874b9205k5519l92L1584J081L6657n070j6323n75k7941J4156L2836k265k7978
17861a8954n741K3507J0115r410K2111L5589J1509k0675k2689j0178m547j6480
17849e843J8816L825O987j8929j262n616J1632M5749j0019k9498L680P357N831
17836C2710j3392j2138j6973j6876l348L1756P657O627r93j0856p05p727K0704
$$ y = [2846, 18611, 13155, -18868, -14936, 2042, -1206, -26033, -43243, -30815, -23101, -25256, 6909, -8576, -31709, -23430, -3582, -231, -33948, -50540, -75683, -68343, -73625, -65334, -17701, -7863, -16846, -11932, -8223, 9420, 6965, -110, -30714, -31644, 13159, 18707, 2660, -20933, -21137, -23058, -39064, -47721, -28024, -45378, -41281, -28501, -5297, -11390, -6651, 16709, -5037, -16601, -29205, -54724, -55116, -23532, -22451, 14206, 9136, -7187, -7762, -35703, -21547, 11289, 9024, -18954, -24695, -1188, 8927, -483, 21628, 57217, 68726, 48051, 25362, 15184, 10637, -5843, 12973, 16798, 23785, 4856, 3594, -2022, 9610, 55359, 45340, 15842, 19522, 26879, 32710, 19318, 7180, -9793, -26669, -30017, 1739, 9396, 16023, 15030, 4174, 3469, -4258, 16446]
17823A6446K4362P043J4418n521k0685l2920N734L284P085l4615L759K5305M0952
17810E4647K9584j2107o4058j5201L9940j2349k0380j6042k308J480r105J5540
17798a0359n823q565L3277K9440k5703m4156k7879Q6J9807K5226l991p789J3713
17785a2716k0306k0938j857J103K6684J6888l0682k039j2178K882N953K3300K4905
17772I99R338K4792O722j521k5365m8666j8205P204P03J5161J6851l477P27N050
17758i687j0276n537K8886M0194J7291r105k4150r944r352l105K7737L372j1280
17745B5044J203L320n164j0306n069l0981j5046J0753K5200n206n55J424J5388
17732A0005K0186p714r596N189k6628p911P455M8308Q274k6667K205j9704K0509
$$ y = [16446, 40808, 47851, 62269, 56748, 36063, 3143, 8877, 12161, 19246, -15369, -11610, 13695, 54647, 84231, 72124, 8066, -7135, 32805, 20456, 76, -15966, -18274, -16794, -25899, -10359, -16182, -24747, 8530, 37970, 12267, -31889, -59768, -59682, -39875, -14649, -18640, -26429, -12716, -33022, -53960, -55817, -54714, -28030, -11142, -41824, -43863, -56041, -53159, -47206, -23906, 999, 10337, 35129, 41851, 40330, 14965, -33701, -51906, -44702, -43999, -28838, -11987, -15464, -14737, -9687, -19963, -25500, 3386, 43580, 60871, 51766, 27616, 17672, 8320, 5215, 32952, 36324, 25044, 26247, 29567, 24403, 14097, 9028, -21953, -36999, -26246, -1046, -6252, -6807, -5383, 10005, 30191, 22477, 12881, 18070, -8558, -16469, -9014, 39294, 47568, 20901, 23106, 3402, 23911]
17719B3911L554J920l2529o954J8126k5971m729K6039J3345J1212l378N489q174
17706B1861k6913o435O630k6819p533M119J6705J2368j532l20O261j5861K513
17693a4956j5152J0836k978o106J9715M2980j0915k1502m5214j5443j3545L3904
17681c8376N784J5714Q400K8207O12j8273o658K9398k8416M256m527k7164n406
17668c6449K3227O181k4055j87L5004p241J136k915k716O603k0626J4944K597
17655d497r36j7040L4430J9969j4801K1415n553n713k9359j8454j2711j107R173
17642b5184M429j3606L971J3872L3672o238j3958M479j190k9172l1657K3151J6653
17629b0778o035Q533j096J9312K1477Q921M784L952k9081j7864m830j7889j5629
$$ y = [23911, 27465, 29385, -3144, -10098, 8028, -17943, -22672, 3367, 16712, 27924, 24546, 30035, 21861, -5052, -11487, -4857, -31676, -39209, -35090, -18385, -6017, -7549, -7869, -1608, -17469, -14956, -30108, -19272, -22250, -28356, -8641, 34339, 23424, 1922, -43292, -58735, -72280, -38376, -32592, -16878, -8478, 19729, 20341, 2068, -4590, 24808, -3608, 648, -3879, -31043, -36449, -13222, -7041, -31096, -31283, 3721, -3520, -2384, -5299, -8015, -1412, -22038, -7094, -4497, -5433, -22473, 11957, 31926, 17125, 38540, 32987, 27274, -2085, -20539, -33250, -34357, -25184, -20755, -34361, -30390, -16518, 17154, 10916, -3042, 1437, 247, -28925, -60582, -37431, -20778, -26813, -18280, -19376, -64, 21413, 30334, 35118, 39070, 9989, -7875, -12705, -30594, -46223]
17616d6223j9794j123K2254L7871j1690J3919q640j2353K3880J5776p826l8965
17604c2914l7936j1605M1056K2320O98j6202r805Q996J0886P205K4124K5506o833
17591B5496n450k603J914j1470j4367K906N272n409K172Q901k812l623l2239L104
17577b8208J4618j086o439K856O073M563q165J8871j047K274k5276n424K8210
17564A820K6960P075p631k8186K2265j801K331k3054n513R584r612j9682k1009
17551d6453K7843o80J1805J2299j1448p085K3447J7718j586m7252k0500j5025
17539e6917K7339J8359m100J5129K5186m492r096L524P610m306j991j2605j7837
17526a4197M507J7224L77J7978J2279K1640j5103k9221j3Q656J0129Q890l8597
$$ y = [-46223, -66017, -67140, -44886, -7015, -18705, -4786, -13426, -25779, -1899, 13877, 6051, -32914, -70850, -82455, -41399, -19079, -18381, -34583, -44388, -35392, -24506, -17301, 6823, 32329, 25496, 20046, 17443, 19357, 7887, -6480, -3574, 1698, -3711, -1539, 7362, 4550, 927, -31312, -28208, -13590, -14676, -21115, -18259, -12186, -7623, -15788, 3083, 2036, 4310, -20966, -26390, 1820, 28780, 35855, 28224, 38, 22303, 20502, 22833, -221, -5734, 3850, -5762, -25444, -46453, -18610, -19290, -7485, 4814, -6634, -13719, 9728, 27446, 25860, -21392, -41892, -56917, -29578, -11219, -15319, -190, 24996, 20504, 11408, 14932, 22542, 18236, 16245, 3640, -14197, -9690, 7534, 7911, 25889, 38168, 59808, 44705, 15484, 15471, 24127, 34256, 43146, 4549]
17513D549j872m432j3597R623m902j0697m867J0367l794J13R595K0165M547j7752
17499b954j0183p346k5223M773j1447m2717R98N0844L6161J1702J9636K1835M255
17486E0334j3042k4105l3043m151R534K9466L683k3893j715L9411J0106m5416
17474b831k5688j4559p531O207m297N600M805K920J5284j0096J7881J1454j0799
17461a1650K83Q161j2720k1367j5580K477L1537k9154%K4773L451k3226Q762J3874
17447b0379k6743J6818J222J2175j4877R665K1512L6116k573J122J2940k6476
17435B0522k9643j2489J4259N961K5664Q293j0207Q147l813k8494j9634j9814
17423d1248J3893M433p883J0555j5093K112K3445J4833J8617j3330j1779M440
$$ y = [4549, 2677, -1755, -15352, -5729, -10631, -21328, -26195, -15828, -19622, -19509, -9914, 10251, 14798, -2954, -13137, -20483, -45706, -40933, -52380, -95097, -94099, -43255, -7094, 4608, 24244, 46079, 50334, 37292, 13187, -19856, -24007, -14473, 14993, 18676, -5217, -6932, 32479, 42585, -2831, -28519, -43078, -50609, -44402, -48699, -43099, -38294, -35374, -20090, -30186, -12305, -851, -11650, -11367, -3206, -15926, -37293, -52873, -50396, -18859, -48013, -48013, -23240, -19789, -43015, -34253, -20379, -47122, -30304, -29082, -16907, -31784, -22119, -607, 35509, 32936, 34058, 46998, 20522, -9121, -21610, -7351, -1390, 24274, 32567, 22360, 30507, 26694, -1800, -21434, -41248, -27355, -22922, -30805, -20250, -35343, -33231, -9786, 5047, 23664, 10334, -1445, 2995]
17411B995O321q604J8427J0001q532J032p774j2321J5664J2568l5055j5939o569
17398b7786j9012j624K5020J885P374O30O19M01j1611k52j1344j2283Q158N948
17384c3877K4195r433j8573k3335Q960L6158J2003R933Q455m416L867j4302j034
17371a399J0424J7361J2649Q31k2229k1081j0867r297J4900R733N116o899q047
17358h805j5377K0582j341l216o294p803K5522J3864j0640J1830J6323N858N48
17345D1051N693l5480j0165j0532j8286l7852J3023l374j7020K96J3207J7547
17333d1892J2361Q272j6448J0133L431l108J96N155m315M873j8313O179K4318
17320i158L2514L500k4731R212j4133j613P559k2667O841O043L5773J2802P016
$$ y = [2995, 9316, 712, 19139, 29140, 20608, 21640, 13866, 1545, 17209, 29777, -5278, -21217, -27786, -46798, -48422, -23402, -21517, -14143, -13513, -12894, -12493, -24104, -24356, -35700, -47983, -39825, -33877, -9682, -19115, -37688, -61023, -52063, -15905, -3902, 6031, 14486, 10070, 13937, -365, -1399, 9025, 26386, 39035, 39866, 17637, -3444, -14311, -23608, -8708, 1025, 6141, -758, -8805, -24182, -3600, -4941, -8157, -14451, -22254, 3268, 17132, 6492, 18322, 34645, 40503, 41051, 46744, 11264, 1099, -9433, -27719, -65571, -52548, -55922, -72942, -72646, -59439, -41892, -29531, -21259, -37707, -27574, -24143, -27251, -27055, -21900, -26215, -21342, -39655, -33476, -9158, 23356, 26856, 2125, 11337, -2796, -4409, 3150, -19517, -12676, -6633, 29140, 41942, 48958]
17307D8958j0146j9482j0464m14k2769R201J4638L479K952j3466P329M904l677
17294A1043O180j9268j6230j304m2703L7372K5174L359o763K537P804m937j3229
17281a0965K2943j878m0382r734M753n563L5019K0940j8396l207p733L7956K3888
17268D7641k2071J160l1913j5640J2695j297l40j7423n324K0310j3275k9652O932
17255d8197L8977J3078n468J1896k834j0192N818n760j6253j4275l1469p326K1332
17242e0673J0610J4203J048l7125o463M5176j3231k604n18k4686R879k337J3425
17229d3296J3890J3562J6017j1367k8044l2746L210K331K7658J8791K4725K0977
17217B5708N358K4160J9612j5904j9872j055K4315J433l808p064m4154j074J3234
$$ y = [48958, 38812, 19330, 8866, 8452, -14317, -5116, 9522, 13001, 15953, 2487, 9816, 14720, 11043, 17223, -2045, -18275, -19579, -62282, -24910, 264, 3623, -3140, -603, 7201, 2264, -10965, 11978, 10100, -30282, -40016, -35263, -40826, -5807, 15133, -3263, -6470, -14203, 23753, 47641, 25570, 26730, -5183, -20823, -8128, -9425, -9765, -27188, -32512, -12202, -25477, -55129, -48197, -9220, 3858, -1610, 10286, 7452, -2740, 3078, -2682, -18935, -33210, -64679, -72005, -50673, -40063, -25860, -24812, -61937, -68400, -23224, -36455, -39059, -39577, -64263, -54384, -56721, -43296, -29406, -15844, 173, -11194, -39238, -71984, -68774, -66443, -38785, -19994, 4731, 25708, 31066, 55226, 74838, 58934, 39062, 38007, 62322, 63755, 59947, 52883, 8729, 7655, 20889]
17204B0889j1848J2603K1592J1601j6078j7705j3531j4210J0075O663L201r698
17192C554k3813J413l60k4547J9662M8333k5729j7426Q586j2469J223j4429J0208
17179b5794M4162J7576j5288p387n0158k0065K9525K5596L6161r270j7370j6619
17167h931o942k4260j8363K1627k193l967J7609R129r042l1432j7931L7528L9398
17154B230K2350M4262n79k5349l3616q418L2605P009k1101l7601J3555K3777K3825
17141D2949O624l6760m0216k6933o387K0626J1645P208m67K5220m613k8693j0320
17128d0117O16K2649K6792j4789J4590j2428Q840o992q895P953J3913J6268k3621
17115D779j8175L848J1886p928P00j5426k8559L732l521L0472m989j724N428J0048
$$ y = [20889, 9041, 21644, 43236, 54837, 38759, 21054, 7523, -6687, 3388, 10051, 13252, 3554, -20259, -18846, -19206, -43753, -24091, 24242, -1487, -18913, -10327, -22796, -21573, -36002, -25794, 18368, 35944, 20656, 13269, -36889, -56954, -27429, -1833, 34328, 25058, 7688, -8931, -15873, -40133, -58496, -36869, -39062, -43029, -25420, -16291, -25333, -56765, -74696, -37168, 2230, 24580, 68842, 68263, 42914, 9298, 880, 33485, 40494, 19393, -18208, -4653, 19124, 42949, 49573, 12813, -27403, -54336, -60723, -40097, -28452, -21244, -21711, 3509, -1104, -29797, -40117, -39501, -16852, 9940, -4849, 9741, -2687, 6153, -839, -9734, -1781, 12132, 28400, 4779, -13396, -9548, 2338, -5590, -4890, -20316, -48875, -45143, -48664, -18192, -23181, -24905, -19477, -9429]
17101i429J5659M09M897J5777j7191L779J6m72r558j0760k0531k1239O463N1679
17087I499M1991m1394k6028J3152k0341k9990j7437J0732L0428L5303K486l0887
17075b2486P882l8151k8124P09L5032M3279p990l3300J4642J8983N1179K8691
17063G0346o5215n3149M343P109m746J5340K1474l67r757K5632n009Q886j5183
17050b96L900k7398j9705q275j1122Q578J9225M2882m208j8105l6378j7787L6058
17037c2631M70J5402n753k4053j1552o518j4322J5332L5049K6899P804j8038l4068
17024d5979R366K1566k7995O235L1122M750k0534k1317k538Q756J535J2461N478
17011a7094j3880M8411J1018j6834L2254J276m02k1971R743j286n604j4245K7764
$$ y = [-9429, 6230, 6639, 11536, 27313, 10122, 13901, 13917, 13445, 3887, -6873, -27404, -48643, -42180, 9499, 51490, 10096, -15932, -2780, -23121, -53111, -70548, -59816, -29388, 5915, 8401, -22486, -14604, -52755, -80879, -80170, -45138, -1859, -9849, -43149, -28507, -9524, 41655, 70346, 5131, -48018, -43675, -36566, -41312, -25972, -4498, -4865, -14622, 11010, 6001, 14887, -296, 3604, -23794, -43499, -51774, -62896, -54318, -35093, 7789, 3581, -14524, -50902, -68689, -32631, -32161, -16759, -22512, -46565, -58117, -64635, -78957, -63625, -28576, -1677, 6127, -11911, -45979, -36613, -15047, -43042, -36807, -5685, -935, -21469, -42786, -45324, -36568, -35033, -22572, -17094, -30974, 17437, 28455, 11621, 43875, 45151, 44749, 22778, 32521, 31235, 25631, 11386, 39150]
16998C9150J1970o5498n5057Q059N5003J1074k951O84N893p832j0936O696L183
16985e62l366k6661Q195M9284l248k2067J931o864M341l278j7925m003P208J8830
16971A815P331r408j3876j672L1168j333q641j6405r824m156K145l454M531M6549
16957B4770O066k6806j6691N012j2756m950K8633O416k9342j9788L8809N0369
16945D9742O642l0313k3574N691j1503l3920p602j4772N495Q071J960m9k038K7263
16931a8907L2574l972n0233k431J8198m97J2770j0657K7352R018k7660J5268M4266
16918D5089P539j9387j200k9546k5707j6303k8971o270J7123K3704K9516J0133
16906E720j5730k2880j1826K27N723N833K9318K4448J7986k053j382k0575J3238
$$ y = [39150, 51120, -14378, -69435, -61376, -6373, 4701, 1750, 2434, 8327, 495, -10441, -3745, -562, -3928, -30589, -22394, 26890, 23642, 1575, 3506, -3358, 983, -2295, -20220, -24223, -17015, 1815, 9146, -262, -14138, -15810, 15358, 14025, 5384, -11021, -20845, -25001, -22856, -26310, -21779, 24770, 30836, 4030, -12661, -7649, -20405, -25355, 3278, 9694, -19648, -39436, -627, 49742, 56384, 26071, 2497, 8188, -3315, -37235, -44837, -59609, -54114, -46043, -44083, -44132, -46170, -18907, 13667, 9695, -40538, -42969, -24771, -25268, -12498, -23155, 4197, 13215, -14445, 823, 45089, 52628, 33241, 32041, 2495, -23212, -39515, -68486, -74756, -57633, -33929, -4413, 5720, -10010, -32890, -44716, -44489, -38766, -32933, -3615, 20833, 38819, 36766, 35384, 14809, 28047]
16893B8047k5030k535J4208p211J7833L5925k6706n9543k5538L8039M635k4387
16881c2263p905j6256R401L0189Q679l902L1171J6277O615M530j9227j6400j6694
16868e785j2283M8889K7159l390l0616l1675K26k2859N936q496L871Q950K6290
16855F217J7266k0239j4353j0950o362j1101j7865J9786J6056r673K3200j630
16843i648r424m6637l2809j2952L6306K1071J1096K1584J8708n51k0159n754J0129
16830a9040j0618k709L226O198q355r665k046M564j2884L0550K2334j7651P308
16817h788M4591J6837m91q889J1169p057J5032Q497k6558j6169j8058Q621p126
16804A1611k2814O852o17k0155k561J4401J2333O230J6327N826J0740j5346k0738
$$ y = [28047, 3017, 482, 14690, 7479, 25312, 61237, 34531, -25012, -50550, -12511, -7876, -32263, -40168, -56424, -47023, -16834, -8155, -12057, 19114, 35391, 42006, 46536, 27309, 10909, -5785, -18068, 30821, 57980, 54590, 23974, -7701, -7475, -30334, -24398, -32894, -29023, -20073, 6217, 23483, 3244, -11109, -22059, -28421, -39522, -57387, -37601, -21545, -31218, -8018, -9648, -19072, -65709, -98518, -111470, -75164, -54093, -42997, -21413, -2705, -3256, -23415, -29169, -19040, -29658, -32367, -29141, -22943, -31298, -40963, -43009, -38445, -51329, -20779, 1555, -16096, -8788, 35803, 52640, 52149, 43260, 54429, 47372, 62404, 70901, 44343, 28174, 10116, 18737, 11611, -11203, -4351, -4968, -25123, -27684, -13283, -950, 5280, 21607, 27433, 38173, 22827, 2089]
16791B089l1766K125r708o49K9737j0274j213P12j9036K2071K2881n572j4383
16778a2986K0922R185P949M486K328J563q242J8944K0765l5205k1792J6755j4151
16765A0521q223j1313K049Q87n425o788P68k2202j0946L818L0644r297o213K2615
16751i105m817j0328K0256R789r191J4319K0084J1707j1042k8060J6188n930J165
16738A5035n621J780l046n513m998m663K5647L856k2962j6889J5706K0221N627
16725B4180R252k488k9419j394L172k3592r921J7011J6067J4332j9126J9897n735
16712A2236R566K7783J2843k1073p735j3851j0182n654l418K4877J3245M052r337
16699C3352j9811k2411r91j4500p599K587J2794M259O024J1647k6906j7781J1602
$$ y = [2089, -29677, -27552, -37260, -37909, -8172, -18446, -19659, -18947, -37983, -15912, 6969, 1397, -12986, 7936, 17121, 25070, 29556, 31884, 33447, 25205, 44149, 64914, 29709, 7917, 24672, 10521, 2298, -9015, -6966, -6079, -11504, -18292, -17524, -39726, -50672, -46854, -16210, -25507, -31720, -9105, -13922, -24250, -3994, 5795, -3396, 10923, 31007, 42714, 31672, 3612, 19800, 13870, 15035, 9414, 11194, 8148, 2635, -2363, -7026, 18621, 22477, -485, -17374, -1668, 18553, 24180, 33432, 30944, 1525, 131, 3303, -20289, -30210, -13199, 2868, 17200, -1926, 17971, 12236, 21802, 49585, 62428, 41355, 33620, 19769, 9587, 3933, 515, 25392, 38637, 42689, 33352, 13541, -8870, -9861, -24361, -31960, -29373, -16579, -12320, -6296, 5351, -21555, -39336, -27734]
16686b7734J0524J1289K623R990L691k2048p266j1504J0233J3047Q804M579o305
16673g7m3384l8791q254M7450J9689k2996L6974O298n323N992q480k108k2031
16660c5041k5460J1385Q486K232j6078P499P551M3185l919K5171r694l0895M1
16647a5537j7097r175k7363j243M1328J2438k975J3637n857j2874r85j1J9498
16634f216P685j9253k9177j9080j1593K6179J9117J6257J4059j4229k7732M6650
16622B667K7898p9L2025n137k8763J2577k7701l2151k128R159j1756o161o092
16609c5642k2064J5599K6180L6718n488j6855m07k5562j2220K6578K3566J6248
16597B6651J3732l056K994p62k8090j8783M278M797j6848K797r136q315M0305
$$ y = [-27734, -17210, -5921, -3298, 6692, 10383, -11665, -18931, -30435, -20202, -7155, 1649, 6228, -77, -43461, -82252, -90506, -43056, -23367, -46363, -9389, -3091, -8414, -2422, -10902, -13010, -35041, -60501, -49116, -40630, -38398, -54476, -46977, -39426, 3759, -160, 25011, 15317, -15578, -15537, -32634, -41809, -69172, -70415, -29087, -16649, -19624, -5987, -11844, -24718, -25703, -25714, -6216, 1469, -17784, -46961, -66041, -77634, -51455, -32338, -16081, -2022, -16251, -43983, 2667, 30565, 30486, 62511, 57374, 28611, 41188, 13487, -18664, -20792, -11633, -23389, -29550, -35642, -57706, -42107, -15927, 20791, 15303, -1552, -1959, -27521, -39741, -13163, 10403, 26651, 40383, 37327, 40321, 39559, 11469, -7314, -3036, 1761, -15087, -12290, -21426, -29741, 10564]
16584A0564k9732p833j4046K380L0987K4828R832k3628n208Q549p19j9027J684
16571a1369M8577J858l2309k5311j3301K1919j1890k422j1551J3069K0546j593
16559c777l2066O263k065J4117j2070k9259M175K9821K3461J1985Q392O88K0583
16546D0248l582j8776l3159o707O898K1047K1000j3293j1754j1089l403L505k5569
16533c4634q422Q692L06N984J2117M548j5272l795L0650J01k1084p741K9504r805
16519h851k0240J0465M663j3927J2568L709k2376K934R013M629J066R766K0209
16506A3628k312j8194r882L3129o118l3676k6071Q11K2527p278J2766R896R588
16493a186j9931L435j9306j7289L7539J4508L638K029P418K0459Q88O134r11k5901
$$ y = [10564, -19168, -27001, -41047, -38667, -7680, 17148, 26980, 3352, -1856, 6693, 5974, -13053, -11369, 37208, 39066, 6757, -18554, -31855, -9936, -21826, -24248, -35799, -22730, -2184, -3777, -35843, -29580, -31645, -17528, -29598, -58857, -54682, -24861, -1400, 10585, 18977, 19665, 40248, 36666, 17890, -15269, -21976, -15078, 5969, 26969, 13676, 1922, -9167, -12570, -9065, -34634, -43056, -34364, -34058, -28074, -15957, -11409, -26681, -30476, 174, 275, -20809, -28550, 954, -8851, -29091, -18626, -13963, -27890, -15322, -11613, -33989, -31055, -22042, -17413, -16347, -6581, 13628, 11316, -6878, -16760, 16369, 10251, -23425, -49496, -48685, -26158, -33436, -20670, -10774, -1186, -21117, -17682, -36988, -54277, -16738, -2230, 1408, 3437, 10855, 31314, 32202, 38336, 37425, 11524]
16479A1524K49k9569P417J849k0023n840K3297Q170j1126m291r451K2048J6378
16466A0632j1029J1934K040l6463r163J9304Q387k3894P572L0736L461Q694j3090
16453I121j2820j7096q19l5550j9717K4534J1566j3838j3499L4143J5144n839
16441b4670l44J0103l9858j1559j6773J4994L3125K4705J3714m830j2180P771
16429e802Q276j2940j111J4299R399K05l621n686M638K6847L3023m0047l3950
16416f470K0799K0743J3009j036j9498l3690r589J2905J4208J2006k0164k9464
16404b6241k8062p181J3082L1508K3122o681K000n039j1695J1390K85O524L6203
16391C9215k1228m039K4885J538k4433N417j0574J3298K3658k4188j8677j0659
$$ y = [11524, 11773, -17796, -10379, -8530, -28553, -34393, -11096, -2926, -14052, -18343, -27794, -5746, 10632, -397, 11537, 13577, -22886, -32049, -12745, -4358, -28252, -20680, 10056, 13517, 22211, 9121, -3699, -20795, -21614, -57164, -76881, -52347, -40781, -54619, -68118, -33975, -18831, -24670, -25014, -14911, -54769, -66328, -83101, -68107, -34982, -10277, 3437, -1393, -13573, -5802, 2474, -10466, -11577, 2722, 12121, 12326, 8705, 3019, 7657, 34504, 67527, 27480, -6470, 14329, 35072, 48081, 47045, 27547, -6143, -15732, -2827, 11381, 23387, 3223, -26241, -54303, -61484, -48402, -16894, 6228, -453, 1547, -3492, -15187, -3797, -3512, 3012, 39215, 17987, 13948, 38833, 40371, 15938, 21355, 10781, 24079, 47737, 23549, 4872, -5787]
16379e787J956R309j4262j959J4400J5471K040j2443j0003L6002M905m5308j8417
16366b4096L638K549J9633K892j4479Q708K9086l792j379J9266R540n040k0918
16353B5608j0454j4278k3027j6577P669J8260M144J0985j3378j867J1720M1406
16341D0211K1908j8119k0719n9649l645J8332R713K3343j5039k9614L110j833
16329c2001j1529L3730J2197J2149M395K0776j1640j815J9783k4917j9904J5868
16317A7092P77j151K090k3219j5761k5127k9694L7525L7422K7299J1679p605r302
16304B2025j4633J6947j805k1063j0864J3205N575K6814M561k2569j3536J0350
16292A5007L4417o92l1449q675j0193L1643q845J6602K528M989j6289j6787J8206
$$ y = [-5787, -3831, 5478, -8784, -10743, 3657, 19128, 21168, 8725, -1278, 34724, 39629, -5679, -24096, -20458, -17909, 1724, 4616, -9863, -1155, 27931, 24139, 22760, 42026, 51566, 46526, 25608, 15154, 876, -22151, -38728, -31059, -12799, -8655, 2330, -11048, -12915, -1195, 40211, 62119, 44000, 23281, -36368, -40013, -21681, -11968, 11375, -3664, -33278, -30168, -32001, -43530, -9800, 2397, 14546, 18941, 39717, 28077, 26262, 46045, 21128, 1224, 17092, 17869, 16718, 18808, -4411, -20172, -45299, -74993, -37468, -46, 27253, 38932, 31327, 22025, 7392, 24339, 22534, 1471, -9393, 3812, 9387, 36201, 40762, 18193, 4657, 15007, 49424, 48732, 17283, 8608, -1585, 30058, 21213, 37815, 40343, 45332, 29043, 12256, 30462]
16279C0462J390L023l786J5262j2333j2253L0957j8949k6759p671J0938j0108
16267A73N994l4281O02L3553N817J491q70k3654q843K4130p866q567k1608j4032
16253d7961m377j288L3981L8016k109l4604j021L153J7900j910Q79K3343j0783
16240A3219j4045q434m112n939j7182r149J206Q335J6039K6726m53r201R936M746
16226A1692J4475l915k6289j2341K0583J2460O162k434L446j4284j5886j3591
16214a9922k5501J7065L910K3818K07n4164L651K2769K0217j096K5436n043k2543
16201a1196j3802J803K4681J0518O022J9985j8662l1272n888k1506l086J1202
16189c1201j1341j8245J2083K2001L8734J5204j7468q29M259n814Q028K2352l558
$$ y = [30462, 31852, 34875, 31089, 46351, 34018, 21765, 52722, 33773, 7014, -657, 10281, 173, 6167, -28114, -27512, 6041, 11858, 13349, 12479, -11175, -20018, 4112, -3754, -12321, -33929, -47961, -52338, -53626, -19645, 18371, 16262, -18342, -19363, -16210, 1690, -220, 659, 24002, 13219, -826, -9260, -13372, -19311, -36493, -45642, -44436, -36101, -20062, 6664, 6211, -2990, 6946, 11692, 26167, 22252, -4037, -16378, 4205, 16665, 22827, 20393, 23839, 9555, -6331, -19922, -45423, -28358, -24448, -630, -423, -54587, -50936, -28167, -7950, -9046, 16390, 11347, -11196, -24998, -23195, 1486, 12004, 18026, 38011, 19349, -11923, -17811, -39317, -42403, -31201, -42542, -60787, -48704, -26703, 12031, 27235, 9767, 8938, 13197, 7383, 15411, 37763, 34205]
16176C4205j8017j2140J1711k835L810L989o845L620n366j3263j5121l2496k459
16163e1207K5136O766n826j8299k1796Q669P652r087K3838P971L543K1425o214
16150g429l35L7369R462l2971k3408j9411K3744J0912m07l8552l5098J0582o343
16137g1885J4259J6976J0397O282J0142Q604j3464k1943J7496J4075Q127q188
16125i122l289O593j8516J2476J0034N117L135J5604K0394J3247j0135n1090j0038
16112a5590j4085M10K2507J6015k0540r135K5123K3323j1836p509k4182o239J4735
16099g003N6072Q940j271Q094j824k4677k549K308k5125j0743j0727J9043K3618
16086C4156p456k8273R59j08L110k6156P160J3017j8589j816M532J4328K8134
$$ y = [34205, 16188, 4048, 15759, 12924, 16734, 20723, 13878, 17498, 12132, -1131, -16252, -48748, -51207, -26071, -19305, -25131, -43430, -65226, -56557, -48905, -57992, -34154, -26183, -22640, -1215, -7429, -7764, 29605, 39067, 6096, -17312, -36723, -12979, -2067, -2474, -41026, -76124, -65542, -71885, -57626, -40650, -30253, -23971, -13829, -5225, -18689, -40632, -23136, -9061, -934, -9122, -12411, -5818, -24334, -11858, -1824, 3293, 6428, 22032, 42426, 55673, 45538, -5552, -15590, -29675, -29265, -6758, 9257, -11283, -20418, 4705, 28028, 16192, 8683, -15499, -21738, -7003, 49069, 58009, 56738, 64832, 63008, 38331, 35782, 38090, 12965, 2222, -8505, 10538, 34156, 26700, -1573, -614, -722, 2388, -23768, -16608, -3591, -22180, -23996, -19464, -5136, 22998]
16073B2998M492j0790M805J452J1594K090Q372j8397j3547M159O549P623k158
16060B9242K781p944K0190r631k6596K9861j7372m6235l882L4279j2804K557N053
16047e01j713L412K1682q615Q416J8987l3045k0164K9939J9939K5230m518k2194
16034C6855J1365J752k5099L510j3144k3197k0934r448K1719K5956K8524l2514
16022E345l9265n533K885N209J5175j7622j0245J662k334J4531M106K0511q152
16009a3727J2169l759j9220O396J7045q516J8657K669J6402O125p379j7081j1153
15996a372j8723N896P742J0508j353J1583K0318l354j1244j1822M894p979k1623
15983a6529K7671L2921k2877N86n816j0391k1147J1450L9224K2988K0257l0273
$$ y = [22998, 27490, 16700, 21505, 22957, 34551, 36641, 45013, 26616, 13069, 17228, 23777, 31400, 29242, 32023, 24079, 44269, 34638, 8042, 37903, 20531, -25704, -29586, 4693, -8111, -5554, -501, -2214, 1198, 22880, 14265, 22681, 41668, 8623, -11541, 18398, 38337, 63567, 59049, 36855, 48220, 49972, 24873, 28383, 15239, -7958, -28892, -38340, -16621, 9335, 37859, 5345, -33920, -39453, -36568, -31359, -16184, -33806, -44051, -42389, -44723, -30192, -26086, -5575, -13727, -1558, -5317, -24537, -18141, -1096, -9612, 9045, 11714, 28116, 34241, 26862, 9781, -1372, -20095, -14199, -6457, 4051, 2698, 14281, 34599, 31245, 20001, 8179, 13073, 5094, -16529, 11142, 44063, 21186, 21772, 15956, 5565, -15582, -4132, 35092, 58080, 78337, 48064]
15971D8064j9712r825l6839k9980j9764J9593K8115J1183l5284j5581M1868L7494
15959A9332K9044J0069m2548j9659j1770P108o750m0489k0158K90L7099K5523
15947a2909P050m813J7N309p803j2611j7467k455R238J649Q225k8481J2645K4074
15933a8332Q536N478j1723k0063L6542K5166N719j370l3120k2841J8224K0222
15921A2438L8887j3839k1456P318k5543o833J1862r070j5873j8765q132r815o49
15908e9470R420K418R34L8966J9767K434K361m2733m566j0197R610K9019j5129
15895a7166j2207J0496K8806K371L1390K4397m5747k8660j4885k2647J6346k5063
15883e2569l0406J6838L8276K5047O444K9126o069o928k5722k184L0201L5755
$$ y = [48064, 28352, 18527, -18312, -48292, -68056, -48463, -20348, -9165, -44449, -60030, -18162, 19332, 48376, 58445, 15897, -3762, -15532, -8424, -15174, -55663, -75821, -75531, -38432, -12909, -5859, -10672, -10655, -5346, -13149, -25760, -43227, -45682, -36444, -34795, -26570, -55051, -42406, -18332, -9796, -4318, -16041, -36104, 438, 25604, 31323, 29953, -3167, -26008, -7784, 12438, 51325, 37486, 16030, 23348, -2195, -9028, 2834, -6236, -22109, -40874, -49006, -58821, -59470, -50050, -47632, -46698, -7732, 12035, 14469, 16830, -25903, -30469, -40666, -31056, -2037, -17166, -29373, -18877, 9929, 12300, 43690, 68087, 22340, -6320, -21205, -43852, -27506, -52569, -82975, -66137, -27861, -2814, 3630, 32756, 26687, 19759, -5963, -8147, 22054, 57809]
15871E7809o732l3216k4902J1176m24k696k5315J0437J864J6394N382m784j3888
15858h895p656R88R606l31m8439J24K2245M1141J7598P022J6615k4370p5845J8402
15844c1795M0083Q831m859O789L6624m887k8232R852l3863j215J6885k022j6076
15831c885p665J8340N9K772j3322L552n770k8937J1919K1232J0389j2760j7509
15818b1585K3511J0652o051L3481m377j7963M819K4003j658m555j9570m4408J4493
15805i208K8679J0732K1199p096j4161k3495m9084M336J2770P052J4585K3287
15793A9596l298n0028J2004K4705P059R373k0098p469j5756r093p425K112K8592
15780i726P2842J8269l5257n1174l1601N309L8575l405k1117Q457j4725r457R390
$$ y = [57809, 51077, 17861, -7041, 4135, 3711, 1015, -24300, -13863, -11999, 4395, 9777, 4993, -8895, -16551, -15563, -5957, -6288, -54727, -54603, -32358, 8783, 26381, 33403, 50018, 25648, -50197, -31795, 8288, 17119, 12260, 19049, 55673, 50786, 22554, 32406, -1457, -2672, 14213, 12191, -3885, -11550, 6790, 6849, 9621, -3701, -149, -5919, -34856, -22937, -1705, 8684, -4076, -21585, 1926, 12578, 6527, 40008, 35631, 17668, 22487, 46490, 44832, 40277, 20707, -23701, -9208, 19471, 30203, 51402, 44306, 30145, 6650, -42434, -38098, -25328, -18276, -3691, 19596, 16298, -33730, -21726, 2979, 10038, 19411, -687, -8156, -23912, -33005, -40430, -38318, -9726, 63116, 81385, 46128, -5046, -36647, -31338, 7237, 3832, -17285, -8828, -23553, -33010, -23620]
15767b3620k860J2599K8079J1058l129J328J6050p25P530R765m2658l6155K2226
15754e12N0053N841K3909j4473j4138l2626k4697J6525j3041l6717L5J0978M093
15741b4770l026r066k92J9522J2799r722R179J7034k6044J8785P456j956j3356
15728c457k8268J2669K1863J9275p861k2964k2203M184j9218O55k0191J6844L5269
15715a3403n442l621r882J7948j1177r37M661j0493q758J388j1727K6637K9482
15702D676j6942J93j207j0620j61n228p708r893P463j4796J479L2757N470K881
15688a1636l959R691J6647M416r375k2741O414K6331j0396J4131J000k1357m4105
15675d4939J126K5369K3683O784l1330J5758N8127M3264J3816l5843k1106J2878
$$ y = [-23620, -26480, -13881, 14198, 25256, 22127, 23455, 39505, 38780, 46310, 56075, 13417, -22738, -512, 49541, 55382, 79291, 64818, 50680, 18054, -6643, 9882, -3159, -39876, -39841, -28863, -24770, -27796, -36862, -37154, -17632, -4833, -14555, -5376, 11658, -14386, 4399, 11855, 9899, -3457, -31725, -19056, 2807, 22082, 14221, -8743, -30946, -26762, -45980, -45325, -65516, -48672, -13403, -18845, -22466, -32348, -14400, -25577, -26514, -21853, -32346, -41104, -39716, -51443, -24806, 4676, -12266, -12073, -13280, -23900, -24061, -29289, -36997, -46890, -39427, -54223, -52744, -19987, -14517, -11636, -15595, -5904, 10743, 15159, 5784, -16957, -10543, 15788, 5392, 19523, 20523, -834, -44939, -43813, -18444, 5239, 12023, -19307, -3549, 54578, 97842, 111658, 75815, 54709, 67587]
15663F7587M254J2746j1158k1329j9912K438j4090R85J2800j4744j4753k0862
15651a6038r487J1586J8158k595L427K3404j1176p629P811J5574r740k2855r568
15638i128J4329L656j4233j0347M697Q800J7855r145J0765R998j5782l8638J0280
15625a6893J0235o748j1765Q480J2814J8578l1758j2404K719J5551J8225o192
15613H42l5350l095J6282M483j6178k4681J6507J5203N985L7353J6851m837O748
15600C6113j8443m9881l363K2036J8703K8506K1590o426l7794n854j5878J9339
15588H648L7678R253n1536m4829K1452J5233K2440R024j9447l5520J2682K556
15576a2366R534P33k7059j0421L7457L3328J7375k8692j4290q438P405J7471J1960
$$ y = [67587, 71841, 84587, 73429, 52100, 32188, 34626, 20536, 21521, 34321, 19577, 4824, -16038, -25525, -13939, 4219, 1624, 5051, 28455, 17279, 9650, 17461, 33035, 23295, 440, -9128, 5201, 8857, -5376, -15723, -11026, -2226, 15629, 6484, 17249, 27247, 11465, -27173, -16893, -6658, -13406, -25171, -16691, -3877, 14701, -17057, -29461, -26742, -11191, 7034, 842, -34508, -37603, -21321, -16838, -33016, -57697, -41190, -25987, -20002, 17351, 34202, 29365, 36113, 17670, -32211, -35574, -13538, 5165, 33671, 55261, 48835, 11041, 5187, -10691, 8648, 46326, 55579, 4043, -40786, -19334, -4101, 18339, 27363, 7916, -27604, -14922, -12366, -2832, -2099, -29158, -39579, -2122, 31206, 48581, 19889, 5599, -2839, 4566, 22037, 33997]
15563C3997R927l655k0375k5619j599q720J0522m397k3560R259P56j0237M161
15550b9540N6829J5801O735L1505p396l8093j9467j0211n104N896j2130j4430
15538a9605k3981q752K5385m869K6469M0195N889p761k2401k4051k714Q620K1668
15525A4092P729q438j9288J3561L2p342m402l1374j3588R230J1281N889j7201
15512c9819j8815K5079J4547q049K3939R579K4270j5006L038O410k0575l7053
15500c2455k6741L4725M6238q288k0076n752j0070K3706J3343K1787l798j2435
15488B0184J9950N258O05L760o813Q42j5073j0061j2975K4111q061m3298L003
15475a8568J1609J4190K2119j4747r612l062M51K7457P00k8301j9269J0272J2423
$$ y = [33997, 43924, 40269, 19894, -5725, -7324, -16044, -5522, -9919, -33479, -24220, -23464, -33701, -29540, 27289, 43090, 49825, 81330, 73934, 35841, 16374, 6163, 1059, 6955, -5175, -19605, -43586, -52338, -26953, -31822, -5353, 34842, 40731, 32970, 10569, -13482, -16196, -7576, 14092, 21821, 13383, -5905, 7656, 7688, 346, -4056, -35430, -49018, -39788, -28507, -22618, -39819, -58634, -33555, -19008, -27057, -3118, 6461, 30731, 15725, 18763, 25173, 4598, -32455, -59196, -24471, 21767, 13479, -6597, -12349, -22419, 1287, 14630, 36417, 32619, 20184, 40134, 45392, 45997, 49757, 42944, 43786, 28713, 18652, 5677, 29788, 21727, -21571, -18568, -6959, 7231, 29350, 14603, 4991, 1929, 2380, 29837, 30537, 2236, -17033, -6761, 5662]
15462E662k7866j7020L672L4302J1191k2210j5594M7850J9905k2923q340p670
15450I59j5103k3240J7040L7058k4780j0017L8220k112k3118O627J1601r700j545
15437A890j2262J1940K0445K6590J6998j8991l3258j0166M807j3208p135R56R85
15424a0409r785M961L920P075K8269J0046j9747k9914n177j1706n473L8680K9609
15411C0349M873j4174m845j819J526r192k654j3748J3645J2954R98n0265J8380
15398a3972L348K3286L638k5019r02J9741q337J2637J0449M134j2601J0437l333
15385B3506P124m170l5200Q040l141l3419R854J9366q722J0406J2865j384l6631
15372c1506J6758n569q735j1622r110J0107K9863O962j8735Q352N9661k0011n3261
$$ y = [5662, -22204, -39224, -35552, -1250, 9941, -12269, -27863, 19987, 39892, 16969, 8629, 959, -14144, -37384, -20344, 16714, -8066, -18083, 20137, 18025, -5093, 1534, 13135, 3435, 1890, -10372, 1568, 22013, 48603, 65601, 46610, 13352, 3186, 7993, -5215, -12350, -11394, -10409, -20194, -15233, -11313, -4238, 24031, 34077, 14330, -15584, -20761, -32467, -37940, 740, 30349, 35222, 21048, 16203, 14384, 15910, 6718, 4064, -9684, 3961, 16915, 17913, -32352, -13972, -10624, 12662, 16300, -8719, -9621, 10120, 1783, 14420, 24869, 29003, 16402, 26839, 23506, 30630, 26460, -8740, -700, -3841, -37260, -27406, -8040, -16762, -6356, 6509, 5125, -31506, -14748, -20317, -29052, -40674, -49784, -39677, -9814, -2852, -21587, -13235, 46426, 26415, -26846]
15359b6846r821M01J191L3260n133m203P849K9179L1960j7652j783k3157R821
15346B5066j0694J873j4757k7283K0097L1246k203j8737l1978m283j5587k610
15334d9850K2243R690K1886P677K936j7649j2557M450R816J1017M964p410m457
15321B756K1273K933q184n803j030l6149N180L9517L214p520O839j7793R017k0013
15307e763l499j5959M104j6834K6031K8199J457q7j3736q319J5219J5706P900
15294C4419k5369l5571N647K811L2752L38j0522J7185J4980o377j6872m1314j3102
15281d0995q414L2450k561l552M822M051n325J7265J7228J2308j7173l6967k3454
15268e0317j7483K8395K3648q846m532J1645K5132J2748p413k4183K1981N330
$$ y = [-26846, -36667, -36266, -35075, -1815, -6948, -11151, -3302, 25877, 57837, 40185, 38402, 15245, 25066, 14372, 16245, 1488, -25795, -5698, 25548, 23345, 4608, -27370, -31653, -47240, -49850, -27607, -17917, 3969, 11646, 14582, -3067, -15624, -11174, -1358, 9659, 14623, 7213, 2756, 24029, 26962, 18778, 12975, 11945, -24204, -19024, 20493, 23707, 16187, 23026, 5233, 14250, -5763, -9262, -25221, -21117, -37951, -11920, 16279, 17736, 17649, 3913, -4406, 10813, 26519, 34419, 9050, -26521, -20874, -18063, 14689, 15027, 4505, 21690, 36670, 30293, 13421, -27893, -40995, -49409, -16959, -19520, -23072, -18250, -14199, -19524, -2259, 14969, 27277, 10104, -26863, -50317, -67800, -39405, -15757, -24603, -29135, -17490, 7642, 20390, 12977, -11206, 10775, 16105]
15256A6105J678J9432j8238k8117K410m177m202p926J0894P538J0940J5006l1153
15243i810k818j1551j4816L2324K7227P888p532k6989l0539K9721K6779N094L5261
15230F0239J4594k4707k9079j999j3071j3945n941J3684J9340j7873k8714j041
15218b8513L305p60Q713k673n261J6491l020p591k9776m944K3947J1007j8038
15205c7113L5657N1894j5004k7894J0281P647J1194k1283J3141p223k3675j1264
15193a3642j9359l4056K6572M007K2741J3533J9740K0858j9728m1119k400k0067
15181d2920k4055J7837K0045K1051J1828K38j5148N838J1592o720j4792j4673
15169b9879K2794K8298j7670k876j2839K212L9276j086l963j8035J3767J543R743
$$ y = [16105, 17783, 37215, 18977, -9140, -6730, -10907, -15109, -23035, -12141, -4603, 6337, 21343, -9810, -12628, -24179, -38995, -6671, 20556, 28444, 20912, -6077, -36616, -6895, 19884, 24978, 60239, 74833, 50126, 21047, 19048, 5977, -7968, -13909, -225, 19115, 1242, -27472, -28513, -25208, -25968, -17255, -19928, -25189, -8698, -11718, -19309, -49085, -54029, -30082, -19075, -37113, -1456, 50438, 35434, 7540, 17821, 25468, 36662, 15379, 28520, 21297, -2378, -13642, -33001, -67057, -40485, -36478, -13737, -204, 19536, 40394, 20666, -20453, -22853, -42920, -66975, -49138, -29093, -8042, 3786, 4024, -11124, -5286, 6306, -414, -15206, -29879, -7085, 21213, 3543, 667, -12172, -9960, 29316, 28230, 24267, 6232, 19999, 21542, 31285]
15156C1285j8300R176j983p717l1378L4343j092j1834j1693l2353N347j1663J7872
15143b9990P309J8167j3278K4969K4480J1246m0666r271L7577K5692l1086j5259
15131I890m332K0744k0347q943J2980K3608j757p484j4494M142L3916L039k1804
15118B9158J3707j442j876l1968O367J5802o417n027J576j2632Q679j8508J9686
15105A7105j0363N453K8762k1829M07j2343K591N750m688j1339N182r885k7838
15092c3035j2411P566j1393J9488M5122J9292k699o279l5648R15L848J0584N285
15079A0635k6087m66K9453K894k1593p090L1781J7118k2231j6147j8538O149K6025
15066A1903K71l7800k7883K3782R92M2901N600L958L134q695j3752j5899J6867
$$ y = [31285, 12985, 22161, 20178, 12461, -18917, 15426, 14334, 2500, -9193, -41546, -36199, -47862, -29990, -22681, -4514, -17792, 7177, 31657, 42903, 2237, -7034, 30543, 56235, 25149, 9890, 5558, 26302, 5955, -2988, 9992, 33600, 31843, 24359, 9865, 14007, 47923, 50962, 29158, 42865, 41423, 39547, 7579, 13946, 29748, 23331, 18304, 19880, 7248, 15927, -2581, 17105, 6742, 12195, 40957, 19128, 19535, 7192, 9783, 15533, 10845, -494, 4688, -5197, -33035, -45446, -37880, -49273, -29785, 15337, 34629, 31930, 25651, -9997, -9082, -5234, 5350, 10635, -15452, -15918, 13535, 16429, -5164, -12254, 19527, 36645, 14414, -1733, -20271, -14122, 11903, 12174, -25626, -53509, -29727, -28735, 14166, 19766, 23724, 26858, 18163, 4411, -11488, 5379]
15053E379K2292J0035k3108R85N422K848p987j4238k4449L567J5415J1270P084
15040A4515q951j4265j1980J7982K0018l291j3179n029J4934J8039j3548n2330
15028c7085j9672K201L450O711J5908K3634J2334N272j1292j1568J6389J8661
15016B4943N396l745K5012j127k3239m0113r281K0684L8643P596q074R998J2054
15003E8747m6765l0218K77K9357O800j6054k4875K3476J3897j6769p830J7930
14991G973j4762J8800J7501q801O025J0526q061j0983k3342R612J3684j1653l8996
14978c2477O970L5113J9628L245L531r908l7803J9543L1371o618j3637k4273m097
14965i412J9781P599j8130M5j4405J5886J1905j869j1097J0841n677q394K5909
$$ y = [5379, 27671, 37706, 14598, 15583, 21005, 23853, 15866, 1628, -22821, -19254, -3839, 7431, 14515, 5564, -8701, -20681, -2699, 17319, 14028, 849, -4180, 10754, 28793, 15245, -37085, -56757, -54556, -51106, -44395, -28487, -4853, 7481, 12753, 1461, -10107, 6282, 24943, 30339, 26594, 51606, 50479, 27240, -12873, -22154, -1470, 37173, 44769, 36695, 46693, 58747, 11982, -18236, -17959, 11398, 18198, 2144, -22731, 745, 14642, -2127, -9957, 7973, -6789, 12011, 29512, 20711, 26736, 37262, 29201, 18218, -5124, 4488, 18172, 6519, -32477, -25507, 9606, 29234, 32479, 36010, 26102, -11701, 7842, 39213, 32595, 18958, -5315, -9412, 10369, 17968, -162, -117, -14522, 1364, 13269, 11400, 303, 11144, 5467, -2927, 22982]
14952B2982j1542k922K0194J3498j4495j1987K921P479k3558J8206q85O155m87
14939B5559J0147J4944J447j6169k3271r791Kl957J126R80K3350p090l1407p192
14925b1322L6803K4136N763r860q413j6388l7952J5125K0013j1782j802j6473
14913b2152j4470J6818K6850j0864n454k3571L1880O220n773J2285R443k352n706
14900A3154l056n063M576K2349j047j9531M723J2657l1945n2559R258K8165K9303
14887A0984J1649m1266J5469J347j391q02R145j1781p833O065k5515L192P6683
14874D5946J1772l3045n943K6311k686K466m1893n0021R22K9159J2956J744J7
14861b295J9253m420l5898j8725O932O671N871J5476N9800R340l2346j2777j2583
$$ y = [22982, 11440, 8518, 28712, 42210, 27715, 15728, 18649, 26128, 2570, 20776, 19891, 26046, 25559, 35706, 50650, 52097, 35928, 12657, 2866, 2868, -1089, 37, 1017, 24367, 17277, -14130, -21322, 15481, 39617, 45380, 35520, 27107, 10719, -27233, -12108, 7905, -3877, -5679, -22152, -36622, -19804, 7046, -3818, -9272, -32843, -963, 5257, -516, 11769, 21212, 18860, 13154, 10098, 5035, 9611, 31960, 30913, 11382, 16105, 28762, -3183, -55742, -46484, -18319, 10984, 22633, -18633, -3164, -1817, -3208, -4010, 5135, -6646, -14479, -8414, -33929, -30737, 45946, 57718, 24673, 18730, 45041, 42355, 44821, 2928, -47093, -46171, -17012, -4056, -2312, -2295, 16958, 12538, -23360, -42085, -35153, -28482, -22611, -7135, 52665, 62005, 29659, 16882, 4299]
14848D299J285j6384j316J2024J5007J7310J5239m847p831m8330k2269L7838K7508
14835B9533K6991J2702l5587k7426l2469k5998j0184K651J7101k577J110J8297
14823b5856K6087R196K64P002J4558j0345k0552j968O490K1414J9623j7741j7348
14810A0824o947j4163M654r8j8905J688R606P802K0619m356k2429L387j270p53
14796a0341j3103K3357J584J9505j3241j1567J6349J9410N124P956j1062k2088
14784A1883m068k449K816k7162p24J0374K6177J2962K777l1074j2697q759L137
14771a6807J9534P576J2610J2927N751L6774j2393m2996k0066j1412J4984k8541
14759b2059J760M32m12J8514J5293J1972k5006k0690K0213R093q550K3052J3980
$$ y = [4299, 5584, -10800, -12116, -92, 14915, 32225, 47464, 42617, 34786, -13544, -35813, 2025, 29533, 56524, 69226, 33639, 6213, -26256, -52254, -62438, -59787, -42686, -45263, -44153, -25856, 231, 9427, 9691, 16693, 31251, 20906, 354, -1614, 4876, 26290, 45913, 28172, 10824, 3877, -10286, -5632, -5730, -24635, -22947, -13341, -5539, 15080, 10724, -11705, -8318, -9588, -10341, -23444, -87, 1497, 21002, 7761, -3806, 12543, 31953, 37077, 45033, 33971, 11883, 7815, 5366, 8182, -18980, -19704, -9330, 16847, 29809, 32586, 1512, -11185, -19944, -16807, 2727, 10303, 22913, 35840, 41591, 78365, 65972, 22976, 2910, -8502, 6482, -22059, -20299, -19867, -20279, -1765, 13528, 25500, 494, -20196, 17, 9110, 560, 23612, 37592]
14746C7592j7856R087j2999k9237J8193M2061R628j8037j4380p650L404J4656
14734C4462r823j1073k888j857p792O905J4078J4899l0483J5695m201M689J708
14721B4319k9046O023j172l264j28J4992N671Q904J3393O147p869j0583N055J1168
14707D3610j4573m8941J0532L0909K539l0748k9527l128J6808j2422j6138j920
14695e2999k490L0348P835J7226J462k961K6378O181l35n244k3659J6458k9409
14682a1209j5623L1467J5666j5861j426J3129R713o062q604q113k3642J3777P154
14669C66K685R419K6986P600k0931K287k6210j8352M791L3279j7635P385k1552
14656i882j9622K840O2k657O490L7724P791l3712j2481K1609M495n610j325j694
$$ y = [37592, 19736, 28823, 15824, -13413, 4780, 46841, 56469, 38432, 24052, 16402, 19806, 34462, 24639, 13566, 10678, 8821, 1029, 7934, 22012, 36911, 6428, 22123, 17922, 22611, 24319, -4727, 1296, 124, -3140, -3268, 11724, 17395, 26299, 39692, 45839, 37970, 27387, 32442, 43610, 29037, -19904, -9372, 21537, 24076, -6672, -36199, -39327, -22519, -34941, -51079, -52999, -55489, -25141, -17306, -80, 1382, -1579, 24799, 30980, 30645, 25401, 1742, 18200, -11209, -26832, 4635, 20301, 4440, 3014, 16143, 25856, 19794, 11190, 3077, -20565, -6788, 366, 3051, 12470, 39456, 47056, 26125, 28412, 2202, -16150, -11359, 21920, 4285, 11670, -9882, -29504, -26664, -26602, -29259, -22769, 14955, 22746, -10966, -23447, -1838, 2657, -2953, -4278, -5972]
14642e972J0235M8888J6206l3826k5577O044k3072o185R266K8194J1776j5318
14630B0659l0442n6242O449J0856j7680j0120J1121M1761Q483K4928n891l7544
14618c3662j1549K9784K4624N790j1247O615L0741k5625j7794o177P096j4486
14606a5890J6120r788l2370J0231K3509j6334o338L2864r413J5947K3593p781
14594B4350J0826K1123Q765l3242k3873J100j8526J962K2290j1532J9K0695j1111
14581A2846k3323m454L345j1761J5386k0680M959L6378L0349k4660J32J6681k8177
14568G021l4403j5713P342K2143K9909R774j4877R5J8128N691n034J6043J9085
14555F5204m282j2292l2117J6599j5078l1612k1538J9645K5180N352r580Q12j5907
$$ y = [-5972, 4263, 53151, 69357, 35531, 9954, 15998, -7074, -13259, -3993, 24201, 35977, 20659, -9783, -66025, -59576, -48720, -66400, -76520, -65399, -23638, -15155, 9773, 3882, -33662, -45211, -15427, 9197, 14987, 3740, 10355, 41096, 15471, -2323, -8500, -1404, -15890, 230, -9558, -41928, -31697, -8188, -24522, -30860, 2004, -7409, 8538, 32131, 24350, 35176, 56299, 65064, 31822, 7949, 9049, -9477, -7515, 14775, 3243, 3262, 23957, 12846, -10477, -14931, -11586, -23347, -7961, -28641, -23682, 12696, 43045, 18385, 18517, 35198, 7021, -27382, -43095, -35753, -13610, 16299, 26073, 11196, 11291, 29419, 35110, 30076, 46119, 65204, 60922, 48630, 16513, 33112, 18034, -13578, -35116, -15471, 9709, 15061, 5481, 6293, -9614]
14542i614j0380l3532q746M537J3302J0968J8880J5686J3817J779q745K032N316
14529A5300K7479O620l6691J8655j8014J6816J7275k6023k7149K8842L805Q047
14517C4962l1881l156K5566O103J7718l0850k1592R845j5085k1595K624p888j6013
14504e1242J4485M1073M7340J1368m9817l744K0492K4707j1622j6923m830p530
14492A3757N524j0937k4139J0398k814J0060J7541K7303Q939j5106j9534k5115
14480d123Q878J1432m654n217J6066K6117K2490M47k5459j8499j3082K5975o962
14467C3409k5778K430K5117j3396M817j0525k9811P696J640j1535K435L4519O964
14454B7982j5538m605M834j1143Q075L157m342k5102m590p989r627K106K1253
$$ y = [-9614, -19994, -53526, -62272, -57735, -44433, -33465, -14585, 1101, 14918, 16697, 7952, 9984, 15300, 42779, 49399, 12708, 31363, 13349, 30165, 47440, 21417, -5732, 23110, 26915, 34962, 3081, -75, 25491, 31594, 49312, 18462, -3130, 6715, -8370, -29965, -27341, -35229, -51242, -36757, 4316, 51656, 63024, 13207, 9463, 29955, 54662, 43040, 26117, 21287, 13757, 19281, 8344, -15795, -5397, -8211, 1849, 19390, 46693, 55632, 40526, 20992, -4123, 4755, 16187, 11533, 6316, 22382, 48499, 70989, 71436, 45977, 27478, 14396, 40371, 33409, 7631, 10061, 35178, 21782, 26599, 16074, -13737, -6041, -4401, -15936, -13501, 21018, 27982, 12444, 7839, 12673, 1530, 9605, 12762, 8420, -16682, -21272, -29261, -38888, -36782, -15529]
14441a5529J8016J9043L3241p4j8090j9431j6424l5931j7576K4758J2187J41M3407
14428B7738q900k3662j1918j1780o973O366K7445K166k1388j0954M1490K3245
14416C2875m022k2309p457R359j782L668N947M015j500M845Q805j3721k4647k3799
14402b9723k4468j6675K0906L8100K1575k2482K2188R294n780l44k1164j7497
14390b6070l343K3700J6021l9931p408K7093j4391j4455J8202O694k673j9848
14378c6409J1193K2268N433J2732J997k9083Q703O546R03J0081l0529k0989K1924
14365a5230k651K1085l9534J849K1822J1211r53j0184K4988K8491J7509l534l9702
14352A5167j6338O817o708K191l0894j1401q216j2477L5666L8683N127k1839l035
$$ y = [-15529, 2487, 21530, 54771, 54697, 36607, 17176, 752, -35179, -52755, -27997, -15810, -15669, 27738, 18838, -4824, -16742, -28522, -35495, -29129, -1684, 482, -20906, -31860, 9630, 32875, 28853, 6544, -913, 8446, 6664, 10332, 16279, 20294, 18794, 23639, 32444, 18723, -5924, -29723, -54191, -70866, -49960, -11860, 9715, -12767, 9421, 18715, 12935, 12591, -8573, -26070, -29413, -5713, 10308, -29623, -37031, -9938, -24329, -38784, -20582, -13888, -16561, -36409, -25216, -2948, 2485, 15217, 17214, -11869, -3166, 3380, 4283, 14364, -16165, -37154, -15230, -17881, 3204, -36330, -34481, -12659, -1448, -2401, -12585, 12403, 40894, 58403, 54869, 15167, -1171, 5646, -1062, 1129, -29765, -41166, -49382, -61859, -26193, 12490, 17617, -4222, -7257]
14339g257L2592j7952l38K403n677Q57J1740j098J9109J6353O357j0027k5081
14326B1981R679N005m407p577q644j9160j35N3778P223M659j62l0865Q888K1886
14312F2149L6203l9101l4220k9156q060L3404K1561J6225k2042n677j2386o521
14300A2379J4113l6557l5941K5323K653j5602j0667K5528L286r556J9395J9172
14288A3526k4716J7309N563J821J9942j997K718N547M887m0284n965Q499k0830
14275a3980O723N846K5679K2910k2061j0108P010k5955J2967o893O385R6J5974
14262B4593K930K1406p831J701m207m011l157k1446j6905O099m198j5004j7971
14249c8001K5789L0139n876l4088j592J0874J3763j8883K4176j1122k1961N120
$$ y = [-7257, 25335, 7383, 7045, 9448, 3771, 4628, 16368, 15270, 34379, 50732, 57089, 47062, 21981, 31660, 36665, 32258, 24681, 16037, -3123, -3258, 50520, 57743, 62402, 62240, 31375, 40263, 62149, 98352, 59251, 25031, -4125, -12185, 21219, 42780, 59005, 36963, 31286, 18900, 12379, 26492, -10065, -46006, -20683, -18030, -33632, -44299, -18771, -15485, -25041, -5646, 13526, -11190, 6119, 11682, 13503, 33445, 31448, 34166, 39713, 44600, 4316, -1649, 6850, -13980, -7257, -1411, 24268, 47178, 25117, 15009, 22019, -3936, 9031, 2138, 8523, 8619, 24593, 27523, 48929, 41098, 42799, 38592, 34581, 31424, 9978, -6927, -828, -5026, -20030, -38001, -12212, 17927, 12051, -22037, -23629, -12755, 1008, -17875, 6301, -4821, -26782, -21662]
14237b1662J969q47J8913M4027R891k1114r88K182J0959L026k5314q450m804l2111
14223b4323k89J5998k085K8660N224j3690o831O974n872K2515R639j6035R0o482
14209A3493n788j4019L28J6380j0441m32R177J5190j8396j758J2568L74J5258
14196C1934K579j0363l1796j0930J9117J7420J3738L1899j335l3404K494K4162
14184E5515Q404k7196l7768O42K5394J1551j1892l5116p653J0625R812l106Q376
14171G588M2940L7444j1065J0018p500N895J1722j8850o658m3507k4392J6068
14159A9703j5304k0346J237K7271K863k1329K231Q482R522K295n32j3479l125
14146e11m896l074J8395J3112M762N288J6986P980K245l8101l2027p886J1893
$$ y = [-21662, -19693, -20540, -1627, 42400, 52291, 31177, 30189, 32371, 43330, 46356, 21042, 12592, 7788, -24323, -24612, -8614, -10699, 17961, 23185, 9495, 2664, 9638, 3766, 26281, 35920, 19885, 19975, 13493, 7705, -6314, -5986, 10394, -47, -479, 8698, 23888, 5492, 3734, 16302, 16676, 31934, 34513, 24150, -7646, -18576, 541, 17961, 31699, 63598, 62263, 28859, 31353, 55515, 63919, 36723, -1045, -403, 24991, 36542, 24650, -10466, -18119, -7494, 2318, -788, 7588, 50528, 87972, 76907, 86925, 79425, 85320, 97042, 78192, 71534, 28027, 3635, 19703, 4399, -15947, -14710, 12561, 15424, -5905, -3674, 4808, 14330, 16625, 16093, 2614, -511, -5407, -8481, 9914, 23026, 27788, 33076, 50062, 58042, 60287, 22186, -9841, -17727, -5834]
14133e834K1729m439k0935l580L5312J7055Q779m4348j0832J0948l741m086P506
14120C534j4387m1011K9558l683N995J7928L2233J9086j934j3669j3781M558Q071
14107C2498k0865L0683k1184j0850J8201j9861j7121L911P526M418M540P283O319
14094B5498k1745j7887k5779K8969K5183K3714J7928j3878r050j5787N156j1395
14082A0927j9207J0074j4955n911k797Q275k474n202m443J5989K0973q175k87
14069B787J2293j2991P59R715R105M674J4073L261j629q65j4457k8567q02l1271
14055c3915n1794J8117K5680K3933J0925L9204L898R570n136j4491K1837q211
14043C9617J2301q740j4314J0728n821k2166q826K8677K2607j3436j5027j7670
$$ y = [-5834, 15895, 11456, -9479, -13059, 22253, 39308, 48087, 3739, -7093, 3855, 114, -3972, 3534, -10853, -51864, -22306, -25989, -19994, -2066, 30167, 49253, 47319, 33650, 19869, 24427, 32498, 11633, 42316, 21132, 10282, 28483, 8622, -8499, -4588, 2938, 7356, 11896, 19179, 25498, 3753, -14134, -39913, -10944, 14239, 37953, 55881, 42003, 32953, 17166, 22322, 10927, -8280, 1794, -13161, -19072, -21869, -13594, -16068, -21270, -25713, -9724, 11249, 3074, 2787, 15080, 2089, 2848, 12563, 21668, 26342, 40415, 43676, 42047, 41182, 26725, -1842, -2644, -33915, -85709, -67592, -41912, -17979, -7054, 32150, 36048, 45618, 40482, 25991, 47828, 39617, 51918, 43178, 28864, 39592, 33771, 11605, 2779, 31456, 54063, 40627, 25600, 7930]
14031G930j489K2863J8910k0430j2424k5250j1942K3717j0139q252J4678J3950
14019A2122q119k5410m3548L1379L7737R458j426j6078o404J2368J0144p686j9356
14006a4819q22J3868M641l1053k94L190K9765J9681K3578j3914l6205M345J9962
13993B1923L1891K152j2849m4871n4461J7978L2479J497m604L2007J4835n024
13981C2953k0886k0976R778J0740K831K4103r485j8297k308o054J9330k8288J580
13968d979J6202K6768p361J9729K3579q085l2792n958O713j4058R442k938l8374
13955a2112j9917R584K6601Q621J2442j6545j8039j0952K2162L7879J1386j3075
13943C8035p476J4448M0912l1951p949j0535l0527L840M266M359q723k2398K4037
$$ y = [7930, 6441, 29304, 48214, 27784, 15360, -9890, -21832, 1885, -8254, -16506, -1828, 12122, 4003, -21407, -64955, -33576, 4161, 13619, 12193, -3885, -10289, 2079, 12223, 4537, -14819, -15641, -1773, 2868, -28185, -28479, -25289, 4476, 24157, 47735, 33821, -2384, 1961, 21923, 53814, 55966, 43117, -1754, -56215, -38237, -5758, -4261, -8865, 23142, 37977, 32953, 12067, -8909, 869, 11609, 14440, 38543, 29058, 10761, 8453, 2399, 21729, -6559, -4979, 11223, 37991, 30630, 50359, 73938, 65853, 33061, 27103, 33816, 19758, 29200, 26262, -12112, -32029, -22445, 4156, 12777, 25219, 8674, -9365, -20317, 1845, 39724, 51110, 38035, 30559, 45007, 85919, 53968, 46019, 35484, 4957, 8797, 13063, 17422, 8699, -13699, 10338]
13930A0338J3140j3223n215J3896J5740M628j5366l6021j1273J5358K7790J875
13918B1667j9821n257K3674K4641P070K1970M444p221k3549l4477m680n586J3847
13905A6722k292K4555K3762l107j3556j5896j8856j882q251J3702J7764q0J932
13892C4517M073L9664j1411j9917r532n179j5548j3272p159L825J3594K2275r90
13879C4940n054q270n879r345J929L4942j5549k4931j1215J4672j9929L2251L6379
13866E4941o453M007r150j5392J5646K5319P744J1004m5599m1708L3312K2441
13854E6112N790k3161J4712J5491m318k7541j7740j2361L518j1259q411m246q850
13841b2264R259K1150J1188J3458L244L1897k383m5799r902j5386j3493N262n716
$$ y = [10338, 23478, 10255, 5040, 18936, 34676, 39304, 23938, -12083, -23356, -7998, 19792, 21667, 1846, -3411, 20263, 44904, 51974, 73944, 78388, 71167, 47618, 13141, 8461, 2875, 16722, 14430, 38985, 62747, 59640, 46084, 30188, 11332, 9450, 1199, 14901, 32665, 32585, 34517, 38590, 78254, 66843, 46926, 37394, 32215, 16667, 3395, -3764, 61, 13655, 35930, 34940, 29886, 21616, 15737, 6392, 8321, 43263, 27714, 2783, -8432, 6240, -13689, 18562, 54941, 48488, 52495, 43345, 27953, 43599, 68918, 76662, 87666, 42067, 359, 33671, 56112, 61902, 38741, 53453, 68944, 64626, 37085, 19345, 6984, 10502, -757, -9168, -13414, -22264, -13005, 8145, 19333, 32791, 36035, 67932, 65549, 19750, 9848, -5538, -19031, -13769, -19485]
13828a9485J5733q795Q589K3328k1531j8413j284K4330Q557j1148k4462j2161
13816c6742K0877J5705q021M163J7144p196j8907J312k6355K4851L4144J3458
13804C4433R787L947J0967j7351j7297n121R21P373N483j4229q657j5583o88K5233
13790A9218P011r747n201J1355M0871r663k8498j2905K621R104j6520L75J937
13777I958q062n867J95M6179j8614l4014o661J7741j232L2974R073J7208J0587
13764F9465J2301k0936l9684L1943L726k0940q459j3025L438Q917j0180j5074
13752A492R249r041k4778L527P875l814M771J8588M8256J1681k5442m680k762
13739C4922m011o890k7174j3283J7482J078q606m354K5188J1204R714N021p420
$$ y = [-19485, -3752, -12547, -3958, 19370, -2161, -20574, -21858, 2472, 11029, -119, -24581, -36742, -15865, -160, -8181, -4018, 13126, 5930, -12977, -11665, -38020, -13169, 20975, 34433, 44220, 48167, 59134, 41783, 24486, 19365, 20286, 27659, 33142, 18913, 10256, -5327, -6015, 19218, 26229, 16482, 11281, 22636, 63507, 53844, 25346, 12441, 15062, 24166, 7646, 8021, 9958, 1896, -3971, -3776, 42403, 23789, -10225, -16886, 855, -377, 32597, 41670, 58878, 69465, 81766, 60830, 21146, 53089, 56815, 35875, 27416, 14391, 17829, 26746, 16566, 1492, 10741, 1700, -23078, -19551, -11676, -15490, -10719, 7869, 56125, 67806, 42364, 37684, 34922, 30911, 24021, -3153, -16436, 1046, 2124, -6482, -10836, 14352, 25556, 35270, 40291, 32871]
13726C2871N481k8893l3066J7190K528K3885L0671K8971k7424k8828k1570n742
13714c926j3906K2554K9821q200J2925j5174p50J3692k12M883N16j296j64j7641
13700B3122m771k5802k0871j967q876q838K7148K5483L057l071K879k207K618
13687G904J818J9978L9577p471l0758P086M7277J3496l0100j3504l365j3260j5437
13674B3241Q022n93p842r94k1744j458J4029K2681k0310L149K2290k9791l1654
13661b0974Q09k0285L802j560P365K0771K0245l754K917N601P088J1853J03j6436
13647A7545J2925K9820L635q3j3357K457J2109k879j2100k2713L085J3831N371
13634D9646k1500m611L799P868k1236k2398K785J3383J9988J4777J1685r573J439
$$ y = [32871, 38352, 9459, -23607, -6417, -3889, 19996, 50667, 79638, 52214, 23386, 1816, -3926, -17832, 4722, 34543, 26343, 39268, 24094, 23344, 37036, 36824, 41707, 42223, 40927, 40763, 23122, 18351, -7451, -28322, -30289, -39165, -48003, -20855, 4628, 7685, 4614, 7493, 5286, 7904, 9722, 29700, 69277, 61806, 31048, 38134, 85411, 98907, 68807, 55303, 51938, 38678, 23241, 31263, 30670, 22828, 21834, 90, -1368, 12661, 35342, 15032, 18181, 40471, 10680, -20974, -20165, -40450, -36648, -38208, -30843, -10072, 10173, 6419, 9336, 14937, 22025, 33878, 33981, 17545, 30470, 60290, 63925, 63842, 50485, 52942, 65051, 62172, 50072, 27359, 30444, 44275, 49646, 28146, 23535, 27334, 35202, 13966, -8432, -5647, 7736, 27724, 42501, 54186, 44613, 46052]
13621D6052J7304R688k3821R24k808k3055N14K1243J5032J961K537J3347j7517
13608F1401j997j4964l2967j0913J1084Q316K0071j1324m951K0013K2064j7104
13596D8729j0471l388n106J3698r676n469J0714J6475R186j3125O366K4397j9575
13583F2755l945j6375k4512l631J0738Q129k5354J4986K2680q151j5182o859J0145
13570B5424J9713K013p173r052J1467K1220N757k7557M550j9902l7375o637N236
13557a2316m872J8792o2l867N644r650O757K7333R380j4367M944m582O326p074
13543B2386j5323j5378l860L1797J3967N931K0890K863j8887l3l1812j6671J5676
13530A1546N196k204M034M078j1442m217J2180n90m098K98N71J846J1695q157
$$ y = [46052, 63356, 73044, 49223, 50147, 47339, 24284, 24798, 46041, 61073, 63034, 65571, 78918, 61401, 59404, 44440, 11473, 560, 11644, 19960, 40031, 28707, 23756, 43769, 65833, 48729, 38258, 34870, 29764, 43462, 33786, 28317, 39031, 55506, 64692, 51567, 57933, 82330, 62755, 58810, 42435, 17923, 14292, 25030, 33159, 7805, 22791, 45471, 37320, 22138, 15279, 25424, 45137, 47150, 39977, 30925, 42392, 63612, 69369, 41812, 46362, 26460, -10915, -17552, -12316, -17188, 1604, 1542, -2325, 3319, -6331, 426, 27759, 37139, 22772, 27716, 23134, 29460, 22386, 7063, -8315, -12175, 19622, 33589, 39520, 60410, 63273, 44386, 44353, 12541, -4130, 11546, 16742, 14538, 18572, 22650, 11208, 6991, 19171, 18581, 14483, 14781, 15352, 17198, 28893, 20736]
13516B0736J869j0504m437J928j3201J1661J5164j387N604k2399q164L856j1884
13503a1158p996L5223l310k837M313K0534L6257L617j8596K478j2364J1577K9903
13490H7641r222m4l6719l070J3795p351k0679k540j9926K431K4219J7586J2526
13477E8647l2119N914J1369p095n550K2671K1690k5539j4618K7347j3060P601
13465E7258k821j7172J0040J1075J5034J4267P67k452r921j3570j4098k742J0486
13452E6151J9423j0469j7443j3468J1992M9333M1910l168l3843l847m6204j9495
13440C0872J1823K4856j8723m6504o436K4001k2317Q263L4536J1267L230j0818
13428D4050r275J0130p813Q559K1406L903k4363j8233J8800J4936m605r806l554
$$ y = [20736, 22605, 12101, 7664, 9592, -3609, 8052, 23216, 21829, 27433, 5034, -3130, 726, -11158, -19154, 16069, 12759, 9922, 14235, 34769, 71026, 74643, 56047, 58525, 46161, 57738, 87641, 78419, 78375, 41656, 38586, 52381, 45030, 24351, 21811, 1885, 4316, 28535, 46121, 58647, 26528, 32442, 43811, 36716, 31166, 53837, 75527, 49988, 35370, 62717, 49657, 57258, 54437, 37265, 47305, 58380, 73414, 87681, 88448, 85996, 76075, 62505, 48407, 45665, 56151, 75574, 65105, 47662, 34194, 46186, 95519, 137429, 134261, 100418, 96571, 50367, 30872, 42695, 67551, 48828, 2324, -4112, 19889, -2428, 5835, 40371, 51638, 54868, 44050, 34775, 44905, 37092, 45651, 67057, 70960, 46597, 28364, 47164, 62100, 57495, 47689, 44135]
13415D4135k1424P010K6553r938j8195k1809M628K1322R674j962Q01O720K8915
13402G6430k975j7090J2701k3087k4506L608q458j069k1145k3287J6174L4192
13390B1488J8171j1874m372J3443J4816K1645J0250K358k352m805k3190k35J4892
13377G0235k990R919O424J0568Q807k2075k7625O946J2634k2925l1833l735J6533
13364C0883q71k3486k799L1042J9242J4385k9934k3963k5562K955L2358J9422
13352D3672l814k9183k2815J6471J1677P087J277J9908j0568l8034k8538J3401
13340a9459M0697J761p860K5624L6978P664k1366j7893k810j836M793k4126J4915
13327C7082M2569L1298k3694p400j5143K5301j9755j6231J1011K4136j1779l0554
$$ y = [44135, 22711, 29721, 56274, 46336, 28141, 6332, 10960, 32282, 41956, 39994, 40795, 47515, 76430, 73455, 56365, 69066, 45979, 21473, 25081, 16623, 15554, -5591, -28878, -12704, 21488, 39659, 27785, 23413, 36856, 51672, 73317, 83567, 85925, 83573, 78768, 55578, 55343, 70235, 67245, 77164, 83588, 94156, 102963, 80888, 53263, 60209, 72843, 49918, 18085, 14350, 30883, 30012, 6526, 3727, 34769, 54011, 68396, 38462, 14499, -11063, -8108, 24250, 43672, 39858, 10675, -12140, 4331, 16008, 23095, 24372, 44280, 33712, -4322, -32860, -19459, 21238, 22999, 15139, 40763, 77741, 85405, 64039, 46146, 43336, 41500, 46293, 22167, 37082, 79651, 110949, 87255, 79855, 64712, 90013, 70258, 54027, 65038, 89174, 77395, 46841]
13315D6841N778r358k837K0570o3P590J8207l021o013j2456L0916J7977j9798
13302I4333j9576Q952J2682m798n875M210m198P230j9438L739q33L2814K0096
13289A29338K196m138m042l6812k7833j462j0314k868J6749K624q547P331J7082
13276G9304n708j9198P703R142J1205L844k4608j2280j2013k2061L7579L7850
13264I0759P607k4749p449R58J865L2985j3858j7432M1799J175K030l1528L071
13251H7233P60p287j1353J7949J8707K267k3438l5382K0084O7933J435j2304l1894
13238I4710j0168j2170j0064L3964j1292l3721oK2744m69J627K248o605J0050
13225H0848l934k5345r190J4826J8861N272j4983J1820K389o626k6410R584L8722
$$ y = [46841, 52619, 43261, 40424, 60994, 60931, 68521, 86728, 83707, 77694, 65238, 96154, 114131, 94333, 74757, 83709, 96391, 91593, 85718, 89928, 85730, 92960, 73522, 77261, 76428, 109242, 129338, 131534, 127396, 123354, 86542, 58709, 57247, 46933, 44065, 60814, 63438, 54891, 62222, 79304, 73596, 54398, 62101, 71243, 82448, 86292, 61684, 49404, 37391, 15330, 52909, 90759, 98366, 73617, 66168, 67126, 68991, 101976, 88118, 70686, 112485, 113660, 115690, 84162, 87233, 87993, 80706, 69353, 87302, 106009, 108276, 84838, 49456, 69540, 137473, 138908, 126604, 94710, 84542, 72372, 62308, 96272, 84980, 51259, 51253, 73997, 73528, 75155, 77403, 70798, 80848, 76914, 51569, 42379, 57205, 76066, 81338, 66355, 78175, 80564, 73938, 47528, 57112, 95834]
13212I5834j974K6465J0721J5786l1506k5251l0998m084M1153J3868O30K815k8631
13199H4828J256J130L726O758L3213m237k9402j8264j761M194m124J1420J0280
13186I9017N142k0225r4o623J6482J7885J1510L103K2328l3478k687K871j1290
13173A03941M876K0294k0820k8343J5536J2212L8263j678J3121P586k3839l0692
13161A10457k5146O360L9552J9229J3595J3884k6925j9913j8134j557J1855K2053
13149A45310J5560n755J6312j9411L808P758K0680q547J934j8876Q352k6499n960
13136A34666K2633m475j1154r488o246K3866L2462k2853j0587K0644l521k395
13124A63552k4017l6992j603J6576k182k3259K918L1859R116K444m344J7685p666
$$ y = [95834, 93860, 120325, 131046, 146832, 115326, 90075, 59077, 54993, 96146, 110014, 110644, 113459, 84828, 86084, 87214, 90940, 97698, 130911, 126674, 97272, 79008, 77247, 81441, 77317, 88737, 99017, 104159, 83934, 83840, 77217, 93699, 111584, 123094, 126197, 148525, 115047, 112360, 115231, 103941, 108817, 129111, 108291, 79948, 95484, 107696, 145959, 144281, 157402, 164988, 141149, 110457, 85311, 91671, 131223, 150452, 164047, 177931, 151006, 131093, 112959, 111402, 123257, 145310, 160870, 155115, 171427, 152016, 155824, 163582, 184262, 175715, 177649, 158773, 167125, 140626, 134666, 157299, 152824, 141670, 132182, 125936, 149802, 182264, 159411, 148824, 169468, 165947, 163552, 139535, 102543, 100940, 117516, 115334, 92075, 94993, 126852, 135968, 138412, 134068, 151753, 144087]
13111A44087J9318p8M680L562l947k3496k1008L1868J476j3815L3n266K4480P566
13097A69460n959O81O588N641j4994N40r29j9278J5707J0102Q433N960l8383l676
13083A39893m333J6228r230J2857K8799J8178J0291j3900R726k090J0799k3197
13071A94021j70J7136L3252J7660K6399L7998M9330N7959N7701J03369R7798J67163
13059H59616K70710M21909N41279M87147Q6262l07630m43102m08241l19090k65318
13049I23542j94673j20040p8839l2557o8279q0862m4925j6855J4427j4546n063
13038B81330o398m1988l3031j1358J0193M600j3624l6049l0382j1644j9142J9241
13026A11748J3284J2981J3439K3491k7187l0391m357j2519k649J7288L305K569
$$ y = [144087, 163405, 163327, 168007, 171569, 167622, 144126, 123118, 154986, 156462, 142647, 142680, 137414, 161894, 169460, 163501, 164182, 170770, 176411, 161417, 161957, 161028, 141750, 157457, 167559, 175992, 181952, 143569, 139893, 135560, 151788, 142558, 155415, 184214, 202392, 212683, 198783, 208509, 206419, 217218, 194021, 193851, 210987, 244239, 261899, 288298, 326296, 375626, 433585, 491286, 594655, 692453, 859616, 1130326, 1552235, 2093514, 2580661, 2666923, 2359293, 1916191, 1507950, 1188860, 923542, 728869, 608829, 529990, 497433, 429154, 348292, 303367, 286512, 300939, 286393, 281330, 274932, 232944, 199913, 188555, 198748, 203348, 189724, 153675, 123293, 111649, 92507, 111748, 125032, 138013, 151452, 174943, 147756, 117365, 113008, 100489, 97840, 115128, 118433, 121002]
13014A21002Q999L2517j0061m219j7185l4454O622J7939l67O390L356J1704q243
13001A34000P390L0764R851o958j522k1738l1142n579N240k0113J5318M941p167
12988A13285j8638P350n257N570k0980J7329P052P1M6326Q397p3842r154M3758
12975A21267J4364o700j1885J4273K9947J1655m052m8339l9940q225J1479J9662
12963A03506L6790j069J1791k3764r482K2651O762j9064k672K2446K4435Q98j3581
12950A59647j7690n456J1304L0487j5593n0889l1753p65K1281p50j8393K4014
12938A05444K3199j5510J705J5953J2075R462J0349Q971j9185n340J4543K684
12926A64350L087k4008k1626q557k043J9464K4523J4803K7592L2687L7867J2004
$$ y = [121002, 130001, 162518, 152457, 148238, 131053, 96599, 103221, 121160, 120793, 127183, 130539, 142243, 134000, 141390, 172154, 182005, 175047, 173525, 151787, 120645, 115066, 120306, 100193, 115511, 120452, 113285, 94647, 101997, 96740, 102310, 81330, 98659, 105711, 105782, 152108, 160505, 86663, 77509, 121267, 135631, 128931, 117046, 131319, 161266, 172921, 168869, 120530, 80590, 72365, 83844, 103506, 140296, 139227, 151018, 127254, 117772, 140423, 147185, 128121, 125449, 147895, 172330, 173228, 159647, 141957, 136501, 147805, 178292, 162699, 111810, 80057, 79292, 100573, 99823, 81430, 105444, 128643, 113133, 114838, 130791, 142866, 152328, 162677, 171648, 152463, 147123, 161666, 164350, 167437, 143429, 121803, 113246, 111203, 130667, 155190, 169993, 197585, 230272, 268139, 280143]
12914B80143K5757L6079n36N860L4372O9076J10542J34030K27161L72643N21571
12903A816698O35492N18838l6096m43223m95859m52796l35303k60903k39537j92360
12893E14951j16186n7507k352j2224k0651k0964j7634r536l0175Q096o178j1541
12881B18099k089k796L3670J3492J1097l6825k5308J1776P135O87j7301j3136
12869A98501j1763O690L9341J4325L63j780m9270j1048j00K7825K3133o632j7154
12856B12431n721p922p056K4507K7554J4197J9679K3996j3460O718J3847J8046
12844C26816j9470m3519j4525l2910m5332Q922J7489o132M0371J7507j2248Q465
12832B45434m848K3102R441l167p61J4317m1993l1479k0152K5551Q023k7779L749
$$ y = [280143, 305900, 341979, 341443, 347303, 381675, 450751, 561293, 695323, 922484, 1295127, 1816698, 2452190, 2971028, 2934932, 2491709, 1995850, 1543054, 1207751, 946848, 707311, 514951, 398765, 341258, 338906, 326682, 306031, 285067, 267433, 257897, 227722, 235818, 229640, 218099, 216010, 213214, 246884, 260376, 271473, 234648, 209340, 221116, 228251, 228938, 211637, 198501, 186738, 193428, 232769, 247094, 247457, 245677, 196407, 185359, 185259, 213084, 236217, 229585, 212431, 206710, 198788, 191732, 216239, 243793, 257990, 277669, 301665, 288205, 294923, 308770, 326816, 307346, 263827, 249302, 216392, 171060, 179982, 197471, 191339, 231710, 249217, 236969, 245434, 240586, 263688, 273129, 269962, 269201, 283518, 241525, 210046, 189894, 215445, 223468, 195689, 199438]
12819A99438K4081J9675j3741K1165J3833N273k390K4841L0311k6200l3733l8834
12807B23719J5913K0891p880j4283j6512o804l1056j4655K1477R252j4430M9737
12795B35369O4949P200J3597J5627j0892r854n625j0496k2591m7637o931o3298
12783A59418r8308j01292n6289n078O8392P7544M8315K3659L4568n674k7693J2858
12771A30420K1143M3360M6972L3398l3148m8763Q009j5150n062J936N550k8769
12759A59896O341J0218j3602j181j2313n39k422n5683p9821r2900j08135j18978
12747c09119l1860J10219R1765K6015O7153O9871L3745M5037N8458O0566L5933
12736B57783L7251J3950J2281k689P528J6209J0432M0762O0108N3587M8031P2091
$$ y = [199438, 223519, 243194, 229453, 250618, 264451, 269724, 267334, 292175, 322486, 296286, 262553, 223719, 239632, 260523, 252643, 238360, 221848, 215044, 183988, 169333, 190810, 200062, 185632, 235369, 300318, 307518, 321115, 336742, 325850, 315996, 310371, 299875, 277284, 229647, 222716, 159418, 61110, -40182, -96471, -101549, -33157, 44387, 92702, 116361, 150929, 145255, 117562, 130420, 151563, 194923, 241895, 275293, 242145, 193382, 201391, 186241, 181179, 183115, 188665, 159896, 166237, 176455, 162853, 161672, 149359, 148820, 146398, 90715, 10894, -82006, -190141, -309119, -340979, -230760, -138995, -112980, -45827, 24044, 57789, 102826, 161284, 221850, 257783, 295034, 308984, 321265, 318576, 326104, 342313, 352745, 393507, 453615, 507202, 555233, 627324]
12724F27324M0356n5664o6211P7999J05018K9649l9296j32707j13875q1331Q3573
12713D74835J72999J44962R9640o237m6543N5487O7124K470o1416o2818j8061
12702H22442K2443O235K8225K3299l5777k8447J2075K9818m8194l1293j2933q969
12690G78924k5563N363M2677K3463K576j3599j6746j3135L8524N0584o239J6602
12678H83431N3863N2170N8383K6493o292L135J3729M3371P906l6203m8147l1202
12666A020637p616J6602N3941N5021M0957M2000K8352O5397Q0013J0693j8267
12655A387730J7996L3985M5053M2220K2971M0589M3595J0641m7608n5911l5535
12644A505726L6680P7824R3762Q0897N0664N6428Q7010J01480J31554J57887J63996
$$ y = [627324, 667680, 612016, 545805, 623804, 728822, 758471, 719175, 586468, 472593, 391262, 474835, 647834, 792796, 892436, 886199, 839656, 895143, 962267, 964737, 903321, 840503, 822442, 844885, 851120, 879345, 902644, 866867, 838420, 850495, 880313, 832119, 800826, 787893, 778924, 753361, 758724, 801401, 824864, 827440, 813841, 797095, 783960, 822484, 873068, 866829, 883431, 937294, 989464, 1047847, 1074340, 1068048, 1071183, 1084912, 1128283, 1136189, 1099986, 1051839, 1020637, 1013021, 1029623, 1083564, 1138585, 1179542, 1221542, 1249894, 1315291, 1395304, 1405997, 1387730, 1405726, 1439711, 1484764, 1526984, 1549955, 1590544, 1634139, 1644780, 1597172, 1541261, 1505726, 1542406, 1620230, 1713992, 1794889, 1845553, 1901981, 1988991, 2090471, 2222025, 2379912, 2543908]
12633B543908J18491J07700J22592J32879J61083J66006K05845K32508K13441
12624D004453K14746J99791K00928K81377L50511L52134L44599L64597M19022
12615F732158M23564M69319N37203P21394J075850J321443J512473J775144K159201
12606A6727749K699429L272089L483717L669479M451547N908259Q021062J1389983
12598E9623314J6478842K4490953L7753351N9573768R2193442J24631542J02973890
12591E17719102k538313p8915805r5825769q5094916o7512896n1088631l6738995
12584A00003777k5294689j7160705j1834989q231800n697414l995324l325360
12577B4463496l074884k794331k424224k012211j566342j156773j012335r89830
$$ y = [2543908, 2662399, 2770099, 2892691, 3025570, 3186653, 3352659, 3558504, 3791012, 4004453, 4219199, 4418990, 4619918, 4901295, 5251806, 5603940, 5948539, 6313136, 6732158, 7155722, 7625041, 8162244, 8883638, 9959488, 11280931, 12793404, 14568548, 16727749, 19427178, 22699267, 26182984, 29852463, 34304010, 40212269, 48233331, 59623314, 76102156, 100593109, 138346460, 197920228, 290113670, 414745212, 517719102, 515180789, 436264984, 340439215, 255344299, 187831403, 136742772, 100003777, 74709088, 57548383, 45713394, 37481594, 31784180, 27788856, 24463496, 21388612, 18594281, 16170057, 14157846, 12591504, 11434731, 10422396, 9432566]
12569I432566r11870p63772o09861n60946n39780m37883l51098l65168l30389
12560D561799l56233k97519k12854j51982j16658j20634j04854r1989j07398j11082
12550B890596j21229j40499q9322o1339p2694l0559j6672m9430n7014m5104o4291
12539B142443q5340r0473p5964n1207k7828k0081o629m0511k3590k1933o866J704
12527A693725j1734J5896K0476O383j495J9958K6011J2268K0109R869L8630M2450
12515A892546J4872K1701M0051L069l8711j9352j2385j0281K7065O6271M3014
12504B027860K3588O0357P5183J11222J00826R5945P6473P9226P1222R1076J25625
12493B938603J70873J94587K10133K31649K15007J73501J43314J61212K32417
$$ y = [9432566, 8520696, 7756924, 7147063, 6586117, 6046337, 5608454, 5257356, 4892188, 4561799, 4205566, 3908047, 3695193, 3543211, 3426553, 3305919, 3201065, 3109076, 3001678, 2890596, 2769367, 2628868, 2539546, 2478207, 2405513, 2374954, 2358282, 2308852, 2251838, 2206734, 2142443, 2057103, 1966630, 1890666, 1839459, 1811631, 1791550, 1784921, 1744410, 1720820, 1698887, 1692021, 1693725, 1681991, 1697887, 1718363, 1724746, 1723251, 1743209, 1769220, 1781488, 1801597, 1811466, 1850096, 1892546, 1907418, 1929119, 1969170, 1972239, 1933528, 1914176, 1901791, 1891510, 1918575, 1984846, 2027860, 2051448, 2111805, 2186988, 2298210, 2399036, 2494981, 2571454, 2650680, 2721902, 2812978, 2938603, 3109476, 3304063, 3514196, 3745845, 3960852, 4134353, 4277667, 4438879, 4671296]
12484D671296L08861L19540L70713L51818L72285M77621N80383O85535Q58770
12475H996822J144026J381918J620594K054885K609311K780327K662340K865822
12467B6116045L689770N211012P258243J0091804J3917610J9924283L0550957
12460A16759724N0065378Q4057463J30977394J43444638M0915615p4760723j08842968
12453C82616521r8985934p7258676n7347144m1046944k8603204j9500129j3308806
12446D6565684r152717o303603m261282k930438k662982k758002k511590k071341
12438A3913729j615712j273227j056792r48211q67315q34532p42375o43338n30141
12429E402086m41114l86512l26671l08798k90486k76562k09736j54677q0352q9231
$$ y = [4671296, 4980157, 5299697, 5670410, 6022228, 6394513, 6872134, 7452517, 8138052, 8996822, 10140848, 11522766, 13143360, 15198245, 17807556, 20587883, 23250223, 26116045, 29805815, 35016827, 42275070, 52366874, 66284484, 86208767, 116759724, 166825102, 250882565, 381859959, 525304597, 566220212, 491459489, 382616521, 283630587, 206371911, 149024767, 107977823, 79374619, 59874490, 46565684, 37412967, 31109364, 26848082, 23917644, 21254662, 18496660, 15985070, 13913729, 12298017, 11024790, 9967998, 9019787, 8152472, 7317940, 6575565, 5932227, 5402086, 4960972, 4574460, 4247789, 3938991, 3648505, 3371943, 3162207, 3007530, 2927178, 2837947]
12419B837947j14475j16071j19944j50653j49135q0658o9919o4780n1700m2014
12409A878598P86m5031p0397m5909L3294N1714k4289p4597j87271j64337j30010
12398A222551r7288p8623p3187n7130l6155n1993o2475n1868m9373l7304J4946
12387F42101J3094K9441J6171j1985K1101J3502o5783n3769n5976n7485m4464
12376D45948l5745o7840o207K4554j2217k1709K1969L6038L4331N554m994r10
12364D18772k8935k8663j9213k1898l1596j1753l1319p595k4807j8314j5476r034
12352A70169J8983l797m5615M171R312o860k6036l1762k2781n9088p4428l6904
12340a04636N0579R1704k0529j04438m425J81569K53600J00680o9358p9972o4081
$$ y = [2837947, 2723472, 2607401, 2487457, 2336804, 2187669, 2107011, 2037092, 1972312, 1920612, 1878598, 1879384, 1834353, 1763956, 1718047, 1751341, 1803055, 1778766, 1704169, 1516898, 1352561, 1222551, 1125263, 1046640, 973453, 916323, 880168, 828175, 765700, 713832, 664459, 627155, 642101, 655195, 684636, 700807, 688822, 709923, 723425, 657642, 603873, 547897, 490412, 445948, 410203, 342363, 336156, 360710, 348493, 326784, 348753, 384791, 419122, 424676, 419682, 418772, 389837, 361174, 341961, 320063, 288467, 276714, 245395, 237800, 212993, 194679, 179203, 170169, 189152, 185355, 139740, 143911, 153223, 146363, 120327, 88565, 65784, 6696, -67732, -104636, -54057, 37647, 17118, -87320, -91745, 89824, 343424, 444104, 374746, 294774, 230693]
12329B30693o8814j4098Q8641J09576n055p3070K1454Q5610Q9509J5020n3411
12318D26055j2301K526m847j1028k7721j5343j3175j5609M1347L5854N4322P7175
12306E37255K8715L0218K5298N0919J18599J06827j3789n3726p7467r1814r7803
12295E63232o5421j8174m6092k2245N517m076J2003J407k81k4165k3133m0570
12283C38002k7110l629l1541p5556l1077K1263M5399M7461L7917M7889N132J3201
12271C87351L3224J6039J3292P4170N6761n9607j15784q6548m5922m0241n0678
12260A82057p5706l6019J4245q401l1632k4790L7632J2462L3407O8960L3767O105
12248B12087j2252K3840j0805n0n853k4021k2061j229k9106k9401m748K1182L0181
$$ y = [230693, 161879, 147781, 236422, 345998, 340943, 267873, 289327, 374937, 464446, 479466, 426055, 413754, 416280, 411433, 400405, 372684, 357341, 344166, 328557, 369904, 405758, 460080, 537255, 565970, 596188, 621486, 672405, 791004, 897831, 884042, 830316, 752849, 661035, 563232, 497811, 479637, 433545, 411300, 416817, 412741, 424744, 426151, 425870, 401705, 378572, 338002, 310892, 307263, 275722, 200166, 169089, 190352, 235751, 283212, 321129, 369018, 374150, 387351, 420575, 436614, 449906, 524076, 580837, 521230, 405446, 318898, 272976, 232735, 182057, 106351, 70332, 84577, 76176, 44544, 19754, 57386, 69848, 103255, 172215, 205982, 212087, 199835, 223675, 212870, 212820, 206967, 182946, 160885, 159656, 130550, 101149, 96401, 117583, 147764]
12235A47764M5832k7068m117L010j870L473J8497j3123n620q713n321j297k6151
12222A25296j0470K9649l3183j1284K3331l509J2585n362J2940L2990O3477J9535
12210B55995K21J3750l1440l8982j3939k3078J4428K0976m4643J1315N1209J9323
12198B35135k3082R728N2760L195L3418j3861R751K0943k0212p8l0634m4298k5154
12185B07611K717R512J6811K5983k5107Q540j0517k5862k0283J1543M732P953
12173B13633k0899K903K2692K4459k0468N4k516J2996j819K4088j0129l3741N346
12160B16599K584n039J2645J9482K2792j8899l601L0456n2252q646K840j4686
12148B04275j9816j695k1806m6105L6079K5548L7528J2510j5760J6971L7955M5168
$$ y = [147764, 193596, 166528, 162411, 165421, 163551, 167024, 185521, 172398, 166778, 158065, 152744, 151447, 125296, 114826, 144475, 111292, 100008, 123339, 119830, 132415, 127053, 139993, 172983, 236460, 255995, 256216, 269966, 238526, 199544, 185605, 162527, 176955, 197931, 153288, 164603, 215812, 235135, 212053, 221781, 274541, 277736, 311154, 297293, 307044, 327987, 307775, 307697, 277063, 232765, 207611, 210328, 219840, 236651, 262634, 237527, 246067, 235550, 209688, 189405, 200948, 205680, 213633, 192734, 195637, 218329, 242788, 222320, 222374, 219858, 232854, 231035, 255123, 244994, 211253, 216599, 219183, 214144, 226789, 246271, 269063, 250164, 246563, 277019, 224767, 216121, 218961, 204275, 184459, 182764, 160958, 114853, 150932, 176480, 214008, 226518, 210758, 227729, 265684, 310852]
12136C10852N0634J2644J1378R093o414K171L9820N0046O1172Q8323J01257J19173
12124H50149J51093K48149L90434N38942M75714P6127k88043l95284l90441l14416
12114A342424k52871j91785j37598j13765n6652l7577n8967l5136k126j6890k8832
12103D10225k3069l1380j7081j6630j4198p22J2970K2518J3175m2273k6278O750
12091B94007K6303o590j3306K4014K8077K478L586o45o371r881K0098M892J0956
12078C77618J5654J7240l4175j9350O977K697n389P906K4774O572j9017j2765
12066C68742Q943K9759K2123J582j0429q778J1020K8225K6595P575J2500j402
12054D96455J1604N156J3947k7525k9888J1588l244j4473J3839K8592M5930L5712
$$ y = [310852, 361486, 374130, 385508, 394601, 388187, 390358, 430178, 480224, 541396, 629719, 730976, 850149, 1001242, 1249391, 1639825, 2178767, 2654481, 2730608, 2442565, 2047281, 1656840, 1342424, 1089553, 897768, 760170, 646405, 589753, 552176, 493209, 458073, 455947, 439057, 410225, 387156, 355776, 338695, 322065, 307867, 307145, 320115, 342633, 355808, 313535, 287257, 294007, 320310, 313720, 300414, 324428, 352505, 354983, 358569, 357924, 351553, 341672, 361770, 366662, 377618, 393272, 410512, 376337, 356987, 363964, 366661, 361272, 369178, 393952, 400524, 381507, 368742, 377685, 407444, 429567, 431149, 420720, 411942, 422962, 451187, 477782, 485357, 497857, 496455, 508059, 513215, 527162, 499637, 469749, 481337, 478093, 463620, 477459, 506051, 551981, 587693]
12042E87693J9102J2441l410K2757L786m842j9966J013J3966J1430K7877M2274
12030G14121R547n820p80K5493m536L3061K2358M2540K6775M839M0304M5808L2925
12017I86635R979p239J2326K9294P1714N5137P5742Q9713J22088K11851L01549
12006A958789M77479O82712O04470J00958l81830m96025m25218l67879k63747
11997A889709j93598j14751o8068k8686p447k143K9425L7582J8766M612j589L5804
11985A599616J127L4363L5967L3801M5884N9684N3207L4566L3494J8356L5909
11974A985974O9859P0255P5317P2788Q6512J01786N9142L8992O9883Q8308R1955
11963B810771P6272O9348R3513J21269R7446Q6260R7683J47485J31949J50983
$$ y = [587693, 606795, 619236, 615826, 638583, 642369, 637527, 617561, 618574, 632540, 643970, 671847, 714121, 723668, 717848, 717068, 742561, 738025, 771086, 793444, 835984, 862759, 867598, 907902, 953710, 986635, 996614, 989375, 1001701, 1030995, 1102709, 1157846, 1233588, 1323301, 1445389, 1657240, 1958789, 2436268, 3118980, 3723450, 3824408, 3442578, 2946553, 2521335, 2153456, 1889709, 1696111, 1581360, 1513292, 1484606, 1477159, 1475016, 1504441, 1542023, 1560789, 1565401, 1563812, 1599616, 1600743, 1635106, 1671073, 1704874, 1750758, 1810442, 1863649, 1898215, 1931709, 1950065, 1985974, 2055833, 2126088, 2201405, 2274193, 2360705, 2462491, 2521633, 2560625, 2630508, 2718816, 2810771, 2887043, 2956391, 3049904, 3171173, 3268619, 3354879, 3452562, 3600047, 3731996, 3882979]
11953C882979J41496J58515J60201J86665J65070J84235J75255K02750K33697
11944E490863K34368K50672K29602K13961K84586L13795L35182L28427L26494
11935H007950L40286L53631L70253L53570L81825M51019M51645M27946M53266
11926A1591391M32268M16176M37217M60534L96519L64952L36837L35992K91121
11917A5063007K51275K18226J66889R4958J6055n5910r5503j13875j92669k04279
11907A5148174k95623k86630l43161l77224m16703m22916m20161m41557m50314
11898A1693885m11185m32977m38792m47478m07795l95842l87261l76451l56816
11889H039288l61381l37866k97907k95290k53975k68810k74996k51735k21658
$$ y = [3882979, 4024475, 4182990, 4343191, 4529856, 4694926, 4879161, 5054416, 5257166, 5490863, 5725231, 5975903, 6205505, 6419466, 6704052, 7017847, 7353029, 7681456, 8007950, 8348236, 8701867, 9072120, 9425690, 9807515, 10258534, 10710179, 11138125, 11591391, 12023659, 12439835, 12877052, 13337586, 13734105, 14099057, 14435894, 14771886, 15063007, 15314282, 15532508, 15699397, 15794355, 15810410, 15754500, 15658997, 15545122, 15352453, 15148174, 14852551, 14565921, 14222760, 13845536, 13428833, 13005917, 12585756, 12144199, 11693885, 11282700, 10849723, 10410931, 9963453, 9555658, 9159816, 8772555, 8396104, 8039288, 7677907, 7340041, 7042134, 6746844, 6492869, 6224059, 5949063, 5697328, 5475670]
11880E475670k02586k14421k03582j66754j81204j79218j58618j64321j47450
11871C857516j18179j04894j42575j52566j08055j32893j09944q9746q8625r0997
11861B719042q6064q3703n7254p7667r2818o2055o7701r6044p2168n2591p8193
11850A892784j6222m4676n3435k2612n0088n1920p0455n9951n5924R983l3243
11839A444241l4068k0247l1201l6484l2093k2386m8707l2039m2586j3179m080
11828A127171j1114o1251o6302k5910j1152j3903k1363j8545k407n921N795l2465
11816H62633j8831r943k8548l0499q297J868k1127k0616l8663n0338m482J8719
11804F51876R473J0166j8244k0235j9791p731J0521P519j6872k0091l509l1214
$$ y = [5475670, 5273084, 5058663, 4855081, 4688327, 4507123, 4327905, 4169287, 4004966, 3857516, 3739337, 3634443, 3491868, 3339302, 3231247, 3098354, 2988410, 2898664, 2810039, 2719042, 2632978, 2549275, 2492021, 2414354, 2321536, 2259481, 2191780, 2095736, 2023568, 1970977, 1892784, 1876562, 1831886, 1778451, 1755839, 1705751, 1653831, 1583376, 1523425, 1467501, 1477484, 1444241, 1410173, 1389926, 1358725, 1322241, 1290148, 1267762, 1219055, 1187016, 1144430, 1131251, 1127171, 1116057, 1054806, 988504, 962594, 951442, 937539, 916176, 897631, 895224, 889303, 895098, 862633, 843802, 833859, 805311, 774812, 766515, 768383, 747256, 726640, 687977, 637639, 633157, 651876, 661349, 671515, 653271, 633036, 613245, 605514, 616035, 623554, 606682, 586591, 583082, 551868]
11792E51868R119K3789O85k1505O099k2839o472m3421l2092k3054j3429j5673
11780D13075o408L920Q132R890J4757r376p565K3029R377j0077j6040M794k5079
11767D12429j7222p250m167J2193o241p390j5941M338J5055k2397R447j5175k9296
11754C28383K455n3M114M0893Q865k6446j0503o313j2374j3366j4236n649P181
11741C02951l27k9861j1020M158K4801L7037j9490o8148k7651J9742l789L4292
11729B62695J7842j2601p090j0310q927M367r18O556K036j3634K395K4046J9473
11716B85930K546n809m1186l920K831K6364l2007l3422P046k6751j5071K185R160
11703A77896M5168L8755l4296k087K7774j5560l4197N957L1955r513m9567l8012
$$ y = [551868, 560987, 584776, 585461, 563956, 570055, 547216, 540744, 497323, 465231, 442177, 428748, 413075, 406667, 410587, 418719, 428609, 443366, 433990, 426425, 449454, 458831, 448754, 432714, 437508, 412429, 395207, 387957, 383790, 395983, 389742, 382352, 366411, 370749, 385804, 363407, 372854, 357679, 328383, 330838, 330785, 334899, 375792, 384657, 358211, 347708, 341395, 329021, 315655, 301419, 295770, 302951, 302624, 272763, 261743, 265901, 290702, 327739, 308249, 240101, 212450, 232192, 228403, 262695, 280537, 267936, 260846, 250536, 241609, 245976, 245058, 251614, 253650, 240016, 242411, 266457, 285930, 288476, 282667, 241481, 237561, 240392, 266756, 234749, 201327, 208373, 181622, 166551, 168736, 177896, 223064, 261819, 227523, 225436, 253210, 237650, 203453, 209410, 241365, 231852, 182285, 144273]
11691A44273J3121K476o908J570p427K2415M098j47k8131J5757j3147k5706M569
11678A26813J0761J4816J9149M1702j468l433j4886l425j0335j6781J4036J6847
11666A93796o497n974j6537J744J6329k651P290M1396Q892j508K1768n015J1146
11653B64179J1196L033K9358J6354Q800Q834J0702L7308M9907M0494P3652O0450
11641F14267P0541J03500Q1535Q8938J66341K02949K17327K11350J81222J53216
11631B091186R8742K7001o4483j56141j76086k05303k03758k10651j42186j16748
11621I41573j44951j40858j00345p0316m8135o0690l0205k775j9257k3400k1722
11610B78919o334l2790j2228j6903k3298j3793l34k8976K5091L0067L546l0426
$$ y = [144273, 157394, 159870, 152962, 154532, 147105, 169520, 173618, 173471, 145340, 161097, 147950, 122244, 126813, 137574, 152390, 171539, 213241, 211773, 208340, 193454, 190029, 179694, 162913, 176949, 193796, 187299, 181325, 164788, 166532, 182861, 180210, 187500, 228896, 237788, 236280, 258048, 253033, 264179, 275375, 278408, 307766, 324120, 332920, 341754, 352456, 389764, 439671, 480165, 553817, 614267, 684808, 788308, 869843, 958781, 1125122, 1328071, 1545398, 1756748, 1937970, 2091186, 2189928, 2216929, 2152446, 1996305, 1820219, 1614916, 1411158, 1200507, 1058321, 941573, 796622, 655764, 555419, 485103, 436968, 376278, 346073, 343298, 324041, 300641, 278919, 272585, 239795, 227567, 210664, 187366, 173573, 173239, 144263, 169354, 199421, 202967, 172541]
11598A72541n9524j3674m114J828K4946J4608O896Q908l6571j6973k682r270j3614
11585G3305n422r1N4390K1245j9680j7995q582K9703j4571l3032o313R713l7452
11572D5218j8161K1797J6071r793k9166J9568K9073O056J2375r743j2756J8062
11560H8601O423j58j7800k4705M311L4608j300j7838J213Q683j6505K9604K9596
11547A24733J027k9198k4964j3335L5180q131J1726j2930k444k0296N429K2863
11535H9660J3960k5134l3604J068j6392r849K0584Q320L337J021L4944n703j1138
11522G1074J3294k4219k124J5350J0280J8549K83l6238p080J4992o960N510k37
11509G2474j1418n948l695k5056j3348J5881K8522m057K5881m588m0267j7468
$$ y = [172541, 113017, 99343, 95229, 97057, 122003, 136611, 143507, 152415, 115844, 98871, 96189, 86919, 73305, 67883, 67792, 122182, 143427, 123747, 105752, 97170, 126873, 112302, 79270, 72957, 82670, 45218, 27057, 48854, 64925, 55132, 25966, 45534, 74607, 80663, 93038, 83295, 70539, 88601, 95024, 94866, 77066, 52361, 56672, 91280, 89980, 72142, 73355, 82038, 65533, 95137, 124733, 125760, 96562, 71598, 58263, 93443, 85312, 97038, 84108, 81664, 61368, 66797, 89660, 103620, 78486, 44882, 45950, 29558, 19709, 40293, 48613, 51950, 52971, 87915, 82212, 71074, 84368, 60149, 58025, 73375, 83655, 102204, 102487, 66249, 59169, 74161, 67201, 72711, 72474, 61056, 55108, 51413, 26357, 13009, 28890, 57412, 53355, 79236, 74648, 34381, 16913]
11497A6913N61q222J5371L0125n447j3454J570K5385k4030o450l30k2655k776
11484F561L5290M5869j6458m982q784j2767L1419M8669P386m6659l9070n815K8625
11471F9284j8892l2399P287j3590k1746L9612K3994j2115j2073J02j2558J875
11459A8781J0670j3525n377k2754O887J0860K0196K0409J002J2324K424m4115
11447A7782J6423L2222j9515K220L2816J0098m7826m0044j0261J6285K30O485
11435A6915O553J2002K0372J2818K0925m550q628o349M008k488J8300n254p402
11422G7222n594k340k1579Q35m140j1944J2136L1523l4792J5015l913m1528l3124
11409b2223K0490R504p37K1705L908K6336j2065k1380m873M6289J2554m8652l0234
$$ y = [16913, 17474, 9252, 24623, 54748, 49301, 35847, 37417, 62802, 38772, 32322, 31992, 9337, 6561, 41851, 87720, 71262, 66280, 57496, 44729, 76148, 124817, 132203, 85544, 46474, 40659, 69284, 50392, 17993, 25280, 11690, -10056, 29556, 53550, 41435, 29362, 29464, 16906, 18781, 29451, 15926, 10549, -12205, -5318, 5542, 25738, 46147, 47149, 59473, 61897, 17782, 34205, 66427, 46912, 49132, 81948, 92046, 44220, 4176, -6085, 10200, 10430, 16915, 23468, 35470, 55842, 68660, 89585, 85035, 76407, 70058, 74066, 71578, 89878, 84624, 77222, 71628, 69288, 47709, 48544, 44404, 32460, 44596, 76119, 41327, 56342, 52429, 10901, -22223, -1733, 7771, 7034, 28739, 32647, 58983, 46918, 25538, 20665, 66954, 79508, 30856, 622]
11396F22J470J1869J4141P293K748k8679k6558Q087L5097M593k2914J4439j9069
11383C139l9462K1059O0138O460j7000J1063K5765j0284m8546O637K320P837k973
11370B6153j0517j1333k3099J2191L0471J6768r365j6697l2805k8235K0053J5639
11358a0776J2260K179k6263j8589K9048O245P133M632M151L006j0574K5119P559
11345C5130P866K0508L812N825j6409m948q719o672L520P305k1571j5403j2709
11332b465j8234l763N654K9966k3741j6608J0661L0518j5498M555K1765K45l3510
11319a0455j5224N482J6720M2096k9338j153M72M562k3469K9750J4887k2207m1193
11306b9070R43M664L1099J1343M34K8597P882k8647l601l6070K1350L7080j6790
$$ y = [622, 2092, 13961, 28102, 35395, 38143, 9464, -17094, -9007, 26090, 30683, 7769, 22208, 3139, -36323, -15264, 44874, 51334, 34334, 45397, 71162, 60878, 12332, 18969, 21289, 29126, 26153, 15636, 4303, -18796, -6605, 23866, 40634, 31269, 14572, -18233, -46468, -26415, -10776, 1484, 3663, -22600, -41189, -12141, -5896, 1237, 5869, 10020, 13026, 2452, 27571, 35130, 42996, 63504, 67316, 73141, 56732, 51784, 43065, 36393, 39913, 47218, 25647, 10244, -2465, -20699, -24462, -18808, 11158, -12583, -29191, -18530, 11988, -3510, 1045, 22810, 23055, -10455, -25679, -20197, -3477, 38619, 9281, 8128, 8600, 13162, -10307, 19443, 34330, 12123, -29070, -28127, -23463, 7636, 18979, 19413, 48010, 55892, 27245, 23644, -12426, 8924, 46004, 29214]
11293B9214k5795L857K1401J8452K125k5815J1976N762K2634r530k1859r816J177
11280B3783Q856m680m524N219R168J5804j3162m9229l308L348K1264n77j4734
11267b772o223k22J6806N75K0674J2602j3958j0383J158k5817j2604k898K2815
11254b47M6381J5149j0258k2992m4988k0039K0610K1258L007k4844K2609j917
11242C729k2030K128J0220k347k2179P618K8611K5311O952l694J0117k1434J554
11229B4556k9833M252m555K0684N458N708P515j2045j944K1628M593j9633L006
11216B9390L755j6546k0670K824N083j9131P781q44m326K0053K3413j3010k1933
11203d161J520N049J2243j0884j3588l557J0118J6663J002p132o096K6928L2391
$$ y = [29214, 3419, 7276, 28677, 47129, 49254, 23439, 35415, 41177, 63811, 54281, 32422, 22606, 23783, 32639, 27959, 23435, 28654, 37822, 53626, 40464, -8765, -12073, -8725, 12539, 11962, -2772, -8995, -9217, 7589, 8164, 28838, 41440, 27482, 17099, 18257, -7560, -20164, -23062, -247, 46134, 61283, 51025, 28033, -16955, -36994, -16384, 4874, 7881, -16963, 5646, 3729, -18301, -16173, -5953, -8300, -30479, -22861, 5750, 31061, 38013, 34319, 44436, 23002, 24556, -5277, -1025, -5580, 15104, 20562, 26270, 33785, 21740, 19796, 41424, 46017, 26384, 29390, 33145, 16599, -4071, -1247, 3836, -15295, -7514, -8358, -12684, 7369, 30782, 17772, -4161, -2641, 2408, 14651, 3767, -9821, -13378, -3260, 13403, 14405, 7273, 1177, 28105, 60496]
11190F0496k9446j3435J7690R447j0153k871O384o106l7799o560K1874K9503P801
11177D6825o716j9995J2075L011r187p961k7387n188K8608K2109p912j1619P556
11164B4219K1093j9200k1697K0648K2682O777l0317J0884j3448K062q186N840
11152B1357j6392r855n142l893k24N382K717K761J1848R886k557L60k6035j0183
11138a9970J4195J5077k214k3258p02L5996Q595O57J3937j1182Q671k7076j6490
11125c764l918j1716K78J4668K6693P977l631Q057k5354o880J5487K1844l63o290
11111C3088O043Q888j0360M352k1036k8030O346L8363J8063m0100l1760J1668
11099d475J839J242P374r024J3790l937j894K7153j1469j1395K856L200N880r371
$$ y = [60496, 31050, 17615, 35305, 44752, 34599, 31728, 38112, 32006, -5793, -12353, 9521, 39024, 46825, 40109, 20114, 32189, 35200, 26013, 18052, -9335, -14523, 14085, 36194, 28282, 16663, 24219, 45312, 26112, 4415, 25063, 47745, 54522, 24205, 35089, 21641, 23703, 15517, 21357, 4965, -4890, -10032, -13925, -14149, -8767, -6050, -3289, 8559, 18445, 15888, 16248, -9787, -19970, -5775, 9302, 7088, -16170, -16872, 19124, 27719, 28376, 42313, 31131, 39802, 12726, -3764, -7682, -19398, -19120, -4452, 22241, 30218, 26587, 34644, 9290, 2410, 17897, 39741, 39378, 33088, 39131, 48019, 37659, 42011, 20975, -7055, -709, 37654, 55717, 15617, -16143, -4475, -2636, -1394, 5980, -3044, 10746, 6809, 4915, 32068, 20599, 9204, 12060, 15260, 21140, 11769]
11085A1769j3217O336j094P259J4683j7305m4487j941J7922l570j661M4705J4644
11072C4043k9449q710R119L591k5220k6363N197M754K0849J2938n735l164k9747
11059c7897o398J6719J7374Q380J4517K3051j8111k6322J7618R812j0102j2492
11047c851J576N751L2592k93L4194K3256J528L483j1259K0214K0204k0767N320
11034A11948K0964l336l1749j8384p700M7020K6638J3942M2297Q030j3589K4000
11022B20081J0591k9293j6478p332J3020L0686L0503L8563N4272J1600J86j7227
11010C39172n4450o191l698l4611k0487j1503n123J6829O55R425r789k4082l6786
10997A59361j4716k7786N614K1298l332j1387j9785j4124j1786J0674J0744j9903
$$ y = [11769, -1448, 4888, 3794, 11053, 25736, 8431, -36056, -37997, -20075, -23645, -25306, 19399, 34043, 4594, -4116, 5003, 8594, -16626, -42989, -37792, -33038, -12189, 749, -4986, -8150, -37897, -44295, -27576, -10202, -1822, 12695, 35746, 17635, -8687, 8931, 18743, 8641, -3851, -2275, 3476, 36068, 35775, 69969, 93225, 94753, 98236, 86977, 107191, 127395, 106628, 111948, 132912, 129576, 97827, 79443, 71743, 118763, 145401, 159343, 201640, 209670, 196081, 220081, 230672, 201379, 184901, 177569, 190589, 221275, 251778, 290341, 344613, 356213, 356399, 339172, 284722, 278531, 274833, 240222, 219735, 208232, 203109, 219938, 220593, 230018, 220229, 196147, 159361, 144645, 116859, 122473, 143771, 140439, 129052, 109267, 95143, 83357, 94031, 104775, 84872]
10985H4872m404j9875k0139j9550p39j7689k029K9502L3148k167j693J5687j5006
10972E9918j4641j0515M421o461J7835J2120L1054J3032m989K508J8835l790o5389
10959E3938l2458K2567K6327K800n595r997j1892J5041N444m8677l444L3795k4946
10946B2903j0921J9796J4664O915k1657l612j3170k416J8873M912K850n463n542
10933B8132n450k5888M902k8106J327L0276K1141J3889J5907q710l0732K074J1421
10920C0183M820j3021j674o372Q534M177R53J3359q225p611k0582k0005j2951
10907b8415K4436J7309L093R026m463j8688L80M5843J5231J0785l7794k4457R893
10894B2179j7510l47k783l580K7382P453k1504K0875J2592M416j6895J0976r062
$$ y = [84872, 80468, 60593, 40454, 20904, 20165, 2476, 447, 29949, 63097, 60930, 59237, 74924, 59918, 45277, 34762, 39183, 32722, 50557, 62677, 93731, 106763, 101774, 104282, 123117, 119327, 53938, 21480, 44047, 70374, 73174, 67579, 57582, 45690, 60731, 66175, 17498, 14054, 47849, 22903, 11982, 31778, 46442, 53357, 31700, 28088, 14918, 12502, 31375, 36287, 39137, 33674, 28132, 22682, -3206, 1696, -26410, -25083, 5193, 26334, 40223, 56130, 47420, 16688, 18762, 30183, 35003, 21982, 20308, 13936, 22470, 26647, 27600, 40959, 32734, 25123, 4541, -15464, -28415, -3979, 13330, 16423, 25449, 20986, 2298, 2678, 48521, 63752, 74537, 36743, 12286, 22179, 4669, 4322, 1539, -2041, 25341, 32794, 11290, 32165, 44757, 49173, 32278, 43254, 34192]
10881C4192p540L860k1414n379M0055J9054J1466M078k3321l5273n374j5578j84
10868a358K731J615j8686K1249M8099r9k0389J8507K2089j267O870n030l0717
10855D3614q841k0676l482K9280m764k8794q22j7331j0316J4015P717L6283M2401
10842G8284k9676k6694J1712K5034K0205q906M21j0540k0345J1235K3876j7411
10830E7195k0137l689j3523m415K8305k776j6372J5985Q465J2152l964J7055L0066
10817A04347k5199j3816K6474J5065l2382m1524p135J3051J2420M414j4612p50
10805D0353j013Q507o707r004M052J1948l026j9980j5085j703k954j6666J9503
10792H225L0990R180k9132M44K2316J78j1682K898k4568L244q385l475N873j5083
$$ y = [34192, 26652, 30512, 9098, 3719, 43774, 62828, 74294, 78372, 55051, 19778, 14404, -1174, -1358, 1373, 2988, -15698, 5551, 53650, 53551, 33162, 51669, 73758, 72491, 79361, 74331, 43614, 34773, 14097, 10615, 39895, 35131, 6337, 5515, -11816, -22132, -8117, -400, 35883, 78284, 48608, 21914, 33626, 58660, 78865, 69959, 70380, 59840, 39495, 50730, 74606, 57195, 37058, 33369, 19846, 15431, 43736, 40960, 24588, 40573, 49038, 61190, 57226, 74281, 104347, 79148, 65332, 91806, 106871, 74489, 32965, 25830, 38881, 51301, 55715, 41103, 40353, 39340, 47847, 41140, 32136, 36188, 48136, 45110, 25130, 10045, 8342, 5388, -11278, 8225, 39215, 48395, 19263, 19707, 42023, 42201, 30519, 33417, 8849, 12093, 3708, 233, 6106, -8977]
10778h977j243J527l8124K6645K9114k2634j2326L062L7521L4663k8427l6230
10766a5429j1187J9262k470L4720O464k9771j5111n447j740o216n29J027K0261
10753f166R084L6573K9207l4668l1408k4199n527J8106q064o899k1785j085j3739
10740f0570j7487k671L089l680L0988J3792K7103K3737j0520O733L5627k0992
10728B5149l4256P699Q040P25K6854p704p207j2127l957j4824K7857J7472J1106
10715D4827J1058K8838j43j5957o611R843o438Q268L8153J3527J032Q207o013
10702A28591J8300J0756m361R037J2325J7804j3693k6533O070R040J2989o526
10690A73799R034K0838j4015m6709r602L8685J7976M03p955j2699M567M399j987
$$ y = [-8977, -10220, -8693, -46817, -20172, 8942, -13692, -26018, -22956, 14565, 49228, 20801, -15429, -26616, -7354, -9824, 24896, 31360, 1589, -13522, -18969, -20709, -26925, -27454, -26427, -6166, 2918, 39491, 68698, 34030, 2622, -21577, -27104, -8998, -17062, -23961, -45746, -46831, -60570, -78057, -80728, -77639, -81319, -50331, -36539, -9436, 14301, 3781, 10514, 46141, 25149, -9107, -1408, 6632, 7357, 34211, 26507, 19300, 7173, 3216, -11608, 16249, 33721, 44827, 55885, 84723, 84580, 68623, 62012, 71855, 65417, 73685, 111838, 125365, 126397, 134604, 128591, 146891, 157647, 153286, 162323, 174648, 192452, 178759, 152226, 158296, 167336, 180325, 173799, 182833, 203671, 189656, 142947, 133345, 172030, 190006, 190409, 182454, 169755, 174322, 178721, 176734]
10677A76734L294j2474p853K1634K9259j9312j362K6050O752r88N664Q869n58
10664B35709J1970J3975k2443j4856j4068j2394R774Q1O056L8179K971M206L1085
10651B90245j0385k2391J6620L5178J7374J6602J093L8260J2871j3179J7922J592
10639D01802K8960M2434j2174j182L2401N8848K9868L2849M5172K5465L0529K3610
10627G38582N6644P7159J12284J37102J28466J15362J18362J01095R7919J49486
10617A832461K21547K81695L30469N14615O65803Q85816J244890J672312K202220
10608I851828K816986K973881K359240J134346o6904o96620p44996m08846K64518
10599A7483433J287330K580368M135742N649824O065727M222723P92748k108116
$$ y = [176734, 180028, 167554, 159701, 181335, 210594, 191282, 189920, 215970, 222722, 221734, 227398, 236267, 235709, 247679, 261654, 239211, 224355, 210287, 197893, 207667, 207748, 213804, 251983, 254954, 259160, 290245, 279860, 257469, 274089, 309267, 326641, 343243, 344336, 382596, 395467, 382288, 400210, 401802, 430762, 473196, 461022, 459840, 492241, 551089, 580957, 613806, 658978, 684443, 714972, 738582, 795226, 872385, 984669, 1121771, 1250237, 1365599, 1483961, 1585056, 1682975, 1832461, 2054008, 2335703, 2666172, 3180787, 3846590, 4732406, 5977296, 7649608, 9851828, 12668814, 15642695, 18001935, 19136281, 19069377, 18372757, 17627761, 17218915, 17483433, 18770763, 21351131, 25486873, 31136697, 37202424, 41425147, 42217895, 40109779]
10591D0109779l306861l189940k248775p51815J019625L109093N407562P350159
10583D7498827P357664M044064j159120n071379o551125o187292m809962l136010
10575C1985667j271477O65506K566414L874556L604366J129005k361762m751749
10567C5440526n372065m851639l774198k581088j418805l84385M99216R54889
10559A8512451P08892l39899j618306k491840k742757k516753k111049j635100
10551E765639j259694r42234o91500n05102l58227k54382k16162j28326j64255
10542A245757j44688j36697j17323p6971n8526n4112o2322p3099l7791k2048j6824
10531D45356k4607l3917k0106j4701K567j6076k6036j5148k6324j9468k1226k7352
$$ y = [40109779, 36802918, 33612978, 31364203, 30612388, 31632013, 34741106, 40148668, 47498827, 54856491, 58900555, 57741435, 52670056, 46118931, 39931639, 35121677, 31985667, 30714190, 31379696, 33946110, 37820666, 41425032, 42554037, 40192275, 35440526, 30068461, 25216822, 21442624, 18861536, 17442731, 17058346, 17557562, 18512451, 19221343, 18881444, 17263138, 14771298, 12028541, 9511788, 7400739, 5765639, 4505945, 3563711, 2872211, 2367109, 2008882, 1754500, 1538338, 1410012, 1245757, 1101069, 964372, 847049, 770078, 711552, 657440, 595118, 522019, 484228, 462180, 445356, 420749, 386832, 366726, 352025, 354592, 338516, 312480, 297332, 271008, 251540, 230314, 202962]
10519B02962n060K981J0033k5459m4582l2783K0278L6765J6633R815J1476J6633
10507B19692K358j4136l9533m9517j2598j8195k5264l673J3751J8898R763j7335
10495H4211J4325k534j9841l0946L395K8547n702k0052O792l565k612J5712P464
10482G5194j2909k5085j7949m8568J5031L4982N069J0833j4321p071j7562J5814
10470A3458R278q094k0116n075J7791k3222j3909j4938K0417L8792L200J1401
10458B8983J0651P498k9442j7620k5468k874J5555K2362K7202n860j4438J2614
10446B9163K2501J6065m5250j3036K9910K7847K4081n727K428q168M650J907l2612
10433E3759N255m825J5163K6264K8223N87K2115k9474l2147J7584O487p436j4065
$$ y = [202962, 197902, 200883, 210916, 185457, 140875, 108092, 128370, 165135, 181768, 191583, 203059, 219692, 222050, 207914, 168381, 118864, 106266, 88071, 62807, 59134, 72885, 91783, 101546, 84211, 98536, 96002, 76161, 45215, 48610, 77157, 71455, 51403, 58195, 54630, 52018, 67730, 75194, 62285, 37200, 19251, -29317, -14286, 20696, 25765, 36598, 22277, 15206, -2356, 13458, 22736, 14642, -5474, -10549, 7242, -15980, -29889, -44827, -24410, 14382, 17582, 28983, 39634, 47132, 17690, 70, -25398, -28272, -12717, 9645, 36847, 30987, 16549, 29163, 51664, 67729, 22479, 9443, 39353, 67200, 91281, 85554, 87982, 79814, 84464, 86371, 53759, 59014, 54189, 69352, 95616, 123839, 124426, 146541, 117067, 84920, 102504, 108991, 101555, 87490]
10420H7490j7161Q568K8727k720j8069j6305N348J8875j8756l7036j9798K7063
10408D6226K6847n06K1825K8678Q119l7917l7962q243N044k0779M581J3299n948
10395D3264j0426p33J402j2964r013J252P822J8587J4191r378j978l624N668J7928
10381F1998j2565p849j2604k91j383m557L474R779L5507k3457n23K5434j2018
10368F0945m9170k0941j9812R338O828j1496R457M623k6275l932L4171P452j7816
10355a6628j9842j2991M0627J867j4330j5277r01J8252K9991L53m3694J0077O726
10342a5770m17L577K422J5396K3305k8711j6130J2906l97j6050R162J4890R808
10329A3991K1199j7385K9708j1326J229j0908L208p516O57j0583L366J3195M6236
$$ y = [87490, 70329, 78897, 107624, 104904, 86835, 70530, 75878, 94753, 75997, 38961, 19163, 46226, 73073, 72567, 94392, 123070, 131189, 93272, 55310, 47067, 52111, 31332, 35913, 49212, 43264, 32838, 32105, 33507, 20543, 11530, 12782, 20604, 39191, 53382, 44004, 42026, 38402, 44070, 61998, 49433, 41584, 28980, 28689, 27306, 22749, 26223, 36002, 71509, 48052, 47529, 72963, 60945, 11775, -9166, -28978, -19640, -12812, -24308, -14851, -10228, -36503, -40435, -6264, 1188, -16628, -36470, -49461, -8834, -6967, -21297, -36574, -37475, -19223, 10768, 11121, -32573, -22496, -15770, -16187, -12610, -10188, 5208, 28513, -198, -16328, -3422, -3819, -19869, -10707, 4183, 13991, 35190, 17805, 47513, 36187, 37416, 26508, 29716, 22200, 22857, 12274, 15640, 28835, 75071]
10316G5071J3109l8290k9979J1543J8243j0192j4012k4319j9682J2967L8713p631
10304B5541q498J0838l8343p802K3193O814q300J7854J9755N637j3082m4533O947
10291c979J7469l896j1601N243l0204j0482q143l9633K0890J9649k835J9101J8833
10278i588j3211N833K6193K744J1623n966R91k8699l7208l5018O569M1046M6000
10265A1309r34j2822J8680J2515j32m932j5739J4095R657J3806J7845m457o329
10252E2562L442o594J5639k461J0073q72k0646J445k2168j539J0723j7028k4990
10239b414l1245J2816q147j5703J7807K5251J3897l114P934J158n094K2092P01
10226C5939J923j4382j3104Q322k046k0947J6310J4592j1579K8252J9983j3107
$$ y = [75071, 88180, 49890, 19911, 31454, 49697, 39505, 25493, 1174, -18508, -5541, 33172, 25541, 17043, 27881, -10462, -18264, 4929, 11743, 3443, 21297, 41052, 46689, 33607, -10926, -3979, 13490, 9594, -2007, 3236, -26968, -37450, -45593, -85226, -64336, -44687, -47522, -28421, -9588, -22799, -16966, 9227, 11971, 23594, 17628, 18619, -10080, -47288, -82306, -75737, -34691, 11309, 10375, -2447, 16233, 28748, 28616, 23684, 7945, 22040, 31697, 45503, 63348, 58891, 52562, 56004, 49410, 65049, 62588, 72661, 71789, 51143, 52588, 30420, 28881, 39604, 22576, -2414, -33659, -20843, -28990, -44693, -26886, -1635, 12262, 9148, 17082, 18240, 13146, 35238, 35939, 37862, 23480, 10376, 18698, 16652, -4295, 12015, 26607, 15028, 43280, 63263, 50156]
10214E0156j3328p466m081J2217k3629j1699N88l24k7615l1804L3674K835L273
10201a7203K1779M613J0207J417M9531n303l7898j7162j8351Q569K0313K7498
10189D8010j5038k48N805J4102J6722K5029j8362k4476l0K386J4353K2259k1945
10176F8567j0388N68j9992Q675j3701M1335L4709J5276k3947l5999k7697j4680
10164B2726K9699K1325J4396M2228J1780L3050K1235L2725K03r523j8805j523
10152A99516K6315J9415k1123O019K7676K8266L2707k0068k0410k3149n183N657
10140B55638O210p108k5257l4145l427q068J7194K3082j8612r609q663l6244j9049
10127A31942k1322l0962p533Q975K4367J2142l4183l9088J0370l814k8568J7592
$$ y = [50156, 36828, 29362, 25281, 37498, 13869, 2170, 2758, 2434, -25181, -56985, -23311, -20476, -17203, 4576, 9189, 19396, 20813, 70344, 65041, 27143, 9981, -8370, 199, 20512, 48010, 32972, 32724, 38529, 52631, 69353, 94382, 76020, 51544, 51514, 53900, 68253, 90512, 68567, 58179, 58747, 38755, 47430, 33729, 75064, 109773, 125049, 101102, 65103, 37406, 22726, 52425, 73750, 88146, 130374, 142154, 175204, 196439, 229164, 229367, 219844, 201039, 199516, 225831, 245246, 224123, 230142, 257818, 286084, 318791, 298723, 278313, 255164, 249981, 255638, 261848, 254740, 229483, 195338, 191911, 183843, 201037, 224119, 205507, 195898, 187235, 150991, 131942, 110620, 79658, 72125, 81100, 105467, 117609, 83426, 44338, 54708, 50894, 22326, 39918]
10115C9918J9795M895k5838k2868J3676o027k2426o909K5758K2230j5330j4119
10103A2755j3992q403m583l243m829M4776N551r000r906k5129j341O432Q891l975
10089e996L209J8899j4922m365L1943L345o05J078k3916j476Q246n566j3125l29
10075c580J885l5278k1370K4230K2379l766j1136J9168K2002J794n458j815j299
10062G756r882j1091J1579J1358k3174N318R432M903j548r822K227n82J3266K6641
10048C6381L337r701m3879k0153j152j900J402J0385k5165j9860N226K0519L1084
10035a3476J7238j4250N2K464q026J3540M601m329k0658j063K5211J5091n954
10022A0441k12J3573j0740l452r85L151P96l4135j5745J7153p778L2J2522J7779
$$ y = [39918, 59713, 64608, 38770, 15902, 29578, 23551, 1125, -5784, 19974, 42204, 26874, 12755, -1237, -9640, -14223, -17466, -22295, 22481, 28032, 19032, 9126, -16003, -17344, -10912, -2021, -5996, -2787, 16112, 1190, -3175, 28768, 32113, 31508, 32586, 8670, 7194, 15440, 9874, -3251, -3580, -1695, -36973, -58343, -34113, -11734, -15500, -26636, -7468, 14534, 16328, 10870, 9055, 7756, -2126, -13217, -1638, 9720, -13454, -8136, 1296, 6199, 4651, -5171, -2944, -3526, 9740, 36381, 39718, 30017, -13862, -34015, -35167, -37067, -35665, -25280, -50445, -70305, -65079, -44560, -13476, 3762, -10488, -10436, -7972, -15998, -2458, 2143, -2186, -22844, -23907, 1304, 16395, 10441, 10229, 23802, 13062, 9610, 8625, 11776, 12572, -21563, -37308, -20155, -27933, -27901, -15379, 2400]
10008B400R537K4804R731J4961M328L494k3949l0104K449j5568m827J9963p586
9995I633k1546Q557n306j7216L8400j552O37m42j6055j128J7348J6929Q88j6399
9981A2748J9388K7829R022k6200J4899O732j0739k7291j2370l659R673K525p655
9968A4902q69K7734J7260l8672k6587J2549m767m4295K0828N9350N173j9099k9491
9955e984q650K2960K6443k657j1317m493Q88J249J3952l2404N350J4824J3446
9942C3607K1937R062K9681L6993N8515M4781j6921r394k2306j1379L8871L1656
9930B45103M8870O8220P2295R2703J66485K17849L72231P04159J377177K829321
9920F194413M677412J882925k494337l040274k343908j573053j087153p82496
$$ y = [2400, 11937, 36741, 46472, 61433, 65761, 69255, 45306, 15202, 17651, 2083, -2744, 17219, 9633, -11913, -3356, -8662, -25878, 12522, 10970, 11607, 11165, -4890, -6018, 11330, 28259, 29147, 12748, 32136, 59965, 68987, 42787, 57686, 64418, 53679, 26388, 14018, 10359, 20032, 22557, 14902, 14033, 41767, 59027, 20355, -6232, 6317, 1550, -42745, -21917, 37433, 42606, 23507, -5984, -14634, 8326, 34769, 32112, 20795, 16302, 17190, 18439, 32391, -13, 5337, 20161, 33607, 55544, 64606, 94287, 131280, 189795, 234576, 217655, 208261, 185955, 174576, 213447, 245103, 293973, 362193, 434488, 527191, 693676, 911525, 1283756, 1987915, 3365092, 6194413, 10871825, 12754750, 10260413, 7220139, 4876231, 3303178, 2216025, 1433529]
9912A433529m90278k55505j57386r7978p1067o1639o5819k9504l1907p84k5227
9901A46435j7707j4791j2036j2573j524l6199l1688n948o45J3501j5563O010R979
9888B7251k0627O028J0383L1369P171m1907k3220K0343M900l2862r86R582k8222
9875c0797R259k4200j0292L3278L2302j6894k3757l649K7468L276r41J2111M965
9862A2129J1939l999R829K8627o641k6805j5926L935k857k1749J5736M4196j3010
9849C5404r210J9590O897j4869j6509j6583K1560O619p439K3749J0359m0891k3796
9836e119m3443o665j1093j2841J8113L3926k487J8489J2966R100n030k9965l992
9823b8041j7979J9234K8788J7899O851l4577j3169J5965J8601j320k6045j3354
$$ y = [1433529, 943251, 687746, 530360, 432382, 361315, 299676, 233857, 204353, 172446, 171662, 146435, 128728, 113937, 101901, 89328, 87804, 51605, 19917, 13969, 13324, 26825, 11262, 17272, 27251, 6624, 12652, 23035, 54404, 61575, 19668, -3552, 16791, 21691, -11171, -12157, -2575, -30797, -21538, -45738, -56030, -22752, 9550, -7344, -31101, -34750, -7282, -4006, -4947, 7164, 12129, 24068, 20069, 29898, 58525, 51884, 25079, 9153, 13088, 10231, -11518, 4218, 48414, 35404, 26194, 45784, 52681, 37812, 21303, 4720, 26280, 32899, 25460, 49209, 59568, 18677, -5119, -48562, -55227, -66320, -79161, -61048, -27122, -29609, -11120, 1846, 10946, 5916, -24049, -28041, -46020, -26786, 2002, 19901, 26752, -7825, -20994, -5029, 13572, 12252, -13793, -27147]
9811b7147j8837N435J6909J6867K5165L5960j8648k0582p43j6002m6771K247J9409
9798b6738L3379J8709j4935o555n08j2549M575k2182j3601P446O281o27k417j3451
9784d3173L757N261o47L7387K843J5913J1714p274m2710r879n531O830k3799l018
9770e2326K3698L464J7358j0785N451K3604j4105m2992k369L9394J9668k0487
9758a0427K969R01Q052k625K4119L4219J7610p045k2570k5673M486J7293p890
9745C3419j1021J0284k8505r792M852O844r25j0558j8404K067M425l0263J4436
9732c3141J9211J9146j628j0060m660L223j3377j5444Q832J0331k189n64n591
9719b5911j1517J5197Q572k857Q717m175r216Q526n296J3184K4999j9390j3001
$$ y = [-27147, -45984, -40549, -23640, -6773, 18392, 54352, 35704, 15122, 14379, -1623, -48394, -46147, -26738, 6641, 25350, 10415, 3860, 3352, -9197, -4622, -26804, -40405, -32959, -26678, -27305, -29722, -43173, -39416, -34155, -34802, 2585, 5428, 21341, 33055, 25781, -16929, -26808, -32339, -25509, -49308, -52326, -28628, -25164, -7806, -18591, -13140, 10464, -3641, -46633, -49002, -9608, 10060, -10427, -7458, -6557, 1495, -1130, 22989, 57208, 74818, 67773, 45203, 19530, 24016, 41309, 33419, 22398, 32682, 4177, -5615, -763, 6081, 5156, -5402, -23806, -21739, -17314, -47577, -33141, -13930, 5216, 3588, -6472, -11132, -7909, -21286, -36730, -27898, -17567, -19756, -20320, -25911, -37428, -22231, -13659, -16516, -7799, -11974, -21190, -12664, -17960, -4776, 20223, 833, -12168]
9706a2168k1503q95o724J1129r060J9447L1796P024J9999j6887l9553N707k6397
9693c8085N943L5812K9263O400l7398j3959k4379J4228K2230J6904p984l6449
9681b7474n2466J5969L9730L76q661Q475J5080j9831j3400J7568M208R401j0015
9668b1040J3131K829k5291r327J3344L1684M536Q137R31q472P225j1392j9300
9655a3005J4574l910o788J6056J4651n610Q474J0158j3556k1277n009L5133K0118
9642E0009L905J3572L7730J1860n259m6494m8852j7064j2093m876J673p349o244
9629b9482j7400k845J8434N555L992q764j4836O69J8115J8645n508j8317J9705
9616a2037l453K691P75j8235k3394J6821r02p284J4840n201K7491j2316l2915
$$ y = [-12168, -33671, -34566, -41290, -30161, -39221, -19774, 12022, 19046, 39045, 22158, -17395, -11688, -38085, -32142, 3670, 32933, 39333, 1935, -12024, -36403, -22175, 55, 16959, 8975, -27474, -79940, -63971, -24241, -23865, -32526, -24051, -8971, -28802, -42202, -24634, -20426, -11025, -21040, -7909, -5080, -30371, -39698, -26354, 5330, 9866, 18003, 18934, 10462, 17687, 6295, -13005, 1569, -2341, -9129, 6927, 21578, 15968, 24442, 34600, 21044, -233, -5242, 29891, 50009, 53914, 67486, 105216, 117076, 111817, 65323, 16471, -593, -12686, -17562, -15889, -23238, -29482, -46882, -49727, -31293, -25738, -21746, -30510, -45346, -44677, -26562, -7917, -13425, -31742, -12037, -15490, -12799, -12024, -30259, -53653, -36832, -37734, -45018, -30178, -35379, -7888, -20204, -53119]
9603e3119K1081K4697j8279L730j951k2432k432j0211k9980j30K0723O1959J6349
9590A0005J0163L7299J9927l4768l3030j5382r76k2703Q529q956R124j3451J9780
9577a4439O927l9600l2730L0471L6889K3137M747k4332n2255J0285L7146L2821
9565A9067l780j1200J2308K148p318O310j4229J6862r540m815R529P181q633J0206
9551B4096K4334q190k7573p364J303J725q284k135K6865l0089l6764j4328K6869
9538b9535J8790j9198q922J806p990J3510L8628L140j6310j7999j5459K792L069
9525c3678k3831R375L6957L2708j3975L147P129k562l4672j4920K8274R429J2423
9512A5804K2315j3548j2239n802j5116J8679l390p254J614L0687r163K919J0743
$$ y = [-53119, -32038, -7341, -25620, -21890, -23841, -46273, -48705, -58916, -88896, -89026, -68303, -6344, 10005, 20168, 57467, 77394, 42626, 9596, -5786, -6762, -29465, -20936, -29892, -20768, -34219, -14439, -7512, -47112, -79842, -49371, -12482, 10655, 15402, -8930, -61185, -50900, -13754, 19067, 15287, 4087, 16395, 18543, 11225, 17535, 3306, 20168, 10628, 5813, 15342, 22523, 13890, 24096, 48430, 40240, 12667, 5303, 6606, 8331, 47, -2088, 24777, -5312, -42076, -56404, -29535, -10745, -29943, -38865, -37059, -45049, -31539, 7089, 10229, -6081, -24080, -39539, -36747, -33678, -57509, -48134, -11177, 21531, 7556, 10703, 17832, 15270, -19402, -34322, -6048, 3381, 15804, 38119, 24571, 12332, 6530, -8586, 10093, 6703, -551, 1063, 31750, 22587, 25506, 36249]
9499C6249Q06j7031O094j9624l1624J0128k0237P517L7966Q223l1212l2275K1937
9486b3083J967p769j0864j4290K4750J9820K4781l5744j7991K167l989L849J7642
9473a8754J3034q45J8030K443j5973Q572k1189k0011J9108K8041R449K048j7802
9460F151j7104o51k392L154L222J365Q372J5639q771J8294J984j1799Q752j5290
9446A0926n851l0561j2495K2791L1038j686l2383N176J8526J297j0225J7001Q571
9433B2125J247p288p278l641k2375J1090K1648L1590K5427j9804q069J6647k5360
9420C5959j8536k7039r403k1545L83J6833k241J116j292K667p133l6547p324R914
9406f4188J2510K3456m004P771O917q495O360n595j1927J4278J9514n299j6485
$$ y = [36249, 37055, 20024, 26118, 6494, -25130, -15002, -35239, -27722, 10244, 18467, -12745, -45020, -23083, -21116, -28885, -39749, -54039, -29289, -9469, 15312, -20432, -38423, -36256, -40245, -36396, -18754, -5720, -6565, 11465, 13908, -2065, 6507, -14682, -34693, -15585, 12456, 21905, 23953, 6151, -10953, -11604, -13996, -10842, -7620, -6255, 2117, 17756, 8985, 27279, 29263, 17464, 26216, 10926, 5075, -25486, -37981, -15190, 15848, 14162, -18221, -13045, 5481, 6778, -3447, 13554, 22125, 23372, 16084, 8806, 5165, -17210, -6120, 15528, 47118, 72545, 52741, 44672, 61319, 35959, 17423, -9616, -19019, -40564, -40181, -23348, -25589, -24473, -25765, -23098, -30231, -66778, -74102, -64188, -51678, -28222, -32226, -24455, -17538, -26033, -19673, -25268, -37195, -22917, -3403, -8702, -25187]
9393b5187k2183J9115J5134L3230l6667n392K9463J444M89j1232j6726j522K8517
9380H483J5428k0595r272p344l6105o76L9304J2736m3668N354K890j3934j1091
9367e8490J0734L1997N407r593k254J6109K8370j212l0953k2657J6689j8304k0190
9354e4347J489O923J3622J941n360K1322J0865J91L8173j1360j1050K3263j8977
9341A6695l2009J2422j5817k6309J2596J9285j7554n346K1853P624Q834j0491
9329h217p872n625J7468K0000P324M023k7509m019k00k2953J1620j0513k7362
9316e3835J00K0955M8108J6974j0957r481J1928j2805j2739n3546j7398N699j452
9303f8449K2479L3353K4773o768K84q121o266j2744k813k239k8681J9451m657
$$ y = [-25187, -47370, -28255, -13121, 20109, -16558, -21950, 7513, 8957, 9446, -1786, -18512, -20034, 8483, 23911, 3316, -5956, -13300, -49405, -50081, -10777, 1959, -41709, -36355, -33465, -47399, -58490, -47756, -15759, -10352, -19945, -22199, -6090, 22280, 21068, -9885, -32542, -15853, -34157, -54347, -52858, -45935, -32313, -30372, -35732, -14410, -3545, -3354, 34819, 23459, 12409, 35672, 16695, -15314, -2892, -18709, -45018, -32422, -13137, -30691, -36037, -14184, -6560, 2274, -8217, -16089, -21714, -4246, 15754, 23078, 27101, -408, -4427, -4627, -27580, -15960, -26473, -53835, -53735, -32780, 15328, 32302, 21345, 11864, 23792, 10987, -1752, -55298, -72696, -66997, -68449, -45970, -12617, 12156, 5388, 5672, -2449, -8715, -21459, -24272, -26511, -55192, -35741, -40398]
9290d0398Q401M295k7971l36R872K2456l149l4339J8221L5534J5490N722O722
9277B0520k10J5238j1603n2j5691k9874q926n735L4879K4698J3274r319l6243
9264i044r230J8305J0542J0524k4813J2043J3592j9671j7366J6003n148J6019
9252A1756K0752K3324k3963r773m135M5218o181p612l7111m3060j5131K8741J9312
9239B137k67O855J4770n414p824K8113J0162j0884m4713l5215o935K4525Q561
9226a6129m02k084o551l6393Q365j7800J6497N2651j2208o282K8559K3964O759
9213C8946k9632l8460J5753J2921M55k2807O046J1829L884r659j4627l9J4309
9200a1081J2479K9786K4323p511l2144k4670J4366J4933r900j0824n869o136j0069
$$ y = [-40398, -31997, -27702, -55673, -56009, -46137, -23681, -26830, -61169, -42948, -7414, 8076, 13798, 20520, 20310, 35548, 23945, 23893, 8202, -21672, -30598, -36333, -1454, 23244, 36518, 27199, -9044, -18274, 31, 10573, 21097, -3716, 8327, 21919, 2248, -15118, 885, -4263, 11756, 32508, 55832, 31869, 22096, 17961, 63179, 56998, 49386, 12275, -30785, -45916, -17175, 2137, 1870, 8725, 23495, 18081, 10257, 38370, 48532, 37648, -7065, -42280, -49215, -24690, -16129, -16531, -18615, -25166, -61559, -53194, -70994, -54497, -1846, -14054, -20336, 8223, 32187, 38946, 9314, -29146, -13393, -472, -17, -22824, -16778, -4949, -1065, -10724, -25351, -25390, -11081, 1398, 31184, 55507, 47996, 15852, -8818, 5548, 20481, 10581, -243, -6112, -12248, -22317]
9187b2317L230K482k7033J9631L5740n367l8657O440K7601l234L6875j8173O722
9174B3940L2401j0239l9835k4547j802J6237J5210q461L207j6599k0035q701l59
9161c9583O712K0214p287P287K5377J1571j2814j963j9787j1982J3097Q649R501
9148H992p500l4392K0516K5851k88n028l3501j6446J5285K2918M986r389L2571
9135B4575k624k0192o443j9561k8075L9801P29K4133L0521k2717l8246J1706J7786
9122A1393L386L484m304p693J1340J8434o094k0558l3652J9847K2613j2538j0805
9109e147O9K7858O480k3150j8864k4032R969L1472Q962j999j2640P528N503k1451
9095i442l854j2316J4615K556J41j0896j0718K3136J9981Q370l1436l411O320
$$ y = [-22317, -19087, -16605, -43638, -24007, 11733, 6366, -32291, -25851, 1750, -1484, 35391, 17218, 23940, 56341, 46102, 6267, -18280, -20082, -3845, 11365, 2904, 6111, -10488, -30523, -39224, -39583, -32871, -12657, -19944, -12657, 12720, 24291, 11477, 9514, -10273, -22255, -9158, -509, 8992, 1492, -32900, -12384, 13467, 13179, 8151, -25350, -41796, -26511, -3593, 1393, -7996, 24575, 21951, 1759, -4684, -24245, -52320, -12519, -11790, 12343, 42864, 20147, -18099, -6393, 11393, 14779, 18263, 13959, 6266, 17606, 36040, 29946, 9388, -24264, -4417, 18196, 5658, -5147, -5078, 22780, 29260, 6110, -12754, -36786, -26817, 4655, 13617, 11618, -1022, 6506, 12009, -9442, -13296, -25612, -10997, -8441, -8300, -19196, -29914, -6778, 13203, 21573, -9863, -13274, -6954]
9082f954M0429o035l8216K3022j0095k346J494p000L165j8664j6156m365j415
9069d3136l451J8814K3652K4164j0893J430k1623l6343L2425O456k2143L3166
9057B518J4527J0550p465L107J0900j9695j2862J163o55K869L909M665Q271k6794
9043d992l3741k0355J4621O133k583R867L6961J8471J2936K595j0454k8574j5135
9030a4250Q450K85j4126J5398L5470p018k5067k3077j3234J1077J115N434M247
9017a5296p887J4411l617j925J6583j4394l9895L24J6077J1062k3059n182J9575
9004c3223K3242J3046P404m161l5765l575K2234k2040k2530L2384K6727j0354
8992f611m5248j2226J0678j353L0272Q621k5888r49l678K5927J3594r664M511
$$ y = [-6954, 33475, 27440, -10776, 12246, 2151, -195, 1299, -5701, -2536, -21200, -37356, -41721, -43136, -46587, -27773, -4121, 20043, 9150, 10580, -11043, -47386, -14961, -8505, -30648, 2518, 17045, 27595, 20130, 23237, 34137, 14442, 1580, 2743, 2088, 4957, 8866, 13531, 21802, -4992, -38733, -59088, -44467, -38334, -40917, -31050, 5911, 24382, 37318, 39913, 29459, 885, -14250, -5800, -5515, -19641, -4243, 31227, 24209, -858, -23935, -37169, -26092, -24977, -19543, -15296, -23183, -8772, -12389, -14314, 2269, -12125, -52020, -51696, -35619, -24557, -47616, -52798, -33223, -9981, 3065, 10469, 6308, -29457, -33032, -10798, -32838, -55368, -22984, 3743, -6611, -51859, -64085, -53407, -54760, -24488, -15867, -41755, -42704, -46382, -20455, -6861, -16525, -12014]
8979a2014o353J0366K835J5975L900M53j311j9408m8980J1147K7034j931J1725
8966f562L0079P486p352l152n7160j1096P728J6260K0335r631j1475n049L38L6479
8952G228l90j5332r56O070j5435o863K8388Q493q125j0607k2241J3750J1631j8210
8938b2599k7965l974K1155n395l300K42K3987Q579j1337L2038L6749m2902l0741
8925b5463J239K5569k5464m5729J1093J7891J6603J2574o25l254n062o951J3260
8912a4319L159k5421m283J0815j965J1280J3362j0517n412K6941j9135j1497J7766
8899i226j513P48K4746j217k2771K7981K3910q275k8719J67j444J6640j5099k9023
8885b3095M966j1342J3077J1505O11p543j8986J0719K7121j1297j2943k3519k259
$$ y = [-12014, -18367, -8001, -5166, 10809, 14709, 15162, 13851, -5557, -54537, -43390, -16356, -18287, -6562, 23517, 31003, 23651, 20499, -36661, -47757, -40029, -23769, -3434, -13065, -24540, -29589, -29251, 7228, 6838, -8494, -9450, -3380, -18815, -25678, 2710, 11203, 3078, -7529, -29770, -16020, -4389, -22599, -50564, -54538, -33383, -38778, -42078, -41836, -17849, -9270, -20607, 11431, 48180, 5278, -25463, -24224, 1345, -24119, -69848, -58755, -40864, -24261, -11687, -12312, -15566, -20628, -27579, -14319, -11160, -36581, -40864, -30049, -32014, -20734, -7372, -17889, -23301, 3640, -15495, -26992, -9226, -10739, -9991, 14755, 13538, -9233, 18748, 42658, 34383, 5664, 5831, 4387, 21027, 5928, -23095, -18129, -29471, -16394, -4889, -4278, -11821, -30807, -20088, 7033, -4264, -17207, -40726, -42985]
8872d2985p657j1122j6685m531J2087K4376K8227L3366o89O364k3269m3170K0282
8859b5406L3647J0304j7228J1496k7110j8899K3702J7180m7070k1266K036N5776
8847b838K4960j5842J8643J0634k0266j8499j1681Q446q177l3912q438J2616n197
8834d9551p460J0835o065K1184K9567J724j7615k3649R30Q622l258P473J7819
8821i444L4249J2988j3499k7514r700L909k1786N462J0021j367J9264K625j5259
8808a0051m4J9332L730m018j3087q698O41j47j1027o505J0607k782J2771J3520
8794D242J9844J6893m603j8192R656q927m0106m709M4215l1836k4538K4339J6912
8781C190j1134k7280m159k803K2193J1254m795l1489j3222p57L6225L8510j7877
$$ y = [-42985, -50642, -61764, -78449, -82980, -70893, -46517, -18290, 15076, 14387, 20751, -2518, -45688, -25406, 8241, 18545, 1317, 12813, -14297, -33196, -9494, 7686, -39384, -60650, -58614, -2838, 22122, 6280, 24923, 35557, 15291, -3208, -14889, -6443, -14620, -48532, -56970, -44354, -49551, -57011, -46176, -52241, -31057, -1490, 234, -17381, -41030, -40100, -31478, -34736, -27263, -9444, 24805, 37793, 24294, -3220, -12920, -9011, -30797, -25335, -15314, -16681, 2583, 5208, -10051, -10095, 9237, 12967, 8949, -4138, -12836, -12195, -12342, -23369, -29874, -19267, -22049, -9278, 4242, 24086, 40979, 36376, 18184, 27840, 18913, -21193, -25902, 18313, -13523, -38061, -13722, 3190, -7944, -35224, -39383, -42186, -19993, -8739, -13534, -45023, -58245, -59002, -22777, 15733, -2144]
8768b144k8524m6509j3035M0694K3597p253J8055L3494k03j1897M849K032j4250
8755a094k1914j2145K0071M1566j3461k7666k924r74R939q416K5391o256k7344
8742b5227p832n971J5497J0540P4K1946J9331m656j6090p461j1436Q706j884N794
8728A331J7101M128j2967R217j573J0160J4533j2597J1590N835n1921m306M107
8715e362o040l075J7237j9766J7176J5566r618N499j0762j0817l2246k1380L4047
8702b9541L0280J7188J137r4q944j6202k825p441r982J9168K3085P90J1828J2216
8688D0663l4702k5440J5287P233j1443J6703j5515j1865m7K3095R789l182l3890
8675b3314k5314O974N5905P910j446j7220m282k2397j0198K0347L0849k3790j8876
$$ y = [-2144, -30668, -77177, -90212, -49518, -25921, -33174, -15119, 18375, 18172, 6275, 11124, 13156, -1094, -23008, -35153, -15082, 26484, 13023, -14643, -17567, -18541, -8602, -17018, 8373, 2117, -25227, -33059, -39030, -23533, -12993, -12919, 9027, 28358, 23702, 7612, 151, -11285, -2579, -4463, 1331, 18432, 22560, 9593, 18810, 17237, 27397, 41930, 29333, 40923, 46758, -5163, -9469, -5362, -11402, -14477, 2760, -17006, 170, 15736, 6118, 11617, 855, -9962, -42208, -63588, -29541, 739, 17927, 19064, 18970, 10026, -6176, -9001, -16442, -26424, -7256, 15829, 16619, 28447, 40663, 5961, -19479, -4192, 3041, -8402, 8301, -7214, -19079, -19126, 3969, 13758, 10576, -23314, -48628, -41654, 14251, 22161, 20715, 3495, -787, -23184, -33382, -13035, 17814, -5976, -24852]
8662b4852k2867r030N470J4878J4579M0901k5629k2613k3179L1815K0937J5954
8650A6364M970j4530j7879O453L734j0991J8400O404k1529J5709k655k1224k6567
8637d3341L4604J0473q973j5513Q926p195j0621M82m566N840N3401M3623K5580
8624I2720j3924o643l652l1153l3609O584q184j1822J7842L1860l1917l3434q237
8611c3569Q173J3581l6451L6461N34R720Q442J2750O895m561j0314l5596r735
8598c3670M3234Q260l9451n231M888J0245L678L012k5317l9184M7800L2653R653
8585B0570K0005L610M315j7998q580j9189k5841M253L2378j0899l6045q67R451
8572b4837M40R26j0838o371j702K6091J0705J7782L2884k191m242J0380O132k069
$$ y = [-24852, -47719, -56749, -51279, -36401, -21822, 19079, -6550, -29163, -52342, -20527, 410, 16364, 21334, 6804, -11075, -4622, -888, -11879, 6521, 12925, -8604, 7105, 4450, -16774, -43341, -8737, 1736, -7237, -22750, -13824, -21019, -31640, -31158, -35724, -29884, 23517, 67140, 92720, 78796, 72153, 68501, 37348, 3739, 10323, 2139, -9683, 8159, 40019, 8102, -25332, -33569, -25396, -11815, -48266, -11805, -11271, -1551, 6891, 19641, 26536, 21975, 11661, -23935, -33670, 9564, 17824, -21627, -26858, -21970, -11725, -8047, -5035, -30352, -69536, -21736, 10917, 20570, 40575, 44185, 48500, 30502, 21922, 2733, -23108, -18855, 13523, 2624, -33421, -34288, -24837, -24397, -23471, -34309, -40680, -42382, -16291, -5586, 12196, 45080, 42889, 38647, 49027, 55159, 53090]
8558E3090k6668l4453j9917j2825K7596K4161J027J5441R694m348k1977n060m349
8545A412j4508k9342j1010M5136K9840o353k4942K215k308L611L086k672K849
8532b986K3009L7218k1777k7176n9128r17J945k855K9720K0324j3323m436K9926
8519I544Q714j2867l7604K0844K3667J0441J6099q367R404L239l467o1623j8858
8506d0834l038k761K3987K9969Q504j6915p19j384J3994J3689R045j8705p460
8493G372K7929j0146m1117j8532K9371K4104J3399l196j6392J3404K5142k4956
8481B6382q760N601O18O040m726p586J7929J306l0816J0524n5j2040k1393j0121
8467b7097K0066k646j9083K3531N590J6031K2446k4458j5007J7888K4221n115
$$ y = [53090, 26422, -8031, -27948, -40773, -13177, 10984, 12011, 27452, 37146, 32798, 10821, 5761, 1412, -13096, -42438, -53448, -8312, 21528, 15175, -9767, -7552, -9860, -6249, -3163, -5835, -2986, 20023, 57241, 35464, 8288, -50840, -51757, -49812, -52667, -22947, -2623, -15946, -20382, 9544, 18258, 5391, -32213, -11369, 12298, 22739, 38838, 30471, 39875, 43114, 39647, -21976, -40834, -43872, -46633, -22646, 7323, 15827, -1088, -1807, -3191, 10803, 24492, 33537, 14832, 7372, 35301, 25155, -15962, -34494, -5123, 18981, 32380, 29184, 12792, 26196, 51338, 26382, 17622, 23223, 23841, 29881, 25155, 17569, 35498, 36804, 5988, 16512, 16457, 4417, -16976, -27097, -7031, -9677, -28760, -5229, 361, 16392, 38838, 14380, -627, 17261, 41482, 36367]
8455C6367m6229l4454q481J8482K9857K6215N9681J4000l1176k5033r580K2168
8443E1817k1207j696j3151k2080j0050m242K9303O269N865l317k5762K0999M1907
8430E4655K1074j0368l8317K2055j7913k0544l149J9092j38P8J7032o926k2399
8417A4232k1078q962r109q416J3095J9670M473k2897l225K8902j0869k0653J0317
8404a4520K6715J7317J4076Q09l9452k0357L344K3032k4496m211J4526J0049K3521
8391C0353K735p448j0899k1912l279Q814O590R472q677J2826J909j0020j1113
8378f49l7132k2026K0982P403j4j8501l318M5972M4281j134j2995P452L6639q914
8364E8046K387j0779p437k9104k2603k760K6388r216K683j692m730n575J5646
$$ y = [36367, -9862, -44316, -52797, -34315, -4458, 21757, 81438, 95438, 64262, 39229, 29649, 51817, 30610, 28914, 15763, -6317, -16367, -20609, 8694, 14963, 20828, 17511, -8251, 12748, 54655, 75729, 65361, 27044, 49099, 31186, 10642, 7493, 26585, 26447, 26525, 43557, 36631, 14232, -6846, -15808, -24917, -33333, -20238, -568, 3905, -18992, -22217, 6685, -4184, -24837, -14520, 12195, 29512, 43588, 44397, 4945, -15412, -12068, 10964, -13532, -17743, -3217, 6832, 30353, 33088, 25640, 14741, -7171, -10450, -1636, 4954, 14426, 5749, 18575, 20484, 10464, -649, -37781, -59807, -38825, -31422, -31436, -49937, -53255, -7283, 36998, 35864, 22869, 30321, 66960, 58046, 60433, 49654, 42217, 13113, -9490, -12250, 14138, 4922, 7605, 5913, 1183, -4392, 11254]
8351A1254K8172L2651j852K409m358j2598n678K891J6102j0089j7593j0437l3303
8338b429j0736m3304j4950K6308J5860J8952J7634l81p398L671k0115l009q529
8325b8426n39p289L194K5706J9859j0514K2494K3835l661J060j7514j1264k1319
8312d378k7902R003j612L064K5349j8818L187l085j4569j3469J4179J0846R292
8299h913L918k2487k0239n413j3390L02K9380L3084R534M139J2196o0331K348
8286c5872J7565k0891o527J6709m156K8217j205q367K0258J5548K2176L097k0057
8273B6495k7294J0520l93j8684o637k0555p171N26r09J9828K6039K4058k343k1407
8259B073l4373L445J6626P924J219k2023o760P61K0664J075L0270J9651J554n4801
$$ y = [11254, 39426, 72077, 70225, 72634, 68276, 55678, 50000, 52891, 68993, 58904, 41311, 30874, -2429, -13165, -56469, -71419, -45111, -29251, -10299, 7335, 6954, -444, 3227, -16888, -19897, -28426, -28965, -36254, -33060, -7354, 12505, 1991, 24485, 48320, 44659, 45719, 28205, 16941, -4378, -32280, -23277, -24889, -21825, 3524, -15294, -12107, -15192, -29761, -43230, -29051, -18205, -8913, -4995, -27482, -47721, -53134, -66524, -66222, -36842, -3758, 5776, 9915, 22111, -38220, -35872, -18307, -39198, -45725, -29016, -33172, -4955, -6160, -14527, 5731, 21279, 43455, 46552, 26495, -799, 9721, 9328, -9356, -15993, -36548, -43719, -43193, -44102, -24274, 1765, 25823, 23480, 2073, -32300, -28855, -12229, -4305, -3086, -25109, -31869, -31108, -10444, -9369, 20901, 40552, 42106, -12695]
8245a2695k2374Q199l742k7809r505M1423M2022k439k1690M824j9846j1695K9816
8232e511j6175R053J5730l793k3795R25n959K1310L2440m842k9903j729k3407
8219c5656k0437L106j0102K945m938K6222K7282J9335J1319j1867k44j4842K6331
8206A8454R226k9014l5449j4542K1668J0644j3144J9931j9722j3345J6220R610
8194a9463K3778K7086j7126k4503K2401p952j4715p708L105P656r76J4260j4613
8181h770l2116j217p856R600L6364J637l946l4873j1105o927K1820j1230J9984
8168b8635M820K98j6688M904K3890m746R853J4448j6668R076N203M557j3342j080
8154d110N741j150J1785k314J9104n129p690k029P705j8306l89k0109l0798j0278
$$ y = [-12695, -35069, -26870, -30612, -58421, -67926, -26503, 15519, 13080, -8610, -3786, -23632, -35327, -5511, -21686, -12633, 3097, -696, -24491, -23566, -29525, -8215, 24225, 19383, -10520, -12249, -35656, -56093, -52987, -63089, -60144, -65082, -38860, -11578, 7757, 19076, 7209, 6965, -7877, 18454, 27680, -1334, -36783, -51325, -29657, -19013, -32157, -12226, -31948, -45293, -29073, -19463, 4315, 31401, 14275, -10228, 12173, 4221, -10494, -18202, -15097, -7441, -8417, 5843, -8770, -40886, -42103, -49959, -40359, -3995, -2358, -6304, -41177, -52282, -59209, -37389, -48619, -28635, -23815, -23517, -40205, -35301, -11411, -16157, -6304, 8144, -8524, 552, 5755, 10312, -3030, -4110, 1631, 481, 12266, 9952, 29056, 23927, 16237, 14208, 21913, 3607, 3218, -16891, -47689, -57967]
8140e7967K1333J3213l5826p698O413J3122m006q238J3600K209J5920J0114J6018
8127a793P195l2381K5912K1757L321K6500j9446m696m0583m8844K0553J1652k055
8114c2908P842m998J0311k507l28K1660J4756k4203n95j2352p403n336K6990P300
8100a771j4493k0426J0054J458L323j1373K0491J3462o443l2989m684P918n877
8087d1350j94J6681p648l19J5096L249j1240J9794J358l7353k4499O561M336L7976
8073a7552p22J7629o746r431M463O343l9895n25Q852k6708m1339L2612M2905J5373
8059a4741r181J7916l1888l4844K4458L6667R305Q5P834P959k868j3517k4583
8046b7398L869O584K3330J6917p581N747k0932j98j2018P060J9878K1697j3819
$$ y = [-57967, -36634, -23421, -59247, -66945, -60532, -47410, -51416, -59654, -46054, -43845, -27925, -17811, -1793, 5402, -26979, -1067, 20690, 24011, 50511, 31065, 26369, -14214, -63058, -42505, -30853, -32908, -25066, -30064, -19753, -22260, -22588, -928, 13828, -10375, -10970, -23322, -30725, -36061, -9071, -1771, -16264, -36690, -26636, -25178, -21855, -33228, -12737, 725, -5718, -38707, -43391, -35473, -41350, -41544, -24863, -32511, -32830, -17734, -14485, -25725, -5931, -4573, -41926, -66425, -59864, -55528, -17552, -18274, -645, -7391, -16822, -12359, -6016, -45911, -46436, -37584, -64292, -105631, -73019, -30114, -14741, -23922, -6006, -37894, -72738, -48280, -11613, -2308, -2223, 5611, 13570, 10702, -2815, -27398, -23529, -16945, 6385, 23302, 15721, 21468, 536, 338, -11680, -4620, 15258, 36955, 23136]
8033B3136n191k603j283l4389J95M2530L8152j0775n3356k8611M38R815J1188
8020a0754l657J826j330J4379J6423J6500J4831q117j3678k2966k5861J0257L8610
8007B6463q977j04L8082k8605l2294K1514J0748J812J4409k9485k1724J5741K7049
7994C4629J6117j476k0868o59r729O733n915k1618j0320J2607K8101R510M466
7981D1578k7454j1494L696k3522J1401M5257K4234o292q615j1728j4547j0373
7969A2141R101j9077l646J3009k179r219l1916O238j261O676J9469K4602K9242
7956E3180n376m440l8115n2542k0492M1782M0136k0046k3110m101K0491J7971
7944E338k579K2179m734R433k2930k3427o803J7861J1764J9265J9509j4699O085
$$ y = [23136, 17945, 15342, 14059, -20330, -20135, 22395, 60547, 49772, -3584, -32195, -31757, -21942, -10754, -14411, -12585, -13915, 464, 16887, 33387, 48218, 40101, 26423, 3457, -22404, -12147, 26463, 17486, 17382, 55464, 26859, -5435, 16079, 26827, 28639, 43048, 13563, -8161, 7580, 34629, 50746, 49270, 28402, 27743, 18014, 24747, 18832, -2786, -13106, -499, 27602, 37112, 41578, 14124, 2630, 6326, -17196, -5795, 39462, 63696, 57404, 48789, 37061, 22514, 12141, 21242, 2165, -1481, 11528, 9349, 130, -31786, -25548, -26809, -20133, -664, 23938, 53180, 47804, 43364, 5249, -47293, -67785, -26003, 14133, -5913, -29023, -33124, -12633, 5338, 2759, 24938, 20204, 29637, 6707, -16720, -23523, -5662, 6102, 25367, 44876, 30177, 36262]
7931C6262k2089n82j593O753p364P15j0723m865k7853q137L714M8996L7718n353
7917D5599j6171N804M260n9536L93j6358q032N4707K638o474J465K2132L018o681
7903B6764j1456j6847r19M573J0813j2775p60l5043j8682J7332O30J5618k2981
7890d3733k4701K6051L7159j8159l5689k1359J8588J6934K2514j4684j9630P730
7878d8979J7085j2224P595P703O786j2658K034J4380j1927n2274P981K3106P461
7865d3931K8098K7268J2668L210j1855M391j6623J3221J8632K0741r113q156j2843
7852B5708o071k0172k6662j9600L6484K4697J8838M147k351N602o489J5610j2984
7839C6757P375L084J5123q173n171j4462n4223k6893J3979J2018K4560j8688o0496
$$ y = [36262, 14173, 13591, 11998, 18751, 11387, 12102, 1379, -3486, -31339, -39476, -35762, 13234, 50952, 45599, 29428, 35232, 39492, -20044, -19651, -36009, -44041, 10666, 13304, 6830, 8295, 30427, 33445, 26764, 15308, -1539, -2458, 2115, 12928, 153, -607, -35650, -54332, -37000, -36370, -20752, -43733, -68434, -42383, -5224, -23383, -59072, -80431, -61843, -44909, -22395, -37079, -56709, -48979, -31894, -44118, -36523, -28820, -22034, -34692, -32658, -18278, -30205, -82479, -74498, -51392, -43931, -15833, 11435, 24103, 27313, 15458, 19849, 3226, 16447, 35079, 55820, 46707, 38551, 25708, 19637, -535, -27197, -46797, -10313, 14384, 33222, 37369, 35018, 40620, 34131, 49741, 36757, 44132, 47216, 62339, 54166, 48995, 34533, -19690, -46583, -32604, -20586, 3974, -14714, -75210]
7826g5210P486K9472P836J2819R990J6777N681j8049K3430J4666j5986j5958K0186
7813B3140l040j7438o330l155M014k0169j3347K8946M462K9515K2475j8895k0325
7800I853N191J586k1661k5392J7416k22J9706K9810l7335l2232J3569j3243J5702
7787a7252j507J9590Q887n1720K7411J2407J6041O57j2073n033K004l4920k5957
7774f1465J7138P0349p982K545J5115k2324j8436K7953J4047j4874P595J6690
7762D6351k9786l8225J8402k137p082J1124O728j194k98R49j2706J0434r161K962
7748c639Q82K4727k3016J8916J7130j4834N191J9782m5150r28K9530J4335k2927
7735A9999k2447o740J459R109P181O26l9755j34J9525j4088P067L1664P589k675
$$ y = [-75210, -67724, -38252, -30416, -17597, -7607, 9170, 14851, -3198, 20232, 34898, 18912, 2954, 23140, 20100, 2662, -3668, -6823, -2809, -22978, -36325, -7379, -2917, 26598, 49073, 30178, 9853, 15044, 16630, -5031, -30423, -13007, -13229, 6477, 36287, -1048, -33280, -19711, -32954, -17252, -18759, 831, 9718, -42002, -14591, -2184, 13857, 14514, 2441, -2592, -588, -35508, -61465, -44327, 26022, 18040, 20585, 35700, 13376, -5060, 22893, 36940, 22066, 29661, 46351, 16565, -21660, -3258, -5395, -12477, -1353, 5375, 4181, 3883, 4832, -7874, 2560, -6601, -3639, -2757, 21970, -1046, 17870, 35000, 20166, 25357, 45139, -11, -939, 28591, 42926, 19999, -2448, -9188, -7729, 1380, 8561, 9187, -30568, -30702, -11177, -25265, -18198, 13466, 21055, 18380]
7721A8380k469l1610k3414K5454K4728o063m447p16j0670K9888J2615R452J5886
7708E7014K3686p244m3058n5182r200K9297K0665J0545J0862K455j3136Q84l2752
7695e164n738J0062J420p298j1784j6527p951J5594Q229O468j0315j3606J3497
7682b3113J7260P681L5122l4140n958L253l864j3189j6450k988J9881J6273J2088
7669A1856K020k1331m542l891K0003P144l302O340k2666q630O725l832M156Q075
7655a875M559k5623n799o706k7256l730L4804P274L0456J8044l2133j0136k0244
7642c8365j5937r226k998k362L7479L2219k405J6864p221j5578k0241L836K4553
7629F18r251j8005l0773J6746J6702J8055K5914k7028q120K7641Q596j900n257
$$ y = [18380, 15911, -15699, -39113, -13659, 11069, 5006, 559, -157, -10827, 19061, 31676, 41128, 57014, 80700, 73456, 30398, -24784, -33984, -4687, 15978, 26523, 37385, 39840, 26704, 27588, -5164, -10902, -840, 580, -6718, -18502, -35029, -42980, -27386, -19157, -12689, -23004, -36610, -23113, -5853, 1828, 36950, 2810, -3148, 105, -3759, -16948, -33398, -36386, -16505, -232, 11856, 13876, -7455, -11997, -15888, 4115, 11259, 7957, 14297, -8369, -16999, -10274, -14106, -9950, -1875, 2684, -22939, -28738, -35444, -62700, -66430, -31626, -24352, 6104, 24148, -7985, -18121, -38365, -54302, -63528, -66526, -68888, -31409, 810, -1595, 15269, 8048, -7530, -27771, -23935, 618, -8633, -26638, -57411, -40665, -23963, -5908, 20006, -7022, -15142, 12499, 21095, 19195, 13938]
7616A3938J3187q4j6615k5415k0152L965J6693m6690l2264R428K5715L4395K4704
7603H05p949K1065J8264p484k7374m501J1561N548L40K307M591J6791L4798k2408
7589D6354l7005L069K0849J7945p336j4700k5823K997J8802k1526k2968K372L1316
7576A4346O432j4955j4535o422Q513J6108M824J1908j5988k3858j6398K676J7009
7563a0340Q287J5012Q590l3099m85Q834M096q752K3158J2668r370k6840R630p330
7549e941J5429p920k9015k430J8979k012O83R998K5294L1525j1921l0397l6582
7536b4310R532J4926l2124J6347P558k1628J6875R014m902j4906j6222M932J0559
7523b4349K9632K1697j6802k6180R679j8739k3419j063J0694J5500J3894l617
$$ y = [13938, 27125, 27041, 10426, -14989, -35141, -31176, -14483, -61173, -93437, -84009, -58294, -23899, 805, -7144, 13921, 32185, 24701, -2673, -7174, 4387, 9935, 10275, 12582, 17173, 33964, 68762, 46354, 9349, 12418, 33267, 51212, 43876, 29176, 3353, 6350, 25152, 3626, -19342, -16970, 14346, 20778, 5823, -8712, -15134, -6621, 9487, 14311, 26219, 10231, -13627, -30025, -27349, -10340, -2053, 12959, 21549, -11550, -12035, -3201, 895, -7857, 15301, 27969, 18599, -8241, 1389, -5941, 9488, 1568, -27447, -29877, -10898, -12910, -12227, -2229, 23065, 54590, 42669, 12272, -24310, -14778, 148, -31976, -15629, -8071, -29699, -12824, -3810, -8712, -23618, -39840, -34908, -24349, 5283, 26980, 10178, -16002, -6323, -25062, -48481, -49544, -38850, -23350, -9456, -13073]
7511a3073r242L1026j1394k7716k1710k3046N875K2493J6323r907j7030O751L0869
7498a9781K4206K0920L050k0569p87l6608j7643L5103J8545k2393n670J9218k3442
7485b5851r980O0659L4723k1348O519j6308l7806K694P14J3082R992j5064j3481
7472a1455J3607J0493K4877K781j705k1437j4723K7399o262q163J7045j657m97
7459C0303j2747m2620R28K3985J2142m805k1079J3470J7579J5318n860l7569j7302
7446b8257J8696K622o671K085j079J716M2843j2735O38k2575k3317J563o067J4304
7432a6234J0499K3348m0869m8831J8385J5197O834J6638P866R131p139P806N398
7419H029j1964J6409j0316j3443j6239k674M280J339j957p256N308J1850m7229
$$ y = [-13073, -22315, 8711, -2683, -30399, -52109, -75155, -69280, -46787, -30464, -40371, -57401, -50650, -19781, 4425, 25345, 28395, 7826, 7039, -29569, -47212, -12109, 6436, -15957, -21627, -2409, -25851, -35831, 24828, 59551, 38203, 44722, 28414, -9392, -6698, -5984, 7098, 17090, 2026, -11455, 2152, 12645, 37522, 40303, 38598, 17161, 2438, 29837, 23575, 15412, 32457, 30800, 30303, 17556, -25064, -24136, -151, 11991, 7186, -13893, -423, 17156, 32474, 26614, -10955, -28257, -9561, -6939, -13610, -11525, -12604, -10888, 31955, 19220, 19858, -2717, -26034, -24471, -30538, -16234, -5735, 17613, -23256, -72087, -53702, -38505, -31671, -15033, -7167, 1964, -5175, 2631, 8029, -3935, 12474, 2158, -11285, -27524, -30198, -25918, -24579, -26536, -33792, -28484, -16634, -63863]
7406f3863P412P1462J2344j4233j4432l6684j2109j1313K0578L923L948K4556
7394h411K103q781j4036J029L8275J4464O591J7489K682J110J3735j3275j1137
7381D1838l3648j9074R497K1476N386j8751j1405J4354L511J6141k0918m1603
7369c3196j778J5084O080J4122j7315j0129o48J0428J6098M19m530J5217N634
7356A5486Q233m2255j8121M184m09j952k0037K6401J2192j719K4465K3178k4987
7343D659k1063Q819K2331j168j2508O649j3396O364r59j3654k54K666l053L40
7329a4227o657J7991m031M54J6356J1488j1534o344M163J8493q243k6061n69k0902
7315b9623J597K385q281L806P819j6514j294j213J7467L8401J4240k1435j8397
$$ y = [-63863, -56451, 15011, 27355, 13122, -1310, -37994, -50103, -61416, -40838, -36915, -32967, -8411, -6308, -15089, -29125, -28096, 10179, 24643, 31234, 48723, 51405, 52515, 66250, 52975, 41838, 8190, -10884, -1387, 20089, 25475, 6724, -4681, 9673, 13184, 29325, 8407, -33196, -34974, -19890, -13810, 312, -17003, -27132, -27780, -17352, -1254, -835, -5365, 9852, 15486, 23719, -18536, -36657, -32473, -32882, -34834, -54871, -28470, -16278, -17997, 6468, 29646, 4659, -16404, -7585, 14746, 13578, 1070, 7719, -5677, 687, -272, -13926, -14180, -11514, -14567, -14227, -20884, -2893, -6924, -6470, 9886, 21374, 9840, 3496, 7659, 26152, 17909, -8152, -8721, -29623, -28026, -25641, -33922, -30116, -22297, -38811, -40105, -41318, -23851, 14550, 28790, 7355, -11042]
7302a1042K2729J9848k0338n353q768m6640j4045J2648k52L0397R822J5354n2934
7289d8574L670K805P512J6473O001J8554P713j6642l0495J3458J7660Q269R486
7276A5890J0891L279j9510k9009j9048j9549j1306J2791M6555k704m47O581k6913
7263c2499J3399O2745k4735k843K5699j3363o0092j4149N5134n317j3375J165
7251h231L4126j4298l7471J5551q612R755J2386L890P914K0711k8680j8787k181
7238a3927j2163J837Q943j299Q788R931o4k5959K2452J5149r398l954q955m147
7224a2766k957m264k142k150k1723M473L0369r291j9980J284J8285K4467K5839
7211B9444k8963j6081J5160M3976k0783k8217K0940J530j2819k5437J2773J3430
$$ y = [-11042, 11687, 31535, 11197, 5844, -2924, -49564, -63609, -50961, -51213, -20816, -10994, 4360, -48574, -44904, -42099, -34587, -18114, -12113, 6441, 14154, -2488, -32983, -19525, -1865, 6404, 15890, 26781, 30060, 10550, -18459, -37507, -57056, -68362, -55571, -9016, -11720, -12167, -5586, -32499, -19100, 43645, 18910, 16067, 41766, 28403, -31689, -45838, 9296, 3979, -9396, -8231, 25895, 11597, -25874, -10323, -18935, -9180, 3206, 7096, 15010, 35721, 7041, -11746, -13927, -26090, -24253, -15310, -16609, -7821, 2110, 2046, -23913, -1461, 13688, 4290, 336, -8619, -12766, -15723, -19987, -22129, -24279, -46002, -41529, -11160, -20451, -40431, -39147, -20862, 3605, 29444, 481, -15600, -440, 43536, 22753, -5464, 15476, 17006, 4187, -21250, -8477, 4953]
7199D953j3104j9449M1812J8568k4716l1251o189j7667j3516J9093L2369K9410
7187B0313n769m1180j4582j3608o090N0282L6760P523m544j2693J482k6822j1374
7174b0302J4460j176K031j8624j8188M344J4183R043Q463K118k0413k2408K8566
7161a7903J7658k4983o809J006M373P113K6366J0325L924p531q868J1333k6531
7148a0527l4668N024J3620O631L578n042k6515J9169L1515Q645J8315Q235k8380
7135I600l915l066k9590n740J1208Q174L9510J5283n9581j4046K8682L116k3445
7122b3810J135k1315R962K205J2465L0146J2388l4082k0906J1254K4079J2645
7110A6166J047q380j5600k4391K8829K0180k5105j7848J8405J5424j9428J2717
$$ y = [4953, -8151, -27600, 14212, 32780, 8064, -23187, -29376, -47043, -60559, -41466, -9097, 20313, 14544, -26636, -41218, -54826, -60916, -10634, 26126, 33649, 29105, 16412, 17894, -8928, -20302, -5842, -7018, -4987, -23611, -41799, -37455, -23272, -14229, -5766, -3648, -24061, -46469, -17903, -245, -25228, -32037, -31031, -26658, -19545, 6821, 17146, 21070, 13539, 4671, 16004, -10527, -45195, -40171, -26551, -19920, -16342, -21384, -47899, -28730, 2785, 11430, 29745, 37980, 9600, 5685, 2619, -26971, -32711, -21503, -13329, 26181, 41464, -18117, -32163, -3481, -365, -23810, -22675, -43990, -34028, -31823, -19358, 10788, 23176, -10906, -31812, -20558, 3521, 16166, 17213, 8833, -6767, -31158, -2329, 17851, -7254, -25102, -6697, 8727, -10701, 2016]
7098B016L987j5119O140J6793J6599j2967m2242j2766O529n35n218R625m807J0367
7084b1598N837J1552j4900j0847m232L0595N207J3585j4820k98J7545L1465j7852
7071C1239k6755K992N353P725P591q750k359m001k2333j6606p956K0098K3975
7058A0213Q014J6690J7579M163k6987l5222m686P047o67j1073L0669K4871K335
7045D2946m199l1274M456m465o644J8543k7318j573N942Q345k9914j9409L0473
7032a4091Q703o323k4203l50n401O082N43L06j23j3283j5967m510L5618O5199
7018C2200J740l3008k449N249K1130M905p443l531M742P148N965k5253J859J2302
7004B5556k3634q356K2099K2083K4928l7431k929l565j4647q222J0615J894k1041
$$ y = [2016, 6003, -9116, -2976, 13817, 30416, 17449, -24793, -37559, -31030, -31565, -36783, -27158, -31965, -21598, -15761, -4209, -19109, -29956, -34188, -3593, 1614, 15199, 379, 81, 17626, 49091, 31239, 4484, 7476, 12829, 20554, 28145, 19395, 17036, 13035, -9298, -25904, -33860, -13762, 10213, 18227, 34917, 52496, 56659, 29672, -5550, -10236, -3189, -3856, -14929, 15740, 40611, 42946, 38747, 7473, 11929, 7464, 820, 19363, -7955, -9528, -3586, 4759, -25155, -44564, -14091, -5388, -11711, -35914, -36264, -41665, -35583, -35040, -34734, -34857, -48140, -64107, -68617, -32999, 32200, 33940, 932, -1517, 3732, 24862, 29767, 22324, 18793, 23535, 30683, 36648, 11395, 13254, 25556, 1922, -6434, 15665, 37748, 62676, 25245, 22316, 18751, 4104, -4118, 6497, 8391, -12650]
6991a2650j1921N323k4112J0277O015K8318J5435M567j3347m437j2035j2447L5619
6978A4605L1631k0276m15J4103j8973j5866Q69k3240J4257P810m342O485o37J4317
6964B0328r249o479Q315J0848R43n557k2926P589Q917J937k3062O103k1857K0217
6950c933L0542J289j7110J7026j6383K931K955M906k644K1792L8479j6654j478
6937F1718n285j0569j0726j0303j7388o833j7468j6897L7963J5025l1439k5259
6925c7461k72j6913k0025J8884J054K8562N3487K463l5216j3356P324N582J9333
6912A3446j8183j6412j7825J17J3036Q406J4588M5038k1459j9960j9036j472l616
6899b3332L647j1041m838M4926K0774j6662o221n667p016K9511K4836m200j6698
$$ y = [-12650, -24571, -19248, -43360, -33083, -27068, 1250, 16685, 21252, 7905, 3468, -8567, -21014, 14605, 46236, 25960, 25545, 39648, 20675, 4809, 5678, -17562, -3305, 4505, 163, 6648, 6011, 20328, 11079, 4600, 12915, 23763, 24706, 19149, -3777, 3812, 12729, 14666, -8396, -2293, -24150, -3933, 26609, 27898, 10788, 27814, 11431, 14362, 17317, 22223, 19579, 41371, 79850, 63196, 61718, 56433, 45864, 35138, 24835, 7447, 614, -16854, -33751, 4212, 19237, -12202, -37461, -37733, -54646, -74671, -55787, -54733, -26171, 27316, 29779, -5437, -18793, -11469, -5887, 13446, -4737, -21149, -38974, -38857, -25821, -17415, -2827, 42211, 20752, 792, -18244, -19716, -23332, -19685, -30726, -35564, 9362, 30136, 13474, 7253, 1586, -5430, 24081, 48917, 44717, 28019]
6886B8019l4014k0873K1502N263Q534k2489n589J102Q394J2706J2286p032r52
6873F857j6312J0206K388l1815l9716K0294O2492L2326j1333q568j8613J8123
6861B6329J379k1096M360R15k7181j0814O086M044J687m7643O73J9768J2916L5407
6847F830k8594j7307o756n918J0763P066N684J1419j6081r624J1175J8597k080
6834a4826J8758K7255J0833j5370j7637k8243m899j5518l92k7507O580K0719j108
6821d1355J942K6458j136k9895k5677J7677J8233M2851J5133M671k2347K7514
6809C4069n459n888j5673k160J2854Q592j1317j5267K0931J4345j4122l0967k1497
6796c1559J755j114k204k0647M609L8340K7386J5519l4485R383j6990l7401K1357
$$ y = [28019, -5995, -26868, -5366, -103, 8431, -14058, -19647, -18545, -10151, 2555, 14841, 7809, 6857, -9455, 751, 3139, -28676, -68392, -48098, 14394, 46720, 35387, 26819, 8206, 26329, 27708, 6612, 10972, 11887, -15294, -26108, -20022, -15978, -14291, -61934, -61261, -41493, -28577, 6830, -21764, -39071, -45827, -51745, -40982, -33916, -28232, -16813, -32894, -42518, -31343, -12746, -14826, 3932, 31187, 42020, 26650, 9013, -19230, -24129, -39647, -40039, -67546, -60966, -40247, -41355, -39413, -12955, -14091, -43986, -69663, -51986, -33753, 9098, 24231, 28902, 6555, 34069, 28610, 22722, 7049, 4889, 17743, 26335, 15018, -249, 20682, 35027, 20905, -10062, -31559, -29804, -30918, -33122, -53769, -49160, -10820, 16566, 32085, -2400, 6983, -10007, -47408, -26051]
6783b6051K2034J8377K1274R875O240q93l6158K473p94l1112J0588K0618m759
6770A1712K760m257k8920n0415M382M2641m621J3959l274O506j6124M264L5114
6757A3727M691k6124p870l3733j116M3579R961l6778l3569Q251J2445j449L359
6744d4626J3300J7302K183j7576j9956j829J1156O62p081N322J8762O077m199
6731b0503J2051K4936j4668k0228j1186M3614K0328j0727r316j4191j619R098
6719G589k2651n434O387k2499j6514K0942N332K2179J4708n428j5213J5679M451
6706I528J5363k288k3253l2970j5153K4572N747N58k3596j6611k4575M3637R692
6693b9349J0004m718J1079q849j1671n368L4514J1978j8449J2965k8669k1952
$$ y = [-26051, -4017, 14360, 35634, 45509, 51749, 50856, 14698, 17171, 16377, -14735, -4147, 16471, 11712, 14472, 10215, -18705, -69120, -64738, -22097, -26718, -12759, -16033, -9527, -25651, -21387, 13727, 18418, -7706, -15576, -49309, -50425, -6846, 3115, -33663, -67232, -58981, -46536, -47985, -44626, -31326, -14024, -11841, -29417, -49373, -51202, -40046, -39384, -46465, -41143, -22381, -16304, -20503, -8452, 16484, 1816, -18412, -29598, 14016, 34344, 23617, 14301, 110, -1509, 7589, -15062, -20496, -14109, -36608, -53122, -32180, -26848, -4669, 10039, 4611, -10602, 5077, 9528, 24891, 22603, -650, -33620, -48773, -24201, -18454, -17896, -41492, -58103, -82678, -39041, -29349, -19345, -24063, -12984, -21833, -33504, -38872, -4358, 7620, -10829, 2136, -26533, -48485]
6681d8485p028J2244j59l134K6586j5628k8971N2516K7365p384j3911N809J4572
6668A4392m447R003l167n2460j7686K317J4985K990J35L2498J4466r44J8548j8686
6654A1944r525K1546J0448K0722j0334K093q069J9334N700m7139m7059N687n730
$$ y = [-48485, -55513, -43269, -43428, -46562, -19976, -35604, -64575, -12059, 15306, 7922, -5989, -180, 14392, 9945, 18948, 15781, -36679, -54365, -52048, -37063, -34073, -33938, -1440, 13026, 12082, 30630, 11944, 2419, 23965, 34413, 55135, 44801, 46894, 38825, 58159, 63859, 16720, -30339, -24652, -30382]
$$ [...]
##END NTUPLES=NMR SPECTRUM
##END=
