##TITLE=Analysis number 320896
Compound Code km 10724
Book Reference 493/30/7
Project Code adrs
Chemist Name peted
##JCAMPDX= 6.0         $$ Bruker NMR JCAMP-DX V2.0
##DATA TYPE= NMR SPECTRUM
##DATA CLASS= NTUPLES
##ORIGIN= Bruker BioSpin GmbH
##OWNER= nmr
$$ XWIN-NMR		Version 3.5
$$ Mon Jul 17 10:25:02 2006 GMT Daylight Time (UT+1h)  MAYBRIDGE\nmr@NMR_250MHZ
##.OBSERVE FREQUENCY= 250.131544655141
##.OBSERVE NUCLEUS= ^1H
##.ACQUISITION MODE= SIMULTANEOUS (DQD)
##.ACQUISITION SCHEME= undefined
##.AVERAGES= 16
##.DIGITISER RES= 18
##SPECTROMETER/DATA SYSTEM= dpx250
##.PULSE SEQUENCE= zg30
##.SOLVENT NAME= CDCl3
##.SHIFT REFERENCE= (INTERNAL, CDCl3, 0, 16.522)
##AUDIT TRAIL= $$ (NUMBER, WHEN, WHO, WHERE, WHAT)
$$ ##TITLE= Audit trail, XWIN-NMR		Version 3.5
$$ ##JCAMPDX= 5.01
$$ ##ORIGIN= Bruker BioSpin GmbH
$$ ##OWNER= nmr
$$ C:\u/data/dgb/nmr/ADRS/2840/pdata/1/auditp.txt
$$ ##AUDIT TRAIL=  $$ (NUMBER, WHEN, WHO, WHERE, WHAT)
(   1,<2006-07-17 10:24:37.07 +100>,<MAYBRIDGE\nmr>,<NMR_250MHZ>,
      <created by zg, POWCHK disabled, PULCHK disabled
       configuration hash MD5:
       E2 DF 36 D8 04 B2 41 60 5A D7 A3 38 5A 4B D0 FE
       data hash MD5: 64K
       A8 96 72 6B 0C 37 6A E5 08 35 4E B0 82 29 AA DC>)
(   2,<2006-07-17 10:24:54.24 +100>,<MAYBRIDGE\nmr>,<NMR_250MHZ>,
      <Start of raw data processing
       ef LB = 0.3 FT_mod = 6 PKNL = 1 SI = 32K 
       data hash MD5: 32K
       FE 1D AD 15 EB 40 A2 F2 B5 76 E6 F6 B7 C3 82 35>)
(   3,<2006-07-17 10:24:55.87 +100>,<MAYBRIDGE\nmr>,<NMR_250MHZ>,
      <apk 
       data hash MD5: 32K
       1C E1 DD E9 3D DA 17 BF 37 07 07 61 58 EB 17 36>)
(   4,<2006-07-17 10:24:56.73 +100>,<MAYBRIDGE\nmr>,<NMR_250MHZ>,
      <abs ABSG = 5 
       data hash MD5: 32K
       70 41 CB E9 CB 60 B8 CA C4 58 6C 98 C8 C5 C8 1F>)
$$ ##END=
$$ 
$$ hash MD5
$$ F4 A5 D3 60 68 05 34 DA C8 0B 8E 28 96 1E 62 81
##$RELAX= 
##$RELAX= 
##$RELAX= 
##$RELAX= 
##$RELAX= 
##$RELAX= 
##$RELAX= 
$$ Bruker specific parameters
$$ --------------------------
##$DU= <C:\u>
##$EXPNO= 2840
##$NAME= <ADRS>
##$PROCNO= 1
##$TYPE= <nmr>
##$USER= <dgb>
##$AMP= (0..31)
100 100 100 100 100 100 100 100 100 100 100 100 100 100 100 100 100 100 
100 100 100 100 100 100 100 100 100 100 100 100 100 100 
##$AQSEQ= 0
##$AQ_mod= 3
##$AUNM= <au_zg>
##$AUTOPOS= <11 >
##$BF1= 250.13
##$BF2= 250.13
##$BF3= 250.13
##$BF4= 250.13
##$BF5= 500.13
##$BF6= 500.13
##$BF7= 500.13
##$BF8= 500.13
##$BYTORDA= 1
##$CFDGTYP= 0
##$CFRGTYP= 5
##$CHEMSTR= <none>
##$CNST= (0..31)
1 1 145 1 1 1 1 1 1 1 1 1 1 1 1 1 1 1 1 1 1 1 1 1 1 1 1 1 1 1 1 1 
##$CPDPRG= <>
##$CPDPRG1= <>
##$CPDPRG2= <>
##$CPDPRG3= <>
##$CPDPRG4= <mlev>
##$CPDPRG5= <mlev>
##$CPDPRG6= <mlev>
##$CPDPRG7= <mlev>
##$CPDPRG8= <mlev>
##$CPDPRGB= <>
##$CPDPRGT= <>
##$D= (0..31)
0 1 0 0 0 0 0 0 0 0.06 0 0 0 0 0 0 0.0002 0 0 0 0 0 0 0 0 0 0 0 0 0 0 
0 
##$DATE= 1153128275
##$DBL= (0..7)
120 120 120 120 120 120 120 120 
##$DBP= (0..7)
150 150 150 150 150 150 150 150 
##$DBP07= 0
##$DBPNAM0= <>
##$DBPNAM1= <>
$$ [...]
##$SUBNAM7= <"">
##$SUBNAM8= <"">
##$SUBNAM9= <"">
##$SW= 20.6930455092707
##$SWIBOX= (0..15)
0 0 3 0 0 0 0 0 0 0 0 0 0 0 0 0 
##$SW_h= 5175.983436853
##$TD= 65536
##$TD0= 1
##$TE= 296.16
##$TE2= 300
##$TE3= 300
##$TEG= 300
##$TL= (0..7)
0 120 120 120 120 120 120 120 
##$TP= (0..7)
150 150 150 150 150 150 150 150 
##$TP07= 0
##$TPNAME0= <>
##$TPNAME1= <>
##$TPNAME2= <>
##$TPNAME3= <>
##$TPNAME4= <>
##$TPNAME5= <>
##$TPNAME6= <>
##$TPNAME7= <>
##$TPOAL= (0..7)
0.5 0.5 0.5 0.5 0.5 0.5 0.5 0.5 
##$TPOFFS= (0..7)
0 0 0 0 0 0 0 0 
##$TUNHIN= 0
##$TUNHOUT= 0
##$TUNXOUT= 0
##$USERA1= <user>
##$USERA2= <user>
##$USERA3= <user>
##$USERA4= <user>
##$USERA5= <user>
##$V9= 5
##$VALIST= <valist>
##$VCLIST= <CCCCCCCCCCCCCCC>
##$VD= 0
##$VDLIST= <DDDDDDDDDDDDDDD>
##$VPLIST= <PPPPPPPPPPPPPPP>
##$VTLIST= <TTTTTTTTTTTTTTT>
##$WBST= 1024
##$WBSW= 4
##$XGAIN= (0..3)
0 0 0 0 
##$XL= 0
##$YL= 0
##$YMAX_a= 309046
##$YMIN_a= -389746
##$ZGOPTNS= <>
##$ZL1= 120
##$ZL2= 120
##$ZL3= 120
##$ZL4= 120
##$ABSF1= 16.522
##$ABSF2= -4.171173
##$ABSG= 5
##$ABSL= 3
##$ALPHA= 0
##$AQORDER= 0
##$ASSFAC= 0
##$ASSFACI= 0
##$ASSFACX= 0
##$ASSWID= 0
##$AUNMP= <proc_1d>
##$AZFE= 0.1
##$AZFW= 0.1
##$BCFW= 0
##$BC_mod= 0
##$BYTORDP= 0
##$COROFFS= 0
##$CY= 12.5
##$DATMOD= 1
##$DC= 0
##$DFILT= <>
##$DTYPP= 0
##$F1P= 14.0000005364418
##$F2P= -0.99999901652339
##$FCOR= 0.5
##$FTSIZE= 32768
##$FT_mod= 6
##$GAMMA= 0
##$GB= 0
##$INTBC= 1
##$INTSCL= 1
##$ISEN= 128
##$LB= 0.3
##$LEV0= 0
##$LPBIN= 0
##$MAXI= 10000
##$MC2= 0
##$MEAN= 0
##$ME_mod= 0
##$MI= 0
##$NCOEF= 0
##$NC_proc= -5
##$NLEV= 6
##$NOISF1= 0
##$NOISF2= 0
##$NSP= 0
##$NTH_PI= 0
##$NZP= 0
##$OFFSET= 16.522
##$PC= 1
##$PHC0= 168.6556
##$PHC1= 6.664633
##$PH_mod= 1
##$PKNL= yes
##$PPARMOD= 0
##$PSCAL= 4
##$PSIGN= 0
##$REVERSE= no
##$SF= 250.13
##$SI= 32768
##$SIGF1= 0
##$SIGF2= 0
##$SINO= 400
##$SIOLD= 32768
##$SREGLST= <1H.CDCl3>
##$SSB= 0
##$STSI= 32768
##$STSR= 0
##$SW_p= 5175.98343685301
##$SYMM= 0
##$S_DEV= 0
##$TDeff= 65536
##$TDoff= 0
##$TI= <Analysis number 999999
Compound Code 99
Book Reference 9
Project Code 9>
##$TILT= no
##$TM1= 0
##$TM2= 0
##$TOPLEV= 0
##$USERP1= <user>
##$USERP2= <user>
##$USERP3= <user>
##$USERP4= <user>
##$USERP5= <user>
##$WDW= 1
##$XDIM= 32768
##$YMAX_p= 476122011
##$YMIN_p= -937862
$$ End of Bruker specific parameters
$$ ---------------------------------
##NTUPLES= NMR SPECTRUM
##VAR_NAME=  FREQUENCY,     SPECTRUM/REAL,   SPECTRUM/IMAG
##SYMBOL=    X,             R,               I
##VAR_TYPE=  INDEPENDENT,   DEPENDENT,       DEPENDENT
##VAR_FORM=  AFFN,          ASDF,            ASDF
##VAR_DIM=   32768,         32768,           32768
##UNITS=     HZ,            ARBITRARY UNITS, ARBITRARY UNITS
##FACTOR=    0.157963299565203, 1,           1
##FIRST=     4132.6476996994, 0,             0
##LAST=      -1043.33573715361, 0,           0
##MIN=       -1043.33573715361, -937862,     0
##MAX=       4132.6476996994, 476122011,     0
$$ Real data points
##PAGE= N=1
##DATA TABLE= (X++(R..R)), XYDATA
$$ [...]
16714B96039M9927J53214r5070j65926j05002K3939J35413M7132L0305L119k34437
$$ 296039 345966 499180 404110 238184 133182 157121 292534 339666 369971 373090 138653
16703A38653r6129J16906n9228j28184M0207R8583m7834J16253Q2165r8955m04395
$$ 138653 42524 159430 100202 -27982 12225 110808 62974 179227 261392 162437 -241958
16692b41958j65217J3597M49092L1644j24417l42739r8052L33825K95255j3728
$$ -241958 -407175 -393578 55514 87158 -37259 -379998 -478050 -144225 151030 137302
16682A37302r1791l1283J13811p4462l12204l26533k6482j31522K93000L02907
$$ 137302 45511 14228 128039 53577 -258627 -585160 -611642 -743164 -450164 -147257
16672a47257J18714j85362j20198m3857k12183J29697J13504J29182P8842J36324
$$ -147257 -28543 -213905 -334103 -377960 -590143 -460446 -346942 -217760 -138918 -2594
16662b594J71124O3713K58154q5459k78093j61364j41931o2498J41377K69005
$$ -2594 168530 232243 490397 404938 126845 -34519 -176450 -238948 -97571 171434
16652A71434k26839j00888q5627O216r982J07702K95107o7332k95621R7340J8274
$$ 171434 -55405 -156293 -241920 -235704 -245686 -137984 157123 89791 -205830 -108490 -90216
16641i0216O1159K67643r1545q3342j52744j13285J3820m0520l3779l5301L0630
$$ -90216 -29057 238586 147041 63699 -89045 -202330 -188510 -229030 -262809 -298110 -267480
16630b67480J55849J88968j28640j35040N3817J13659L20858J42797k7353J32292
$$ -267480 -111631 77337 -51303 -186343 -132526 -18867 301991 444788 417435 549727
16620E49727K23304J84851Q6613j81821r9692o7830j64271j13023J58570J30656
$$ 549727 773031 957882 1044495 862674 762982 695152 530881 417858 576428 707084
16610G07084j6236M3664l4505l12237k40074m3838J67114l9856n046K23779K1362
$$ 707084 690848 734512 700007 387770 147696 103858 270972 231116 226070 449849 471211
16599D71211l3795l18581O9455P8761j33807p2782k61927j36438K88401R7549
$$ 471211 437416 118835 188290 267051 133244 60462 -201465 -337903 -49502 48047
16589D8047N7294J6653R5237K486q808M5145J01078j89240k18810J65313Q4005
$$ 48047 105341 121994 217231 219717 210909 256054 357132 167892 -50918 114395 198400
16578A98400J39947l26892j6194L67754K47493J46098J90069K02297p4526M7114
$$ 198400 338347 11455 -4739 363015 610508 756606 946675 1148972 1074446 1121560
16568A121560k23318m62045j72568n225Q6211q9584j83998N3300P8344N7408J38341
$$ 1121560 898242 436197 263629 258404 344615 255031 71033 124333 202677 260085 398426
16557C98426l7500k97980R8892J55813j11997o4345n0098N5827j29862R1399L6455
$$ 398426 360926 62946 161838 317651 205654 141309 91211 147038 17176 108575 145030
16546A45030j95993j40828J18771J75061M9624j76386q6342K54095J82461J16232
$$ 145030 -50963 -191791 -73020 102041 151665 -24721 -111063 143032 325493 441725
16536D41725j10576l82034k09337K9248J63516p5734j49585j70411j39766J79743
$$ 441725 331149 -50885 -260222 -230974 -67458 -143192 -292777 -463188 -602954 -423211
16526d23211K32091J08512O3567J91931Q5579K5183k31066o6593Q9338J27285
$$ -423211 -191120 -82608 -19041 172890 258469 283652 52586 -14007 75331 202616
16516B02616M6052o1529k475j52633j5387j27855L5417Q2383K8548J0654J77470
$$ 202616 248668 187139 184664 32031 16644 -111211 -75794 6589 35137 45791 223261
16505B23261K47056P4210j1806l40125j84757J31180J53050j51434K7255j34443
$$ 223261 470317 544527 532721 192596 7839 139019 292069 140635 167890 33447
16495C3447Q2647R0792P3173Q6891p6859j41307Q3994K9394j78731O3432j85402
$$ 33447 116094 206886 280059 366950 290091 148784 232778 262172 83441 146873 -38529
16484c8529j75113J66260J58949Q5523j33374l01742J31382K72540K00580p7988
$$ -38529 -213642 -47382 111567 197090 63716 -238026 -106644 165896 366476 288488
16474B88488k70828j14058k28676p6787J68788J71489N1893j25362j24824j31807
$$ 288488 17660 -96398 -325074 -401861 -233073 -61584 -9691 -135053 -259877 -391684
16464c91684J69036J08280O9208K599J83990m5711j5950J54238j11908k90882
$$ -391684 -222648 -114368 -45160 -42561 141429 95718 79768 234006 122098 -168784
16454a68784j04780n7130J69029K3476j19630m7860n1361j06544R9372L20679
$$ -168784 -273564 -330694 -161665 -138189 -257819 -305679 -357040 -463584 -364212 -43533
16444d3533L026n8792K12549J26670J0577j59650j17831o4190l880Q8441J84264
$$ -43533 -40507 -99299 113250 239920 250497 90847 -26984 -91174 -95054 -6613 177651
16433A77651J79488l4691J05785Q5295k65169j28811O5758j43480j14494k70672
$$ 177651 357139 322448 428233 513528 248359 119548 185306 41826 -72668 -343340
16423c43340n021P5751k2668O8167J15696n5997n9894o8345J30194J47910p2791
$$ -343340 -348361 -272610 -295278 -227111 -111415 -167412 -227306 -295651 -165457 -17547 -90338
16412i0338k42256j14626O0177n6840j60998J31062L16908K86871J79737j93607
$$ -90338 -332594 -447220 -387043 -443883 -604881 -473819 -156911 129960 309697 116090
16402A16090m20292j99010L99745J06344k50551r674Q6413N9840m2844K15912
$$ 116090 -304202 -503212 -103467 2877 -247674 -257348 -170935 -111095 -153939 61973
16392F1973L2206j56378J05183j87049j26091j27660j39050L50910L34443k21546
$$ 61973 94179 -62199 42984 -144065 -270156 -397816 -536866 -185956 148487 -73059
16382g3059P423m3380L3470Q8438J75052k0395j13096j17066j42671J40861K25580
$$ -73059 -65636 -109016 -75546 12892 187944 167549 54453 -62613 -205284 -64423 161157
16371A61157m4141k16275o8755J04977J0092j17762j20044k52571K59159P0786
$$ 161157 117016 -99259 -168014 -63037 -52945 -170707 -290751 -543322 -284163 -213377
16361b13377l0547K00494K21797m5296P5198j89153j09001p5076k07832k0650
$$ -213377 -243924 -43430 178367 133071 208269 19116 -89885 -164961 -372793 -393443
16351c93443K63786k1333k69781j07003J47467J63713j62690k09073M8505J78819
$$ -393443 -129657 -150990 -420771 -527774 -380307 -216594 -379284 -588357 -539852 -361033
16341c61033K57765n544Q3231J3800N1334N4574J5643n2101j14863P5893j54353
$$ -361033 -103268 -108812 -25581 -11781 39553 94127 109770 57669 -57194 18699 -135654
16330a35654j08847j47034J43817N2981Q8767J12211K51373j82121j51562M2618
$$ -135654 -244501 -391535 -247718 -194737 -105970 6241 257614 75493 -76069 -33451
16320c3451j42937J3404N1081L1018Q0916K9034Q7965p9494j36536j16668j9765
$$ -33451 -176388 -162984 -111903 -80885 31 29065 117030 37536 -99000 -215668 -235433
16309b35433L83509J42811r8054J21187L6286j02763j30303p5049j73115R9010
$$ -235433 148076 290887 192833 314020 350306 247543 117240 42191 -130924 -31914
16299c1914O4580J27552j1173j69943R0799l2908L6j10605J28125K61751j48464
$$ -31914 32666 160218 149045 -20898 69901 36993 37029 -73576 54549 316300 167836
16288A67836j45819J02020L4998o4878j63827j38767k127j26948j48254K19342
$$ 167836 22017 124037 159035 94157 -69670 -208437 -210564 -337512 -485766 -266424
16278b66424J31068o0113n2603j62840o7332n333L9348K56302K28772l1018k82160
$$ -266424 -135356 -195469 -248072 -410912 -478244 -483577 -444229 -187927 40845 9827 -272333
16267b72333k06738j4661P681q7591m3926j56995J97011J53024J93167L29105
$$ -272333 -479071 -493732 -486051 -573642 -617568 -774563 -577552 -424528 -231361 97744
16257I7744K19823l59924l68538j859l7326J45807K74733q9343j50761j15840
$$ 97744 317567 -42357 -410895 -412754 -450080 -304273 -29540 -118883 -269644 -385484
16247c85484q3795m7373J20011O9683J45139j8051R4768P8073n3626o4100q1490
$$ -385484 -469279 -516652 -396641 -326958 -181819 -199870 -105102 -27029 -80655 -144755 -226245
16236b26245j92561J76803L4665j82144m5506P997Q8705j875o6053p1214R4456
$$ -226245 -418806 -242003 -207338 -389482 -434988 -426991 -338286 -340161 -406214 -477428 -382972
16225c82972P8785R5093m4840j38485R1272R3365p625r1716K28567l8372k19482
$$ -382972 -304187 -209094 -253934 -392419 -301147 -207782 -215407 -307123 -78556 -116928 -336410
16214c36410J5407M07498J10780l2704j79349k93074p4117K25977P0784J95684
$$ -336410 -321003 86495 197275 164571 -14778 -307852 -381969 -155992 -85208 110476
16204A10476L6361k66632j79747L2437K2618J70670J3868l4348O8983M203N3595
$$ 110476 146837 -119795 -299542 -267105 -244487 -73817 -59949 -94297 -25314 -21111 32484
16193C2484O8926n731j74045n4559j20974k28826o5645J2687j34273P03L3445
$$ 32484 101410 95679 -78366 -132925 -253899 -482725 -548370 -535683 -669956 -669253 -635808
16182f35808O6871K99955R8670R27J74329Q5453j89368j53322J606K5034r0838
$$ -635808 -568937 -268982 -170312 -169385 4944 90397 -98971 -252293 -250687 -225653 -316491
16171c16491O803j75933N9659J83035j4374K73594L9703m4090Q1931j75711j2888
$$ -316491 -309688 -485621 -425962 -242927 -257301 16293 55996 11906 93837 -81874 -94762
16160i4762J20556k263l9083r0613P7563j11238j99476K1224Q4043K03270o7234
$$ -94762 25794 23531 -15552 -106165 -28602 -139840 -339316 -318092 -234049 -30779 -98013
16149i8013J40372l4773l7205J85523k11443j60568Q9981K08064L98543J61457
$$ -98013 42359 7586 -29619 155904 -55539 -216107 -126126 81938 480481 641938
16139F41938l37869l74351j01329J8950n4706J10374J23985J70153r5998J3939
$$ 641938 304069 -70282 -171611 -152661 -207367 -96993 26992 197145 101147 115086
16129A15086O2633L2489j77032j48393o6890n9592j08034m5784Q5892L114j8736
$$ 115086 177719 210208 33176 -115217 -182107 -241699 -349733 -395517 -309625 -306511 -325247
16118c25247K2888p0608J66281K29359R2339k208J34314N7757M1977J6775j37694
$$ -325247 -302359 -372967 -206686 22673 115012 112804 247118 304875 346852 363627 225933
16107B25933j53447q8985K69906r5280j14630l3650Q7497J454k715J314M30376
$$ 225933 72486 -16499 253407 158127 43497 9847 97344 98798 96083 97397 527773
16096E27773o348j92261q3173k0004O9217q03l9082J03926j60919L120k37285
$$ 527773 521425 329164 245991 225987 295204 294401 255319 359245 198326 201446 -35839
16085c5839p7295J24422K25125Q101q9617J8570r8728Q2543R0279N2485l30231
$$ -35839 -113134 11288 236413 244514 154897 173467 74739 157282 247561 300046 -30185
16074c0185m97446Q5081K81856p7090J23465j3783k0542k19355j03896N4270L4332
$$ -30185 -527631 -442550 -160694 -237784 -114319 -128102 -148644 -367999 -471895 -417625 -383293
16063c83293K7343K26911J31569L39698O9740j26048k33203M4552J99210k15883
$$ -383293 -355950 -129039 2530 342228 411968 285920 52717 97269 296479 80596
16053H0596N3743J43929j4673j3573k70432N3449o042j64207J28213K11802K41139
$$ 80596 134339 278268 263595 250022 -20410 33039 26997 -137210 -8997 202805 443944
16042D43944p0875j44742l19798L0585m1172k01763M510j35856j31839K7147J25229
$$ 443944 373069 228327 -91471 -60886 -102058 -303821 -299311 -435167 -567006 -539859 -414630
16031d14630M4583J30984k0071O4890L5496q5160j77855L67028J58257j19504
$$ -414630 -370047 -239063 -259134 -194244 -158748 -243908 -421763 -54735 103522 -15982
16021a5982k14622J28098J75145l9507J91018m6843M3680J07459o0073K8133j58806
$$ -15982 -230604 -102506 72639 33132 224150 177307 220987 328446 268373 296506 137700
16010A37700k61944l347J28125j55091O7442J84213r039k52139j17177K7010N2564
$$ 137700 -124244 -127591 534 -154557 -87115 97098 88059 -164080 -281257 -254247 -201683
15999b01683L1776K50282J32915l9296p0483J87102k02572k19666o7503l75m850
$$ -201683 -169907 80375 213290 173994 103511 290613 88041 -131625 -199128 -199503 -204353
15988b04353l7494j6131J78472J50402N6121j05578J1926J97451K52428j6001
$$ -204353 -241847 -257978 -79506 70896 127017 21439 33365 230816 483244 467243
15978D67243l99689j31867j5420p2326n3826J56217J70310N6941J6812K24381
$$ 467243 67554 -64313 -79733 -152059 -205885 -49668 120642 177583 194395 418776
15968D18776P9154j30247M9871p7380r807k58023k6297p0686q3760P6419q54o6394
$$ 418776 497930 367683 417554 340174 330367 72344 46047 -24639 -108399 -31980 -32834 -99228
15956i9228j53651K0320P4668o5229n9249n488J20580J85985k07860j11023K65943
$$ -99228 -252879 -232559 -157891 -223120 -282369 -287857 -167277 18708 -189152 -300175 -34232
15945c4232J4757N3642J85994l50165k31006J20583j17154R4451L18746L81777
$$ -34232 -19475 34167 220161 -130004 -361010 -240427 -357581 -263130 55616 437393
15935D37393r4506k44625m4126Q100r2633N525O4079j37769p0693J49501k45980
$$ 437393 342887 98262 54136 62236 -30397 -24872 39207 -98562 -169255 -19754 -265734
15924b65734J27395M2390N6703o2131j3629J0969l5389J18996J82508N3963L8923
$$ -265734 -138339 -95949 -39246 -101377 -115006 -104037 -139426 -20430 162078 216041 254964
15913B54964p2472j38664k730K2994M8003M8156p6702j57801q9345J73423l9798
$$ 254964 182492 43828 41098 64092 112095 160251 83549 -74252 -163597 9826 -29972
15902b9972n7251l9417J42890j21667j64861o8076R7552J95561j03698k2824J65783
$$ -29972 -87223 -126640 16250 -105417 -270278 -338354 -240802 -45241 -148939 -171763 -5980
15891e980j09128j6043k8921j5801j12102J12974R8541M906J21183R4622j35172
$$ -5980 -115108 -131151 -160072 -175873 -287975 -175001 -76460 -71554 49629 144251 9079
15880I079q1715k65577j87289J75027J72280K35787j39711k07452p7122o8214
$$ 9079 -72636 -338213 -525502 -350475 -178195 57592 -82119 -289571 -366693 -434907
15870d34907j88959J53792L02327K45947J91890q5616k51691J58038K12095j6420
$$ -434907 -623866 -470074 -167747 78200 270090 184474 -67217 90821 302916 286496
15860B86496j01406l51730K06473K63892J88433k9829k05317M362p4741k31588
$$ 286496 185090 -166640 39833 303725 492158 462329 257012 261374 186633 -44955
15850d4955m3969J66366K97352L68509k44487l07478k68256m0486R4580J92924
$$ -44955 -88924 77442 374794 743303 498816 191338 -76918 -117404 -22824 170100
15840A70100K27863K0240l13511j12290q0854J3118J22040J22509j58338q628
$$ 170100 397963 418203 104692 -7598 -88452 -75334 46706 169215 10877 2249
15830B249n9492j74033K43050J01352r0891p4458P4082J55371J89506j68778p116
$$ 2249 -57243 -231276 11774 113126 22235 -52223 21859 177230 366736 197958 190842
15819A90842K6946k01272m30434j16180L28458j42079r5923R7769M5387Q0115
$$ 190842 217788 16516 -413918 -530098 -201640 -343719 -439642 -341873 -296486 -216371
15809b16371J18782j13776J99612M16618L0670l16046j99471j56524j31585K25111
$$ -216371 -97589 -211365 -11753 404865 435535 119489 -79982 -236506 -368091 -142980
15799a42980L9175j37290p3607K18780L24763L11815m559k02315l76539L0690
$$ -142980 -103805 -241095 -314702 -95922 228841 540656 536097 333782 -42757 -12067
15789a2067R336k57884j02344L51208K49194O3182j16637k343q2989q9031j18210
$$ -12067 -2731 -260615 -362959 -11751 237443 300625 183988 181645 98656 9625 -108585
15778a08585o0346k11950l597L43346M7629p8915K16054J79938j12352l6730j05070
$$ -108585 -168931 -380881 -384478 -41132 6497 -72418 143636 323574 211222 174492 69422
15767F9422k81606k72785K46169L50907M2022R1242j04036j85632j0016K28139
$$ 69422 -212184 -484969 -238800 112107 154129 245371 141335 -44297 -54313 173826
15757A73826M2454o3159j36705J65105Q9040O2800j62991j17154n2222J23300
$$ 173826 216280 153121 16416 181521 270561 333361 170370 53216 994 124294
15747A24294n0441J0961K72162P819j1721l84471m09580P4719L03364r7252o5091
$$ 124294 73853 84814 356976 364795 353074 -31397 -440977 -366258 -62894 -160146 -225237
15736b25237q1670J95168L30695J45753k30316j64516l49843j20140P5655K16179
$$ -225237 -306907 -111739 218956 364709 134393 -30123 -379966 -500106 -424451 -208272
15726b08272o6761l86017j5488K86854K37019M0872J46087J83447K02564J35544
$$ -208272 -275033 -661050 -676538 -389684 -152665 -111793 34294 217741 420305 555849
15716E55849k98859k59736j83893J33316K44474J57503j20693j17908l242j32600
$$ 555849 256990 -2746 -186639 -53323 191151 348654 227961 110053 106811 -25789
15706b5789k82114l339J03827M9239j22420J05545P9130J13795K7950J60562q5783
$$ -25789 -307903 -311242 -207415 -158176 -280596 -175051 -95921 17874 45824 206386 120603
15695A20603j32630k24107J55255K58378j25723M305O4386K583j10699J44216
$$ 120603 -12027 -236134 -80879 177499 51776 56081 120467 123050 12351 156567
15685A56567j27442j92824m5022K09767K07949j46375q8634N8403L4442j25521
$$ 156567 29125 -163699 -208721 1046 208995 62620 -26014 32389 66831 -58690
15675e8690k5526J3000j12163o0942j56577j09947J98798M4573j15351J37222
$$ -58690 -84216 -71216 -183379 -244321 -400898 -510845 -312047 -267474 -382825 -245603
15665b45603L0816j23692l0600R3628Q6327m9103Q152j25118J1925J18929j70155
$$ -245603 -214787 -338479 -369079 -275451 -189124 -238227 -230075 -355193 -343268 -224339 -394494
15654c94494Q3888K62739P1200j66241k09746r1617j55105N4073R4933P3438k4845
$$ -394494 -310606 -47867 23333 -142908 -352654 -444271 -599376 -545303 -450370 -376932 -401777
15643d01777J54131J887l6127M3481l2069J07268N2169n3867L36437J27103k38236
$$ -401777 -247646 -245759 -281886 -238405 -270474 -163206 -111037 -164904 171533 298636 60400
15632F0400j16868j84690j3853J38428P3960P9290r1471j19880J54822N9242J1398
$$ 60400 -56468 -241158 -255011 -116583 -42623 36667 -54804 -174684 -19862 39380 50778
15621E0778l911J71493P9725k26796k6765K86087J212p2641J03635o1962j90644
$$ 50778 46867 218360 298085 71289 44524 330611 331823 259182 362817 300855 110211
15610A10211k08346j84213K06700K48860R1157j57392j63575r5975p3866J67411
$$ 110211 -98135 -282348 -75648 173212 264369 106977 -56598 -152573 -226439 -59028
15600e9028K31350P5948k72876j08145N8588J07718O3513l0425q3648k12404K8360
$$ -59028 172322 248270 -24606 -132751 -74163 33555 97068 66643 -17005 -229409 -201049
15589b01049Q2520m5963l8245m5674J73163J67729j61318P964P8730Q5285M4217
$$ -201049 -118529 -164492 -202737 -248411 -75248 92481 -68837 -60873 17857 103142 147359
15578A47359P3101p8280j34612K9249q6032j54325M4738J22359J86294M5662l032
$$ 147359 220460 142180 7568 36817 -49215 -203540 -158802 -36443 149851 195513 192481
15567A92481p7876j21908j85471J58065L76872J0574k19103j76354P247L9375
$$ 192481 114605 -7303 -192774 -34709 342163 352737 133634 -42720 -35473 3902
15557C902K18302O7497j22192k00631M4651J36794M0585o4616j65970J9303j53504
$$ 3902 222204 289701 167509 -33122 11529 148323 188908 124292 -41678 -22375 -175879
15546a75879J66542L61418K42717j23253j14061n04748k73620R9447R2333J23662
$$ -175879 -9337 352081 594798 471545 357484 -147264 -420884 -321437 -229104 -105442
15536a05442P100K664K9100q9616r3068p0097P4688Q4433L0020Q7394L2224j29278
$$ -105442 -98342 -95678 -66578 -156194 -249262 -319359 -244671 -160238 -130218 -42824 -10600 -139878
15524a39878R705P3163k4169l4089K17487j18369k42698j34460r0123O8627J19996
$$ -139878 -130173 -57010 -81179 -115268 102219 -16150 -258848 -393308 -483431 -414804 -294808
15513b94808J31755P1649j05750n3451j13856J67874l6462J72092K14778J42855
$$ -294808 -163053 -91404 -197154 -250605 -364461 -196587 -233049 -60957 153821 296676
15503B96676R6083m3087l24694j07080j35791l0228K75016R3039j91749k02925
$$ 296676 392759 349672 24978 -82102 -217893 -248121 26895 119934 -71815 -274740
15493b74740L9875J63535K28335l6931K7967P9439j56144k35331K30873R8214
$$ -274740 -234865 -71330 157005 120074 148041 227480 71336 -163995 66878 165092
15483A65092k4193o1645J6564R8651m361k35157l25319m051J83124K79573o1453
$$ 165092 140899 79254 95818 194469 190108 -45049 -370368 -374419 -191295 88278 26825
15472B6825l42940J55304O803J18593j4061j3978K33314p3817o6316Q7009j6768
$$ 26825 -316115 -160811 -154008 -35415 -49476 -63454 169860 96043 29727 116736 99968
15461I9968k28092k20929o0383K53233j3291j68217J66194J56881j77765l5222
$$ 99968 -128124 -349053 -409436 -156203 -169494 -337711 -171517 -14636 -192401 -227623
15451b27623j8236J74414P8936k43734j15688K03873J16179L0910k50561l530
$$ -227623 -245859 -71445 7491 -236243 -351931 -148058 -31879 -969 -251530 -255060
15441b55060j9963N8853J37321J27140J965m6314j17041Q4760J0803p0695M4955
$$ -255060 -275023 -216170 -78849 48291 50256 3942 -113099 -28339 -17536 -88231 -43276
15430d3276j3760l3577K46164O3809j07683j1448O1984k2493l4270N2356j89639
$$ -43276 -57036 -90613 155551 219360 111677 100229 162213 139720 105450 157806 -31833
15419c1833k16183m9434j18601r2945O1392J15815P5160j13673m3660O1150r8861
$$ -31833 -248016 -297450 -416051 -508996 -447604 -331789 -256629 -370302 -413962 -352812 -451673
15408d51673q7615o0820n2258K70517L1032j2997o615O1522O5744J35936L9227
$$ -451673 -539288 -600108 -652366 -381849 -350817 -363814 -370429 -308907 -243163 -107227 -68000
15397f8000n8015J3645K58761J73348j42450q9880J0615k9724o6536O8356J07450
$$ -68000 -126015 -112370 146391 319739 177289 87409 98024 68300 1764 70120 177570
15386A77570l2541k31242o5157J12760J34498K0299P4586m5773n0147j72768Q6752
$$ 177570 145029 -86213 -151370 -38610 95888 116187 190773 145000 94853 -77915 8837
15375H837J70220n6704N7260j35705l70962L1747J61883n3935j84640O5107L33151
$$ 8837 179057 122353 179613 43908 -327054 -295307 -133424 -187359 -371999 -306892 26259
15364B6259L6265j99427k98525j7902O8772J85832J92406j06536j81702J32905
$$ 26259 62524 -136903 -435428 -453330 -384558 -198726 -6320 -112856 -294558 -161653
15354a61653J83495j88142m6939J36952J77810j58087l00949J5236j85800l1469
$$ -161653 21842 -166300 -213239 -76287 101523 -56564 -357513 -342277 -528077 -559546
15344e59546J29596Q7215J22018J06647Q1469K85691j24064j03925l12880r0026
$$ -559546 -429950 -342735 -220717 -114070 -32601 253090 129026 25101 -287779 -377805
15334c77805K87362q112L8555q2524J51028J65198K10046q7443k07117m3121k43555
$$ -377805 -90443 -98555 -60000 -142524 8504 173702 383748 296305 89188 46067 -197488
15323a97488j63776m2288J42561J37492J72795k75712m3277K99434Q1590j14163
$$ -197488 -361264 -403552 -260991 -123499 49296 -226416 -269693 29741 111331 -2832
15313b832o0687q7009r4189J25123K52696J01245O2995k90767q8591j06568l4080
$$ -2832 -63519 -150528 -244717 -119594 133102 234347 297342 6575 -82016 -188584 -222664
15302b22664N8115N4131Q2680l7368J08730Q9178J6286m293J40547L5051k46520
$$ -222664 -164549 -110418 -27738 -65106 43624 132802 149088 144795 285342 320393 73873
15291G3873j44797j01122r5938N5588J21922M4297J15356Q2983j97241p7909J34957
$$ 73873 -70924 -172046 -267984 -212396 -90474 -46177 69179 152162 -45079 -122988 11969
15280A1969o6679m33526n2489R8690J17468K18200n7510k19687L43217J56969
$$ 11969 -54710 -488236 -540725 -442035 -324567 -106367 -163877 -383564 -40347 116622
15270A16622J9015L0664n9620l1396K7389j9792k83819j01837M6302R2342K35285
$$ 116622 135637 166301 106681 75285 102674 82882 -200937 -302774 -256472 -164130 71155
15259G1155o06J64484O1827k25739j82192k2820n9183r3382J94006L11080j3754
$$ 71155 70549 235033 296860 71121 -111071 -133891 -193074 -286456 -92450 218630 204876
15248B04876j32389p4138j75093J314l3120j16601J83268J47190j88702o922K0944
$$ 204876 72487 -1651 -176744 -175430 -208550 -325151 -141883 5307 -183395 -190317 -169373
15237a69373p3868K8399q1911J52887Q5206j44636J99127L5180l20279l9249p1018
$$ -169373 -243241 -214842 -296753 -143866 -58660 -203296 -4169 31011 -289268 -328517 -399535
15226c99535l49193Q7972K52941K02332L38049O3182L3346k10142o4618r2262
$$ -399535 -748728 -660756 -407815 -205483 132566 195748 229094 18952 -45666 -137928
15216a37928K50848j9087R1810m8642j41207n1558M9879J06104J70484k40113
$$ -137928 112920 93833 185643 137001 -4206 -55764 -5885 100219 270703 30590
15206C0590k53016O9332N7631k04779Q3725J12632J52750O2515j54571k98496
$$ 30590 -222426 -153094 -95463 -300242 -216517 -103885 48865 111380 -43191 -341687
15196c41687j88269Q1916K03707K56592O9918p9341j92457j73284K55465J06619
$$ -341687 -529956 -448040 -244333 12259 82177 2836 -189621 -362905 -107440 -821
15186h21L5483n5533k9088l06063k96793K63899J52242M4476j52737L2576p6222
$$ -821 34662 -20871 -49959 -356022 -652815 -388916 -236674 -192198 -344935 -312359 -388581
15175c88581J5851J10049l1669L06420k44726j26555L02363R2322m9928j31265
$$ -388581 -372730 -262681 -294350 12070 -232656 -359211 -56848 35474 -14454 -145719
15165a45719q1863K9537K39930k3854k71534R0077R5922n801P7160r7133q4609
$$ -145719 -227582 -198045 41885 18031 -253503 -163426 -67504 -73305 3855 -93278 -177887
15154a77887q8438q011m8922O5568J55367O5534j48218j68108k7429L14096K86951
$$ -177887 -266325 -274336 -323258 -257690 -102323 -36789 -185007 -353115 -380544 -66448 220503
15143B20503K4415K43413j81838j20870j06728p9615L39576j04089o20223q9322
$$ 220503 244918 488331 306493 185623 78895 -720 338856 234767 -385456 -474778
15133d74778M9346J77095Q7898K55064j67012J55788K14517k9427m8272j9278
$$ -474778 -425432 -248337 -160439 94625 -72387 83401 297918 268491 220219 200941
15123B00941n7526o9256K9566m1412k26283L0288J08939L7578k46641O4725J42667
$$ 200941 143415 74159 103725 62313 -163970 -133682 -24743 12835 -233806 -169081 -26414
15112b6414O8845j5163k44356k85494k1436K11941O9288K08340J18137K75362
$$ -26414 42431 27268 -217088 -502582 -524018 -312077 -242789 -34449 83688 359050
15102C59050n3208o9631J58109k5966L1623l08639j66284Q3123R1084o8195k02033
$$ 359050 305842 236211 394320 368354 399977 91338 -74946 8177 99261 31066 -170967
15091a70967L1273J31711l30293K8377J57925K66112N155j21397Q3781J9740j06907
$$ -170967 -139694 -7983 -338276 -309899 -151974 114138 119293 -2104 81677 101417 -5490
15080e490j22224J02802J24063o4671j29672R4953P2999p014k9525k05457n7045
$$ -5490 -127714 -24912 99151 34480 -95192 -239 72760 65746 36221 -169236 -226281
15069b26281P3762N4532j86317Q2012J62736K83944K02434j58321k17556N983
$$ -226281 -152519 -97987 -284304 -202292 -39556 244388 446822 288501 70945 76928
15059G6928o5518Q3195j30194J623p8082P1022J2919j77538J50090n309j50593
$$ 76928 11410 94605 -35589 -33966 -112048 -41026 -28107 -205645 -55555 -60864 -211457
15048b11457J32032K12350O1162m466q5991j42150k7044R2852j59513J47658L54560
$$ -211457 -79425 132925 194087 189621 103630 -38520 -65564 27288 -132225 15433 369993
15037C69993r162l00863K3645k3279j23300k66718r395m8468m6356J48098J46986
$$ 369993 360831 59968 83613 60334 -62966 -329684 -339079 -387547 -433903 -285805 -138819
15026a38819J37600O7579k6750j01354k31554j83467L92109R26N8693J09585J79385
$$ -138819 -1219 66360 39610 -61744 -293298 -476765 -84656 -83730 -25037 84548 263933
15015B63933O9766j60411j57852q7608J9304j2849K9800o2095K5131Q1956l0932
$$ 263933 333699 173288 15436 -72172 -52868 -65717 -35917 -98012 -72881 9075 -21857
15004b1857k86867j40076Q1177R0299L30249O9424K05099N2966r2710j67380j96818
$$ -21857 -308724 -448800 -367623 -277324 52925 122349 327448 380414 287704 120324 -76494
14993g6494J8979j72240J4499J53444j48534l25595p8705J64487J45483M8031
$$ -76494 -57515 -229755 -215256 -61812 -210346 -535941 -614646 -450159 -304676 -256645
14983b56645K2548K71747m2706k51472O2391P7990P8370J35805K22006l49423
$$ -256645 -234097 37650 -5056 -256528 -194137 -116147 -37777 98028 320034 -29389
14973b9389K8044R4848j7246j60478j45290J91162O6233J02168n2953n0481R1734
$$ -29389 -1345 93503 76257 -84221 -229511 -38349 27884 130052 77099 26618 118352
14962A18352j1550q6883j63412n183N3289L20348M8220j03659j07554n7052p7009
$$ 118352 106802 19919 -143493 -148676 -95387 224961 273181 169522 61968 4916 -72093
14951g2093j83943o5581n8341L3594J05770L89143K63534j78856k14912J44615
$$ -72093 -256036 -321617 -379958 -346364 -240594 148549 412083 233227 18315 162930
14941A62930j05367n462J086J53484O6576k54312K68978K13468r4028l01349l6875
$$ 162930 57563 52101 53187 206671 273247 18935 287913 501381 407353 106004 69129
14930F9129o9875l2751J36985q2225l46491m6949J03396J92154j39110k10197
$$ 69129 -746 -33497 103488 21263 -325228 -372177 -268781 -76627 -215737 -425934
14920d25934j74077K98778l6919l2785Q4276k6487j30983J34928K77907P5079
$$ -425934 -600011 -301233 -338152 -370937 -286661 -313148 -444131 -309203 -31296 43783
14910D3783j83891J76631p5125k75749n5414j74968J07094O8861o78J76871K09734
$$ 43783 -140108 36523 -38602 -314351 -369765 -544733 -437639 -368778 -369456 -192585 17149
14899A7149l30677m6887J76051J03607k58253n9597J71082l1343l7597J24855
$$ 17149 -313528 -360415 -184364 -80757 -339010 -398607 -227525 -258868 -296465 -171610
14889a71610O1004J08650j28873j29637o0334J10970K0110j01638j09663J70961
$$ -171610 -110606 -1956 -130829 -260466 -320800 -209830 -189720 -291358 -401021 -230060
14879b30060K51782K34341K21196l3411O57r8130j13322p640m8117J79963q915
$$ -230060 21722 256063 477259 443848 444505 346375 233053 225413 177296 357259 348344
14868C48344p5385r2263M082J02737j24642k63121o54J43527J73864P370p5764
$$ 348344 272959 180696 184778 287515 162873 -100248 -100902 42625 216489 223859 148095
14857A48095j55542J09644k8822L07744l14113k47874k8825k2037J54270K5053
$$ 148095 -7447 102197 73375 381119 67006 -180868 -209693 -231730 -77460 -52407
14847e2407k24671j49318J63698j4406j13716r5452K88985q20j24282j91100M34208
$$ -52407 -277078 -426396 -262698 -277104 -390820 -486272 -197287 -198107 -322389 -513489 -79281
14836g9281M08972j28546k62903l70811K14134J84940j1004j82078j41760J1512
$$ -79281 329691 201145 -61758 -432569 -218435 -33495 -44499 -226577 -368337 -356825
14826c56825M1946j33077m1622K27699M3216L4608M2309R8777K66685J59266p0504
$$ -356825 -314879 -447956 -489578 -261879 -218663 -184055 -141746 -42969 223716 382982 312478
14815C12478p6107r4937j5080O0203P7679k12579o6771J53466K62926N2403j49792
$$ 312478 236371 141434 126354 186557 264236 51657 -15114 138352 401278 453681 303889
14804C03889n3511j34093j16120M8591J55440r5778j9522n3397L4997q4946K23416
$$ 303889 250378 116285 165 48756 204196 108418 88896 35499 70496 -14450 208966
14793B08966K21372n4809N1129m7166k124k3213J39407j12258r7743j00435l09861
$$ 208966 430338 375529 426658 379492 377368 354155 493562 381304 283561 183126 -126735
14782a26735n7518L3072K77368N6015j85284j93280M9353N7061j79117j2273K21714
$$ -126735 -184253 -151181 126187 182202 -3082 -196362 -147009 -89948 -269065 -281338 -59624
14771e9624J86919J62063J30022r4823l02567k75058r5380K43239J9251J44805
$$ -59624 127295 289358 419380 324557 21990 -253068 -348448 -105209 -85958 58847
14761E8847J2396k82802p283j77797J3662Q2346L58261J34180l5596k50216k0221
$$ 58847 71243 -211559 -218842 -396639 -382977 -300631 57630 191810 156214 -94002 -114223
14750a14223J09401m6727Q9736l3715N1186j9018n9084j15286M7509k36467l64304
$$ -114223 -4822 -51549 38187 4472 55658 36640 -22444 -137730 -90221 -326688 -690992
14739f90992Q1158K96229J39506J07986O0714j24415J67934J60597r4268l7419
$$ -690992 -609834 -313605 -174099 -66113 -5399 -129814 38120 198717 104449 67030
14729F7030P769p2282o3480K8212j64316q9269J09766K07067M9214K18615O4948
$$ 67030 74799 2517 -60963 -32751 -197067 -286336 -176570 30497 79711 298326 363274
14718C63274j05703k99591r1973J45695K68970K7830O395j56211q5966o7580J45813
$$ 363274 257571 -42020 -133993 11702 280672 308502 314897 158686 72720 5140 150953
14707A50953m03238K6442j17904R4831J17294J9362n0006J18899r0457J24276
$$ 150953 -252285 -225843 -343747 -248916 -131622 -112260 -162266 -43367 -133824 -9548
14697i548J56555j88857j53047J42535N3860r5510j36940N1469j99839o2563J43718
$$ -9548 147007 -41850 -194897 -52362 1498 -94012 -230952 -179483 -379322 -441885 -298167
14686b98167m2552J21645K0240M2853Q4702j465l28072J3320M3813J78589L71362
$$ -298167 -340719 -219074 -198834 -155981 -71279 -72744 -400816 -387496 -343683 -165094 206268
14675B06268J34089l1988j95019m26396K00918K06170k14432j07682Q8244K90035
$$ 206268 340357 308369 113350 -313046 -112128 94042 -120390 -228072 -139828 150207
14665A50207R3393p7269k00144j06970l20902j02233Q9991l2119J48373J58000
$$ 150207 243600 166331 -33813 -140783 -461685 -563918 -473927 -506046 -357673 -199673
14655a99673j44799J14197l8623J20153R7065K27008j33334k10649K42877j28087
$$ -199673 -344472 -230275 -268898 -148745 -51680 175328 41994 -168655 74222 -53865
14645e3865L20844N1882j87534P3475j19033k27956k12570j38124p829J38712
$$ -53865 266979 318861 131327 204802 85769 -142187 -354757 -492881 -500710 -361998
14635c61998J12620l8160p5521K53579o328k03877j71539K9074P8554J79520l1174
$$ -361998 -249378 -287538 -363059 -109480 -115808 -319685 -491224 -462150 -383596 -204076 -235250
14624b35250m52001J48913J91203L34680j6463k7466K32657K655N0928r3048n0429
$$ -235250 -687251 -538338 -347135 -12455 -28918 -56384 176273 178928 229856 136808 86379
14613H6379R5666k26314j58834n2349J92215J09887j93210j16694M5413j32778
$$ 86379 182045 -44269 -203103 -255452 -63237 46650 -146560 -263254 -217841 -350619
14603c50619j15205K98525q1992j16832J76235J96127M3319j59584k43712K0366
$$ -350619 -465824 -167299 -249291 -366123 -189888 6239 49558 -110026 -353738 -333372
14593c33372P7211M7861n2819n7131L59847m4144j98096o6935J3628O3445J02081
$$ -333372 -256161 -208300 -261119 -318250 41597 -2547 -200643 -267578 -253950 -190505 -88424
14582h8424J11372o2463R8779j0164k91004j7520J08387m5533j49674L7587N9021
$$ -88424 22948 -39515 59264 49100 -241904 -259424 -151037 -196570 -346244 -308657 -249636
14571b49636K76438k3651k09997j39813m62r793K5515p2021Q2365L37206J68218
$$ -249636 26802 3151 -206846 -346659 -347121 -356914 -331399 -403420 -321055 16151 184369
14560A84369n7107J54140L3726J64348k4374J72703j22084j33784j14597k9890
$$ 184369 127262 281402 315128 479476 455102 627805 505721 371937 257340 227450
14550B27450J92460k73552N8863o250k53469l1444p0225l41774j15205j23776
$$ 227450 419910 146358 205221 198971 -54498 -85942 -156167 -497941 -613146 -736922
14540g36922L12002J90931j85071J22829L23631N8991n3859j09077p8953p9662
$$ -736922 -424920 -233989 -419060 -296231 27400 86391 32532 -76545 -155498 -235160
14530b35160j43614O2427q5439q3183K00622M24598J89789j21767j20888o6095
$$ -235160 -378774 -316347 -401786 -484969 -284347 140251 330040 208273 87385 21290
14520B1290O7218K2932o286j68429k78023l12397q1055J18127K09385j05566J52992
$$ 21290 88508 111440 105154 -63275 -341298 -653695 -734750 -616623 -407238 -512804 -359812
14509c59812J06233Q461L73710L5201k35508r4140r2464j16119l5629p3285L2126
$$ -359812 -253579 -245118 128592 163793 -71715 -165855 -258319 -374438 -410067 -483352 -451226
14498d51226J49487j58959k05248J07352K46412j47541l073J33414K6487J04685
$$ -451226 -301739 -460698 -665946 -558594 -312182 -459723 -462796 -329382 -302895 -198210
14488a98210K16157J4015Q6909R1630j54128k50040r1888L5111j18647J86120
$$ -198210 17947 31962 118871 210501 56373 -193667 -285555 -250444 -369091 -182971
14478a82971J06931J58800M1981j39893k09500r3960m7053K35531M4784q199O3913
$$ -182971 -76040 82760 124741 -15152 -224652 -318612 -365665 -130134 -85350 -93549 -29636
14467b9636j29207J50368l4884j50488J59631q6135M6494J29851J07443k57943
$$ -29636 -158843 -8475 -43359 -193847 -34216 -120351 -73857 55994 163437 -94506
14457i4506K1546J67700j3939M084J12623j9775j34972m9409r2500j81202k2071
$$ -94506 -72960 94740 80801 84885 197508 177733 42761 -6648 -99148 -280350 -302421
14446c02421K8707j10478M4431j84363m7301K56061J44099J32260j08439k42682
$$ -302421 -273714 -384192 -339761 -524124 -571425 -315364 -171265 -39005 -147444 -390126
14436c90126K96389p2254k09195M3014Q0912J70947n519Q5861J2886j22782o5865
$$ -390126 -93737 -165991 -375186 -332172 -251260 -80313 -85832 29 12915 -109867 -175732
14425a75732R1343J81186j33811M8428J1696K39676j99120r285j41924l55545
$$ -175732 -84389 96797 -37014 11414 23110 262786 63666 54381 -87543 -443088
14415d43088R8685K96593L18321J55651k2649k4283k8499j46447l7285M9877j10568
$$ -443088 -344403 -47810 270511 426162 403513 379230 350731 204284 166999 216876 106308
14404A06308P4679k0751Q0660P8395J02943o4138j02862J47038r0286j77549N216
$$ 106308 180987 160236 240896 319291 422234 358096 255234 402272 311986 134437 139653
14393A39653j99518k8070k8503l3266j29355J90199K55110j66361M5014K1835
$$ 139653 -59865 -87935 -116438 -149704 -279059 -88860 166250 -111 44903 66738
14383F6738j8835L9986j72406k19067R6882J75620O18j63115j35960n3933k60754
$$ 66738 47903 87889 -84517 -303584 -206702 -31082 -30464 -193579 -329539 -383472 -644226
14372f44226o7502K26190J24177j8109J95162k9412l2473J24694P2602j51912
$$ -644226 -711728 -485538 -361361 -379470 -184308 -213720 -246193 -121499 -48897 -200809
14362b00809j79869K51529R4779J5642J11955J71721l4305Q0940j09206n8201
$$ -200809 -380678 -129149 -34370 -18728 93227 264948 230643 311583 202377 144176
14352A44176J82371L7297L4513j53897q6316j16564j79433r3896m1508m600k5916
$$ 144176 326547 363844 398357 244460 158144 41580 -137853 -231749 -273257 -277857 -303773
14341c03773O7803k8113r7106J0444j69040N6652N6988J82869L59412J56597p3905
$$ -303773 -235970 -264083 -361189 -350745 -519785 -463133 -406145 -223276 136136 292733 218828
14330B18828l2551o2422k43884j67880j1873M2649J27764J93584J57620r7693
$$ 218828 186277 123855 -120029 -287909 -299782 -257133 -129369 64215 221835 124142
14320A24142j24379k00210j71080k16241j94837j3596Q9890L07869K55007Q6052
$$ 124142 -237 -200447 -371527 -587768 -782605 -796201 -706311 -398442 -143435 -57383
14310e7383M2635J62853J29331j67626k03964m8406O8125m9281j87054Q6206K65977
$$ -57383 -14748 148105 277436 109810 -94154 -142560 -74435 -123716 -310770 -224564 41413
14299D1413J977J18898k6886j43905l3117k51994K0486J64663M51121l9805j02005
$$ 41413 43390 162288 135402 -8503 -41620 -293614 -273128 -108465 342656 302851 200846
14288B00846O3481j73519k23585j39849J08017K23994J39294k17836j9539R6208
$$ 200846 264327 90808 -132777 -272626 -164609 59385 198679 -19157 -38696 57512
14278E7512j7397N9656l5409K7043O2110O914M67j56619l13750J7760J34358J41460
$$ 57512 40115 99771 64362 91405 153515 160429 160896 4277 -309473 -291713 -157355 -15895
14266a5895m6179L4362J58516o399j27934k30706K015j35613N2892J79795P7627
$$ -15895 -62074 -27712 130804 124405 -3529 -234235 -232220 -367833 -314941 -135146 -57519
14255e7519k23529j08414J68132L7964K7927J84525K08792L0162j35185K1257
$$ -57519 -281048 -389462 -221330 -183366 -155439 29086 237878 268040 132855 154112
14245A54112j9361l5004J03476k78412k24958j8868O2365J0532M01448l0691m8787
$$ 154112 134751 99747 203223 -75189 -300147 -319015 -256650 -246118 155330 124639 75852
14234G5852m57j31580J20516K09946q8736j9973L0954j91799k29597J71080L7380
$$ 75852 75395 -56185 64331 274277 185541 165568 196522 4723 -224874 -53794 -16414
14223a6414r5551p549K5444J86423j54031p5566O5554O7584J42749J14706j98824
$$ -16414 -111965 -119514 -94070 92353 -61678 -137244 -71690 -4106 138643 253349 54525
14212E4525q4011K8179k15761Q9481o7197P5235K79577J08037j84498o1755J63875
$$ 54525 -29486 -1307 -217068 -127587 -194784 -119549 160028 268065 83567 21812 185687
14201A85687q2661l17396J181K66833K20947j77711k25145r248n4555K64772L30784
$$ 185687 103026 -214370 -213189 53644 274591 96880 -128265 -137513 -192068 72704 403488
14190D03488J8074k47007j0386j31875p3895J48299L4401j23799j11688J76327
$$ 403488 421562 174555 164169 32294 -41601 106698 141099 17300 -94388 81939
14180H1939M0524m763l7910j27160m1049J63105j6133j91367J22048N5674k3435
$$ 81939 122463 117700 79790 -47370 -88419 74686 58553 -132814 -10766 44908 21473
14169B1473j27710j21916j71046M9398M34q8985j11296N2929K09879J65339p4493
$$ 21473 -106237 -228153 -399199 -349801 -349367 -438352 -549648 -496719 -286840 -121501 -195994
14158a95994K9694j79354L6094J09884J9154J27593q3507R9437P2971j03041j78193
$$ -195994 -166300 -345654 -309560 -199676 -180522 -52929 -136436 -36999 35972 -67069 -245262
14147b45262j55382M3866J34829r7734l882J95678m2705O7654j8416M5194Q8456
$$ -245262 -400644 -356778 -221949 -319683 -323565 -127887 -170592 -102938 -121354 -76160 12296
14136A2296J47873j41825k34759k04088M550J10206J34922k22658j7650J88969
$$ 12296 160169 18344 -216415 -420503 -415953 -305747 -170825 -393483 -411133 -222164
14126b22164J60741k3787J97168l33144p0501l8538J20448M6039n0465r1782M1491
$$ -222164 -61423 -85210 111958 -221186 -291687 -330225 -209777 -163738 -214203 -305985 -264494
14115b64494j19N1956J49048Q8729J76315r9137j39199n5926N8872K29336R0701
$$ -264494 -264613 -212657 -63609 25120 201435 102298 -36901 -92827 -33955 195381 286082
14104B86082j89613k42725j24394M6479L5106J55111k6713l9854M0517j84591
$$ 286082 96469 -146256 -270650 -224171 -189065 -33954 -60667 -100521 -60004 -244595
14094b44595M1650N0404K4575R0547r0670j37262Q6141J00030K48255K40389M716
$$ -244595 -202945 -152541 -127966 -37419 -128089 -265351 -179210 -79180 169075 409464 414180
14083D14180L703l436k81765l62972j47716L87636K93660J10685j00824K21973
$$ 414180 417883 414447 132682 -230290 -378006 9630 303290 413975 313151 535124
14073E35124J03348j32677j77598k14557k9260j99903J9219K19920k15842n1734
$$ 535124 638472 505795 328197 113640 84380 -115523 -96304 123616 -92226 -143960
14063a43960j17279J78892J15580k5824k38048J62895L24487O4852j73291j75542
$$ -143960 -261239 -82347 33233 7409 -230639 -67744 256743 321595 148304 -27238
14053b7238K4706p0491k54764M8787p2854m6398K08696K0866P455K29259j29609
$$ -27238 -2532 -73023 -327787 -279000 -351854 -398252 -189556 -168690 -161235 68024 -61585
14042f1585K1669J06984n6714n5024L7418K2681j4143j7875k85189j74656N7907
$$ -61585 -39916 67068 10354 -44670 -7252 15429 1286 -16589 -301778 -476434 -418527
14031d18527j49114Q9254K10578r65k9449O3091K48162j72439m5406J13604J6987
$$ -418527 -567641 -478387 -267809 -268774 -298223 -235132 13030 -159409 -204815 -91211 -74224
14020g4224o9326p5899R4032Q6931K2003L5300r4112R801l4620j66746Q9333O6902
$$ -74224 -143550 -219449 -125417 -38486 -16483 18817 -75295 -65494 -100114 -266860 -177527 -110625
14008a10625K6069n7351Q9800K59359P6729o2599k88563q4953J40066j12558j78481
$$ -110625 -84556 -141907 -52107 207252 283981 221382 -67181 -152134 -12068 -124626 -303107
13997c03107J89917K5586m7686M1393J16845M5076n0740L08616j25081k85741
$$ -303107 -113190 -87604 -135290 -93897 22948 68024 17284 325900 200819 -84922
13987h4922o1213P4927q9496m8130J78076K17503j38151k4381J6958l7669j98006
$$ -84922 -146135 -71208 -160704 -208834 -30758 186745 48594 24213 41171 3502 -194504
13976a94504q0372J36106r8253J08699j52779j14915j1742J1634k309l4396J38862
$$ -194504 -274876 -138770 -237023 -128324 -281103 -396018 -407760 -396126 -398435 -432831 -293969
13965b93969K30563J13827j829j9867M486j51204q3431J26695j08490j32157L04484
$$ -293969 -63406 50421 48592 28725 33211 -117993 -201424 -74729 -183219 -315376 -10892
13954a0892k5724j26151K2834K08075j18575N9659J30198L07222j50901K6995
$$ -10892 -36616 -162767 -139933 68142 -50433 9226 139424 446646 295745 322740
13944C22740J94780j04678l08435j70982j23611j27502J41831m6700j03211Q7088
$$ 322740 517520 412842 104407 -66575 -190186 -317688 -175857 -222557 -325768 -238680
13934b38680r7613q5774R7349K86565J91394l0525j56805j47983o2342q2673K24502
$$ -238680 -336293 -422067 -324718 -38153 153241 122716 -34089 -182072 -244414 -327087 -102585
13923a02585J73749j36283K2501q8135J13821O2438Q2983J92207r4023j24588
$$ -102585 71164 -65119 -42618 -130753 -16932 45506 128489 320696 226673 102085
13913A02085N8891o4805j64227j08428j5289o9559J99451p6787m0978k2893j32617
$$ 102085 160976 96171 -68056 -176484 -191773 -261332 -61881 -138668 -179646 -202539 -335156
13902c35156J51222J45797O6314m1275j17471M4608J17841r0879q9998J27834
$$ -335156 -183934 -38137 28177 -13098 -130569 -85961 31880 -58999 -148997 -21163
13892b1163O1937k706r2710Q7399K052J58133j82366m7335q256j9737j72646r6694
$$ -21163 40774 38068 -54642 32757 34809 192942 10576 -36759 -45015 -64752 -237398 -334092
13880c34092J79985J72292N7887k28522M6176m4860P2032j72054o3605o8433K16079
$$ -334092 -154107 18185 76072 -152450 -106274 -151134 -79102 -251156 -314761 -383194 -167115
13869a67115k3734j25085K00452J66458r9197q7663L35833L71092J16542k20090
$$ -167115 -190849 -315934 -115482 50976 -48221 -135884 199949 571041 687583 467493
13859D67493j88081N6674K71040j87706j75379l3301r7977o885R2584j54882m03446
$$ 467493 279412 336086 607126 419420 244041 210740 112763 105878 198462 43580 -359866
13848c59866k23478J31744J75379m6724j20708P393J04958K06306m5630N28j58136
$$ -359866 -583344 -451600 -276221 -322945 -443653 -436260 -331302 -124996 -170626 -170098 -328234
13837c28234P1643J88742j33544J25387J69074J15812L08962k10370k41176j57997
$$ -328234 -256591 -67849 -201393 -76006 93068 208880 517842 307472 66296 -91701
13827i1701j39071O6130P8096J33356K7430j54238j99138K5378m6559l9824J63374
$$ -91701 -230772 -164642 -86546 46810 74240 -79998 -279136 -253758 -300317 -340141 -176767
13816a76767J03912n0194l364j94398J56845k1291j28027l5553P8313J4913K22007
$$ -176767 -72855 -123049 -126413 -320811 -163966 -185257 -313284 -348837 -270524 -255611 -33604
13805c3604K56663M2112L912J69611j00329r1334j20662j07619K28961L14027
$$ -33604 223059 265171 269083 438694 338365 247031 126369 18750 247711 561738
13795E61738r3101k11685j59760r7364k0239k1830J36752N7880M8060K90428k86473
$$ 561738 468637 256952 97192 -172 -20411 -42241 94511 152391 200451 490879 204406
13784B04406l50936j20934O7914K4743J27282j20565r492k1248j01622O318n1029
$$ 204406 -146530 -267464 -199550 -174807 -47525 -168090 -177582 -198830 -300452 -294134 -345163
13773c45163J11063K77785R3860k29900J62017J24385P8577K5365j19688j73545
$$ -345163 -234100 43685 137545 -92355 69662 194047 272624 297989 178301 4756
13763D756N4535q2083K92658n2605o8575k737k3735o6495J36l445k52406L0535
$$ 4756 59291 -22792 269866 217261 148686 145949 122214 55719 55855 52410 -199996 -169461
13751a69461N8206K19654j08165o3236k20278m4707L39836K43032p2109j03017
$$ -169461 -111255 108399 234 -63002 -283280 -327987 11849 254881 182772 79755
13741G9755r8773l5826L625n566J74945r412J31002J498J0993J30461n5395l24503
$$ 79755 -19018 -54844 -51219 -56785 118160 108748 239750 241248 252241 382702 327307 2804
13729B804k15568j98341n9374K42132J16353o8452J78204K1132J81039Q7043P3013
$$ 2804 -212764 -411105 -470479 -228347 -111994 -180446 -2242 18890 199929 286972 359985
13718C59985r7063j53121J8260j61307Q2017J61170L0817q4954M8474n0106l85144
$$ 359985 262922 109801 128061 -33246 48771 209941 240758 155804 204278 154172 -230972
13707b30972m3125J35255J63853J37534j87180K06206J35209m0363p8099k8214
$$ -230972 -274097 -138842 25011 162545 -24635 181571 316780 276417 198318 170104
13697A70104M7486J95403J45117j75086j31116j98566K66697j1440k01004O3903
$$ 170104 217590 412993 558110 383024 251908 53342 320039 308599 107595 171498
13687A71498r473k9591r1188r8962K7724L6353J49389J32118J48599k1233n7298
$$ 171498 162025 132434 41246 -57716 -29992 6361 155750 287868 436467 415234 357936
13676C57936q8825j37526l9133M7551J37660k27476j79090K73481N01j17222L1849
$$ 357936 269111 131585 92452 140003 277663 50187 -128903 144578 145079 27857 59706
13665E9706J1101J28914J94933k33943l949M6223N3788j88520J99764o0121q7029
$$ 59706 70807 199721 394654 160711 156762 202985 256773 68253 268017 207896 120867
13654A20867J23629n4270l81635p2773R898J35448K27203L47753J24801o5903
$$ 120867 244496 190226 -191409 -264182 -254284 -118836 108367 456120 580921 515018
13644E15018j58623j05444K97888J2190k45030k01156J90000r6133j60669o120
$$ 515018 356395 250951 548839 561029 315999 114843 304843 208710 48041 41921
13634D1921j96553J78495Q1145j97069j40859q9230N2356P0972N8582K50896J23499
$$ 41921 -154632 23863 105008 -92061 -232920 -322150 -269794 -198822 -140240 110656 234155
13623B34155k55409l30401O7110k744j02982P071p6851K3285o33J45679K17817
$$ 234155 -21254 -351655 -284545 -287289 -390271 -383200 -460051 -436766 -437399 -291720 -73903
13612g3903j0072j01606p3779j83789r9805J41246O2754J94670j081R5309K05030
$$ -73903 -83975 -185581 -259360 -443149 -542954 -401708 -338954 -144284 -145365 -50056 154974
13601A54974K80540j28558m14614k44216j0924K43981R5405J52778p9504j69910
$$ 154974 435514 306956 -107658 -351874 -362798 -118817 -23412 129366 49862 -120048
13591a20048j03429O834Q9099n973Q2993N5967n6535j24305l26360r9647K23097
$$ -120048 -223477 -216643 -127544 -133517 -50524 5443 -51092 -175397 -501757 -601404 -378307
13580c78307R5297J29159k05618O7935J42530N282q0015j85001K2313j45499L412
$$ -378307 -283010 -153851 -359469 -291534 -149004 -143722 -223737 -408738 -386425 -531924 -528512
13569e28512R3221K44054J91156k75673k5586M96066L11316k05930l02338l82412
$$ -528512 -435291 -191237 -81 -275754 -301340 194726 506042 300112 -2226 -384638
13559c84638j54362J61849J26417Q6513K45930J59634n6018n4306k79858m7103
$$ -384638 -539000 -377151 -250734 -164221 81709 241343 185325 131019 -148839 -195942
13549a95942J34507j1235O5125j33487m6130L8614n3355K75979J46025m922j90905
$$ -195942 -61435 -72670 -7545 -141032 -187162 -148548 -201903 74076 220101 215179 24274
13538B4274K78031j5211j92489K9992K37481l0568J992j68342p2729P5273J229
$$ 24274 302305 287094 94605 124597 362078 331510 333502 165160 92431 167704 168933
13527A68933j35439l0602j47530m1016l7803K8497J1162J44023J72716k3000j61282
$$ 168933 33494 2892 -144638 -185654 -223457 -194960 -183798 -39775 132941 109941 -51341
13516e1341j69974J53410R4670J79865r9537j90509P3183M67801J9133l57630
$$ -51341 -221315 -67905 26765 206630 107093 -83416 -10233 457568 476701 119071
13506A19071q1037n0083p3632r9047N317j94472j74475K61452J5623K06486q2413
$$ 119071 38034 -12049 -85681 -184728 -179411 -373883 -548358 -286906 -271283 -64797 -147210
13495a47210k02811k202Q6972J22235j7205K21334M2967J6547L14479m3052k03525
$$ -147210 -350021 -352223 -265251 -143016 -160221 61113 104080 120627 435106 392054 188529
13484A88529j17827j66832j451J24020k10359j72526n8702q1049k05040M53224
$$ 188529 70702 -96130 -97581 26439 -183920 -356446 -415148 -496197 -701237 -248013
13474b48013K68289J95518J06713j42487n7360k15488J80494J18893r2282Q0544
$$ -248013 20276 215794 322507 180020 122660 -92828 87666 206559 114277 194821
13464A94821n096k45593l1333J81136n9959R4739P6086K8689j61909N7464J68701
$$ 194821 189725 -55868 -87201 93935 33976 128715 204801 233490 71581 129045 297746
13453B97746q4972o6522q1058L2037q2934j05034j06360L4016J52488j37346l07660
$$ 297746 212774 146252 65194 97231 14297 -90737 -197097 -163081 -10593 -147939 -455599
13442d55599p5409J38919j28850p9399J69076K44947J35253r7145J09595K9854
$$ -455599 -531008 -392089 -520939 -600338 -431262 -186315 -51062 -148207 -38612 -8758
13432h758j65175k06333K53841K35671O8256p4211j31558j06004j38408j31102
$$ -8758 -173933 -380266 -126425 109246 177502 103291 -28267 -134271 -272679 -403781
13422d03781J55201O7521n4968J34598j891P4386O0699J75070j80480O8714K17198
$$ -403781 -248580 -181059 -236027 -101429 -103320 -28934 31765 206835 26355 95069 312267
13411C12267J74125O669j72493L335m4867r9931j96934L5950k8124l4455Q0967
$$ 312267 486392 493061 320568 323903 279036 179105 -17829 18121 -10003 -44458 36509
13400C6509O5810J9962K967N9711o6866k0581j57159N7343R8700J90520J80348
$$ 36509 102319 122281 125248 184959 118093 97512 -59647 -2304 96396 286916 467264
13389D67264L1345l73730J09974o2128j28855J70749k7124Q1115l18670m6999
$$ 467264 498609 124879 234853 172725 43870 214619 187495 268610 -50060 -97059
13379i7059Q986l1113Q1566K28489o3986j86378j45627N2157Q6911J2572n5285
$$ -97059 -88073 -119186 -37620 190869 126883 -59495 -205122 -152965 -66054 -53482 -108767
13368a08767L9320O1870m2453j73699j41631R0370J61861N3206J06724r1613l42219
$$ -108767 -69447 -7577 -50030 -223729 -365360 -274990 -113129 -59923 46801 -44812 -387031
13357c87031k1468N5150n5011j33244K9703K38213K25969j9566m4152K9534m3616
$$ -387031 -408499 -353349 -408360 -541604 -511901 -273688 -47719 -67285 -111437 -81903 -125519
13346a25519J15815r0934q4117K91582M0429j31902j34005L16003l7238k6110
$$ -125519 -9704 -100638 -184755 106827 147256 15354 -118651 197352 160114 134004
13336A34004p6295J3158r569J40980j44452m91060L8750J99342q6344R6626J42923
$$ 134004 57709 70867 61298 202278 57826 -433234 -394484 -195142 -281486 -184860 -41937
13325d1937K72122j49227J19537k15695l2885R4586l4228K43460K27618J43571
$$ -41937 230185 80958 200495 -15200 -48085 46501 12273 255733 483351 626922
13315F26922n0990k69626j67722j56858j41432J76316j2470j2289J40895K18357
$$ 626922 575932 306306 138584 -18274 -159706 16610 4140 -8149 132746 351103
13305C51103m4369j79317o3116j21433J55559M08O6505M7178m6178k40639k5652
$$ 351103 306734 127417 64301 -57132 98427 98835 165340 212518 166340 -74299 -99951
13294i9951r3951k44514o3480J11733J55076J90500K73906q2950k40439l3411
$$ -99951 -193902 -438416 -501896 -390163 -235087 -44587 229319 146369 -94070 -127481
13284a27481J31758j07101j05007K02478J24337R3582N0836o7367l0501j86095
$$ -127481 4277 -102824 -207831 -5353 118984 212566 263402 196035 165534 -20561
13274b0561k41125p0315K5179O2709K41475Q0269m9565J31169q9891O572j3301
$$ -20561 -261686 -332001 -306822 -244113 -2638 77631 28066 159235 69344 75916 62615
13263F2615J39283K60996r2534j37356j06451r2118J33833j14164K0921j16304
$$ 62615 201898 462894 370360 233004 126553 34435 168268 54104 75025 -41279
13253d1279q7545M3700J33662q0127m0731K34734j38029k52380K2991O3710m9546
$$ -41279 -128824 -85124 48538 -31589 -72320 162414 24385 -227995 -205004 -141294 -190840
13242a90840K76400K54364R2768j82458P936k48461j63190K7191Q7388Q4295J93951
$$ -190840 85560 339924 432692 250234 258170 9709 -153481 -126290 -38902 45393 239344
13231B39344m2865o5750J98636J10149J10491j61066j80119J9768r5420j45473
$$ 239344 196479 130729 329365 439514 550005 388939 208820 228588 133168 -12305
13221a2305M4857p7095k12294o1998P6351K93561j2343l09862J05494l2248j39271
$$ -12305 32552 -44543 -256837 -318835 -242484 51077 38734 -271128 -165634 -197882 -337153
13210c37153J15793R8602j0335n0506J38113r5728l20764n1744K43718J40806
$$ -337153 -221360 -122758 -133093 -183599 -45486 -141214 -461978 -513722 -270004 -129198
13200a29198L0127k45711N1232R1465j16121o8963J49651J3005j30911K52458
$$ -129198 -99071 -344782 -293550 -202085 -318206 -387169 -237518 -224513 -355424 -102966
13190a02966N4712K6355J16639k6685k01827N0688K84660M2103j15605l4131J65053
$$ -102966 -48254 -21899 94740 68055 -133772 -83084 201576 243679 128074 93943 258996
13179B58996R0790j04962O3072P067k53887M6423R3894m556k52325O14q2410n0125
$$ 258996 349786 244824 307896 314963 61076 107499 201393 196837 -55488 -54874 -137284 -187409
13167a87409J79265j73889m501j2089R3750O9254p7239j02041j37067P6322J79857
$$ -187409 -8144 -182033 -186534 -198623 -104873 -35619 -112858 -214899 -351966 -275644 -95787
13156i5787J30322q1509P3794j40316l1831J37699N3961K7401j68279j55088J23171
$$ -95787 34535 -46974 26820 -113496 -145327 -7628 46333 73734 -94545 -249633 -126462
13145a26462K5446k30027R5470K70105M3204j5394q6420J1853j42708p0044M0194
$$ -126462 -101016 -331043 -235573 34532 77736 62342 -24078 -12225 -154933 -224977 -184783
13134a84783K06325K64229k39832l86262J21115K06580N7582o9813k17889m0806
$$ -184783 21542 285771 45939 -340323 -219208 -12628 44954 -24859 -242748 -283554
13124b83554N2818J73054L4323J03844R194k54017j71423L0105J55047N524J53704
$$ -283554 -230736 -57682 -23359 80485 89679 -164338 -335761 -305656 -150609 -145085 8619
13113H619j01058J65512J28936j22212K2210n2698j40730J94313J32459r0989
$$ 8619 -92439 73073 202009 79797 102007 49309 -91421 102892 235351 144362
13103A44362L3178Q7389j95523k40442j06436K14173N9932J93157J93538p6949
$$ 144362 177540 264929 69406 -171036 -277472 -63299 -3367 189790 383328 306379
13093C06379k90996r8030j78793j28896J41148K01079K8769r6355n8027q11j82781
$$ 306379 15383 -82647 -261440 -390336 -249188 -48109 -19340 -115695 -173722 -174533 -357314
13082c57314R0882K94841k95519n5040k8950J138J42119O9992J19251K10018J63193
$$ -357314 -266432 28409 -267110 -322150 -351100 -349962 -207843 -137851 -18600 191418 354611
13071C54611L527l15403n2259M05j16847Q6123R6786n8549J65954K59274L4535
$$ 354611 358138 42735 -9524 -9119 -125966 -39843 56943 -1606 164348 423622 458157
13060D58157j99604j06119o4151n5885j57405M7393J01131J45946r2301O589N250
$$ 458157 258553 152434 88283 32398 -125007 -77614 23517 169463 77162 83751 89001
13049H9001j21847J1291J67842M8110J64041k13284k43098j49458k10744J36314
$$ 89001 -32846 -21555 146287 194397 358438 145154 -97944 -247402 -458146 -321832
13039c21832k0394j1487Q9338n1139J41489J08507Q1992J01805J38236o8364n7556
$$ -321832 -342226 -353713 -264375 -315514 -174025 -65518 16474 118279 256515 188151 130595
13028A30595r9861j24038j53675p7823O8213M6128k607k33064J77524L71755K20985
$$ 130595 30734 -93304 -246979 -324802 -256589 -210461 -213068 -446132 -268608 103147 324132
13017C24132j63738k07543j27332J39974j3474o1092J57623K77439k12036l00094
$$ 324132 160394 -47149 -174481 -34507 -47981 -109073 48550 325989 113953 -186141
13007a86141Q8439J90374m6849J20690K6842Q8065l41797k06087j18587K681L5822
$$ -186141 -97702 92672 45823 166513 193355 281420 -60377 -266464 -385051 -382370 -346548
12996c46548K95136l1901j85232l1548J41659J13346k26352p8995M1235J65791
$$ -346548 -51412 -83313 -268545 -300093 -158434 -45088 -271440 -350435 -309200 -143409
12986a43409J38438R3092N7312O576J66157m6485Q7434O301j05632j11950q7791
$$ -143409 -4971 88121 145433 152009 318166 271681 359115 365416 259784 147834 60043
12975F0043j18267k4628J68754K7028L3037l7084p1697l7138n3035l0174O1586
$$ 60043 -58224 -82852 85902 112930 145967 108883 37186 48 -52987 -83161 -21575
12964b1575o8207k81496j21972K26748N5114J00957Q5250O7289J01245O6757L1690
$$ -21575 -89782 -371278 -493250 -266502 -211388 -110431 -25181 42108 143353 210110 241800
12953B41800J59004k8822j30038k45684N1126R914O9787m1365q6171M7554J08631
$$ 241800 400804 371982 241944 -3740 47386 57300 127087 85722 -449 47105 155736
12942A55736M0250K321J89579p3189Q3940K12071l13800l4717K02718r2502j85695
$$ 155736 195986 198307 387886 314697 398637 610708 296908 262191 464909 372407 186712
12931A86712r836j67466K23761J49736L1892Q9086l16851k08232m5127M7869p9582
$$ 186712 176876 9410 233171 382907 414799 503885 187034 -21198 -66325 -18456 -98038
12920i8038r5254J45344P9850J10063q0748K40135p5242j09937q8456K22836N3919
$$ -98038 -193292 -47948 31902 141965 61217 301352 226110 116173 27717 250553 304472
12909C04472K527k53528j54239J47697J47314J44970R5390L2626j59349j28471
$$ 304472 306999 53471 -100768 46929 194243 339213 434603 467229 307880 179409
12899A79409Q9739m5699m94806P3955K42615P6791R4111j87062k0762R3883j42129
$$ 179409 269148 223449 -271357 -197402 45213 122004 216115 29053 8291 102174 -39955
12888c9955K329J8676N1874j04448J31222L0644L458m9110K18963J25726k05943
$$ -39955 -37626 -18950 32924 -71524 59698 90342 93800 44690 263653 389379 183436
12877A83436p1266M0576J08196K9274o3415j02723J4638J51628o004r6305M7732
$$ 183436 112170 152746 260942 290216 226801 124078 138716 290344 284340 188035 235767
12866B35767J46909P5054j31982k59293j89827p1514k00369j486J88884O5595
$$ 235767 382676 457730 325748 66455 -123372 -194886 -395255 -396741 -207857 -142262
12856a42262P5677n030J0833L6822j79616j03238m219J53967K22782j43559j43534
$$ -142262 -66585 -71615 -60782 -23960 -203576 -306814 -311033 -157066 65716 -77843 -221377
12845b21377J22615K59217J01757j70120K03514K5954J71134k88386k27499j15496
$$ -221377 -98762 160455 262212 92092 295606 321560 492694 204308 -23191 -138687
12835a38687J03483j40714N2514M3859j13141K16878j83596J7140J38881J24878
$$ -138687 -35204 -175918 -123404 -79545 -192686 24192 -159404 -142264 -3383 121495
12825A21495Q5634n1965J9662k64947r8910o1511l79o9728k8226J28281J49002
$$ 121495 207129 155164 174826 -90121 -189031 -250542 -250921 -320649 -348875 -220594 -71592
12814g1592p1516j61608K4493K6598R3260N0761j92196Q6537j091J90392J41555
$$ -71592 -143108 -304716 -280223 -253625 -160365 -109604 -301800 -215263 -216354 -25962 115593
12803A15593r0347r7418L3640K05710R0422j97310n5171K03089M7930N2006r6705
$$ 115593 25246 -72172 -38532 167178 257600 60290 5119 208208 256138 308144 211439
12792B11439j51067K08572P1987k41924p2745k81154j22267L4717K25993L41075
$$ 211439 60372 268944 340931 99007 26262 -254892 -377159 -342442 -116449 224626
12782B24626J51218L1488r7629l25258k30870J42252K72424j01413q4150M1105
$$ 224626 375844 407332 309703 -15555 -246425 -104173 168251 66838 -17312 23793
12772B3793Q9323J81147J56220j92538m3507K05539J18459j13807j33606j12766
$$ 23793 113116 294263 450483 257945 214438 419977 538436 424629 291023 178257
12762A78257j19793P8093N0671R1761J53016j4138l18780j82578K15419J72289
$$ 178257 58464 136557 187228 278989 432005 417867 99087 -83491 131928 304217
12752C04217L31739K56713o6679j24315j39288m01534j08336Q1058K13935j3558
$$ 304217 635956 892669 825990 701675 562387 160853 52517 133575 347510 333952
12742C33952n6895j96403q2945K7770j65127Q0621K30547j43197o1105o2269K1166
$$ 333952 277057 80654 -2291 25479 -139648 -59027 171520 28323 -32782 -95051 -73885
12731g3885K6212O4294K85526J11580k58365p0507j50387o1282O2317J19142K65532
$$ -73885 -47673 16621 302147 413727 155362 84855 -65532 -126814 -64497 54645 320177
12720C20177k26304l63615J57675J82435j56099k8933q5814j00319J59710j88067
$$ 320177 93873 -269742 -112067 70368 -85731 -114664 -200478 -300797 -141087 -329154
12710c29154j95427J71699J43170J82990O7306j07164M9501p3277N6129l1755
$$ -329154 -524581 -352882 -209712 -26722 40584 -66580 -17079 -90356 -34227 -65982
12700f5982L1312M0797j10287k36551j30205J33977P5704N450j11371K42571K24813
$$ -65982 -34670 6127 -104160 -340711 -470916 -336939 -261235 -255785 -367156 -124585 100228
12689A00228L57052k66120j09531P2240k65239j20061R7271j10710J10407j1441
$$ 100228 457280 191160 81629 153869 -111370 -231431 -134160 -244870 -134463 -145904
12679a45904J30935K57818O9746K5154K2318j88924j79466j20958N322Q7714P5908
$$ -145904 -14969 242849 312595 337749 360067 171143 -8323 -129281 -123959 -36245 39663
12668C9663J51832j97157O2212l0167n495K4293J11491j65904O2458j21025k45882
$$ 39663 191495 -5662 56550 26383 20888 45181 156672 -9232 53226 -67799 -313681
12657c13681O1160L45387K15557k856k86838k1742L61586n0388k27237J36734
$$ -313681 -252521 92866 308423 305567 18729 -3013 358573 308185 80948 217682
12647B17682M7267J4247j56510l02277j32472K12718J8167j1699K95658O1898
$$ 217682 264949 279196 122686 -179591 -312063 -99345 -81178 -92877 202781 264679
12637B64679r3968k31902k33514L59072Q5711n3457j50183M4427L4462j29915
$$ 264679 170711 -61191 -294705 64367 150078 96621 -53562 -9135 25327 -104588
12627a04588k30283K75161K63876m5819l1409N1817j55074j58105Q1731j66065
$$ -104588 -334871 -59710 204166 158347 126938 178755 23681 -134424 -52693 -218758
12617b18758j24515l8301k6821O2777O2070l279J18280J51697n5550l4318N7863
$$ -218758 -343273 -381574 -408395 -345618 -283548 -286827 -168547 -16850 -72400 -106718 -48855
12606d8855R8750r6968n066R1770P3716k38096J45513L66473K0561L1532l09026
$$ -48855 49895 -47073 -52139 39631 113347 -124749 20764 387237 407798 439330 130304
12595A30304q4128N6916J12458R0800K2803j3165j72438r6532J83787M6489k27055
$$ 130304 46176 103092 215550 306350 329153 315988 143550 47018 230805 277294 50239
12584E0239N341L2816N6545o6465K9253J08500n8538r3809L7906j81349J38198
$$ 50239 55580 88396 144941 78476 107729 216229 157691 63882 101788 -79561 58637
12573E8637O2719L0202j16297p5270j4568o5572J14353J17645K05971K24786M5444
$$ 58637 121356 151558 35261 -40009 -54577 -120149 -5796 111849 317820 542606 588050
12562E88050l85373j62605K13483o4986j78898o7509Q3936k8264J20123J9950
$$ 588050 202677 40072 253555 188569 9671 -57838 26098 -2166 117957 137907
12552A37907R9099J68184n5792j37580k1653p5836N6520j10612j2999J31614Q941
$$ 137907 237006 405190 349398 211818 190165 114329 170849 60237 47238 178852 187793
12541A87793q2132p7103l0477k38292l0937J59006j17339K21590J23606j9898
$$ 187793 105661 28558 -1919 -240211 -271148 -112142 -229481 -7891 115715 95817
12531I5817O2337N839n6876k91801n9397K23316K39702j15840j01253j19134j1183
$$ 95817 158154 163993 107117 -184684 -244081 -20765 218937 103097 1844 -117290 -128473
12520a28473K98113m369l2273J05127J10525j01991N8078K40361r9158J4339j43216
$$ -128473 169640 165271 132998 238125 348650 246659 304737 545098 445940 460279 317063
12509C17063k58469k3251Q2886j1715q6600L7305j5345R0074m2609j54843J91661
$$ 317063 58594 35343 118229 106514 19914 57219 41874 131948 89339 -65504 126157
12498A26157K44676j80525k25843J3271k22476n7356K07164J08536J53797Q2471
$$ 126157 370833 190308 -35535 -22264 -244740 -302096 -94932 13604 167401 249872
12488B49872j93962k473j39042j63562R4588O7418J95839Q8139J86232J5403k65202
$$ 249872 55910 53437 -85605 -249167 -154579 -87161 108678 196817 383049 398452 133250
12477A33250j27111J56835J01082j51800l79756n5627M10728N0405J73836P0137
$$ 133250 6139 162974 264056 112256 -267500 -323127 87601 138006 311842 381979
12467C81979n7007J24000q3986n9154n2598q6402j63744n8962j23670R9596J25203
$$ 381979 324972 448972 364986 305832 253234 166832 3088 -55874 -179544 -79948 45255
12456D5255K34339r0320j69715O5586K10025J44288j91113j16744J12791J08244
$$ 45255 279594 189274 19559 85145 295170 439458 248345 131601 244392 352636
12446C52636n2830j52318m27762k63077J68786J34505R1667o5237K27437J74722
$$ 352636 299806 147488 -280274 -543351 -374565 -240060 -148393 -213630 13807 188529
12436A88529K11247m918r5567j8514k02993l29649N356J02246K46893m026k53411
$$ 188529 399776 394858 299291 280777 77784 -251865 -246509 -144263 102630 98604 -154807
12425a54807L46469J7224J50332J03181k89420j02182m5908J50432J98833k4150
$$ -154807 191662 208886 359218 462399 172979 70797 24889 175321 374154 350004
12415C50004k66189l9966k23712r1806K93412L52594q254J22913J34555r1964
$$ 350004 83815 43849 -179863 -271669 21743 374337 366083 488996 623551 531587
12405E31587l70314l28189j26584J1513J08857N7071J25513K09235l14933j4042
$$ 531587 161273 -166916 -293500 -281987 -173130 -116059 9454 218689 -96244 -110286
12395a10286J26316K06695J73671J3706k40064k44651J33685L68036R8186K3690
$$ -110286 16030 222725 396396 410102 170038 -74613 59072 427108 525294 548984
12385E48984K9943k36793k17985M4750J8986M2609m71k09616j41371j3303q100
$$ 548984 578927 342134 124149 168899 187885 230494 230023 20407 -120964 -134267 -142367
12374a42367K51292J86636j04097j70917J84241j9658j39782J47802n4463p1280
$$ -142367 108925 295561 191464 20547 204788 185130 45348 193150 138687 67407
12364F7407O0111P2045J33589J31647J56K06286N9674M4479l62185j80427k82656
$$ 67407 127518 199563 333152 464799 464955 671241 730915 775394 413209 232782 -49874
12353d9874k75386J70640l9788k18014J71058K86397J76420q1198R9734q2281
$$ -49874 -325260 -154620 -194408 -412422 -241364 45033 221453 140255 239989 157708
12343A57708J40965k54237j59246q4424m6726K57462J66056N8302O185l25729
$$ 157708 298673 44436 -114810 -199234 -245960 11502 177558 235860 242045 -83684
12333h3684j66762J08699J01941J23096L7536m5138O3724o8518L4694K7939o009
$$ -83684 -250446 -141747 -39806 83290 120826 75688 139412 70894 105588 133527 127518
12322A27518J00750N6726n9839J34520n2359M6500k46599k36573R4545N695q7367
$$ 127518 228268 284994 225155 359675 307316 353816 107217 -129356 -34811 -29116 -116483
12311a16483o3923J25720R4889j75096j37589Q9038J46843M9705n7012J18371
$$ -116483 -180406 -54686 40203 -134893 -272482 -183444 -36601 13104 -43908 74463
12301G4463K21873L5482j24461n0404j58713k14385l4092J63573K51042L86854
$$ 74463 296336 331818 207357 156953 -1760 -216145 -250237 -86664 164378 551232
12291E51232L57461m9153k97096l1019n5894j61938O4823J15607M1305L20955
$$ 551232 908693 859540 562444 531425 475531 313593 378416 494023 535328 856283
12281H56283k17073j65787r6378l17805M0821R1721m9816J56445p3381P3356J09649
$$ 856283 639210 473423 377045 59240 100061 191782 141966 298411 225030 298386 408035
12270D08035j53824J7775n2272Q0799k06909j86353K6384Q3856j91268J09136
$$ 408035 254211 271986 219714 300513 93604 -92749 -66365 17491 -173777 -64641
12260f4641J33539K85236J05856j91716m3941J65628j00289j51579Q6152N9993
$$ -64641 68898 354134 459990 268274 224333 389961 289672 138093 224245 284238
12250B84238L1348K9314J56430O0697n7398l6841j61375j47237K50042J35159
$$ 284238 315586 344900 501330 562027 504629 467788 306413 159176 409218 544377
12240E44377r5703l61229j45448K80455K32750l3919j12172m6684O2586J8884
$$ 544377 448674 87445 -58003 222452 455202 421283 309111 262427 325013 343897
12230C43897n5189m5347k27562p6939J73074J7391J43101K46110J71755j08016
$$ 343897 288708 243361 15799 -61140 111934 129325 272426 518536 690291 582275
12220E82275M4808j5133o9062J75334N9902j60835k35498l6165L49855J95401
$$ 582275 627083 611950 542888 718222 778124 617289 381791 345626 695481 890882
12210H90882M3984J00503J92622p7623o3789K05911L8280Q083L51005K99170J46946
$$ 890882 934866 1035369 1227991 1150368 1086579 1292490 1330770 1338853 1689858 1989028 2135974
12199B135974N4361L51163Q30984Q09639N59518O71517J070520J252865J066707
$$ 2135974 2190335 2541498 3372482 4182121 4741639 5413156 6483676 7736541 8803248
12190H803248J107467R44524K63869m45423j058435j310888j224345j197088q34415
$$ 8803248 9910715 10855239 11119108 10673685 9615250 8304362 7080017 5882929 5048514
12181E048514p59730m95386k38191k89825n0513j0704m74929l28689Q6614J66923
$$ 5048514 4288784 3793398 3555207 3265382 3214869 3204165 2729236 2400547 2487161 2654084
12171B654084q3236m22797j39367j63004k2138J04136J15683j11889k97480k09108
$$ 2654084 2570848 2148051 2008684 1845680 1823542 1927678 2043361 1931472 1633992 1424884
12161A424884o0587J38287o6876j26032o3457Q3211L4523J4162k865k30021j52233
$$ 1424884 1364297 1502584 1435708 1309676 1246219 1329430 1363953 1378115 1375250 1145229 992996
12150I92996k17407k02160Q095M4495N1989M6309Q7825j9677j73233J66394L42291
$$ 992996 775589 573429 581524 626019 678008 724317 812142 792465 619232 785626 1127917
12139A127917j85292k77671Q3649J08635J74796m7075n1625Q218k25692r5176
$$ 1127917 942625 664954 748603 857238 1032034 984959 933334 941552 715860 620684
12129F20684K20262K48993k8396K3796M04202j87129j29393K8182j52108M1420
$$ 620684 840946 1089939 1061543 1085339 1489541 1302412 1173019 1201201 1049093 1090513
12119A090513K11745j37257p2057K5695M0557K56740m8517O7940K48964J17851
$$ 1090513 1302258 1165001 1092944 1118639 1159196 1415936 1367419 1435359 1684323 1802174
12109A802174j65215j58310J26516o9556L7621j61873p20j65212j96927o7467
$$ 1802174 1636959 1478649 1605165 1535609 1573230 1411357 1410637 1245425 1048498 981031
12099I81031J70282N1634J03360J78641j70278k33609j61426J25834K32608P5040
$$ 981031 1151313 1202947 1306307 1484948 1314670 1081061 919635 1045469 1278077 1353117
12089A353117P0005m1560R5927Q6057P9870K51662j97666j09003J14908K33520
$$ 1353117 1423122 1381562 1477489 1563546 1643416 1895078 1697412 1588409 1703317 1936837
12079A936837P3098o602q9534j21533o352J56105K94878j89759k15369j4061k4369
$$ 1936837 2009935 2003333 1913799 1792266 1785914 1942019 2236897 2047138 1831769 1817708 1793339
12068A793339L8975o9648P8941n1325j40487K37584o110l61354k08575K37978
$$ 1793339 1832314 1762666 1841607 1790282 1649795 1887379 1881269 1519915 1311340 1549318
12058A549318N8776M8727K82216j44861k40479l34136k84783P3953K6252J59048
$$ 1549318 1608094 1656821 1939037 1794176 1553697 1219561 934778 1008731 1034983 1194031
12048A194031L80312J18581n6393l2768n5839Q6734n250j40997J03131j71350
$$ 1194031 1574343 1692924 1636531 1603763 1547924 1634658 1629408 1488411 1591542 1420192
12038A420192k0947J71977K00712J20066M0749j18277k49867l11421r4652J34968
$$ 1420192 1399245 1571222 1771934 1892000 1932749 1814472 1564605 1253184 1158532 1293500
12028A293500J90250O8393j37861j66963l8809J34734M7760n5019M0460O444n0415
$$ 1293500 1483750 1552143 1414282 1247319 1208510 1343244 1391004 1335985 1376445 1382889 1332474
12017A332474l5457J90945K94053J89618K04148k75449k27627j63266K52533j05311
$$ 1332474 1297017 1487962 1782015 1971633 2175781 1900332 1672705 1509439 1761972 1656661
12007A656661k92173k61475N0520l4203j49738P619j73889p0426M3143L3817N4566
$$ 1656661 1364488 1103013 1153533 1119330 969592 977211 803322 732896 776039 809856 864422
11996H64422o8248l60649n4843m4724p1531j2478J25943n5514J23391J21517J00416
$$ 864422 796174 435525 380682 335958 264427 251949 377892 322378 445769 567286 667702
11985F67702O3828j36386p7631n1103L34588J64277j51199j5933O3606p8280O3143
$$ 667702 731530 595144 517513 466410 800998 965275 814076 798143 861749 783469 846612
11974H46612j47276j33983J0555k1822j10906l3716K20409J11472N847j5847N405
$$ 846612 699336 565353 575908 554086 443180 409464 629873 741345 747192 731345 736750
11963G36750l15170j76950J54540k58189R5044L28195J10574O7923M9789L9606
$$ 736750 421580 244630 399170 140981 236025 564220 674794 742717 792506 832112
11953H32112P1265J49231k4930o7219j8299n8483n8886l86092J26745k80955j32656
$$ 832112 903377 1052608 1027678 960459 942160 883677 824791 438699 565444 284489 151833
11942A51833L15927P7660M7172K96607j24127k21807p5370j66356M4257K31516
$$ 151833 467760 545420 592592 889199 765072 543265 467895 301539 345796 577312
11932E77312p0331j07955j65391O2371K38359j594J02530o6969R9541K15717j44523
$$ 577312 506981 399026 233635 296006 534365 532771 635301 568332 667873 883590 739067
11921G39067j41930k4434k8132J75480j3131j54575J54358Q5380J10742r8390
$$ 739067 597137 572703 544571 720051 706920 552345 706703 792083 902825 804435
11911H04435N8132r4752j70055j95454R7947K02498J15618n3959P0826m819o5548
$$ 804435 862567 767815 597760 402306 500253 702751 818369 764410 835236 830417 764869
11900G64869N4515K65023J40732k10278J31294K26551j23148j91467o8584P0635
$$ 764869 819384 1084407 1225139 1014861 1146155 1372706 1249558 1058091 989507 1060142
11890A060142O6222j08223J4561J53562R7919k2703P7N2102J12643k42096J1760
$$ 1060142 1126364 1018141 1032702 1186264 1284183 1261480 1261557 1313659 1426302 1184206 1195966
11879A195966N0308L5501r7080j0310k54711l10954k9211M9986R3650J19113L0364
$$ 1195966 1246274 1281775 1184695 1174385 919674 608720 579509 629495 723145 842258 872622
11868H72622p9112J21862K70037J13407j26641n6223k8999O9856Q8479k32481
$$ 872622 793510 915372 1185409 1298816 1172175 1115952 1086953 1156809 1245288 1012807
11858A012807k8013J33323j25970p0074p2723j8518K25002O0293m720k9272M1354
$$ 1012807 984794 1118117 992147 922073 849350 830832 1055834 1116127 1111407 1082135 1123489
11847A123489o2430M1579o5015k55938J6520K02474M2831J55831j30198j24229
$$ 1123489 1061059 1102638 1037623 781685 798205 1000679 1043510 1199341 1069143 944914
11837I44914l3326R8701J6002J25071Q2129r5301l084J53259Q9471m3016Q2944
$$ 944914 911588 1010289 1026291 1151362 1233491 1138190 1135106 1288365 1377836 1334820 1417764
11826A417764o2697J46637j85887r8498L5656J7616J45597J18795r9557n6433
$$ 1417764 1355067 1501704 1315817 1217319 1252975 1270591 1416188 1534983 1435426 1378993
11816A378993j90490J21246N2296J73377J44579j6414p0565J02218J54882n5880
$$ 1378993 1188503 1309749 1362045 1535422 1680001 1663587 1593022 1695240 1850122 1794242
11806A794242j14279K20346J0174J04211p7474k6165P8767m8484J29949J44950
$$ 1794242 1679963 1900309 1910483 2014694 1937220 1911055 1989822 1941338 2071287 2216237
11796B216237p6931J12125k509j11571o3530N7550J76687Q2898j54530j67300
$$ 2216237 2139306 2251431 2248922 2137351 2073821 2131371 2308058 2390956 2236426 2069126
11786B069126q9014N9711K21330m5382j60537p7264M43032J62730q4887j23980
$$ 2069126 1980112 2039823 2261153 2215771 2055234 1977970 2421002 2583732 2498845 2374865
11776B374865K49083J54662J43463J36661p5530r5095R9599k8648j66577p3932
$$ 2374865 2623948 2778610 2922073 3058734 2983204 2888109 2987708 2959060 2792483 2718551
11766B718551j5215J80974L4749R8665J30975J28887K36519j9070j61660K23161
$$ 2718551 2703336 2884310 2919059 3017724 3148699 3277586 3514105 3495035 3333375 3556536
11756C556536L49377j64066j37652m9893k6475m6910K93387L34224p1520k06085
$$ 3556536 3905913 3741847 3604195 3554302 3527827 3480917 3774304 4108528 4037008 3830923
11746C830923K21785J84137L58032K48459M5114q1343l0785L1608q9628K62002
$$ 3830923 4052708 4236845 4594877 4843336 4888450 4807107 4776322 4807930 4718302 4980304
11736D980304K88554N31667K94080J62543K02560M23662L47239J15780M48656
$$ 4980304 5268858 5800525 6094605 6257148 6459708 6883370 7230609 7346389 7795045
11727G795045N76767J14522M29941O22210N45402M63667Q62216J060512J345689
$$ 7795045 8371812 8486334 8916275 9538485 10083887 10547554 11409770 12470282 13815971
11718A3815971J263838J537656J838203K148853K259362K399679J997516J179791
$$ 13815971 15079809 16617465 18455668 20604521 22863883 25263562 27261078 28440869
11710B8440869O76867J97177l53809p8232K58115P54252J113777J657358K553627
$$ 28440869 29117736 29314913 28961104 28882872 29140987 29895239 31009016 32666374 35220001
11701C5220001L572166M336687M534070M762982M521526L747973K524352P02140
$$ 35220001 38792167 43128854 47662924 52425906 56947432 60695405 63219757 63921897
11693F3921897r26729j717286j883397j331001l77136P14173J672524K805801
$$ 63921897 62995168 61277882 59394485 58063484 57686348 58400521 60073045 62878846
11685F2878846L460748L728274L255248K298223Q11791m96201j340372j687672
$$ 62878846 66339594 70067868 73323116 75621339 76433130 75936929 74596557 72908885
11677G2908885j731307r73902L16397J526932K870571M097305N351006P134446
$$ 72908885 71177578 70203676 70520073 72047005 74917576 79014881 84365887 91500333
11669I1500333Q204046Q611345Q590001Q154302P526885O944726O847369P540053
$$ 91500333 99704379 108315724 116905725 125060027 132586912 139531638 146379007 153919060
11661A53919060R664222J2606292J5640707J7955538J9061081J9242149J9176452
$$ 153919060 163583282 176189574 191830281 209785819 228846900 248089049 267265501
11654B67265501J8668356J9290941K0140565K0895886J9894420J6426329J1502820
$$ 267265501 285933857 305224798 325365363 346261249 366155669 382581998 394084818
11647C94084818N101640j268098o124963r336486r476461o817288j631206N365246
$$ 394084818 399186458 397918360 391793397 382456911 372980450 366163162 364531956 369897202
11639C69897202J2621622J8870238K2429013K2444683J8338764J0598859R21630
$$ 369897202 382518824 401389062 423818075 446262758 464601522 475200381 476122011
11632D76122011q753259j7272161k3678559k7452906k7164089k3862170k0235655
$$ 476122011 467368752 450096591 426418032 398965126 371801037 347938867 327703212
11625C27703212j7125594j5205550j3766476j2905485j1830270j0290522q737768
$$ 327703212 310577618 295372068 281605592 268700107 256869837 246579315 237841547
11618B37841547p760270p696171q196160r293881j0480170j1012781j0408535
$$ 237841547 230081277 222385106 214188946 204895065 194414895 183402114 172993579
11611A72993579r535915q424464p366616n876740m416150l460672k524454j362546
$$ 172993579 163457664 155033200 147666584 141789844 137373694 133913022 131388568 130026022
11603A30026022r17938o05274n14415r31145j770521k700935l353793l827023
$$ 130026022 129108084 128502810 127988395 127057250 125286729 122585794 119232001 115404978
11595A15404978l410047k612612j965282r21315o2533N83486Q93927N81851j23593
$$ 115404978 111994931 109382319 107417037 106495722 106433189 107016675 107910602 108492453 108368860
11586A08368860j885813l699065n344325o186062o226881n573072m642102l853121
$$ 108368860 106483047 102783982 97439657 91253595 85026714 79453642 74811540 70958419
11578G0958419l164880k000153j387144r83660m63568j58869j61783j20557q61176
$$ 70958419 67793539 65793386 64406242 63422582 62959014 62800145 62638362 62517805 61656629
11569F1656629k033769k676269l253393l517929l185402k595533k205607k075988
$$ 61656629 59622860 56946591 53693198 50175269 46989867 44394334 42188727 40112739
11561D0112739k191028j885556j269959j094190j086957j204138j257171p96307
$$ 40112739 37921711 36036155 34766196 33672006 32585049 31380911 30123740 29327433
11553B9327433n32057r54463j059906j112878p10972q64086r58396o28099o04565
$$ 29327433 28795376 27840913 26781007 25668129 24957157 24093071 23134675 22506576 21902011
11544B1902011o83283n33397o57329m77806n92116k94128n16786n62741m74853
$$ 21902011 21218728 20685331 20028002 19550196 18958080 18663952 18147166 17584425 17109572
11535A7109572p96169n88974n10853m25125j72294k63424m24689k59287l83409
$$ 17109572 16313403 15724429 15213576 14788451 14616157 14352733 13928044 13668757 13285348
11526A3285348k30780n39460k79072k76185j54719j71830l89449m22673k46373
$$ 13285348 13054568 12515108 12236036 11959851 11805132 11633302 11243853 10821180 10574807
11517A0574807l27639r7680k82969j53985k14150k21158l30691j08286o809l63768
$$ 10574807 10247168 10149488 9866519 9712534 9498384 9277226 8946535 8838249 8831440 8467672
11507H467672l16394n5331j95163J30122j97189m73730J00417J23291n0013m18862
$$ 8467672 8151278 8095947 7900784 8030906 7833717 7359987 7460404 7583695 7533682 7114820
11497G114820l06097n682j3892k86902k69061j86812j01991j99822l09447l88578
$$ 7114820 6808723 6803041 6789149 6502247 6233186 6046374 5944383 5744561 5435114 5046536
11487E046536k03736j9363R9517K6959k38239k2904r1913m36375k99267j67744
$$ 5046536 4842800 4823437 4922954 4949913 4711674 4688770 4596857 4160482 3861215 3693471
11477C693471l18669j01942J09294J34050j99574j79476R4651o8442p6880O6406
$$ 3693471 3374802 3272860 3382154 3516204 3316630 3137154 3231805 3163363 3086483 3152889
11467C152889n0102k94574J892J3552q0541k17405m09009K70108J22384k43081
$$ 3152889 3102787 2808213 2810105 2823657 2743116 2525711 2116702 2386810 2509194 2266113
11457B266113k13625K74017L20540j6484k14186k14756k71972N2699K59471J07007
$$ 2266113 2052488 2326505 2647045 2630561 2416375 2201619 1929647 1982346 2241817 2348824
11447B348824Q0758q4178j04564l13185n6624K85102j74414m43915J49544L07798
$$ 2348824 2429582 2345404 2240840 1927655 1871031 2156133 1981719 1537804 1687348 1995146
11437A995146M9060Q7568j45239j36051j5455n0616M0449l2460p6925K9656m4604
$$ 1995146 2044206 2131774 1986535 1850484 1835029 1784413 1824862 1792402 1715477 1745133 1700529
11426A700529J32843M7727j72298j69387k0167j62751j17982l9845J2012n6244
$$ 1700529 1833372 1881099 1708801 1539414 1519247 1356496 1238514 1198669 1210681 1154437
11416A154437O3126Q9180K11545k6604j54237J2865j21113J73997j00743j88082
$$ 1154437 1217563 1306743 1518288 1491684 1337447 1350312 1229199 1403196 1302453 1114371
11406A114371M7392p402N3496J46342q9875k84531j43244k0905O0089O514l821
$$ 1114371 1161763 1154361 1207857 1354199 1264324 979793 836549 815644 875733 882247 878426
11395H78426R7223J8562k60494p4404K04782k7771K71726L51235O4739j12641
$$ 878426 975649 994211 733717 659313 864095 836324 1108050 1459285 1524024 1411383
11385A411383j40955j31292j16506j93099q2995J49897p7927N6897J63915j03533
$$ 1411383 1270428 1139136 1022630 829531 746536 896433 818506 875403 1039318 935785
11375I35785n3488J53549K29113p3891K8517j44925j69705j44292j62290L7537
$$ 935785 882297 1035846 1264959 1191068 1219585 1074660 904955 760663 598373 635910
11365F35910P1719j0236k49126r5906J47895R4782N6934j71795k5513o6778J50222
$$ 635910 707629 697393 448267 352361 500256 595038 651972 480177 454664 387886 538108
11354E38108K08202J27748j99417j56691l5674Q6051J09563p9406k83725j563
$$ 538108 746310 874058 674641 517950 482276 568327 677890 598484 314759 313196
11344C13196j07027j31962K9063J42579J48965J8144k6135j7881K6419J11841
$$ 313196 206169 74207 103270 245849 394814 412958 386823 368942 395361 507202
11334E07202n1785j53252o5739J87899k1925p717L71921J78083m01178j72148
$$ 507202 455417 302165 236426 424325 402400 394683 766604 944687 543509 371361
11324C71361k93494o5988K57402J26546j196j35520j23913K17279J00505k23236
$$ 371361 77867 11879 269281 395827 394631 259111 135198 352477 452982 229746
11314B29746p3312P4561j67900j65264r8484J51590K80776K79902K0439n1167
$$ 229746 156434 230995 63095 -102169 -200653 -49063 231713 511615 532054 480887
11304D80887j10321P5569j14015j38608j69863j6558L04675J87195K1598p3477
$$ 480887 370566 446135 332120 193512 23649 7091 311766 498961 520559 447082
11294D47082l90133k63824K5414J54000Q6833J07288J08670K40305n4455L2206
$$ 447082 56949 -206875 -181461 -27461 59372 166660 275330 515635 461180 493386
11284D93386R630p1620P4676k0785j77857j69852j04730j5526J99620L46498K14081
$$ 493386 503016 431396 506072 485287 307430 137578 32848 17322 216942 563440 777521
11273G77521j48128j61588j73287j51759K97803J31617p2186J68138J77518J04262
$$ 777521 629393 467805 294518 142759 440562 572179 499993 668131 845649 949911
11263I49911R9175K25635k4558k54846q1923J18885k57900j73608k14665j51479
$$ 949911 1049086 1274721 1250163 995317 913394 1032279 774379 600771 386106 234627
11253B34627J33780K27693L65207J46838J28344R6884k81306j27312q9953J29205
$$ 234627 368407 596100 961307 1108145 1236489 1333373 1052067 924755 834802 964007
11243I64007L19558N2035n7058j08517n2663l2301p1122p5239K87773L07772P8018
$$ 964007 1283565 1335600 1278542 1170025 1117362 1085061 1013939 938700 1226473 1534245 1612263
11232A612263j34392k23566q3148O4063j08778j66903R7109K07981K61496k35698
$$ 1612263 1477871 1254305 1171157 1235220 1126442 959539 1056648 1264629 1526125 1290427
11222A290427n4052J82022J60995p2827l22475j68600m9016M26329J99251K2384
$$ 1290427 1236375 1418397 1579392 1506565 1184090 1015490 966474 1392803 1592054 1614438
11212A614438J16115q0635l97277l9252K06431m0956J8432k9795J18712r3124
$$ 1614438 1730553 1649918 1252641 1213389 1419820 1378864 1397296 1367501 1486213 1393089
11202A393089J3070O181R393r1586p0746O392J80834N1212Q5029m7863K1268r2534
$$ 1393089 1406159 1412340 1421733 1330147 1259401 1265793 1446627 1497839 1582868 1535005 1556273 1463739
11190A463739M7028m9182k52882j43175N472J44991p2953j49592j24056K01900
$$ 1463739 1510767 1461585 1208703 1065528 1071000 1215991 1143038 993446 869390 1071290
11180A071290P2655k0135J53798Q2904O8290q6538q1332k43015o8944j25676J22878
$$ 1071290 1143945 1123810 1277608 1360512 1428802 1342264 1260932 1017917 948973 823297 946175
11169I46175m2421l9792J29809J5751k72037n4474l2234j44000K5247J5084q6889
$$ 946175 903754 863962 993771 1009522 737485 683011 650777 506777 532024 547108 460219
11158D60219J28290J40325L16498J08406l1705r4387j98099J57006J63426L477
$$ 460219 588509 728834 1045332 1153738 1122033 1027646 829547 986553 1149979 1153456
11148A153456K4803m6432k05754l34628j52132j34633O6059R3351j8290j289O6678
$$ 1153456 1178259 1131827 926073 591445 439313 304680 370739 464090 445800 444511 511189
11137E11189j9706J50745J50371J35425j12426j68629P2331j66740j49082r4750
$$ 511189 491483 642228 792599 928024 815598 646969 719300 552560 403478 308728
11127C08728j74126R2791K8015K43099L2800o01082j53486J85923J26780J65J1123
$$ 308728 134602 227393 255408 498507 531307 -69775 -223261 -37338 89442 89607 100730
11116A00730L60453K2144j93176k259L337Q3210J41769K11133J30649j38370j81596
$$ 100730 461183 483327 290151 287892 291229 374439 516208 727341 857990 719620 538024
11105E38024l31881k28658o8608Q8502O0251j25259k3001J03175M2200l5950R1800
$$ 538024 206143 -22515 -91123 -2621 57630 -67629 -90630 12545 54745 18795 110595
11094A10595O5141j34736L5860J06957M6538L6594m2619r0006J24160l5666l0757
$$ 110595 175736 41000 76860 183817 230355 266949 224330 134324 258484 222818 192061
11083A92061J4657J13989j2007o7243J26173j13520p0016m4784k17905J37623
$$ 192061 206718 320707 308700 241457 367630 254110 184094 139310 -78595 59028
11073E9028K78143K16360j82331K7840k02875j83580L3980J31364o3846l7916
$$ 59028 337171 553531 371200 399040 196165 12585 46565 177929 114083 76167
11063G6167J30614J08148M7027j18482p1057j01345M6135k08757o3330l151R7751
$$ 76167 206781 314929 361956 243474 172417 71072 117207 -91550 -154880 -158031 -60280
11052f0280M03696J60214j95876p9268q4842O4944J5769o3233L2828J32054k18922
$$ -60280 343416 503630 307754 228486 143644 208588 224357 161124 193952 326006 107084
11041A07084m03309p2896L40541K93744R7101k22406k1575P5057k0208j22831
$$ 107084 -296225 -369121 -28580 265164 362265 139859 118284 193341 173133 50302
11031E0302j0176k7351j06994J00389L5867j73741r2819J27124R3774l2119m8956
$$ 50302 40126 12775 -94219 6170 42037 -131704 -224523 -97399 -3625 -35744 -84700
11020h4700J14426J84362l8489M540q4048J80550R5827q748n0716j68785p1679
$$ -84700 29726 214088 175599 180139 96091 276641 372468 363720 313004 144219 72540
11009G2540k43773O3290L7029J22113j3177j02021k05376k74868K81156L26551
$$ 72540 -171233 -107943 -70914 51199 38022 -63999 -269375 -544243 -263087 63464
10999F3464j74787J19831M1739j09695j53351M2680L48751j52633o9508j82971
$$ 63464 -111323 8508 50247 -59448 -212799 -170119 178632 25999 -43509 -226480
10989b26480p9482J19989K69172k22489j14167O1530O4103p2837P7796K43198
$$ -226480 -305962 -185973 83199 -139290 -253457 -191927 -127824 -200661 -122865 120333
10979A20333l0392J28397N0318l1811Q4481k11792l4754P4916J9963k03479k35124
$$ 120333 89941 218338 268656 236845 321326 109534 74780 149696 169659 -33820 -268944
10968b68944j61859K87554K75757Q8937j73271k30112J16528J16577j17628R4784
$$ -268944 -430803 -143249 132508 221445 48174 -181938 -65410 51167 -66461 28323
10958B8323j9417j14855L5986j7135J1452K0401k8650L06217M3441k9959r9182
$$ 28323 8906 -105949 -69963 -87098 -75646 -55245 -83895 222322 265763 235804 136622
10947A36622p8199J08109j3204j21341l8791J63143K17582n5250k73662j94783
$$ 136622 58423 166532 153328 31987 -6804 156339 373921 318671 45009 -149774
10937a49774j1676K20229J28795j01512O9961k1396P6879J9293k17824p5472k03549
$$ -149774 -161450 58779 187574 86062 156023 134627 211506 230799 12975 -62497 -266046
10926b66046L5378Q0671j27463l650P2347K37969K42986k30146Q9258r8913l9009
$$ -266046 -230668 -149997 -277460 -281110 -208763 29206 272192 42046 131304 32391 -6618
10915f618j04770J67443N1458n0677J4961j8681J0321J92871j89488N3773k18149
$$ -6618 -111388 56055 107513 56836 71797 53116 63437 256308 66820 120593 -97556
10904i7556K9283L09693o0485M3938k8826j5087l5705p6940j51632q6599P0447
$$ -97556 -68273 241420 180935 224873 196047 180960 145255 68315 -83317 -169916 -99469
10893i9469p1821N2473l6693l215R6658m3004j63857O8328P923j24114K00088
$$ -99469 -171290 -118817 -155510 -158725 -62067 -105071 -268928 -200600 -192677 -316791 -116703
10882a16703j22692l9862Q5391M8703R2480r5479m5740J85604j00666n9511L25815
$$ -116703 -239395 -279257 -193866 -145163 -52683 -148162 -193902 -8298 -108964 -168475 157340
10871A57340r3638k05537J72531J73543l19376l0851J82411l288l6650o4128j13830
$$ 157340 63702 -141835 30696 204239 -115137 -145988 36423 33135 -3515 -67643 -181473
10860a81473K67507J07857j78111n0694l46657l8591K54779J38693J77011L1615
$$ -181473 86034 193891 15780 -34914 -381571 -420162 -165383 -26690 150321 181936
10850A81936o8349q3656q2686J77676p8726l5441m60198k1892J87929J52314r7237
$$ 181936 113587 29931 -52755 124921 46195 10754 -449444 -471336 -283407 -131093 -228330
10839b28330J19168J15165Q2706R8408k71340l02388O475J37022l2782J65100
$$ -228330 -109162 6003 88709 187117 -84223 -386611 -380136 -243114 -275896 -110796
10829a10796J8744J71368Q4748j51794M2936o0012j82377K28024m6593q471J3320
$$ -110796 -92052 79316 164064 12270 55206 -4806 -187183 40841 -5752 -14223 -903
10818i03j23210j62992m4279J82331J9270R829j22942j61219j15280J27667J32622
$$ -903 -124113 -287105 -331384 -149053 -129783 -119954 -242896 -404115 -519395 -391728 -259106
10807b59106M25630P3201j69393j97623K6286J89393m9270m8869R7418j55014
$$ -259106 166524 239725 70332 -127291 -101005 88388 39118 -9751 87667 -67347
10797f7347o1580j47439j28491j06228m2669K26890L36134J14792K10319J33954
$$ -67347 -128927 -276366 -404857 -511085 -553754 -326864 9270 124062 334381 468335
10787D68335k75911k54950k2272N1645q3500R3409J5673K0986N8299l5696j23110
$$ 468335 192424 -62526 -84798 -33153 -116653 -23244 -7571 13415 71714 36018 -87092
10776h7092J32537J75072m7208l42659j69225K0085J29221K56067q9084k43866
$$ -87092 45445 220517 173309 -169350 -338575 -318490 -189269 66798 -22286 -266152
10766b66152J28567K94857K16839o7341l66693l02085M3044J23393Q2816p7783
$$ -266152 -137585 157272 374111 306770 -59923 -362008 -318964 -195571 -112755 -190538
10756a90538j35623o6400m1000L22071P290L0908J3695m5104r476O4770K1526
$$ -190538 -326161 -392561 -433561 -111490 -104200 -73292 -59597 -104701 -114177 -49407 -27881
10745b7881Q6854j20290R2975j97461j94538J21811J15088P036K32044K01677
$$ -27881 58973 -61317 31658 -165803 -360341 -238530 -123442 -116406 115638 317315
10735C17315j70531R6641k65848K1613J25789J47601j62562j58594k70053r565
$$ 317315 146784 243425 -22423 -810 124979 272580 110018 -48576 -318629 -328194
10725c28194J48092J16599K90125m5990J44114j89129o9619O8227j37031q1188
$$ -328194 -180102 -63503 226622 180632 324746 135617 65998 134225 -2806 -83994
10715h3994k9050j72876O2793R4780J09551j4993j25352q5055o5289j20428q255
$$ -83994 -113044 -285920 -223127 -128347 -18796 -33789 -159141 -244196 -309485 -429913 -438168
10704d38168K09977P1819O4226M041j79716M7691J23358K3525p2231r865P5210
$$ -438168 -228191 -156372 -92146 -88105 -267821 -220130 -96772 -73247 -145478 -155343 -80133
10693h0133J86959J9861J4599j34605m9959J1889K48523k28101r2825r5712L1889
$$ -80133 106826 126687 141286 6681 -43278 -31389 217134 -10967 -103792 -199504 -167615
10682a67615j59943k05616K1075J65733N1977l1674Q6991R4215n1349J05178q5134
$$ -167615 -327558 -533174 -512099 -346366 -294389 -326063 -239072 -144857 -196206 -91028 -176162
10671a76162k8470R5538J21079j44003J73170L79154N2175j49384j51269K4243
$$ -176162 -204632 -109094 11985 -132018 41152 420306 472481 323097 171828 196071
10661A96071j4625J74550p7692n8522j31038k3696l2182J01576k09992k05329
$$ 196071 181446 355996 278304 219782 88744 65048 32866 134442 -75550 -280879
10651b80879j58426K07981o8336J36099K8849R8023j6280M7104r590j01143M8392
$$ -280879 -439305 -231324 -299660 -163561 -134712 -36689 -52969 -5865 -15455 -116598 -68206
10640f8206j25314k8584J03102Q6283P608k3808O206m0363K26653J18341k2147
$$ -68206 -193520 -222104 -119002 -32719 -25111 -48919 -42713 -83076 143577 261918 239771
10629B39771j37012K3350J60556J82658l6863l6663j10691q5779r3049J91044
$$ 239771 102759 126109 286665 469323 432460 395797 285106 199327 106278 297322
10619B97322K39105k80442l60197n4848J34514r6947N931K03296l7413k41120
$$ 297322 536427 255985 -104212 -159060 -24546 -121493 -115562 87734 50321 -190799
10609a90799q7455K81164J68717J69314l1247K1041K22109j88693m14992l1553
$$ -190799 -278254 2910 171627 340941 309694 330735 552844 364151 -50841 -82394
10599h2394J43427J73625p7852j94848J23215L34373J31176k63268l21511j77088
$$ -82394 61033 234658 156806 -38042 85173 419546 550722 287454 -34057 -211145
10589b11145J65032K34324Q1853r780K01317j01808k79366j89210P6858J59501
$$ -211145 -46113 188211 270064 260284 461601 359793 80427 -108783 -31925 127576
10579A27576K22938J21718j41008k61682r0799J15131J73985k4386J6758l7363
$$ 127576 350514 472232 331224 69542 -21257 93874 267859 243473 260231 222868
10569B22868j20802j37062k53985P3205J47208J7296p4452K3068J1387J2933j16568
$$ 222868 102066 -34996 -288981 -215776 -68568 -51272 -125724 -102656 -91269 -78336 -194904
10558a94904k8701M8029j39557O3495J63926J3138J2242Q8984J25061q1863j95007
$$ -194904 -223605 -175576 -315133 -251638 -87712 -74574 -62332 26652 151713 69850 -125157
10547a25157K95205R3292r8704j51623O8375J30165P040j9747k73315k08355J19233
$$ -125157 170048 263340 164636 13013 81388 211553 218593 198846 -74469 -282824 -163591
10536a63591N3439j02351n2097L1203r2747r4118M6832j77493J69711Q8629Q678
$$ -163591 -110152 -212503 -264600 -233397 -326144 -420262 -373430 -550923 -381212 -292583 -283905
10525b83905L91144K35614j28123k21406k68880P1704J91398J07779N9164r7121
$$ -283905 107239 342853 214730 -6676 -275556 -203852 -12454 95325 154489 57368
10515E7368R3930j90801j54293n7443J29854j61163j49214L9045O5413J32350
$$ 57368 151298 -39503 -193796 -251239 -121385 -282548 -431762 -392717 -327304 -194954
10505a94954J0313j0758J98245j6048n0960j69756J15679K51296j93228k80802
$$ -194954 -184641 -195399 2846 -13202 -64162 -233918 -118239 133057 -60171 -340973
10495c40973O7508k3403m2615J76871J38664K79216K00192j67762j73668l3349
$$ -340973 -273465 -296868 -339483 -162612 -23948 255268 455460 287698 114030 80681
10485H0681q1229j00219J08438J58689K2648K1210p648j14187j786J22373j36819
$$ 80681 -548 -100767 7671 166360 189008 210218 202570 88383 86597 208970 72151
10474G2151j62662J1721j7052p4238J73282J67715J34828K66921N6534l8544k32603
$$ 72151 -90511 -78790 -95842 -170080 3202 170917 305745 572666 629200 590656 358053
10463C58053k53609r9939r551L7211j7615o0356P2906J7911n9152J13549l8658
$$ 358053 104444 4505 -5046 32165 14550 -45806 27100 45011 -14141 99408 60750
10452F0750l84324L3489K41940J59027j30848N1456O8242n2740K65124J40709
$$ 60750 -323574 -290085 -48145 110882 -19966 31490 99732 46992 312116 452825
10442D52825j23699r4403l9282j05963p9351J7398J67585J31370K17427J6673
$$ 452825 329126 234723 195441 89478 10127 27525 195110 326480 543907 560580
10432E60580j70900k25582m5970j27743J16510k0978k4526Q7726R2937k07453
$$ 560580 389680 164098 118128 -9615 106895 85917 61391 149117 242054 34601
10422C4601l5003p3309K32278J39353k16820m16564J9140L09180K48282m5390
$$ 34601 -402 -73711 158567 297920 81100 -335464 -316324 -7144 241138 195748
10412A95748K6550j53914j34362K8751r6209Q8297n3060j88487J01043Q6071K00735
$$ 195748 222298 68384 -65978 -37227 -133436 -45139 -98199 -286686 -185643 -99572 101163
10401A01163P0179p5441N4716n6119m2389r6265j63347m7954j60318k00888N7767
$$ 101163 171342 95901 150617 94498 52109 -44156 -207503 -255457 -415775 -616663 -558896
10390e58896J57596J23569J60801j52733J28133k4479k38683n0267J37744P5324
$$ -558896 -401300 -277731 -116930 -269663 -141530 -166009 -404692 -454959 -317215 -241891
10380b41891j76361j13948L42958K29281K91k37607J06404K17568J33641K33k85953
$$ -241891 -418252 -532200 -189242 40039 40330 -197277 -90873 126695 260336 260569 -25384
10369b5384j75598n8621J29797K13821Q2423L6636k7565j0961J31851k93760k43366
$$ -25384 -200982 -259603 -129806 84015 166438 203074 175509 164548 296399 2639 -240727
10358b40727k06J27744M9101K1850N7035j87122j09991L00034J15058J93400J93911
$$ -240727 -240933 -113189 -64088 -42238 14797 -172325 -282316 17718 132776 326176 520087
10347E20087N43660L50160K29821P05453M78388O70566P48732N09671L88949r4081
$$ 520087 1063747 1413907 1643728 2349181 2827569 3498135 4246867 4756538 5145487 5051406
10337E051406j29602m26564n03909l10582m90020o44718m98117k55211j16682
$$ 5051406 4921804 4495240 3991331 3680749 3190729 2546011 2047894 1792683 1676001
10328A676001k69539q9024J10164j18210j71637j97292M8969q0371k05250l4148
$$ 1676001 1406462 1317438 1427602 1309392 1137755 940463 989432 909061 703811 669663
10318F69663j01387j18400O1337O4872j73639m2726j8626k7941K442o3960j28638
$$ 669663 568276 449876 511213 576085 402446 359720 341094 313153 315595 251635 122997
10307A22997l5357K85049l0667j58415p6783j03163K05081M04251M69j71064j04468
$$ 122997 87640 372689 342022 183607 106824 3661 208742 612993 613462 442398 337930
10296C37930l97668K852l5438p0562q988q271N0324J23606Q9179k04462o5303
$$ 337930 -59738 -56886 -92324 -162886 -171874 -180145 -129821 -6215 82964 -121498 -186801
10285a86801N4847k9633K4721J73719r573k03722k0793J17813J4499q0149j48279
$$ -186801 -131954 -161587 -136866 36853 27280 -176442 -197235 -79422 -64923 -145072 -293351
10274b93351J6083J65236q3288L0761L03160L3460j30722k86059m3825J15948
$$ -293351 -277268 -112032 -195320 -164559 138601 172061 41339 -244720 -288545 -172597
10264a72597J2056q662K88903j17834R0666O7651k91379l495J01161k6030o3923
$$ -172597 -160541 -169203 119700 1866 92532 160183 -131196 -134691 -33530 -59560 -123483
10253a23483K03218L5495K2288k21395K54671L36140J93210l93385l76290J1245
$$ -123483 79735 115230 137518 -83877 170794 506934 700144 306759 -69531 -58286
10243e8286j43859n2207L1664j96552O7681K59626K80559J72155j30323o8690
$$ -58286 -202145 -254352 -222688 -419240 -351559 -91933 188626 360781 230458 161768
10233A61768k9142m1987k23535k72702j30012K03639L44551J03103J85281J17220
$$ 161768 132626 90639 -132896 -405598 -535610 -331971 12580 115683 300964 418184
10223D18184n1725k31359j20172j24803N0714K224K9034j21846m3911J57604J33134
$$ 418184 366459 135100 14928 -109875 -59161 -56937 -27903 -149749 -193660 -36056 97078
10212I7078n4670M9184k9520r1632J94430J3009m0286R4803q1566J17577r1184
$$ 97078 42408 91592 62072 -29560 164870 177879 137593 232396 150830 268407 177223
10201A77223j39583k57318j21430o0179J44460J21043K21178K28982J18070J24041
$$ 177223 37640 -219678 -341108 -401287 -256827 -135784 85394 314376 432446 556487
10191E56487J00091k47915j71756m2518j03516n8488J38801P8048M5655j48103
$$ 556487 656578 408663 236907 194389 90873 32385 171186 249234 294889 146786
10181A46786j06899M7427J7176N7294l7080m9487K61298j58336k03508l4298Q5151
$$ 146786 39887 87314 104490 161784 124704 75217 336515 178179 -25329 -59627 25524
10170B5524o558J6565m7106q5834J74652j7199j8700R2467n0217j57657j72770
$$ 25524 18966 35531 -11575 -97409 77243 60044 41344 133811 83594 -74063 -246833
10159b46833J64680N073j8196J38884N5599k66802j34673J21615k36416l482K01537
$$ -246833 -82153 -77080 -95276 43608 99207 -167595 -302268 -180653 -417069 -420551 -219014
10148b19014J80506l1420J12746J39320k61686k71978r0143L0807k7490n2895
$$ -219014 -38508 -69928 42818 182138 -79548 -351526 -441669 -410862 -438352 -491247
10138d91247K16281J40487p5413L224P5141J10374P8567j08859J25984k35503
$$ -491247 -274966 -134479 -209892 -206668 -131527 -21153 57414 -51445 74539 -160964
10128a60964l00044K65257K79445l8966o0805j92292o4481q3572J12668K39201
$$ -160964 -461008 -195751 83694 44728 -16077 -208369 -272850 -356422 -243754 -4553
10118d553o834j12458O8344j69019l93975j27052J01896J34075L78101J04359
$$ -4553 -11387 -123845 -55501 -224520 -618495 -745547 -643651 -509576 -131475 -27116
10108b7116m7182j14543k90648O8712q2254J67988L56388l8427j00428M1612Q7364
$$ -27116 -74298 -188841 -479489 -410777 -493031 -325043 31345 -7082 -107510 -65898 21466
10097B1466j35349j33435l3557J25715l6713J77503L2290l2727K24774J77823
$$ 21466 -113883 -247318 -280875 -155160 -191873 -14370 17920 -14807 209967 387790
10087C87790j7053j07664j94404j67029j9470K91243K09075J02098j03323J80201
$$ 387790 370737 263073 68669 -98360 -117830 173413 382488 484586 381263 561464
10077E61464p3087l40134l4298R7314Q949o0463K2727K8189j20293q3778q3433
$$ 561464 488377 148243 113945 211259 220208 159745 182472 210661 90368 6590 -76843
10066g6843J16123j94947P3452K3244k8305k0956L2365J1383J09332n2302J6633
$$ -76843 39280 -155667 -82215 -58971 -87276 -108232 -75867 -64484 44848 -7454 9179
10055I179K03385N4738K16227O7433K23408P13455R04314P63792N05821r61770
$$ 9179 212564 267302 483529 550962 774370 1487825 2392139 3155931 3661752 2699982
10045B699982j328385n09821k91699L399j56947j39969o805O5042Q6095J32718
$$ 2699982 1371597 861776 570077 573476 416529 276560 269755 334797 420892 553610
10035E53610P9525N6075N2283r4186j16491l0261j07496k69246J3425L7742K04237
$$ 553610 633135 689210 741493 647307 530816 500555 393059 123813 137238 174980 379217
10024C79217n78k2844j68235N7096N2304k38437j21054p4234L06919J40542l76818
$$ 379217 378639 355795 187560 244656 296960 58523 -62531 -136765 170154 310696 -66122
10013f6122k23658R8039k9601J90896L71664J39217j96528l76616N2015L0497
$$ -66122 -289780 -191741 -221342 -30446 341218 480435 283907 -92709 -40694 -10197
10003a0197J3188k8925J69319j63847j90502j1129j35337L633J56573J58985M7759
$$ -10197 2991 -25934 143385 -20462 -210964 -222093 -357430 -353797 -197224 -38239 9520
9992I520k31339k13282K78684K73923K9160j34962l85256j50579K27680L2456
$$ 9520 -221819 -435101 -156417 117506 146666 11704 -373552 -524131 -296451 -263995
9982b63995K28854L16957o9597n4574O8832M2981j10449j01731q7819q6795Q8936
$$ -263995 -35141 281816 212219 157645 226477 269458 159009 57278 -30541 -117336 -28400
9971b8400R7684K59795P2602o5120j44504k00745J30653q6061J40933j0272k98374
$$ -28400 69284 329079 401681 336561 192057 -8688 121965 35904 176837 166565 -131809
9960a31809r4533R9287K26769J0019p7270J34192J81913K8942k35008K3072M572
$$ -131809 -226342 -127055 99714 109733 32463 166655 348568 377510 142502 165574 170146
9949A70146j82078o2538o3833m8881M710P9164q1522j59500R2884J41677j03260
$$ 170146 -11932 -74470 -138303 -187184 -182474 -103310 -184832 -344332 -251448 -109771 -213031
9938b13031q4390K74009M03552l6551l70152j36795j76781J38131M3972l83286
$$ -213031 -297421 -23412 380140 343589 -26563 -163358 -340139 -202008 -158036 -541322
9928e41322J7740J97584K67398J056o8437J64092l0024o3949M8227K6914j61741
$$ -541322 -523582 -325998 -58600 -57544 -125981 38111 8087 -55862 -7635 19279 -142462
9917a42462j51819J97346K39883j18990j50130P0018N9443n0598o0858P3422J04330
$$ -142462 -294281 -96935 142948 23958 -126172 -56154 3289 -47309 -108167 -34745 69585
9906F9585k6239J31194m3624O985K322N6444j78970q0239j27286J17665J06020
$$ 69585 43346 174540 130916 137901 140223 196667 17697 -62542 -189828 -72163 33857
9895C3857J42729K15233K21606J42381k40591k16695J65707O7934j11663j47844
$$ 33857 176586 391819 613425 755806 515215 298520 464227 532161 420498 272654
9885B72654o1362j24696k21443n2186P7233J16065K1959J28229J54611r6651k09686
$$ 272654 211292 86596 -134847 -187033 -109800 6265 28224 156453 311064 214413 4727
9874D727j92224o4642l9940K55711J92232M2858p6938j18327Q5070k20754j44496
$$ 4727 -187497 -252139 -292079 -36368 155864 198722 121784 3457 88527 -132227 -276723
9863b76723J89521K14686R6629o9520L6681J03806j21271k54946m9117J78779
$$ -276723 -87202 127484 224113 154593 191274 295080 173809 -81137 -130254 48525
9853D8525K33502k09737o6350o5569l129J58697J90301R6631n3547O4600J25520
$$ 48525 282027 72290 5940 -59629 -62758 95939 286240 382871 329324 393924 519444
9842E19444J46418j07421J01293l24738l06905j33545o7377j96202L00421J25282
$$ 519444 665862 558441 659734 334996 28091 -105454 -172831 -369033 -68612 56670
9832E6670k25724j38891k819K04662P7785j04402j34414k1819J78959J34314j92732
$$ 56670 -169054 -307945 -310764 -106102 -28317 -132719 -267133 -288952 -109993 24321 -168411
9821a68411l6746l366K49871J01469J9312P9681j94877k82250m5914J56015o070
$$ -168411 -205157 -208523 41348 142817 162129 241810 46933 -235317 -281231 -125216 -131286
9810a31286J25473O1813P757j8776j78064K0772O8301J9089J74032J03488r74
$$ -131286 -5813 56000 63757 44981 -133083 -112311 -44010 -24921 149111 252599 251625
9799B51625O0239O6145Q4546n6211q7555j30530k4023J02570n9703k85160k01311
$$ 251625 311864 378009 462555 406344 318789 188259 164236 266806 207103 -78057 -279368
9788b79368J50515K1189J98336J29071j78709o7899L0321j38265p2604R2666N3006
$$ -279368 -128853 -107664 90672 219743 41034 -26865 3456 -134809 -207413 -114747 -61741
9777f1741m1622L2230k9052J65245Q0657j61662M5389J86423J99222J20499q7301
$$ -61741 -103363 -71133 -100185 65060 145717 -15945 29444 215867 415089 535588 448287
9766D48287k17252k09186j02166K61700K31592j10531N1315R1526j31450m6023
$$ 448287 231035 21849 -80317 181383 412975 302444 353759 445285 313835 267812
9756B67812K4177J0281Q1973J04730R8549k21503m2054P6446m8887m9174l10933
$$ 267812 291989 302270 384243 488973 587522 366019 323965 400411 351524 302350 -8583
9745h583j50797M1594R1409o5078K1194J87918j31646o0339K38842J59211j04078
$$ -8583 -159380 -117786 -26377 -91455 -70261 117657 -13989 -74328 164514 323725 219647
9734B19647R4648m5254m56660J7160J31242P790J80337M7133j41327l6299j38313
$$ 219647 314295 269041 -187619 -170459 -39217 -31427 148910 196043 54716 18417 -119896
9723a19896n0564n7950K7468j5174o4071J1311j09855J64396K74112K14632L3886
$$ -119896 -170460 -228410 -200942 -216116 -280187 -268876 -378731 -214335 59777 274409 308295
9712C08295j6204K58282r9336k02801j26598J19897R4739J16186j05553p2540
$$ 308295 292091 550373 451037 248236 121638 241535 336274 452460 346907 274367
9702B74367k94936L00166r5493j08056J92290J00329j07420j79790l9623L5259
$$ 274367 -20569 279597 184104 76048 268338 368667 261247 81457 41834 77093
9692G7093P7812R4052q6772k5969N7470p2639J107o00j08771j53908o1362J07134
$$ 77093 154905 248957 162185 136216 193686 121047 122154 121554 12783 -141125 -202487 -95353
9680i5353o839j22412j13236N5277L54231Q0265L4831k1282j12199k02441K8021
$$ -95353 -102192 -224604 -337840 -282563 71668 151933 186764 165482 53283 -149158 -121137
9669a21137l0328L16173J20378k49983j77437p385J20846l0965K13991k01652
$$ -121137 -151465 164708 285086 35103 -142334 -149719 -28873 -59838 154153 -47499
9659d7499j16396J2649J63725R1416j47262N0663K71834q3156k29943r6069K19837
$$ -47499 -163895 -151246 12479 103895 -43367 7296 279130 195974 -33969 -130038 89799
9648H9799K41889m5497p745l625j39710N5588K6843J02140q2081K42038p1862
$$ 89799 331688 286191 278446 274821 135111 190699 217542 319682 237601 479639 407777
9637D07777p8143n2875j24847J33104j00766j81192K7958L94293L1992Q5809P0428
$$ 407777 329634 276759 151912 285016 184250 3058 31016 425309 457301 543110 613538
9626F13538j98965l49691j71818L95743J5225K4881j8381k2593J71794L52268
$$ 613538 414573 64882 -106936 288807 304032 328913 310532 287939 459733 812001
9616H12001o9877k87708l70290k96090k37849j08575P9597J98832K06369M3926
$$ 812001 742124 454416 84126 -211964 -449813 -558388 -478791 -279959 -73590 -29664
9606b9664J24774J54648k6798o7961j88342j372J56341J31828M7587J89285j65548
$$ -29664 95110 249758 222960 154999 -33343 -34715 121626 253454 301041 490326 324778
9595C24778M4330r607k20864J16192J34062k23133p5862K87376K5603j25186j37337
$$ 324778 369108 359501 138637 254829 388891 165758 89896 377272 402875 277689 140352
9584A40352k07250j04948K27249J80588P8615J4955j85503p9195J01961L9982
$$ 140352 -66898 -171846 55403 235991 314606 329561 144058 64863 166824 206806
9574B06806J2723R1631o5806j16834j70699Q4690J09499P0517J47191j00040j43261
$$ 206806 219529 311160 245354 128520 -42179 42511 152010 222527 369718 269678 126417
9563A26417M2513j64554o8157O5485q8200J60020J64032j67814j68795J20633
$$ 126417 168930 4376 -63781 1704 -86496 73524 237556 69742 -99053 21580
9553B1580J41990J04010J00352l0382N0166J51652J38871j41995J45689j04871
$$ 21580 163570 267580 367932 337550 387716 539368 678239 536244 681933 577062
9543E77062k87555R3890j74142M8727q7530J90792K17887r2409j30272p3788J27727
$$ 577062 289507 383397 209255 257982 170452 361244 579131 486722 356450 282662 410389
9532D10389j53833j97360L6126M98054R5441q0463k02248k8229J07426R6058K40127
$$ 410389 256556 59196 95322 593376 688817 608354 406106 377877 485303 581361 821488
9521H21488J60380k47011k32225p9924K2758N0001l11905j2049J09040P1089l8584
$$ 821488 981868 734857 502632 422708 445466 495467 183562 171513 280553 351642 313058
9510C13058L9435o1199l7806J39582J56969j19378k53883R0222j91200p0749L15322
$$ 313058 352493 291294 253488 393070 550039 430661 176778 267000 75800 5051 320373
9499C20373J45341j8849Q413K5470j65333j51869r5599n6973j49597J59329R9343
$$ 320373 465714 446865 455278 480748 315415 163546 67947 10974 -138623 20706 120049
9488A20049J33978o1336j40830J21373M2883K161K22800M4660l21236j0760j2280
$$ 120049 254027 192691 51861 173234 216117 218278 441078 485738 164502 153742 141462
9477A41462L45381J98850r8885l3274K23236k45263k16288M0275J09602J82761
$$ 141462 486843 685693 586808 553534 776770 531507 315219 355494 465096 647857
9467F47857K74959j28342r5362K86651j53164k32184m5061J57157J68103k069
$$ 647857 922816 794474 699112 985763 832599 600415 555354 712511 880614 878545
9457H78545M4978k70668M3369k3161O132j15438j23331r7865m3992R4216O0337
$$ 878545 923523 652855 696224 673063 679195 563757 440426 342561 298569 392785 453122
9446D53122K10364O4717j01777k95888J10043n4093O9132J45798O4260N939k45160
$$ 453122 663486 728203 626426 330538 440581 386488 455620 601418 665678 671617 426457
9435D26457j45817J88485L16915M1023k380J40465j10468l05865J0035L16688
$$ 426457 280640 469125 786040 827063 824683 965148 854680 548815 558850 875538
9425H75538J79798k44631k07002o7048K4221l8112J98468Q5359K5181K94854m6780
$$ 875538 1055336 810705 603703 536655 560876 522764 721232 806591 831772 1126626 1079846
9414A079846N905K22950j50292l5894j52814J9441L17024J78612l5998M4996J00278
$$ 1079846 1085751 1308701 1158409 1122515 969701 989142 1306166 1484778 1448780 1493776 1594054
9403A594054Q9151j81827K5084j36909n686k53218M2018J67232J16903j41676
$$ 1594054 1683205 1501378 1526462 1389553 1383867 1130649 1172667 1339899 1456802 1315126
9393A315126R2468k8651j72933K15044J73821j51899q0262J43724J62551j51862
$$ 1315126 1407594 1378943 1206010 1421054 1594875 1442976 1362714 1506438 1668989 1517127
9383A517127J7043p7124j63176J21413L07939J03815Q8533j2150q3465L496N6103
$$ 1517127 1534170 1457046 1293870 1415283 1723222 1827037 1915570 1903420 1819955 1823451 1879554
9372A879554J67935Q3200J03788J68784n534K15325J57372K18546m407q691R4614
$$ 1879554 2047489 2130689 2234477 2403261 2397727 2613052 2770424 2988970 2984563 2975872 3070486
9361C070486l2846L396J81746J88024k15581J42742J8714l8024J7542m9047j71986
$$ 3070486 3037640 3041036 3222782 3410806 3195225 3337967 3356681 3318657 3336199 3287152 3115166
9350C115166K2102K79299J77242J14012J46425Q2917j90064R8577L48606K52674
$$ 3115166 3137268 3416567 3593809 3707821 3854246 3937163 3747099 3845676 4194282 4446956
9340D446956O9123K43607R2048Q9010R2859L12936K96815l6034J54292K27276
$$ 4446956 4516079 4759686 4851734 4940744 5033603 5346539 5643354 5607320 5761612 5988888
9330E988888J86926J76092J39635J57637K82172K94758K36108L55906L62624N18158
$$ 5988888 6175814 6351906 6491541 6649178 6931350 7226108 7462216 7818122 8180746 8698904
9320H698904M74377L39538K50256M86817O69774L31066M04550P64255P55144J047697
$$ 8698904 9173281 9512819 9763075 10249892 10919666 11250732 11655282 12419537 13174681 14222378
9310A4222378Q95047O94667Q38265J068271J179693J187219J375019J518056J476964
$$ 14222378 15117425 15812092 16650357 17718628 18898321 20085540 21460559 22978615 24455579
9301B4455579J714945J925197K197469K486030K744077K950403L197097L548932
$$ 24455579 26170524 28095721 30293190 32779220 35523297 38473700 41670797 45219729
9293D5219729L874700M281994M751130M852189N375408O223429O229984O551011
$$ 45219729 49094429 53376423 58127553 62979742 68355150 74578579 80808563 87359574
9285H7359574O564191O115378N392907M608607L435030K253476O88823q73232
$$ 87359574 93923765 100039143 105432050 110040657 113475687 115729163 116417986 115544754
9277A15544754j991994l173275m149523m804132m946243n160009n062308m879152
$$ 115544754 113552760 110379485 106229962 101425830 96479587 91319578 86257270 81378118
9269H1378118m585747m213167m054414l836281l590884l199035k891022k523671
$$ 81378118 76792371 72579204 68524790 64688509 61097625 57898590 55007568 52483897
9261E2483897k595045k188123k253504k189314j770100j657052j690936j704314
$$ 52483897 49888852 47700729 45447225 43257911 41487811 39830759 38139823 36435509
9253C6435509j484875j587125j671538j221021q50584j193701j153482j285843
$$ 36435509 34950634 33363509 31691971 30470950 29620366 28426665 27273183 25987340
9245B5987340j231440p35935o85852q30150o58163n88896p19466q21054p74713
$$ 25987340 24755900 24019965 23334113 22503963 21845800 21256904 20537438 19716384 18941671
9236A8941671p60601p61878n59060m44560l46130m26206o56004m41876o9026l07691
$$ 18941671 18181070 17419192 16860132 16415572 16069442 15643236 14987232 14545356 14476330 14168639
9226A4168639l82715m01336o37360l71174o8863j92631l43247m55100m84499l37433
$$ 14168639 13785924 13384588 12747228 12376054 12307191 12114560 11771313 11316213 10831714 10494281
9216A0494281l01501j20228k51390k18791k59561j28921j69255k62214l04291
$$ 10494281 10192780 10072552 9821162 9602371 9342810 9213889 9044634 8782420 8478129
9207H478129Q444k73379j74797l58100l23094j80823k87033k23729P5476L1776
$$ 8478129 8486573 8213194 8038397 7680297 7357203 7176380 6889347 6665618 6741094 6772870
9197F772870j9733k81062k06815k15201k68417r8396l0783n1450n17271Q0653
$$ 6772870 6753137 6472075 6265260 6050059 5781642 5683246 5652463 5601013 5083742 5164395
9187E164395j10961k19971j92062m0166j85744j24782R3114n5550j27173J38254
$$ 5164395 5053434 4833463 4641401 4601235 4415491 4290709 4383823 4328273 4201100 4339354
9177D339354j09104k70452j04770k0148R7748j62396k60046j35194O7005l39235
$$ 4339354 4230250 3959798 3855028 3834880 3932628 3770232 3510186 3374992 3441997 3102762
9167C102762j97688K015M93560Q4539l30672l4538M5833j83492m2466M2415k88228
$$ 3102762 2905074 2907089 3400649 3485188 3154516 3119978 3165811 2982319 2939853 2982268 2694040
9156B694040m7485N8139N8508j31005n8119J48609O5992l49411k32866J39568
$$ 2694040 2646555 2704694 2763202 2632197 2574078 2722687 2788679 2439268 2206402 2345970
9146B345970l9224o3444N0906j07273j63480r6826j93222M6023J17352l6479k34889
$$ 2345970 2306746 2243302 2294208 2186935 2023455 1926629 1733407 1779430 1896782 1860303 1625414
9135A625414j1573J72726j12884j32981K43568K3900k87172j27217P2598m3564
$$ 1625414 1613841 1786567 1673683 1540702 1784270 1808170 1520998 1393781 1466379 1422815
9125A422815j59262R0526L43956j81962j25076J00463l519p4363j88994r7450
$$ 1422815 1263553 1354079 1698035 1516073 1390997 1491460 1487941 1413578 1224584 1127134
9115A127134J3836L5476M5658j51649r4767L5705p1257P0588k04070k15265l17358
$$ 1127134 1140970 1176446 1222104 1070455 975688 1011393 940136 1010724 806654 591389 274031
9104B74031J96734J28066J21543O9337k49773P7575l2702J03018K18491j40789
$$ 274031 470765 598831 720374 789711 539938 617513 584811 687829 906320 765531
9094G65531j09309M1095j35115j90731K40664L03584J0126q2777o7868j19220
$$ 765531 656222 697317 562202 371471 612135 915719 925845 843068 775200 655980
9084F55980l13500N9204J9046J55190O5823J48005L60371L8592k17607p7524j12192
$$ 655980 342480 401684 420730 575920 641743 789748 1150119 1188711 971104 893580 781388
9073G81388n7712k16443R5609J00699j633o3794k70204J19194j7001K00042K30244
$$ 781388 723676 507233 602842 703541 701908 638114 367910 487104 470103 670145 900389
9062I00389k39170j45477k01874j87265N29654J64878m02564j04840k3347j08047
$$ 900389 661219 515742 313868 126603 656257 821135 418571 313731 290384 182337
9052A82337J15323J30176L02843J19199k40288j68248K19003O0083q1231m5597
$$ 182337 297660 427836 730679 849878 609590 441342 660345 720428 639197 593600
9042E93600j55132q9343m8883p0967K18710p1892r6013j97276O1363J64266R3792
$$ 593600 438468 349125 300242 229275 447985 376093 280080 82804 144167 308433 402225
9031D02225J23121J9533l21194J2446N3342k8503j33761P3027K26284p887L46978
$$ 402225 525346 544879 223685 236131 289473 260970 127209 200236 426520 418633 765611
9020G65611n8343j00008K39718J1949J8359J14068j61787m33985l41515N2692
$$ 765611 707268 607260 846978 858927 877286 991354 829567 395582 54067 106759
9010A06759Q6968J8889m5678J06290Q9820J29097J8194q6797R052R0242k37518
$$ 106759 193727 212616 166938 273228 363048 492145 510339 423542 432594 522836 285318
8999B85318k95164R9503K81735J87607R603j31452k79833j66768K85466K37119
$$ 285318 -9846 89657 371392 558999 568602 437150 157317 -9451 276015 513134
8989E13134K77796j92386j11885j88294r8956J02769m9173j98995j60407J02761
$$ 513134 790930 598544 486659 298365 199409 302178 253005 54010 -106397 -3636
8979c636Q4169j8964K18875J70754K1193N828j37239j01793m3862K43940N7500
$$ -3636 80533 61569 280444 451198 472391 478219 340980 239187 195325 439265 496765
8968D96765k75124j08347L2600p5894L6613o3577r7315R3514R9953J42011J61628
$$ 496765 221641 113294 145894 70000 106613 43036 -54279 39235 139188 281199 442827
8957D42827P1333o6083J05869n7864J9201j43858J655K09045o2162k51596R0602
$$ 442827 514160 448077 553946 496082 515283 371425 373080 582125 519963 268367 358969
8946C58969K29249J80428j54287m09759k36479j32401J78085J88155n6076J43873
$$ 358969 588218 768646 614359 204600 -31879 -164280 13805 201960 145884 289757
8936B89757J16453l1077o994J68538J6548j53919k98289j06075K02957r6254k51419
$$ 289757 406210 375133 368139 536677 553225 399306 101017 -5058 197899 101645 -149774
8925a49774J38413J0227J72287J39006k68640K01507Q7894l5177n0778k19977
$$ -149774 -11361 -1134 171153 310159 41519 243026 330920 295743 244965 24988
8915B4988n8619K27817K88416j32518j23266k39331l1036N0388j36526J43558
$$ 24988 -33631 194186 482602 350084 226818 -12513 -43549 6839 -129687 13871
8905A3871k1445J34148o3970K2774J33009J48284K1654j20080k08439j32623K9659
$$ 13871 -7574 126574 62604 85378 218387 366671 388325 268245 59806 -72817 -43158
8894d3158n0269O1602J68426j03125j59688j03055J22755r9531M1468K18917k17481
$$ -43158 -93427 -31825 136601 33476 -126212 -229267 -106512 -206043 -164575 54342 -163139
8883a63139J07504J49737J4754r7349L260P4198j88923R5739J7667J63303J27941
$$ -163139 -55635 94102 108856 11507 14767 88965 -99958 -4219 13448 176751 304692
8872C04692k23990l4834j6890J2623K05088J84777K20128J16899J46194j81537
$$ 304692 80702 45868 28978 41601 246689 431466 651594 768493 914687 733150
8862G33150l38485j82219Q2458r5916m0344K14375p9220k69638l9011J70585q3925
$$ 733150 394665 212446 294904 198988 158644 373019 293799 24161 -14850 155735 71810
8851G1810j18979P3331r7709m1658p0090J98307K32819o4722J50931K34589q5382
$$ 71810 -47169 26162 -71547 -113205 -183295 15012 247831 183109 334040 568629 483247
8840D83247l31483L0871P9008q0359k66284m1903Q5102q8350j17811K09785J64359
$$ 483247 151764 182635 261643 181284 -85000 -126903 -41801 -130151 -247962 -38177 126182
8829A26182J72762k37628k00609n9656j7578R8892K01344N8079j40344Q7265J2974
$$ 126182 298944 61316 -139293 -198949 -216527 -117635 83709 141788 1444 88709 101683
8818A01683l787l03372Q1129K93932J62655K33496j50194m06339j3744J486j18062
$$ 101683 97896 -205476 -124347 169585 332240 565736 415542 9203 -4541 -3055 -121117
8807a21117Q4478j48287j17908k6955k4946j83285n8588J56560J63330J76358
$$ -121117 -36639 -184926 -302834 -329789 -354735 -538020 -596608 -440048 -276718 -100360
8797a00360J37320M45762l05604l59213K28676K28316O794J62207N5808j79451
$$ -100360 36960 482722 177118 -182095 46581 274897 281691 443898 499706 320255
8787C20255k82373p094J15746n4014k1286J37214J4882n1589k46292k95862J9136
$$ 320255 37882 30788 146534 92520 71234 208448 223330 171741 -74551 -370413 -351277
8776c51277K70310L79893Q4485L4870k71678j95180M702K5392L2352j34941k09242
$$ -351277 -80967 298926 383411 418281 146603 -48577 -43875 -18483 13869 -121072 -330314
8765c30314j7348J71763R8188o038l0609j06683K9500Q347k5382Q60K6642j61986
$$ -330314 -347662 -175899 -77711 -83749 -114358 -221041 -191541 -183194 -208576 -207716 -181074 -343060
8753c43060m3529L58693Q8092R1411j56398j75717j72239m952L49677Q0597j15702
$$ -343060 -386589 -27896 60196 151607 -4791 -180508 -352747 -357699 -8022 72575 -43127
8742d3127j76603k62534Q4211K80699m7327P5240L32002K13793k9530j39869J82687
$$ -43127 -219730 -482264 -398053 -117354 -164681 -89441 242561 456354 426824 286955 469642
8731D69642o645l75777j09775K38168Q6123j42268k30363l1116N1298L6763k01961
$$ 469642 462997 87220 -22555 215613 301736 159468 -70895 -102011 -50713 -13950 -215911
8720b15911k7524J37448n0763k8568Q6593K79355K00288j63075o4474q3930Q3277
$$ -215911 -243435 -105987 -156750 -185318 -98725 180630 380918 217843 153369 69439 152716
8709A52716j27903j09323J85938k2634l2663k55255j06504J43694J01480j19626
$$ 152716 24813 -84510 101428 78794 46131 -209124 -315628 -171934 -70454 -190080
8699a90080M1070j34438o710L43361K38224j74547j74165J13351r7188k3465j35820
$$ -190080 -149010 -283448 -290158 53203 291427 116880 -57285 56066 -41122 -64587 -200407
8688b00407k6719J13278J94965j59758l8619J6265N9579P0739M2587j0499j05229
$$ -200407 -227126 -113848 81117 -78641 -117260 -100995 -41416 29323 71910 61411 -43818
8677d3818k41884P6835K03105K96646K62346m54488j52717K92151L20168J0694
$$ -43818 -285702 -208867 -5762 290884 553230 98742 -53975 238176 558344 569038
8667E69038j49282j826k83434q9868j0183j02615j3944J30872M6406r6513M4609
$$ 569038 419756 417930 134496 44628 34445 -68170 -82114 48758 95164 -1349 43260
8656D3260k09155M5549J14858K0037R6529J27041L8715j51241k31217J60201L1565
$$ 43260 -165895 -120346 -5488 14549 111078 238119 276834 125593 -105624 54577 86142
8645H6142L37851K33986Q2535l5147k83972j20030m1142P5014L8576j79150p3978
$$ 86142 423993 657979 740514 705367 421395 301365 260223 335237 373813 194663 120685
8634A20685j38588q9755l2498J90529L4405j49751J26516K38930K49834j24459
$$ 120685 -17903 -107658 -140156 50373 84778 -64973 61543 300473 550307 425848
8624D25848m1586j19116k97114P9521P7827j35001j76697L9143Q7362O7654N5674
$$ 425848 384262 265146 -31968 47553 125380 -9621 -186318 -147175 -59813 7841 63515
8613F3515k1453o3866l9760j482L4872K35334N7663l7345k70961k1913M18489
$$ 63515 42062 -21804 -61564 -63046 -28174 207160 264823 227478 -43483 -65396 353093
8602C53093R1331J35648j25983M2643J96753j38219l4175j1054j57182J08981
$$ 353093 444424 580072 454089 496732 693485 555266 521091 510037 352855 461836
8592D61836K03934O8648j26441j59792P9325Q7903M7098j27168o7851J57766j94688
$$ 461836 665770 734418 607977 448185 527510 615413 662511 535343 467492 625258 430570
8581D30570k17238q5334K54381K90632j14207r2822j81626j36531Q0170k6846
$$ 430570 213332 127998 382379 673011 558804 465982 284356 147825 227995 201149
8571B01149q3649J02730K3461J01550N922P1928K13781o6312j10411k22267m0126
$$ 201149 117500 220230 243691 345241 351163 423091 636872 570560 460149 237882 197756
8560A97756j22385j6331p2604Q0554Q8660J70435K1174k28128j92297K50o0441
$$ 197756 75371 59040 -13564 66990 155650 326085 347259 119131 -73166 -72916 -133357
8549a33357l05377l7535J55314K74264k069r6344K9880N608R5983j62843J48K73759
$$ -133357 -438734 -476269 -320955 -46691 -48760 -145104 -115224 -109616 -13633 -176476 -176328 97431
8537I7431M5838Q8293L1109r533M1862j46385M2352r9121j33140r9967J05049
$$ 97431 143269 231562 262671 253138 295000 148615 190967 91846 -41294 -141261 -36212
8526c6212K41985j85755N514j53639K963K5306P7291K38581K33030j01154k79591
$$ -36212 205773 20018 25532 -128107 -125144 -99838 -22547 216034 449064 347910 68319
8515F8319O1565L661k23231K69651J0839k12503J15419p529L3798k65529J0969
$$ 68319 129884 133545 -89686 179965 190804 -21699 93720 86191 119989 -145540 -134571
8504a34571j72628l543j70170l2246K77077J21277K8062J1794j10394N0027j85265
$$ -134571 -307199 -310742 -480912 -513158 -236081 -114804 -86742 -74948 -185342 -135315 -320580
8493c20580k043R6759L44895J47128o000r9323l82494J23672k22620J42540K76817
$$ -320580 -322623 -225864 119031 266159 260159 160836 -221658 -97986 -320606 -178066 98751
8482I8751L65979O6720k46812r0965J17312J79364j96231l11316j54419P9513
$$ 98751 464730 531450 284638 193673 310985 490349 294118 -17198 -171617 -92104
8472i2104K99630n130r2427J68694q5959k05928N0134k03997j81281j50496j5562
$$ -92104 207526 202396 109969 278663 192704 -13224 36910 -167087 -348368 -498864 -514426
8461e14426J80364K5649P6137K9600N386L0874P1748k7933k638J03748N0913j38020
$$ -514426 -334062 -308413 -232276 -202676 -197290 -166416 -94668 -122601 -125239 -21491 29422 -108598
8449a08598K1175N4180M3779j95333j75399Q8123K35871l176R2391j39669o067
$$ -108598 -87423 -33243 10536 -184797 -360196 -272073 -36202 -39378 53013 -86656 -92723
8438i2723q0350m1233K62164K69536l09633r8458p6731J78678K12186L21881k29033
$$ -92723 -173073 -214306 47858 317394 7761 -90697 -167428 11250 223436 545317 316284
8427C16284n00259l8029K12593P7444J04565J9519j4945n6338n2019O9592J00709
$$ 316284 -183975 -222004 -9411 68033 172598 192117 177172 120834 68815 138407 239116
8416B39116j08016K0013K7834k16625r1973M8796J99879k7962k07937r6898M9360
$$ 239116 131100 151113 178947 -37678 -129651 -80855 119024 91062 -116875 -213773 -164413
8405a64413J4709j35812l7757q857K79581K10146L1385k51144j32363L7052J54803
$$ -164413 -149704 -285516 -323273 -332130 -52549 157597 188982 -62162 -194525 -157473 -2670
8394b670J48499J42877O8073j59911j03204j16425j76152k8316N4808K82214j02582
$$ -2670 145829 288706 356779 196868 93664 -22761 -198913 -227229 -172421 109793 7211
8383G211j80298J9558J85077J47891j13883J06915L42357j07483j80955k99860
$$ 7211 -173087 -153529 31548 179439 65556 172471 514828 407345 226390 -73470
8373g3470K1473o1423J66453J22847j11225Q9516J3689L077N3717R8122j65406
$$ -73470 -51997 -113420 53033 175880 64655 154171 167860 170937 224654 322776 157370
8362A57370J8205j25814j55535o3028O92o0046m6473n6383K32002k5754J45408
$$ 157370 175575 49761 -105774 -168802 -168110 -228156 -274629 -331012 -99010 -124764 20644
8351B0644L9429J45161j9177n0312j27646l2245l0820m5886q3855j44447L7101
$$ 20644 60073 205234 186057 135745 8099 -24146 -54966 -100852 -184707 -329154 -292053
8340b92053m9135j08304J63443J39662N124J91718R8395k30545K91744j77775
$$ -292053 -341188 -449492 -286049 -146387 -141263 50455 148850 -81695 210049 32274
8330C2274l9588P8859n8144J50143K63771k58834M529J61039k9653o1701j02032
$$ 32274 -7314 71545 13401 163544 427315 168481 173010 334049 304396 242695 140663
8319A40663j15723L8588J53324l5677k63768k31346J05253K12119M0212N9252
$$ 140663 24940 63528 216852 181175 -82593 -313939 -208686 3433 43645 102897
8309A02897n1140P4963J45076Q8694j08629j09357J51438n2454l11127j70229
$$ 102897 51757 126720 271796 360490 251861 142504 293942 241488 -69639 -239868
8299b39868O3153L85549M6879m5015n6424k23396j26143k1620L9573q2667K1879
$$ -239868 -176715 208834 255713 210698 154274 -69122 -195265 -216885 -177312 -259979 -238100
8288b38100K82836Q8935K6427j34639o9842l828l0812L77310L2862j69571j14473
$$ -238100 44736 133671 160098 25459 -44383 -48211 -79023 298287 331149 161578 47105
8277D7105j10921K01879M3057J26900N3430o3007k99425j31037L95247j20291
$$ 47105 -63816 138063 181120 308020 361450 298443 -982 -132019 263228 142937
8267A42937m5272m4123m3110N5167M462R0080r6933q9469L7204o4004k8198L4000
$$ 142937 97665 53542 10432 65599 70061 160141 63208 -26261 10943 -53061 -81259 -47259
8255d7259J51348o0837j37029R1560j4811K4605J31808L8455K5291j10698o3396
$$ -47259 104089 43252 -93777 -2217 -17028 7577 139385 177840 203131 92433 29037
8244B9037K1542K2523o3258J192K88701R4514j77683n346P3802J68790M3359l6670
$$ 29037 50579 73102 9844 11036 299737 394251 216568 211222 285024 453814 497173 460503
8232D60503k13631q8509r6174l5069J59696k51214j69685P2503Q7578j75835k02571
$$ 460503 246872 158363 62189 27120 186816 -64398 -234083 -161580 -74002 -249837 -452408
8221d52408Q9573K00742J63484m2020r8862j0368P3293P6958k6530j59633l12514
$$ -452408 -362835 -162093 1391 -40629 -139491 -149859 -76566 392 -26138 -185771 -498285
8210d98285J42413J95063k21976j12720p6878K48531j4450P062Q1792K51868J74398
$$ -498285 -355872 -160809 -382785 -495505 -572383 -323852 -338302 -331240 -249448 2420 176818
8199A76818p1798j07317Q7699K0700j96026l17883r3451K08442J43255J00198
$$ 176818 105020 -2297 85402 106102 -89924 -407807 -501258 -292816 -149561 -49363
8189d9363J72737J19860R395k45706R8022P4161K62157r6757k50791L52L0808
$$ -49363 123374 243234 252629 6923 104945 179106 441263 344506 93715 94067 124875
8178A24875J29687K3930Q2925k27864j48881r2340P3976j47081k35142J20558
$$ 124875 254562 278492 361417 133553 -15328 -107668 -33692 -180773 -415915 -295357
8168b95357J95057j09911N3758l3426R2791j6144k3625J77954J93202k039R9112
$$ -295357 -100300 -210211 -156453 -189879 -97088 -113232 -136857 41097 234299 232260 331372
8157C31372K7588K52959j12006J46989j22702l64343j45577Q1644o5966m2879
$$ 331372 358960 611919 499913 646902 524200 159857 14280 95924 29958 -12921
8147a2921n9206J2553K32407r2482P0142Q4770L663p9265M0408J06950K50789
$$ -12921 -72127 -59574 172833 80351 150493 235263 238926 159661 200069 307019 557808
8136E57808L3884P6962j60089M6432k52981l06209Q8025K02801N3266j42176O4724
$$ 557808 591692 668654 508565 554997 302016 -4193 83832 286633 339899 197723 262447
8125B62447K78138k41541k15417o9433K8665L3212M8491K4362K0752m7267j27717
$$ 262447 540585 299044 83627 14194 42859 76071 124562 148924 169676 122409 -5308
8114e308j50008P3220J86215j32826m2457j81821l4761J44668j8153K63638J77579
$$ -5308 -155316 -82096 104119 -28707 -71164 -252985 -287746 -143078 -161231 102407 279986
8103B79986K0580K5022K2456l02124k06919p9918j31862J79196K83854O7449K7717
$$ 279986 300566 325588 348044 45920 -160999 -240917 -372779 -193583 90271 157720 185437
8092A85437q5384k98864P5954J85903k6417K28457K08760l04135m59087Q0105
$$ 185437 100053 -198811 -122857 63046 36629 265086 473846 169711 -289376 -209271
8082b09271L92188p4919k98917l5675R1868N379j08417j09028J75664L10819K72648
$$ -209271 182917 107998 -190919 -226594 -134726 -129347 -237764 -346792 -171128 139691 412339
8071D12339j73844j37571l28026J9903K14997j27496J69916j6252k22520R9323
$$ 412339 238495 100924 -227102 -207199 7798 -119698 50218 33966 -188554 -89231
8061h9231J96637r106k47455r786J782j67714Q0014j70625K36702M50426J33755
$$ -89231 107406 98300 -149155 -158941 -157159 -324873 -244859 -415484 -178782 271644 405399
8050D05399k21710r1094r2705Q2576J38552j25805k1946L93352M7449o6637j24837
$$ 405399 183689 92595 -110 82466 221018 95213 73267 466619 514068 447431 322594
8039C22594m19084l39337m5537J13055J16506P0356L4705K829j40268J32380J79980
$$ 322594 -96490 -435827 -481364 -368309 -251803 -181447 -146742 -143913 -284181 -151801 28179
8028B8179J28140j65391j2834K1686N7351Q5273L60783k81041j39519j57622L0062
$$ 28179 156319 -9072 -21906 -220 57131 142404 503187 222146 82627 -74995 -44933
8017d4933K92246K646J27591m0428n9350N0132j03394J68074J53537p1716o8996
$$ -44933 247313 249959 377550 337122 277772 327904 224510 392584 546121 474405 405409
8006D05409j07509j54903l46049j79162J18031j6070L0615P4042J40244M1572
$$ 405409 297900 142997 -203052 -382214 -264183 -280253 -249638 -175596 -35352 6220
7996F220j19592P0576J58461M0480Q5943j21854k4884l9246R5645K8383n9316
$$ 6220 -113372 -42796 115665 156145 242088 120234 95350 56104 151749 180132 120816
7985A20816j20375O2305j43583r0927K21666n119k3748J25505J8234k84773k06294
$$ 120816 441 62746 -80837 -171764 49902 44783 21035 146540 164774 -119999 -326293
7974c26293j30051P0680J27088j64050j15278Q4073M13385J82871k16188k03433
$$ -326293 -456344 -385664 -258576 -422626 -537904 -453831 -40446 142425 -73763 -277196
7964b77196m9168J99153K99659J84688J3505l21810M7713Q0338j42870R0855K47930
$$ -277196 -326364 -127211 172448 357136 370641 48831 96544 176882 34012 124867 372797
7953C72797j9859p3991L651j22517M336N7900l6845j66741j11290j37514j7564
$$ 372797 352938 278947 282598 160081 164417 222317 185472 18731 -92559 -230073 -247637
7942b47637J26568J06071j10531o3905l11445J6686L72655L17005L15477q6669
$$ -247637 -121069 -14998 -125529 -189434 -500879 -484193 -111538 205467 520944 434275
7932D34275l81384q1216K48610k886j94842Q9137j35715p6265o8257o1171R0366
$$ 434275 52891 -28325 220285 217399 22557 111694 -24021 -100286 -168543 -229714 -139348
7921a39348j01438l189J36425M2035N7464P9429R3010M2602O4431Q1887k90244
$$ -139348 -240786 -243975 -107550 -65515 -8051 71378 164388 206990 271421 353308 63064
7910F3064l81688J45283L22340m9374k89711m1281J91963Q1384j26950k95848
$$ 63064 -318624 -173341 148999 99625 -190086 -231367 -39404 41980 -84970 -380818
7900c80818M1018J8149p6818K05381J81317n9560J69518k9331J7610o5822k11783
$$ -380818 -339800 -321651 -398469 -193088 -11771 -71331 98187 68856 86466 20644 -191139
7889a91139K6882K64556N2559K5016j41198K54413k8479l00954m9380O0361J45568
$$ -191139 -164257 100299 152858 177874 36676 291089 262610 -38344 -87724 -27363 118205
7878A18205J94956r4581K5153L3620l5029j29041j8775J54587O6330j21775O8384
$$ 118205 313161 218580 243733 277353 242324 113283 94508 249095 315425 193650 262034
7867B62034j84768O9021R5125m3990r3488l00222J331K72044m8093p6195k2386
$$ 262034 77266 146287 241412 197422 103934 -196288 -194957 77087 28994 -47201 -69587
7856f9587k12594J79054K15111R5259M0852L2431J50935L834k97845k43252j46085
$$ -69587 -282181 -103127 111984 207243 248095 280526 431461 435295 137450 -105802 -251887
7845b51887J06871o7715J00279J82403R263J38082R8092n461j40837j71665j40991
$$ -251887 -145016 -212731 -112452 69951 79214 217296 315388 309927 169090 -2575 -143566
7834a43566K5554o7479M8332L6955O1853r5577k81596K03599J02958k24992J5585
$$ -143566 -118012 -185491 -137159 -100204 -38351 -133928 -415524 -211925 -108967 -333959 -318374
7823c18374M23123K8919j92012q4165J7196K52891l9118q7754M9644J59494N608
$$ -318374 104749 133668 -58344 -142509 -125313 127578 88460 706 50350 209844 215452
7812B15452j16428l48803k8096J48801N5027j58019l10586O6680N0032k3904K53768
$$ 215452 99024 -249779 -277875 -129074 -74047 -232066 -542652 -475972 -425940 -449844 -196076
7801a96076J04472K07692J65432R9284l15688K2104r5822k51881J73448K38811
$$ -196076 -91604 116088 281520 380804 65116 87220 -8602 -260483 -87035 151776
7791A51776o5559n3944R9198k3877j05086j88621O0220k6500M5101J45921m6964
$$ 151776 86217 32273 131471 107594 2508 -186113 -125893 -152393 -107292 38629 -8335
7780h335q0280o0381J65052L17290j1742j90691j67234l1172L70234J33468k25010
$$ -8335 -88615 -148996 16056 333346 321604 130913 -36321 -67493 302741 436209 211199
7769B11199n192l2822p2223p1928J19559j8132j02256k41857R015j8536K9099
$$ 211199 206007 173185 100962 29034 148593 130461 28205 -213652 -204637 -223173 -194074
7758a94074J28525Q6719j87239j80154J56158N4818j84517K11054L01453J27380
$$ -194074 -65549 21170 -166069 -346223 -190065 -135247 -319764 -108710 192743 320123
7748C20123k7303l79003K2922L65802j86984k04607k01853j21509O6543k1106
$$ 320123 292820 -86183 -63261 302541 115557 -89050 -290903 -412412 -345869 -366975
7738c66975R0616K40101L87158j237k20534p0532j3204j09371K7434m9570N9185
$$ -366975 -276359 -36258 350900 349663 129129 58597 45393 -63978 -36544 -86114 -26929
7727b6929m0990l8120j80686j83733k3404J77969K48629J38944k26739l6548q706
$$ -26929 -67919 -106039 -286725 -470458 -493862 -315893 -67264 71680 -155059 -191607 -200313
7716b00313J84297o5546j44425J24307K90547J35681o220j03173j39474o5326
$$ -200313 -16016 -81562 -225987 -101680 188867 324548 318328 215155 75681 10355
7706A0355k31385K7713J5900k21040J3057J46890j36513q2436L92868K40137P0100
$$ 10355 -221030 -193317 -177417 -398457 -385400 -238510 -375023 -457459 -64591 175546 245646
7695B45646o9616j24244k03407j53729L406Q2368q1370K7211Q9505O3713Q2722
$$ 245646 176030 51786 -151621 -305350 -301944 -219576 -300946 -273735 -184230 -120517 -37795
7684c7795J00747L6552j73595J28337J62207M991k22703j67864J08365N6638j29098
$$ -37795 62952 99504 -74091 54246 216453 221444 -1259 -169123 -60758 -4120 -133218
7673a33218K9969k965O9165k5896J66065L7541l92759k28891J32923J86283j53563
$$ -133218 -103249 -106214 -37049 -62945 103120 140661 -252098 -480989 -348066 -161783 -315346
7662c15346k8797Q6409j91087k0304L91986L25748Q2793j85446K05675K30387
$$ -315346 -344143 -257734 -448821 -469125 -77139 248609 331402 145956 351631 582018
7652E82018j14916k89550Q766k24202M9360J3620j91262j18879p9209J58796O0241
$$ 582018 467102 177552 186318 -37884 11476 25096 -166166 -285045 -364254 -205458 -145217
7641a45217J34542J27191j02599j31969k5012J21059M12996j86348o4883J92600
$$ -145217 -10675 116516 13917 -118052 -143064 -22005 390991 204643 139760 332360
7631C32360j88067j15653R792l8708k09592m681J57387j08547R0282J02775j34782
$$ 332360 144293 28640 38432 -276 -209868 -214549 -57162 -165709 -75427 27348 -107434
7620a07434M2360j09727L1861J16429k20036k08732J56002J94464j3167J54448
$$ -107434 -65074 -174801 -142940 -26511 -246547 -455279 -299277 -104813 -117980 36468
7610C6468j27530k22983j44394K06240L23143M2643k67511k23918O6391J0539
$$ 36468 -91062 -314045 -458439 -252199 70944 113587 -153924 -377842 -311451 -300912
7600c00912q748J06091L11019j20936r4068j39626j87549M13700J13550n01894
$$ -300912 -309660 -203569 107450 -13486 -107554 -247180 -434729 -21029 92521 -409373
7590d09373k35204q3873K99521K39603K60135K9833j30955j59519j95861R4540
$$ -409373 -644577 -728450 -428929 -189326 70809 100642 -30313 -189832 -385693 -291153
7580b91153K85500J42899k18091r8872J19380k4775o9488p6688q1090K3417k78686
$$ -291153 -5653 137246 -80845 -179717 -60337 -85112 -154600 -231288 -312378 -288961 -567647
7569e67647j01682P6828K08146M7071J51440l3545P7231K56230J5325m2168j27345
$$ -567647 -669329 -592501 -384355 -337284 -185844 -219389 -142158 114072 129397 87229 -40116
7558d0116q5040q1990R7834J59888l8411J17989J9451J90093j14323j39957J89083
$$ -40116 -125156 -207146 -109312 50576 12165 130154 149605 339698 225375 85418 274501
7547B74501L8220k02863k56578j2067K69604K24514m8827k38765j44475p6181
$$ 274501 312721 109858 -146720 -158787 110817 335331 286504 47739 -96736 -172917
7537a72917J7734J7417k09657j62235J47271L45873K7189o3356q1203o0496o2600
$$ -172917 -155183 -137766 -347423 -509658 -362387 -16514 10675 -52681 -133884 -194380 -256980
7526b56980j96963l7447L4622L05034J93222j66021j36816K25919J33258j33959
$$ -256980 -453943 -491390 -456768 -151734 41488 -124533 -261349 -35430 97828 -36131
7516c6131l05027Q3547K3187l0355K5872j54764k23552Q425L72183K46968j47133
$$ -36131 -341158 -257611 -234424 -264779 -238907 -393671 -617223 -608798 -236615 10353 -136780
7505a36780r6024J10304n5752j8589P0925k5450P4547M9994M1401J56167l9835
$$ -136780 -232804 -122500 -178252 -196841 -125916 -151366 -76819 -26825 14576 170743 130908
7494A30908j65338O2874J96755J96751j3863k29368j09935j23626N0425P9872
$$ 130908 -34430 28444 225199 421950 408087 178719 68784 -54842 -4417 75455
7484G5455J42293j52304J1919O8100K09303J59673l99466j83188J16483J24989
$$ 75455 217748 65444 77363 145463 354766 514439 114973 -68215 48268 173257
7474A73257k80199j84590J8960L5697l2355k8220j1407j23570J39813J84831j91305
$$ 173257 -106942 -291532 -272572 -236875 -269230 -297450 -308857 -432427 -292614 -107783 -299088
7463b99088l54846j46116J65589K07684J93696J61663Q1018m1271l02002N4225
$$ -299088 -653934 -800050 -634461 -426777 -233081 -71418 9600 -31671 -333673 -279448
7453b79448J66575K47579J47762j1035J3902j62661j77199p5173N9677j4364L023
$$ -279448 -112873 134706 282468 271433 285335 122674 -54525 -129698 -70021 -84385 -81362
7442h1362k14030j07386J07221J79541J35896l11399m2201k33085Q0134J85280
$$ -81362 -295392 -402778 -295557 -116016 19880 -291519 -333720 -566805 -486671 -301391
7432c01391O7948K16119K8044j01538J99338P5004l72694j90465J67227Q0564
$$ -301391 -233443 -17324 10720 -90818 108520 183524 -189170 -379635 -212408 -131844
7422a31844J14445j25437k7935j8557p3594L80620L71799q6713k60817k19183
$$ -131844 -17399 -142836 -170771 -189328 -262922 117698 489497 402784 141967 -77216
7412g7216J35824K69566R8838p0908K18204k9855l03176k02751J61102J55037
$$ -77216 58608 328174 427012 356104 574308 544453 241277 38526 199628 354665
7402C54665j08632k27022L2259J47982K89649o4970l14533L7722L9805K4723r3349
$$ 354665 246033 19011 51270 199252 488901 423931 109398 147120 186925 211648 118299
7391A18299j61915L3617j45019J52602o53r3761r847n3399m5071l0689J6093K9868
$$ 118299 -43616 -9999 -155018 -2416 -3069 -96830 -106677 -160076 -205147 -235836 -219743 -189875
7379a89875M7261K623K19129M9904J99011j14110k60580j78587M3864N6694N4900
$$ -189875 -142614 -139991 79138 129042 328053 213943 -46637 -225224 -181360 -124666 -69766
7368f9766j0438l6601q9240o1054n2520K18916L89694l2283l38941j97265Q8528
$$ -69766 -80204 -116805 -206045 -267099 -319619 -100703 288991 256708 -82233 -279498 -190970
7357a90970J11032K00730o7834j07635M8312J1789K76150J50688j33607m3268
$$ -190970 -79938 120792 52958 -54677 -6365 5424 281574 432262 298655 255387
7347B55387j32057R180Q4793J28874n1486l74709M1064k6243R2766j03102j18104
$$ 255387 123330 132510 217303 346177 294691 -80018 -38954 -65197 27569 -75533 -193637
7336a93637J28807J92758o4680r0567O0950J5279J0902m7379k94365P8238K05838
$$ -193637 -64830 127928 63248 -27319 33631 48910 59812 12433 -281932 -203694 2144
7325B144P0876k41922k70782P6211K35254J42521M0206O7264k0433l13388o8287
$$ 2144 73020 -168902 -439684 -363473 -128219 14302 54508 121772 101339 -212049 -280336
7314b80336j25967K39011N0781k428R3051O8612n7212J9010q9055m6150R5019
$$ -280336 -406303 -167292 -116511 -118939 -25888 42724 -14488 4522 -84533 -130683 -35664
7303c5664O3598N7906m4055j43142p7823N5326J97333K43681k44395k65734j89970
$$ -35664 27934 85840 41785 -101357 -179180 -123854 73479 317160 72765 -192969 -382939
7292c82939j90500K37336J56815R383l3425J58644J55705j04704p213N9320p5559
$$ -382939 -573439 -336103 -179288 -169905 -203330 -44686 111019 6315 -898 58422 -17137
7281a7137j20708N5387k4663k3924k4160o7031l6086m4802k4150j0034K73350
$$ -17137 -137845 -82458 -107121 -131045 -155205 -222236 -258322 -303124 -327274 -337308 -63958
7270f3958J65372n1287k14945p4203q240J15586K7431L3813k57631k25470j59884
$$ -63958 101414 50127 -164818 -239021 -247261 -131675 -104244 -70431 -328062 -553532 -713416
7259g13416J38616K66865O7834K08739m582l68631k0408J78646k4847j12558O7259
$$ -713416 -574800 -307935 -240101 -31362 -35944 -404575 -424983 -246337 -271184 -383742 -316483
7248c16483k4647J83271Q5554k24991j53767P7203J91056M9212j18900k76532
$$ -316483 -341130 -157859 -72305 -297296 -451063 -373860 -182804 -133592 -252492 -529024
7238e29024J88781K32682O7417J7994J56924R8639j68605k59333j59379l9518
$$ -529024 -340243 -107561 -40144 -22150 134774 233413 64808 -194525 -353904 -393422
7228c93422J68302o5368N7583J22369k00641m2961K4905K33764K12684K71685
$$ -393422 -225120 -290488 -232905 -110536 -311177 -354138 -329233 -95469 117215 388900
7218C88900q7376n26108n7293J66686N5626o541j69589L60984M2976k1113K1772
$$ 388900 301524 -224584 -281877 -115191 -59565 -66106 -235695 125289 168265 147152 168924
7207A68924j42951r3074O7324K15110j9473P5705j4856k02264l72102j83721J20668
$$ 168924 25973 -67101 223 215333 195860 271565 256709 54445 -317657 -501378 -380710
7196c80710K30915J81074M6431q2264n3216r0168l3024j9059J00370J04250J62988
$$ -380710 -149795 31279 77710 -4554 -57770 -147938 -180962 -200021 -99651 4599 167587
7185A67587j03004l0702P1390n7027J7712n4608r6026L5253j4213J54701n8508
$$ 167587 64583 33881 105271 48244 65956 11348 -84678 -49425 -63638 91063 32555
7174C2555k18830N8459K97352J74632k27596j71867m1942O0654p2879K172Q6421
$$ 32555 -186275 -127816 169536 344168 116572 -55295 -97237 -36583 -109462 -107290 -20869
7163b0869P0654N2901q6282j06837R7263p81N3881O6148j48759K20447j8554K1412
$$ -20869 49785 102686 16404 -90433 6830 6049 59930 126078 -22681 197766 179212 200624
7151B00624j52176j11738j37239O4784L53232j43974k65510j38568q4081K65906
$$ 200624 48448 -63290 -200529 -135745 217487 73513 -191997 -330565 -414646 -148740
7141a48740L70516J54580j30266p5020j24157p5152q8230L5830p9498k13446K77407
$$ -148740 221776 376356 246090 171070 46913 -28239 -116469 -80639 -160137 -373583 -96176
7130i6176K78953q685J91054j04187j50477j86618j22397J67993j80070j0006
$$ -96176 182777 174092 365146 260959 110482 -76136 -198533 -30540 -210610 -220616
7120b20616K00891J59345n3615j73123K6550P5441J63723j809j30310q1455j38253
$$ -220616 -19725 139620 86005 -87118 -60568 14873 178596 176787 46477 -34978 -173231
7109a73231j10319N0255K38396J720R3030o1548j45130O8146j73357J64046J88834
$$ -173231 -283550 -233295 5101 6821 99851 38303 -106827 -38681 -212038 -47992 140842
7098A40842p7869m0594K754j5878K43657J06676j19117j98210k0310J40369q0975
$$ 140842 62973 22379 25133 9255 252912 359588 240471 42261 21951 162320 81345
7087H1345M246P6724J94357j49156k39297Q9729J60821j0649p0678j23611K9768
$$ 81345 85591 162315 356672 207516 -31781 57948 218769 208120 137442 13831 43599
7076D3599l5176j90596k803j59908k24353J08098J05419J83808K17067M129j94765
$$ 43599 8423 -182173 -184976 -344884 -569237 -461139 -355720 -171912 45155 49284 -145481
7065a45481k07200M6827Q7392P7261n078k08685k8686J13890J38826o9273K3450
$$ -145481 -352681 -305854 -218462 -141201 -146279 -354964 -383650 -269760 -130934 -200207 -176757
7054a76757J35796m598Q02j63156o1456M5514N2871q3134k5868Q8670J16750r7650
$$ -176757 -40961 -45559 -44757 -207913 -269369 -223855 -170984 -254118 -279986 -191316 -74566 -172216
7042a72216j28345K13472J45430j42372j26216m229J06755O7993l36834q1966
$$ -172216 -300561 -87089 58341 -84031 -210247 -214476 -107721 -39728 -376562 -458528
7032d58528L81350j322j7882k02091r0429j1090N5973K10954p6745K6190K57113
$$ -458528 -77178 -78500 -96382 -298473 -388902 -399992 -344019 -133065 -209810 -183620 73493
7021G3493J7119O1345k1810j44323r6743N6199j24537k17002L7458K1124K58074
$$ 73493 90612 151957 130147 -14176 -110919 -54720 -179257 -396259 -358801 -337677 -79603
7010g9603K51398n4745j0241o12M4718l6311j19534l2842J26942j29670j09733
$$ -79603 171795 117050 106809 106197 150915 114604 -4930 -37772 89170 -40500 -150233
6999a50233j46006K70950K1298o1008K9689J9011J6214r9517R0003J73833q7553
$$ -150233 -296239 -25289 -3991 -64999 -35310 -16299 -85 -99602 -9599 164234 76681
6988G6681j5003j16387q4449k48977j83342J16026J55713j2618Q1441j30393j40662
$$ 76681 61678 -54709 -139158 -388135 -571477 -455451 -299738 -312356 -230915 -361308 -501970
6977e01970j44002O8148J25436K46894M45912K30512j16774l09790r271R215l00424
$$ -501970 -645972 -577824 -452388 -205494 240418 470930 354156 44366 35095 44310 -256114
6966b56114j62726J67943K33316N5173q9533j7247P5699M187J45067r3306P7105
$$ -256114 -418840 -250897 -17581 37592 -51941 -69188 6511 10698 155765 62459 139564
6955A39564k9787j91050J64735p5772q9632N0675j213j55325q4777R2417N7057
$$ 139564 109777 -81273 83462 7690 -81942 -31267 -32480 -187805 -272582 -180165 -123108
6944a23108J55893k8101p9254k42984j70993J74607K47180k84794k99550L3194
$$ -123108 32785 4684 -74570 -317554 -488547 -313940 -66760 -351554 -651104 -617910
6934f17910P7722J28362K1793K15692O1098n3318J4719L2626L8181K06698j20592
$$ -617910 -540188 -411826 -390033 -174341 -113243 -166561 -151842 -119216 -81035 125663 5071
6923E071l4981J03714k32502k8083R2622j30823K5518J16805K24465J10536J9764
$$ 5071 -29910 73804 -158698 -186781 -94159 -224982 -199464 -82659 141806 252342 272106
6912B72106J32985k7041k48448R081p7618l1557K06012j43210K6114K01439K3123
$$ 272106 405091 378050 129602 138683 61065 29508 235520 92310 118424 319863 342986
6901C42986l3031k37107L9799Q2469k08168j02376r4543r7895K4244K00715O9070
$$ 342986 309955 72848 112647 195116 -13052 -115428 -209971 -307866 -283622 -82907 -13837
6890a3837k75874J24798O1637J98203J49517k0896j90220J16827j95718l01742
$$ -13837 -289711 -164913 -103276 94927 244444 223548 33328 150155 -45563 -347305
6880c47305j86050K70758L39393M4438L491j17541j84715p4437o2836q0063K01040
$$ -347305 -533355 -262597 76796 121234 124725 7184 -177531 -251968 -314804 -394867 -193827
6869a93827M0476R4676J59026Q0850J85310j95942j02881R8695J84383j8806K5128
$$ -193827 -153351 -58675 100351 181201 366511 170569 67688 166383 350766 331960 357088
6858C57088j85310m3959J3175j62256k46113J03252L123j19268m0855L6106L74745
$$ 357088 171778 127819 140994 -21262 -267375 -164123 -161000 -280268 -321123 -285017 89728
6847H9728P6995l6457j7645k06416j37208K36657k3436J11050J67808J5551o8827
$$ 89728 166723 130266 112621 -93795 -231003 5654 -17782 93268 261076 276627 207800
6836B07800L12345n6949j78024J03093J14980L528Q2099j92445k07733o6871p8468
$$ 207800 520145 463196 285172 388265 503245 506773 588872 396427 188694 121823 43355
6825D3355j27692o8778r6874J10316J92755j98847Q9466r8862p7988L2607r7351
$$ 43355 -84337 -153115 -249989 -139673 53082 -145765 -56299 -155161 -233149 -200542 -297893
6814b97893j81801j18436M06990K18025l8719j01391J5092m5024j18242k16349
$$ -297893 -479694 -598130 -191140 26885 -11834 -113225 -98133 -143157 -261399 -477748
6804d77748N4452R5534M2988K8758J72205r4098k91166o1969K50642P0956O4281
$$ -477748 -423296 -327762 -284774 -256016 -83811 -177909 -469075 -531044 -280402 -209446 -145165
6793a45165K2545K3627R0193n7735j30317J33513n9237j22934J47151K78913K4824
$$ -145165 -122620 -98993 -8800 -66535 -196852 -63339 -122576 -245510 -98359 180554 205378
6782B05378o833J92225n4700j14552k66276j29755J53106j31619j15333J45697
$$ 205378 198545 390770 336070 221518 -44758 -174513 -21407 -153026 -268359 -122662
6772a22662J37982N877q295K03893k43418k02033j04225J75131L4831o5436j50764
$$ -122662 15320 21197 12902 216795 -26623 -228656 -332881 -157750 -122919 -188355 -339119
6761c39119K0487J0256M1327q21j18179r1941O4276J74931K77857L6101j67234
$$ -339119 -318632 -308376 -267049 -267870 -386049 -477990 -413714 -238783 39074 75175 -92059
6750i2059q4054n3568J09070K85678R2739o9529j83006o7893k5384K3575j35004
$$ -92059 -176113 -229681 -120611 165067 257806 188277 5271 -62622 -88006 -64431 -199435
6739a99435j8376q7228j69681L16475J60135J197K7737J52900J69883J098O4084
$$ -199435 -217811 -305039 -474720 -158245 1890 3087 30824 183724 353607 354705 418789
6728D18789k09195O1442m8862k22108o7354O3404L54500P3867j41419J89425J20851
$$ 418789 209594 271036 222174 66 -67288 -3884 350616 424483 283064 472489 593340
6717E93340K7432l5973l20790L0249l0160k01470M8112r2239l24845p5380J9867
$$ 593340 620772 584799 264009 294258 264098 62628 110740 18501 -306344 -381724 -361857
6706c61857J17163M9546K04912J91470j21949j27731L0553M6774j1458j44749
$$ -361857 -244694 -195148 9764 201234 79285 -48446 -17893 28881 17423 -127326
6696a27326J10150K5040J7425J24448k41318N6278L3935p4831j32047j3600q2113
$$ -127326 -17176 7864 25289 149737 -91581 -35303 -1368 -76199 -208246 -221846 -303959
6685c03959o9368J78304M8680K69934P390k62587o7660J9485l8648j83070p326
$$ -303959 -373327 -195023 -146343 123591 130981 -131606 -199266 -179781 -218429 -401499 -408825
6674d08825J74111R5251J08002L18117P4429j62414J74290j15030n9109n3244
$$ -408825 -234714 -139463 -31461 286656 361085 198671 372961 257931 198822 145578
6664A45578l07624m1984O1377R6148j18253j53052j07642L61482J14120j45692
$$ 145578 -162046 -204030 -142653 -46505 -164758 -317810 -425452 -63970 50150 -95542
6654i5542Q9304L03149J02665q7790j40615K3837p3577m8690Q1640Q2222j3112
$$ -95542 -6238 296911 399576 311786 171171 195008 121431 72741 154381 236603 223491
6643B23491j82899l18081Q1358L3411J80247K04165J10627j94148m9960j08689
$$ 223491 40592 -277489 -196131 -162720 17527 221692 332319 138171 88211 -20478
6633b0478j44813K8703N7718J6784o5328M4868k23783P0273R5009j22116N1818
$$ -20478 -165291 -136588 -78870 -62086 -127414 -82546 -306329 -236056 -141047 -263163 -211345
6622b11345J69018L3563m4657k02558O1599N1782j00008j00628j02843J01851
$$ -211345 -42327 -8764 -53421 -255979 -194380 -142598 -242606 -343234 -446077 -344226
6612c44226J57371J05434J59136o2434R3123p3408p7051n9216J00680Q9732J6891
$$ -344226 -186855 -81421 77715 15281 108404 34996 -42055 -101271 -591 89141 106032
6601A06032O072r0399q5772J83186j81852k31869j95896O8719j7093Q6930L12637
$$ 106032 112104 21705 -64067 119119 -62733 -294602 -490498 -421779 -438872 -351942 -39305
6590c9305K03248n818k4768q4426l28469k47413p5810L20151K53579l1326m4576
$$ -39305 163943 158125 133357 48931 -279538 -526951 -602761 -282610 -29031 -60357 -104933
6579a04933K3557M9794l123j01147M4676k12640k05963K09392K66871k73327R6387
$$ -104933 -81376 -31582 -34705 -135852 -91176 -303816 -509779 -300387 -33516 -306843 -210456
6568b10456J10064P7212L2312K77683J56496n1236Q040k05488q7302J38989l1607
$$ -210456 -100392 -23180 9132 286815 443311 392075 400115 194627 107325 246314 214707
6557B14707k54372p6615P8579M9974j50282l29651K6947L14902J28310K27485
$$ 214707 -39665 -116280 -37701 12273 -138009 -467660 -440713 -125811 2499 229984
6547B29984J87022j15680l00180J29702K30083k0138J0886o7509l20079N400O8558
$$ 229984 417006 301326 1146 130848 360931 340793 351679 284170 -35909 -30509 38049
6536C8049N8097M900j59911M5518J45871R6712q168k71634k76883K8045K71863
$$ 38049 96146 101046 -58865 -13347 132524 229236 221068 -50566 -327449 -299404 -27541
$$ [...]
##END NTUPLES=NMR SPECTRUM
##END=
